%!PS-Adobe-3.0 EPSF-3.0
%%Title: position_and_envelope_length.eps
%%Creator: Matplotlib v3.7.2, https://matplotlib.org/
%%CreationDate: Mon Sep 18 15:40:58 2023
%%Orientation: portrait
%%BoundingBox: -10 263 623 529
%%HiResBoundingBox: -10.990016 263.724063 622.990016 528.275938
%%EndComments
%%BeginProlog
/mpldict 14 dict def
mpldict begin
/_d { bind def } bind def
/m { moveto } _d
/l { lineto } _d
/r { rlineto } _d
/c { curveto } _d
/cl { closepath } _d
/ce { closepath eofill } _d
/box {
      m
      1 index 0 r
      0 exch r
      neg 0 r
      cl
    } _d
/clipbox {
      box
      clip
      newpath
    } _d
/sc { setcachedevice } _d
%!PS-Adobe-3.0 Resource-Font
%%Creator: Converted from TrueType to Type 3 by Matplotlib.
10 dict begin
/FontName /STIXGeneral-Regular def
/PaintType 0 def
/FontMatrix [0.001 0 0 0.001 0 0] def
/FontBBox [-970 -443 2000 1023] def
/FontType 3 def
/Encoding [/space /comma /period /zero /one /two /three /four /five /six /seven /eight /nine /C /F /I /M /P /T /a /c /d /e /g /h /i /l /m /n /o /p /r /s /t /u /v /x] def
/CharStrings 38 dict dup begin
/.notdef 0 def
/space{250 0 0 0 0 0 sc
ce} _d
/comma{250 0 55 -141 195 102 sc
83 -141 m
73 -122 l
128 -85 156 -49 156 -15 c
156 -6 151 -2 142 -2 c
139 -2 135 -3 128 -4 c
122 -5 117 -6 113 -6 c
74 -6 55 11 55 45 c
55 62 60 76 71 86 c
82 97 97 102 115 102 c
138 102 157 94 172 77 c
187 61 195 40 195 15 c
195 -16 185 -45 164 -74 c
144 -103 117 -125 83 -141 c

ce} _d
/period{250 0 70 -11 181 100 sc
181 43 m
181 28 175 16 164 5 c
153 -6 140 -11 125 -11 c
110 -11 97 -6 86 5 c
75 16 70 29 70 44 c
70 59 75 72 86 83 c
97 94 111 100 126 100 c
141 100 153 94 164 83 c
175 72 181 58 181 43 c

ce} _d
/zero{500 0 24 -14 476 676 sc
476 330 m
476 285 472 243 463 203 c
454 164 441 127 424 94 c
407 61 384 34 354 15 c
324 -4 289 -14 250 -14 c
209 -14 174 -4 143 17 c
112 38 89 65 72 100 c
55 135 43 172 35 211 c
28 250 24 292 24 336 c
24 398 32 454 47 503 c
62 553 88 594 123 627 c
159 660 203 676 254 676 c
319 676 373 644 414 580 c
455 516 476 433 476 330 c

380 325 m
380 430 369 511 346 566 c
324 622 291 650 248 650 c
207 650 175 622 153 566 c
131 510 120 431 120 329 c
120 226 131 148 153 93 c
175 39 207 12 250 12 c
292 12 324 39 346 93 c
369 148 380 225 380 325 c

ce} _d
/one{500 0 111 0 394 676 sc
394 0 m
118 0 l
118 15 l
155 17 180 24 193 35 c
206 47 213 67 213 95 c
213 544 l
213 577 203 593 183 593 c
174 593 159 589 138 581 c
111 571 l
111 585 l
290 676 l
299 673 l
299 76 l
299 54 306 38 319 29 c
332 20 357 15 394 15 c
394 0 l

ce} _d
/two{500 0 29 0 474 676 sc
474 137 m
420 0 l
29 0 l
29 12 l
207 201 l
254 250 287 294 307 335 c
327 376 337 418 337 461 c
337 506 325 540 300 565 c
275 590 241 602 198 602 c
162 602 133 593 112 574 c
91 555 71 521 51 472 c
30 477 l
41 539 64 588 98 623 c
133 658 179 676 238 676 c
293 676 338 659 372 626 c
406 593 423 551 423 500 c
423 425 380 342 295 252 c
130 76 l
364 76 l
386 76 403 80 416 89 c
429 98 444 116 460 143 c
474 137 l

ce} _d
/three{500 0 41 -14 431 676 sc
61 510 m
45 514 l
60 564 84 603 117 632 c
150 661 191 676 241 676 c
288 676 325 663 354 638 c
383 613 397 580 397 539 c
397 484 366 438 304 401 c
341 385 368 367 387 348 c
416 315 431 272 431 219 c
431 166 416 119 385 79 c
362 48 330 25 287 9 c
245 -6 200 -14 153 -14 c
78 -14 41 5 41 43 c
41 54 45 62 53 69 c
61 76 71 79 82 79 c
99 79 119 70 143 53 c
172 32 201 22 229 22 c
266 22 296 37 321 66 c
346 96 359 132 359 175 c
359 252 324 300 255 320 c
234 327 200 330 153 330 c
153 344 l
190 357 218 369 237 380 c
291 411 318 455 318 514 c
318 547 308 573 289 590 c
270 607 244 616 210 616 c
150 616 100 581 61 510 c

ce} _d
/four{500 0 12 0 473 676 sc
473 167 m
370 167 l
370 0 l
292 0 l
292 167 l
12 167 l
12 231 l
326 676 l
370 676 l
370 231 l
473 231 l
473 167 l

292 231 m
292 574 l
52 231 l
292 231 l

ce} _d
/five{500 0 31 -14 438 688 sc
438 681 m
402 596 l
398 587 389 583 375 583 c
181 583 l
141 498 l
214 484 267 469 300 452 c
333 436 363 409 391 370 c
414 338 426 296 426 243 c
426 195 418 155 402 122 c
387 89 362 60 328 35 c
283 2 226 -14 158 -14 c
120 -14 89 -8 66 3 c
43 14 31 29 31 48 c
31 73 46 86 76 86 c
100 86 125 76 150 55 c
176 34 200 23 221 23 c
256 23 287 40 314 75 c
342 110 356 149 356 192 c
356 256 334 306 289 342 c
231 389 160 412 76 412 c
68 412 64 415 64 420 c
65 425 l
174 662 l
381 662 l
392 662 401 664 407 667 c
414 670 421 677 429 688 c
438 681 l

ce} _d
/six{500 0 34 -14 468 684 sc
446 684 m
448 668 l
369 655 304 623 251 572 c
198 521 165 458 152 383 c
191 413 233 428 279 428 c
338 428 384 409 417 372 c
451 335 468 284 468 219 c
468 154 451 100 417 59 c
378 10 325 -14 258 -14 c
177 -14 118 20 81 87 c
50 144 34 208 34 279 c
34 388 70 480 143 555 c
184 598 227 628 270 645 c
314 663 373 676 446 684 c

378 188 m
378 317 333 382 243 382 c
210 382 182 373 160 355 c
138 338 127 308 127 266 c
127 188 139 126 163 81 c
188 36 223 14 269 14 c
304 14 331 30 350 61 c
369 93 378 135 378 188 c

ce} _d
/seven{500 0 20 -8 449 662 sc
449 646 m
237 -8 l
172 -8 l
370 588 l
155 588 l
126 588 105 583 91 573 c
77 563 59 541 38 506 c
20 515 l
80 662 l
449 662 l
449 646 l

ce} _d
/eight{500 0 56 -14 445 676 sc
445 155 m
445 104 427 63 391 32 c
356 1 308 -14 248 -14 c
192 -14 146 1 110 32 c
74 63 56 102 56 149 c
56 184 65 214 82 239 c
99 264 134 295 186 332 c
136 373 103 407 86 432 c
70 457 62 487 62 520 c
62 567 80 605 116 633 c
153 662 199 676 256 676 c
305 676 345 662 376 634 c
408 607 424 573 424 533 c
424 496 414 467 395 445 c
376 423 341 398 290 371 c
350 331 391 295 412 264 c
434 233 445 196 445 155 c

355 533 m
355 568 345 595 326 616 c
307 637 280 648 246 648 c
212 648 185 639 165 621 c
146 604 136 580 136 549 c
136 518 146 490 165 465 c
185 440 217 415 261 389 c
295 409 319 430 333 452 c
348 475 355 502 355 533 c

271 272 m
212 312 l
183 288 162 264 150 241 c
138 218 132 191 132 158 c
132 113 143 77 166 52 c
189 27 220 14 259 14 c
292 14 318 24 338 44 c
359 65 369 91 369 124 c
369 154 361 180 346 203 c
331 226 306 249 271 272 c

ce} _d
/nine{500 0 30 -22 459 676 sc
59 -22 m
56 -2 l
133 11 197 44 250 95 c
303 146 340 213 360 294 c
321 256 271 237 210 237 c
156 237 112 256 79 293 c
46 330 30 379 30 440 c
30 507 50 563 89 608 c
129 653 179 676 238 676 c
301 676 354 651 395 600 c
438 547 459 478 459 394 c
459 335 449 280 428 228 c
408 177 378 133 339 97 c
298 60 257 33 218 16 c
179 0 126 -13 59 -22 c

362 355 m
362 394 l
362 563 318 648 230 648 c
199 648 174 637 157 614 c
147 601 139 581 132 554 c
125 527 122 501 122 474 c
122 415 133 367 155 332 c
178 297 208 280 245 280 c
272 280 298 286 323 299 c
349 312 362 331 362 355 c

ce} _d
/C{667 0 28 -14 633 676 sc
614 131 m
633 113 l
574 28 483 -14 360 -14 c
263 -14 185 16 124 75 c
60 138 28 221 28 325 c
28 422 58 505 118 572 c
181 641 262 676 361 676 c
404 676 443 671 480 661 c
522 649 545 643 549 643 c
571 643 585 654 591 676 c
611 676 l
620 449 l
597 449 l
586 497 569 534 545 560 c
498 611 444 636 384 636 c
310 636 251 609 208 554 c
165 500 144 429 144 341 c
144 234 168 154 216 102 c
261 54 320 30 394 30 c
438 30 476 38 508 53 c
540 68 575 94 614 131 c

ce} _d
/F{556 0 11 0 546 662 sc
546 519 m
521 519 l
514 564 501 593 483 605 c
466 618 427 624 367 624 c
235 624 l
221 624 212 621 207 616 c
203 611 201 601 201 585 c
201 368 l
343 368 l
385 368 413 374 427 386 c
442 398 451 424 456 463 c
479 463 l
479 230 l
456 230 l
452 271 443 297 429 309 c
415 321 386 327 343 327 c
201 327 l
201 112 l
201 74 206 49 217 38 c
228 27 253 21 292 19 c
292 0 l
11 0 l
11 19 l
49 22 73 29 83 40 c
94 52 99 80 99 123 c
99 551 l
99 588 94 611 84 622 c
74 633 50 640 12 643 c
12 662 l
541 662 l
546 519 l

ce} _d
/I{333 0 18 0 315 662 sc
315 0 m
18 0 l
18 19 l
60 20 87 26 98 37 c
109 48 115 73 115 112 c
115 551 l
115 590 110 614 99 624 c
88 634 61 640 18 643 c
18 662 l
315 662 l
315 643 l
273 641 246 635 234 624 c
223 613 217 589 217 551 c
217 112 l
217 75 223 50 235 38 c
247 27 274 20 315 19 c
315 0 l

ce} _d
/M{889 0 12 0 864 662 sc
864 0 m
584 0 l
584 19 l
623 22 648 29 658 41 c
669 54 674 81 674 123 c
674 572 l
419 0 l
405 0 l
153 549 l
153 151 l
153 97 159 62 170 46 c
181 30 207 21 246 19 c
246 0 l
12 0 l
12 19 l
41 21 62 25 75 32 c
88 39 96 50 101 67 c
106 84 109 112 109 151 c
109 549 l
109 587 103 611 92 622 c
81 633 55 640 14 643 c
14 662 l
212 662 l
443 160 l
664 662 l
863 662 l
863 643 l
827 642 803 636 792 624 c
781 612 776 587 776 550 c
776 112 l
776 77 781 53 792 41 c
803 29 827 22 864 19 c
864 0 l

ce} _d
/P{557 0 16 0 542 662 sc
16 662 m
275 662 l
370 662 442 641 492 599 c
525 571 542 531 542 480 c
542 427 523 383 485 349 c
457 324 428 307 399 299 c
370 292 327 288 271 288 c
252 288 229 289 202 291 c
202 112 l
202 74 207 49 218 38 c
229 27 255 21 296 19 c
296 0 l
16 0 l
16 19 l
55 22 78 29 87 40 c
96 51 100 79 100 122 c
100 551 l
100 588 95 612 85 623 c
76 634 53 640 16 643 c
16 662 l

202 589 m
202 331 l
225 329 245 328 263 328 c
317 328 359 341 388 367 c
418 394 433 430 433 475 c
433 529 418 567 387 590 c
356 613 306 625 237 625 c
223 625 214 622 209 617 c
204 612 202 603 202 589 c

ce} _d
/T{611 0 17 0 593 662 sc
593 492 m
569 492 l
558 547 543 582 524 597 c
505 612 468 620 415 620 c
356 620 l
356 111 l
356 73 362 49 373 38 c
384 27 411 21 452 19 c
452 0 l
160 0 l
160 19 l
202 22 228 29 238 40 c
249 51 254 79 254 123 c
254 620 l
194 620 l
140 620 103 612 84 596 c
65 581 51 546 41 492 c
17 492 l
24 662 l
586 662 l
593 492 l

ce} _d
/a{444 0 37 -10 442 460 sc
442 66 m
442 38 l
417 6 387 -10 352 -10 c
314 -10 293 14 288 63 c
287 63 l
244 14 196 -10 142 -10 c
111 -10 85 -1 66 17 c
47 36 37 61 37 94 c
37 141 60 180 107 211 c
139 232 199 259 287 292 c
287 346 l
287 376 280 398 265 413 c
251 428 232 436 209 436 c
189 436 172 431 159 421 c
146 412 139 400 139 387 c
139 381 140 374 142 367 c
144 360 145 352 145 345 c
145 335 140 326 131 317 c
122 308 112 304 99 304 c
88 304 78 308 69 317 c
60 326 56 337 56 350 c
56 382 73 409 107 430 c
138 450 177 460 222 460 c
276 460 315 445 340 415 c
352 401 360 387 363 372 c
366 358 368 335 368 304 c
368 113 l
368 69 378 47 399 47 c
412 47 427 53 442 66 c

287 127 m
287 268 l
226 247 183 225 159 202 c
136 181 125 156 125 125 c
125 100 131 80 144 67 c
157 54 173 48 194 48 c
216 48 235 53 252 64 c
266 74 275 83 280 92 c
285 101 287 112 287 127 c

ce} _d
/c{444 0 25 -10 412 460 sc
398 156 m
412 147 l
383 91 356 53 330 32 c
296 4 258 -10 215 -10 c
160 -10 114 11 78 52 c
43 94 25 147 25 212 c
25 297 53 362 109 409 c
150 443 195 460 244 460 c
286 460 322 450 352 429 c
383 409 398 385 398 357 c
398 346 393 336 384 327 c
375 319 364 315 351 315 c
328 315 312 330 303 361 c
297 383 l
292 402 285 414 277 421 c
269 428 256 431 238 431 c
197 431 164 415 139 383 c
114 351 102 309 102 257 c
102 200 116 153 145 116 c
174 80 211 62 257 62 c
286 62 310 69 331 82 c
352 96 374 121 398 156 c

ce} _d
/d{500 0 27 -10 491 683 sc
491 42 m
344 -10 l
340 -7 l
340 57 l
308 12 265 -10 212 -10 c
157 -10 112 10 78 49 c
44 89 27 141 27 205 c
27 276 47 336 88 385 c
129 435 178 460 235 460 c
271 460 306 446 340 417 c
340 573 l
340 594 337 607 331 614 c
325 621 313 624 294 624 c
285 624 277 624 272 623 c
272 639 l
333 655 382 670 419 683 c
424 681 l
424 114 l
424 91 427 75 432 68 c
438 61 450 57 468 57 c
472 57 480 57 491 58 c
491 42 l

340 102 m
340 332 l
340 359 330 382 309 402 c
289 422 265 432 238 432 c
200 432 170 415 147 381 c
124 347 113 302 113 245 c
113 184 125 134 150 97 c
175 60 209 42 251 42 c
282 42 307 53 325 74 c
335 85 340 95 340 102 c

ce} _d
/e{444 0 25 -10 424 460 sc
408 164 m
424 157 l
384 46 314 -10 215 -10 c
156 -10 110 10 76 51 c
42 92 25 148 25 217 c
25 288 44 347 82 392 c
120 437 170 460 232 460 c
292 460 338 437 371 391 c
390 364 402 326 405 277 c
97 277 l
100 235 104 203 109 181 c
115 159 126 137 143 114 c
171 77 208 59 254 59 c
287 59 314 67 336 83 c
359 99 383 126 408 164 c

99 309 m
303 309 l
297 351 287 381 273 398 c
260 415 237 424 205 424 c
177 424 154 414 135 394 c
116 375 104 346 99 309 c

ce} _d
/g{500 0 28 -218 470 460 sc
470 388 m
387 388 l
400 359 406 331 406 304 c
406 253 389 214 354 188 c
319 162 285 149 250 149 c
243 149 230 150 212 152 c
193 154 l
180 150 166 141 153 127 c
140 113 133 101 133 91 c
133 76 159 67 211 64 c
340 58 l
377 57 406 46 428 27 c
450 8 461 -18 461 -49 c
461 -88 441 -123 401 -154 c
346 -197 279 -218 201 -218 c
153 -218 112 -208 78 -189 c
45 -170 28 -148 28 -121 c
28 -102 35 -84 50 -65 c
65 -47 90 -25 126 1 c
105 11 90 20 83 27 c
76 34 73 43 73 54 c
73 73 88 96 119 123 c
134 136 149 150 162 163 c
129 180 105 198 90 219 c
76 240 69 266 69 297 c
69 342 85 381 117 412 c
150 444 189 460 236 460 c
263 460 289 455 316 445 c
338 437 l
357 430 376 427 393 427 c
470 427 l
470 388 l

152 338 m
152 335 l
152 287 161 248 180 218 c
199 189 224 174 255 174 c
278 174 296 182 309 198 c
322 215 329 237 329 264 c
329 308 319 348 299 385 c
282 416 258 432 226 432 c
203 432 184 424 171 407 c
158 390 152 367 152 338 c

433 -64 m
433 -45 424 -32 405 -25 c
387 -18 355 -15 309 -15 c
243 -15 189 -11 147 -2 c
127 -26 114 -43 107 -54 c
101 -65 98 -77 98 -88 c
98 -110 111 -128 137 -141 c
164 -154 199 -161 243 -161 c
300 -161 345 -152 380 -134 c
415 -117 433 -93 433 -64 c

ce} _d
/h{500 0 9 0 487 683 sc
487 0 m
275 0 l
275 15 l
304 18 323 25 331 35 c
339 45 343 67 343 102 c
343 300 l
343 371 318 406 269 406 c
249 406 231 401 214 392 c
197 383 178 366 157 343 c
157 102 l
157 67 161 45 169 35 c
177 25 196 18 225 15 c
225 0 l
9 0 l
9 15 l
38 19 55 26 62 35 c
69 44 73 67 73 102 c
73 573 l
73 594 70 608 63 614 c
57 621 43 624 22 624 c
16 624 12 624 10 623 c
10 639 l
37 647 l
88 662 127 674 152 683 c
157 680 l
157 376 l
180 406 203 427 226 440 c
249 453 275 460 304 460 c
386 460 427 407 427 301 c
427 102 l
427 67 430 45 436 36 c
443 27 460 20 487 15 c
487 0 l

ce} _d
/i{278 0 16 0 253 683 sc
180 632 m
180 617 175 605 165 595 c
155 586 143 581 128 581 c
114 581 102 586 92 595 c
83 605 78 617 78 632 c
78 646 83 658 93 668 c
103 678 115 683 129 683 c
144 683 156 678 165 668 c
175 658 180 646 180 632 c

253 0 m
16 0 l
16 15 l
51 17 72 23 81 33 c
90 43 95 67 95 104 c
95 331 l
95 354 93 371 88 380 c
83 389 75 394 62 394 c
46 394 32 392 20 389 c
20 405 l
175 460 l
179 456 l
179 105 l
179 68 183 44 191 34 c
200 24 220 18 253 15 c
253 0 l

ce} _d
/l{278 0 19 0 257 683 sc
257 0 m
21 0 l
21 15 l
52 18 73 24 83 34 c
93 45 98 64 98 92 c
98 561 l
98 585 95 602 89 611 c
83 620 72 625 56 625 c
42 625 30 624 19 623 c
19 639 l
82 654 135 669 177 683 c
182 679 l
182 87 l
182 59 187 40 196 31 c
205 22 226 17 257 15 c
257 0 l

ce} _d
/m{778 0 16 0 775 460 sc
775 0 m
557 0 l
557 15 l
585 18 603 23 610 32 c
618 41 622 61 622 90 c
622 296 l
622 336 616 365 604 382 c
593 399 573 408 545 408 c
522 408 502 403 485 394 c
469 385 453 369 438 347 c
438 95 l
438 63 443 42 452 31 c
462 21 481 16 510 15 c
510 0 l
286 0 l
286 15 l
315 17 334 22 342 29 c
350 37 354 56 354 86 c
354 297 l
354 371 332 408 289 408 c
270 408 250 404 229 395 c
208 387 193 377 183 365 c
174 355 170 349 170 348 c
170 70 l
170 49 175 34 184 27 c
193 20 211 16 238 15 c
238 0 l
16 0 l
16 15 l
44 16 63 21 72 30 c
81 40 86 59 86 88 c
86 336 l
86 361 83 378 78 387 c
73 397 64 402 51 402 c
41 402 30 401 19 398 c
19 415 l
64 428 111 443 158 460 c
166 457 l
166 383 l
168 383 l
198 414 224 435 247 445 c
270 455 295 460 321 460 c
374 460 409 432 427 376 c
479 432 533 460 590 460 c
667 460 706 400 706 280 c
706 77 l
706 55 709 40 716 31 c
723 23 734 18 749 17 c
775 15 l
775 0 l

ce} _d
/n{500 0 16 0 485 460 sc
485 0 m
277 0 l
278 15 l
303 17 319 24 327 36 c
336 49 340 72 340 105 c
340 304 l
340 371 316 405 267 405 c
250 405 235 401 220 393 c
205 385 187 370 164 348 c
164 72 l
164 52 168 38 177 30 c
186 22 204 17 229 15 c
229 0 l
18 0 l
18 15 l
43 17 60 23 68 33 c
76 44 80 64 80 94 c
80 337 l
80 362 78 379 73 388 c
68 397 59 402 45 402 c
32 402 22 401 16 398 c
16 415 l
63 428 108 443 153 460 c
161 457 l
161 379 l
162 379 l
209 433 257 460 306 460 c
344 460 373 447 393 420 c
414 393 424 355 424 306 c
424 85 l
424 58 428 41 436 32 c
444 23 460 18 485 15 c
485 0 l

ce} _d
/o{500 0 29 -10 470 460 sc
470 231 m
470 161 449 103 407 58 c
366 13 312 -10 245 -10 c
184 -10 132 12 91 57 c
50 102 29 159 29 228 c
29 297 50 353 91 396 c
132 439 187 460 254 460 c
316 460 367 439 408 396 c
449 354 470 299 470 231 c

380 204 m
380 280 363 339 330 382 c
303 415 272 432 235 432 c
200 432 172 418 151 389 c
130 361 119 322 119 273 c
119 188 137 119 172 68 c
195 35 225 18 262 18 c
299 18 327 34 348 67 c
369 100 380 146 380 204 c

ce} _d
/p{500 0 5 -217 470 460 sc
159 458 m
159 381 l
201 434 249 460 303 460 c
352 460 392 440 423 400 c
454 360 470 309 470 247 c
470 174 450 113 409 64 c
369 15 319 -10 260 -10 c
239 -10 222 -7 207 -1 c
193 5 177 16 159 33 c
159 -124 l
159 -155 164 -175 175 -184 c
186 -193 210 -198 247 -199 c
247 -217 l
5 -217 l
5 -200 l
34 -197 53 -192 62 -183 c
71 -174 75 -157 75 -131 c
75 337 l
75 360 72 376 67 383 c
62 390 51 394 34 394 c
23 394 15 394 9 393 c
9 409 l
56 423 104 440 153 460 c
159 458 l

159 334 m
159 88 l
159 73 170 59 193 44 c
216 29 240 22 263 22 c
299 22 328 39 350 73 c
373 107 384 152 384 207 c
384 266 373 312 350 347 c
328 382 298 400 261 400 c
238 400 215 393 192 378 c
170 363 159 349 159 334 c

ce} _d
/r{333 0 5 0 335 460 sc
160 458 m
160 366 l
185 402 206 427 223 440 c
240 453 259 460 280 460 c
297 460 311 455 320 446 c
330 437 335 424 335 407 c
335 393 331 382 324 374 c
317 366 308 362 296 362 c
283 362 270 369 256 382 c
245 392 237 397 230 397 c
216 397 201 387 184 368 c
168 349 160 331 160 315 c
160 90 l
160 61 166 42 177 32 c
188 22 211 16 245 15 c
245 0 l
5 0 l
5 15 l
37 21 57 28 64 35 c
72 42 76 59 76 84 c
76 334 l
76 356 73 371 68 380 c
63 389 55 394 42 394 c
31 394 20 393 7 390 c
7 406 l
49 419 98 437 155 460 c
160 458 l

ce} _d
/s{389 0 51 -10 348 459 sc
156 301 m
260 238 l
293 218 316 199 329 182 c
342 165 348 142 348 115 c
348 82 334 52 306 27 c
279 2 246 -10 208 -10 c
177 -10 152 -7 135 -1 c
117 5 102 8 89 8 c
78 8 70 4 65 -4 c
52 -4 l
52 153 l
68 153 l
79 104 94 69 114 46 c
134 23 161 12 195 12 c
220 12 240 19 255 33 c
270 47 278 65 278 86 c
278 117 260 142 225 161 c
171 191 l
91 236 51 284 51 336 c
51 375 63 405 88 426 c
113 448 147 459 189 459 c
218 459 241 455 256 448 c
268 443 277 440 284 440 c
289 440 294 443 300 450 c
311 450 l
316 314 l
301 314 l
290 359 275 391 258 409 c
241 428 218 437 188 437 c
165 437 147 431 133 420 c
120 409 113 392 113 369 c
113 358 117 345 124 332 c
132 319 143 309 156 301 c

ce} _d
/t{278 0 13 -10 279 579 sc
266 77 m
279 66 l
247 15 207 -10 158 -10 c
99 -10 70 32 70 117 c
70 418 l
17 418 l
14 420 13 422 13 425 c
13 430 19 437 30 444 c
55 459 88 494 127 551 c
128 553 131 557 136 563 c
141 570 145 575 147 579 c
152 579 154 575 154 566 c
154 450 l
255 450 l
255 418 l
154 418 l
154 132 l
154 100 158 77 166 63 c
174 49 187 42 206 42 c
226 42 246 54 266 77 c

ce} _d
/u{500 0 9 -10 480 450 sc
480 50 m
480 36 l
428 22 382 7 343 -9 c
338 -6 l
338 76 l
336 76 l
294 19 246 -10 193 -10 c
155 -10 125 2 103 25 c
82 48 71 79 71 118 c
71 369 l
71 394 67 411 58 420 c
49 429 33 435 9 436 c
9 450 l
155 450 l
155 127 l
155 104 162 85 175 70 c
189 55 206 48 226 48 c
259 48 287 58 310 79 c
319 87 325 94 328 101 c
331 108 333 120 333 137 c
333 368 l
333 394 328 411 319 418 c
310 426 290 431 259 433 c
259 450 l
417 450 l
417 107 l
417 84 421 68 428 61 c
436 54 451 50 474 50 c
480 50 l

ce} _d
/v{500 0 19 -14 477 450 sc
477 450 m
477 435 l
462 434 450 429 443 420 c
436 411 425 390 412 357 c
284 36 l
271 3 261 -14 256 -14 c
251 -14 245 -5 238 12 c
237 14 235 17 234 22 c
233 27 231 30 230 33 c
110 320 l
89 371 73 402 63 414 c
53 427 38 434 19 435 c
19 450 l
215 450 l
215 435 l
198 434 186 431 179 427 c
172 423 169 417 169 408 c
169 397 172 385 178 370 c
280 114 l
379 373 l
383 383 385 393 385 403 c
385 422 369 432 338 435 c
338 450 l
477 450 l

ce} _d
/x{500 0 17 0 479 450 sc
479 0 m
278 0 l
278 15 l
295 16 305 18 310 21 c
315 24 318 30 318 39 c
318 45 316 51 312 57 c
221 197 l
142 74 l
129 53 122 40 122 33 c
122 21 135 15 162 15 c
162 0 l
17 0 l
17 15 l
34 16 46 20 55 26 c
64 33 76 46 90 66 c
204 231 l
110 375 l
95 398 82 414 71 422 c
60 431 48 435 33 435 c
24 435 l
24 450 l
231 450 l
231 435 l
202 434 188 427 188 413 c
188 399 203 369 234 324 c
243 312 247 305 248 304 c
251 309 261 323 278 348 c
281 354 285 360 290 367 c
295 374 298 379 300 383 c
303 387 305 391 308 395 c
311 399 312 402 313 405 c
314 408 315 411 315 413 c
315 426 302 433 275 435 c
275 450 l
433 450 l
433 435 l
399 434 372 419 352 391 c
269 271 l
397 75 l
423 35 450 15 479 15 c
479 0 l

ce} _d
end readonly def

/BuildGlyph {
 exch begin
 CharStrings exch
 2 copy known not {pop /.notdef} if
 true 3 1 roll get exec
 end
} _d

/BuildChar {
 1 index /Encoding get exch get
 1 index /BuildGlyph get exec
} _d

FontName currentdict end definefont pop
%!PS-Adobe-3.0 Resource-Font
%%Creator: Converted from TrueType to Type 3 by Matplotlib.
10 dict begin
/FontName /Cmmi10 def
/PaintType 0 def
/FontMatrix [0.00048828125 0 0 0.00048828125 0 0] def
/FontBBox [-70 -512 2146 1536] def
/FontType 3 def
/Encoding [/e /h /m /t /period] def
/CharStrings 6 dict dup begin
/.notdef 0 def
/e{952 0 90 -23 881 905 sc
412 -23 m
347 -23 289 -6 240 28 c
191 62 154 108 128 165 c
103 223 90 284 90 348 c
90 445 114 537 163 622 c
212 708 279 777 363 828 c
447 879 537 905 633 905 c
692 905 743 890 786 859 c
830 829 852 786 852 729 c
852 650 821 592 758 553 c
695 515 625 491 546 482 c
467 473 380 469 285 469 c
279 469 l
257 388 246 318 246 260 c
246 199 260 146 288 100 c
316 54 359 31 416 31 c
497 31 575 50 650 87 c
725 124 787 176 834 242 c
838 246 843 248 850 248 c
857 248 863 244 870 236 c
877 229 881 222 881 215 c
881 210 880 206 877 203 c
827 133 760 78 675 37 c
590 -3 503 -23 412 -23 c

291 522 m
370 522 444 526 511 533 c
578 540 639 559 694 588 c
749 618 776 664 776 727 c
776 752 769 774 755 793 c
741 812 723 827 700 837 c
678 847 655 852 631 852 c
573 852 521 836 474 805 c
428 774 390 733 360 682 c
330 632 307 579 291 522 c

ce} _d
/h{1180 0 109 -23 1124 1421 sc
109 37 m
109 45 110 51 111 55 c
408 1239 l
413 1262 417 1281 418 1294 c
418 1316 374 1327 285 1327 c
271 1327 264 1336 264 1354 c
265 1357 266 1363 268 1372 c
271 1381 274 1387 277 1392 c
281 1397 286 1399 293 1399 c
569 1421 l
575 1421 l
575 1420 577 1418 582 1415 c
587 1413 589 1412 590 1411 c
593 1404 594 1399 594 1395 c
434 756 l
518 855 618 905 733 905 c
781 905 822 897 857 880 c
892 863 920 838 939 804 c
959 771 969 731 969 684 c
969 628 956 560 931 481 c
906 402 875 313 838 215 c
819 170 809 129 809 92 c
809 51 825 31 856 31 c
909 31 954 59 989 116 c
1025 173 1050 235 1065 301 c
1068 309 1073 313 1081 313 c
1106 313 l
1111 313 1116 311 1119 307 c
1122 304 1124 300 1124 295 c
1124 294 1123 292 1122 289 c
1110 240 1092 191 1068 143 c
1045 96 1015 56 979 24 c
943 -7 901 -23 852 -23 c
804 -23 763 -7 729 26 c
695 59 678 100 678 147 c
678 172 683 199 694 227 c
733 330 765 421 790 502 c
816 583 829 654 829 715 c
829 754 821 787 806 813 c
791 839 765 852 729 852 c
656 852 592 829 537 784 c
482 739 435 680 395 606 c
256 47 l
251 26 240 10 225 -3 c
210 -16 192 -23 172 -23 c
155 -23 140 -17 127 -5 c
115 6 109 20 109 37 c

ce} _d
/m{1798 0 55 -23 1743 905 sc
158 35 m
158 43 159 49 160 53 c
313 664 l
323 702 328 735 328 764 c
328 823 308 852 268 852 c
225 852 194 826 173 775 c
152 724 132 660 113 582 c
113 578 111 575 107 572 c
103 570 99 569 96 569 c
72 569 l
67 569 63 571 60 576 c
57 581 55 586 55 590 c
70 649 84 700 97 741 c
111 782 132 820 161 854 c
190 888 227 905 270 905 c
321 905 367 889 406 856 c
445 824 465 783 465 733 c
506 786 553 828 608 859 c
663 890 721 905 782 905 c
847 905 902 888 949 855 c
996 822 1020 776 1020 715 c
1062 774 1111 821 1167 854 c
1224 888 1285 905 1352 905 c
1423 905 1479 886 1522 847 c
1565 809 1587 755 1587 684 c
1587 628 1574 560 1549 481 c
1524 402 1493 313 1456 215 c
1437 168 1427 127 1427 92 c
1427 51 1443 31 1475 31 c
1528 31 1573 60 1608 117 c
1643 174 1668 236 1683 301 c
1687 309 1693 313 1700 313 c
1724 313 l
1729 313 1734 311 1737 307 c
1741 304 1743 300 1743 295 c
1743 294 1742 292 1741 289 c
1722 212 1690 140 1643 75 c
1597 10 1539 -23 1470 -23 c
1422 -23 1381 -7 1347 26 c
1313 59 1296 100 1296 147 c
1296 171 1302 198 1313 227 c
1352 330 1384 421 1409 502 c
1435 583 1448 654 1448 715 c
1448 753 1440 785 1425 812 c
1410 839 1384 852 1348 852 c
1273 852 1209 829 1154 783 c
1099 738 1052 677 1012 602 c
1009 589 1007 578 1006 571 c
874 45 l
869 26 859 10 842 -3 c
826 -16 808 -23 788 -23 c
772 -23 758 -18 745 -7 c
733 4 727 18 727 35 c
727 43 728 49 729 53 c
860 575 l
874 631 881 678 881 715 c
881 753 873 785 857 812 c
842 839 815 852 778 852 c
728 852 682 841 640 819 c
598 797 561 768 530 731 c
499 695 470 652 444 602 c
305 45 l
300 26 290 10 273 -3 c
257 -16 239 -23 219 -23 c
202 -23 188 -18 176 -7 c
164 4 158 18 158 35 c

ce} _d
/t{739 0 45 -23 676 1282 sc
127 166 m
127 186 129 205 133 223 c
281 811 l
66 811 l
52 811 45 820 45 838 c
50 868 59 883 72 883 c
299 883 l
381 1217 l
386 1235 397 1250 413 1263 c
429 1276 447 1282 467 1282 c
484 1282 499 1277 510 1266 c
522 1256 528 1242 528 1225 c
528 1221 528 1218 527 1215 c
527 1213 527 1211 526 1208 c
444 883 l
655 883 l
669 883 676 874 676 856 c
675 853 674 847 672 839 c
670 831 667 824 664 819 c
661 814 656 811 649 811 c
426 811 l
279 219 l
269 180 264 147 264 119 c
264 60 284 31 324 31 c
384 31 437 59 483 115 c
530 172 565 234 590 301 c
595 309 601 313 606 313 c
631 313 l
636 313 641 311 644 307 c
647 304 649 300 649 295 c
649 292 648 290 647 289 c
617 206 573 134 516 71 c
459 8 393 -23 319 -23 c
265 -23 219 -5 182 30 c
145 65 127 111 127 166 c

ce} _d
/period{567 0 172 0 397 225 sc
172 113 m
172 144 183 170 206 192 c
229 214 255 225 285 225 c
304 225 322 220 340 210 c
358 200 372 186 382 168 c
392 150 397 132 397 113 c
397 83 386 57 364 34 c
342 11 316 0 285 0 c
255 0 229 11 206 34 c
183 57 172 83 172 113 c

ce} _d
end readonly def

/BuildGlyph {
 exch begin
 CharStrings exch
 2 copy known not {pop /.notdef} if
 true 3 1 roll get exec
 end
} _d

/BuildChar {
 1 index /Encoding get exch get
 1 index /BuildGlyph get exec
} _d

FontName currentdict end definefont pop
%!PS-Adobe-3.0 Resource-Font
%%Creator: Converted from TrueType to Type 3 by Matplotlib.
10 dict begin
/FontName /Cmsy10 def
/PaintType 0 def
/FontMatrix [0.00048828125 0 0 0.00048828125 0 0] def
/FontBBox [-59 -1966 2300 1595] def
/FontType 3 def
/Encoding [/approxequal] def
/CharStrings 2 dict dup begin
/.notdef 0 def
/approxequal{1591 0 115 115 1477 989 sc
143 115 m
128 115 119 132 115 166 c
115 178 l
115 240 130 297 160 348 c
191 399 232 439 285 468 c
338 497 394 512 455 512 c
528 512 604 488 681 441 c
759 394 836 347 913 300 c
990 253 1064 229 1137 229 c
1207 229 1271 251 1330 294 c
1389 337 1419 393 1419 461 c
1423 495 1433 512 1448 512 c
1463 512 1473 495 1477 461 c
1477 449 l
1477 387 1462 330 1431 279 c
1400 228 1359 187 1306 158 c
1254 129 1198 115 1137 115 c
1080 115 1026 127 975 150 c
925 174 866 209 798 254 c
731 300 671 335 620 360 c
569 385 514 397 455 397 c
412 397 368 387 323 368 c
278 349 242 321 214 286 c
186 251 172 211 172 166 c
168 132 158 115 143 115 c

143 592 m
128 592 119 609 115 643 c
115 655 l
115 717 130 774 160 825 c
191 876 232 916 285 945 c
338 974 394 989 455 989 c
528 989 604 965 681 918 c
759 871 836 824 913 777 c
990 730 1064 707 1137 707 c
1207 707 1271 729 1330 772 c
1389 815 1419 871 1419 938 c
1423 972 1433 989 1448 989 c
1463 989 1473 972 1477 938 c
1477 926 l
1477 864 1462 807 1431 756 c
1400 705 1359 664 1306 635 c
1254 606 1198 592 1137 592 c
1080 592 1026 604 975 627 c
925 651 866 686 798 731 c
731 777 671 812 620 837 c
569 862 514 874 455 874 c
412 874 368 864 323 845 c
278 826 242 798 214 763 c
186 728 172 688 172 643 c
168 609 158 592 143 592 c

ce} _d
end readonly def

/BuildGlyph {
 exch begin
 CharStrings exch
 2 copy known not {pop /.notdef} if
 true 3 1 roll get exec
 end
} _d

/BuildChar {
 1 index /Encoding get exch get
 1 index /BuildGlyph get exec
} _d

FontName currentdict end definefont pop
%!PS-Adobe-3.0 Resource-Font
%%Creator: Converted from TrueType to Type 3 by Matplotlib.
10 dict begin
/FontName /Cmr10 def
/PaintType 0 def
/FontMatrix [0.00048828125 0 0 0.00048828125 0 0] def
/FontBBox [-90 -512 2066 1536] def
/FontType 3 def
/Encoding [/zero /two /four /six /nine /equal] def
/CharStrings 7 dict dup begin
/.notdef 0 def
/zero{1024 0 80 -45 942 1364 sc
512 -45 m
345 -45 231 24 170 161 c
110 299 80 463 80 653 c
80 772 91 883 112 988 c
134 1093 177 1181 241 1254 c
306 1327 396 1364 512 1364 c
602 1364 676 1342 733 1298 c
790 1254 834 1197 864 1127 c
894 1058 914 983 925 903 c
936 824 942 740 942 653 c
942 536 931 426 909 323 c
888 221 845 134 782 62 c
719 -9 629 -45 512 -45 c

512 8 m
588 8 645 47 682 125 c
719 203 742 289 751 384 c
760 479 764 579 764 686 c
764 789 760 883 751 970 c
742 1057 719 1135 682 1205 c
645 1276 589 1311 512 1311 c
435 1311 377 1276 340 1205 c
303 1134 280 1056 271 969 c
262 883 258 789 258 686 c
258 610 260 538 263 471 c
267 404 277 334 293 262 c
309 191 335 130 370 81 c
406 32 453 8 512 8 c

ce} _d
/two{1024 0 102 0 920 1364 sc
102 0 m
102 55 l
102 58 103 62 106 66 c
424 418 l
472 470 511 514 541 549 c
571 584 601 625 630 671 c
659 717 682 764 699 811 c
716 859 725 910 725 963 c
725 1019 715 1072 694 1123 c
673 1174 642 1215 601 1246 c
560 1277 511 1292 453 1292 c
394 1292 340 1274 293 1238 c
246 1203 212 1157 193 1100 c
198 1101 206 1102 215 1102 c
246 1102 272 1092 293 1071 c
315 1050 326 1024 326 991 c
326 960 315 933 293 911 c
272 890 246 879 215 879 c
183 879 156 890 134 912 c
113 935 102 961 102 991 c
102 1042 112 1090 131 1135 c
150 1180 178 1220 214 1255 c
251 1290 292 1317 337 1336 c
383 1355 432 1364 483 1364 c
561 1364 634 1347 701 1314 c
768 1281 822 1235 861 1174 c
900 1114 920 1044 920 963 c
920 904 907 847 881 794 c
855 741 822 692 781 648 c
740 605 688 555 625 500 c
562 445 520 408 500 389 c
268 166 l
465 166 l
562 166 642 167 707 168 c
772 170 807 173 811 176 c
827 193 843 256 860 365 c
920 365 l
862 0 l
102 0 l

ce} _d
/four{1024 0 57 0 965 1364 sc
57 338 m
57 410 l
690 1354 l
695 1361 702 1364 711 1364 c
741 1364 l
756 1364 764 1356 764 1341 c
764 410 l
965 410 l
965 338 l
764 338 l
764 137 l
764 109 784 91 824 83 c
864 76 910 72 963 72 c
963 0 l
399 0 l
399 72 l
452 72 498 76 538 83 c
578 91 598 109 598 137 c
598 338 l
57 338 l

125 410 m
610 410 l
610 1135 l
125 410 l

ce} _d
/six{1024 0 86 -45 936 1364 sc
512 -45 m
427 -45 357 -23 300 22 c
243 67 199 126 168 197 c
137 269 116 344 104 423 c
92 502 86 581 86 662 c
86 770 107 878 149 987 c
191 1096 253 1186 334 1257 c
416 1328 513 1364 625 1364 c
672 1364 715 1355 755 1337 c
796 1320 827 1294 850 1259 c
873 1225 885 1184 885 1135 c
885 1107 875 1083 856 1064 c
837 1045 814 1036 786 1036 c
759 1036 736 1046 717 1065 c
698 1084 688 1108 688 1135 c
688 1162 698 1185 717 1204 c
736 1223 759 1233 786 1233 c
797 1233 l
780 1258 755 1276 723 1287 c
692 1299 659 1305 625 1305 c
584 1305 545 1296 510 1278 c
475 1260 444 1236 416 1205 c
388 1174 365 1140 346 1103 c
327 1066 313 1024 302 977 c
292 930 286 885 283 844 c
280 803 279 751 279 688 c
303 744 337 790 381 825 c
425 861 475 879 530 879 c
591 879 646 867 696 842 c
746 817 789 783 825 739 c
861 696 888 646 907 590 c
926 534 936 477 936 420 c
936 340 918 264 882 191 c
847 119 797 62 732 19 c
667 -24 594 -45 512 -45 c

512 20 m
565 20 607 32 639 56 c
671 80 694 112 709 151 c
724 191 734 231 737 271 c
741 312 743 361 743 420 c
743 497 739 563 732 618 c
725 673 705 721 672 762 c
639 804 589 825 522 825 c
467 825 421 806 385 769 c
350 732 324 684 307 627 c
291 570 283 516 283 463 c
283 445 284 431 285 422 c
285 420 285 418 284 417 c
284 416 284 414 283 412 c
283 353 289 294 301 234 c
313 174 336 123 370 82 c
404 41 451 20 512 20 c

ce} _d
/nine{1024 0 86 -45 936 1364 sc
231 86 m
268 42 333 20 426 20 c
478 20 526 38 571 73 c
616 108 651 152 676 203 c
705 261 723 323 731 388 c
739 454 743 536 743 633 c
720 578 686 532 642 497 c
599 462 549 444 492 444 c
413 444 342 465 279 508 c
217 551 169 608 136 678 c
103 749 86 824 86 903 c
86 985 105 1061 142 1132 c
179 1203 231 1260 297 1301 c
363 1343 438 1364 522 1364 c
605 1364 674 1341 729 1296 c
785 1251 828 1193 857 1122 c
886 1051 907 976 918 897 c
930 818 936 739 936 662 c
936 557 917 449 878 339 c
839 230 781 138 704 65 c
627 -8 535 -45 426 -45 c
345 -45 277 -26 221 12 c
165 50 137 107 137 184 c
137 212 146 235 165 254 c
184 273 208 283 236 283 c
263 283 286 273 305 254 c
324 235 334 212 334 184 c
334 157 324 134 305 115 c
286 96 263 86 236 86 c
231 86 l

500 498 m
556 498 602 517 637 554 c
673 592 699 639 715 695 c
731 751 739 807 739 862 c
739 901 l
739 909 l
739 1012 724 1103 694 1184 c
664 1265 607 1305 522 1305 c
468 1305 424 1293 390 1269 c
357 1246 332 1214 316 1175 c
300 1136 290 1094 285 1049 c
281 1004 279 956 279 903 c
279 826 283 760 290 705 c
297 650 317 602 350 560 c
383 519 433 498 500 498 c

ce} _d
/equal{1591 0 115 272 1477 752 sc
154 272 m
143 272 133 276 126 285 c
119 294 115 303 115 313 c
115 324 119 334 126 342 c
133 350 143 354 154 354 c
1440 354 l
1450 354 1459 350 1466 342 c
1473 334 1477 324 1477 313 c
1477 303 1473 294 1466 285 c
1459 276 1450 272 1440 272 c
154 272 l

154 670 m
143 670 133 674 126 682 c
119 690 115 700 115 711 c
115 721 119 730 126 739 c
133 748 143 752 154 752 c
1440 752 l
1450 752 1459 748 1466 739 c
1473 730 1477 721 1477 711 c
1477 700 1473 690 1466 682 c
1459 674 1450 670 1440 670 c
154 670 l

ce} _d
end readonly def

/BuildGlyph {
 exch begin
 CharStrings exch
 2 copy known not {pop /.notdef} if
 true 3 1 roll get exec
 end
} _d

/BuildChar {
 1 index /Encoding get exch get
 1 index /BuildGlyph get exec
} _d

FontName currentdict end definefont pop
end
%%EndProlog
mpldict begin
-10.99 263.724 translate
633.98 264.552 0 0 clipbox
gsave
0 0 m
633.980033 0 l
633.980033 264.551875 l
0 264.551875 l
cl
1.000 setgray
fill
grestore
gsave
45.79375 66.136 m
312.629397 66.136 l
312.629397 243.14875 l
45.79375 243.14875 l
cl
1.000 setgray
fill
grestore
0.800 setlinewidth
1 setlinejoin
2 setlinecap
[] 0 setdash
0.690 setgray
gsave
266.836 177.013 45.794 66.136 clipbox
251.984932 66.136 m
251.984932 243.14875 l
stroke
grestore
0 setlinecap
0.000 setgray
gsave
/o {
gsave
newpath
translate
0.8 setlinewidth
1 setlinejoin

0 setlinecap

0 0 m
0 -3.5 l

gsave
0.000 setgray
fill
grestore
stroke
grestore
} bind def
251.985 66.136 o
grestore
gsave
241.485 50.9329 translate
0 rotate
/STIXGeneral-Regular 12.0 selectfont
0 0.890625 moveto
/zero glyphshow
5.99998 0.890625 moveto
/period glyphshow
8.99997 0.890625 moveto
/zero glyphshow
15 0.890625 moveto
/four glyphshow
grestore
2 setlinecap
0.690 setgray
gsave
266.836 177.013 45.794 66.136 clipbox
187.297502 66.136 m
187.297502 243.14875 l
stroke
grestore
0 setlinecap
0.000 setgray
gsave
/o {
gsave
newpath
translate
0.8 setlinewidth
1 setlinejoin

0 setlinecap

0 0 m
0 -3.5 l

gsave
0.000 setgray
fill
grestore
stroke
grestore
} bind def
187.298 66.136 o
grestore
gsave
176.798 50.9329 translate
0 rotate
/STIXGeneral-Regular 12.0 selectfont
0 0.796875 moveto
/zero glyphshow
5.99998 0.796875 moveto
/period glyphshow
8.99997 0.796875 moveto
/zero glyphshow
15 0.796875 moveto
/six glyphshow
grestore
2 setlinecap
0.690 setgray
gsave
266.836 177.013 45.794 66.136 clipbox
122.610073 66.136 m
122.610073 243.14875 l
stroke
grestore
0 setlinecap
0.000 setgray
gsave
/o {
gsave
newpath
translate
0.8 setlinewidth
1 setlinejoin

0 setlinecap

0 0 m
0 -3.5 l

gsave
0.000 setgray
fill
grestore
stroke
grestore
} bind def
122.61 66.136 o
grestore
gsave
112.11 50.9329 translate
0 rotate
/STIXGeneral-Regular 12.0 selectfont
0 0.890625 moveto
/zero glyphshow
5.99998 0.890625 moveto
/period glyphshow
8.99997 0.890625 moveto
/zero glyphshow
15 0.890625 moveto
/eight glyphshow
grestore
2 setlinecap
0.690 setgray
gsave
266.836 177.013 45.794 66.136 clipbox
57.922643 66.136 m
57.922643 243.14875 l
stroke
grestore
0 setlinecap
0.000 setgray
gsave
/o {
gsave
newpath
translate
0.8 setlinewidth
1 setlinejoin

0 setlinecap

0 0 m
0 -3.5 l

gsave
0.000 setgray
fill
grestore
stroke
grestore
} bind def
57.9226 66.136 o
grestore
gsave
47.4226 50.9329 translate
0 rotate
/STIXGeneral-Regular 12.0 selectfont
0 0.890625 moveto
/zero glyphshow
5.99998 0.890625 moveto
/period glyphshow
8.99997 0.890625 moveto
/one glyphshow
15 0.890625 moveto
/zero glyphshow
grestore
gsave
117.212 34.3548 translate
0 rotate
/STIXGeneral-Regular 14.0 selectfont
0 0.28125 moveto
/i glyphshow
3.892 0.28125 moveto
/n glyphshow
10.892 0.28125 moveto
/t glyphshow
14.784 0.28125 moveto
/e glyphshow
21 0.28125 moveto
/r glyphshow
25.662 0.28125 moveto
/n glyphshow
32.662 0.28125 moveto
/o glyphshow
39.662 0.28125 moveto
/d glyphshow
46.662 0.28125 moveto
/a glyphshow
52.878 0.28125 moveto
/l glyphshow
56.77 0.28125 moveto
/space glyphshow
60.27 0.28125 moveto
/d glyphshow
67.27 0.28125 moveto
/i glyphshow
71.162 0.28125 moveto
/s glyphshow
76.608 0.28125 moveto
/t glyphshow
80.5 0.28125 moveto
/a glyphshow
86.7159 0.28125 moveto
/n glyphshow
93.7159 0.28125 moveto
/c glyphshow
99.9319 0.28125 moveto
/e glyphshow
106.148 0.28125 moveto
/space glyphshow
/Cmmi10 14.0 selectfont
109.648 0.28125 moveto
/h glyphshow
/Cmmi10 9.799999999999999 selectfont
117.714 -2.09962 moveto
/e glyphshow
grestore
2 setlinecap
0.690 setgray
gsave
266.836 177.013 45.794 66.136 clipbox
45.79375 88.067532 m
312.629397 88.067532 l
stroke
grestore
0 setlinecap
0.000 setgray
gsave
/o {
gsave
newpath
translate
0.8 setlinewidth
1 setlinejoin

0 setlinecap

-0 0 m
-3.5 0 l

gsave
0.000 setgray
fill
grestore
stroke
grestore
} bind def
45.7938 88.0675 o
grestore
gsave
23.7938 83.966 translate
0 rotate
/STIXGeneral-Regular 12.0 selectfont
0 0.890625 moveto
/eight glyphshow
5.99998 0.890625 moveto
/period glyphshow
8.99997 0.890625 moveto
/seven glyphshow
grestore
2 setlinecap
0.690 setgray
gsave
266.836 177.013 45.794 66.136 clipbox
45.79375 133.219095 m
312.629397 133.219095 l
stroke
grestore
0 setlinecap
0.000 setgray
gsave
/o {
gsave
newpath
translate
0.8 setlinewidth
1 setlinejoin

0 setlinecap

-0 0 m
-3.5 0 l

gsave
0.000 setgray
fill
grestore
stroke
grestore
} bind def
45.7938 133.219 o
grestore
gsave
23.7938 129.118 translate
0 rotate
/STIXGeneral-Regular 12.0 selectfont
0 0.890625 moveto
/eight glyphshow
5.99998 0.890625 moveto
/period glyphshow
8.99997 0.890625 moveto
/eight glyphshow
grestore
2 setlinecap
0.690 setgray
gsave
266.836 177.013 45.794 66.136 clipbox
45.79375 178.370658 m
312.629397 178.370658 l
stroke
grestore
0 setlinecap
0.000 setgray
gsave
/o {
gsave
newpath
translate
0.8 setlinewidth
1 setlinejoin

0 setlinecap

-0 0 m
-3.5 0 l

gsave
0.000 setgray
fill
grestore
stroke
grestore
} bind def
45.7938 178.371 o
grestore
gsave
23.7938 174.269 translate
0 rotate
/STIXGeneral-Regular 12.0 selectfont
0 0.890625 moveto
/eight glyphshow
5.99998 0.890625 moveto
/period glyphshow
8.99997 0.890625 moveto
/nine glyphshow
grestore
2 setlinecap
0.690 setgray
gsave
266.836 177.013 45.794 66.136 clipbox
45.79375 223.522221 m
312.629397 223.522221 l
stroke
grestore
0 setlinecap
0.000 setgray
gsave
/o {
gsave
newpath
translate
0.8 setlinewidth
1 setlinejoin

0 setlinecap

-0 0 m
-3.5 0 l

gsave
0.000 setgray
fill
grestore
stroke
grestore
} bind def
45.7938 223.522 o
grestore
gsave
23.7938 219.421 translate
0 rotate
/STIXGeneral-Regular 12.0 selectfont
0 0.890625 moveto
/nine glyphshow
5.99998 0.890625 moveto
/period glyphshow
8.99997 0.890625 moveto
/zero glyphshow
grestore
/STIXGeneral-Regular 14.000 selectfont
gsave

16.7625 109.135 translate
90 rotate
0 0 m /m glyphshow
10.892 0 m /a glyphshow
17.108 0 m /x glyphshow
24.108 0 m /space glyphshow
27.608 0 m /t glyphshow
31.5 0 m /i glyphshow
35.392 0 m /p glyphshow
42.392 0 m /space glyphshow
45.892 0 m /p glyphshow
52.892 0 m /o glyphshow
59.892 0 m /s glyphshow
65.338 0 m /i glyphshow
69.23 0 m /t glyphshow
73.122 0 m /i glyphshow
77.014 0 m /o glyphshow
84.014 0 m /n glyphshow
grestore
1.500 setlinewidth
2 setlinecap
gsave
266.836 177.013 45.794 66.136 clipbox
300.500504 179.012619 m
255.017155 176.435043 l
219.641217 183.705499 l
128.674519 212.387702 l
57.922643 235.102716 l
stroke
grestore
1.000 setlinewidth
0 setlinecap
gsave
266.836 177.013 45.794 66.136 clipbox
/o {
gsave
newpath
translate
1.0 setlinewidth
1 setlinejoin

0 setlinecap

-3 -3 m
3 3 l
-3 3 m
3 -3 l

gsave
0.000 setgray
fill
grestore
stroke
grestore
} bind def
300.501 179.013 o
255.017 176.435 o
219.641 183.705 o
128.675 212.388 o
57.9226 235.103 o
grestore
1.500 setlinewidth
2 setlinecap
0.122 0.467 0.706 setrgbcolor
gsave
266.836 177.013 45.794 66.136 clipbox
57.922643 89.432437 m
84.228908 97.738147 l
108.395593 115.007876 l
130.596718 125.848013 l
150.992149 136.682419 l
169.728748 151.442521 l
186.941435 152.31747 l
202.754154 161.327902 l
217.28077 171.219451 l
230.625886 173.497655 l
242.885597 164.793291 l
254.148183 171.125623 l
264.494745 175.915704 l
273.999784 161.338091 l
282.731746 169.136358 l
290.753507 171.725389 l
stroke
grestore
1.000 setlinewidth
0 setlinecap
gsave
266.836 177.013 45.794 66.136 clipbox
/o {
gsave
newpath
translate
1.0 setlinewidth
1 setlinejoin

0 setlinecap

0 -3 m
0.795609 -3 1.55874 -2.683901 2.12132 -2.12132 c
2.683901 -1.55874 3 -0.795609 3 0 c
3 0.795609 2.683901 1.55874 2.12132 2.12132 c
1.55874 2.683901 0.795609 3 0 3 c
-0.795609 3 -1.55874 2.683901 -2.12132 2.12132 c
-2.683901 1.55874 -3 0.795609 -3 0 c
-3 -0.795609 -2.683901 -1.55874 -2.12132 -2.12132 c
-1.55874 -2.683901 -0.795609 -3 0 -3 c
cl

gsave
grestore
stroke
grestore
} bind def
57.9226 89.4324 o
84.2289 97.7381 o
108.396 115.008 o
130.597 125.848 o
150.992 136.682 o
169.729 151.443 o
186.941 152.317 o
202.754 161.328 o
217.281 171.219 o
230.626 173.498 o
242.886 164.793 o
254.148 171.126 o
264.495 175.916 o
274 161.338 o
282.732 169.136 o
290.754 171.725 o
grestore
1.500 setlinewidth
2 setlinecap
1.000 0.498 0.055 setrgbcolor
gsave
266.836 177.013 45.794 66.136 clipbox
57.922643 74.182034 m
84.228908 76.817159 l
108.395593 97.821365 l
130.596718 107.240207 l
150.992149 132.0265 l
169.728748 133.344213 l
186.941435 150.935617 l
202.754154 157.062849 l
217.28077 172.856057 l
230.625886 173.95537 l
254.148183 167.437327 l
264.494745 171.327149 l
273.999784 161.969347 l
290.753507 174.53044 l
stroke
grestore
1.000 setlinewidth
0 setlinecap
gsave
266.836 177.013 45.794 66.136 clipbox
/o {
gsave
newpath
translate
1.0 setlinewidth
1 setlinejoin

0 setlinecap

0 -1.5 m
0.397805 -1.5 0.77937 -1.341951 1.06066 -1.06066 c
1.341951 -0.77937 1.5 -0.397805 1.5 0 c
1.5 0.397805 1.341951 0.77937 1.06066 1.06066 c
0.77937 1.341951 0.397805 1.5 0 1.5 c
-0.397805 1.5 -0.77937 1.341951 -1.06066 1.06066 c
-1.341951 0.77937 -1.5 0.397805 -1.5 0 c
-1.5 -0.397805 -1.341951 -0.77937 -1.06066 -1.06066 c
-0.77937 -1.341951 -0.397805 -1.5 0 -1.5 c
cl

gsave
1.000 0.498 0.055 setrgbcolor
fill
grestore
stroke
grestore
} bind def
57.9226 74.182 o
84.2289 76.8172 o
108.396 97.8214 o
130.597 107.24 o
150.992 132.027 o
169.729 133.344 o
186.941 150.936 o
202.754 157.063 o
217.281 172.856 o
230.626 173.955 o
254.148 167.437 o
264.495 171.327 o
274 161.969 o
290.754 174.53 o
grestore
0.800 setlinewidth
0 setlinejoin
2 setlinecap
0.000 setgray
gsave
45.79375 66.136 m
45.79375 243.14875 l
stroke
grestore
gsave
312.629397 66.136 m
312.629397 243.14875 l
stroke
grestore
gsave
45.79375 66.136 m
312.629397 66.136 l
stroke
grestore
gsave
45.79375 243.14875 m
312.629397 243.14875 l
stroke
grestore
gsave
159.212 249.149 translate
0 rotate
/Cmmi10 12.0 selectfont
0 0 moveto
/t glyphshow
/Cmsy10 12.0 selectfont
6.43711 0 moveto
/approxequal glyphshow
/Cmr10 12.0 selectfont
17.8664 0 moveto
/nine glyphshow
/Cmmi10 12.0 selectfont
23.8664 0 moveto
/period glyphshow
/Cmr10 12.0 selectfont
27.1887 0 moveto
/six glyphshow
33.1887 0 moveto
/zero glyphshow
grestore
gsave
359.944386 66.136 m
626.780033 66.136 l
626.780033 243.14875 l
359.944386 243.14875 l
cl
1.000 setgray
fill
grestore
1 setlinejoin
0.690 setgray
gsave
266.836 177.013 359.944 66.136 clipbox
566.135568 66.136 m
566.135568 243.14875 l
stroke
grestore
0 setlinecap
0.000 setgray
gsave
/o {
gsave
newpath
translate
0.8 setlinewidth
1 setlinejoin

0 setlinecap

0 0 m
0 -3.5 l

gsave
0.000 setgray
fill
grestore
stroke
grestore
} bind def
566.136 66.136 o
grestore
gsave
555.636 50.9329 translate
0 rotate
/STIXGeneral-Regular 12.0 selectfont
0 0.890625 moveto
/zero glyphshow
5.99998 0.890625 moveto
/period glyphshow
8.99997 0.890625 moveto
/zero glyphshow
15 0.890625 moveto
/four glyphshow
grestore
2 setlinecap
0.690 setgray
gsave
266.836 177.013 359.944 66.136 clipbox
501.448138 66.136 m
501.448138 243.14875 l
stroke
grestore
0 setlinecap
0.000 setgray
gsave
/o {
gsave
newpath
translate
0.8 setlinewidth
1 setlinejoin

0 setlinecap

0 0 m
0 -3.5 l

gsave
0.000 setgray
fill
grestore
stroke
grestore
} bind def
501.448 66.136 o
grestore
gsave
490.948 50.9329 translate
0 rotate
/STIXGeneral-Regular 12.0 selectfont
0 0.796875 moveto
/zero glyphshow
5.99998 0.796875 moveto
/period glyphshow
8.99997 0.796875 moveto
/zero glyphshow
15 0.796875 moveto
/six glyphshow
grestore
2 setlinecap
0.690 setgray
gsave
266.836 177.013 359.944 66.136 clipbox
436.760709 66.136 m
436.760709 243.14875 l
stroke
grestore
0 setlinecap
0.000 setgray
gsave
/o {
gsave
newpath
translate
0.8 setlinewidth
1 setlinejoin

0 setlinecap

0 0 m
0 -3.5 l

gsave
0.000 setgray
fill
grestore
stroke
grestore
} bind def
436.761 66.136 o
grestore
gsave
426.261 50.9329 translate
0 rotate
/STIXGeneral-Regular 12.0 selectfont
0 0.890625 moveto
/zero glyphshow
5.99998 0.890625 moveto
/period glyphshow
8.99997 0.890625 moveto
/zero glyphshow
15 0.890625 moveto
/eight glyphshow
grestore
2 setlinecap
0.690 setgray
gsave
266.836 177.013 359.944 66.136 clipbox
372.073279 66.136 m
372.073279 243.14875 l
stroke
grestore
0 setlinecap
0.000 setgray
gsave
/o {
gsave
newpath
translate
0.8 setlinewidth
1 setlinejoin

0 setlinecap

0 0 m
0 -3.5 l

gsave
0.000 setgray
fill
grestore
stroke
grestore
} bind def
372.073 66.136 o
grestore
gsave
361.573 50.9329 translate
0 rotate
/STIXGeneral-Regular 12.0 selectfont
0 0.890625 moveto
/zero glyphshow
5.99998 0.890625 moveto
/period glyphshow
8.99997 0.890625 moveto
/one glyphshow
15 0.890625 moveto
/zero glyphshow
grestore
gsave
431.362 34.3548 translate
0 rotate
/STIXGeneral-Regular 14.0 selectfont
0 0.28125 moveto
/i glyphshow
3.892 0.28125 moveto
/n glyphshow
10.892 0.28125 moveto
/t glyphshow
14.784 0.28125 moveto
/e glyphshow
21 0.28125 moveto
/r glyphshow
25.662 0.28125 moveto
/n glyphshow
32.662 0.28125 moveto
/o glyphshow
39.662 0.28125 moveto
/d glyphshow
46.662 0.28125 moveto
/a glyphshow
52.878 0.28125 moveto
/l glyphshow
56.77 0.28125 moveto
/space glyphshow
60.27 0.28125 moveto
/d glyphshow
67.27 0.28125 moveto
/i glyphshow
71.162 0.28125 moveto
/s glyphshow
76.608 0.28125 moveto
/t glyphshow
80.5 0.28125 moveto
/a glyphshow
86.7159 0.28125 moveto
/n glyphshow
93.7159 0.28125 moveto
/c glyphshow
99.9319 0.28125 moveto
/e glyphshow
106.148 0.28125 moveto
/space glyphshow
/Cmmi10 14.0 selectfont
109.648 0.28125 moveto
/h glyphshow
/Cmmi10 9.799999999999999 selectfont
117.714 -2.09962 moveto
/e glyphshow
grestore
2 setlinecap
0.690 setgray
gsave
266.836 177.013 359.944 66.136 clipbox
359.944386 69.025979 m
626.780033 69.025979 l
stroke
grestore
0 setlinecap
0.000 setgray
gsave
/o {
gsave
newpath
translate
0.8 setlinewidth
1 setlinejoin

0 setlinecap

-0 0 m
-3.5 0 l

gsave
0.000 setgray
fill
grestore
stroke
grestore
} bind def
359.944 69.026 o
grestore
gsave
340.944 64.9244 translate
0 rotate
/STIXGeneral-Regular 12.0 selectfont
0 0.75 moveto
/five glyphshow
5.99998 0.75 moveto
/nine glyphshow
grestore
2 setlinecap
0.690 setgray
gsave
266.836 177.013 359.944 66.136 clipbox
359.944386 105.265481 m
626.780033 105.265481 l
stroke
grestore
0 setlinecap
0.000 setgray
gsave
/o {
gsave
newpath
translate
0.8 setlinewidth
1 setlinejoin

0 setlinecap

-0 0 m
-3.5 0 l

gsave
0.000 setgray
fill
grestore
stroke
grestore
} bind def
359.944 105.265 o
grestore
gsave
340.944 101.164 translate
0 rotate
/STIXGeneral-Regular 12.0 selectfont
0 0.796875 moveto
/six glyphshow
5.99998 0.796875 moveto
/zero glyphshow
grestore
2 setlinecap
0.690 setgray
gsave
266.836 177.013 359.944 66.136 clipbox
359.944386 141.504982 m
626.780033 141.504982 l
stroke
grestore
0 setlinecap
0.000 setgray
gsave
/o {
gsave
newpath
translate
0.8 setlinewidth
1 setlinejoin

0 setlinecap

-0 0 m
-3.5 0 l

gsave
0.000 setgray
fill
grestore
stroke
grestore
} bind def
359.944 141.505 o
grestore
gsave
340.944 137.403 translate
0 rotate
/STIXGeneral-Regular 12.0 selectfont
0 0.796875 moveto
/six glyphshow
5.99998 0.796875 moveto
/one glyphshow
grestore
2 setlinecap
0.690 setgray
gsave
266.836 177.013 359.944 66.136 clipbox
359.944386 177.744483 m
626.780033 177.744483 l
stroke
grestore
0 setlinecap
0.000 setgray
gsave
/o {
gsave
newpath
translate
0.8 setlinewidth
1 setlinejoin

0 setlinecap

-0 0 m
-3.5 0 l

gsave
0.000 setgray
fill
grestore
stroke
grestore
} bind def
359.944 177.744 o
grestore
gsave
340.944 173.643 translate
0 rotate
/STIXGeneral-Regular 12.0 selectfont
0 0.796875 moveto
/six glyphshow
5.99998 0.796875 moveto
/two glyphshow
grestore
2 setlinecap
0.690 setgray
gsave
266.836 177.013 359.944 66.136 clipbox
359.944386 213.983984 m
626.780033 213.983984 l
stroke
grestore
0 setlinecap
0.000 setgray
gsave
/o {
gsave
newpath
translate
0.8 setlinewidth
1 setlinejoin

0 setlinecap

-0 0 m
-3.5 0 l

gsave
0.000 setgray
fill
grestore
stroke
grestore
} bind def
359.944 213.984 o
grestore
gsave
340.944 209.882 translate
0 rotate
/STIXGeneral-Regular 12.0 selectfont
0 0.796875 moveto
/six glyphshow
5.99998 0.796875 moveto
/three glyphshow
grestore
/STIXGeneral-Regular 14.000 selectfont
gsave

333.898 86.9861 translate
90 rotate
0 0 m /e glyphshow
6.21599 0 m /n glyphshow
13.216 0 m /v glyphshow
20.216 0 m /e glyphshow
26.432 0 m /l glyphshow
30.324 0 m /o glyphshow
37.324 0 m /p glyphshow
44.324 0 m /e glyphshow
50.54 0 m /space glyphshow
54.04 0 m /c glyphshow
60.256 0 m /o glyphshow
67.256 0 m /n glyphshow
74.256 0 m /t glyphshow
78.1479 0 m /o glyphshow
85.1479 0 m /u glyphshow
92.1479 0 m /r glyphshow
96.8099 0 m /space glyphshow
100.31 0 m /l glyphshow
104.202 0 m /e glyphshow
110.418 0 m /n glyphshow
117.418 0 m /g glyphshow
124.418 0 m /t glyphshow
128.31 0 m /h glyphshow
grestore
1.500 setlinewidth
2 setlinecap
0.122 0.467 0.706 setrgbcolor
gsave
266.836 177.013 359.944 66.136 clipbox
612.273466 211.033043 m
604.904143 182.196675 l
596.882382 180.256075 l
588.15042 180.442765 l
578.645381 190.586658 l
568.298819 210.733117 l
557.036233 188.779288 l
544.776522 209.291099 l
531.431406 221.325638 l
516.90479 188.933621 l
501.092071 187.086531 l
483.879384 189.72192 l
465.142785 178.198188 l
444.747354 174.025129 l
422.546229 177.172306 l
398.379544 171.513932 l
372.073279 145.245848 l
stroke
grestore
1.000 setlinewidth
0 setlinecap
gsave
266.836 177.013 359.944 66.136 clipbox
/o {
gsave
newpath
translate
1.0 setlinewidth
1 setlinejoin

0 setlinecap

0 -3 m
0.795609 -3 1.55874 -2.683901 2.12132 -2.12132 c
2.683901 -1.55874 3 -0.795609 3 0 c
3 0.795609 2.683901 1.55874 2.12132 2.12132 c
1.55874 2.683901 0.795609 3 0 3 c
-0.795609 3 -1.55874 2.683901 -2.12132 2.12132 c
-2.683901 1.55874 -3 0.795609 -3 0 c
-3 -0.795609 -2.683901 -1.55874 -2.12132 -2.12132 c
-1.55874 -2.683901 -0.795609 -3 0 -3 c
cl

gsave
grestore
stroke
grestore
} bind def
612.273 211.033 o
604.904 182.197 o
596.882 180.256 o
588.15 180.443 o
578.645 190.587 o
568.299 210.733 o
557.036 188.779 o
544.777 209.291 o
531.431 221.326 o
516.905 188.934 o
501.092 187.087 o
483.879 189.722 o
465.143 178.198 o
444.747 174.025 o
422.546 177.172 o
398.38 171.514 o
372.073 145.246 o
grestore
1.500 setlinewidth
2 setlinecap
0.000 setgray
gsave
266.836 177.013 359.944 66.136 clipbox
614.65114 185.365555 m
569.167791 158.631675 l
533.791853 139.555874 l
442.825155 95.154799 l
372.073279 74.182034 l
stroke
grestore
1.000 setlinewidth
0 setlinecap
gsave
266.836 177.013 359.944 66.136 clipbox
/o {
gsave
newpath
translate
1.0 setlinewidth
1 setlinejoin

0 setlinecap

-3 -3 m
3 3 l
-3 3 m
3 -3 l

gsave
0.000 setgray
fill
grestore
stroke
grestore
} bind def
614.651 185.366 o
569.168 158.632 o
533.792 139.556 o
442.825 95.1548 o
372.073 74.182 o
grestore
1.500 setlinewidth
2 setlinecap
1.000 0.498 0.055 setrgbcolor
gsave
266.836 177.013 359.944 66.136 clipbox
604.904143 188.540691 m
588.15042 179.18786 l
578.645381 192.63843 l
568.298819 187.412402 l
544.776522 235.102716 l
531.431406 195.556329 l
516.90479 195.647302 l
501.092071 180.558732 l
483.879384 186.204679 l
465.142785 188.107081 l
444.747354 168.702334 l
422.546229 164.309354 l
398.379544 136.614575 l
372.073279 133.408378 l
stroke
grestore
1.000 setlinewidth
0 setlinecap
gsave
266.836 177.013 359.944 66.136 clipbox
/o {
gsave
newpath
translate
1.0 setlinewidth
1 setlinejoin

0 setlinecap

0 -1.5 m
0.397805 -1.5 0.77937 -1.341951 1.06066 -1.06066 c
1.341951 -0.77937 1.5 -0.397805 1.5 0 c
1.5 0.397805 1.341951 0.77937 1.06066 1.06066 c
0.77937 1.341951 0.397805 1.5 0 1.5 c
-0.397805 1.5 -0.77937 1.341951 -1.06066 1.06066 c
-1.341951 0.77937 -1.5 0.397805 -1.5 0 c
-1.5 -0.397805 -1.341951 -0.77937 -1.06066 -1.06066 c
-0.77937 -1.341951 -0.397805 -1.5 0 -1.5 c
cl

gsave
1.000 0.498 0.055 setrgbcolor
fill
grestore
stroke
grestore
} bind def
604.904 188.541 o
588.15 179.188 o
578.645 192.638 o
568.299 187.412 o
544.777 235.103 o
531.431 195.556 o
516.905 195.647 o
501.092 180.559 o
483.879 186.205 o
465.143 188.107 o
444.747 168.702 o
422.546 164.309 o
398.38 136.615 o
372.073 133.408 o
grestore
0.800 setlinewidth
0 setlinejoin
2 setlinecap
0.000 setgray
gsave
359.944386 66.136 m
359.944386 243.14875 l
stroke
grestore
gsave
626.780033 66.136 m
626.780033 243.14875 l
stroke
grestore
gsave
359.944386 66.136 m
626.780033 66.136 l
stroke
grestore
gsave
359.944386 243.14875 m
626.780033 243.14875 l
stroke
grestore
gsave
473.362 249.149 translate
0 rotate
/Cmmi10 12.0 selectfont
0 0 moveto
/t glyphshow
/Cmsy10 12.0 selectfont
6.43711 0 moveto
/approxequal glyphshow
/Cmr10 12.0 selectfont
17.8664 0 moveto
/nine glyphshow
/Cmmi10 12.0 selectfont
23.8664 0 moveto
/period glyphshow
/Cmr10 12.0 selectfont
27.1887 0 moveto
/six glyphshow
33.1887 0 moveto
/zero glyphshow
grestore
1.000 setlinewidth
0 setlinecap
0.800 setgray
gsave
205.419704 5 m
428.560329 5 l
429.893662 5 430.560329 5.666667 430.560329 7 c
430.560329 20.171875 l
430.560329 21.505208 429.893662 22.171875 428.560329 22.171875 c
205.419704 22.171875 l
204.086371 22.171875 203.419704 21.505208 203.419704 20.171875 c
203.419704 7 l
203.419704 5.666667 204.086371 5 205.419704 5 c
cl
gsave
1.000 setgray
fill
grestore
stroke
grestore
1.500 setlinewidth
1 setlinejoin
2 setlinecap
0.000 setgray
gsave
207.419704 14.671875 m
217.419704 14.671875 l
227.419704 14.671875 l
stroke
grestore
1.000 setlinewidth
0 setlinecap
gsave
/o {
gsave
newpath
translate
1.0 setlinewidth
1 setlinejoin

0 setlinecap

-3 -3 m
3 3 l
-3 3 m
3 -3 l

gsave
0.000 setgray
fill
grestore
stroke
grestore
} bind def
217.42 14.6719 o
grestore
/STIXGeneral-Regular 10.000 selectfont
gsave

235.42 11.1719 translate
0 rotate
0 0 m /P glyphshow
5.56999 0 m /F glyphshow
11.13 0 m /I glyphshow
14.46 0 m /C glyphshow
grestore
1.500 setlinewidth
2 setlinecap
0.122 0.467 0.706 setrgbcolor
gsave
264.560329 14.671875 m
274.560329 14.671875 l
284.560329 14.671875 l
stroke
grestore
1.000 setlinewidth
0 setlinecap
gsave
/o {
gsave
newpath
translate
1.0 setlinewidth
1 setlinejoin

0 setlinecap

0 -3 m
0.795609 -3 1.55874 -2.683901 2.12132 -2.12132 c
2.683901 -1.55874 3 -0.795609 3 0 c
3 0.795609 2.683901 1.55874 2.12132 2.12132 c
1.55874 2.683901 0.795609 3 0 3 c
-0.795609 3 -1.55874 2.683901 -2.12132 2.12132 c
-2.683901 1.55874 -3 0.795609 -3 0 c
-3 -0.795609 -2.683901 -1.55874 -2.12132 -2.12132 c
-1.55874 -2.683901 -0.795609 -3 0 -3 c
cl

gsave
grestore
stroke
grestore
} bind def
274.56 14.6719 o
grestore
0.000 setgray
gsave
292.56 11.1719 translate
0 rotate
/STIXGeneral-Regular 10.0 selectfont
0 0.34375 moveto
/M glyphshow
8.88998 0.34375 moveto
/I glyphshow
12.22 0.34375 moveto
/T glyphshow
18.33 0.34375 moveto
/comma glyphshow
20.8299 0.34375 moveto
/space glyphshow
/Cmmi10 10.0 selectfont
23.3299 0.34375 moveto
/m glyphshow
/Cmr10 10.0 selectfont
33.8651 0.34375 moveto
/equal glyphshow
43.3895 0.34375 moveto
/two glyphshow
grestore
1.500 setlinewidth
2 setlinecap
1.000 0.498 0.055 setrgbcolor
gsave
349.560329 14.671875 m
359.560329 14.671875 l
369.560329 14.671875 l
stroke
grestore
1.000 setlinewidth
0 setlinecap
gsave
/o {
gsave
newpath
translate
1.0 setlinewidth
1 setlinejoin

0 setlinecap

0 -1.5 m
0.397805 -1.5 0.77937 -1.341951 1.06066 -1.06066 c
1.341951 -0.77937 1.5 -0.397805 1.5 0 c
1.5 0.397805 1.341951 0.77937 1.06066 1.06066 c
0.77937 1.341951 0.397805 1.5 0 1.5 c
-0.397805 1.5 -0.77937 1.341951 -1.06066 1.06066 c
-1.341951 0.77937 -1.5 0.397805 -1.5 0 c
-1.5 -0.397805 -1.341951 -0.77937 -1.06066 -1.06066 c
-0.77937 -1.341951 -0.397805 -1.5 0 -1.5 c
cl

gsave
1.000 0.498 0.055 setrgbcolor
fill
grestore
stroke
grestore
} bind def
359.56 14.6719 o
grestore
0.000 setgray
gsave
377.56 11.1719 translate
0 rotate
/STIXGeneral-Regular 10.0 selectfont
0 0.34375 moveto
/M glyphshow
8.88998 0.34375 moveto
/I glyphshow
12.22 0.34375 moveto
/T glyphshow
18.33 0.34375 moveto
/comma glyphshow
20.8299 0.34375 moveto
/space glyphshow
/Cmmi10 10.0 selectfont
23.3299 0.34375 moveto
/m glyphshow
/Cmr10 10.0 selectfont
33.8651 0.34375 moveto
/equal glyphshow
43.3895 0.34375 moveto
/four glyphshow
grestore

end
showpage
