%!PS-Adobe-3.0 EPSF-3.0
%%Title: radiuses_isotropy.eps
%%Creator: Matplotlib v3.5.3, https://matplotlib.org/
%%CreationDate: Tue Jun 27 09:54:19 2023
%%Orientation: portrait
%%BoundingBox: 166 253 446 539
%%HiResBoundingBox: 166.319359 253.639375 445.680641 538.360625
%%EndComments
%%BeginProlog
/mpldict 15 dict def
mpldict begin
/_d { bind def } bind def
/m { moveto } _d
/l { lineto } _d
/r { rlineto } _d
/c { curveto } _d
/cl { closepath } _d
/ce { closepath eofill } _d
/box {
      m
      1 index 0 r
      0 exch r
      neg 0 r
      cl
    } _d
/clipbox {
      box
      clip
      newpath
    } _d
/sc { setcachedevice } _d
%!PS-Adobe-3.0 Resource-Font
%%Creator: Converted from TrueType to Type 3 by Matplotlib.
10 dict begin
/FontName /STIXGeneral-Regular def
/PaintType 0 def
/FontMatrix [0.001 0 0 0.001 0 0] def
/FontBBox [-970 -443 2000 1023] def
/FontType 3 def
/Encoding [/space /period /zero /one /two /three /four /five /six /seven /eight /nine /a /d /e /g /i /l /m /n /p /r /s /t /u] def
/CharStrings 26 dict dup begin
/.notdef 0 def
/space{250 0 0 0 0 0 sc
ce} _d
/period{250 0 70 -11 181 100 sc
181 43 m
181 28 175 16 164 5 c
153 -6 140 -11 125 -11 c
110 -11 97 -6 86 5 c
75 16 70 29 70 44 c
70 59 75 72 86 83 c
97 94 111 100 126 100 c
141 100 153 94 164 83 c
175 72 181 58 181 43 c

ce} _d
/zero{500 0 24 -14 476 676 sc
476 330 m
476 285 472 243 463 203 c
454 164 441 127 424 94 c
407 61 384 34 354 15 c
324 -4 289 -14 250 -14 c
209 -14 174 -4 143 17 c
112 38 89 65 72 100 c
55 135 43 172 35 211 c
28 250 24 292 24 336 c
24 398 32 454 47 503 c
62 553 88 594 123 627 c
159 660 203 676 254 676 c
319 676 373 644 414 580 c
455 516 476 433 476 330 c

380 325 m
380 430 369 511 346 566 c
324 622 291 650 248 650 c
207 650 175 622 153 566 c
131 510 120 431 120 329 c
120 226 131 148 153 93 c
175 39 207 12 250 12 c
292 12 324 39 346 93 c
369 148 380 225 380 325 c

ce} _d
/one{500 0 111 0 394 676 sc
394 0 m
118 0 l
118 15 l
155 17 180 24 193 35 c
206 47 213 67 213 95 c
213 544 l
213 577 203 593 183 593 c
174 593 159 589 138 581 c
111 571 l
111 585 l
290 676 l
299 673 l
299 76 l
299 54 306 38 319 29 c
332 20 357 15 394 15 c
394 0 l

ce} _d
/two{500 0 29 0 474 676 sc
474 137 m
420 0 l
29 0 l
29 12 l
207 201 l
254 250 287 294 307 335 c
327 376 337 418 337 461 c
337 506 325 540 300 565 c
275 590 241 602 198 602 c
162 602 133 593 112 574 c
91 555 71 521 51 472 c
30 477 l
41 539 64 588 98 623 c
133 658 179 676 238 676 c
293 676 338 659 372 626 c
406 593 423 551 423 500 c
423 425 380 342 295 252 c
130 76 l
364 76 l
386 76 403 80 416 89 c
429 98 444 116 460 143 c
474 137 l

ce} _d
/three{500 0 41 -14 431 676 sc
61 510 m
45 514 l
60 564 84 603 117 632 c
150 661 191 676 241 676 c
288 676 325 663 354 638 c
383 613 397 580 397 539 c
397 484 366 438 304 401 c
341 385 368 367 387 348 c
416 315 431 272 431 219 c
431 166 416 119 385 79 c
362 48 330 25 287 9 c
245 -6 200 -14 153 -14 c
78 -14 41 5 41 43 c
41 54 45 62 53 69 c
61 76 71 79 82 79 c
99 79 119 70 143 53 c
172 32 201 22 229 22 c
266 22 296 37 321 66 c
346 96 359 132 359 175 c
359 252 324 300 255 320 c
234 327 200 330 153 330 c
153 344 l
190 357 218 369 237 380 c
291 411 318 455 318 514 c
318 547 308 573 289 590 c
270 607 244 616 210 616 c
150 616 100 581 61 510 c

ce} _d
/four{500 0 12 0 473 676 sc
473 167 m
370 167 l
370 0 l
292 0 l
292 167 l
12 167 l
12 231 l
326 676 l
370 676 l
370 231 l
473 231 l
473 167 l

292 231 m
292 574 l
52 231 l
292 231 l

ce} _d
/five{500 0 31 -14 438 688 sc
438 681 m
402 596 l
398 587 389 583 375 583 c
181 583 l
141 498 l
214 484 267 469 300 452 c
333 436 363 409 391 370 c
414 338 426 296 426 243 c
426 195 418 155 402 122 c
387 89 362 60 328 35 c
283 2 226 -14 158 -14 c
120 -14 89 -8 66 3 c
43 14 31 29 31 48 c
31 73 46 86 76 86 c
100 86 125 76 150 55 c
176 34 200 23 221 23 c
256 23 287 40 314 75 c
342 110 356 149 356 192 c
356 256 334 306 289 342 c
231 389 160 412 76 412 c
68 412 64 415 64 420 c
65 425 l
174 662 l
381 662 l
392 662 401 664 407 667 c
414 670 421 677 429 688 c
438 681 l

ce} _d
/six{500 0 34 -14 468 684 sc
446 684 m
448 668 l
369 655 304 623 251 572 c
198 521 165 458 152 383 c
191 413 233 428 279 428 c
338 428 384 409 417 372 c
451 335 468 284 468 219 c
468 154 451 100 417 59 c
378 10 325 -14 258 -14 c
177 -14 118 20 81 87 c
50 144 34 208 34 279 c
34 388 70 480 143 555 c
184 598 227 628 270 645 c
314 663 373 676 446 684 c

378 188 m
378 317 333 382 243 382 c
210 382 182 373 160 355 c
138 338 127 308 127 266 c
127 188 139 126 163 81 c
188 36 223 14 269 14 c
304 14 331 30 350 61 c
369 93 378 135 378 188 c

ce} _d
/seven{500 0 20 -8 449 662 sc
449 646 m
237 -8 l
172 -8 l
370 588 l
155 588 l
126 588 105 583 91 573 c
77 563 59 541 38 506 c
20 515 l
80 662 l
449 662 l
449 646 l

ce} _d
/eight{500 0 56 -14 445 676 sc
445 155 m
445 104 427 63 391 32 c
356 1 308 -14 248 -14 c
192 -14 146 1 110 32 c
74 63 56 102 56 149 c
56 184 65 214 82 239 c
99 264 134 295 186 332 c
136 373 103 407 86 432 c
70 457 62 487 62 520 c
62 567 80 605 116 633 c
153 662 199 676 256 676 c
305 676 345 662 376 634 c
408 607 424 573 424 533 c
424 496 414 467 395 445 c
376 423 341 398 290 371 c
350 331 391 295 412 264 c
434 233 445 196 445 155 c

355 533 m
355 568 345 595 326 616 c
307 637 280 648 246 648 c
212 648 185 639 165 621 c
146 604 136 580 136 549 c
136 518 146 490 165 465 c
185 440 217 415 261 389 c
295 409 319 430 333 452 c
348 475 355 502 355 533 c

271 272 m
212 312 l
183 288 162 264 150 241 c
138 218 132 191 132 158 c
132 113 143 77 166 52 c
189 27 220 14 259 14 c
292 14 318 24 338 44 c
359 65 369 91 369 124 c
369 154 361 180 346 203 c
331 226 306 249 271 272 c

ce} _d
/nine{500 0 30 -22 459 676 sc
59 -22 m
56 -2 l
133 11 197 44 250 95 c
303 146 340 213 360 294 c
321 256 271 237 210 237 c
156 237 112 256 79 293 c
46 330 30 379 30 440 c
30 507 50 563 89 608 c
129 653 179 676 238 676 c
301 676 354 651 395 600 c
438 547 459 478 459 394 c
459 335 449 280 428 228 c
408 177 378 133 339 97 c
298 60 257 33 218 16 c
179 0 126 -13 59 -22 c

362 355 m
362 394 l
362 563 318 648 230 648 c
199 648 174 637 157 614 c
147 601 139 581 132 554 c
125 527 122 501 122 474 c
122 415 133 367 155 332 c
178 297 208 280 245 280 c
272 280 298 286 323 299 c
349 312 362 331 362 355 c

ce} _d
/a{444 0 37 -10 442 460 sc
442 66 m
442 38 l
417 6 387 -10 352 -10 c
314 -10 293 14 288 63 c
287 63 l
244 14 196 -10 142 -10 c
111 -10 85 -1 66 17 c
47 36 37 61 37 94 c
37 141 60 180 107 211 c
139 232 199 259 287 292 c
287 346 l
287 376 280 398 265 413 c
251 428 232 436 209 436 c
189 436 172 431 159 421 c
146 412 139 400 139 387 c
139 381 140 374 142 367 c
144 360 145 352 145 345 c
145 335 140 326 131 317 c
122 308 112 304 99 304 c
88 304 78 308 69 317 c
60 326 56 337 56 350 c
56 382 73 409 107 430 c
138 450 177 460 222 460 c
276 460 315 445 340 415 c
352 401 360 387 363 372 c
366 358 368 335 368 304 c
368 113 l
368 69 378 47 399 47 c
412 47 427 53 442 66 c

287 127 m
287 268 l
226 247 183 225 159 202 c
136 181 125 156 125 125 c
125 100 131 80 144 67 c
157 54 173 48 194 48 c
216 48 235 53 252 64 c
266 74 275 83 280 92 c
285 101 287 112 287 127 c

ce} _d
/d{500 0 27 -10 491 683 sc
491 42 m
344 -10 l
340 -7 l
340 57 l
308 12 265 -10 212 -10 c
157 -10 112 10 78 49 c
44 89 27 141 27 205 c
27 276 47 336 88 385 c
129 435 178 460 235 460 c
271 460 306 446 340 417 c
340 573 l
340 594 337 607 331 614 c
325 621 313 624 294 624 c
285 624 277 624 272 623 c
272 639 l
333 655 382 670 419 683 c
424 681 l
424 114 l
424 91 427 75 432 68 c
438 61 450 57 468 57 c
472 57 480 57 491 58 c
491 42 l

340 102 m
340 332 l
340 359 330 382 309 402 c
289 422 265 432 238 432 c
200 432 170 415 147 381 c
124 347 113 302 113 245 c
113 184 125 134 150 97 c
175 60 209 42 251 42 c
282 42 307 53 325 74 c
335 85 340 95 340 102 c

ce} _d
/e{444 0 25 -10 424 460 sc
408 164 m
424 157 l
384 46 314 -10 215 -10 c
156 -10 110 10 76 51 c
42 92 25 148 25 217 c
25 288 44 347 82 392 c
120 437 170 460 232 460 c
292 460 338 437 371 391 c
390 364 402 326 405 277 c
97 277 l
100 235 104 203 109 181 c
115 159 126 137 143 114 c
171 77 208 59 254 59 c
287 59 314 67 336 83 c
359 99 383 126 408 164 c

99 309 m
303 309 l
297 351 287 381 273 398 c
260 415 237 424 205 424 c
177 424 154 414 135 394 c
116 375 104 346 99 309 c

ce} _d
/g{500 0 28 -218 470 460 sc
470 388 m
387 388 l
400 359 406 331 406 304 c
406 253 389 214 354 188 c
319 162 285 149 250 149 c
243 149 230 150 212 152 c
193 154 l
180 150 166 141 153 127 c
140 113 133 101 133 91 c
133 76 159 67 211 64 c
340 58 l
377 57 406 46 428 27 c
450 8 461 -18 461 -49 c
461 -88 441 -123 401 -154 c
346 -197 279 -218 201 -218 c
153 -218 112 -208 78 -189 c
45 -170 28 -148 28 -121 c
28 -102 35 -84 50 -65 c
65 -47 90 -25 126 1 c
105 11 90 20 83 27 c
76 34 73 43 73 54 c
73 73 88 96 119 123 c
134 136 149 150 162 163 c
129 180 105 198 90 219 c
76 240 69 266 69 297 c
69 342 85 381 117 412 c
150 444 189 460 236 460 c
263 460 289 455 316 445 c
338 437 l
357 430 376 427 393 427 c
470 427 l
470 388 l

152 338 m
152 335 l
152 287 161 248 180 218 c
199 189 224 174 255 174 c
278 174 296 182 309 198 c
322 215 329 237 329 264 c
329 308 319 348 299 385 c
282 416 258 432 226 432 c
203 432 184 424 171 407 c
158 390 152 367 152 338 c

433 -64 m
433 -45 424 -32 405 -25 c
387 -18 355 -15 309 -15 c
243 -15 189 -11 147 -2 c
127 -26 114 -43 107 -54 c
101 -65 98 -77 98 -88 c
98 -110 111 -128 137 -141 c
164 -154 199 -161 243 -161 c
300 -161 345 -152 380 -134 c
415 -117 433 -93 433 -64 c

ce} _d
/i{278 0 16 0 253 683 sc
180 632 m
180 617 175 605 165 595 c
155 586 143 581 128 581 c
114 581 102 586 92 595 c
83 605 78 617 78 632 c
78 646 83 658 93 668 c
103 678 115 683 129 683 c
144 683 156 678 165 668 c
175 658 180 646 180 632 c

253 0 m
16 0 l
16 15 l
51 17 72 23 81 33 c
90 43 95 67 95 104 c
95 331 l
95 354 93 371 88 380 c
83 389 75 394 62 394 c
46 394 32 392 20 389 c
20 405 l
175 460 l
179 456 l
179 105 l
179 68 183 44 191 34 c
200 24 220 18 253 15 c
253 0 l

ce} _d
/l{278 0 19 0 257 683 sc
257 0 m
21 0 l
21 15 l
52 18 73 24 83 34 c
93 45 98 64 98 92 c
98 561 l
98 585 95 602 89 611 c
83 620 72 625 56 625 c
42 625 30 624 19 623 c
19 639 l
82 654 135 669 177 683 c
182 679 l
182 87 l
182 59 187 40 196 31 c
205 22 226 17 257 15 c
257 0 l

ce} _d
/m{778 0 16 0 775 460 sc
775 0 m
557 0 l
557 15 l
585 18 603 23 610 32 c
618 41 622 61 622 90 c
622 296 l
622 336 616 365 604 382 c
593 399 573 408 545 408 c
522 408 502 403 485 394 c
469 385 453 369 438 347 c
438 95 l
438 63 443 42 452 31 c
462 21 481 16 510 15 c
510 0 l
286 0 l
286 15 l
315 17 334 22 342 29 c
350 37 354 56 354 86 c
354 297 l
354 371 332 408 289 408 c
270 408 250 404 229 395 c
208 387 193 377 183 365 c
174 355 170 349 170 348 c
170 70 l
170 49 175 34 184 27 c
193 20 211 16 238 15 c
238 0 l
16 0 l
16 15 l
44 16 63 21 72 30 c
81 40 86 59 86 88 c
86 336 l
86 361 83 378 78 387 c
73 397 64 402 51 402 c
41 402 30 401 19 398 c
19 415 l
64 428 111 443 158 460 c
166 457 l
166 383 l
168 383 l
198 414 224 435 247 445 c
270 455 295 460 321 460 c
374 460 409 432 427 376 c
479 432 533 460 590 460 c
667 460 706 400 706 280 c
706 77 l
706 55 709 40 716 31 c
723 23 734 18 749 17 c
775 15 l
775 0 l

ce} _d
/n{500 0 16 0 485 460 sc
485 0 m
277 0 l
278 15 l
303 17 319 24 327 36 c
336 49 340 72 340 105 c
340 304 l
340 371 316 405 267 405 c
250 405 235 401 220 393 c
205 385 187 370 164 348 c
164 72 l
164 52 168 38 177 30 c
186 22 204 17 229 15 c
229 0 l
18 0 l
18 15 l
43 17 60 23 68 33 c
76 44 80 64 80 94 c
80 337 l
80 362 78 379 73 388 c
68 397 59 402 45 402 c
32 402 22 401 16 398 c
16 415 l
63 428 108 443 153 460 c
161 457 l
161 379 l
162 379 l
209 433 257 460 306 460 c
344 460 373 447 393 420 c
414 393 424 355 424 306 c
424 85 l
424 58 428 41 436 32 c
444 23 460 18 485 15 c
485 0 l

ce} _d
/p{500 0 5 -217 470 460 sc
159 458 m
159 381 l
201 434 249 460 303 460 c
352 460 392 440 423 400 c
454 360 470 309 470 247 c
470 174 450 113 409 64 c
369 15 319 -10 260 -10 c
239 -10 222 -7 207 -1 c
193 5 177 16 159 33 c
159 -124 l
159 -155 164 -175 175 -184 c
186 -193 210 -198 247 -199 c
247 -217 l
5 -217 l
5 -200 l
34 -197 53 -192 62 -183 c
71 -174 75 -157 75 -131 c
75 337 l
75 360 72 376 67 383 c
62 390 51 394 34 394 c
23 394 15 394 9 393 c
9 409 l
56 423 104 440 153 460 c
159 458 l

159 334 m
159 88 l
159 73 170 59 193 44 c
216 29 240 22 263 22 c
299 22 328 39 350 73 c
373 107 384 152 384 207 c
384 266 373 312 350 347 c
328 382 298 400 261 400 c
238 400 215 393 192 378 c
170 363 159 349 159 334 c

ce} _d
/r{333 0 5 0 335 460 sc
160 458 m
160 366 l
185 402 206 427 223 440 c
240 453 259 460 280 460 c
297 460 311 455 320 446 c
330 437 335 424 335 407 c
335 393 331 382 324 374 c
317 366 308 362 296 362 c
283 362 270 369 256 382 c
245 392 237 397 230 397 c
216 397 201 387 184 368 c
168 349 160 331 160 315 c
160 90 l
160 61 166 42 177 32 c
188 22 211 16 245 15 c
245 0 l
5 0 l
5 15 l
37 21 57 28 64 35 c
72 42 76 59 76 84 c
76 334 l
76 356 73 371 68 380 c
63 389 55 394 42 394 c
31 394 20 393 7 390 c
7 406 l
49 419 98 437 155 460 c
160 458 l

ce} _d
/s{389 0 51 -10 348 459 sc
156 301 m
260 238 l
293 218 316 199 329 182 c
342 165 348 142 348 115 c
348 82 334 52 306 27 c
279 2 246 -10 208 -10 c
177 -10 152 -7 135 -1 c
117 5 102 8 89 8 c
78 8 70 4 65 -4 c
52 -4 l
52 153 l
68 153 l
79 104 94 69 114 46 c
134 23 161 12 195 12 c
220 12 240 19 255 33 c
270 47 278 65 278 86 c
278 117 260 142 225 161 c
171 191 l
91 236 51 284 51 336 c
51 375 63 405 88 426 c
113 448 147 459 189 459 c
218 459 241 455 256 448 c
268 443 277 440 284 440 c
289 440 294 443 300 450 c
311 450 l
316 314 l
301 314 l
290 359 275 391 258 409 c
241 428 218 437 188 437 c
165 437 147 431 133 420 c
120 409 113 392 113 369 c
113 358 117 345 124 332 c
132 319 143 309 156 301 c

ce} _d
/t{278 0 13 -10 279 579 sc
266 77 m
279 66 l
247 15 207 -10 158 -10 c
99 -10 70 32 70 117 c
70 418 l
17 418 l
14 420 13 422 13 425 c
13 430 19 437 30 444 c
55 459 88 494 127 551 c
128 553 131 557 136 563 c
141 570 145 575 147 579 c
152 579 154 575 154 566 c
154 450 l
255 450 l
255 418 l
154 418 l
154 132 l
154 100 158 77 166 63 c
174 49 187 42 206 42 c
226 42 246 54 266 77 c

ce} _d
/u{500 0 9 -10 480 450 sc
480 50 m
480 36 l
428 22 382 7 343 -9 c
338 -6 l
338 76 l
336 76 l
294 19 246 -10 193 -10 c
155 -10 125 2 103 25 c
82 48 71 79 71 118 c
71 369 l
71 394 67 411 58 420 c
49 429 33 435 9 436 c
9 450 l
155 450 l
155 127 l
155 104 162 85 175 70 c
189 55 206 48 226 48 c
259 48 287 58 310 79 c
319 87 325 94 328 101 c
331 108 333 120 333 137 c
333 368 l
333 394 328 411 319 418 c
310 426 290 431 259 433 c
259 450 l
417 450 l
417 107 l
417 84 421 68 428 61 c
436 54 451 50 474 50 c
480 50 l

ce} _d
end readonly def

/BuildGlyph {
 exch begin
 CharStrings exch
 2 copy known not {pop /.notdef} if
 true 3 1 roll get exec
 end
} _d

/BuildChar {
 1 index /Encoding get exch get
 1 index /BuildGlyph get exec
} _d

FontName currentdict end definefont pop
%!PS-Adobe-3.0 Resource-Font
%%Creator: Converted from TrueType to Type 3 by Matplotlib.
10 dict begin
/FontName /Cmmi10 def
/PaintType 0 def
/FontMatrix [0.00048828125 0 0 0.00048828125 0 0] def
/FontBBox [-70 -512 2146 1536] def
/FontType 3 def
/Encoding [/k /m /gamma /t /period /comma] def
/CharStrings 7 dict dup begin
/.notdef 0 def
/k{1065 0 109 -23 1038 1421 sc
109 37 m
109 45 110 51 111 55 c
408 1239 l
413 1262 417 1281 418 1294 c
418 1316 374 1327 285 1327 c
271 1327 264 1336 264 1354 c
265 1357 266 1363 268 1372 c
271 1381 274 1387 277 1392 c
281 1397 286 1399 293 1399 c
569 1421 l
575 1421 l
575 1420 577 1418 582 1415 c
587 1413 589 1412 590 1411 c
593 1404 594 1399 594 1395 c
379 539 l
428 560 490 609 565 686 c
640 764 699 820 741 854 c
784 888 837 905 901 905 c
939 905 971 892 998 866 c
1025 840 1038 808 1038 770 c
1038 746 1033 724 1023 703 c
1013 683 999 667 981 654 c
963 641 942 635 918 635 c
896 635 877 642 862 655 c
847 669 840 687 840 709 c
840 742 851 769 874 791 c
897 814 925 825 958 825 c
945 843 924 852 897 852 c
856 852 817 840 779 817 c
742 794 701 760 657 716 c
614 673 574 633 538 596 c
502 560 469 533 438 514 c
519 505 589 483 648 450 c
707 417 737 367 737 299 c
737 285 734 267 729 246 c
717 195 711 154 711 123 c
711 62 732 31 774 31 c
823 31 861 58 886 112 c
912 166 933 229 950 301 c
953 309 958 313 967 313 c
991 313 l
996 313 1001 311 1004 308 c
1008 305 1010 300 1010 295 c
1010 294 1009 292 1008 289 c
957 81 877 -23 770 -23 c
731 -23 697 -14 667 4 c
638 22 615 46 599 77 c
583 108 575 143 575 182 c
575 204 578 227 584 250 c
588 266 590 281 590 295 c
590 348 567 388 520 415 c
473 442 420 459 360 465 c
256 47 l
251 26 240 10 225 -3 c
210 -16 192 -23 172 -23 c
155 -23 140 -17 127 -5 c
115 6 109 20 109 37 c

ce} _d
/m{1798 0 55 -23 1743 905 sc
158 35 m
158 43 159 49 160 53 c
313 664 l
323 702 328 735 328 764 c
328 823 308 852 268 852 c
225 852 194 826 173 775 c
152 724 132 660 113 582 c
113 578 111 575 107 572 c
103 570 99 569 96 569 c
72 569 l
67 569 63 571 60 576 c
57 581 55 586 55 590 c
70 649 84 700 97 741 c
111 782 132 820 161 854 c
190 888 227 905 270 905 c
321 905 367 889 406 856 c
445 824 465 783 465 733 c
506 786 553 828 608 859 c
663 890 721 905 782 905 c
847 905 902 888 949 855 c
996 822 1020 776 1020 715 c
1062 774 1111 821 1167 854 c
1224 888 1285 905 1352 905 c
1423 905 1479 886 1522 847 c
1565 809 1587 755 1587 684 c
1587 628 1574 560 1549 481 c
1524 402 1493 313 1456 215 c
1437 168 1427 127 1427 92 c
1427 51 1443 31 1475 31 c
1528 31 1573 60 1608 117 c
1643 174 1668 236 1683 301 c
1687 309 1693 313 1700 313 c
1724 313 l
1729 313 1734 311 1737 307 c
1741 304 1743 300 1743 295 c
1743 294 1742 292 1741 289 c
1722 212 1690 140 1643 75 c
1597 10 1539 -23 1470 -23 c
1422 -23 1381 -7 1347 26 c
1313 59 1296 100 1296 147 c
1296 171 1302 198 1313 227 c
1352 330 1384 421 1409 502 c
1435 583 1448 654 1448 715 c
1448 753 1440 785 1425 812 c
1410 839 1384 852 1348 852 c
1273 852 1209 829 1154 783 c
1099 738 1052 677 1012 602 c
1009 589 1007 578 1006 571 c
874 45 l
869 26 859 10 842 -3 c
826 -16 808 -23 788 -23 c
772 -23 758 -18 745 -7 c
733 4 727 18 727 35 c
727 43 728 49 729 53 c
860 575 l
874 631 881 678 881 715 c
881 753 873 785 857 812 c
842 839 815 852 778 852 c
728 852 682 841 640 819 c
598 797 561 768 530 731 c
499 695 470 652 444 602 c
305 45 l
300 26 290 10 273 -3 c
257 -16 239 -23 219 -23 c
202 -23 188 -18 176 -7 c
164 4 158 18 158 35 c

ce} _d
/gamma{1059 0 33 -442 1110 905 sc
604 -401 m
604 -370 611 -326 624 -267 c
638 -208 655 -146 674 -79 c
694 -13 711 41 725 84 c
730 152 733 203 733 238 c
733 326 724 408 707 483 c
690 559 657 622 609 673 c
561 724 494 750 408 750 c
363 750 317 740 272 721 c
227 702 189 675 156 640 c
124 605 102 566 90 522 c
87 514 82 510 74 510 c
49 510 l
38 510 33 516 33 528 c
33 535 l
48 596 75 655 114 712 c
153 769 201 816 257 851 c
314 887 373 905 436 905 c
500 905 555 883 602 840 c
649 797 686 742 714 675 c
742 608 762 541 774 473 c
787 405 793 341 793 281 c
862 468 939 644 1024 811 c
1055 877 l
1059 881 1064 883 1069 883 c
1094 883 l
1105 883 1110 877 1110 864 c
1110 861 1109 857 1106 852 c
1075 788 l
1016 670 961 550 911 429 c
862 308 819 191 784 78 c
779 32 768 -31 753 -111 c
738 -191 720 -265 699 -334 c
678 -403 656 -439 635 -442 c
614 -442 604 -428 604 -401 c

ce} _d
/t{739 0 45 -23 676 1282 sc
127 166 m
127 186 129 205 133 223 c
281 811 l
66 811 l
52 811 45 820 45 838 c
50 868 59 883 72 883 c
299 883 l
381 1217 l
386 1235 397 1250 413 1263 c
429 1276 447 1282 467 1282 c
484 1282 499 1277 510 1266 c
522 1256 528 1242 528 1225 c
528 1221 528 1218 527 1215 c
527 1213 527 1211 526 1208 c
444 883 l
655 883 l
669 883 676 874 676 856 c
675 853 674 847 672 839 c
670 831 667 824 664 819 c
661 814 656 811 649 811 c
426 811 l
279 219 l
269 180 264 147 264 119 c
264 60 284 31 324 31 c
384 31 437 59 483 115 c
530 172 565 234 590 301 c
595 309 601 313 606 313 c
631 313 l
636 313 641 311 644 307 c
647 304 649 300 649 295 c
649 292 648 290 647 289 c
617 206 573 134 516 71 c
459 8 393 -23 319 -23 c
265 -23 219 -5 182 30 c
145 65 127 111 127 166 c

ce} _d
/period{567 0 172 0 397 225 sc
172 113 m
172 144 183 170 206 192 c
229 214 255 225 285 225 c
304 225 322 220 340 210 c
358 200 372 186 382 168 c
392 150 397 132 397 113 c
397 83 386 57 364 34 c
342 11 316 0 285 0 c
255 0 229 11 206 34 c
183 57 172 83 172 113 c

ce} _d
/comma{567 0 172 -397 420 225 sc
203 -369 m
203 -363 206 -357 211 -352 c
260 -305 299 -250 326 -188 c
353 -126 367 -61 367 8 c
367 33 l
345 11 318 0 285 0 c
254 0 227 11 205 33 c
183 55 172 82 172 113 c
172 145 183 172 205 193 c
227 214 254 225 285 225 c
334 225 368 202 389 157 c
410 112 420 63 420 8 c
420 -68 405 -140 374 -208 c
344 -277 301 -338 246 -393 c
241 -396 236 -397 233 -397 c
226 -397 220 -394 213 -388 c
206 -382 203 -376 203 -369 c

ce} _d
end readonly def

/BuildGlyph {
 exch begin
 CharStrings exch
 2 copy known not {pop /.notdef} if
 true 3 1 roll get exec
 end
} _d

/BuildChar {
 1 index /Encoding get exch get
 1 index /BuildGlyph get exec
} _d

FontName currentdict end definefont pop
%!PS-Adobe-3.0 Resource-Font
%%Creator: Converted from TrueType to Type 3 by Matplotlib.
10 dict begin
/FontName /Cmsy10 def
/PaintType 0 def
/FontMatrix [0.00048828125 0 0 0.00048828125 0 0] def
/FontBBox [-59 -1966 2300 1595] def
/FontType 3 def
/Encoding [/prime /nabla /approxequal /proportional] def
/CharStrings 5 dict dup begin
/.notdef 0 def
/prime{563 0 59 88 537 1145 sc
72 111 m
63 114 59 120 59 131 c
309 1061 l
317 1086 331 1107 350 1122 c
369 1137 391 1145 416 1145 c
448 1145 476 1134 500 1113 c
525 1092 537 1066 537 1034 c
537 1020 533 1004 526 987 c
156 102 l
151 93 145 88 137 88 c
130 88 118 91 102 98 c
87 105 77 109 72 111 c

ce} _d
/nabla{1706 0 94 -68 1610 1399 sc
801 -45 m
96 1376 l
96 1377 96 1378 95 1379 c
95 1380 95 1381 94 1382 c
94 1393 100 1399 111 1399 c
1593 1399 l
1604 1399 1610 1393 1610 1382 c
1610 1381 1610 1380 1609 1379 c
1609 1378 1609 1377 1608 1376 c
903 -45 l
896 -60 884 -68 866 -68 c
838 -68 l
820 -68 808 -60 801 -45 c

911 133 m
1462 1245 l
360 1245 l
911 133 l

ce} _d
/approxequal{1591 0 115 115 1477 989 sc
143 115 m
128 115 119 132 115 166 c
115 178 l
115 240 130 297 160 348 c
191 399 232 439 285 468 c
338 497 394 512 455 512 c
528 512 604 488 681 441 c
759 394 836 347 913 300 c
990 253 1064 229 1137 229 c
1207 229 1271 251 1330 294 c
1389 337 1419 393 1419 461 c
1423 495 1433 512 1448 512 c
1463 512 1473 495 1477 461 c
1477 449 l
1477 387 1462 330 1431 279 c
1400 228 1359 187 1306 158 c
1254 129 1198 115 1137 115 c
1080 115 1026 127 975 150 c
925 174 866 209 798 254 c
731 300 671 335 620 360 c
569 385 514 397 455 397 c
412 397 368 387 323 368 c
278 349 242 321 214 286 c
186 251 172 211 172 166 c
168 132 158 115 143 115 c

143 592 m
128 592 119 609 115 643 c
115 655 l
115 717 130 774 160 825 c
191 876 232 916 285 945 c
338 974 394 989 455 989 c
528 989 604 965 681 918 c
759 871 836 824 913 777 c
990 730 1064 707 1137 707 c
1207 707 1271 729 1330 772 c
1389 815 1419 871 1419 938 c
1423 972 1433 989 1448 989 c
1463 989 1473 972 1477 938 c
1477 926 l
1477 864 1462 807 1431 756 c
1400 705 1359 664 1306 635 c
1254 606 1198 592 1137 592 c
1080 592 1026 604 975 627 c
925 651 866 686 798 731 c
731 777 671 812 620 837 c
569 862 514 874 455 874 c
412 874 368 864 323 845 c
278 826 242 798 214 763 c
186 728 172 688 172 643 c
168 609 158 592 143 592 c

ce} _d
/proportional{1591 0 115 -23 1479 905 sc
469 -23 m
358 -23 272 25 209 121 c
146 218 115 325 115 442 c
115 515 129 588 156 659 c
183 730 224 789 279 835 c
334 882 399 905 475 905 c
562 905 642 879 715 828 c
788 777 851 710 903 629 c
948 561 l
999 661 1063 743 1140 808 c
1217 873 1306 905 1407 905 c
1433 905 1456 902 1477 897 c
1479 834 l
1460 838 1442 840 1425 840 c
1359 840 1299 823 1244 789 c
1190 755 1142 711 1101 656 c
1060 602 1026 544 999 481 c
1094 336 l
1125 287 1156 244 1187 206 c
1218 168 1254 136 1295 109 c
1336 83 1381 70 1430 70 c
1440 70 1456 71 1479 74 c
1479 -12 l
1446 -19 1420 -23 1401 -23 c
1316 -23 1236 3 1161 55 c
1086 108 1024 174 973 254 c
928 322 l
895 258 857 200 812 148 c
768 97 717 55 658 24 c
600 -7 537 -23 469 -23 c

451 43 m
547 43 631 77 703 146 c
775 215 833 300 877 401 c
782 547 l
734 625 683 689 629 738 c
576 788 515 813 446 813 c
386 813 335 794 293 756 c
252 719 220 671 199 613 c
178 556 168 498 168 440 c
168 381 178 320 198 258 c
219 197 250 145 293 104 c
336 63 388 43 451 43 c

ce} _d
end readonly def

/BuildGlyph {
 exch begin
 CharStrings exch
 2 copy known not {pop /.notdef} if
 true 3 1 roll get exec
 end
} _d

/BuildChar {
 1 index /Encoding get exch get
 1 index /BuildGlyph get exec
} _d

FontName currentdict end definefont pop
%!PS-Adobe-3.0 Resource-Font
%%Creator: Converted from TrueType to Type 3 by Matplotlib.
10 dict begin
/FontName /Cmr10 def
/PaintType 0 def
/FontMatrix [0.00048828125 0 0 0.00048828125 0 0] def
/FontBBox [-90 -512 2066 1536] def
/FontType 3 def
/Encoding [/zero /one /two /four /equal] def
/CharStrings 6 dict dup begin
/.notdef 0 def
/zero{1024 0 80 -45 942 1364 sc
512 -45 m
345 -45 231 24 170 161 c
110 299 80 463 80 653 c
80 772 91 883 112 988 c
134 1093 177 1181 241 1254 c
306 1327 396 1364 512 1364 c
602 1364 676 1342 733 1298 c
790 1254 834 1197 864 1127 c
894 1058 914 983 925 903 c
936 824 942 740 942 653 c
942 536 931 426 909 323 c
888 221 845 134 782 62 c
719 -9 629 -45 512 -45 c

512 8 m
588 8 645 47 682 125 c
719 203 742 289 751 384 c
760 479 764 579 764 686 c
764 789 760 883 751 970 c
742 1057 719 1135 682 1205 c
645 1276 589 1311 512 1311 c
435 1311 377 1276 340 1205 c
303 1134 280 1056 271 969 c
262 883 258 789 258 686 c
258 610 260 538 263 471 c
267 404 277 334 293 262 c
309 191 335 130 370 81 c
406 32 453 8 512 8 c

ce} _d
/one{1024 0 178 0 862 1364 sc
190 0 m
190 72 l
361 72 446 94 446 137 c
446 1212 l
375 1178 286 1161 178 1161 c
178 1233 l
345 1233 472 1277 557 1364 c
586 1364 l
591 1364 595 1362 599 1358 c
604 1355 606 1351 606 1346 c
606 137 l
606 94 691 72 862 72 c
862 0 l
190 0 l

ce} _d
/two{1024 0 102 0 920 1364 sc
102 0 m
102 55 l
102 58 103 62 106 66 c
424 418 l
472 470 511 514 541 549 c
571 584 601 625 630 671 c
659 717 682 764 699 811 c
716 859 725 910 725 963 c
725 1019 715 1072 694 1123 c
673 1174 642 1215 601 1246 c
560 1277 511 1292 453 1292 c
394 1292 340 1274 293 1238 c
246 1203 212 1157 193 1100 c
198 1101 206 1102 215 1102 c
246 1102 272 1092 293 1071 c
315 1050 326 1024 326 991 c
326 960 315 933 293 911 c
272 890 246 879 215 879 c
183 879 156 890 134 912 c
113 935 102 961 102 991 c
102 1042 112 1090 131 1135 c
150 1180 178 1220 214 1255 c
251 1290 292 1317 337 1336 c
383 1355 432 1364 483 1364 c
561 1364 634 1347 701 1314 c
768 1281 822 1235 861 1174 c
900 1114 920 1044 920 963 c
920 904 907 847 881 794 c
855 741 822 692 781 648 c
740 605 688 555 625 500 c
562 445 520 408 500 389 c
268 166 l
465 166 l
562 166 642 167 707 168 c
772 170 807 173 811 176 c
827 193 843 256 860 365 c
920 365 l
862 0 l
102 0 l

ce} _d
/four{1024 0 57 0 965 1364 sc
57 338 m
57 410 l
690 1354 l
695 1361 702 1364 711 1364 c
741 1364 l
756 1364 764 1356 764 1341 c
764 410 l
965 410 l
965 338 l
764 338 l
764 137 l
764 109 784 91 824 83 c
864 76 910 72 963 72 c
963 0 l
399 0 l
399 72 l
452 72 498 76 538 83 c
578 91 598 109 598 137 c
598 338 l
57 338 l

125 410 m
610 410 l
610 1135 l
125 410 l

ce} _d
/equal{1591 0 115 272 1477 752 sc
154 272 m
143 272 133 276 126 285 c
119 294 115 303 115 313 c
115 324 119 334 126 342 c
133 350 143 354 154 354 c
1440 354 l
1450 354 1459 350 1466 342 c
1473 334 1477 324 1477 313 c
1477 303 1473 294 1466 285 c
1459 276 1450 272 1440 272 c
154 272 l

154 670 m
143 670 133 674 126 682 c
119 690 115 700 115 711 c
115 721 119 730 126 739 c
133 748 143 752 154 752 c
1440 752 l
1450 752 1459 748 1466 739 c
1473 730 1477 721 1477 711 c
1477 700 1473 690 1466 682 c
1459 674 1450 670 1440 670 c
154 670 l

ce} _d
end readonly def

/BuildGlyph {
 exch begin
 CharStrings exch
 2 copy known not {pop /.notdef} if
 true 3 1 roll get exec
 end
} _d

/BuildChar {
 1 index /Encoding get exch get
 1 index /BuildGlyph get exec
} _d

FontName currentdict end definefont pop
%!PS-Adobe-3.0 Resource-Font
%%Creator: Converted from TrueType to Type 3 by Matplotlib.
10 dict begin
/FontName /Cmb10 def
/PaintType 0 def
/FontMatrix [0.00048828125 0 0 0.00048828125 0 0] def
/FontBBox [-135 -512 2071 1536] def
/FontType 3 def
/Encoding [/n] def
/CharStrings 2 dict dup begin
/.notdef 0 def
/n{1137 0 45 0 1137 922 sc
45 0 m
45 104 l
186 104 l
186 743 l
186 782 139 801 45 801 c
45 905 l
406 922 l
406 723 l
437 783 479 831 533 867 c
587 904 647 922 713 922 c
780 922 833 911 874 890 c
915 869 946 837 965 794 c
985 751 995 696 995 629 c
995 104 l
1137 104 l
1137 0 l
629 0 l
629 104 l
754 104 l
754 623 l
754 629 l
754 770 732 840 688 840 c
649 840 614 831 581 814 c
549 797 521 774 498 744 c
475 715 458 682 446 646 c
434 611 428 574 428 535 c
428 104 l
569 104 l
569 0 l
45 0 l

ce} _d
end readonly def

/BuildGlyph {
 exch begin
 CharStrings exch
 2 copy known not {pop /.notdef} if
 true 3 1 roll get exec
 end
} _d

/BuildChar {
 1 index /Encoding get exch get
 1 index /BuildGlyph get exec
} _d

FontName currentdict end definefont pop
end
%%EndProlog
mpldict begin
166.319 253.639 translate
279.361 284.721 0 0 clipbox
gsave
0 0 m
279.361283 0 l
279.361283 284.72125 l
0 284.72125 l
cl
1.000 setgray
fill
grestore
gsave
51.79375 43.0125 m
272.161283 43.0125 l
272.161283 277.52125 l
51.79375 277.52125 l
cl
1.000 setgray
fill
grestore
0.800 setlinewidth
1 setlinejoin
2 setlinecap
[] 0 setdash
0.690 setgray
gsave
220.368 234.509 51.794 43.013 clipbox
61.810456 43.0125 m
61.810456 277.52125 l
stroke
grestore
0 setlinecap
0.000 setgray
gsave
/o {
gsave
newpath
translate
0.8 setlinewidth
1 setlinejoin

0 setlinecap

0 0 m
0 -3.5 l

gsave
0.000 setgray
fill
grestore
stroke
grestore
} bind def
61.8105 43.0125 o
grestore
/STIXGeneral-Regular 12.000 selectfont
gsave

58.810456 27.809375 translate
0.000000 rotate
0.000000 0 m /one glyphshow
grestore
2 setlinecap
0.690 setgray
gsave
220.368 234.509 51.794 43.013 clipbox
128.588496 43.0125 m
128.588496 277.52125 l
stroke
grestore
0 setlinecap
0.000 setgray
gsave
/o {
gsave
newpath
translate
0.8 setlinewidth
1 setlinejoin

0 setlinecap

0 0 m
0 -3.5 l

gsave
0.000 setgray
fill
grestore
stroke
grestore
} bind def
128.588 43.0125 o
grestore
gsave

125.588496 27.809375 translate
0.000000 rotate
0.000000 0 m /two glyphshow
grestore
2 setlinecap
0.690 setgray
gsave
220.368 234.509 51.794 43.013 clipbox
195.366537 43.0125 m
195.366537 277.52125 l
stroke
grestore
0 setlinecap
0.000 setgray
gsave
/o {
gsave
newpath
translate
0.8 setlinewidth
1 setlinejoin

0 setlinecap

0 0 m
0 -3.5 l

gsave
0.000 setgray
fill
grestore
stroke
grestore
} bind def
195.367 43.0125 o
grestore
gsave

192.366537 27.809375 translate
0.000000 rotate
0.000000 0 m /three glyphshow
grestore
2 setlinecap
0.690 setgray
gsave
220.368 234.509 51.794 43.013 clipbox
262.144577 43.0125 m
262.144577 277.52125 l
stroke
grestore
0 setlinecap
0.000 setgray
gsave
/o {
gsave
newpath
translate
0.8 setlinewidth
1 setlinejoin

0 setlinecap

0 0 m
0 -3.5 l

gsave
0.000 setgray
fill
grestore
stroke
grestore
} bind def
262.145 43.0125 o
grestore
gsave

259.144577 27.809375 translate
0.000000 rotate
0.000000 0 m /four glyphshow
grestore
gsave
118.977516 11.200000 translate
0.000000 rotate
/STIXGeneral-Regular 14.0 selectfont
0.000000 0.281250 moveto
/s glyphshow
5.445999 0.281250 moveto
/p glyphshow
12.445999 0.281250 moveto
/l glyphshow
16.337997 0.281250 moveto
/i glyphshow
20.229996 0.281250 moveto
/n glyphshow
27.229996 0.281250 moveto
/e glyphshow
33.445984 0.281250 moveto
/space glyphshow
36.945984 0.281250 moveto
/d glyphshow
43.945984 0.281250 moveto
/e glyphshow
50.161972 0.281250 moveto
/g glyphshow
57.161972 0.281250 moveto
/r glyphshow
61.823959 0.281250 moveto
/e glyphshow
68.039948 0.281250 moveto
/e glyphshow
74.255936 0.281250 moveto
/space glyphshow
/Cmmi10 14.0 selectfont
77.755936 0.281250 moveto
/k glyphshow
grestore
2 setlinecap
0.690 setgray
gsave
220.368 234.509 51.794 43.013 clipbox
51.79375 47.764231 m
272.161283 47.764231 l
stroke
grestore
0 setlinecap
0.000 setgray
gsave
/o {
gsave
newpath
translate
0.8 setlinewidth
1 setlinejoin

0 setlinecap

-0 0 m
-3.5 0 l

gsave
0.000 setgray
fill
grestore
stroke
grestore
} bind def
51.7938 47.7642 o
grestore
gsave
23.793750 43.662669 translate
0.000000 rotate
/STIXGeneral-Regular 12.0 selectfont
0.000000 0.750000 moveto
/seven glyphshow
5.999985 0.750000 moveto
/period glyphshow
8.999969 0.750000 moveto
/three glyphshow
14.999954 0.750000 moveto
/five glyphshow
grestore
2 setlinecap
0.690 setgray
gsave
220.368 234.509 51.794 43.013 clipbox
51.79375 91.239987 m
272.161283 91.239987 l
stroke
grestore
0 setlinecap
0.000 setgray
gsave
/o {
gsave
newpath
translate
0.8 setlinewidth
1 setlinejoin

0 setlinecap

-0 0 m
-3.5 0 l

gsave
0.000 setgray
fill
grestore
stroke
grestore
} bind def
51.7938 91.24 o
grestore
gsave
23.793750 87.138425 translate
0.000000 rotate
/STIXGeneral-Regular 12.0 selectfont
0.000000 0.796875 moveto
/seven glyphshow
5.999985 0.796875 moveto
/period glyphshow
8.999969 0.796875 moveto
/three glyphshow
14.999954 0.796875 moveto
/six glyphshow
grestore
2 setlinecap
0.690 setgray
gsave
220.368 234.509 51.794 43.013 clipbox
51.79375 134.715743 m
272.161283 134.715743 l
stroke
grestore
0 setlinecap
0.000 setgray
gsave
/o {
gsave
newpath
translate
0.8 setlinewidth
1 setlinejoin

0 setlinecap

-0 0 m
-3.5 0 l

gsave
0.000 setgray
fill
grestore
stroke
grestore
} bind def
51.7938 134.716 o
grestore
gsave
23.793750 130.614181 translate
0.000000 rotate
/STIXGeneral-Regular 12.0 selectfont
0.000000 0.890625 moveto
/seven glyphshow
5.999985 0.890625 moveto
/period glyphshow
8.999969 0.890625 moveto
/three glyphshow
14.999954 0.890625 moveto
/seven glyphshow
grestore
2 setlinecap
0.690 setgray
gsave
220.368 234.509 51.794 43.013 clipbox
51.79375 178.191499 m
272.161283 178.191499 l
stroke
grestore
0 setlinecap
0.000 setgray
gsave
/o {
gsave
newpath
translate
0.8 setlinewidth
1 setlinejoin

0 setlinecap

-0 0 m
-3.5 0 l

gsave
0.000 setgray
fill
grestore
stroke
grestore
} bind def
51.7938 178.191 o
grestore
gsave
23.793750 174.089937 translate
0.000000 rotate
/STIXGeneral-Regular 12.0 selectfont
0.000000 0.890625 moveto
/seven glyphshow
5.999985 0.890625 moveto
/period glyphshow
8.999969 0.890625 moveto
/three glyphshow
14.999954 0.890625 moveto
/eight glyphshow
grestore
2 setlinecap
0.690 setgray
gsave
220.368 234.509 51.794 43.013 clipbox
51.79375 221.667255 m
272.161283 221.667255 l
stroke
grestore
0 setlinecap
0.000 setgray
gsave
/o {
gsave
newpath
translate
0.8 setlinewidth
1 setlinejoin

0 setlinecap

-0 0 m
-3.5 0 l

gsave
0.000 setgray
fill
grestore
stroke
grestore
} bind def
51.7938 221.667 o
grestore
gsave
23.793750 217.565693 translate
0.000000 rotate
/STIXGeneral-Regular 12.0 selectfont
0.000000 0.890625 moveto
/seven glyphshow
5.999985 0.890625 moveto
/period glyphshow
8.999969 0.890625 moveto
/three glyphshow
14.999954 0.890625 moveto
/nine glyphshow
grestore
2 setlinecap
0.690 setgray
gsave
220.368 234.509 51.794 43.013 clipbox
51.79375 265.143011 m
272.161283 265.143011 l
stroke
grestore
0 setlinecap
0.000 setgray
gsave
/o {
gsave
newpath
translate
0.8 setlinewidth
1 setlinejoin

0 setlinecap

-0 0 m
-3.5 0 l

gsave
0.000 setgray
fill
grestore
stroke
grestore
} bind def
51.7938 265.143 o
grestore
gsave
23.793750 261.041449 translate
0.000000 rotate
/STIXGeneral-Regular 12.0 selectfont
0.000000 0.890625 moveto
/seven glyphshow
5.999985 0.890625 moveto
/period glyphshow
8.999969 0.890625 moveto
/four glyphshow
14.999954 0.890625 moveto
/zero glyphshow
grestore
gsave
16.762500 94.766875 translate
90.000000 rotate
/STIXGeneral-Regular 14.0 selectfont
0.000000 0.437500 moveto
/m glyphshow
10.891998 0.437500 moveto
/e glyphshow
17.107986 0.437500 moveto
/a glyphshow
23.323975 0.437500 moveto
/n glyphshow
30.323975 0.437500 moveto
/space glyphshow
33.823975 0.437500 moveto
/r glyphshow
38.485962 0.437500 moveto
/a glyphshow
44.701950 0.437500 moveto
/d glyphshow
51.701950 0.437500 moveto
/i glyphshow
55.593948 0.437500 moveto
/u glyphshow
62.593948 0.437500 moveto
/s glyphshow
68.039948 0.437500 moveto
/space glyphshow
71.539948 0.437500 moveto
/a glyphshow
77.755936 0.437500 moveto
/t glyphshow
81.647934 0.437500 moveto
/space glyphshow
/Cmmi10 14.0 selectfont
85.147934 0.437500 moveto
/t glyphshow
/Cmsy10 14.0 selectfont
92.657895 0.437500 moveto
/approxequal glyphshow
/Cmr10 14.0 selectfont
105.992075 0.437500 moveto
/one glyphshow
112.992075 0.437500 moveto
/four glyphshow
/Cmmi10 14.0 selectfont
119.992075 0.437500 moveto
/period glyphshow
/Cmr10 14.0 selectfont
123.868051 0.437500 moveto
/zero glyphshow
grestore
1.500 setlinewidth
[5.55 2.4] 0 setdash
gsave
220.368 234.509 51.794 43.013 clipbox
51.79375 266.861761 m
272.161283 266.861761 l
stroke
grestore
[9.6 2.4 1.5 2.4] 0 setdash
gsave
220.368 234.509 51.794 43.013 clipbox
51.79375 227.713029 m
272.161283 227.713029 l
stroke
grestore
2 setlinecap
[] 0 setdash
0.122 0.467 0.706 setrgbcolor
gsave
220.368 234.509 51.794 43.013 clipbox
61.810456 130.490804 m
128.588496 250.699199 l
195.366537 252.063025 l
262.144577 257.96508 l
stroke
grestore
1.000 setlinewidth
0 setlinecap
gsave
220.368 234.509 51.794 43.013 clipbox
/o {
gsave
newpath
translate
1.0 setlinewidth
1 setlinejoin

0 setlinecap

0 -3 m
0.795609 -3 1.55874 -2.683901 2.12132 -2.12132 c
2.683901 -1.55874 3 -0.795609 3 0 c
3 0.795609 2.683901 1.55874 2.12132 2.12132 c
1.55874 2.683901 0.795609 3 0 3 c
-0.795609 3 -1.55874 2.683901 -2.12132 2.12132 c
-2.683901 1.55874 -3 0.795609 -3 0 c
-3 -0.795609 -2.683901 -1.55874 -2.12132 -2.12132 c
-1.55874 -2.683901 -0.795609 -3 0 -3 c
cl

gsave
grestore
stroke
grestore
} bind def
61.8105 130.491 o
128.588 250.699 o
195.367 252.063 o
262.145 257.965 o
grestore
1.500 setlinewidth
2 setlinecap
1.000 0.498 0.055 setrgbcolor
gsave
220.368 234.509 51.794 43.013 clipbox
61.810456 53.671989 m
128.588496 227.520691 l
195.366537 225.146022 l
262.144577 227.969894 l
stroke
grestore
1.000 setlinewidth
0 setlinecap
gsave
220.368 234.509 51.794 43.013 clipbox
/o {
gsave
newpath
translate
1.0 setlinewidth
1 setlinejoin

0 setlinecap

0 -2 m
0.530406 -2 1.03916 -1.789267 1.414214 -1.414214 c
1.789267 -1.03916 2 -0.530406 2 0 c
2 0.530406 1.789267 1.03916 1.414214 1.414214 c
1.03916 1.789267 0.530406 2 0 2 c
-0.530406 2 -1.03916 1.789267 -1.414214 1.414214 c
-1.789267 1.03916 -2 0.530406 -2 0 c
-2 -0.530406 -1.789267 -1.03916 -1.414214 -1.414214 c
-1.03916 -1.789267 -0.530406 -2 0 -2 c
cl

gsave
1.000 0.498 0.055 setrgbcolor
fill
grestore
stroke
grestore
} bind def
61.8105 53.672 o
128.588 227.521 o
195.367 225.146 o
262.145 227.97 o
grestore
0.800 setlinewidth
0 setlinejoin
2 setlinecap
0.000 setgray
gsave
51.79375 43.0125 m
51.79375 277.52125 l
stroke
grestore
gsave
272.161283 43.0125 m
272.161283 277.52125 l
stroke
grestore
gsave
51.79375 43.0125 m
272.161283 43.0125 l
stroke
grestore
gsave
51.79375 277.52125 m
272.161283 277.52125 l
stroke
grestore
1.000 setlinewidth
0 setlinecap
0.800 setgray
gsave
176.161283 48.0125 m
265.161283 48.0125 l
266.494616 48.0125 267.161283 48.679167 267.161283 50.0125 c
267.161283 109.35625 l
267.161283 110.689583 266.494616 111.35625 265.161283 111.35625 c
176.161283 111.35625 l
174.82795 111.35625 174.161283 110.689583 174.161283 109.35625 c
174.161283 50.0125 l
174.161283 48.679167 174.82795 48.0125 176.161283 48.0125 c
cl
gsave
1.000 setgray
fill
grestore
stroke
grestore
1.500 setlinewidth
1 setlinejoin
[5.55 2.4] 0 setdash
0.000 setgray
gsave
178.161283 103.85625 m
188.161283 103.85625 l
198.161283 103.85625 l
stroke
grestore
gsave
206.161283 100.356250 translate
0.000000 rotate
/Cmmi10 10.0 selectfont
0.000000 0.171875 moveto
/m glyphshow
/Cmr10 10.0 selectfont
10.535156 0.171875 moveto
/equal glyphshow
20.059570 0.171875 moveto
/two glyphshow
/Cmmi10 10.0 selectfont
25.059570 0.171875 moveto
/comma glyphshow
/Cmb10 10.0 selectfont
29.583984 0.171875 moveto
/n glyphshow
/Cmsy10 10.0 selectfont
36.891602 0.171875 moveto
/proportional glyphshow
46.416016 0.171875 moveto
/nabla glyphshow
grestore
[9.6 2.4 1.5 2.4] 0 setdash
gsave
178.161283 89.684375 m
188.161283 89.684375 l
198.161283 89.684375 l
stroke
grestore
gsave
206.161283 86.184375 translate
0.000000 rotate
/Cmmi10 10.0 selectfont
0.000000 0.171875 moveto
/m glyphshow
/Cmr10 10.0 selectfont
10.535156 0.171875 moveto
/equal glyphshow
20.059570 0.171875 moveto
/four glyphshow
/Cmmi10 10.0 selectfont
25.059570 0.171875 moveto
/comma glyphshow
/Cmb10 10.0 selectfont
29.583984 0.171875 moveto
/n glyphshow
/Cmsy10 10.0 selectfont
36.891602 0.171875 moveto
/proportional glyphshow
46.416016 0.171875 moveto
/nabla glyphshow
grestore
2 setlinecap
[] 0 setdash
0.122 0.467 0.706 setrgbcolor
gsave
178.161283 74.5125 m
188.161283 74.5125 l
198.161283 74.5125 l
stroke
grestore
1.000 setlinewidth
0 setlinecap
gsave
/o {
gsave
newpath
translate
1.0 setlinewidth
1 setlinejoin

0 setlinecap

0 -3 m
0.795609 -3 1.55874 -2.683901 2.12132 -2.12132 c
2.683901 -1.55874 3 -0.795609 3 0 c
3 0.795609 2.683901 1.55874 2.12132 2.12132 c
1.55874 2.683901 0.795609 3 0 3 c
-0.795609 3 -1.55874 2.683901 -2.12132 2.12132 c
-2.683901 1.55874 -3 0.795609 -3 0 c
-3 -0.795609 -2.683901 -1.55874 -2.12132 -2.12132 c
-1.55874 -2.683901 -0.795609 -3 0 -3 c
cl

gsave
grestore
stroke
grestore
} bind def
188.161 74.5125 o
grestore
0.000 setgray
gsave
206.161283 71.012500 translate
0.000000 rotate
/Cmmi10 10.0 selectfont
0.000000 0.257969 moveto
/m glyphshow
/Cmr10 10.0 selectfont
10.535156 0.257969 moveto
/equal glyphshow
20.059570 0.257969 moveto
/two glyphshow
/Cmmi10 10.0 selectfont
25.059570 0.257969 moveto
/comma glyphshow
/Cmb10 10.0 selectfont
29.583984 0.257969 moveto
/n glyphshow
/Cmsy10 10.0 selectfont
36.891602 0.257969 moveto
/proportional glyphshow
/Cmmi10 10.0 selectfont
46.416016 0.257969 moveto
/gamma glyphshow
/Cmsy10 7.0 selectfont
52.217898 4.084375 moveto
/prime glyphshow
54.142215 4.084375 moveto
/prime glyphshow
grestore
1.500 setlinewidth
2 setlinecap
1.000 0.498 0.055 setrgbcolor
gsave
178.161283 58.5125 m
188.161283 58.5125 l
198.161283 58.5125 l
stroke
grestore
1.000 setlinewidth
0 setlinecap
gsave
/o {
gsave
newpath
translate
1.0 setlinewidth
1 setlinejoin

0 setlinecap

0 -2 m
0.530406 -2 1.03916 -1.789267 1.414214 -1.414214 c
1.789267 -1.03916 2 -0.530406 2 0 c
2 0.530406 1.789267 1.03916 1.414214 1.414214 c
1.03916 1.789267 0.530406 2 0 2 c
-0.530406 2 -1.03916 1.789267 -1.414214 1.414214 c
-1.789267 1.03916 -2 0.530406 -2 0 c
-2 -0.530406 -1.789267 -1.03916 -1.414214 -1.414214 c
-1.03916 -1.789267 -0.530406 -2 0 -2 c
cl

gsave
1.000 0.498 0.055 setrgbcolor
fill
grestore
stroke
grestore
} bind def
188.161 58.5125 o
grestore
0.000 setgray
gsave
206.161283 55.012500 translate
0.000000 rotate
/Cmmi10 10.0 selectfont
0.000000 0.257969 moveto
/m glyphshow
/Cmr10 10.0 selectfont
10.535156 0.257969 moveto
/equal glyphshow
20.059570 0.257969 moveto
/four glyphshow
/Cmmi10 10.0 selectfont
25.059570 0.257969 moveto
/comma glyphshow
/Cmb10 10.0 selectfont
29.583984 0.257969 moveto
/n glyphshow
/Cmsy10 10.0 selectfont
36.891602 0.257969 moveto
/proportional glyphshow
/Cmmi10 10.0 selectfont
46.416016 0.257969 moveto
/gamma glyphshow
/Cmsy10 7.0 selectfont
52.217898 4.084375 moveto
/prime glyphshow
54.142215 4.084375 moveto
/prime glyphshow
grestore

end
showpage
