%!PS-Adobe-3.0 EPSF-3.0
%%Title: conv_at_h.eps
%%Creator: Matplotlib v3.5.3, https://matplotlib.org/
%%CreationDate: Tue Jun 27 09:53:22 2023
%%Orientation: portrait
%%BoundingBox: 151 242 461 550
%%HiResBoundingBox: 151.150337 242.687500 460.849663 549.312500
%%EndComments
%%BeginProlog
/mpldict 14 dict def
mpldict begin
/_d { bind def } bind def
/m { moveto } _d
/l { lineto } _d
/r { rlineto } _d
/c { curveto } _d
/cl { closepath } _d
/ce { closepath eofill } _d
/box {
      m
      1 index 0 r
      0 exch r
      neg 0 r
      cl
    } _d
/clipbox {
      box
      clip
      newpath
    } _d
/sc { setcachedevice } _d
%!PS-Adobe-3.0 Resource-Font
%%Creator: Converted from TrueType to Type 3 by Matplotlib.
10 dict begin
/FontName /STIXGeneral-Regular def
/PaintType 0 def
/FontMatrix [0.001 0 0 0.001 0 0] def
/FontBBox [-970 -443 2000 1023] def
/FontType 3 def
/Encoding [/space /period /zero /one /two /four /five /six /seven /eight /a /c /d /e /i /l /m /n /o /r /s /t /u] def
/CharStrings 24 dict dup begin
/.notdef 0 def
/space{250 0 0 0 0 0 sc
ce} _d
/period{250 0 70 -11 181 100 sc
181 43 m
181 28 175 16 164 5 c
153 -6 140 -11 125 -11 c
110 -11 97 -6 86 5 c
75 16 70 29 70 44 c
70 59 75 72 86 83 c
97 94 111 100 126 100 c
141 100 153 94 164 83 c
175 72 181 58 181 43 c

ce} _d
/zero{500 0 24 -14 476 676 sc
476 330 m
476 285 472 243 463 203 c
454 164 441 127 424 94 c
407 61 384 34 354 15 c
324 -4 289 -14 250 -14 c
209 -14 174 -4 143 17 c
112 38 89 65 72 100 c
55 135 43 172 35 211 c
28 250 24 292 24 336 c
24 398 32 454 47 503 c
62 553 88 594 123 627 c
159 660 203 676 254 676 c
319 676 373 644 414 580 c
455 516 476 433 476 330 c

380 325 m
380 430 369 511 346 566 c
324 622 291 650 248 650 c
207 650 175 622 153 566 c
131 510 120 431 120 329 c
120 226 131 148 153 93 c
175 39 207 12 250 12 c
292 12 324 39 346 93 c
369 148 380 225 380 325 c

ce} _d
/one{500 0 111 0 394 676 sc
394 0 m
118 0 l
118 15 l
155 17 180 24 193 35 c
206 47 213 67 213 95 c
213 544 l
213 577 203 593 183 593 c
174 593 159 589 138 581 c
111 571 l
111 585 l
290 676 l
299 673 l
299 76 l
299 54 306 38 319 29 c
332 20 357 15 394 15 c
394 0 l

ce} _d
/two{500 0 29 0 474 676 sc
474 137 m
420 0 l
29 0 l
29 12 l
207 201 l
254 250 287 294 307 335 c
327 376 337 418 337 461 c
337 506 325 540 300 565 c
275 590 241 602 198 602 c
162 602 133 593 112 574 c
91 555 71 521 51 472 c
30 477 l
41 539 64 588 98 623 c
133 658 179 676 238 676 c
293 676 338 659 372 626 c
406 593 423 551 423 500 c
423 425 380 342 295 252 c
130 76 l
364 76 l
386 76 403 80 416 89 c
429 98 444 116 460 143 c
474 137 l

ce} _d
/four{500 0 12 0 473 676 sc
473 167 m
370 167 l
370 0 l
292 0 l
292 167 l
12 167 l
12 231 l
326 676 l
370 676 l
370 231 l
473 231 l
473 167 l

292 231 m
292 574 l
52 231 l
292 231 l

ce} _d
/five{500 0 31 -14 438 688 sc
438 681 m
402 596 l
398 587 389 583 375 583 c
181 583 l
141 498 l
214 484 267 469 300 452 c
333 436 363 409 391 370 c
414 338 426 296 426 243 c
426 195 418 155 402 122 c
387 89 362 60 328 35 c
283 2 226 -14 158 -14 c
120 -14 89 -8 66 3 c
43 14 31 29 31 48 c
31 73 46 86 76 86 c
100 86 125 76 150 55 c
176 34 200 23 221 23 c
256 23 287 40 314 75 c
342 110 356 149 356 192 c
356 256 334 306 289 342 c
231 389 160 412 76 412 c
68 412 64 415 64 420 c
65 425 l
174 662 l
381 662 l
392 662 401 664 407 667 c
414 670 421 677 429 688 c
438 681 l

ce} _d
/six{500 0 34 -14 468 684 sc
446 684 m
448 668 l
369 655 304 623 251 572 c
198 521 165 458 152 383 c
191 413 233 428 279 428 c
338 428 384 409 417 372 c
451 335 468 284 468 219 c
468 154 451 100 417 59 c
378 10 325 -14 258 -14 c
177 -14 118 20 81 87 c
50 144 34 208 34 279 c
34 388 70 480 143 555 c
184 598 227 628 270 645 c
314 663 373 676 446 684 c

378 188 m
378 317 333 382 243 382 c
210 382 182 373 160 355 c
138 338 127 308 127 266 c
127 188 139 126 163 81 c
188 36 223 14 269 14 c
304 14 331 30 350 61 c
369 93 378 135 378 188 c

ce} _d
/seven{500 0 20 -8 449 662 sc
449 646 m
237 -8 l
172 -8 l
370 588 l
155 588 l
126 588 105 583 91 573 c
77 563 59 541 38 506 c
20 515 l
80 662 l
449 662 l
449 646 l

ce} _d
/eight{500 0 56 -14 445 676 sc
445 155 m
445 104 427 63 391 32 c
356 1 308 -14 248 -14 c
192 -14 146 1 110 32 c
74 63 56 102 56 149 c
56 184 65 214 82 239 c
99 264 134 295 186 332 c
136 373 103 407 86 432 c
70 457 62 487 62 520 c
62 567 80 605 116 633 c
153 662 199 676 256 676 c
305 676 345 662 376 634 c
408 607 424 573 424 533 c
424 496 414 467 395 445 c
376 423 341 398 290 371 c
350 331 391 295 412 264 c
434 233 445 196 445 155 c

355 533 m
355 568 345 595 326 616 c
307 637 280 648 246 648 c
212 648 185 639 165 621 c
146 604 136 580 136 549 c
136 518 146 490 165 465 c
185 440 217 415 261 389 c
295 409 319 430 333 452 c
348 475 355 502 355 533 c

271 272 m
212 312 l
183 288 162 264 150 241 c
138 218 132 191 132 158 c
132 113 143 77 166 52 c
189 27 220 14 259 14 c
292 14 318 24 338 44 c
359 65 369 91 369 124 c
369 154 361 180 346 203 c
331 226 306 249 271 272 c

ce} _d
/a{444 0 37 -10 442 460 sc
442 66 m
442 38 l
417 6 387 -10 352 -10 c
314 -10 293 14 288 63 c
287 63 l
244 14 196 -10 142 -10 c
111 -10 85 -1 66 17 c
47 36 37 61 37 94 c
37 141 60 180 107 211 c
139 232 199 259 287 292 c
287 346 l
287 376 280 398 265 413 c
251 428 232 436 209 436 c
189 436 172 431 159 421 c
146 412 139 400 139 387 c
139 381 140 374 142 367 c
144 360 145 352 145 345 c
145 335 140 326 131 317 c
122 308 112 304 99 304 c
88 304 78 308 69 317 c
60 326 56 337 56 350 c
56 382 73 409 107 430 c
138 450 177 460 222 460 c
276 460 315 445 340 415 c
352 401 360 387 363 372 c
366 358 368 335 368 304 c
368 113 l
368 69 378 47 399 47 c
412 47 427 53 442 66 c

287 127 m
287 268 l
226 247 183 225 159 202 c
136 181 125 156 125 125 c
125 100 131 80 144 67 c
157 54 173 48 194 48 c
216 48 235 53 252 64 c
266 74 275 83 280 92 c
285 101 287 112 287 127 c

ce} _d
/c{444 0 25 -10 412 460 sc
398 156 m
412 147 l
383 91 356 53 330 32 c
296 4 258 -10 215 -10 c
160 -10 114 11 78 52 c
43 94 25 147 25 212 c
25 297 53 362 109 409 c
150 443 195 460 244 460 c
286 460 322 450 352 429 c
383 409 398 385 398 357 c
398 346 393 336 384 327 c
375 319 364 315 351 315 c
328 315 312 330 303 361 c
297 383 l
292 402 285 414 277 421 c
269 428 256 431 238 431 c
197 431 164 415 139 383 c
114 351 102 309 102 257 c
102 200 116 153 145 116 c
174 80 211 62 257 62 c
286 62 310 69 331 82 c
352 96 374 121 398 156 c

ce} _d
/d{500 0 27 -10 491 683 sc
491 42 m
344 -10 l
340 -7 l
340 57 l
308 12 265 -10 212 -10 c
157 -10 112 10 78 49 c
44 89 27 141 27 205 c
27 276 47 336 88 385 c
129 435 178 460 235 460 c
271 460 306 446 340 417 c
340 573 l
340 594 337 607 331 614 c
325 621 313 624 294 624 c
285 624 277 624 272 623 c
272 639 l
333 655 382 670 419 683 c
424 681 l
424 114 l
424 91 427 75 432 68 c
438 61 450 57 468 57 c
472 57 480 57 491 58 c
491 42 l

340 102 m
340 332 l
340 359 330 382 309 402 c
289 422 265 432 238 432 c
200 432 170 415 147 381 c
124 347 113 302 113 245 c
113 184 125 134 150 97 c
175 60 209 42 251 42 c
282 42 307 53 325 74 c
335 85 340 95 340 102 c

ce} _d
/e{444 0 25 -10 424 460 sc
408 164 m
424 157 l
384 46 314 -10 215 -10 c
156 -10 110 10 76 51 c
42 92 25 148 25 217 c
25 288 44 347 82 392 c
120 437 170 460 232 460 c
292 460 338 437 371 391 c
390 364 402 326 405 277 c
97 277 l
100 235 104 203 109 181 c
115 159 126 137 143 114 c
171 77 208 59 254 59 c
287 59 314 67 336 83 c
359 99 383 126 408 164 c

99 309 m
303 309 l
297 351 287 381 273 398 c
260 415 237 424 205 424 c
177 424 154 414 135 394 c
116 375 104 346 99 309 c

ce} _d
/i{278 0 16 0 253 683 sc
180 632 m
180 617 175 605 165 595 c
155 586 143 581 128 581 c
114 581 102 586 92 595 c
83 605 78 617 78 632 c
78 646 83 658 93 668 c
103 678 115 683 129 683 c
144 683 156 678 165 668 c
175 658 180 646 180 632 c

253 0 m
16 0 l
16 15 l
51 17 72 23 81 33 c
90 43 95 67 95 104 c
95 331 l
95 354 93 371 88 380 c
83 389 75 394 62 394 c
46 394 32 392 20 389 c
20 405 l
175 460 l
179 456 l
179 105 l
179 68 183 44 191 34 c
200 24 220 18 253 15 c
253 0 l

ce} _d
/l{278 0 19 0 257 683 sc
257 0 m
21 0 l
21 15 l
52 18 73 24 83 34 c
93 45 98 64 98 92 c
98 561 l
98 585 95 602 89 611 c
83 620 72 625 56 625 c
42 625 30 624 19 623 c
19 639 l
82 654 135 669 177 683 c
182 679 l
182 87 l
182 59 187 40 196 31 c
205 22 226 17 257 15 c
257 0 l

ce} _d
/m{778 0 16 0 775 460 sc
775 0 m
557 0 l
557 15 l
585 18 603 23 610 32 c
618 41 622 61 622 90 c
622 296 l
622 336 616 365 604 382 c
593 399 573 408 545 408 c
522 408 502 403 485 394 c
469 385 453 369 438 347 c
438 95 l
438 63 443 42 452 31 c
462 21 481 16 510 15 c
510 0 l
286 0 l
286 15 l
315 17 334 22 342 29 c
350 37 354 56 354 86 c
354 297 l
354 371 332 408 289 408 c
270 408 250 404 229 395 c
208 387 193 377 183 365 c
174 355 170 349 170 348 c
170 70 l
170 49 175 34 184 27 c
193 20 211 16 238 15 c
238 0 l
16 0 l
16 15 l
44 16 63 21 72 30 c
81 40 86 59 86 88 c
86 336 l
86 361 83 378 78 387 c
73 397 64 402 51 402 c
41 402 30 401 19 398 c
19 415 l
64 428 111 443 158 460 c
166 457 l
166 383 l
168 383 l
198 414 224 435 247 445 c
270 455 295 460 321 460 c
374 460 409 432 427 376 c
479 432 533 460 590 460 c
667 460 706 400 706 280 c
706 77 l
706 55 709 40 716 31 c
723 23 734 18 749 17 c
775 15 l
775 0 l

ce} _d
/n{500 0 16 0 485 460 sc
485 0 m
277 0 l
278 15 l
303 17 319 24 327 36 c
336 49 340 72 340 105 c
340 304 l
340 371 316 405 267 405 c
250 405 235 401 220 393 c
205 385 187 370 164 348 c
164 72 l
164 52 168 38 177 30 c
186 22 204 17 229 15 c
229 0 l
18 0 l
18 15 l
43 17 60 23 68 33 c
76 44 80 64 80 94 c
80 337 l
80 362 78 379 73 388 c
68 397 59 402 45 402 c
32 402 22 401 16 398 c
16 415 l
63 428 108 443 153 460 c
161 457 l
161 379 l
162 379 l
209 433 257 460 306 460 c
344 460 373 447 393 420 c
414 393 424 355 424 306 c
424 85 l
424 58 428 41 436 32 c
444 23 460 18 485 15 c
485 0 l

ce} _d
/o{500 0 29 -10 470 460 sc
470 231 m
470 161 449 103 407 58 c
366 13 312 -10 245 -10 c
184 -10 132 12 91 57 c
50 102 29 159 29 228 c
29 297 50 353 91 396 c
132 439 187 460 254 460 c
316 460 367 439 408 396 c
449 354 470 299 470 231 c

380 204 m
380 280 363 339 330 382 c
303 415 272 432 235 432 c
200 432 172 418 151 389 c
130 361 119 322 119 273 c
119 188 137 119 172 68 c
195 35 225 18 262 18 c
299 18 327 34 348 67 c
369 100 380 146 380 204 c

ce} _d
/r{333 0 5 0 335 460 sc
160 458 m
160 366 l
185 402 206 427 223 440 c
240 453 259 460 280 460 c
297 460 311 455 320 446 c
330 437 335 424 335 407 c
335 393 331 382 324 374 c
317 366 308 362 296 362 c
283 362 270 369 256 382 c
245 392 237 397 230 397 c
216 397 201 387 184 368 c
168 349 160 331 160 315 c
160 90 l
160 61 166 42 177 32 c
188 22 211 16 245 15 c
245 0 l
5 0 l
5 15 l
37 21 57 28 64 35 c
72 42 76 59 76 84 c
76 334 l
76 356 73 371 68 380 c
63 389 55 394 42 394 c
31 394 20 393 7 390 c
7 406 l
49 419 98 437 155 460 c
160 458 l

ce} _d
/s{389 0 51 -10 348 459 sc
156 301 m
260 238 l
293 218 316 199 329 182 c
342 165 348 142 348 115 c
348 82 334 52 306 27 c
279 2 246 -10 208 -10 c
177 -10 152 -7 135 -1 c
117 5 102 8 89 8 c
78 8 70 4 65 -4 c
52 -4 l
52 153 l
68 153 l
79 104 94 69 114 46 c
134 23 161 12 195 12 c
220 12 240 19 255 33 c
270 47 278 65 278 86 c
278 117 260 142 225 161 c
171 191 l
91 236 51 284 51 336 c
51 375 63 405 88 426 c
113 448 147 459 189 459 c
218 459 241 455 256 448 c
268 443 277 440 284 440 c
289 440 294 443 300 450 c
311 450 l
316 314 l
301 314 l
290 359 275 391 258 409 c
241 428 218 437 188 437 c
165 437 147 431 133 420 c
120 409 113 392 113 369 c
113 358 117 345 124 332 c
132 319 143 309 156 301 c

ce} _d
/t{278 0 13 -10 279 579 sc
266 77 m
279 66 l
247 15 207 -10 158 -10 c
99 -10 70 32 70 117 c
70 418 l
17 418 l
14 420 13 422 13 425 c
13 430 19 437 30 444 c
55 459 88 494 127 551 c
128 553 131 557 136 563 c
141 570 145 575 147 579 c
152 579 154 575 154 566 c
154 450 l
255 450 l
255 418 l
154 418 l
154 132 l
154 100 158 77 166 63 c
174 49 187 42 206 42 c
226 42 246 54 266 77 c

ce} _d
/u{500 0 9 -10 480 450 sc
480 50 m
480 36 l
428 22 382 7 343 -9 c
338 -6 l
338 76 l
336 76 l
294 19 246 -10 193 -10 c
155 -10 125 2 103 25 c
82 48 71 79 71 118 c
71 369 l
71 394 67 411 58 420 c
49 429 33 435 9 436 c
9 450 l
155 450 l
155 127 l
155 104 162 85 175 70 c
189 55 206 48 226 48 c
259 48 287 58 310 79 c
319 87 325 94 328 101 c
331 108 333 120 333 137 c
333 368 l
333 394 328 411 319 418 c
310 426 290 431 259 433 c
259 450 l
417 450 l
417 107 l
417 84 421 68 428 61 c
436 54 451 50 474 50 c
480 50 l

ce} _d
end readonly def

/BuildGlyph {
 exch begin
 CharStrings exch
 2 copy known not {pop /.notdef} if
 true 3 1 roll get exec
 end
} _d

/BuildChar {
 1 index /Encoding get exch get
 1 index /BuildGlyph get exec
} _d

FontName currentdict end definefont pop
%!PS-Adobe-3.0 Resource-Font
%%Creator: Converted from TrueType to Type 3 by Matplotlib.
10 dict begin
/FontName /Cmmi10 def
/PaintType 0 def
/FontMatrix [0.00048828125 0 0 0.00048828125 0 0] def
/FontBBox [-70 -512 2146 1536] def
/FontType 3 def
/Encoding [/e /h /l /n /N /o /p /v /period] def
/CharStrings 10 dict dup begin
/.notdef 0 def
/e{952 0 90 -23 881 905 sc
412 -23 m
347 -23 289 -6 240 28 c
191 62 154 108 128 165 c
103 223 90 284 90 348 c
90 445 114 537 163 622 c
212 708 279 777 363 828 c
447 879 537 905 633 905 c
692 905 743 890 786 859 c
830 829 852 786 852 729 c
852 650 821 592 758 553 c
695 515 625 491 546 482 c
467 473 380 469 285 469 c
279 469 l
257 388 246 318 246 260 c
246 199 260 146 288 100 c
316 54 359 31 416 31 c
497 31 575 50 650 87 c
725 124 787 176 834 242 c
838 246 843 248 850 248 c
857 248 863 244 870 236 c
877 229 881 222 881 215 c
881 210 880 206 877 203 c
827 133 760 78 675 37 c
590 -3 503 -23 412 -23 c

291 522 m
370 522 444 526 511 533 c
578 540 639 559 694 588 c
749 618 776 664 776 727 c
776 752 769 774 755 793 c
741 812 723 827 700 837 c
678 847 655 852 631 852 c
573 852 521 836 474 805 c
428 774 390 733 360 682 c
330 632 307 579 291 522 c

ce} _d
/h{1180 0 109 -23 1124 1421 sc
109 37 m
109 45 110 51 111 55 c
408 1239 l
413 1262 417 1281 418 1294 c
418 1316 374 1327 285 1327 c
271 1327 264 1336 264 1354 c
265 1357 266 1363 268 1372 c
271 1381 274 1387 277 1392 c
281 1397 286 1399 293 1399 c
569 1421 l
575 1421 l
575 1420 577 1418 582 1415 c
587 1413 589 1412 590 1411 c
593 1404 594 1399 594 1395 c
434 756 l
518 855 618 905 733 905 c
781 905 822 897 857 880 c
892 863 920 838 939 804 c
959 771 969 731 969 684 c
969 628 956 560 931 481 c
906 402 875 313 838 215 c
819 170 809 129 809 92 c
809 51 825 31 856 31 c
909 31 954 59 989 116 c
1025 173 1050 235 1065 301 c
1068 309 1073 313 1081 313 c
1106 313 l
1111 313 1116 311 1119 307 c
1122 304 1124 300 1124 295 c
1124 294 1123 292 1122 289 c
1110 240 1092 191 1068 143 c
1045 96 1015 56 979 24 c
943 -7 901 -23 852 -23 c
804 -23 763 -7 729 26 c
695 59 678 100 678 147 c
678 172 683 199 694 227 c
733 330 765 421 790 502 c
816 583 829 654 829 715 c
829 754 821 787 806 813 c
791 839 765 852 729 852 c
656 852 592 829 537 784 c
482 739 435 680 395 606 c
256 47 l
251 26 240 10 225 -3 c
210 -16 192 -23 172 -23 c
155 -23 140 -17 127 -5 c
115 6 109 20 109 37 c

ce} _d
/l{610 0 90 -23 537 1421 sc
90 166 m
90 170 90 176 91 184 c
92 192 93 200 94 207 c
95 215 96 221 96 225 c
350 1239 l
355 1262 359 1281 360 1294 c
360 1316 316 1327 227 1327 c
214 1327 207 1336 207 1354 c
208 1357 209 1363 211 1372 c
214 1381 217 1387 220 1392 c
224 1397 229 1399 236 1399 c
512 1421 l
529 1421 537 1412 537 1395 c
242 217 l
232 195 227 162 227 119 c
227 60 247 31 287 31 c
329 31 360 57 381 109 c
402 162 421 226 438 301 c
441 309 446 313 455 313 c
479 313 l
484 313 489 311 492 306 c
496 302 498 298 498 293 c
482 227 467 175 454 136 c
441 98 421 62 392 28 c
363 -6 327 -23 283 -23 c
228 -23 182 -5 145 30 c
108 65 90 111 90 166 c

ce} _d
/n{1229 0 55 -23 1176 905 sc
158 35 m
158 43 159 49 160 53 c
313 664 l
323 702 328 735 328 764 c
328 823 308 852 268 852 c
225 852 194 826 173 775 c
152 724 132 660 113 582 c
113 578 111 575 107 572 c
103 570 99 569 96 569 c
72 569 l
67 569 63 571 60 576 c
57 581 55 586 55 590 c
70 649 84 700 97 741 c
111 782 132 820 161 854 c
190 888 227 905 270 905 c
321 905 367 889 406 856 c
445 824 465 783 465 733 c
506 786 553 828 608 859 c
663 890 721 905 782 905 c
831 905 873 897 908 880 c
943 863 971 838 990 804 c
1010 771 1020 731 1020 684 c
1020 628 1007 560 982 481 c
957 402 926 313 889 215 c
870 170 860 129 860 92 c
860 51 876 31 907 31 c
960 31 1005 60 1040 117 c
1076 174 1101 236 1116 301 c
1119 309 1124 313 1133 313 c
1157 313 l
1162 313 1167 311 1170 308 c
1174 305 1176 300 1176 295 c
1176 294 1175 292 1174 289 c
1155 212 1123 140 1076 75 c
1030 10 972 -23 903 -23 c
855 -23 814 -7 780 26 c
746 59 729 100 729 147 c
729 172 734 199 745 227 c
762 272 782 325 804 387 c
827 449 845 508 859 565 c
874 622 881 672 881 715 c
881 753 873 785 857 812 c
842 839 815 852 778 852 c
728 852 682 841 640 819 c
598 797 561 768 530 731 c
499 695 470 652 444 602 c
305 45 l
300 26 290 10 273 -3 c
257 -16 239 -23 219 -23 c
202 -23 188 -18 176 -7 c
164 4 158 18 158 35 c

ce} _d
/N{1645 0 76 0 1808 1399 sc
96 0 m
83 0 76 9 76 27 c
77 30 78 36 80 44 c
82 53 85 59 88 64 c
92 69 97 72 102 72 c
233 72 309 114 330 197 c
608 1317 l
570 1324 510 1327 428 1327 c
415 1327 408 1336 408 1354 c
409 1357 410 1363 412 1371 c
414 1380 417 1386 420 1391 c
424 1396 429 1399 434 1399 c
788 1399 l
798 1399 804 1395 807 1386 c
1262 303 l
1489 1210 l
1492 1225 1493 1235 1493 1241 c
1493 1298 1440 1327 1335 1327 c
1322 1327 1315 1336 1315 1354 c
1320 1371 1323 1383 1326 1389 c
1329 1396 1337 1399 1350 1399 c
1788 1399 l
1801 1399 1808 1390 1808 1372 c
1807 1369 1806 1363 1804 1354 c
1802 1346 1799 1339 1795 1334 c
1792 1329 1787 1327 1782 1327 c
1651 1327 1575 1285 1554 1202 c
1260 18 l
1255 6 1248 0 1239 0 c
1214 0 l
1205 0 1199 5 1196 14 c
674 1253 l
670 1266 l
667 1269 666 1271 666 1272 c
395 188 l
394 185 393 180 392 175 c
391 170 390 165 389 158 c
389 123 404 99 435 88 c
466 77 504 72 549 72 c
562 72 569 63 569 45 c
564 26 560 14 557 8 c
554 3 546 0 535 0 c
96 0 l

ce} _d
/o{991 0 82 -23 965 905 sc
412 -23 m
347 -23 290 -8 239 23 c
189 54 150 95 123 147 c
96 199 82 258 82 324 c
82 417 108 508 159 599 c
211 690 280 763 365 820 c
451 877 541 905 635 905 c
686 905 731 896 770 879 c
810 862 845 837 874 806 c
903 775 926 738 941 696 c
957 654 965 608 965 559 c
965 488 950 417 920 348 c
890 279 849 217 796 160 c
744 104 684 59 617 26 c
550 -7 481 -23 412 -23 c

416 31 m
477 31 532 52 582 93 c
633 134 674 186 706 249 c
739 312 764 379 781 449 c
798 519 807 582 807 639 c
807 698 792 749 762 790 c
733 831 689 852 631 852 c
551 852 481 818 421 749 c
361 681 316 599 285 504 c
255 409 240 323 240 244 c
240 185 255 134 285 93 c
316 52 359 31 416 31 c

ce} _d
/p{1030 0 -70 -397 1006 905 sc
-51 -397 m
-64 -397 -70 -388 -70 -371 c
-65 -341 -56 -326 -43 -326 c
-0 -326 29 -322 46 -314 c
63 -307 77 -287 86 -256 c
317 666 l
327 691 332 724 332 764 c
332 823 312 852 272 852 c
229 852 198 826 177 775 c
156 724 136 660 117 582 c
117 573 111 569 100 569 c
76 569 l
73 569 69 571 65 576 c
61 581 59 586 59 590 c
74 649 88 700 101 741 c
115 782 136 820 165 854 c
194 888 231 905 274 905 c
321 905 362 892 397 865 c
432 839 455 803 465 758 c
502 801 544 837 589 864 c
634 891 681 905 729 905 c
786 905 836 890 878 859 c
921 828 953 788 974 738 c
995 689 1006 635 1006 578 c
1006 490 983 399 938 305 c
893 211 832 133 755 70 c
678 8 596 -23 508 -23 c
468 -23 432 -12 399 11 c
367 34 342 63 324 100 c
231 -264 l
228 -284 226 -296 225 -299 c
225 -317 270 -326 360 -326 c
374 -326 381 -335 381 -352 c
376 -370 372 -382 369 -388 c
366 -394 359 -397 346 -397 c
-51 -397 l

510 31 m
557 31 601 50 642 89 c
683 128 716 172 741 221 c
760 258 777 302 793 355 c
810 408 824 465 836 525 c
848 585 854 633 854 668 c
854 699 850 729 841 756 c
833 783 819 806 800 824 c
781 843 756 852 725 852 c
675 852 628 834 583 798 c
539 763 499 719 463 666 c
463 659 l
350 207 l
359 158 377 117 404 82 c
431 48 466 31 510 31 c

ce} _d
/v{991 0 55 -23 956 907 sc
219 231 m
219 262 223 295 230 332 c
237 369 245 399 252 422 c
259 446 276 492 302 561 c
328 630 341 665 342 668 c
360 718 369 759 369 791 c
369 832 354 852 324 852 c
270 852 225 824 190 768 c
155 713 130 651 113 582 c
110 573 105 569 96 569 c
72 569 l
61 569 55 575 55 588 c
55 594 l
77 675 111 747 156 810 c
201 873 259 905 328 905 c
377 905 418 889 451 857 c
485 825 502 784 502 735 c
502 710 496 683 485 655 c
458 586 437 530 422 488 c
407 447 392 400 379 348 c
366 297 360 249 360 205 c
360 154 372 112 395 79 c
419 47 456 31 506 31 c
601 31 686 104 762 250 c
786 297 809 353 830 417 c
851 481 862 533 862 573 c
862 614 855 646 842 669 c
829 692 811 716 790 741 c
769 766 758 786 758 801 c
758 828 769 852 791 874 c
813 896 837 907 864 907 c
897 907 920 892 934 862 c
949 832 956 798 956 760 c
956 715 949 661 936 598 c
923 535 905 470 882 403 c
859 336 838 283 819 244 c
729 66 624 -23 504 -23 c
418 -23 349 -2 297 41 c
245 84 219 148 219 231 c

ce} _d
/period{567 0 172 0 397 225 sc
172 113 m
172 144 183 170 206 192 c
229 214 255 225 285 225 c
304 225 322 220 340 210 c
358 200 372 186 382 168 c
392 150 397 132 397 113 c
397 83 386 57 364 34 c
342 11 316 0 285 0 c
255 0 229 11 206 34 c
183 57 172 83 172 113 c

ce} _d
end readonly def

/BuildGlyph {
 exch begin
 CharStrings exch
 2 copy known not {pop /.notdef} if
 true 3 1 roll get exec
 end
} _d

/BuildChar {
 1 index /Encoding get exch get
 1 index /BuildGlyph get exec
} _d

FontName currentdict end definefont pop
%!PS-Adobe-3.0 Resource-Font
%%Creator: Converted from TrueType to Type 3 by Matplotlib.
10 dict begin
/FontName /Cmr10 def
/PaintType 0 def
/FontMatrix [0.00048828125 0 0 0.00048828125 0 0] def
/FontBBox [-90 -512 2066 1536] def
/FontType 3 def
/Encoding [/a /l /o /zero /two /t /eight] def
/CharStrings 8 dict dup begin
/.notdef 0 def
/a{1024 0 82 -23 1010 918 sc
82 201 m
82 282 114 348 178 399 c
242 450 319 486 408 507 c
498 528 583 539 664 539 c
664 623 l
664 662 655 700 638 737 c
621 774 596 805 563 828 c
530 852 494 864 455 864 c
364 864 295 844 248 803 c
274 803 295 793 312 773 c
329 754 338 731 338 705 c
338 678 328 654 309 635 c
290 616 267 606 240 606 c
213 606 189 616 170 635 c
151 654 141 678 141 705 c
141 777 174 830 239 865 c
304 900 376 918 455 918 c
510 918 566 906 622 882 c
678 859 724 825 759 781 c
795 737 813 686 813 627 c
813 166 l
813 139 819 115 830 92 c
841 70 859 59 883 59 c
906 59 922 70 933 93 c
944 116 950 140 950 166 c
950 297 l
1010 297 l
1010 166 l
1010 135 1002 106 986 78 c
970 51 948 29 921 12 c
894 -4 865 -12 834 -12 c
794 -12 759 3 730 34 c
701 65 685 102 682 145 c
657 94 619 53 570 22 c
521 -8 468 -23 412 -23 c
360 -23 309 -15 258 0 c
208 15 166 39 132 72 c
99 105 82 148 82 201 c

248 201 m
248 153 266 113 301 80 c
336 47 378 31 426 31 c
470 31 510 42 546 64 c
582 86 611 116 632 154 c
653 192 664 232 664 274 c
664 487 l
602 487 538 477 473 456 c
408 436 355 404 312 361 c
269 318 248 264 248 201 c

ce} _d
/l{567 0 63 0 526 1421 sc
63 0 m
63 72 l
110 72 148 76 178 83 c
208 90 223 108 223 137 c
223 1212 l
223 1249 217 1275 206 1291 c
195 1308 180 1318 159 1321 c
138 1325 106 1327 63 1327 c
63 1399 l
367 1421 l
367 137 l
367 108 382 90 412 83 c
442 76 480 72 526 72 c
526 0 l
63 0 l

ce} _d
/o{1024 0 57 -23 965 918 sc
512 -23 m
430 -23 354 -2 284 39 c
214 81 159 137 118 207 c
77 277 57 353 57 436 c
57 499 68 559 90 617 c
113 675 145 727 186 772 c
228 818 277 854 332 879 c
387 905 447 918 512 918 c
596 918 672 896 741 851 c
810 807 865 748 905 673 c
945 599 965 520 965 436 c
965 354 945 278 904 207 c
863 137 808 81 738 39 c
669 -2 593 -23 512 -23 c

512 37 m
621 37 694 77 731 156 c
768 235 786 336 786 459 c
786 528 782 584 775 629 c
768 674 752 715 727 752 c
712 775 692 794 668 811 c
645 828 620 841 593 850 c
567 859 540 864 512 864 c
469 864 429 854 390 835 c
352 816 320 788 295 752 c
270 713 253 671 246 624 c
239 578 236 523 236 459 c
236 382 243 313 256 252 c
269 191 296 140 336 99 c
377 58 435 37 512 37 c

ce} _d
/zero{1024 0 80 -45 942 1364 sc
512 -45 m
345 -45 231 24 170 161 c
110 299 80 463 80 653 c
80 772 91 883 112 988 c
134 1093 177 1181 241 1254 c
306 1327 396 1364 512 1364 c
602 1364 676 1342 733 1298 c
790 1254 834 1197 864 1127 c
894 1058 914 983 925 903 c
936 824 942 740 942 653 c
942 536 931 426 909 323 c
888 221 845 134 782 62 c
719 -9 629 -45 512 -45 c

512 8 m
588 8 645 47 682 125 c
719 203 742 289 751 384 c
760 479 764 579 764 686 c
764 789 760 883 751 970 c
742 1057 719 1135 682 1205 c
645 1276 589 1311 512 1311 c
435 1311 377 1276 340 1205 c
303 1134 280 1056 271 969 c
262 883 258 789 258 686 c
258 610 260 538 263 471 c
267 404 277 334 293 262 c
309 191 335 130 370 81 c
406 32 453 8 512 8 c

ce} _d
/two{1024 0 102 0 920 1364 sc
102 0 m
102 55 l
102 58 103 62 106 66 c
424 418 l
472 470 511 514 541 549 c
571 584 601 625 630 671 c
659 717 682 764 699 811 c
716 859 725 910 725 963 c
725 1019 715 1072 694 1123 c
673 1174 642 1215 601 1246 c
560 1277 511 1292 453 1292 c
394 1292 340 1274 293 1238 c
246 1203 212 1157 193 1100 c
198 1101 206 1102 215 1102 c
246 1102 272 1092 293 1071 c
315 1050 326 1024 326 991 c
326 960 315 933 293 911 c
272 890 246 879 215 879 c
183 879 156 890 134 912 c
113 935 102 961 102 991 c
102 1042 112 1090 131 1135 c
150 1180 178 1220 214 1255 c
251 1290 292 1317 337 1336 c
383 1355 432 1364 483 1364 c
561 1364 634 1347 701 1314 c
768 1281 822 1235 861 1174 c
900 1114 920 1044 920 963 c
920 904 907 847 881 794 c
855 741 822 692 781 648 c
740 605 688 555 625 500 c
562 445 520 408 500 389 c
268 166 l
465 166 l
562 166 642 167 707 168 c
772 170 807 173 811 176 c
827 193 843 256 860 365 c
920 365 l
862 0 l
102 0 l

ce} _d
/t{795 0 39 -23 680 1260 sc
209 246 m
209 811 l
39 811 l
39 864 l
128 864 194 906 236 989 c
278 1072 299 1163 299 1260 c
358 1260 l
358 883 l
647 883 l
647 811 l
358 811 l
358 250 l
358 193 367 144 386 101 c
405 58 440 37 489 37 c
536 37 569 59 590 104 c
611 149 621 198 621 250 c
621 371 l
680 371 l
680 246 l
680 203 672 161 656 119 c
641 78 618 44 587 17 c
556 -10 519 -23 475 -23 c
393 -23 328 1 280 50 c
233 99 209 165 209 246 c

ce} _d
/eight{1024 0 86 -45 936 1364 sc
86 311 m
86 393 113 465 167 528 c
221 591 290 644 375 686 c
299 735 l
252 766 214 806 185 857 c
156 908 141 962 141 1018 c
141 1083 158 1142 192 1195 c
227 1248 272 1289 329 1319 c
386 1349 447 1364 512 1364 c
573 1364 631 1352 687 1327 c
744 1302 790 1267 826 1221 c
863 1175 881 1120 881 1057 c
881 1011 870 968 848 929 c
827 890 797 854 759 823 c
722 792 682 765 639 743 c
756 668 l
810 633 853 586 886 529 c
919 472 936 411 936 348 c
936 274 916 207 876 146 c
837 85 784 38 719 5 c
654 -28 585 -45 512 -45 c
441 -45 373 -31 307 -2 c
242 27 188 68 147 122 c
106 177 86 240 86 311 c

197 311 m
197 257 212 208 241 163 c
271 118 310 83 359 58 c
408 33 459 20 512 20 c
591 20 663 43 728 89 c
793 136 825 197 825 274 c
825 300 820 326 809 351 c
799 377 785 400 766 421 c
748 442 728 460 705 473 c
430 651 l
387 628 348 600 312 565 c
277 530 249 491 228 448 c
207 405 197 359 197 311 c

338 936 m
586 776 l
643 809 690 850 727 897 c
764 944 782 998 782 1057 c
782 1103 769 1145 743 1183 c
718 1222 684 1252 643 1273 c
602 1294 557 1305 510 1305 c
469 1305 427 1297 385 1281 c
343 1265 308 1241 281 1209 c
254 1178 240 1141 240 1098 c
240 1034 273 980 338 936 c

ce} _d
end readonly def

/BuildGlyph {
 exch begin
 CharStrings exch
 2 copy known not {pop /.notdef} if
 true 3 1 roll get exec
 end
} _d

/BuildChar {
 1 index /Encoding get exch get
 1 index /BuildGlyph get exec
} _d

FontName currentdict end definefont pop
%!PS-Adobe-3.0 Resource-Font
%%Creator: Converted from TrueType to Type 3 by Matplotlib.
10 dict begin
/FontName /Cmsy10 def
/PaintType 0 def
/FontMatrix [0.00048828125 0 0 0.00048828125 0 0] def
/FontBBox [-59 -1966 2300 1595] def
/FontType 3 def
/Encoding [/approxequal] def
/CharStrings 2 dict dup begin
/.notdef 0 def
/approxequal{1591 0 115 115 1477 989 sc
143 115 m
128 115 119 132 115 166 c
115 178 l
115 240 130 297 160 348 c
191 399 232 439 285 468 c
338 497 394 512 455 512 c
528 512 604 488 681 441 c
759 394 836 347 913 300 c
990 253 1064 229 1137 229 c
1207 229 1271 251 1330 294 c
1389 337 1419 393 1419 461 c
1423 495 1433 512 1448 512 c
1463 512 1473 495 1477 461 c
1477 449 l
1477 387 1462 330 1431 279 c
1400 228 1359 187 1306 158 c
1254 129 1198 115 1137 115 c
1080 115 1026 127 975 150 c
925 174 866 209 798 254 c
731 300 671 335 620 360 c
569 385 514 397 455 397 c
412 397 368 387 323 368 c
278 349 242 321 214 286 c
186 251 172 211 172 166 c
168 132 158 115 143 115 c

143 592 m
128 592 119 609 115 643 c
115 655 l
115 717 130 774 160 825 c
191 876 232 916 285 945 c
338 974 394 989 455 989 c
528 989 604 965 681 918 c
759 871 836 824 913 777 c
990 730 1064 707 1137 707 c
1207 707 1271 729 1330 772 c
1389 815 1419 871 1419 938 c
1423 972 1433 989 1448 989 c
1463 989 1473 972 1477 938 c
1477 926 l
1477 864 1462 807 1431 756 c
1400 705 1359 664 1306 635 c
1254 606 1198 592 1137 592 c
1080 592 1026 604 975 627 c
925 651 866 686 798 731 c
731 777 671 812 620 837 c
569 862 514 874 455 874 c
412 874 368 864 323 845 c
278 826 242 798 214 763 c
186 728 172 688 172 643 c
168 609 158 592 143 592 c

ce} _d
end readonly def

/BuildGlyph {
 exch begin
 CharStrings exch
 2 copy known not {pop /.notdef} if
 true 3 1 roll get exec
 end
} _d

/BuildChar {
 1 index /Encoding get exch get
 1 index /BuildGlyph get exec
} _d

FontName currentdict end definefont pop
end
%%EndProlog
mpldict begin
151.15 242.688 translate
309.699 306.625 0 0 clipbox
gsave
0 0 m
309.699327 0 l
309.699327 306.625 l
0 306.625 l
cl
1.000 setgray
fill
grestore
gsave
61.2 41.60625 m
252.499327 41.60625 l
252.499327 284.425 l
61.2 284.425 l
cl
1.000 setgray
fill
grestore
0.800 setlinewidth
1 setlinejoin
2 setlinecap
[] 0 setdash
0.690 setgray
gsave
191.299 242.819 61.2 41.606 clipbox
69.895424 41.60625 m
69.895424 284.425 l
stroke
grestore
0 setlinecap
0.000 setgray
gsave
/o {
gsave
newpath
translate
0.8 setlinewidth
1 setlinejoin

0 setlinecap

0 0 m
0 -3.5 l

gsave
0.000 setgray
fill
grestore
stroke
grestore
} bind def
69.8954 41.6063 o
grestore
gsave
62.395424 26.403125 translate
0.000000 rotate
/STIXGeneral-Regular 12.0 selectfont
0.000000 0.890625 moveto
/zero glyphshow
5.999985 0.890625 moveto
/period glyphshow
8.999969 0.890625 moveto
/zero glyphshow
grestore
2 setlinecap
0.690 setgray
gsave
191.299 242.819 61.2 41.606 clipbox
116.157662 41.60625 m
116.157662 284.425 l
stroke
grestore
0 setlinecap
0.000 setgray
gsave
/o {
gsave
newpath
translate
0.8 setlinewidth
1 setlinejoin

0 setlinecap

0 0 m
0 -3.5 l

gsave
0.000 setgray
fill
grestore
stroke
grestore
} bind def
116.158 41.6063 o
grestore
gsave
108.657662 26.403125 translate
0.000000 rotate
/STIXGeneral-Regular 12.0 selectfont
0.000000 0.750000 moveto
/two glyphshow
5.999985 0.750000 moveto
/period glyphshow
8.999969 0.750000 moveto
/five glyphshow
grestore
2 setlinecap
0.690 setgray
gsave
191.299 242.819 61.2 41.606 clipbox
162.419901 41.60625 m
162.419901 284.425 l
stroke
grestore
0 setlinecap
0.000 setgray
gsave
/o {
gsave
newpath
translate
0.8 setlinewidth
1 setlinejoin

0 setlinecap

0 0 m
0 -3.5 l

gsave
0.000 setgray
fill
grestore
stroke
grestore
} bind def
162.42 41.6063 o
grestore
gsave
154.919901 26.403125 translate
0.000000 rotate
/STIXGeneral-Regular 12.0 selectfont
0.000000 0.750000 moveto
/five glyphshow
5.999985 0.750000 moveto
/period glyphshow
8.999969 0.750000 moveto
/zero glyphshow
grestore
2 setlinecap
0.690 setgray
gsave
191.299 242.819 61.2 41.606 clipbox
208.682139 41.60625 m
208.682139 284.425 l
stroke
grestore
0 setlinecap
0.000 setgray
gsave
/o {
gsave
newpath
translate
0.8 setlinewidth
1 setlinejoin

0 setlinecap

0 0 m
0 -3.5 l

gsave
0.000 setgray
fill
grestore
stroke
grestore
} bind def
208.682 41.6063 o
grestore
gsave
201.182139 26.403125 translate
0.000000 rotate
/STIXGeneral-Regular 12.0 selectfont
0.000000 0.750000 moveto
/seven glyphshow
5.999985 0.750000 moveto
/period glyphshow
8.999969 0.750000 moveto
/five glyphshow
grestore
/STIXGeneral-Regular 14.000 selectfont
gsave

113.091851 10.231250 translate
0.000000 rotate
0.000000 0 m /s glyphshow
5.445999 0 m /i glyphshow
9.337997 0 m /m glyphshow
20.229996 0 m /u glyphshow
27.229996 0 m /l glyphshow
31.121994 0 m /a glyphshow
37.337982 0 m /t glyphshow
41.229980 0 m /i glyphshow
45.121979 0 m /o glyphshow
52.121979 0 m /n glyphshow
59.121979 0 m /space glyphshow
62.621979 0 m /t glyphshow
66.513977 0 m /i glyphshow
70.405975 0 m /m glyphshow
81.297974 0 m /e glyphshow
grestore
2 setlinecap
0.690 setgray
gsave
191.299 242.819 61.2 41.606 clipbox
61.2 59.660504 m
252.499327 59.660504 l
stroke
grestore
0 setlinecap
0.000 setgray
gsave
/o {
gsave
newpath
translate
0.8 setlinewidth
1 setlinejoin

0 setlinecap

-0 0 m
-3.5 0 l

gsave
0.000 setgray
fill
grestore
stroke
grestore
} bind def
61.2 59.6605 o
grestore
gsave
24.200000 55.558941 translate
0.000000 rotate
/STIXGeneral-Regular 12.0 selectfont
0.000000 0.796875 moveto
/six glyphshow
5.999985 0.796875 moveto
/eight glyphshow
11.999969 0.796875 moveto
/zero glyphshow
17.999954 0.796875 moveto
/zero glyphshow
23.999939 0.796875 moveto
/zero glyphshow
grestore
2 setlinecap
0.690 setgray
gsave
191.299 242.819 61.2 41.606 clipbox
61.2 90.436986 m
252.499327 90.436986 l
stroke
grestore
0 setlinecap
0.000 setgray
gsave
/o {
gsave
newpath
translate
0.8 setlinewidth
1 setlinejoin

0 setlinecap

-0 0 m
-3.5 0 l

gsave
0.000 setgray
fill
grestore
stroke
grestore
} bind def
61.2 90.437 o
grestore
gsave
24.200000 86.335423 translate
0.000000 rotate
/STIXGeneral-Regular 12.0 selectfont
0.000000 0.890625 moveto
/seven glyphshow
5.999985 0.890625 moveto
/zero glyphshow
11.999969 0.890625 moveto
/zero glyphshow
17.999954 0.890625 moveto
/zero glyphshow
23.999939 0.890625 moveto
/zero glyphshow
grestore
2 setlinecap
0.690 setgray
gsave
191.299 242.819 61.2 41.606 clipbox
61.2 121.213468 m
252.499327 121.213468 l
stroke
grestore
0 setlinecap
0.000 setgray
gsave
/o {
gsave
newpath
translate
0.8 setlinewidth
1 setlinejoin

0 setlinecap

-0 0 m
-3.5 0 l

gsave
0.000 setgray
fill
grestore
stroke
grestore
} bind def
61.2 121.213 o
grestore
gsave
24.200000 117.111906 translate
0.000000 rotate
/STIXGeneral-Regular 12.0 selectfont
0.000000 0.890625 moveto
/seven glyphshow
5.999985 0.890625 moveto
/two glyphshow
11.999969 0.890625 moveto
/zero glyphshow
17.999954 0.890625 moveto
/zero glyphshow
23.999939 0.890625 moveto
/zero glyphshow
grestore
2 setlinecap
0.690 setgray
gsave
191.299 242.819 61.2 41.606 clipbox
61.2 151.98995 m
252.499327 151.98995 l
stroke
grestore
0 setlinecap
0.000 setgray
gsave
/o {
gsave
newpath
translate
0.8 setlinewidth
1 setlinejoin

0 setlinecap

-0 0 m
-3.5 0 l

gsave
0.000 setgray
fill
grestore
stroke
grestore
} bind def
61.2 151.99 o
grestore
gsave
24.200000 147.888388 translate
0.000000 rotate
/STIXGeneral-Regular 12.0 selectfont
0.000000 0.890625 moveto
/seven glyphshow
5.999985 0.890625 moveto
/four glyphshow
11.999969 0.890625 moveto
/zero glyphshow
17.999954 0.890625 moveto
/zero glyphshow
23.999939 0.890625 moveto
/zero glyphshow
grestore
2 setlinecap
0.690 setgray
gsave
191.299 242.819 61.2 41.606 clipbox
61.2 182.766432 m
252.499327 182.766432 l
stroke
grestore
0 setlinecap
0.000 setgray
gsave
/o {
gsave
newpath
translate
0.8 setlinewidth
1 setlinejoin

0 setlinecap

-0 0 m
-3.5 0 l

gsave
0.000 setgray
fill
grestore
stroke
grestore
} bind def
61.2 182.766 o
grestore
gsave
24.200000 178.664870 translate
0.000000 rotate
/STIXGeneral-Regular 12.0 selectfont
0.000000 0.796875 moveto
/seven glyphshow
5.999985 0.796875 moveto
/six glyphshow
11.999969 0.796875 moveto
/zero glyphshow
17.999954 0.796875 moveto
/zero glyphshow
23.999939 0.796875 moveto
/zero glyphshow
grestore
2 setlinecap
0.690 setgray
gsave
191.299 242.819 61.2 41.606 clipbox
61.2 213.542915 m
252.499327 213.542915 l
stroke
grestore
0 setlinecap
0.000 setgray
gsave
/o {
gsave
newpath
translate
0.8 setlinewidth
1 setlinejoin

0 setlinecap

-0 0 m
-3.5 0 l

gsave
0.000 setgray
fill
grestore
stroke
grestore
} bind def
61.2 213.543 o
grestore
gsave
24.200000 209.441352 translate
0.000000 rotate
/STIXGeneral-Regular 12.0 selectfont
0.000000 0.890625 moveto
/seven glyphshow
5.999985 0.890625 moveto
/eight glyphshow
11.999969 0.890625 moveto
/zero glyphshow
17.999954 0.890625 moveto
/zero glyphshow
23.999939 0.890625 moveto
/zero glyphshow
grestore
2 setlinecap
0.690 setgray
gsave
191.299 242.819 61.2 41.606 clipbox
61.2 244.319397 m
252.499327 244.319397 l
stroke
grestore
0 setlinecap
0.000 setgray
gsave
/o {
gsave
newpath
translate
0.8 setlinewidth
1 setlinejoin

0 setlinecap

-0 0 m
-3.5 0 l

gsave
0.000 setgray
fill
grestore
stroke
grestore
} bind def
61.2 244.319 o
grestore
gsave
24.200000 240.217834 translate
0.000000 rotate
/STIXGeneral-Regular 12.0 selectfont
0.000000 0.890625 moveto
/eight glyphshow
5.999985 0.890625 moveto
/zero glyphshow
11.999969 0.890625 moveto
/zero glyphshow
17.999954 0.890625 moveto
/zero glyphshow
23.999939 0.890625 moveto
/zero glyphshow
grestore
2 setlinecap
0.690 setgray
gsave
191.299 242.819 61.2 41.606 clipbox
61.2 275.095879 m
252.499327 275.095879 l
stroke
grestore
0 setlinecap
0.000 setgray
gsave
/o {
gsave
newpath
translate
0.8 setlinewidth
1 setlinejoin

0 setlinecap

-0 0 m
-3.5 0 l

gsave
0.000 setgray
fill
grestore
stroke
grestore
} bind def
61.2 275.096 o
grestore
gsave
24.200000 270.994316 translate
0.000000 rotate
/STIXGeneral-Regular 12.0 selectfont
0.000000 0.890625 moveto
/eight glyphshow
5.999985 0.890625 moveto
/two glyphshow
11.999969 0.890625 moveto
/zero glyphshow
17.999954 0.890625 moveto
/zero glyphshow
23.999939 0.890625 moveto
/zero glyphshow
grestore
gsave
17.168750 146.515625 translate
90.000000 rotate
/Cmmi10 14.0 selectfont
0.000000 0.437500 moveto
/N glyphshow
/Cmr10 9.799999999999999 selectfont
11.245117 -1.943375 moveto
/t glyphshow
15.049316 -1.943375 moveto
/o glyphshow
19.949316 -1.943375 moveto
/t glyphshow
23.753516 -1.943375 moveto
/a glyphshow
28.653516 -1.943375 moveto
/l glyphshow
grestore
2.000 setlinewidth
2 setlinecap
gsave
191.299 242.819 61.2 41.606 clipbox
69.895424 52.643466 m
71.745514 63.9846 l
73.595604 78.387993 l
75.445695 89.975339 l
77.295785 103.624709 l
79.145875 110.503252 l
80.995965 120.444056 l
82.846055 127.568812 l
84.696146 140.064063 l
86.546236 144.065006 l
88.396326 155.082987 l
90.246416 162.777107 l
92.096506 168.347651 l
93.946597 174.718382 l
95.796687 180.135043 l
97.646777 181.319938 l
99.496867 191.583895 l
101.346957 197.477591 l
103.197048 199.893545 l
105.047138 206.525877 l
106.897228 210.649925 l
108.747318 211.034631 l
110.597408 218.621034 l
112.447499 223.222118 l
114.297589 227.007625 l
116.147679 228.084802 l
117.997769 230.670027 l
119.847859 233.70151 l
121.69795 236.917653 l
123.54804 237.194641 l
125.39813 241.411019 l
127.24822 246.766127 l
129.09831 250.166928 l
130.948401 253.56773 l
132.798491 253.967824 l
134.648581 256.168342 l
136.498671 254.752624 l
138.348761 259.923073 l
140.198852 260.800203 l
142.048942 263.554698 l
143.899032 261.415733 l
145.749122 265.031969 l
147.599212 266.709287 l
149.449303 266.924723 l
151.299393 269.3099 l
153.149483 266.524629 l
154.999573 270.294748 l
156.849663 265.016581 l
158.699754 271.571972 l
160.549844 271.017995 l
162.399934 272.033619 l
164.250024 267.370982 l
166.100114 272.156725 l
167.950205 270.433242 l
169.800295 272.541431 l
171.650385 272.172113 l
173.500475 273.203125 l
175.350565 273.387784 l
177.200656 270.617901 l
179.050746 272.079784 l
180.900836 270.002371 l
182.750926 267.64797 l
184.601016 268.802088 l
186.451107 269.648442 l
188.301197 267.786464 l
190.151287 266.817005 l
192.001377 265.078134 l
193.851467 264.139451 l
195.701558 263.585475 l
197.551648 257.307072 l
199.401738 260.000014 l
201.251828 257.32246 l
203.101919 256.399166 l
204.952009 254.552577 l
206.802099 253.660059 l
208.652189 251.182552 l
210.502279 248.566551 l
212.35237 247.535539 l
214.20246 245.735115 l
216.05255 241.688007 l
217.90264 238.948901 l
219.75273 237.456241 l
221.602821 234.224711 l
223.452911 234.255487 l
225.303001 228.577226 l
227.153091 228.731108 l
229.003181 225.114872 l
230.853272 221.206259 l
232.703362 219.036517 l
234.553452 213.40442 l
236.403542 210.496043 l
238.253632 207.0183 l
240.103723 202.955805 l
241.953813 202.586487 l
243.803903 198.908697 l
stroke
grestore
1.500 setlinewidth
gsave
191.299 242.819 61.2 41.606 clipbox
69.895424 52.643466 m
71.745514 63.9846 l
73.595604 78.387993 l
75.445695 89.975339 l
77.295785 103.624709 l
79.145875 110.503252 l
80.995965 120.444056 l
82.846055 127.568812 l
84.696146 140.064063 l
86.546236 144.065006 l
88.396326 155.082987 l
90.246416 162.777107 l
92.096506 168.347651 l
93.946597 174.718382 l
95.796687 180.135043 l
97.646777 181.319938 l
99.496867 191.583895 l
101.346957 197.477591 l
103.197048 199.893545 l
105.047138 206.525877 l
106.897228 210.649925 l
108.747318 211.034631 l
110.597408 218.621034 l
112.447499 223.222118 l
114.297589 227.007625 l
116.147679 228.084802 l
117.997769 230.670027 l
119.847859 233.70151 l
121.69795 236.917653 l
123.54804 237.194641 l
125.39813 241.411019 l
127.24822 246.766127 l
129.09831 250.166928 l
130.948401 253.56773 l
132.798491 253.967824 l
134.648581 256.168342 l
136.498671 254.752624 l
138.348761 259.923073 l
140.198852 260.800203 l
142.048942 263.554698 l
143.899032 261.415733 l
145.749122 265.031969 l
147.599212 266.709287 l
149.449303 266.924723 l
151.299393 269.3099 l
153.149483 266.524629 l
154.999573 270.294748 l
156.849663 265.016581 l
158.699754 271.571972 l
160.549844 271.017995 l
162.399934 272.033619 l
164.250024 267.370982 l
166.100114 272.156725 l
167.950205 270.433242 l
169.800295 272.541431 l
171.650385 272.172113 l
173.500475 273.203125 l
175.350565 273.387784 l
177.200656 270.617901 l
179.050746 272.079784 l
180.900836 270.002371 l
182.750926 267.64797 l
184.601016 268.802088 l
186.451107 269.648442 l
188.301197 267.786464 l
190.151287 266.817005 l
192.001377 265.078134 l
193.851467 264.139451 l
195.701558 263.585475 l
197.551648 257.307072 l
199.401738 260.000014 l
201.251828 257.32246 l
203.101919 256.399166 l
204.952009 254.552577 l
206.802099 253.660059 l
208.652189 251.182552 l
210.502279 248.566551 l
212.35237 247.535539 l
214.20246 245.735115 l
216.05255 241.688007 l
217.90264 238.948901 l
219.75273 237.456241 l
221.602821 234.224711 l
223.452911 234.255487 l
225.303001 228.577226 l
227.153091 228.731108 l
229.003181 225.114872 l
230.853272 221.206259 l
232.703362 219.036517 l
234.553452 213.40442 l
236.403542 210.496043 l
238.253632 207.0183 l
240.103723 202.955805 l
241.953813 202.586487 l
243.803903 198.908697 l
stroke
grestore
1.000 setlinewidth
0 setlinecap
gsave
191.299 242.819 61.2 41.606 clipbox
/o {
gsave
newpath
translate
1.0 setlinewidth
1 setlinejoin

0 setlinecap

-3.5 -3.5 m
3.5 3.5 l
-3.5 3.5 m
3.5 -3.5 l

gsave
0.000 setgray
fill
grestore
stroke
grestore
} bind def
69.8954 52.6435 o
71.7455 63.9846 o
73.5956 78.388 o
75.4457 89.9753 o
77.2958 103.625 o
79.1459 110.503 o
80.996 120.444 o
82.8461 127.569 o
84.6961 140.064 o
86.5462 144.065 o
88.3963 155.083 o
90.2464 162.777 o
92.0965 168.348 o
93.9466 174.718 o
95.7967 180.135 o
97.6468 181.32 o
99.4969 191.584 o
101.347 197.478 o
103.197 199.894 o
105.047 206.526 o
106.897 210.65 o
108.747 211.035 o
110.597 218.621 o
112.447 223.222 o
114.298 227.008 o
116.148 228.085 o
117.998 230.67 o
119.848 233.702 o
121.698 236.918 o
123.548 237.195 o
125.398 241.411 o
127.248 246.766 o
129.098 250.167 o
130.948 253.568 o
132.798 253.968 o
134.649 256.168 o
136.499 254.753 o
138.349 259.923 o
140.199 260.8 o
142.049 263.555 o
143.899 261.416 o
145.749 265.032 o
147.599 266.709 o
149.449 266.925 o
151.299 269.31 o
153.149 266.525 o
155 270.295 o
156.85 265.017 o
158.7 271.572 o
160.55 271.018 o
162.4 272.034 o
164.25 267.371 o
166.1 272.157 o
167.95 270.433 o
169.8 272.541 o
171.65 272.172 o
173.5 273.203 o
175.351 273.388 o
177.201 270.618 o
179.051 272.08 o
180.901 270.002 o
182.751 267.648 o
184.601 268.802 o
186.451 269.648 o
188.301 267.786 o
190.151 266.817 o
192.001 265.078 o
193.851 264.139 o
195.702 263.585 o
197.552 257.307 o
199.402 260 o
201.252 257.322 o
203.102 256.399 o
204.952 254.553 o
206.802 253.66 o
208.652 251.183 o
210.502 248.567 o
212.352 247.536 o
214.202 245.735 o
216.053 241.688 o
217.903 238.949 o
219.753 237.456 o
221.603 234.225 o
223.453 234.255 o
225.303 228.577 o
227.153 228.731 o
229.003 225.115 o
230.853 221.206 o
232.703 219.037 o
234.553 213.404 o
236.404 210.496 o
238.254 207.018 o
240.104 202.956 o
241.954 202.586 o
243.804 198.909 o
grestore
0.800 setlinewidth
0 setlinejoin
2 setlinecap
gsave
61.2 41.60625 m
61.2 284.425 l
stroke
grestore
gsave
252.499327 41.60625 m
252.499327 284.425 l
stroke
grestore
gsave
61.2 41.60625 m
252.499327 41.60625 l
stroke
grestore
gsave
61.2 284.425 m
252.499327 284.425 l
stroke
grestore
gsave
83.349663 290.425000 translate
0.000000 rotate
/STIXGeneral-Regular 12.0 selectfont
0.000000 0.671875 moveto
/i glyphshow
3.335999 0.671875 moveto
/n glyphshow
9.335983 0.671875 moveto
/t glyphshow
12.671982 0.671875 moveto
/e glyphshow
17.999969 0.671875 moveto
/r glyphshow
21.995956 0.671875 moveto
/n glyphshow
27.995941 0.671875 moveto
/o glyphshow
33.995926 0.671875 moveto
/d glyphshow
39.995911 0.671875 moveto
/a glyphshow
45.323898 0.671875 moveto
/l glyphshow
48.659897 0.671875 moveto
/space glyphshow
51.659882 0.671875 moveto
/d glyphshow
57.659866 0.671875 moveto
/i glyphshow
60.995865 0.671875 moveto
/s glyphshow
65.663849 0.671875 moveto
/t glyphshow
68.999847 0.671875 moveto
/a glyphshow
74.327835 0.671875 moveto
/n glyphshow
80.327820 0.671875 moveto
/c glyphshow
85.655807 0.671875 moveto
/e glyphshow
90.983795 0.671875 moveto
/space glyphshow
/Cmmi10 12.0 selectfont
93.983780 0.671875 moveto
/h glyphshow
/Cmmi10 8.399999999999999 selectfont
100.897842 -1.368875 moveto
/e glyphshow
/Cmsy10 12.0 selectfont
107.674842 0.671875 moveto
/approxequal glyphshow
/Cmr10 12.0 selectfont
119.104139 0.671875 moveto
/zero glyphshow
/Cmmi10 12.0 selectfont
125.104139 0.671875 moveto
/period glyphshow
/Cmr10 12.0 selectfont
128.426405 0.671875 moveto
/zero glyphshow
134.426405 0.671875 moveto
/two glyphshow
140.426405 0.671875 moveto
/eight glyphshow
grestore
1 setlinejoin
0.690 setgray
gsave
191.299 242.819 61.2 41.606 clipbox
61.2 47.55015 m
252.499327 47.55015 l
stroke
grestore
0 setlinecap
0.000 setgray
gsave
/o {
gsave
newpath
translate
0.8 setlinewidth
1 setlinejoin

0 setlinecap

0 0 m
3.5 0 l

gsave
0.000 setgray
fill
grestore
stroke
grestore
} bind def
252.499 47.5501 o
grestore
0.839 0.153 0.157 setrgbcolor
gsave
259.499327 43.448587 translate
0.000000 rotate
/STIXGeneral-Regular 12.0 selectfont
0.000000 0.890625 moveto
/zero glyphshow
grestore
2 setlinecap
0.690 setgray
gsave
191.299 242.819 61.2 41.606 clipbox
61.2 98.48331 m
252.499327 98.48331 l
stroke
grestore
0 setlinecap
0.000 setgray
gsave
/o {
gsave
newpath
translate
0.8 setlinewidth
1 setlinejoin

0 setlinecap

0 0 m
3.5 0 l

gsave
0.000 setgray
fill
grestore
stroke
grestore
} bind def
252.499 98.4833 o
grestore
0.839 0.153 0.157 setrgbcolor
gsave
259.499327 94.381748 translate
0.000000 rotate
/STIXGeneral-Regular 12.0 selectfont
0.000000 0.750000 moveto
/five glyphshow
5.999985 0.750000 moveto
/zero glyphshow
11.999969 0.750000 moveto
/zero glyphshow
grestore
2 setlinecap
0.690 setgray
gsave
191.299 242.819 61.2 41.606 clipbox
61.2 149.416471 m
252.499327 149.416471 l
stroke
grestore
0 setlinecap
0.000 setgray
gsave
/o {
gsave
newpath
translate
0.8 setlinewidth
1 setlinejoin

0 setlinecap

0 0 m
3.5 0 l

gsave
0.000 setgray
fill
grestore
stroke
grestore
} bind def
252.499 149.416 o
grestore
0.839 0.153 0.157 setrgbcolor
gsave
259.499327 145.314909 translate
0.000000 rotate
/STIXGeneral-Regular 12.0 selectfont
0.000000 0.890625 moveto
/one glyphshow
5.999985 0.890625 moveto
/zero glyphshow
11.999969 0.890625 moveto
/zero glyphshow
17.999954 0.890625 moveto
/zero glyphshow
grestore
2 setlinecap
0.690 setgray
gsave
191.299 242.819 61.2 41.606 clipbox
61.2 200.349632 m
252.499327 200.349632 l
stroke
grestore
0 setlinecap
0.000 setgray
gsave
/o {
gsave
newpath
translate
0.8 setlinewidth
1 setlinejoin

0 setlinecap

0 0 m
3.5 0 l

gsave
0.000 setgray
fill
grestore
stroke
grestore
} bind def
252.499 200.35 o
grestore
0.839 0.153 0.157 setrgbcolor
gsave
259.499327 196.248069 translate
0.000000 rotate
/STIXGeneral-Regular 12.0 selectfont
0.000000 0.750000 moveto
/one glyphshow
5.999985 0.750000 moveto
/five glyphshow
11.999969 0.750000 moveto
/zero glyphshow
17.999954 0.750000 moveto
/zero glyphshow
grestore
2 setlinecap
0.690 setgray
gsave
191.299 242.819 61.2 41.606 clipbox
61.2 251.282792 m
252.499327 251.282792 l
stroke
grestore
0 setlinecap
0.000 setgray
gsave
/o {
gsave
newpath
translate
0.8 setlinewidth
1 setlinejoin

0 setlinecap

0 0 m
3.5 0 l

gsave
0.000 setgray
fill
grestore
stroke
grestore
} bind def
252.499 251.283 o
grestore
0.839 0.153 0.157 setrgbcolor
gsave
259.499327 247.181230 translate
0.000000 rotate
/STIXGeneral-Regular 12.0 selectfont
0.000000 0.890625 moveto
/two glyphshow
5.999985 0.890625 moveto
/zero glyphshow
11.999969 0.890625 moveto
/zero glyphshow
17.999954 0.890625 moveto
/zero glyphshow
grestore
gsave
297.499327 138.015625 translate
90.000000 rotate
/Cmmi10 14.0 selectfont
0.000000 0.437500 moveto
/N glyphshow
/Cmmi10 9.799999999999999 selectfont
11.245117 -1.943375 moveto
/e glyphshow
15.800586 -1.943375 moveto
/n glyphshow
21.681543 -1.943375 moveto
/v glyphshow
26.423633 -1.943375 moveto
/e glyphshow
30.979102 -1.943375 moveto
/l glyphshow
33.898047 -1.943375 moveto
/o glyphshow
38.640137 -1.943375 moveto
/p glyphshow
43.568848 -1.943375 moveto
/e glyphshow
grestore
2.000 setlinewidth
2 setlinecap
0.000 setgray
gsave
191.299 242.819 61.2 41.606 clipbox
69.895424 52.643466 m
71.745514 55.495723 l
73.595604 58.653579 l
75.445695 61.607702 l
77.295785 64.459959 l
79.145875 67.006617 l
80.995965 69.553275 l
82.846055 72.2018 l
84.696146 74.748458 l
86.546236 76.989517 l
88.396326 79.536175 l
90.246416 81.8791 l
92.096506 84.222026 l
93.946597 86.463085 l
95.796687 88.80601 l
97.646777 90.843336 l
99.496867 93.186262 l
101.346957 95.529187 l
103.197048 97.566514 l
105.047138 99.909439 l
106.897228 101.946765 l
108.747318 104.085958 l
110.597408 106.428884 l
112.447499 108.568076 l
114.297589 110.605403 l
116.147679 112.744595 l
117.997769 114.883788 l
119.847859 117.022981 l
121.69795 119.26404 l
123.54804 121.403233 l
125.39813 123.542426 l
127.24822 125.783485 l
129.09831 128.024544 l
130.948401 130.265603 l
132.798491 132.506662 l
134.648581 134.849587 l
136.498671 136.785047 l
138.348761 139.026106 l
140.198852 141.369032 l
142.048942 143.711957 l
143.899032 145.749284 l
145.749122 148.194075 l
147.599212 150.537001 l
149.449303 152.676193 l
151.299393 155.120985 l
153.149483 157.260178 l
154.999573 159.70497 l
156.849663 161.844162 l
158.699754 164.39082 l
160.549844 166.937478 l
162.399934 169.178537 l
164.250024 171.31773 l
166.100114 173.966255 l
167.950205 176.207314 l
169.800295 178.855838 l
171.650385 181.198763 l
173.500475 183.847288 l
175.350565 186.190213 l
177.200656 188.533138 l
179.050746 191.283529 l
180.900836 193.626455 l
182.750926 195.96938 l
184.601016 198.719771 l
186.451107 201.164562 l
188.301197 203.507488 l
190.151287 206.359745 l
192.001377 208.804536 l
193.851467 211.147462 l
195.701558 213.592254 l
197.551648 216.037045 l
199.401738 218.991169 l
201.251828 221.43596 l
203.101919 223.880752 l
204.952009 226.42741 l
206.802099 228.872202 l
208.652189 231.41886 l
210.502279 233.863651 l
212.35237 236.410309 l
214.20246 238.956968 l
216.05255 241.503626 l
217.90264 244.050284 l
219.75273 246.08761 l
221.602821 248.736134 l
223.452911 250.875327 l
225.303001 253.523851 l
227.153091 255.663044 l
229.003181 257.904103 l
230.853272 260.145162 l
232.703362 261.978756 l
234.553452 264.321681 l
236.403542 266.257142 l
238.253632 268.192602 l
240.103723 269.61873 l
241.953813 271.757923 l
243.803903 273.387784 l
stroke
grestore
1.500 setlinewidth
0.839 0.153 0.157 setrgbcolor
gsave
191.299 242.819 61.2 41.606 clipbox
69.895424 52.643466 m
71.745514 55.495723 l
73.595604 58.653579 l
75.445695 61.607702 l
77.295785 64.459959 l
79.145875 67.006617 l
80.995965 69.553275 l
82.846055 72.2018 l
84.696146 74.748458 l
86.546236 76.989517 l
88.396326 79.536175 l
90.246416 81.8791 l
92.096506 84.222026 l
93.946597 86.463085 l
95.796687 88.80601 l
97.646777 90.843336 l
99.496867 93.186262 l
101.346957 95.529187 l
103.197048 97.566514 l
105.047138 99.909439 l
106.897228 101.946765 l
108.747318 104.085958 l
110.597408 106.428884 l
112.447499 108.568076 l
114.297589 110.605403 l
116.147679 112.744595 l
117.997769 114.883788 l
119.847859 117.022981 l
121.69795 119.26404 l
123.54804 121.403233 l
125.39813 123.542426 l
127.24822 125.783485 l
129.09831 128.024544 l
130.948401 130.265603 l
132.798491 132.506662 l
134.648581 134.849587 l
136.498671 136.785047 l
138.348761 139.026106 l
140.198852 141.369032 l
142.048942 143.711957 l
143.899032 145.749284 l
145.749122 148.194075 l
147.599212 150.537001 l
149.449303 152.676193 l
151.299393 155.120985 l
153.149483 157.260178 l
154.999573 159.70497 l
156.849663 161.844162 l
158.699754 164.39082 l
160.549844 166.937478 l
162.399934 169.178537 l
164.250024 171.31773 l
166.100114 173.966255 l
167.950205 176.207314 l
169.800295 178.855838 l
171.650385 181.198763 l
173.500475 183.847288 l
175.350565 186.190213 l
177.200656 188.533138 l
179.050746 191.283529 l
180.900836 193.626455 l
182.750926 195.96938 l
184.601016 198.719771 l
186.451107 201.164562 l
188.301197 203.507488 l
190.151287 206.359745 l
192.001377 208.804536 l
193.851467 211.147462 l
195.701558 213.592254 l
197.551648 216.037045 l
199.401738 218.991169 l
201.251828 221.43596 l
203.101919 223.880752 l
204.952009 226.42741 l
206.802099 228.872202 l
208.652189 231.41886 l
210.502279 233.863651 l
212.35237 236.410309 l
214.20246 238.956968 l
216.05255 241.503626 l
217.90264 244.050284 l
219.75273 246.08761 l
221.602821 248.736134 l
223.452911 250.875327 l
225.303001 253.523851 l
227.153091 255.663044 l
229.003181 257.904103 l
230.853272 260.145162 l
232.703362 261.978756 l
234.553452 264.321681 l
236.403542 266.257142 l
238.253632 268.192602 l
240.103723 269.61873 l
241.953813 271.757923 l
243.803903 273.387784 l
stroke
grestore
1.000 setlinewidth
0 setlinecap
gsave
191.299 242.819 61.2 41.606 clipbox
/o {
gsave
newpath
translate
1.0 setlinewidth
1 setlinejoin

0 setlinecap

0 -1.75 m
0.464105 -1.75 0.909265 -1.565609 1.237437 -1.237437 c
1.565609 -0.909265 1.75 -0.464105 1.75 0 c
1.75 0.464105 1.565609 0.909265 1.237437 1.237437 c
0.909265 1.565609 0.464105 1.75 0 1.75 c
-0.464105 1.75 -0.909265 1.565609 -1.237437 1.237437 c
-1.565609 0.909265 -1.75 0.464105 -1.75 0 c
-1.75 -0.464105 -1.565609 -0.909265 -1.237437 -1.237437 c
-0.909265 -1.565609 -0.464105 -1.75 0 -1.75 c
cl

gsave
0.839 0.153 0.157 setrgbcolor
fill
grestore
stroke
grestore
} bind def
69.8954 52.6435 o
71.7455 55.4957 o
73.5956 58.6536 o
75.4457 61.6077 o
77.2958 64.46 o
79.1459 67.0066 o
80.996 69.5533 o
82.8461 72.2018 o
84.6961 74.7485 o
86.5462 76.9895 o
88.3963 79.5362 o
90.2464 81.8791 o
92.0965 84.222 o
93.9466 86.4631 o
95.7967 88.806 o
97.6468 90.8433 o
99.4969 93.1863 o
101.347 95.5292 o
103.197 97.5665 o
105.047 99.9094 o
106.897 101.947 o
108.747 104.086 o
110.597 106.429 o
112.447 108.568 o
114.298 110.605 o
116.148 112.745 o
117.998 114.884 o
119.848 117.023 o
121.698 119.264 o
123.548 121.403 o
125.398 123.542 o
127.248 125.783 o
129.098 128.025 o
130.948 130.266 o
132.798 132.507 o
134.649 134.85 o
136.499 136.785 o
138.349 139.026 o
140.199 141.369 o
142.049 143.712 o
143.899 145.749 o
145.749 148.194 o
147.599 150.537 o
149.449 152.676 o
151.299 155.121 o
153.149 157.26 o
155 159.705 o
156.85 161.844 o
158.7 164.391 o
160.55 166.937 o
162.4 169.179 o
164.25 171.318 o
166.1 173.966 o
167.95 176.207 o
169.8 178.856 o
171.65 181.199 o
173.5 183.847 o
175.351 186.19 o
177.201 188.533 o
179.051 191.284 o
180.901 193.626 o
182.751 195.969 o
184.601 198.72 o
186.451 201.165 o
188.301 203.507 o
190.151 206.36 o
192.001 208.805 o
193.851 211.147 o
195.702 213.592 o
197.552 216.037 o
199.402 218.991 o
201.252 221.436 o
203.102 223.881 o
204.952 226.427 o
206.802 228.872 o
208.652 231.419 o
210.502 233.864 o
212.352 236.41 o
214.202 238.957 o
216.053 241.504 o
217.903 244.05 o
219.753 246.088 o
221.603 248.736 o
223.453 250.875 o
225.303 253.524 o
227.153 255.663 o
229.003 257.904 o
230.853 260.145 o
232.703 261.979 o
234.553 264.322 o
236.404 266.257 o
238.254 268.193 o
240.104 269.619 o
241.954 271.758 o
243.804 273.388 o
grestore
0.800 setlinewidth
0 setlinejoin
2 setlinecap
0.000 setgray
gsave
61.2 41.60625 m
61.2 284.425 l
stroke
grestore
gsave
252.499327 41.60625 m
252.499327 284.425 l
stroke
grestore
gsave
61.2 41.60625 m
252.499327 41.60625 l
stroke
grestore
gsave
61.2 284.425 m
252.499327 284.425 l
stroke
grestore

end
showpage
