Points_0,Points_1,Points_2
1.8999999762e+00,1.8836120367e+00,0.0000000000e+00
1.8836120367e+00,1.8999999762e+00,0.0000000000e+00
1.8920378685e+00,1.8920378685e+00,0.0000000000e+00
1.8920378685e+00,1.8920378685e+00,7.9620908946e-03
1.8999999762e+00,1.8836120367e+00,5.0000000745e-02
1.8836120367e+00,1.8999999762e+00,5.0000000745e-02
1.8920378685e+00,1.8920378685e+00,4.2037907988e-02
1.8920378685e+00,1.8920378685e+00,5.0000000745e-02
1.9200751781e+00,1.8700752258e+00,0.0000000000e+00
1.8700752258e+00,1.9200751781e+00,0.0000000000e+00
1.8703529835e+00,1.9201303720e+00,2.5000000373e-02
1.9201303720e+00,1.8703529835e+00,2.5000000373e-02
1.8700752258e+00,1.9200751781e+00,5.0000000745e-02
1.9200751781e+00,1.8700752258e+00,5.0000000745e-02
1.8500000238e+00,1.9446067810e+00,0.0000000000e+00
1.9446067810e+00,1.8500000238e+00,0.0000000000e+00
1.8500000238e+00,1.9446067810e+00,5.0000000745e-02
1.9446067810e+00,1.8500000238e+00,5.0000000745e-02
1.8478009701e+00,1.9478009939e+00,0.0000000000e+00
1.9478009939e+00,1.8478009701e+00,0.0000000000e+00
1.8478009701e+00,1.9478009939e+00,2.1989895031e-03
1.9478009939e+00,1.8478009701e+00,2.1989895031e-03
1.8459827900e+00,1.9500000477e+00,0.0000000000e+00
1.9500000477e+00,1.8459827900e+00,0.0000000000e+00
1.8478009701e+00,1.9478009939e+00,4.7801010311e-02
1.9478009939e+00,1.8478009701e+00,4.7801010311e-02
1.8478009701e+00,1.9478009939e+00,5.0000000745e-02
1.9478009939e+00,1.8478009701e+00,5.0000000745e-02
1.8459827900e+00,1.9500000477e+00,5.0000000745e-02
1.9500000477e+00,1.8459827900e+00,5.0000000745e-02
1.9558770657e+00,1.8441228867e+00,0.0000000000e+00
1.8441228867e+00,1.9558770657e+00,0.0000000000e+00
1.9558770657e+00,1.8441228867e+00,5.8770682663e-03
1.8441228867e+00,1.9558770657e+00,5.8770682663e-03
1.9558770657e+00,1.8441228867e+00,4.4122930616e-02
1.8441228867e+00,1.9558770657e+00,4.4122930616e-02
1.9558770657e+00,1.8441228867e+00,5.0000000745e-02
1.8441228867e+00,1.9558770657e+00,5.0000000745e-02
1.8303742409e+00,1.9803742170e+00,0.0000000000e+00
1.9803742170e+00,1.8303742409e+00,0.0000000000e+00
1.8303742409e+00,1.9803742170e+00,5.0000000745e-02
1.9803742170e+00,1.8303742409e+00,5.0000000745e-02
1.8300215006e+00,1.9820690155e+00,2.5000000373e-02
1.9820690155e+00,1.8300215006e+00,2.5000000373e-02
1.8165001869e+00,2.0000000000e+00,0.0000000000e+00
2.0000000000e+00,1.8165001869e+00,0.0000000000e+00
1.8165001869e+00,2.0000000000e+00,5.0000000745e-02
2.0000000000e+00,1.8165001869e+00,5.0000000745e-02
1.8141005039e+00,2.0141005516e+00,0.0000000000e+00
2.0141005516e+00,1.8141005039e+00,0.0000000000e+00
1.8141005039e+00,2.0141005516e+00,5.0000000745e-02
2.0141005516e+00,1.8141005039e+00,5.0000000745e-02
1.8126834631e+00,2.0177335739e+00,2.5000000373e-02
2.0177335739e+00,1.8126834631e+00,2.5000000373e-02
2.0487360954e+00,1.8012638092e+00,0.0000000000e+00
1.8012638092e+00,2.0487360954e+00,0.0000000000e+00
2.0487360954e+00,1.8012638092e+00,1.2638050830e-03
1.8012638092e+00,2.0487360954e+00,1.2638050830e-03
2.0487360954e+00,1.8012638092e+00,4.8736196011e-02
1.8012638092e+00,2.0487360954e+00,4.8736196011e-02
1.8005197048e+00,2.0499999523e+00,0.0000000000e+00
2.0499999523e+00,1.8005197048e+00,0.0000000000e+00
2.0487360954e+00,1.8012638092e+00,5.0000000745e-02
1.8012638092e+00,2.0487360954e+00,5.0000000745e-02
1.8005015850e+00,2.0505015850e+00,0.0000000000e+00
2.0505015850e+00,1.8005015850e+00,0.0000000000e+00
1.8005015850e+00,2.0505015850e+00,5.0155608915e-04
2.0505015850e+00,1.8005015850e+00,5.0155608915e-04
1.8005197048e+00,2.0499999523e+00,5.0000000745e-02
2.0499999523e+00,1.8005197048e+00,5.0000000745e-02
1.8005015850e+00,2.0505015850e+00,4.9498442560e-02
2.0505015850e+00,1.8005015850e+00,4.9498442560e-02
1.8005015850e+00,2.0505015850e+00,5.0000000745e-02
2.0505015850e+00,1.8005015850e+00,5.0000000745e-02
1.7999999523e+00,2.0525588989e+00,0.0000000000e+00
2.0525588989e+00,1.7999999523e+00,0.0000000000e+00
1.7999999523e+00,2.0525588989e+00,5.0000000745e-02
2.0525588989e+00,1.7999999523e+00,5.0000000745e-02
1.7933936119e+00,2.0750000477e+00,2.5000000373e-02
2.0750000477e+00,1.7933936119e+00,2.5000000373e-02
1.7901313305e+00,2.0901312828e+00,0.0000000000e+00
2.0901312828e+00,1.7901313305e+00,0.0000000000e+00
1.7901313305e+00,2.0901312828e+00,9.8686562851e-03
2.0901312828e+00,1.7901313305e+00,9.8686562851e-03
1.7901313305e+00,2.0901312828e+00,4.0131341666e-02
2.0901312828e+00,1.7901313305e+00,4.0131345391e-02
1.7901313305e+00,2.0901312828e+00,5.0000000745e-02
2.0901312828e+00,1.7901313305e+00,5.0000000745e-02
1.7854350805e+00,2.0999999046e+00,0.0000000000e+00
2.0999999046e+00,1.7854350805e+00,0.0000000000e+00
1.7854350805e+00,2.0999999046e+00,5.0000000745e-02
2.0999999046e+00,1.7854350805e+00,5.0000000745e-02
2.1128678322e+00,1.7871321440e+00,0.0000000000e+00
1.7871321440e+00,2.1128678322e+00,0.0000000000e+00
2.1128678322e+00,1.7871321440e+00,5.0000000745e-02
1.7871321440e+00,2.1128678322e+00,5.0000000745e-02
1.7853384018e+00,2.1239657402e+00,2.5000000373e-02
2.1239657402e+00,1.7853384018e+00,2.5000000373e-02
1.7840294838e+00,2.1340296268e+00,0.0000000000e+00
2.1340296268e+00,1.7840294838e+00,0.0000000000e+00
1.7840294838e+00,2.1340296268e+00,5.0000000745e-02
2.1340296268e+00,1.7840294838e+00,5.0000000745e-02
1.7779237032e+00,2.1500000954e+00,0.0000000000e+00
2.1500000954e+00,1.7779237032e+00,0.0000000000e+00
1.7779237032e+00,2.1500000954e+00,5.0000000745e-02
2.1500000954e+00,1.7779237032e+00,5.0000000745e-02
2.1679434776e+00,1.7820564508e+00,0.0000000000e+00
1.7820564508e+00,2.1679434776e+00,0.0000000000e+00
2.1679434776e+00,1.7820564508e+00,5.0000000745e-02
1.7820564508e+00,2.1679434776e+00,5.0000000745e-02
1.7816771269e+00,2.1748225689e+00,2.5000000373e-02
2.1748225689e+00,1.7816771269e+00,2.5000000373e-02
1.7815243006e+00,2.1815242767e+00,0.0000000000e+00
2.1815242767e+00,1.7815243006e+00,0.0000000000e+00
1.7815243006e+00,2.1815242767e+00,5.0000000745e-02
2.1815242767e+00,1.7815243006e+00,5.0000000745e-02
1.7760428190e+00,2.2000000477e+00,0.0000000000e+00
2.2000000477e+00,1.7760428190e+00,0.0000000000e+00
1.7760428190e+00,2.2000000477e+00,5.0000000745e-02
2.2000000477e+00,1.7760428190e+00,5.0000000745e-02
2.2181825638e+00,1.7818174362e+00,0.0000000000e+00
1.7818174362e+00,2.2181825638e+00,0.0000000000e+00
2.2181825638e+00,1.7818174362e+00,5.0000000745e-02
1.7818174362e+00,2.2181825638e+00,5.0000000745e-02
1.7820914984e+00,2.2252480984e+00,2.5000000373e-02
2.2252480984e+00,1.7820914984e+00,2.5000000373e-02
1.7825620174e+00,2.2325620651e+00,0.0000000000e+00
2.2325620651e+00,1.7825620174e+00,0.0000000000e+00
1.7825620174e+00,2.2325620651e+00,5.0000000745e-02
2.2325620651e+00,1.7825620174e+00,5.0000000745e-02
1.7786136866e+00,2.2500000000e+00,0.0000000000e+00
2.2500000000e+00,1.7786136866e+00,0.0000000000e+00
1.7786136866e+00,2.2500000000e+00,5.0000000745e-02
2.2500000000e+00,1.7786136866e+00,5.0000000745e-02
2.2654042244e+00,1.7845956087e+00,0.0000000000e+00
1.7845956087e+00,2.2654042244e+00,0.0000000000e+00
2.2654042244e+00,1.7845956087e+00,5.0000000745e-02
1.7845956087e+00,2.2654042244e+00,5.0000000745e-02
1.7857066393e+00,2.2758121490e+00,2.5000000373e-02
2.2758121490e+00,1.7857066393e+00,2.5000000373e-02
1.7870321274e+00,2.2870321274e+00,0.0000000000e+00
2.2870321274e+00,1.7870321274e+00,0.0000000000e+00
1.7870321274e+00,2.2870321274e+00,5.0000000745e-02
2.2870321274e+00,1.7870321274e+00,5.0000000745e-02
1.7845983505e+00,2.2999999523e+00,0.0000000000e+00
2.2999999523e+00,1.7845983505e+00,0.0000000000e+00
1.7845983505e+00,2.2999999523e+00,5.0000000745e-02
2.2999999523e+00,1.7845983505e+00,5.0000000745e-02
2.3107776642e+00,1.7892222404e+00,0.0000000000e+00
1.7892222404e+00,2.3107776642e+00,0.0000000000e+00
2.3107776642e+00,1.7892222404e+00,1.0777759366e-02
1.7892222404e+00,2.3107776642e+00,1.0777759366e-02
2.3107776642e+00,1.7892222404e+00,3.9222240448e-02
1.7892222404e+00,2.3107776642e+00,3.9222240448e-02
2.3107776642e+00,1.7892222404e+00,5.0000000745e-02
1.7892222404e+00,2.3107776642e+00,5.0000000745e-02
1.7911981344e+00,2.3250000477e+00,2.5000000373e-02
2.3250000477e+00,1.7911981344e+00,2.5000000373e-02
1.7933120728e+00,2.3433120251e+00,0.0000000000e+00
2.3433120251e+00,1.7933120728e+00,0.0000000000e+00
1.7933120728e+00,2.3433120251e+00,6.6879736260e-03
2.3433120251e+00,1.7933120728e+00,6.6879731603e-03
1.7933120728e+00,2.3433120251e+00,4.3312028050e-02
2.3433120251e+00,1.7933120728e+00,4.3312028050e-02
1.7933120728e+00,2.3433120251e+00,5.0000000745e-02
2.3433120251e+00,1.7933120728e+00,5.0000000745e-02
1.7919713259e+00,2.3499999046e+00,0.0000000000e+00
2.3499999046e+00,1.7919713259e+00,0.0000000000e+00
1.7919713259e+00,2.3499999046e+00,5.0000000745e-02
2.3499999046e+00,1.7919713259e+00,5.0000000745e-02
2.3556494713e+00,1.7943506241e+00,0.0000000000e+00
1.7943506241e+00,2.3556494713e+00,0.0000000000e+00
2.3556494713e+00,1.7943506241e+00,5.6494181044e-03
1.7943506241e+00,2.3556494713e+00,5.6494181044e-03
2.3556494713e+00,1.7943506241e+00,4.4350583106e-02
1.7943506241e+00,2.3556494713e+00,4.4350583106e-02
2.3556494713e+00,1.7943506241e+00,5.0000000745e-02
1.7943506241e+00,2.3556494713e+00,5.0000000745e-02
1.7967480421e+00,2.3750000000e+00,2.5000000373e-02
2.3750000000e+00,1.7967480421e+00,2.5000000373e-02
1.7979209423e+00,2.3979208469e+00,0.0000000000e+00
2.3979208469e+00,1.7979209423e+00,0.0000000000e+00
1.7979209423e+00,2.3979208469e+00,2.0790854469e-03
2.3979208469e+00,1.7979209423e+00,2.0790852141e-03
1.7979209423e+00,2.3979208469e+00,4.7920916229e-02
2.3979208469e+00,1.7979209423e+00,4.7920916229e-02
1.7979209423e+00,2.3979208469e+00,5.0000000745e-02
2.3979208469e+00,1.7979209423e+00,5.0000000745e-02
1.7973709106e+00,2.4000000954e+00,0.0000000000e+00
2.4000000954e+00,1.7973709106e+00,0.0000000000e+00
1.7973709106e+00,2.4000000954e+00,5.0000000745e-02
2.4000000954e+00,1.7973709106e+00,5.0000000745e-02
2.4019293785e+00,1.7980705500e+00,0.0000000000e+00
1.7980705500e+00,2.4019293785e+00,0.0000000000e+00
2.4019293785e+00,1.7980705500e+00,1.9294306403e-03
1.7980705500e+00,2.4019293785e+00,1.9294307567e-03
2.4019293785e+00,1.7980705500e+00,4.8070568591e-02
1.7980705500e+00,2.4019293785e+00,4.8070568591e-02
2.4019293785e+00,1.7980705500e+00,5.0000000745e-02
1.7980705500e+00,2.4019293785e+00,5.0000000745e-02
1.7992860079e+00,2.4249999523e+00,2.5000000373e-02
2.4249999523e+00,1.7992860079e+00,2.5000000373e-02
1.7986102104e+00,2.4486103058e+00,0.0000000000e+00
2.4486103058e+00,1.7986102104e+00,0.0000000000e+00
1.7986102104e+00,2.4486103058e+00,1.3898030156e-03
2.4486103058e+00,1.7986102104e+00,1.3898026664e-03
1.7986102104e+00,2.4486103058e+00,4.8610195518e-02
2.4486103058e+00,1.7986102104e+00,4.8610195518e-02
1.7986102104e+00,2.4486103058e+00,5.0000000745e-02
2.4486103058e+00,1.7986102104e+00,5.0000000745e-02
1.7981371880e+00,2.4500000477e+00,0.0000000000e+00
2.4500000477e+00,1.7981371880e+00,0.0000000000e+00
1.7981371880e+00,2.4500000477e+00,5.0000000745e-02
2.4500000477e+00,1.7981371880e+00,5.0000000745e-02
2.4514455795e+00,1.7985544205e+00,0.0000000000e+00
1.7985544205e+00,2.4514455795e+00,0.0000000000e+00
2.4514455795e+00,1.7985544205e+00,1.4455390628e-03
1.7985544205e+00,2.4514455795e+00,1.4455394121e-03
2.4514455795e+00,1.7985544205e+00,4.8554461449e-02
1.7985544205e+00,2.4514455795e+00,4.8554461449e-02
2.4514455795e+00,1.7985544205e+00,5.0000000745e-02
1.7985544205e+00,2.4514455795e+00,5.0000000745e-02
1.7978918552e+00,2.4749999046e+00,2.5000000373e-02
2.4749999046e+00,1.7978918552e+00,2.5000000373e-02
1.7962007523e+00,2.4962007999e+00,0.0000000000e+00
2.4962007999e+00,1.7962007523e+00,0.0000000000e+00
1.7962007523e+00,2.4962007999e+00,3.7992815487e-03
2.4962007999e+00,1.7962007523e+00,3.7992810830e-03
1.7962007523e+00,2.4962007999e+00,4.6200718731e-02
2.4962007999e+00,1.7962007523e+00,4.6200718731e-02
1.7962007523e+00,2.4962007999e+00,5.0000000745e-02
2.4962007999e+00,1.7962007523e+00,5.0000000745e-02
1.7947367430e+00,2.5000000000e+00,0.0000000000e+00
2.5000000000e+00,1.7947367430e+00,0.0000000000e+00
1.7947367430e+00,2.5000000000e+00,5.0000000745e-02
2.5000000000e+00,1.7947367430e+00,5.0000000745e-02
2.5042386055e+00,1.7957614660e+00,0.0000000000e+00
1.7957614660e+00,2.5042386055e+00,0.0000000000e+00
2.5042386055e+00,1.7957614660e+00,4.2385575362e-03
1.7957614660e+00,2.5042386055e+00,4.2385580018e-03
2.5042386055e+00,1.7957614660e+00,4.5761443675e-02
1.7957614660e+00,2.5042386055e+00,4.5761443675e-02
2.5042386055e+00,1.7957614660e+00,5.0000000745e-02
1.7957614660e+00,2.5042386055e+00,5.0000000745e-02
1.7941806316e+00,2.5250000954e+00,2.5000000373e-02
2.5250000954e+00,1.7941806316e+00,2.5000000373e-02
1.7925131321e+00,2.5425131321e+00,0.0000000000e+00
2.5425131321e+00,1.7925131321e+00,0.0000000000e+00
1.7925131321e+00,2.5425131321e+00,7.4869082309e-03
2.5425131321e+00,1.7925131321e+00,7.4869077653e-03
1.7925131321e+00,2.5425131321e+00,4.2513091117e-02
2.5425131321e+00,1.7925131321e+00,4.2513091117e-02
1.7925131321e+00,2.5425131321e+00,5.0000000745e-02
2.5425131321e+00,1.7925131321e+00,5.0000000745e-02
1.7895464897e+00,2.5499999523e+00,0.0000000000e+00
2.5499999523e+00,1.7895464897e+00,0.0000000000e+00
1.7895464897e+00,2.5499999523e+00,5.0000000745e-02
2.5499999523e+00,1.7895464897e+00,5.0000000745e-02
2.5585210323e+00,1.7914789915e+00,0.0000000000e+00
1.7914789915e+00,2.5585210323e+00,0.0000000000e+00
2.5585210323e+00,1.7914789915e+00,8.5210176185e-03
1.7914789915e+00,2.5585210323e+00,8.5210185498e-03
2.5585210323e+00,1.7914789915e+00,4.1478980333e-02
1.7914789915e+00,2.5585210323e+00,4.1478980333e-02
2.5585210323e+00,1.7914789915e+00,5.0000000745e-02
1.7914789915e+00,2.5585210323e+00,5.0000000745e-02
1.7899951935e+00,2.5750000477e+00,2.5000000373e-02
2.5750000477e+00,1.7899951935e+00,2.5000000373e-02
1.7886825800e+00,2.5886826515e+00,0.0000000000e+00
2.5886826515e+00,1.7886825800e+00,0.0000000000e+00
1.7886825800e+00,2.5886826515e+00,1.1317395605e-02
2.5886826515e+00,1.7886825800e+00,1.1317394674e-02
1.7886825800e+00,2.5886826515e+00,3.8682606071e-02
2.5886826515e+00,1.7886825800e+00,3.8682606071e-02
1.7886825800e+00,2.5886826515e+00,5.0000000745e-02
2.5886826515e+00,1.7886825800e+00,5.0000000745e-02
1.7842123508e+00,2.5999999046e+00,0.0000000000e+00
2.5999999046e+00,1.7842123508e+00,0.0000000000e+00
1.7842123508e+00,2.5999999046e+00,5.0000000745e-02
2.5999999046e+00,1.7842123508e+00,5.0000000745e-02
2.6128966808e+00,1.7871034145e+00,0.0000000000e+00
1.7871034145e+00,2.6128966808e+00,0.0000000000e+00
2.6128966808e+00,1.7871034145e+00,5.0000000745e-02
1.7871034145e+00,2.6128966808e+00,5.0000000745e-02
1.7860367298e+00,2.6242992878e+00,2.5000000373e-02
2.6242992878e+00,1.7860367298e+00,2.5000000373e-02
1.7850011587e+00,2.6350011826e+00,0.0000000000e+00
2.6350011826e+00,1.7850011587e+00,0.0000000000e+00
1.7850011587e+00,2.6350011826e+00,5.0000000745e-02
2.6350011826e+00,1.7850011587e+00,5.0000000745e-02
1.7790329456e+00,2.6500000954e+00,0.0000000000e+00
2.6500000954e+00,1.7790329456e+00,0.0000000000e+00
1.7790329456e+00,2.6500000954e+00,5.0000000745e-02
2.6500000954e+00,1.7790329456e+00,5.0000000745e-02
2.6672160625e+00,1.7827839851e+00,0.0000000000e+00
1.7827839851e+00,2.6672160625e+00,0.0000000000e+00
1.7827839851e+00,2.6672160625e+00,5.0000000745e-02
2.6672160625e+00,1.7827839851e+00,5.0000000745e-02
1.7820498943e+00,2.6745119095e+00,2.5000000373e-02
2.6745119095e+00,1.7820498943e+00,2.5000000373e-02
1.7813198566e+00,2.6813199520e+00,0.0000000000e+00
2.6813199520e+00,1.7813198566e+00,0.0000000000e+00
1.7813198566e+00,2.6813199520e+00,5.0000000745e-02
2.6813199520e+00,1.7813198566e+00,5.0000000745e-02
1.7736756802e+00,2.7000000477e+00,0.0000000000e+00
2.7000000477e+00,1.7736756802e+00,0.0000000000e+00
1.7736756802e+00,2.7000000477e+00,5.0000000745e-02
2.7000000477e+00,1.7736756802e+00,5.0000000745e-02
2.7218918800e+00,1.7781082392e+00,0.0000000000e+00
1.7781082392e+00,2.7218918800e+00,0.0000000000e+00
2.7218918800e+00,1.7781082392e+00,5.0000000745e-02
1.7781082392e+00,2.7218918800e+00,5.0000000745e-02
1.7777743340e+00,2.7247776985e+00,2.5000000373e-02
2.7247776985e+00,1.7777743340e+00,2.5000000373e-02
1.7774416208e+00,2.7274415493e+00,0.0000000000e+00
2.7274415493e+00,1.7774416208e+00,0.0000000000e+00
1.7774416208e+00,2.7274415493e+00,5.0000000745e-02
2.7274415493e+00,1.7774416208e+00,5.0000000745e-02
1.7678523064e+00,2.7500000000e+00,0.0000000000e+00
2.7500000000e+00,1.7678523064e+00,0.0000000000e+00
1.7678523064e+00,2.7500000000e+00,5.0000000745e-02
2.7500000000e+00,1.7678523064e+00,5.0000000745e-02
1.7717996836e+00,2.7717998028e+00,0.0000000000e+00
2.7717998028e+00,1.7717996836e+00,0.0000000000e+00
1.7717996836e+00,2.7717998028e+00,5.0000000745e-02
2.7717998028e+00,1.7717996836e+00,5.0000000745e-02
1.7716073990e+00,2.7734367847e+00,2.5000000373e-02
2.7734367847e+00,1.7716073990e+00,2.5000000373e-02
2.7793080807e+00,1.7706918716e+00,0.0000000000e+00
1.7706918716e+00,2.7793080807e+00,0.0000000000e+00
2.7793080807e+00,1.7706918716e+00,5.0000000745e-02
1.7706918716e+00,2.7793080807e+00,5.0000000745e-02
1.7615944147e+00,2.7999999523e+00,0.0000000000e+00
2.7999999523e+00,1.7615944147e+00,0.0000000000e+00
1.7615944147e+00,2.7999999523e+00,5.0000000745e-02
2.7999999523e+00,1.7615944147e+00,5.0000000745e-02
1.7637968063e+00,2.8137967587e+00,0.0000000000e+00
2.8137967587e+00,1.7637968063e+00,0.0000000000e+00
1.7637968063e+00,2.8137967587e+00,5.0000000745e-02
2.8137967587e+00,1.7637968063e+00,5.0000000745e-02
1.7632483244e+00,2.8175313473e+00,2.5000000373e-02
2.8175313473e+00,1.7632483244e+00,2.5000000373e-02
2.8406317234e+00,1.7593683004e+00,0.0000000000e+00
1.7593683004e+00,2.8406317234e+00,0.0000000000e+00
2.8406317234e+00,1.7593683004e+00,9.3682967126e-03
1.7593683004e+00,2.8406317234e+00,9.3682929873e-03
2.8406317234e+00,1.7593683004e+00,4.0631704032e-02
1.7593683004e+00,2.8406317234e+00,4.0631707758e-02
2.8406317234e+00,1.7593683004e+00,5.0000000745e-02
1.7593683004e+00,2.8406317234e+00,5.0000000745e-02
1.7551490068e+00,2.8499999046e+00,0.0000000000e+00
2.8499999046e+00,1.7551490068e+00,0.0000000000e+00
1.7551490068e+00,2.8499999046e+00,5.0000000745e-02
2.8499999046e+00,1.7551490068e+00,5.0000000745e-02
1.7559918165e+00,2.8559918404e+00,0.0000000000e+00
2.8559918404e+00,1.7559918165e+00,0.0000000000e+00
1.7559918165e+00,2.8559918404e+00,5.9918430634e-03
2.8559918404e+00,1.7559918165e+00,5.9918458574e-03
1.7559918165e+00,2.8559918404e+00,4.4008158147e-02
2.8559918404e+00,1.7559918165e+00,4.4008154422e-02
1.7559918165e+00,2.8559918404e+00,5.0000000745e-02
2.8559918404e+00,1.7559918165e+00,5.0000000745e-02
1.7529351711e+00,2.8750000000e+00,2.5000000373e-02
2.8750000000e+00,1.7529351711e+00,2.5000000373e-02
1.7500000000e+00,2.8893094063e+00,0.0000000000e+00
2.8893094063e+00,1.7500000000e+00,0.0000000000e+00
1.7500000000e+00,2.8893094063e+00,5.0000000745e-02
2.8893094063e+00,1.7500000000e+00,5.0000000745e-02
1.7484145164e+00,2.8984146118e+00,0.0000000000e+00
2.8984146118e+00,1.7484145164e+00,0.0000000000e+00
1.7484145164e+00,2.8984146118e+00,1.5854873927e-03
2.8984146118e+00,1.7484145164e+00,1.5854836674e-03
1.7484145164e+00,2.8984146118e+00,4.8414513469e-02
2.8984146118e+00,1.7484145164e+00,4.8414517194e-02
1.7484145164e+00,2.8984146118e+00,5.0000000745e-02
2.8984146118e+00,1.7484145164e+00,5.0000000745e-02
1.7476559877e+00,2.9000000954e+00,0.0000000000e+00
2.9000000954e+00,1.7476559877e+00,0.0000000000e+00
1.7476559877e+00,2.9000000954e+00,5.0000000745e-02
2.9000000954e+00,1.7476559877e+00,5.0000000745e-02
2.9020504951e+00,1.7479494810e+00,0.0000000000e+00
1.7479493618e+00,2.9020504951e+00,0.0000000000e+00
2.9020504951e+00,1.7479494810e+00,2.0505748689e-03
1.7479493618e+00,2.9020504951e+00,2.0505795255e-03
2.9020504951e+00,1.7479494810e+00,4.7949425876e-02
1.7479493618e+00,2.9020504951e+00,4.7949422151e-02
2.9020504951e+00,1.7479494810e+00,5.0000000745e-02
1.7479493618e+00,2.9020504951e+00,5.0000000745e-02
1.7439774275e+00,2.9249999523e+00,2.5000000373e-02
2.9249999523e+00,1.7439774275e+00,2.5000000373e-02
1.7406874895e+00,2.9406876564e+00,0.0000000000e+00
2.9406876564e+00,1.7406874895e+00,0.0000000000e+00
1.7406874895e+00,2.9406876564e+00,9.3124574050e-03
2.9406876564e+00,1.7406874895e+00,9.3124536797e-03
1.7406874895e+00,2.9406876564e+00,4.0687542409e-02
2.9406876564e+00,1.7406874895e+00,4.0687546134e-02
1.7406874895e+00,2.9406876564e+00,5.0000000745e-02
2.9406876564e+00,1.7406874895e+00,5.0000000745e-02
1.7361326218e+00,2.9500000477e+00,0.0000000000e+00
2.9500000477e+00,1.7361326218e+00,0.0000000000e+00
1.7361326218e+00,2.9500000477e+00,5.0000000745e-02
2.9500000477e+00,1.7361326218e+00,5.0000000745e-02
2.9623367786e+00,1.7376631498e+00,0.0000000000e+00
1.7376631498e+00,2.9623367786e+00,0.0000000000e+00
2.9623367786e+00,1.7376631498e+00,1.2336844578e-02
1.7376631498e+00,2.9623367786e+00,1.2336849235e-02
2.9623367786e+00,1.7376631498e+00,3.7663154304e-02
1.7376631498e+00,2.9623367786e+00,3.7663150579e-02
2.9623367786e+00,1.7376631498e+00,5.0000000745e-02
1.7376631498e+00,2.9623367786e+00,5.0000000745e-02
1.7340223789e+00,2.9805896282e+00,2.5000000373e-02
2.9805896282e+00,1.7340223789e+00,2.5000000373e-02
1.7333846092e+00,2.9833846092e+00,0.0000000000e+00
2.9833846092e+00,1.7333846092e+00,0.0000000000e+00
1.7333846092e+00,2.9833846092e+00,5.0000000745e-02
2.9833846092e+00,1.7333846092e+00,5.0000000745e-02
1.7250503302e+00,3.0000000000e+00,0.0000000000e+00
3.0000000000e+00,1.7250503302e+00,0.0000000000e+00
1.7250503302e+00,3.0000000000e+00,5.0000000745e-02
3.0000000000e+00,1.7250503302e+00,5.0000000745e-02
3.0226204395e+00,1.7273796797e+00,0.0000000000e+00
1.7273796797e+00,3.0226204395e+00,0.0000000000e+00
3.0226204395e+00,1.7273796797e+00,5.0000000745e-02
1.7273796797e+00,3.0226204395e+00,5.0000000745e-02
1.7267503738e+00,3.0256876945e+00,2.5000000373e-02
3.0256876945e+00,1.7267503738e+00,2.5000000373e-02
1.7265235186e+00,3.0265235901e+00,0.0000000000e+00
3.0265235901e+00,1.7265235186e+00,0.0000000000e+00
1.7265235186e+00,3.0265235901e+00,5.0000000745e-02
3.0265235901e+00,1.7265235186e+00,5.0000000745e-02
1.7144829035e+00,3.0499999523e+00,0.0000000000e+00
3.0499999523e+00,1.7144829035e+00,0.0000000000e+00
1.7144829035e+00,3.0499999523e+00,5.0000000745e-02
3.0499999523e+00,1.7144829035e+00,5.0000000745e-02
1.7157726288e+00,3.0657725334e+00,0.0000000000e+00
3.0657725334e+00,1.7157726288e+00,0.0000000000e+00
1.7157726288e+00,3.0657725334e+00,5.0000000745e-02
3.0657725334e+00,1.7157726288e+00,5.0000000745e-02
1.7150937319e+00,3.0688483715e+00,2.5000000373e-02
3.0688483715e+00,1.7150937319e+00,2.5000000373e-02
3.0904431343e+00,1.7095568180e+00,0.0000000000e+00
1.7095568180e+00,3.0904431343e+00,0.0000000000e+00
3.0904431343e+00,1.7095568180e+00,9.5568569377e-03
1.7095568180e+00,3.0904431343e+00,9.5568485558e-03
3.0904431343e+00,1.7095568180e+00,4.0443144739e-02
1.7095568180e+00,3.0904431343e+00,4.0443152189e-02
3.0904431343e+00,1.7095568180e+00,5.0000000745e-02
1.7095568180e+00,3.0904431343e+00,5.0000000745e-02
1.7045731544e+00,3.0999999046e+00,0.0000000000e+00
3.0999999046e+00,1.7045731544e+00,0.0000000000e+00
1.7045731544e+00,3.0999999046e+00,5.0000000745e-02
3.0999999046e+00,1.7045731544e+00,5.0000000745e-02
1.7048703432e+00,3.1048703194e+00,0.0000000000e+00
3.1048703194e+00,1.7048703432e+00,0.0000000000e+00
1.7048703432e+00,3.1048703194e+00,4.8703947105e-03
3.1048703194e+00,1.7048703432e+00,4.8703989014e-03
1.7048703432e+00,3.1048703194e+00,4.5129604638e-02
3.1048703194e+00,1.7048703432e+00,4.5129600912e-02
1.7048703432e+00,3.1048703194e+00,5.0000000745e-02
3.1048703194e+00,1.7048703432e+00,5.0000000745e-02
1.7000000477e+00,3.1231136322e+00,0.0000000000e+00
3.1231136322e+00,1.7000000477e+00,0.0000000000e+00
1.7000000477e+00,3.1231136322e+00,5.0000000745e-02
3.1231136322e+00,1.7000000477e+00,5.0000000745e-02
1.7001770735e+00,3.1250000000e+00,2.5000000373e-02
3.1250000000e+00,1.7001770735e+00,2.5000000373e-02
1.6945697069e+00,3.1445696354e+00,0.0000000000e+00
3.1445696354e+00,1.6945697069e+00,0.0000000000e+00
1.6945697069e+00,3.1445696354e+00,5.4303081706e-03
3.1445696354e+00,1.6945697069e+00,5.4303035140e-03
1.6945697069e+00,3.1445696354e+00,4.4569693506e-02
3.1445696354e+00,1.6945697069e+00,4.4569697231e-02
1.6945697069e+00,3.1445696354e+00,5.0000000745e-02
3.1445696354e+00,1.6945697069e+00,5.0000000745e-02
1.6915878057e+00,3.1500000954e+00,0.0000000000e+00
3.1500000954e+00,1.6915878057e+00,0.0000000000e+00
1.6915878057e+00,3.1500000954e+00,5.0000000745e-02
3.1500000954e+00,1.6915878057e+00,5.0000000745e-02
3.1579310894e+00,1.6920689344e+00,0.0000000000e+00
1.6920689344e+00,3.1579310894e+00,0.0000000000e+00
3.1579310894e+00,1.6920689344e+00,7.9311113805e-03
1.6920689344e+00,3.1579310894e+00,7.9311188310e-03
3.1579310894e+00,1.6920689344e+00,4.2068887502e-02
1.6920689344e+00,3.1579310894e+00,4.2068880051e-02
3.1579310894e+00,1.6920689344e+00,5.0000000745e-02
1.6920689344e+00,3.1579310894e+00,5.0000000745e-02
1.6858834028e+00,3.1815903187e+00,2.5000000373e-02
3.1815903187e+00,1.6858834028e+00,2.5000000373e-02
1.6848855019e+00,3.1848855019e+00,0.0000000000e+00
3.1848855019e+00,1.6848855019e+00,0.0000000000e+00
1.6848855019e+00,3.1848855019e+00,5.0000000745e-02
3.1848855019e+00,1.6848855019e+00,5.0000000745e-02
1.6764488220e+00,3.2000000477e+00,0.0000000000e+00
3.2000000477e+00,1.6764488220e+00,0.0000000000e+00
1.6764488220e+00,3.2000000477e+00,5.0000000745e-02
3.2000000477e+00,1.6764488220e+00,5.0000000745e-02
3.2226481438e+00,1.6773518324e+00,0.0000000000e+00
1.6773518324e+00,3.2226481438e+00,0.0000000000e+00
3.2226481438e+00,1.6773518324e+00,5.0000000745e-02
1.6773518324e+00,3.2226481438e+00,5.0000000745e-02
1.6766216755e+00,3.2254076004e+00,2.5000000373e-02
3.2254076004e+00,1.6766216755e+00,2.5000000373e-02
1.6763234138e+00,3.2263233662e+00,0.0000000000e+00
3.2263233662e+00,1.6763234138e+00,0.0000000000e+00
1.6763234138e+00,3.2263233662e+00,5.0000000745e-02
3.2263233662e+00,1.6763234138e+00,5.0000000745e-02
1.6629210711e+00,3.2500000000e+00,0.0000000000e+00
3.2500000000e+00,1.6629210711e+00,0.0000000000e+00
1.6629210711e+00,3.2500000000e+00,5.0000000745e-02
3.2500000000e+00,1.6629210711e+00,5.0000000745e-02
1.6631772518e+00,3.2631773949e+00,0.0000000000e+00
3.2631773949e+00,1.6631772518e+00,0.0000000000e+00
1.6631772518e+00,3.2631773949e+00,5.0000000745e-02
3.2631773949e+00,1.6631772518e+00,5.0000000745e-02
1.6620968580e+00,3.2671182156e+00,2.5000000373e-02
3.2671182156e+00,1.6620968580e+00,2.5000000373e-02
3.2978131771e+00,1.6521867514e+00,0.0000000000e+00
1.6521867514e+00,3.2978131771e+00,0.0000000000e+00
3.2978131771e+00,1.6521867514e+00,2.1867470350e-03
1.6521867514e+00,3.2978131771e+00,2.1867337637e-03
3.2978131771e+00,1.6521867514e+00,4.7813251615e-02
1.6521867514e+00,3.2978131771e+00,4.7813266516e-02
3.2978131771e+00,1.6521867514e+00,5.0000000745e-02
1.6521867514e+00,3.2978131771e+00,5.0000000745e-02
1.6509387493e+00,3.2999999523e+00,0.0000000000e+00
3.2999999523e+00,1.6509387493e+00,0.0000000000e+00
1.6509387493e+00,3.2999999523e+00,5.0000000745e-02
3.2999999523e+00,1.6509387493e+00,5.0000000745e-02
1.6509385109e+00,3.3009386063e+00,0.0000000000e+00
3.3009386063e+00,1.6509385109e+00,0.0000000000e+00
1.6509385109e+00,3.3009386063e+00,9.3854503939e-04
3.3009386063e+00,1.6509385109e+00,9.3855074374e-04
1.6509385109e+00,3.3009386063e+00,4.9061454833e-02
3.3009386063e+00,1.6509385109e+00,4.9061451107e-02
1.6509385109e+00,3.3009386063e+00,5.0000000745e-02
3.3009386063e+00,1.6509385109e+00,5.0000000745e-02
1.6499999762e+00,3.3037912846e+00,0.0000000000e+00
3.3037912846e+00,1.6499999762e+00,0.0000000000e+00
1.6499999762e+00,3.3037912846e+00,5.0000000745e-02
3.3037912846e+00,1.6499999762e+00,5.0000000745e-02
1.6441206932e+00,3.3250000477e+00,2.5000000373e-02
3.3250000477e+00,1.6441206932e+00,2.5000000373e-02
1.6391419172e+00,3.3391420841e+00,0.0000000000e+00
3.3391420841e+00,1.6391420364e+00,0.0000000000e+00
1.6391419172e+00,3.3391420841e+00,1.0858027264e-02
3.3391420841e+00,1.6391420364e+00,1.0858021677e-02
1.6391419172e+00,3.3391420841e+00,3.9141971618e-02
3.3391420841e+00,1.6391420364e+00,3.9141979069e-02
1.6391419172e+00,3.3391420841e+00,5.0000000745e-02
3.3391420841e+00,1.6391420364e+00,5.0000000745e-02
1.6326885223e+00,3.3499999046e+00,0.0000000000e+00
3.3499999046e+00,1.6326885223e+00,0.0000000000e+00
1.6326885223e+00,3.3499999046e+00,5.0000000745e-02
3.3499999046e+00,1.6326885223e+00,5.0000000745e-02
3.3672845364e+00,1.6327153444e+00,0.0000000000e+00
1.6327153444e+00,3.3672847748e+00,0.0000000000e+00
3.3672845364e+00,1.6327153444e+00,5.0000000745e-02
1.6327153444e+00,3.3672847748e+00,5.0000000745e-02
1.6301106215e+00,3.3759205341e+00,2.5000000373e-02
3.3759205341e+00,1.6301106215e+00,2.5000000373e-02
1.6289968491e+00,3.3789968491e+00,0.0000000000e+00
3.3789968491e+00,1.6289968491e+00,0.0000000000e+00
1.6289968491e+00,3.3789968491e+00,5.0000000745e-02
3.3789968491e+00,1.6289968491e+00,5.0000000745e-02
1.6163839102e+00,3.4000000954e+00,0.0000000000e+00
3.4000000954e+00,1.6163839102e+00,0.0000000000e+00
1.6163839102e+00,3.4000000954e+00,5.0000000745e-02
3.4000000954e+00,1.6163839102e+00,5.0000000745e-02
1.6160963774e+00,3.4160964489e+00,0.0000000000e+00
3.4160964489e+00,1.6160963774e+00,0.0000000000e+00
1.6160963774e+00,3.4160964489e+00,5.0000000745e-02
3.4160964489e+00,1.6160963774e+00,5.0000000745e-02
1.6151864529e+00,3.4190642834e+00,2.5000000373e-02
3.4190642834e+00,1.6151864529e+00,2.5000000373e-02
3.4439167976e+00,1.6060831547e+00,0.0000000000e+00
1.6060831547e+00,3.4439167976e+00,0.0000000000e+00
3.4439167976e+00,1.6060831547e+00,6.0831815936e-03
1.6060831547e+00,3.4439167976e+00,6.0831680894e-03
3.4439167976e+00,1.6060831547e+00,4.3916817755e-02
1.6060831547e+00,3.4439167976e+00,4.3916832656e-02
3.4439167976e+00,1.6060831547e+00,5.0000000745e-02
1.6060831547e+00,3.4439167976e+00,5.0000000745e-02
1.6024106741e+00,3.4500000477e+00,0.0000000000e+00
3.4500000477e+00,1.6024106741e+00,0.0000000000e+00
1.6024106741e+00,3.4500000477e+00,5.0000000745e-02
3.4500000477e+00,1.6024106741e+00,5.0000000745e-02
1.6023250818e+00,3.4523251057e+00,0.0000000000e+00
3.4523251057e+00,1.6023250818e+00,0.0000000000e+00
1.6023250818e+00,3.4523251057e+00,2.3251329549e-03
3.4523251057e+00,1.6023250818e+00,2.3251380771e-03
1.6023250818e+00,3.4523251057e+00,4.7674868256e-02
3.4523251057e+00,1.6023250818e+00,4.7674860805e-02
1.6023250818e+00,3.4523251057e+00,5.0000000745e-02
3.4523251057e+00,1.6023250818e+00,5.0000000745e-02
1.6000000238e+00,3.4586253166e+00,0.0000000000e+00
3.4586253166e+00,1.6000000238e+00,0.0000000000e+00
1.6000000238e+00,3.4586253166e+00,5.0000000745e-02
3.4586253166e+00,1.6000000238e+00,5.0000000745e-02
1.5951923132e+00,3.4749999046e+00,2.5000000373e-02
3.4749999046e+00,1.5951923132e+00,2.5000000373e-02
1.5894833803e+00,3.4894833565e+00,0.0000000000e+00
3.4894833565e+00,1.5894834995e+00,0.0000000000e+00
1.5894833803e+00,3.4894833565e+00,1.0516560636e-02
3.4894833565e+00,1.5894834995e+00,1.0516555980e-02
1.5894833803e+00,3.4894833565e+00,3.9483439177e-02
3.4894833565e+00,1.5894834995e+00,3.9483442903e-02
1.5894833803e+00,3.4894833565e+00,5.0000000745e-02
3.4894833565e+00,1.5894834995e+00,5.0000000745e-02
1.5829229355e+00,3.5000000000e+00,0.0000000000e+00
3.5000000000e+00,1.5829229355e+00,0.0000000000e+00
1.5829229355e+00,3.5000000000e+00,5.0000000745e-02
3.5000000000e+00,1.5829229355e+00,5.0000000745e-02
3.5176646709e+00,1.5823353529e+00,0.0000000000e+00
1.5823353529e+00,3.5176646709e+00,0.0000000000e+00
3.5176646709e+00,1.5823353529e+00,5.0000000745e-02
1.5823353529e+00,3.5176646709e+00,5.0000000745e-02
1.5796995163e+00,3.5255935192e+00,2.5000000373e-02
3.5255935192e+00,1.5796995163e+00,2.5000000373e-02
1.5785428286e+00,3.5285429955e+00,0.0000000000e+00
3.5285429955e+00,1.5785428286e+00,0.0000000000e+00
1.5785428286e+00,3.5285429955e+00,5.0000000745e-02
3.5285429955e+00,1.5785428286e+00,5.0000000745e-02
1.5650769472e+00,3.5499999523e+00,0.0000000000e+00
3.5499999523e+00,1.5650769472e+00,0.0000000000e+00
1.5650769472e+00,3.5499999523e+00,5.0000000745e-02
3.5499999523e+00,1.5650769472e+00,5.0000000745e-02
1.5643411875e+00,3.5643410683e+00,0.0000000000e+00
3.5643410683e+00,1.5643411875e+00,0.0000000000e+00
1.5643411875e+00,3.5643410683e+00,5.0000000745e-02
3.5643410683e+00,1.5643411875e+00,5.0000000745e-02
1.5631582737e+00,3.5678939819e+00,2.5000000373e-02
3.5678939819e+00,1.5631582737e+00,2.5000000373e-02
3.5995934010e+00,1.5504066944e+00,0.0000000000e+00
1.5504065752e+00,3.5995934010e+00,0.0000000000e+00
3.5995934010e+00,1.5504066944e+00,4.0664631524e-04
1.5504065752e+00,3.5995934010e+00,4.0663278196e-04
1.5501508713e+00,3.5999999046e+00,0.0000000000e+00
3.5999999046e+00,1.5501508713e+00,0.0000000000e+00
3.5995934010e+00,1.5504066944e+00,4.9593355507e-02
1.5504065752e+00,3.5995934010e+00,4.9593366683e-02
3.5995934010e+00,1.5504066944e+00,5.0000000745e-02
1.5504065752e+00,3.5995934010e+00,5.0000000745e-02
1.5501410961e+00,3.6001410484e+00,0.0000000000e+00
1.5501410961e+00,3.6001410484e+00,1.4105251466e-04
3.6001410484e+00,1.5501410961e+00,0.0000000000e+00
3.6001410484e+00,1.5501410961e+00,1.4105720038e-04
1.5501508713e+00,3.5999999046e+00,5.0000000745e-02
3.5999999046e+00,1.5501508713e+00,5.0000000745e-02
1.5499999523e+00,3.6004912853e+00,0.0000000000e+00
3.6004912853e+00,1.5499999523e+00,0.0000000000e+00
1.5501410961e+00,3.6001410484e+00,4.9858946353e-02
3.6001410484e+00,1.5501410961e+00,4.9858942628e-02
1.5501410961e+00,3.6001410484e+00,5.0000000745e-02
3.6001410484e+00,1.5501410961e+00,5.0000000745e-02
1.5499999523e+00,3.6004912853e+00,5.0000000745e-02
3.6004912853e+00,1.5499999523e+00,5.0000000745e-02
1.5383520126e+00,3.6327867508e+00,2.5000000373e-02
3.6327867508e+00,1.5383520126e+00,2.5000000373e-02
1.5366799831e+00,3.6366801262e+00,0.0000000000e+00
3.6366801262e+00,1.5366799831e+00,0.0000000000e+00
1.5366799831e+00,3.6366801262e+00,5.0000000745e-02
3.6366801262e+00,1.5366799831e+00,5.0000000745e-02
1.5280528069e+00,3.6500000954e+00,0.0000000000e+00
3.6500000954e+00,1.5280528069e+00,0.0000000000e+00
1.5280528069e+00,3.6500000954e+00,5.0000000745e-02
3.6500000954e+00,1.5280528069e+00,5.0000000745e-02
3.6734635830e+00,1.5265364647e+00,0.0000000000e+00
1.5265364647e+00,3.6734635830e+00,0.0000000000e+00
3.6734635830e+00,1.5265364647e+00,5.0000000745e-02
1.5265364647e+00,3.6734635830e+00,5.0000000745e-02
1.5259573460e+00,3.6750802994e+00,2.5000000373e-02
3.6750802994e+00,1.5259573460e+00,2.5000000373e-02
1.5256993771e+00,3.6756992340e+00,0.0000000000e+00
3.6756992340e+00,1.5256993771e+00,0.0000000000e+00
1.5256993771e+00,3.6756992340e+00,5.0000000745e-02
3.6756992340e+00,1.5256993771e+00,5.0000000745e-02
1.5099261999e+00,3.7000000477e+00,0.0000000000e+00
3.7000000477e+00,1.5099261999e+00,0.0000000000e+00
1.5099261999e+00,3.7000000477e+00,5.0000000745e-02
3.7000000477e+00,1.5099261999e+00,5.0000000745e-02
1.5091719627e+00,3.7091720104e+00,0.0000000000e+00
3.7091720104e+00,1.5091719627e+00,0.0000000000e+00
1.5091719627e+00,3.7091720104e+00,9.1719981283e-03
3.7091720104e+00,1.5091719627e+00,9.1720037162e-03
1.5091719627e+00,3.7091720104e+00,4.0828000754e-02
3.7091720104e+00,1.5091719627e+00,4.0827997029e-02
1.5091719627e+00,3.7091720104e+00,5.0000000745e-02
3.7091720104e+00,1.5091719627e+00,5.0000000745e-02
1.5035589933e+00,3.7249999046e+00,2.5000000373e-02
3.7249999046e+00,1.5035589933e+00,2.5000000373e-02
1.5000000000e+00,3.7307608128e+00,0.0000000000e+00
3.7307608128e+00,1.5000000000e+00,0.0000000000e+00
1.5000000000e+00,3.7307608128e+00,5.0000000745e-02
3.7307608128e+00,1.5000000000e+00,5.0000000745e-02
1.4946525097e+00,3.7446525097e+00,0.0000000000e+00
3.7446525097e+00,1.4946525097e+00,0.0000000000e+00
1.4946525097e+00,3.7446525097e+00,5.3474376909e-03
3.7446525097e+00,1.4946525097e+00,5.3474325687e-03
1.4946525097e+00,3.7446525097e+00,4.4652562588e-02
3.7446525097e+00,1.4946525097e+00,4.4652566314e-02
1.4946525097e+00,3.7446525097e+00,5.0000000745e-02
3.7446525097e+00,1.4946525097e+00,5.0000000745e-02
1.4910918474e+00,3.7500000000e+00,0.0000000000e+00
3.7500000000e+00,1.4910918474e+00,0.0000000000e+00
1.4910918474e+00,3.7500000000e+00,5.0000000745e-02
3.7500000000e+00,1.4910918474e+00,5.0000000745e-02
3.7596642971e+00,1.4903355837e+00,0.0000000000e+00
1.4903355837e+00,3.7596642971e+00,0.0000000000e+00
3.7596642971e+00,1.4903355837e+00,9.6643632278e-03
1.4903355837e+00,3.7596642971e+00,9.6643725410e-03
3.7596642971e+00,1.4903355837e+00,4.0335636586e-02
1.4903355837e+00,3.7596642971e+00,4.0335625410e-02
3.7596642971e+00,1.4903355837e+00,5.0000000745e-02
1.4903355837e+00,3.7596642971e+00,5.0000000745e-02
1.4827506542e+00,3.7794814110e+00,2.5000000373e-02
3.7794814110e+00,1.4827506542e+00,2.5000000373e-02
1.4817222357e+00,3.7817220688e+00,0.0000000000e+00
3.7817220688e+00,1.4817222357e+00,0.0000000000e+00
1.4817222357e+00,3.7817220688e+00,5.0000000745e-02
3.7817220688e+00,1.4817222357e+00,5.0000000745e-02
1.4695404768e+00,3.7999999523e+00,0.0000000000e+00
3.7999999523e+00,1.4695404768e+00,0.0000000000e+00
1.4695404768e+00,3.7999999523e+00,5.0000000745e-02
3.7999999523e+00,1.4695404768e+00,5.0000000745e-02
1.4686118364e+00,3.8168160915e+00,2.5000000373e-02
3.8168160915e+00,1.4686118364e+00,2.5000000373e-02
1.4678597450e+00,3.8178596497e+00,0.0000000000e+00
3.8178596497e+00,1.4678597450e+00,0.0000000000e+00
1.4678597450e+00,3.8178596497e+00,5.0000000745e-02
3.8178596497e+00,1.4678597450e+00,5.0000000745e-02
3.8436172009e+00,1.4563827515e+00,0.0000000000e+00
1.4563826323e+00,3.8436172009e+00,0.0000000000e+00
3.8436172009e+00,1.4563827515e+00,6.3826995902e-03
1.4563826323e+00,3.8436172009e+00,6.3826832920e-03
3.8436172009e+00,1.4563827515e+00,4.3617300689e-02
1.4563826323e+00,3.8436172009e+00,4.3617315590e-02
3.8436172009e+00,1.4563827515e+00,5.0000000745e-02
1.4563826323e+00,3.8436172009e+00,5.0000000745e-02
1.4521310329e+00,3.8499999046e+00,0.0000000000e+00
3.8499999046e+00,1.4521310329e+00,0.0000000000e+00
1.4521310329e+00,3.8499999046e+00,5.0000000745e-02
3.8499999046e+00,1.4521310329e+00,5.0000000745e-02
1.4519171715e+00,3.8519172668e+00,0.0000000000e+00
3.8519172668e+00,1.4519171715e+00,0.0000000000e+00
1.4519171715e+00,3.8519172668e+00,1.9172091270e-03
3.8519172668e+00,1.4519171715e+00,1.9172141328e-03
1.4519171715e+00,3.8519172668e+00,4.8082791269e-02
3.8519172668e+00,1.4519171715e+00,4.8082787544e-02
1.4519171715e+00,3.8519172668e+00,5.0000000745e-02
3.8519172668e+00,1.4519171715e+00,5.0000000745e-02
1.4500000477e+00,3.8561711311e+00,0.0000000000e+00
3.8561711311e+00,1.4500000477e+00,0.0000000000e+00
1.4500000477e+00,3.8561711311e+00,5.0000000745e-02
3.8561711311e+00,1.4500000477e+00,5.0000000745e-02
1.4393347502e+00,3.8832387924e+00,2.5000000373e-02
3.8832387924e+00,1.4393347502e+00,2.5000000373e-02
1.4373582602e+00,3.8873581886e+00,0.0000000000e+00
3.8873581886e+00,1.4373582602e+00,0.0000000000e+00
1.4373582602e+00,3.8873581886e+00,5.0000000745e-02
3.8873581886e+00,1.4373582602e+00,5.0000000745e-02
1.4287388325e+00,3.9000000954e+00,0.0000000000e+00
3.9000000954e+00,1.4287388325e+00,0.0000000000e+00
1.4287388325e+00,3.9000000954e+00,5.0000000745e-02
3.9000000954e+00,1.4287388325e+00,5.0000000745e-02
3.9237697124e+00,1.4262301922e+00,0.0000000000e+00
1.4262301922e+00,3.9237697124e+00,0.0000000000e+00
3.9237697124e+00,1.4262301922e+00,5.0000000745e-02
1.4262301922e+00,3.9237697124e+00,5.0000000745e-02
1.4257378578e+00,3.9250216484e+00,2.5000000373e-02
3.9250216484e+00,1.4257378578e+00,2.5000000373e-02
1.4255149364e+00,3.9255149364e+00,0.0000000000e+00
3.9255149364e+00,1.4255149364e+00,0.0000000000e+00
1.4255149364e+00,3.9255149364e+00,5.0000000745e-02
3.9255149364e+00,1.4255149364e+00,5.0000000745e-02
1.4088325500e+00,3.9500000477e+00,0.0000000000e+00
3.9500000477e+00,1.4088325500e+00,0.0000000000e+00
1.4088325500e+00,3.9500000477e+00,5.0000000745e-02
3.9500000477e+00,1.4088325500e+00,5.0000000745e-02
1.4078700542e+00,3.9578700066e+00,0.0000000000e+00
3.9578700066e+00,1.4078700542e+00,0.0000000000e+00
1.4078700542e+00,3.9578700066e+00,7.8700063750e-03
3.9578700066e+00,1.4078700542e+00,7.8700119630e-03
1.4078700542e+00,3.9578700066e+00,4.2129993439e-02
3.9578700066e+00,1.4078700542e+00,4.2129989713e-02
1.4078700542e+00,3.9578700066e+00,5.0000000745e-02
3.9578700066e+00,1.4078700542e+00,5.0000000745e-02
1.3999999762e+00,3.9746530056e+00,0.0000000000e+00
3.9746530056e+00,1.3999999762e+00,0.0000000000e+00
1.3999999762e+00,3.9746530056e+00,5.0000000745e-02
3.9746530056e+00,1.3999999762e+00,5.0000000745e-02
1.4012703896e+00,3.9749999046e+00,2.5000000373e-02
3.9749999046e+00,1.4012703896e+00,2.5000000373e-02
1.3925232887e+00,3.9925231934e+00,0.0000000000e+00
3.9925231934e+00,1.3925232887e+00,0.0000000000e+00
1.3925232887e+00,3.9925231934e+00,7.4767554179e-03
3.9925231934e+00,1.3925232887e+00,7.4767502956e-03
1.3925232887e+00,3.9925231934e+00,4.2523246258e-02
3.9925231934e+00,1.3925232887e+00,4.2523249984e-02
1.3925232887e+00,3.9925231934e+00,5.0000000745e-02
3.9925231934e+00,1.3925232887e+00,5.0000000745e-02
1.3873215914e+00,4.0000000000e+00,0.0000000000e+00
4.0000000000e+00,1.3873215914e+00,0.0000000000e+00
1.3873215914e+00,4.0000000000e+00,5.0000000745e-02
4.0000000000e+00,1.3873215914e+00,5.0000000745e-02
4.0143675804e+00,1.3856326342e+00,0.0000000000e+00
1.3856326342e+00,4.0143675804e+00,0.0000000000e+00
4.0143675804e+00,1.3856326342e+00,5.0000000745e-02
1.3856326342e+00,4.0143675804e+00,5.0000000745e-02
1.3812903166e+00,4.0250682831e+00,2.5000000373e-02
4.0250682831e+00,1.3812903166e+00,2.5000000373e-02
1.3793146610e+00,4.0293145180e+00,0.0000000000e+00
4.0293145180e+00,1.3793146610e+00,0.0000000000e+00
1.3793146610e+00,4.0293145180e+00,5.0000000745e-02
4.0293145180e+00,1.3793146610e+00,5.0000000745e-02
1.3649400473e+00,4.0500001907e+00,0.0000000000e+00
4.0500001907e+00,1.3649400473e+00,0.0000000000e+00
1.3649400473e+00,4.0500001907e+00,5.0000000745e-02
4.0500001907e+00,1.3649400473e+00,5.0000000745e-02
1.3631845713e+00,4.0631847382e+00,0.0000000000e+00
4.0631847382e+00,1.3631845713e+00,0.0000000000e+00
1.3631845713e+00,4.0631847382e+00,5.0000000745e-02
4.0631847382e+00,1.3631845713e+00,5.0000000745e-02
1.3616245985e+00,4.0671229362e+00,2.5000000373e-02
4.0671229362e+00,1.3616245985e+00,2.5000000373e-02
1.3500000238e+00,4.0903000832e+00,0.0000000000e+00
4.0903000832e+00,1.3500000238e+00,0.0000000000e+00
1.3500000238e+00,4.0903000832e+00,5.0000000745e-02
4.0903000832e+00,1.3500000238e+00,5.0000000745e-02
1.3470803499e+00,4.0970802307e+00,0.0000000000e+00
4.0970802307e+00,1.3470803499e+00,0.0000000000e+00
1.3470803499e+00,4.0970802307e+00,2.9196471442e-03
4.0970802307e+00,1.3470803499e+00,2.9196415562e-03
1.3470803499e+00,4.0970802307e+00,4.7080352902e-02
4.0970802307e+00,1.3470803499e+00,4.7080356628e-02
1.3470803499e+00,4.0970802307e+00,5.0000000745e-02
4.0970802307e+00,1.3470803499e+00,5.0000000745e-02
1.3450083733e+00,4.0999999046e+00,0.0000000000e+00
4.0999999046e+00,1.3450083733e+00,0.0000000000e+00
1.3450083733e+00,4.0999999046e+00,5.0000000745e-02
4.0999999046e+00,1.3450083733e+00,5.0000000745e-02
4.1057300568e+00,1.3442699909e+00,0.0000000000e+00
1.3442699909e+00,4.1057300568e+00,0.0000000000e+00
4.1057300568e+00,1.3442699909e+00,5.7299886830e-03
1.3442699909e+00,4.1057300568e+00,5.7299998589e-03
4.1057300568e+00,1.3442699909e+00,4.4270012528e-02
1.3442699909e+00,4.1057300568e+00,4.4270001352e-02
4.1057300568e+00,1.3442699909e+00,5.0000000745e-02
1.3442699909e+00,4.1057300568e+00,5.0000000745e-02
1.3339098692e+00,4.1300616264e+00,2.5000000373e-02
4.1300616264e+00,1.3339098692e+00,2.5000000373e-02
1.3325926065e+00,4.1325926781e+00,0.0000000000e+00
4.1325926781e+00,1.3325926065e+00,0.0000000000e+00
1.3325926065e+00,4.1325926781e+00,5.0000000745e-02
4.1325926781e+00,1.3325926065e+00,5.0000000745e-02
1.3202694654e+00,4.1500000954e+00,0.0000000000e+00
4.1500000954e+00,1.3202694654e+00,0.0000000000e+00
1.3202694654e+00,4.1500000954e+00,5.0000000745e-02
4.1500000954e+00,1.3202694654e+00,5.0000000745e-02
1.3184388876e+00,4.1668858528e+00,2.5000000373e-02
4.1668858528e+00,1.3184388876e+00,2.5000000373e-02
1.3177180290e+00,4.1677179337e+00,0.0000000000e+00
4.1677179337e+00,1.3177180290e+00,0.0000000000e+00
1.3177180290e+00,4.1677179337e+00,5.0000000745e-02
4.1677179337e+00,1.3177180290e+00,5.0000000745e-02
4.1970224380e+00,1.3029775620e+00,0.0000000000e+00
1.3029775620e+00,4.1970224380e+00,0.0000000000e+00
4.1970224380e+00,1.3029775620e+00,2.9775421135e-03
1.3029775620e+00,4.1970224380e+00,2.9775220901e-03
4.1970224380e+00,1.3029775620e+00,4.7022458166e-02
1.3029775620e+00,4.1970224380e+00,4.7022476792e-02
4.1970224380e+00,1.3029775620e+00,5.0000000745e-02
1.3029775620e+00,4.1970224380e+00,5.0000000745e-02
1.3008757830e+00,4.1999998093e+00,0.0000000000e+00
4.1999998093e+00,1.3008757830e+00,0.0000000000e+00
1.3008757830e+00,4.1999998093e+00,5.0000000745e-02
4.1999998093e+00,1.3008757830e+00,5.0000000745e-02
1.3007540703e+00,4.2007541656e+00,0.0000000000e+00
4.2007541656e+00,1.3007540703e+00,0.0000000000e+00
1.3007540703e+00,4.2007541656e+00,7.5405929238e-04
4.2007541656e+00,1.3007540703e+00,7.5406441465e-04
1.3007540703e+00,4.2007541656e+00,4.9245942384e-02
4.2007541656e+00,1.3007540703e+00,4.9245934933e-02
1.3007540703e+00,4.2007541656e+00,5.0000000745e-02
4.2007541656e+00,1.3007540703e+00,5.0000000745e-02
1.2999999523e+00,4.2022428513e+00,0.0000000000e+00
4.2022428513e+00,1.2999999523e+00,0.0000000000e+00
1.2999999523e+00,4.2022428513e+00,5.0000000745e-02
4.2022428513e+00,1.2999999523e+00,5.0000000745e-02
1.2871024609e+00,4.2318420410e+00,2.5000000373e-02
4.2318420410e+00,1.2871025801e+00,2.5000000373e-02
1.2852632999e+00,4.2352633476e+00,0.0000000000e+00
4.2352633476e+00,1.2852632999e+00,0.0000000000e+00
1.2852632999e+00,4.2352633476e+00,5.0000000745e-02
4.2352633476e+00,1.2852632999e+00,5.0000000745e-02
1.2746537924e+00,4.2500000000e+00,0.0000000000e+00
4.2500000000e+00,1.2746537924e+00,0.0000000000e+00
1.2746537924e+00,4.2500000000e+00,5.0000000745e-02
4.2500000000e+00,1.2746537924e+00,5.0000000745e-02
1.2713437080e+00,4.2713437080e+00,0.0000000000e+00
4.2713437080e+00,1.2713437080e+00,0.0000000000e+00
1.2713437080e+00,4.2713437080e+00,5.0000000745e-02
4.2713437080e+00,1.2713437080e+00,5.0000000745e-02
1.2690780163e+00,4.2759733200e+00,2.5000000373e-02
4.2759733200e+00,1.2690780163e+00,2.5000000373e-02
4.2865471840e+00,1.2634526491e+00,0.0000000000e+00
1.2634526491e+00,4.2865471840e+00,0.0000000000e+00
4.2865471840e+00,1.2634526491e+00,5.0000000745e-02
1.2634526491e+00,4.2865471840e+00,5.0000000745e-02
1.2537957430e+00,4.3000001907e+00,0.0000000000e+00
4.3000001907e+00,1.2537957430e+00,0.0000000000e+00
1.2537957430e+00,4.3000001907e+00,5.0000000745e-02
4.3000001907e+00,1.2537957430e+00,5.0000000745e-02
1.2532378435e+00,4.3032379150e+00,0.0000000000e+00
4.3032379150e+00,1.2532378435e+00,0.0000000000e+00
1.2532378435e+00,4.3032379150e+00,3.2378216274e-03
4.3032379150e+00,1.2532378435e+00,3.2378269825e-03
1.2532378435e+00,4.3032379150e+00,4.6762179583e-02
4.3032379150e+00,1.2532378435e+00,4.6762172133e-02
1.2532378435e+00,4.3032379150e+00,5.0000000745e-02
4.3032379150e+00,1.2532378435e+00,5.0000000745e-02
1.2500000000e+00,4.3094353676e+00,0.0000000000e+00
4.3094353676e+00,1.2500000000e+00,0.0000000000e+00
1.2500000000e+00,4.3094353676e+00,5.0000000745e-02
4.3094353676e+00,1.2500000000e+00,5.0000000745e-02
1.2395395041e+00,4.3331813812e+00,2.5000000373e-02
4.3331813812e+00,1.2395395041e+00,2.5000000373e-02
1.2372723818e+00,4.3372721672e+00,0.0000000000e+00
4.3372721672e+00,1.2372723818e+00,0.0000000000e+00
1.2372723818e+00,4.3372721672e+00,5.0000000745e-02
4.3372721672e+00,1.2372723818e+00,5.0000000745e-02
1.2279636860e+00,4.3499999046e+00,0.0000000000e+00
4.3499999046e+00,1.2279636860e+00,0.0000000000e+00
1.2279636860e+00,4.3499999046e+00,5.0000000745e-02
4.3499999046e+00,1.2279636860e+00,5.0000000745e-02
1.2239663601e+00,4.3739662170e+00,0.0000000000e+00
4.3739662170e+00,1.2239663601e+00,0.0000000000e+00
1.2239663601e+00,4.3739662170e+00,5.0000000745e-02
4.3739662170e+00,1.2239663601e+00,5.0000000745e-02
1.2232835293e+00,4.3753175735e+00,2.5000000373e-02
4.3753175735e+00,1.2232835293e+00,2.5000000373e-02
4.3784127235e+00,1.2215871811e+00,0.0000000000e+00
1.2215871811e+00,4.3784127235e+00,0.0000000000e+00
4.3784127235e+00,1.2215871811e+00,5.0000000745e-02
1.2215871811e+00,4.3784127235e+00,5.0000000745e-02
1.2058448792e+00,4.4000000954e+00,0.0000000000e+00
4.4000000954e+00,1.2058448792e+00,0.0000000000e+00
1.2058448792e+00,4.4000000954e+00,5.0000000745e-02
4.4000000954e+00,1.2058448792e+00,5.0000000745e-02
1.2049367428e+00,4.4049367905e+00,0.0000000000e+00
4.4049367905e+00,1.2049367428e+00,0.0000000000e+00
1.2049367428e+00,4.4049367905e+00,4.9367421307e-03
4.4049367905e+00,1.2049367428e+00,4.9367477186e-03
1.2049367428e+00,4.4049367905e+00,4.5063257217e-02
4.4049367905e+00,1.2049367428e+00,4.5063253492e-02
1.2049367428e+00,4.4049367905e+00,5.0000000745e-02
4.4049367905e+00,1.2049367428e+00,5.0000000745e-02
1.2000000477e+00,4.4141077995e+00,0.0000000000e+00
4.4141077995e+00,1.2000000477e+00,0.0000000000e+00
1.2000000477e+00,4.4141077995e+00,5.0000000745e-02
4.4141077995e+00,1.2000000477e+00,5.0000000745e-02
1.1962941885e+00,4.4250001907e+00,2.5000000373e-02
4.4250001907e+00,1.1962941885e+00,2.5000000373e-02
1.1885581017e+00,4.4385581017e+00,0.0000000000e+00
4.4385581017e+00,1.1885581017e+00,0.0000000000e+00
1.1885581017e+00,4.4385581017e+00,1.1441855691e-02
4.4385581017e+00,1.1885581017e+00,1.1441851035e-02
1.1885581017e+00,4.4385581017e+00,3.8558144122e-02
4.4385581017e+00,1.1885581017e+00,3.8558147848e-02
1.1885581017e+00,4.4385581017e+00,5.0000000745e-02
4.4385581017e+00,1.1885581017e+00,5.0000000745e-02
1.1800638437e+00,4.4499998093e+00,0.0000000000e+00
4.4499998093e+00,1.1800638437e+00,0.0000000000e+00
1.1800638437e+00,4.4499998093e+00,5.0000000745e-02
4.4499998093e+00,1.1800638437e+00,5.0000000745e-02
4.4742827415e+00,1.1757172346e+00,0.0000000000e+00
1.1757172346e+00,4.4742827415e+00,0.0000000000e+00
4.4742827415e+00,1.1757172346e+00,5.0000000745e-02
1.1757172346e+00,4.4742827415e+00,5.0000000745e-02
1.1754022837e+00,4.4749755859e+00,2.5000000373e-02
4.4749755859e+00,1.1754022837e+00,2.5000000373e-02
1.1752575636e+00,4.4752573967e+00,0.0000000000e+00
4.4752573967e+00,1.1752575636e+00,0.0000000000e+00
1.1752575636e+00,4.4752573967e+00,5.0000000745e-02
4.4752573967e+00,1.1752575636e+00,5.0000000745e-02
1.1569404602e+00,4.5000000000e+00,0.0000000000e+00
4.5000000000e+00,1.1569404602e+00,0.0000000000e+00
1.1569404602e+00,4.5000000000e+00,5.0000000745e-02
4.5000000000e+00,1.1569404602e+00,5.0000000745e-02
1.1558015347e+00,4.5058016777e+00,0.0000000000e+00
4.5058016777e+00,1.1558015347e+00,0.0000000000e+00
1.1558015347e+00,4.5058016777e+00,5.8015640825e-03
4.5058016777e+00,1.1558015347e+00,5.8015701361e-03
1.1558015347e+00,4.5058016777e+00,4.4198434800e-02
4.5058016777e+00,1.1558015347e+00,4.4198431075e-02
1.1558015347e+00,4.5058016777e+00,5.0000000745e-02
4.5058016777e+00,1.1558015347e+00,5.0000000745e-02
1.1499999762e+00,4.5162682533e+00,0.0000000000e+00
4.5162682533e+00,1.1499999762e+00,0.0000000000e+00
1.1499999762e+00,4.5162682533e+00,5.0000000745e-02
4.5162682533e+00,1.1499999762e+00,5.0000000745e-02
1.1473445892e+00,4.5250000954e+00,2.5000000373e-02
4.5250000954e+00,1.1473445892e+00,2.5000000373e-02
1.1390805244e+00,4.5390806198e+00,0.0000000000e+00
4.5390806198e+00,1.1390806437e+00,0.0000000000e+00
1.1390805244e+00,4.5390806198e+00,1.0919420980e-02
4.5390806198e+00,1.1390806437e+00,1.0919415392e-02
1.1390805244e+00,4.5390806198e+00,3.9080578834e-02
4.5390806198e+00,1.1390806437e+00,3.9080586284e-02
1.1390805244e+00,4.5390806198e+00,5.0000000745e-02
4.5390806198e+00,1.1390806437e+00,5.0000000745e-02
1.1308565140e+00,4.5500001907e+00,0.0000000000e+00
4.5500001907e+00,1.1308565140e+00,0.0000000000e+00
1.1308565140e+00,4.5500001907e+00,5.0000000745e-02
4.5500001907e+00,1.1308565140e+00,5.0000000745e-02
4.5736880302e+00,1.1263117790e+00,0.0000000000e+00
1.1263117790e+00,4.5736880302e+00,0.0000000000e+00
4.5736880302e+00,1.1263117790e+00,5.0000000745e-02
1.1263117790e+00,4.5736880302e+00,5.0000000745e-02
1.1257271767e+00,4.5749449730e+00,2.5000000373e-02
4.5749449730e+00,1.1257271767e+00,2.5000000373e-02
1.1254582405e+00,4.5754580498e+00,0.0000000000e+00
4.5754580498e+00,1.1254582405e+00,0.0000000000e+00
1.1254582405e+00,4.5754580498e+00,5.0000000745e-02
4.5754580498e+00,1.1254582405e+00,5.0000000745e-02
1.1070239544e+00,4.5999999046e+00,0.0000000000e+00
4.5999999046e+00,1.1070239544e+00,0.0000000000e+00
1.1070239544e+00,4.5999999046e+00,5.0000000745e-02
4.5999999046e+00,1.1070239544e+00,5.0000000745e-02
1.1058074236e+00,4.6058073044e+00,0.0000000000e+00
4.6058073044e+00,1.1058074236e+00,0.0000000000e+00
1.1058074236e+00,4.6058073044e+00,5.8073815890e-03
4.6058073044e+00,1.1058074236e+00,5.8073871769e-03
1.1058074236e+00,4.6058073044e+00,4.4192619622e-02
4.6058073044e+00,1.1058074236e+00,4.4192612171e-02
1.1058074236e+00,4.6058073044e+00,5.0000000745e-02
4.6058073044e+00,1.1058074236e+00,5.0000000745e-02
1.1000000238e+00,4.6159858704e+00,0.0000000000e+00
4.6159858704e+00,1.1000000238e+00,0.0000000000e+00
1.1000000238e+00,4.6159858704e+00,5.0000000745e-02
4.6159858704e+00,1.1000000238e+00,5.0000000745e-02
1.0971629620e+00,4.6250000000e+00,2.5000000373e-02
4.6250000000e+00,1.0971629620e+00,2.5000000373e-02
1.0888223648e+00,4.6388225555e+00,0.0000000000e+00
4.6388225555e+00,1.0888223648e+00,0.0000000000e+00
1.0888223648e+00,4.6388225555e+00,1.1177614331e-02
4.6388225555e+00,1.0888223648e+00,1.1177608743e-02
1.0888223648e+00,4.6388225555e+00,3.8822386414e-02
4.6388225555e+00,1.0888223648e+00,3.8822390139e-02
1.0888223648e+00,4.6388225555e+00,5.0000000745e-02
4.6388225555e+00,1.0888223648e+00,5.0000000745e-02
1.0802842379e+00,4.6500000954e+00,0.0000000000e+00
4.6500000954e+00,1.0802843571e+00,0.0000000000e+00
1.0802842379e+00,4.6500000954e+00,5.0000000745e-02
4.6500000954e+00,1.0802843571e+00,5.0000000745e-02
4.6748166084e+00,1.0751833916e+00,0.0000000000e+00
1.0751833916e+00,4.6748166084e+00,0.0000000000e+00
1.0750622749e+00,4.6750621796e+00,0.0000000000e+00
4.6750621796e+00,1.0750622749e+00,0.0000000000e+00
1.0751004219e+00,4.6749906540e+00,2.5000000373e-02
4.6749906540e+00,1.0751004219e+00,2.5000000373e-02
4.6748166084e+00,1.0751833916e+00,5.0000000745e-02
1.0751833916e+00,4.6748166084e+00,5.0000000745e-02
1.0750622749e+00,4.6750621796e+00,5.0000000745e-02
4.6750621796e+00,1.0750622749e+00,5.0000000745e-02
1.0560638905e+00,4.6999998093e+00,0.0000000000e+00
4.6999998093e+00,1.0560638905e+00,0.0000000000e+00
1.0560638905e+00,4.6999998093e+00,5.0000000745e-02
4.6999998093e+00,1.0560638905e+00,5.0000000745e-02
1.0549554825e+00,4.7049555779e+00,0.0000000000e+00
4.7049555779e+00,1.0549554825e+00,0.0000000000e+00
1.0549554825e+00,4.7049555779e+00,4.9555269070e-03
4.7049555779e+00,1.0549554825e+00,4.9555329606e-03
1.0549554825e+00,4.7049555779e+00,4.5044474304e-02
4.7049555779e+00,1.0549554825e+00,4.5044466853e-02
1.0549554825e+00,4.7049555779e+00,5.0000000745e-02
4.7049555779e+00,1.0549554825e+00,5.0000000745e-02
1.0499999523e+00,4.7133941650e+00,0.0000000000e+00
4.7133941650e+00,1.0499999523e+00,0.0000000000e+00
1.0499999523e+00,4.7133941650e+00,5.0000000745e-02
4.7133941650e+00,1.0499999523e+00,5.0000000745e-02
1.0457240343e+00,4.7249999046e+00,2.5000000373e-02
4.7249999046e+00,1.0457240343e+00,2.5000000373e-02
1.0377912521e+00,4.7377910614e+00,0.0000000000e+00
4.7377910614e+00,1.0377912521e+00,0.0000000000e+00
1.0377912521e+00,4.7377910614e+00,1.2208790518e-02
4.7377910614e+00,1.0377912521e+00,1.2208784930e-02
1.0377912521e+00,4.7377910614e+00,3.7791211158e-02
4.7377910614e+00,1.0377912521e+00,3.7791214883e-02
1.0377912521e+00,4.7377910614e+00,5.0000000745e-02
4.7377910614e+00,1.0377912521e+00,5.0000000745e-02
1.0283342600e+00,4.7500000000e+00,0.0000000000e+00
4.7500000000e+00,1.0283343792e+00,0.0000000000e+00
1.0283342600e+00,4.7500000000e+00,5.0000000745e-02
4.7500000000e+00,1.0283343792e+00,5.0000000745e-02
1.0232204199e+00,4.7732205391e+00,0.0000000000e+00
4.7732205391e+00,1.0232205391e+00,0.0000000000e+00
1.0232204199e+00,4.7732205391e+00,5.0000000745e-02
4.7732205391e+00,1.0232205391e+00,5.0000000745e-02
4.7759037018e+00,1.0216864347e+00,2.5000000373e-02
1.0216863155e+00,4.7759037018e+00,2.5000000373e-02
4.7821502686e+00,1.0178498030e+00,0.0000000000e+00
1.0178498030e+00,4.7821502686e+00,0.0000000000e+00
4.7821502686e+00,1.0178498030e+00,5.0000000745e-02
1.0178498030e+00,4.7821502686e+00,5.0000000745e-02
1.0040624142e+00,4.8000001907e+00,0.0000000000e+00
4.8000001907e+00,1.0040624142e+00,0.0000000000e+00
1.0040624142e+00,4.8000001907e+00,5.0000000745e-02
4.8000001907e+00,1.0040624142e+00,5.0000000745e-02
1.0032788515e+00,4.8032789230e+00,0.0000000000e+00
4.8032789230e+00,1.0032788515e+00,0.0000000000e+00
1.0032788515e+00,4.8032789230e+00,3.2788454555e-03
4.8032789230e+00,1.0032788515e+00,3.2788515091e-03
1.0032788515e+00,4.8032789230e+00,4.6721152961e-02
4.8032789230e+00,1.0032788515e+00,4.6721149236e-02
1.0032788515e+00,4.8032789230e+00,5.0000000745e-02
4.8032789230e+00,1.0032788515e+00,5.0000000745e-02
1.0000000000e+00,4.8087034225e+00,0.0000000000e+00
4.8087034225e+00,1.0000000000e+00,0.0000000000e+00
1.0000000000e+00,4.8087034225e+00,5.0000000745e-02
4.8087034225e+00,1.0000000000e+00,5.0000000745e-02
9.8836451769e-01,4.8323483467e+00,2.5000000373e-02
4.8323483467e+00,9.8836451769e-01,2.5000000373e-02
9.8602271080e-01,4.8360228539e+00,0.0000000000e+00
4.8360228539e+00,9.8602271080e-01,0.0000000000e+00
9.8602271080e-01,4.8360228539e+00,5.0000000745e-02
4.8360228539e+00,9.8602271080e-01,5.0000000745e-02
9.7504192591e-01,4.8499999046e+00,0.0000000000e+00
4.8499999046e+00,9.7504192591e-01,0.0000000000e+00
9.7504192591e-01,4.8499999046e+00,5.0000000745e-02
4.8499999046e+00,9.7504192591e-01,5.0000000745e-02
9.7067195177e-01,4.8699254990e+00,2.5000000373e-02
4.8699254990e+00,9.7067195177e-01,2.5000000373e-02
9.7025728226e-01,4.8702573776e+00,0.0000000000e+00
4.8702573776e+00,9.7025728226e-01,0.0000000000e+00
9.7025728226e-01,4.8702573776e+00,5.0000000745e-02
4.8702573776e+00,9.7025728226e-01,5.0000000745e-02
4.8951644897e+00,9.5483553410e-01,0.0000000000e+00
9.5483547449e-01,4.8951644897e+00,0.0000000000e+00
4.8951644897e+00,9.5483553410e-01,4.8355213366e-03
9.5483547449e-01,4.8951644897e+00,4.8354850151e-03
4.8951644897e+00,9.5483553410e-01,4.5164477080e-02
9.5483547449e-01,4.8951644897e+00,4.5164514333e-02
4.8951644897e+00,9.5483553410e-01,5.0000000745e-02
9.5483547449e-01,4.8951644897e+00,5.0000000745e-02
9.5104920864e-01,4.9000000954e+00,0.0000000000e+00
4.9000000954e+00,9.5104920864e-01,0.0000000000e+00
9.5104920864e-01,4.9000000954e+00,5.0000000745e-02
4.9000000954e+00,9.5104920864e-01,5.0000000745e-02
9.5083552599e-01,4.9008355141e+00,0.0000000000e+00
4.9008355141e+00,9.5083552599e-01,0.0000000000e+00
9.5083552599e-01,4.9008355141e+00,8.3551049465e-04
4.9008355141e+00,9.5083552599e-01,8.3551672287e-04
9.5083552599e-01,4.9008355141e+00,4.9164488912e-02
4.9008355141e+00,9.5083552599e-01,4.9164481461e-02
9.5083552599e-01,4.9008355141e+00,5.0000000745e-02
4.9008355141e+00,9.5083552599e-01,5.0000000745e-02
9.4999998808e-01,4.9021782875e+00,0.0000000000e+00
4.9021782875e+00,9.4999998808e-01,0.0000000000e+00
9.4999998808e-01,4.9021782875e+00,5.0000000745e-02
4.9021782875e+00,9.4999998808e-01,5.0000000745e-02
9.3544858694e-01,4.9307174683e+00,2.5000000373e-02
4.9307174683e+00,9.3544858694e-01,2.5000000373e-02
9.3357616663e-01,4.9335761070e+00,0.0000000000e+00
4.9335761070e+00,9.3357616663e-01,0.0000000000e+00
9.3357616663e-01,4.9335761070e+00,5.0000000745e-02
4.9335761070e+00,9.3357616663e-01,5.0000000745e-02
9.2048496008e-01,4.9499998093e+00,0.0000000000e+00
4.9499998093e+00,9.2048496008e-01,0.0000000000e+00
9.2048496008e-01,4.9499998093e+00,5.0000000745e-02
4.9499998093e+00,9.2048496008e-01,5.0000000745e-02
9.1708034277e-01,4.9657826424e+00,2.5000000373e-02
4.9657831192e+00,9.1708034277e-01,2.5000000373e-02
9.1634029150e-01,4.9663405418e+00,0.0000000000e+00
4.9663405418e+00,9.1634035110e-01,0.0000000000e+00
9.1634029150e-01,4.9663405418e+00,5.0000000745e-02
4.9663405418e+00,9.1634035110e-01,5.0000000745e-02
8.9999997616e-01,4.9919424057e+00,0.0000000000e+00
4.9919424057e+00,8.9999997616e-01,0.0000000000e+00
8.9999997616e-01,4.9919424057e+00,5.0000000745e-02
4.9919424057e+00,8.9999997616e-01,5.0000000745e-02
8.9720696211e-01,4.9972071648e+00,0.0000000000e+00
4.9972071648e+00,8.9720702171e-01,0.0000000000e+00
8.9720696211e-01,4.9972071648e+00,2.7930089273e-03
4.9972071648e+00,8.9720702171e-01,2.7930017095e-03
8.9720696211e-01,4.9972071648e+00,4.7206990421e-02
4.9972071648e+00,8.9720702171e-01,4.7206997871e-02
8.9720696211e-01,4.9972071648e+00,5.0000000745e-02
4.9972071648e+00,8.9720702171e-01,5.0000000745e-02
8.9494901896e-01,5.0000000000e+00,0.0000000000e+00
5.0000000000e+00,8.9494901896e-01,0.0000000000e+00
8.9494901896e-01,5.0000000000e+00,5.0000000745e-02
5.0000000000e+00,8.9494901896e-01,5.0000000745e-02
5.0067696571e+00,8.9323025942e-01,0.0000000000e+00
8.9323025942e-01,5.0067696571e+00,0.0000000000e+00
5.0067696571e+00,8.9323025942e-01,6.7697213963e-03
8.9323025942e-01,5.0067696571e+00,6.7697390914e-03
5.0067696571e+00,8.9323025942e-01,4.3230276555e-02
8.9323025942e-01,5.0067696571e+00,4.3230261654e-02
5.0067696571e+00,8.9323025942e-01,5.0000000745e-02
8.9323025942e-01,5.0067696571e+00,5.0000000745e-02
8.8052046299e-01,5.0305204391e+00,0.0000000000e+00
5.0305204391e+00,8.8052046299e-01,0.0000000000e+00
8.8052046299e-01,5.0305204391e+00,5.0000000745e-02
5.0305204391e+00,8.8052046299e-01,5.0000000745e-02
8.8021963835e-01,5.0317587852e+00,2.5000000373e-02
5.0317587852e+00,8.8021963835e-01,2.5000000373e-02
8.6477535963e-01,5.0500001907e+00,0.0000000000e+00
5.0500001907e+00,8.6477541924e-01,0.0000000000e+00
8.6477535963e-01,5.0500001907e+00,5.0000000745e-02
5.0500001907e+00,8.6477541924e-01,5.0000000745e-02
8.6161017418e-01,5.0616102219e+00,0.0000000000e+00
5.0616102219e+00,8.6161017418e-01,0.0000000000e+00
8.6161017418e-01,5.0616102219e+00,1.1610170826e-02
5.0616102219e+00,8.6161017418e-01,1.1610178277e-02
8.6161017418e-01,5.0616102219e+00,3.8389828056e-02
5.0616102219e+00,8.6161017418e-01,3.8389820606e-02
8.6161017418e-01,5.0616102219e+00,5.0000000745e-02
5.0616102219e+00,8.6161017418e-01,5.0000000745e-02
8.5491222143e-01,5.0749998093e+00,2.5000000373e-02
5.0749998093e+00,8.5491222143e-01,2.5000000373e-02
8.5000002384e-01,5.0792436600e+00,0.0000000000e+00
5.0792436600e+00,8.5000002384e-01,0.0000000000e+00
8.5000002384e-01,5.0792436600e+00,5.0000000745e-02
5.0792436600e+00,8.5000002384e-01,5.0000000745e-02
8.4268903732e-01,5.0926890373e+00,0.0000000000e+00
5.0926890373e+00,8.4268903732e-01,0.0000000000e+00
8.4268903732e-01,5.0926890373e+00,7.3109874502e-03
5.0926890373e+00,8.4268903732e-01,7.3109809309e-03
8.4268903732e-01,5.0926890373e+00,4.2689014226e-02
5.0926890373e+00,8.4268903732e-01,4.2689017951e-02
8.4268903732e-01,5.0926890373e+00,5.0000000745e-02
5.0926890373e+00,8.4268903732e-01,5.0000000745e-02
8.3668863773e-01,5.0999999046e+00,0.0000000000e+00
5.0999999046e+00,8.3668863773e-01,0.0000000000e+00
8.3668863773e-01,5.0999999046e+00,5.0000000745e-02
5.0999999046e+00,8.3668863773e-01,5.0000000745e-02
5.1183123589e+00,8.3168780804e-01,0.0000000000e+00
8.3168780804e-01,5.1183123589e+00,0.0000000000e+00
5.1183123589e+00,8.3168780804e-01,5.0000000745e-02
8.3168780804e-01,5.1183123589e+00,5.0000000745e-02
5.1244239807e+00,8.2844614983e-01,2.5000000373e-02
8.2844614983e-01,5.1244239807e+00,2.5000000373e-02
8.2695341110e-01,5.1269536018e+00,0.0000000000e+00
5.1269536018e+00,8.2695347071e-01,0.0000000000e+00
8.2695341110e-01,5.1269536018e+00,5.0000000745e-02
5.1269536018e+00,8.2695347071e-01,5.0000000745e-02
8.0806005001e-01,5.1500000954e+00,0.0000000000e+00
5.1500000954e+00,8.0806005001e-01,0.0000000000e+00
8.0806005001e-01,5.1500000954e+00,5.0000000745e-02
5.1500000954e+00,8.0806005001e-01,5.0000000745e-02
8.0623233318e-01,5.1562323570e+00,0.0000000000e+00
5.1562323570e+00,8.0623233318e-01,0.0000000000e+00
8.0623233318e-01,5.1562323570e+00,6.2323156744e-03
5.1562323570e+00,8.0623233318e-01,6.2323226593e-03
8.0623233318e-01,5.1562323570e+00,4.3767683208e-02
5.1562323570e+00,8.0623233318e-01,4.3767675757e-02
8.0623233318e-01,5.1562323570e+00,5.0000000745e-02
5.1562323570e+00,8.0623233318e-01,5.0000000745e-02
8.0000001192e-01,5.1654062271e+00,0.0000000000e+00
5.1654062271e+00,8.0000001192e-01,0.0000000000e+00
8.0000001192e-01,5.1654062271e+00,5.0000000745e-02
5.1654062271e+00,8.0000001192e-01,5.0000000745e-02
7.9661172628e-01,5.1750001907e+00,2.5000000373e-02
5.1750001907e+00,7.9661172628e-01,2.5000000373e-02
7.8762972355e-01,5.1876296997e+00,0.0000000000e+00
5.1876296997e+00,7.8762972355e-01,0.0000000000e+00
7.8762972355e-01,5.1876296997e+00,1.2370276265e-02
5.1876296997e+00,7.8762972355e-01,1.2370270677e-02
7.8762972355e-01,5.1876296997e+00,3.7629723549e-02
5.1876296997e+00,7.8762972355e-01,3.7629730999e-02
7.8762972355e-01,5.1876296997e+00,5.0000000745e-02
5.1876296997e+00,7.8762972355e-01,5.0000000745e-02
7.7731555700e-01,5.1999998093e+00,0.0000000000e+00
5.1999998093e+00,7.7731555700e-01,0.0000000000e+00
7.7731555700e-01,5.1999998093e+00,5.0000000745e-02
5.1999998093e+00,7.7731555700e-01,5.0000000745e-02
7.7141332626e-01,5.2209086418e+00,2.5000000373e-02
5.2209086418e+00,7.7141332626e-01,2.5000000373e-02
7.7110010386e-01,5.2211003304e+00,0.0000000000e+00
5.2211003304e+00,7.7110010386e-01,0.0000000000e+00
7.7110010386e-01,5.2211003304e+00,5.0000000745e-02
5.2211003304e+00,7.7110010386e-01,5.0000000745e-02
5.2468738556e+00,7.5312626362e-01,0.0000000000e+00
7.5312620401e-01,5.2468738556e+00,0.0000000000e+00
5.2468738556e+00,7.5312626362e-01,3.1262657139e-03
7.5312620401e-01,5.2468738556e+00,3.1262130942e-03
5.2468738556e+00,7.5312626362e-01,4.6873733401e-02
7.5312620401e-01,5.2468738556e+00,4.6873785555e-02
5.2468738556e+00,7.5312626362e-01,5.0000000745e-02
7.5312620401e-01,5.2468738556e+00,5.0000000745e-02
7.5052624941e-01,5.2500000000e+00,0.0000000000e+00
5.2500000000e+00,7.5052624941e-01,0.0000000000e+00
7.5052624941e-01,5.2500000000e+00,5.0000000745e-02
5.2500000000e+00,7.5052624941e-01,5.0000000745e-02
7.5039970875e-01,5.2503995895e+00,0.0000000000e+00
5.2503995895e+00,7.5039976835e-01,0.0000000000e+00
7.5039970875e-01,5.2503995895e+00,3.9973543608e-04
5.2503995895e+00,7.5039976835e-01,3.9974215906e-04
7.5039970875e-01,5.2503995895e+00,4.9600265920e-02
5.2503995895e+00,7.5039976835e-01,4.9600258470e-02
7.5039970875e-01,5.2503995895e+00,5.0000000745e-02
5.2503995895e+00,7.5039976835e-01,5.0000000745e-02
7.5000000000e-01,5.2509698868e+00,0.0000000000e+00
5.2509698868e+00,7.5000000000e-01,0.0000000000e+00
7.5000000000e-01,5.2509698868e+00,5.0000000745e-02
5.2509698868e+00,7.5000000000e-01,5.0000000745e-02
7.3220008612e-01,5.2821998596e+00,0.0000000000e+00
5.2822003365e+00,7.3220008612e-01,0.0000000000e+00
7.3220008612e-01,5.2821998596e+00,5.0000000745e-02
5.2822003365e+00,7.3220008612e-01,5.0000000745e-02
7.3187810183e-01,5.2836036682e+00,2.5000000373e-02
5.2836036682e+00,7.3187810183e-01,2.5000000373e-02
7.1712213755e-01,5.3000001907e+00,0.0000000000e+00
5.3000001907e+00,7.1712213755e-01,0.0000000000e+00
7.1712213755e-01,5.3000001907e+00,5.0000000745e-02
5.3000001907e+00,7.1712213755e-01,5.0000000745e-02
7.1298688650e-01,5.3129868507e+00,0.0000000000e+00
5.3129868507e+00,7.1298688650e-01,0.0000000000e+00
7.1298688650e-01,5.3129868507e+00,5.0000000745e-02
5.3129868507e+00,7.1298688650e-01,5.0000000745e-02
7.1084713936e-01,5.3169913292e+00,2.5000000373e-02
5.3169913292e+00,7.1084713936e-01,2.5000000373e-02
6.9999998808e-01,5.3309679031e+00,0.0000000000e+00
5.3309679031e+00,6.9999998808e-01,0.0000000000e+00
6.9999998808e-01,5.3309679031e+00,5.0000000745e-02
5.3309679031e+00,6.9999998808e-01,5.0000000745e-02
6.9301235676e-01,5.3430123329e+00,0.0000000000e+00
5.3430123329e+00,6.9301235676e-01,0.0000000000e+00
6.9301235676e-01,5.3430123329e+00,6.9876238704e-03
5.3430123329e+00,6.9301235676e-01,6.9876159541e-03
6.9301235676e-01,5.3430123329e+00,4.3012376875e-02
5.3430123329e+00,6.9301235676e-01,4.3012384325e-02
6.9301235676e-01,5.3430123329e+00,5.0000000745e-02
5.3430123329e+00,6.9301235676e-01,5.0000000745e-02
6.8700385094e-01,5.3499999046e+00,0.0000000000e+00
5.3499999046e+00,6.8700385094e-01,0.0000000000e+00
6.8700385094e-01,5.3499999046e+00,5.0000000745e-02
5.3499999046e+00,6.8700385094e-01,5.0000000745e-02
5.3691797256e+00,6.8082052469e-01,0.0000000000e+00
6.8082046509e-01,5.3691797256e+00,0.0000000000e+00
5.3691797256e+00,6.8082052469e-01,5.0000000745e-02
6.8082046509e-01,5.3691797256e+00,5.0000000745e-02
5.3743710518e+00,6.7787408829e-01,2.5000000373e-02
6.7787408829e-01,5.3743710518e+00,2.5000000373e-02
6.7652380466e-01,5.3765239716e+00,0.0000000000e+00
5.3765239716e+00,6.7652380466e-01,0.0000000000e+00
6.7652380466e-01,5.3765239716e+00,5.0000000745e-02
5.3765239716e+00,6.7652380466e-01,5.0000000745e-02
6.5634524822e-01,5.4000000954e+00,0.0000000000e+00
5.4000000954e+00,6.5634524822e-01,0.0000000000e+00
6.5634524822e-01,5.4000000954e+00,5.0000000745e-02
5.4000000954e+00,6.5634524822e-01,5.0000000745e-02
6.5471917391e-01,5.4047193527e+00,0.0000000000e+00
5.4047193527e+00,6.5471917391e-01,0.0000000000e+00
6.5471917391e-01,5.4047193527e+00,4.7191889025e-03
5.4047193527e+00,6.5471917391e-01,4.7191968188e-03
6.5471917391e-01,5.4047193527e+00,4.5280810446e-02
5.4047193527e+00,6.5471917391e-01,4.5280802995e-02
6.5471917391e-01,5.4047193527e+00,5.0000000745e-02
5.4047193527e+00,6.5471917391e-01,5.0000000745e-02
6.4999997616e-01,5.4110379219e+00,0.0000000000e+00
5.4110379219e+00,6.4999997616e-01,0.0000000000e+00
6.4999997616e-01,5.4110379219e+00,5.0000000745e-02
5.4110379219e+00,6.4999997616e-01,5.0000000745e-02
6.3817745447e-01,5.4319806099e+00,2.5000000373e-02
5.4319806099e+00,6.3817745447e-01,2.5000000373e-02
6.3547062874e-01,5.4354705811e+00,0.0000000000e+00
5.4354705811e+00,6.3547062874e-01,0.0000000000e+00
6.3547062874e-01,5.4354705811e+00,5.0000000745e-02
5.4354705811e+00,6.3547062874e-01,5.0000000745e-02
6.2274640799e-01,5.4499998093e+00,0.0000000000e+00
5.4499998093e+00,6.2274646759e-01,0.0000000000e+00
6.2274640799e-01,5.4499998093e+00,5.0000000745e-02
5.4499998093e+00,6.2274646759e-01,5.0000000745e-02
6.1745524406e-01,5.4665794373e+00,2.5000000373e-02
5.4665794373e+00,6.1745530367e-01,2.5000000373e-02
6.1685472727e-01,5.4668545723e+00,0.0000000000e+00
5.4668545723e+00,6.1685472727e-01,0.0000000000e+00
6.1685472727e-01,5.4668545723e+00,5.0000000745e-02
5.4668545723e+00,6.1685472727e-01,5.0000000745e-02
6.0000002384e-01,5.4887251854e+00,0.0000000000e+00
5.4887251854e+00,6.0000002384e-01,0.0000000000e+00
6.0000002384e-01,5.4887251854e+00,5.0000000745e-02
5.4887251854e+00,6.0000002384e-01,5.0000000745e-02
5.9574931860e-01,5.4957494736e+00,0.0000000000e+00
5.4957494736e+00,5.9574931860e-01,0.0000000000e+00
5.9574931860e-01,5.4957494736e+00,4.2506628670e-03
5.4957494736e+00,5.9574931860e-01,4.2506549507e-03
5.9574931860e-01,5.4957494736e+00,4.5749336481e-02
5.4957494736e+00,5.9574931860e-01,4.5749343932e-02
5.9574931860e-01,5.4957494736e+00,5.0000000745e-02
5.4957494736e+00,5.9574931860e-01,5.0000000745e-02
5.9197247028e-01,5.5000000000e+00,0.0000000000e+00
5.5000000000e+00,5.9197247028e-01,0.0000000000e+00
5.9197247028e-01,5.5000000000e+00,5.0000000745e-02
5.5000000000e+00,5.9197247028e-01,5.0000000745e-02
5.5124754906e+00,5.8752453327e-01,0.0000000000e+00
5.8752453327e-01,5.5124754906e+00,0.0000000000e+00
5.5124754906e+00,5.8752453327e-01,1.2475471012e-02
5.8752453327e-01,5.5124754906e+00,1.2475494295e-02
5.5124754906e+00,5.8752453327e-01,3.7524528801e-02
5.8752453327e-01,5.5124754906e+00,3.7524506450e-02
5.5124754906e+00,5.8752453327e-01,5.0000000745e-02
5.8752453327e-01,5.5124754906e+00,5.0000000745e-02
5.7802224159e-01,5.5280222893e+00,0.0000000000e+00
5.5280222893e+00,5.7802224159e-01,0.0000000000e+00
5.7802224159e-01,5.5280222893e+00,5.0000000745e-02
5.5280222893e+00,5.7802224159e-01,5.0000000745e-02
5.7792127132e-01,5.5285139084e+00,2.5000000373e-02
5.5285139084e+00,5.7792127132e-01,2.5000000373e-02
5.5846452713e-01,5.5500001907e+00,0.0000000000e+00
5.5500001907e+00,5.5846458673e-01,0.0000000000e+00
5.5846452713e-01,5.5500001907e+00,5.0000000745e-02
5.5500001907e+00,5.5846458673e-01,5.0000000745e-02
5.5613309145e-01,5.5561332703e+00,0.0000000000e+00
5.5561332703e+00,5.5613315105e-01,0.0000000000e+00
5.5613309145e-01,5.5561332703e+00,6.1331158504e-03
5.5561332703e+00,5.5613315105e-01,6.1331237666e-03
5.5613309145e-01,5.5561332703e+00,4.3866883963e-02
5.5561332703e+00,5.5613315105e-01,4.3866876513e-02
5.5613309145e-01,5.5561332703e+00,5.0000000745e-02
5.5561332703e+00,5.5613315105e-01,5.0000000745e-02
5.5000001192e-01,5.5638051033e+00,0.0000000000e+00
5.5638051033e+00,5.5000001192e-01,0.0000000000e+00
5.5000001192e-01,5.5638051033e+00,5.0000000745e-02
5.5638051033e+00,5.5000001192e-01,5.0000000745e-02
5.3917104006e-01,5.5824108124e+00,2.5000000373e-02
5.5824108124e+00,5.3917104006e-01,2.5000000373e-02
5.3611618280e-01,5.5861163139e+00,0.0000000000e+00
5.5861163139e+00,5.3611624241e-01,0.0000000000e+00
5.3611618280e-01,5.5861163139e+00,5.0000000745e-02
5.5861163139e+00,5.3611624241e-01,5.0000000745e-02
5.2352237701e-01,5.5999999046e+00,0.0000000000e+00
5.5999999046e+00,5.2352237701e-01,0.0000000000e+00
5.2352237701e-01,5.5999999046e+00,5.0000000745e-02
5.5999999046e+00,5.2352237701e-01,5.0000000745e-02
5.1750135422e-01,5.6167521477e+00,2.5000000373e-02
5.6167521477e+00,5.1750135422e-01,2.5000000373e-02
5.1694458723e-01,5.6169447899e+00,0.0000000000e+00
5.6169447899e+00,5.1694458723e-01,0.0000000000e+00
5.1694458723e-01,5.6169447899e+00,5.0000000745e-02
5.6169447899e+00,5.1694458723e-01,5.0000000745e-02
5.0000000000e-01,5.6374306679e+00,0.0000000000e+00
5.6374306679e+00,5.0000000000e-01,0.0000000000e+00
5.0000000000e-01,5.6374306679e+00,5.0000000745e-02
5.6374306679e+00,5.0000000000e-01,5.0000000745e-02
4.9512410164e-01,5.6451239586e+00,0.0000000000e+00
5.6451239586e+00,4.9512410164e-01,0.0000000000e+00
4.9512410164e-01,5.6451239586e+00,4.8759123310e-03
5.6451239586e+00,4.9512410164e-01,4.8759044148e-03
4.9512410164e-01,5.6451239586e+00,4.5124087483e-02
5.6451239586e+00,4.9512410164e-01,4.5124094933e-02
4.9512410164e-01,5.6451239586e+00,5.0000000745e-02
5.6451239586e+00,4.9512410164e-01,5.0000000745e-02
4.9063026905e-01,5.6500000954e+00,0.0000000000e+00
5.6500000954e+00,4.9063029885e-01,0.0000000000e+00
4.9063026905e-01,5.6500000954e+00,5.0000000745e-02
5.6500000954e+00,4.9063029885e-01,5.0000000745e-02
5.6655769348e+00,4.8442316055e-01,0.0000000000e+00
4.8442316055e-01,5.6655769348e+00,0.0000000000e+00
5.6655769348e+00,4.8442316055e-01,5.0000000745e-02
4.8442316055e-01,5.6655769348e+00,5.0000000745e-02
5.6737046242e+00,4.7935608029e-01,2.5000000373e-02
4.7935608029e-01,5.6737046242e+00,2.5000000373e-02
4.7706249356e-01,5.6770625114e+00,0.0000000000e+00
5.6770625114e+00,4.7706249356e-01,0.0000000000e+00
4.7706249356e-01,5.6770625114e+00,5.0000000745e-02
5.6770625114e+00,4.7706249356e-01,5.0000000745e-02
4.5588484406e-01,5.6999998093e+00,0.0000000000e+00
5.6999998093e+00,4.5588484406e-01,0.0000000000e+00
4.5588484406e-01,5.6999998093e+00,5.0000000745e-02
5.6999998093e+00,4.5588484406e-01,5.0000000745e-02
4.5413205028e-01,5.7041320801e+00,0.0000000000e+00
5.7041320801e+00,4.5413205028e-01,0.0000000000e+00
4.5413205028e-01,5.7041320801e+00,4.1320547462e-03
5.7041320801e+00,4.5413205028e-01,4.1320621967e-03
4.5413205028e-01,5.7041320801e+00,4.5867945999e-02
5.7041320801e+00,4.5413205028e-01,4.5867938548e-02
4.5413205028e-01,5.7041320801e+00,5.0000000745e-02
5.7041320801e+00,4.5413205028e-01,5.0000000745e-02
4.4999998808e-01,5.7089390755e+00,0.0000000000e+00
5.7089390755e+00,4.4999998808e-01,0.0000000000e+00
4.4999998808e-01,5.7089390755e+00,5.0000000745e-02
5.7089390755e+00,4.4999998808e-01,5.0000000745e-02
4.3378347158e-01,5.7337832451e+00,0.0000000000e+00
5.7337832451e+00,4.3378347158e-01,0.0000000000e+00
4.3378347158e-01,5.7337832451e+00,5.0000000745e-02
5.7337832451e+00,4.3378347158e-01,5.0000000745e-02
4.3360599875e-01,5.7349834442e+00,2.5000000373e-02
5.7349834442e+00,4.3360599875e-01,2.5000000373e-02
4.1851317883e-01,5.7500000000e+00,0.0000000000e+00
5.7500000000e+00,4.1851317883e-01,0.0000000000e+00
4.1851317883e-01,5.7500000000e+00,5.0000000745e-02
5.7500000000e+00,4.1851317883e-01,5.0000000745e-02
4.1289675236e-01,5.7628965378e+00,0.0000000000e+00
5.7628965378e+00,4.1289675236e-01,0.0000000000e+00
4.1289675236e-01,5.7628965378e+00,5.0000000745e-02
5.7628965378e+00,4.1289675236e-01,5.0000000745e-02
4.1040378809e-01,5.7669310570e+00,2.5000000373e-02
5.7669310570e+00,4.1040378809e-01,2.5000000373e-02
4.0000000596e-01,5.7773423195e+00,0.0000000000e+00
5.7773427963e+00,4.0000000596e-01,0.0000000000e+00
4.0000000596e-01,5.7773423195e+00,5.0000000745e-02
5.7773427963e+00,4.0000000596e-01,5.0000000745e-02
3.9093944430e-01,5.7909393311e+00,0.0000000000e+00
5.7909393311e+00,3.9093944430e-01,0.0000000000e+00
3.9093944430e-01,5.7909393311e+00,9.0605635196e-03
5.7909393311e+00,3.9093944430e-01,9.0605560690e-03
3.9093944430e-01,5.7909393311e+00,4.0939435363e-02
5.7909393311e+00,3.9093944430e-01,4.0939442813e-02
3.9093944430e-01,5.7909393311e+00,5.0000000745e-02
5.7909393311e+00,3.9093944430e-01,5.0000000745e-02
3.8224083185e-01,5.8000001907e+00,0.0000000000e+00
5.8000001907e+00,3.8224083185e-01,0.0000000000e+00
3.8224083185e-01,5.8000001907e+00,5.0000000745e-02
5.8000001907e+00,3.8224083185e-01,5.0000000745e-02
3.7224298716e-01,5.8222432137e+00,0.0000000000e+00
5.8222432137e+00,3.7224298716e-01,0.0000000000e+00
3.7241303921e-01,5.8222169876e+00,2.5000000373e-02
5.8222169876e+00,3.7241306901e-01,2.5000000373e-02
3.7224298716e-01,5.8222432137e+00,5.0000000745e-02
5.8222432137e+00,3.7224298716e-01,5.0000000745e-02
3.4999999404e-01,5.8462586403e+00,0.0000000000e+00
5.8462591171e+00,3.4999999404e-01,0.0000000000e+00
3.4999999404e-01,5.8462586403e+00,5.0000000745e-02
5.8462591171e+00,3.4999999404e-01,5.0000000745e-02
3.4848672152e-01,5.8484869003e+00,0.0000000000e+00
5.8484869003e+00,3.4848675132e-01,0.0000000000e+00
3.4848672152e-01,5.8484869003e+00,1.5132640256e-03
5.8484869003e+00,3.4848675132e-01,1.5132555272e-03
3.4848672152e-01,5.8484869003e+00,4.8486735672e-02
5.8484869003e+00,3.4848675132e-01,4.8486743122e-02
3.4848672152e-01,5.8484869003e+00,5.0000000745e-02
5.8484869003e+00,3.4848675132e-01,5.0000000745e-02
3.4700968862e-01,5.8499999046e+00,0.0000000000e+00
5.8499999046e+00,3.4700968862e-01,0.0000000000e+00
3.4700968862e-01,5.8499999046e+00,5.0000000745e-02
5.8499999046e+00,3.4700968862e-01,5.0000000745e-02
5.8555855751e+00,3.4441456199e-01,0.0000000000e+00
3.4441453218e-01,5.8555855751e+00,0.0000000000e+00
5.8555855751e+00,3.4441456199e-01,5.5854287930e-03
3.4441453218e-01,5.8555855751e+00,5.5854604580e-03
5.8555855751e+00,3.4441456199e-01,4.4414572418e-02
3.4441453218e-01,5.8555855751e+00,4.4414538890e-02
5.8555855751e+00,3.4441456199e-01,5.0000000745e-02
3.4441453218e-01,5.8555855751e+00,5.0000000745e-02
3.2859241962e-01,5.8785924911e+00,0.0000000000e+00
5.8785924911e+00,3.2859241962e-01,0.0000000000e+00
3.2859241962e-01,5.8785924911e+00,5.0000000745e-02
5.8785924911e+00,3.2859241962e-01,5.0000000745e-02
3.2855635881e-01,5.8790040016e+00,2.5000000373e-02
5.8790040016e+00,3.2855638862e-01,2.5000000373e-02
3.0760496855e-01,5.9000000954e+00,0.0000000000e+00
5.9000000954e+00,3.0760496855e-01,0.0000000000e+00
3.0760496855e-01,5.9000000954e+00,5.0000000745e-02
5.9000000954e+00,3.0760496855e-01,5.0000000745e-02
3.0509257317e-01,5.9050927162e+00,0.0000000000e+00
5.9050927162e+00,3.0509260297e-01,0.0000000000e+00
3.0509257317e-01,5.9050927162e+00,5.0925808027e-03
5.9050927162e+00,3.0509260297e-01,5.0925887190e-03
3.0509257317e-01,5.9050927162e+00,4.4907420874e-02
5.9050927162e+00,3.0509260297e-01,4.4907409698e-02
3.0509257317e-01,5.9050927162e+00,5.0000000745e-02
5.9050927162e+00,3.0509260297e-01,5.0000000745e-02
3.0000001192e-01,5.9103598595e+00,0.0000000000e+00
5.9103598595e+00,3.0000001192e-01,0.0000000000e+00
3.0000001192e-01,5.9103598595e+00,5.0000000745e-02
5.9103598595e+00,3.0000001192e-01,5.0000000745e-02
2.8364908695e-01,5.9336490631e+00,0.0000000000e+00
5.9336490631e+00,2.8364908695e-01,0.0000000000e+00
2.8364908695e-01,5.9336490631e+00,5.0000000745e-02
5.9336490631e+00,2.8364908695e-01,5.0000000745e-02
2.8360885382e-01,5.9345827103e+00,2.5000000373e-02
5.9345827103e+00,2.8360885382e-01,2.5000000373e-02
2.6728725433e-01,5.9499998093e+00,0.0000000000e+00
5.9499998093e+00,2.6728725433e-01,0.0000000000e+00
2.6728725433e-01,5.9499998093e+00,5.0000000745e-02
5.9499998093e+00,2.6728725433e-01,5.0000000745e-02
2.6144424081e-01,5.9614443779e+00,0.0000000000e+00
5.9614443779e+00,2.6144424081e-01,0.0000000000e+00
2.6144424081e-01,5.9614443779e+00,1.1444225907e-02
5.9614443779e+00,2.6144424081e-01,1.1444235221e-02
2.6144424081e-01,5.9614443779e+00,3.8555774838e-02
5.9614443779e+00,2.6144424081e-01,3.8555763662e-02
2.6144424081e-01,5.9614443779e+00,5.0000000745e-02
5.9614443779e+00,2.6144424081e-01,5.0000000745e-02
2.5000000000e-01,5.9728035927e+00,0.0000000000e+00
5.9728035927e+00,2.5000000000e-01,0.0000000000e+00
2.5000000000e-01,5.9728035927e+00,5.0000000745e-02
5.9728035927e+00,2.5000000000e-01,5.0000000745e-02
2.5236189365e-01,5.9749999046e+00,2.5000000373e-02
5.9749999046e+00,2.5236189365e-01,2.5000000373e-02
2.3863855004e-01,5.9886384010e+00,0.0000000000e+00
5.9886384010e+00,2.3863855004e-01,0.0000000000e+00
2.3863855004e-01,5.9886384010e+00,1.1361451820e-02
5.9886384010e+00,2.3863855004e-01,1.1361445300e-02
2.3863855004e-01,5.9886384010e+00,3.8638547063e-02
5.9886384010e+00,2.3863855004e-01,3.8638554513e-02
2.3863855004e-01,5.9886384010e+00,5.0000000745e-02
5.9886384010e+00,2.3863855004e-01,5.0000000745e-02
2.2702798247e-01,6.0000000000e+00,0.0000000000e+00
6.0000000000e+00,2.2702799737e-01,0.0000000000e+00
2.2702798247e-01,6.0000000000e+00,5.0000000745e-02
6.0000000000e+00,2.2702799737e-01,5.0000000745e-02
2.1766239405e-01,6.0176625252e+00,0.0000000000e+00
6.0176625252e+00,2.1766239405e-01,0.0000000000e+00
2.1804836392e-01,6.0176968575e+00,2.5000000373e-02
6.0176968575e+00,2.1804837883e-01,2.5000000373e-02
2.1766239405e-01,6.0176625252e+00,5.0000000745e-02
6.0176625252e+00,2.1766239405e-01,5.0000000745e-02
2.0000000298e-01,6.0345196724e+00,0.0000000000e+00
6.0345196724e+00,2.0000000298e-01,0.0000000000e+00
2.0000000298e-01,6.0345196724e+00,5.0000000745e-02
6.0345196724e+00,2.0000000298e-01,5.0000000745e-02
1.9345772266e-01,6.0434575081e+00,0.0000000000e+00
6.0434575081e+00,1.9345773757e-01,0.0000000000e+00
1.9345772266e-01,6.0434575081e+00,6.5422761254e-03
6.0434575081e+00,1.9345773757e-01,6.5422677435e-03
1.9345772266e-01,6.0434575081e+00,4.3457724154e-02
6.0434575081e+00,1.9345773757e-01,4.3457731605e-02
1.9345772266e-01,6.0434575081e+00,5.0000000745e-02
6.0434575081e+00,1.9345773757e-01,5.0000000745e-02
1.8670117855e-01,6.0500001907e+00,0.0000000000e+00
6.0500001907e+00,1.8670120835e-01,0.0000000000e+00
1.8670117855e-01,6.0500001907e+00,5.0000000745e-02
6.0500001907e+00,1.8670120835e-01,5.0000000745e-02
1.7368121445e-01,6.0736813545e+00,0.0000000000e+00
6.0736813545e+00,1.7368122935e-01,0.0000000000e+00
1.7374962568e-01,6.0736904144e+00,2.5000000373e-02
6.0736904144e+00,1.7374964058e-01,2.5000000373e-02
1.7368121445e-01,6.0736813545e+00,5.0000000745e-02
6.0736813545e+00,1.7368122935e-01,5.0000000745e-02
1.5000000596e-01,6.0958442688e+00,0.0000000000e+00
6.0958442688e+00,1.5000000596e-01,0.0000000000e+00
1.5000000596e-01,6.0958442688e+00,5.0000000745e-02
6.0958442688e+00,1.5000000596e-01,5.0000000745e-02
1.4823676646e-01,6.0982365608e+00,0.0000000000e+00
6.0982365608e+00,1.4823676646e-01,0.0000000000e+00
1.4823676646e-01,6.0982365608e+00,1.7632403178e-03
6.0982365608e+00,1.4823676646e-01,1.7632315867e-03
1.4823676646e-01,6.0982365608e+00,4.8236761242e-02
6.0982365608e+00,1.4823676646e-01,4.8236768693e-02
1.4823676646e-01,6.0982365608e+00,5.0000000745e-02
6.0982365608e+00,1.4823676646e-01,5.0000000745e-02
1.4644129574e-01,6.0999999046e+00,0.0000000000e+00
6.0999999046e+00,1.4644132555e-01,0.0000000000e+00
1.4644129574e-01,6.0999999046e+00,5.0000000745e-02
6.0999999046e+00,1.4644132555e-01,5.0000000745e-02
6.1079902649e+00,1.4200969040e-01,0.0000000000e+00
1.4200966060e-01,6.1079902649e+00,0.0000000000e+00
6.1079902649e+00,1.4200969040e-01,7.9903043807e-03
1.4200966060e-01,6.1079902649e+00,7.9903444275e-03
6.1079902649e+00,1.4200969040e-01,4.2009696364e-02
1.4200966060e-01,6.1079902649e+00,4.2009655386e-02
6.1079902649e+00,1.4200969040e-01,5.0000000745e-02
1.4200966060e-01,6.1079902649e+00,5.0000000745e-02
1.2748995423e-01,6.1274900436e+00,0.0000000000e+00
6.1274900436e+00,1.2748995423e-01,0.0000000000e+00
1.2748995423e-01,6.1274900436e+00,5.0000000745e-02
6.1274900436e+00,1.2748995423e-01,5.0000000745e-02
1.2751196325e-01,6.1277060509e+00,2.5000000373e-02
6.1277060509e+00,1.2751196325e-01,2.5000000373e-02
1.0450021178e-01,6.1500000954e+00,0.0000000000e+00
6.1500000954e+00,1.0450021923e-01,0.0000000000e+00
1.0450021178e-01,6.1500000954e+00,5.0000000745e-02
6.1500000954e+00,1.0450021923e-01,5.0000000745e-02
1.0284326226e-01,6.1528434753e+00,0.0000000000e+00
6.1528434753e+00,1.0284326971e-01,0.0000000000e+00
1.0284326226e-01,6.1528434753e+00,2.8432647232e-03
6.1528434753e+00,1.0284326971e-01,2.8432724066e-03
1.0284326226e-01,6.1528434753e+00,4.7156736255e-02
6.1528434753e+00,1.0284326971e-01,4.7156728804e-02
1.0284326226e-01,6.1528434753e+00,5.0000000745e-02
6.1528434753e+00,1.0284326971e-01,5.0000000745e-02
1.0000000149e-01,6.1555414200e+00,0.0000000000e+00
6.1555414200e+00,1.0000000149e-01,0.0000000000e+00
1.0000000149e-01,6.1555414200e+00,5.0000000745e-02
6.1555414200e+00,1.0000000149e-01,5.0000000745e-02
8.1237815320e-02,6.1812376976e+00,0.0000000000e+00
6.1812376976e+00,8.1237822771e-02,0.0000000000e+00
8.1237815320e-02,6.1812376976e+00,5.0000000745e-02
6.1812376976e+00,8.1237822771e-02,5.0000000745e-02
8.1283569336e-02,6.1818013191e+00,2.5000000373e-02
6.1818013191e+00,8.1283576787e-02,2.5000000373e-02
5.8490555733e-02,6.1999998093e+00,0.0000000000e+00
6.1999998093e+00,5.8490566909e-02,0.0000000000e+00
5.8490555733e-02,6.1999998093e+00,5.0000000745e-02
6.1999998093e+00,5.8490566909e-02,5.0000000745e-02
5.5555824190e-02,6.2055559158e+00,0.0000000000e+00
6.2055559158e+00,5.5555835366e-02,0.0000000000e+00
5.5555824190e-02,6.2055559158e+00,5.5558253080e-03
6.2055559158e+00,5.5555835366e-02,5.5558346212e-03
5.5555824190e-02,6.2055559158e+00,4.4444173574e-02
6.2055559158e+00,5.5555835366e-02,4.4444166124e-02
5.5555824190e-02,6.2055559158e+00,5.0000000745e-02
6.2055559158e+00,5.5555835366e-02,5.0000000745e-02
5.0000000745e-02,6.2086482048e+00,0.0000000000e+00
6.2086482048e+00,5.0000000745e-02,0.0000000000e+00
5.0000000745e-02,6.2086482048e+00,5.0000000745e-02
6.2086482048e+00,5.0000000745e-02,5.0000000745e-02
0.0000000000e+00,6.2294416428e+00,0.0000000000e+00
6.2294416428e+00,0.0000000000e+00,0.0000000000e+00
0.0000000000e+00,6.2294416428e+00,5.0000000745e-02
6.2294416428e+00,0.0000000000e+00,5.0000000745e-02
2.9678842053e-02,6.2296786308e+00,0.0000000000e+00
6.2296786308e+00,2.9678849503e-02,0.0000000000e+00
2.9678842053e-02,6.2296786308e+00,5.0000000745e-02
6.2296786308e+00,2.9678849503e-02,5.0000000745e-02
2.5340553373e-02,6.2315287590e+00,2.5000000373e-02
6.2315287590e+00,2.5340553373e-02,2.5000000373e-02
0.0000000000e+00,6.2337322235e+00,1.6267558560e-02
1.6267558560e-02,6.2337322235e+00,0.0000000000e+00
6.2337322235e+00,0.0000000000e+00,1.6267543659e-02
6.2337322235e+00,1.6267543659e-02,0.0000000000e+00
0.0000000000e+00,6.2337322235e+00,3.3732440323e-02
6.2337322235e+00,0.0000000000e+00,3.3732455224e-02
1.6267558560e-02,6.2337322235e+00,5.0000000745e-02
6.2337322235e+00,1.6267543659e-02,5.0000000745e-02
