%!PS-Adobe-3.0 EPSF-3.0
%%Title: isotropy_envelope_shapes.eps
%%Creator: Matplotlib v3.7.2, https://matplotlib.org/
%%CreationDate: Wed Feb  7 08:48:38 2024
%%Orientation: portrait
%%BoundingBox: 140 246 472 546
%%HiResBoundingBox: 140.003125 246.478318 471.996875 545.521682
%%EndComments
%%BeginProlog
/mpldict 14 dict def
mpldict begin
/_d { bind def } bind def
/m { moveto } _d
/l { lineto } _d
/r { rlineto } _d
/c { curveto } _d
/cl { closepath } _d
/ce { closepath eofill } _d
/box {
      m
      1 index 0 r
      0 exch r
      neg 0 r
      cl
    } _d
/clipbox {
      box
      clip
      newpath
    } _d
/sc { setcachedevice } _d
%!PS-Adobe-3.0 Resource-Font
%%Creator: Converted from TrueType to Type 3 by Matplotlib.
10 dict begin
/FontName /STIXGeneral-Regular def
/PaintType 0 def
/FontMatrix [0.001 0 0 0.001 0 0] def
/FontBBox [-970 -443 2000 1023] def
/FontType 3 def
/Encoding [/zero /one /two /minus /four /three /six /five /eight /seven] def
/CharStrings 11 dict dup begin
/.notdef 0 def
/zero{500 0 24 -14 476 676 sc
476 330 m
476 285 472 243 463 203 c
454 164 441 127 424 94 c
407 61 384 34 354 15 c
324 -4 289 -14 250 -14 c
209 -14 174 -4 143 17 c
112 38 89 65 72 100 c
55 135 43 172 35 211 c
28 250 24 292 24 336 c
24 398 32 454 47 503 c
62 553 88 594 123 627 c
159 660 203 676 254 676 c
319 676 373 644 414 580 c
455 516 476 433 476 330 c

380 325 m
380 430 369 511 346 566 c
324 622 291 650 248 650 c
207 650 175 622 153 566 c
131 510 120 431 120 329 c
120 226 131 148 153 93 c
175 39 207 12 250 12 c
292 12 324 39 346 93 c
369 148 380 225 380 325 c

ce} _d
/one{500 0 111 0 394 676 sc
394 0 m
118 0 l
118 15 l
155 17 180 24 193 35 c
206 47 213 67 213 95 c
213 544 l
213 577 203 593 183 593 c
174 593 159 589 138 581 c
111 571 l
111 585 l
290 676 l
299 673 l
299 76 l
299 54 306 38 319 29 c
332 20 357 15 394 15 c
394 0 l

ce} _d
/two{500 0 29 0 474 676 sc
474 137 m
420 0 l
29 0 l
29 12 l
207 201 l
254 250 287 294 307 335 c
327 376 337 418 337 461 c
337 506 325 540 300 565 c
275 590 241 602 198 602 c
162 602 133 593 112 574 c
91 555 71 521 51 472 c
30 477 l
41 539 64 588 98 623 c
133 658 179 676 238 676 c
293 676 338 659 372 626 c
406 593 423 551 423 500 c
423 425 380 342 295 252 c
130 76 l
364 76 l
386 76 403 80 416 89 c
429 98 444 116 460 143 c
474 137 l

ce} _d
/minus{685 0 64 220 621 286 sc
621 220 m
64 220 l
64 286 l
621 286 l
621 220 l

ce} _d
/four{500 0 12 0 473 676 sc
473 167 m
370 167 l
370 0 l
292 0 l
292 167 l
12 167 l
12 231 l
326 676 l
370 676 l
370 231 l
473 231 l
473 167 l

292 231 m
292 574 l
52 231 l
292 231 l

ce} _d
/three{500 0 41 -14 431 676 sc
61 510 m
45 514 l
60 564 84 603 117 632 c
150 661 191 676 241 676 c
288 676 325 663 354 638 c
383 613 397 580 397 539 c
397 484 366 438 304 401 c
341 385 368 367 387 348 c
416 315 431 272 431 219 c
431 166 416 119 385 79 c
362 48 330 25 287 9 c
245 -6 200 -14 153 -14 c
78 -14 41 5 41 43 c
41 54 45 62 53 69 c
61 76 71 79 82 79 c
99 79 119 70 143 53 c
172 32 201 22 229 22 c
266 22 296 37 321 66 c
346 96 359 132 359 175 c
359 252 324 300 255 320 c
234 327 200 330 153 330 c
153 344 l
190 357 218 369 237 380 c
291 411 318 455 318 514 c
318 547 308 573 289 590 c
270 607 244 616 210 616 c
150 616 100 581 61 510 c

ce} _d
/six{500 0 34 -14 468 684 sc
446 684 m
448 668 l
369 655 304 623 251 572 c
198 521 165 458 152 383 c
191 413 233 428 279 428 c
338 428 384 409 417 372 c
451 335 468 284 468 219 c
468 154 451 100 417 59 c
378 10 325 -14 258 -14 c
177 -14 118 20 81 87 c
50 144 34 208 34 279 c
34 388 70 480 143 555 c
184 598 227 628 270 645 c
314 663 373 676 446 684 c

378 188 m
378 317 333 382 243 382 c
210 382 182 373 160 355 c
138 338 127 308 127 266 c
127 188 139 126 163 81 c
188 36 223 14 269 14 c
304 14 331 30 350 61 c
369 93 378 135 378 188 c

ce} _d
/five{500 0 31 -14 438 688 sc
438 681 m
402 596 l
398 587 389 583 375 583 c
181 583 l
141 498 l
214 484 267 469 300 452 c
333 436 363 409 391 370 c
414 338 426 296 426 243 c
426 195 418 155 402 122 c
387 89 362 60 328 35 c
283 2 226 -14 158 -14 c
120 -14 89 -8 66 3 c
43 14 31 29 31 48 c
31 73 46 86 76 86 c
100 86 125 76 150 55 c
176 34 200 23 221 23 c
256 23 287 40 314 75 c
342 110 356 149 356 192 c
356 256 334 306 289 342 c
231 389 160 412 76 412 c
68 412 64 415 64 420 c
65 425 l
174 662 l
381 662 l
392 662 401 664 407 667 c
414 670 421 677 429 688 c
438 681 l

ce} _d
/eight{500 0 56 -14 445 676 sc
445 155 m
445 104 427 63 391 32 c
356 1 308 -14 248 -14 c
192 -14 146 1 110 32 c
74 63 56 102 56 149 c
56 184 65 214 82 239 c
99 264 134 295 186 332 c
136 373 103 407 86 432 c
70 457 62 487 62 520 c
62 567 80 605 116 633 c
153 662 199 676 256 676 c
305 676 345 662 376 634 c
408 607 424 573 424 533 c
424 496 414 467 395 445 c
376 423 341 398 290 371 c
350 331 391 295 412 264 c
434 233 445 196 445 155 c

355 533 m
355 568 345 595 326 616 c
307 637 280 648 246 648 c
212 648 185 639 165 621 c
146 604 136 580 136 549 c
136 518 146 490 165 465 c
185 440 217 415 261 389 c
295 409 319 430 333 452 c
348 475 355 502 355 533 c

271 272 m
212 312 l
183 288 162 264 150 241 c
138 218 132 191 132 158 c
132 113 143 77 166 52 c
189 27 220 14 259 14 c
292 14 318 24 338 44 c
359 65 369 91 369 124 c
369 154 361 180 346 203 c
331 226 306 249 271 272 c

ce} _d
/seven{500 0 20 -8 449 662 sc
449 646 m
237 -8 l
172 -8 l
370 588 l
155 588 l
126 588 105 583 91 573 c
77 563 59 541 38 506 c
20 515 l
80 662 l
449 662 l
449 646 l

ce} _d
end readonly def

/BuildGlyph {
 exch begin
 CharStrings exch
 2 copy known not {pop /.notdef} if
 true 3 1 roll get exec
 end
} _d

/BuildChar {
 1 index /Encoding get exch get
 1 index /BuildGlyph get exec
} _d

FontName currentdict end definefont pop
%!PS-Adobe-3.0 Resource-Font
%%Creator: Converted from TrueType to Type 3 by Matplotlib.
10 dict begin
/FontName /Cmmi10 def
/PaintType 0 def
/FontMatrix [0.00048828125 0 0 0.00048828125 0 0] def
/FontBBox [-70 -512 2146 1536] def
/FontType 3 def
/Encoding [/x /y /period /t] def
/CharStrings 5 dict dup begin
/.notdef 0 def
/x{1169 0 63 -23 1077 905 sc
160 59 m
184 40 218 31 262 31 c
305 31 342 51 375 92 c
408 133 430 178 442 227 c
535 590 l
550 656 557 701 557 725 c
557 759 547 789 528 814 c
509 839 483 852 449 852 c
406 852 365 838 327 811 c
289 784 257 750 231 708 c
205 667 187 625 176 582 c
173 573 168 569 160 569 c
135 569 l
124 569 119 575 119 588 c
119 594 l
132 645 155 694 187 742 c
219 791 258 830 304 860 c
351 890 400 905 453 905 c
503 905 548 892 588 865 c
629 838 657 802 674 756 c
697 798 727 833 763 862 c
800 891 840 905 883 905 c
912 905 942 900 973 889 c
1004 879 1029 863 1048 842 c
1067 821 1077 794 1077 762 c
1077 727 1066 697 1043 672 c
1021 647 993 635 958 635 c
936 635 918 642 903 656 c
888 670 881 688 881 709 c
881 738 891 763 910 784 c
930 806 954 819 981 823 c
956 842 922 852 879 852 c
835 852 797 832 764 791 c
732 750 709 705 696 655 c
606 293 l
591 238 584 193 584 158 c
584 123 594 93 613 68 c
633 43 659 31 692 31 c
756 31 813 59 863 115 c
914 172 947 234 963 301 c
966 309 971 313 979 313 c
1004 313 l
1009 313 1014 311 1017 307 c
1020 304 1022 300 1022 295 c
1022 294 1021 292 1020 289 c
1001 208 960 135 898 72 c
836 9 766 -23 688 -23 c
638 -23 593 -10 552 17 c
512 44 484 81 467 127 c
446 87 416 52 378 22 c
341 -8 301 -23 258 -23 c
229 -23 198 -18 167 -7 c
136 3 111 19 92 40 c
73 61 63 88 63 121 c
63 153 74 182 96 208 c
119 235 147 248 180 248 c
203 248 222 241 237 227 c
252 214 260 196 260 174 c
260 145 250 120 231 99 c
212 78 189 64 160 59 c

ce} _d
/y{1004 0 55 -420 1008 905 sc
172 -293 m
201 -342 251 -367 322 -367 c
387 -367 443 -344 490 -299 c
537 -254 575 -199 604 -134 c
633 -70 656 -4 672 63 c
611 6 546 -23 475 -23 c
421 -23 375 -14 337 5 c
299 24 269 51 248 88 c
227 125 217 170 217 223 c
217 268 223 313 235 360 c
247 407 264 460 285 517 c
307 575 326 625 342 668 c
360 718 369 759 369 791 c
369 832 354 852 324 852 c
270 852 225 824 190 768 c
155 713 130 651 113 582 c
110 573 105 569 96 569 c
72 569 l
61 569 55 575 55 588 c
55 594 l
77 675 111 747 156 810 c
201 873 259 905 328 905 c
377 905 418 889 451 857 c
485 825 502 784 502 735 c
502 710 496 683 485 655 c
479 638 465 602 444 546 c
423 490 406 444 395 407 c
384 370 374 334 367 299 c
360 264 356 228 356 193 c
356 148 366 109 385 78 c
404 47 435 31 477 31 c
562 31 638 83 705 186 c
860 817 l
865 835 875 850 892 863 c
909 876 927 883 946 883 c
963 883 977 878 989 867 c
1002 856 1008 842 1008 825 c
1008 817 1007 812 1006 809 c
803 -6 l
785 -76 752 -143 704 -207 c
656 -271 598 -322 530 -361 c
463 -400 392 -420 319 -420 c
284 -420 249 -413 214 -399 c
179 -386 151 -365 130 -338 c
109 -311 98 -279 98 -242 c
98 -205 109 -172 131 -145 c
153 -118 182 -104 219 -104 c
241 -104 259 -111 274 -124 c
289 -138 297 -156 297 -178 c
297 -209 285 -237 262 -260 c
239 -283 211 -295 180 -295 c
179 -294 177 -294 176 -293 c
175 -293 173 -293 172 -293 c

ce} _d
/period{567 0 172 0 397 225 sc
172 113 m
172 144 183 170 206 192 c
229 214 255 225 285 225 c
304 225 322 220 340 210 c
358 200 372 186 382 168 c
392 150 397 132 397 113 c
397 83 386 57 364 34 c
342 11 316 0 285 0 c
255 0 229 11 206 34 c
183 57 172 83 172 113 c

ce} _d
/t{739 0 45 -23 676 1282 sc
127 166 m
127 186 129 205 133 223 c
281 811 l
66 811 l
52 811 45 820 45 838 c
50 868 59 883 72 883 c
299 883 l
381 1217 l
386 1235 397 1250 413 1263 c
429 1276 447 1282 467 1282 c
484 1282 499 1277 510 1266 c
522 1256 528 1242 528 1225 c
528 1221 528 1218 527 1215 c
527 1213 527 1211 526 1208 c
444 883 l
655 883 l
669 883 676 874 676 856 c
675 853 674 847 672 839 c
670 831 667 824 664 819 c
661 814 656 811 649 811 c
426 811 l
279 219 l
269 180 264 147 264 119 c
264 60 284 31 324 31 c
384 31 437 59 483 115 c
530 172 565 234 590 301 c
595 309 601 313 606 313 c
631 313 l
636 313 641 311 644 307 c
647 304 649 300 649 295 c
649 292 648 290 647 289 c
617 206 573 134 516 71 c
459 8 393 -23 319 -23 c
265 -23 219 -5 182 30 c
145 65 127 111 127 166 c

ce} _d
end readonly def

/BuildGlyph {
 exch begin
 CharStrings exch
 2 copy known not {pop /.notdef} if
 true 3 1 roll get exec
 end
} _d

/BuildChar {
 1 index /Encoding get exch get
 1 index /BuildGlyph get exec
} _d

FontName currentdict end definefont pop
%!PS-Adobe-3.0 Resource-Font
%%Creator: Converted from TrueType to Type 3 by Matplotlib.
10 dict begin
/FontName /Cmsy10 def
/PaintType 0 def
/FontMatrix [0.00048828125 0 0 0.00048828125 0 0] def
/FontBBox [-59 -1966 2300 1595] def
/FontType 3 def
/Encoding [/approxequal] def
/CharStrings 2 dict dup begin
/.notdef 0 def
/approxequal{1591 0 115 115 1477 989 sc
143 115 m
128 115 119 132 115 166 c
115 178 l
115 240 130 297 160 348 c
191 399 232 439 285 468 c
338 497 394 512 455 512 c
528 512 604 488 681 441 c
759 394 836 347 913 300 c
990 253 1064 229 1137 229 c
1207 229 1271 251 1330 294 c
1389 337 1419 393 1419 461 c
1423 495 1433 512 1448 512 c
1463 512 1473 495 1477 461 c
1477 449 l
1477 387 1462 330 1431 279 c
1400 228 1359 187 1306 158 c
1254 129 1198 115 1137 115 c
1080 115 1026 127 975 150 c
925 174 866 209 798 254 c
731 300 671 335 620 360 c
569 385 514 397 455 397 c
412 397 368 387 323 368 c
278 349 242 321 214 286 c
186 251 172 211 172 166 c
168 132 158 115 143 115 c

143 592 m
128 592 119 609 115 643 c
115 655 l
115 717 130 774 160 825 c
191 876 232 916 285 945 c
338 974 394 989 455 989 c
528 989 604 965 681 918 c
759 871 836 824 913 777 c
990 730 1064 707 1137 707 c
1207 707 1271 729 1330 772 c
1389 815 1419 871 1419 938 c
1423 972 1433 989 1448 989 c
1463 989 1473 972 1477 938 c
1477 926 l
1477 864 1462 807 1431 756 c
1400 705 1359 664 1306 635 c
1254 606 1198 592 1137 592 c
1080 592 1026 604 975 627 c
925 651 866 686 798 731 c
731 777 671 812 620 837 c
569 862 514 874 455 874 c
412 874 368 864 323 845 c
278 826 242 798 214 763 c
186 728 172 688 172 643 c
168 609 158 592 143 592 c

ce} _d
end readonly def

/BuildGlyph {
 exch begin
 CharStrings exch
 2 copy known not {pop /.notdef} if
 true 3 1 roll get exec
 end
} _d

/BuildChar {
 1 index /Encoding get exch get
 1 index /BuildGlyph get exec
} _d

FontName currentdict end definefont pop
%!PS-Adobe-3.0 Resource-Font
%%Creator: Converted from TrueType to Type 3 by Matplotlib.
10 dict begin
/FontName /Cmr10 def
/PaintType 0 def
/FontMatrix [0.00048828125 0 0 0.00048828125 0 0] def
/FontBBox [-90 -512 2066 1536] def
/FontType 3 def
/Encoding [/zero /one /two /three /four /five /six /seven /eight /nine] def
/CharStrings 11 dict dup begin
/.notdef 0 def
/zero{1024 0 80 -45 942 1364 sc
512 -45 m
345 -45 231 24 170 161 c
110 299 80 463 80 653 c
80 772 91 883 112 988 c
134 1093 177 1181 241 1254 c
306 1327 396 1364 512 1364 c
602 1364 676 1342 733 1298 c
790 1254 834 1197 864 1127 c
894 1058 914 983 925 903 c
936 824 942 740 942 653 c
942 536 931 426 909 323 c
888 221 845 134 782 62 c
719 -9 629 -45 512 -45 c

512 8 m
588 8 645 47 682 125 c
719 203 742 289 751 384 c
760 479 764 579 764 686 c
764 789 760 883 751 970 c
742 1057 719 1135 682 1205 c
645 1276 589 1311 512 1311 c
435 1311 377 1276 340 1205 c
303 1134 280 1056 271 969 c
262 883 258 789 258 686 c
258 610 260 538 263 471 c
267 404 277 334 293 262 c
309 191 335 130 370 81 c
406 32 453 8 512 8 c

ce} _d
/one{1024 0 178 0 862 1364 sc
190 0 m
190 72 l
361 72 446 94 446 137 c
446 1212 l
375 1178 286 1161 178 1161 c
178 1233 l
345 1233 472 1277 557 1364 c
586 1364 l
591 1364 595 1362 599 1358 c
604 1355 606 1351 606 1346 c
606 137 l
606 94 691 72 862 72 c
862 0 l
190 0 l

ce} _d
/two{1024 0 102 0 920 1364 sc
102 0 m
102 55 l
102 58 103 62 106 66 c
424 418 l
472 470 511 514 541 549 c
571 584 601 625 630 671 c
659 717 682 764 699 811 c
716 859 725 910 725 963 c
725 1019 715 1072 694 1123 c
673 1174 642 1215 601 1246 c
560 1277 511 1292 453 1292 c
394 1292 340 1274 293 1238 c
246 1203 212 1157 193 1100 c
198 1101 206 1102 215 1102 c
246 1102 272 1092 293 1071 c
315 1050 326 1024 326 991 c
326 960 315 933 293 911 c
272 890 246 879 215 879 c
183 879 156 890 134 912 c
113 935 102 961 102 991 c
102 1042 112 1090 131 1135 c
150 1180 178 1220 214 1255 c
251 1290 292 1317 337 1336 c
383 1355 432 1364 483 1364 c
561 1364 634 1347 701 1314 c
768 1281 822 1235 861 1174 c
900 1114 920 1044 920 963 c
920 904 907 847 881 794 c
855 741 822 692 781 648 c
740 605 688 555 625 500 c
562 445 520 408 500 389 c
268 166 l
465 166 l
562 166 642 167 707 168 c
772 170 807 173 811 176 c
827 193 843 256 860 365 c
920 365 l
862 0 l
102 0 l

ce} _d
/three{1024 0 86 -45 936 1364 sc
195 158 m
227 111 270 77 324 54 c
378 31 436 20 498 20 c
577 20 634 54 667 121 c
700 189 717 266 717 352 c
717 391 713 429 706 468 c
699 507 688 543 671 576 c
654 609 631 636 602 656 c
573 676 538 686 496 686 c
360 686 l
348 686 342 692 342 705 c
342 723 l
342 734 348 739 360 739 c
473 748 l
521 748 561 766 592 802 c
624 838 647 882 662 933 c
677 985 684 1034 684 1081 c
684 1146 669 1200 638 1242 c
607 1284 561 1305 498 1305 c
446 1305 396 1295 349 1275 c
302 1256 264 1226 236 1186 c
239 1187 241 1187 243 1187 c
245 1188 247 1188 250 1188 c
281 1188 306 1177 327 1156 c
348 1135 358 1109 358 1079 c
358 1050 348 1024 327 1003 c
306 982 281 971 250 971 c
220 971 194 982 173 1003 c
152 1024 141 1050 141 1079 c
141 1138 159 1189 194 1232 c
229 1275 275 1308 330 1330 c
386 1353 442 1364 498 1364 c
539 1364 583 1358 629 1345 c
675 1333 717 1315 754 1292 c
791 1269 822 1240 845 1204 c
869 1168 881 1127 881 1081 c
881 1024 868 971 842 922 c
817 873 782 831 737 796 c
692 761 643 734 590 717 c
649 706 706 683 759 650 c
812 617 855 574 887 522 c
920 470 936 414 936 354 c
936 279 915 210 874 149 c
833 88 778 41 711 6 c
644 -28 573 -45 498 -45 c
434 -45 370 -33 305 -8 c
241 16 188 52 147 101 c
106 150 86 208 86 276 c
86 310 97 338 120 361 c
143 384 171 395 205 395 c
227 395 247 390 265 379 c
284 369 298 355 308 336 c
319 317 324 297 324 276 c
324 243 312 215 289 192 c
266 169 238 158 205 158 c
195 158 l

ce} _d
/four{1024 0 57 0 965 1364 sc
57 338 m
57 410 l
690 1354 l
695 1361 702 1364 711 1364 c
741 1364 l
756 1364 764 1356 764 1341 c
764 410 l
965 410 l
965 338 l
764 338 l
764 137 l
764 109 784 91 824 83 c
864 76 910 72 963 72 c
963 0 l
399 0 l
399 72 l
452 72 498 76 538 83 c
578 91 598 109 598 137 c
598 338 l
57 338 l

125 410 m
610 410 l
610 1135 l
125 410 l

ce} _d
/five{1024 0 102 -45 920 1364 sc
178 233 m
192 193 213 157 242 124 c
271 91 306 66 345 47 c
385 29 426 20 469 20 c
568 20 636 58 673 135 c
710 212 729 305 729 414 c
729 461 728 501 726 533 c
725 566 720 597 713 627 c
700 675 678 717 646 753 c
615 789 576 807 530 807 c
484 807 444 800 411 786 c
378 772 352 756 331 737 c
310 718 292 699 276 678 c
260 657 250 646 246 645 c
223 645 l
220 645 215 647 210 651 c
205 656 203 660 203 664 c
203 1348 l
203 1351 205 1355 209 1358 c
214 1362 218 1364 223 1364 c
229 1364 l
321 1320 419 1298 522 1298 c
623 1298 721 1320 815 1364 c
821 1364 l
826 1364 830 1362 834 1359 c
838 1356 840 1352 840 1348 c
840 1329 l
840 1322 839 1319 836 1319 c
789 1257 731 1209 660 1174 c
590 1139 517 1122 442 1122 c
387 1122 331 1130 274 1145 c
274 758 l
319 795 360 821 395 836 c
431 852 477 860 532 860 c
607 860 675 838 734 795 c
794 752 840 695 872 625 c
904 556 920 485 920 412 c
920 330 900 254 859 184 c
819 114 764 58 695 17 c
626 -24 550 -45 469 -45 c
402 -45 340 -28 283 7 c
227 42 183 88 150 147 c
118 206 102 268 102 334 c
102 365 112 390 132 409 c
152 428 177 438 207 438 c
237 438 262 428 282 408 c
303 389 313 364 313 334 c
313 305 303 280 282 259 c
262 239 237 229 207 229 c
202 229 197 229 191 230 c
185 231 181 232 178 233 c

ce} _d
/six{1024 0 86 -45 936 1364 sc
512 -45 m
427 -45 357 -23 300 22 c
243 67 199 126 168 197 c
137 269 116 344 104 423 c
92 502 86 581 86 662 c
86 770 107 878 149 987 c
191 1096 253 1186 334 1257 c
416 1328 513 1364 625 1364 c
672 1364 715 1355 755 1337 c
796 1320 827 1294 850 1259 c
873 1225 885 1184 885 1135 c
885 1107 875 1083 856 1064 c
837 1045 814 1036 786 1036 c
759 1036 736 1046 717 1065 c
698 1084 688 1108 688 1135 c
688 1162 698 1185 717 1204 c
736 1223 759 1233 786 1233 c
797 1233 l
780 1258 755 1276 723 1287 c
692 1299 659 1305 625 1305 c
584 1305 545 1296 510 1278 c
475 1260 444 1236 416 1205 c
388 1174 365 1140 346 1103 c
327 1066 313 1024 302 977 c
292 930 286 885 283 844 c
280 803 279 751 279 688 c
303 744 337 790 381 825 c
425 861 475 879 530 879 c
591 879 646 867 696 842 c
746 817 789 783 825 739 c
861 696 888 646 907 590 c
926 534 936 477 936 420 c
936 340 918 264 882 191 c
847 119 797 62 732 19 c
667 -24 594 -45 512 -45 c

512 20 m
565 20 607 32 639 56 c
671 80 694 112 709 151 c
724 191 734 231 737 271 c
741 312 743 361 743 420 c
743 497 739 563 732 618 c
725 673 705 721 672 762 c
639 804 589 825 522 825 c
467 825 421 806 385 769 c
350 732 324 684 307 627 c
291 570 283 516 283 463 c
283 445 284 431 285 422 c
285 420 285 418 284 417 c
284 416 284 414 283 412 c
283 353 289 294 301 234 c
313 174 336 123 370 82 c
404 41 451 20 512 20 c

ce} _d
/seven{1024 0 115 -45 993 1384 sc
356 53 m
356 129 363 203 376 276 c
389 349 409 420 434 491 c
460 562 491 632 527 700 c
564 769 604 833 647 893 c
834 1153 l
600 1153 l
357 1153 232 1150 225 1143 c
207 1121 190 1058 174 954 c
115 954 l
182 1384 l
242 1384 l
242 1378 l
242 1353 284 1337 367 1330 c
450 1323 532 1319 612 1319 c
993 1319 l
993 1266 l
993 1265 993 1264 992 1263 c
992 1262 992 1261 991 1260 c
709 864 l
640 761 596 647 579 522 c
562 397 553 240 553 53 c
553 26 543 3 524 -16 c
505 -35 482 -45 455 -45 c
428 -45 404 -35 385 -16 c
366 3 356 26 356 53 c

ce} _d
/eight{1024 0 86 -45 936 1364 sc
86 311 m
86 393 113 465 167 528 c
221 591 290 644 375 686 c
299 735 l
252 766 214 806 185 857 c
156 908 141 962 141 1018 c
141 1083 158 1142 192 1195 c
227 1248 272 1289 329 1319 c
386 1349 447 1364 512 1364 c
573 1364 631 1352 687 1327 c
744 1302 790 1267 826 1221 c
863 1175 881 1120 881 1057 c
881 1011 870 968 848 929 c
827 890 797 854 759 823 c
722 792 682 765 639 743 c
756 668 l
810 633 853 586 886 529 c
919 472 936 411 936 348 c
936 274 916 207 876 146 c
837 85 784 38 719 5 c
654 -28 585 -45 512 -45 c
441 -45 373 -31 307 -2 c
242 27 188 68 147 122 c
106 177 86 240 86 311 c

197 311 m
197 257 212 208 241 163 c
271 118 310 83 359 58 c
408 33 459 20 512 20 c
591 20 663 43 728 89 c
793 136 825 197 825 274 c
825 300 820 326 809 351 c
799 377 785 400 766 421 c
748 442 728 460 705 473 c
430 651 l
387 628 348 600 312 565 c
277 530 249 491 228 448 c
207 405 197 359 197 311 c

338 936 m
586 776 l
643 809 690 850 727 897 c
764 944 782 998 782 1057 c
782 1103 769 1145 743 1183 c
718 1222 684 1252 643 1273 c
602 1294 557 1305 510 1305 c
469 1305 427 1297 385 1281 c
343 1265 308 1241 281 1209 c
254 1178 240 1141 240 1098 c
240 1034 273 980 338 936 c

ce} _d
/nine{1024 0 86 -45 936 1364 sc
231 86 m
268 42 333 20 426 20 c
478 20 526 38 571 73 c
616 108 651 152 676 203 c
705 261 723 323 731 388 c
739 454 743 536 743 633 c
720 578 686 532 642 497 c
599 462 549 444 492 444 c
413 444 342 465 279 508 c
217 551 169 608 136 678 c
103 749 86 824 86 903 c
86 985 105 1061 142 1132 c
179 1203 231 1260 297 1301 c
363 1343 438 1364 522 1364 c
605 1364 674 1341 729 1296 c
785 1251 828 1193 857 1122 c
886 1051 907 976 918 897 c
930 818 936 739 936 662 c
936 557 917 449 878 339 c
839 230 781 138 704 65 c
627 -8 535 -45 426 -45 c
345 -45 277 -26 221 12 c
165 50 137 107 137 184 c
137 212 146 235 165 254 c
184 273 208 283 236 283 c
263 283 286 273 305 254 c
324 235 334 212 334 184 c
334 157 324 134 305 115 c
286 96 263 86 236 86 c
231 86 l

500 498 m
556 498 602 517 637 554 c
673 592 699 639 715 695 c
731 751 739 807 739 862 c
739 901 l
739 909 l
739 1012 724 1103 694 1184 c
664 1265 607 1305 522 1305 c
468 1305 424 1293 390 1269 c
357 1246 332 1214 316 1175 c
300 1136 290 1094 285 1049 c
281 1004 279 956 279 903 c
279 826 283 760 290 705 c
297 650 317 602 350 560 c
383 519 433 498 500 498 c

ce} _d
end readonly def

/BuildGlyph {
 exch begin
 CharStrings exch
 2 copy known not {pop /.notdef} if
 true 3 1 roll get exec
 end
} _d

/BuildChar {
 1 index /Encoding get exch get
 1 index /BuildGlyph get exec
} _d

FontName currentdict end definefont pop
end
%%EndProlog
mpldict begin
140.003 246.478 translate
331.994 299.043 0 0 clipbox
gsave
0 0 m
331.99375 0 l
331.99375 299.043363 l
0 299.043363 l
cl
1.000 setgray
fill
grestore
gsave
45.79375 41.60625 m
324.79375 41.60625 l
324.79375 291.843363 l
45.79375 291.843363 l
cl
1.000 setgray
fill
grestore
0.800 setlinewidth
1 setlinejoin
2 setlinecap
[] 0 setdash
0.690 setgray
gsave
279 250.237 45.794 41.606 clipbox
86.061791 41.60625 m
86.061791 291.843363 l
stroke
grestore
0 setlinecap
0.000 setgray
gsave
/o {
gsave
newpath
translate
0.8 setlinewidth
1 setlinejoin

0 setlinecap

0 0 m
0 -3.5 l

gsave
0.000 setgray
fill
grestore
stroke
grestore
} bind def
86.0618 41.6063 o
grestore
gsave
83.0618 26.4031 translate
0 rotate
/STIXGeneral-Regular 12.0 selectfont
0 0.890625 moveto
/zero glyphshow
grestore
2 setlinecap
0.690 setgray
gsave
279 250.237 45.794 41.606 clipbox
143.587564 41.60625 m
143.587564 291.843363 l
stroke
grestore
0 setlinecap
0.000 setgray
gsave
/o {
gsave
newpath
translate
0.8 setlinewidth
1 setlinejoin

0 setlinecap

0 0 m
0 -3.5 l

gsave
0.000 setgray
fill
grestore
stroke
grestore
} bind def
143.588 41.6063 o
grestore
gsave
140.588 26.4031 translate
0 rotate
/STIXGeneral-Regular 12.0 selectfont
0 0.890625 moveto
/two glyphshow
grestore
2 setlinecap
0.690 setgray
gsave
279 250.237 45.794 41.606 clipbox
201.113338 41.60625 m
201.113338 291.843363 l
stroke
grestore
0 setlinecap
0.000 setgray
gsave
/o {
gsave
newpath
translate
0.8 setlinewidth
1 setlinejoin

0 setlinecap

0 0 m
0 -3.5 l

gsave
0.000 setgray
fill
grestore
stroke
grestore
} bind def
201.113 41.6063 o
grestore
gsave
198.113 26.4031 translate
0 rotate
/STIXGeneral-Regular 12.0 selectfont
0 0.890625 moveto
/four glyphshow
grestore
2 setlinecap
0.690 setgray
gsave
279 250.237 45.794 41.606 clipbox
258.639111 41.60625 m
258.639111 291.843363 l
stroke
grestore
0 setlinecap
0.000 setgray
gsave
/o {
gsave
newpath
translate
0.8 setlinewidth
1 setlinejoin

0 setlinecap

0 0 m
0 -3.5 l

gsave
0.000 setgray
fill
grestore
stroke
grestore
} bind def
258.639 41.6063 o
grestore
gsave
255.639 26.4031 translate
0 rotate
/STIXGeneral-Regular 12.0 selectfont
0 0.796875 moveto
/six glyphshow
grestore
2 setlinecap
0.690 setgray
gsave
279 250.237 45.794 41.606 clipbox
316.164884 41.60625 m
316.164884 291.843363 l
stroke
grestore
0 setlinecap
0.000 setgray
gsave
/o {
gsave
newpath
translate
0.8 setlinewidth
1 setlinejoin

0 setlinecap

0 0 m
0 -3.5 l

gsave
0.000 setgray
fill
grestore
stroke
grestore
} bind def
316.165 41.6063 o
grestore
gsave
313.165 26.4031 translate
0 rotate
/STIXGeneral-Regular 12.0 selectfont
0 0.890625 moveto
/eight glyphshow
grestore
gsave
181.294 10.2313 translate
0 rotate
/Cmmi10 14.0 selectfont
0 0.8125 moveto
/x glyphshow
grestore
2 setlinecap
0.690 setgray
gsave
279 250.237 45.794 41.606 clipbox
45.79375 41.60625 m
324.79375 41.60625 l
stroke
grestore
0 setlinecap
0.000 setgray
gsave
/o {
gsave
newpath
translate
0.8 setlinewidth
1 setlinejoin

0 setlinecap

-0 0 m
-3.5 0 l

gsave
0.000 setgray
fill
grestore
stroke
grestore
} bind def
45.7938 41.6063 o
grestore
gsave
23.7938 37.5047 translate
0 rotate
/STIXGeneral-Regular 12.0 selectfont
0 0.890625 moveto
/minus glyphshow
8.21999 0.890625 moveto
/one glyphshow
grestore
2 setlinecap
0.690 setgray
gsave
279 250.237 45.794 41.606 clipbox
45.79375 70.369137 m
324.79375 70.369137 l
stroke
grestore
0 setlinecap
0.000 setgray
gsave
/o {
gsave
newpath
translate
0.8 setlinewidth
1 setlinejoin

0 setlinecap

-0 0 m
-3.5 0 l

gsave
0.000 setgray
fill
grestore
stroke
grestore
} bind def
45.7938 70.3691 o
grestore
gsave
32.7938 66.2676 translate
0 rotate
/STIXGeneral-Regular 12.0 selectfont
0 0.890625 moveto
/zero glyphshow
grestore
2 setlinecap
0.690 setgray
gsave
279 250.237 45.794 41.606 clipbox
45.79375 99.132023 m
324.79375 99.132023 l
stroke
grestore
0 setlinecap
0.000 setgray
gsave
/o {
gsave
newpath
translate
0.8 setlinewidth
1 setlinejoin

0 setlinecap

-0 0 m
-3.5 0 l

gsave
0.000 setgray
fill
grestore
stroke
grestore
} bind def
45.7938 99.132 o
grestore
gsave
32.7938 95.0305 translate
0 rotate
/STIXGeneral-Regular 12.0 selectfont
0 0.890625 moveto
/one glyphshow
grestore
2 setlinecap
0.690 setgray
gsave
279 250.237 45.794 41.606 clipbox
45.79375 127.89491 m
324.79375 127.89491 l
stroke
grestore
0 setlinecap
0.000 setgray
gsave
/o {
gsave
newpath
translate
0.8 setlinewidth
1 setlinejoin

0 setlinecap

-0 0 m
-3.5 0 l

gsave
0.000 setgray
fill
grestore
stroke
grestore
} bind def
45.7938 127.895 o
grestore
gsave
32.7938 123.793 translate
0 rotate
/STIXGeneral-Regular 12.0 selectfont
0 0.890625 moveto
/two glyphshow
grestore
2 setlinecap
0.690 setgray
gsave
279 250.237 45.794 41.606 clipbox
45.79375 156.657796 m
324.79375 156.657796 l
stroke
grestore
0 setlinecap
0.000 setgray
gsave
/o {
gsave
newpath
translate
0.8 setlinewidth
1 setlinejoin

0 setlinecap

-0 0 m
-3.5 0 l

gsave
0.000 setgray
fill
grestore
stroke
grestore
} bind def
45.7938 156.658 o
grestore
gsave
32.7938 152.556 translate
0 rotate
/STIXGeneral-Regular 12.0 selectfont
0 0.890625 moveto
/three glyphshow
grestore
2 setlinecap
0.690 setgray
gsave
279 250.237 45.794 41.606 clipbox
45.79375 185.420683 m
324.79375 185.420683 l
stroke
grestore
0 setlinecap
0.000 setgray
gsave
/o {
gsave
newpath
translate
0.8 setlinewidth
1 setlinejoin

0 setlinecap

-0 0 m
-3.5 0 l

gsave
0.000 setgray
fill
grestore
stroke
grestore
} bind def
45.7938 185.421 o
grestore
gsave
32.7938 181.319 translate
0 rotate
/STIXGeneral-Regular 12.0 selectfont
0 0.890625 moveto
/four glyphshow
grestore
2 setlinecap
0.690 setgray
gsave
279 250.237 45.794 41.606 clipbox
45.79375 214.18357 m
324.79375 214.18357 l
stroke
grestore
0 setlinecap
0.000 setgray
gsave
/o {
gsave
newpath
translate
0.8 setlinewidth
1 setlinejoin

0 setlinecap

-0 0 m
-3.5 0 l

gsave
0.000 setgray
fill
grestore
stroke
grestore
} bind def
45.7938 214.184 o
grestore
gsave
32.7938 210.082 translate
0 rotate
/STIXGeneral-Regular 12.0 selectfont
0 0.75 moveto
/five glyphshow
grestore
2 setlinecap
0.690 setgray
gsave
279 250.237 45.794 41.606 clipbox
45.79375 242.946456 m
324.79375 242.946456 l
stroke
grestore
0 setlinecap
0.000 setgray
gsave
/o {
gsave
newpath
translate
0.8 setlinewidth
1 setlinejoin

0 setlinecap

-0 0 m
-3.5 0 l

gsave
0.000 setgray
fill
grestore
stroke
grestore
} bind def
45.7938 242.946 o
grestore
gsave
32.7938 238.845 translate
0 rotate
/STIXGeneral-Regular 12.0 selectfont
0 0.796875 moveto
/six glyphshow
grestore
2 setlinecap
0.690 setgray
gsave
279 250.237 45.794 41.606 clipbox
45.79375 271.709343 m
324.79375 271.709343 l
stroke
grestore
0 setlinecap
0.000 setgray
gsave
/o {
gsave
newpath
translate
0.8 setlinewidth
1 setlinejoin

0 setlinecap

-0 0 m
-3.5 0 l

gsave
0.000 setgray
fill
grestore
stroke
grestore
} bind def
45.7938 271.709 o
grestore
gsave
32.7938 267.608 translate
0 rotate
/STIXGeneral-Regular 12.0 selectfont
0 0.0625 moveto
/seven glyphshow
grestore
gsave
16.7625 163.225 translate
90 rotate
/Cmmi10 14.0 selectfont
0 0.8125 moveto
/y glyphshow
grestore
1.500 setlinewidth
0.122 0.467 0.706 setrgbcolor
gsave
279 250.237 45.794 41.606 clipbox
/o {
gsave
newpath
translate
1.5 setlinewidth
1 setlinejoin

0 setlinecap

-3 -3 m
3 3 l
-3 3 m
3 -3 l

gsave
0.122 0.467 0.706 setrgbcolor
fill
grestore
stroke
grestore
} bind def
129.415 70.8754 o
129.328 73.1611 o
129.121 75.4391 o
128.794 77.703 o
128.348 79.9464 o
127.784 82.1632 o
127.104 84.3472 o
126.31 86.4923 o
125.404 88.5926 o
124.388 90.6421 o
123.266 92.6352 o
122.04 94.5663 o
120.714 96.43 o
119.291 98.2212 o
117.776 99.9349 o
116.172 101.566 o
114.485 103.111 o
112.719 104.564 o
110.878 105.922 o
108.969 107.181 o
106.995 108.338 o
104.964 109.389 o
102.88 110.331 o
100.748 111.163 o
98.5765 111.88 o
96.3696 112.482 o
94.1342 112.967 o
91.8764 113.333 o
89.6025 113.579 o
87.3189 113.706 o
grestore
2 setlinecap
0.000 setgray
gsave
279 250.237 45.794 41.606 clipbox
129.418777 70.369137 m
129.305416 73.502369 l
128.965925 76.619217 l
128.40208 79.703381 l
127.61683 82.738736 l
126.61428 85.709407 l
125.399673 88.599861 l
123.97936 91.394983 l
122.360769 94.080156 l
120.552363 96.64134 l
118.563599 99.065141 l
116.404877 101.338886 l
114.087485 103.450683 l
111.623541 105.38949 l
109.025929 107.145169 l
106.308234 108.708539 l
103.484666 110.071425 l
100.56999 111.226699 l
97.579448 112.168321 l
94.528677 112.891367 l
91.433632 113.392055 l
88.310496 113.667769 l
86.061791 113.726122 l
86.061791 113.726122 l
stroke
grestore
0 setlinecap
0.122 0.467 0.706 setrgbcolor
gsave
279 250.237 45.794 41.606 clipbox
/o {
gsave
newpath
translate
1.5 setlinewidth
1 setlinejoin

0 setlinecap

-3 -3 m
3 3 l
-3 3 m
3 -3 l

gsave
0.122 0.467 0.706 setrgbcolor
fill
grestore
stroke
grestore
} bind def
86.9092 189.484 o
89.1541 189.445 o
91.3979 189.364 o
93.6397 189.242 o
95.8789 189.078 o
98.1147 188.872 o
100.346 188.625 o
102.573 188.335 o
104.794 188.005 o
107.008 187.632 o
109.215 187.218 o
111.413 186.763 o
113.603 186.266 o
115.783 185.728 o
117.952 185.148 o
120.11 184.528 o
122.256 183.867 o
124.389 183.165 o
126.509 182.422 o
128.613 181.64 o
130.703 180.818 o
205.183 71.7423 o
205.136 73.9872 o
205.047 76.2308 o
204.915 78.4723 o
204.741 80.7109 o
204.525 82.9459 o
204.267 85.1764 o
203.967 87.4016 o
203.625 89.6207 o
203.241 91.833 o
202.815 94.0377 o
202.349 96.234 o
201.841 98.4211 o
201.292 100.598 o
200.702 102.765 o
200.071 104.92 o
199.4 107.062 o
198.688 109.192 o
197.937 111.308 o
197.145 113.409 o
196.315 115.495 o
195.445 117.565 o
194.536 119.619 o
193.589 121.654 o
192.603 123.672 o
191.58 125.67 o
190.519 127.649 o
189.421 129.608 o
188.286 131.546 o
187.115 133.461 o
185.908 135.355 o
184.666 137.225 o
183.388 139.072 o
182.076 140.894 o
180.73 142.691 o
179.35 144.462 o
177.937 146.207 o
176.492 147.925 o
175.014 149.616 o
173.505 151.278 o
171.964 152.912 o
170.393 154.516 o
168.792 156.091 o
167.162 157.635 o
165.503 159.147 o
163.815 160.629 o
162.1 162.078 o
160.358 163.494 o
158.589 164.878 o
156.795 166.227 o
154.975 167.543 o
153.131 168.824 o
151.264 170.071 o
149.373 171.281 o
147.459 172.456 o
145.524 173.595 o
143.568 174.697 o
141.591 175.762 o
139.595 176.79 o
137.58 177.781 o
135.547 178.733 o
133.496 179.647 o
grestore
2 setlinecap
0.000 setgray
gsave
279 250.237 45.794 41.606 clipbox
205.189808 70.369137 m
205.082469 75.425073 l
204.760648 80.471898 l
204.224923 85.500518 l
203.47626 90.501869 l
202.516008 95.46694 l
201.345898 100.386783 l
199.968038 105.252533 l
198.384911 110.05542 l
196.599371 114.786789 l
194.614634 119.438115 l
192.434278 124.001016 l
190.062231 128.467268 l
187.502768 132.828823 l
184.760502 137.077822 l
181.840375 141.206607 l
178.747647 145.207739 l
175.487894 149.074006 l
172.066989 152.798442 l
168.491096 156.374334 l
164.766661 159.795239 l
160.900393 163.054993 l
156.899262 166.14772 l
152.770477 169.067848 l
148.521478 171.810114 l
144.159923 174.369576 l
139.69367 176.741623 l
135.13077 178.921979 l
130.479444 180.906716 l
125.748074 182.692256 l
120.945187 184.275383 l
116.079438 185.653243 l
111.159595 186.823353 l
106.194524 187.783605 l
101.193172 188.532268 l
96.164553 189.067993 l
91.117728 189.389815 l
86.061791 189.497153 l
86.061791 189.497153 l
stroke
grestore
0 setlinecap
0.122 0.467 0.706 setrgbcolor
gsave
279 250.237 45.794 41.606 clipbox
/o {
gsave
newpath
translate
1.5 setlinewidth
1 setlinejoin

0 setlinecap

-3 -3 m
3 3 l
-3 3 m
3 -3 l

gsave
0.122 0.467 0.706 setrgbcolor
fill
grestore
stroke
grestore
} bind def
252.894 71.2285 o
252.867 73.4653 o
252.81 75.7015 o
252.723 77.9367 o
252.607 80.1705 o
252.46 82.4026 o
252.283 84.6324 o
252.076 86.8597 o
251.839 89.0841 o
251.572 91.305 o
251.276 93.5221 o
250.95 95.7351 o
250.594 97.9435 o
250.209 100.147 o
249.795 102.345 o
249.351 104.537 o
248.879 106.724 o
248.377 108.904 o
247.846 111.076 o
247.286 113.242 o
246.697 115.4 o
246.079 117.55 o
245.432 119.691 o
244.757 121.824 o
244.053 123.947 o
243.321 126.061 o
242.561 128.164 o
241.772 130.258 o
240.955 132.34 o
240.111 134.411 o
239.239 136.471 o
238.339 138.519 o
237.412 140.555 o
236.458 142.578 o
235.476 144.588 o
234.468 146.585 o
233.433 148.568 o
232.372 150.537 o
231.284 152.491 o
230.17 154.431 o
229.03 156.356 o
227.865 158.265 o
226.674 160.159 o
225.457 162.036 o
224.216 163.896 o
222.949 165.74 o
221.658 167.567 o
220.343 169.376 o
219.004 171.168 o
217.641 172.941 o
216.254 174.697 o
214.843 176.433 o
213.41 178.15 o
211.954 179.848 o
210.475 181.526 o
208.974 183.184 o
207.45 184.822 o
205.905 186.44 o
204.338 188.036 o
202.75 189.611 o
201.141 191.165 o
199.511 192.697 o
197.861 194.207 o
196.19 195.695 o
194.499 197.16 o
192.789 198.602 o
191.06 200.02 o
189.311 201.415 o
187.544 202.787 o
185.759 204.135 o
183.956 205.458 o
182.135 206.758 o
180.297 208.032 o
178.442 209.283 o
176.57 210.508 o
174.683 211.708 o
172.779 212.882 o
170.86 214.032 o
168.926 215.155 o
166.977 216.253 o
165.014 217.325 o
163.037 218.371 o
161.046 219.391 o
159.042 220.384 o
157.025 221.351 o
154.996 222.292 o
152.954 223.205 o
150.899 224.09 o
148.834 224.948 o
146.756 225.778 o
144.668 226.58 o
142.569 227.353 o
140.459 228.097 o
138.339 228.812 o
136.21 229.498 o
134.071 230.154 o
131.924 230.781 o
129.768 231.378 o
127.604 231.945 o
125.433 232.483 o
123.254 232.991 o
121.069 233.47 o
118.878 233.92 o
116.681 234.34 o
114.479 234.73 o
112.271 235.092 o
110.059 235.424 o
107.843 235.727 o
105.623 236 o
103.4 236.245 o
86.4285 237.158 o
88.665 237.134 o
90.901 237.081 o
93.1361 236.998 o
95.37 236.886 o
97.6022 236.746 o
99.8324 236.577 o
grestore
2 setlinecap
0.000 setgray
gsave
279 250.237 45.794 41.606 clipbox
252.888076 70.369137 m
252.778994 76.401007 l
252.451892 82.42499 l
251.907197 88.433207 l
251.145621 94.417801 l
250.168161 100.370946 l
248.976095 106.284857 l
247.570981 112.1518 l
245.954657 117.964103 l
244.129237 123.714164 l
242.097107 129.394465 l
239.860926 134.997576 l
237.423618 140.516172 l
234.78837 145.943034 l
231.958628 151.271066 l
228.938093 156.4933 l
225.730715 161.602907 l
222.340688 166.593206 l
218.772445 171.45767 l
215.030653 176.189937 l
211.120205 180.78382 l
207.046214 185.233311 l
202.814009 189.532591 l
198.429124 193.676037 l
193.897294 197.658231 l
189.224443 201.473967 l
184.416684 205.118252 l
179.480304 208.586323 l
174.421758 211.873643 l
169.247661 214.975915 l
163.96478 217.88908 l
158.580023 220.609329 l
153.100432 223.133105 l
147.533172 225.457107 l
141.885525 227.578296 l
136.164876 229.493899 l
130.378705 231.201411 l
124.53458 232.698597 l
118.640143 233.983501 l
112.703103 235.054442 l
106.731223 235.910019 l
100.732313 236.549114 l
94.714218 236.970891 l
88.684807 237.174799 l
86.061791 237.195421 l
86.061791 237.195421 l
stroke
grestore
0 setlinecap
0.122 0.467 0.706 setrgbcolor
gsave
279 250.237 45.794 41.606 clipbox
/o {
gsave
newpath
translate
1.5 setlinewidth
1 setlinejoin

0 setlinecap

-3 -3 m
3 3 l
-3 3 m
3 -3 l

gsave
0.122 0.467 0.706 setrgbcolor
fill
grestore
stroke
grestore
} bind def
283.829 98.212 o
283.504 100.418 o
284.13 96.0022 o
283.154 102.621 o
284.406 93.7892 o
282.78 104.82 o
284.657 91.5731 o
282.382 107.014 o
284.883 89.3544 o
281.96 109.204 o
285.084 87.1333 o
281.514 111.389 o
285.261 84.9101 o
281.043 113.569 o
285.412 82.685 o
280.549 115.744 o
285.538 80.4584 o
280.031 117.913 o
285.64 78.2305 o
279.489 120.076 o
285.716 76.0016 o
278.923 122.233 o
285.767 73.772 o
278.332 124.384 o
285.793 71.5419 o
277.718 126.528 o
277.08 128.665 o
276.418 130.795 o
275.732 132.917 o
275.022 135.031 o
274.289 137.137 o
273.532 139.235 o
272.752 141.325 o
271.949 143.405 o
271.122 145.476 o
270.272 147.538 o
269.4 149.591 o
268.504 151.633 o
267.586 153.666 o
266.645 155.688 o
265.682 157.699 o
264.696 159.699 o
263.688 161.689 o
262.657 163.667 o
261.605 165.633 o
260.53 167.587 o
259.434 169.53 o
258.316 171.459 o
257.177 173.377 o
256.016 175.281 o
254.834 177.172 o
253.631 179.05 o
252.407 180.914 o
251.162 182.764 o
249.896 184.601 o
248.61 186.423 o
247.305 188.231 o
245.979 190.024 o
244.633 191.803 o
243.267 193.566 o
241.883 195.314 o
240.478 197.047 o
239.055 198.763 o
237.612 200.464 o
236.151 202.149 o
234.67 203.817 o
233.172 205.468 o
231.654 207.103 o
230.119 208.721 o
228.566 210.321 o
226.995 211.904 o
225.406 213.469 o
223.8 215.017 o
222.177 216.546 o
220.536 218.057 o
218.879 219.549 o
217.205 221.022 o
215.514 222.477 o
213.806 223.911 o
212.083 225.327 o
210.343 226.722 o
208.588 228.098 o
206.817 229.454 o
205.032 230.79 o
203.231 232.107 o
201.416 233.403 o
199.587 234.678 o
197.744 235.934 o
195.886 237.168 o
194.015 238.382 o
192.131 239.575 o
190.233 240.747 o
188.323 241.897 o
186.4 243.027 o
184.465 244.136 o
182.518 245.224 o
180.56 246.29 o
178.59 247.336 o
176.609 248.361 o
174.618 249.365 o
172.615 250.347 o
170.603 251.309 o
168.58 252.248 o
166.547 253.165 o
164.504 254.059 o
162.451 254.931 o
160.389 255.779 o
158.317 256.604 o
156.235 257.404 o
154.144 258.181 o
152.045 258.932 o
149.936 259.659 o
147.819 260.361 o
145.694 261.037 o
143.561 261.687 o
141.42 262.312 o
139.272 262.912 o
137.117 263.486 o
134.955 264.035 o
132.787 264.558 o
130.613 265.057 o
128.434 265.531 o
126.25 265.98 o
124.06 266.405 o
121.866 266.806 o
119.668 267.182 o
117.466 267.534 o
115.26 267.862 o
113.051 268.167 o
110.838 268.447 o
108.623 268.703 o
106.405 268.937 o
104.184 269.147 o
101.962 269.334 o
99.7379 269.498 o
97.5122 269.639 o
95.2851 269.757 o
93.057 269.852 o
90.8279 269.923 o
88.5983 269.972 o
86.3682 269.997 o
grestore
2 setlinecap
0.000 setgray
gsave
279 250.237 45.794 41.606 clipbox
285.775032 70.369137 m
285.666168 76.962418 l
285.339694 83.548512 l
284.795967 90.120237 l
284.035579 96.67043 l
283.059359 103.191948 l
281.868371 109.677684 l
280.463914 116.120564 l
278.847519 122.513567 l
277.020949 128.849721 l
274.986193 135.12212 l
272.745472 141.323924 l
270.301227 147.448374 l
267.656124 153.488791 l
264.813045 159.438591 l
261.775092 165.291287 l
258.545575 171.040498 l
255.128015 176.679957 l
251.526138 182.203516 l
247.743872 187.605152 l
243.785339 192.878977 l
239.654855 198.019241 l
235.356924 203.020341 l
230.89623 207.876824 l
226.277637 212.583395 l
221.50618 217.134923 l
216.587061 221.526447 l
211.525643 225.753179 l
206.327444 229.81051 l
200.99813 233.694017 l
195.543512 237.399467 l
189.969537 240.92282 l
184.282282 244.260234 l
178.487945 247.408072 l
172.592846 250.362901 l
166.60341 253.1215 l
160.526167 255.680861 l
154.367743 258.038195 l
148.134851 260.190932 l
141.834287 262.136723 l
135.472919 263.873449 l
129.057684 265.399216 l
122.595574 266.71236 l
116.093634 267.81145 l
109.558954 268.695287 l
102.998657 269.362908 l
96.419896 269.813586 l
89.829842 270.046828 l
86.061791 270.082378 l
86.061791 270.082378 l
stroke
grestore
0 setlinecap
0.122 0.467 0.706 setrgbcolor
gsave
279 250.237 45.794 41.606 clipbox
/o {
gsave
newpath
translate
1.5 setlinewidth
1 setlinejoin

0 setlinecap

-3 -3 m
3 3 l
-3 3 m
3 -3 l

gsave
0.122 0.467 0.706 setrgbcolor
fill
grestore
stroke
grestore
} bind def
87.0848 284.033 o
89.3219 283.999 o
91.5586 283.943 o
93.7945 283.866 o
96.0297 283.768 o
98.2637 283.649 o
100.497 283.509 o
102.728 283.348 o
104.958 283.166 o
107.186 282.963 o
109.412 282.739 o
111.636 282.493 o
113.858 282.225 o
116.076 281.935 o
118.292 281.623 o
120.505 281.289 o
122.714 280.932 o
124.92 280.552 o
127.121 280.149 o
129.319 279.723 o
131.511 279.275 o
133.699 278.803 o
135.882 278.307 o
138.059 277.788 o
140.231 277.245 o
142.397 276.678 o
144.556 276.086 o
146.708 275.47 o
148.853 274.828 o
150.991 274.162 o
153.121 273.472 o
155.242 272.757 o
157.355 272.017 o
159.46 271.254 o
161.556 270.467 o
163.643 269.657 o
165.721 268.825 o
167.789 267.97 o
169.848 267.093 o
171.898 266.194 o
173.938 265.275 o
175.969 264.335 o
177.99 263.374 o
180.002 262.394 o
182.003 261.394 o
183.995 260.375 o
185.977 259.337 o
187.949 258.279 o
189.91 257.202 o
191.861 256.106 o
193.801 254.99 o
195.729 253.855 o
197.646 252.7 o
199.551 251.525 o
201.443 250.33 o
203.323 249.115 o
205.19 247.881 o
207.044 246.627 o
208.885 245.354 o
210.712 244.062 o
212.526 242.751 o
214.326 241.42 o
216.111 240.071 o
217.883 238.704 o
219.64 237.317 o
221.382 235.912 o
223.109 234.488 o
224.821 233.046 o
226.517 231.585 o
228.197 230.107 o
229.862 228.61 o
231.51 227.096 o
233.142 225.564 o
234.757 224.015 o
236.357 222.449 o
237.939 220.867 o
239.505 219.268 o
241.055 217.653 o
242.587 216.022 o
244.102 214.375 o
245.6 212.712 o
247.081 211.033 o
248.543 209.339 o
249.988 207.63 o
251.415 205.906 o
252.824 204.167 o
254.215 202.414 o
255.588 200.646 o
256.942 198.864 o
258.277 197.068 o
259.594 195.258 o
260.892 193.435 o
262.171 191.599 o
263.43 189.749 o
264.671 187.886 o
265.892 186.01 o
267.093 184.122 o
268.274 182.22 o
269.435 180.307 o
270.575 178.381 o
271.696 176.444 o
272.796 174.495 o
273.875 172.534 o
274.934 170.562 o
275.972 168.579 o
276.989 166.586 o
277.985 164.582 o
278.96 162.567 o
279.914 160.542 o
280.847 158.508 o
281.758 156.464 o
282.648 154.41 o
283.517 152.348 o
284.364 150.276 o
285.189 148.196 o
285.992 146.107 o
286.773 144.009 o
287.532 141.904 o
288.27 139.791 o
288.984 137.67 o
289.677 135.541 o
290.347 133.406 o
290.994 131.264 o
291.619 129.115 o
292.222 126.959 o
292.802 124.797 o
293.359 122.63 o
293.893 120.457 o
294.405 118.278 o
294.895 116.094 o
295.362 113.906 o
295.807 111.712 o
296.229 109.515 o
296.629 107.313 o
297.006 105.107 o
297.361 102.897 o
297.693 100.684 o
298.001 98.4673 o
298.287 96.2475 o
298.549 94.0248 o
298.788 91.7994 o
299.003 89.5716 o
299.195 87.3416 o
299.363 85.1098 o
299.507 82.8764 o
299.628 80.6415 o
299.726 78.4055 o
299.799 76.1686 o
299.85 73.9309 o
299.876 71.6928 o
grestore
2 setlinecap
0.000 setgray
gsave
279 250.237 45.794 41.606 clipbox
299.84909 70.369137 m
299.732555 77.427055 l
299.383074 84.47728 l
298.801029 91.512123 l
297.987056 98.523917 l
296.94204 105.505016 l
295.667122 112.447809 l
294.163691 119.344729 l
292.433387 126.188254 l
290.478095 132.970926 l
288.299948 139.685349 l
285.90132 146.324203 l
283.284826 152.88025 l
280.453319 159.346344 l
277.409885 165.715434 l
274.157842 171.980577 l
270.700737 178.134943 l
267.042337 184.171823 l
263.186632 190.084634 l
259.137824 195.86693 l
254.900328 201.512409 l
250.478763 207.014914 l
245.877951 212.368448 l
241.102906 217.567174 l
236.158834 222.605423 l
231.051127 227.477704 l
225.785351 232.178704 l
220.367248 236.703299 l
214.802724 241.046556 l
209.097847 245.203739 l
203.258835 249.170317 l
197.292055 252.941965 l
191.20401 256.514572 l
185.00134 259.884242 l
178.690805 263.047301 l
172.279285 266.000303 l
165.773771 268.740026 l
159.181354 271.263484 l
152.509222 273.567927 l
145.764649 275.650841 l
138.954987 277.509956 l
132.087661 279.143246 l
125.170158 280.548929 l
118.210018 281.725473 l
111.214831 282.671595 l
104.192221 283.386265 l
97.149845 283.868702 l
90.095381 284.118381 l
86.061791 284.156436 l
86.061791 284.156436 l
stroke
grestore
0.800 setlinewidth
0 setlinejoin
gsave
45.79375 41.60625 m
45.79375 291.843363 l
stroke
grestore
gsave
324.79375 41.60625 m
324.79375 291.843363 l
stroke
grestore
gsave
45.79375 41.60625 m
324.79375 41.60625 l
stroke
grestore
gsave
45.79375 291.843363 m
324.79375 291.843363 l
stroke
grestore
gsave
48.67 110.805 translate
0 rotate
/Cmmi10 10.0 selectfont
0 0.34375 moveto
/t glyphshow
/Cmsy10 10.0 selectfont
5.36426 0.34375 moveto
/approxequal glyphshow
/Cmr10 10.0 selectfont
14.8887 0.34375 moveto
/one glyphshow
/Cmmi10 10.0 selectfont
19.8887 0.34375 moveto
/period glyphshow
/Cmr10 10.0 selectfont
22.6572 0.34375 moveto
/zero glyphshow
grestore
gsave
118.443 55.9877 translate
0 rotate
/Cmr10 10.0 selectfont
0 0.34375 moveto
/three glyphshow
5 0.34375 moveto
/three glyphshow
10 0.34375 moveto
/two glyphshow
15 0.34375 moveto
/zero glyphshow
grestore
gsave
48.67 186.621 translate
0 rotate
/Cmmi10 10.0 selectfont
0 0.34375 moveto
/t glyphshow
/Cmsy10 10.0 selectfont
5.36426 0.34375 moveto
/approxequal glyphshow
/Cmr10 10.0 selectfont
14.8887 0.34375 moveto
/four glyphshow
/Cmmi10 10.0 selectfont
19.8887 0.34375 moveto
/period glyphshow
/Cmr10 10.0 selectfont
22.6572 0.34375 moveto
/five glyphshow
grestore
gsave
194.262 55.9877 translate
0 rotate
/Cmr10 10.0 selectfont
0 0.34375 moveto
/one glyphshow
5 0.34375 moveto
/four glyphshow
10 0.34375 moveto
/nine glyphshow
15 0.34375 moveto
/four glyphshow
20 0.34375 moveto
/zero glyphshow
grestore
gsave
48.67 233.755 translate
0 rotate
/Cmmi10 10.0 selectfont
0 0.34375 moveto
/t glyphshow
/Cmsy10 10.0 selectfont
5.36426 0.34375 moveto
/approxequal glyphshow
/Cmr10 10.0 selectfont
14.8887 0.34375 moveto
/eight glyphshow
/Cmmi10 10.0 selectfont
19.8887 0.34375 moveto
/period glyphshow
/Cmr10 10.0 selectfont
22.6572 0.34375 moveto
/zero glyphshow
grestore
gsave
237.073 55.9877 translate
0 rotate
/Cmr10 10.0 selectfont
0 0.34375 moveto
/two glyphshow
5 0.34375 moveto
/six glyphshow
10 0.34375 moveto
/five glyphshow
15 0.34375 moveto
/six glyphshow
20 0.34375 moveto
/zero glyphshow
grestore
gsave
48.67 265.805 translate
0 rotate
/Cmmi10 10.0 selectfont
0 0.34375 moveto
/t glyphshow
/Cmsy10 10.0 selectfont
5.36426 0.34375 moveto
/approxequal glyphshow
/Cmr10 10.0 selectfont
14.8887 0.34375 moveto
/one glyphshow
19.8887 0.34375 moveto
/one glyphshow
/Cmmi10 10.0 selectfont
24.8887 0.34375 moveto
/period glyphshow
/Cmr10 10.0 selectfont
27.6572 0.34375 moveto
/five glyphshow
grestore
gsave
268.519 55.9877 translate
0 rotate
/Cmr10 10.0 selectfont
0 0.34375 moveto
/three glyphshow
5 0.34375 moveto
/eight glyphshow
10 0.34375 moveto
/one glyphshow
15 0.34375 moveto
/eight glyphshow
20 0.34375 moveto
/zero glyphshow
grestore
gsave
48.67 279.894 translate
0 rotate
/Cmmi10 10.0 selectfont
0 0.34375 moveto
/t glyphshow
/Cmsy10 10.0 selectfont
5.36426 0.34375 moveto
/approxequal glyphshow
/Cmr10 10.0 selectfont
14.8887 0.34375 moveto
/one glyphshow
19.8887 0.34375 moveto
/five glyphshow
/Cmmi10 10.0 selectfont
24.8887 0.34375 moveto
/period glyphshow
/Cmr10 10.0 selectfont
27.6572 0.34375 moveto
/zero glyphshow
grestore
gsave
296.97 55.9877 translate
0 rotate
/Cmr10 10.0 selectfont
0 0.234375 moveto
/four glyphshow
5 0.234375 moveto
/seven glyphshow
10 0.234375 moveto
/eight glyphshow
15 0.234375 moveto
/zero glyphshow
20 0.234375 moveto
/eight glyphshow
grestore

end
showpage
