%!PS-Adobe-3.0 EPSF-3.0
%%Title: timestep_convergence.eps
%%Creator: Matplotlib v3.5.3, https://matplotlib.org/
%%CreationDate: Tue Jun 27 09:52:55 2023
%%Orientation: portrait
%%BoundingBox: 130 292 482 500
%%HiResBoundingBox: 130.066165 292.794969 481.933835 499.205031
%%EndComments
%%BeginProlog
/mpldict 14 dict def
mpldict begin
/_d { bind def } bind def
/m { moveto } _d
/l { lineto } _d
/r { rlineto } _d
/c { curveto } _d
/cl { closepath } _d
/ce { closepath eofill } _d
/box {
      m
      1 index 0 r
      0 exch r
      neg 0 r
      cl
    } _d
/clipbox {
      box
      clip
      newpath
    } _d
/sc { setcachedevice } _d
%!PS-Adobe-3.0 Resource-Font
%%Creator: Converted from TrueType to Type 3 by Matplotlib.
10 dict begin
/FontName /Cmr10 def
/PaintType 0 def
/FontMatrix [0.00048828125 0 0 0.00048828125 0 0] def
/FontBBox [-90 -512 2066 1536] def
/FontType 3 def
/Encoding [/d /zero /one /two /three /four /five /equal] def
/CharStrings 9 dict dup begin
/.notdef 0 def
/d{1137 0 68 -23 1083 1421 sc
500 -23 m
419 -23 346 -1 279 42 c
212 86 160 144 123 215 c
86 286 68 362 68 442 c
68 525 88 601 128 672 c
169 743 224 800 293 842 c
362 884 439 905 522 905 c
572 905 619 894 664 873 c
709 852 747 823 780 786 c
780 1212 l
780 1249 774 1275 763 1291 c
752 1308 737 1318 716 1321 c
696 1325 664 1327 621 1327 c
621 1399 l
924 1421 l
924 186 l
924 150 929 124 940 107 c
951 91 967 81 987 77 c
1008 74 1040 72 1083 72 c
1083 0 l
774 -23 l
774 106 l
739 65 697 34 648 11 c
599 -12 550 -23 500 -23 c

291 178 m
314 133 345 98 384 71 c
423 44 466 31 512 31 c
569 31 621 47 668 80 c
715 113 751 155 774 207 c
774 698 l
758 728 738 755 713 778 c
689 802 662 820 631 833 c
601 846 569 852 535 852 c
464 852 406 832 363 791 c
320 751 289 700 272 637 c
255 574 246 509 246 440 c
246 385 249 338 254 297 c
260 256 272 217 291 178 c

ce} _d
/zero{1024 0 80 -45 942 1364 sc
512 -45 m
345 -45 231 24 170 161 c
110 299 80 463 80 653 c
80 772 91 883 112 988 c
134 1093 177 1181 241 1254 c
306 1327 396 1364 512 1364 c
602 1364 676 1342 733 1298 c
790 1254 834 1197 864 1127 c
894 1058 914 983 925 903 c
936 824 942 740 942 653 c
942 536 931 426 909 323 c
888 221 845 134 782 62 c
719 -9 629 -45 512 -45 c

512 8 m
588 8 645 47 682 125 c
719 203 742 289 751 384 c
760 479 764 579 764 686 c
764 789 760 883 751 970 c
742 1057 719 1135 682 1205 c
645 1276 589 1311 512 1311 c
435 1311 377 1276 340 1205 c
303 1134 280 1056 271 969 c
262 883 258 789 258 686 c
258 610 260 538 263 471 c
267 404 277 334 293 262 c
309 191 335 130 370 81 c
406 32 453 8 512 8 c

ce} _d
/one{1024 0 178 0 862 1364 sc
190 0 m
190 72 l
361 72 446 94 446 137 c
446 1212 l
375 1178 286 1161 178 1161 c
178 1233 l
345 1233 472 1277 557 1364 c
586 1364 l
591 1364 595 1362 599 1358 c
604 1355 606 1351 606 1346 c
606 137 l
606 94 691 72 862 72 c
862 0 l
190 0 l

ce} _d
/two{1024 0 102 0 920 1364 sc
102 0 m
102 55 l
102 58 103 62 106 66 c
424 418 l
472 470 511 514 541 549 c
571 584 601 625 630 671 c
659 717 682 764 699 811 c
716 859 725 910 725 963 c
725 1019 715 1072 694 1123 c
673 1174 642 1215 601 1246 c
560 1277 511 1292 453 1292 c
394 1292 340 1274 293 1238 c
246 1203 212 1157 193 1100 c
198 1101 206 1102 215 1102 c
246 1102 272 1092 293 1071 c
315 1050 326 1024 326 991 c
326 960 315 933 293 911 c
272 890 246 879 215 879 c
183 879 156 890 134 912 c
113 935 102 961 102 991 c
102 1042 112 1090 131 1135 c
150 1180 178 1220 214 1255 c
251 1290 292 1317 337 1336 c
383 1355 432 1364 483 1364 c
561 1364 634 1347 701 1314 c
768 1281 822 1235 861 1174 c
900 1114 920 1044 920 963 c
920 904 907 847 881 794 c
855 741 822 692 781 648 c
740 605 688 555 625 500 c
562 445 520 408 500 389 c
268 166 l
465 166 l
562 166 642 167 707 168 c
772 170 807 173 811 176 c
827 193 843 256 860 365 c
920 365 l
862 0 l
102 0 l

ce} _d
/three{1024 0 86 -45 936 1364 sc
195 158 m
227 111 270 77 324 54 c
378 31 436 20 498 20 c
577 20 634 54 667 121 c
700 189 717 266 717 352 c
717 391 713 429 706 468 c
699 507 688 543 671 576 c
654 609 631 636 602 656 c
573 676 538 686 496 686 c
360 686 l
348 686 342 692 342 705 c
342 723 l
342 734 348 739 360 739 c
473 748 l
521 748 561 766 592 802 c
624 838 647 882 662 933 c
677 985 684 1034 684 1081 c
684 1146 669 1200 638 1242 c
607 1284 561 1305 498 1305 c
446 1305 396 1295 349 1275 c
302 1256 264 1226 236 1186 c
239 1187 241 1187 243 1187 c
245 1188 247 1188 250 1188 c
281 1188 306 1177 327 1156 c
348 1135 358 1109 358 1079 c
358 1050 348 1024 327 1003 c
306 982 281 971 250 971 c
220 971 194 982 173 1003 c
152 1024 141 1050 141 1079 c
141 1138 159 1189 194 1232 c
229 1275 275 1308 330 1330 c
386 1353 442 1364 498 1364 c
539 1364 583 1358 629 1345 c
675 1333 717 1315 754 1292 c
791 1269 822 1240 845 1204 c
869 1168 881 1127 881 1081 c
881 1024 868 971 842 922 c
817 873 782 831 737 796 c
692 761 643 734 590 717 c
649 706 706 683 759 650 c
812 617 855 574 887 522 c
920 470 936 414 936 354 c
936 279 915 210 874 149 c
833 88 778 41 711 6 c
644 -28 573 -45 498 -45 c
434 -45 370 -33 305 -8 c
241 16 188 52 147 101 c
106 150 86 208 86 276 c
86 310 97 338 120 361 c
143 384 171 395 205 395 c
227 395 247 390 265 379 c
284 369 298 355 308 336 c
319 317 324 297 324 276 c
324 243 312 215 289 192 c
266 169 238 158 205 158 c
195 158 l

ce} _d
/four{1024 0 57 0 965 1364 sc
57 338 m
57 410 l
690 1354 l
695 1361 702 1364 711 1364 c
741 1364 l
756 1364 764 1356 764 1341 c
764 410 l
965 410 l
965 338 l
764 338 l
764 137 l
764 109 784 91 824 83 c
864 76 910 72 963 72 c
963 0 l
399 0 l
399 72 l
452 72 498 76 538 83 c
578 91 598 109 598 137 c
598 338 l
57 338 l

125 410 m
610 410 l
610 1135 l
125 410 l

ce} _d
/five{1024 0 102 -45 920 1364 sc
178 233 m
192 193 213 157 242 124 c
271 91 306 66 345 47 c
385 29 426 20 469 20 c
568 20 636 58 673 135 c
710 212 729 305 729 414 c
729 461 728 501 726 533 c
725 566 720 597 713 627 c
700 675 678 717 646 753 c
615 789 576 807 530 807 c
484 807 444 800 411 786 c
378 772 352 756 331 737 c
310 718 292 699 276 678 c
260 657 250 646 246 645 c
223 645 l
220 645 215 647 210 651 c
205 656 203 660 203 664 c
203 1348 l
203 1351 205 1355 209 1358 c
214 1362 218 1364 223 1364 c
229 1364 l
321 1320 419 1298 522 1298 c
623 1298 721 1320 815 1364 c
821 1364 l
826 1364 830 1362 834 1359 c
838 1356 840 1352 840 1348 c
840 1329 l
840 1322 839 1319 836 1319 c
789 1257 731 1209 660 1174 c
590 1139 517 1122 442 1122 c
387 1122 331 1130 274 1145 c
274 758 l
319 795 360 821 395 836 c
431 852 477 860 532 860 c
607 860 675 838 734 795 c
794 752 840 695 872 625 c
904 556 920 485 920 412 c
920 330 900 254 859 184 c
819 114 764 58 695 17 c
626 -24 550 -45 469 -45 c
402 -45 340 -28 283 7 c
227 42 183 88 150 147 c
118 206 102 268 102 334 c
102 365 112 390 132 409 c
152 428 177 438 207 438 c
237 438 262 428 282 408 c
303 389 313 364 313 334 c
313 305 303 280 282 259 c
262 239 237 229 207 229 c
202 229 197 229 191 230 c
185 231 181 232 178 233 c

ce} _d
/equal{1591 0 115 272 1477 752 sc
154 272 m
143 272 133 276 126 285 c
119 294 115 303 115 313 c
115 324 119 334 126 342 c
133 350 143 354 154 354 c
1440 354 l
1450 354 1459 350 1466 342 c
1473 334 1477 324 1477 313 c
1477 303 1473 294 1466 285 c
1459 276 1450 272 1440 272 c
154 272 l

154 670 m
143 670 133 674 126 682 c
119 690 115 700 115 711 c
115 721 119 730 126 739 c
133 748 143 752 154 752 c
1440 752 l
1450 752 1459 748 1466 739 c
1473 730 1477 721 1477 711 c
1477 700 1473 690 1466 682 c
1459 674 1450 670 1440 670 c
154 670 l

ce} _d
end readonly def

/BuildGlyph {
 exch begin
 CharStrings exch
 2 copy known not {pop /.notdef} if
 true 3 1 roll get exec
 end
} _d

/BuildChar {
 1 index /Encoding get exch get
 1 index /BuildGlyph get exec
} _d

FontName currentdict end definefont pop
%!PS-Adobe-3.0 Resource-Font
%%Creator: Converted from TrueType to Type 3 by Matplotlib.
10 dict begin
/FontName /Cmsy10 def
/PaintType 0 def
/FontMatrix [0.00048828125 0 0 0.00048828125 0 0] def
/FontBBox [-59 -1966 2300 1595] def
/FontType 3 def
/Encoding [/minus /periodcentered] def
/CharStrings 3 dict dup begin
/.notdef 0 def
/minus{1591 0 170 471 1421 553 sc
209 471 m
198 471 188 475 181 484 c
174 493 170 502 170 512 c
170 522 174 531 181 540 c
188 549 198 553 209 553 c
1384 553 l
1395 553 1403 549 1410 540 c
1417 531 1421 522 1421 512 c
1421 502 1417 493 1410 484 c
1403 475 1395 471 1384 471 c
209 471 l

ce} _d
/periodcentered{567 0 172 399 397 625 sc
172 512 m
172 531 177 550 187 567 c
197 584 211 598 228 609 c
246 620 265 625 285 625 c
304 625 323 620 340 609 c
358 598 372 584 382 567 c
392 550 397 531 397 512 c
397 481 386 455 364 432 c
343 410 316 399 285 399 c
254 399 228 410 205 432 c
183 455 172 481 172 512 c

ce} _d
end readonly def

/BuildGlyph {
 exch begin
 CharStrings exch
 2 copy known not {pop /.notdef} if
 true 3 1 roll get exec
 end
} _d

/BuildChar {
 1 index /Encoding get exch get
 1 index /BuildGlyph get exec
} _d

FontName currentdict end definefont pop
%!PS-Adobe-3.0 Resource-Font
%%Creator: Converted from TrueType to Type 3 by Matplotlib.
10 dict begin
/FontName /Cmmi10 def
/PaintType 0 def
/FontMatrix [0.00048828125 0 0 0.00048828125 0 0] def
/FontBBox [-70 -512 2146 1536] def
/FontType 3 def
/Encoding [/r /t /m] def
/CharStrings 4 dict dup begin
/.notdef 0 def
/r{924 0 55 -23 889 905 sc
158 35 m
158 43 159 49 160 53 c
313 664 l
323 702 328 735 328 764 c
328 823 308 852 268 852 c
225 852 194 826 173 775 c
152 724 132 660 113 582 c
113 578 111 575 107 572 c
103 570 99 569 96 569 c
72 569 l
67 569 63 571 60 576 c
57 581 55 586 55 590 c
70 649 84 700 97 741 c
111 782 132 820 161 854 c
190 888 227 905 270 905 c
317 905 359 891 394 864 c
430 837 452 801 461 756 c
496 801 535 837 579 864 c
624 891 672 905 725 905 c
768 905 806 892 839 867 c
872 842 889 807 889 764 c
889 729 878 699 856 673 c
835 648 806 635 770 635 c
748 635 729 642 714 655 c
699 669 692 687 692 709 c
692 739 703 766 725 789 c
747 813 772 825 801 825 c
779 843 752 852 721 852 c
662 852 611 831 568 789 c
525 748 486 695 451 631 c
305 45 l
300 26 290 10 273 -3 c
257 -16 239 -23 219 -23 c
202 -23 188 -18 176 -7 c
164 4 158 18 158 35 c

ce} _d
/t{739 0 45 -23 676 1282 sc
127 166 m
127 186 129 205 133 223 c
281 811 l
66 811 l
52 811 45 820 45 838 c
50 868 59 883 72 883 c
299 883 l
381 1217 l
386 1235 397 1250 413 1263 c
429 1276 447 1282 467 1282 c
484 1282 499 1277 510 1266 c
522 1256 528 1242 528 1225 c
528 1221 528 1218 527 1215 c
527 1213 527 1211 526 1208 c
444 883 l
655 883 l
669 883 676 874 676 856 c
675 853 674 847 672 839 c
670 831 667 824 664 819 c
661 814 656 811 649 811 c
426 811 l
279 219 l
269 180 264 147 264 119 c
264 60 284 31 324 31 c
384 31 437 59 483 115 c
530 172 565 234 590 301 c
595 309 601 313 606 313 c
631 313 l
636 313 641 311 644 307 c
647 304 649 300 649 295 c
649 292 648 290 647 289 c
617 206 573 134 516 71 c
459 8 393 -23 319 -23 c
265 -23 219 -5 182 30 c
145 65 127 111 127 166 c

ce} _d
/m{1798 0 55 -23 1743 905 sc
158 35 m
158 43 159 49 160 53 c
313 664 l
323 702 328 735 328 764 c
328 823 308 852 268 852 c
225 852 194 826 173 775 c
152 724 132 660 113 582 c
113 578 111 575 107 572 c
103 570 99 569 96 569 c
72 569 l
67 569 63 571 60 576 c
57 581 55 586 55 590 c
70 649 84 700 97 741 c
111 782 132 820 161 854 c
190 888 227 905 270 905 c
321 905 367 889 406 856 c
445 824 465 783 465 733 c
506 786 553 828 608 859 c
663 890 721 905 782 905 c
847 905 902 888 949 855 c
996 822 1020 776 1020 715 c
1062 774 1111 821 1167 854 c
1224 888 1285 905 1352 905 c
1423 905 1479 886 1522 847 c
1565 809 1587 755 1587 684 c
1587 628 1574 560 1549 481 c
1524 402 1493 313 1456 215 c
1437 168 1427 127 1427 92 c
1427 51 1443 31 1475 31 c
1528 31 1573 60 1608 117 c
1643 174 1668 236 1683 301 c
1687 309 1693 313 1700 313 c
1724 313 l
1729 313 1734 311 1737 307 c
1741 304 1743 300 1743 295 c
1743 294 1742 292 1741 289 c
1722 212 1690 140 1643 75 c
1597 10 1539 -23 1470 -23 c
1422 -23 1381 -7 1347 26 c
1313 59 1296 100 1296 147 c
1296 171 1302 198 1313 227 c
1352 330 1384 421 1409 502 c
1435 583 1448 654 1448 715 c
1448 753 1440 785 1425 812 c
1410 839 1384 852 1348 852 c
1273 852 1209 829 1154 783 c
1099 738 1052 677 1012 602 c
1009 589 1007 578 1006 571 c
874 45 l
869 26 859 10 842 -3 c
826 -16 808 -23 788 -23 c
772 -23 758 -18 745 -7 c
733 4 727 18 727 35 c
727 43 728 49 729 53 c
860 575 l
874 631 881 678 881 715 c
881 753 873 785 857 812 c
842 839 815 852 778 852 c
728 852 682 841 640 819 c
598 797 561 768 530 731 c
499 695 470 652 444 602 c
305 45 l
300 26 290 10 273 -3 c
257 -16 239 -23 219 -23 c
202 -23 188 -18 176 -7 c
164 4 158 18 158 35 c

ce} _d
end readonly def

/BuildGlyph {
 exch begin
 CharStrings exch
 2 copy known not {pop /.notdef} if
 true 3 1 roll get exec
 end
} _d

/BuildChar {
 1 index /Encoding get exch get
 1 index /BuildGlyph get exec
} _d

FontName currentdict end definefont pop
%!PS-Adobe-3.0 Resource-Font
%%Creator: Converted from TrueType to Type 3 by Matplotlib.
10 dict begin
/FontName /STIXGeneral-Regular def
/PaintType 0 def
/FontMatrix [0.001 0 0 0.001 0 0] def
/FontBBox [-970 -443 2000 1023] def
/FontType 3 def
/Encoding [/period /zero /one /two /three /four /six] def
/CharStrings 8 dict dup begin
/.notdef 0 def
/period{250 0 70 -11 181 100 sc
181 43 m
181 28 175 16 164 5 c
153 -6 140 -11 125 -11 c
110 -11 97 -6 86 5 c
75 16 70 29 70 44 c
70 59 75 72 86 83 c
97 94 111 100 126 100 c
141 100 153 94 164 83 c
175 72 181 58 181 43 c

ce} _d
/zero{500 0 24 -14 476 676 sc
476 330 m
476 285 472 243 463 203 c
454 164 441 127 424 94 c
407 61 384 34 354 15 c
324 -4 289 -14 250 -14 c
209 -14 174 -4 143 17 c
112 38 89 65 72 100 c
55 135 43 172 35 211 c
28 250 24 292 24 336 c
24 398 32 454 47 503 c
62 553 88 594 123 627 c
159 660 203 676 254 676 c
319 676 373 644 414 580 c
455 516 476 433 476 330 c

380 325 m
380 430 369 511 346 566 c
324 622 291 650 248 650 c
207 650 175 622 153 566 c
131 510 120 431 120 329 c
120 226 131 148 153 93 c
175 39 207 12 250 12 c
292 12 324 39 346 93 c
369 148 380 225 380 325 c

ce} _d
/one{500 0 111 0 394 676 sc
394 0 m
118 0 l
118 15 l
155 17 180 24 193 35 c
206 47 213 67 213 95 c
213 544 l
213 577 203 593 183 593 c
174 593 159 589 138 581 c
111 571 l
111 585 l
290 676 l
299 673 l
299 76 l
299 54 306 38 319 29 c
332 20 357 15 394 15 c
394 0 l

ce} _d
/two{500 0 29 0 474 676 sc
474 137 m
420 0 l
29 0 l
29 12 l
207 201 l
254 250 287 294 307 335 c
327 376 337 418 337 461 c
337 506 325 540 300 565 c
275 590 241 602 198 602 c
162 602 133 593 112 574 c
91 555 71 521 51 472 c
30 477 l
41 539 64 588 98 623 c
133 658 179 676 238 676 c
293 676 338 659 372 626 c
406 593 423 551 423 500 c
423 425 380 342 295 252 c
130 76 l
364 76 l
386 76 403 80 416 89 c
429 98 444 116 460 143 c
474 137 l

ce} _d
/three{500 0 41 -14 431 676 sc
61 510 m
45 514 l
60 564 84 603 117 632 c
150 661 191 676 241 676 c
288 676 325 663 354 638 c
383 613 397 580 397 539 c
397 484 366 438 304 401 c
341 385 368 367 387 348 c
416 315 431 272 431 219 c
431 166 416 119 385 79 c
362 48 330 25 287 9 c
245 -6 200 -14 153 -14 c
78 -14 41 5 41 43 c
41 54 45 62 53 69 c
61 76 71 79 82 79 c
99 79 119 70 143 53 c
172 32 201 22 229 22 c
266 22 296 37 321 66 c
346 96 359 132 359 175 c
359 252 324 300 255 320 c
234 327 200 330 153 330 c
153 344 l
190 357 218 369 237 380 c
291 411 318 455 318 514 c
318 547 308 573 289 590 c
270 607 244 616 210 616 c
150 616 100 581 61 510 c

ce} _d
/four{500 0 12 0 473 676 sc
473 167 m
370 167 l
370 0 l
292 0 l
292 167 l
12 167 l
12 231 l
326 676 l
370 676 l
370 231 l
473 231 l
473 167 l

292 231 m
292 574 l
52 231 l
292 231 l

ce} _d
/six{500 0 34 -14 468 684 sc
446 684 m
448 668 l
369 655 304 623 251 572 c
198 521 165 458 152 383 c
191 413 233 428 279 428 c
338 428 384 409 417 372 c
451 335 468 284 468 219 c
468 154 451 100 417 59 c
378 10 325 -14 258 -14 c
177 -14 118 20 81 87 c
50 144 34 208 34 279 c
34 388 70 480 143 555 c
184 598 227 628 270 645 c
314 663 373 676 446 684 c

378 188 m
378 317 333 382 243 382 c
210 382 182 373 160 355 c
138 338 127 308 127 266 c
127 188 139 126 163 81 c
188 36 223 14 269 14 c
304 14 331 30 350 61 c
369 93 378 135 378 188 c

ce} _d
end readonly def

/BuildGlyph {
 exch begin
 CharStrings exch
 2 copy known not {pop /.notdef} if
 true 3 1 roll get exec
 end
} _d

/BuildChar {
 1 index /Encoding get exch get
 1 index /BuildGlyph get exec
} _d

FontName currentdict end definefont pop
end
%%EndProlog
mpldict begin
130.066 292.795 translate
351.868 206.41 0 0 clipbox
gsave
0 0 m
351.867669 0 l
351.867669 206.410062 l
0 206.410062 l
cl
1.000 setgray
fill
grestore
gsave
45.79375 42.79375 m
341.656319 42.79375 l
341.656319 199.210062 l
45.79375 199.210062 l
cl
1.000 setgray
fill
grestore
0.800 setlinewidth
1 setlinejoin
2 setlinecap
[] 0 setdash
0.690 setgray
gsave
295.863 156.416 45.794 42.794 clipbox
59.099296 42.79375 m
59.099296 199.210062 l
stroke
grestore
0 setlinecap
0.000 setgray
gsave
/o {
gsave
newpath
translate
0.8 setlinewidth
1 setlinejoin

0 setlinecap

0 0 m
0 -3.5 l

gsave
0.000 setgray
fill
grestore
stroke
grestore
} bind def
59.0993 42.7938 o
grestore
gsave
40.099296 26.403125 translate
0.000000 rotate
/Cmr10 12.0 selectfont
0.000000 0.808312 moveto
/three glyphshow
/Cmsy10 12.0 selectfont
8.107031 0.808312 moveto
/periodcentered glyphshow
/Cmr10 12.0 selectfont
13.536328 0.808312 moveto
/one glyphshow
19.536328 0.808312 moveto
/zero glyphshow
/Cmsy10 8.399999999999999 selectfont
26.072025 5.400000 moveto
/minus glyphshow
/Cmr10 8.399999999999999 selectfont
32.597611 5.400000 moveto
/five glyphshow
grestore
2 setlinecap
0.690 setgray
gsave
295.863 156.416 45.794 42.794 clipbox
152.857022 42.79375 m
152.857022 199.210062 l
stroke
grestore
0 setlinecap
0.000 setgray
gsave
/o {
gsave
newpath
translate
0.8 setlinewidth
1 setlinejoin

0 setlinecap

0 0 m
0 -3.5 l

gsave
0.000 setgray
fill
grestore
stroke
grestore
} bind def
152.857 42.7938 o
grestore
gsave
140.357022 26.403125 translate
0.000000 rotate
/Cmr10 12.0 selectfont
0.000000 0.808312 moveto
/one glyphshow
6.000000 0.808312 moveto
/zero glyphshow
/Cmsy10 8.399999999999999 selectfont
12.535697 5.400000 moveto
/minus glyphshow
/Cmr10 8.399999999999999 selectfont
19.061283 5.400000 moveto
/four glyphshow
grestore
2 setlinecap
0.690 setgray
gsave
295.863 156.416 45.794 42.794 clipbox
238.552696 42.79375 m
238.552696 199.210062 l
stroke
grestore
0 setlinecap
0.000 setgray
gsave
/o {
gsave
newpath
translate
0.8 setlinewidth
1 setlinejoin

0 setlinecap

0 0 m
0 -3.5 l

gsave
0.000 setgray
fill
grestore
stroke
grestore
} bind def
238.553 42.7938 o
grestore
gsave
219.552696 26.403125 translate
0.000000 rotate
/Cmr10 12.0 selectfont
0.000000 0.808312 moveto
/three glyphshow
/Cmsy10 12.0 selectfont
8.107031 0.808312 moveto
/periodcentered glyphshow
/Cmr10 12.0 selectfont
13.536328 0.808312 moveto
/one glyphshow
19.536328 0.808312 moveto
/zero glyphshow
/Cmsy10 8.399999999999999 selectfont
26.072025 5.400000 moveto
/minus glyphshow
/Cmr10 8.399999999999999 selectfont
32.597611 5.400000 moveto
/four glyphshow
grestore
2 setlinecap
0.690 setgray
gsave
295.863 156.416 45.794 42.794 clipbox
332.167669 42.79375 m
332.167669 199.210062 l
stroke
grestore
0 setlinecap
0.000 setgray
gsave
/o {
gsave
newpath
translate
0.8 setlinewidth
1 setlinejoin

0 setlinecap

0 0 m
0 -3.5 l

gsave
0.000 setgray
fill
grestore
stroke
grestore
} bind def
332.168 42.7938 o
grestore
gsave
319.667669 26.403125 translate
0.000000 rotate
/Cmr10 12.0 selectfont
0.000000 0.808312 moveto
/one glyphshow
6.000000 0.808312 moveto
/zero glyphshow
/Cmsy10 8.399999999999999 selectfont
12.535697 5.400000 moveto
/minus glyphshow
/Cmr10 8.399999999999999 selectfont
19.061283 5.400000 moveto
/three glyphshow
grestore
2 setlinecap
0.690 setgray
gsave
295.863 156.416 45.794 42.794 clipbox
81.502142 42.79375 m
81.502142 199.210062 l
stroke
grestore
0.600 setlinewidth
0 setlinecap
0.000 setgray
gsave
/o {
gsave
newpath
translate
0.6 setlinewidth
1 setlinejoin

0 setlinecap

0 0 m
0 -2 l

gsave
0.000 setgray
fill
grestore
stroke
grestore
} bind def
81.5021 42.7938 o
grestore
0.800 setlinewidth
2 setlinecap
0.690 setgray
gsave
295.863 156.416 45.794 42.794 clipbox
98.879139 42.79375 m
98.879139 199.210062 l
stroke
grestore
0.600 setlinewidth
0 setlinecap
0.000 setgray
gsave
/o {
gsave
newpath
translate
0.6 setlinewidth
1 setlinejoin

0 setlinecap

0 0 m
0 -2 l

gsave
0.000 setgray
fill
grestore
stroke
grestore
} bind def
98.8791 42.7938 o
grestore
0.800 setlinewidth
2 setlinecap
0.690 setgray
gsave
295.863 156.416 45.794 42.794 clipbox
113.077179 42.79375 m
113.077179 199.210062 l
stroke
grestore
0.600 setlinewidth
0 setlinecap
0.000 setgray
gsave
/o {
gsave
newpath
translate
0.6 setlinewidth
1 setlinejoin

0 setlinecap

0 0 m
0 -2 l

gsave
0.000 setgray
fill
grestore
stroke
grestore
} bind def
113.077 42.7938 o
grestore
0.800 setlinewidth
2 setlinecap
0.690 setgray
gsave
295.863 156.416 45.794 42.794 clipbox
125.081452 42.79375 m
125.081452 199.210062 l
stroke
grestore
0.600 setlinewidth
0 setlinecap
0.000 setgray
gsave
/o {
gsave
newpath
translate
0.6 setlinewidth
1 setlinejoin

0 setlinecap

0 0 m
0 -2 l

gsave
0.000 setgray
fill
grestore
stroke
grestore
} bind def
125.081 42.7938 o
grestore
0.800 setlinewidth
2 setlinecap
0.690 setgray
gsave
295.863 156.416 45.794 42.794 clipbox
135.480025 42.79375 m
135.480025 199.210062 l
stroke
grestore
0.600 setlinewidth
0 setlinecap
0.000 setgray
gsave
/o {
gsave
newpath
translate
0.6 setlinewidth
1 setlinejoin

0 setlinecap

0 0 m
0 -2 l

gsave
0.000 setgray
fill
grestore
stroke
grestore
} bind def
135.48 42.7938 o
grestore
0.800 setlinewidth
2 setlinecap
0.690 setgray
gsave
295.863 156.416 45.794 42.794 clipbox
144.652217 42.79375 m
144.652217 199.210062 l
stroke
grestore
0.600 setlinewidth
0 setlinecap
0.000 setgray
gsave
/o {
gsave
newpath
translate
0.6 setlinewidth
1 setlinejoin

0 setlinecap

0 0 m
0 -2 l

gsave
0.000 setgray
fill
grestore
stroke
grestore
} bind def
144.652 42.7938 o
grestore
0.800 setlinewidth
2 setlinecap
0.690 setgray
gsave
295.863 156.416 45.794 42.794 clipbox
206.834906 42.79375 m
206.834906 199.210062 l
stroke
grestore
0.600 setlinewidth
0 setlinecap
0.000 setgray
gsave
/o {
gsave
newpath
translate
0.6 setlinewidth
1 setlinejoin

0 setlinecap

0 0 m
0 -2 l

gsave
0.000 setgray
fill
grestore
stroke
grestore
} bind def
206.835 42.7938 o
grestore
0.800 setlinewidth
2 setlinecap
0.690 setgray
gsave
295.863 156.416 45.794 42.794 clipbox
238.409943 42.79375 m
238.409943 199.210062 l
stroke
grestore
0.600 setlinewidth
0 setlinecap
0.000 setgray
gsave
/o {
gsave
newpath
translate
0.6 setlinewidth
1 setlinejoin

0 setlinecap

0 0 m
0 -2 l

gsave
0.000 setgray
fill
grestore
stroke
grestore
} bind def
238.41 42.7938 o
grestore
0.800 setlinewidth
2 setlinecap
0.690 setgray
gsave
295.863 156.416 45.794 42.794 clipbox
260.812789 42.79375 m
260.812789 199.210062 l
stroke
grestore
0.600 setlinewidth
0 setlinecap
0.000 setgray
gsave
/o {
gsave
newpath
translate
0.6 setlinewidth
1 setlinejoin

0 setlinecap

0 0 m
0 -2 l

gsave
0.000 setgray
fill
grestore
stroke
grestore
} bind def
260.813 42.7938 o
grestore
0.800 setlinewidth
2 setlinecap
0.690 setgray
gsave
295.863 156.416 45.794 42.794 clipbox
278.189786 42.79375 m
278.189786 199.210062 l
stroke
grestore
0.600 setlinewidth
0 setlinecap
0.000 setgray
gsave
/o {
gsave
newpath
translate
0.6 setlinewidth
1 setlinejoin

0 setlinecap

0 0 m
0 -2 l

gsave
0.000 setgray
fill
grestore
stroke
grestore
} bind def
278.19 42.7938 o
grestore
0.800 setlinewidth
2 setlinecap
0.690 setgray
gsave
295.863 156.416 45.794 42.794 clipbox
292.387827 42.79375 m
292.387827 199.210062 l
stroke
grestore
0.600 setlinewidth
0 setlinecap
0.000 setgray
gsave
/o {
gsave
newpath
translate
0.6 setlinewidth
1 setlinejoin

0 setlinecap

0 0 m
0 -2 l

gsave
0.000 setgray
fill
grestore
stroke
grestore
} bind def
292.388 42.7938 o
grestore
0.800 setlinewidth
2 setlinecap
0.690 setgray
gsave
295.863 156.416 45.794 42.794 clipbox
304.392099 42.79375 m
304.392099 199.210062 l
stroke
grestore
0.600 setlinewidth
0 setlinecap
0.000 setgray
gsave
/o {
gsave
newpath
translate
0.6 setlinewidth
1 setlinejoin

0 setlinecap

0 0 m
0 -2 l

gsave
0.000 setgray
fill
grestore
stroke
grestore
} bind def
304.392 42.7938 o
grestore
0.800 setlinewidth
2 setlinecap
0.690 setgray
gsave
295.863 156.416 45.794 42.794 clipbox
314.790672 42.79375 m
314.790672 199.210062 l
stroke
grestore
0.600 setlinewidth
0 setlinecap
0.000 setgray
gsave
/o {
gsave
newpath
translate
0.6 setlinewidth
1 setlinejoin

0 setlinecap

0 0 m
0 -2 l

gsave
0.000 setgray
fill
grestore
stroke
grestore
} bind def
314.791 42.7938 o
grestore
0.800 setlinewidth
2 setlinecap
0.690 setgray
gsave
295.863 156.416 45.794 42.794 clipbox
323.962864 42.79375 m
323.962864 199.210062 l
stroke
grestore
0.600 setlinewidth
0 setlinecap
0.000 setgray
gsave
/o {
gsave
newpath
translate
0.6 setlinewidth
1 setlinejoin

0 setlinecap

0 0 m
0 -2 l

gsave
0.000 setgray
fill
grestore
stroke
grestore
} bind def
323.963 42.7938 o
grestore
gsave
187.225034 10.231250 translate
0.000000 rotate
/Cmr10 14.0 selectfont
0.000000 0.281250 moveto
/d glyphshow
/Cmmi10 14.0 selectfont
7.772461 0.281250 moveto
/t glyphshow
grestore
0.800 setlinewidth
2 setlinecap
0.690 setgray
gsave
295.863 156.416 45.794 42.794 clipbox
45.79375 64.442079 m
341.656319 64.442079 l
stroke
grestore
0 setlinecap
0.000 setgray
gsave
/o {
gsave
newpath
translate
0.8 setlinewidth
1 setlinejoin

0 setlinecap

-0 0 m
-3.5 0 l

gsave
0.000 setgray
fill
grestore
stroke
grestore
} bind def
45.7938 64.4421 o
grestore
/STIXGeneral-Regular 12.000 selectfont
gsave

23.793750 60.340516 translate
0.000000 rotate
0.000000 0 m /zero glyphshow
5.999985 0 m /period glyphshow
8.999969 0 m /three glyphshow
grestore
2 setlinecap
0.690 setgray
gsave
295.863 156.416 45.794 42.794 clipbox
45.79375 98.10609 m
341.656319 98.10609 l
stroke
grestore
0 setlinecap
0.000 setgray
gsave
/o {
gsave
newpath
translate
0.8 setlinewidth
1 setlinejoin

0 setlinecap

-0 0 m
-3.5 0 l

gsave
0.000 setgray
fill
grestore
stroke
grestore
} bind def
45.7938 98.1061 o
grestore
gsave

23.793750 94.004528 translate
0.000000 rotate
0.000000 0 m /zero glyphshow
5.999985 0 m /period glyphshow
8.999969 0 m /six glyphshow
grestore
2 setlinecap
0.690 setgray
gsave
295.863 156.416 45.794 42.794 clipbox
45.79375 122.915309 m
341.656319 122.915309 l
stroke
grestore
0 setlinecap
0.000 setgray
gsave
/o {
gsave
newpath
translate
0.8 setlinewidth
1 setlinejoin

0 setlinecap

-0 0 m
-3.5 0 l

gsave
0.000 setgray
fill
grestore
stroke
grestore
} bind def
45.7938 122.915 o
grestore
gsave

32.793750 118.813746 translate
0.000000 rotate
0.000000 0 m /one glyphshow
grestore
2 setlinecap
0.690 setgray
gsave
295.863 156.416 45.794 42.794 clipbox
45.79375 156.57932 m
341.656319 156.57932 l
stroke
grestore
0 setlinecap
0.000 setgray
gsave
/o {
gsave
newpath
translate
0.8 setlinewidth
1 setlinejoin

0 setlinecap

-0 0 m
-3.5 0 l

gsave
0.000 setgray
fill
grestore
stroke
grestore
} bind def
45.7938 156.579 o
grestore
gsave

32.793750 152.477758 translate
0.000000 rotate
0.000000 0 m /two glyphshow
grestore
2 setlinecap
0.690 setgray
gsave
295.863 156.416 45.794 42.794 clipbox
45.79375 190.243332 m
341.656319 190.243332 l
stroke
grestore
0 setlinecap
0.000 setgray
gsave
/o {
gsave
newpath
translate
0.8 setlinewidth
1 setlinejoin

0 setlinecap

-0 0 m
-3.5 0 l

gsave
0.000 setgray
fill
grestore
stroke
grestore
} bind def
45.7938 190.243 o
grestore
gsave

32.793750 186.141770 translate
0.000000 rotate
0.000000 0 m /four glyphshow
grestore
2 setlinecap
0.690 setgray
gsave
295.863 156.416 45.794 42.794 clipbox
45.79375 44.749894 m
341.656319 44.749894 l
stroke
grestore
0.600 setlinewidth
0 setlinecap
0.000 setgray
gsave
/o {
gsave
newpath
translate
0.6 setlinewidth
1 setlinejoin

0 setlinecap

-0 0 m
-2 0 l

gsave
0.000 setgray
fill
grestore
stroke
grestore
} bind def
45.7938 44.7499 o
grestore
0.800 setlinewidth
2 setlinecap
0.690 setgray
gsave
295.863 156.416 45.794 42.794 clipbox
45.79375 78.413906 m
341.656319 78.413906 l
stroke
grestore
0.600 setlinewidth
0 setlinecap
0.000 setgray
gsave
/o {
gsave
newpath
translate
0.6 setlinewidth
1 setlinejoin

0 setlinecap

-0 0 m
-2 0 l

gsave
0.000 setgray
fill
grestore
stroke
grestore
} bind def
45.7938 78.4139 o
grestore
0.800 setlinewidth
2 setlinecap
0.690 setgray
gsave
295.863 156.416 45.794 42.794 clipbox
45.79375 89.251297 m
341.656319 89.251297 l
stroke
grestore
0.600 setlinewidth
0 setlinecap
0.000 setgray
gsave
/o {
gsave
newpath
translate
0.6 setlinewidth
1 setlinejoin

0 setlinecap

-0 0 m
-2 0 l

gsave
0.000 setgray
fill
grestore
stroke
grestore
} bind def
45.7938 89.2513 o
grestore
0.800 setlinewidth
2 setlinecap
0.690 setgray
gsave
295.863 156.416 45.794 42.794 clipbox
45.79375 105.592711 m
341.656319 105.592711 l
stroke
grestore
0.600 setlinewidth
0 setlinecap
0.000 setgray
gsave
/o {
gsave
newpath
translate
0.6 setlinewidth
1 setlinejoin

0 setlinecap

-0 0 m
-2 0 l

gsave
0.000 setgray
fill
grestore
stroke
grestore
} bind def
45.7938 105.593 o
grestore
0.800 setlinewidth
2 setlinecap
0.690 setgray
gsave
295.863 156.416 45.794 42.794 clipbox
45.79375 112.077918 m
341.656319 112.077918 l
stroke
grestore
0.600 setlinewidth
0 setlinecap
0.000 setgray
gsave
/o {
gsave
newpath
translate
0.6 setlinewidth
1 setlinejoin

0 setlinecap

-0 0 m
-2 0 l

gsave
0.000 setgray
fill
grestore
stroke
grestore
} bind def
45.7938 112.078 o
grestore
0.800 setlinewidth
2 setlinecap
0.690 setgray
gsave
295.863 156.416 45.794 42.794 clipbox
45.79375 117.798275 m
341.656319 117.798275 l
stroke
grestore
0.600 setlinewidth
0 setlinecap
0.000 setgray
gsave
/o {
gsave
newpath
translate
0.6 setlinewidth
1 setlinejoin

0 setlinecap

-0 0 m
-2 0 l

gsave
0.000 setgray
fill
grestore
stroke
grestore
} bind def
45.7938 117.798 o
grestore
0.800 setlinewidth
2 setlinecap
0.690 setgray
gsave
295.863 156.416 45.794 42.794 clipbox
45.79375 176.271505 m
341.656319 176.271505 l
stroke
grestore
0.600 setlinewidth
0 setlinecap
0.000 setgray
gsave
/o {
gsave
newpath
translate
0.6 setlinewidth
1 setlinejoin

0 setlinecap

-0 0 m
-2 0 l

gsave
0.000 setgray
fill
grestore
stroke
grestore
} bind def
45.7938 176.272 o
grestore
gsave
16.762500 117.501906 translate
90.000000 rotate
/Cmmi10 14.0 selectfont
0.000000 -0.062500 moveto
/r glyphshow
0.0 8.25 6.31640625 0.875 rectfill
grestore
1.500 setlinewidth
2 setlinecap
0.122 0.467 0.706 setrgbcolor
gsave
295.863 156.416 45.794 42.794 clipbox
59.242049 192.095626 m
89.127156 192.097371 l
119.012264 192.10023 l
148.897372 192.085229 l
178.78248 192.091315 l
208.667588 192.097531 l
238.552696 192.093189 l
268.437805 192.082016 l
271.477693 192.093655 l
274.40336 192.08906 l
277.22308 192.09386 l
279.944259 192.089697 l
282.573552 192.0883 l
285.116962 192.081916 l
287.579923 192.077692 l
289.967369 192.081017 l
292.283793 192.087837 l
294.533298 192.082704 l
296.719642 192.089754 l
298.322911 192.073604 l
298.846277 192.08584 l
300.916376 190.789403 l
302.932868 146.933685 l
304.89846 93.677022 l
306.815657 81.081185 l
310.51401 61.286065 l
312.29934 56.937289 l
314.044655 56.8469 l
315.75171 56.378104 l
317.422147 55.62841 l
319.057502 55.492502 l
320.65922 50.078078 l
322.228657 49.903582 l
323.767088 49.903582 l
325.275714 49.903582 l
326.755668 49.903582 l
328.20802 49.903582 l
stroke
grestore
1.000 setlinewidth
0 setlinecap
gsave
295.863 156.416 45.794 42.794 clipbox
/o {
gsave
newpath
translate
1.0 setlinewidth
1 setlinejoin

0 setlinecap

0 -3 m
0.795609 -3 1.55874 -2.683901 2.12132 -2.12132 c
2.683901 -1.55874 3 -0.795609 3 0 c
3 0.795609 2.683901 1.55874 2.12132 2.12132 c
1.55874 2.683901 0.795609 3 0 3 c
-0.795609 3 -1.55874 2.683901 -2.12132 2.12132 c
-2.683901 1.55874 -3 0.795609 -3 0 c
-3 -0.795609 -2.683901 -1.55874 -2.12132 -2.12132 c
-1.55874 -2.683901 -0.795609 -3 0 -3 c
cl

gsave
grestore
stroke
grestore
} bind def
59.242 192.096 o
89.1272 192.097 o
119.012 192.1 o
148.897 192.085 o
178.782 192.091 o
208.668 192.098 o
238.553 192.093 o
268.438 192.082 o
271.478 192.094 o
274.403 192.089 o
277.223 192.094 o
279.944 192.09 o
282.574 192.088 o
285.117 192.082 o
287.58 192.078 o
289.967 192.081 o
292.284 192.088 o
294.533 192.083 o
296.72 192.09 o
298.323 192.074 o
298.846 192.086 o
300.916 190.789 o
302.933 146.934 o
304.898 93.677 o
306.816 81.0812 o
310.514 61.2861 o
312.299 56.9373 o
314.045 56.8469 o
315.752 56.3781 o
317.422 55.6284 o
319.058 55.4925 o
320.659 50.0781 o
322.229 49.9036 o
323.767 49.9036 o
325.276 49.9036 o
326.756 49.9036 o
328.208 49.9036 o
grestore
1.500 setlinewidth
2 setlinecap
1.000 0.498 0.055 setrgbcolor
gsave
295.863 156.416 45.794 42.794 clipbox
59.242049 192.006413 m
89.127156 192.006797 l
119.012264 192.005927 l
148.897372 192.007266 l
178.78248 192.006352 l
208.667588 192.004434 l
238.552696 192.003183 l
268.437805 192.000103 l
271.477693 192.002013 l
274.40336 192.000773 l
277.22308 192.000248 l
279.944259 191.998891 l
282.573552 191.999605 l
285.116962 191.997405 l
287.579923 191.998499 l
289.967369 191.996405 l
292.283793 192.000721 l
294.533298 191.998123 l
296.719642 76.414692 l
298.846277 62.643116 l
300.916376 56.828445 l
302.932868 56.401903 l
304.89846 55.889371 l
306.815657 51.34995 l
308.686787 49.903582 l
310.51401 54.4905 l
315.75171 49.903582 l
317.422147 49.903582 l
319.057502 49.903582 l
320.65922 49.903582 l
322.228657 49.903582 l
323.767088 49.903582 l
325.275714 49.903582 l
326.755668 49.903582 l
328.20802 49.903582 l
stroke
grestore
1.000 setlinewidth
0 setlinecap
gsave
295.863 156.416 45.794 42.794 clipbox
/o {
gsave
newpath
translate
1.0 setlinewidth
1 setlinejoin

0 setlinecap

0 -2 m
0.530406 -2 1.03916 -1.789267 1.414214 -1.414214 c
1.789267 -1.03916 2 -0.530406 2 0 c
2 0.530406 1.789267 1.03916 1.414214 1.414214 c
1.03916 1.789267 0.530406 2 0 2 c
-0.530406 2 -1.03916 1.789267 -1.414214 1.414214 c
-1.789267 1.03916 -2 0.530406 -2 0 c
-2 -0.530406 -1.789267 -1.03916 -1.414214 -1.414214 c
-1.03916 -1.789267 -0.530406 -2 0 -2 c
cl

gsave
1.000 0.498 0.055 setrgbcolor
fill
grestore
stroke
grestore
} bind def
59.242 192.006 o
89.1272 192.007 o
119.012 192.006 o
148.897 192.007 o
178.782 192.006 o
208.668 192.004 o
238.553 192.003 o
268.438 192 o
271.478 192.002 o
274.403 192.001 o
277.223 192 o
279.944 191.999 o
282.574 192 o
285.117 191.997 o
287.58 191.998 o
289.967 191.996 o
292.284 192.001 o
294.533 191.998 o
296.72 76.4147 o
298.846 62.6431 o
300.916 56.8284 o
302.933 56.4019 o
304.898 55.8894 o
306.816 51.3499 o
308.687 49.9036 o
310.514 54.4905 o
315.752 49.9036 o
317.422 49.9036 o
319.058 49.9036 o
320.659 49.9036 o
322.229 49.9036 o
323.767 49.9036 o
325.276 49.9036 o
326.756 49.9036 o
328.208 49.9036 o
grestore
1.500 setlinewidth
[5.55 2.4] 0 setdash
0.000 setgray
gsave
295.863 156.416 45.794 42.794 clipbox
238.552696 42.79375 m
238.552696 199.210062 l
stroke
grestore
0.800 setlinewidth
0 setlinejoin
2 setlinecap
[] 0 setdash
gsave
45.79375 42.79375 m
45.79375 199.210062 l
stroke
grestore
gsave
341.656319 42.79375 m
341.656319 199.210062 l
stroke
grestore
gsave
45.79375 42.79375 m
341.656319 42.79375 l
stroke
grestore
gsave
45.79375 199.210062 m
341.656319 199.210062 l
stroke
grestore
1.000 setlinewidth
0 setlinecap
0.800 setgray
gsave
52.79375 47.79375 m
110.79375 47.79375 l
112.127083 47.79375 112.79375 48.460417 112.79375 49.79375 c
112.79375 77.1375 l
112.79375 78.470833 112.127083 79.1375 110.79375 79.1375 c
52.79375 79.1375 l
51.460417 79.1375 50.79375 78.470833 50.79375 77.1375 c
50.79375 49.79375 l
50.79375 48.460417 51.460417 47.79375 52.79375 47.79375 c
cl
gsave
1.000 setgray
fill
grestore
stroke
grestore
1.500 setlinewidth
1 setlinejoin
2 setlinecap
0.122 0.467 0.706 setrgbcolor
gsave
54.79375 71.6375 m
64.79375 71.6375 l
74.79375 71.6375 l
stroke
grestore
1.000 setlinewidth
0 setlinecap
gsave
/o {
gsave
newpath
translate
1.0 setlinewidth
1 setlinejoin

0 setlinecap

0 -3 m
0.795609 -3 1.55874 -2.683901 2.12132 -2.12132 c
2.683901 -1.55874 3 -0.795609 3 0 c
3 0.795609 2.683901 1.55874 2.12132 2.12132 c
1.55874 2.683901 0.795609 3 0 3 c
-0.795609 3 -1.55874 2.683901 -2.12132 2.12132 c
-2.683901 1.55874 -3 0.795609 -3 0 c
-3 -0.795609 -2.683901 -1.55874 -2.12132 -2.12132 c
-1.55874 -2.683901 -0.795609 -3 0 -3 c
cl

gsave
grestore
stroke
grestore
} bind def
64.7938 71.6375 o
grestore
0.000 setgray
gsave
82.793750 68.137500 translate
0.000000 rotate
/Cmmi10 10.0 selectfont
0.000000 0.343750 moveto
/m glyphshow
/Cmr10 10.0 selectfont
10.535156 0.343750 moveto
/equal glyphshow
20.059570 0.343750 moveto
/two glyphshow
grestore
1.500 setlinewidth
2 setlinecap
1.000 0.498 0.055 setrgbcolor
gsave
54.79375 57.465625 m
64.79375 57.465625 l
74.79375 57.465625 l
stroke
grestore
1.000 setlinewidth
0 setlinecap
gsave
/o {
gsave
newpath
translate
1.0 setlinewidth
1 setlinejoin

0 setlinecap

0 -2 m
0.530406 -2 1.03916 -1.789267 1.414214 -1.414214 c
1.789267 -1.03916 2 -0.530406 2 0 c
2 0.530406 1.789267 1.03916 1.414214 1.414214 c
1.03916 1.789267 0.530406 2 0 2 c
-0.530406 2 -1.03916 1.789267 -1.414214 1.414214 c
-1.789267 1.03916 -2 0.530406 -2 0 c
-2 -0.530406 -1.789267 -1.03916 -1.414214 -1.414214 c
-1.03916 -1.789267 -0.530406 -2 0 -2 c
cl

gsave
1.000 0.498 0.055 setrgbcolor
fill
grestore
stroke
grestore
} bind def
64.7938 57.4656 o
grestore
0.000 setgray
gsave
82.793750 53.965625 translate
0.000000 rotate
/Cmmi10 10.0 selectfont
0.000000 0.343750 moveto
/m glyphshow
/Cmr10 10.0 selectfont
10.535156 0.343750 moveto
/equal glyphshow
20.059570 0.343750 moveto
/four glyphshow
grestore

end
showpage
