%!PS-Adobe-3.0 EPSF-3.0
%%Title: conv_at_time.eps
%%Creator: Matplotlib v3.7.2, https://matplotlib.org/
%%CreationDate: Mon Sep 18 15:54:04 2023
%%Orientation: portrait
%%BoundingBox: 148 243 464 549
%%HiResBoundingBox: 148.511573 243.668250 463.488427 548.331750
%%EndComments
%%BeginProlog
/mpldict 14 dict def
mpldict begin
/_d { bind def } bind def
/m { moveto } _d
/l { lineto } _d
/r { rlineto } _d
/c { curveto } _d
/cl { closepath } _d
/ce { closepath eofill } _d
/box {
      m
      1 index 0 r
      0 exch r
      neg 0 r
      cl
    } _d
/clipbox {
      box
      clip
      newpath
    } _d
/sc { setcachedevice } _d
%!PS-Adobe-3.0 Resource-Font
%%Creator: Converted from TrueType to Type 3 by Matplotlib.
10 dict begin
/FontName /STIXGeneral-Regular def
/PaintType 0 def
/FontMatrix [0.001 0 0 0.001 0 0] def
/FontBBox [-970 -443 2000 1023] def
/FontType 3 def
/Encoding [/space /comma /period /zero /one /four /six /eight /C /F /I /M /P /T /a /c /d /e /i /l /n /o /r /s /t] def
/CharStrings 26 dict dup begin
/.notdef 0 def
/space{250 0 0 0 0 0 sc
ce} _d
/comma{250 0 55 -141 195 102 sc
83 -141 m
73 -122 l
128 -85 156 -49 156 -15 c
156 -6 151 -2 142 -2 c
139 -2 135 -3 128 -4 c
122 -5 117 -6 113 -6 c
74 -6 55 11 55 45 c
55 62 60 76 71 86 c
82 97 97 102 115 102 c
138 102 157 94 172 77 c
187 61 195 40 195 15 c
195 -16 185 -45 164 -74 c
144 -103 117 -125 83 -141 c

ce} _d
/period{250 0 70 -11 181 100 sc
181 43 m
181 28 175 16 164 5 c
153 -6 140 -11 125 -11 c
110 -11 97 -6 86 5 c
75 16 70 29 70 44 c
70 59 75 72 86 83 c
97 94 111 100 126 100 c
141 100 153 94 164 83 c
175 72 181 58 181 43 c

ce} _d
/zero{500 0 24 -14 476 676 sc
476 330 m
476 285 472 243 463 203 c
454 164 441 127 424 94 c
407 61 384 34 354 15 c
324 -4 289 -14 250 -14 c
209 -14 174 -4 143 17 c
112 38 89 65 72 100 c
55 135 43 172 35 211 c
28 250 24 292 24 336 c
24 398 32 454 47 503 c
62 553 88 594 123 627 c
159 660 203 676 254 676 c
319 676 373 644 414 580 c
455 516 476 433 476 330 c

380 325 m
380 430 369 511 346 566 c
324 622 291 650 248 650 c
207 650 175 622 153 566 c
131 510 120 431 120 329 c
120 226 131 148 153 93 c
175 39 207 12 250 12 c
292 12 324 39 346 93 c
369 148 380 225 380 325 c

ce} _d
/one{500 0 111 0 394 676 sc
394 0 m
118 0 l
118 15 l
155 17 180 24 193 35 c
206 47 213 67 213 95 c
213 544 l
213 577 203 593 183 593 c
174 593 159 589 138 581 c
111 571 l
111 585 l
290 676 l
299 673 l
299 76 l
299 54 306 38 319 29 c
332 20 357 15 394 15 c
394 0 l

ce} _d
/four{500 0 12 0 473 676 sc
473 167 m
370 167 l
370 0 l
292 0 l
292 167 l
12 167 l
12 231 l
326 676 l
370 676 l
370 231 l
473 231 l
473 167 l

292 231 m
292 574 l
52 231 l
292 231 l

ce} _d
/six{500 0 34 -14 468 684 sc
446 684 m
448 668 l
369 655 304 623 251 572 c
198 521 165 458 152 383 c
191 413 233 428 279 428 c
338 428 384 409 417 372 c
451 335 468 284 468 219 c
468 154 451 100 417 59 c
378 10 325 -14 258 -14 c
177 -14 118 20 81 87 c
50 144 34 208 34 279 c
34 388 70 480 143 555 c
184 598 227 628 270 645 c
314 663 373 676 446 684 c

378 188 m
378 317 333 382 243 382 c
210 382 182 373 160 355 c
138 338 127 308 127 266 c
127 188 139 126 163 81 c
188 36 223 14 269 14 c
304 14 331 30 350 61 c
369 93 378 135 378 188 c

ce} _d
/eight{500 0 56 -14 445 676 sc
445 155 m
445 104 427 63 391 32 c
356 1 308 -14 248 -14 c
192 -14 146 1 110 32 c
74 63 56 102 56 149 c
56 184 65 214 82 239 c
99 264 134 295 186 332 c
136 373 103 407 86 432 c
70 457 62 487 62 520 c
62 567 80 605 116 633 c
153 662 199 676 256 676 c
305 676 345 662 376 634 c
408 607 424 573 424 533 c
424 496 414 467 395 445 c
376 423 341 398 290 371 c
350 331 391 295 412 264 c
434 233 445 196 445 155 c

355 533 m
355 568 345 595 326 616 c
307 637 280 648 246 648 c
212 648 185 639 165 621 c
146 604 136 580 136 549 c
136 518 146 490 165 465 c
185 440 217 415 261 389 c
295 409 319 430 333 452 c
348 475 355 502 355 533 c

271 272 m
212 312 l
183 288 162 264 150 241 c
138 218 132 191 132 158 c
132 113 143 77 166 52 c
189 27 220 14 259 14 c
292 14 318 24 338 44 c
359 65 369 91 369 124 c
369 154 361 180 346 203 c
331 226 306 249 271 272 c

ce} _d
/C{667 0 28 -14 633 676 sc
614 131 m
633 113 l
574 28 483 -14 360 -14 c
263 -14 185 16 124 75 c
60 138 28 221 28 325 c
28 422 58 505 118 572 c
181 641 262 676 361 676 c
404 676 443 671 480 661 c
522 649 545 643 549 643 c
571 643 585 654 591 676 c
611 676 l
620 449 l
597 449 l
586 497 569 534 545 560 c
498 611 444 636 384 636 c
310 636 251 609 208 554 c
165 500 144 429 144 341 c
144 234 168 154 216 102 c
261 54 320 30 394 30 c
438 30 476 38 508 53 c
540 68 575 94 614 131 c

ce} _d
/F{556 0 11 0 546 662 sc
546 519 m
521 519 l
514 564 501 593 483 605 c
466 618 427 624 367 624 c
235 624 l
221 624 212 621 207 616 c
203 611 201 601 201 585 c
201 368 l
343 368 l
385 368 413 374 427 386 c
442 398 451 424 456 463 c
479 463 l
479 230 l
456 230 l
452 271 443 297 429 309 c
415 321 386 327 343 327 c
201 327 l
201 112 l
201 74 206 49 217 38 c
228 27 253 21 292 19 c
292 0 l
11 0 l
11 19 l
49 22 73 29 83 40 c
94 52 99 80 99 123 c
99 551 l
99 588 94 611 84 622 c
74 633 50 640 12 643 c
12 662 l
541 662 l
546 519 l

ce} _d
/I{333 0 18 0 315 662 sc
315 0 m
18 0 l
18 19 l
60 20 87 26 98 37 c
109 48 115 73 115 112 c
115 551 l
115 590 110 614 99 624 c
88 634 61 640 18 643 c
18 662 l
315 662 l
315 643 l
273 641 246 635 234 624 c
223 613 217 589 217 551 c
217 112 l
217 75 223 50 235 38 c
247 27 274 20 315 19 c
315 0 l

ce} _d
/M{889 0 12 0 864 662 sc
864 0 m
584 0 l
584 19 l
623 22 648 29 658 41 c
669 54 674 81 674 123 c
674 572 l
419 0 l
405 0 l
153 549 l
153 151 l
153 97 159 62 170 46 c
181 30 207 21 246 19 c
246 0 l
12 0 l
12 19 l
41 21 62 25 75 32 c
88 39 96 50 101 67 c
106 84 109 112 109 151 c
109 549 l
109 587 103 611 92 622 c
81 633 55 640 14 643 c
14 662 l
212 662 l
443 160 l
664 662 l
863 662 l
863 643 l
827 642 803 636 792 624 c
781 612 776 587 776 550 c
776 112 l
776 77 781 53 792 41 c
803 29 827 22 864 19 c
864 0 l

ce} _d
/P{557 0 16 0 542 662 sc
16 662 m
275 662 l
370 662 442 641 492 599 c
525 571 542 531 542 480 c
542 427 523 383 485 349 c
457 324 428 307 399 299 c
370 292 327 288 271 288 c
252 288 229 289 202 291 c
202 112 l
202 74 207 49 218 38 c
229 27 255 21 296 19 c
296 0 l
16 0 l
16 19 l
55 22 78 29 87 40 c
96 51 100 79 100 122 c
100 551 l
100 588 95 612 85 623 c
76 634 53 640 16 643 c
16 662 l

202 589 m
202 331 l
225 329 245 328 263 328 c
317 328 359 341 388 367 c
418 394 433 430 433 475 c
433 529 418 567 387 590 c
356 613 306 625 237 625 c
223 625 214 622 209 617 c
204 612 202 603 202 589 c

ce} _d
/T{611 0 17 0 593 662 sc
593 492 m
569 492 l
558 547 543 582 524 597 c
505 612 468 620 415 620 c
356 620 l
356 111 l
356 73 362 49 373 38 c
384 27 411 21 452 19 c
452 0 l
160 0 l
160 19 l
202 22 228 29 238 40 c
249 51 254 79 254 123 c
254 620 l
194 620 l
140 620 103 612 84 596 c
65 581 51 546 41 492 c
17 492 l
24 662 l
586 662 l
593 492 l

ce} _d
/a{444 0 37 -10 442 460 sc
442 66 m
442 38 l
417 6 387 -10 352 -10 c
314 -10 293 14 288 63 c
287 63 l
244 14 196 -10 142 -10 c
111 -10 85 -1 66 17 c
47 36 37 61 37 94 c
37 141 60 180 107 211 c
139 232 199 259 287 292 c
287 346 l
287 376 280 398 265 413 c
251 428 232 436 209 436 c
189 436 172 431 159 421 c
146 412 139 400 139 387 c
139 381 140 374 142 367 c
144 360 145 352 145 345 c
145 335 140 326 131 317 c
122 308 112 304 99 304 c
88 304 78 308 69 317 c
60 326 56 337 56 350 c
56 382 73 409 107 430 c
138 450 177 460 222 460 c
276 460 315 445 340 415 c
352 401 360 387 363 372 c
366 358 368 335 368 304 c
368 113 l
368 69 378 47 399 47 c
412 47 427 53 442 66 c

287 127 m
287 268 l
226 247 183 225 159 202 c
136 181 125 156 125 125 c
125 100 131 80 144 67 c
157 54 173 48 194 48 c
216 48 235 53 252 64 c
266 74 275 83 280 92 c
285 101 287 112 287 127 c

ce} _d
/c{444 0 25 -10 412 460 sc
398 156 m
412 147 l
383 91 356 53 330 32 c
296 4 258 -10 215 -10 c
160 -10 114 11 78 52 c
43 94 25 147 25 212 c
25 297 53 362 109 409 c
150 443 195 460 244 460 c
286 460 322 450 352 429 c
383 409 398 385 398 357 c
398 346 393 336 384 327 c
375 319 364 315 351 315 c
328 315 312 330 303 361 c
297 383 l
292 402 285 414 277 421 c
269 428 256 431 238 431 c
197 431 164 415 139 383 c
114 351 102 309 102 257 c
102 200 116 153 145 116 c
174 80 211 62 257 62 c
286 62 310 69 331 82 c
352 96 374 121 398 156 c

ce} _d
/d{500 0 27 -10 491 683 sc
491 42 m
344 -10 l
340 -7 l
340 57 l
308 12 265 -10 212 -10 c
157 -10 112 10 78 49 c
44 89 27 141 27 205 c
27 276 47 336 88 385 c
129 435 178 460 235 460 c
271 460 306 446 340 417 c
340 573 l
340 594 337 607 331 614 c
325 621 313 624 294 624 c
285 624 277 624 272 623 c
272 639 l
333 655 382 670 419 683 c
424 681 l
424 114 l
424 91 427 75 432 68 c
438 61 450 57 468 57 c
472 57 480 57 491 58 c
491 42 l

340 102 m
340 332 l
340 359 330 382 309 402 c
289 422 265 432 238 432 c
200 432 170 415 147 381 c
124 347 113 302 113 245 c
113 184 125 134 150 97 c
175 60 209 42 251 42 c
282 42 307 53 325 74 c
335 85 340 95 340 102 c

ce} _d
/e{444 0 25 -10 424 460 sc
408 164 m
424 157 l
384 46 314 -10 215 -10 c
156 -10 110 10 76 51 c
42 92 25 148 25 217 c
25 288 44 347 82 392 c
120 437 170 460 232 460 c
292 460 338 437 371 391 c
390 364 402 326 405 277 c
97 277 l
100 235 104 203 109 181 c
115 159 126 137 143 114 c
171 77 208 59 254 59 c
287 59 314 67 336 83 c
359 99 383 126 408 164 c

99 309 m
303 309 l
297 351 287 381 273 398 c
260 415 237 424 205 424 c
177 424 154 414 135 394 c
116 375 104 346 99 309 c

ce} _d
/i{278 0 16 0 253 683 sc
180 632 m
180 617 175 605 165 595 c
155 586 143 581 128 581 c
114 581 102 586 92 595 c
83 605 78 617 78 632 c
78 646 83 658 93 668 c
103 678 115 683 129 683 c
144 683 156 678 165 668 c
175 658 180 646 180 632 c

253 0 m
16 0 l
16 15 l
51 17 72 23 81 33 c
90 43 95 67 95 104 c
95 331 l
95 354 93 371 88 380 c
83 389 75 394 62 394 c
46 394 32 392 20 389 c
20 405 l
175 460 l
179 456 l
179 105 l
179 68 183 44 191 34 c
200 24 220 18 253 15 c
253 0 l

ce} _d
/l{278 0 19 0 257 683 sc
257 0 m
21 0 l
21 15 l
52 18 73 24 83 34 c
93 45 98 64 98 92 c
98 561 l
98 585 95 602 89 611 c
83 620 72 625 56 625 c
42 625 30 624 19 623 c
19 639 l
82 654 135 669 177 683 c
182 679 l
182 87 l
182 59 187 40 196 31 c
205 22 226 17 257 15 c
257 0 l

ce} _d
/n{500 0 16 0 485 460 sc
485 0 m
277 0 l
278 15 l
303 17 319 24 327 36 c
336 49 340 72 340 105 c
340 304 l
340 371 316 405 267 405 c
250 405 235 401 220 393 c
205 385 187 370 164 348 c
164 72 l
164 52 168 38 177 30 c
186 22 204 17 229 15 c
229 0 l
18 0 l
18 15 l
43 17 60 23 68 33 c
76 44 80 64 80 94 c
80 337 l
80 362 78 379 73 388 c
68 397 59 402 45 402 c
32 402 22 401 16 398 c
16 415 l
63 428 108 443 153 460 c
161 457 l
161 379 l
162 379 l
209 433 257 460 306 460 c
344 460 373 447 393 420 c
414 393 424 355 424 306 c
424 85 l
424 58 428 41 436 32 c
444 23 460 18 485 15 c
485 0 l

ce} _d
/o{500 0 29 -10 470 460 sc
470 231 m
470 161 449 103 407 58 c
366 13 312 -10 245 -10 c
184 -10 132 12 91 57 c
50 102 29 159 29 228 c
29 297 50 353 91 396 c
132 439 187 460 254 460 c
316 460 367 439 408 396 c
449 354 470 299 470 231 c

380 204 m
380 280 363 339 330 382 c
303 415 272 432 235 432 c
200 432 172 418 151 389 c
130 361 119 322 119 273 c
119 188 137 119 172 68 c
195 35 225 18 262 18 c
299 18 327 34 348 67 c
369 100 380 146 380 204 c

ce} _d
/r{333 0 5 0 335 460 sc
160 458 m
160 366 l
185 402 206 427 223 440 c
240 453 259 460 280 460 c
297 460 311 455 320 446 c
330 437 335 424 335 407 c
335 393 331 382 324 374 c
317 366 308 362 296 362 c
283 362 270 369 256 382 c
245 392 237 397 230 397 c
216 397 201 387 184 368 c
168 349 160 331 160 315 c
160 90 l
160 61 166 42 177 32 c
188 22 211 16 245 15 c
245 0 l
5 0 l
5 15 l
37 21 57 28 64 35 c
72 42 76 59 76 84 c
76 334 l
76 356 73 371 68 380 c
63 389 55 394 42 394 c
31 394 20 393 7 390 c
7 406 l
49 419 98 437 155 460 c
160 458 l

ce} _d
/s{389 0 51 -10 348 459 sc
156 301 m
260 238 l
293 218 316 199 329 182 c
342 165 348 142 348 115 c
348 82 334 52 306 27 c
279 2 246 -10 208 -10 c
177 -10 152 -7 135 -1 c
117 5 102 8 89 8 c
78 8 70 4 65 -4 c
52 -4 l
52 153 l
68 153 l
79 104 94 69 114 46 c
134 23 161 12 195 12 c
220 12 240 19 255 33 c
270 47 278 65 278 86 c
278 117 260 142 225 161 c
171 191 l
91 236 51 284 51 336 c
51 375 63 405 88 426 c
113 448 147 459 189 459 c
218 459 241 455 256 448 c
268 443 277 440 284 440 c
289 440 294 443 300 450 c
311 450 l
316 314 l
301 314 l
290 359 275 391 258 409 c
241 428 218 437 188 437 c
165 437 147 431 133 420 c
120 409 113 392 113 369 c
113 358 117 345 124 332 c
132 319 143 309 156 301 c

ce} _d
/t{278 0 13 -10 279 579 sc
266 77 m
279 66 l
247 15 207 -10 158 -10 c
99 -10 70 32 70 117 c
70 418 l
17 418 l
14 420 13 422 13 425 c
13 430 19 437 30 444 c
55 459 88 494 127 551 c
128 553 131 557 136 563 c
141 570 145 575 147 579 c
152 579 154 575 154 566 c
154 450 l
255 450 l
255 418 l
154 418 l
154 132 l
154 100 158 77 166 63 c
174 49 187 42 206 42 c
226 42 246 54 266 77 c

ce} _d
end readonly def

/BuildGlyph {
 exch begin
 CharStrings exch
 2 copy known not {pop /.notdef} if
 true 3 1 roll get exec
 end
} _d

/BuildChar {
 1 index /Encoding get exch get
 1 index /BuildGlyph get exec
} _d

FontName currentdict end definefont pop
%!PS-Adobe-3.0 Resource-Font
%%Creator: Converted from TrueType to Type 3 by Matplotlib.
10 dict begin
/FontName /Cmmi10 def
/PaintType 0 def
/FontMatrix [0.00048828125 0 0 0.00048828125 0 0] def
/FontBBox [-70 -512 2146 1536] def
/FontType 3 def
/Encoding [/e /h /m /N /t /period] def
/CharStrings 7 dict dup begin
/.notdef 0 def
/e{952 0 90 -23 881 905 sc
412 -23 m
347 -23 289 -6 240 28 c
191 62 154 108 128 165 c
103 223 90 284 90 348 c
90 445 114 537 163 622 c
212 708 279 777 363 828 c
447 879 537 905 633 905 c
692 905 743 890 786 859 c
830 829 852 786 852 729 c
852 650 821 592 758 553 c
695 515 625 491 546 482 c
467 473 380 469 285 469 c
279 469 l
257 388 246 318 246 260 c
246 199 260 146 288 100 c
316 54 359 31 416 31 c
497 31 575 50 650 87 c
725 124 787 176 834 242 c
838 246 843 248 850 248 c
857 248 863 244 870 236 c
877 229 881 222 881 215 c
881 210 880 206 877 203 c
827 133 760 78 675 37 c
590 -3 503 -23 412 -23 c

291 522 m
370 522 444 526 511 533 c
578 540 639 559 694 588 c
749 618 776 664 776 727 c
776 752 769 774 755 793 c
741 812 723 827 700 837 c
678 847 655 852 631 852 c
573 852 521 836 474 805 c
428 774 390 733 360 682 c
330 632 307 579 291 522 c

ce} _d
/h{1180 0 109 -23 1124 1421 sc
109 37 m
109 45 110 51 111 55 c
408 1239 l
413 1262 417 1281 418 1294 c
418 1316 374 1327 285 1327 c
271 1327 264 1336 264 1354 c
265 1357 266 1363 268 1372 c
271 1381 274 1387 277 1392 c
281 1397 286 1399 293 1399 c
569 1421 l
575 1421 l
575 1420 577 1418 582 1415 c
587 1413 589 1412 590 1411 c
593 1404 594 1399 594 1395 c
434 756 l
518 855 618 905 733 905 c
781 905 822 897 857 880 c
892 863 920 838 939 804 c
959 771 969 731 969 684 c
969 628 956 560 931 481 c
906 402 875 313 838 215 c
819 170 809 129 809 92 c
809 51 825 31 856 31 c
909 31 954 59 989 116 c
1025 173 1050 235 1065 301 c
1068 309 1073 313 1081 313 c
1106 313 l
1111 313 1116 311 1119 307 c
1122 304 1124 300 1124 295 c
1124 294 1123 292 1122 289 c
1110 240 1092 191 1068 143 c
1045 96 1015 56 979 24 c
943 -7 901 -23 852 -23 c
804 -23 763 -7 729 26 c
695 59 678 100 678 147 c
678 172 683 199 694 227 c
733 330 765 421 790 502 c
816 583 829 654 829 715 c
829 754 821 787 806 813 c
791 839 765 852 729 852 c
656 852 592 829 537 784 c
482 739 435 680 395 606 c
256 47 l
251 26 240 10 225 -3 c
210 -16 192 -23 172 -23 c
155 -23 140 -17 127 -5 c
115 6 109 20 109 37 c

ce} _d
/m{1798 0 55 -23 1743 905 sc
158 35 m
158 43 159 49 160 53 c
313 664 l
323 702 328 735 328 764 c
328 823 308 852 268 852 c
225 852 194 826 173 775 c
152 724 132 660 113 582 c
113 578 111 575 107 572 c
103 570 99 569 96 569 c
72 569 l
67 569 63 571 60 576 c
57 581 55 586 55 590 c
70 649 84 700 97 741 c
111 782 132 820 161 854 c
190 888 227 905 270 905 c
321 905 367 889 406 856 c
445 824 465 783 465 733 c
506 786 553 828 608 859 c
663 890 721 905 782 905 c
847 905 902 888 949 855 c
996 822 1020 776 1020 715 c
1062 774 1111 821 1167 854 c
1224 888 1285 905 1352 905 c
1423 905 1479 886 1522 847 c
1565 809 1587 755 1587 684 c
1587 628 1574 560 1549 481 c
1524 402 1493 313 1456 215 c
1437 168 1427 127 1427 92 c
1427 51 1443 31 1475 31 c
1528 31 1573 60 1608 117 c
1643 174 1668 236 1683 301 c
1687 309 1693 313 1700 313 c
1724 313 l
1729 313 1734 311 1737 307 c
1741 304 1743 300 1743 295 c
1743 294 1742 292 1741 289 c
1722 212 1690 140 1643 75 c
1597 10 1539 -23 1470 -23 c
1422 -23 1381 -7 1347 26 c
1313 59 1296 100 1296 147 c
1296 171 1302 198 1313 227 c
1352 330 1384 421 1409 502 c
1435 583 1448 654 1448 715 c
1448 753 1440 785 1425 812 c
1410 839 1384 852 1348 852 c
1273 852 1209 829 1154 783 c
1099 738 1052 677 1012 602 c
1009 589 1007 578 1006 571 c
874 45 l
869 26 859 10 842 -3 c
826 -16 808 -23 788 -23 c
772 -23 758 -18 745 -7 c
733 4 727 18 727 35 c
727 43 728 49 729 53 c
860 575 l
874 631 881 678 881 715 c
881 753 873 785 857 812 c
842 839 815 852 778 852 c
728 852 682 841 640 819 c
598 797 561 768 530 731 c
499 695 470 652 444 602 c
305 45 l
300 26 290 10 273 -3 c
257 -16 239 -23 219 -23 c
202 -23 188 -18 176 -7 c
164 4 158 18 158 35 c

ce} _d
/N{1645 0 76 0 1808 1399 sc
96 0 m
83 0 76 9 76 27 c
77 30 78 36 80 44 c
82 53 85 59 88 64 c
92 69 97 72 102 72 c
233 72 309 114 330 197 c
608 1317 l
570 1324 510 1327 428 1327 c
415 1327 408 1336 408 1354 c
409 1357 410 1363 412 1371 c
414 1380 417 1386 420 1391 c
424 1396 429 1399 434 1399 c
788 1399 l
798 1399 804 1395 807 1386 c
1262 303 l
1489 1210 l
1492 1225 1493 1235 1493 1241 c
1493 1298 1440 1327 1335 1327 c
1322 1327 1315 1336 1315 1354 c
1320 1371 1323 1383 1326 1389 c
1329 1396 1337 1399 1350 1399 c
1788 1399 l
1801 1399 1808 1390 1808 1372 c
1807 1369 1806 1363 1804 1354 c
1802 1346 1799 1339 1795 1334 c
1792 1329 1787 1327 1782 1327 c
1651 1327 1575 1285 1554 1202 c
1260 18 l
1255 6 1248 0 1239 0 c
1214 0 l
1205 0 1199 5 1196 14 c
674 1253 l
670 1266 l
667 1269 666 1271 666 1272 c
395 188 l
394 185 393 180 392 175 c
391 170 390 165 389 158 c
389 123 404 99 435 88 c
466 77 504 72 549 72 c
562 72 569 63 569 45 c
564 26 560 14 557 8 c
554 3 546 0 535 0 c
96 0 l

ce} _d
/t{739 0 45 -23 676 1282 sc
127 166 m
127 186 129 205 133 223 c
281 811 l
66 811 l
52 811 45 820 45 838 c
50 868 59 883 72 883 c
299 883 l
381 1217 l
386 1235 397 1250 413 1263 c
429 1276 447 1282 467 1282 c
484 1282 499 1277 510 1266 c
522 1256 528 1242 528 1225 c
528 1221 528 1218 527 1215 c
527 1213 527 1211 526 1208 c
444 883 l
655 883 l
669 883 676 874 676 856 c
675 853 674 847 672 839 c
670 831 667 824 664 819 c
661 814 656 811 649 811 c
426 811 l
279 219 l
269 180 264 147 264 119 c
264 60 284 31 324 31 c
384 31 437 59 483 115 c
530 172 565 234 590 301 c
595 309 601 313 606 313 c
631 313 l
636 313 641 311 644 307 c
647 304 649 300 649 295 c
649 292 648 290 647 289 c
617 206 573 134 516 71 c
459 8 393 -23 319 -23 c
265 -23 219 -5 182 30 c
145 65 127 111 127 166 c

ce} _d
/period{567 0 172 0 397 225 sc
172 113 m
172 144 183 170 206 192 c
229 214 255 225 285 225 c
304 225 322 220 340 210 c
358 200 372 186 382 168 c
392 150 397 132 397 113 c
397 83 386 57 364 34 c
342 11 316 0 285 0 c
255 0 229 11 206 34 c
183 57 172 83 172 113 c

ce} _d
end readonly def

/BuildGlyph {
 exch begin
 CharStrings exch
 2 copy known not {pop /.notdef} if
 true 3 1 roll get exec
 end
} _d

/BuildChar {
 1 index /Encoding get exch get
 1 index /BuildGlyph get exec
} _d

FontName currentdict end definefont pop
%!PS-Adobe-3.0 Resource-Font
%%Creator: Converted from TrueType to Type 3 by Matplotlib.
10 dict begin
/FontName /Cmr10 def
/PaintType 0 def
/FontMatrix [0.00048828125 0 0 0.00048828125 0 0] def
/FontBBox [-90 -512 2066 1536] def
/FontType 3 def
/Encoding [/a /l /o /zero /one /two /four /five /t /six /nine /equal] def
/CharStrings 13 dict dup begin
/.notdef 0 def
/a{1024 0 82 -23 1010 918 sc
82 201 m
82 282 114 348 178 399 c
242 450 319 486 408 507 c
498 528 583 539 664 539 c
664 623 l
664 662 655 700 638 737 c
621 774 596 805 563 828 c
530 852 494 864 455 864 c
364 864 295 844 248 803 c
274 803 295 793 312 773 c
329 754 338 731 338 705 c
338 678 328 654 309 635 c
290 616 267 606 240 606 c
213 606 189 616 170 635 c
151 654 141 678 141 705 c
141 777 174 830 239 865 c
304 900 376 918 455 918 c
510 918 566 906 622 882 c
678 859 724 825 759 781 c
795 737 813 686 813 627 c
813 166 l
813 139 819 115 830 92 c
841 70 859 59 883 59 c
906 59 922 70 933 93 c
944 116 950 140 950 166 c
950 297 l
1010 297 l
1010 166 l
1010 135 1002 106 986 78 c
970 51 948 29 921 12 c
894 -4 865 -12 834 -12 c
794 -12 759 3 730 34 c
701 65 685 102 682 145 c
657 94 619 53 570 22 c
521 -8 468 -23 412 -23 c
360 -23 309 -15 258 0 c
208 15 166 39 132 72 c
99 105 82 148 82 201 c

248 201 m
248 153 266 113 301 80 c
336 47 378 31 426 31 c
470 31 510 42 546 64 c
582 86 611 116 632 154 c
653 192 664 232 664 274 c
664 487 l
602 487 538 477 473 456 c
408 436 355 404 312 361 c
269 318 248 264 248 201 c

ce} _d
/l{567 0 63 0 526 1421 sc
63 0 m
63 72 l
110 72 148 76 178 83 c
208 90 223 108 223 137 c
223 1212 l
223 1249 217 1275 206 1291 c
195 1308 180 1318 159 1321 c
138 1325 106 1327 63 1327 c
63 1399 l
367 1421 l
367 137 l
367 108 382 90 412 83 c
442 76 480 72 526 72 c
526 0 l
63 0 l

ce} _d
/o{1024 0 57 -23 965 918 sc
512 -23 m
430 -23 354 -2 284 39 c
214 81 159 137 118 207 c
77 277 57 353 57 436 c
57 499 68 559 90 617 c
113 675 145 727 186 772 c
228 818 277 854 332 879 c
387 905 447 918 512 918 c
596 918 672 896 741 851 c
810 807 865 748 905 673 c
945 599 965 520 965 436 c
965 354 945 278 904 207 c
863 137 808 81 738 39 c
669 -2 593 -23 512 -23 c

512 37 m
621 37 694 77 731 156 c
768 235 786 336 786 459 c
786 528 782 584 775 629 c
768 674 752 715 727 752 c
712 775 692 794 668 811 c
645 828 620 841 593 850 c
567 859 540 864 512 864 c
469 864 429 854 390 835 c
352 816 320 788 295 752 c
270 713 253 671 246 624 c
239 578 236 523 236 459 c
236 382 243 313 256 252 c
269 191 296 140 336 99 c
377 58 435 37 512 37 c

ce} _d
/zero{1024 0 80 -45 942 1364 sc
512 -45 m
345 -45 231 24 170 161 c
110 299 80 463 80 653 c
80 772 91 883 112 988 c
134 1093 177 1181 241 1254 c
306 1327 396 1364 512 1364 c
602 1364 676 1342 733 1298 c
790 1254 834 1197 864 1127 c
894 1058 914 983 925 903 c
936 824 942 740 942 653 c
942 536 931 426 909 323 c
888 221 845 134 782 62 c
719 -9 629 -45 512 -45 c

512 8 m
588 8 645 47 682 125 c
719 203 742 289 751 384 c
760 479 764 579 764 686 c
764 789 760 883 751 970 c
742 1057 719 1135 682 1205 c
645 1276 589 1311 512 1311 c
435 1311 377 1276 340 1205 c
303 1134 280 1056 271 969 c
262 883 258 789 258 686 c
258 610 260 538 263 471 c
267 404 277 334 293 262 c
309 191 335 130 370 81 c
406 32 453 8 512 8 c

ce} _d
/one{1024 0 178 0 862 1364 sc
190 0 m
190 72 l
361 72 446 94 446 137 c
446 1212 l
375 1178 286 1161 178 1161 c
178 1233 l
345 1233 472 1277 557 1364 c
586 1364 l
591 1364 595 1362 599 1358 c
604 1355 606 1351 606 1346 c
606 137 l
606 94 691 72 862 72 c
862 0 l
190 0 l

ce} _d
/two{1024 0 102 0 920 1364 sc
102 0 m
102 55 l
102 58 103 62 106 66 c
424 418 l
472 470 511 514 541 549 c
571 584 601 625 630 671 c
659 717 682 764 699 811 c
716 859 725 910 725 963 c
725 1019 715 1072 694 1123 c
673 1174 642 1215 601 1246 c
560 1277 511 1292 453 1292 c
394 1292 340 1274 293 1238 c
246 1203 212 1157 193 1100 c
198 1101 206 1102 215 1102 c
246 1102 272 1092 293 1071 c
315 1050 326 1024 326 991 c
326 960 315 933 293 911 c
272 890 246 879 215 879 c
183 879 156 890 134 912 c
113 935 102 961 102 991 c
102 1042 112 1090 131 1135 c
150 1180 178 1220 214 1255 c
251 1290 292 1317 337 1336 c
383 1355 432 1364 483 1364 c
561 1364 634 1347 701 1314 c
768 1281 822 1235 861 1174 c
900 1114 920 1044 920 963 c
920 904 907 847 881 794 c
855 741 822 692 781 648 c
740 605 688 555 625 500 c
562 445 520 408 500 389 c
268 166 l
465 166 l
562 166 642 167 707 168 c
772 170 807 173 811 176 c
827 193 843 256 860 365 c
920 365 l
862 0 l
102 0 l

ce} _d
/four{1024 0 57 0 965 1364 sc
57 338 m
57 410 l
690 1354 l
695 1361 702 1364 711 1364 c
741 1364 l
756 1364 764 1356 764 1341 c
764 410 l
965 410 l
965 338 l
764 338 l
764 137 l
764 109 784 91 824 83 c
864 76 910 72 963 72 c
963 0 l
399 0 l
399 72 l
452 72 498 76 538 83 c
578 91 598 109 598 137 c
598 338 l
57 338 l

125 410 m
610 410 l
610 1135 l
125 410 l

ce} _d
/five{1024 0 102 -45 920 1364 sc
178 233 m
192 193 213 157 242 124 c
271 91 306 66 345 47 c
385 29 426 20 469 20 c
568 20 636 58 673 135 c
710 212 729 305 729 414 c
729 461 728 501 726 533 c
725 566 720 597 713 627 c
700 675 678 717 646 753 c
615 789 576 807 530 807 c
484 807 444 800 411 786 c
378 772 352 756 331 737 c
310 718 292 699 276 678 c
260 657 250 646 246 645 c
223 645 l
220 645 215 647 210 651 c
205 656 203 660 203 664 c
203 1348 l
203 1351 205 1355 209 1358 c
214 1362 218 1364 223 1364 c
229 1364 l
321 1320 419 1298 522 1298 c
623 1298 721 1320 815 1364 c
821 1364 l
826 1364 830 1362 834 1359 c
838 1356 840 1352 840 1348 c
840 1329 l
840 1322 839 1319 836 1319 c
789 1257 731 1209 660 1174 c
590 1139 517 1122 442 1122 c
387 1122 331 1130 274 1145 c
274 758 l
319 795 360 821 395 836 c
431 852 477 860 532 860 c
607 860 675 838 734 795 c
794 752 840 695 872 625 c
904 556 920 485 920 412 c
920 330 900 254 859 184 c
819 114 764 58 695 17 c
626 -24 550 -45 469 -45 c
402 -45 340 -28 283 7 c
227 42 183 88 150 147 c
118 206 102 268 102 334 c
102 365 112 390 132 409 c
152 428 177 438 207 438 c
237 438 262 428 282 408 c
303 389 313 364 313 334 c
313 305 303 280 282 259 c
262 239 237 229 207 229 c
202 229 197 229 191 230 c
185 231 181 232 178 233 c

ce} _d
/t{795 0 39 -23 680 1260 sc
209 246 m
209 811 l
39 811 l
39 864 l
128 864 194 906 236 989 c
278 1072 299 1163 299 1260 c
358 1260 l
358 883 l
647 883 l
647 811 l
358 811 l
358 250 l
358 193 367 144 386 101 c
405 58 440 37 489 37 c
536 37 569 59 590 104 c
611 149 621 198 621 250 c
621 371 l
680 371 l
680 246 l
680 203 672 161 656 119 c
641 78 618 44 587 17 c
556 -10 519 -23 475 -23 c
393 -23 328 1 280 50 c
233 99 209 165 209 246 c

ce} _d
/six{1024 0 86 -45 936 1364 sc
512 -45 m
427 -45 357 -23 300 22 c
243 67 199 126 168 197 c
137 269 116 344 104 423 c
92 502 86 581 86 662 c
86 770 107 878 149 987 c
191 1096 253 1186 334 1257 c
416 1328 513 1364 625 1364 c
672 1364 715 1355 755 1337 c
796 1320 827 1294 850 1259 c
873 1225 885 1184 885 1135 c
885 1107 875 1083 856 1064 c
837 1045 814 1036 786 1036 c
759 1036 736 1046 717 1065 c
698 1084 688 1108 688 1135 c
688 1162 698 1185 717 1204 c
736 1223 759 1233 786 1233 c
797 1233 l
780 1258 755 1276 723 1287 c
692 1299 659 1305 625 1305 c
584 1305 545 1296 510 1278 c
475 1260 444 1236 416 1205 c
388 1174 365 1140 346 1103 c
327 1066 313 1024 302 977 c
292 930 286 885 283 844 c
280 803 279 751 279 688 c
303 744 337 790 381 825 c
425 861 475 879 530 879 c
591 879 646 867 696 842 c
746 817 789 783 825 739 c
861 696 888 646 907 590 c
926 534 936 477 936 420 c
936 340 918 264 882 191 c
847 119 797 62 732 19 c
667 -24 594 -45 512 -45 c

512 20 m
565 20 607 32 639 56 c
671 80 694 112 709 151 c
724 191 734 231 737 271 c
741 312 743 361 743 420 c
743 497 739 563 732 618 c
725 673 705 721 672 762 c
639 804 589 825 522 825 c
467 825 421 806 385 769 c
350 732 324 684 307 627 c
291 570 283 516 283 463 c
283 445 284 431 285 422 c
285 420 285 418 284 417 c
284 416 284 414 283 412 c
283 353 289 294 301 234 c
313 174 336 123 370 82 c
404 41 451 20 512 20 c

ce} _d
/nine{1024 0 86 -45 936 1364 sc
231 86 m
268 42 333 20 426 20 c
478 20 526 38 571 73 c
616 108 651 152 676 203 c
705 261 723 323 731 388 c
739 454 743 536 743 633 c
720 578 686 532 642 497 c
599 462 549 444 492 444 c
413 444 342 465 279 508 c
217 551 169 608 136 678 c
103 749 86 824 86 903 c
86 985 105 1061 142 1132 c
179 1203 231 1260 297 1301 c
363 1343 438 1364 522 1364 c
605 1364 674 1341 729 1296 c
785 1251 828 1193 857 1122 c
886 1051 907 976 918 897 c
930 818 936 739 936 662 c
936 557 917 449 878 339 c
839 230 781 138 704 65 c
627 -8 535 -45 426 -45 c
345 -45 277 -26 221 12 c
165 50 137 107 137 184 c
137 212 146 235 165 254 c
184 273 208 283 236 283 c
263 283 286 273 305 254 c
324 235 334 212 334 184 c
334 157 324 134 305 115 c
286 96 263 86 236 86 c
231 86 l

500 498 m
556 498 602 517 637 554 c
673 592 699 639 715 695 c
731 751 739 807 739 862 c
739 901 l
739 909 l
739 1012 724 1103 694 1184 c
664 1265 607 1305 522 1305 c
468 1305 424 1293 390 1269 c
357 1246 332 1214 316 1175 c
300 1136 290 1094 285 1049 c
281 1004 279 956 279 903 c
279 826 283 760 290 705 c
297 650 317 602 350 560 c
383 519 433 498 500 498 c

ce} _d
/equal{1591 0 115 272 1477 752 sc
154 272 m
143 272 133 276 126 285 c
119 294 115 303 115 313 c
115 324 119 334 126 342 c
133 350 143 354 154 354 c
1440 354 l
1450 354 1459 350 1466 342 c
1473 334 1477 324 1477 313 c
1477 303 1473 294 1466 285 c
1459 276 1450 272 1440 272 c
154 272 l

154 670 m
143 670 133 674 126 682 c
119 690 115 700 115 711 c
115 721 119 730 126 739 c
133 748 143 752 154 752 c
1440 752 l
1450 752 1459 748 1466 739 c
1473 730 1477 721 1477 711 c
1477 700 1473 690 1466 682 c
1459 674 1450 670 1440 670 c
154 670 l

ce} _d
end readonly def

/BuildGlyph {
 exch begin
 CharStrings exch
 2 copy known not {pop /.notdef} if
 true 3 1 roll get exec
 end
} _d

/BuildChar {
 1 index /Encoding get exch get
 1 index /BuildGlyph get exec
} _d

FontName currentdict end definefont pop
%!PS-Adobe-3.0 Resource-Font
%%Creator: Converted from TrueType to Type 3 by Matplotlib.
10 dict begin
/FontName /Cmsy10 def
/PaintType 0 def
/FontMatrix [0.00048828125 0 0 0.00048828125 0 0] def
/FontBBox [-59 -1966 2300 1595] def
/FontType 3 def
/Encoding [/periodcentered /approxequal] def
/CharStrings 3 dict dup begin
/.notdef 0 def
/periodcentered{567 0 172 399 397 625 sc
172 512 m
172 531 177 550 187 567 c
197 584 211 598 228 609 c
246 620 265 625 285 625 c
304 625 323 620 340 609 c
358 598 372 584 382 567 c
392 550 397 531 397 512 c
397 481 386 455 364 432 c
343 410 316 399 285 399 c
254 399 228 410 205 432 c
183 455 172 481 172 512 c

ce} _d
/approxequal{1591 0 115 115 1477 989 sc
143 115 m
128 115 119 132 115 166 c
115 178 l
115 240 130 297 160 348 c
191 399 232 439 285 468 c
338 497 394 512 455 512 c
528 512 604 488 681 441 c
759 394 836 347 913 300 c
990 253 1064 229 1137 229 c
1207 229 1271 251 1330 294 c
1389 337 1419 393 1419 461 c
1423 495 1433 512 1448 512 c
1463 512 1473 495 1477 461 c
1477 449 l
1477 387 1462 330 1431 279 c
1400 228 1359 187 1306 158 c
1254 129 1198 115 1137 115 c
1080 115 1026 127 975 150 c
925 174 866 209 798 254 c
731 300 671 335 620 360 c
569 385 514 397 455 397 c
412 397 368 387 323 368 c
278 349 242 321 214 286 c
186 251 172 211 172 166 c
168 132 158 115 143 115 c

143 592 m
128 592 119 609 115 643 c
115 655 l
115 717 130 774 160 825 c
191 876 232 916 285 945 c
338 974 394 989 455 989 c
528 989 604 965 681 918 c
759 871 836 824 913 777 c
990 730 1064 707 1137 707 c
1207 707 1271 729 1330 772 c
1389 815 1419 871 1419 938 c
1423 972 1433 989 1448 989 c
1463 989 1473 972 1477 938 c
1477 926 l
1477 864 1462 807 1431 756 c
1400 705 1359 664 1306 635 c
1254 606 1198 592 1137 592 c
1080 592 1026 604 975 627 c
925 651 866 686 798 731 c
731 777 671 812 620 837 c
569 862 514 874 455 874 c
412 874 368 864 323 845 c
278 826 242 798 214 763 c
186 728 172 688 172 643 c
168 609 158 592 143 592 c

ce} _d
end readonly def

/BuildGlyph {
 exch begin
 CharStrings exch
 2 copy known not {pop /.notdef} if
 true 3 1 roll get exec
 end
} _d

/BuildChar {
 1 index /Encoding get exch get
 1 index /BuildGlyph get exec
} _d

FontName currentdict end definefont pop
end
%%EndProlog
mpldict begin
148.512 243.668 translate
314.977 304.663 0 0 clipbox
gsave
0 0 m
314.976853 0 l
314.976853 304.6635 l
0 304.6635 l
cl
1.000 setgray
fill
grestore
gsave
63.2 42.0125 m
307.776853 42.0125 l
307.776853 283.260375 l
63.2 283.260375 l
cl
1.000 setgray
fill
grestore
0.800 setlinewidth
1 setlinejoin
2 setlinecap
[] 0 setdash
0.690 setgray
gsave
244.577 241.248 63.2 42.013 clipbox
252.191205 42.0125 m
252.191205 283.260375 l
stroke
grestore
0 setlinecap
0.000 setgray
gsave
/o {
gsave
newpath
translate
0.8 setlinewidth
1 setlinejoin

0 setlinecap

0 0 m
0 -3.5 l

gsave
0.000 setgray
fill
grestore
stroke
grestore
} bind def
252.191 42.0125 o
grestore
gsave
241.691 26.8094 translate
0 rotate
/STIXGeneral-Regular 12.0 selectfont
0 0.890625 moveto
/zero glyphshow
5.99998 0.890625 moveto
/period glyphshow
8.99997 0.890625 moveto
/zero glyphshow
15 0.890625 moveto
/four glyphshow
grestore
2 setlinecap
0.690 setgray
gsave
244.577 241.248 63.2 42.013 clipbox
192.899847 42.0125 m
192.899847 283.260375 l
stroke
grestore
0 setlinecap
0.000 setgray
gsave
/o {
gsave
newpath
translate
0.8 setlinewidth
1 setlinejoin

0 setlinecap

0 0 m
0 -3.5 l

gsave
0.000 setgray
fill
grestore
stroke
grestore
} bind def
192.9 42.0125 o
grestore
gsave
182.4 26.8094 translate
0 rotate
/STIXGeneral-Regular 12.0 selectfont
0 0.796875 moveto
/zero glyphshow
5.99998 0.796875 moveto
/period glyphshow
8.99997 0.796875 moveto
/zero glyphshow
15 0.796875 moveto
/six glyphshow
grestore
2 setlinecap
0.690 setgray
gsave
244.577 241.248 63.2 42.013 clipbox
133.608488 42.0125 m
133.608488 283.260375 l
stroke
grestore
0 setlinecap
0.000 setgray
gsave
/o {
gsave
newpath
translate
0.8 setlinewidth
1 setlinejoin

0 setlinecap

0 0 m
0 -3.5 l

gsave
0.000 setgray
fill
grestore
stroke
grestore
} bind def
133.608 42.0125 o
grestore
gsave
123.108 26.8094 translate
0 rotate
/STIXGeneral-Regular 12.0 selectfont
0 0.890625 moveto
/zero glyphshow
5.99998 0.890625 moveto
/period glyphshow
8.99997 0.890625 moveto
/zero glyphshow
15 0.890625 moveto
/eight glyphshow
grestore
2 setlinecap
0.690 setgray
gsave
244.577 241.248 63.2 42.013 clipbox
74.31713 42.0125 m
74.31713 283.260375 l
stroke
grestore
0 setlinecap
0.000 setgray
gsave
/o {
gsave
newpath
translate
0.8 setlinewidth
1 setlinejoin

0 setlinecap

0 0 m
0 -3.5 l

gsave
0.000 setgray
fill
grestore
stroke
grestore
} bind def
74.3171 42.0125 o
grestore
gsave
63.8171 26.8094 translate
0 rotate
/STIXGeneral-Regular 12.0 selectfont
0 0.890625 moveto
/zero glyphshow
5.99998 0.890625 moveto
/period glyphshow
8.99997 0.890625 moveto
/one glyphshow
15 0.890625 moveto
/zero glyphshow
grestore
gsave
123.488 10.2313 translate
0 rotate
/STIXGeneral-Regular 14.0 selectfont
0 0.28125 moveto
/i glyphshow
3.892 0.28125 moveto
/n glyphshow
10.892 0.28125 moveto
/t glyphshow
14.784 0.28125 moveto
/e glyphshow
21 0.28125 moveto
/r glyphshow
25.662 0.28125 moveto
/n glyphshow
32.662 0.28125 moveto
/o glyphshow
39.662 0.28125 moveto
/d glyphshow
46.662 0.28125 moveto
/a glyphshow
52.878 0.28125 moveto
/l glyphshow
56.77 0.28125 moveto
/space glyphshow
60.27 0.28125 moveto
/d glyphshow
67.27 0.28125 moveto
/i glyphshow
71.162 0.28125 moveto
/s glyphshow
76.608 0.28125 moveto
/t glyphshow
80.5 0.28125 moveto
/a glyphshow
86.7159 0.28125 moveto
/n glyphshow
93.7159 0.28125 moveto
/c glyphshow
99.9319 0.28125 moveto
/e glyphshow
106.148 0.28125 moveto
/space glyphshow
/Cmmi10 14.0 selectfont
109.648 0.28125 moveto
/h glyphshow
/Cmmi10 9.799999999999999 selectfont
117.714 -2.09962 moveto
/e glyphshow
grestore
2 setlinecap
0.690 setgray
gsave
244.577 241.248 63.2 42.013 clipbox
63.2 83.840409 m
307.776853 83.840409 l
stroke
grestore
0 setlinecap
0.000 setgray
gsave
/o {
gsave
newpath
translate
0.8 setlinewidth
1 setlinejoin

0 setlinecap

-0 0 m
-3.5 0 l

gsave
0.000 setgray
fill
grestore
stroke
grestore
} bind def
63.2 83.8404 o
grestore
gsave
24.2 79.1451 translate
0 rotate
/Cmr10 12.0 selectfont
0 0.808312 moveto
/four glyphshow
/Cmsy10 12.0 selectfont
8.10703 0.808312 moveto
/periodcentered glyphshow
/Cmr10 12.0 selectfont
13.5363 0.808312 moveto
/one glyphshow
19.5363 0.808312 moveto
/zero glyphshow
/Cmr10 8.399999999999999 selectfont
26.072 5.4 moveto
/four glyphshow
grestore
2 setlinecap
0.690 setgray
gsave
244.577 241.248 63.2 42.013 clipbox
63.2 146.121119 m
307.776853 146.121119 l
stroke
grestore
0 setlinecap
0.000 setgray
gsave
/o {
gsave
newpath
translate
0.8 setlinewidth
1 setlinejoin

0 setlinecap

-0 0 m
-3.5 0 l

gsave
0.000 setgray
fill
grestore
stroke
grestore
} bind def
63.2 146.121 o
grestore
gsave
38.2 141.426 translate
0 rotate
/Cmr10 12.0 selectfont
0 0.808312 moveto
/one glyphshow
6 0.808312 moveto
/zero glyphshow
/Cmr10 8.399999999999999 selectfont
12.5357 5.4 moveto
/five glyphshow
grestore
2 setlinecap
0.690 setgray
gsave
244.577 241.248 63.2 42.013 clipbox
63.2 240.348196 m
307.776853 240.348196 l
stroke
grestore
0 setlinecap
0.000 setgray
gsave
/o {
gsave
newpath
translate
0.8 setlinewidth
1 setlinejoin

0 setlinecap

-0 0 m
-3.5 0 l

gsave
0.000 setgray
fill
grestore
stroke
grestore
} bind def
63.2 240.348 o
grestore
gsave
24.2 235.653 translate
0 rotate
/Cmr10 12.0 selectfont
0 0.808312 moveto
/four glyphshow
/Cmsy10 12.0 selectfont
8.10703 0.808312 moveto
/periodcentered glyphshow
/Cmr10 12.0 selectfont
13.5363 0.808312 moveto
/one glyphshow
19.5363 0.808312 moveto
/zero glyphshow
/Cmr10 8.399999999999999 selectfont
26.072 5.4 moveto
/five glyphshow
grestore
0.600 setlinewidth
gsave
/o {
gsave
newpath
translate
0.6 setlinewidth
1 setlinejoin

0 setlinecap

-0 0 m
-2 0 l

gsave
0.000 setgray
fill
grestore
stroke
grestore
} bind def
63.2 64.2865 o
grestore
gsave
/o {
gsave
newpath
translate
0.6 setlinewidth
1 setlinejoin

0 setlinecap

-0 0 m
-2 0 l

gsave
0.000 setgray
fill
grestore
stroke
grestore
} bind def
63.2 99.0076 o
grestore
gsave
/o {
gsave
newpath
translate
0.6 setlinewidth
1 setlinejoin

0 setlinecap

-0 0 m
-2 0 l

gsave
0.000 setgray
fill
grestore
stroke
grestore
} bind def
63.2 111.4 o
grestore
gsave
/o {
gsave
newpath
translate
0.6 setlinewidth
1 setlinejoin

0 setlinecap

-0 0 m
-2 0 l

gsave
0.000 setgray
fill
grestore
stroke
grestore
} bind def
63.2 121.878 o
grestore
gsave
/o {
gsave
newpath
translate
0.6 setlinewidth
1 setlinejoin

0 setlinecap

-0 0 m
-2 0 l

gsave
0.000 setgray
fill
grestore
stroke
grestore
} bind def
63.2 130.954 o
grestore
gsave
/o {
gsave
newpath
translate
0.6 setlinewidth
1 setlinejoin

0 setlinecap

-0 0 m
-2 0 l

gsave
0.000 setgray
fill
grestore
stroke
grestore
} bind def
63.2 138.96 o
grestore
gsave
/o {
gsave
newpath
translate
0.6 setlinewidth
1 setlinejoin

0 setlinecap

-0 0 m
-2 0 l

gsave
0.000 setgray
fill
grestore
stroke
grestore
} bind def
63.2 193.235 o
grestore
gsave
/o {
gsave
newpath
translate
0.6 setlinewidth
1 setlinejoin

0 setlinecap

-0 0 m
-2 0 l

gsave
0.000 setgray
fill
grestore
stroke
grestore
} bind def
63.2 220.794 o
grestore
gsave
/o {
gsave
newpath
translate
0.6 setlinewidth
1 setlinejoin

0 setlinecap

-0 0 m
-2 0 l

gsave
0.000 setgray
fill
grestore
stroke
grestore
} bind def
63.2 255.515 o
grestore
gsave
/o {
gsave
newpath
translate
0.6 setlinewidth
1 setlinejoin

0 setlinecap

-0 0 m
-2 0 l

gsave
0.000 setgray
fill
grestore
stroke
grestore
} bind def
63.2 267.908 o
grestore
gsave
/o {
gsave
newpath
translate
0.6 setlinewidth
1 setlinejoin

0 setlinecap

-0 0 m
-2 0 l

gsave
0.000 setgray
fill
grestore
stroke
grestore
} bind def
63.2 278.386 o
grestore
gsave
17.1688 146.136 translate
90 rotate
/Cmmi10 14.0 selectfont
0 0.4375 moveto
/N glyphshow
/Cmr10 9.799999999999999 selectfont
11.2451 -1.94337 moveto
/t glyphshow
15.0493 -1.94337 moveto
/o glyphshow
19.9493 -1.94337 moveto
/t glyphshow
23.7535 -1.94337 moveto
/a glyphshow
28.6535 -1.94337 moveto
/l glyphshow
grestore
1.500 setlinewidth
2 setlinecap
gsave
244.577 241.248 63.2 42.013 clipbox
296.659724 272.294562 m
254.970487 211.625876 l
222.545526 178.067486 l
139.167053 117.398799 l
74.31713 83.840409 l
stroke
grestore
1.000 setlinewidth
0 setlinecap
gsave
244.577 241.248 63.2 42.013 clipbox
/o {
gsave
newpath
translate
1.0 setlinewidth
1 setlinejoin

0 setlinecap

-3 -3 m
3 3 l
-3 3 m
3 -3 l

gsave
0.000 setgray
fill
grestore
stroke
grestore
} bind def
296.66 272.295 o
254.97 211.626 o
222.546 178.067 o
139.167 117.399 o
74.3171 83.8404 o
grestore
1.500 setlinewidth
2 setlinecap
0.122 0.467 0.706 setrgbcolor
gsave
244.577 241.248 63.2 42.013 clipbox
287.725798 128.504171 m
280.373193 122.384668 l
272.369631 117.659659 l
263.657479 112.112273 l
254.174003 106.151173 l
243.850915 101.285416 l
232.613879 96.348907 l
220.381981 90.372732 l
207.067141 85.770299 l
192.573481 81.283088 l
176.796636 76.237655 l
159.622999 70.935542 l
140.928907 66.48456 l
120.579747 62.199844 l
98.428989 57.172934 l
74.31713 52.978313 l
stroke
grestore
1.000 setlinewidth
0 setlinecap
gsave
244.577 241.248 63.2 42.013 clipbox
/o {
gsave
newpath
translate
1.0 setlinewidth
1 setlinejoin

0 setlinecap

0 -3 m
0.795609 -3 1.55874 -2.683901 2.12132 -2.12132 c
2.683901 -1.55874 3 -0.795609 3 0 c
3 0.795609 2.683901 1.55874 2.12132 2.12132 c
1.55874 2.683901 0.795609 3 0 3 c
-0.795609 3 -1.55874 2.683901 -2.12132 2.12132 c
-2.683901 1.55874 -3 0.795609 -3 0 c
-3 -0.795609 -2.683901 -1.55874 -2.12132 -2.12132 c
-1.55874 -2.683901 -0.795609 -3 0 -3 c
cl

gsave
grestore
stroke
grestore
} bind def
287.726 128.504 o
280.373 122.385 o
272.37 117.66 o
263.657 112.112 o
254.174 106.151 o
243.851 101.285 o
232.614 96.3489 o
220.382 90.3727 o
207.067 85.7703 o
192.573 81.2831 o
176.797 76.2377 o
159.623 70.9355 o
140.929 66.4846 o
120.58 62.1998 o
98.429 57.1729 o
74.3171 52.9783 o
grestore
1.500 setlinewidth
2 setlinecap
1.000 0.498 0.055 setrgbcolor
gsave
244.577 241.248 63.2 42.013 clipbox
287.725798 128.399273 m
280.373193 125.559271 l
272.369631 116.938827 l
263.657479 112.13469 l
254.174003 106.877877 l
243.850915 106.033588 l
232.613879 95.651244 l
220.381981 90.691499 l
207.067141 86.278766 l
192.573481 80.95234 l
176.796636 76.452058 l
159.622999 71.71385 l
140.928907 67.052513 l
120.579747 62.311895 l
98.428989 57.661725 l
74.31713 53.248032 l
stroke
grestore
1.000 setlinewidth
0 setlinecap
gsave
244.577 241.248 63.2 42.013 clipbox
/o {
gsave
newpath
translate
1.0 setlinewidth
1 setlinejoin

0 setlinecap

0 -1.5 m
0.397805 -1.5 0.77937 -1.341951 1.06066 -1.06066 c
1.341951 -0.77937 1.5 -0.397805 1.5 0 c
1.5 0.397805 1.341951 0.77937 1.06066 1.06066 c
0.77937 1.341951 0.397805 1.5 0 1.5 c
-0.397805 1.5 -0.77937 1.341951 -1.06066 1.06066 c
-1.341951 0.77937 -1.5 0.397805 -1.5 0 c
-1.5 -0.397805 -1.341951 -0.77937 -1.06066 -1.06066 c
-0.77937 -1.341951 -0.397805 -1.5 0 -1.5 c
cl

gsave
1.000 0.498 0.055 setrgbcolor
fill
grestore
stroke
grestore
} bind def
287.726 128.399 o
280.373 125.559 o
272.37 116.939 o
263.657 112.135 o
254.174 106.878 o
243.851 106.034 o
232.614 95.6512 o
220.382 90.6915 o
207.067 86.2788 o
192.573 80.9523 o
176.797 76.4521 o
159.623 71.7139 o
140.929 67.0525 o
120.58 62.3119 o
98.429 57.6617 o
74.3171 53.248 o
grestore
0.800 setlinewidth
0 setlinejoin
2 setlinecap
0.000 setgray
gsave
63.2 42.0125 m
63.2 283.260375 l
stroke
grestore
gsave
307.776853 42.0125 m
307.776853 283.260375 l
stroke
grestore
gsave
63.2 42.0125 m
307.776853 42.0125 l
stroke
grestore
gsave
63.2 283.260375 m
307.776853 283.260375 l
stroke
grestore
gsave
165.488 289.26 translate
0 rotate
/Cmmi10 12.0 selectfont
0 0 moveto
/t glyphshow
/Cmsy10 12.0 selectfont
6.43711 0 moveto
/approxequal glyphshow
/Cmr10 12.0 selectfont
17.8664 0 moveto
/nine glyphshow
/Cmmi10 12.0 selectfont
23.8664 0 moveto
/period glyphshow
/Cmr10 12.0 selectfont
27.1887 0 moveto
/six glyphshow
33.1887 0 moveto
/zero glyphshow
grestore
1.000 setlinewidth
0 setlinecap
0.800 setgray
gsave
70.2 232.74475 m
151.2 232.74475 l
152.533333 232.74475 153.2 233.411417 153.2 234.74475 c
153.2 276.260375 l
153.2 277.593708 152.533333 278.260375 151.2 278.260375 c
70.2 278.260375 l
68.866667 278.260375 68.2 277.593708 68.2 276.260375 c
68.2 234.74475 l
68.2 233.411417 68.866667 232.74475 70.2 232.74475 c
cl
gsave
1.000 setgray
fill
grestore
stroke
grestore
1.500 setlinewidth
1 setlinejoin
2 setlinecap
0.000 setgray
gsave
72.2 270.760375 m
82.2 270.760375 l
92.2 270.760375 l
stroke
grestore
1.000 setlinewidth
0 setlinecap
gsave
/o {
gsave
newpath
translate
1.0 setlinewidth
1 setlinejoin

0 setlinecap

-3 -3 m
3 3 l
-3 3 m
3 -3 l

gsave
0.000 setgray
fill
grestore
stroke
grestore
} bind def
82.2 270.76 o
grestore
/STIXGeneral-Regular 10.000 selectfont
gsave

100.2 267.26 translate
0 rotate
0 0 m /P glyphshow
5.56999 0 m /F glyphshow
11.13 0 m /I glyphshow
14.46 0 m /C glyphshow
grestore
1.500 setlinewidth
2 setlinecap
0.122 0.467 0.706 setrgbcolor
gsave
72.2 256.5885 m
82.2 256.5885 l
92.2 256.5885 l
stroke
grestore
1.000 setlinewidth
0 setlinecap
gsave
/o {
gsave
newpath
translate
1.0 setlinewidth
1 setlinejoin

0 setlinecap

0 -3 m
0.795609 -3 1.55874 -2.683901 2.12132 -2.12132 c
2.683901 -1.55874 3 -0.795609 3 0 c
3 0.795609 2.683901 1.55874 2.12132 2.12132 c
1.55874 2.683901 0.795609 3 0 3 c
-0.795609 3 -1.55874 2.683901 -2.12132 2.12132 c
-2.683901 1.55874 -3 0.795609 -3 0 c
-3 -0.795609 -2.683901 -1.55874 -2.12132 -2.12132 c
-1.55874 -2.683901 -0.795609 -3 0 -3 c
cl

gsave
grestore
stroke
grestore
} bind def
82.2 256.589 o
grestore
0.000 setgray
gsave
100.2 253.089 translate
0 rotate
/STIXGeneral-Regular 10.0 selectfont
0 0.34375 moveto
/M glyphshow
8.88998 0.34375 moveto
/I glyphshow
12.22 0.34375 moveto
/T glyphshow
18.33 0.34375 moveto
/comma glyphshow
20.8299 0.34375 moveto
/space glyphshow
/Cmmi10 10.0 selectfont
23.3299 0.34375 moveto
/m glyphshow
/Cmr10 10.0 selectfont
33.8651 0.34375 moveto
/equal glyphshow
43.3895 0.34375 moveto
/two glyphshow
grestore
1.500 setlinewidth
2 setlinecap
1.000 0.498 0.055 setrgbcolor
gsave
72.2 242.416625 m
82.2 242.416625 l
92.2 242.416625 l
stroke
grestore
1.000 setlinewidth
0 setlinecap
gsave
/o {
gsave
newpath
translate
1.0 setlinewidth
1 setlinejoin

0 setlinecap

0 -1.5 m
0.397805 -1.5 0.77937 -1.341951 1.06066 -1.06066 c
1.341951 -0.77937 1.5 -0.397805 1.5 0 c
1.5 0.397805 1.341951 0.77937 1.06066 1.06066 c
0.77937 1.341951 0.397805 1.5 0 1.5 c
-0.397805 1.5 -0.77937 1.341951 -1.06066 1.06066 c
-1.341951 0.77937 -1.5 0.397805 -1.5 0 c
-1.5 -0.397805 -1.341951 -0.77937 -1.06066 -1.06066 c
-0.77937 -1.341951 -0.397805 -1.5 0 -1.5 c
cl

gsave
1.000 0.498 0.055 setrgbcolor
fill
grestore
stroke
grestore
} bind def
82.2 242.417 o
grestore
0.000 setgray
gsave
100.2 238.917 translate
0 rotate
/STIXGeneral-Regular 10.0 selectfont
0 0.34375 moveto
/M glyphshow
8.88998 0.34375 moveto
/I glyphshow
12.22 0.34375 moveto
/T glyphshow
18.33 0.34375 moveto
/comma glyphshow
20.8299 0.34375 moveto
/space glyphshow
/Cmmi10 10.0 selectfont
23.3299 0.34375 moveto
/m glyphshow
/Cmr10 10.0 selectfont
33.8651 0.34375 moveto
/equal glyphshow
43.3895 0.34375 moveto
/four glyphshow
grestore

end
showpage
