%!PS-Adobe-3.0 EPSF-3.0
%%Title: computational_times.eps
%%Creator: Matplotlib v3.5.3, https://matplotlib.org/
%%CreationDate: Tue Jun 27 09:53:02 2023
%%Orientation: portrait
%%BoundingBox: 148 222 464 570
%%HiResBoundingBox: 148.026870 222.222500 463.973130 569.777500
%%EndComments
%%BeginProlog
/mpldict 12 dict def
mpldict begin
/_d { bind def } bind def
/m { moveto } _d
/l { lineto } _d
/r { rlineto } _d
/c { curveto } _d
/cl { closepath } _d
/ce { closepath eofill } _d
/box {
      m
      1 index 0 r
      0 exch r
      neg 0 r
      cl
    } _d
/clipbox {
      box
      clip
      newpath
    } _d
/sc { setcachedevice } _d
%!PS-Adobe-3.0 Resource-Font
%%Creator: Converted from TrueType to Type 3 by Matplotlib.
10 dict begin
/FontName /STIXGeneral-Regular def
/PaintType 0 def
/FontMatrix [0.001 0 0 0.001 0 0] def
/FontBBox [-970 -443 2000 1023] def
/FontType 3 def
/Encoding [/space /period /zero /one /two /three /four /five /six /seven /eight /bracketleft /bracketright /a /c /d /e /h /i /l /m /n /o /p /r /s /t /u /v] def
/CharStrings 30 dict dup begin
/.notdef 0 def
/space{250 0 0 0 0 0 sc
ce} _d
/period{250 0 70 -11 181 100 sc
181 43 m
181 28 175 16 164 5 c
153 -6 140 -11 125 -11 c
110 -11 97 -6 86 5 c
75 16 70 29 70 44 c
70 59 75 72 86 83 c
97 94 111 100 126 100 c
141 100 153 94 164 83 c
175 72 181 58 181 43 c

ce} _d
/zero{500 0 24 -14 476 676 sc
476 330 m
476 285 472 243 463 203 c
454 164 441 127 424 94 c
407 61 384 34 354 15 c
324 -4 289 -14 250 -14 c
209 -14 174 -4 143 17 c
112 38 89 65 72 100 c
55 135 43 172 35 211 c
28 250 24 292 24 336 c
24 398 32 454 47 503 c
62 553 88 594 123 627 c
159 660 203 676 254 676 c
319 676 373 644 414 580 c
455 516 476 433 476 330 c

380 325 m
380 430 369 511 346 566 c
324 622 291 650 248 650 c
207 650 175 622 153 566 c
131 510 120 431 120 329 c
120 226 131 148 153 93 c
175 39 207 12 250 12 c
292 12 324 39 346 93 c
369 148 380 225 380 325 c

ce} _d
/one{500 0 111 0 394 676 sc
394 0 m
118 0 l
118 15 l
155 17 180 24 193 35 c
206 47 213 67 213 95 c
213 544 l
213 577 203 593 183 593 c
174 593 159 589 138 581 c
111 571 l
111 585 l
290 676 l
299 673 l
299 76 l
299 54 306 38 319 29 c
332 20 357 15 394 15 c
394 0 l

ce} _d
/two{500 0 29 0 474 676 sc
474 137 m
420 0 l
29 0 l
29 12 l
207 201 l
254 250 287 294 307 335 c
327 376 337 418 337 461 c
337 506 325 540 300 565 c
275 590 241 602 198 602 c
162 602 133 593 112 574 c
91 555 71 521 51 472 c
30 477 l
41 539 64 588 98 623 c
133 658 179 676 238 676 c
293 676 338 659 372 626 c
406 593 423 551 423 500 c
423 425 380 342 295 252 c
130 76 l
364 76 l
386 76 403 80 416 89 c
429 98 444 116 460 143 c
474 137 l

ce} _d
/three{500 0 41 -14 431 676 sc
61 510 m
45 514 l
60 564 84 603 117 632 c
150 661 191 676 241 676 c
288 676 325 663 354 638 c
383 613 397 580 397 539 c
397 484 366 438 304 401 c
341 385 368 367 387 348 c
416 315 431 272 431 219 c
431 166 416 119 385 79 c
362 48 330 25 287 9 c
245 -6 200 -14 153 -14 c
78 -14 41 5 41 43 c
41 54 45 62 53 69 c
61 76 71 79 82 79 c
99 79 119 70 143 53 c
172 32 201 22 229 22 c
266 22 296 37 321 66 c
346 96 359 132 359 175 c
359 252 324 300 255 320 c
234 327 200 330 153 330 c
153 344 l
190 357 218 369 237 380 c
291 411 318 455 318 514 c
318 547 308 573 289 590 c
270 607 244 616 210 616 c
150 616 100 581 61 510 c

ce} _d
/four{500 0 12 0 473 676 sc
473 167 m
370 167 l
370 0 l
292 0 l
292 167 l
12 167 l
12 231 l
326 676 l
370 676 l
370 231 l
473 231 l
473 167 l

292 231 m
292 574 l
52 231 l
292 231 l

ce} _d
/five{500 0 31 -14 438 688 sc
438 681 m
402 596 l
398 587 389 583 375 583 c
181 583 l
141 498 l
214 484 267 469 300 452 c
333 436 363 409 391 370 c
414 338 426 296 426 243 c
426 195 418 155 402 122 c
387 89 362 60 328 35 c
283 2 226 -14 158 -14 c
120 -14 89 -8 66 3 c
43 14 31 29 31 48 c
31 73 46 86 76 86 c
100 86 125 76 150 55 c
176 34 200 23 221 23 c
256 23 287 40 314 75 c
342 110 356 149 356 192 c
356 256 334 306 289 342 c
231 389 160 412 76 412 c
68 412 64 415 64 420 c
65 425 l
174 662 l
381 662 l
392 662 401 664 407 667 c
414 670 421 677 429 688 c
438 681 l

ce} _d
/six{500 0 34 -14 468 684 sc
446 684 m
448 668 l
369 655 304 623 251 572 c
198 521 165 458 152 383 c
191 413 233 428 279 428 c
338 428 384 409 417 372 c
451 335 468 284 468 219 c
468 154 451 100 417 59 c
378 10 325 -14 258 -14 c
177 -14 118 20 81 87 c
50 144 34 208 34 279 c
34 388 70 480 143 555 c
184 598 227 628 270 645 c
314 663 373 676 446 684 c

378 188 m
378 317 333 382 243 382 c
210 382 182 373 160 355 c
138 338 127 308 127 266 c
127 188 139 126 163 81 c
188 36 223 14 269 14 c
304 14 331 30 350 61 c
369 93 378 135 378 188 c

ce} _d
/seven{500 0 20 -8 449 662 sc
449 646 m
237 -8 l
172 -8 l
370 588 l
155 588 l
126 588 105 583 91 573 c
77 563 59 541 38 506 c
20 515 l
80 662 l
449 662 l
449 646 l

ce} _d
/eight{500 0 56 -14 445 676 sc
445 155 m
445 104 427 63 391 32 c
356 1 308 -14 248 -14 c
192 -14 146 1 110 32 c
74 63 56 102 56 149 c
56 184 65 214 82 239 c
99 264 134 295 186 332 c
136 373 103 407 86 432 c
70 457 62 487 62 520 c
62 567 80 605 116 633 c
153 662 199 676 256 676 c
305 676 345 662 376 634 c
408 607 424 573 424 533 c
424 496 414 467 395 445 c
376 423 341 398 290 371 c
350 331 391 295 412 264 c
434 233 445 196 445 155 c

355 533 m
355 568 345 595 326 616 c
307 637 280 648 246 648 c
212 648 185 639 165 621 c
146 604 136 580 136 549 c
136 518 146 490 165 465 c
185 440 217 415 261 389 c
295 409 319 430 333 452 c
348 475 355 502 355 533 c

271 272 m
212 312 l
183 288 162 264 150 241 c
138 218 132 191 132 158 c
132 113 143 77 166 52 c
189 27 220 14 259 14 c
292 14 318 24 338 44 c
359 65 369 91 369 124 c
369 154 361 180 346 203 c
331 226 306 249 271 272 c

ce} _d
/bracketleft{333 0 88 -156 299 662 sc
299 -156 m
88 -156 l
88 662 l
299 662 l
299 637 l
216 637 l
199 637 186 633 177 626 c
168 619 164 606 164 589 c
164 -77 l
164 -113 181 -131 216 -131 c
299 -131 l
299 -156 l

ce} _d
/bracketright{333 0 34 -156 245 662 sc
245 -156 m
34 -156 l
34 -131 l
122 -131 l
139 -131 151 -127 158 -120 c
165 -113 169 -101 169 -85 c
169 583 l
169 619 152 637 118 637 c
34 637 l
34 662 l
245 662 l
245 -156 l

ce} _d
/a{444 0 37 -10 442 460 sc
442 66 m
442 38 l
417 6 387 -10 352 -10 c
314 -10 293 14 288 63 c
287 63 l
244 14 196 -10 142 -10 c
111 -10 85 -1 66 17 c
47 36 37 61 37 94 c
37 141 60 180 107 211 c
139 232 199 259 287 292 c
287 346 l
287 376 280 398 265 413 c
251 428 232 436 209 436 c
189 436 172 431 159 421 c
146 412 139 400 139 387 c
139 381 140 374 142 367 c
144 360 145 352 145 345 c
145 335 140 326 131 317 c
122 308 112 304 99 304 c
88 304 78 308 69 317 c
60 326 56 337 56 350 c
56 382 73 409 107 430 c
138 450 177 460 222 460 c
276 460 315 445 340 415 c
352 401 360 387 363 372 c
366 358 368 335 368 304 c
368 113 l
368 69 378 47 399 47 c
412 47 427 53 442 66 c

287 127 m
287 268 l
226 247 183 225 159 202 c
136 181 125 156 125 125 c
125 100 131 80 144 67 c
157 54 173 48 194 48 c
216 48 235 53 252 64 c
266 74 275 83 280 92 c
285 101 287 112 287 127 c

ce} _d
/c{444 0 25 -10 412 460 sc
398 156 m
412 147 l
383 91 356 53 330 32 c
296 4 258 -10 215 -10 c
160 -10 114 11 78 52 c
43 94 25 147 25 212 c
25 297 53 362 109 409 c
150 443 195 460 244 460 c
286 460 322 450 352 429 c
383 409 398 385 398 357 c
398 346 393 336 384 327 c
375 319 364 315 351 315 c
328 315 312 330 303 361 c
297 383 l
292 402 285 414 277 421 c
269 428 256 431 238 431 c
197 431 164 415 139 383 c
114 351 102 309 102 257 c
102 200 116 153 145 116 c
174 80 211 62 257 62 c
286 62 310 69 331 82 c
352 96 374 121 398 156 c

ce} _d
/d{500 0 27 -10 491 683 sc
491 42 m
344 -10 l
340 -7 l
340 57 l
308 12 265 -10 212 -10 c
157 -10 112 10 78 49 c
44 89 27 141 27 205 c
27 276 47 336 88 385 c
129 435 178 460 235 460 c
271 460 306 446 340 417 c
340 573 l
340 594 337 607 331 614 c
325 621 313 624 294 624 c
285 624 277 624 272 623 c
272 639 l
333 655 382 670 419 683 c
424 681 l
424 114 l
424 91 427 75 432 68 c
438 61 450 57 468 57 c
472 57 480 57 491 58 c
491 42 l

340 102 m
340 332 l
340 359 330 382 309 402 c
289 422 265 432 238 432 c
200 432 170 415 147 381 c
124 347 113 302 113 245 c
113 184 125 134 150 97 c
175 60 209 42 251 42 c
282 42 307 53 325 74 c
335 85 340 95 340 102 c

ce} _d
/e{444 0 25 -10 424 460 sc
408 164 m
424 157 l
384 46 314 -10 215 -10 c
156 -10 110 10 76 51 c
42 92 25 148 25 217 c
25 288 44 347 82 392 c
120 437 170 460 232 460 c
292 460 338 437 371 391 c
390 364 402 326 405 277 c
97 277 l
100 235 104 203 109 181 c
115 159 126 137 143 114 c
171 77 208 59 254 59 c
287 59 314 67 336 83 c
359 99 383 126 408 164 c

99 309 m
303 309 l
297 351 287 381 273 398 c
260 415 237 424 205 424 c
177 424 154 414 135 394 c
116 375 104 346 99 309 c

ce} _d
/h{500 0 9 0 487 683 sc
487 0 m
275 0 l
275 15 l
304 18 323 25 331 35 c
339 45 343 67 343 102 c
343 300 l
343 371 318 406 269 406 c
249 406 231 401 214 392 c
197 383 178 366 157 343 c
157 102 l
157 67 161 45 169 35 c
177 25 196 18 225 15 c
225 0 l
9 0 l
9 15 l
38 19 55 26 62 35 c
69 44 73 67 73 102 c
73 573 l
73 594 70 608 63 614 c
57 621 43 624 22 624 c
16 624 12 624 10 623 c
10 639 l
37 647 l
88 662 127 674 152 683 c
157 680 l
157 376 l
180 406 203 427 226 440 c
249 453 275 460 304 460 c
386 460 427 407 427 301 c
427 102 l
427 67 430 45 436 36 c
443 27 460 20 487 15 c
487 0 l

ce} _d
/i{278 0 16 0 253 683 sc
180 632 m
180 617 175 605 165 595 c
155 586 143 581 128 581 c
114 581 102 586 92 595 c
83 605 78 617 78 632 c
78 646 83 658 93 668 c
103 678 115 683 129 683 c
144 683 156 678 165 668 c
175 658 180 646 180 632 c

253 0 m
16 0 l
16 15 l
51 17 72 23 81 33 c
90 43 95 67 95 104 c
95 331 l
95 354 93 371 88 380 c
83 389 75 394 62 394 c
46 394 32 392 20 389 c
20 405 l
175 460 l
179 456 l
179 105 l
179 68 183 44 191 34 c
200 24 220 18 253 15 c
253 0 l

ce} _d
/l{278 0 19 0 257 683 sc
257 0 m
21 0 l
21 15 l
52 18 73 24 83 34 c
93 45 98 64 98 92 c
98 561 l
98 585 95 602 89 611 c
83 620 72 625 56 625 c
42 625 30 624 19 623 c
19 639 l
82 654 135 669 177 683 c
182 679 l
182 87 l
182 59 187 40 196 31 c
205 22 226 17 257 15 c
257 0 l

ce} _d
/m{778 0 16 0 775 460 sc
775 0 m
557 0 l
557 15 l
585 18 603 23 610 32 c
618 41 622 61 622 90 c
622 296 l
622 336 616 365 604 382 c
593 399 573 408 545 408 c
522 408 502 403 485 394 c
469 385 453 369 438 347 c
438 95 l
438 63 443 42 452 31 c
462 21 481 16 510 15 c
510 0 l
286 0 l
286 15 l
315 17 334 22 342 29 c
350 37 354 56 354 86 c
354 297 l
354 371 332 408 289 408 c
270 408 250 404 229 395 c
208 387 193 377 183 365 c
174 355 170 349 170 348 c
170 70 l
170 49 175 34 184 27 c
193 20 211 16 238 15 c
238 0 l
16 0 l
16 15 l
44 16 63 21 72 30 c
81 40 86 59 86 88 c
86 336 l
86 361 83 378 78 387 c
73 397 64 402 51 402 c
41 402 30 401 19 398 c
19 415 l
64 428 111 443 158 460 c
166 457 l
166 383 l
168 383 l
198 414 224 435 247 445 c
270 455 295 460 321 460 c
374 460 409 432 427 376 c
479 432 533 460 590 460 c
667 460 706 400 706 280 c
706 77 l
706 55 709 40 716 31 c
723 23 734 18 749 17 c
775 15 l
775 0 l

ce} _d
/n{500 0 16 0 485 460 sc
485 0 m
277 0 l
278 15 l
303 17 319 24 327 36 c
336 49 340 72 340 105 c
340 304 l
340 371 316 405 267 405 c
250 405 235 401 220 393 c
205 385 187 370 164 348 c
164 72 l
164 52 168 38 177 30 c
186 22 204 17 229 15 c
229 0 l
18 0 l
18 15 l
43 17 60 23 68 33 c
76 44 80 64 80 94 c
80 337 l
80 362 78 379 73 388 c
68 397 59 402 45 402 c
32 402 22 401 16 398 c
16 415 l
63 428 108 443 153 460 c
161 457 l
161 379 l
162 379 l
209 433 257 460 306 460 c
344 460 373 447 393 420 c
414 393 424 355 424 306 c
424 85 l
424 58 428 41 436 32 c
444 23 460 18 485 15 c
485 0 l

ce} _d
/o{500 0 29 -10 470 460 sc
470 231 m
470 161 449 103 407 58 c
366 13 312 -10 245 -10 c
184 -10 132 12 91 57 c
50 102 29 159 29 228 c
29 297 50 353 91 396 c
132 439 187 460 254 460 c
316 460 367 439 408 396 c
449 354 470 299 470 231 c

380 204 m
380 280 363 339 330 382 c
303 415 272 432 235 432 c
200 432 172 418 151 389 c
130 361 119 322 119 273 c
119 188 137 119 172 68 c
195 35 225 18 262 18 c
299 18 327 34 348 67 c
369 100 380 146 380 204 c

ce} _d
/p{500 0 5 -217 470 460 sc
159 458 m
159 381 l
201 434 249 460 303 460 c
352 460 392 440 423 400 c
454 360 470 309 470 247 c
470 174 450 113 409 64 c
369 15 319 -10 260 -10 c
239 -10 222 -7 207 -1 c
193 5 177 16 159 33 c
159 -124 l
159 -155 164 -175 175 -184 c
186 -193 210 -198 247 -199 c
247 -217 l
5 -217 l
5 -200 l
34 -197 53 -192 62 -183 c
71 -174 75 -157 75 -131 c
75 337 l
75 360 72 376 67 383 c
62 390 51 394 34 394 c
23 394 15 394 9 393 c
9 409 l
56 423 104 440 153 460 c
159 458 l

159 334 m
159 88 l
159 73 170 59 193 44 c
216 29 240 22 263 22 c
299 22 328 39 350 73 c
373 107 384 152 384 207 c
384 266 373 312 350 347 c
328 382 298 400 261 400 c
238 400 215 393 192 378 c
170 363 159 349 159 334 c

ce} _d
/r{333 0 5 0 335 460 sc
160 458 m
160 366 l
185 402 206 427 223 440 c
240 453 259 460 280 460 c
297 460 311 455 320 446 c
330 437 335 424 335 407 c
335 393 331 382 324 374 c
317 366 308 362 296 362 c
283 362 270 369 256 382 c
245 392 237 397 230 397 c
216 397 201 387 184 368 c
168 349 160 331 160 315 c
160 90 l
160 61 166 42 177 32 c
188 22 211 16 245 15 c
245 0 l
5 0 l
5 15 l
37 21 57 28 64 35 c
72 42 76 59 76 84 c
76 334 l
76 356 73 371 68 380 c
63 389 55 394 42 394 c
31 394 20 393 7 390 c
7 406 l
49 419 98 437 155 460 c
160 458 l

ce} _d
/s{389 0 51 -10 348 459 sc
156 301 m
260 238 l
293 218 316 199 329 182 c
342 165 348 142 348 115 c
348 82 334 52 306 27 c
279 2 246 -10 208 -10 c
177 -10 152 -7 135 -1 c
117 5 102 8 89 8 c
78 8 70 4 65 -4 c
52 -4 l
52 153 l
68 153 l
79 104 94 69 114 46 c
134 23 161 12 195 12 c
220 12 240 19 255 33 c
270 47 278 65 278 86 c
278 117 260 142 225 161 c
171 191 l
91 236 51 284 51 336 c
51 375 63 405 88 426 c
113 448 147 459 189 459 c
218 459 241 455 256 448 c
268 443 277 440 284 440 c
289 440 294 443 300 450 c
311 450 l
316 314 l
301 314 l
290 359 275 391 258 409 c
241 428 218 437 188 437 c
165 437 147 431 133 420 c
120 409 113 392 113 369 c
113 358 117 345 124 332 c
132 319 143 309 156 301 c

ce} _d
/t{278 0 13 -10 279 579 sc
266 77 m
279 66 l
247 15 207 -10 158 -10 c
99 -10 70 32 70 117 c
70 418 l
17 418 l
14 420 13 422 13 425 c
13 430 19 437 30 444 c
55 459 88 494 127 551 c
128 553 131 557 136 563 c
141 570 145 575 147 579 c
152 579 154 575 154 566 c
154 450 l
255 450 l
255 418 l
154 418 l
154 132 l
154 100 158 77 166 63 c
174 49 187 42 206 42 c
226 42 246 54 266 77 c

ce} _d
/u{500 0 9 -10 480 450 sc
480 50 m
480 36 l
428 22 382 7 343 -9 c
338 -6 l
338 76 l
336 76 l
294 19 246 -10 193 -10 c
155 -10 125 2 103 25 c
82 48 71 79 71 118 c
71 369 l
71 394 67 411 58 420 c
49 429 33 435 9 436 c
9 450 l
155 450 l
155 127 l
155 104 162 85 175 70 c
189 55 206 48 226 48 c
259 48 287 58 310 79 c
319 87 325 94 328 101 c
331 108 333 120 333 137 c
333 368 l
333 394 328 411 319 418 c
310 426 290 431 259 433 c
259 450 l
417 450 l
417 107 l
417 84 421 68 428 61 c
436 54 451 50 474 50 c
480 50 l

ce} _d
/v{500 0 19 -14 477 450 sc
477 450 m
477 435 l
462 434 450 429 443 420 c
436 411 425 390 412 357 c
284 36 l
271 3 261 -14 256 -14 c
251 -14 245 -5 238 12 c
237 14 235 17 234 22 c
233 27 231 30 230 33 c
110 320 l
89 371 73 402 63 414 c
53 427 38 434 19 435 c
19 450 l
215 450 l
215 435 l
198 434 186 431 179 427 c
172 423 169 417 169 408 c
169 397 172 385 178 370 c
280 114 l
379 373 l
383 383 385 393 385 403 c
385 422 369 432 338 435 c
338 450 l
477 450 l

ce} _d
end readonly def

/BuildGlyph {
 exch begin
 CharStrings exch
 2 copy known not {pop /.notdef} if
 true 3 1 roll get exec
 end
} _d

/BuildChar {
 1 index /Encoding get exch get
 1 index /BuildGlyph get exec
} _d

FontName currentdict end definefont pop
%!PS-Adobe-3.0 Resource-Font
%%Creator: Converted from TrueType to Type 3 by Matplotlib.
10 dict begin
/FontName /Cmmi10 def
/PaintType 0 def
/FontMatrix [0.00048828125 0 0 0.00048828125 0 0] def
/FontBBox [-70 -512 2146 1536] def
/FontType 3 def
/Encoding [/h /e] def
/CharStrings 3 dict dup begin
/.notdef 0 def
/h{1180 0 109 -23 1124 1421 sc
109 37 m
109 45 110 51 111 55 c
408 1239 l
413 1262 417 1281 418 1294 c
418 1316 374 1327 285 1327 c
271 1327 264 1336 264 1354 c
265 1357 266 1363 268 1372 c
271 1381 274 1387 277 1392 c
281 1397 286 1399 293 1399 c
569 1421 l
575 1421 l
575 1420 577 1418 582 1415 c
587 1413 589 1412 590 1411 c
593 1404 594 1399 594 1395 c
434 756 l
518 855 618 905 733 905 c
781 905 822 897 857 880 c
892 863 920 838 939 804 c
959 771 969 731 969 684 c
969 628 956 560 931 481 c
906 402 875 313 838 215 c
819 170 809 129 809 92 c
809 51 825 31 856 31 c
909 31 954 59 989 116 c
1025 173 1050 235 1065 301 c
1068 309 1073 313 1081 313 c
1106 313 l
1111 313 1116 311 1119 307 c
1122 304 1124 300 1124 295 c
1124 294 1123 292 1122 289 c
1110 240 1092 191 1068 143 c
1045 96 1015 56 979 24 c
943 -7 901 -23 852 -23 c
804 -23 763 -7 729 26 c
695 59 678 100 678 147 c
678 172 683 199 694 227 c
733 330 765 421 790 502 c
816 583 829 654 829 715 c
829 754 821 787 806 813 c
791 839 765 852 729 852 c
656 852 592 829 537 784 c
482 739 435 680 395 606 c
256 47 l
251 26 240 10 225 -3 c
210 -16 192 -23 172 -23 c
155 -23 140 -17 127 -5 c
115 6 109 20 109 37 c

ce} _d
/e{952 0 90 -23 881 905 sc
412 -23 m
347 -23 289 -6 240 28 c
191 62 154 108 128 165 c
103 223 90 284 90 348 c
90 445 114 537 163 622 c
212 708 279 777 363 828 c
447 879 537 905 633 905 c
692 905 743 890 786 859 c
830 829 852 786 852 729 c
852 650 821 592 758 553 c
695 515 625 491 546 482 c
467 473 380 469 285 469 c
279 469 l
257 388 246 318 246 260 c
246 199 260 146 288 100 c
316 54 359 31 416 31 c
497 31 575 50 650 87 c
725 124 787 176 834 242 c
838 246 843 248 850 248 c
857 248 863 244 870 236 c
877 229 881 222 881 215 c
881 210 880 206 877 203 c
827 133 760 78 675 37 c
590 -3 503 -23 412 -23 c

291 522 m
370 522 444 526 511 533 c
578 540 639 559 694 588 c
749 618 776 664 776 727 c
776 752 769 774 755 793 c
741 812 723 827 700 837 c
678 847 655 852 631 852 c
573 852 521 836 474 805 c
428 774 390 733 360 682 c
330 632 307 579 291 522 c

ce} _d
end readonly def

/BuildGlyph {
 exch begin
 CharStrings exch
 2 copy known not {pop /.notdef} if
 true 3 1 roll get exec
 end
} _d

/BuildChar {
 1 index /Encoding get exch get
 1 index /BuildGlyph get exec
} _d

FontName currentdict end definefont pop
end
%%EndProlog
mpldict begin
148.027 222.223 translate
315.946 347.555 0 0 clipbox
gsave
0 0 m
315.946261 0 l
315.946261 347.555 l
0 347.555 l
cl
1.000 setgray
fill
grestore
gsave
42.79375 41.60625 m
308.746261 41.60625 l
308.746261 308.57375 l
42.79375 308.57375 l
cl
1.000 setgray
fill
grestore
0.800 setlinewidth
1 setlinejoin
2 setlinecap
[] 0 setdash
0.690 setgray
gsave
265.953 266.968 42.794 41.606 clipbox
76.003471 41.60625 m
76.003471 308.57375 l
stroke
grestore
0 setlinecap
0.000 setgray
gsave
/o {
gsave
newpath
translate
0.8 setlinewidth
1 setlinejoin

0 setlinecap

0 0 m
0 -3.5 l

gsave
0.000 setgray
fill
grestore
stroke
grestore
} bind def
76.0035 41.6063 o
grestore
gsave
67.003471 26.403125 translate
0.000000 rotate
/STIXGeneral-Regular 12.0 selectfont
0.000000 0.750000 moveto
/seven glyphshow
5.999985 0.750000 moveto
/five glyphshow
11.999969 0.750000 moveto
/zero glyphshow
grestore
2 setlinecap
0.690 setgray
gsave
265.953 266.968 42.794 41.606 clipbox
118.932272 41.60625 m
118.932272 308.57375 l
stroke
grestore
0 setlinecap
0.000 setgray
gsave
/o {
gsave
newpath
translate
0.8 setlinewidth
1 setlinejoin

0 setlinecap

0 0 m
0 -3.5 l

gsave
0.000 setgray
fill
grestore
stroke
grestore
} bind def
118.932 41.6063 o
grestore
gsave
106.932272 26.403125 translate
0.000000 rotate
/STIXGeneral-Regular 12.0 selectfont
0.000000 0.890625 moveto
/one glyphshow
5.999985 0.890625 moveto
/zero glyphshow
11.999969 0.890625 moveto
/zero glyphshow
17.999954 0.890625 moveto
/zero glyphshow
grestore
2 setlinecap
0.690 setgray
gsave
265.953 266.968 42.794 41.606 clipbox
161.861074 41.60625 m
161.861074 308.57375 l
stroke
grestore
0 setlinecap
0.000 setgray
gsave
/o {
gsave
newpath
translate
0.8 setlinewidth
1 setlinejoin

0 setlinecap

0 0 m
0 -3.5 l

gsave
0.000 setgray
fill
grestore
stroke
grestore
} bind def
161.861 41.6063 o
grestore
gsave
149.861074 26.403125 translate
0.000000 rotate
/STIXGeneral-Regular 12.0 selectfont
0.000000 0.750000 moveto
/one glyphshow
5.999985 0.750000 moveto
/two glyphshow
11.999969 0.750000 moveto
/five glyphshow
17.999954 0.750000 moveto
/zero glyphshow
grestore
2 setlinecap
0.690 setgray
gsave
265.953 266.968 42.794 41.606 clipbox
204.789875 41.60625 m
204.789875 308.57375 l
stroke
grestore
0 setlinecap
0.000 setgray
gsave
/o {
gsave
newpath
translate
0.8 setlinewidth
1 setlinejoin

0 setlinecap

0 0 m
0 -3.5 l

gsave
0.000 setgray
fill
grestore
stroke
grestore
} bind def
204.79 41.6063 o
grestore
gsave
192.789875 26.403125 translate
0.000000 rotate
/STIXGeneral-Regular 12.0 selectfont
0.000000 0.750000 moveto
/one glyphshow
5.999985 0.750000 moveto
/five glyphshow
11.999969 0.750000 moveto
/zero glyphshow
17.999954 0.750000 moveto
/zero glyphshow
grestore
2 setlinecap
0.690 setgray
gsave
265.953 266.968 42.794 41.606 clipbox
247.718677 41.60625 m
247.718677 308.57375 l
stroke
grestore
0 setlinecap
0.000 setgray
gsave
/o {
gsave
newpath
translate
0.8 setlinewidth
1 setlinejoin

0 setlinecap

0 0 m
0 -3.5 l

gsave
0.000 setgray
fill
grestore
stroke
grestore
} bind def
247.719 41.6063 o
grestore
gsave
235.718677 26.403125 translate
0.000000 rotate
/STIXGeneral-Regular 12.0 selectfont
0.000000 0.750000 moveto
/one glyphshow
5.999985 0.750000 moveto
/seven glyphshow
11.999969 0.750000 moveto
/five glyphshow
17.999954 0.750000 moveto
/zero glyphshow
grestore
2 setlinecap
0.690 setgray
gsave
265.953 266.968 42.794 41.606 clipbox
290.647478 41.60625 m
290.647478 308.57375 l
stroke
grestore
0 setlinecap
0.000 setgray
gsave
/o {
gsave
newpath
translate
0.8 setlinewidth
1 setlinejoin

0 setlinecap

0 0 m
0 -3.5 l

gsave
0.000 setgray
fill
grestore
stroke
grestore
} bind def
290.647 41.6063 o
grestore
gsave
278.647478 26.403125 translate
0.000000 rotate
/STIXGeneral-Regular 12.0 selectfont
0.000000 0.890625 moveto
/two glyphshow
5.999985 0.890625 moveto
/zero glyphshow
11.999969 0.890625 moveto
/zero glyphshow
17.999954 0.890625 moveto
/zero glyphshow
grestore
/STIXGeneral-Regular 14.000 selectfont
gsave

123.660630 10.231250 translate
0.000000 rotate
0.000000 0 m /n glyphshow
7.000000 0 m /o glyphshow
14.000000 0 m /d glyphshow
21.000000 0 m /e glyphshow
27.215988 0 m /s glyphshow
32.661987 0 m /space glyphshow
36.161987 0 m /o glyphshow
43.161987 0 m /n glyphshow
50.161987 0 m /space glyphshow
53.661987 0 m /e glyphshow
59.877975 0 m /n glyphshow
66.877975 0 m /v glyphshow
73.877975 0 m /e glyphshow
80.093964 0 m /l glyphshow
83.985962 0 m /o glyphshow
90.985962 0 m /p glyphshow
97.985962 0 m /e glyphshow
grestore
2 setlinecap
0.690 setgray
gsave
265.953 266.968 42.794 41.606 clipbox
42.79375 43.103236 m
308.746261 43.103236 l
stroke
grestore
0 setlinecap
0.000 setgray
gsave
/o {
gsave
newpath
translate
0.8 setlinewidth
1 setlinejoin

0 setlinecap

-0 0 m
-3.5 0 l

gsave
0.000 setgray
fill
grestore
stroke
grestore
} bind def
42.7938 43.1032 o
grestore
gsave
29.793750 39.001674 translate
0.000000 rotate
/STIXGeneral-Regular 12.0 selectfont
0.000000 0.890625 moveto
/zero glyphshow
grestore
2 setlinecap
0.690 setgray
gsave
265.953 266.968 42.794 41.606 clipbox
42.79375 81.290165 m
308.746261 81.290165 l
stroke
grestore
0 setlinecap
0.000 setgray
gsave
/o {
gsave
newpath
translate
0.8 setlinewidth
1 setlinejoin

0 setlinecap

-0 0 m
-3.5 0 l

gsave
0.000 setgray
fill
grestore
stroke
grestore
} bind def
42.7938 81.2902 o
grestore
gsave
23.793750 77.188603 translate
0.000000 rotate
/STIXGeneral-Regular 12.0 selectfont
0.000000 0.890625 moveto
/one glyphshow
5.999985 0.890625 moveto
/zero glyphshow
grestore
2 setlinecap
0.690 setgray
gsave
265.953 266.968 42.794 41.606 clipbox
42.79375 119.477094 m
308.746261 119.477094 l
stroke
grestore
0 setlinecap
0.000 setgray
gsave
/o {
gsave
newpath
translate
0.8 setlinewidth
1 setlinejoin

0 setlinecap

-0 0 m
-3.5 0 l

gsave
0.000 setgray
fill
grestore
stroke
grestore
} bind def
42.7938 119.477 o
grestore
gsave
23.793750 115.375532 translate
0.000000 rotate
/STIXGeneral-Regular 12.0 selectfont
0.000000 0.890625 moveto
/two glyphshow
5.999985 0.890625 moveto
/zero glyphshow
grestore
2 setlinecap
0.690 setgray
gsave
265.953 266.968 42.794 41.606 clipbox
42.79375 157.664023 m
308.746261 157.664023 l
stroke
grestore
0 setlinecap
0.000 setgray
gsave
/o {
gsave
newpath
translate
0.8 setlinewidth
1 setlinejoin

0 setlinecap

-0 0 m
-3.5 0 l

gsave
0.000 setgray
fill
grestore
stroke
grestore
} bind def
42.7938 157.664 o
grestore
gsave
23.793750 153.562460 translate
0.000000 rotate
/STIXGeneral-Regular 12.0 selectfont
0.000000 0.890625 moveto
/three glyphshow
5.999985 0.890625 moveto
/zero glyphshow
grestore
2 setlinecap
0.690 setgray
gsave
265.953 266.968 42.794 41.606 clipbox
42.79375 195.850952 m
308.746261 195.850952 l
stroke
grestore
0 setlinecap
0.000 setgray
gsave
/o {
gsave
newpath
translate
0.8 setlinewidth
1 setlinejoin

0 setlinecap

-0 0 m
-3.5 0 l

gsave
0.000 setgray
fill
grestore
stroke
grestore
} bind def
42.7938 195.851 o
grestore
gsave
23.793750 191.749389 translate
0.000000 rotate
/STIXGeneral-Regular 12.0 selectfont
0.000000 0.890625 moveto
/four glyphshow
5.999985 0.890625 moveto
/zero glyphshow
grestore
2 setlinecap
0.690 setgray
gsave
265.953 266.968 42.794 41.606 clipbox
42.79375 234.037881 m
308.746261 234.037881 l
stroke
grestore
0 setlinecap
0.000 setgray
gsave
/o {
gsave
newpath
translate
0.8 setlinewidth
1 setlinejoin

0 setlinecap

-0 0 m
-3.5 0 l

gsave
0.000 setgray
fill
grestore
stroke
grestore
} bind def
42.7938 234.038 o
grestore
gsave
23.793750 229.936318 translate
0.000000 rotate
/STIXGeneral-Regular 12.0 selectfont
0.000000 0.750000 moveto
/five glyphshow
5.999985 0.750000 moveto
/zero glyphshow
grestore
2 setlinecap
0.690 setgray
gsave
265.953 266.968 42.794 41.606 clipbox
42.79375 272.22481 m
308.746261 272.22481 l
stroke
grestore
0 setlinecap
0.000 setgray
gsave
/o {
gsave
newpath
translate
0.8 setlinewidth
1 setlinejoin

0 setlinecap

-0 0 m
-3.5 0 l

gsave
0.000 setgray
fill
grestore
stroke
grestore
} bind def
42.7938 272.225 o
grestore
gsave
23.793750 268.123247 translate
0.000000 rotate
/STIXGeneral-Regular 12.0 selectfont
0.000000 0.796875 moveto
/six glyphshow
5.999985 0.796875 moveto
/zero glyphshow
grestore
gsave

16.762500 110.933750 translate
90.000000 rotate
0.000000 0 m /c glyphshow
6.215988 0 m /o glyphshow
13.215988 0 m /m glyphshow
24.107986 0 m /p glyphshow
31.107986 0 m /u glyphshow
38.107986 0 m /t glyphshow
41.999985 0 m /a glyphshow
48.215973 0 m /t glyphshow
52.107971 0 m /i glyphshow
55.999969 0 m /o glyphshow
62.999969 0 m /n glyphshow
69.999969 0 m /a glyphshow
76.215958 0 m /l glyphshow
80.107956 0 m /space glyphshow
83.607956 0 m /t glyphshow
87.499954 0 m /i glyphshow
91.391953 0 m /m glyphshow
102.283951 0 m /e glyphshow
108.499939 0 m /space glyphshow
111.999939 0 m /bracketleft glyphshow
116.661926 0 m /h glyphshow
123.661926 0 m /bracketright glyphshow
grestore
1.000 setlinewidth
2 setlinecap
0.122 0.467 0.706 setrgbcolor
gsave
265.953 266.968 42.794 41.606 clipbox
296.65751 296.438864 m
267.981071 244.525813 l
243.769227 203.853035 l
219.213953 169.433524 l
196.890976 143.601536 l
176.285151 123.441869 l
158.7702 106.663715 l
141.426964 94.113735 l
125.11402 83.612143 l
111.720234 75.255393 l
97.983017 69.022001 l
86.306383 63.961018 l
74.286319 59.702577 l
64.841982 56.589563 l
54.8825 53.741136 l
stroke
grestore
0 setlinecap
gsave
265.953 266.968 42.794 41.606 clipbox
/o {
gsave
newpath
translate
1.0 setlinewidth
1 setlinejoin

0 setlinecap

-5 -5 m
5 5 l
-5 5 m
5 -5 l

gsave
0.122 0.467 0.706 setrgbcolor
fill
grestore
stroke
grestore
} bind def
296.658 296.439 o
267.981 244.526 o
243.769 203.853 o
219.214 169.434 o
196.891 143.602 o
176.285 123.442 o
158.77 106.664 o
141.427 94.1137 o
125.114 83.6121 o
111.72 75.2554 o
97.983 69.022 o
86.3064 63.961 o
74.2863 59.7026 o
64.842 56.5896 o
54.8825 53.7411 o
grestore
0.800 setlinewidth
0 setlinejoin
2 setlinecap
0.000 setgray
gsave
42.79375 41.60625 m
42.79375 308.57375 l
stroke
grestore
gsave
308.746261 41.60625 m
308.746261 308.57375 l
stroke
grestore
gsave
42.79375 41.60625 m
308.746261 41.60625 l
stroke
grestore
gsave
42.79375 308.57375 m
308.746261 308.57375 l
stroke
grestore
1 setlinejoin
0 setlinecap
gsave
/o {
gsave
newpath
translate
0.8 setlinewidth
1 setlinejoin

0 setlinecap

0 0 m
0 3.5 l

gsave
0.000 setgray
fill
grestore
stroke
grestore
} bind def
263.59 308.574 o
grestore
gsave
253.090294 318.183125 translate
0.000000 rotate
/STIXGeneral-Regular 12.0 selectfont
0.000000 0.890625 moveto
/zero glyphshow
5.999985 0.890625 moveto
/period glyphshow
8.999969 0.890625 moveto
/zero glyphshow
14.999954 0.890625 moveto
/four glyphshow
grestore
gsave
/o {
gsave
newpath
translate
0.8 setlinewidth
1 setlinejoin

0 setlinecap

0 0 m
0 3.5 l

gsave
0.000 setgray
fill
grestore
stroke
grestore
} bind def
194.021 308.574 o
grestore
gsave
183.521029 318.183125 translate
0.000000 rotate
/STIXGeneral-Regular 12.0 selectfont
0.000000 0.796875 moveto
/zero glyphshow
5.999985 0.796875 moveto
/period glyphshow
8.999969 0.796875 moveto
/zero glyphshow
14.999954 0.796875 moveto
/six glyphshow
grestore
gsave
/o {
gsave
newpath
translate
0.8 setlinewidth
1 setlinejoin

0 setlinecap

0 0 m
0 3.5 l

gsave
0.000 setgray
fill
grestore
stroke
grestore
} bind def
124.452 308.574 o
grestore
gsave
113.951765 318.183125 translate
0.000000 rotate
/STIXGeneral-Regular 12.0 selectfont
0.000000 0.890625 moveto
/zero glyphshow
5.999985 0.890625 moveto
/period glyphshow
8.999969 0.890625 moveto
/zero glyphshow
14.999954 0.890625 moveto
/eight glyphshow
grestore
gsave
/o {
gsave
newpath
translate
0.8 setlinewidth
1 setlinejoin

0 setlinecap

0 0 m
0 3.5 l

gsave
0.000 setgray
fill
grestore
stroke
grestore
} bind def
54.8825 308.574 o
grestore
gsave
44.382500 318.183125 translate
0.000000 rotate
/STIXGeneral-Regular 12.0 selectfont
0.000000 0.890625 moveto
/zero glyphshow
5.999985 0.890625 moveto
/period glyphshow
8.999969 0.890625 moveto
/one glyphshow
14.999954 0.890625 moveto
/zero glyphshow
grestore
gsave
113.770005 330.386250 translate
0.000000 rotate
/STIXGeneral-Regular 14.0 selectfont
0.000000 0.281250 moveto
/i glyphshow
3.891998 0.281250 moveto
/n glyphshow
10.891998 0.281250 moveto
/t glyphshow
14.783997 0.281250 moveto
/e glyphshow
20.999985 0.281250 moveto
/r glyphshow
25.661972 0.281250 moveto
/n glyphshow
32.661972 0.281250 moveto
/o glyphshow
39.661972 0.281250 moveto
/d glyphshow
46.661972 0.281250 moveto
/a glyphshow
52.877960 0.281250 moveto
/l glyphshow
56.769958 0.281250 moveto
/space glyphshow
60.269958 0.281250 moveto
/d glyphshow
67.269958 0.281250 moveto
/i glyphshow
71.161957 0.281250 moveto
/s glyphshow
76.607956 0.281250 moveto
/t glyphshow
80.499954 0.281250 moveto
/a glyphshow
86.715942 0.281250 moveto
/n glyphshow
93.715942 0.281250 moveto
/c glyphshow
99.931931 0.281250 moveto
/e glyphshow
106.147919 0.281250 moveto
/space glyphshow
/Cmmi10 14.0 selectfont
109.647919 0.281250 moveto
/h glyphshow
/Cmmi10 9.799999999999999 selectfont
117.714325 -2.099625 moveto
/e glyphshow
grestore
0 setlinejoin
2 setlinecap
gsave
42.79375 41.60625 m
42.79375 308.57375 l
stroke
grestore
gsave
308.746261 41.60625 m
308.746261 308.57375 l
stroke
grestore
gsave
42.79375 41.60625 m
308.746261 41.60625 l
stroke
grestore
gsave
42.79375 308.57375 m
308.746261 308.57375 l
stroke
grestore

end
showpage
