%!PS-Adobe-3.0 EPSF-3.0
%%Title: execution_times.eps
%%Creator: Matplotlib v3.7.2, https://matplotlib.org/
%%CreationDate: Wed Feb 21 06:43:58 2024
%%Orientation: portrait
%%BoundingBox: 57 258 555 534
%%HiResBoundingBox: 57.765164 258.037937 554.234836 533.962063
%%EndComments
%%BeginProlog
/mpldict 14 dict def
mpldict begin
/_d { bind def } bind def
/m { moveto } _d
/l { lineto } _d
/r { rlineto } _d
/c { curveto } _d
/cl { closepath } _d
/ce { closepath eofill } _d
/box {
      m
      1 index 0 r
      0 exch r
      neg 0 r
      cl
    } _d
/clipbox {
      box
      clip
      newpath
    } _d
/sc { setcachedevice } _d
%!PS-Adobe-3.0 Resource-Font
%%Creator: Converted from TrueType to Type 3 by Matplotlib.
10 dict begin
/FontName /STIXGeneral-Regular def
/PaintType 0 def
/FontMatrix [0.001 0 0 0.001 0 0] def
/FontBBox [-970 -443 2000 1023] def
/FontType 3 def
/Encoding [/minus /space /zero /one /two /three /four /six /C /F /I /M /P /T /multiply /bracketleft /bracketright /c /e /h /i /m /n /o /t /u /x] def
/CharStrings 28 dict dup begin
/.notdef 0 def
/minus{685 0 64 220 621 286 sc
621 220 m
64 220 l
64 286 l
621 286 l
621 220 l

ce} _d
/space{250 0 0 0 0 0 sc
ce} _d
/zero{500 0 24 -14 476 676 sc
476 330 m
476 285 472 243 463 203 c
454 164 441 127 424 94 c
407 61 384 34 354 15 c
324 -4 289 -14 250 -14 c
209 -14 174 -4 143 17 c
112 38 89 65 72 100 c
55 135 43 172 35 211 c
28 250 24 292 24 336 c
24 398 32 454 47 503 c
62 553 88 594 123 627 c
159 660 203 676 254 676 c
319 676 373 644 414 580 c
455 516 476 433 476 330 c

380 325 m
380 430 369 511 346 566 c
324 622 291 650 248 650 c
207 650 175 622 153 566 c
131 510 120 431 120 329 c
120 226 131 148 153 93 c
175 39 207 12 250 12 c
292 12 324 39 346 93 c
369 148 380 225 380 325 c

ce} _d
/one{500 0 111 0 394 676 sc
394 0 m
118 0 l
118 15 l
155 17 180 24 193 35 c
206 47 213 67 213 95 c
213 544 l
213 577 203 593 183 593 c
174 593 159 589 138 581 c
111 571 l
111 585 l
290 676 l
299 673 l
299 76 l
299 54 306 38 319 29 c
332 20 357 15 394 15 c
394 0 l

ce} _d
/two{500 0 29 0 474 676 sc
474 137 m
420 0 l
29 0 l
29 12 l
207 201 l
254 250 287 294 307 335 c
327 376 337 418 337 461 c
337 506 325 540 300 565 c
275 590 241 602 198 602 c
162 602 133 593 112 574 c
91 555 71 521 51 472 c
30 477 l
41 539 64 588 98 623 c
133 658 179 676 238 676 c
293 676 338 659 372 626 c
406 593 423 551 423 500 c
423 425 380 342 295 252 c
130 76 l
364 76 l
386 76 403 80 416 89 c
429 98 444 116 460 143 c
474 137 l

ce} _d
/three{500 0 41 -14 431 676 sc
61 510 m
45 514 l
60 564 84 603 117 632 c
150 661 191 676 241 676 c
288 676 325 663 354 638 c
383 613 397 580 397 539 c
397 484 366 438 304 401 c
341 385 368 367 387 348 c
416 315 431 272 431 219 c
431 166 416 119 385 79 c
362 48 330 25 287 9 c
245 -6 200 -14 153 -14 c
78 -14 41 5 41 43 c
41 54 45 62 53 69 c
61 76 71 79 82 79 c
99 79 119 70 143 53 c
172 32 201 22 229 22 c
266 22 296 37 321 66 c
346 96 359 132 359 175 c
359 252 324 300 255 320 c
234 327 200 330 153 330 c
153 344 l
190 357 218 369 237 380 c
291 411 318 455 318 514 c
318 547 308 573 289 590 c
270 607 244 616 210 616 c
150 616 100 581 61 510 c

ce} _d
/four{500 0 12 0 473 676 sc
473 167 m
370 167 l
370 0 l
292 0 l
292 167 l
12 167 l
12 231 l
326 676 l
370 676 l
370 231 l
473 231 l
473 167 l

292 231 m
292 574 l
52 231 l
292 231 l

ce} _d
/six{500 0 34 -14 468 684 sc
446 684 m
448 668 l
369 655 304 623 251 572 c
198 521 165 458 152 383 c
191 413 233 428 279 428 c
338 428 384 409 417 372 c
451 335 468 284 468 219 c
468 154 451 100 417 59 c
378 10 325 -14 258 -14 c
177 -14 118 20 81 87 c
50 144 34 208 34 279 c
34 388 70 480 143 555 c
184 598 227 628 270 645 c
314 663 373 676 446 684 c

378 188 m
378 317 333 382 243 382 c
210 382 182 373 160 355 c
138 338 127 308 127 266 c
127 188 139 126 163 81 c
188 36 223 14 269 14 c
304 14 331 30 350 61 c
369 93 378 135 378 188 c

ce} _d
/C{667 0 28 -14 633 676 sc
614 131 m
633 113 l
574 28 483 -14 360 -14 c
263 -14 185 16 124 75 c
60 138 28 221 28 325 c
28 422 58 505 118 572 c
181 641 262 676 361 676 c
404 676 443 671 480 661 c
522 649 545 643 549 643 c
571 643 585 654 591 676 c
611 676 l
620 449 l
597 449 l
586 497 569 534 545 560 c
498 611 444 636 384 636 c
310 636 251 609 208 554 c
165 500 144 429 144 341 c
144 234 168 154 216 102 c
261 54 320 30 394 30 c
438 30 476 38 508 53 c
540 68 575 94 614 131 c

ce} _d
/F{556 0 11 0 546 662 sc
546 519 m
521 519 l
514 564 501 593 483 605 c
466 618 427 624 367 624 c
235 624 l
221 624 212 621 207 616 c
203 611 201 601 201 585 c
201 368 l
343 368 l
385 368 413 374 427 386 c
442 398 451 424 456 463 c
479 463 l
479 230 l
456 230 l
452 271 443 297 429 309 c
415 321 386 327 343 327 c
201 327 l
201 112 l
201 74 206 49 217 38 c
228 27 253 21 292 19 c
292 0 l
11 0 l
11 19 l
49 22 73 29 83 40 c
94 52 99 80 99 123 c
99 551 l
99 588 94 611 84 622 c
74 633 50 640 12 643 c
12 662 l
541 662 l
546 519 l

ce} _d
/I{333 0 18 0 315 662 sc
315 0 m
18 0 l
18 19 l
60 20 87 26 98 37 c
109 48 115 73 115 112 c
115 551 l
115 590 110 614 99 624 c
88 634 61 640 18 643 c
18 662 l
315 662 l
315 643 l
273 641 246 635 234 624 c
223 613 217 589 217 551 c
217 112 l
217 75 223 50 235 38 c
247 27 274 20 315 19 c
315 0 l

ce} _d
/M{889 0 12 0 864 662 sc
864 0 m
584 0 l
584 19 l
623 22 648 29 658 41 c
669 54 674 81 674 123 c
674 572 l
419 0 l
405 0 l
153 549 l
153 151 l
153 97 159 62 170 46 c
181 30 207 21 246 19 c
246 0 l
12 0 l
12 19 l
41 21 62 25 75 32 c
88 39 96 50 101 67 c
106 84 109 112 109 151 c
109 549 l
109 587 103 611 92 622 c
81 633 55 640 14 643 c
14 662 l
212 662 l
443 160 l
664 662 l
863 662 l
863 643 l
827 642 803 636 792 624 c
781 612 776 587 776 550 c
776 112 l
776 77 781 53 792 41 c
803 29 827 22 864 19 c
864 0 l

ce} _d
/P{557 0 16 0 542 662 sc
16 662 m
275 662 l
370 662 442 641 492 599 c
525 571 542 531 542 480 c
542 427 523 383 485 349 c
457 324 428 307 399 299 c
370 292 327 288 271 288 c
252 288 229 289 202 291 c
202 112 l
202 74 207 49 218 38 c
229 27 255 21 296 19 c
296 0 l
16 0 l
16 19 l
55 22 78 29 87 40 c
96 51 100 79 100 122 c
100 551 l
100 588 95 612 85 623 c
76 634 53 640 16 643 c
16 662 l

202 589 m
202 331 l
225 329 245 328 263 328 c
317 328 359 341 388 367 c
418 394 433 430 433 475 c
433 529 418 567 387 590 c
356 613 306 625 237 625 c
223 625 214 622 209 617 c
204 612 202 603 202 589 c

ce} _d
/T{611 0 17 0 593 662 sc
593 492 m
569 492 l
558 547 543 582 524 597 c
505 612 468 620 415 620 c
356 620 l
356 111 l
356 73 362 49 373 38 c
384 27 411 21 452 19 c
452 0 l
160 0 l
160 19 l
202 22 228 29 238 40 c
249 51 254 79 254 123 c
254 620 l
194 620 l
140 620 103 612 84 596 c
65 581 51 546 41 492 c
17 492 l
24 662 l
586 662 l
593 492 l

ce} _d
/multiply{640 0 43 -25 597 529 sc
597 22 m
551 -25 l
320 205 l
89 -25 l
43 21 l
273 252 l
43 483 l
90 529 l
320 299 l
551 529 l
597 484 l
367 252 l
597 22 l

ce} _d
/bracketleft{333 0 88 -156 299 662 sc
299 -156 m
88 -156 l
88 662 l
299 662 l
299 637 l
216 637 l
199 637 186 633 177 626 c
168 619 164 606 164 589 c
164 -77 l
164 -113 181 -131 216 -131 c
299 -131 l
299 -156 l

ce} _d
/bracketright{333 0 34 -156 245 662 sc
245 -156 m
34 -156 l
34 -131 l
122 -131 l
139 -131 151 -127 158 -120 c
165 -113 169 -101 169 -85 c
169 583 l
169 619 152 637 118 637 c
34 637 l
34 662 l
245 662 l
245 -156 l

ce} _d
/c{444 0 25 -10 412 460 sc
398 156 m
412 147 l
383 91 356 53 330 32 c
296 4 258 -10 215 -10 c
160 -10 114 11 78 52 c
43 94 25 147 25 212 c
25 297 53 362 109 409 c
150 443 195 460 244 460 c
286 460 322 450 352 429 c
383 409 398 385 398 357 c
398 346 393 336 384 327 c
375 319 364 315 351 315 c
328 315 312 330 303 361 c
297 383 l
292 402 285 414 277 421 c
269 428 256 431 238 431 c
197 431 164 415 139 383 c
114 351 102 309 102 257 c
102 200 116 153 145 116 c
174 80 211 62 257 62 c
286 62 310 69 331 82 c
352 96 374 121 398 156 c

ce} _d
/e{444 0 25 -10 424 460 sc
408 164 m
424 157 l
384 46 314 -10 215 -10 c
156 -10 110 10 76 51 c
42 92 25 148 25 217 c
25 288 44 347 82 392 c
120 437 170 460 232 460 c
292 460 338 437 371 391 c
390 364 402 326 405 277 c
97 277 l
100 235 104 203 109 181 c
115 159 126 137 143 114 c
171 77 208 59 254 59 c
287 59 314 67 336 83 c
359 99 383 126 408 164 c

99 309 m
303 309 l
297 351 287 381 273 398 c
260 415 237 424 205 424 c
177 424 154 414 135 394 c
116 375 104 346 99 309 c

ce} _d
/h{500 0 9 0 487 683 sc
487 0 m
275 0 l
275 15 l
304 18 323 25 331 35 c
339 45 343 67 343 102 c
343 300 l
343 371 318 406 269 406 c
249 406 231 401 214 392 c
197 383 178 366 157 343 c
157 102 l
157 67 161 45 169 35 c
177 25 196 18 225 15 c
225 0 l
9 0 l
9 15 l
38 19 55 26 62 35 c
69 44 73 67 73 102 c
73 573 l
73 594 70 608 63 614 c
57 621 43 624 22 624 c
16 624 12 624 10 623 c
10 639 l
37 647 l
88 662 127 674 152 683 c
157 680 l
157 376 l
180 406 203 427 226 440 c
249 453 275 460 304 460 c
386 460 427 407 427 301 c
427 102 l
427 67 430 45 436 36 c
443 27 460 20 487 15 c
487 0 l

ce} _d
/i{278 0 16 0 253 683 sc
180 632 m
180 617 175 605 165 595 c
155 586 143 581 128 581 c
114 581 102 586 92 595 c
83 605 78 617 78 632 c
78 646 83 658 93 668 c
103 678 115 683 129 683 c
144 683 156 678 165 668 c
175 658 180 646 180 632 c

253 0 m
16 0 l
16 15 l
51 17 72 23 81 33 c
90 43 95 67 95 104 c
95 331 l
95 354 93 371 88 380 c
83 389 75 394 62 394 c
46 394 32 392 20 389 c
20 405 l
175 460 l
179 456 l
179 105 l
179 68 183 44 191 34 c
200 24 220 18 253 15 c
253 0 l

ce} _d
/m{778 0 16 0 775 460 sc
775 0 m
557 0 l
557 15 l
585 18 603 23 610 32 c
618 41 622 61 622 90 c
622 296 l
622 336 616 365 604 382 c
593 399 573 408 545 408 c
522 408 502 403 485 394 c
469 385 453 369 438 347 c
438 95 l
438 63 443 42 452 31 c
462 21 481 16 510 15 c
510 0 l
286 0 l
286 15 l
315 17 334 22 342 29 c
350 37 354 56 354 86 c
354 297 l
354 371 332 408 289 408 c
270 408 250 404 229 395 c
208 387 193 377 183 365 c
174 355 170 349 170 348 c
170 70 l
170 49 175 34 184 27 c
193 20 211 16 238 15 c
238 0 l
16 0 l
16 15 l
44 16 63 21 72 30 c
81 40 86 59 86 88 c
86 336 l
86 361 83 378 78 387 c
73 397 64 402 51 402 c
41 402 30 401 19 398 c
19 415 l
64 428 111 443 158 460 c
166 457 l
166 383 l
168 383 l
198 414 224 435 247 445 c
270 455 295 460 321 460 c
374 460 409 432 427 376 c
479 432 533 460 590 460 c
667 460 706 400 706 280 c
706 77 l
706 55 709 40 716 31 c
723 23 734 18 749 17 c
775 15 l
775 0 l

ce} _d
/n{500 0 16 0 485 460 sc
485 0 m
277 0 l
278 15 l
303 17 319 24 327 36 c
336 49 340 72 340 105 c
340 304 l
340 371 316 405 267 405 c
250 405 235 401 220 393 c
205 385 187 370 164 348 c
164 72 l
164 52 168 38 177 30 c
186 22 204 17 229 15 c
229 0 l
18 0 l
18 15 l
43 17 60 23 68 33 c
76 44 80 64 80 94 c
80 337 l
80 362 78 379 73 388 c
68 397 59 402 45 402 c
32 402 22 401 16 398 c
16 415 l
63 428 108 443 153 460 c
161 457 l
161 379 l
162 379 l
209 433 257 460 306 460 c
344 460 373 447 393 420 c
414 393 424 355 424 306 c
424 85 l
424 58 428 41 436 32 c
444 23 460 18 485 15 c
485 0 l

ce} _d
/o{500 0 29 -10 470 460 sc
470 231 m
470 161 449 103 407 58 c
366 13 312 -10 245 -10 c
184 -10 132 12 91 57 c
50 102 29 159 29 228 c
29 297 50 353 91 396 c
132 439 187 460 254 460 c
316 460 367 439 408 396 c
449 354 470 299 470 231 c

380 204 m
380 280 363 339 330 382 c
303 415 272 432 235 432 c
200 432 172 418 151 389 c
130 361 119 322 119 273 c
119 188 137 119 172 68 c
195 35 225 18 262 18 c
299 18 327 34 348 67 c
369 100 380 146 380 204 c

ce} _d
/t{278 0 13 -10 279 579 sc
266 77 m
279 66 l
247 15 207 -10 158 -10 c
99 -10 70 32 70 117 c
70 418 l
17 418 l
14 420 13 422 13 425 c
13 430 19 437 30 444 c
55 459 88 494 127 551 c
128 553 131 557 136 563 c
141 570 145 575 147 579 c
152 579 154 575 154 566 c
154 450 l
255 450 l
255 418 l
154 418 l
154 132 l
154 100 158 77 166 63 c
174 49 187 42 206 42 c
226 42 246 54 266 77 c

ce} _d
/u{500 0 9 -10 480 450 sc
480 50 m
480 36 l
428 22 382 7 343 -9 c
338 -6 l
338 76 l
336 76 l
294 19 246 -10 193 -10 c
155 -10 125 2 103 25 c
82 48 71 79 71 118 c
71 369 l
71 394 67 411 58 420 c
49 429 33 435 9 436 c
9 450 l
155 450 l
155 127 l
155 104 162 85 175 70 c
189 55 206 48 226 48 c
259 48 287 58 310 79 c
319 87 325 94 328 101 c
331 108 333 120 333 137 c
333 368 l
333 394 328 411 319 418 c
310 426 290 431 259 433 c
259 450 l
417 450 l
417 107 l
417 84 421 68 428 61 c
436 54 451 50 474 50 c
480 50 l

ce} _d
/x{500 0 17 0 479 450 sc
479 0 m
278 0 l
278 15 l
295 16 305 18 310 21 c
315 24 318 30 318 39 c
318 45 316 51 312 57 c
221 197 l
142 74 l
129 53 122 40 122 33 c
122 21 135 15 162 15 c
162 0 l
17 0 l
17 15 l
34 16 46 20 55 26 c
64 33 76 46 90 66 c
204 231 l
110 375 l
95 398 82 414 71 422 c
60 431 48 435 33 435 c
24 435 l
24 450 l
231 450 l
231 435 l
202 434 188 427 188 413 c
188 399 203 369 234 324 c
243 312 247 305 248 304 c
251 309 261 323 278 348 c
281 354 285 360 290 367 c
295 374 298 379 300 383 c
303 387 305 391 308 395 c
311 399 312 402 313 405 c
314 408 315 411 315 413 c
315 426 302 433 275 435 c
275 450 l
433 450 l
433 435 l
399 434 372 419 352 391 c
269 271 l
397 75 l
423 35 450 15 479 15 c
479 0 l

ce} _d
end readonly def

/BuildGlyph {
 exch begin
 CharStrings exch
 2 copy known not {pop /.notdef} if
 true 3 1 roll get exec
 end
} _d

/BuildChar {
 1 index /Encoding get exch get
 1 index /BuildGlyph get exec
} _d

FontName currentdict end definefont pop
%!PS-Adobe-3.0 Resource-Font
%%Creator: Converted from TrueType to Type 3 by Matplotlib.
10 dict begin
/FontName /Cmmi10 def
/PaintType 0 def
/FontMatrix [0.00048828125 0 0 0.00048828125 0 0] def
/FontBBox [-70 -512 2146 1536] def
/FontType 3 def
/Encoding [/h /y /period /x] def
/CharStrings 5 dict dup begin
/.notdef 0 def
/h{1180 0 109 -23 1124 1421 sc
109 37 m
109 45 110 51 111 55 c
408 1239 l
413 1262 417 1281 418 1294 c
418 1316 374 1327 285 1327 c
271 1327 264 1336 264 1354 c
265 1357 266 1363 268 1372 c
271 1381 274 1387 277 1392 c
281 1397 286 1399 293 1399 c
569 1421 l
575 1421 l
575 1420 577 1418 582 1415 c
587 1413 589 1412 590 1411 c
593 1404 594 1399 594 1395 c
434 756 l
518 855 618 905 733 905 c
781 905 822 897 857 880 c
892 863 920 838 939 804 c
959 771 969 731 969 684 c
969 628 956 560 931 481 c
906 402 875 313 838 215 c
819 170 809 129 809 92 c
809 51 825 31 856 31 c
909 31 954 59 989 116 c
1025 173 1050 235 1065 301 c
1068 309 1073 313 1081 313 c
1106 313 l
1111 313 1116 311 1119 307 c
1122 304 1124 300 1124 295 c
1124 294 1123 292 1122 289 c
1110 240 1092 191 1068 143 c
1045 96 1015 56 979 24 c
943 -7 901 -23 852 -23 c
804 -23 763 -7 729 26 c
695 59 678 100 678 147 c
678 172 683 199 694 227 c
733 330 765 421 790 502 c
816 583 829 654 829 715 c
829 754 821 787 806 813 c
791 839 765 852 729 852 c
656 852 592 829 537 784 c
482 739 435 680 395 606 c
256 47 l
251 26 240 10 225 -3 c
210 -16 192 -23 172 -23 c
155 -23 140 -17 127 -5 c
115 6 109 20 109 37 c

ce} _d
/y{1004 0 55 -420 1008 905 sc
172 -293 m
201 -342 251 -367 322 -367 c
387 -367 443 -344 490 -299 c
537 -254 575 -199 604 -134 c
633 -70 656 -4 672 63 c
611 6 546 -23 475 -23 c
421 -23 375 -14 337 5 c
299 24 269 51 248 88 c
227 125 217 170 217 223 c
217 268 223 313 235 360 c
247 407 264 460 285 517 c
307 575 326 625 342 668 c
360 718 369 759 369 791 c
369 832 354 852 324 852 c
270 852 225 824 190 768 c
155 713 130 651 113 582 c
110 573 105 569 96 569 c
72 569 l
61 569 55 575 55 588 c
55 594 l
77 675 111 747 156 810 c
201 873 259 905 328 905 c
377 905 418 889 451 857 c
485 825 502 784 502 735 c
502 710 496 683 485 655 c
479 638 465 602 444 546 c
423 490 406 444 395 407 c
384 370 374 334 367 299 c
360 264 356 228 356 193 c
356 148 366 109 385 78 c
404 47 435 31 477 31 c
562 31 638 83 705 186 c
860 817 l
865 835 875 850 892 863 c
909 876 927 883 946 883 c
963 883 977 878 989 867 c
1002 856 1008 842 1008 825 c
1008 817 1007 812 1006 809 c
803 -6 l
785 -76 752 -143 704 -207 c
656 -271 598 -322 530 -361 c
463 -400 392 -420 319 -420 c
284 -420 249 -413 214 -399 c
179 -386 151 -365 130 -338 c
109 -311 98 -279 98 -242 c
98 -205 109 -172 131 -145 c
153 -118 182 -104 219 -104 c
241 -104 259 -111 274 -124 c
289 -138 297 -156 297 -178 c
297 -209 285 -237 262 -260 c
239 -283 211 -295 180 -295 c
179 -294 177 -294 176 -293 c
175 -293 173 -293 172 -293 c

ce} _d
/period{567 0 172 0 397 225 sc
172 113 m
172 144 183 170 206 192 c
229 214 255 225 285 225 c
304 225 322 220 340 210 c
358 200 372 186 382 168 c
392 150 397 132 397 113 c
397 83 386 57 364 34 c
342 11 316 0 285 0 c
255 0 229 11 206 34 c
183 57 172 83 172 113 c

ce} _d
/x{1169 0 63 -23 1077 905 sc
160 59 m
184 40 218 31 262 31 c
305 31 342 51 375 92 c
408 133 430 178 442 227 c
535 590 l
550 656 557 701 557 725 c
557 759 547 789 528 814 c
509 839 483 852 449 852 c
406 852 365 838 327 811 c
289 784 257 750 231 708 c
205 667 187 625 176 582 c
173 573 168 569 160 569 c
135 569 l
124 569 119 575 119 588 c
119 594 l
132 645 155 694 187 742 c
219 791 258 830 304 860 c
351 890 400 905 453 905 c
503 905 548 892 588 865 c
629 838 657 802 674 756 c
697 798 727 833 763 862 c
800 891 840 905 883 905 c
912 905 942 900 973 889 c
1004 879 1029 863 1048 842 c
1067 821 1077 794 1077 762 c
1077 727 1066 697 1043 672 c
1021 647 993 635 958 635 c
936 635 918 642 903 656 c
888 670 881 688 881 709 c
881 738 891 763 910 784 c
930 806 954 819 981 823 c
956 842 922 852 879 852 c
835 852 797 832 764 791 c
732 750 709 705 696 655 c
606 293 l
591 238 584 193 584 158 c
584 123 594 93 613 68 c
633 43 659 31 692 31 c
756 31 813 59 863 115 c
914 172 947 234 963 301 c
966 309 971 313 979 313 c
1004 313 l
1009 313 1014 311 1017 307 c
1020 304 1022 300 1022 295 c
1022 294 1021 292 1020 289 c
1001 208 960 135 898 72 c
836 9 766 -23 688 -23 c
638 -23 593 -10 552 17 c
512 44 484 81 467 127 c
446 87 416 52 378 22 c
341 -8 301 -23 258 -23 c
229 -23 198 -18 167 -7 c
136 3 111 19 92 40 c
73 61 63 88 63 121 c
63 153 74 182 96 208 c
119 235 147 248 180 248 c
203 248 222 241 237 227 c
252 214 260 196 260 174 c
260 145 250 120 231 99 c
212 78 189 64 160 59 c

ce} _d
end readonly def

/BuildGlyph {
 exch begin
 CharStrings exch
 2 copy known not {pop /.notdef} if
 true 3 1 roll get exec
 end
} _d

/BuildChar {
 1 index /Encoding get exch get
 1 index /BuildGlyph get exec
} _d

FontName currentdict end definefont pop
%!PS-Adobe-3.0 Resource-Font
%%Creator: Converted from TrueType to Type 3 by Matplotlib.
10 dict begin
/FontName /Cmr10 def
/PaintType 0 def
/FontMatrix [0.00048828125 0 0 0.00048828125 0 0] def
/FontBBox [-90 -512 2066 1536] def
/FontType 3 def
/Encoding [/e /zero /one /two /three /four /five /six /seven /nine /equal] def
/CharStrings 12 dict dup begin
/.notdef 0 def
/e{909 0 57 -23 850 918 sc
510 -23 m
427 -23 350 -1 280 42 c
211 86 156 144 116 217 c
77 290 57 368 57 449 c
57 529 75 605 111 677 c
148 749 198 807 263 851 c
328 896 401 918 481 918 c
544 918 598 907 644 886 c
691 865 729 836 759 799 c
789 762 812 718 827 667 c
842 616 850 561 850 500 c
850 482 843 473 829 473 c
236 473 l
236 451 l
236 338 259 240 304 159 c
350 78 425 37 528 37 c
570 37 609 46 644 65 c
680 84 711 110 737 143 c
764 176 782 212 791 250 c
792 255 795 259 798 262 c
802 266 806 268 811 268 c
829 268 l
843 268 850 259 850 242 c
831 165 789 101 725 51 c
661 2 589 -23 510 -23 c

238 524 m
705 524 l
705 575 698 627 683 680 c
669 733 645 776 612 811 c
579 846 535 864 481 864 c
404 864 344 828 301 755 c
259 683 238 606 238 524 c

ce} _d
/zero{1024 0 80 -45 942 1364 sc
512 -45 m
345 -45 231 24 170 161 c
110 299 80 463 80 653 c
80 772 91 883 112 988 c
134 1093 177 1181 241 1254 c
306 1327 396 1364 512 1364 c
602 1364 676 1342 733 1298 c
790 1254 834 1197 864 1127 c
894 1058 914 983 925 903 c
936 824 942 740 942 653 c
942 536 931 426 909 323 c
888 221 845 134 782 62 c
719 -9 629 -45 512 -45 c

512 8 m
588 8 645 47 682 125 c
719 203 742 289 751 384 c
760 479 764 579 764 686 c
764 789 760 883 751 970 c
742 1057 719 1135 682 1205 c
645 1276 589 1311 512 1311 c
435 1311 377 1276 340 1205 c
303 1134 280 1056 271 969 c
262 883 258 789 258 686 c
258 610 260 538 263 471 c
267 404 277 334 293 262 c
309 191 335 130 370 81 c
406 32 453 8 512 8 c

ce} _d
/one{1024 0 178 0 862 1364 sc
190 0 m
190 72 l
361 72 446 94 446 137 c
446 1212 l
375 1178 286 1161 178 1161 c
178 1233 l
345 1233 472 1277 557 1364 c
586 1364 l
591 1364 595 1362 599 1358 c
604 1355 606 1351 606 1346 c
606 137 l
606 94 691 72 862 72 c
862 0 l
190 0 l

ce} _d
/two{1024 0 102 0 920 1364 sc
102 0 m
102 55 l
102 58 103 62 106 66 c
424 418 l
472 470 511 514 541 549 c
571 584 601 625 630 671 c
659 717 682 764 699 811 c
716 859 725 910 725 963 c
725 1019 715 1072 694 1123 c
673 1174 642 1215 601 1246 c
560 1277 511 1292 453 1292 c
394 1292 340 1274 293 1238 c
246 1203 212 1157 193 1100 c
198 1101 206 1102 215 1102 c
246 1102 272 1092 293 1071 c
315 1050 326 1024 326 991 c
326 960 315 933 293 911 c
272 890 246 879 215 879 c
183 879 156 890 134 912 c
113 935 102 961 102 991 c
102 1042 112 1090 131 1135 c
150 1180 178 1220 214 1255 c
251 1290 292 1317 337 1336 c
383 1355 432 1364 483 1364 c
561 1364 634 1347 701 1314 c
768 1281 822 1235 861 1174 c
900 1114 920 1044 920 963 c
920 904 907 847 881 794 c
855 741 822 692 781 648 c
740 605 688 555 625 500 c
562 445 520 408 500 389 c
268 166 l
465 166 l
562 166 642 167 707 168 c
772 170 807 173 811 176 c
827 193 843 256 860 365 c
920 365 l
862 0 l
102 0 l

ce} _d
/three{1024 0 86 -45 936 1364 sc
195 158 m
227 111 270 77 324 54 c
378 31 436 20 498 20 c
577 20 634 54 667 121 c
700 189 717 266 717 352 c
717 391 713 429 706 468 c
699 507 688 543 671 576 c
654 609 631 636 602 656 c
573 676 538 686 496 686 c
360 686 l
348 686 342 692 342 705 c
342 723 l
342 734 348 739 360 739 c
473 748 l
521 748 561 766 592 802 c
624 838 647 882 662 933 c
677 985 684 1034 684 1081 c
684 1146 669 1200 638 1242 c
607 1284 561 1305 498 1305 c
446 1305 396 1295 349 1275 c
302 1256 264 1226 236 1186 c
239 1187 241 1187 243 1187 c
245 1188 247 1188 250 1188 c
281 1188 306 1177 327 1156 c
348 1135 358 1109 358 1079 c
358 1050 348 1024 327 1003 c
306 982 281 971 250 971 c
220 971 194 982 173 1003 c
152 1024 141 1050 141 1079 c
141 1138 159 1189 194 1232 c
229 1275 275 1308 330 1330 c
386 1353 442 1364 498 1364 c
539 1364 583 1358 629 1345 c
675 1333 717 1315 754 1292 c
791 1269 822 1240 845 1204 c
869 1168 881 1127 881 1081 c
881 1024 868 971 842 922 c
817 873 782 831 737 796 c
692 761 643 734 590 717 c
649 706 706 683 759 650 c
812 617 855 574 887 522 c
920 470 936 414 936 354 c
936 279 915 210 874 149 c
833 88 778 41 711 6 c
644 -28 573 -45 498 -45 c
434 -45 370 -33 305 -8 c
241 16 188 52 147 101 c
106 150 86 208 86 276 c
86 310 97 338 120 361 c
143 384 171 395 205 395 c
227 395 247 390 265 379 c
284 369 298 355 308 336 c
319 317 324 297 324 276 c
324 243 312 215 289 192 c
266 169 238 158 205 158 c
195 158 l

ce} _d
/four{1024 0 57 0 965 1364 sc
57 338 m
57 410 l
690 1354 l
695 1361 702 1364 711 1364 c
741 1364 l
756 1364 764 1356 764 1341 c
764 410 l
965 410 l
965 338 l
764 338 l
764 137 l
764 109 784 91 824 83 c
864 76 910 72 963 72 c
963 0 l
399 0 l
399 72 l
452 72 498 76 538 83 c
578 91 598 109 598 137 c
598 338 l
57 338 l

125 410 m
610 410 l
610 1135 l
125 410 l

ce} _d
/five{1024 0 102 -45 920 1364 sc
178 233 m
192 193 213 157 242 124 c
271 91 306 66 345 47 c
385 29 426 20 469 20 c
568 20 636 58 673 135 c
710 212 729 305 729 414 c
729 461 728 501 726 533 c
725 566 720 597 713 627 c
700 675 678 717 646 753 c
615 789 576 807 530 807 c
484 807 444 800 411 786 c
378 772 352 756 331 737 c
310 718 292 699 276 678 c
260 657 250 646 246 645 c
223 645 l
220 645 215 647 210 651 c
205 656 203 660 203 664 c
203 1348 l
203 1351 205 1355 209 1358 c
214 1362 218 1364 223 1364 c
229 1364 l
321 1320 419 1298 522 1298 c
623 1298 721 1320 815 1364 c
821 1364 l
826 1364 830 1362 834 1359 c
838 1356 840 1352 840 1348 c
840 1329 l
840 1322 839 1319 836 1319 c
789 1257 731 1209 660 1174 c
590 1139 517 1122 442 1122 c
387 1122 331 1130 274 1145 c
274 758 l
319 795 360 821 395 836 c
431 852 477 860 532 860 c
607 860 675 838 734 795 c
794 752 840 695 872 625 c
904 556 920 485 920 412 c
920 330 900 254 859 184 c
819 114 764 58 695 17 c
626 -24 550 -45 469 -45 c
402 -45 340 -28 283 7 c
227 42 183 88 150 147 c
118 206 102 268 102 334 c
102 365 112 390 132 409 c
152 428 177 438 207 438 c
237 438 262 428 282 408 c
303 389 313 364 313 334 c
313 305 303 280 282 259 c
262 239 237 229 207 229 c
202 229 197 229 191 230 c
185 231 181 232 178 233 c

ce} _d
/six{1024 0 86 -45 936 1364 sc
512 -45 m
427 -45 357 -23 300 22 c
243 67 199 126 168 197 c
137 269 116 344 104 423 c
92 502 86 581 86 662 c
86 770 107 878 149 987 c
191 1096 253 1186 334 1257 c
416 1328 513 1364 625 1364 c
672 1364 715 1355 755 1337 c
796 1320 827 1294 850 1259 c
873 1225 885 1184 885 1135 c
885 1107 875 1083 856 1064 c
837 1045 814 1036 786 1036 c
759 1036 736 1046 717 1065 c
698 1084 688 1108 688 1135 c
688 1162 698 1185 717 1204 c
736 1223 759 1233 786 1233 c
797 1233 l
780 1258 755 1276 723 1287 c
692 1299 659 1305 625 1305 c
584 1305 545 1296 510 1278 c
475 1260 444 1236 416 1205 c
388 1174 365 1140 346 1103 c
327 1066 313 1024 302 977 c
292 930 286 885 283 844 c
280 803 279 751 279 688 c
303 744 337 790 381 825 c
425 861 475 879 530 879 c
591 879 646 867 696 842 c
746 817 789 783 825 739 c
861 696 888 646 907 590 c
926 534 936 477 936 420 c
936 340 918 264 882 191 c
847 119 797 62 732 19 c
667 -24 594 -45 512 -45 c

512 20 m
565 20 607 32 639 56 c
671 80 694 112 709 151 c
724 191 734 231 737 271 c
741 312 743 361 743 420 c
743 497 739 563 732 618 c
725 673 705 721 672 762 c
639 804 589 825 522 825 c
467 825 421 806 385 769 c
350 732 324 684 307 627 c
291 570 283 516 283 463 c
283 445 284 431 285 422 c
285 420 285 418 284 417 c
284 416 284 414 283 412 c
283 353 289 294 301 234 c
313 174 336 123 370 82 c
404 41 451 20 512 20 c

ce} _d
/seven{1024 0 115 -45 993 1384 sc
356 53 m
356 129 363 203 376 276 c
389 349 409 420 434 491 c
460 562 491 632 527 700 c
564 769 604 833 647 893 c
834 1153 l
600 1153 l
357 1153 232 1150 225 1143 c
207 1121 190 1058 174 954 c
115 954 l
182 1384 l
242 1384 l
242 1378 l
242 1353 284 1337 367 1330 c
450 1323 532 1319 612 1319 c
993 1319 l
993 1266 l
993 1265 993 1264 992 1263 c
992 1262 992 1261 991 1260 c
709 864 l
640 761 596 647 579 522 c
562 397 553 240 553 53 c
553 26 543 3 524 -16 c
505 -35 482 -45 455 -45 c
428 -45 404 -35 385 -16 c
366 3 356 26 356 53 c

ce} _d
/nine{1024 0 86 -45 936 1364 sc
231 86 m
268 42 333 20 426 20 c
478 20 526 38 571 73 c
616 108 651 152 676 203 c
705 261 723 323 731 388 c
739 454 743 536 743 633 c
720 578 686 532 642 497 c
599 462 549 444 492 444 c
413 444 342 465 279 508 c
217 551 169 608 136 678 c
103 749 86 824 86 903 c
86 985 105 1061 142 1132 c
179 1203 231 1260 297 1301 c
363 1343 438 1364 522 1364 c
605 1364 674 1341 729 1296 c
785 1251 828 1193 857 1122 c
886 1051 907 976 918 897 c
930 818 936 739 936 662 c
936 557 917 449 878 339 c
839 230 781 138 704 65 c
627 -8 535 -45 426 -45 c
345 -45 277 -26 221 12 c
165 50 137 107 137 184 c
137 212 146 235 165 254 c
184 273 208 283 236 283 c
263 283 286 273 305 254 c
324 235 334 212 334 184 c
334 157 324 134 305 115 c
286 96 263 86 236 86 c
231 86 l

500 498 m
556 498 602 517 637 554 c
673 592 699 639 715 695 c
731 751 739 807 739 862 c
739 901 l
739 909 l
739 1012 724 1103 694 1184 c
664 1265 607 1305 522 1305 c
468 1305 424 1293 390 1269 c
357 1246 332 1214 316 1175 c
300 1136 290 1094 285 1049 c
281 1004 279 956 279 903 c
279 826 283 760 290 705 c
297 650 317 602 350 560 c
383 519 433 498 500 498 c

ce} _d
/equal{1591 0 115 272 1477 752 sc
154 272 m
143 272 133 276 126 285 c
119 294 115 303 115 313 c
115 324 119 334 126 342 c
133 350 143 354 154 354 c
1440 354 l
1450 354 1459 350 1466 342 c
1473 334 1477 324 1477 313 c
1477 303 1473 294 1466 285 c
1459 276 1450 272 1440 272 c
154 272 l

154 670 m
143 670 133 674 126 682 c
119 690 115 700 115 711 c
115 721 119 730 126 739 c
133 748 143 752 154 752 c
1440 752 l
1450 752 1459 748 1466 739 c
1473 730 1477 721 1477 711 c
1477 700 1473 690 1466 682 c
1459 674 1450 670 1440 670 c
154 670 l

ce} _d
end readonly def

/BuildGlyph {
 exch begin
 CharStrings exch
 2 copy known not {pop /.notdef} if
 true 3 1 roll get exec
 end
} _d

/BuildChar {
 1 index /Encoding get exch get
 1 index /BuildGlyph get exec
} _d

FontName currentdict end definefont pop
%!PS-Adobe-3.0 Resource-Font
%%Creator: Converted from TrueType to Type 3 by Matplotlib.
10 dict begin
/FontName /Cmsy10 def
/PaintType 0 def
/FontMatrix [0.00048828125 0 0 0.00048828125 0 0] def
/FontBBox [-59 -1966 2300 1595] def
/FontType 3 def
/Encoding [/minus] def
/CharStrings 2 dict dup begin
/.notdef 0 def
/minus{1591 0 170 471 1421 553 sc
209 471 m
198 471 188 475 181 484 c
174 493 170 502 170 512 c
170 522 174 531 181 540 c
188 549 198 553 209 553 c
1384 553 l
1395 553 1403 549 1410 540 c
1417 531 1421 522 1421 512 c
1421 502 1417 493 1410 484 c
1403 475 1395 471 1384 471 c
209 471 l

ce} _d
end readonly def

/BuildGlyph {
 exch begin
 CharStrings exch
 2 copy known not {pop /.notdef} if
 true 3 1 roll get exec
 end
} _d

/BuildChar {
 1 index /Encoding get exch get
 1 index /BuildGlyph get exec
} _d

FontName currentdict end definefont pop
end
%%EndProlog
mpldict begin
57.765 258.038 translate
496.47 275.924 0 0 clipbox
gsave
0 0 m
496.469672 0 l
496.469672 275.924125 l
0 275.924125 l
cl
1.000 setgray
fill
grestore
gsave
47.79375 43.2 m
489.269672 43.2 l
489.269672 268.724125 l
47.79375 268.724125 l
cl
1.000 setgray
fill
grestore
0.800 setlinewidth
1 setlinejoin
2 setlinecap
[] 0 setdash
0.690 setgray
gsave
441.476 225.524 47.794 43.2 clipbox
469.202585 43.2 m
469.202585 268.724125 l
stroke
grestore
0 setlinecap
0.000 setgray
gsave
/o {
gsave
newpath
translate
0.8 setlinewidth
1 setlinejoin

0 setlinecap

0 0 m
0 -3.5 l

gsave
0.000 setgray
fill
grestore
stroke
grestore
} bind def
469.203 43.2 o
grestore
gsave
457.703 26.8094 translate
0 rotate
/STIXGeneral-Regular 12.0 selectfont
0 0.998438 moveto
/one glyphshow
5.99998 0.998438 moveto
/zero glyphshow
/STIXGeneral-Regular 8.399999999999999 selectfont
12.1892 5.32344 moveto
/minus glyphshow
17.9432 5.32344 moveto
/one glyphshow
grestore
2 setlinecap
0.690 setgray
gsave
441.476 225.524 47.794 43.2 clipbox
62.344593 43.2 m
62.344593 268.724125 l
stroke
grestore
0.600 setlinewidth
0 setlinecap
0.000 setgray
gsave
/o {
gsave
newpath
translate
0.6 setlinewidth
1 setlinejoin

0 setlinecap

0 0 m
0 -2 l

gsave
0.000 setgray
fill
grestore
stroke
grestore
} bind def
62.3446 43.2 o
grestore
gsave
41.8446 28.4094 translate
0 rotate
/STIXGeneral-Regular 12.0 selectfont
0 0.998438 moveto
/three glyphshow
8.10702 0.998438 moveto
/multiply glyphshow
17.894 0.998438 moveto
/one glyphshow
23.894 0.998438 moveto
/zero glyphshow
/STIXGeneral-Regular 8.399999999999999 selectfont
30.0832 5.32344 moveto
/minus glyphshow
35.8372 5.32344 moveto
/two glyphshow
grestore
0.800 setlinewidth
2 setlinecap
0.690 setgray
gsave
441.476 225.524 47.794 43.2 clipbox
159.560867 43.2 m
159.560867 268.724125 l
stroke
grestore
0.600 setlinewidth
0 setlinecap
0.000 setgray
gsave
/o {
gsave
newpath
translate
0.6 setlinewidth
1 setlinejoin

0 setlinecap

0 0 m
0 -2 l

gsave
0.000 setgray
fill
grestore
stroke
grestore
} bind def
159.561 43.2 o
grestore
gsave
139.061 28.4094 translate
0 rotate
/STIXGeneral-Regular 12.0 selectfont
0 0.998438 moveto
/four glyphshow
8.10702 0.998438 moveto
/multiply glyphshow
17.894 0.998438 moveto
/one glyphshow
23.894 0.998438 moveto
/zero glyphshow
/STIXGeneral-Regular 8.399999999999999 selectfont
30.0832 5.32344 moveto
/minus glyphshow
35.8372 5.32344 moveto
/two glyphshow
grestore
0.800 setlinewidth
2 setlinecap
0.690 setgray
gsave
441.476 225.524 47.794 43.2 clipbox
234.967668 43.2 m
234.967668 268.724125 l
stroke
grestore
0.600 setlinewidth
0 setlinecap
0.000 setgray
gsave
/o {
gsave
newpath
translate
0.6 setlinewidth
1 setlinejoin

0 setlinecap

0 0 m
0 -2 l

gsave
0.000 setgray
fill
grestore
stroke
grestore
} bind def
234.968 43.2 o
grestore
0.800 setlinewidth
2 setlinecap
0.690 setgray
gsave
441.476 225.524 47.794 43.2 clipbox
296.57951 43.2 m
296.57951 268.724125 l
stroke
grestore
0.600 setlinewidth
0 setlinecap
0.000 setgray
gsave
/o {
gsave
newpath
translate
0.6 setlinewidth
1 setlinejoin

0 setlinecap

0 0 m
0 -2 l

gsave
0.000 setgray
fill
grestore
stroke
grestore
} bind def
296.58 43.2 o
grestore
gsave
276.08 28.4094 translate
0 rotate
/STIXGeneral-Regular 12.0 selectfont
0 0.998438 moveto
/six glyphshow
8.10702 0.998438 moveto
/multiply glyphshow
17.894 0.998438 moveto
/one glyphshow
23.894 0.998438 moveto
/zero glyphshow
/STIXGeneral-Regular 8.399999999999999 selectfont
30.0832 5.32344 moveto
/minus glyphshow
35.8372 5.32344 moveto
/two glyphshow
grestore
0.800 setlinewidth
2 setlinecap
0.690 setgray
gsave
441.476 225.524 47.794 43.2 clipbox
348.67158 43.2 m
348.67158 268.724125 l
stroke
grestore
0.600 setlinewidth
0 setlinecap
0.000 setgray
gsave
/o {
gsave
newpath
translate
0.6 setlinewidth
1 setlinejoin

0 setlinecap

0 0 m
0 -2 l

gsave
0.000 setgray
fill
grestore
stroke
grestore
} bind def
348.672 43.2 o
grestore
0.800 setlinewidth
2 setlinecap
0.690 setgray
gsave
441.476 225.524 47.794 43.2 clipbox
393.795784 43.2 m
393.795784 268.724125 l
stroke
grestore
0.600 setlinewidth
0 setlinecap
0.000 setgray
gsave
/o {
gsave
newpath
translate
0.6 setlinewidth
1 setlinejoin

0 setlinecap

0 0 m
0 -2 l

gsave
0.000 setgray
fill
grestore
stroke
grestore
} bind def
393.796 43.2 o
grestore
0.800 setlinewidth
2 setlinecap
0.690 setgray
gsave
441.476 225.524 47.794 43.2 clipbox
433.598153 43.2 m
433.598153 268.724125 l
stroke
grestore
0.600 setlinewidth
0 setlinecap
0.000 setgray
gsave
/o {
gsave
newpath
translate
0.6 setlinewidth
1 setlinejoin

0 setlinecap

0 0 m
0 -2 l

gsave
0.000 setgray
fill
grestore
stroke
grestore
} bind def
433.598 43.2 o
grestore
gsave
261.532 10.2313 translate
0 rotate
/Cmmi10 14.0 selectfont
0 0.28125 moveto
/h glyphshow
/Cmr10 9.799999999999999 selectfont
8.06641 -2.09962 moveto
/e glyphshow
grestore
0.800 setlinewidth
2 setlinecap
0.690 setgray
gsave
441.476 225.524 47.794 43.2 clipbox
47.79375 49.223024 m
489.269672 49.223024 l
stroke
grestore
0 setlinecap
0.000 setgray
gsave
/o {
gsave
newpath
translate
0.8 setlinewidth
1 setlinejoin

0 setlinecap

-0 0 m
-3.5 0 l

gsave
0.000 setgray
fill
grestore
stroke
grestore
} bind def
47.7938 49.223 o
grestore
gsave
23.7938 44.5277 translate
0 rotate
/STIXGeneral-Regular 12.0 selectfont
0 0.998438 moveto
/one glyphshow
5.99998 0.998438 moveto
/zero glyphshow
/STIXGeneral-Regular 8.399999999999999 selectfont
12.1892 5.32344 moveto
/zero glyphshow
grestore
2 setlinecap
0.690 setgray
gsave
441.476 225.524 47.794 43.2 clipbox
47.79375 147.892085 m
489.269672 147.892085 l
stroke
grestore
0 setlinecap
0.000 setgray
gsave
/o {
gsave
newpath
translate
0.8 setlinewidth
1 setlinejoin

0 setlinecap

-0 0 m
-3.5 0 l

gsave
0.000 setgray
fill
grestore
stroke
grestore
} bind def
47.7938 147.892 o
grestore
gsave
23.7938 143.197 translate
0 rotate
/STIXGeneral-Regular 12.0 selectfont
0 0.998438 moveto
/one glyphshow
5.99998 0.998438 moveto
/zero glyphshow
/STIXGeneral-Regular 8.399999999999999 selectfont
12.1892 5.32344 moveto
/one glyphshow
grestore
2 setlinecap
0.690 setgray
gsave
441.476 225.524 47.794 43.2 clipbox
47.79375 246.561146 m
489.269672 246.561146 l
stroke
grestore
0 setlinecap
0.000 setgray
gsave
/o {
gsave
newpath
translate
0.8 setlinewidth
1 setlinejoin

0 setlinecap

-0 0 m
-3.5 0 l

gsave
0.000 setgray
fill
grestore
stroke
grestore
} bind def
47.7938 246.561 o
grestore
gsave
23.7938 241.866 translate
0 rotate
/STIXGeneral-Regular 12.0 selectfont
0 0.998438 moveto
/one glyphshow
5.99998 0.998438 moveto
/zero glyphshow
/STIXGeneral-Regular 8.399999999999999 selectfont
12.1892 5.32344 moveto
/two glyphshow
grestore
2 setlinecap
0.690 setgray
gsave
441.476 225.524 47.794 43.2 clipbox
47.79375 44.708176 m
489.269672 44.708176 l
stroke
grestore
0.600 setlinewidth
0 setlinecap
0.000 setgray
gsave
/o {
gsave
newpath
translate
0.6 setlinewidth
1 setlinejoin

0 setlinecap

-0 0 m
-2 0 l

gsave
0.000 setgray
fill
grestore
stroke
grestore
} bind def
47.7938 44.7082 o
grestore
0.800 setlinewidth
2 setlinecap
0.690 setgray
gsave
441.476 225.524 47.794 43.2 clipbox
47.79375 78.925371 m
489.269672 78.925371 l
stroke
grestore
0.600 setlinewidth
0 setlinecap
0.000 setgray
gsave
/o {
gsave
newpath
translate
0.6 setlinewidth
1 setlinejoin

0 setlinecap

-0 0 m
-2 0 l

gsave
0.000 setgray
fill
grestore
stroke
grestore
} bind def
47.7938 78.9254 o
grestore
0.800 setlinewidth
2 setlinecap
0.690 setgray
gsave
441.476 225.524 47.794 43.2 clipbox
47.79375 96.300131 m
489.269672 96.300131 l
stroke
grestore
0.600 setlinewidth
0 setlinecap
0.000 setgray
gsave
/o {
gsave
newpath
translate
0.6 setlinewidth
1 setlinejoin

0 setlinecap

-0 0 m
-2 0 l

gsave
0.000 setgray
fill
grestore
stroke
grestore
} bind def
47.7938 96.3001 o
grestore
0.800 setlinewidth
2 setlinecap
0.690 setgray
gsave
441.476 225.524 47.794 43.2 clipbox
47.79375 108.627718 m
489.269672 108.627718 l
stroke
grestore
0.600 setlinewidth
0 setlinecap
0.000 setgray
gsave
/o {
gsave
newpath
translate
0.6 setlinewidth
1 setlinejoin

0 setlinecap

-0 0 m
-2 0 l

gsave
0.000 setgray
fill
grestore
stroke
grestore
} bind def
47.7938 108.628 o
grestore
0.800 setlinewidth
2 setlinecap
0.690 setgray
gsave
441.476 225.524 47.794 43.2 clipbox
47.79375 118.189738 m
489.269672 118.189738 l
stroke
grestore
0.600 setlinewidth
0 setlinecap
0.000 setgray
gsave
/o {
gsave
newpath
translate
0.6 setlinewidth
1 setlinejoin

0 setlinecap

-0 0 m
-2 0 l

gsave
0.000 setgray
fill
grestore
stroke
grestore
} bind def
47.7938 118.19 o
grestore
0.800 setlinewidth
2 setlinecap
0.690 setgray
gsave
441.476 225.524 47.794 43.2 clipbox
47.79375 126.002478 m
489.269672 126.002478 l
stroke
grestore
0.600 setlinewidth
0 setlinecap
0.000 setgray
gsave
/o {
gsave
newpath
translate
0.6 setlinewidth
1 setlinejoin

0 setlinecap

-0 0 m
-2 0 l

gsave
0.000 setgray
fill
grestore
stroke
grestore
} bind def
47.7938 126.002 o
grestore
0.800 setlinewidth
2 setlinecap
0.690 setgray
gsave
441.476 225.524 47.794 43.2 clipbox
47.79375 132.608054 m
489.269672 132.608054 l
stroke
grestore
0.600 setlinewidth
0 setlinecap
0.000 setgray
gsave
/o {
gsave
newpath
translate
0.6 setlinewidth
1 setlinejoin

0 setlinecap

-0 0 m
-2 0 l

gsave
0.000 setgray
fill
grestore
stroke
grestore
} bind def
47.7938 132.608 o
grestore
0.800 setlinewidth
2 setlinecap
0.690 setgray
gsave
441.476 225.524 47.794 43.2 clipbox
47.79375 138.330065 m
489.269672 138.330065 l
stroke
grestore
0.600 setlinewidth
0 setlinecap
0.000 setgray
gsave
/o {
gsave
newpath
translate
0.6 setlinewidth
1 setlinejoin

0 setlinecap

-0 0 m
-2 0 l

gsave
0.000 setgray
fill
grestore
stroke
grestore
} bind def
47.7938 138.33 o
grestore
0.800 setlinewidth
2 setlinecap
0.690 setgray
gsave
441.476 225.524 47.794 43.2 clipbox
47.79375 143.377237 m
489.269672 143.377237 l
stroke
grestore
0.600 setlinewidth
0 setlinecap
0.000 setgray
gsave
/o {
gsave
newpath
translate
0.6 setlinewidth
1 setlinejoin

0 setlinecap

-0 0 m
-2 0 l

gsave
0.000 setgray
fill
grestore
stroke
grestore
} bind def
47.7938 143.377 o
grestore
0.800 setlinewidth
2 setlinecap
0.690 setgray
gsave
441.476 225.524 47.794 43.2 clipbox
47.79375 177.594432 m
489.269672 177.594432 l
stroke
grestore
0.600 setlinewidth
0 setlinecap
0.000 setgray
gsave
/o {
gsave
newpath
translate
0.6 setlinewidth
1 setlinejoin

0 setlinecap

-0 0 m
-2 0 l

gsave
0.000 setgray
fill
grestore
stroke
grestore
} bind def
47.7938 177.594 o
grestore
0.800 setlinewidth
2 setlinecap
0.690 setgray
gsave
441.476 225.524 47.794 43.2 clipbox
47.79375 194.969191 m
489.269672 194.969191 l
stroke
grestore
0.600 setlinewidth
0 setlinecap
0.000 setgray
gsave
/o {
gsave
newpath
translate
0.6 setlinewidth
1 setlinejoin

0 setlinecap

-0 0 m
-2 0 l

gsave
0.000 setgray
fill
grestore
stroke
grestore
} bind def
47.7938 194.969 o
grestore
0.800 setlinewidth
2 setlinecap
0.690 setgray
gsave
441.476 225.524 47.794 43.2 clipbox
47.79375 207.296779 m
489.269672 207.296779 l
stroke
grestore
0.600 setlinewidth
0 setlinecap
0.000 setgray
gsave
/o {
gsave
newpath
translate
0.6 setlinewidth
1 setlinejoin

0 setlinecap

-0 0 m
-2 0 l

gsave
0.000 setgray
fill
grestore
stroke
grestore
} bind def
47.7938 207.297 o
grestore
0.800 setlinewidth
2 setlinecap
0.690 setgray
gsave
441.476 225.524 47.794 43.2 clipbox
47.79375 216.858799 m
489.269672 216.858799 l
stroke
grestore
0.600 setlinewidth
0 setlinecap
0.000 setgray
gsave
/o {
gsave
newpath
translate
0.6 setlinewidth
1 setlinejoin

0 setlinecap

-0 0 m
-2 0 l

gsave
0.000 setgray
fill
grestore
stroke
grestore
} bind def
47.7938 216.859 o
grestore
0.800 setlinewidth
2 setlinecap
0.690 setgray
gsave
441.476 225.524 47.794 43.2 clipbox
47.79375 224.671538 m
489.269672 224.671538 l
stroke
grestore
0.600 setlinewidth
0 setlinecap
0.000 setgray
gsave
/o {
gsave
newpath
translate
0.6 setlinewidth
1 setlinejoin

0 setlinecap

-0 0 m
-2 0 l

gsave
0.000 setgray
fill
grestore
stroke
grestore
} bind def
47.7938 224.672 o
grestore
0.800 setlinewidth
2 setlinecap
0.690 setgray
gsave
441.476 225.524 47.794 43.2 clipbox
47.79375 231.277115 m
489.269672 231.277115 l
stroke
grestore
0.600 setlinewidth
0 setlinecap
0.000 setgray
gsave
/o {
gsave
newpath
translate
0.6 setlinewidth
1 setlinejoin

0 setlinecap

-0 0 m
-2 0 l

gsave
0.000 setgray
fill
grestore
stroke
grestore
} bind def
47.7938 231.277 o
grestore
0.800 setlinewidth
2 setlinecap
0.690 setgray
gsave
441.476 225.524 47.794 43.2 clipbox
47.79375 236.999126 m
489.269672 236.999126 l
stroke
grestore
0.600 setlinewidth
0 setlinecap
0.000 setgray
gsave
/o {
gsave
newpath
translate
0.6 setlinewidth
1 setlinejoin

0 setlinecap

-0 0 m
-2 0 l

gsave
0.000 setgray
fill
grestore
stroke
grestore
} bind def
47.7938 236.999 o
grestore
0.800 setlinewidth
2 setlinecap
0.690 setgray
gsave
441.476 225.524 47.794 43.2 clipbox
47.79375 242.046298 m
489.269672 242.046298 l
stroke
grestore
0.600 setlinewidth
0 setlinecap
0.000 setgray
gsave
/o {
gsave
newpath
translate
0.6 setlinewidth
1 setlinejoin

0 setlinecap

-0 0 m
-2 0 l

gsave
0.000 setgray
fill
grestore
stroke
grestore
} bind def
47.7938 242.046 o
grestore
/STIXGeneral-Regular 14.000 selectfont
gsave

16.7625 104.642 translate
90 rotate
0 0 m /e glyphshow
6.21599 0 m /x glyphshow
13.216 0 m /e glyphshow
19.432 0 m /c glyphshow
25.648 0 m /u glyphshow
32.648 0 m /t glyphshow
36.54 0 m /i glyphshow
40.432 0 m /o glyphshow
47.432 0 m /n glyphshow
54.432 0 m /space glyphshow
57.932 0 m /t glyphshow
61.824 0 m /i glyphshow
65.716 0 m /m glyphshow
76.608 0 m /e glyphshow
82.8239 0 m /space glyphshow
86.3239 0 m /bracketleft glyphshow
90.9859 0 m /h glyphshow
97.9859 0 m /bracketright glyphshow
grestore
1.500 setlinewidth
2 setlinecap
0.122 0.467 0.706 setrgbcolor
gsave
441.476 225.524 47.794 43.2 clipbox
67.860837 208.028083 m
96.528105 198.005327 l
125.195373 187.966358 l
153.86264 178.221306 l
182.529908 168.010611 l
211.197176 158.114664 l
239.864443 148.175776 l
268.531711 138.259227 l
297.198979 128.404571 l
325.866246 118.651216 l
354.533514 108.967477 l
383.200782 99.241493 l
411.868049 89.736425 l
440.535317 80.020291 l
469.202585 70.386742 l
stroke
grestore
1.000 setlinewidth
0 setlinecap
gsave
441.476 225.524 47.794 43.2 clipbox
/o {
gsave
newpath
translate
1.0 setlinewidth
1 setlinejoin

0 setlinecap

0 -2.5 m
0.663008 -2.5 1.29895 -2.236584 1.767767 -1.767767 c
2.236584 -1.29895 2.5 -0.663008 2.5 0 c
2.5 0.663008 2.236584 1.29895 1.767767 1.767767 c
1.29895 2.236584 0.663008 2.5 0 2.5 c
-0.663008 2.5 -1.29895 2.236584 -1.767767 1.767767 c
-2.236584 1.29895 -2.5 0.663008 -2.5 0 c
-2.5 -0.663008 -2.236584 -1.29895 -1.767767 -1.767767 c
-1.29895 -2.236584 -0.663008 -2.5 0 -2.5 c
cl

gsave
0.122 0.467 0.706 setrgbcolor
fill
grestore
stroke
grestore
} bind def
67.8608 208.028 o
96.5281 198.005 o
125.195 187.966 o
153.863 178.221 o
182.53 168.011 o
211.197 158.115 o
239.864 148.176 o
268.532 138.259 o
297.199 128.405 o
325.866 118.651 o
354.534 108.967 o
383.201 99.2415 o
411.868 89.7364 o
440.535 80.0203 o
469.203 70.3867 o
grestore
1.500 setlinewidth
2 setlinecap
0.000 setgray
gsave
441.476 225.524 47.794 43.2 clipbox
67.860837 258.473028 m
96.528105 243.010606 l
125.195373 228.059985 l
153.86264 213.339756 l
182.529908 198.054351 l
211.197176 183.394485 l
239.864443 169.082839 l
268.531711 154.262447 l
297.198979 139.499344 l
325.866246 125.233761 l
354.533514 110.10368 l
383.200782 96.36016 l
411.868049 81.45455 l
440.535317 67.939318 l
469.202585 53.451097 l
stroke
grestore
1.000 setlinewidth
0 setlinecap
gsave
441.476 225.524 47.794 43.2 clipbox
/o {
gsave
newpath
translate
1.0 setlinewidth
1 setlinejoin

0 setlinecap

0 -2.5 m
0.663008 -2.5 1.29895 -2.236584 1.767767 -1.767767 c
2.236584 -1.29895 2.5 -0.663008 2.5 0 c
2.5 0.663008 2.236584 1.29895 1.767767 1.767767 c
1.29895 2.236584 0.663008 2.5 0 2.5 c
-0.663008 2.5 -1.29895 2.236584 -1.767767 1.767767 c
-2.236584 1.29895 -2.5 0.663008 -2.5 0 c
-2.5 -0.663008 -2.236584 -1.29895 -1.767767 -1.767767 c
-1.29895 -2.236584 -0.663008 -2.5 0 -2.5 c
cl

gsave
0.000 setgray
fill
grestore
stroke
grestore
} bind def
67.8608 258.473 o
96.5281 243.011 o
125.195 228.06 o
153.863 213.34 o
182.53 198.054 o
211.197 183.394 o
239.864 169.083 o
268.532 154.262 o
297.199 139.499 o
325.866 125.234 o
354.534 110.104 o
383.201 96.3602 o
411.868 81.4545 o
440.535 67.9393 o
469.203 53.4511 o
grestore
0.800 setlinewidth
0 setlinejoin
2 setlinecap
gsave
47.79375 43.2 m
47.79375 268.724125 l
stroke
grestore
gsave
489.269672 43.2 m
489.269672 268.724125 l
stroke
grestore
gsave
47.79375 43.2 m
489.269672 43.2 l
stroke
grestore
gsave
47.79375 268.724125 m
489.269672 268.724125 l
stroke
grestore
1.000 setlinewidth
0 setlinecap
0.122 0.467 0.706 setrgbcolor
gsave
67.860837 141.575776 m
175.860837 141.575776 l
178.260837 141.575776 179.460837 142.775776 179.460837 145.175776 c
179.460837 157.175776 l
179.460837 159.575776 178.260837 160.775776 175.860837 160.775776 c
67.860837 160.775776 l
65.460837 160.775776 64.260837 159.575776 64.260837 157.175776 c
64.260837 145.175776 l
64.260837 142.775776 65.460837 141.575776 67.860837 141.575776 c
cl
gsave
1.000 setgray
fill
grestore
stroke
grestore
gsave
67.8608 148.176 translate
0 rotate
/Cmmi10 12.0 selectfont
0 0.890625 moveto
/y glyphshow
/Cmr10 12.0 selectfont
7.98984 0.890625 moveto
/equal glyphshow
/Cmsy10 12.0 selectfont
21.5262 0.890625 moveto
/minus glyphshow
/Cmr10 12.0 selectfont
32.9555 0.890625 moveto
/two glyphshow
/Cmmi10 12.0 selectfont
38.9555 0.890625 moveto
/period glyphshow
/Cmr10 12.0 selectfont
42.2777 0.890625 moveto
/seven glyphshow
48.2777 0.890625 moveto
/zero glyphshow
54.2777 0.890625 moveto
/six glyphshow
/Cmmi10 12.0 selectfont
60.2777 0.890625 moveto
/x glyphshow
/Cmsy10 12.0 selectfont
69.2344 0.890625 moveto
/minus glyphshow
/Cmr10 12.0 selectfont
80.6637 0.890625 moveto
/five glyphshow
/Cmmi10 12.0 selectfont
86.6637 0.890625 moveto
/period glyphshow
/Cmr10 12.0 selectfont
89.9859 0.890625 moveto
/seven glyphshow
95.9859 0.890625 moveto
/five glyphshow
101.986 0.890625 moveto
/zero glyphshow
grestore
0.000 setgray
gsave
239.864443 176.794485 m
347.864443 176.794485 l
350.264443 176.794485 351.464443 177.994485 351.464443 180.394485 c
351.464443 191.394485 l
351.464443 193.794485 350.264443 194.994485 347.864443 194.994485 c
239.864443 194.994485 l
237.464443 194.994485 236.264443 193.794485 236.264443 191.394485 c
236.264443 180.394485 l
236.264443 177.994485 237.464443 176.794485 239.864443 176.794485 c
cl
gsave
1.000 setgray
fill
grestore
stroke
grestore
gsave
239.864 183.394 translate
0 rotate
/Cmmi10 12.0 selectfont
0 0 moveto
/y glyphshow
/Cmr10 12.0 selectfont
7.98984 0 moveto
/equal glyphshow
/Cmsy10 12.0 selectfont
21.5262 0 moveto
/minus glyphshow
/Cmr10 12.0 selectfont
32.9555 0 moveto
/four glyphshow
/Cmmi10 12.0 selectfont
38.9555 0 moveto
/period glyphshow
/Cmr10 12.0 selectfont
42.2777 0 moveto
/zero glyphshow
48.2777 0 moveto
/two glyphshow
54.2777 0 moveto
/four glyphshow
/Cmmi10 12.0 selectfont
60.2777 0 moveto
/x glyphshow
/Cmsy10 12.0 selectfont
69.2344 0 moveto
/minus glyphshow
/Cmr10 12.0 selectfont
80.6637 0 moveto
/nine glyphshow
/Cmmi10 12.0 selectfont
86.6637 0 moveto
/period glyphshow
/Cmr10 12.0 selectfont
89.9859 0 moveto
/one glyphshow
95.9859 0 moveto
/nine glyphshow
101.986 0 moveto
/three glyphshow
grestore
0.800 setgray
gsave
429.129047 232.380375 m
482.269672 232.380375 l
483.603005 232.380375 484.269672 233.047042 484.269672 234.380375 c
484.269672 261.724125 l
484.269672 263.057458 483.603005 263.724125 482.269672 263.724125 c
429.129047 263.724125 l
427.795714 263.724125 427.129047 263.057458 427.129047 261.724125 c
427.129047 234.380375 l
427.129047 233.047042 427.795714 232.380375 429.129047 232.380375 c
cl
gsave
1.000 setgray
fill
grestore
stroke
grestore
1.500 setlinewidth
1 setlinejoin
2 setlinecap
0.122 0.467 0.706 setrgbcolor
gsave
431.129047 256.224125 m
441.129047 256.224125 l
451.129047 256.224125 l
stroke
grestore
1.000 setlinewidth
0 setlinecap
gsave
/o {
gsave
newpath
translate
1.0 setlinewidth
1 setlinejoin

0 setlinecap

0 -2.5 m
0.663008 -2.5 1.29895 -2.236584 1.767767 -1.767767 c
2.236584 -1.29895 2.5 -0.663008 2.5 0 c
2.5 0.663008 2.236584 1.29895 1.767767 1.767767 c
1.29895 2.236584 0.663008 2.5 0 2.5 c
-0.663008 2.5 -1.29895 2.236584 -1.767767 1.767767 c
-2.236584 1.29895 -2.5 0.663008 -2.5 0 c
-2.5 -0.663008 -2.236584 -1.29895 -1.767767 -1.767767 c
-1.29895 -2.236584 -0.663008 -2.5 0 -2.5 c
cl

gsave
0.122 0.467 0.706 setrgbcolor
fill
grestore
stroke
grestore
} bind def
441.129 256.224 o
grestore
0.000 setgray
/STIXGeneral-Regular 10.000 selectfont
gsave

459.129 252.724 translate
0 rotate
0 0 m /M glyphshow
8.88998 0 m /I glyphshow
12.22 0 m /T glyphshow
grestore
1.500 setlinewidth
2 setlinecap
gsave
431.129047 242.05225 m
441.129047 242.05225 l
451.129047 242.05225 l
stroke
grestore
1.000 setlinewidth
0 setlinecap
gsave
/o {
gsave
newpath
translate
1.0 setlinewidth
1 setlinejoin

0 setlinecap

0 -2.5 m
0.663008 -2.5 1.29895 -2.236584 1.767767 -1.767767 c
2.236584 -1.29895 2.5 -0.663008 2.5 0 c
2.5 0.663008 2.236584 1.29895 1.767767 1.767767 c
1.29895 2.236584 0.663008 2.5 0 2.5 c
-0.663008 2.5 -1.29895 2.236584 -1.767767 1.767767 c
-2.236584 1.29895 -2.5 0.663008 -2.5 0 c
-2.5 -0.663008 -2.236584 -1.29895 -1.767767 -1.767767 c
-1.29895 -2.236584 -0.663008 -2.5 0 -2.5 c
cl

gsave
0.000 setgray
fill
grestore
stroke
grestore
} bind def
441.129 242.052 o
grestore
/STIXGeneral-Regular 10.000 selectfont
gsave

459.129 238.552 translate
0 rotate
0 0 m /P glyphshow
5.56999 0 m /F glyphshow
11.13 0 m /I glyphshow
14.46 0 m /C glyphshow
grestore

end
showpage
