%!PS-Adobe-3.0 EPSF-3.0
%%Title: dvd_nusselt_delta_h.eps
%%Creator: Matplotlib v3.5.3, https://matplotlib.org/
%%CreationDate: Tue Apr 18 16:27:09 2023
%%Orientation: portrait
%%BoundingBox: 29 275 583 517
%%HiResBoundingBox: 29.246546 275.813750 582.753454 516.186250
%%EndComments
%%BeginProlog
/mpldict 13 dict def
mpldict begin
/_d { bind def } bind def
/m { moveto } _d
/l { lineto } _d
/r { rlineto } _d
/c { curveto } _d
/cl { closepath } _d
/ce { closepath eofill } _d
/box {
      m
      1 index 0 r
      0 exch r
      neg 0 r
      cl
    } _d
/clipbox {
      box
      clip
      newpath
    } _d
/sc { setcachedevice } _d
%!PS-Adobe-3.0 Resource-Font
%%Creator: Converted from TrueType to Type 3 by Matplotlib.
10 dict begin
/FontName /STIXGeneral-Regular def
/PaintType 0 def
/FontMatrix [0.001 0 0 0.001 0 0] def
/FontBBox [-970 -443 2000 1023] def
/FontType 3 def
/Encoding [/space /period /zero /one /two /four /five /six /seven /eight /nine /C /K /S /W /Scaron /a /c /d /e /g /h /i /l /n /o /p /r /s /t /u /v /z] def
/CharStrings 34 dict dup begin
/.notdef 0 def
/space{250 0 0 0 0 0 sc
ce} _d
/period{250 0 70 -11 181 100 sc
181 43 m
181 28 175 16 164 5 c
153 -6 140 -11 125 -11 c
110 -11 97 -6 86 5 c
75 16 70 29 70 44 c
70 59 75 72 86 83 c
97 94 111 100 126 100 c
141 100 153 94 164 83 c
175 72 181 58 181 43 c

ce} _d
/zero{500 0 24 -14 476 676 sc
476 330 m
476 285 472 243 463 203 c
454 164 441 127 424 94 c
407 61 384 34 354 15 c
324 -4 289 -14 250 -14 c
209 -14 174 -4 143 17 c
112 38 89 65 72 100 c
55 135 43 172 35 211 c
28 250 24 292 24 336 c
24 398 32 454 47 503 c
62 553 88 594 123 627 c
159 660 203 676 254 676 c
319 676 373 644 414 580 c
455 516 476 433 476 330 c

380 325 m
380 430 369 511 346 566 c
324 622 291 650 248 650 c
207 650 175 622 153 566 c
131 510 120 431 120 329 c
120 226 131 148 153 93 c
175 39 207 12 250 12 c
292 12 324 39 346 93 c
369 148 380 225 380 325 c

ce} _d
/one{500 0 111 0 394 676 sc
394 0 m
118 0 l
118 15 l
155 17 180 24 193 35 c
206 47 213 67 213 95 c
213 544 l
213 577 203 593 183 593 c
174 593 159 589 138 581 c
111 571 l
111 585 l
290 676 l
299 673 l
299 76 l
299 54 306 38 319 29 c
332 20 357 15 394 15 c
394 0 l

ce} _d
/two{500 0 29 0 474 676 sc
474 137 m
420 0 l
29 0 l
29 12 l
207 201 l
254 250 287 294 307 335 c
327 376 337 418 337 461 c
337 506 325 540 300 565 c
275 590 241 602 198 602 c
162 602 133 593 112 574 c
91 555 71 521 51 472 c
30 477 l
41 539 64 588 98 623 c
133 658 179 676 238 676 c
293 676 338 659 372 626 c
406 593 423 551 423 500 c
423 425 380 342 295 252 c
130 76 l
364 76 l
386 76 403 80 416 89 c
429 98 444 116 460 143 c
474 137 l

ce} _d
/four{500 0 12 0 473 676 sc
473 167 m
370 167 l
370 0 l
292 0 l
292 167 l
12 167 l
12 231 l
326 676 l
370 676 l
370 231 l
473 231 l
473 167 l

292 231 m
292 574 l
52 231 l
292 231 l

ce} _d
/five{500 0 31 -14 438 688 sc
438 681 m
402 596 l
398 587 389 583 375 583 c
181 583 l
141 498 l
214 484 267 469 300 452 c
333 436 363 409 391 370 c
414 338 426 296 426 243 c
426 195 418 155 402 122 c
387 89 362 60 328 35 c
283 2 226 -14 158 -14 c
120 -14 89 -8 66 3 c
43 14 31 29 31 48 c
31 73 46 86 76 86 c
100 86 125 76 150 55 c
176 34 200 23 221 23 c
256 23 287 40 314 75 c
342 110 356 149 356 192 c
356 256 334 306 289 342 c
231 389 160 412 76 412 c
68 412 64 415 64 420 c
65 425 l
174 662 l
381 662 l
392 662 401 664 407 667 c
414 670 421 677 429 688 c
438 681 l

ce} _d
/six{500 0 34 -14 468 684 sc
446 684 m
448 668 l
369 655 304 623 251 572 c
198 521 165 458 152 383 c
191 413 233 428 279 428 c
338 428 384 409 417 372 c
451 335 468 284 468 219 c
468 154 451 100 417 59 c
378 10 325 -14 258 -14 c
177 -14 118 20 81 87 c
50 144 34 208 34 279 c
34 388 70 480 143 555 c
184 598 227 628 270 645 c
314 663 373 676 446 684 c

378 188 m
378 317 333 382 243 382 c
210 382 182 373 160 355 c
138 338 127 308 127 266 c
127 188 139 126 163 81 c
188 36 223 14 269 14 c
304 14 331 30 350 61 c
369 93 378 135 378 188 c

ce} _d
/seven{500 0 20 -8 449 662 sc
449 646 m
237 -8 l
172 -8 l
370 588 l
155 588 l
126 588 105 583 91 573 c
77 563 59 541 38 506 c
20 515 l
80 662 l
449 662 l
449 646 l

ce} _d
/eight{500 0 56 -14 445 676 sc
445 155 m
445 104 427 63 391 32 c
356 1 308 -14 248 -14 c
192 -14 146 1 110 32 c
74 63 56 102 56 149 c
56 184 65 214 82 239 c
99 264 134 295 186 332 c
136 373 103 407 86 432 c
70 457 62 487 62 520 c
62 567 80 605 116 633 c
153 662 199 676 256 676 c
305 676 345 662 376 634 c
408 607 424 573 424 533 c
424 496 414 467 395 445 c
376 423 341 398 290 371 c
350 331 391 295 412 264 c
434 233 445 196 445 155 c

355 533 m
355 568 345 595 326 616 c
307 637 280 648 246 648 c
212 648 185 639 165 621 c
146 604 136 580 136 549 c
136 518 146 490 165 465 c
185 440 217 415 261 389 c
295 409 319 430 333 452 c
348 475 355 502 355 533 c

271 272 m
212 312 l
183 288 162 264 150 241 c
138 218 132 191 132 158 c
132 113 143 77 166 52 c
189 27 220 14 259 14 c
292 14 318 24 338 44 c
359 65 369 91 369 124 c
369 154 361 180 346 203 c
331 226 306 249 271 272 c

ce} _d
/nine{500 0 30 -22 459 676 sc
59 -22 m
56 -2 l
133 11 197 44 250 95 c
303 146 340 213 360 294 c
321 256 271 237 210 237 c
156 237 112 256 79 293 c
46 330 30 379 30 440 c
30 507 50 563 89 608 c
129 653 179 676 238 676 c
301 676 354 651 395 600 c
438 547 459 478 459 394 c
459 335 449 280 428 228 c
408 177 378 133 339 97 c
298 60 257 33 218 16 c
179 0 126 -13 59 -22 c

362 355 m
362 394 l
362 563 318 648 230 648 c
199 648 174 637 157 614 c
147 601 139 581 132 554 c
125 527 122 501 122 474 c
122 415 133 367 155 332 c
178 297 208 280 245 280 c
272 280 298 286 323 299 c
349 312 362 331 362 355 c

ce} _d
/C{667 0 28 -14 633 676 sc
614 131 m
633 113 l
574 28 483 -14 360 -14 c
263 -14 185 16 124 75 c
60 138 28 221 28 325 c
28 422 58 505 118 572 c
181 641 262 676 361 676 c
404 676 443 671 480 661 c
522 649 545 643 549 643 c
571 643 585 654 591 676 c
611 676 l
620 449 l
597 449 l
586 497 569 534 545 560 c
498 611 444 636 384 636 c
310 636 251 609 208 554 c
165 500 144 429 144 341 c
144 234 168 154 216 102 c
261 54 320 30 394 30 c
438 30 476 38 508 53 c
540 68 575 94 614 131 c

ce} _d
/K{722 0 33 0 723 662 sc
723 0 m
420 0 l
420 19 l
447 20 l
475 21 489 29 489 44 c
489 56 478 75 456 100 c
435 126 400 164 352 214 c
252 317 l
226 296 l
226 111 l
226 74 231 50 242 39 c
253 29 277 22 315 19 c
315 0 l
33 0 l
33 19 l
72 21 97 28 108 41 c
119 54 124 82 124 125 c
124 549 l
124 586 119 611 108 622 c
97 633 73 640 34 643 c
34 662 l
316 662 l
316 643 l
275 640 250 634 240 623 c
231 612 226 587 226 548 c
226 348 l
404 512 l
433 539 453 559 464 573 c
476 587 482 600 482 611 c
482 622 479 629 473 634 c
468 639 457 641 441 642 c
416 643 l
416 662 l
675 662 l
675 643 l
641 640 615 634 597 625 c
580 616 554 595 519 562 c
333 384 l
567 128 l
608 83 639 53 658 39 c
678 26 700 19 723 19 c
723 0 l

ce} _d
/S{556 0 43 -14 491 676 sc
469 463 m
444 463 l
433 504 419 536 403 557 c
362 609 314 635 258 635 c
227 635 203 626 184 608 c
166 591 157 568 157 540 c
157 527 160 514 167 501 c
174 488 181 477 188 468 c
196 459 210 448 229 435 c
248 422 264 411 276 404 c
288 397 308 386 336 369 c
390 338 429 306 454 275 c
479 244 491 210 491 173 c
491 118 472 73 433 38 c
394 3 346 -14 287 -14 c
244 -14 204 -6 169 9 c
152 16 136 20 122 20 c
114 20 107 17 102 11 c
97 5 94 -3 94 -13 c
72 -13 l
43 199 l
65 199 l
110 81 178 22 271 22 c
306 22 335 32 357 53 c
379 74 390 101 390 134 c
390 165 380 192 361 213 c
329 248 273 286 193 329 c
112 372 71 430 71 501 c
71 554 87 597 120 628 c
153 660 194 676 245 676 c
280 676 315 669 350 654 c
368 646 383 642 394 642 c
411 642 422 653 426 676 c
447 676 l
469 463 l

ce} _d
/W{944 0 5 -11 932 662 sc
932 662 m
932 643 l
905 638 887 631 877 623 c
868 616 858 599 849 573 c
773 369 705 174 645 -11 c
630 -11 l
589 102 536 243 470 412 c
316 -11 l
301 -11 l
278 56 244 151 199 274 c
154 397 124 480 109 523 c
92 571 77 603 63 618 c
50 634 30 642 5 643 c
5 662 l
249 662 l
249 643 l
224 642 207 640 198 635 c
189 630 185 623 185 612 c
185 601 189 585 196 565 c
340 189 l
444 472 l
416 547 l
400 590 386 617 375 627 c
364 637 343 642 314 643 c
314 662 l
579 662 l
579 643 l
528 642 502 630 502 608 c
502 599 508 580 519 550 c
662 186 l
788 525 l
799 557 805 583 805 602 c
805 629 782 642 735 643 c
735 662 l
932 662 l

ce} _d
/Scaron{556 0 43 -14 491 924 sc
429 924 m
305 757 l
241 757 l
118 924 l
153 924 l
273 821 l
394 924 l
429 924 l

469 463 m
444 463 l
433 504 419 536 403 557 c
362 609 314 635 258 635 c
227 635 203 626 184 608 c
166 591 157 568 157 540 c
157 527 160 514 167 501 c
174 488 181 477 188 468 c
196 459 210 448 229 435 c
248 422 264 411 276 404 c
288 397 308 386 336 369 c
390 338 429 306 454 275 c
479 244 491 210 491 173 c
491 118 472 73 433 38 c
394 3 346 -14 287 -14 c
244 -14 204 -6 169 9 c
152 16 136 20 122 20 c
114 20 107 17 102 11 c
97 5 94 -3 94 -13 c
72 -13 l
43 199 l
65 199 l
110 81 178 22 271 22 c
306 22 335 32 357 53 c
379 74 390 101 390 134 c
390 165 380 192 361 213 c
329 248 273 286 193 329 c
112 372 71 430 71 501 c
71 554 87 597 120 628 c
153 660 194 676 245 676 c
280 676 315 669 350 654 c
368 646 383 642 394 642 c
411 642 422 653 426 676 c
447 676 l
469 463 l

ce} _d
/a{444 0 37 -10 442 460 sc
442 66 m
442 38 l
417 6 387 -10 352 -10 c
314 -10 293 14 288 63 c
287 63 l
244 14 196 -10 142 -10 c
111 -10 85 -1 66 17 c
47 36 37 61 37 94 c
37 141 60 180 107 211 c
139 232 199 259 287 292 c
287 346 l
287 376 280 398 265 413 c
251 428 232 436 209 436 c
189 436 172 431 159 421 c
146 412 139 400 139 387 c
139 381 140 374 142 367 c
144 360 145 352 145 345 c
145 335 140 326 131 317 c
122 308 112 304 99 304 c
88 304 78 308 69 317 c
60 326 56 337 56 350 c
56 382 73 409 107 430 c
138 450 177 460 222 460 c
276 460 315 445 340 415 c
352 401 360 387 363 372 c
366 358 368 335 368 304 c
368 113 l
368 69 378 47 399 47 c
412 47 427 53 442 66 c

287 127 m
287 268 l
226 247 183 225 159 202 c
136 181 125 156 125 125 c
125 100 131 80 144 67 c
157 54 173 48 194 48 c
216 48 235 53 252 64 c
266 74 275 83 280 92 c
285 101 287 112 287 127 c

ce} _d
/c{444 0 25 -10 412 460 sc
398 156 m
412 147 l
383 91 356 53 330 32 c
296 4 258 -10 215 -10 c
160 -10 114 11 78 52 c
43 94 25 147 25 212 c
25 297 53 362 109 409 c
150 443 195 460 244 460 c
286 460 322 450 352 429 c
383 409 398 385 398 357 c
398 346 393 336 384 327 c
375 319 364 315 351 315 c
328 315 312 330 303 361 c
297 383 l
292 402 285 414 277 421 c
269 428 256 431 238 431 c
197 431 164 415 139 383 c
114 351 102 309 102 257 c
102 200 116 153 145 116 c
174 80 211 62 257 62 c
286 62 310 69 331 82 c
352 96 374 121 398 156 c

ce} _d
/d{500 0 27 -10 491 683 sc
491 42 m
344 -10 l
340 -7 l
340 57 l
308 12 265 -10 212 -10 c
157 -10 112 10 78 49 c
44 89 27 141 27 205 c
27 276 47 336 88 385 c
129 435 178 460 235 460 c
271 460 306 446 340 417 c
340 573 l
340 594 337 607 331 614 c
325 621 313 624 294 624 c
285 624 277 624 272 623 c
272 639 l
333 655 382 670 419 683 c
424 681 l
424 114 l
424 91 427 75 432 68 c
438 61 450 57 468 57 c
472 57 480 57 491 58 c
491 42 l

340 102 m
340 332 l
340 359 330 382 309 402 c
289 422 265 432 238 432 c
200 432 170 415 147 381 c
124 347 113 302 113 245 c
113 184 125 134 150 97 c
175 60 209 42 251 42 c
282 42 307 53 325 74 c
335 85 340 95 340 102 c

ce} _d
/e{444 0 25 -10 424 460 sc
408 164 m
424 157 l
384 46 314 -10 215 -10 c
156 -10 110 10 76 51 c
42 92 25 148 25 217 c
25 288 44 347 82 392 c
120 437 170 460 232 460 c
292 460 338 437 371 391 c
390 364 402 326 405 277 c
97 277 l
100 235 104 203 109 181 c
115 159 126 137 143 114 c
171 77 208 59 254 59 c
287 59 314 67 336 83 c
359 99 383 126 408 164 c

99 309 m
303 309 l
297 351 287 381 273 398 c
260 415 237 424 205 424 c
177 424 154 414 135 394 c
116 375 104 346 99 309 c

ce} _d
/g{500 0 28 -218 470 460 sc
470 388 m
387 388 l
400 359 406 331 406 304 c
406 253 389 214 354 188 c
319 162 285 149 250 149 c
243 149 230 150 212 152 c
193 154 l
180 150 166 141 153 127 c
140 113 133 101 133 91 c
133 76 159 67 211 64 c
340 58 l
377 57 406 46 428 27 c
450 8 461 -18 461 -49 c
461 -88 441 -123 401 -154 c
346 -197 279 -218 201 -218 c
153 -218 112 -208 78 -189 c
45 -170 28 -148 28 -121 c
28 -102 35 -84 50 -65 c
65 -47 90 -25 126 1 c
105 11 90 20 83 27 c
76 34 73 43 73 54 c
73 73 88 96 119 123 c
134 136 149 150 162 163 c
129 180 105 198 90 219 c
76 240 69 266 69 297 c
69 342 85 381 117 412 c
150 444 189 460 236 460 c
263 460 289 455 316 445 c
338 437 l
357 430 376 427 393 427 c
470 427 l
470 388 l

152 338 m
152 335 l
152 287 161 248 180 218 c
199 189 224 174 255 174 c
278 174 296 182 309 198 c
322 215 329 237 329 264 c
329 308 319 348 299 385 c
282 416 258 432 226 432 c
203 432 184 424 171 407 c
158 390 152 367 152 338 c

433 -64 m
433 -45 424 -32 405 -25 c
387 -18 355 -15 309 -15 c
243 -15 189 -11 147 -2 c
127 -26 114 -43 107 -54 c
101 -65 98 -77 98 -88 c
98 -110 111 -128 137 -141 c
164 -154 199 -161 243 -161 c
300 -161 345 -152 380 -134 c
415 -117 433 -93 433 -64 c

ce} _d
/h{500 0 9 0 487 683 sc
487 0 m
275 0 l
275 15 l
304 18 323 25 331 35 c
339 45 343 67 343 102 c
343 300 l
343 371 318 406 269 406 c
249 406 231 401 214 392 c
197 383 178 366 157 343 c
157 102 l
157 67 161 45 169 35 c
177 25 196 18 225 15 c
225 0 l
9 0 l
9 15 l
38 19 55 26 62 35 c
69 44 73 67 73 102 c
73 573 l
73 594 70 608 63 614 c
57 621 43 624 22 624 c
16 624 12 624 10 623 c
10 639 l
37 647 l
88 662 127 674 152 683 c
157 680 l
157 376 l
180 406 203 427 226 440 c
249 453 275 460 304 460 c
386 460 427 407 427 301 c
427 102 l
427 67 430 45 436 36 c
443 27 460 20 487 15 c
487 0 l

ce} _d
/i{278 0 16 0 253 683 sc
180 632 m
180 617 175 605 165 595 c
155 586 143 581 128 581 c
114 581 102 586 92 595 c
83 605 78 617 78 632 c
78 646 83 658 93 668 c
103 678 115 683 129 683 c
144 683 156 678 165 668 c
175 658 180 646 180 632 c

253 0 m
16 0 l
16 15 l
51 17 72 23 81 33 c
90 43 95 67 95 104 c
95 331 l
95 354 93 371 88 380 c
83 389 75 394 62 394 c
46 394 32 392 20 389 c
20 405 l
175 460 l
179 456 l
179 105 l
179 68 183 44 191 34 c
200 24 220 18 253 15 c
253 0 l

ce} _d
/l{278 0 19 0 257 683 sc
257 0 m
21 0 l
21 15 l
52 18 73 24 83 34 c
93 45 98 64 98 92 c
98 561 l
98 585 95 602 89 611 c
83 620 72 625 56 625 c
42 625 30 624 19 623 c
19 639 l
82 654 135 669 177 683 c
182 679 l
182 87 l
182 59 187 40 196 31 c
205 22 226 17 257 15 c
257 0 l

ce} _d
/n{500 0 16 0 485 460 sc
485 0 m
277 0 l
278 15 l
303 17 319 24 327 36 c
336 49 340 72 340 105 c
340 304 l
340 371 316 405 267 405 c
250 405 235 401 220 393 c
205 385 187 370 164 348 c
164 72 l
164 52 168 38 177 30 c
186 22 204 17 229 15 c
229 0 l
18 0 l
18 15 l
43 17 60 23 68 33 c
76 44 80 64 80 94 c
80 337 l
80 362 78 379 73 388 c
68 397 59 402 45 402 c
32 402 22 401 16 398 c
16 415 l
63 428 108 443 153 460 c
161 457 l
161 379 l
162 379 l
209 433 257 460 306 460 c
344 460 373 447 393 420 c
414 393 424 355 424 306 c
424 85 l
424 58 428 41 436 32 c
444 23 460 18 485 15 c
485 0 l

ce} _d
/o{500 0 29 -10 470 460 sc
470 231 m
470 161 449 103 407 58 c
366 13 312 -10 245 -10 c
184 -10 132 12 91 57 c
50 102 29 159 29 228 c
29 297 50 353 91 396 c
132 439 187 460 254 460 c
316 460 367 439 408 396 c
449 354 470 299 470 231 c

380 204 m
380 280 363 339 330 382 c
303 415 272 432 235 432 c
200 432 172 418 151 389 c
130 361 119 322 119 273 c
119 188 137 119 172 68 c
195 35 225 18 262 18 c
299 18 327 34 348 67 c
369 100 380 146 380 204 c

ce} _d
/p{500 0 5 -217 470 460 sc
159 458 m
159 381 l
201 434 249 460 303 460 c
352 460 392 440 423 400 c
454 360 470 309 470 247 c
470 174 450 113 409 64 c
369 15 319 -10 260 -10 c
239 -10 222 -7 207 -1 c
193 5 177 16 159 33 c
159 -124 l
159 -155 164 -175 175 -184 c
186 -193 210 -198 247 -199 c
247 -217 l
5 -217 l
5 -200 l
34 -197 53 -192 62 -183 c
71 -174 75 -157 75 -131 c
75 337 l
75 360 72 376 67 383 c
62 390 51 394 34 394 c
23 394 15 394 9 393 c
9 409 l
56 423 104 440 153 460 c
159 458 l

159 334 m
159 88 l
159 73 170 59 193 44 c
216 29 240 22 263 22 c
299 22 328 39 350 73 c
373 107 384 152 384 207 c
384 266 373 312 350 347 c
328 382 298 400 261 400 c
238 400 215 393 192 378 c
170 363 159 349 159 334 c

ce} _d
/r{333 0 5 0 335 460 sc
160 458 m
160 366 l
185 402 206 427 223 440 c
240 453 259 460 280 460 c
297 460 311 455 320 446 c
330 437 335 424 335 407 c
335 393 331 382 324 374 c
317 366 308 362 296 362 c
283 362 270 369 256 382 c
245 392 237 397 230 397 c
216 397 201 387 184 368 c
168 349 160 331 160 315 c
160 90 l
160 61 166 42 177 32 c
188 22 211 16 245 15 c
245 0 l
5 0 l
5 15 l
37 21 57 28 64 35 c
72 42 76 59 76 84 c
76 334 l
76 356 73 371 68 380 c
63 389 55 394 42 394 c
31 394 20 393 7 390 c
7 406 l
49 419 98 437 155 460 c
160 458 l

ce} _d
/s{389 0 51 -10 348 459 sc
156 301 m
260 238 l
293 218 316 199 329 182 c
342 165 348 142 348 115 c
348 82 334 52 306 27 c
279 2 246 -10 208 -10 c
177 -10 152 -7 135 -1 c
117 5 102 8 89 8 c
78 8 70 4 65 -4 c
52 -4 l
52 153 l
68 153 l
79 104 94 69 114 46 c
134 23 161 12 195 12 c
220 12 240 19 255 33 c
270 47 278 65 278 86 c
278 117 260 142 225 161 c
171 191 l
91 236 51 284 51 336 c
51 375 63 405 88 426 c
113 448 147 459 189 459 c
218 459 241 455 256 448 c
268 443 277 440 284 440 c
289 440 294 443 300 450 c
311 450 l
316 314 l
301 314 l
290 359 275 391 258 409 c
241 428 218 437 188 437 c
165 437 147 431 133 420 c
120 409 113 392 113 369 c
113 358 117 345 124 332 c
132 319 143 309 156 301 c

ce} _d
/t{278 0 13 -10 279 579 sc
266 77 m
279 66 l
247 15 207 -10 158 -10 c
99 -10 70 32 70 117 c
70 418 l
17 418 l
14 420 13 422 13 425 c
13 430 19 437 30 444 c
55 459 88 494 127 551 c
128 553 131 557 136 563 c
141 570 145 575 147 579 c
152 579 154 575 154 566 c
154 450 l
255 450 l
255 418 l
154 418 l
154 132 l
154 100 158 77 166 63 c
174 49 187 42 206 42 c
226 42 246 54 266 77 c

ce} _d
/u{500 0 9 -10 480 450 sc
480 50 m
480 36 l
428 22 382 7 343 -9 c
338 -6 l
338 76 l
336 76 l
294 19 246 -10 193 -10 c
155 -10 125 2 103 25 c
82 48 71 79 71 118 c
71 369 l
71 394 67 411 58 420 c
49 429 33 435 9 436 c
9 450 l
155 450 l
155 127 l
155 104 162 85 175 70 c
189 55 206 48 226 48 c
259 48 287 58 310 79 c
319 87 325 94 328 101 c
331 108 333 120 333 137 c
333 368 l
333 394 328 411 319 418 c
310 426 290 431 259 433 c
259 450 l
417 450 l
417 107 l
417 84 421 68 428 61 c
436 54 451 50 474 50 c
480 50 l

ce} _d
/v{500 0 19 -14 477 450 sc
477 450 m
477 435 l
462 434 450 429 443 420 c
436 411 425 390 412 357 c
284 36 l
271 3 261 -14 256 -14 c
251 -14 245 -5 238 12 c
237 14 235 17 234 22 c
233 27 231 30 230 33 c
110 320 l
89 371 73 402 63 414 c
53 427 38 434 19 435 c
19 450 l
215 450 l
215 435 l
198 434 186 431 179 427 c
172 423 169 417 169 408 c
169 397 172 385 178 370 c
280 114 l
379 373 l
383 383 385 393 385 403 c
385 422 369 432 338 435 c
338 450 l
477 450 l

ce} _d
/z{444 0 27 0 418 450 sc
418 136 m
403 0 l
27 0 l
27 15 l
293 420 l
158 420 l
127 420 105 414 94 403 c
83 392 76 369 71 332 c
53 332 l
57 450 l
403 450 l
403 435 l
134 30 l
267 30 l
323 30 358 39 373 57 c
382 68 391 96 400 140 c
418 136 l

ce} _d
end readonly def

/BuildGlyph {
 exch begin
 CharStrings exch
 2 copy known not {pop /.notdef} if
 true 3 1 roll get exec
 end
} _d

/BuildChar {
 1 index /Encoding get exch get
 1 index /BuildGlyph get exec
} _d

FontName currentdict end definefont pop
%!PS-Adobe-3.0 Resource-Font
%%Creator: Converted from TrueType to Type 3 by Matplotlib.
10 dict begin
/FontName /Cmmi10 def
/PaintType 0 def
/FontMatrix [0.00048828125 0 0 0.00048828125 0 0] def
/FontBBox [-70 -512 2146 1536] def
/FontType 3 def
/Encoding [/h /delta /L /slash] def
/CharStrings 5 dict dup begin
/.notdef 0 def
/h{1180 0 109 -23 1124 1421 sc
109 37 m
109 45 110 51 111 55 c
408 1239 l
413 1262 417 1281 418 1294 c
418 1316 374 1327 285 1327 c
271 1327 264 1336 264 1354 c
265 1357 266 1363 268 1372 c
271 1381 274 1387 277 1392 c
281 1397 286 1399 293 1399 c
569 1421 l
575 1421 l
575 1420 577 1418 582 1415 c
587 1413 589 1412 590 1411 c
593 1404 594 1399 594 1395 c
434 756 l
518 855 618 905 733 905 c
781 905 822 897 857 880 c
892 863 920 838 939 804 c
959 771 969 731 969 684 c
969 628 956 560 931 481 c
906 402 875 313 838 215 c
819 170 809 129 809 92 c
809 51 825 31 856 31 c
909 31 954 59 989 116 c
1025 173 1050 235 1065 301 c
1068 309 1073 313 1081 313 c
1106 313 l
1111 313 1116 311 1119 307 c
1122 304 1124 300 1124 295 c
1124 294 1123 292 1122 289 c
1110 240 1092 191 1068 143 c
1045 96 1015 56 979 24 c
943 -7 901 -23 852 -23 c
804 -23 763 -7 729 26 c
695 59 678 100 678 147 c
678 172 683 199 694 227 c
733 330 765 421 790 502 c
816 583 829 654 829 715 c
829 754 821 787 806 813 c
791 839 765 852 729 852 c
656 852 592 829 537 784 c
482 739 435 680 395 606 c
256 47 l
251 26 240 10 225 -3 c
210 -16 192 -23 172 -23 c
155 -23 140 -17 127 -5 c
115 6 109 20 109 37 c

ce} _d
/delta{909 0 82 -31 924 1460 sc
410 -31 m
363 -31 319 -22 278 -4 c
237 13 202 39 171 72 c
141 105 119 142 104 183 c
89 224 82 269 82 317 c
82 402 102 485 142 565 c
183 646 238 715 307 774 c
377 833 453 872 535 893 c
495 967 464 1031 443 1084 c
422 1138 412 1193 412 1249 c
412 1290 422 1327 441 1358 c
460 1390 487 1415 521 1433 c
555 1451 593 1460 635 1460 c
676 1460 756 1446 877 1419 c
908 1412 924 1393 924 1364 c
924 1341 916 1321 899 1302 c
882 1283 863 1274 840 1274 c
823 1274 808 1278 795 1285 c
782 1293 761 1307 732 1326 c
703 1345 678 1360 655 1370 c
632 1381 609 1386 584 1386 c
556 1386 531 1377 508 1360 c
486 1343 475 1321 475 1294 c
475 1251 494 1201 532 1144 c
571 1088 625 1016 696 928 c
777 825 817 712 817 588 c
817 527 808 460 790 389 c
773 318 747 250 713 187 c
680 124 637 71 584 30 c
532 -11 474 -31 410 -31 c

414 25 m
467 25 513 53 551 108 c
590 163 619 229 638 305 c
658 382 668 446 668 498 c
668 600 632 715 561 842 c
489 822 427 780 375 716 c
323 652 284 578 257 495 c
230 412 217 333 217 258 c
217 193 234 137 268 92 c
302 47 351 25 414 25 c

ce} _d
/L{1393 0 76 0 1321 1399 sc
96 0 m
83 0 76 9 76 27 c
77 30 78 36 80 44 c
82 53 85 59 88 64 c
92 69 97 72 102 72 c
185 72 243 77 276 86 c
294 92 307 110 315 141 c
596 1266 l
599 1279 600 1289 600 1294 c
600 1309 592 1317 575 1319 c
550 1324 501 1327 428 1327 c
415 1327 408 1336 408 1354 c
413 1371 416 1383 419 1389 c
422 1396 429 1399 442 1399 c
1047 1399 l
1059 1399 1065 1390 1065 1372 c
1063 1358 1061 1347 1058 1339 c
1055 1331 1049 1327 1038 1327 c
937 1327 870 1324 836 1317 c
803 1311 782 1291 774 1257 c
494 133 l
488 116 485 101 485 88 c
485 77 508 72 555 72 c
745 72 l
852 72 939 93 1006 136 c
1073 179 1122 227 1154 280 c
1186 334 1213 390 1234 447 c
1256 505 1272 535 1282 537 c
1300 537 l
1314 537 1321 528 1321 510 c
1139 14 l
1137 5 1131 0 1120 0 c
96 0 l

ce} _d
/slash{1024 0 115 -512 907 1536 sc
115 -471 m
115 -467 116 -464 117 -463 c
829 1511 l
832 1519 836 1525 843 1529 c
850 1534 857 1536 866 1536 c
878 1536 888 1532 895 1525 c
903 1518 907 1508 907 1495 c
907 1487 l
195 -487 l
187 -504 174 -512 156 -512 c
145 -512 135 -508 127 -500 c
119 -492 115 -482 115 -471 c

ce} _d
end readonly def

/BuildGlyph {
 exch begin
 CharStrings exch
 2 copy known not {pop /.notdef} if
 true 3 1 roll get exec
 end
} _d

/BuildChar {
 1 index /Encoding get exch get
 1 index /BuildGlyph get exec
} _d

FontName currentdict end definefont pop
%!PS-Adobe-3.0 Resource-Font
%%Creator: Converted from TrueType to Type 3 by Matplotlib.
10 dict begin
/FontName /Cmr10 def
/PaintType 0 def
/FontMatrix [0.00048828125 0 0 0.00048828125 0 0] def
/FontBBox [-90 -512 2066 1536] def
/FontType 3 def
/Encoding [/u /N] def
/CharStrings 3 dict dup begin
/.notdef 0 def
/u{1137 0 61 -23 1100 905 sc
221 244 m
221 696 l
221 733 215 759 204 775 c
193 792 178 802 157 805 c
136 809 104 811 61 811 c
61 883 l
371 905 l
371 244 l
371 191 375 149 382 119 c
390 90 406 68 431 53 c
456 38 496 31 551 31 c
624 31 683 62 726 123 c
769 184 791 254 791 332 c
791 696 l
791 733 785 759 774 775 c
763 792 747 802 726 805 c
706 809 674 811 631 811 c
631 883 l
940 905 l
940 186 l
940 150 945 124 956 107 c
967 91 983 81 1004 77 c
1025 74 1057 72 1100 72 c
1100 0 l
797 -23 l
797 150 l
772 99 736 57 691 25 c
646 -7 596 -23 541 -23 c
443 -23 365 -2 307 39 c
250 81 221 149 221 244 c

ce} _d
/N{1536 0 63 0 1470 1399 sc
63 0 m
63 72 l
204 72 274 112 274 193 c
274 1315 l
229 1323 159 1327 63 1327 c
63 1399 l
455 1399 l
462 1399 466 1396 469 1391 c
1194 324 l
1194 1206 l
1194 1287 1124 1327 983 1327 c
983 1399 l
1470 1399 l
1470 1327 l
1330 1327 1260 1287 1260 1206 c
1260 18 l
1260 14 1257 10 1252 6 c
1247 2 1242 0 1239 0 c
1214 0 l
1207 0 1203 3 1200 8 c
340 1274 l
340 193 l
340 112 410 72 551 72 c
551 0 l
63 0 l

ce} _d
end readonly def

/BuildGlyph {
 exch begin
 CharStrings exch
 2 copy known not {pop /.notdef} if
 true 3 1 roll get exec
 end
} _d

/BuildChar {
 1 index /Encoding get exch get
 1 index /BuildGlyph get exec
} _d

FontName currentdict end definefont pop
end
%%EndProlog
mpldict begin
29.247 275.814 translate
553.507 240.373 0 0 clipbox
gsave
0 0 m
553.506908 0 l
553.506908 240.3725 l
0 240.3725 l
cl
1.000 setgray
fill
grestore
gsave
54.2 44.0125 m
406.478794 44.0125 l
406.478794 233.1725 l
54.2 233.1725 l
cl
1.000 setgray
fill
grestore
0.800 setlinewidth
1 setlinejoin
2 setlinecap
[] 0 setdash
0.690 setgray
gsave
352.279 189.16 54.2 44.013 clipbox
54.2 44.0125 m
54.2 233.1725 l
stroke
grestore
0 setlinecap
0.000 setgray
gsave
/o {
gsave
newpath
translate
0.8 setlinewidth
1 setlinejoin

0 setlinecap

0 0 m
0 -3.5 l

gsave
0.000 setgray
fill
grestore
stroke
grestore
} bind def
54.2 44.0125 o
grestore
gsave
46.700000 28.809375 translate
0.000000 rotate
/STIXGeneral-Regular 12.0 selectfont
0.000000 0.890625 moveto
/zero glyphshow
5.999985 0.890625 moveto
/period glyphshow
8.999969 0.890625 moveto
/zero glyphshow
grestore
2 setlinecap
0.690 setgray
gsave
352.279 189.16 54.2 44.013 clipbox
124.655759 44.0125 m
124.655759 233.1725 l
stroke
grestore
0 setlinecap
0.000 setgray
gsave
/o {
gsave
newpath
translate
0.8 setlinewidth
1 setlinejoin

0 setlinecap

0 0 m
0 -3.5 l

gsave
0.000 setgray
fill
grestore
stroke
grestore
} bind def
124.656 44.0125 o
grestore
gsave
117.155759 28.809375 translate
0.000000 rotate
/STIXGeneral-Regular 12.0 selectfont
0.000000 0.890625 moveto
/zero glyphshow
5.999985 0.890625 moveto
/period glyphshow
8.999969 0.890625 moveto
/two glyphshow
grestore
2 setlinecap
0.690 setgray
gsave
352.279 189.16 54.2 44.013 clipbox
195.111518 44.0125 m
195.111518 233.1725 l
stroke
grestore
0 setlinecap
0.000 setgray
gsave
/o {
gsave
newpath
translate
0.8 setlinewidth
1 setlinejoin

0 setlinecap

0 0 m
0 -3.5 l

gsave
0.000 setgray
fill
grestore
stroke
grestore
} bind def
195.112 44.0125 o
grestore
gsave
187.611518 28.809375 translate
0.000000 rotate
/STIXGeneral-Regular 12.0 selectfont
0.000000 0.890625 moveto
/zero glyphshow
5.999985 0.890625 moveto
/period glyphshow
8.999969 0.890625 moveto
/four glyphshow
grestore
2 setlinecap
0.690 setgray
gsave
352.279 189.16 54.2 44.013 clipbox
265.567276 44.0125 m
265.567276 233.1725 l
stroke
grestore
0 setlinecap
0.000 setgray
gsave
/o {
gsave
newpath
translate
0.8 setlinewidth
1 setlinejoin

0 setlinecap

0 0 m
0 -3.5 l

gsave
0.000 setgray
fill
grestore
stroke
grestore
} bind def
265.567 44.0125 o
grestore
gsave
258.067276 28.809375 translate
0.000000 rotate
/STIXGeneral-Regular 12.0 selectfont
0.000000 0.796875 moveto
/zero glyphshow
5.999985 0.796875 moveto
/period glyphshow
8.999969 0.796875 moveto
/six glyphshow
grestore
2 setlinecap
0.690 setgray
gsave
352.279 189.16 54.2 44.013 clipbox
336.023035 44.0125 m
336.023035 233.1725 l
stroke
grestore
0 setlinecap
0.000 setgray
gsave
/o {
gsave
newpath
translate
0.8 setlinewidth
1 setlinejoin

0 setlinecap

0 0 m
0 -3.5 l

gsave
0.000 setgray
fill
grestore
stroke
grestore
} bind def
336.023 44.0125 o
grestore
gsave
328.523035 28.809375 translate
0.000000 rotate
/STIXGeneral-Regular 12.0 selectfont
0.000000 0.890625 moveto
/zero glyphshow
5.999985 0.890625 moveto
/period glyphshow
8.999969 0.890625 moveto
/eight glyphshow
grestore
2 setlinecap
0.690 setgray
gsave
352.279 189.16 54.2 44.013 clipbox
406.478794 44.0125 m
406.478794 233.1725 l
stroke
grestore
0 setlinecap
0.000 setgray
gsave
/o {
gsave
newpath
translate
0.8 setlinewidth
1 setlinejoin

0 setlinecap

0 0 m
0 -3.5 l

gsave
0.000 setgray
fill
grestore
stroke
grestore
} bind def
406.479 44.0125 o
grestore
gsave
398.978794 28.809375 translate
0.000000 rotate
/STIXGeneral-Regular 12.0 selectfont
0.000000 0.890625 moveto
/one glyphshow
5.999985 0.890625 moveto
/period glyphshow
8.999969 0.890625 moveto
/zero glyphshow
grestore
gsave
211.339397 11.200000 translate
0.000000 rotate
/Cmmi10 14.0 selectfont
0.000000 0.500000 moveto
/h glyphshow
8.066406 0.500000 moveto
/delta glyphshow
/Cmmi10 9.799999999999999 selectfont
14.280273 -1.880875 moveto
/h glyphshow
/Cmmi10 14.0 selectfont
20.819586 0.500000 moveto
/slash glyphshow
27.819586 0.500000 moveto
/L glyphshow
grestore
2 setlinecap
0.690 setgray
gsave
352.279 189.16 54.2 44.013 clipbox
54.2 44.0125 m
406.478794 44.0125 l
stroke
grestore
0 setlinecap
0.000 setgray
gsave
/o {
gsave
newpath
translate
0.8 setlinewidth
1 setlinejoin

0 setlinecap

-0 0 m
-3.5 0 l

gsave
0.000 setgray
fill
grestore
stroke
grestore
} bind def
54.2 44.0125 o
grestore
gsave
26.200000 39.910938 translate
0.000000 rotate
/STIXGeneral-Regular 12.0 selectfont
0.000000 0.750000 moveto
/eight glyphshow
5.999985 0.750000 moveto
/period glyphshow
8.999969 0.750000 moveto
/seven glyphshow
14.999954 0.750000 moveto
/five glyphshow
grestore
2 setlinecap
0.690 setgray
gsave
352.279 189.16 54.2 44.013 clipbox
54.2 85.404185 m
406.478794 85.404185 l
stroke
grestore
0 setlinecap
0.000 setgray
gsave
/o {
gsave
newpath
translate
0.8 setlinewidth
1 setlinejoin

0 setlinecap

-0 0 m
-3.5 0 l

gsave
0.000 setgray
fill
grestore
stroke
grestore
} bind def
54.2 85.4042 o
grestore
gsave
26.200000 81.302622 translate
0.000000 rotate
/STIXGeneral-Regular 12.0 selectfont
0.000000 0.890625 moveto
/eight glyphshow
5.999985 0.890625 moveto
/period glyphshow
8.999969 0.890625 moveto
/eight glyphshow
14.999954 0.890625 moveto
/zero glyphshow
grestore
2 setlinecap
0.690 setgray
gsave
352.279 189.16 54.2 44.013 clipbox
54.2 126.79587 m
406.478794 126.79587 l
stroke
grestore
0 setlinecap
0.000 setgray
gsave
/o {
gsave
newpath
translate
0.8 setlinewidth
1 setlinejoin

0 setlinecap

-0 0 m
-3.5 0 l

gsave
0.000 setgray
fill
grestore
stroke
grestore
} bind def
54.2 126.796 o
grestore
gsave
26.200000 122.694307 translate
0.000000 rotate
/STIXGeneral-Regular 12.0 selectfont
0.000000 0.750000 moveto
/eight glyphshow
5.999985 0.750000 moveto
/period glyphshow
8.999969 0.750000 moveto
/eight glyphshow
14.999954 0.750000 moveto
/five glyphshow
grestore
2 setlinecap
0.690 setgray
gsave
352.279 189.16 54.2 44.013 clipbox
54.2 168.187555 m
406.478794 168.187555 l
stroke
grestore
0 setlinecap
0.000 setgray
gsave
/o {
gsave
newpath
translate
0.8 setlinewidth
1 setlinejoin

0 setlinecap

-0 0 m
-3.5 0 l

gsave
0.000 setgray
fill
grestore
stroke
grestore
} bind def
54.2 168.188 o
grestore
gsave
26.200000 164.085992 translate
0.000000 rotate
/STIXGeneral-Regular 12.0 selectfont
0.000000 0.890625 moveto
/eight glyphshow
5.999985 0.890625 moveto
/period glyphshow
8.999969 0.890625 moveto
/nine glyphshow
14.999954 0.890625 moveto
/zero glyphshow
grestore
2 setlinecap
0.690 setgray
gsave
352.279 189.16 54.2 44.013 clipbox
54.2 209.57924 m
406.478794 209.57924 l
stroke
grestore
0 setlinecap
0.000 setgray
gsave
/o {
gsave
newpath
translate
0.8 setlinewidth
1 setlinejoin

0 setlinecap

-0 0 m
-3.5 0 l

gsave
0.000 setgray
fill
grestore
stroke
grestore
} bind def
54.2 209.579 o
grestore
gsave
26.200000 205.477677 translate
0.000000 rotate
/STIXGeneral-Regular 12.0 selectfont
0.000000 0.750000 moveto
/eight glyphshow
5.999985 0.750000 moveto
/period glyphshow
8.999969 0.750000 moveto
/nine glyphshow
14.999954 0.750000 moveto
/five glyphshow
grestore
gsave
19.168750 129.092500 translate
90.000000 rotate
/Cmr10 14.0 selectfont
0.000000 0.562500 moveto
/N glyphshow
10.500000 0.562500 moveto
/u glyphshow
0.0 12.25 18.2724609375 0.875 rectfill
grestore
1.500 setlinewidth
2 setlinecap
0.122 0.467 0.706 setrgbcolor
gsave
352.279 189.16 54.2 44.013 clipbox
54.2 142.598901 m
57.722788 193.370001 l
61.245576 205.301612 l
64.768364 185.156936 l
68.291152 170.535786 l
71.81394 156.227199 l
75.336728 149.205079 l
78.859516 154.153684 l
82.382304 156.243923 l
85.905091 157.278758 l
89.427879 162.08669 l
92.950667 165.847952 l
96.473455 167.99457 l
99.996243 166.306154 l
103.519031 166.380021 l
107.041819 171.669283 l
110.564607 174.961896 l
114.087395 176.452193 l
117.610183 178.179689 l
121.132971 168.759724 l
124.655759 171.01449 l
128.178547 173.429394 l
131.701335 171.141137 l
135.224123 176.16798 l
138.746911 173.702166 l
142.269698 165.599633 l
145.792486 170.634008 l
149.315274 176.714042 l
152.838062 180.868787 l
156.36085 172.355411 l
159.883638 176.655541 l
163.406426 167.740492 l
166.929214 167.401056 l
170.452002 171.504633 l
173.97479 170.121059 l
177.497578 174.157993 l
181.020366 176.830364 l
184.543154 168.124415 l
188.065942 172.217218 l
191.58873 176.334982 l
195.111518 165.75766 l
198.634306 170.749124 l
202.157093 162.901042 l
205.679881 170.669822 l
209.202669 177.523977 l
212.725457 164.698637 l
216.248245 172.505876 l
219.771033 174.599819 l
223.293821 175.163203 l
226.816609 170.73373 l
230.339397 169.912672 l
233.862185 167.705652 l
237.384973 169.99787 l
240.907761 168.347103 l
244.430549 171.196512 l
247.953337 169.952364 l
251.476125 170.912786 l
254.998913 177.634348 l
258.5217 168.606121 l
262.044488 176.142572 l
265.567276 173.587845 l
269.090064 170.509032 l
272.612852 173.498971 l
276.13564 169.636857 l
279.658428 173.478076 l
283.181216 166.200275 l
286.704004 170.221098 l
290.226792 171.299899 l
293.74958 166.235768 l
297.272368 177.252156 l
300.795156 171.5373 l
304.317944 163.587734 l
307.840732 174.96445 l
311.36352 172.979849 l
314.886308 169.078532 l
318.409095 169.149062 l
321.931883 167.732564 l
325.454671 169.065257 l
328.977459 170.463657 l
332.500247 168.437297 l
336.023035 178.557469 l
339.545823 171.476716 l
343.068611 170.723683 l
346.591399 167.750561 l
350.114187 166.158583 l
353.636975 163.660964 l
357.159763 165.537101 l
360.682551 168.220606 l
364.205339 168.684902 l
367.728127 173.544752 l
371.250915 167.893983 l
374.773702 165.449096 l
378.29649 162.021965 l
381.819278 176.559393 l
385.342066 173.645575 l
388.864854 188.945845 l
392.387642 172.036541 l
395.91043 185.436468 l
399.433218 184.088297 l
402.956006 170.069075 l
406.478794 166.140429 l
stroke
grestore
1.000 setlinewidth
0 setlinecap
gsave
352.279 189.16 54.2 44.013 clipbox
/o {
gsave
newpath
translate
1.0 setlinewidth
1 setlinejoin

0 setlinecap

0 -1.5 m
0.397805 -1.5 0.77937 -1.341951 1.06066 -1.06066 c
1.341951 -0.77937 1.5 -0.397805 1.5 0 c
1.5 0.397805 1.341951 0.77937 1.06066 1.06066 c
0.77937 1.341951 0.397805 1.5 0 1.5 c
-0.397805 1.5 -0.77937 1.341951 -1.06066 1.06066 c
-1.341951 0.77937 -1.5 0.397805 -1.5 0 c
-1.5 -0.397805 -1.341951 -0.77937 -1.06066 -1.06066 c
-0.77937 -1.341951 -0.397805 -1.5 0 -1.5 c
cl

gsave
0.122 0.467 0.706 setrgbcolor
fill
grestore
stroke
grestore
} bind def
54.2 142.599 o
57.7228 193.37 o
61.2456 205.302 o
64.7684 185.157 o
68.2912 170.536 o
71.8139 156.227 o
75.3367 149.205 o
78.8595 154.154 o
82.3823 156.244 o
85.9051 157.279 o
89.4279 162.087 o
92.9507 165.848 o
96.4735 167.995 o
99.9962 166.306 o
103.519 166.38 o
107.042 171.669 o
110.565 174.962 o
114.087 176.452 o
117.61 178.18 o
121.133 168.76 o
124.656 171.014 o
128.179 173.429 o
131.701 171.141 o
135.224 176.168 o
138.747 173.702 o
142.27 165.6 o
145.792 170.634 o
149.315 176.714 o
152.838 180.869 o
156.361 172.355 o
159.884 176.656 o
163.406 167.74 o
166.929 167.401 o
170.452 171.505 o
173.975 170.121 o
177.498 174.158 o
181.02 176.83 o
184.543 168.124 o
188.066 172.217 o
191.589 176.335 o
195.112 165.758 o
198.634 170.749 o
202.157 162.901 o
205.68 170.67 o
209.203 177.524 o
212.725 164.699 o
216.248 172.506 o
219.771 174.6 o
223.294 175.163 o
226.817 170.734 o
230.339 169.913 o
233.862 167.706 o
237.385 169.998 o
240.908 168.347 o
244.431 171.197 o
247.953 169.952 o
251.476 170.913 o
254.999 177.634 o
258.522 168.606 o
262.044 176.143 o
265.567 173.588 o
269.09 170.509 o
272.613 173.499 o
276.136 169.637 o
279.658 173.478 o
283.181 166.2 o
286.704 170.221 o
290.227 171.3 o
293.75 166.236 o
297.272 177.252 o
300.795 171.537 o
304.318 163.588 o
307.841 174.964 o
311.364 172.98 o
314.886 169.079 o
318.409 169.149 o
321.932 167.733 o
325.455 169.065 o
328.977 170.464 o
332.5 168.437 o
336.023 178.557 o
339.546 171.477 o
343.069 170.724 o
346.591 167.751 o
350.114 166.159 o
353.637 163.661 o
357.16 165.537 o
360.683 168.221 o
364.205 168.685 o
367.728 173.545 o
371.251 167.894 o
374.774 165.449 o
378.296 162.022 o
381.819 176.559 o
385.342 173.646 o
388.865 188.946 o
392.388 172.037 o
395.91 185.436 o
399.433 184.088 o
402.956 170.069 o
406.479 166.14 o
grestore
1.500 setlinewidth
2 setlinecap
1.000 0.498 0.055 setrgbcolor
gsave
352.279 189.16 54.2 44.013 clipbox
54.2 142.598901 m
57.722788 139.346402 l
61.245576 139.945189 l
64.768364 141.292001 l
68.291152 142.248125 l
71.81394 143.322871 l
75.336728 144.331661 l
78.859516 143.865813 l
82.382304 145.135209 l
85.905091 146.231619 l
89.427879 145.241133 l
92.950667 146.999533 l
96.473455 145.926356 l
99.996243 146.933547 l
103.519031 147.127854 l
107.041819 148.264581 l
110.564607 146.192693 l
114.087395 146.558127 l
117.610183 148.679121 l
121.132971 145.755903 l
124.655759 147.169647 l
128.178547 149.397499 l
131.701335 147.901905 l
135.224123 150.850159 l
138.746911 149.881913 l
142.269698 149.104667 l
145.792486 150.650912 l
149.315274 150.385353 l
152.838062 148.878899 l
156.36085 151.362546 l
159.883638 151.072296 l
163.406426 151.149587 l
166.929214 147.415802 l
170.452002 152.226406 l
173.97479 150.562844 l
177.497578 152.806328 l
181.020366 148.680663 l
184.543154 148.807452 l
188.065942 152.814371 l
191.58873 152.222985 l
195.111518 154.557704 l
198.634306 153.732251 l
202.157093 154.31225 l
205.679881 153.527636 l
209.202669 154.201284 l
212.725457 152.234977 l
216.248245 155.599361 l
219.771033 151.276726 l
223.293821 153.664119 l
226.816609 155.119089 l
230.339397 153.803968 l
233.862185 154.812276 l
237.384973 156.067321 l
240.907761 154.022038 l
244.430549 152.419312 l
247.953337 153.651736 l
251.476125 150.490693 l
254.998913 153.363814 l
258.5217 153.251272 l
262.044488 153.416885 l
265.567276 154.565288 l
269.090064 154.895718 l
272.612852 154.700107 l
276.13564 156.827013 l
279.658428 154.503862 l
283.181216 156.542374 l
286.704004 154.568333 l
290.226792 148.52881 l
293.74958 153.794214 l
297.272368 158.492036 l
300.795156 156.096624 l
304.317944 155.946017 l
307.840732 158.269434 l
311.36352 157.283562 l
314.886308 157.269474 l
318.409095 151.702402 l
321.931883 155.029559 l
325.454671 154.124165 l
328.977459 157.993728 l
332.500247 156.570145 l
336.023035 154.982311 l
339.545823 153.9432 l
343.068611 153.036656 l
346.591399 155.521542 l
350.114187 152.502988 l
353.636975 152.584897 l
357.159763 153.10992 l
360.682551 152.804397 l
364.205339 159.972911 l
367.728127 151.749434 l
371.250915 155.582449 l
374.773702 156.108758 l
378.29649 155.50087 l
381.819278 159.74427 l
385.342066 152.752059 l
388.864854 153.082512 l
392.387642 150.413755 l
395.91043 151.418482 l
399.433218 153.280682 l
402.956006 146.660738 l
406.478794 166.140429 l
stroke
grestore
1.000 setlinewidth
0 setlinecap
gsave
352.279 189.16 54.2 44.013 clipbox
/o {
gsave
newpath
translate
1.0 setlinewidth
1 setlinejoin

0 setlinecap

0 -1.5 m
0.397805 -1.5 0.77937 -1.341951 1.06066 -1.06066 c
1.341951 -0.77937 1.5 -0.397805 1.5 0 c
1.5 0.397805 1.341951 0.77937 1.06066 1.06066 c
0.77937 1.341951 0.397805 1.5 0 1.5 c
-0.397805 1.5 -0.77937 1.341951 -1.06066 1.06066 c
-1.341951 0.77937 -1.5 0.397805 -1.5 0 c
-1.5 -0.397805 -1.341951 -0.77937 -1.06066 -1.06066 c
-0.77937 -1.341951 -0.397805 -1.5 0 -1.5 c
cl

gsave
1.000 0.498 0.055 setrgbcolor
fill
grestore
stroke
grestore
} bind def
54.2 142.599 o
57.7228 139.346 o
61.2456 139.945 o
64.7684 141.292 o
68.2912 142.248 o
71.8139 143.323 o
75.3367 144.332 o
78.8595 143.866 o
82.3823 145.135 o
85.9051 146.232 o
89.4279 145.241 o
92.9507 147 o
96.4735 145.926 o
99.9962 146.934 o
103.519 147.128 o
107.042 148.265 o
110.565 146.193 o
114.087 146.558 o
117.61 148.679 o
121.133 145.756 o
124.656 147.17 o
128.179 149.397 o
131.701 147.902 o
135.224 150.85 o
138.747 149.882 o
142.27 149.105 o
145.792 150.651 o
149.315 150.385 o
152.838 148.879 o
156.361 151.363 o
159.884 151.072 o
163.406 151.15 o
166.929 147.416 o
170.452 152.226 o
173.975 150.563 o
177.498 152.806 o
181.02 148.681 o
184.543 148.807 o
188.066 152.814 o
191.589 152.223 o
195.112 154.558 o
198.634 153.732 o
202.157 154.312 o
205.68 153.528 o
209.203 154.201 o
212.725 152.235 o
216.248 155.599 o
219.771 151.277 o
223.294 153.664 o
226.817 155.119 o
230.339 153.804 o
233.862 154.812 o
237.385 156.067 o
240.908 154.022 o
244.431 152.419 o
247.953 153.652 o
251.476 150.491 o
254.999 153.364 o
258.522 153.251 o
262.044 153.417 o
265.567 154.565 o
269.09 154.896 o
272.613 154.7 o
276.136 156.827 o
279.658 154.504 o
283.181 156.542 o
286.704 154.568 o
290.227 148.529 o
293.75 153.794 o
297.272 158.492 o
300.795 156.097 o
304.318 155.946 o
307.841 158.269 o
311.364 157.284 o
314.886 157.269 o
318.409 151.702 o
321.932 155.03 o
325.455 154.124 o
328.977 157.994 o
332.5 156.57 o
336.023 154.982 o
339.546 153.943 o
343.069 153.037 o
346.591 155.522 o
350.114 152.503 o
353.637 152.585 o
357.16 153.11 o
360.683 152.804 o
364.205 159.973 o
367.728 151.749 o
371.251 155.582 o
374.774 156.109 o
378.296 155.501 o
381.819 159.744 o
385.342 152.752 o
388.865 153.083 o
392.388 150.414 o
395.91 151.418 o
399.433 153.281 o
402.956 146.661 o
406.479 166.14 o
grestore
1.500 setlinewidth
[9.6 2.4 1.5 2.4] 0 setdash
1.000 0.000 0.000 setrgbcolor
gsave
352.279 189.16 54.2 44.013 clipbox
54.2 142.598901 m
406.478794 142.598901 l
stroke
grestore
[5.55 2.4] 0 setdash
gsave
352.279 189.16 54.2 44.013 clipbox
54.2 166.140429 m
406.478794 166.140429 l
stroke
grestore
[] 0 setdash
0.000 setgray
gsave
352.279 189.16 54.2 44.013 clipbox
54.2 226.135914 m
406.478794 226.135914 l
stroke
grestore
[5.55 2.4] 0 setdash
gsave
352.279 189.16 54.2 44.013 clipbox
54.2 108.583528 m
406.478794 108.583528 l
stroke
grestore
[1.5 2.475] 0 setdash
gsave
352.279 189.16 54.2 44.013 clipbox
54.2 85.404185 m
406.478794 85.404185 l
stroke
grestore
0.800 setlinewidth
0 setlinejoin
2 setlinecap
[] 0 setdash
gsave
54.2 44.0125 m
54.2 233.1725 l
stroke
grestore
gsave
406.478794 44.0125 m
406.478794 233.1725 l
stroke
grestore
gsave
54.2 44.0125 m
406.478794 44.0125 l
stroke
grestore
gsave
54.2 233.1725 m
406.478794 233.1725 l
stroke
grestore
1.000 setlinewidth
0 setlinecap
0.800 setgray
gsave
432.322533 86.150625 m
544.306908 86.150625 l
545.640241 86.150625 546.306908 86.817292 546.306908 88.150625 c
546.306908 186.5725 l
546.306908 187.905833 545.640241 188.5725 544.306908 188.5725 c
432.322533 188.5725 l
430.9892 188.5725 430.322533 187.905833 430.322533 186.5725 c
430.322533 88.150625 l
430.322533 86.817292 430.9892 86.150625 432.322533 86.150625 c
cl
gsave
1.000 setgray
fill
grestore
stroke
grestore
1.500 setlinewidth
1 setlinejoin
2 setlinecap
0.122 0.467 0.706 setrgbcolor
gsave
434.322533 181.0725 m
444.322533 181.0725 l
454.322533 181.0725 l
stroke
grestore
1.000 setlinewidth
0 setlinecap
gsave
/o {
gsave
newpath
translate
1.0 setlinewidth
1 setlinejoin

0 setlinecap

0 -1.5 m
0.397805 -1.5 0.77937 -1.341951 1.06066 -1.06066 c
1.341951 -0.77937 1.5 -0.397805 1.5 0 c
1.5 0.397805 1.341951 0.77937 1.06066 1.06066 c
0.77937 1.341951 0.397805 1.5 0 1.5 c
-0.397805 1.5 -0.77937 1.341951 -1.06066 1.06066 c
-1.341951 0.77937 -1.5 0.397805 -1.5 0 c
-1.5 -0.397805 -1.341951 -0.77937 -1.06066 -1.06066 c
-0.77937 -1.341951 -0.397805 -1.5 0 -1.5 c
cl

gsave
0.122 0.467 0.706 setrgbcolor
fill
grestore
stroke
grestore
} bind def
444.323 181.073 o
grestore
0.000 setgray
/STIXGeneral-Regular 10.000 selectfont
gsave

462.322533 177.572500 translate
0.000000 rotate
0.000000 0 m /v glyphshow
4.999985 0 m /e glyphshow
9.439972 0 m /r glyphshow
12.769958 0 m /t glyphshow
15.549942 0 m /i glyphshow
18.329926 0 m /c glyphshow
22.769913 0 m /a glyphshow
27.209900 0 m /l glyphshow
29.989883 0 m /space glyphshow
32.489868 0 m /s glyphshow
36.379852 0 m /p glyphshow
41.379837 0 m /l glyphshow
44.159821 0 m /i glyphshow
46.939804 0 m /t glyphshow
grestore
1.500 setlinewidth
2 setlinecap
1.000 0.498 0.055 setrgbcolor
gsave
434.322533 166.900625 m
444.322533 166.900625 l
454.322533 166.900625 l
stroke
grestore
1.000 setlinewidth
0 setlinecap
gsave
/o {
gsave
newpath
translate
1.0 setlinewidth
1 setlinejoin

0 setlinecap

0 -1.5 m
0.397805 -1.5 0.77937 -1.341951 1.06066 -1.06066 c
1.341951 -0.77937 1.5 -0.397805 1.5 0 c
1.5 0.397805 1.341951 0.77937 1.06066 1.06066 c
0.77937 1.341951 0.397805 1.5 0 1.5 c
-0.397805 1.5 -0.77937 1.341951 -1.06066 1.06066 c
-1.341951 0.77937 -1.5 0.397805 -1.5 0 c
-1.5 -0.397805 -1.341951 -0.77937 -1.06066 -1.06066 c
-0.77937 -1.341951 -0.397805 -1.5 0 -1.5 c
cl

gsave
1.000 0.498 0.055 setrgbcolor
fill
grestore
stroke
grestore
} bind def
444.323 166.901 o
grestore
0.000 setgray
gsave

462.322533 163.400625 translate
0.000000 rotate
0.000000 0 m /h glyphshow
4.999985 0 m /o glyphshow
9.999969 0 m /r glyphshow
13.329956 0 m /i glyphshow
16.109940 0 m /z glyphshow
20.549927 0 m /o glyphshow
25.549911 0 m /n glyphshow
30.549896 0 m /t glyphshow
33.329880 0 m /a glyphshow
37.769867 0 m /l glyphshow
40.549850 0 m /space glyphshow
43.049835 0 m /s glyphshow
46.939819 0 m /p glyphshow
51.939804 0 m /l glyphshow
54.719788 0 m /i glyphshow
57.499771 0 m /t glyphshow
grestore
1.500 setlinewidth
[9.6 2.4 1.5 2.4] 0 setdash
1.000 0.000 0.000 setrgbcolor
gsave
434.322533 152.72875 m
454.322533 152.72875 l
stroke
grestore
0.000 setgray
gsave

462.322533 149.228750 translate
0.000000 rotate
0.000000 0 m /a glyphshow
4.439987 0 m /l glyphshow
7.219971 0 m /l glyphshow
9.999954 0 m /space glyphshow
12.499939 0 m /r glyphshow
15.829926 0 m /e glyphshow
20.269913 0 m /g glyphshow
25.269897 0 m /u glyphshow
30.269882 0 m /l glyphshow
33.049866 0 m /a glyphshow
37.489853 0 m /r glyphshow
grestore
[5.55 2.4] 0 setdash
1.000 0.000 0.000 setrgbcolor
gsave
434.322533 138.54125 m
454.322533 138.54125 l
stroke
grestore
0.000 setgray
gsave

462.322533 135.041250 translate
0.000000 rotate
0.000000 0 m /a glyphshow
4.439987 0 m /l glyphshow
7.219971 0 m /l glyphshow
9.999954 0 m /space glyphshow
12.499939 0 m /s glyphshow
16.389923 0 m /c glyphshow
20.829910 0 m /a glyphshow
25.269897 0 m /t glyphshow
28.049881 0 m /t glyphshow
30.829865 0 m /e glyphshow
35.269852 0 m /r glyphshow
38.599838 0 m /e glyphshow
43.039825 0 m /d glyphshow
grestore
[] 0 setdash
gsave
434.322533 124.16625 m
454.322533 124.16625 l
stroke
grestore
gsave

462.322533 120.666250 translate
0.000000 rotate
0.000000 0 m /K glyphshow
7.219986 0 m /o glyphshow
12.219971 0 m /s glyphshow
16.109955 0 m /e glyphshow
20.549942 0 m /c glyphshow
24.989929 0 m /space glyphshow
27.489914 0 m /a glyphshow
31.929901 0 m /n glyphshow
36.929886 0 m /d glyphshow
41.929871 0 m /space glyphshow
44.429855 0 m /Scaron glyphshow
49.989838 0 m /a glyphshow
54.429825 0 m /r glyphshow
57.759811 0 m /l glyphshow
60.539795 0 m /e glyphshow
64.979782 0 m /r glyphshow
grestore
[5.55 2.4] 0 setdash
gsave
434.322533 109.994375 m
454.322533 109.994375 l
stroke
grestore
gsave

462.322533 106.494375 translate
0.000000 rotate
0.000000 0 m /S glyphshow
5.559982 0 m /a glyphshow
9.999969 0 m /d glyphshow
14.999954 0 m /a glyphshow
19.439941 0 m /t glyphshow
22.219925 0 m /space glyphshow
24.719910 0 m /a glyphshow
29.159897 0 m /n glyphshow
34.159882 0 m /d glyphshow
39.159866 0 m /space glyphshow
41.659851 0 m /C glyphshow
48.329834 0 m /o glyphshow
53.329819 0 m /u glyphshow
58.329803 0 m /t glyphshow
61.109787 0 m /u glyphshow
66.109772 0 m /r glyphshow
69.439758 0 m /i glyphshow
72.219742 0 m /e glyphshow
76.659729 0 m /r glyphshow
grestore
[1.5 2.475] 0 setdash
gsave
434.322533 95.8225 m
454.322533 95.8225 l
stroke
grestore
gsave

462.322533 92.322500 translate
0.000000 rotate
0.000000 0 m /W glyphshow
9.439987 0 m /a glyphshow
13.879974 0 m /n glyphshow
18.879959 0 m /space glyphshow
21.379944 0 m /e glyphshow
25.819931 0 m /t glyphshow
28.599915 0 m /period glyphshow
31.099899 0 m /space glyphshow
33.599884 0 m /a glyphshow
38.039871 0 m /l glyphshow
grestore

end
showpage
