%!PS-Adobe-3.0 EPSF-3.0
%%Title: irregular_nusselt.eps
%%Creator: Matplotlib v3.5.3, https://matplotlib.org/
%%CreationDate: Tue Apr 18 16:29:37 2023
%%Orientation: portrait
%%BoundingBox: 95 274 517 518
%%HiResBoundingBox: 95.183745 274.187500 516.816255 517.812500
%%EndComments
%%BeginProlog
/mpldict 13 dict def
mpldict begin
/_d { bind def } bind def
/m { moveto } _d
/l { lineto } _d
/r { rlineto } _d
/c { curveto } _d
/cl { closepath } _d
/ce { closepath eofill } _d
/box {
      m
      1 index 0 r
      0 exch r
      neg 0 r
      cl
    } _d
/clipbox {
      box
      clip
      newpath
    } _d
/sc { setcachedevice } _d
%!PS-Adobe-3.0 Resource-Font
%%Creator: Converted from TrueType to Type 3 by Matplotlib.
10 dict begin
/FontName /STIXGeneral-Regular def
/PaintType 0 def
/FontMatrix [0.001 0 0 0.001 0 0] def
/FontBBox [-970 -443 2000 1023] def
/FontType 3 def
/Encoding [/space /comma /period /zero /one /two /four /five /six /eight /a /b /c /d /e /h /i /l /m /n /o /r /s /t /u /y] def
/CharStrings 27 dict dup begin
/.notdef 0 def
/space{250 0 0 0 0 0 sc
ce} _d
/comma{250 0 55 -141 195 102 sc
83 -141 m
73 -122 l
128 -85 156 -49 156 -15 c
156 -6 151 -2 142 -2 c
139 -2 135 -3 128 -4 c
122 -5 117 -6 113 -6 c
74 -6 55 11 55 45 c
55 62 60 76 71 86 c
82 97 97 102 115 102 c
138 102 157 94 172 77 c
187 61 195 40 195 15 c
195 -16 185 -45 164 -74 c
144 -103 117 -125 83 -141 c

ce} _d
/period{250 0 70 -11 181 100 sc
181 43 m
181 28 175 16 164 5 c
153 -6 140 -11 125 -11 c
110 -11 97 -6 86 5 c
75 16 70 29 70 44 c
70 59 75 72 86 83 c
97 94 111 100 126 100 c
141 100 153 94 164 83 c
175 72 181 58 181 43 c

ce} _d
/zero{500 0 24 -14 476 676 sc
476 330 m
476 285 472 243 463 203 c
454 164 441 127 424 94 c
407 61 384 34 354 15 c
324 -4 289 -14 250 -14 c
209 -14 174 -4 143 17 c
112 38 89 65 72 100 c
55 135 43 172 35 211 c
28 250 24 292 24 336 c
24 398 32 454 47 503 c
62 553 88 594 123 627 c
159 660 203 676 254 676 c
319 676 373 644 414 580 c
455 516 476 433 476 330 c

380 325 m
380 430 369 511 346 566 c
324 622 291 650 248 650 c
207 650 175 622 153 566 c
131 510 120 431 120 329 c
120 226 131 148 153 93 c
175 39 207 12 250 12 c
292 12 324 39 346 93 c
369 148 380 225 380 325 c

ce} _d
/one{500 0 111 0 394 676 sc
394 0 m
118 0 l
118 15 l
155 17 180 24 193 35 c
206 47 213 67 213 95 c
213 544 l
213 577 203 593 183 593 c
174 593 159 589 138 581 c
111 571 l
111 585 l
290 676 l
299 673 l
299 76 l
299 54 306 38 319 29 c
332 20 357 15 394 15 c
394 0 l

ce} _d
/two{500 0 29 0 474 676 sc
474 137 m
420 0 l
29 0 l
29 12 l
207 201 l
254 250 287 294 307 335 c
327 376 337 418 337 461 c
337 506 325 540 300 565 c
275 590 241 602 198 602 c
162 602 133 593 112 574 c
91 555 71 521 51 472 c
30 477 l
41 539 64 588 98 623 c
133 658 179 676 238 676 c
293 676 338 659 372 626 c
406 593 423 551 423 500 c
423 425 380 342 295 252 c
130 76 l
364 76 l
386 76 403 80 416 89 c
429 98 444 116 460 143 c
474 137 l

ce} _d
/four{500 0 12 0 473 676 sc
473 167 m
370 167 l
370 0 l
292 0 l
292 167 l
12 167 l
12 231 l
326 676 l
370 676 l
370 231 l
473 231 l
473 167 l

292 231 m
292 574 l
52 231 l
292 231 l

ce} _d
/five{500 0 31 -14 438 688 sc
438 681 m
402 596 l
398 587 389 583 375 583 c
181 583 l
141 498 l
214 484 267 469 300 452 c
333 436 363 409 391 370 c
414 338 426 296 426 243 c
426 195 418 155 402 122 c
387 89 362 60 328 35 c
283 2 226 -14 158 -14 c
120 -14 89 -8 66 3 c
43 14 31 29 31 48 c
31 73 46 86 76 86 c
100 86 125 76 150 55 c
176 34 200 23 221 23 c
256 23 287 40 314 75 c
342 110 356 149 356 192 c
356 256 334 306 289 342 c
231 389 160 412 76 412 c
68 412 64 415 64 420 c
65 425 l
174 662 l
381 662 l
392 662 401 664 407 667 c
414 670 421 677 429 688 c
438 681 l

ce} _d
/six{500 0 34 -14 468 684 sc
446 684 m
448 668 l
369 655 304 623 251 572 c
198 521 165 458 152 383 c
191 413 233 428 279 428 c
338 428 384 409 417 372 c
451 335 468 284 468 219 c
468 154 451 100 417 59 c
378 10 325 -14 258 -14 c
177 -14 118 20 81 87 c
50 144 34 208 34 279 c
34 388 70 480 143 555 c
184 598 227 628 270 645 c
314 663 373 676 446 684 c

378 188 m
378 317 333 382 243 382 c
210 382 182 373 160 355 c
138 338 127 308 127 266 c
127 188 139 126 163 81 c
188 36 223 14 269 14 c
304 14 331 30 350 61 c
369 93 378 135 378 188 c

ce} _d
/eight{500 0 56 -14 445 676 sc
445 155 m
445 104 427 63 391 32 c
356 1 308 -14 248 -14 c
192 -14 146 1 110 32 c
74 63 56 102 56 149 c
56 184 65 214 82 239 c
99 264 134 295 186 332 c
136 373 103 407 86 432 c
70 457 62 487 62 520 c
62 567 80 605 116 633 c
153 662 199 676 256 676 c
305 676 345 662 376 634 c
408 607 424 573 424 533 c
424 496 414 467 395 445 c
376 423 341 398 290 371 c
350 331 391 295 412 264 c
434 233 445 196 445 155 c

355 533 m
355 568 345 595 326 616 c
307 637 280 648 246 648 c
212 648 185 639 165 621 c
146 604 136 580 136 549 c
136 518 146 490 165 465 c
185 440 217 415 261 389 c
295 409 319 430 333 452 c
348 475 355 502 355 533 c

271 272 m
212 312 l
183 288 162 264 150 241 c
138 218 132 191 132 158 c
132 113 143 77 166 52 c
189 27 220 14 259 14 c
292 14 318 24 338 44 c
359 65 369 91 369 124 c
369 154 361 180 346 203 c
331 226 306 249 271 272 c

ce} _d
/a{444 0 37 -10 442 460 sc
442 66 m
442 38 l
417 6 387 -10 352 -10 c
314 -10 293 14 288 63 c
287 63 l
244 14 196 -10 142 -10 c
111 -10 85 -1 66 17 c
47 36 37 61 37 94 c
37 141 60 180 107 211 c
139 232 199 259 287 292 c
287 346 l
287 376 280 398 265 413 c
251 428 232 436 209 436 c
189 436 172 431 159 421 c
146 412 139 400 139 387 c
139 381 140 374 142 367 c
144 360 145 352 145 345 c
145 335 140 326 131 317 c
122 308 112 304 99 304 c
88 304 78 308 69 317 c
60 326 56 337 56 350 c
56 382 73 409 107 430 c
138 450 177 460 222 460 c
276 460 315 445 340 415 c
352 401 360 387 363 372 c
366 358 368 335 368 304 c
368 113 l
368 69 378 47 399 47 c
412 47 427 53 442 66 c

287 127 m
287 268 l
226 247 183 225 159 202 c
136 181 125 156 125 125 c
125 100 131 80 144 67 c
157 54 173 48 194 48 c
216 48 235 53 252 64 c
266 74 275 83 280 92 c
285 101 287 112 287 127 c

ce} _d
/b{500 0 3 -10 468 683 sc
153 681 m
153 376 l
164 401 181 422 205 437 c
230 452 257 460 288 460 c
341 460 384 439 417 397 c
451 355 468 303 468 240 c
468 167 446 107 401 60 c
356 13 301 -10 234 -10 c
193 -10 156 -3 121 10 c
86 24 69 39 69 56 c
69 566 l
69 591 66 606 60 613 c
54 620 41 624 20 624 c
15 624 10 623 3 622 c
3 639 l
33 648 l
101 669 139 680 148 683 c
153 681 l

153 318 m
153 74 l
153 59 162 46 181 36 c
200 27 223 22 250 22 c
289 22 320 36 343 65 c
368 96 380 140 380 197 c
380 262 367 313 341 350 c
319 381 289 397 252 397 c
225 397 202 389 182 373 c
163 358 153 339 153 318 c

ce} _d
/c{444 0 25 -10 412 460 sc
398 156 m
412 147 l
383 91 356 53 330 32 c
296 4 258 -10 215 -10 c
160 -10 114 11 78 52 c
43 94 25 147 25 212 c
25 297 53 362 109 409 c
150 443 195 460 244 460 c
286 460 322 450 352 429 c
383 409 398 385 398 357 c
398 346 393 336 384 327 c
375 319 364 315 351 315 c
328 315 312 330 303 361 c
297 383 l
292 402 285 414 277 421 c
269 428 256 431 238 431 c
197 431 164 415 139 383 c
114 351 102 309 102 257 c
102 200 116 153 145 116 c
174 80 211 62 257 62 c
286 62 310 69 331 82 c
352 96 374 121 398 156 c

ce} _d
/d{500 0 27 -10 491 683 sc
491 42 m
344 -10 l
340 -7 l
340 57 l
308 12 265 -10 212 -10 c
157 -10 112 10 78 49 c
44 89 27 141 27 205 c
27 276 47 336 88 385 c
129 435 178 460 235 460 c
271 460 306 446 340 417 c
340 573 l
340 594 337 607 331 614 c
325 621 313 624 294 624 c
285 624 277 624 272 623 c
272 639 l
333 655 382 670 419 683 c
424 681 l
424 114 l
424 91 427 75 432 68 c
438 61 450 57 468 57 c
472 57 480 57 491 58 c
491 42 l

340 102 m
340 332 l
340 359 330 382 309 402 c
289 422 265 432 238 432 c
200 432 170 415 147 381 c
124 347 113 302 113 245 c
113 184 125 134 150 97 c
175 60 209 42 251 42 c
282 42 307 53 325 74 c
335 85 340 95 340 102 c

ce} _d
/e{444 0 25 -10 424 460 sc
408 164 m
424 157 l
384 46 314 -10 215 -10 c
156 -10 110 10 76 51 c
42 92 25 148 25 217 c
25 288 44 347 82 392 c
120 437 170 460 232 460 c
292 460 338 437 371 391 c
390 364 402 326 405 277 c
97 277 l
100 235 104 203 109 181 c
115 159 126 137 143 114 c
171 77 208 59 254 59 c
287 59 314 67 336 83 c
359 99 383 126 408 164 c

99 309 m
303 309 l
297 351 287 381 273 398 c
260 415 237 424 205 424 c
177 424 154 414 135 394 c
116 375 104 346 99 309 c

ce} _d
/h{500 0 9 0 487 683 sc
487 0 m
275 0 l
275 15 l
304 18 323 25 331 35 c
339 45 343 67 343 102 c
343 300 l
343 371 318 406 269 406 c
249 406 231 401 214 392 c
197 383 178 366 157 343 c
157 102 l
157 67 161 45 169 35 c
177 25 196 18 225 15 c
225 0 l
9 0 l
9 15 l
38 19 55 26 62 35 c
69 44 73 67 73 102 c
73 573 l
73 594 70 608 63 614 c
57 621 43 624 22 624 c
16 624 12 624 10 623 c
10 639 l
37 647 l
88 662 127 674 152 683 c
157 680 l
157 376 l
180 406 203 427 226 440 c
249 453 275 460 304 460 c
386 460 427 407 427 301 c
427 102 l
427 67 430 45 436 36 c
443 27 460 20 487 15 c
487 0 l

ce} _d
/i{278 0 16 0 253 683 sc
180 632 m
180 617 175 605 165 595 c
155 586 143 581 128 581 c
114 581 102 586 92 595 c
83 605 78 617 78 632 c
78 646 83 658 93 668 c
103 678 115 683 129 683 c
144 683 156 678 165 668 c
175 658 180 646 180 632 c

253 0 m
16 0 l
16 15 l
51 17 72 23 81 33 c
90 43 95 67 95 104 c
95 331 l
95 354 93 371 88 380 c
83 389 75 394 62 394 c
46 394 32 392 20 389 c
20 405 l
175 460 l
179 456 l
179 105 l
179 68 183 44 191 34 c
200 24 220 18 253 15 c
253 0 l

ce} _d
/l{278 0 19 0 257 683 sc
257 0 m
21 0 l
21 15 l
52 18 73 24 83 34 c
93 45 98 64 98 92 c
98 561 l
98 585 95 602 89 611 c
83 620 72 625 56 625 c
42 625 30 624 19 623 c
19 639 l
82 654 135 669 177 683 c
182 679 l
182 87 l
182 59 187 40 196 31 c
205 22 226 17 257 15 c
257 0 l

ce} _d
/m{778 0 16 0 775 460 sc
775 0 m
557 0 l
557 15 l
585 18 603 23 610 32 c
618 41 622 61 622 90 c
622 296 l
622 336 616 365 604 382 c
593 399 573 408 545 408 c
522 408 502 403 485 394 c
469 385 453 369 438 347 c
438 95 l
438 63 443 42 452 31 c
462 21 481 16 510 15 c
510 0 l
286 0 l
286 15 l
315 17 334 22 342 29 c
350 37 354 56 354 86 c
354 297 l
354 371 332 408 289 408 c
270 408 250 404 229 395 c
208 387 193 377 183 365 c
174 355 170 349 170 348 c
170 70 l
170 49 175 34 184 27 c
193 20 211 16 238 15 c
238 0 l
16 0 l
16 15 l
44 16 63 21 72 30 c
81 40 86 59 86 88 c
86 336 l
86 361 83 378 78 387 c
73 397 64 402 51 402 c
41 402 30 401 19 398 c
19 415 l
64 428 111 443 158 460 c
166 457 l
166 383 l
168 383 l
198 414 224 435 247 445 c
270 455 295 460 321 460 c
374 460 409 432 427 376 c
479 432 533 460 590 460 c
667 460 706 400 706 280 c
706 77 l
706 55 709 40 716 31 c
723 23 734 18 749 17 c
775 15 l
775 0 l

ce} _d
/n{500 0 16 0 485 460 sc
485 0 m
277 0 l
278 15 l
303 17 319 24 327 36 c
336 49 340 72 340 105 c
340 304 l
340 371 316 405 267 405 c
250 405 235 401 220 393 c
205 385 187 370 164 348 c
164 72 l
164 52 168 38 177 30 c
186 22 204 17 229 15 c
229 0 l
18 0 l
18 15 l
43 17 60 23 68 33 c
76 44 80 64 80 94 c
80 337 l
80 362 78 379 73 388 c
68 397 59 402 45 402 c
32 402 22 401 16 398 c
16 415 l
63 428 108 443 153 460 c
161 457 l
161 379 l
162 379 l
209 433 257 460 306 460 c
344 460 373 447 393 420 c
414 393 424 355 424 306 c
424 85 l
424 58 428 41 436 32 c
444 23 460 18 485 15 c
485 0 l

ce} _d
/o{500 0 29 -10 470 460 sc
470 231 m
470 161 449 103 407 58 c
366 13 312 -10 245 -10 c
184 -10 132 12 91 57 c
50 102 29 159 29 228 c
29 297 50 353 91 396 c
132 439 187 460 254 460 c
316 460 367 439 408 396 c
449 354 470 299 470 231 c

380 204 m
380 280 363 339 330 382 c
303 415 272 432 235 432 c
200 432 172 418 151 389 c
130 361 119 322 119 273 c
119 188 137 119 172 68 c
195 35 225 18 262 18 c
299 18 327 34 348 67 c
369 100 380 146 380 204 c

ce} _d
/r{333 0 5 0 335 460 sc
160 458 m
160 366 l
185 402 206 427 223 440 c
240 453 259 460 280 460 c
297 460 311 455 320 446 c
330 437 335 424 335 407 c
335 393 331 382 324 374 c
317 366 308 362 296 362 c
283 362 270 369 256 382 c
245 392 237 397 230 397 c
216 397 201 387 184 368 c
168 349 160 331 160 315 c
160 90 l
160 61 166 42 177 32 c
188 22 211 16 245 15 c
245 0 l
5 0 l
5 15 l
37 21 57 28 64 35 c
72 42 76 59 76 84 c
76 334 l
76 356 73 371 68 380 c
63 389 55 394 42 394 c
31 394 20 393 7 390 c
7 406 l
49 419 98 437 155 460 c
160 458 l

ce} _d
/s{389 0 51 -10 348 459 sc
156 301 m
260 238 l
293 218 316 199 329 182 c
342 165 348 142 348 115 c
348 82 334 52 306 27 c
279 2 246 -10 208 -10 c
177 -10 152 -7 135 -1 c
117 5 102 8 89 8 c
78 8 70 4 65 -4 c
52 -4 l
52 153 l
68 153 l
79 104 94 69 114 46 c
134 23 161 12 195 12 c
220 12 240 19 255 33 c
270 47 278 65 278 86 c
278 117 260 142 225 161 c
171 191 l
91 236 51 284 51 336 c
51 375 63 405 88 426 c
113 448 147 459 189 459 c
218 459 241 455 256 448 c
268 443 277 440 284 440 c
289 440 294 443 300 450 c
311 450 l
316 314 l
301 314 l
290 359 275 391 258 409 c
241 428 218 437 188 437 c
165 437 147 431 133 420 c
120 409 113 392 113 369 c
113 358 117 345 124 332 c
132 319 143 309 156 301 c

ce} _d
/t{278 0 13 -10 279 579 sc
266 77 m
279 66 l
247 15 207 -10 158 -10 c
99 -10 70 32 70 117 c
70 418 l
17 418 l
14 420 13 422 13 425 c
13 430 19 437 30 444 c
55 459 88 494 127 551 c
128 553 131 557 136 563 c
141 570 145 575 147 579 c
152 579 154 575 154 566 c
154 450 l
255 450 l
255 418 l
154 418 l
154 132 l
154 100 158 77 166 63 c
174 49 187 42 206 42 c
226 42 246 54 266 77 c

ce} _d
/u{500 0 9 -10 480 450 sc
480 50 m
480 36 l
428 22 382 7 343 -9 c
338 -6 l
338 76 l
336 76 l
294 19 246 -10 193 -10 c
155 -10 125 2 103 25 c
82 48 71 79 71 118 c
71 369 l
71 394 67 411 58 420 c
49 429 33 435 9 436 c
9 450 l
155 450 l
155 127 l
155 104 162 85 175 70 c
189 55 206 48 226 48 c
259 48 287 58 310 79 c
319 87 325 94 328 101 c
331 108 333 120 333 137 c
333 368 l
333 394 328 411 319 418 c
310 426 290 431 259 433 c
259 450 l
417 450 l
417 107 l
417 84 421 68 428 61 c
436 54 451 50 474 50 c
480 50 l

ce} _d
/y{500 0 14 -218 475 450 sc
475 450 m
475 435 l
463 434 453 429 446 422 c
439 415 432 402 425 384 c
275 -25 l
249 -96 223 -145 196 -174 c
170 -203 138 -218 100 -218 c
79 -218 62 -212 49 -201 c
36 -190 30 -177 30 -160 c
30 -147 34 -136 42 -127 c
51 -118 61 -114 73 -114 c
92 -114 110 -118 125 -127 c
134 -132 142 -134 151 -134 c
165 -134 182 -119 201 -90 c
210 -77 219 -58 228 -33 c
237 -8 241 9 241 18 c
241 27 227 60 199 119 c
67 401 l
58 420 41 432 14 436 c
14 450 l
219 450 l
219 435 l
198 434 183 432 174 428 c
166 424 162 417 162 408 c
162 401 166 387 175 367 c
287 117 l
384 393 l
387 399 388 405 388 411 c
388 427 373 435 342 435 c
342 450 l
475 450 l

ce} _d
end readonly def

/BuildGlyph {
 exch begin
 CharStrings exch
 2 copy known not {pop /.notdef} if
 true 3 1 roll get exec
 end
} _d

/BuildChar {
 1 index /Encoding get exch get
 1 index /BuildGlyph get exec
} _d

FontName currentdict end definefont pop
%!PS-Adobe-3.0 Resource-Font
%%Creator: Converted from TrueType to Type 3 by Matplotlib.
10 dict begin
/FontName /Cmr10 def
/PaintType 0 def
/FontMatrix [0.00048828125 0 0 0.00048828125 0 0] def
/FontBBox [-90 -512 2066 1536] def
/FontType 3 def
/Encoding [/N /zero /four /u /seven /equal] def
/CharStrings 7 dict dup begin
/.notdef 0 def
/N{1536 0 63 0 1470 1399 sc
63 0 m
63 72 l
204 72 274 112 274 193 c
274 1315 l
229 1323 159 1327 63 1327 c
63 1399 l
455 1399 l
462 1399 466 1396 469 1391 c
1194 324 l
1194 1206 l
1194 1287 1124 1327 983 1327 c
983 1399 l
1470 1399 l
1470 1327 l
1330 1327 1260 1287 1260 1206 c
1260 18 l
1260 14 1257 10 1252 6 c
1247 2 1242 0 1239 0 c
1214 0 l
1207 0 1203 3 1200 8 c
340 1274 l
340 193 l
340 112 410 72 551 72 c
551 0 l
63 0 l

ce} _d
/zero{1024 0 80 -45 942 1364 sc
512 -45 m
345 -45 231 24 170 161 c
110 299 80 463 80 653 c
80 772 91 883 112 988 c
134 1093 177 1181 241 1254 c
306 1327 396 1364 512 1364 c
602 1364 676 1342 733 1298 c
790 1254 834 1197 864 1127 c
894 1058 914 983 925 903 c
936 824 942 740 942 653 c
942 536 931 426 909 323 c
888 221 845 134 782 62 c
719 -9 629 -45 512 -45 c

512 8 m
588 8 645 47 682 125 c
719 203 742 289 751 384 c
760 479 764 579 764 686 c
764 789 760 883 751 970 c
742 1057 719 1135 682 1205 c
645 1276 589 1311 512 1311 c
435 1311 377 1276 340 1205 c
303 1134 280 1056 271 969 c
262 883 258 789 258 686 c
258 610 260 538 263 471 c
267 404 277 334 293 262 c
309 191 335 130 370 81 c
406 32 453 8 512 8 c

ce} _d
/four{1024 0 57 0 965 1364 sc
57 338 m
57 410 l
690 1354 l
695 1361 702 1364 711 1364 c
741 1364 l
756 1364 764 1356 764 1341 c
764 410 l
965 410 l
965 338 l
764 338 l
764 137 l
764 109 784 91 824 83 c
864 76 910 72 963 72 c
963 0 l
399 0 l
399 72 l
452 72 498 76 538 83 c
578 91 598 109 598 137 c
598 338 l
57 338 l

125 410 m
610 410 l
610 1135 l
125 410 l

ce} _d
/u{1137 0 61 -23 1100 905 sc
221 244 m
221 696 l
221 733 215 759 204 775 c
193 792 178 802 157 805 c
136 809 104 811 61 811 c
61 883 l
371 905 l
371 244 l
371 191 375 149 382 119 c
390 90 406 68 431 53 c
456 38 496 31 551 31 c
624 31 683 62 726 123 c
769 184 791 254 791 332 c
791 696 l
791 733 785 759 774 775 c
763 792 747 802 726 805 c
706 809 674 811 631 811 c
631 883 l
940 905 l
940 186 l
940 150 945 124 956 107 c
967 91 983 81 1004 77 c
1025 74 1057 72 1100 72 c
1100 0 l
797 -23 l
797 150 l
772 99 736 57 691 25 c
646 -7 596 -23 541 -23 c
443 -23 365 -2 307 39 c
250 81 221 149 221 244 c

ce} _d
/seven{1024 0 115 -45 993 1384 sc
356 53 m
356 129 363 203 376 276 c
389 349 409 420 434 491 c
460 562 491 632 527 700 c
564 769 604 833 647 893 c
834 1153 l
600 1153 l
357 1153 232 1150 225 1143 c
207 1121 190 1058 174 954 c
115 954 l
182 1384 l
242 1384 l
242 1378 l
242 1353 284 1337 367 1330 c
450 1323 532 1319 612 1319 c
993 1319 l
993 1266 l
993 1265 993 1264 992 1263 c
992 1262 992 1261 991 1260 c
709 864 l
640 761 596 647 579 522 c
562 397 553 240 553 53 c
553 26 543 3 524 -16 c
505 -35 482 -45 455 -45 c
428 -45 404 -35 385 -16 c
366 3 356 26 356 53 c

ce} _d
/equal{1591 0 115 272 1477 752 sc
154 272 m
143 272 133 276 126 285 c
119 294 115 303 115 313 c
115 324 119 334 126 342 c
133 350 143 354 154 354 c
1440 354 l
1450 354 1459 350 1466 342 c
1473 334 1477 324 1477 313 c
1477 303 1473 294 1466 285 c
1459 276 1450 272 1440 272 c
154 272 l

154 670 m
143 670 133 674 126 682 c
119 690 115 700 115 711 c
115 721 119 730 126 739 c
133 748 143 752 154 752 c
1440 752 l
1450 752 1459 748 1466 739 c
1473 730 1477 721 1477 711 c
1477 700 1473 690 1466 682 c
1459 674 1450 670 1440 670 c
154 670 l

ce} _d
end readonly def

/BuildGlyph {
 exch begin
 CharStrings exch
 2 copy known not {pop /.notdef} if
 true 3 1 roll get exec
 end
} _d

/BuildChar {
 1 index /Encoding get exch get
 1 index /BuildGlyph get exec
} _d

FontName currentdict end definefont pop
%!PS-Adobe-3.0 Resource-Font
%%Creator: Converted from TrueType to Type 3 by Matplotlib.
10 dict begin
/FontName /Cmmi10 def
/PaintType 0 def
/FontMatrix [0.00048828125 0 0 0.00048828125 0 0] def
/FontBBox [-70 -512 2146 1536] def
/FontType 3 def
/Encoding [/h /delta] def
/CharStrings 3 dict dup begin
/.notdef 0 def
/h{1180 0 109 -23 1124 1421 sc
109 37 m
109 45 110 51 111 55 c
408 1239 l
413 1262 417 1281 418 1294 c
418 1316 374 1327 285 1327 c
271 1327 264 1336 264 1354 c
265 1357 266 1363 268 1372 c
271 1381 274 1387 277 1392 c
281 1397 286 1399 293 1399 c
569 1421 l
575 1421 l
575 1420 577 1418 582 1415 c
587 1413 589 1412 590 1411 c
593 1404 594 1399 594 1395 c
434 756 l
518 855 618 905 733 905 c
781 905 822 897 857 880 c
892 863 920 838 939 804 c
959 771 969 731 969 684 c
969 628 956 560 931 481 c
906 402 875 313 838 215 c
819 170 809 129 809 92 c
809 51 825 31 856 31 c
909 31 954 59 989 116 c
1025 173 1050 235 1065 301 c
1068 309 1073 313 1081 313 c
1106 313 l
1111 313 1116 311 1119 307 c
1122 304 1124 300 1124 295 c
1124 294 1123 292 1122 289 c
1110 240 1092 191 1068 143 c
1045 96 1015 56 979 24 c
943 -7 901 -23 852 -23 c
804 -23 763 -7 729 26 c
695 59 678 100 678 147 c
678 172 683 199 694 227 c
733 330 765 421 790 502 c
816 583 829 654 829 715 c
829 754 821 787 806 813 c
791 839 765 852 729 852 c
656 852 592 829 537 784 c
482 739 435 680 395 606 c
256 47 l
251 26 240 10 225 -3 c
210 -16 192 -23 172 -23 c
155 -23 140 -17 127 -5 c
115 6 109 20 109 37 c

ce} _d
/delta{909 0 82 -31 924 1460 sc
410 -31 m
363 -31 319 -22 278 -4 c
237 13 202 39 171 72 c
141 105 119 142 104 183 c
89 224 82 269 82 317 c
82 402 102 485 142 565 c
183 646 238 715 307 774 c
377 833 453 872 535 893 c
495 967 464 1031 443 1084 c
422 1138 412 1193 412 1249 c
412 1290 422 1327 441 1358 c
460 1390 487 1415 521 1433 c
555 1451 593 1460 635 1460 c
676 1460 756 1446 877 1419 c
908 1412 924 1393 924 1364 c
924 1341 916 1321 899 1302 c
882 1283 863 1274 840 1274 c
823 1274 808 1278 795 1285 c
782 1293 761 1307 732 1326 c
703 1345 678 1360 655 1370 c
632 1381 609 1386 584 1386 c
556 1386 531 1377 508 1360 c
486 1343 475 1321 475 1294 c
475 1251 494 1201 532 1144 c
571 1088 625 1016 696 928 c
777 825 817 712 817 588 c
817 527 808 460 790 389 c
773 318 747 250 713 187 c
680 124 637 71 584 30 c
532 -11 474 -31 410 -31 c

414 25 m
467 25 513 53 551 108 c
590 163 619 229 638 305 c
658 382 668 446 668 498 c
668 600 632 715 561 842 c
489 822 427 780 375 716 c
323 652 284 578 257 495 c
230 412 217 333 217 258 c
217 193 234 137 268 92 c
302 47 351 25 414 25 c

ce} _d
end readonly def

/BuildGlyph {
 exch begin
 CharStrings exch
 2 copy known not {pop /.notdef} if
 true 3 1 roll get exec
 end
} _d

/BuildChar {
 1 index /Encoding get exch get
 1 index /BuildGlyph get exec
} _d

FontName currentdict end definefont pop
end
%%EndProlog
mpldict begin
95.184 274.188 translate
421.633 243.625 0 0 clipbox
gsave
0 0 m
421.632511 0 l
421.632511 243.625 l
0 243.625 l
cl
1.000 setgray
fill
grestore
gsave
45.2 41.60625 m
414.432511 41.60625 l
414.432511 236.425 l
45.2 236.425 l
cl
1.000 setgray
fill
grestore
0.800 setlinewidth
1 setlinejoin
2 setlinecap
[] 0 setdash
0.690 setgray
gsave
369.233 194.819 45.2 41.606 clipbox
60.859739 41.60625 m
60.859739 236.425 l
stroke
grestore
0 setlinecap
0.000 setgray
gsave
/o {
gsave
newpath
translate
0.8 setlinewidth
1 setlinejoin

0 setlinecap

0 0 m
0 -3.5 l

gsave
0.000 setgray
fill
grestore
stroke
grestore
} bind def
60.8597 41.6063 o
grestore
gsave
50.359739 26.403125 translate
0.000000 rotate
/STIXGeneral-Regular 12.0 selectfont
0.000000 0.890625 moveto
/zero glyphshow
5.999985 0.890625 moveto
/period glyphshow
8.999969 0.890625 moveto
/zero glyphshow
14.999954 0.890625 moveto
/zero glyphshow
grestore
2 setlinecap
0.690 setgray
gsave
369.233 194.819 45.2 41.606 clipbox
105.764971 41.60625 m
105.764971 236.425 l
stroke
grestore
0 setlinecap
0.000 setgray
gsave
/o {
gsave
newpath
translate
0.8 setlinewidth
1 setlinejoin

0 setlinecap

0 0 m
0 -3.5 l

gsave
0.000 setgray
fill
grestore
stroke
grestore
} bind def
105.765 41.6063 o
grestore
gsave
95.264971 26.403125 translate
0.000000 rotate
/STIXGeneral-Regular 12.0 selectfont
0.000000 0.890625 moveto
/zero glyphshow
5.999985 0.890625 moveto
/period glyphshow
8.999969 0.890625 moveto
/zero glyphshow
14.999954 0.890625 moveto
/two glyphshow
grestore
2 setlinecap
0.690 setgray
gsave
369.233 194.819 45.2 41.606 clipbox
150.670203 41.60625 m
150.670203 236.425 l
stroke
grestore
0 setlinecap
0.000 setgray
gsave
/o {
gsave
newpath
translate
0.8 setlinewidth
1 setlinejoin

0 setlinecap

0 0 m
0 -3.5 l

gsave
0.000 setgray
fill
grestore
stroke
grestore
} bind def
150.67 41.6063 o
grestore
gsave
140.170203 26.403125 translate
0.000000 rotate
/STIXGeneral-Regular 12.0 selectfont
0.000000 0.890625 moveto
/zero glyphshow
5.999985 0.890625 moveto
/period glyphshow
8.999969 0.890625 moveto
/zero glyphshow
14.999954 0.890625 moveto
/four glyphshow
grestore
2 setlinecap
0.690 setgray
gsave
369.233 194.819 45.2 41.606 clipbox
195.575435 41.60625 m
195.575435 236.425 l
stroke
grestore
0 setlinecap
0.000 setgray
gsave
/o {
gsave
newpath
translate
0.8 setlinewidth
1 setlinejoin

0 setlinecap

0 0 m
0 -3.5 l

gsave
0.000 setgray
fill
grestore
stroke
grestore
} bind def
195.575 41.6063 o
grestore
gsave
185.075435 26.403125 translate
0.000000 rotate
/STIXGeneral-Regular 12.0 selectfont
0.000000 0.796875 moveto
/zero glyphshow
5.999985 0.796875 moveto
/period glyphshow
8.999969 0.796875 moveto
/zero glyphshow
14.999954 0.796875 moveto
/six glyphshow
grestore
2 setlinecap
0.690 setgray
gsave
369.233 194.819 45.2 41.606 clipbox
240.480667 41.60625 m
240.480667 236.425 l
stroke
grestore
0 setlinecap
0.000 setgray
gsave
/o {
gsave
newpath
translate
0.8 setlinewidth
1 setlinejoin

0 setlinecap

0 0 m
0 -3.5 l

gsave
0.000 setgray
fill
grestore
stroke
grestore
} bind def
240.481 41.6063 o
grestore
gsave
229.980667 26.403125 translate
0.000000 rotate
/STIXGeneral-Regular 12.0 selectfont
0.000000 0.890625 moveto
/zero glyphshow
5.999985 0.890625 moveto
/period glyphshow
8.999969 0.890625 moveto
/zero glyphshow
14.999954 0.890625 moveto
/eight glyphshow
grestore
2 setlinecap
0.690 setgray
gsave
369.233 194.819 45.2 41.606 clipbox
285.3859 41.60625 m
285.3859 236.425 l
stroke
grestore
0 setlinecap
0.000 setgray
gsave
/o {
gsave
newpath
translate
0.8 setlinewidth
1 setlinejoin

0 setlinecap

0 0 m
0 -3.5 l

gsave
0.000 setgray
fill
grestore
stroke
grestore
} bind def
285.386 41.6063 o
grestore
gsave
274.885900 26.403125 translate
0.000000 rotate
/STIXGeneral-Regular 12.0 selectfont
0.000000 0.890625 moveto
/zero glyphshow
5.999985 0.890625 moveto
/period glyphshow
8.999969 0.890625 moveto
/one glyphshow
14.999954 0.890625 moveto
/zero glyphshow
grestore
2 setlinecap
0.690 setgray
gsave
369.233 194.819 45.2 41.606 clipbox
330.291132 41.60625 m
330.291132 236.425 l
stroke
grestore
0 setlinecap
0.000 setgray
gsave
/o {
gsave
newpath
translate
0.8 setlinewidth
1 setlinejoin

0 setlinecap

0 0 m
0 -3.5 l

gsave
0.000 setgray
fill
grestore
stroke
grestore
} bind def
330.291 41.6063 o
grestore
gsave
319.791132 26.403125 translate
0.000000 rotate
/STIXGeneral-Regular 12.0 selectfont
0.000000 0.890625 moveto
/zero glyphshow
5.999985 0.890625 moveto
/period glyphshow
8.999969 0.890625 moveto
/one glyphshow
14.999954 0.890625 moveto
/two glyphshow
grestore
2 setlinecap
0.690 setgray
gsave
369.233 194.819 45.2 41.606 clipbox
375.196364 41.60625 m
375.196364 236.425 l
stroke
grestore
0 setlinecap
0.000 setgray
gsave
/o {
gsave
newpath
translate
0.8 setlinewidth
1 setlinejoin

0 setlinecap

0 0 m
0 -3.5 l

gsave
0.000 setgray
fill
grestore
stroke
grestore
} bind def
375.196 41.6063 o
grestore
gsave
364.696364 26.403125 translate
0.000000 rotate
/STIXGeneral-Regular 12.0 selectfont
0.000000 0.890625 moveto
/zero glyphshow
5.999985 0.890625 moveto
/period glyphshow
8.999969 0.890625 moveto
/one glyphshow
14.999954 0.890625 moveto
/four glyphshow
grestore
/STIXGeneral-Regular 14.000 selectfont
gsave

186.058443 10.231250 translate
0.000000 rotate
0.000000 0 m /s glyphshow
5.445999 0 m /i glyphshow
9.337997 0 m /m glyphshow
20.229996 0 m /u glyphshow
27.229996 0 m /l glyphshow
31.121994 0 m /a glyphshow
37.337982 0 m /t glyphshow
41.229980 0 m /i glyphshow
45.121979 0 m /o glyphshow
52.121979 0 m /n glyphshow
59.121979 0 m /space glyphshow
62.621979 0 m /t glyphshow
66.513977 0 m /i glyphshow
70.405975 0 m /m glyphshow
81.297974 0 m /e glyphshow
grestore
2 setlinecap
0.690 setgray
gsave
369.233 194.819 45.2 41.606 clipbox
45.2 50.461648 m
414.432511 50.461648 l
stroke
grestore
0 setlinecap
0.000 setgray
gsave
/o {
gsave
newpath
translate
0.8 setlinewidth
1 setlinejoin

0 setlinecap

-0 0 m
-3.5 0 l

gsave
0.000 setgray
fill
grestore
stroke
grestore
} bind def
45.2 50.4616 o
grestore
gsave
32.200000 46.360085 translate
0.000000 rotate
/STIXGeneral-Regular 12.0 selectfont
0.000000 0.890625 moveto
/zero glyphshow
grestore
2 setlinecap
0.690 setgray
gsave
369.233 194.819 45.2 41.606 clipbox
45.2 78.574021 m
414.432511 78.574021 l
stroke
grestore
0 setlinecap
0.000 setgray
gsave
/o {
gsave
newpath
translate
0.8 setlinewidth
1 setlinejoin

0 setlinecap

-0 0 m
-3.5 0 l

gsave
0.000 setgray
fill
grestore
stroke
grestore
} bind def
45.2 78.574 o
grestore
gsave
32.200000 74.472459 translate
0.000000 rotate
/STIXGeneral-Regular 12.0 selectfont
0.000000 0.890625 moveto
/two glyphshow
grestore
2 setlinecap
0.690 setgray
gsave
369.233 194.819 45.2 41.606 clipbox
45.2 106.686395 m
414.432511 106.686395 l
stroke
grestore
0 setlinecap
0.000 setgray
gsave
/o {
gsave
newpath
translate
0.8 setlinewidth
1 setlinejoin

0 setlinecap

-0 0 m
-3.5 0 l

gsave
0.000 setgray
fill
grestore
stroke
grestore
} bind def
45.2 106.686 o
grestore
gsave
32.200000 102.584833 translate
0.000000 rotate
/STIXGeneral-Regular 12.0 selectfont
0.000000 0.890625 moveto
/four glyphshow
grestore
2 setlinecap
0.690 setgray
gsave
369.233 194.819 45.2 41.606 clipbox
45.2 134.798769 m
414.432511 134.798769 l
stroke
grestore
0 setlinecap
0.000 setgray
gsave
/o {
gsave
newpath
translate
0.8 setlinewidth
1 setlinejoin

0 setlinecap

-0 0 m
-3.5 0 l

gsave
0.000 setgray
fill
grestore
stroke
grestore
} bind def
45.2 134.799 o
grestore
gsave
32.200000 130.697206 translate
0.000000 rotate
/STIXGeneral-Regular 12.0 selectfont
0.000000 0.796875 moveto
/six glyphshow
grestore
2 setlinecap
0.690 setgray
gsave
369.233 194.819 45.2 41.606 clipbox
45.2 162.911143 m
414.432511 162.911143 l
stroke
grestore
0 setlinecap
0.000 setgray
gsave
/o {
gsave
newpath
translate
0.8 setlinewidth
1 setlinejoin

0 setlinecap

-0 0 m
-3.5 0 l

gsave
0.000 setgray
fill
grestore
stroke
grestore
} bind def
45.2 162.911 o
grestore
gsave
32.200000 158.809580 translate
0.000000 rotate
/STIXGeneral-Regular 12.0 selectfont
0.000000 0.890625 moveto
/eight glyphshow
grestore
2 setlinecap
0.690 setgray
gsave
369.233 194.819 45.2 41.606 clipbox
45.2 191.023516 m
414.432511 191.023516 l
stroke
grestore
0 setlinecap
0.000 setgray
gsave
/o {
gsave
newpath
translate
0.8 setlinewidth
1 setlinejoin

0 setlinecap

-0 0 m
-3.5 0 l

gsave
0.000 setgray
fill
grestore
stroke
grestore
} bind def
45.2 191.024 o
grestore
gsave
26.200000 186.921954 translate
0.000000 rotate
/STIXGeneral-Regular 12.0 selectfont
0.000000 0.890625 moveto
/one glyphshow
5.999985 0.890625 moveto
/zero glyphshow
grestore
2 setlinecap
0.690 setgray
gsave
369.233 194.819 45.2 41.606 clipbox
45.2 219.13589 m
414.432511 219.13589 l
stroke
grestore
0 setlinecap
0.000 setgray
gsave
/o {
gsave
newpath
translate
0.8 setlinewidth
1 setlinejoin

0 setlinecap

-0 0 m
-3.5 0 l

gsave
0.000 setgray
fill
grestore
stroke
grestore
} bind def
45.2 219.136 o
grestore
gsave
26.200000 215.034328 translate
0.000000 rotate
/STIXGeneral-Regular 12.0 selectfont
0.000000 0.890625 moveto
/one glyphshow
5.999985 0.890625 moveto
/two glyphshow
grestore
gsave
19.168750 129.515625 translate
90.000000 rotate
/Cmr10 14.0 selectfont
0.000000 0.562500 moveto
/N glyphshow
10.500000 0.562500 moveto
/u glyphshow
0.0 12.25 18.2724609375 0.875 rectfill
grestore
1.500 setlinewidth
2 setlinecap
1.000 0.498 0.055 setrgbcolor
gsave
369.233 194.819 45.2 41.606 clipbox
64.228368 50.461655 m
67.596997 53.509945 l
70.965627 92.693982 l
74.334256 116.590666 l
77.702885 102.958381 l
81.071514 107.481412 l
84.440144 127.815448 l
87.808773 133.61841 l
91.177402 133.256348 l
94.546031 125.412183 l
97.914661 118.306994 l
101.28329 124.584608 l
104.651919 147.128474 l
108.020548 171.204082 l
111.389178 175.496168 l
114.757807 162.577236 l
118.126436 153.776185 l
121.495065 156.474794 l
124.863694 171.742839 l
128.232324 185.305513 l
131.600953 197.312781 l
134.969582 202.152288 l
138.338211 197.479825 l
141.706841 194.757264 l
145.07547 196.549549 l
148.444099 197.836931 l
151.812728 198.780583 l
155.181358 200.367833 l
158.549987 202.009264 l
161.918616 203.356725 l
165.287245 204.133388 l
168.655875 204.371225 l
172.024504 204.727371 l
175.393133 205.656141 l
178.761762 206.909635 l
182.130391 207.985873 l
185.499021 208.89045 l
188.86765 209.838359 l
192.236279 210.791797 l
195.604908 211.655311 l
198.973538 212.400699 l
202.342167 213.05654 l
205.710796 213.693326 l
209.079425 214.342955 l
212.448055 214.958874 l
215.816684 215.513804 l
219.185313 216.034936 l
222.553942 216.540405 l
225.922572 217.023763 l
229.291201 217.476941 l
232.65983 217.899636 l
236.028459 218.298395 l
239.397089 218.680518 l
242.765718 219.04446 l
246.134347 219.386091 l
249.502976 219.707476 l
252.871605 220.012578 l
256.240235 220.302301 l
259.608864 220.57618 l
262.977493 220.834602 l
266.346122 221.078633 l
269.714752 221.309654 l
273.083381 221.528375 l
276.45201 221.73495 l
279.820639 221.929869 l
283.189269 222.114016 l
286.557898 222.288065 l
289.926527 222.452433 l
293.295156 222.607572 l
296.663786 222.753977 l
300.032415 222.89217 l
303.401044 223.022614 l
306.769673 223.145709 l
310.138302 223.261823 l
313.506932 223.371351 l
316.875561 223.474676 l
320.24419 223.572136 l
323.612819 223.664049 l
326.981449 223.750718 l
330.350078 223.832444 l
333.718707 223.909504 l
337.087336 223.982163 l
340.455966 224.050664 l
343.824595 224.115243 l
347.193224 224.176124 l
350.561853 224.233517 l
353.930483 224.287621 l
357.299112 224.338622 l
360.667741 224.386698 l
364.03637 224.432016 l
367.404999 224.474735 l
370.773629 224.515003 l
374.142258 224.552961 l
377.510887 224.588742 l
380.879516 224.622471 l
384.248146 224.654266 l
387.616775 224.684238 l
390.985404 224.712493 l
394.354033 224.739129 l
397.649215 224.763708 l
stroke
grestore
1.000 setlinewidth
0 setlinecap
gsave
369.233 194.819 45.2 41.606 clipbox
/o {
gsave
newpath
translate
1.0 setlinewidth
1 setlinejoin

0 setlinecap

0 -2.5 m
0.663008 -2.5 1.29895 -2.236584 1.767767 -1.767767 c
2.236584 -1.29895 2.5 -0.663008 2.5 0 c
2.5 0.663008 2.236584 1.29895 1.767767 1.767767 c
1.29895 2.236584 0.663008 2.5 0 2.5 c
-0.663008 2.5 -1.29895 2.236584 -1.767767 1.767767 c
-2.236584 1.29895 -2.5 0.663008 -2.5 0 c
-2.5 -0.663008 -2.236584 -1.29895 -1.767767 -1.767767 c
-1.29895 -2.236584 -0.663008 -2.5 0 -2.5 c
cl

gsave
grestore
stroke
grestore
} bind def
64.2284 50.4617 o
67.597 53.5099 o
70.9656 92.694 o
74.3343 116.591 o
77.7029 102.958 o
81.0715 107.481 o
84.4401 127.815 o
87.8088 133.618 o
91.1774 133.256 o
94.546 125.412 o
97.9147 118.307 o
101.283 124.585 o
104.652 147.128 o
108.021 171.204 o
111.389 175.496 o
114.758 162.577 o
118.126 153.776 o
121.495 156.475 o
124.864 171.743 o
128.232 185.306 o
131.601 197.313 o
134.97 202.152 o
138.338 197.48 o
141.707 194.757 o
145.075 196.55 o
148.444 197.837 o
151.813 198.781 o
155.181 200.368 o
158.55 202.009 o
161.919 203.357 o
165.287 204.133 o
168.656 204.371 o
172.025 204.727 o
175.393 205.656 o
178.762 206.91 o
182.13 207.986 o
185.499 208.89 o
188.868 209.838 o
192.236 210.792 o
195.605 211.655 o
198.974 212.401 o
202.342 213.057 o
205.711 213.693 o
209.079 214.343 o
212.448 214.959 o
215.817 215.514 o
219.185 216.035 o
222.554 216.54 o
225.923 217.024 o
229.291 217.477 o
232.66 217.9 o
236.028 218.298 o
239.397 218.681 o
242.766 219.044 o
246.134 219.386 o
249.503 219.707 o
252.872 220.013 o
256.24 220.302 o
259.609 220.576 o
262.977 220.835 o
266.346 221.079 o
269.715 221.31 o
273.083 221.528 o
276.452 221.735 o
279.821 221.93 o
283.189 222.114 o
286.558 222.288 o
289.927 222.452 o
293.295 222.608 o
296.664 222.754 o
300.032 222.892 o
303.401 223.023 o
306.77 223.146 o
310.138 223.262 o
313.507 223.371 o
316.876 223.475 o
320.244 223.572 o
323.613 223.664 o
326.981 223.751 o
330.35 223.832 o
333.719 223.91 o
337.087 223.982 o
340.456 224.051 o
343.825 224.115 o
347.193 224.176 o
350.562 224.234 o
353.93 224.288 o
357.299 224.339 o
360.668 224.387 o
364.036 224.432 o
367.405 224.475 o
370.774 224.515 o
374.142 224.553 o
377.511 224.589 o
380.88 224.622 o
384.248 224.654 o
387.617 224.684 o
390.985 224.712 o
394.354 224.739 o
397.649 224.764 o
grestore
1.500 setlinewidth
2 setlinecap
0.173 0.627 0.173 setrgbcolor
gsave
369.233 194.819 45.2 41.606 clipbox
64.228368 50.461667 m
67.596997 55.274759 l
70.965627 103.996719 l
74.334256 117.302247 l
77.702885 104.731715 l
81.071514 106.275748 l
84.440144 121.731704 l
87.808773 122.440799 l
91.177402 113.868647 l
94.546031 110.479162 l
97.914661 121.221076 l
101.28329 143.324714 l
104.651919 165.652353 l
108.020548 172.619327 l
111.389178 161.788217 l
114.757807 155.637493 l
118.126436 159.992701 l
121.495065 176.247925 l
124.863694 189.180256 l
128.232324 198.960373 l
131.600953 202.052558 l
134.969582 198.266239 l
138.338211 196.521124 l
141.706841 198.624897 l
145.07547 199.248208 l
148.444099 199.111062 l
151.812728 200.502493 l
155.181358 202.581705 l
158.549987 203.698864 l
161.918616 203.576409 l
165.287245 203.303393 l
168.655875 204.116177 l
172.024504 205.63092 l
175.393133 206.791709 l
178.761762 207.661181 l
182.130391 208.792143 l
185.499021 210.072259 l
188.86765 211.128891 l
192.236279 211.879663 l
195.604908 212.507562 l
198.973538 213.200839 l
202.342167 213.91936 l
205.710796 214.521559 l
209.079425 215.03545 l
212.448055 215.565589 l
215.816684 216.107388 l
219.185313 216.605444 l
222.553942 217.051398 l
225.922572 217.474504 l
229.291201 217.894169 l
232.65983 218.296978 l
236.028459 218.664912 l
239.397089 219.007057 l
242.765718 219.337514 l
246.134347 219.652414 l
249.502976 219.944586 l
252.871605 220.216635 l
256.240235 220.473999 l
259.608864 220.717995 l
262.977493 220.946738 l
266.346122 221.160103 l
269.714752 221.360879 l
273.083381 221.550649 l
276.45201 221.728809 l
279.820639 221.895599 l
283.189269 222.052436 l
286.557898 222.200117 l
289.926527 222.338831 l
293.295156 222.468961 l
296.663786 222.591179 l
300.032415 222.706059 l
303.401044 222.813931 l
306.769673 222.915116 l
310.138302 223.0101 l
313.506932 223.099297 l
316.875561 223.182985 l
320.24419 223.261481 l
323.612819 223.335149 l
326.981449 223.404284 l
330.350078 223.469135 l
333.718707 223.529969 l
337.087336 223.58705 l
340.455966 223.64061 l
343.824595 223.690854 l
347.193224 223.737987 l
350.561853 223.782212 l
353.930483 223.82371 l
357.299112 223.86264 l
360.667741 223.899164 l
364.03637 223.933437 l
367.404999 223.965596 l
370.773629 223.995769 l
374.142258 224.024082 l
377.510887 224.050651 l
380.879516 224.075584 l
384.248146 224.098982 l
387.616775 224.12094 l
390.985404 224.141549 l
394.354033 224.160893 l
397.649215 224.178665 l
stroke
grestore
1.000 setlinewidth
0 setlinecap
gsave
369.233 194.819 45.2 41.606 clipbox
/o {
gsave
newpath
translate
1.0 setlinewidth
1 setlinejoin

0 setlinecap

-2.5 -2.5 m
2.5 2.5 l
-2.5 2.5 m
2.5 -2.5 l

gsave
grestore
stroke
grestore
} bind def
64.2284 50.4617 o
67.597 55.2748 o
70.9656 103.997 o
74.3343 117.302 o
77.7029 104.732 o
81.0715 106.276 o
84.4401 121.732 o
87.8088 122.441 o
91.1774 113.869 o
94.546 110.479 o
97.9147 121.221 o
101.283 143.325 o
104.652 165.652 o
108.021 172.619 o
111.389 161.788 o
114.758 155.637 o
118.126 159.993 o
121.495 176.248 o
124.864 189.18 o
128.232 198.96 o
131.601 202.053 o
134.97 198.266 o
138.338 196.521 o
141.707 198.625 o
145.075 199.248 o
148.444 199.111 o
151.813 200.502 o
155.181 202.582 o
158.55 203.699 o
161.919 203.576 o
165.287 203.303 o
168.656 204.116 o
172.025 205.631 o
175.393 206.792 o
178.762 207.661 o
182.13 208.792 o
185.499 210.072 o
188.868 211.129 o
192.236 211.88 o
195.605 212.508 o
198.974 213.201 o
202.342 213.919 o
205.711 214.522 o
209.079 215.035 o
212.448 215.566 o
215.817 216.107 o
219.185 216.605 o
222.554 217.051 o
225.923 217.475 o
229.291 217.894 o
232.66 218.297 o
236.028 218.665 o
239.397 219.007 o
242.766 219.338 o
246.134 219.652 o
249.503 219.945 o
252.872 220.217 o
256.24 220.474 o
259.609 220.718 o
262.977 220.947 o
266.346 221.16 o
269.715 221.361 o
273.083 221.551 o
276.452 221.729 o
279.821 221.896 o
283.189 222.052 o
286.558 222.2 o
289.927 222.339 o
293.295 222.469 o
296.664 222.591 o
300.032 222.706 o
303.401 222.814 o
306.77 222.915 o
310.138 223.01 o
313.507 223.099 o
316.876 223.183 o
320.244 223.261 o
323.613 223.335 o
326.981 223.404 o
330.35 223.469 o
333.719 223.53 o
337.087 223.587 o
340.456 223.641 o
343.825 223.691 o
347.193 223.738 o
350.562 223.782 o
353.93 223.824 o
357.299 223.863 o
360.668 223.899 o
364.036 223.933 o
367.405 223.966 o
370.774 223.996 o
374.142 224.024 o
377.511 224.051 o
380.88 224.076 o
384.248 224.099 o
387.617 224.121 o
390.985 224.142 o
394.354 224.161 o
397.649 224.179 o
grestore
1.500 setlinewidth
2 setlinecap
0.122 0.467 0.706 setrgbcolor
gsave
369.233 194.819 45.2 41.606 clipbox
61.983296 50.461648 m
66.477524 50.52485 l
67.601081 54.297901 l
68.724638 82.493634 l
69.848195 90.860519 l
70.971752 97.636081 l
72.095309 119.491177 l
73.218866 122.156017 l
74.342423 115.388907 l
75.46598 110.08846 l
76.589537 107.409439 l
77.713094 106.069921 l
78.836651 105.607033 l
79.960208 106.712755 l
81.083765 110.055347 l
84.454435 124.72728 l
85.577992 126.329666 l
86.701549 125.308408 l
87.825106 122.728912 l
90.07222 116.617959 l
91.195777 114.449093 l
92.319334 113.60136 l
93.442891 114.280288 l
94.566448 116.426821 l
95.690005 119.825118 l
96.813562 124.163802 l
97.937119 129.197308 l
99.060676 134.954266 l
103.554904 160.81551 l
104.678461 165.833067 l
105.802018 169.075918 l
106.925575 169.987817 l
108.049132 168.973896 l
109.172689 166.665211 l
111.419803 160.862798 l
112.54336 158.462913 l
113.666917 156.891554 l
114.790474 156.364588 l
115.914031 157.142838 l
117.037588 159.43878 l
118.161145 163.15675 l
121.531816 177.202711 l
122.655373 181.167599 l
124.902486 187.912609 l
127.1496 193.885333 l
128.273157 196.607353 l
129.396714 198.922188 l
130.520271 200.546811 l
131.643828 201.270139 l
132.767385 201.086861 l
133.890942 200.236588 l
136.138056 198.122236 l
137.261613 197.497653 l
138.38517 197.31019 l
139.508727 197.482552 l
145.126512 199.326232 l
147.373626 199.571852 l
150.744297 199.921741 l
152.991411 200.460547 l
158.609196 202.279516 l
160.85631 202.515661 l
165.350537 202.715598 l
167.597651 203.178168 l
169.844765 203.959484 l
173.215436 205.490402 l
176.586107 206.993882 l
179.956778 208.223538 l
186.69812 210.367844 l
190.068791 211.248638 l
193.439462 211.900992 l
214.787044 215.186597 l
226.022614 216.788528 l
236.134627 217.958382 l
246.24664 218.918977 l
258.605766 219.887445 l
273.212007 220.801295 l
288.941805 221.559845 l
306.918716 222.204908 l
328.266299 222.746339 l
355.231666 223.192269 l
390.061932 223.525449 l
397.649036 223.574319 l
397.649036 223.574319 l
stroke
grestore
1.000 setlinewidth
0 setlinecap
gsave
369.233 194.819 45.2 41.606 clipbox
/o {
gsave
newpath
translate
1.0 setlinewidth
1 setlinejoin

0 setlinecap

0 -1.25 m
0.331504 -1.25 0.649475 -1.118292 0.883883 -0.883883 c
1.118292 -0.649475 1.25 -0.331504 1.25 0 c
1.25 0.331504 1.118292 0.649475 0.883883 0.883883 c
0.649475 1.118292 0.331504 1.25 0 1.25 c
-0.331504 1.25 -0.649475 1.118292 -0.883883 0.883883 c
-1.118292 0.649475 -1.25 0.331504 -1.25 0 c
-1.25 -0.331504 -1.118292 -0.649475 -0.883883 -0.883883 c
-0.649475 -1.118292 -0.331504 -1.25 0 -1.25 c
cl

gsave
0.122 0.467 0.706 setrgbcolor
fill
grestore
stroke
grestore
} bind def
61.9833 50.4616 o
63.1069 50.4616 o
64.2304 50.4617 o
65.354 50.4618 o
66.4775 50.5249 o
67.6011 54.2979 o
68.7246 82.4936 o
69.8482 90.8605 o
70.9718 97.6361 o
72.0953 119.491 o
73.2189 122.156 o
74.3424 115.389 o
75.466 110.088 o
76.5895 107.409 o
77.7131 106.07 o
78.8367 105.607 o
79.9602 106.713 o
81.0838 110.055 o
82.2073 115.095 o
83.3309 120.518 o
84.4544 124.727 o
85.578 126.33 o
86.7015 125.308 o
87.8251 122.729 o
88.9487 119.595 o
90.0722 116.618 o
91.1958 114.449 o
92.3193 113.601 o
93.4429 114.28 o
94.5664 116.427 o
95.69 119.825 o
96.8136 124.164 o
97.9371 129.197 o
99.0607 134.954 o
100.184 141.511 o
101.308 148.429 o
102.431 154.958 o
103.555 160.816 o
104.678 165.833 o
105.802 169.076 o
106.926 169.988 o
108.049 168.974 o
109.173 166.665 o
110.296 163.759 o
111.42 160.863 o
112.543 158.463 o
113.667 156.892 o
114.79 156.365 o
115.914 157.143 o
117.038 159.439 o
118.161 163.157 o
119.285 167.81 o
120.408 172.687 o
121.532 177.203 o
122.655 181.168 o
123.779 184.685 o
124.902 187.913 o
126.026 190.965 o
127.15 193.885 o
128.273 196.607 o
129.397 198.922 o
130.52 200.547 o
131.644 201.27 o
132.767 201.087 o
133.891 200.237 o
135.014 199.118 o
136.138 198.122 o
137.262 197.498 o
138.385 197.31 o
139.509 197.483 o
140.632 197.869 o
141.756 198.326 o
142.879 198.75 o
144.003 199.088 o
145.127 199.326 o
146.25 199.476 o
147.374 199.572 o
148.497 199.655 o
149.621 199.763 o
150.744 199.922 o
151.868 200.151 o
152.991 200.461 o
154.115 200.841 o
155.239 201.26 o
156.362 201.669 o
157.486 202.019 o
158.609 202.28 o
159.733 202.44 o
160.856 202.516 o
161.98 202.541 o
163.103 202.558 o
164.227 202.606 o
165.351 202.716 o
166.474 202.904 o
167.598 203.178 o
168.721 203.533 o
169.845 203.959 o
170.968 204.441 o
172.092 204.958 o
173.215 205.49 o
174.339 206.017 o
175.463 206.521 o
176.586 206.994 o
177.71 207.432 o
178.833 207.839 o
179.957 208.224 o
181.08 208.595 o
182.204 208.96 o
183.327 209.322 o
184.451 209.68 o
185.575 210.031 o
186.698 210.368 o
187.822 210.686 o
188.945 210.981 o
190.069 211.249 o
191.192 211.49 o
192.316 211.706 o
193.439 211.901 o
194.563 212.08 o
195.687 212.248 o
196.81 212.41 o
197.934 212.571 o
199.057 212.735 o
200.181 212.903 o
201.304 213.077 o
202.428 213.256 o
203.551 213.439 o
204.675 213.623 o
205.799 213.806 o
206.922 213.987 o
208.046 214.164 o
209.169 214.338 o
210.293 214.51 o
211.416 214.679 o
212.54 214.848 o
213.663 215.017 o
214.787 215.187 o
215.911 215.357 o
217.034 215.526 o
218.158 215.695 o
219.281 215.862 o
220.405 216.027 o
221.528 216.187 o
222.652 216.344 o
223.776 216.496 o
224.899 216.644 o
226.023 216.789 o
227.146 216.929 o
228.27 217.067 o
229.393 217.201 o
230.517 217.334 o
231.64 217.463 o
232.764 217.591 o
233.888 217.716 o
235.011 217.839 o
236.135 217.958 o
237.258 218.075 o
238.382 218.19 o
239.505 218.301 o
240.629 218.409 o
241.752 218.515 o
242.876 218.619 o
244 218.721 o
245.123 218.821 o
246.247 218.919 o
247.37 219.016 o
248.494 219.11 o
249.617 219.204 o
250.741 219.295 o
251.864 219.385 o
252.988 219.473 o
254.112 219.559 o
255.235 219.644 o
256.359 219.726 o
257.482 219.808 o
258.606 219.887 o
259.729 219.966 o
260.853 220.043 o
261.976 220.118 o
263.1 220.193 o
264.224 220.265 o
265.347 220.337 o
266.471 220.407 o
267.594 220.476 o
268.718 220.544 o
269.841 220.61 o
270.965 220.675 o
272.088 220.739 o
273.212 220.801 o
274.336 220.863 o
275.459 220.923 o
276.583 220.982 o
277.706 221.04 o
278.83 221.096 o
279.953 221.152 o
281.077 221.207 o
282.2 221.26 o
283.324 221.313 o
284.448 221.364 o
285.571 221.414 o
286.695 221.464 o
287.818 221.512 o
288.942 221.56 o
290.065 221.606 o
291.189 221.652 o
292.312 221.697 o
293.436 221.741 o
294.56 221.784 o
295.683 221.826 o
296.807 221.867 o
297.93 221.908 o
299.054 221.948 o
300.177 221.987 o
301.301 222.025 o
302.424 222.062 o
303.548 222.099 o
304.672 222.135 o
305.795 222.17 o
306.919 222.205 o
308.042 222.239 o
309.166 222.272 o
310.289 222.305 o
311.413 222.337 o
312.537 222.368 o
313.66 222.399 o
314.784 222.429 o
315.907 222.458 o
317.031 222.487 o
318.154 222.515 o
319.278 222.543 o
320.401 222.57 o
321.525 222.597 o
322.649 222.623 o
323.772 222.649 o
324.896 222.674 o
326.019 222.699 o
327.143 222.723 o
328.266 222.746 o
329.39 222.77 o
330.513 222.792 o
331.637 222.815 o
332.761 222.836 o
333.884 222.858 o
335.008 222.879 o
336.131 222.899 o
337.255 222.919 o
338.378 222.939 o
339.502 222.959 o
340.625 222.977 o
341.749 222.996 o
342.873 223.014 o
343.996 223.032 o
345.12 223.05 o
346.243 223.067 o
347.367 223.084 o
348.49 223.1 o
349.614 223.116 o
350.737 223.132 o
351.861 223.148 o
352.985 223.163 o
354.108 223.178 o
355.232 223.192 o
356.355 223.207 o
357.479 223.221 o
358.602 223.234 o
359.726 223.248 o
360.849 223.261 o
361.973 223.274 o
363.097 223.287 o
364.22 223.299 o
365.344 223.311 o
366.467 223.323 o
367.591 223.335 o
368.714 223.346 o
369.838 223.358 o
370.961 223.369 o
372.085 223.379 o
373.209 223.39 o
374.332 223.4 o
375.456 223.41 o
376.579 223.42 o
377.703 223.43 o
378.826 223.44 o
379.95 223.449 o
381.073 223.458 o
382.197 223.467 o
383.321 223.476 o
384.444 223.485 o
385.568 223.493 o
386.691 223.502 o
387.815 223.51 o
388.938 223.518 o
390.062 223.525 o
391.185 223.533 o
392.309 223.541 o
393.433 223.548 o
394.556 223.555 o
395.68 223.562 o
396.803 223.569 o
397.649 223.574 o
grestore
0.800 setlinewidth
0 setlinejoin
2 setlinecap
0.000 setgray
gsave
45.2 41.60625 m
45.2 236.425 l
stroke
grestore
gsave
414.432511 41.60625 m
414.432511 236.425 l
stroke
grestore
gsave
45.2 41.60625 m
414.432511 41.60625 l
stroke
grestore
gsave
45.2 236.425 m
414.432511 236.425 l
stroke
grestore
1.000 setlinewidth
0 setlinecap
gsave
369.233 194.819 45.2 41.606 clipbox
375.196364 220.541509 m
397.64898 220.541509 l
397.64898 227.569602 l
375.196364 227.569602 l
375.196364 220.541509 l
cl
stroke
grestore
1 setlinejoin
1 setlinecap
gsave
203.96998 168.238437 m
261.045441 188.015492 318.120902 207.792547 375.196364 227.569602 c
stroke
grestore
gsave
388.586235 109.792812 m
391.60715 146.709045 394.628065 183.625277 397.64898 220.541509 c
stroke
grestore
gsave
203.96998 109.792812 m
388.586235 109.792812 l
388.586235 168.238437 l
203.96998 168.238437 l
cl
1.000 setgray
fill
grestore
0.800 setlinewidth
0 setlinecap
gsave
/o {
gsave
newpath
translate
0.8 setlinewidth
1 setlinejoin

0 setlinecap

0 0 m
0 -3.5 l

gsave
0.000 setgray
fill
grestore
stroke
grestore
} bind def
203.97 109.793 o
grestore
gsave
/o {
gsave
newpath
translate
0.8 setlinewidth
1 setlinejoin

0 setlinecap

0 0 m
0 -3.5 l

gsave
0.000 setgray
fill
grestore
stroke
grestore
} bind def
240.893 109.793 o
grestore
gsave
/o {
gsave
newpath
translate
0.8 setlinewidth
1 setlinejoin

0 setlinecap

0 0 m
0 -3.5 l

gsave
0.000 setgray
fill
grestore
stroke
grestore
} bind def
277.816 109.793 o
grestore
gsave
/o {
gsave
newpath
translate
0.8 setlinewidth
1 setlinejoin

0 setlinecap

0 0 m
0 -3.5 l

gsave
0.000 setgray
fill
grestore
stroke
grestore
} bind def
314.74 109.793 o
grestore
gsave
/o {
gsave
newpath
translate
0.8 setlinewidth
1 setlinejoin

0 setlinecap

0 0 m
0 -3.5 l

gsave
0.000 setgray
fill
grestore
stroke
grestore
} bind def
351.663 109.793 o
grestore
gsave
/o {
gsave
newpath
translate
0.8 setlinewidth
1 setlinejoin

0 setlinecap

0 0 m
0 -3.5 l

gsave
0.000 setgray
fill
grestore
stroke
grestore
} bind def
388.586 109.793 o
grestore
gsave
/o {
gsave
newpath
translate
0.8 setlinewidth
1 setlinejoin

0 setlinecap

-0 0 m
-3.5 0 l

gsave
0.000 setgray
fill
grestore
stroke
grestore
} bind def
203.97 127.327 o
grestore
gsave
169.969980 123.224938 translate
0.000000 rotate
/STIXGeneral-Regular 12.0 selectfont
0.000000 0.750000 moveto
/one glyphshow
5.999985 0.750000 moveto
/two glyphshow
11.999969 0.750000 moveto
/period glyphshow
14.999954 0.750000 moveto
/two glyphshow
20.999939 0.750000 moveto
/five glyphshow
grestore
gsave
/o {
gsave
newpath
translate
0.8 setlinewidth
1 setlinejoin

0 setlinecap

-0 0 m
-3.5 0 l

gsave
0.000 setgray
fill
grestore
stroke
grestore
} bind def
203.97 156.549 o
grestore
gsave
169.969980 152.447750 translate
0.000000 rotate
/STIXGeneral-Regular 12.0 selectfont
0.000000 0.750000 moveto
/one glyphshow
5.999985 0.750000 moveto
/two glyphshow
11.999969 0.750000 moveto
/period glyphshow
14.999954 0.750000 moveto
/five glyphshow
20.999939 0.750000 moveto
/zero glyphshow
grestore
1.500 setlinewidth
2 setlinecap
1.000 0.498 0.055 setrgbcolor
gsave
184.616 58.446 203.97 109.793 clipbox
-1 140.453972 m
1.413134 140.495554 l
29.111631 140.945482 l
56.810128 141.369605 l
84.508625 141.769405 l
112.207122 142.146271 l
139.905618 142.501522 l
167.604115 142.836391 l
195.302612 143.152051 l
223.001109 143.449603 l
250.699606 143.730093 l
278.398103 143.9945 l
306.0966 144.24375 l
333.795097 144.478717 l
361.493593 144.700222 l
388.588169 144.904622 l
stroke
grestore
1.000 setlinewidth
0 setlinecap
gsave
184.616 58.446 203.97 109.793 clipbox
/o {
gsave
newpath
translate
1.0 setlinewidth
1 setlinejoin

0 setlinecap

0 -2.5 m
0.663008 -2.5 1.29895 -2.236584 1.767767 -1.767767 c
2.236584 -1.29895 2.5 -0.663008 2.5 0 c
2.5 0.663008 2.236584 1.29895 1.767767 1.767767 c
1.29895 2.236584 0.663008 2.5 0 2.5 c
-0.663008 2.5 -1.29895 2.236584 -1.767767 1.767767 c
-2.236584 1.29895 -2.5 0.663008 -2.5 0 c
-2.5 -0.663008 -2.236584 -1.29895 -1.767767 -1.767767 c
-1.29895 -2.236584 -0.663008 -2.5 0 -2.5 c
cl

gsave
grestore
stroke
grestore
} bind def
-1 140.454 o
1.41313 140.496 o
29.1116 140.945 o
56.8101 141.37 o
84.5086 141.769 o
112.207 142.146 o
139.906 142.502 o
167.604 142.836 o
195.303 143.152 o
223.001 143.45 o
250.7 143.73 o
278.398 143.994 o
306.097 144.244 o
333.795 144.479 o
361.494 144.7 o
388.588 144.905 o
grestore
1.500 setlinewidth
2 setlinecap
0.173 0.627 0.173 setrgbcolor
gsave
184.616 58.446 203.97 109.793 clipbox
-1 136.710462 m
1.413134 136.742503 l
29.111631 137.087598 l
56.810128 137.411341 l
84.508625 137.715073 l
112.207122 138.000083 l
139.905618 138.267521 l
167.604115 138.518442 l
195.302612 138.753887 l
223.001109 138.974836 l
250.699606 139.182184 l
278.398103 139.37676 l
306.0966 139.559363 l
333.795097 139.73075 l
361.493593 139.891611 l
388.588169 140.039402 l
stroke
grestore
1.000 setlinewidth
0 setlinecap
gsave
184.616 58.446 203.97 109.793 clipbox
/o {
gsave
newpath
translate
1.0 setlinewidth
1 setlinejoin

0 setlinecap

-2.5 -2.5 m
2.5 2.5 l
-2.5 2.5 m
2.5 -2.5 l

gsave
grestore
stroke
grestore
} bind def
-1 136.71 o
1.41313 136.743 o
29.1116 137.088 o
56.8101 137.411 o
84.5086 137.715 o
112.207 138 o
139.906 138.268 o
167.604 138.518 o
195.303 138.754 o
223.001 138.975 o
250.7 139.182 o
278.398 139.377 o
306.097 139.559 o
333.795 139.731 o
361.494 139.892 o
388.588 140.039 o
grestore
1.500 setlinewidth
2 setlinecap
0.122 0.467 0.706 setrgbcolor
gsave
184.616 58.446 203.97 109.793 clipbox
-1 131.280971 m
76.764303 132.298399 l
169.148585 133.302542 l
280.009723 134.268698 l
388.586697 135.013664 l
388.586697 135.013664 l
stroke
grestore
1.000 setlinewidth
0 setlinecap
gsave
184.616 58.446 203.97 109.793 clipbox
/o {
gsave
newpath
translate
1.0 setlinewidth
1 setlinejoin

0 setlinecap

0 -1.25 m
0.331504 -1.25 0.649475 -1.118292 0.883883 -0.883883 c
1.118292 -0.649475 1.25 -0.331504 1.25 0 c
1.25 0.331504 1.118292 0.649475 0.883883 0.883883 c
0.649475 1.118292 0.331504 1.25 0 1.25 c
-0.331504 1.25 -0.649475 1.118292 -0.883883 0.883883 c
-1.118292 0.649475 -1.25 0.331504 -1.25 0 c
-1.25 -0.331504 -1.118292 -0.649475 -0.883883 -0.883883 c
-0.649475 -1.118292 -0.331504 -1.25 0 -1.25 c
cl

gsave
0.122 0.467 0.706 setrgbcolor
fill
grestore
stroke
grestore
} bind def
-1 131.281 o
2.85688 131.336 o
12.0953 131.465 o
21.3337 131.591 o
30.5722 131.715 o
39.8106 131.837 o
49.049 131.956 o
58.2874 132.072 o
67.5259 132.186 o
76.7643 132.298 o
86.0027 132.408 o
95.2412 132.516 o
104.48 132.621 o
113.718 132.724 o
122.956 132.826 o
132.195 132.925 o
141.433 133.022 o
150.672 133.118 o
159.91 133.211 o
169.149 133.303 o
178.387 133.392 o
187.625 133.48 o
196.864 133.566 o
206.102 133.651 o
215.341 133.734 o
224.579 133.815 o
233.818 133.894 o
243.056 133.972 o
252.294 134.049 o
261.533 134.123 o
270.771 134.197 o
280.01 134.269 o
289.248 134.339 o
298.487 134.408 o
307.725 134.476 o
316.963 134.542 o
326.202 134.607 o
335.44 134.671 o
344.679 134.733 o
353.917 134.795 o
363.156 134.855 o
372.394 134.913 o
381.632 134.971 o
388.587 135.014 o
grestore
0.800 setlinewidth
0 setlinejoin
2 setlinecap
0.000 setgray
gsave
203.96998 109.792813 m
203.96998 168.238438 l
stroke
grestore
gsave
388.586235 109.792813 m
388.586235 168.238438 l
stroke
grestore
gsave
203.96998 109.792812 m
388.586235 109.792812 l
stroke
grestore
gsave
203.96998 168.238437 m
388.586235 168.238437 l
stroke
grestore
1.000 setlinewidth
0 setlinecap
0.800 setgray
gsave
304.432511 46.60625 m
407.432511 46.60625 l
408.765844 46.60625 409.432511 47.272917 409.432511 48.60625 c
409.432511 91.79375 l
409.432511 93.127083 408.765844 93.79375 407.432511 93.79375 c
304.432511 93.79375 l
303.099178 93.79375 302.432511 93.127083 302.432511 91.79375 c
302.432511 48.60625 l
302.432511 47.272917 303.099178 46.60625 304.432511 46.60625 c
cl
gsave
1.000 setgray
fill
grestore
stroke
grestore
1.500 setlinewidth
1 setlinejoin
2 setlinecap
1.000 0.498 0.055 setrgbcolor
gsave
306.432511 85.465625 m
316.432511 85.465625 l
326.432511 85.465625 l
stroke
grestore
1.000 setlinewidth
0 setlinecap
gsave
/o {
gsave
newpath
translate
1.0 setlinewidth
1 setlinejoin

0 setlinecap

0 -2.5 m
0.663008 -2.5 1.29895 -2.236584 1.767767 -1.767767 c
2.236584 -1.29895 2.5 -0.663008 2.5 0 c
2.5 0.663008 2.236584 1.29895 1.767767 1.767767 c
1.29895 2.236584 0.663008 2.5 0 2.5 c
-0.663008 2.5 -1.29895 2.236584 -1.767767 1.767767 c
-2.236584 1.29895 -2.5 0.663008 -2.5 0 c
-2.5 -0.663008 -2.236584 -1.29895 -1.767767 -1.767767 c
-1.29895 -2.236584 -0.663008 -2.5 0 -2.5 c
cl

gsave
grestore
stroke
grestore
} bind def
316.433 85.4656 o
grestore
0.000 setgray
gsave
334.432511 81.965625 translate
0.000000 rotate
/STIXGeneral-Regular 10.0 selectfont
0.000000 0.875000 moveto
/s glyphshow
3.889984 0.875000 moveto
/c glyphshow
8.329971 0.875000 moveto
/a glyphshow
12.769958 0.875000 moveto
/t glyphshow
15.549942 0.875000 moveto
/t glyphshow
18.329926 0.875000 moveto
/e glyphshow
22.769913 0.875000 moveto
/r glyphshow
26.099899 0.875000 moveto
/e glyphshow
30.539886 0.875000 moveto
/d glyphshow
35.539871 0.875000 moveto
/comma glyphshow
38.039856 0.875000 moveto
/space glyphshow
/Cmmi10 10.0 selectfont
40.539841 0.875000 moveto
/delta glyphshow
/Cmmi10 7.0 selectfont
44.978317 -0.825625 moveto
/h glyphshow
/Cmr10 10.0 selectfont
51.405114 0.875000 moveto
/equal glyphshow
60.929528 0.875000 moveto
/seven glyphshow
65.929528 0.875000 moveto
/zero glyphshow
grestore
1.500 setlinewidth
2 setlinecap
0.173 0.627 0.173 setrgbcolor
gsave
306.432511 70.465625 m
316.432511 70.465625 l
326.432511 70.465625 l
stroke
grestore
1.000 setlinewidth
0 setlinecap
gsave
/o {
gsave
newpath
translate
1.0 setlinewidth
1 setlinejoin

0 setlinecap

-2.5 -2.5 m
2.5 2.5 l
-2.5 2.5 m
2.5 -2.5 l

gsave
grestore
stroke
grestore
} bind def
316.433 70.4656 o
grestore
0.000 setgray
gsave
334.432511 66.965625 translate
0.000000 rotate
/STIXGeneral-Regular 10.0 selectfont
0.000000 0.875000 moveto
/s glyphshow
3.889984 0.875000 moveto
/c glyphshow
8.329971 0.875000 moveto
/a glyphshow
12.769958 0.875000 moveto
/t glyphshow
15.549942 0.875000 moveto
/t glyphshow
18.329926 0.875000 moveto
/e glyphshow
22.769913 0.875000 moveto
/r glyphshow
26.099899 0.875000 moveto
/e glyphshow
30.539886 0.875000 moveto
/d glyphshow
35.539871 0.875000 moveto
/comma glyphshow
38.039856 0.875000 moveto
/space glyphshow
/Cmmi10 10.0 selectfont
40.539841 0.875000 moveto
/delta glyphshow
/Cmmi10 7.0 selectfont
44.978317 -0.825625 moveto
/h glyphshow
/Cmr10 10.0 selectfont
51.405114 0.875000 moveto
/equal glyphshow
60.929528 0.875000 moveto
/four glyphshow
grestore
1.500 setlinewidth
2 setlinecap
0.122 0.467 0.706 setrgbcolor
gsave
306.432511 56.29375 m
316.432511 56.29375 l
326.432511 56.29375 l
stroke
grestore
1.000 setlinewidth
0 setlinecap
gsave
/o {
gsave
newpath
translate
1.0 setlinewidth
1 setlinejoin

0 setlinecap

0 -1.25 m
0.331504 -1.25 0.649475 -1.118292 0.883883 -0.883883 c
1.118292 -0.649475 1.25 -0.331504 1.25 0 c
1.25 0.331504 1.118292 0.649475 0.883883 0.883883 c
0.649475 1.118292 0.331504 1.25 0 1.25 c
-0.331504 1.25 -0.649475 1.118292 -0.883883 0.883883 c
-1.118292 0.649475 -1.25 0.331504 -1.25 0 c
-1.25 -0.331504 -1.118292 -0.649475 -0.883883 -0.883883 c
-0.649475 -1.118292 -0.331504 -1.25 0 -1.25 c
cl

gsave
0.122 0.467 0.706 setrgbcolor
fill
grestore
stroke
grestore
} bind def
316.433 56.2938 o
grestore
0.000 setgray
/STIXGeneral-Regular 10.000 selectfont
gsave

334.432511 52.793750 translate
0.000000 rotate
0.000000 0 m /h glyphshow
4.999985 0 m /y glyphshow
9.999969 0 m /b glyphshow
14.999954 0 m /r glyphshow
18.329941 0 m /i glyphshow
21.109924 0 m /d glyphshow
grestore

end
showpage
