%!PS-Adobe-3.0 EPSF-3.0
%%Title: irregular_2d_conv.eps
%%Creator: Matplotlib v3.7.2, https://matplotlib.org/
%%CreationDate: Fri Oct 13 16:42:47 2023
%%Orientation: portrait
%%BoundingBox: -11 256 624 536
%%HiResBoundingBox: -11.843975 256.367978 623.843975 535.632022
%%EndComments
%%BeginProlog
/mpldict 12 dict def
mpldict begin
/_d { bind def } bind def
/m { moveto } _d
/l { lineto } _d
/r { rlineto } _d
/c { curveto } _d
/cl { closepath } _d
/ce { closepath eofill } _d
/box {
      m
      1 index 0 r
      0 exch r
      neg 0 r
      cl
    } _d
/clipbox {
      box
      clip
      newpath
    } _d
/sc { setcachedevice } _d
%!PS-Adobe-3.0 Resource-Font
%%Creator: Converted from TrueType to Type 3 by Matplotlib.
10 dict begin
/FontName /STIXGeneral-Regular def
/PaintType 0 def
/FontMatrix [0.001 0 0 0.001 0 0] def
/FontBBox [-970 -443 2000 1023] def
/FontType 3 def
/Encoding [/space /hyphen /period /zero /one /two /three /four /five /six /seven /eight /nine /D /F /M /N /bracketleft /bracketright /a /b /c /d /e /h /i /k /l /m /n /o /r /s /t /u /x /y] def
/CharStrings 38 dict dup begin
/.notdef 0 def
/space{250 0 0 0 0 0 sc
ce} _d
/hyphen{333 0 39 194 285 257 sc
285 194 m
39 194 l
39 257 l
285 257 l
285 194 l

ce} _d
/period{250 0 70 -11 181 100 sc
181 43 m
181 28 175 16 164 5 c
153 -6 140 -11 125 -11 c
110 -11 97 -6 86 5 c
75 16 70 29 70 44 c
70 59 75 72 86 83 c
97 94 111 100 126 100 c
141 100 153 94 164 83 c
175 72 181 58 181 43 c

ce} _d
/zero{500 0 24 -14 476 676 sc
476 330 m
476 285 472 243 463 203 c
454 164 441 127 424 94 c
407 61 384 34 354 15 c
324 -4 289 -14 250 -14 c
209 -14 174 -4 143 17 c
112 38 89 65 72 100 c
55 135 43 172 35 211 c
28 250 24 292 24 336 c
24 398 32 454 47 503 c
62 553 88 594 123 627 c
159 660 203 676 254 676 c
319 676 373 644 414 580 c
455 516 476 433 476 330 c

380 325 m
380 430 369 511 346 566 c
324 622 291 650 248 650 c
207 650 175 622 153 566 c
131 510 120 431 120 329 c
120 226 131 148 153 93 c
175 39 207 12 250 12 c
292 12 324 39 346 93 c
369 148 380 225 380 325 c

ce} _d
/one{500 0 111 0 394 676 sc
394 0 m
118 0 l
118 15 l
155 17 180 24 193 35 c
206 47 213 67 213 95 c
213 544 l
213 577 203 593 183 593 c
174 593 159 589 138 581 c
111 571 l
111 585 l
290 676 l
299 673 l
299 76 l
299 54 306 38 319 29 c
332 20 357 15 394 15 c
394 0 l

ce} _d
/two{500 0 29 0 474 676 sc
474 137 m
420 0 l
29 0 l
29 12 l
207 201 l
254 250 287 294 307 335 c
327 376 337 418 337 461 c
337 506 325 540 300 565 c
275 590 241 602 198 602 c
162 602 133 593 112 574 c
91 555 71 521 51 472 c
30 477 l
41 539 64 588 98 623 c
133 658 179 676 238 676 c
293 676 338 659 372 626 c
406 593 423 551 423 500 c
423 425 380 342 295 252 c
130 76 l
364 76 l
386 76 403 80 416 89 c
429 98 444 116 460 143 c
474 137 l

ce} _d
/three{500 0 41 -14 431 676 sc
61 510 m
45 514 l
60 564 84 603 117 632 c
150 661 191 676 241 676 c
288 676 325 663 354 638 c
383 613 397 580 397 539 c
397 484 366 438 304 401 c
341 385 368 367 387 348 c
416 315 431 272 431 219 c
431 166 416 119 385 79 c
362 48 330 25 287 9 c
245 -6 200 -14 153 -14 c
78 -14 41 5 41 43 c
41 54 45 62 53 69 c
61 76 71 79 82 79 c
99 79 119 70 143 53 c
172 32 201 22 229 22 c
266 22 296 37 321 66 c
346 96 359 132 359 175 c
359 252 324 300 255 320 c
234 327 200 330 153 330 c
153 344 l
190 357 218 369 237 380 c
291 411 318 455 318 514 c
318 547 308 573 289 590 c
270 607 244 616 210 616 c
150 616 100 581 61 510 c

ce} _d
/four{500 0 12 0 473 676 sc
473 167 m
370 167 l
370 0 l
292 0 l
292 167 l
12 167 l
12 231 l
326 676 l
370 676 l
370 231 l
473 231 l
473 167 l

292 231 m
292 574 l
52 231 l
292 231 l

ce} _d
/five{500 0 31 -14 438 688 sc
438 681 m
402 596 l
398 587 389 583 375 583 c
181 583 l
141 498 l
214 484 267 469 300 452 c
333 436 363 409 391 370 c
414 338 426 296 426 243 c
426 195 418 155 402 122 c
387 89 362 60 328 35 c
283 2 226 -14 158 -14 c
120 -14 89 -8 66 3 c
43 14 31 29 31 48 c
31 73 46 86 76 86 c
100 86 125 76 150 55 c
176 34 200 23 221 23 c
256 23 287 40 314 75 c
342 110 356 149 356 192 c
356 256 334 306 289 342 c
231 389 160 412 76 412 c
68 412 64 415 64 420 c
65 425 l
174 662 l
381 662 l
392 662 401 664 407 667 c
414 670 421 677 429 688 c
438 681 l

ce} _d
/six{500 0 34 -14 468 684 sc
446 684 m
448 668 l
369 655 304 623 251 572 c
198 521 165 458 152 383 c
191 413 233 428 279 428 c
338 428 384 409 417 372 c
451 335 468 284 468 219 c
468 154 451 100 417 59 c
378 10 325 -14 258 -14 c
177 -14 118 20 81 87 c
50 144 34 208 34 279 c
34 388 70 480 143 555 c
184 598 227 628 270 645 c
314 663 373 676 446 684 c

378 188 m
378 317 333 382 243 382 c
210 382 182 373 160 355 c
138 338 127 308 127 266 c
127 188 139 126 163 81 c
188 36 223 14 269 14 c
304 14 331 30 350 61 c
369 93 378 135 378 188 c

ce} _d
/seven{500 0 20 -8 449 662 sc
449 646 m
237 -8 l
172 -8 l
370 588 l
155 588 l
126 588 105 583 91 573 c
77 563 59 541 38 506 c
20 515 l
80 662 l
449 662 l
449 646 l

ce} _d
/eight{500 0 56 -14 445 676 sc
445 155 m
445 104 427 63 391 32 c
356 1 308 -14 248 -14 c
192 -14 146 1 110 32 c
74 63 56 102 56 149 c
56 184 65 214 82 239 c
99 264 134 295 186 332 c
136 373 103 407 86 432 c
70 457 62 487 62 520 c
62 567 80 605 116 633 c
153 662 199 676 256 676 c
305 676 345 662 376 634 c
408 607 424 573 424 533 c
424 496 414 467 395 445 c
376 423 341 398 290 371 c
350 331 391 295 412 264 c
434 233 445 196 445 155 c

355 533 m
355 568 345 595 326 616 c
307 637 280 648 246 648 c
212 648 185 639 165 621 c
146 604 136 580 136 549 c
136 518 146 490 165 465 c
185 440 217 415 261 389 c
295 409 319 430 333 452 c
348 475 355 502 355 533 c

271 272 m
212 312 l
183 288 162 264 150 241 c
138 218 132 191 132 158 c
132 113 143 77 166 52 c
189 27 220 14 259 14 c
292 14 318 24 338 44 c
359 65 369 91 369 124 c
369 154 361 180 346 203 c
331 226 306 249 271 272 c

ce} _d
/nine{500 0 30 -22 459 676 sc
59 -22 m
56 -2 l
133 11 197 44 250 95 c
303 146 340 213 360 294 c
321 256 271 237 210 237 c
156 237 112 256 79 293 c
46 330 30 379 30 440 c
30 507 50 563 89 608 c
129 653 179 676 238 676 c
301 676 354 651 395 600 c
438 547 459 478 459 394 c
459 335 449 280 428 228 c
408 177 378 133 339 97 c
298 60 257 33 218 16 c
179 0 126 -13 59 -22 c

362 355 m
362 394 l
362 563 318 648 230 648 c
199 648 174 637 157 614 c
147 601 139 581 132 554 c
125 527 122 501 122 474 c
122 415 133 367 155 332 c
178 297 208 280 245 280 c
272 280 298 286 323 299 c
349 312 362 331 362 355 c

ce} _d
/D{722 0 16 0 685 662 sc
16 662 m
286 662 l
416 662 516 632 586 571 c
652 514 685 435 685 334 c
685 212 640 122 549 64 c
483 21 399 0 297 0 c
16 0 l
16 19 l
55 22 79 28 89 39 c
99 50 104 76 104 115 c
104 550 l
104 589 99 613 89 623 c
79 634 55 640 16 643 c
16 662 l

206 583 m
206 84 l
206 66 209 54 215 47 c
222 40 235 37 254 37 c
306 37 348 41 380 48 c
412 55 443 69 472 89 c
541 136 576 215 576 328 c
576 425 544 501 481 556 c
452 581 421 599 387 609 c
353 620 310 625 259 625 c
240 625 226 622 218 616 c
210 610 206 599 206 583 c

ce} _d
/F{556 0 11 0 546 662 sc
546 519 m
521 519 l
514 564 501 593 483 605 c
466 618 427 624 367 624 c
235 624 l
221 624 212 621 207 616 c
203 611 201 601 201 585 c
201 368 l
343 368 l
385 368 413 374 427 386 c
442 398 451 424 456 463 c
479 463 l
479 230 l
456 230 l
452 271 443 297 429 309 c
415 321 386 327 343 327 c
201 327 l
201 112 l
201 74 206 49 217 38 c
228 27 253 21 292 19 c
292 0 l
11 0 l
11 19 l
49 22 73 29 83 40 c
94 52 99 80 99 123 c
99 551 l
99 588 94 611 84 622 c
74 633 50 640 12 643 c
12 662 l
541 662 l
546 519 l

ce} _d
/M{889 0 12 0 864 662 sc
864 0 m
584 0 l
584 19 l
623 22 648 29 658 41 c
669 54 674 81 674 123 c
674 572 l
419 0 l
405 0 l
153 549 l
153 151 l
153 97 159 62 170 46 c
181 30 207 21 246 19 c
246 0 l
12 0 l
12 19 l
41 21 62 25 75 32 c
88 39 96 50 101 67 c
106 84 109 112 109 151 c
109 549 l
109 587 103 611 92 622 c
81 633 55 640 14 643 c
14 662 l
212 662 l
443 160 l
664 662 l
863 662 l
863 643 l
827 642 803 636 792 624 c
781 612 776 587 776 550 c
776 112 l
776 77 781 53 792 41 c
803 29 827 22 864 19 c
864 0 l

ce} _d
/N{722 0 12 -11 707 662 sc
707 662 m
707 643 l
673 640 651 634 641 625 c
630 616 623 603 618 587 c
614 571 612 544 612 507 c
612 -11 l
594 -11 l
153 538 l
153 150 l
153 99 159 66 170 50 c
181 35 207 24 246 19 c
246 0 l
12 0 l
12 19 l
53 24 80 33 91 48 c
103 63 109 97 109 150 c
109 590 l
92 611 77 625 65 632 c
53 639 35 643 12 643 c
12 662 l
182 662 l
568 179 l
568 519 l
568 570 562 602 549 617 c
541 626 532 631 522 634 c
513 637 495 640 470 643 c
470 662 l
707 662 l

ce} _d
/bracketleft{333 0 88 -156 299 662 sc
299 -156 m
88 -156 l
88 662 l
299 662 l
299 637 l
216 637 l
199 637 186 633 177 626 c
168 619 164 606 164 589 c
164 -77 l
164 -113 181 -131 216 -131 c
299 -131 l
299 -156 l

ce} _d
/bracketright{333 0 34 -156 245 662 sc
245 -156 m
34 -156 l
34 -131 l
122 -131 l
139 -131 151 -127 158 -120 c
165 -113 169 -101 169 -85 c
169 583 l
169 619 152 637 118 637 c
34 637 l
34 662 l
245 662 l
245 -156 l

ce} _d
/a{444 0 37 -10 442 460 sc
442 66 m
442 38 l
417 6 387 -10 352 -10 c
314 -10 293 14 288 63 c
287 63 l
244 14 196 -10 142 -10 c
111 -10 85 -1 66 17 c
47 36 37 61 37 94 c
37 141 60 180 107 211 c
139 232 199 259 287 292 c
287 346 l
287 376 280 398 265 413 c
251 428 232 436 209 436 c
189 436 172 431 159 421 c
146 412 139 400 139 387 c
139 381 140 374 142 367 c
144 360 145 352 145 345 c
145 335 140 326 131 317 c
122 308 112 304 99 304 c
88 304 78 308 69 317 c
60 326 56 337 56 350 c
56 382 73 409 107 430 c
138 450 177 460 222 460 c
276 460 315 445 340 415 c
352 401 360 387 363 372 c
366 358 368 335 368 304 c
368 113 l
368 69 378 47 399 47 c
412 47 427 53 442 66 c

287 127 m
287 268 l
226 247 183 225 159 202 c
136 181 125 156 125 125 c
125 100 131 80 144 67 c
157 54 173 48 194 48 c
216 48 235 53 252 64 c
266 74 275 83 280 92 c
285 101 287 112 287 127 c

ce} _d
/b{500 0 3 -10 468 683 sc
153 681 m
153 376 l
164 401 181 422 205 437 c
230 452 257 460 288 460 c
341 460 384 439 417 397 c
451 355 468 303 468 240 c
468 167 446 107 401 60 c
356 13 301 -10 234 -10 c
193 -10 156 -3 121 10 c
86 24 69 39 69 56 c
69 566 l
69 591 66 606 60 613 c
54 620 41 624 20 624 c
15 624 10 623 3 622 c
3 639 l
33 648 l
101 669 139 680 148 683 c
153 681 l

153 318 m
153 74 l
153 59 162 46 181 36 c
200 27 223 22 250 22 c
289 22 320 36 343 65 c
368 96 380 140 380 197 c
380 262 367 313 341 350 c
319 381 289 397 252 397 c
225 397 202 389 182 373 c
163 358 153 339 153 318 c

ce} _d
/c{444 0 25 -10 412 460 sc
398 156 m
412 147 l
383 91 356 53 330 32 c
296 4 258 -10 215 -10 c
160 -10 114 11 78 52 c
43 94 25 147 25 212 c
25 297 53 362 109 409 c
150 443 195 460 244 460 c
286 460 322 450 352 429 c
383 409 398 385 398 357 c
398 346 393 336 384 327 c
375 319 364 315 351 315 c
328 315 312 330 303 361 c
297 383 l
292 402 285 414 277 421 c
269 428 256 431 238 431 c
197 431 164 415 139 383 c
114 351 102 309 102 257 c
102 200 116 153 145 116 c
174 80 211 62 257 62 c
286 62 310 69 331 82 c
352 96 374 121 398 156 c

ce} _d
/d{500 0 27 -10 491 683 sc
491 42 m
344 -10 l
340 -7 l
340 57 l
308 12 265 -10 212 -10 c
157 -10 112 10 78 49 c
44 89 27 141 27 205 c
27 276 47 336 88 385 c
129 435 178 460 235 460 c
271 460 306 446 340 417 c
340 573 l
340 594 337 607 331 614 c
325 621 313 624 294 624 c
285 624 277 624 272 623 c
272 639 l
333 655 382 670 419 683 c
424 681 l
424 114 l
424 91 427 75 432 68 c
438 61 450 57 468 57 c
472 57 480 57 491 58 c
491 42 l

340 102 m
340 332 l
340 359 330 382 309 402 c
289 422 265 432 238 432 c
200 432 170 415 147 381 c
124 347 113 302 113 245 c
113 184 125 134 150 97 c
175 60 209 42 251 42 c
282 42 307 53 325 74 c
335 85 340 95 340 102 c

ce} _d
/e{444 0 25 -10 424 460 sc
408 164 m
424 157 l
384 46 314 -10 215 -10 c
156 -10 110 10 76 51 c
42 92 25 148 25 217 c
25 288 44 347 82 392 c
120 437 170 460 232 460 c
292 460 338 437 371 391 c
390 364 402 326 405 277 c
97 277 l
100 235 104 203 109 181 c
115 159 126 137 143 114 c
171 77 208 59 254 59 c
287 59 314 67 336 83 c
359 99 383 126 408 164 c

99 309 m
303 309 l
297 351 287 381 273 398 c
260 415 237 424 205 424 c
177 424 154 414 135 394 c
116 375 104 346 99 309 c

ce} _d
/h{500 0 9 0 487 683 sc
487 0 m
275 0 l
275 15 l
304 18 323 25 331 35 c
339 45 343 67 343 102 c
343 300 l
343 371 318 406 269 406 c
249 406 231 401 214 392 c
197 383 178 366 157 343 c
157 102 l
157 67 161 45 169 35 c
177 25 196 18 225 15 c
225 0 l
9 0 l
9 15 l
38 19 55 26 62 35 c
69 44 73 67 73 102 c
73 573 l
73 594 70 608 63 614 c
57 621 43 624 22 624 c
16 624 12 624 10 623 c
10 639 l
37 647 l
88 662 127 674 152 683 c
157 680 l
157 376 l
180 406 203 427 226 440 c
249 453 275 460 304 460 c
386 460 427 407 427 301 c
427 102 l
427 67 430 45 436 36 c
443 27 460 20 487 15 c
487 0 l

ce} _d
/i{278 0 16 0 253 683 sc
180 632 m
180 617 175 605 165 595 c
155 586 143 581 128 581 c
114 581 102 586 92 595 c
83 605 78 617 78 632 c
78 646 83 658 93 668 c
103 678 115 683 129 683 c
144 683 156 678 165 668 c
175 658 180 646 180 632 c

253 0 m
16 0 l
16 15 l
51 17 72 23 81 33 c
90 43 95 67 95 104 c
95 331 l
95 354 93 371 88 380 c
83 389 75 394 62 394 c
46 394 32 392 20 389 c
20 405 l
175 460 l
179 456 l
179 105 l
179 68 183 44 191 34 c
200 24 220 18 253 15 c
253 0 l

ce} _d
/k{500 0 7 0 505 683 sc
505 0 m
287 0 l
287 15 l
306 15 l
320 15 327 20 327 30 c
327 36 323 44 316 53 c
166 251 l
166 67 l
166 50 170 37 178 29 c
187 21 201 17 221 16 c
241 15 l
241 0 l
7 0 l
7 15 l
43 21 64 27 71 33 c
78 40 82 56 82 82 c
82 564 l
82 588 79 604 73 612 c
67 621 56 625 39 625 c
35 625 24 624 7 623 c
7 639 l
37 647 l
77 658 119 670 162 683 c
166 681 l
166 261 l
303 383 l
318 397 326 409 326 418 c
326 425 322 429 315 431 c
308 434 295 435 276 436 c
276 450 l
480 450 l
480 435 l
447 435 417 428 391 413 c
366 399 323 364 264 309 c
235 282 l
388 88 l
424 42 463 18 505 15 c
505 0 l

ce} _d
/l{278 0 19 0 257 683 sc
257 0 m
21 0 l
21 15 l
52 18 73 24 83 34 c
93 45 98 64 98 92 c
98 561 l
98 585 95 602 89 611 c
83 620 72 625 56 625 c
42 625 30 624 19 623 c
19 639 l
82 654 135 669 177 683 c
182 679 l
182 87 l
182 59 187 40 196 31 c
205 22 226 17 257 15 c
257 0 l

ce} _d
/m{778 0 16 0 775 460 sc
775 0 m
557 0 l
557 15 l
585 18 603 23 610 32 c
618 41 622 61 622 90 c
622 296 l
622 336 616 365 604 382 c
593 399 573 408 545 408 c
522 408 502 403 485 394 c
469 385 453 369 438 347 c
438 95 l
438 63 443 42 452 31 c
462 21 481 16 510 15 c
510 0 l
286 0 l
286 15 l
315 17 334 22 342 29 c
350 37 354 56 354 86 c
354 297 l
354 371 332 408 289 408 c
270 408 250 404 229 395 c
208 387 193 377 183 365 c
174 355 170 349 170 348 c
170 70 l
170 49 175 34 184 27 c
193 20 211 16 238 15 c
238 0 l
16 0 l
16 15 l
44 16 63 21 72 30 c
81 40 86 59 86 88 c
86 336 l
86 361 83 378 78 387 c
73 397 64 402 51 402 c
41 402 30 401 19 398 c
19 415 l
64 428 111 443 158 460 c
166 457 l
166 383 l
168 383 l
198 414 224 435 247 445 c
270 455 295 460 321 460 c
374 460 409 432 427 376 c
479 432 533 460 590 460 c
667 460 706 400 706 280 c
706 77 l
706 55 709 40 716 31 c
723 23 734 18 749 17 c
775 15 l
775 0 l

ce} _d
/n{500 0 16 0 485 460 sc
485 0 m
277 0 l
278 15 l
303 17 319 24 327 36 c
336 49 340 72 340 105 c
340 304 l
340 371 316 405 267 405 c
250 405 235 401 220 393 c
205 385 187 370 164 348 c
164 72 l
164 52 168 38 177 30 c
186 22 204 17 229 15 c
229 0 l
18 0 l
18 15 l
43 17 60 23 68 33 c
76 44 80 64 80 94 c
80 337 l
80 362 78 379 73 388 c
68 397 59 402 45 402 c
32 402 22 401 16 398 c
16 415 l
63 428 108 443 153 460 c
161 457 l
161 379 l
162 379 l
209 433 257 460 306 460 c
344 460 373 447 393 420 c
414 393 424 355 424 306 c
424 85 l
424 58 428 41 436 32 c
444 23 460 18 485 15 c
485 0 l

ce} _d
/o{500 0 29 -10 470 460 sc
470 231 m
470 161 449 103 407 58 c
366 13 312 -10 245 -10 c
184 -10 132 12 91 57 c
50 102 29 159 29 228 c
29 297 50 353 91 396 c
132 439 187 460 254 460 c
316 460 367 439 408 396 c
449 354 470 299 470 231 c

380 204 m
380 280 363 339 330 382 c
303 415 272 432 235 432 c
200 432 172 418 151 389 c
130 361 119 322 119 273 c
119 188 137 119 172 68 c
195 35 225 18 262 18 c
299 18 327 34 348 67 c
369 100 380 146 380 204 c

ce} _d
/r{333 0 5 0 335 460 sc
160 458 m
160 366 l
185 402 206 427 223 440 c
240 453 259 460 280 460 c
297 460 311 455 320 446 c
330 437 335 424 335 407 c
335 393 331 382 324 374 c
317 366 308 362 296 362 c
283 362 270 369 256 382 c
245 392 237 397 230 397 c
216 397 201 387 184 368 c
168 349 160 331 160 315 c
160 90 l
160 61 166 42 177 32 c
188 22 211 16 245 15 c
245 0 l
5 0 l
5 15 l
37 21 57 28 64 35 c
72 42 76 59 76 84 c
76 334 l
76 356 73 371 68 380 c
63 389 55 394 42 394 c
31 394 20 393 7 390 c
7 406 l
49 419 98 437 155 460 c
160 458 l

ce} _d
/s{389 0 51 -10 348 459 sc
156 301 m
260 238 l
293 218 316 199 329 182 c
342 165 348 142 348 115 c
348 82 334 52 306 27 c
279 2 246 -10 208 -10 c
177 -10 152 -7 135 -1 c
117 5 102 8 89 8 c
78 8 70 4 65 -4 c
52 -4 l
52 153 l
68 153 l
79 104 94 69 114 46 c
134 23 161 12 195 12 c
220 12 240 19 255 33 c
270 47 278 65 278 86 c
278 117 260 142 225 161 c
171 191 l
91 236 51 284 51 336 c
51 375 63 405 88 426 c
113 448 147 459 189 459 c
218 459 241 455 256 448 c
268 443 277 440 284 440 c
289 440 294 443 300 450 c
311 450 l
316 314 l
301 314 l
290 359 275 391 258 409 c
241 428 218 437 188 437 c
165 437 147 431 133 420 c
120 409 113 392 113 369 c
113 358 117 345 124 332 c
132 319 143 309 156 301 c

ce} _d
/t{278 0 13 -10 279 579 sc
266 77 m
279 66 l
247 15 207 -10 158 -10 c
99 -10 70 32 70 117 c
70 418 l
17 418 l
14 420 13 422 13 425 c
13 430 19 437 30 444 c
55 459 88 494 127 551 c
128 553 131 557 136 563 c
141 570 145 575 147 579 c
152 579 154 575 154 566 c
154 450 l
255 450 l
255 418 l
154 418 l
154 132 l
154 100 158 77 166 63 c
174 49 187 42 206 42 c
226 42 246 54 266 77 c

ce} _d
/u{500 0 9 -10 480 450 sc
480 50 m
480 36 l
428 22 382 7 343 -9 c
338 -6 l
338 76 l
336 76 l
294 19 246 -10 193 -10 c
155 -10 125 2 103 25 c
82 48 71 79 71 118 c
71 369 l
71 394 67 411 58 420 c
49 429 33 435 9 436 c
9 450 l
155 450 l
155 127 l
155 104 162 85 175 70 c
189 55 206 48 226 48 c
259 48 287 58 310 79 c
319 87 325 94 328 101 c
331 108 333 120 333 137 c
333 368 l
333 394 328 411 319 418 c
310 426 290 431 259 433 c
259 450 l
417 450 l
417 107 l
417 84 421 68 428 61 c
436 54 451 50 474 50 c
480 50 l

ce} _d
/x{500 0 17 0 479 450 sc
479 0 m
278 0 l
278 15 l
295 16 305 18 310 21 c
315 24 318 30 318 39 c
318 45 316 51 312 57 c
221 197 l
142 74 l
129 53 122 40 122 33 c
122 21 135 15 162 15 c
162 0 l
17 0 l
17 15 l
34 16 46 20 55 26 c
64 33 76 46 90 66 c
204 231 l
110 375 l
95 398 82 414 71 422 c
60 431 48 435 33 435 c
24 435 l
24 450 l
231 450 l
231 435 l
202 434 188 427 188 413 c
188 399 203 369 234 324 c
243 312 247 305 248 304 c
251 309 261 323 278 348 c
281 354 285 360 290 367 c
295 374 298 379 300 383 c
303 387 305 391 308 395 c
311 399 312 402 313 405 c
314 408 315 411 315 413 c
315 426 302 433 275 435 c
275 450 l
433 450 l
433 435 l
399 434 372 419 352 391 c
269 271 l
397 75 l
423 35 450 15 479 15 c
479 0 l

ce} _d
/y{500 0 14 -218 475 450 sc
475 450 m
475 435 l
463 434 453 429 446 422 c
439 415 432 402 425 384 c
275 -25 l
249 -96 223 -145 196 -174 c
170 -203 138 -218 100 -218 c
79 -218 62 -212 49 -201 c
36 -190 30 -177 30 -160 c
30 -147 34 -136 42 -127 c
51 -118 61 -114 73 -114 c
92 -114 110 -118 125 -127 c
134 -132 142 -134 151 -134 c
165 -134 182 -119 201 -90 c
210 -77 219 -58 228 -33 c
237 -8 241 9 241 18 c
241 27 227 60 199 119 c
67 401 l
58 420 41 432 14 436 c
14 450 l
219 450 l
219 435 l
198 434 183 432 174 428 c
166 424 162 417 162 408 c
162 401 166 387 175 367 c
287 117 l
384 393 l
387 399 388 405 388 411 c
388 427 373 435 342 435 c
342 450 l
475 450 l

ce} _d
end readonly def

/BuildGlyph {
 exch begin
 CharStrings exch
 2 copy known not {pop /.notdef} if
 true 3 1 roll get exec
 end
} _d

/BuildChar {
 1 index /Encoding get exch get
 1 index /BuildGlyph get exec
} _d

FontName currentdict end definefont pop
%!PS-Adobe-3.0 Resource-Font
%%Creator: Converted from TrueType to Type 3 by Matplotlib.
10 dict begin
/FontName /STIXGeneral-Italic def
/PaintType 0 def
/FontMatrix [0.001 0 0 0.001 0 0] def
/FontBBox [-970 -305 1429 1023] def
/FontType 3 def
/Encoding [/N] def
/CharStrings 2 dict dup begin
/.notdef 0 def
/N{667 0 -20 -15 727 653 sc
727 653 m
727 637 l
709 633 696 630 689 627 c
682 625 675 618 666 606 c
658 595 652 582 647 568 c
643 554 636 529 625 492 c
479 -15 l
461 -15 l
231 535 l
117 113 l
111 92 108 74 108 59 c
108 45 113 35 123 28 c
134 22 152 18 178 16 c
178 0 l
-20 0 l
-20 16 l
9 20 29 30 41 47 c
53 64 68 105 86 168 c
203 583 l
188 619 159 637 117 637 c
117 653 l
277 653 l
484 154 l
590 542 l
595 561 598 575 598 586 c
598 604 593 616 584 623 c
575 630 557 634 529 637 c
529 653 l
727 653 l

ce} _d
end readonly def

/BuildGlyph {
 exch begin
 CharStrings exch
 2 copy known not {pop /.notdef} if
 true 3 1 roll get exec
 end
} _d

/BuildChar {
 1 index /Encoding get exch get
 1 index /BuildGlyph get exec
} _d

FontName currentdict end definefont pop
end
%%EndProlog
mpldict begin
-11.844 256.368 translate
635.688 279.264 0 0 clipbox
gsave
0 0 m
635.68795 0 l
635.68795 279.264045 l
0 279.264045 l
cl
1.000 setgray
fill
grestore
gsave
59.2 41.60625 m
314.037012 41.60625 l
314.037012 271.729312 l
59.2 271.729312 l
cl
1.000 setgray
fill
grestore
0.800 setlinewidth
1 setlinejoin
2 setlinecap
[] 0 setdash
0.690 setgray
gsave
254.837 230.123 59.2 41.606 clipbox
98.807582 41.60625 m
98.807582 271.729312 l
stroke
grestore
0 setlinecap
0.000 setgray
gsave
/o {
gsave
newpath
translate
0.8 setlinewidth
1 setlinejoin

0 setlinecap

0 0 m
0 -3.5 l

gsave
0.000 setgray
fill
grestore
stroke
grestore
} bind def
98.8076 41.6063 o
grestore
gsave
83.8076 26.4031 translate
0 rotate
/STIXGeneral-Regular 12.0 selectfont
0 0.890625 moveto
/two glyphshow
5.99998 0.890625 moveto
/zero glyphshow
12 0.890625 moveto
/zero glyphshow
18 0.890625 moveto
/zero glyphshow
23.9999 0.890625 moveto
/zero glyphshow
grestore
2 setlinecap
0.690 setgray
gsave
254.837 230.123 59.2 41.606 clipbox
166.570768 41.60625 m
166.570768 271.729312 l
stroke
grestore
0 setlinecap
0.000 setgray
gsave
/o {
gsave
newpath
translate
0.8 setlinewidth
1 setlinejoin

0 setlinecap

0 0 m
0 -3.5 l

gsave
0.000 setgray
fill
grestore
stroke
grestore
} bind def
166.571 41.6063 o
grestore
gsave
151.571 26.4031 translate
0 rotate
/STIXGeneral-Regular 12.0 selectfont
0 0.890625 moveto
/four glyphshow
5.99998 0.890625 moveto
/zero glyphshow
12 0.890625 moveto
/zero glyphshow
18 0.890625 moveto
/zero glyphshow
23.9999 0.890625 moveto
/zero glyphshow
grestore
2 setlinecap
0.690 setgray
gsave
254.837 230.123 59.2 41.606 clipbox
234.333953 41.60625 m
234.333953 271.729312 l
stroke
grestore
0 setlinecap
0.000 setgray
gsave
/o {
gsave
newpath
translate
0.8 setlinewidth
1 setlinejoin

0 setlinecap

0 0 m
0 -3.5 l

gsave
0.000 setgray
fill
grestore
stroke
grestore
} bind def
234.334 41.6063 o
grestore
gsave
219.334 26.4031 translate
0 rotate
/STIXGeneral-Regular 12.0 selectfont
0 0.796875 moveto
/six glyphshow
5.99998 0.796875 moveto
/zero glyphshow
12 0.796875 moveto
/zero glyphshow
18 0.796875 moveto
/zero glyphshow
23.9999 0.796875 moveto
/zero glyphshow
grestore
2 setlinecap
0.690 setgray
gsave
254.837 230.123 59.2 41.606 clipbox
302.097139 41.60625 m
302.097139 271.729312 l
stroke
grestore
0 setlinecap
0.000 setgray
gsave
/o {
gsave
newpath
translate
0.8 setlinewidth
1 setlinejoin

0 setlinecap

0 0 m
0 -3.5 l

gsave
0.000 setgray
fill
grestore
stroke
grestore
} bind def
302.097 41.6063 o
grestore
gsave
287.097 26.4031 translate
0 rotate
/STIXGeneral-Regular 12.0 selectfont
0 0.890625 moveto
/eight glyphshow
5.99998 0.890625 moveto
/zero glyphshow
12 0.890625 moveto
/zero glyphshow
18 0.890625 moveto
/zero glyphshow
23.9999 0.890625 moveto
/zero glyphshow
grestore
gsave
181.619 10.2313 translate
0 rotate
/STIXGeneral-Italic 14.0 selectfont
0 0.859375 moveto
/N glyphshow
grestore
2 setlinecap
0.690 setgray
gsave
254.837 230.123 59.2 41.606 clipbox
59.2 62.677576 m
314.037012 62.677576 l
stroke
grestore
0 setlinecap
0.000 setgray
gsave
/o {
gsave
newpath
translate
0.8 setlinewidth
1 setlinejoin

0 setlinecap

-0 0 m
-3.5 0 l

gsave
0.000 setgray
fill
grestore
stroke
grestore
} bind def
59.2 62.6776 o
grestore
gsave
31.2 58.576 translate
0 rotate
/STIXGeneral-Regular 12.0 selectfont
0 0.75 moveto
/eight glyphshow
5.99998 0.75 moveto
/period glyphshow
8.99997 0.75 moveto
/two glyphshow
15 0.75 moveto
/five glyphshow
grestore
2 setlinecap
0.690 setgray
gsave
254.837 230.123 59.2 41.606 clipbox
59.2 92.003992 m
314.037012 92.003992 l
stroke
grestore
0 setlinecap
0.000 setgray
gsave
/o {
gsave
newpath
translate
0.8 setlinewidth
1 setlinejoin

0 setlinecap

-0 0 m
-3.5 0 l

gsave
0.000 setgray
fill
grestore
stroke
grestore
} bind def
59.2 92.004 o
grestore
gsave
31.2 87.9024 translate
0 rotate
/STIXGeneral-Regular 12.0 selectfont
0 0.75 moveto
/eight glyphshow
5.99998 0.75 moveto
/period glyphshow
8.99997 0.75 moveto
/five glyphshow
15 0.75 moveto
/zero glyphshow
grestore
2 setlinecap
0.690 setgray
gsave
254.837 230.123 59.2 41.606 clipbox
59.2 121.330407 m
314.037012 121.330407 l
stroke
grestore
0 setlinecap
0.000 setgray
gsave
/o {
gsave
newpath
translate
0.8 setlinewidth
1 setlinejoin

0 setlinecap

-0 0 m
-3.5 0 l

gsave
0.000 setgray
fill
grestore
stroke
grestore
} bind def
59.2 121.33 o
grestore
gsave
31.2 117.229 translate
0 rotate
/STIXGeneral-Regular 12.0 selectfont
0 0.75 moveto
/eight glyphshow
5.99998 0.75 moveto
/period glyphshow
8.99997 0.75 moveto
/seven glyphshow
15 0.75 moveto
/five glyphshow
grestore
2 setlinecap
0.690 setgray
gsave
254.837 230.123 59.2 41.606 clipbox
59.2 150.656822 m
314.037012 150.656822 l
stroke
grestore
0 setlinecap
0.000 setgray
gsave
/o {
gsave
newpath
translate
0.8 setlinewidth
1 setlinejoin

0 setlinecap

-0 0 m
-3.5 0 l

gsave
0.000 setgray
fill
grestore
stroke
grestore
} bind def
59.2 150.657 o
grestore
gsave
31.2 146.555 translate
0 rotate
/STIXGeneral-Regular 12.0 selectfont
0 0.890625 moveto
/nine glyphshow
5.99998 0.890625 moveto
/period glyphshow
8.99997 0.890625 moveto
/zero glyphshow
15 0.890625 moveto
/zero glyphshow
grestore
2 setlinecap
0.690 setgray
gsave
254.837 230.123 59.2 41.606 clipbox
59.2 179.983237 m
314.037012 179.983237 l
stroke
grestore
0 setlinecap
0.000 setgray
gsave
/o {
gsave
newpath
translate
0.8 setlinewidth
1 setlinejoin

0 setlinecap

-0 0 m
-3.5 0 l

gsave
0.000 setgray
fill
grestore
stroke
grestore
} bind def
59.2 179.983 o
grestore
gsave
31.2 175.882 translate
0 rotate
/STIXGeneral-Regular 12.0 selectfont
0 0.75 moveto
/nine glyphshow
5.99998 0.75 moveto
/period glyphshow
8.99997 0.75 moveto
/two glyphshow
15 0.75 moveto
/five glyphshow
grestore
2 setlinecap
0.690 setgray
gsave
254.837 230.123 59.2 41.606 clipbox
59.2 209.309652 m
314.037012 209.309652 l
stroke
grestore
0 setlinecap
0.000 setgray
gsave
/o {
gsave
newpath
translate
0.8 setlinewidth
1 setlinejoin

0 setlinecap

-0 0 m
-3.5 0 l

gsave
0.000 setgray
fill
grestore
stroke
grestore
} bind def
59.2 209.31 o
grestore
gsave
31.2 205.208 translate
0 rotate
/STIXGeneral-Regular 12.0 selectfont
0 0.75 moveto
/nine glyphshow
5.99998 0.75 moveto
/period glyphshow
8.99997 0.75 moveto
/five glyphshow
15 0.75 moveto
/zero glyphshow
grestore
2 setlinecap
0.690 setgray
gsave
254.837 230.123 59.2 41.606 clipbox
59.2 238.636067 m
314.037012 238.636067 l
stroke
grestore
0 setlinecap
0.000 setgray
gsave
/o {
gsave
newpath
translate
0.8 setlinewidth
1 setlinejoin

0 setlinecap

-0 0 m
-3.5 0 l

gsave
0.000 setgray
fill
grestore
stroke
grestore
} bind def
59.2 238.636 o
grestore
gsave
31.2 234.535 translate
0 rotate
/STIXGeneral-Regular 12.0 selectfont
0 0.75 moveto
/nine glyphshow
5.99998 0.75 moveto
/period glyphshow
8.99997 0.75 moveto
/seven glyphshow
15 0.75 moveto
/five glyphshow
grestore
2 setlinecap
0.690 setgray
gsave
254.837 230.123 59.2 41.606 clipbox
59.2 267.962482 m
314.037012 267.962482 l
stroke
grestore
0 setlinecap
0.000 setgray
gsave
/o {
gsave
newpath
translate
0.8 setlinewidth
1 setlinejoin

0 setlinecap

-0 0 m
-3.5 0 l

gsave
0.000 setgray
fill
grestore
stroke
grestore
} bind def
59.2 267.962 o
grestore
gsave
25.2 263.861 translate
0 rotate
/STIXGeneral-Regular 12.0 selectfont
0 0.890625 moveto
/one glyphshow
5.99998 0.890625 moveto
/zero glyphshow
12 0.890625 moveto
/period glyphshow
15 0.890625 moveto
/zero glyphshow
20.9999 0.890625 moveto
/zero glyphshow
grestore
gsave
18.1688 147.668 translate
90 rotate
/STIXGeneral-Regular 14.0 selectfont
0 -0.140625 moveto
/N glyphshow
10.108 -0.140625 moveto
/u glyphshow
0.0 11.25 17.107986450195312 0.875 rectfill
grestore
1.500 setlinewidth
2 setlinecap
0.122 0.467 0.706 setrgbcolor
gsave
254.837 230.123 59.2 41.606 clipbox
62.574607 73.585049 m
77.997508 136.506536 l
96.47314 167.500542 l
117.879531 199.140285 l
142.37931 202.777815 l
171.182052 232.720387 l
201.865223 254.892907 l
235.570631 254.965674 l
272.342324 245.594569 l
314.037012 261.269173 l
stroke
grestore
1.000 setlinewidth
0 setlinecap
gsave
254.837 230.123 59.2 41.606 clipbox
/o {
gsave
newpath
translate
1.0 setlinewidth
1 setlinejoin

0 setlinecap

-3.5 -3.5 m
3.5 3.5 l
-3.5 3.5 m
3.5 -3.5 l

gsave
0.122 0.467 0.706 setrgbcolor
fill
grestore
stroke
grestore
} bind def
62.5746 73.585 o
77.9975 136.507 o
96.4731 167.501 o
117.88 199.14 o
142.379 202.778 o
171.182 232.72 o
201.865 254.893 o
235.571 254.966 o
272.342 245.595 o
314.037 261.269 o
grestore
1.500 setlinewidth
[5.55 2.4] 0 setdash
1.000 0.498 0.055 setrgbcolor
gsave
254.837 230.123 59.2 41.606 clipbox
59.2 118.9032 m
72.644216 136.667583 l
88.829453 172.336004 l
107.721829 185.665944 l
129.2197 214.7948 l
154.353065 225.813374 l
181.105971 232.261994 l
210.52197 212.675637 l
242.790799 250.743327 l
279.386307 249.794585 l
stroke
grestore
1.000 setlinewidth
0 setlinejoin
[] 0 setdash
gsave
254.837 230.123 59.2 41.606 clipbox
/o {
gsave
newpath
translate
1.0 setlinewidth
0 setlinejoin

0 setlinecap

3.5 -0 m
-3.5 3.5 l
-3.5 -3.5 l
cl

gsave
1.000 0.498 0.055 setrgbcolor
fill
grestore
stroke
grestore
} bind def
59.2 118.903 o
72.6442 136.668 o
88.8295 172.336 o
107.722 185.666 o
129.22 214.795 o
154.353 225.813 o
181.106 232.262 o
210.522 212.676 o
242.791 250.743 o
279.386 249.795 o
grestore
1.500 setlinewidth
1 setlinejoin
[1.5 2.475] 0 setdash
0.173 0.627 0.173 setrgbcolor
gsave
254.837 230.123 59.2 41.606 clipbox
62.195133 89.806396 m
77.462179 59.686283 l
95.775179 135.579828 l
117.076537 75.246487 l
141.413685 52.066389 l
170.199486 99.547691 l
200.73019 100.550799 l
234.317013 89.763221 l
270.905745 103.593 l
312.492012 113.148656 l
stroke
grestore
1.000 setlinewidth
[] 0 setdash
gsave
254.837 230.123 59.2 41.606 clipbox
/o {
gsave
newpath
translate
1.0 setlinewidth
1 setlinejoin

0 setlinecap

0 -1.75 m
0.464105 -1.75 0.909265 -1.565609 1.237437 -1.237437 c
1.565609 -0.909265 1.75 -0.464105 1.75 0 c
1.75 0.464105 1.565609 0.909265 1.237437 1.237437 c
0.909265 1.565609 0.464105 1.75 0 1.75 c
-0.464105 1.75 -0.909265 1.565609 -1.237437 1.237437 c
-1.565609 0.909265 -1.75 0.464105 -1.75 0 c
-1.75 -0.464105 -1.565609 -0.909265 -1.237437 -1.237437 c
-0.909265 -1.565609 -0.464105 -1.75 0 -1.75 c
cl

gsave
0.173 0.627 0.173 setrgbcolor
fill
grestore
stroke
grestore
} bind def
62.1951 89.8064 o
77.4622 59.6863 o
95.7752 135.58 o
117.077 75.2465 o
141.414 52.0664 o
170.199 99.5477 o
200.73 100.551 o
234.317 89.7632 o
270.906 103.593 o
312.492 113.149 o
grestore
0.800 setlinewidth
0 setlinejoin
2 setlinecap
0.000 setgray
gsave
59.2 41.60625 m
59.2 271.729312 l
stroke
grestore
gsave
314.037012 41.60625 m
314.037012 271.729312 l
stroke
grestore
gsave
59.2 41.60625 m
314.037012 41.60625 l
stroke
grestore
gsave
59.2 271.729312 m
314.037012 271.729312 l
stroke
grestore
1.000 setlinewidth
0 setlinecap
0.800 setgray
gsave
66.2 221.198062 m
138.2 221.198062 l
139.533333 221.198062 140.2 221.864729 140.2 223.198062 c
140.2 264.729312 l
140.2 266.062646 139.533333 266.729312 138.2 266.729312 c
66.2 266.729312 l
64.866667 266.729312 64.2 266.062646 64.2 264.729312 c
64.2 223.198062 l
64.2 221.864729 64.866667 221.198062 66.2 221.198062 c
cl
gsave
1.000 setgray
fill
grestore
stroke
grestore
1.500 setlinewidth
1 setlinejoin
2 setlinecap
0.122 0.467 0.706 setrgbcolor
gsave
68.2 259.229312 m
78.2 259.229312 l
88.2 259.229312 l
stroke
grestore
1.000 setlinewidth
0 setlinecap
gsave
/o {
gsave
newpath
translate
1.0 setlinewidth
1 setlinejoin

0 setlinecap

-3.5 -3.5 m
3.5 3.5 l
-3.5 3.5 m
3.5 -3.5 l

gsave
0.122 0.467 0.706 setrgbcolor
fill
grestore
stroke
grestore
} bind def
78.2 259.229 o
grestore
0.000 setgray
/STIXGeneral-Regular 10.000 selectfont
gsave

96.2 255.729 translate
0 rotate
0 0 m /h glyphshow
4.99998 0 m /y glyphshow
9.99997 0 m /b glyphshow
15 0 m /r glyphshow
18.3299 0 m /i glyphshow
21.1099 0 m /d glyphshow
grestore
1.500 setlinewidth
[5.55 2.4] 0 setdash
1.000 0.498 0.055 setrgbcolor
gsave
68.2 245.041812 m
78.2 245.041812 l
88.2 245.041812 l
stroke
grestore
1.000 setlinewidth
0 setlinejoin
[] 0 setdash
gsave
/o {
gsave
newpath
translate
1.0 setlinewidth
0 setlinejoin

0 setlinecap

3.5 -0 m
-3.5 3.5 l
-3.5 -3.5 l
cl

gsave
1.000 0.498 0.055 setrgbcolor
fill
grestore
stroke
grestore
} bind def
78.2 245.042 o
grestore
0.000 setgray
/STIXGeneral-Regular 10.000 selectfont
gsave

96.2 241.542 translate
0 rotate
0 0 m /s glyphshow
3.88998 0 m /c glyphshow
8.32997 0 m /a glyphshow
12.77 0 m /t glyphshow
15.5499 0 m /t glyphshow
18.3299 0 m /e glyphshow
22.7699 0 m /r glyphshow
26.0999 0 m /e glyphshow
30.5399 0 m /d glyphshow
grestore
1.500 setlinewidth
1 setlinejoin
[1.5 2.475] 0 setdash
0.173 0.627 0.173 setrgbcolor
gsave
68.2 230.869937 m
78.2 230.869937 l
88.2 230.869937 l
stroke
grestore
1.000 setlinewidth
[] 0 setdash
gsave
/o {
gsave
newpath
translate
1.0 setlinewidth
1 setlinejoin

0 setlinecap

0 -1.75 m
0.464105 -1.75 0.909265 -1.565609 1.237437 -1.237437 c
1.565609 -0.909265 1.75 -0.464105 1.75 0 c
1.75 0.464105 1.565609 0.909265 1.237437 1.237437 c
0.909265 1.565609 0.464105 1.75 0 1.75 c
-0.464105 1.75 -0.909265 1.565609 -1.237437 1.237437 c
-1.565609 0.909265 -1.75 0.464105 -1.75 0 c
-1.75 -0.464105 -1.565609 -0.909265 -1.237437 -1.237437 c
-0.909265 -1.565609 -0.464105 -1.75 0 -1.75 c
cl

gsave
0.173 0.627 0.173 setrgbcolor
fill
grestore
stroke
grestore
} bind def
78.2 230.87 o
grestore
0.000 setgray
/STIXGeneral-Regular 10.000 selectfont
gsave

96.2 227.37 translate
0 rotate
0 0 m /F glyphshow
5.55998 0 m /D glyphshow
12.78 0 m /M glyphshow
21.67 0 m /hyphen glyphshow
24.9999 0 m /l glyphshow
27.7799 0 m /i glyphshow
30.5599 0 m /k glyphshow
35.5599 0 m /e glyphshow
grestore
gsave
370.590811 41.60625 m
625.427823 41.60625 l
625.427823 271.729312 l
370.590811 271.729312 l
cl
1.000 setgray
fill
grestore
0.800 setlinewidth
2 setlinecap
0.690 setgray
gsave
254.837 230.123 370.591 41.606 clipbox
410.198393 41.60625 m
410.198393 271.729312 l
stroke
grestore
0 setlinecap
0.000 setgray
gsave
/o {
gsave
newpath
translate
0.8 setlinewidth
1 setlinejoin

0 setlinecap

0 0 m
0 -3.5 l

gsave
0.000 setgray
fill
grestore
stroke
grestore
} bind def
410.198 41.6063 o
grestore
gsave
395.198 26.4031 translate
0 rotate
/STIXGeneral-Regular 12.0 selectfont
0 0.890625 moveto
/two glyphshow
5.99998 0.890625 moveto
/zero glyphshow
12 0.890625 moveto
/zero glyphshow
18 0.890625 moveto
/zero glyphshow
23.9999 0.890625 moveto
/zero glyphshow
grestore
2 setlinecap
0.690 setgray
gsave
254.837 230.123 370.591 41.606 clipbox
477.961579 41.60625 m
477.961579 271.729312 l
stroke
grestore
0 setlinecap
0.000 setgray
gsave
/o {
gsave
newpath
translate
0.8 setlinewidth
1 setlinejoin

0 setlinecap

0 0 m
0 -3.5 l

gsave
0.000 setgray
fill
grestore
stroke
grestore
} bind def
477.962 41.6063 o
grestore
gsave
462.962 26.4031 translate
0 rotate
/STIXGeneral-Regular 12.0 selectfont
0 0.890625 moveto
/four glyphshow
5.99998 0.890625 moveto
/zero glyphshow
12 0.890625 moveto
/zero glyphshow
18 0.890625 moveto
/zero glyphshow
23.9999 0.890625 moveto
/zero glyphshow
grestore
2 setlinecap
0.690 setgray
gsave
254.837 230.123 370.591 41.606 clipbox
545.724764 41.60625 m
545.724764 271.729312 l
stroke
grestore
0 setlinecap
0.000 setgray
gsave
/o {
gsave
newpath
translate
0.8 setlinewidth
1 setlinejoin

0 setlinecap

0 0 m
0 -3.5 l

gsave
0.000 setgray
fill
grestore
stroke
grestore
} bind def
545.725 41.6063 o
grestore
gsave
530.725 26.4031 translate
0 rotate
/STIXGeneral-Regular 12.0 selectfont
0 0.796875 moveto
/six glyphshow
5.99998 0.796875 moveto
/zero glyphshow
12 0.796875 moveto
/zero glyphshow
18 0.796875 moveto
/zero glyphshow
23.9999 0.796875 moveto
/zero glyphshow
grestore
2 setlinecap
0.690 setgray
gsave
254.837 230.123 370.591 41.606 clipbox
613.48795 41.60625 m
613.48795 271.729312 l
stroke
grestore
0 setlinecap
0.000 setgray
gsave
/o {
gsave
newpath
translate
0.8 setlinewidth
1 setlinejoin

0 setlinecap

0 0 m
0 -3.5 l

gsave
0.000 setgray
fill
grestore
stroke
grestore
} bind def
613.488 41.6063 o
grestore
gsave
598.488 26.4031 translate
0 rotate
/STIXGeneral-Regular 12.0 selectfont
0 0.890625 moveto
/eight glyphshow
5.99998 0.890625 moveto
/zero glyphshow
12 0.890625 moveto
/zero glyphshow
18 0.890625 moveto
/zero glyphshow
23.9999 0.890625 moveto
/zero glyphshow
grestore
gsave
493.009 10.2313 translate
0 rotate
/STIXGeneral-Italic 14.0 selectfont
0 0.859375 moveto
/N glyphshow
grestore
2 setlinecap
0.690 setgray
gsave
254.837 230.123 370.591 41.606 clipbox
370.590811 53.743485 m
625.427823 53.743485 l
stroke
grestore
0 setlinecap
0.000 setgray
gsave
/o {
gsave
newpath
translate
0.8 setlinewidth
1 setlinejoin

0 setlinecap

-0 0 m
-3.5 0 l

gsave
0.000 setgray
fill
grestore
stroke
grestore
} bind def
370.591 53.7435 o
grestore
gsave
346.591 49.0482 translate
0 rotate
/STIXGeneral-Regular 12.0 selectfont
0 0.998438 moveto
/one glyphshow
5.99998 0.998438 moveto
/zero glyphshow
/STIXGeneral-Regular 8.399999999999999 selectfont
12.1892 5.32344 moveto
/one glyphshow
grestore
2 setlinecap
0.690 setgray
gsave
254.837 230.123 370.591 41.606 clipbox
370.590811 152.413151 m
625.427823 152.413151 l
stroke
grestore
0 setlinecap
0.000 setgray
gsave
/o {
gsave
newpath
translate
0.8 setlinewidth
1 setlinejoin

0 setlinecap

-0 0 m
-3.5 0 l

gsave
0.000 setgray
fill
grestore
stroke
grestore
} bind def
370.591 152.413 o
grestore
gsave
346.591 147.718 translate
0 rotate
/STIXGeneral-Regular 12.0 selectfont
0 0.998438 moveto
/one glyphshow
5.99998 0.998438 moveto
/zero glyphshow
/STIXGeneral-Regular 8.399999999999999 selectfont
12.1892 5.32344 moveto
/two glyphshow
grestore
2 setlinecap
0.690 setgray
gsave
254.837 230.123 370.591 41.606 clipbox
370.590811 251.082817 m
625.427823 251.082817 l
stroke
grestore
0 setlinecap
0.000 setgray
gsave
/o {
gsave
newpath
translate
0.8 setlinewidth
1 setlinejoin

0 setlinecap

-0 0 m
-3.5 0 l

gsave
0.000 setgray
fill
grestore
stroke
grestore
} bind def
370.591 251.083 o
grestore
gsave
346.591 246.388 translate
0 rotate
/STIXGeneral-Regular 12.0 selectfont
0 0.998438 moveto
/one glyphshow
5.99998 0.998438 moveto
/zero glyphshow
/STIXGeneral-Regular 8.399999999999999 selectfont
12.1892 5.32344 moveto
/three glyphshow
grestore
2 setlinecap
0.690 setgray
gsave
254.837 230.123 370.591 41.606 clipbox
370.590811 44.181406 m
625.427823 44.181406 l
stroke
grestore
0.600 setlinewidth
0 setlinecap
0.000 setgray
gsave
/o {
gsave
newpath
translate
0.6 setlinewidth
1 setlinejoin

0 setlinecap

-0 0 m
-2 0 l

gsave
0.000 setgray
fill
grestore
stroke
grestore
} bind def
370.591 44.1814 o
grestore
0.800 setlinewidth
2 setlinecap
0.690 setgray
gsave
254.837 230.123 370.591 41.606 clipbox
370.590811 49.228609 m
625.427823 49.228609 l
stroke
grestore
0.600 setlinewidth
0 setlinecap
0.000 setgray
gsave
/o {
gsave
newpath
translate
0.6 setlinewidth
1 setlinejoin

0 setlinecap

-0 0 m
-2 0 l

gsave
0.000 setgray
fill
grestore
stroke
grestore
} bind def
370.591 49.2286 o
grestore
0.800 setlinewidth
2 setlinecap
0.690 setgray
gsave
254.837 230.123 370.591 41.606 clipbox
370.590811 83.446014 m
625.427823 83.446014 l
stroke
grestore
0.600 setlinewidth
0 setlinecap
0.000 setgray
gsave
/o {
gsave
newpath
translate
0.6 setlinewidth
1 setlinejoin

0 setlinecap

-0 0 m
-2 0 l

gsave
0.000 setgray
fill
grestore
stroke
grestore
} bind def
370.591 83.446 o
grestore
0.800 setlinewidth
2 setlinecap
0.690 setgray
gsave
254.837 230.123 370.591 41.606 clipbox
370.590811 100.82088 m
625.427823 100.82088 l
stroke
grestore
0.600 setlinewidth
0 setlinecap
0.000 setgray
gsave
/o {
gsave
newpath
translate
0.6 setlinewidth
1 setlinejoin

0 setlinecap

-0 0 m
-2 0 l

gsave
0.000 setgray
fill
grestore
stroke
grestore
} bind def
370.591 100.821 o
grestore
0.800 setlinewidth
2 setlinecap
0.690 setgray
gsave
254.837 230.123 370.591 41.606 clipbox
370.590811 113.148543 m
625.427823 113.148543 l
stroke
grestore
0.600 setlinewidth
0 setlinecap
0.000 setgray
gsave
/o {
gsave
newpath
translate
0.6 setlinewidth
1 setlinejoin

0 setlinecap

-0 0 m
-2 0 l

gsave
0.000 setgray
fill
grestore
stroke
grestore
} bind def
370.591 113.149 o
grestore
0.800 setlinewidth
2 setlinecap
0.690 setgray
gsave
254.837 230.123 370.591 41.606 clipbox
370.590811 122.710622 m
625.427823 122.710622 l
stroke
grestore
0.600 setlinewidth
0 setlinecap
0.000 setgray
gsave
/o {
gsave
newpath
translate
0.6 setlinewidth
1 setlinejoin

0 setlinecap

-0 0 m
-2 0 l

gsave
0.000 setgray
fill
grestore
stroke
grestore
} bind def
370.591 122.711 o
grestore
0.800 setlinewidth
2 setlinecap
0.690 setgray
gsave
254.837 230.123 370.591 41.606 clipbox
370.590811 130.523409 m
625.427823 130.523409 l
stroke
grestore
0.600 setlinewidth
0 setlinecap
0.000 setgray
gsave
/o {
gsave
newpath
translate
0.6 setlinewidth
1 setlinejoin

0 setlinecap

-0 0 m
-2 0 l

gsave
0.000 setgray
fill
grestore
stroke
grestore
} bind def
370.591 130.523 o
grestore
0.800 setlinewidth
2 setlinecap
0.690 setgray
gsave
254.837 230.123 370.591 41.606 clipbox
370.590811 137.129026 m
625.427823 137.129026 l
stroke
grestore
0.600 setlinewidth
0 setlinecap
0.000 setgray
gsave
/o {
gsave
newpath
translate
0.6 setlinewidth
1 setlinejoin

0 setlinecap

-0 0 m
-2 0 l

gsave
0.000 setgray
fill
grestore
stroke
grestore
} bind def
370.591 137.129 o
grestore
0.800 setlinewidth
2 setlinecap
0.690 setgray
gsave
254.837 230.123 370.591 41.606 clipbox
370.590811 142.851073 m
625.427823 142.851073 l
stroke
grestore
0.600 setlinewidth
0 setlinecap
0.000 setgray
gsave
/o {
gsave
newpath
translate
0.6 setlinewidth
1 setlinejoin

0 setlinecap

-0 0 m
-2 0 l

gsave
0.000 setgray
fill
grestore
stroke
grestore
} bind def
370.591 142.851 o
grestore
0.800 setlinewidth
2 setlinecap
0.690 setgray
gsave
254.837 230.123 370.591 41.606 clipbox
370.590811 147.898275 m
625.427823 147.898275 l
stroke
grestore
0.600 setlinewidth
0 setlinecap
0.000 setgray
gsave
/o {
gsave
newpath
translate
0.6 setlinewidth
1 setlinejoin

0 setlinecap

-0 0 m
-2 0 l

gsave
0.000 setgray
fill
grestore
stroke
grestore
} bind def
370.591 147.898 o
grestore
0.800 setlinewidth
2 setlinecap
0.690 setgray
gsave
254.837 230.123 370.591 41.606 clipbox
370.590811 182.11568 m
625.427823 182.11568 l
stroke
grestore
0.600 setlinewidth
0 setlinecap
0.000 setgray
gsave
/o {
gsave
newpath
translate
0.6 setlinewidth
1 setlinejoin

0 setlinecap

-0 0 m
-2 0 l

gsave
0.000 setgray
fill
grestore
stroke
grestore
} bind def
370.591 182.116 o
grestore
0.800 setlinewidth
2 setlinecap
0.690 setgray
gsave
254.837 230.123 370.591 41.606 clipbox
370.590811 199.490546 m
625.427823 199.490546 l
stroke
grestore
0.600 setlinewidth
0 setlinecap
0.000 setgray
gsave
/o {
gsave
newpath
translate
0.6 setlinewidth
1 setlinejoin

0 setlinecap

-0 0 m
-2 0 l

gsave
0.000 setgray
fill
grestore
stroke
grestore
} bind def
370.591 199.491 o
grestore
0.800 setlinewidth
2 setlinecap
0.690 setgray
gsave
254.837 230.123 370.591 41.606 clipbox
370.590811 211.81821 m
625.427823 211.81821 l
stroke
grestore
0.600 setlinewidth
0 setlinecap
0.000 setgray
gsave
/o {
gsave
newpath
translate
0.6 setlinewidth
1 setlinejoin

0 setlinecap

-0 0 m
-2 0 l

gsave
0.000 setgray
fill
grestore
stroke
grestore
} bind def
370.591 211.818 o
grestore
0.800 setlinewidth
2 setlinecap
0.690 setgray
gsave
254.837 230.123 370.591 41.606 clipbox
370.590811 221.380288 m
625.427823 221.380288 l
stroke
grestore
0.600 setlinewidth
0 setlinecap
0.000 setgray
gsave
/o {
gsave
newpath
translate
0.6 setlinewidth
1 setlinejoin

0 setlinecap

-0 0 m
-2 0 l

gsave
0.000 setgray
fill
grestore
stroke
grestore
} bind def
370.591 221.38 o
grestore
0.800 setlinewidth
2 setlinecap
0.690 setgray
gsave
254.837 230.123 370.591 41.606 clipbox
370.590811 229.193075 m
625.427823 229.193075 l
stroke
grestore
0.600 setlinewidth
0 setlinecap
0.000 setgray
gsave
/o {
gsave
newpath
translate
0.6 setlinewidth
1 setlinejoin

0 setlinecap

-0 0 m
-2 0 l

gsave
0.000 setgray
fill
grestore
stroke
grestore
} bind def
370.591 229.193 o
grestore
0.800 setlinewidth
2 setlinecap
0.690 setgray
gsave
254.837 230.123 370.591 41.606 clipbox
370.590811 235.798693 m
625.427823 235.798693 l
stroke
grestore
0.600 setlinewidth
0 setlinecap
0.000 setgray
gsave
/o {
gsave
newpath
translate
0.6 setlinewidth
1 setlinejoin

0 setlinecap

-0 0 m
-2 0 l

gsave
0.000 setgray
fill
grestore
stroke
grestore
} bind def
370.591 235.799 o
grestore
0.800 setlinewidth
2 setlinecap
0.690 setgray
gsave
254.837 230.123 370.591 41.606 clipbox
370.590811 241.520739 m
625.427823 241.520739 l
stroke
grestore
0.600 setlinewidth
0 setlinecap
0.000 setgray
gsave
/o {
gsave
newpath
translate
0.6 setlinewidth
1 setlinejoin

0 setlinecap

-0 0 m
-2 0 l

gsave
0.000 setgray
fill
grestore
stroke
grestore
} bind def
370.591 241.521 o
grestore
0.800 setlinewidth
2 setlinecap
0.690 setgray
gsave
254.837 230.123 370.591 41.606 clipbox
370.590811 246.567941 m
625.427823 246.567941 l
stroke
grestore
0.600 setlinewidth
0 setlinecap
0.000 setgray
gsave
/o {
gsave
newpath
translate
0.6 setlinewidth
1 setlinejoin

0 setlinecap

-0 0 m
-2 0 l

gsave
0.000 setgray
fill
grestore
stroke
grestore
} bind def
370.591 246.568 o
grestore
/STIXGeneral-Regular 14.000 selectfont
gsave

339.56 97.9568 translate
90 rotate
0 0 m /e glyphshow
6.21599 0 m /x glyphshow
13.216 0 m /e glyphshow
19.432 0 m /c glyphshow
25.648 0 m /u glyphshow
32.648 0 m /t glyphshow
36.54 0 m /i glyphshow
40.432 0 m /o glyphshow
47.432 0 m /n glyphshow
54.432 0 m /space glyphshow
57.932 0 m /t glyphshow
61.824 0 m /i glyphshow
65.716 0 m /m glyphshow
76.608 0 m /e glyphshow
82.8239 0 m /space glyphshow
86.3239 0 m /bracketleft glyphshow
90.9859 0 m /m glyphshow
101.878 0 m /i glyphshow
105.77 0 m /n glyphshow
112.77 0 m /bracketright glyphshow
grestore
1.500 setlinewidth
2 setlinecap
0.122 0.467 0.706 setrgbcolor
gsave
254.837 230.123 370.591 41.606 clipbox
373.965418 60.213788 m
389.388319 93.090722 l
407.863951 120.743359 l
429.270342 144.542053 l
453.770121 165.686521 l
482.572863 186.405435 l
513.256034 203.252943 l
546.961442 220.349469 l
583.733135 232.444747 l
625.427823 245.796048 l
stroke
grestore
1.000 setlinewidth
0 setlinecap
gsave
254.837 230.123 370.591 41.606 clipbox
/o {
gsave
newpath
translate
1.0 setlinewidth
1 setlinejoin

0 setlinecap

-3.5 -3.5 m
3.5 3.5 l
-3.5 3.5 m
3.5 -3.5 l

gsave
0.122 0.467 0.706 setrgbcolor
fill
grestore
stroke
grestore
} bind def
373.965 60.2138 o
389.388 93.0907 o
407.864 120.743 o
429.27 144.542 o
453.77 165.687 o
482.573 186.405 o
513.256 203.253 o
546.961 220.349 o
583.733 232.445 o
625.428 245.796 o
grestore
1.500 setlinewidth
[5.55 2.4] 0 setdash
1.000 0.498 0.055 setrgbcolor
gsave
254.837 230.123 370.591 41.606 clipbox
370.590811 84.760928 m
384.035027 118.88113 l
400.220264 148.031401 l
419.11264 173.022719 l
440.610511 193.401934 l
465.743876 216.778247 l
492.496782 233.722302 l
521.912781 247.743843 l
554.18161 261.269173 l
554.278582 -1 l
stroke
grestore
1.000 setlinewidth
0 setlinejoin
[] 0 setdash
gsave
254.837 230.123 370.591 41.606 clipbox
/o {
gsave
newpath
translate
1.0 setlinewidth
0 setlinejoin

0 setlinecap

3.5 -0 m
-3.5 3.5 l
-3.5 -3.5 l
cl

gsave
1.000 0.498 0.055 setrgbcolor
fill
grestore
stroke
grestore
} bind def
370.591 84.7609 o
384.035 118.881 o
400.22 148.031 o
419.113 173.023 o
440.611 193.402 o
465.744 216.778 o
492.497 233.722 o
521.913 247.744 o
554.182 261.269 o
554.279 -1 o
grestore
1.500 setlinewidth
1 setlinejoin
[1.5 2.475] 0 setdash
0.173 0.627 0.173 setrgbcolor
gsave
254.837 230.123 370.591 41.606 clipbox
373.585944 52.066389 m
388.85299 86.924057 l
407.16599 114.964939 l
428.467348 141.42595 l
452.804496 161.474899 l
481.590297 183.681831 l
512.121001 200.698825 l
545.707824 215.455238 l
582.296556 229.210784 l
623.882823 244.945255 l
stroke
grestore
1.000 setlinewidth
[] 0 setdash
gsave
254.837 230.123 370.591 41.606 clipbox
/o {
gsave
newpath
translate
1.0 setlinewidth
1 setlinejoin

0 setlinecap

0 -1.75 m
0.464105 -1.75 0.909265 -1.565609 1.237437 -1.237437 c
1.565609 -0.909265 1.75 -0.464105 1.75 0 c
1.75 0.464105 1.565609 0.909265 1.237437 1.237437 c
0.909265 1.565609 0.464105 1.75 0 1.75 c
-0.464105 1.75 -0.909265 1.565609 -1.237437 1.237437 c
-1.565609 0.909265 -1.75 0.464105 -1.75 0 c
-1.75 -0.464105 -1.565609 -0.909265 -1.237437 -1.237437 c
-0.909265 -1.565609 -0.464105 -1.75 0 -1.75 c
cl

gsave
0.173 0.627 0.173 setrgbcolor
fill
grestore
stroke
grestore
} bind def
373.586 52.0664 o
388.853 86.9241 o
407.166 114.965 o
428.467 141.426 o
452.804 161.475 o
481.59 183.682 o
512.121 200.699 o
545.708 215.455 o
582.297 229.211 o
623.883 244.945 o
grestore
0.800 setlinewidth
0 setlinejoin
2 setlinecap
0.000 setgray
gsave
370.590811 41.60625 m
370.590811 271.729312 l
stroke
grestore
gsave
625.427823 41.60625 m
625.427823 271.729312 l
stroke
grestore
gsave
370.590811 41.60625 m
625.427823 41.60625 l
stroke
grestore
gsave
370.590811 271.729312 m
625.427823 271.729312 l
stroke
grestore
1.000 setlinewidth
0 setlinecap
0.800 setgray
gsave
377.590811 221.198062 m
449.590811 221.198062 l
450.924144 221.198062 451.590811 221.864729 451.590811 223.198062 c
451.590811 264.729312 l
451.590811 266.062646 450.924144 266.729312 449.590811 266.729312 c
377.590811 266.729312 l
376.257478 266.729312 375.590811 266.062646 375.590811 264.729312 c
375.590811 223.198062 l
375.590811 221.864729 376.257478 221.198062 377.590811 221.198062 c
cl
gsave
1.000 setgray
fill
grestore
stroke
grestore
1.500 setlinewidth
1 setlinejoin
2 setlinecap
0.122 0.467 0.706 setrgbcolor
gsave
379.590811 259.229312 m
389.590811 259.229312 l
399.590811 259.229312 l
stroke
grestore
1.000 setlinewidth
0 setlinecap
gsave
/o {
gsave
newpath
translate
1.0 setlinewidth
1 setlinejoin

0 setlinecap

-3.5 -3.5 m
3.5 3.5 l
-3.5 3.5 m
3.5 -3.5 l

gsave
0.122 0.467 0.706 setrgbcolor
fill
grestore
stroke
grestore
} bind def
389.591 259.229 o
grestore
0.000 setgray
/STIXGeneral-Regular 10.000 selectfont
gsave

407.591 255.729 translate
0 rotate
0 0 m /h glyphshow
4.99998 0 m /y glyphshow
9.99997 0 m /b glyphshow
15 0 m /r glyphshow
18.3299 0 m /i glyphshow
21.1099 0 m /d glyphshow
grestore
1.500 setlinewidth
[5.55 2.4] 0 setdash
1.000 0.498 0.055 setrgbcolor
gsave
379.590811 245.041812 m
389.590811 245.041812 l
399.590811 245.041812 l
stroke
grestore
1.000 setlinewidth
0 setlinejoin
[] 0 setdash
gsave
/o {
gsave
newpath
translate
1.0 setlinewidth
0 setlinejoin

0 setlinecap

3.5 -0 m
-3.5 3.5 l
-3.5 -3.5 l
cl

gsave
1.000 0.498 0.055 setrgbcolor
fill
grestore
stroke
grestore
} bind def
389.591 245.042 o
grestore
0.000 setgray
/STIXGeneral-Regular 10.000 selectfont
gsave

407.591 241.542 translate
0 rotate
0 0 m /s glyphshow
3.88998 0 m /c glyphshow
8.32997 0 m /a glyphshow
12.77 0 m /t glyphshow
15.5499 0 m /t glyphshow
18.3299 0 m /e glyphshow
22.7699 0 m /r glyphshow
26.0999 0 m /e glyphshow
30.5399 0 m /d glyphshow
grestore
1.500 setlinewidth
1 setlinejoin
[1.5 2.475] 0 setdash
0.173 0.627 0.173 setrgbcolor
gsave
379.590811 230.869937 m
389.590811 230.869937 l
399.590811 230.869937 l
stroke
grestore
1.000 setlinewidth
[] 0 setdash
gsave
/o {
gsave
newpath
translate
1.0 setlinewidth
1 setlinejoin

0 setlinecap

0 -1.75 m
0.464105 -1.75 0.909265 -1.565609 1.237437 -1.237437 c
1.565609 -0.909265 1.75 -0.464105 1.75 0 c
1.75 0.464105 1.565609 0.909265 1.237437 1.237437 c
0.909265 1.565609 0.464105 1.75 0 1.75 c
-0.464105 1.75 -0.909265 1.565609 -1.237437 1.237437 c
-1.565609 0.909265 -1.75 0.464105 -1.75 0 c
-1.75 -0.464105 -1.565609 -0.909265 -1.237437 -1.237437 c
-0.909265 -1.565609 -0.464105 -1.75 0 -1.75 c
cl

gsave
0.173 0.627 0.173 setrgbcolor
fill
grestore
stroke
grestore
} bind def
389.591 230.87 o
grestore
0.000 setgray
/STIXGeneral-Regular 10.000 selectfont
gsave

407.591 227.37 translate
0 rotate
0 0 m /F glyphshow
5.55998 0 m /D glyphshow
12.78 0 m /M glyphshow
21.67 0 m /hyphen glyphshow
24.9999 0 m /l glyphshow
27.7799 0 m /i glyphshow
30.5599 0 m /k glyphshow
35.5599 0 m /e glyphshow
grestore

end
showpage
