%!PS-Adobe-3.0 EPSF-3.0
%%Title: dvd_nusselt_time.eps
%%Creator: Matplotlib v3.7.2, https://matplotlib.org/
%%CreationDate: Thu Oct 12 12:23:47 2023
%%Orientation: portrait
%%BoundingBox: 95 274 517 518
%%HiResBoundingBox: 95.146239 274.187500 516.853761 517.812500
%%EndComments
%%BeginProlog
/mpldict 12 dict def
mpldict begin
/_d { bind def } bind def
/m { moveto } _d
/l { lineto } _d
/r { rlineto } _d
/c { curveto } _d
/cl { closepath } _d
/ce { closepath eofill } _d
/box {
      m
      1 index 0 r
      0 exch r
      neg 0 r
      cl
    } _d
/clipbox {
      box
      clip
      newpath
    } _d
/sc { setcachedevice } _d
%!PS-Adobe-3.0 Resource-Font
%%Creator: Converted from TrueType to Type 3 by Matplotlib.
10 dict begin
/FontName /STIXGeneral-Regular def
/PaintType 0 def
/FontMatrix [0.001 0 0 0.001 0 0] def
/FontBBox [-970 -443 2000 1023] def
/FontType 3 def
/Encoding [/space /period /zero /one /two /four /five /six /seven /eight /nine /C /K /S /W /Scaron /a /b /c /d /e /g /h /i /l /m /n /o /r /s /t /u /y] def
/CharStrings 34 dict dup begin
/.notdef 0 def
/space{250 0 0 0 0 0 sc
ce} _d
/period{250 0 70 -11 181 100 sc
181 43 m
181 28 175 16 164 5 c
153 -6 140 -11 125 -11 c
110 -11 97 -6 86 5 c
75 16 70 29 70 44 c
70 59 75 72 86 83 c
97 94 111 100 126 100 c
141 100 153 94 164 83 c
175 72 181 58 181 43 c

ce} _d
/zero{500 0 24 -14 476 676 sc
476 330 m
476 285 472 243 463 203 c
454 164 441 127 424 94 c
407 61 384 34 354 15 c
324 -4 289 -14 250 -14 c
209 -14 174 -4 143 17 c
112 38 89 65 72 100 c
55 135 43 172 35 211 c
28 250 24 292 24 336 c
24 398 32 454 47 503 c
62 553 88 594 123 627 c
159 660 203 676 254 676 c
319 676 373 644 414 580 c
455 516 476 433 476 330 c

380 325 m
380 430 369 511 346 566 c
324 622 291 650 248 650 c
207 650 175 622 153 566 c
131 510 120 431 120 329 c
120 226 131 148 153 93 c
175 39 207 12 250 12 c
292 12 324 39 346 93 c
369 148 380 225 380 325 c

ce} _d
/one{500 0 111 0 394 676 sc
394 0 m
118 0 l
118 15 l
155 17 180 24 193 35 c
206 47 213 67 213 95 c
213 544 l
213 577 203 593 183 593 c
174 593 159 589 138 581 c
111 571 l
111 585 l
290 676 l
299 673 l
299 76 l
299 54 306 38 319 29 c
332 20 357 15 394 15 c
394 0 l

ce} _d
/two{500 0 29 0 474 676 sc
474 137 m
420 0 l
29 0 l
29 12 l
207 201 l
254 250 287 294 307 335 c
327 376 337 418 337 461 c
337 506 325 540 300 565 c
275 590 241 602 198 602 c
162 602 133 593 112 574 c
91 555 71 521 51 472 c
30 477 l
41 539 64 588 98 623 c
133 658 179 676 238 676 c
293 676 338 659 372 626 c
406 593 423 551 423 500 c
423 425 380 342 295 252 c
130 76 l
364 76 l
386 76 403 80 416 89 c
429 98 444 116 460 143 c
474 137 l

ce} _d
/four{500 0 12 0 473 676 sc
473 167 m
370 167 l
370 0 l
292 0 l
292 167 l
12 167 l
12 231 l
326 676 l
370 676 l
370 231 l
473 231 l
473 167 l

292 231 m
292 574 l
52 231 l
292 231 l

ce} _d
/five{500 0 31 -14 438 688 sc
438 681 m
402 596 l
398 587 389 583 375 583 c
181 583 l
141 498 l
214 484 267 469 300 452 c
333 436 363 409 391 370 c
414 338 426 296 426 243 c
426 195 418 155 402 122 c
387 89 362 60 328 35 c
283 2 226 -14 158 -14 c
120 -14 89 -8 66 3 c
43 14 31 29 31 48 c
31 73 46 86 76 86 c
100 86 125 76 150 55 c
176 34 200 23 221 23 c
256 23 287 40 314 75 c
342 110 356 149 356 192 c
356 256 334 306 289 342 c
231 389 160 412 76 412 c
68 412 64 415 64 420 c
65 425 l
174 662 l
381 662 l
392 662 401 664 407 667 c
414 670 421 677 429 688 c
438 681 l

ce} _d
/six{500 0 34 -14 468 684 sc
446 684 m
448 668 l
369 655 304 623 251 572 c
198 521 165 458 152 383 c
191 413 233 428 279 428 c
338 428 384 409 417 372 c
451 335 468 284 468 219 c
468 154 451 100 417 59 c
378 10 325 -14 258 -14 c
177 -14 118 20 81 87 c
50 144 34 208 34 279 c
34 388 70 480 143 555 c
184 598 227 628 270 645 c
314 663 373 676 446 684 c

378 188 m
378 317 333 382 243 382 c
210 382 182 373 160 355 c
138 338 127 308 127 266 c
127 188 139 126 163 81 c
188 36 223 14 269 14 c
304 14 331 30 350 61 c
369 93 378 135 378 188 c

ce} _d
/seven{500 0 20 -8 449 662 sc
449 646 m
237 -8 l
172 -8 l
370 588 l
155 588 l
126 588 105 583 91 573 c
77 563 59 541 38 506 c
20 515 l
80 662 l
449 662 l
449 646 l

ce} _d
/eight{500 0 56 -14 445 676 sc
445 155 m
445 104 427 63 391 32 c
356 1 308 -14 248 -14 c
192 -14 146 1 110 32 c
74 63 56 102 56 149 c
56 184 65 214 82 239 c
99 264 134 295 186 332 c
136 373 103 407 86 432 c
70 457 62 487 62 520 c
62 567 80 605 116 633 c
153 662 199 676 256 676 c
305 676 345 662 376 634 c
408 607 424 573 424 533 c
424 496 414 467 395 445 c
376 423 341 398 290 371 c
350 331 391 295 412 264 c
434 233 445 196 445 155 c

355 533 m
355 568 345 595 326 616 c
307 637 280 648 246 648 c
212 648 185 639 165 621 c
146 604 136 580 136 549 c
136 518 146 490 165 465 c
185 440 217 415 261 389 c
295 409 319 430 333 452 c
348 475 355 502 355 533 c

271 272 m
212 312 l
183 288 162 264 150 241 c
138 218 132 191 132 158 c
132 113 143 77 166 52 c
189 27 220 14 259 14 c
292 14 318 24 338 44 c
359 65 369 91 369 124 c
369 154 361 180 346 203 c
331 226 306 249 271 272 c

ce} _d
/nine{500 0 30 -22 459 676 sc
59 -22 m
56 -2 l
133 11 197 44 250 95 c
303 146 340 213 360 294 c
321 256 271 237 210 237 c
156 237 112 256 79 293 c
46 330 30 379 30 440 c
30 507 50 563 89 608 c
129 653 179 676 238 676 c
301 676 354 651 395 600 c
438 547 459 478 459 394 c
459 335 449 280 428 228 c
408 177 378 133 339 97 c
298 60 257 33 218 16 c
179 0 126 -13 59 -22 c

362 355 m
362 394 l
362 563 318 648 230 648 c
199 648 174 637 157 614 c
147 601 139 581 132 554 c
125 527 122 501 122 474 c
122 415 133 367 155 332 c
178 297 208 280 245 280 c
272 280 298 286 323 299 c
349 312 362 331 362 355 c

ce} _d
/C{667 0 28 -14 633 676 sc
614 131 m
633 113 l
574 28 483 -14 360 -14 c
263 -14 185 16 124 75 c
60 138 28 221 28 325 c
28 422 58 505 118 572 c
181 641 262 676 361 676 c
404 676 443 671 480 661 c
522 649 545 643 549 643 c
571 643 585 654 591 676 c
611 676 l
620 449 l
597 449 l
586 497 569 534 545 560 c
498 611 444 636 384 636 c
310 636 251 609 208 554 c
165 500 144 429 144 341 c
144 234 168 154 216 102 c
261 54 320 30 394 30 c
438 30 476 38 508 53 c
540 68 575 94 614 131 c

ce} _d
/K{722 0 33 0 723 662 sc
723 0 m
420 0 l
420 19 l
447 20 l
475 21 489 29 489 44 c
489 56 478 75 456 100 c
435 126 400 164 352 214 c
252 317 l
226 296 l
226 111 l
226 74 231 50 242 39 c
253 29 277 22 315 19 c
315 0 l
33 0 l
33 19 l
72 21 97 28 108 41 c
119 54 124 82 124 125 c
124 549 l
124 586 119 611 108 622 c
97 633 73 640 34 643 c
34 662 l
316 662 l
316 643 l
275 640 250 634 240 623 c
231 612 226 587 226 548 c
226 348 l
404 512 l
433 539 453 559 464 573 c
476 587 482 600 482 611 c
482 622 479 629 473 634 c
468 639 457 641 441 642 c
416 643 l
416 662 l
675 662 l
675 643 l
641 640 615 634 597 625 c
580 616 554 595 519 562 c
333 384 l
567 128 l
608 83 639 53 658 39 c
678 26 700 19 723 19 c
723 0 l

ce} _d
/S{556 0 43 -14 491 676 sc
469 463 m
444 463 l
433 504 419 536 403 557 c
362 609 314 635 258 635 c
227 635 203 626 184 608 c
166 591 157 568 157 540 c
157 527 160 514 167 501 c
174 488 181 477 188 468 c
196 459 210 448 229 435 c
248 422 264 411 276 404 c
288 397 308 386 336 369 c
390 338 429 306 454 275 c
479 244 491 210 491 173 c
491 118 472 73 433 38 c
394 3 346 -14 287 -14 c
244 -14 204 -6 169 9 c
152 16 136 20 122 20 c
114 20 107 17 102 11 c
97 5 94 -3 94 -13 c
72 -13 l
43 199 l
65 199 l
110 81 178 22 271 22 c
306 22 335 32 357 53 c
379 74 390 101 390 134 c
390 165 380 192 361 213 c
329 248 273 286 193 329 c
112 372 71 430 71 501 c
71 554 87 597 120 628 c
153 660 194 676 245 676 c
280 676 315 669 350 654 c
368 646 383 642 394 642 c
411 642 422 653 426 676 c
447 676 l
469 463 l

ce} _d
/W{944 0 5 -11 932 662 sc
932 662 m
932 643 l
905 638 887 631 877 623 c
868 616 858 599 849 573 c
773 369 705 174 645 -11 c
630 -11 l
589 102 536 243 470 412 c
316 -11 l
301 -11 l
278 56 244 151 199 274 c
154 397 124 480 109 523 c
92 571 77 603 63 618 c
50 634 30 642 5 643 c
5 662 l
249 662 l
249 643 l
224 642 207 640 198 635 c
189 630 185 623 185 612 c
185 601 189 585 196 565 c
340 189 l
444 472 l
416 547 l
400 590 386 617 375 627 c
364 637 343 642 314 643 c
314 662 l
579 662 l
579 643 l
528 642 502 630 502 608 c
502 599 508 580 519 550 c
662 186 l
788 525 l
799 557 805 583 805 602 c
805 629 782 642 735 643 c
735 662 l
932 662 l

ce} _d
/Scaron{556 0 43 -14 491 924 sc
429 924 m
305 757 l
241 757 l
118 924 l
153 924 l
273 821 l
394 924 l
429 924 l

469 463 m
444 463 l
433 504 419 536 403 557 c
362 609 314 635 258 635 c
227 635 203 626 184 608 c
166 591 157 568 157 540 c
157 527 160 514 167 501 c
174 488 181 477 188 468 c
196 459 210 448 229 435 c
248 422 264 411 276 404 c
288 397 308 386 336 369 c
390 338 429 306 454 275 c
479 244 491 210 491 173 c
491 118 472 73 433 38 c
394 3 346 -14 287 -14 c
244 -14 204 -6 169 9 c
152 16 136 20 122 20 c
114 20 107 17 102 11 c
97 5 94 -3 94 -13 c
72 -13 l
43 199 l
65 199 l
110 81 178 22 271 22 c
306 22 335 32 357 53 c
379 74 390 101 390 134 c
390 165 380 192 361 213 c
329 248 273 286 193 329 c
112 372 71 430 71 501 c
71 554 87 597 120 628 c
153 660 194 676 245 676 c
280 676 315 669 350 654 c
368 646 383 642 394 642 c
411 642 422 653 426 676 c
447 676 l
469 463 l

ce} _d
/a{444 0 37 -10 442 460 sc
442 66 m
442 38 l
417 6 387 -10 352 -10 c
314 -10 293 14 288 63 c
287 63 l
244 14 196 -10 142 -10 c
111 -10 85 -1 66 17 c
47 36 37 61 37 94 c
37 141 60 180 107 211 c
139 232 199 259 287 292 c
287 346 l
287 376 280 398 265 413 c
251 428 232 436 209 436 c
189 436 172 431 159 421 c
146 412 139 400 139 387 c
139 381 140 374 142 367 c
144 360 145 352 145 345 c
145 335 140 326 131 317 c
122 308 112 304 99 304 c
88 304 78 308 69 317 c
60 326 56 337 56 350 c
56 382 73 409 107 430 c
138 450 177 460 222 460 c
276 460 315 445 340 415 c
352 401 360 387 363 372 c
366 358 368 335 368 304 c
368 113 l
368 69 378 47 399 47 c
412 47 427 53 442 66 c

287 127 m
287 268 l
226 247 183 225 159 202 c
136 181 125 156 125 125 c
125 100 131 80 144 67 c
157 54 173 48 194 48 c
216 48 235 53 252 64 c
266 74 275 83 280 92 c
285 101 287 112 287 127 c

ce} _d
/b{500 0 3 -10 468 683 sc
153 681 m
153 376 l
164 401 181 422 205 437 c
230 452 257 460 288 460 c
341 460 384 439 417 397 c
451 355 468 303 468 240 c
468 167 446 107 401 60 c
356 13 301 -10 234 -10 c
193 -10 156 -3 121 10 c
86 24 69 39 69 56 c
69 566 l
69 591 66 606 60 613 c
54 620 41 624 20 624 c
15 624 10 623 3 622 c
3 639 l
33 648 l
101 669 139 680 148 683 c
153 681 l

153 318 m
153 74 l
153 59 162 46 181 36 c
200 27 223 22 250 22 c
289 22 320 36 343 65 c
368 96 380 140 380 197 c
380 262 367 313 341 350 c
319 381 289 397 252 397 c
225 397 202 389 182 373 c
163 358 153 339 153 318 c

ce} _d
/c{444 0 25 -10 412 460 sc
398 156 m
412 147 l
383 91 356 53 330 32 c
296 4 258 -10 215 -10 c
160 -10 114 11 78 52 c
43 94 25 147 25 212 c
25 297 53 362 109 409 c
150 443 195 460 244 460 c
286 460 322 450 352 429 c
383 409 398 385 398 357 c
398 346 393 336 384 327 c
375 319 364 315 351 315 c
328 315 312 330 303 361 c
297 383 l
292 402 285 414 277 421 c
269 428 256 431 238 431 c
197 431 164 415 139 383 c
114 351 102 309 102 257 c
102 200 116 153 145 116 c
174 80 211 62 257 62 c
286 62 310 69 331 82 c
352 96 374 121 398 156 c

ce} _d
/d{500 0 27 -10 491 683 sc
491 42 m
344 -10 l
340 -7 l
340 57 l
308 12 265 -10 212 -10 c
157 -10 112 10 78 49 c
44 89 27 141 27 205 c
27 276 47 336 88 385 c
129 435 178 460 235 460 c
271 460 306 446 340 417 c
340 573 l
340 594 337 607 331 614 c
325 621 313 624 294 624 c
285 624 277 624 272 623 c
272 639 l
333 655 382 670 419 683 c
424 681 l
424 114 l
424 91 427 75 432 68 c
438 61 450 57 468 57 c
472 57 480 57 491 58 c
491 42 l

340 102 m
340 332 l
340 359 330 382 309 402 c
289 422 265 432 238 432 c
200 432 170 415 147 381 c
124 347 113 302 113 245 c
113 184 125 134 150 97 c
175 60 209 42 251 42 c
282 42 307 53 325 74 c
335 85 340 95 340 102 c

ce} _d
/e{444 0 25 -10 424 460 sc
408 164 m
424 157 l
384 46 314 -10 215 -10 c
156 -10 110 10 76 51 c
42 92 25 148 25 217 c
25 288 44 347 82 392 c
120 437 170 460 232 460 c
292 460 338 437 371 391 c
390 364 402 326 405 277 c
97 277 l
100 235 104 203 109 181 c
115 159 126 137 143 114 c
171 77 208 59 254 59 c
287 59 314 67 336 83 c
359 99 383 126 408 164 c

99 309 m
303 309 l
297 351 287 381 273 398 c
260 415 237 424 205 424 c
177 424 154 414 135 394 c
116 375 104 346 99 309 c

ce} _d
/g{500 0 28 -218 470 460 sc
470 388 m
387 388 l
400 359 406 331 406 304 c
406 253 389 214 354 188 c
319 162 285 149 250 149 c
243 149 230 150 212 152 c
193 154 l
180 150 166 141 153 127 c
140 113 133 101 133 91 c
133 76 159 67 211 64 c
340 58 l
377 57 406 46 428 27 c
450 8 461 -18 461 -49 c
461 -88 441 -123 401 -154 c
346 -197 279 -218 201 -218 c
153 -218 112 -208 78 -189 c
45 -170 28 -148 28 -121 c
28 -102 35 -84 50 -65 c
65 -47 90 -25 126 1 c
105 11 90 20 83 27 c
76 34 73 43 73 54 c
73 73 88 96 119 123 c
134 136 149 150 162 163 c
129 180 105 198 90 219 c
76 240 69 266 69 297 c
69 342 85 381 117 412 c
150 444 189 460 236 460 c
263 460 289 455 316 445 c
338 437 l
357 430 376 427 393 427 c
470 427 l
470 388 l

152 338 m
152 335 l
152 287 161 248 180 218 c
199 189 224 174 255 174 c
278 174 296 182 309 198 c
322 215 329 237 329 264 c
329 308 319 348 299 385 c
282 416 258 432 226 432 c
203 432 184 424 171 407 c
158 390 152 367 152 338 c

433 -64 m
433 -45 424 -32 405 -25 c
387 -18 355 -15 309 -15 c
243 -15 189 -11 147 -2 c
127 -26 114 -43 107 -54 c
101 -65 98 -77 98 -88 c
98 -110 111 -128 137 -141 c
164 -154 199 -161 243 -161 c
300 -161 345 -152 380 -134 c
415 -117 433 -93 433 -64 c

ce} _d
/h{500 0 9 0 487 683 sc
487 0 m
275 0 l
275 15 l
304 18 323 25 331 35 c
339 45 343 67 343 102 c
343 300 l
343 371 318 406 269 406 c
249 406 231 401 214 392 c
197 383 178 366 157 343 c
157 102 l
157 67 161 45 169 35 c
177 25 196 18 225 15 c
225 0 l
9 0 l
9 15 l
38 19 55 26 62 35 c
69 44 73 67 73 102 c
73 573 l
73 594 70 608 63 614 c
57 621 43 624 22 624 c
16 624 12 624 10 623 c
10 639 l
37 647 l
88 662 127 674 152 683 c
157 680 l
157 376 l
180 406 203 427 226 440 c
249 453 275 460 304 460 c
386 460 427 407 427 301 c
427 102 l
427 67 430 45 436 36 c
443 27 460 20 487 15 c
487 0 l

ce} _d
/i{278 0 16 0 253 683 sc
180 632 m
180 617 175 605 165 595 c
155 586 143 581 128 581 c
114 581 102 586 92 595 c
83 605 78 617 78 632 c
78 646 83 658 93 668 c
103 678 115 683 129 683 c
144 683 156 678 165 668 c
175 658 180 646 180 632 c

253 0 m
16 0 l
16 15 l
51 17 72 23 81 33 c
90 43 95 67 95 104 c
95 331 l
95 354 93 371 88 380 c
83 389 75 394 62 394 c
46 394 32 392 20 389 c
20 405 l
175 460 l
179 456 l
179 105 l
179 68 183 44 191 34 c
200 24 220 18 253 15 c
253 0 l

ce} _d
/l{278 0 19 0 257 683 sc
257 0 m
21 0 l
21 15 l
52 18 73 24 83 34 c
93 45 98 64 98 92 c
98 561 l
98 585 95 602 89 611 c
83 620 72 625 56 625 c
42 625 30 624 19 623 c
19 639 l
82 654 135 669 177 683 c
182 679 l
182 87 l
182 59 187 40 196 31 c
205 22 226 17 257 15 c
257 0 l

ce} _d
/m{778 0 16 0 775 460 sc
775 0 m
557 0 l
557 15 l
585 18 603 23 610 32 c
618 41 622 61 622 90 c
622 296 l
622 336 616 365 604 382 c
593 399 573 408 545 408 c
522 408 502 403 485 394 c
469 385 453 369 438 347 c
438 95 l
438 63 443 42 452 31 c
462 21 481 16 510 15 c
510 0 l
286 0 l
286 15 l
315 17 334 22 342 29 c
350 37 354 56 354 86 c
354 297 l
354 371 332 408 289 408 c
270 408 250 404 229 395 c
208 387 193 377 183 365 c
174 355 170 349 170 348 c
170 70 l
170 49 175 34 184 27 c
193 20 211 16 238 15 c
238 0 l
16 0 l
16 15 l
44 16 63 21 72 30 c
81 40 86 59 86 88 c
86 336 l
86 361 83 378 78 387 c
73 397 64 402 51 402 c
41 402 30 401 19 398 c
19 415 l
64 428 111 443 158 460 c
166 457 l
166 383 l
168 383 l
198 414 224 435 247 445 c
270 455 295 460 321 460 c
374 460 409 432 427 376 c
479 432 533 460 590 460 c
667 460 706 400 706 280 c
706 77 l
706 55 709 40 716 31 c
723 23 734 18 749 17 c
775 15 l
775 0 l

ce} _d
/n{500 0 16 0 485 460 sc
485 0 m
277 0 l
278 15 l
303 17 319 24 327 36 c
336 49 340 72 340 105 c
340 304 l
340 371 316 405 267 405 c
250 405 235 401 220 393 c
205 385 187 370 164 348 c
164 72 l
164 52 168 38 177 30 c
186 22 204 17 229 15 c
229 0 l
18 0 l
18 15 l
43 17 60 23 68 33 c
76 44 80 64 80 94 c
80 337 l
80 362 78 379 73 388 c
68 397 59 402 45 402 c
32 402 22 401 16 398 c
16 415 l
63 428 108 443 153 460 c
161 457 l
161 379 l
162 379 l
209 433 257 460 306 460 c
344 460 373 447 393 420 c
414 393 424 355 424 306 c
424 85 l
424 58 428 41 436 32 c
444 23 460 18 485 15 c
485 0 l

ce} _d
/o{500 0 29 -10 470 460 sc
470 231 m
470 161 449 103 407 58 c
366 13 312 -10 245 -10 c
184 -10 132 12 91 57 c
50 102 29 159 29 228 c
29 297 50 353 91 396 c
132 439 187 460 254 460 c
316 460 367 439 408 396 c
449 354 470 299 470 231 c

380 204 m
380 280 363 339 330 382 c
303 415 272 432 235 432 c
200 432 172 418 151 389 c
130 361 119 322 119 273 c
119 188 137 119 172 68 c
195 35 225 18 262 18 c
299 18 327 34 348 67 c
369 100 380 146 380 204 c

ce} _d
/r{333 0 5 0 335 460 sc
160 458 m
160 366 l
185 402 206 427 223 440 c
240 453 259 460 280 460 c
297 460 311 455 320 446 c
330 437 335 424 335 407 c
335 393 331 382 324 374 c
317 366 308 362 296 362 c
283 362 270 369 256 382 c
245 392 237 397 230 397 c
216 397 201 387 184 368 c
168 349 160 331 160 315 c
160 90 l
160 61 166 42 177 32 c
188 22 211 16 245 15 c
245 0 l
5 0 l
5 15 l
37 21 57 28 64 35 c
72 42 76 59 76 84 c
76 334 l
76 356 73 371 68 380 c
63 389 55 394 42 394 c
31 394 20 393 7 390 c
7 406 l
49 419 98 437 155 460 c
160 458 l

ce} _d
/s{389 0 51 -10 348 459 sc
156 301 m
260 238 l
293 218 316 199 329 182 c
342 165 348 142 348 115 c
348 82 334 52 306 27 c
279 2 246 -10 208 -10 c
177 -10 152 -7 135 -1 c
117 5 102 8 89 8 c
78 8 70 4 65 -4 c
52 -4 l
52 153 l
68 153 l
79 104 94 69 114 46 c
134 23 161 12 195 12 c
220 12 240 19 255 33 c
270 47 278 65 278 86 c
278 117 260 142 225 161 c
171 191 l
91 236 51 284 51 336 c
51 375 63 405 88 426 c
113 448 147 459 189 459 c
218 459 241 455 256 448 c
268 443 277 440 284 440 c
289 440 294 443 300 450 c
311 450 l
316 314 l
301 314 l
290 359 275 391 258 409 c
241 428 218 437 188 437 c
165 437 147 431 133 420 c
120 409 113 392 113 369 c
113 358 117 345 124 332 c
132 319 143 309 156 301 c

ce} _d
/t{278 0 13 -10 279 579 sc
266 77 m
279 66 l
247 15 207 -10 158 -10 c
99 -10 70 32 70 117 c
70 418 l
17 418 l
14 420 13 422 13 425 c
13 430 19 437 30 444 c
55 459 88 494 127 551 c
128 553 131 557 136 563 c
141 570 145 575 147 579 c
152 579 154 575 154 566 c
154 450 l
255 450 l
255 418 l
154 418 l
154 132 l
154 100 158 77 166 63 c
174 49 187 42 206 42 c
226 42 246 54 266 77 c

ce} _d
/u{500 0 9 -10 480 450 sc
480 50 m
480 36 l
428 22 382 7 343 -9 c
338 -6 l
338 76 l
336 76 l
294 19 246 -10 193 -10 c
155 -10 125 2 103 25 c
82 48 71 79 71 118 c
71 369 l
71 394 67 411 58 420 c
49 429 33 435 9 436 c
9 450 l
155 450 l
155 127 l
155 104 162 85 175 70 c
189 55 206 48 226 48 c
259 48 287 58 310 79 c
319 87 325 94 328 101 c
331 108 333 120 333 137 c
333 368 l
333 394 328 411 319 418 c
310 426 290 431 259 433 c
259 450 l
417 450 l
417 107 l
417 84 421 68 428 61 c
436 54 451 50 474 50 c
480 50 l

ce} _d
/y{500 0 14 -218 475 450 sc
475 450 m
475 435 l
463 434 453 429 446 422 c
439 415 432 402 425 384 c
275 -25 l
249 -96 223 -145 196 -174 c
170 -203 138 -218 100 -218 c
79 -218 62 -212 49 -201 c
36 -190 30 -177 30 -160 c
30 -147 34 -136 42 -127 c
51 -118 61 -114 73 -114 c
92 -114 110 -118 125 -127 c
134 -132 142 -134 151 -134 c
165 -134 182 -119 201 -90 c
210 -77 219 -58 228 -33 c
237 -8 241 9 241 18 c
241 27 227 60 199 119 c
67 401 l
58 420 41 432 14 436 c
14 450 l
219 450 l
219 435 l
198 434 183 432 174 428 c
166 424 162 417 162 408 c
162 401 166 387 175 367 c
287 117 l
384 393 l
387 399 388 405 388 411 c
388 427 373 435 342 435 c
342 450 l
475 450 l

ce} _d
end readonly def

/BuildGlyph {
 exch begin
 CharStrings exch
 2 copy known not {pop /.notdef} if
 true 3 1 roll get exec
 end
} _d

/BuildChar {
 1 index /Encoding get exch get
 1 index /BuildGlyph get exec
} _d

FontName currentdict end definefont pop
%!PS-Adobe-3.0 Resource-Font
%%Creator: Converted from TrueType to Type 3 by Matplotlib.
10 dict begin
/FontName /Cmr10 def
/PaintType 0 def
/FontMatrix [0.00048828125 0 0 0.00048828125 0 0] def
/FontBBox [-90 -512 2066 1536] def
/FontType 3 def
/Encoding [/u /N] def
/CharStrings 3 dict dup begin
/.notdef 0 def
/u{1137 0 61 -23 1100 905 sc
221 244 m
221 696 l
221 733 215 759 204 775 c
193 792 178 802 157 805 c
136 809 104 811 61 811 c
61 883 l
371 905 l
371 244 l
371 191 375 149 382 119 c
390 90 406 68 431 53 c
456 38 496 31 551 31 c
624 31 683 62 726 123 c
769 184 791 254 791 332 c
791 696 l
791 733 785 759 774 775 c
763 792 747 802 726 805 c
706 809 674 811 631 811 c
631 883 l
940 905 l
940 186 l
940 150 945 124 956 107 c
967 91 983 81 1004 77 c
1025 74 1057 72 1100 72 c
1100 0 l
797 -23 l
797 150 l
772 99 736 57 691 25 c
646 -7 596 -23 541 -23 c
443 -23 365 -2 307 39 c
250 81 221 149 221 244 c

ce} _d
/N{1536 0 63 0 1470 1399 sc
63 0 m
63 72 l
204 72 274 112 274 193 c
274 1315 l
229 1323 159 1327 63 1327 c
63 1399 l
455 1399 l
462 1399 466 1396 469 1391 c
1194 324 l
1194 1206 l
1194 1287 1124 1327 983 1327 c
983 1399 l
1470 1399 l
1470 1327 l
1330 1327 1260 1287 1260 1206 c
1260 18 l
1260 14 1257 10 1252 6 c
1247 2 1242 0 1239 0 c
1214 0 l
1207 0 1203 3 1200 8 c
340 1274 l
340 193 l
340 112 410 72 551 72 c
551 0 l
63 0 l

ce} _d
end readonly def

/BuildGlyph {
 exch begin
 CharStrings exch
 2 copy known not {pop /.notdef} if
 true 3 1 roll get exec
 end
} _d

/BuildChar {
 1 index /Encoding get exch get
 1 index /BuildGlyph get exec
} _d

FontName currentdict end definefont pop
end
%%EndProlog
mpldict begin
95.146 274.188 translate
421.708 243.625 0 0 clipbox
gsave
0 0 m
421.707522 0 l
421.707522 243.625 l
0 243.625 l
cl
1.000 setgray
fill
grestore
gsave
48.2 41.60625 m
414.507522 41.60625 l
414.507522 236.425 l
48.2 236.425 l
cl
1.000 setgray
fill
grestore
0.800 setlinewidth
1 setlinejoin
2 setlinecap
[] 0 setdash
0.690 setgray
gsave
366.308 194.819 48.2 41.606 clipbox
48.2 41.60625 m
48.2 236.425 l
stroke
grestore
0 setlinecap
0.000 setgray
gsave
/o {
gsave
newpath
translate
0.8 setlinewidth
1 setlinejoin

0 setlinecap

0 0 m
0 -3.5 l

gsave
0.000 setgray
fill
grestore
stroke
grestore
} bind def
48.2 41.6063 o
grestore
gsave
37.7 26.4031 translate
0 rotate
/STIXGeneral-Regular 12.0 selectfont
0 0.890625 moveto
/zero glyphshow
5.99998 0.890625 moveto
/period glyphshow
8.99997 0.890625 moveto
/zero glyphshow
15 0.890625 moveto
/zero glyphshow
grestore
2 setlinecap
0.690 setgray
gsave
366.308 194.819 48.2 41.606 clipbox
97.040797 41.60625 m
97.040797 236.425 l
stroke
grestore
0 setlinecap
0.000 setgray
gsave
/o {
gsave
newpath
translate
0.8 setlinewidth
1 setlinejoin

0 setlinecap

0 0 m
0 -3.5 l

gsave
0.000 setgray
fill
grestore
stroke
grestore
} bind def
97.0408 41.6063 o
grestore
gsave
86.5408 26.4031 translate
0 rotate
/STIXGeneral-Regular 12.0 selectfont
0 0.890625 moveto
/zero glyphshow
5.99998 0.890625 moveto
/period glyphshow
8.99997 0.890625 moveto
/zero glyphshow
15 0.890625 moveto
/two glyphshow
grestore
2 setlinecap
0.690 setgray
gsave
366.308 194.819 48.2 41.606 clipbox
145.881595 41.60625 m
145.881595 236.425 l
stroke
grestore
0 setlinecap
0.000 setgray
gsave
/o {
gsave
newpath
translate
0.8 setlinewidth
1 setlinejoin

0 setlinecap

0 0 m
0 -3.5 l

gsave
0.000 setgray
fill
grestore
stroke
grestore
} bind def
145.882 41.6063 o
grestore
gsave
135.382 26.4031 translate
0 rotate
/STIXGeneral-Regular 12.0 selectfont
0 0.890625 moveto
/zero glyphshow
5.99998 0.890625 moveto
/period glyphshow
8.99997 0.890625 moveto
/zero glyphshow
15 0.890625 moveto
/four glyphshow
grestore
2 setlinecap
0.690 setgray
gsave
366.308 194.819 48.2 41.606 clipbox
194.722392 41.60625 m
194.722392 236.425 l
stroke
grestore
0 setlinecap
0.000 setgray
gsave
/o {
gsave
newpath
translate
0.8 setlinewidth
1 setlinejoin

0 setlinecap

0 0 m
0 -3.5 l

gsave
0.000 setgray
fill
grestore
stroke
grestore
} bind def
194.722 41.6063 o
grestore
gsave
184.222 26.4031 translate
0 rotate
/STIXGeneral-Regular 12.0 selectfont
0 0.796875 moveto
/zero glyphshow
5.99998 0.796875 moveto
/period glyphshow
8.99997 0.796875 moveto
/zero glyphshow
15 0.796875 moveto
/six glyphshow
grestore
2 setlinecap
0.690 setgray
gsave
366.308 194.819 48.2 41.606 clipbox
243.563189 41.60625 m
243.563189 236.425 l
stroke
grestore
0 setlinecap
0.000 setgray
gsave
/o {
gsave
newpath
translate
0.8 setlinewidth
1 setlinejoin

0 setlinecap

0 0 m
0 -3.5 l

gsave
0.000 setgray
fill
grestore
stroke
grestore
} bind def
243.563 41.6063 o
grestore
gsave
233.063 26.4031 translate
0 rotate
/STIXGeneral-Regular 12.0 selectfont
0 0.890625 moveto
/zero glyphshow
5.99998 0.890625 moveto
/period glyphshow
8.99997 0.890625 moveto
/zero glyphshow
15 0.890625 moveto
/eight glyphshow
grestore
2 setlinecap
0.690 setgray
gsave
366.308 194.819 48.2 41.606 clipbox
292.403987 41.60625 m
292.403987 236.425 l
stroke
grestore
0 setlinecap
0.000 setgray
gsave
/o {
gsave
newpath
translate
0.8 setlinewidth
1 setlinejoin

0 setlinecap

0 0 m
0 -3.5 l

gsave
0.000 setgray
fill
grestore
stroke
grestore
} bind def
292.404 41.6063 o
grestore
gsave
281.904 26.4031 translate
0 rotate
/STIXGeneral-Regular 12.0 selectfont
0 0.890625 moveto
/zero glyphshow
5.99998 0.890625 moveto
/period glyphshow
8.99997 0.890625 moveto
/one glyphshow
15 0.890625 moveto
/zero glyphshow
grestore
2 setlinecap
0.690 setgray
gsave
366.308 194.819 48.2 41.606 clipbox
341.244784 41.60625 m
341.244784 236.425 l
stroke
grestore
0 setlinecap
0.000 setgray
gsave
/o {
gsave
newpath
translate
0.8 setlinewidth
1 setlinejoin

0 setlinecap

0 0 m
0 -3.5 l

gsave
0.000 setgray
fill
grestore
stroke
grestore
} bind def
341.245 41.6063 o
grestore
gsave
330.745 26.4031 translate
0 rotate
/STIXGeneral-Regular 12.0 selectfont
0 0.890625 moveto
/zero glyphshow
5.99998 0.890625 moveto
/period glyphshow
8.99997 0.890625 moveto
/one glyphshow
15 0.890625 moveto
/two glyphshow
grestore
2 setlinecap
0.690 setgray
gsave
366.308 194.819 48.2 41.606 clipbox
390.085582 41.60625 m
390.085582 236.425 l
stroke
grestore
0 setlinecap
0.000 setgray
gsave
/o {
gsave
newpath
translate
0.8 setlinewidth
1 setlinejoin

0 setlinecap

0 0 m
0 -3.5 l

gsave
0.000 setgray
fill
grestore
stroke
grestore
} bind def
390.086 41.6063 o
grestore
gsave
379.586 26.4031 translate
0 rotate
/STIXGeneral-Regular 12.0 selectfont
0 0.890625 moveto
/zero glyphshow
5.99998 0.890625 moveto
/period glyphshow
8.99997 0.890625 moveto
/one glyphshow
15 0.890625 moveto
/four glyphshow
grestore
/STIXGeneral-Regular 14.000 selectfont
gsave

187.596 10.2313 translate
0 rotate
0 0 m /s glyphshow
5.446 0 m /i glyphshow
9.338 0 m /m glyphshow
20.23 0 m /u glyphshow
27.23 0 m /l glyphshow
31.122 0 m /a glyphshow
37.338 0 m /t glyphshow
41.23 0 m /i glyphshow
45.122 0 m /o glyphshow
52.122 0 m /n glyphshow
59.122 0 m /space glyphshow
62.622 0 m /t glyphshow
66.514 0 m /i glyphshow
70.406 0 m /m glyphshow
81.298 0 m /e glyphshow
grestore
2 setlinecap
0.690 setgray
gsave
366.308 194.819 48.2 41.606 clipbox
48.2 53.179786 m
414.507522 53.179786 l
stroke
grestore
0 setlinecap
0.000 setgray
gsave
/o {
gsave
newpath
translate
0.8 setlinewidth
1 setlinejoin

0 setlinecap

-0 0 m
-3.5 0 l

gsave
0.000 setgray
fill
grestore
stroke
grestore
} bind def
48.2 53.1798 o
grestore
gsave
26.2 49.0782 translate
0 rotate
/STIXGeneral-Regular 12.0 selectfont
0 0.796875 moveto
/six glyphshow
5.99998 0.796875 moveto
/period glyphshow
8.99997 0.796875 moveto
/zero glyphshow
grestore
2 setlinecap
0.690 setgray
gsave
366.308 194.819 48.2 41.606 clipbox
48.2 82.244755 m
414.507522 82.244755 l
stroke
grestore
0 setlinecap
0.000 setgray
gsave
/o {
gsave
newpath
translate
0.8 setlinewidth
1 setlinejoin

0 setlinecap

-0 0 m
-3.5 0 l

gsave
0.000 setgray
fill
grestore
stroke
grestore
} bind def
48.2 82.2448 o
grestore
gsave
26.2 78.1432 translate
0 rotate
/STIXGeneral-Regular 12.0 selectfont
0 0.75 moveto
/six glyphshow
5.99998 0.75 moveto
/period glyphshow
8.99997 0.75 moveto
/five glyphshow
grestore
2 setlinecap
0.690 setgray
gsave
366.308 194.819 48.2 41.606 clipbox
48.2 111.309724 m
414.507522 111.309724 l
stroke
grestore
0 setlinecap
0.000 setgray
gsave
/o {
gsave
newpath
translate
0.8 setlinewidth
1 setlinejoin

0 setlinecap

-0 0 m
-3.5 0 l

gsave
0.000 setgray
fill
grestore
stroke
grestore
} bind def
48.2 111.31 o
grestore
gsave
26.2 107.208 translate
0 rotate
/STIXGeneral-Regular 12.0 selectfont
0 0.890625 moveto
/seven glyphshow
5.99998 0.890625 moveto
/period glyphshow
8.99997 0.890625 moveto
/zero glyphshow
grestore
2 setlinecap
0.690 setgray
gsave
366.308 194.819 48.2 41.606 clipbox
48.2 140.374694 m
414.507522 140.374694 l
stroke
grestore
0 setlinecap
0.000 setgray
gsave
/o {
gsave
newpath
translate
0.8 setlinewidth
1 setlinejoin

0 setlinecap

-0 0 m
-3.5 0 l

gsave
0.000 setgray
fill
grestore
stroke
grestore
} bind def
48.2 140.375 o
grestore
gsave
26.2 136.273 translate
0 rotate
/STIXGeneral-Regular 12.0 selectfont
0 0.75 moveto
/seven glyphshow
5.99998 0.75 moveto
/period glyphshow
8.99997 0.75 moveto
/five glyphshow
grestore
2 setlinecap
0.690 setgray
gsave
366.308 194.819 48.2 41.606 clipbox
48.2 169.439663 m
414.507522 169.439663 l
stroke
grestore
0 setlinecap
0.000 setgray
gsave
/o {
gsave
newpath
translate
0.8 setlinewidth
1 setlinejoin

0 setlinecap

-0 0 m
-3.5 0 l

gsave
0.000 setgray
fill
grestore
stroke
grestore
} bind def
48.2 169.44 o
grestore
gsave
26.2 165.338 translate
0 rotate
/STIXGeneral-Regular 12.0 selectfont
0 0.890625 moveto
/eight glyphshow
5.99998 0.890625 moveto
/period glyphshow
8.99997 0.890625 moveto
/zero glyphshow
grestore
2 setlinecap
0.690 setgray
gsave
366.308 194.819 48.2 41.606 clipbox
48.2 198.504633 m
414.507522 198.504633 l
stroke
grestore
0 setlinecap
0.000 setgray
gsave
/o {
gsave
newpath
translate
0.8 setlinewidth
1 setlinejoin

0 setlinecap

-0 0 m
-3.5 0 l

gsave
0.000 setgray
fill
grestore
stroke
grestore
} bind def
48.2 198.505 o
grestore
gsave
26.2 194.403 translate
0 rotate
/STIXGeneral-Regular 12.0 selectfont
0 0.75 moveto
/eight glyphshow
5.99998 0.75 moveto
/period glyphshow
8.99997 0.75 moveto
/five glyphshow
grestore
2 setlinecap
0.690 setgray
gsave
366.308 194.819 48.2 41.606 clipbox
48.2 227.569602 m
414.507522 227.569602 l
stroke
grestore
0 setlinecap
0.000 setgray
gsave
/o {
gsave
newpath
translate
0.8 setlinewidth
1 setlinejoin

0 setlinecap

-0 0 m
-3.5 0 l

gsave
0.000 setgray
fill
grestore
stroke
grestore
} bind def
48.2 227.57 o
grestore
gsave
26.2 223.468 translate
0 rotate
/STIXGeneral-Regular 12.0 selectfont
0 0.890625 moveto
/nine glyphshow
5.99998 0.890625 moveto
/period glyphshow
8.99997 0.890625 moveto
/zero glyphshow
grestore
gsave
19.1688 129.516 translate
90 rotate
/Cmr10 14.0 selectfont
0 0.5625 moveto
/N glyphshow
10.5 0.5625 moveto
/u glyphshow
0.0 12.25 18.2724609375 0.875 rectfill
grestore
1.500 setlinewidth
2 setlinecap
0.122 0.467 0.706 setrgbcolor
gsave
366.308 194.819 48.2 41.606 clipbox
55.526615 50.992743 m
59.189922 52.901852 l
62.85323 64.254949 l
66.516537 65.872516 l
70.179845 92.164715 l
73.843152 184.914257 l
77.50646 197.077147 l
81.169767 181.756772 l
84.833074 182.055927 l
88.496382 183.604104 l
92.159689 177.493157 l
95.822997 170.212972 l
99.486304 170.652812 l
103.149612 182.736786 l
106.812919 198.982097 l
110.476227 207.917272 l
114.139534 208.855193 l
117.802841 206.815063 l
121.466149 204.200145 l
125.129456 202.119683 l
128.792764 202.250789 l
132.456071 205.506514 l
136.119379 210.558409 l
139.782686 214.659743 l
143.445993 215.966984 l
147.109301 214.841337 l
150.772608 213.052891 l
154.435916 212.235963 l
158.099223 213.014233 l
161.762531 214.936858 l
165.425838 216.960054 l
169.089146 218.159196 l
172.752453 218.228635 l
176.41576 217.538422 l
180.079068 216.827821 l
183.742375 216.72634 l
187.405683 217.365796 l
191.06899 218.355426 l
194.732298 219.134584 l
198.395605 219.379411 l
202.058913 219.150321 l
205.72222 218.765603 l
209.385527 218.565159 l
213.048835 218.710959 l
216.712142 219.117847 l
220.37545 219.544789 l
224.038757 219.774102 l
227.702065 219.745629 l
231.365372 219.565171 l
235.02868 219.408478 l
238.691987 219.400853 l
242.355294 219.548998 l
246.018602 219.758279 l
249.681909 219.910709 l
253.345217 219.943055 l
257.008524 219.875667 l
260.671832 219.784546 l
264.335139 219.744894 l
267.998447 219.785088 l
271.661754 219.877349 l
275.325061 219.965168 l
278.988369 220.004 l
282.651676 219.986944 l
286.314984 219.942102 l
289.978291 219.908828 l
293.641599 219.911446 l
297.304906 219.946988 l
300.968214 219.992014 l
304.631521 220.020955 l
308.294828 220.022444 l
311.958136 220.003822 l
315.621443 219.983206 l
319.284751 219.976342 l
322.948058 219.9873 l
326.611366 220.00809 l
330.274673 220.025841 l
333.93798 220.031721 l
337.601288 220.025698 l
341.264595 220.014971 l
344.927903 220.008205 l
348.59121 220.009905 l
352.254518 220.018389 l
355.917825 220.027969 l
359.581133 220.033223 l
363.24444 220.032321 l
366.907747 220.02752 l
370.571055 220.023019 l
374.234362 220.022013 l
377.89767 220.024895 l
381.560977 220.029527 l
385.224285 220.033036 l
388.887592 220.033733 l
392.5509 220.031951 l
396.214207 220.029472 l
399.877514 220.028163 l
403.540822 220.028801 l
407.204129 220.030794 l
410.867437 220.032799 l
414.507522 220.033692 l
stroke
grestore
1.000 setlinewidth
0 setlinecap
gsave
366.308 194.819 48.2 41.606 clipbox
/o {
gsave
newpath
translate
1.0 setlinewidth
1 setlinejoin

0 setlinecap

0 -1.5 m
0.397805 -1.5 0.77937 -1.341951 1.06066 -1.06066 c
1.341951 -0.77937 1.5 -0.397805 1.5 0 c
1.5 0.397805 1.341951 0.77937 1.06066 1.06066 c
0.77937 1.341951 0.397805 1.5 0 1.5 c
-0.397805 1.5 -0.77937 1.341951 -1.06066 1.06066 c
-1.341951 0.77937 -1.5 0.397805 -1.5 0 c
-1.5 -0.397805 -1.341951 -0.77937 -1.06066 -1.06066 c
-0.77937 -1.341951 -0.397805 -1.5 0 -1.5 c
cl

gsave
0.122 0.467 0.706 setrgbcolor
fill
grestore
stroke
grestore
} bind def
55.5266 50.9927 o
59.1899 52.9019 o
62.8532 64.2549 o
66.5165 65.8725 o
70.1798 92.1647 o
73.8432 184.914 o
77.5065 197.077 o
81.1698 181.757 o
84.8331 182.056 o
88.4964 183.604 o
92.1597 177.493 o
95.823 170.213 o
99.4863 170.653 o
103.15 182.737 o
106.813 198.982 o
110.476 207.917 o
114.14 208.855 o
117.803 206.815 o
121.466 204.2 o
125.129 202.12 o
128.793 202.251 o
132.456 205.507 o
136.119 210.558 o
139.783 214.66 o
143.446 215.967 o
147.109 214.841 o
150.773 213.053 o
154.436 212.236 o
158.099 213.014 o
161.763 214.937 o
165.426 216.96 o
169.089 218.159 o
172.752 218.229 o
176.416 217.538 o
180.079 216.828 o
183.742 216.726 o
187.406 217.366 o
191.069 218.355 o
194.732 219.135 o
198.396 219.379 o
202.059 219.15 o
205.722 218.766 o
209.386 218.565 o
213.049 218.711 o
216.712 219.118 o
220.375 219.545 o
224.039 219.774 o
227.702 219.746 o
231.365 219.565 o
235.029 219.408 o
238.692 219.401 o
242.355 219.549 o
246.019 219.758 o
249.682 219.911 o
253.345 219.943 o
257.009 219.876 o
260.672 219.785 o
264.335 219.745 o
267.998 219.785 o
271.662 219.877 o
275.325 219.965 o
278.988 220.004 o
282.652 219.987 o
286.315 219.942 o
289.978 219.909 o
293.642 219.911 o
297.305 219.947 o
300.968 219.992 o
304.632 220.021 o
308.295 220.022 o
311.958 220.004 o
315.621 219.983 o
319.285 219.976 o
322.948 219.987 o
326.611 220.008 o
330.275 220.026 o
333.938 220.032 o
337.601 220.026 o
341.265 220.015 o
344.928 220.008 o
348.591 220.01 o
352.255 220.018 o
355.918 220.028 o
359.581 220.033 o
363.244 220.032 o
366.908 220.028 o
370.571 220.023 o
374.234 220.022 o
377.898 220.025 o
381.561 220.03 o
385.224 220.033 o
388.888 220.034 o
392.551 220.032 o
396.214 220.029 o
399.878 220.028 o
403.541 220.029 o
407.204 220.031 o
410.867 220.033 o
414.508 220.034 o
grestore
1.500 setlinewidth
[5.55 2.4] 0 setdash
1.000 0.498 0.055 setrgbcolor
gsave
366.308 194.819 48.2 41.606 clipbox
55.526615 50.991714 m
59.189922 52.819946 l
62.85323 64.183508 l
66.516537 65.78992 l
70.179845 92.197103 l
73.843152 184.94598 l
77.50646 197.086512 l
81.169767 181.723924 l
84.833074 182.011235 l
88.496382 183.484184 l
92.159689 177.320926 l
95.822997 170.047206 l
99.486304 170.535816 l
103.149612 182.670926 l
106.812919 198.920854 l
110.476227 207.838731 l
114.139534 208.767578 l
117.802841 206.713123 l
121.466149 204.076829 l
125.129456 201.985407 l
128.792764 202.124589 l
132.456071 205.395327 l
136.119379 210.451489 l
139.782686 214.541583 l
143.445993 215.832018 l
147.109301 214.694309 l
150.772608 212.900343 l
154.435916 212.082527 l
158.099223 212.862934 l
161.762531 214.787729 l
165.425838 216.809104 l
169.089146 218.001284 l
172.752453 218.061639 l
176.41576 217.364526 l
180.079068 216.651381 l
183.742375 216.550552 l
187.405683 217.190792 l
191.06899 218.17903 l
194.732298 218.954499 l
198.395605 219.194734 l
202.058913 218.961687 l
205.72222 218.574543 l
209.385527 218.373182 l
213.048835 218.518715 l
216.712142 218.92488 l
220.37545 219.350098 l
224.038757 219.576999 l
227.702065 219.546181 l
231.365372 219.364022 l
235.02868 219.206368 l
238.691987 219.198199 l
242.355294 219.345763 l
246.018602 219.554124 l
249.681909 219.70531 l
253.345217 219.73634 l
257.008524 219.667849 l
260.671832 219.575971 l
264.335139 219.535825 l
267.998447 219.575579 l
271.661754 219.667286 l
275.325061 219.754407 l
278.988369 219.792495 l
282.651676 219.774777 l
286.314984 219.729424 l
289.978291 219.695766 l
293.641599 219.698053 l
297.304906 219.733237 l
300.968214 219.777856 l
304.631521 219.806368 l
308.294828 219.80746 l
311.958136 219.788506 l
315.621443 219.767621 l
319.284751 219.760522 l
322.948058 219.771245 l
326.611366 219.791784 l
330.274673 219.809279 l
333.93798 219.814917 l
337.601288 219.808683 l
341.264595 219.797777 l
344.927903 219.790851 l
348.59121 219.792395 l
352.254518 219.800721 l
355.917825 219.810142 l
359.581133 219.815245 l
363.24444 219.814209 l
366.907747 219.80929 l
370.571055 219.804684 l
374.234362 219.803576 l
377.89767 219.806355 l
381.560977 219.810887 l
385.224285 219.8143 l
388.887592 219.814911 l
392.5509 219.813052 l
396.214207 219.810504 l
399.877514 219.809128 l
403.540822 219.8097 l
407.204129 219.811629 l
410.867437 219.813572 l
414.507522 219.81441 l
stroke
grestore
1.000 setlinewidth
[] 0 setdash
gsave
366.308 194.819 48.2 41.606 clipbox
/o {
gsave
newpath
translate
1.0 setlinewidth
1 setlinejoin

0 setlinecap

0 -1.5 m
0.397805 -1.5 0.77937 -1.341951 1.06066 -1.06066 c
1.341951 -0.77937 1.5 -0.397805 1.5 0 c
1.5 0.397805 1.341951 0.77937 1.06066 1.06066 c
0.77937 1.341951 0.397805 1.5 0 1.5 c
-0.397805 1.5 -0.77937 1.341951 -1.06066 1.06066 c
-1.341951 0.77937 -1.5 0.397805 -1.5 0 c
-1.5 -0.397805 -1.341951 -0.77937 -1.06066 -1.06066 c
-0.77937 -1.341951 -0.397805 -1.5 0 -1.5 c
cl

gsave
1.000 0.498 0.055 setrgbcolor
fill
grestore
stroke
grestore
} bind def
55.5266 50.9917 o
59.1899 52.8199 o
62.8532 64.1835 o
66.5165 65.7899 o
70.1798 92.1971 o
73.8432 184.946 o
77.5065 197.087 o
81.1698 181.724 o
84.8331 182.011 o
88.4964 183.484 o
92.1597 177.321 o
95.823 170.047 o
99.4863 170.536 o
103.15 182.671 o
106.813 198.921 o
110.476 207.839 o
114.14 208.768 o
117.803 206.713 o
121.466 204.077 o
125.129 201.985 o
128.793 202.125 o
132.456 205.395 o
136.119 210.451 o
139.783 214.542 o
143.446 215.832 o
147.109 214.694 o
150.773 212.9 o
154.436 212.083 o
158.099 212.863 o
161.763 214.788 o
165.426 216.809 o
169.089 218.001 o
172.752 218.062 o
176.416 217.365 o
180.079 216.651 o
183.742 216.551 o
187.406 217.191 o
191.069 218.179 o
194.732 218.954 o
198.396 219.195 o
202.059 218.962 o
205.722 218.575 o
209.386 218.373 o
213.049 218.519 o
216.712 218.925 o
220.375 219.35 o
224.039 219.577 o
227.702 219.546 o
231.365 219.364 o
235.029 219.206 o
238.692 219.198 o
242.355 219.346 o
246.019 219.554 o
249.682 219.705 o
253.345 219.736 o
257.009 219.668 o
260.672 219.576 o
264.335 219.536 o
267.998 219.576 o
271.662 219.667 o
275.325 219.754 o
278.988 219.792 o
282.652 219.775 o
286.315 219.729 o
289.978 219.696 o
293.642 219.698 o
297.305 219.733 o
300.968 219.778 o
304.632 219.806 o
308.295 219.807 o
311.958 219.789 o
315.621 219.768 o
319.285 219.761 o
322.948 219.771 o
326.611 219.792 o
330.275 219.809 o
333.938 219.815 o
337.601 219.809 o
341.265 219.798 o
344.928 219.791 o
348.591 219.792 o
352.255 219.801 o
355.918 219.81 o
359.581 219.815 o
363.244 219.814 o
366.908 219.809 o
370.571 219.805 o
374.234 219.804 o
377.898 219.806 o
381.561 219.811 o
385.224 219.814 o
388.888 219.815 o
392.551 219.813 o
396.214 219.811 o
399.878 219.809 o
403.541 219.81 o
407.204 219.812 o
410.867 219.814 o
414.508 219.814 o
grestore
1.500 setlinewidth
[1.5 2.475] 0 setdash
0.173 0.627 0.173 setrgbcolor
gsave
366.308 194.819 48.2 41.606 clipbox
55.526615 50.461648 m
59.189922 52.3587 l
62.85323 63.861094 l
66.516537 65.456111 l
70.179845 91.659183 l
73.843152 184.07798 l
77.50646 196.437279 l
81.169767 180.801462 l
84.833074 180.944882 l
88.496382 182.571518 l
92.159689 176.541398 l
95.822997 169.283557 l
99.486304 169.677863 l
103.149612 181.704633 l
106.812919 197.97468 l
110.476227 206.951064 l
114.139534 207.844129 l
117.802841 205.738952 l
121.466149 203.108191 l
125.129456 201.045784 l
128.792764 201.197262 l
132.456071 204.466002 l
136.119379 209.524948 l
139.782686 213.62605 l
143.445993 214.920195 l
147.109301 213.771112 l
150.772608 211.96521 l
154.435916 211.150615 l
158.099223 211.946906 l
161.762531 213.886992 l
165.425838 215.914956 l
169.089146 217.106035 l
172.752453 217.162311 l
176.41576 216.462217 l
180.079068 215.750074 l
183.742375 215.655696 l
187.405683 216.306222 l
191.06899 217.303635 l
194.732298 218.082518 l
198.395605 218.320306 l
202.058913 218.083284 l
205.72222 217.695406 l
209.385527 217.498262 l
213.048835 217.651111 l
216.712142 218.064085 l
220.37545 218.492723 l
224.038757 218.719169 l
227.702065 218.685977 l
231.365372 218.502447 l
235.02868 218.346345 l
238.691987 218.342397 l
242.355294 218.494787 l
246.018602 218.706294 l
249.681909 218.858006 l
253.345217 218.887791 l
257.008524 218.818094 l
260.671832 218.726527 l
264.335139 218.688482 l
267.998447 218.731192 l
271.661754 218.825308 l
275.325061 218.913383 l
278.988369 218.95108 l
282.651676 218.93255 l
286.314984 218.887003 l
289.978291 218.854238 l
293.641599 218.858186 l
297.304906 218.895011 l
300.968214 218.94056 l
304.631521 218.969134 l
308.294828 218.969816 l
311.958136 218.950597 l
315.621443 218.93001 l
319.284751 218.923755 l
322.948058 218.935489 l
326.611366 218.956763 l
330.274673 218.974501 l
333.93798 218.980003 l
337.601288 218.973581 l
341.264595 218.962732 l
344.927903 218.956194 l
348.59121 218.958312 l
352.254518 218.967147 l
355.917825 218.976832 l
359.581133 218.981948 l
363.24444 218.98082 l
366.907747 218.975886 l
370.571055 218.971441 l
374.234362 218.970636 l
377.89767 218.973737 l
381.560977 218.978486 l
385.224285 218.981971 l
388.887592 218.982558 l
392.5509 218.98068 l
396.214207 218.978192 l
399.877514 218.976967 l
403.540822 218.977728 l
407.204129 218.979812 l
410.867437 218.981835 l
414.507522 218.982686 l
stroke
grestore
1.000 setlinewidth
[] 0 setdash
gsave
366.308 194.819 48.2 41.606 clipbox
/o {
gsave
newpath
translate
1.0 setlinewidth
1 setlinejoin

0 setlinecap

0 -1.5 m
0.397805 -1.5 0.77937 -1.341951 1.06066 -1.06066 c
1.341951 -0.77937 1.5 -0.397805 1.5 0 c
1.5 0.397805 1.341951 0.77937 1.06066 1.06066 c
0.77937 1.341951 0.397805 1.5 0 1.5 c
-0.397805 1.5 -0.77937 1.341951 -1.06066 1.06066 c
-1.341951 0.77937 -1.5 0.397805 -1.5 0 c
-1.5 -0.397805 -1.341951 -0.77937 -1.06066 -1.06066 c
-0.77937 -1.341951 -0.397805 -1.5 0 -1.5 c
cl

gsave
0.173 0.627 0.173 setrgbcolor
fill
grestore
stroke
grestore
} bind def
55.5266 50.4616 o
59.1899 52.3587 o
62.8532 63.8611 o
66.5165 65.4561 o
70.1798 91.6592 o
73.8432 184.078 o
77.5065 196.437 o
81.1698 180.801 o
84.8331 180.945 o
88.4964 182.572 o
92.1597 176.541 o
95.823 169.284 o
99.4863 169.678 o
103.15 181.705 o
106.813 197.975 o
110.476 206.951 o
114.14 207.844 o
117.803 205.739 o
121.466 203.108 o
125.129 201.046 o
128.793 201.197 o
132.456 204.466 o
136.119 209.525 o
139.783 213.626 o
143.446 214.92 o
147.109 213.771 o
150.773 211.965 o
154.436 211.151 o
158.099 211.947 o
161.763 213.887 o
165.426 215.915 o
169.089 217.106 o
172.752 217.162 o
176.416 216.462 o
180.079 215.75 o
183.742 215.656 o
187.406 216.306 o
191.069 217.304 o
194.732 218.083 o
198.396 218.32 o
202.059 218.083 o
205.722 217.695 o
209.386 217.498 o
213.049 217.651 o
216.712 218.064 o
220.375 218.493 o
224.039 218.719 o
227.702 218.686 o
231.365 218.502 o
235.029 218.346 o
238.692 218.342 o
242.355 218.495 o
246.019 218.706 o
249.682 218.858 o
253.345 218.888 o
257.009 218.818 o
260.672 218.727 o
264.335 218.688 o
267.998 218.731 o
271.662 218.825 o
275.325 218.913 o
278.988 218.951 o
282.652 218.933 o
286.315 218.887 o
289.978 218.854 o
293.642 218.858 o
297.305 218.895 o
300.968 218.941 o
304.632 218.969 o
308.295 218.97 o
311.958 218.951 o
315.621 218.93 o
319.285 218.924 o
322.948 218.935 o
326.611 218.957 o
330.275 218.975 o
333.938 218.98 o
337.601 218.974 o
341.265 218.963 o
344.928 218.956 o
348.591 218.958 o
352.255 218.967 o
355.918 218.977 o
359.581 218.982 o
363.244 218.981 o
366.908 218.976 o
370.571 218.971 o
374.234 218.971 o
377.898 218.974 o
381.561 218.978 o
385.224 218.982 o
388.888 218.983 o
392.551 218.981 o
396.214 218.978 o
399.878 218.977 o
403.541 218.978 o
407.204 218.98 o
410.867 218.982 o
414.508 218.983 o
grestore
1.500 setlinewidth
0.000 setgray
gsave
366.308 194.819 48.2 41.606 clipbox
48.2 225.825704 m
414.507522 225.825704 l
stroke
grestore
[5.55 2.4] 0 setdash
gsave
366.308 194.819 48.2 41.606 clipbox
48.2 217.571253 m
414.507522 217.571253 l
stroke
grestore
[9.6 2.4 1.5 2.4] 0 setdash
gsave
366.308 194.819 48.2 41.606 clipbox
48.2 215.943614 m
414.507522 215.943614 l
stroke
grestore
0.800 setlinewidth
0 setlinejoin
2 setlinecap
[] 0 setdash
gsave
48.2 41.60625 m
48.2 236.425 l
stroke
grestore
gsave
414.507522 41.60625 m
414.507522 236.425 l
stroke
grestore
gsave
48.2 41.60625 m
414.507522 41.60625 l
stroke
grestore
gsave
48.2 236.425 m
414.507522 236.425 l
stroke
grestore
1.000 setlinewidth
0 setlinecap
gsave
366.308 194.819 48.2 41.606 clipbox
385.201502 213.037118 m
414.50598 213.037118 l
414.50598 227.569602 l
385.201502 227.569602 l
385.201502 213.037118 l
cl
stroke
grestore
1 setlinejoin
1 setlinecap
gsave
194.723009 177.979375 m
258.21584 194.509451 321.708671 211.039527 385.201502 227.569602 c
stroke
grestore
gsave
377.87677 119.53375 m
390.086507 150.701539 402.296243 181.869328 414.50598 213.037118 c
stroke
grestore
gsave
194.723009 119.53375 m
377.87677 119.53375 l
377.87677 177.979375 l
194.723009 177.979375 l
cl
1.000 setgray
fill
grestore
0.800 setlinewidth
0 setlinecap
gsave
/o {
gsave
newpath
translate
0.8 setlinewidth
1 setlinejoin

0 setlinecap

0 0 m
0 -3.5 l

gsave
0.000 setgray
fill
grestore
stroke
grestore
} bind def
225.249 119.534 o
grestore
gsave
/o {
gsave
newpath
translate
0.8 setlinewidth
1 setlinejoin

0 setlinecap

0 0 m
0 -3.5 l

gsave
0.000 setgray
fill
grestore
stroke
grestore
} bind def
263.406 119.534 o
grestore
gsave
/o {
gsave
newpath
translate
0.8 setlinewidth
1 setlinejoin

0 setlinecap

0 0 m
0 -3.5 l

gsave
0.000 setgray
fill
grestore
stroke
grestore
} bind def
301.563 119.534 o
grestore
gsave
/o {
gsave
newpath
translate
0.8 setlinewidth
1 setlinejoin

0 setlinecap

0 0 m
0 -3.5 l

gsave
0.000 setgray
fill
grestore
stroke
grestore
} bind def
339.72 119.534 o
grestore
gsave
/o {
gsave
newpath
translate
0.8 setlinewidth
1 setlinejoin

0 setlinecap

0 0 m
0 -3.5 l

gsave
0.000 setgray
fill
grestore
stroke
grestore
} bind def
377.877 119.534 o
grestore
gsave
/o {
gsave
newpath
translate
0.8 setlinewidth
1 setlinejoin

0 setlinecap

-0 0 m
-3.5 0 l

gsave
0.000 setgray
fill
grestore
stroke
grestore
} bind def
194.723 131.223 o
grestore
gsave
172.723 127.121 translate
0 rotate
/STIXGeneral-Regular 12.0 selectfont
0 0.890625 moveto
/eight glyphshow
5.99998 0.890625 moveto
/period glyphshow
8.99997 0.890625 moveto
/eight glyphshow
grestore
gsave
/o {
gsave
newpath
translate
0.8 setlinewidth
1 setlinejoin

0 setlinecap

-0 0 m
-3.5 0 l

gsave
0.000 setgray
fill
grestore
stroke
grestore
} bind def
194.723 177.979 o
grestore
gsave
172.723 173.878 translate
0 rotate
/STIXGeneral-Regular 12.0 selectfont
0 0.890625 moveto
/nine glyphshow
5.99998 0.890625 moveto
/period glyphshow
8.99997 0.890625 moveto
/zero glyphshow
grestore
1.500 setlinewidth
2 setlinecap
0.122 0.467 0.706 setrgbcolor
gsave
183.154 58.446 194.723 119.534 clipbox
-1 147.627648 m
11.699259 147.649018 l
34.595027 147.670146 l
57.490795 147.666521 l
80.386563 147.64721 l
103.28233 147.62911 l
126.178098 147.625064 l
149.073866 147.636653 l
171.969634 147.655284 l
194.865402 147.669396 l
217.76117 147.672199 l
240.656938 147.66503 l
263.552706 147.655061 l
286.448473 147.649796 l
309.344241 147.652363 l
332.240009 147.660378 l
355.135777 147.668441 l
377.886405 147.672034 l
stroke
grestore
1.000 setlinewidth
0 setlinecap
gsave
183.154 58.446 194.723 119.534 clipbox
/o {
gsave
newpath
translate
1.0 setlinewidth
1 setlinejoin

0 setlinecap

0 -1.5 m
0.397805 -1.5 0.77937 -1.341951 1.06066 -1.06066 c
1.341951 -0.77937 1.5 -0.397805 1.5 0 c
1.5 0.397805 1.341951 0.77937 1.06066 1.06066 c
0.77937 1.341951 0.397805 1.5 0 1.5 c
-0.397805 1.5 -0.77937 1.341951 -1.06066 1.06066 c
-1.341951 0.77937 -1.5 0.397805 -1.5 0 c
-1.5 -0.397805 -1.341951 -0.77937 -1.06066 -1.06066 c
-0.77937 -1.341951 -0.397805 -1.5 0 -1.5 c
cl

gsave
0.122 0.467 0.706 setrgbcolor
fill
grestore
stroke
grestore
} bind def
-1 147.628 o
11.6993 147.649 o
34.595 147.67 o
57.4908 147.667 o
80.3866 147.647 o
103.282 147.629 o
126.178 147.625 o
149.074 147.637 o
171.97 147.655 o
194.865 147.669 o
217.761 147.672 o
240.657 147.665 o
263.553 147.655 o
286.448 147.65 o
309.344 147.652 o
332.24 147.66 o
355.136 147.668 o
377.886 147.672 o
grestore
1.500 setlinewidth
[5.55 2.4] 0 setdash
1.000 0.498 0.055 setrgbcolor
gsave
183.154 58.446 194.723 119.534 clipbox
-1 146.751961 m
11.699259 146.772977 l
34.595027 146.793498 l
57.490795 146.789333 l
80.386563 146.769551 l
103.28233 146.751025 l
126.178098 146.74657 l
149.073866 146.757748 l
171.969634 146.775972 l
194.865402 146.7897 l
217.76117 146.792156 l
240.656938 146.78468 l
263.552706 146.774432 l
286.448473 146.768899 l
309.344241 146.771201 l
332.240009 146.778955 l
355.135777 146.78677 l
377.886405 146.79014 l
stroke
grestore
1.000 setlinewidth
[] 0 setdash
gsave
183.154 58.446 194.723 119.534 clipbox
/o {
gsave
newpath
translate
1.0 setlinewidth
1 setlinejoin

0 setlinecap

0 -1.5 m
0.397805 -1.5 0.77937 -1.341951 1.06066 -1.06066 c
1.341951 -0.77937 1.5 -0.397805 1.5 0 c
1.5 0.397805 1.341951 0.77937 1.06066 1.06066 c
0.77937 1.341951 0.397805 1.5 0 1.5 c
-0.397805 1.5 -0.77937 1.341951 -1.06066 1.06066 c
-1.341951 0.77937 -1.5 0.397805 -1.5 0 c
-1.5 -0.397805 -1.341951 -0.77937 -1.06066 -1.06066 c
-0.77937 -1.341951 -0.397805 -1.5 0 -1.5 c
cl

gsave
1.000 0.498 0.055 setrgbcolor
fill
grestore
stroke
grestore
} bind def
-1 146.752 o
11.6993 146.773 o
34.595 146.793 o
57.4908 146.789 o
80.3866 146.77 o
103.282 146.751 o
126.178 146.747 o
149.074 146.758 o
171.97 146.776 o
194.865 146.79 o
217.761 146.792 o
240.657 146.785 o
263.553 146.774 o
286.448 146.769 o
309.344 146.771 o
332.24 146.779 o
355.136 146.787 o
377.886 146.79 o
grestore
1.500 setlinewidth
[1.5 2.475] 0 setdash
0.173 0.627 0.173 setrgbcolor
gsave
183.154 58.446 194.723 119.534 clipbox
-1 143.400031 m
11.699259 143.421636 l
34.595027 143.442212 l
57.490795 143.437676 l
80.386563 143.417832 l
103.28233 143.399954 l
126.178098 143.396717 l
149.073866 143.409188 l
171.969634 143.428288 l
194.865402 143.442303 l
217.76117 143.444665 l
240.656938 143.43711 l
263.552706 143.427106 l
286.448473 143.422179 l
309.344241 143.425239 l
332.240009 143.433619 l
355.135777 143.441755 l
377.886405 143.445177 l
stroke
grestore
1.000 setlinewidth
[] 0 setdash
gsave
183.154 58.446 194.723 119.534 clipbox
/o {
gsave
newpath
translate
1.0 setlinewidth
1 setlinejoin

0 setlinecap

0 -1.5 m
0.397805 -1.5 0.77937 -1.341951 1.06066 -1.06066 c
1.341951 -0.77937 1.5 -0.397805 1.5 0 c
1.5 0.397805 1.341951 0.77937 1.06066 1.06066 c
0.77937 1.341951 0.397805 1.5 0 1.5 c
-0.397805 1.5 -0.77937 1.341951 -1.06066 1.06066 c
-1.341951 0.77937 -1.5 0.397805 -1.5 0 c
-1.5 -0.397805 -1.341951 -0.77937 -1.06066 -1.06066 c
-0.77937 -1.341951 -0.397805 -1.5 0 -1.5 c
cl

gsave
0.173 0.627 0.173 setrgbcolor
fill
grestore
stroke
grestore
} bind def
-1 143.4 o
11.6993 143.422 o
34.595 143.442 o
57.4908 143.438 o
80.3866 143.418 o
103.282 143.4 o
126.178 143.397 o
149.074 143.409 o
171.97 143.428 o
194.865 143.442 o
217.761 143.445 o
240.657 143.437 o
263.553 143.427 o
286.448 143.422 o
309.344 143.425 o
332.24 143.434 o
355.136 143.442 o
377.886 143.445 o
grestore
1.500 setlinewidth
0.000 setgray
gsave
183.154 58.446 194.723 119.534 clipbox
-1 170.9659 m
377.886405 170.9659 l
stroke
grestore
[5.55 2.4] 0 setdash
gsave
183.154 58.446 194.723 119.534 clipbox
-1 138.703915 m
377.886405 138.703915 l
stroke
grestore
[9.6 2.4 1.5 2.4] 0 setdash
gsave
183.154 58.446 194.723 119.534 clipbox
-1 131.222875 m
377.886405 131.222875 l
stroke
grestore
0.800 setlinewidth
0 setlinejoin
2 setlinecap
[] 0 setdash
gsave
194.723009 119.53375 m
194.723009 177.979375 l
stroke
grestore
gsave
377.87677 119.53375 m
377.87677 177.979375 l
stroke
grestore
gsave
194.723009 119.53375 m
377.87677 119.53375 l
stroke
grestore
gsave
194.723009 177.979375 m
377.87677 177.979375 l
stroke
grestore
1.000 setlinewidth
0 setlinecap
0.800 setgray
gsave
211.991897 46.60625 m
407.507522 46.60625 l
408.840855 46.60625 409.507522 47.272917 409.507522 48.60625 c
409.507522 90.35625 l
409.507522 91.689583 408.840855 92.35625 407.507522 92.35625 c
211.991897 92.35625 l
210.658564 92.35625 209.991897 91.689583 209.991897 90.35625 c
209.991897 48.60625 l
209.991897 47.272917 210.658564 46.60625 211.991897 46.60625 c
cl
gsave
1.000 setgray
fill
grestore
stroke
grestore
1.500 setlinewidth
1 setlinejoin
2 setlinecap
0.122 0.467 0.706 setrgbcolor
gsave
213.991897 84.653125 m
223.991897 84.653125 l
233.991897 84.653125 l
stroke
grestore
1.000 setlinewidth
0 setlinecap
gsave
/o {
gsave
newpath
translate
1.0 setlinewidth
1 setlinejoin

0 setlinecap

0 -1.5 m
0.397805 -1.5 0.77937 -1.341951 1.06066 -1.06066 c
1.341951 -0.77937 1.5 -0.397805 1.5 0 c
1.5 0.397805 1.341951 0.77937 1.06066 1.06066 c
0.77937 1.341951 0.397805 1.5 0 1.5 c
-0.397805 1.5 -0.77937 1.341951 -1.06066 1.06066 c
-1.341951 0.77937 -1.5 0.397805 -1.5 0 c
-1.5 -0.397805 -1.341951 -0.77937 -1.06066 -1.06066 c
-0.77937 -1.341951 -0.397805 -1.5 0 -1.5 c
cl

gsave
0.122 0.467 0.706 setrgbcolor
fill
grestore
stroke
grestore
} bind def
223.992 84.6531 o
grestore
0.000 setgray
/STIXGeneral-Regular 10.000 selectfont
gsave

241.992 81.1531 translate
0 rotate
0 0 m /h glyphshow
4.99998 0 m /y glyphshow
9.99997 0 m /b glyphshow
15 0 m /r glyphshow
18.3299 0 m /i glyphshow
21.1099 0 m /d glyphshow
grestore
1.500 setlinewidth
[5.55 2.4] 0 setdash
1.000 0.498 0.055 setrgbcolor
gsave
213.991897 70.465625 m
223.991897 70.465625 l
233.991897 70.465625 l
stroke
grestore
1.000 setlinewidth
[] 0 setdash
gsave
/o {
gsave
newpath
translate
1.0 setlinewidth
1 setlinejoin

0 setlinecap

0 -1.5 m
0.397805 -1.5 0.77937 -1.341951 1.06066 -1.06066 c
1.341951 -0.77937 1.5 -0.397805 1.5 0 c
1.5 0.397805 1.341951 0.77937 1.06066 1.06066 c
0.77937 1.341951 0.397805 1.5 0 1.5 c
-0.397805 1.5 -0.77937 1.341951 -1.06066 1.06066 c
-1.341951 0.77937 -1.5 0.397805 -1.5 0 c
-1.5 -0.397805 -1.341951 -0.77937 -1.06066 -1.06066 c
-0.77937 -1.341951 -0.397805 -1.5 0 -1.5 c
cl

gsave
1.000 0.498 0.055 setrgbcolor
fill
grestore
stroke
grestore
} bind def
223.992 70.4656 o
grestore
0.000 setgray
/STIXGeneral-Regular 10.000 selectfont
gsave

241.992 66.9656 translate
0 rotate
0 0 m /s glyphshow
3.88998 0 m /c glyphshow
8.32997 0 m /a glyphshow
12.77 0 m /t glyphshow
15.5499 0 m /t glyphshow
18.3299 0 m /e glyphshow
22.7699 0 m /r glyphshow
26.0999 0 m /e glyphshow
30.5399 0 m /d glyphshow
grestore
1.500 setlinewidth
[1.5 2.475] 0 setdash
0.173 0.627 0.173 setrgbcolor
gsave
213.991897 56.29375 m
223.991897 56.29375 l
233.991897 56.29375 l
stroke
grestore
1.000 setlinewidth
[] 0 setdash
gsave
/o {
gsave
newpath
translate
1.0 setlinewidth
1 setlinejoin

0 setlinecap

0 -1.5 m
0.397805 -1.5 0.77937 -1.341951 1.06066 -1.06066 c
1.341951 -0.77937 1.5 -0.397805 1.5 0 c
1.5 0.397805 1.341951 0.77937 1.06066 1.06066 c
0.77937 1.341951 0.397805 1.5 0 1.5 c
-0.397805 1.5 -0.77937 1.341951 -1.06066 1.06066 c
-1.341951 0.77937 -1.5 0.397805 -1.5 0 c
-1.5 -0.397805 -1.341951 -0.77937 -1.06066 -1.06066 c
-0.77937 -1.341951 -0.397805 -1.5 0 -1.5 c
cl

gsave
0.173 0.627 0.173 setrgbcolor
fill
grestore
stroke
grestore
} bind def
223.992 56.2938 o
grestore
0.000 setgray
/STIXGeneral-Regular 10.000 selectfont
gsave

241.992 52.7938 translate
0 rotate
0 0 m /r glyphshow
3.32999 0 m /e glyphshow
7.76997 0 m /g glyphshow
12.77 0 m /u glyphshow
17.7699 0 m /l glyphshow
20.5499 0 m /a glyphshow
24.9899 0 m /r glyphshow
grestore
1.500 setlinewidth
gsave
297.523147 84.653125 m
317.523147 84.653125 l
stroke
grestore
/STIXGeneral-Regular 10.000 selectfont
gsave

325.523 81.1531 translate
0 rotate
0 0 m /K glyphshow
7.21999 0 m /o glyphshow
12.22 0 m /s glyphshow
16.11 0 m /e glyphshow
20.5499 0 m /c glyphshow
24.9899 0 m /space glyphshow
27.4899 0 m /a glyphshow
31.9299 0 m /n glyphshow
36.9299 0 m /d glyphshow
41.9299 0 m /space glyphshow
44.4299 0 m /Scaron glyphshow
49.9898 0 m /a glyphshow
54.4298 0 m /r glyphshow
57.7598 0 m /l glyphshow
60.5398 0 m /e glyphshow
64.9798 0 m /r glyphshow
grestore
[5.55 2.4] 0 setdash
gsave
297.523147 70.48125 m
317.523147 70.48125 l
stroke
grestore
/STIXGeneral-Regular 10.000 selectfont
gsave

325.523 66.9813 translate
0 rotate
0 0 m /S glyphshow
5.55998 0 m /a glyphshow
9.99997 0 m /d glyphshow
15 0 m /a glyphshow
19.4399 0 m /t glyphshow
22.2199 0 m /space glyphshow
24.7199 0 m /a glyphshow
29.1599 0 m /n glyphshow
34.1599 0 m /d glyphshow
39.1599 0 m /space glyphshow
41.6599 0 m /C glyphshow
48.3298 0 m /o glyphshow
53.3298 0 m /u glyphshow
58.3298 0 m /t glyphshow
61.1098 0 m /u glyphshow
66.1098 0 m /r glyphshow
69.4398 0 m /i glyphshow
72.2197 0 m /e glyphshow
76.6597 0 m /r glyphshow
grestore
[9.6 2.4 1.5 2.4] 0 setdash
gsave
297.523147 56.309375 m
317.523147 56.309375 l
stroke
grestore
/STIXGeneral-Regular 10.000 selectfont
gsave

325.523 52.8094 translate
0 rotate
0 0 m /W glyphshow
9.43999 0 m /a glyphshow
13.88 0 m /n glyphshow
18.88 0 m /space glyphshow
21.3799 0 m /e glyphshow
25.8199 0 m /t glyphshow
28.5999 0 m /period glyphshow
31.0999 0 m /space glyphshow
33.5999 0 m /a glyphshow
38.0399 0 m /l glyphshow
grestore

end
showpage
