%!PS-Adobe-3.0 EPSF-3.0
%%Title: dvd_conv.eps
%%Creator: Matplotlib v3.7.2, https://matplotlib.org/
%%CreationDate: Thu Oct 12 13:08:33 2023
%%Orientation: portrait
%%BoundingBox: -12 256 625 536
%%HiResBoundingBox: -12.820011 256.496875 624.820011 535.503125
%%EndComments
%%BeginProlog
/mpldict 13 dict def
mpldict begin
/_d { bind def } bind def
/m { moveto } _d
/l { lineto } _d
/r { rlineto } _d
/c { curveto } _d
/cl { closepath } _d
/ce { closepath eofill } _d
/box {
      m
      1 index 0 r
      0 exch r
      neg 0 r
      cl
    } _d
/clipbox {
      box
      clip
      newpath
    } _d
/sc { setcachedevice } _d
%!PS-Adobe-3.0 Resource-Font
%%Creator: Converted from TrueType to Type 3 by Matplotlib.
10 dict begin
/FontName /STIXGeneral-Regular def
/PaintType 0 def
/FontMatrix [0.001 0 0 0.001 0 0] def
/FontBBox [-970 -443 2000 1023] def
/FontType 3 def
/Encoding [/space /period /zero /one /two /three /four /five /six /eight /nine /C /K /S /W /bracketleft /bracketright /Scaron /a /b /c /d /e /g /h /i /l /m /n /o /r /s /t /u /x /y] def
/CharStrings 37 dict dup begin
/.notdef 0 def
/space{250 0 0 0 0 0 sc
ce} _d
/period{250 0 70 -11 181 100 sc
181 43 m
181 28 175 16 164 5 c
153 -6 140 -11 125 -11 c
110 -11 97 -6 86 5 c
75 16 70 29 70 44 c
70 59 75 72 86 83 c
97 94 111 100 126 100 c
141 100 153 94 164 83 c
175 72 181 58 181 43 c

ce} _d
/zero{500 0 24 -14 476 676 sc
476 330 m
476 285 472 243 463 203 c
454 164 441 127 424 94 c
407 61 384 34 354 15 c
324 -4 289 -14 250 -14 c
209 -14 174 -4 143 17 c
112 38 89 65 72 100 c
55 135 43 172 35 211 c
28 250 24 292 24 336 c
24 398 32 454 47 503 c
62 553 88 594 123 627 c
159 660 203 676 254 676 c
319 676 373 644 414 580 c
455 516 476 433 476 330 c

380 325 m
380 430 369 511 346 566 c
324 622 291 650 248 650 c
207 650 175 622 153 566 c
131 510 120 431 120 329 c
120 226 131 148 153 93 c
175 39 207 12 250 12 c
292 12 324 39 346 93 c
369 148 380 225 380 325 c

ce} _d
/one{500 0 111 0 394 676 sc
394 0 m
118 0 l
118 15 l
155 17 180 24 193 35 c
206 47 213 67 213 95 c
213 544 l
213 577 203 593 183 593 c
174 593 159 589 138 581 c
111 571 l
111 585 l
290 676 l
299 673 l
299 76 l
299 54 306 38 319 29 c
332 20 357 15 394 15 c
394 0 l

ce} _d
/two{500 0 29 0 474 676 sc
474 137 m
420 0 l
29 0 l
29 12 l
207 201 l
254 250 287 294 307 335 c
327 376 337 418 337 461 c
337 506 325 540 300 565 c
275 590 241 602 198 602 c
162 602 133 593 112 574 c
91 555 71 521 51 472 c
30 477 l
41 539 64 588 98 623 c
133 658 179 676 238 676 c
293 676 338 659 372 626 c
406 593 423 551 423 500 c
423 425 380 342 295 252 c
130 76 l
364 76 l
386 76 403 80 416 89 c
429 98 444 116 460 143 c
474 137 l

ce} _d
/three{500 0 41 -14 431 676 sc
61 510 m
45 514 l
60 564 84 603 117 632 c
150 661 191 676 241 676 c
288 676 325 663 354 638 c
383 613 397 580 397 539 c
397 484 366 438 304 401 c
341 385 368 367 387 348 c
416 315 431 272 431 219 c
431 166 416 119 385 79 c
362 48 330 25 287 9 c
245 -6 200 -14 153 -14 c
78 -14 41 5 41 43 c
41 54 45 62 53 69 c
61 76 71 79 82 79 c
99 79 119 70 143 53 c
172 32 201 22 229 22 c
266 22 296 37 321 66 c
346 96 359 132 359 175 c
359 252 324 300 255 320 c
234 327 200 330 153 330 c
153 344 l
190 357 218 369 237 380 c
291 411 318 455 318 514 c
318 547 308 573 289 590 c
270 607 244 616 210 616 c
150 616 100 581 61 510 c

ce} _d
/four{500 0 12 0 473 676 sc
473 167 m
370 167 l
370 0 l
292 0 l
292 167 l
12 167 l
12 231 l
326 676 l
370 676 l
370 231 l
473 231 l
473 167 l

292 231 m
292 574 l
52 231 l
292 231 l

ce} _d
/five{500 0 31 -14 438 688 sc
438 681 m
402 596 l
398 587 389 583 375 583 c
181 583 l
141 498 l
214 484 267 469 300 452 c
333 436 363 409 391 370 c
414 338 426 296 426 243 c
426 195 418 155 402 122 c
387 89 362 60 328 35 c
283 2 226 -14 158 -14 c
120 -14 89 -8 66 3 c
43 14 31 29 31 48 c
31 73 46 86 76 86 c
100 86 125 76 150 55 c
176 34 200 23 221 23 c
256 23 287 40 314 75 c
342 110 356 149 356 192 c
356 256 334 306 289 342 c
231 389 160 412 76 412 c
68 412 64 415 64 420 c
65 425 l
174 662 l
381 662 l
392 662 401 664 407 667 c
414 670 421 677 429 688 c
438 681 l

ce} _d
/six{500 0 34 -14 468 684 sc
446 684 m
448 668 l
369 655 304 623 251 572 c
198 521 165 458 152 383 c
191 413 233 428 279 428 c
338 428 384 409 417 372 c
451 335 468 284 468 219 c
468 154 451 100 417 59 c
378 10 325 -14 258 -14 c
177 -14 118 20 81 87 c
50 144 34 208 34 279 c
34 388 70 480 143 555 c
184 598 227 628 270 645 c
314 663 373 676 446 684 c

378 188 m
378 317 333 382 243 382 c
210 382 182 373 160 355 c
138 338 127 308 127 266 c
127 188 139 126 163 81 c
188 36 223 14 269 14 c
304 14 331 30 350 61 c
369 93 378 135 378 188 c

ce} _d
/eight{500 0 56 -14 445 676 sc
445 155 m
445 104 427 63 391 32 c
356 1 308 -14 248 -14 c
192 -14 146 1 110 32 c
74 63 56 102 56 149 c
56 184 65 214 82 239 c
99 264 134 295 186 332 c
136 373 103 407 86 432 c
70 457 62 487 62 520 c
62 567 80 605 116 633 c
153 662 199 676 256 676 c
305 676 345 662 376 634 c
408 607 424 573 424 533 c
424 496 414 467 395 445 c
376 423 341 398 290 371 c
350 331 391 295 412 264 c
434 233 445 196 445 155 c

355 533 m
355 568 345 595 326 616 c
307 637 280 648 246 648 c
212 648 185 639 165 621 c
146 604 136 580 136 549 c
136 518 146 490 165 465 c
185 440 217 415 261 389 c
295 409 319 430 333 452 c
348 475 355 502 355 533 c

271 272 m
212 312 l
183 288 162 264 150 241 c
138 218 132 191 132 158 c
132 113 143 77 166 52 c
189 27 220 14 259 14 c
292 14 318 24 338 44 c
359 65 369 91 369 124 c
369 154 361 180 346 203 c
331 226 306 249 271 272 c

ce} _d
/nine{500 0 30 -22 459 676 sc
59 -22 m
56 -2 l
133 11 197 44 250 95 c
303 146 340 213 360 294 c
321 256 271 237 210 237 c
156 237 112 256 79 293 c
46 330 30 379 30 440 c
30 507 50 563 89 608 c
129 653 179 676 238 676 c
301 676 354 651 395 600 c
438 547 459 478 459 394 c
459 335 449 280 428 228 c
408 177 378 133 339 97 c
298 60 257 33 218 16 c
179 0 126 -13 59 -22 c

362 355 m
362 394 l
362 563 318 648 230 648 c
199 648 174 637 157 614 c
147 601 139 581 132 554 c
125 527 122 501 122 474 c
122 415 133 367 155 332 c
178 297 208 280 245 280 c
272 280 298 286 323 299 c
349 312 362 331 362 355 c

ce} _d
/C{667 0 28 -14 633 676 sc
614 131 m
633 113 l
574 28 483 -14 360 -14 c
263 -14 185 16 124 75 c
60 138 28 221 28 325 c
28 422 58 505 118 572 c
181 641 262 676 361 676 c
404 676 443 671 480 661 c
522 649 545 643 549 643 c
571 643 585 654 591 676 c
611 676 l
620 449 l
597 449 l
586 497 569 534 545 560 c
498 611 444 636 384 636 c
310 636 251 609 208 554 c
165 500 144 429 144 341 c
144 234 168 154 216 102 c
261 54 320 30 394 30 c
438 30 476 38 508 53 c
540 68 575 94 614 131 c

ce} _d
/K{722 0 33 0 723 662 sc
723 0 m
420 0 l
420 19 l
447 20 l
475 21 489 29 489 44 c
489 56 478 75 456 100 c
435 126 400 164 352 214 c
252 317 l
226 296 l
226 111 l
226 74 231 50 242 39 c
253 29 277 22 315 19 c
315 0 l
33 0 l
33 19 l
72 21 97 28 108 41 c
119 54 124 82 124 125 c
124 549 l
124 586 119 611 108 622 c
97 633 73 640 34 643 c
34 662 l
316 662 l
316 643 l
275 640 250 634 240 623 c
231 612 226 587 226 548 c
226 348 l
404 512 l
433 539 453 559 464 573 c
476 587 482 600 482 611 c
482 622 479 629 473 634 c
468 639 457 641 441 642 c
416 643 l
416 662 l
675 662 l
675 643 l
641 640 615 634 597 625 c
580 616 554 595 519 562 c
333 384 l
567 128 l
608 83 639 53 658 39 c
678 26 700 19 723 19 c
723 0 l

ce} _d
/S{556 0 43 -14 491 676 sc
469 463 m
444 463 l
433 504 419 536 403 557 c
362 609 314 635 258 635 c
227 635 203 626 184 608 c
166 591 157 568 157 540 c
157 527 160 514 167 501 c
174 488 181 477 188 468 c
196 459 210 448 229 435 c
248 422 264 411 276 404 c
288 397 308 386 336 369 c
390 338 429 306 454 275 c
479 244 491 210 491 173 c
491 118 472 73 433 38 c
394 3 346 -14 287 -14 c
244 -14 204 -6 169 9 c
152 16 136 20 122 20 c
114 20 107 17 102 11 c
97 5 94 -3 94 -13 c
72 -13 l
43 199 l
65 199 l
110 81 178 22 271 22 c
306 22 335 32 357 53 c
379 74 390 101 390 134 c
390 165 380 192 361 213 c
329 248 273 286 193 329 c
112 372 71 430 71 501 c
71 554 87 597 120 628 c
153 660 194 676 245 676 c
280 676 315 669 350 654 c
368 646 383 642 394 642 c
411 642 422 653 426 676 c
447 676 l
469 463 l

ce} _d
/W{944 0 5 -11 932 662 sc
932 662 m
932 643 l
905 638 887 631 877 623 c
868 616 858 599 849 573 c
773 369 705 174 645 -11 c
630 -11 l
589 102 536 243 470 412 c
316 -11 l
301 -11 l
278 56 244 151 199 274 c
154 397 124 480 109 523 c
92 571 77 603 63 618 c
50 634 30 642 5 643 c
5 662 l
249 662 l
249 643 l
224 642 207 640 198 635 c
189 630 185 623 185 612 c
185 601 189 585 196 565 c
340 189 l
444 472 l
416 547 l
400 590 386 617 375 627 c
364 637 343 642 314 643 c
314 662 l
579 662 l
579 643 l
528 642 502 630 502 608 c
502 599 508 580 519 550 c
662 186 l
788 525 l
799 557 805 583 805 602 c
805 629 782 642 735 643 c
735 662 l
932 662 l

ce} _d
/bracketleft{333 0 88 -156 299 662 sc
299 -156 m
88 -156 l
88 662 l
299 662 l
299 637 l
216 637 l
199 637 186 633 177 626 c
168 619 164 606 164 589 c
164 -77 l
164 -113 181 -131 216 -131 c
299 -131 l
299 -156 l

ce} _d
/bracketright{333 0 34 -156 245 662 sc
245 -156 m
34 -156 l
34 -131 l
122 -131 l
139 -131 151 -127 158 -120 c
165 -113 169 -101 169 -85 c
169 583 l
169 619 152 637 118 637 c
34 637 l
34 662 l
245 662 l
245 -156 l

ce} _d
/Scaron{556 0 43 -14 491 924 sc
429 924 m
305 757 l
241 757 l
118 924 l
153 924 l
273 821 l
394 924 l
429 924 l

469 463 m
444 463 l
433 504 419 536 403 557 c
362 609 314 635 258 635 c
227 635 203 626 184 608 c
166 591 157 568 157 540 c
157 527 160 514 167 501 c
174 488 181 477 188 468 c
196 459 210 448 229 435 c
248 422 264 411 276 404 c
288 397 308 386 336 369 c
390 338 429 306 454 275 c
479 244 491 210 491 173 c
491 118 472 73 433 38 c
394 3 346 -14 287 -14 c
244 -14 204 -6 169 9 c
152 16 136 20 122 20 c
114 20 107 17 102 11 c
97 5 94 -3 94 -13 c
72 -13 l
43 199 l
65 199 l
110 81 178 22 271 22 c
306 22 335 32 357 53 c
379 74 390 101 390 134 c
390 165 380 192 361 213 c
329 248 273 286 193 329 c
112 372 71 430 71 501 c
71 554 87 597 120 628 c
153 660 194 676 245 676 c
280 676 315 669 350 654 c
368 646 383 642 394 642 c
411 642 422 653 426 676 c
447 676 l
469 463 l

ce} _d
/a{444 0 37 -10 442 460 sc
442 66 m
442 38 l
417 6 387 -10 352 -10 c
314 -10 293 14 288 63 c
287 63 l
244 14 196 -10 142 -10 c
111 -10 85 -1 66 17 c
47 36 37 61 37 94 c
37 141 60 180 107 211 c
139 232 199 259 287 292 c
287 346 l
287 376 280 398 265 413 c
251 428 232 436 209 436 c
189 436 172 431 159 421 c
146 412 139 400 139 387 c
139 381 140 374 142 367 c
144 360 145 352 145 345 c
145 335 140 326 131 317 c
122 308 112 304 99 304 c
88 304 78 308 69 317 c
60 326 56 337 56 350 c
56 382 73 409 107 430 c
138 450 177 460 222 460 c
276 460 315 445 340 415 c
352 401 360 387 363 372 c
366 358 368 335 368 304 c
368 113 l
368 69 378 47 399 47 c
412 47 427 53 442 66 c

287 127 m
287 268 l
226 247 183 225 159 202 c
136 181 125 156 125 125 c
125 100 131 80 144 67 c
157 54 173 48 194 48 c
216 48 235 53 252 64 c
266 74 275 83 280 92 c
285 101 287 112 287 127 c

ce} _d
/b{500 0 3 -10 468 683 sc
153 681 m
153 376 l
164 401 181 422 205 437 c
230 452 257 460 288 460 c
341 460 384 439 417 397 c
451 355 468 303 468 240 c
468 167 446 107 401 60 c
356 13 301 -10 234 -10 c
193 -10 156 -3 121 10 c
86 24 69 39 69 56 c
69 566 l
69 591 66 606 60 613 c
54 620 41 624 20 624 c
15 624 10 623 3 622 c
3 639 l
33 648 l
101 669 139 680 148 683 c
153 681 l

153 318 m
153 74 l
153 59 162 46 181 36 c
200 27 223 22 250 22 c
289 22 320 36 343 65 c
368 96 380 140 380 197 c
380 262 367 313 341 350 c
319 381 289 397 252 397 c
225 397 202 389 182 373 c
163 358 153 339 153 318 c

ce} _d
/c{444 0 25 -10 412 460 sc
398 156 m
412 147 l
383 91 356 53 330 32 c
296 4 258 -10 215 -10 c
160 -10 114 11 78 52 c
43 94 25 147 25 212 c
25 297 53 362 109 409 c
150 443 195 460 244 460 c
286 460 322 450 352 429 c
383 409 398 385 398 357 c
398 346 393 336 384 327 c
375 319 364 315 351 315 c
328 315 312 330 303 361 c
297 383 l
292 402 285 414 277 421 c
269 428 256 431 238 431 c
197 431 164 415 139 383 c
114 351 102 309 102 257 c
102 200 116 153 145 116 c
174 80 211 62 257 62 c
286 62 310 69 331 82 c
352 96 374 121 398 156 c

ce} _d
/d{500 0 27 -10 491 683 sc
491 42 m
344 -10 l
340 -7 l
340 57 l
308 12 265 -10 212 -10 c
157 -10 112 10 78 49 c
44 89 27 141 27 205 c
27 276 47 336 88 385 c
129 435 178 460 235 460 c
271 460 306 446 340 417 c
340 573 l
340 594 337 607 331 614 c
325 621 313 624 294 624 c
285 624 277 624 272 623 c
272 639 l
333 655 382 670 419 683 c
424 681 l
424 114 l
424 91 427 75 432 68 c
438 61 450 57 468 57 c
472 57 480 57 491 58 c
491 42 l

340 102 m
340 332 l
340 359 330 382 309 402 c
289 422 265 432 238 432 c
200 432 170 415 147 381 c
124 347 113 302 113 245 c
113 184 125 134 150 97 c
175 60 209 42 251 42 c
282 42 307 53 325 74 c
335 85 340 95 340 102 c

ce} _d
/e{444 0 25 -10 424 460 sc
408 164 m
424 157 l
384 46 314 -10 215 -10 c
156 -10 110 10 76 51 c
42 92 25 148 25 217 c
25 288 44 347 82 392 c
120 437 170 460 232 460 c
292 460 338 437 371 391 c
390 364 402 326 405 277 c
97 277 l
100 235 104 203 109 181 c
115 159 126 137 143 114 c
171 77 208 59 254 59 c
287 59 314 67 336 83 c
359 99 383 126 408 164 c

99 309 m
303 309 l
297 351 287 381 273 398 c
260 415 237 424 205 424 c
177 424 154 414 135 394 c
116 375 104 346 99 309 c

ce} _d
/g{500 0 28 -218 470 460 sc
470 388 m
387 388 l
400 359 406 331 406 304 c
406 253 389 214 354 188 c
319 162 285 149 250 149 c
243 149 230 150 212 152 c
193 154 l
180 150 166 141 153 127 c
140 113 133 101 133 91 c
133 76 159 67 211 64 c
340 58 l
377 57 406 46 428 27 c
450 8 461 -18 461 -49 c
461 -88 441 -123 401 -154 c
346 -197 279 -218 201 -218 c
153 -218 112 -208 78 -189 c
45 -170 28 -148 28 -121 c
28 -102 35 -84 50 -65 c
65 -47 90 -25 126 1 c
105 11 90 20 83 27 c
76 34 73 43 73 54 c
73 73 88 96 119 123 c
134 136 149 150 162 163 c
129 180 105 198 90 219 c
76 240 69 266 69 297 c
69 342 85 381 117 412 c
150 444 189 460 236 460 c
263 460 289 455 316 445 c
338 437 l
357 430 376 427 393 427 c
470 427 l
470 388 l

152 338 m
152 335 l
152 287 161 248 180 218 c
199 189 224 174 255 174 c
278 174 296 182 309 198 c
322 215 329 237 329 264 c
329 308 319 348 299 385 c
282 416 258 432 226 432 c
203 432 184 424 171 407 c
158 390 152 367 152 338 c

433 -64 m
433 -45 424 -32 405 -25 c
387 -18 355 -15 309 -15 c
243 -15 189 -11 147 -2 c
127 -26 114 -43 107 -54 c
101 -65 98 -77 98 -88 c
98 -110 111 -128 137 -141 c
164 -154 199 -161 243 -161 c
300 -161 345 -152 380 -134 c
415 -117 433 -93 433 -64 c

ce} _d
/h{500 0 9 0 487 683 sc
487 0 m
275 0 l
275 15 l
304 18 323 25 331 35 c
339 45 343 67 343 102 c
343 300 l
343 371 318 406 269 406 c
249 406 231 401 214 392 c
197 383 178 366 157 343 c
157 102 l
157 67 161 45 169 35 c
177 25 196 18 225 15 c
225 0 l
9 0 l
9 15 l
38 19 55 26 62 35 c
69 44 73 67 73 102 c
73 573 l
73 594 70 608 63 614 c
57 621 43 624 22 624 c
16 624 12 624 10 623 c
10 639 l
37 647 l
88 662 127 674 152 683 c
157 680 l
157 376 l
180 406 203 427 226 440 c
249 453 275 460 304 460 c
386 460 427 407 427 301 c
427 102 l
427 67 430 45 436 36 c
443 27 460 20 487 15 c
487 0 l

ce} _d
/i{278 0 16 0 253 683 sc
180 632 m
180 617 175 605 165 595 c
155 586 143 581 128 581 c
114 581 102 586 92 595 c
83 605 78 617 78 632 c
78 646 83 658 93 668 c
103 678 115 683 129 683 c
144 683 156 678 165 668 c
175 658 180 646 180 632 c

253 0 m
16 0 l
16 15 l
51 17 72 23 81 33 c
90 43 95 67 95 104 c
95 331 l
95 354 93 371 88 380 c
83 389 75 394 62 394 c
46 394 32 392 20 389 c
20 405 l
175 460 l
179 456 l
179 105 l
179 68 183 44 191 34 c
200 24 220 18 253 15 c
253 0 l

ce} _d
/l{278 0 19 0 257 683 sc
257 0 m
21 0 l
21 15 l
52 18 73 24 83 34 c
93 45 98 64 98 92 c
98 561 l
98 585 95 602 89 611 c
83 620 72 625 56 625 c
42 625 30 624 19 623 c
19 639 l
82 654 135 669 177 683 c
182 679 l
182 87 l
182 59 187 40 196 31 c
205 22 226 17 257 15 c
257 0 l

ce} _d
/m{778 0 16 0 775 460 sc
775 0 m
557 0 l
557 15 l
585 18 603 23 610 32 c
618 41 622 61 622 90 c
622 296 l
622 336 616 365 604 382 c
593 399 573 408 545 408 c
522 408 502 403 485 394 c
469 385 453 369 438 347 c
438 95 l
438 63 443 42 452 31 c
462 21 481 16 510 15 c
510 0 l
286 0 l
286 15 l
315 17 334 22 342 29 c
350 37 354 56 354 86 c
354 297 l
354 371 332 408 289 408 c
270 408 250 404 229 395 c
208 387 193 377 183 365 c
174 355 170 349 170 348 c
170 70 l
170 49 175 34 184 27 c
193 20 211 16 238 15 c
238 0 l
16 0 l
16 15 l
44 16 63 21 72 30 c
81 40 86 59 86 88 c
86 336 l
86 361 83 378 78 387 c
73 397 64 402 51 402 c
41 402 30 401 19 398 c
19 415 l
64 428 111 443 158 460 c
166 457 l
166 383 l
168 383 l
198 414 224 435 247 445 c
270 455 295 460 321 460 c
374 460 409 432 427 376 c
479 432 533 460 590 460 c
667 460 706 400 706 280 c
706 77 l
706 55 709 40 716 31 c
723 23 734 18 749 17 c
775 15 l
775 0 l

ce} _d
/n{500 0 16 0 485 460 sc
485 0 m
277 0 l
278 15 l
303 17 319 24 327 36 c
336 49 340 72 340 105 c
340 304 l
340 371 316 405 267 405 c
250 405 235 401 220 393 c
205 385 187 370 164 348 c
164 72 l
164 52 168 38 177 30 c
186 22 204 17 229 15 c
229 0 l
18 0 l
18 15 l
43 17 60 23 68 33 c
76 44 80 64 80 94 c
80 337 l
80 362 78 379 73 388 c
68 397 59 402 45 402 c
32 402 22 401 16 398 c
16 415 l
63 428 108 443 153 460 c
161 457 l
161 379 l
162 379 l
209 433 257 460 306 460 c
344 460 373 447 393 420 c
414 393 424 355 424 306 c
424 85 l
424 58 428 41 436 32 c
444 23 460 18 485 15 c
485 0 l

ce} _d
/o{500 0 29 -10 470 460 sc
470 231 m
470 161 449 103 407 58 c
366 13 312 -10 245 -10 c
184 -10 132 12 91 57 c
50 102 29 159 29 228 c
29 297 50 353 91 396 c
132 439 187 460 254 460 c
316 460 367 439 408 396 c
449 354 470 299 470 231 c

380 204 m
380 280 363 339 330 382 c
303 415 272 432 235 432 c
200 432 172 418 151 389 c
130 361 119 322 119 273 c
119 188 137 119 172 68 c
195 35 225 18 262 18 c
299 18 327 34 348 67 c
369 100 380 146 380 204 c

ce} _d
/r{333 0 5 0 335 460 sc
160 458 m
160 366 l
185 402 206 427 223 440 c
240 453 259 460 280 460 c
297 460 311 455 320 446 c
330 437 335 424 335 407 c
335 393 331 382 324 374 c
317 366 308 362 296 362 c
283 362 270 369 256 382 c
245 392 237 397 230 397 c
216 397 201 387 184 368 c
168 349 160 331 160 315 c
160 90 l
160 61 166 42 177 32 c
188 22 211 16 245 15 c
245 0 l
5 0 l
5 15 l
37 21 57 28 64 35 c
72 42 76 59 76 84 c
76 334 l
76 356 73 371 68 380 c
63 389 55 394 42 394 c
31 394 20 393 7 390 c
7 406 l
49 419 98 437 155 460 c
160 458 l

ce} _d
/s{389 0 51 -10 348 459 sc
156 301 m
260 238 l
293 218 316 199 329 182 c
342 165 348 142 348 115 c
348 82 334 52 306 27 c
279 2 246 -10 208 -10 c
177 -10 152 -7 135 -1 c
117 5 102 8 89 8 c
78 8 70 4 65 -4 c
52 -4 l
52 153 l
68 153 l
79 104 94 69 114 46 c
134 23 161 12 195 12 c
220 12 240 19 255 33 c
270 47 278 65 278 86 c
278 117 260 142 225 161 c
171 191 l
91 236 51 284 51 336 c
51 375 63 405 88 426 c
113 448 147 459 189 459 c
218 459 241 455 256 448 c
268 443 277 440 284 440 c
289 440 294 443 300 450 c
311 450 l
316 314 l
301 314 l
290 359 275 391 258 409 c
241 428 218 437 188 437 c
165 437 147 431 133 420 c
120 409 113 392 113 369 c
113 358 117 345 124 332 c
132 319 143 309 156 301 c

ce} _d
/t{278 0 13 -10 279 579 sc
266 77 m
279 66 l
247 15 207 -10 158 -10 c
99 -10 70 32 70 117 c
70 418 l
17 418 l
14 420 13 422 13 425 c
13 430 19 437 30 444 c
55 459 88 494 127 551 c
128 553 131 557 136 563 c
141 570 145 575 147 579 c
152 579 154 575 154 566 c
154 450 l
255 450 l
255 418 l
154 418 l
154 132 l
154 100 158 77 166 63 c
174 49 187 42 206 42 c
226 42 246 54 266 77 c

ce} _d
/u{500 0 9 -10 480 450 sc
480 50 m
480 36 l
428 22 382 7 343 -9 c
338 -6 l
338 76 l
336 76 l
294 19 246 -10 193 -10 c
155 -10 125 2 103 25 c
82 48 71 79 71 118 c
71 369 l
71 394 67 411 58 420 c
49 429 33 435 9 436 c
9 450 l
155 450 l
155 127 l
155 104 162 85 175 70 c
189 55 206 48 226 48 c
259 48 287 58 310 79 c
319 87 325 94 328 101 c
331 108 333 120 333 137 c
333 368 l
333 394 328 411 319 418 c
310 426 290 431 259 433 c
259 450 l
417 450 l
417 107 l
417 84 421 68 428 61 c
436 54 451 50 474 50 c
480 50 l

ce} _d
/x{500 0 17 0 479 450 sc
479 0 m
278 0 l
278 15 l
295 16 305 18 310 21 c
315 24 318 30 318 39 c
318 45 316 51 312 57 c
221 197 l
142 74 l
129 53 122 40 122 33 c
122 21 135 15 162 15 c
162 0 l
17 0 l
17 15 l
34 16 46 20 55 26 c
64 33 76 46 90 66 c
204 231 l
110 375 l
95 398 82 414 71 422 c
60 431 48 435 33 435 c
24 435 l
24 450 l
231 450 l
231 435 l
202 434 188 427 188 413 c
188 399 203 369 234 324 c
243 312 247 305 248 304 c
251 309 261 323 278 348 c
281 354 285 360 290 367 c
295 374 298 379 300 383 c
303 387 305 391 308 395 c
311 399 312 402 313 405 c
314 408 315 411 315 413 c
315 426 302 433 275 435 c
275 450 l
433 450 l
433 435 l
399 434 372 419 352 391 c
269 271 l
397 75 l
423 35 450 15 479 15 c
479 0 l

ce} _d
/y{500 0 14 -218 475 450 sc
475 450 m
475 435 l
463 434 453 429 446 422 c
439 415 432 402 425 384 c
275 -25 l
249 -96 223 -145 196 -174 c
170 -203 138 -218 100 -218 c
79 -218 62 -212 49 -201 c
36 -190 30 -177 30 -160 c
30 -147 34 -136 42 -127 c
51 -118 61 -114 73 -114 c
92 -114 110 -118 125 -127 c
134 -132 142 -134 151 -134 c
165 -134 182 -119 201 -90 c
210 -77 219 -58 228 -33 c
237 -8 241 9 241 18 c
241 27 227 60 199 119 c
67 401 l
58 420 41 432 14 436 c
14 450 l
219 450 l
219 435 l
198 434 183 432 174 428 c
166 424 162 417 162 408 c
162 401 166 387 175 367 c
287 117 l
384 393 l
387 399 388 405 388 411 c
388 427 373 435 342 435 c
342 450 l
475 450 l

ce} _d
end readonly def

/BuildGlyph {
 exch begin
 CharStrings exch
 2 copy known not {pop /.notdef} if
 true 3 1 roll get exec
 end
} _d

/BuildChar {
 1 index /Encoding get exch get
 1 index /BuildGlyph get exec
} _d

FontName currentdict end definefont pop
%!PS-Adobe-3.0 Resource-Font
%%Creator: Converted from TrueType to Type 3 by Matplotlib.
10 dict begin
/FontName /Cmmi10 def
/PaintType 0 def
/FontMatrix [0.00048828125 0 0 0.00048828125 0 0] def
/FontBBox [-70 -512 2146 1536] def
/FontType 3 def
/Encoding [/N] def
/CharStrings 2 dict dup begin
/.notdef 0 def
/N{1645 0 76 0 1808 1399 sc
96 0 m
83 0 76 9 76 27 c
77 30 78 36 80 44 c
82 53 85 59 88 64 c
92 69 97 72 102 72 c
233 72 309 114 330 197 c
608 1317 l
570 1324 510 1327 428 1327 c
415 1327 408 1336 408 1354 c
409 1357 410 1363 412 1371 c
414 1380 417 1386 420 1391 c
424 1396 429 1399 434 1399 c
788 1399 l
798 1399 804 1395 807 1386 c
1262 303 l
1489 1210 l
1492 1225 1493 1235 1493 1241 c
1493 1298 1440 1327 1335 1327 c
1322 1327 1315 1336 1315 1354 c
1320 1371 1323 1383 1326 1389 c
1329 1396 1337 1399 1350 1399 c
1788 1399 l
1801 1399 1808 1390 1808 1372 c
1807 1369 1806 1363 1804 1354 c
1802 1346 1799 1339 1795 1334 c
1792 1329 1787 1327 1782 1327 c
1651 1327 1575 1285 1554 1202 c
1260 18 l
1255 6 1248 0 1239 0 c
1214 0 l
1205 0 1199 5 1196 14 c
674 1253 l
670 1266 l
667 1269 666 1271 666 1272 c
395 188 l
394 185 393 180 392 175 c
391 170 390 165 389 158 c
389 123 404 99 435 88 c
466 77 504 72 549 72 c
562 72 569 63 569 45 c
564 26 560 14 557 8 c
554 3 546 0 535 0 c
96 0 l

ce} _d
end readonly def

/BuildGlyph {
 exch begin
 CharStrings exch
 2 copy known not {pop /.notdef} if
 true 3 1 roll get exec
 end
} _d

/BuildChar {
 1 index /Encoding get exch get
 1 index /BuildGlyph get exec
} _d

FontName currentdict end definefont pop
%!PS-Adobe-3.0 Resource-Font
%%Creator: Converted from TrueType to Type 3 by Matplotlib.
10 dict begin
/FontName /Cmr10 def
/PaintType 0 def
/FontMatrix [0.00048828125 0 0 0.00048828125 0 0] def
/FontBBox [-90 -512 2066 1536] def
/FontType 3 def
/Encoding [/u /N] def
/CharStrings 3 dict dup begin
/.notdef 0 def
/u{1137 0 61 -23 1100 905 sc
221 244 m
221 696 l
221 733 215 759 204 775 c
193 792 178 802 157 805 c
136 809 104 811 61 811 c
61 883 l
371 905 l
371 244 l
371 191 375 149 382 119 c
390 90 406 68 431 53 c
456 38 496 31 551 31 c
624 31 683 62 726 123 c
769 184 791 254 791 332 c
791 696 l
791 733 785 759 774 775 c
763 792 747 802 726 805 c
706 809 674 811 631 811 c
631 883 l
940 905 l
940 186 l
940 150 945 124 956 107 c
967 91 983 81 1004 77 c
1025 74 1057 72 1100 72 c
1100 0 l
797 -23 l
797 150 l
772 99 736 57 691 25 c
646 -7 596 -23 541 -23 c
443 -23 365 -2 307 39 c
250 81 221 149 221 244 c

ce} _d
/N{1536 0 63 0 1470 1399 sc
63 0 m
63 72 l
204 72 274 112 274 193 c
274 1315 l
229 1323 159 1327 63 1327 c
63 1399 l
455 1399 l
462 1399 466 1396 469 1391 c
1194 324 l
1194 1206 l
1194 1287 1124 1327 983 1327 c
983 1399 l
1470 1399 l
1470 1327 l
1330 1327 1260 1287 1260 1206 c
1260 18 l
1260 14 1257 10 1252 6 c
1247 2 1242 0 1239 0 c
1214 0 l
1207 0 1203 3 1200 8 c
340 1274 l
340 193 l
340 112 410 72 551 72 c
551 0 l
63 0 l

ce} _d
end readonly def

/BuildGlyph {
 exch begin
 CharStrings exch
 2 copy known not {pop /.notdef} if
 true 3 1 roll get exec
 end
} _d

/BuildChar {
 1 index /Encoding get exch get
 1 index /BuildGlyph get exec
} _d

FontName currentdict end definefont pop
end
%%EndProlog
mpldict begin
-12.82 256.497 translate
637.64 279.006 0 0 clipbox
gsave
-0 0 m
637.640022 0 l
637.640022 279.00625 l
-0 279.00625 l
cl
1.000 setgray
fill
grestore
gsave
48.2 41.60625 m
313.457972 41.60625 l
313.457972 271.80625 l
48.2 271.80625 l
cl
1.000 setgray
fill
grestore
0.800 setlinewidth
1 setlinejoin
2 setlinecap
[] 0 setdash
0.690 setgray
gsave
265.258 230.2 48.2 41.606 clipbox
65.903759 41.60625 m
65.903759 271.80625 l
stroke
grestore
0 setlinecap
0.000 setgray
gsave
/o {
gsave
newpath
translate
0.8 setlinewidth
1 setlinejoin

0 setlinecap

0 0 m
0 -3.5 l

gsave
0.000 setgray
fill
grestore
stroke
grestore
} bind def
65.9038 41.6063 o
grestore
gsave
50.9038 26.4031 translate
0 rotate
/STIXGeneral-Regular 12.0 selectfont
0 0.890625 moveto
/one glyphshow
5.99998 0.890625 moveto
/zero glyphshow
12 0.890625 moveto
/zero glyphshow
18 0.890625 moveto
/zero glyphshow
23.9999 0.890625 moveto
/zero glyphshow
grestore
2 setlinecap
0.690 setgray
gsave
265.258 230.2 48.2 41.606 clipbox
111.742887 41.60625 m
111.742887 271.80625 l
stroke
grestore
0 setlinecap
0.000 setgray
gsave
/o {
gsave
newpath
translate
0.8 setlinewidth
1 setlinejoin

0 setlinecap

0 0 m
0 -3.5 l

gsave
0.000 setgray
fill
grestore
stroke
grestore
} bind def
111.743 41.6063 o
grestore
gsave
96.7429 26.4031 translate
0 rotate
/STIXGeneral-Regular 12.0 selectfont
0 0.890625 moveto
/two glyphshow
5.99998 0.890625 moveto
/zero glyphshow
12 0.890625 moveto
/zero glyphshow
18 0.890625 moveto
/zero glyphshow
23.9999 0.890625 moveto
/zero glyphshow
grestore
2 setlinecap
0.690 setgray
gsave
265.258 230.2 48.2 41.606 clipbox
157.582016 41.60625 m
157.582016 271.80625 l
stroke
grestore
0 setlinecap
0.000 setgray
gsave
/o {
gsave
newpath
translate
0.8 setlinewidth
1 setlinejoin

0 setlinecap

0 0 m
0 -3.5 l

gsave
0.000 setgray
fill
grestore
stroke
grestore
} bind def
157.582 41.6063 o
grestore
gsave
142.582 26.4031 translate
0 rotate
/STIXGeneral-Regular 12.0 selectfont
0 0.890625 moveto
/three glyphshow
5.99998 0.890625 moveto
/zero glyphshow
12 0.890625 moveto
/zero glyphshow
18 0.890625 moveto
/zero glyphshow
23.9999 0.890625 moveto
/zero glyphshow
grestore
2 setlinecap
0.690 setgray
gsave
265.258 230.2 48.2 41.606 clipbox
203.421144 41.60625 m
203.421144 271.80625 l
stroke
grestore
0 setlinecap
0.000 setgray
gsave
/o {
gsave
newpath
translate
0.8 setlinewidth
1 setlinejoin

0 setlinecap

0 0 m
0 -3.5 l

gsave
0.000 setgray
fill
grestore
stroke
grestore
} bind def
203.421 41.6063 o
grestore
gsave
188.421 26.4031 translate
0 rotate
/STIXGeneral-Regular 12.0 selectfont
0 0.890625 moveto
/four glyphshow
5.99998 0.890625 moveto
/zero glyphshow
12 0.890625 moveto
/zero glyphshow
18 0.890625 moveto
/zero glyphshow
23.9999 0.890625 moveto
/zero glyphshow
grestore
2 setlinecap
0.690 setgray
gsave
265.258 230.2 48.2 41.606 clipbox
249.260273 41.60625 m
249.260273 271.80625 l
stroke
grestore
0 setlinecap
0.000 setgray
gsave
/o {
gsave
newpath
translate
0.8 setlinewidth
1 setlinejoin

0 setlinecap

0 0 m
0 -3.5 l

gsave
0.000 setgray
fill
grestore
stroke
grestore
} bind def
249.26 41.6063 o
grestore
gsave
234.26 26.4031 translate
0 rotate
/STIXGeneral-Regular 12.0 selectfont
0 0.75 moveto
/five glyphshow
5.99998 0.75 moveto
/zero glyphshow
12 0.75 moveto
/zero glyphshow
18 0.75 moveto
/zero glyphshow
23.9999 0.75 moveto
/zero glyphshow
grestore
2 setlinecap
0.690 setgray
gsave
265.258 230.2 48.2 41.606 clipbox
295.099401 41.60625 m
295.099401 271.80625 l
stroke
grestore
0 setlinecap
0.000 setgray
gsave
/o {
gsave
newpath
translate
0.8 setlinewidth
1 setlinejoin

0 setlinecap

0 0 m
0 -3.5 l

gsave
0.000 setgray
fill
grestore
stroke
grestore
} bind def
295.099 41.6063 o
grestore
gsave
280.099 26.4031 translate
0 rotate
/STIXGeneral-Regular 12.0 selectfont
0 0.796875 moveto
/six glyphshow
5.99998 0.796875 moveto
/zero glyphshow
12 0.796875 moveto
/zero glyphshow
18 0.796875 moveto
/zero glyphshow
23.9999 0.796875 moveto
/zero glyphshow
grestore
gsave
174.829 10.2313 translate
0 rotate
/Cmmi10 14.0 selectfont
0 0.4375 moveto
/N glyphshow
grestore
2 setlinecap
0.690 setgray
gsave
265.258 230.2 48.2 41.606 clipbox
48.2 52.069886 m
313.457972 52.069886 l
stroke
grestore
0 setlinecap
0.000 setgray
gsave
/o {
gsave
newpath
translate
0.8 setlinewidth
1 setlinejoin

0 setlinecap

-0 0 m
-3.5 0 l

gsave
0.000 setgray
fill
grestore
stroke
grestore
} bind def
48.2 52.0699 o
grestore
gsave
26.2 47.9683 translate
0 rotate
/STIXGeneral-Regular 12.0 selectfont
0 0.890625 moveto
/eight glyphshow
5.99998 0.890625 moveto
/period glyphshow
8.99997 0.890625 moveto
/eight glyphshow
grestore
2 setlinecap
0.690 setgray
gsave
265.258 230.2 48.2 41.606 clipbox
48.2 89.276756 m
313.457972 89.276756 l
stroke
grestore
0 setlinecap
0.000 setgray
gsave
/o {
gsave
newpath
translate
0.8 setlinewidth
1 setlinejoin

0 setlinecap

-0 0 m
-3.5 0 l

gsave
0.000 setgray
fill
grestore
stroke
grestore
} bind def
48.2 89.2768 o
grestore
gsave
26.2 85.1752 translate
0 rotate
/STIXGeneral-Regular 12.0 selectfont
0 0.890625 moveto
/eight glyphshow
5.99998 0.890625 moveto
/period glyphshow
8.99997 0.890625 moveto
/nine glyphshow
grestore
2 setlinecap
0.690 setgray
gsave
265.258 230.2 48.2 41.606 clipbox
48.2 126.483626 m
313.457972 126.483626 l
stroke
grestore
0 setlinecap
0.000 setgray
gsave
/o {
gsave
newpath
translate
0.8 setlinewidth
1 setlinejoin

0 setlinecap

-0 0 m
-3.5 0 l

gsave
0.000 setgray
fill
grestore
stroke
grestore
} bind def
48.2 126.484 o
grestore
gsave
26.2 122.382 translate
0 rotate
/STIXGeneral-Regular 12.0 selectfont
0 0.890625 moveto
/nine glyphshow
5.99998 0.890625 moveto
/period glyphshow
8.99997 0.890625 moveto
/zero glyphshow
grestore
2 setlinecap
0.690 setgray
gsave
265.258 230.2 48.2 41.606 clipbox
48.2 163.690496 m
313.457972 163.690496 l
stroke
grestore
0 setlinecap
0.000 setgray
gsave
/o {
gsave
newpath
translate
0.8 setlinewidth
1 setlinejoin

0 setlinecap

-0 0 m
-3.5 0 l

gsave
0.000 setgray
fill
grestore
stroke
grestore
} bind def
48.2 163.69 o
grestore
gsave
26.2 159.589 translate
0 rotate
/STIXGeneral-Regular 12.0 selectfont
0 0.890625 moveto
/nine glyphshow
5.99998 0.890625 moveto
/period glyphshow
8.99997 0.890625 moveto
/one glyphshow
grestore
2 setlinecap
0.690 setgray
gsave
265.258 230.2 48.2 41.606 clipbox
48.2 200.897366 m
313.457972 200.897366 l
stroke
grestore
0 setlinecap
0.000 setgray
gsave
/o {
gsave
newpath
translate
0.8 setlinewidth
1 setlinejoin

0 setlinecap

-0 0 m
-3.5 0 l

gsave
0.000 setgray
fill
grestore
stroke
grestore
} bind def
48.2 200.897 o
grestore
gsave
26.2 196.796 translate
0 rotate
/STIXGeneral-Regular 12.0 selectfont
0 0.890625 moveto
/nine glyphshow
5.99998 0.890625 moveto
/period glyphshow
8.99997 0.890625 moveto
/two glyphshow
grestore
2 setlinecap
0.690 setgray
gsave
265.258 230.2 48.2 41.606 clipbox
48.2 238.104236 m
313.457972 238.104236 l
stroke
grestore
0 setlinecap
0.000 setgray
gsave
/o {
gsave
newpath
translate
0.8 setlinewidth
1 setlinejoin

0 setlinecap

-0 0 m
-3.5 0 l

gsave
0.000 setgray
fill
grestore
stroke
grestore
} bind def
48.2 238.104 o
grestore
gsave
26.2 234.003 translate
0 rotate
/STIXGeneral-Regular 12.0 selectfont
0 0.890625 moveto
/nine glyphshow
5.99998 0.890625 moveto
/period glyphshow
8.99997 0.890625 moveto
/three glyphshow
grestore
gsave
19.1688 147.206 translate
90 rotate
/Cmr10 14.0 selectfont
0 0.5625 moveto
/N glyphshow
10.5 0.5625 moveto
/u glyphshow
0.0 12.25 18.2724609375 0.875 rectfill
grestore
1.500 setlinewidth
2 setlinecap
0.122 0.467 0.706 setrgbcolor
gsave
265.258 230.2 48.2 41.606 clipbox
50.776847 249.806939 m
67.214758 187.349628 l
93.453075 139.065619 l
133.5944 106.415793 l
195.999789 87.702298 l
293.696724 78.248993 l
stroke
grestore
1.000 setlinewidth
0 setlinecap
gsave
265.258 230.2 48.2 41.606 clipbox
/o {
gsave
newpath
translate
1.0 setlinewidth
1 setlinejoin

0 setlinecap

-3.5 -3.5 m
3.5 3.5 l
-3.5 3.5 m
3.5 -3.5 l

gsave
0.122 0.467 0.706 setrgbcolor
fill
grestore
stroke
grestore
} bind def
50.7768 249.807 o
67.2148 187.35 o
93.4531 139.066 o
133.594 106.416 o
196 87.7023 o
293.697 78.249 o
grestore
1.500 setlinewidth
[5.55 2.4] 0 setdash
1.000 0.498 0.055 setrgbcolor
gsave
265.258 230.2 48.2 41.606 clipbox
48.457387 261.342614 m
63.753904 173.674332 l
87.787359 137.016848 l
125.467122 102.261817 l
183.609473 88.482742 l
274.366363 76.845444 l
stroke
grestore
1.000 setlinewidth
0 setlinejoin
[] 0 setdash
gsave
265.258 230.2 48.2 41.606 clipbox
/o {
gsave
newpath
translate
1.0 setlinewidth
0 setlinejoin

0 setlinecap

3.5 -0 m
-3.5 3.5 l
-3.5 -3.5 l
cl

gsave
1.000 0.498 0.055 setrgbcolor
fill
grestore
stroke
grestore
} bind def
48.4574 261.343 o
63.7539 173.674 o
87.7874 137.017 o
125.467 102.262 o
183.609 88.4827 o
274.366 76.8454 o
grestore
1.500 setlinewidth
1 setlinejoin
[1.5 2.475] 0 setdash
0.173 0.627 0.173 setrgbcolor
gsave
265.258 230.2 48.2 41.606 clipbox
53.165065 179.848099 m
70.583934 135.504362 l
98.710823 105.766733 l
141.836275 87.612997 l
208.944759 77.436241 l
313.457972 71.521882 l
stroke
grestore
1.000 setlinewidth
[] 0 setdash
gsave
265.258 230.2 48.2 41.606 clipbox
/o {
gsave
newpath
translate
1.0 setlinewidth
1 setlinejoin

0 setlinecap

0 -1.75 m
0.464105 -1.75 0.909265 -1.565609 1.237437 -1.237437 c
1.565609 -0.909265 1.75 -0.464105 1.75 0 c
1.75 0.464105 1.565609 0.909265 1.237437 1.237437 c
0.909265 1.565609 0.464105 1.75 0 1.75 c
-0.464105 1.75 -0.909265 1.565609 -1.237437 1.237437 c
-1.565609 0.909265 -1.75 0.464105 -1.75 0 c
-1.75 -0.464105 -1.565609 -0.909265 -1.237437 -1.237437 c
-0.909265 -1.565609 -0.464105 -1.75 0 -1.75 c
cl

gsave
0.173 0.627 0.173 setrgbcolor
fill
grestore
stroke
grestore
} bind def
53.1651 179.848 o
70.5839 135.504 o
98.7108 105.767 o
141.836 87.613 o
208.945 77.4362 o
313.458 71.5219 o
grestore
1.500 setlinewidth
0.000 setgray
gsave
265.258 230.2 48.2 41.606 clipbox
48.2 115.321565 m
313.457972 115.321565 l
stroke
grestore
[5.55 2.4] 0 setdash
gsave
265.258 230.2 48.2 41.606 clipbox
48.2 63.976085 m
313.457972 63.976085 l
stroke
grestore
[9.6 2.4 1.5 2.4] 0 setdash
gsave
265.258 230.2 48.2 41.606 clipbox
48.2 52.069886 m
313.457972 52.069886 l
stroke
grestore
0.800 setlinewidth
0 setlinejoin
2 setlinecap
[] 0 setdash
gsave
48.2 41.60625 m
48.2 271.80625 l
stroke
grestore
gsave
313.457972 41.60625 m
313.457972 271.80625 l
stroke
grestore
gsave
48.2 41.60625 m
313.457972 41.60625 l
stroke
grestore
gsave
48.2 271.80625 m
313.457972 271.80625 l
stroke
grestore
1.000 setlinewidth
0 setlinecap
0.800 setgray
gsave
194.473597 178.540625 m
306.457972 178.540625 l
307.791305 178.540625 308.457972 179.207292 308.457972 180.540625 c
308.457972 264.80625 l
308.457972 266.139583 307.791305 266.80625 306.457972 266.80625 c
194.473597 266.80625 l
193.140264 266.80625 192.473597 266.139583 192.473597 264.80625 c
192.473597 180.540625 l
192.473597 179.207292 193.140264 178.540625 194.473597 178.540625 c
cl
gsave
1.000 setgray
fill
grestore
stroke
grestore
1.500 setlinewidth
1 setlinejoin
2 setlinecap
0.122 0.467 0.706 setrgbcolor
gsave
196.473597 259.30625 m
206.473597 259.30625 l
216.473597 259.30625 l
stroke
grestore
1.000 setlinewidth
0 setlinecap
gsave
/o {
gsave
newpath
translate
1.0 setlinewidth
1 setlinejoin

0 setlinecap

-3.5 -3.5 m
3.5 3.5 l
-3.5 3.5 m
3.5 -3.5 l

gsave
0.122 0.467 0.706 setrgbcolor
fill
grestore
stroke
grestore
} bind def
206.474 259.306 o
grestore
0.000 setgray
/STIXGeneral-Regular 10.000 selectfont
gsave

224.474 255.806 translate
0 rotate
0 0 m /h glyphshow
4.99998 0 m /y glyphshow
9.99997 0 m /b glyphshow
15 0 m /r glyphshow
18.3299 0 m /i glyphshow
21.1099 0 m /d glyphshow
grestore
1.500 setlinewidth
[5.55 2.4] 0 setdash
1.000 0.498 0.055 setrgbcolor
gsave
196.473597 245.11875 m
206.473597 245.11875 l
216.473597 245.11875 l
stroke
grestore
1.000 setlinewidth
0 setlinejoin
[] 0 setdash
gsave
/o {
gsave
newpath
translate
1.0 setlinewidth
0 setlinejoin

0 setlinecap

3.5 -0 m
-3.5 3.5 l
-3.5 -3.5 l
cl

gsave
1.000 0.498 0.055 setrgbcolor
fill
grestore
stroke
grestore
} bind def
206.474 245.119 o
grestore
0.000 setgray
/STIXGeneral-Regular 10.000 selectfont
gsave

224.474 241.619 translate
0 rotate
0 0 m /s glyphshow
3.88998 0 m /c glyphshow
8.32997 0 m /a glyphshow
12.77 0 m /t glyphshow
15.5499 0 m /t glyphshow
18.3299 0 m /e glyphshow
22.7699 0 m /r glyphshow
26.0999 0 m /e glyphshow
30.5399 0 m /d glyphshow
grestore
1.500 setlinewidth
1 setlinejoin
[1.5 2.475] 0 setdash
0.173 0.627 0.173 setrgbcolor
gsave
196.473597 230.946875 m
206.473597 230.946875 l
216.473597 230.946875 l
stroke
grestore
1.000 setlinewidth
[] 0 setdash
gsave
/o {
gsave
newpath
translate
1.0 setlinewidth
1 setlinejoin

0 setlinecap

0 -1.75 m
0.464105 -1.75 0.909265 -1.565609 1.237437 -1.237437 c
1.565609 -0.909265 1.75 -0.464105 1.75 0 c
1.75 0.464105 1.565609 0.909265 1.237437 1.237437 c
0.909265 1.565609 0.464105 1.75 0 1.75 c
-0.464105 1.75 -0.909265 1.565609 -1.237437 1.237437 c
-1.565609 0.909265 -1.75 0.464105 -1.75 0 c
-1.75 -0.464105 -1.565609 -0.909265 -1.237437 -1.237437 c
-0.909265 -1.565609 -0.464105 -1.75 0 -1.75 c
cl

gsave
0.173 0.627 0.173 setrgbcolor
fill
grestore
stroke
grestore
} bind def
206.474 230.947 o
grestore
0.000 setgray
/STIXGeneral-Regular 10.000 selectfont
gsave

224.474 227.447 translate
0 rotate
0 0 m /r glyphshow
3.32999 0 m /e glyphshow
7.76997 0 m /g glyphshow
12.77 0 m /u glyphshow
17.7699 0 m /l glyphshow
20.5499 0 m /a glyphshow
24.9899 0 m /r glyphshow
grestore
1.500 setlinewidth
gsave
196.473597 216.55625 m
216.473597 216.55625 l
stroke
grestore
/STIXGeneral-Regular 10.000 selectfont
gsave

224.474 213.056 translate
0 rotate
0 0 m /K glyphshow
7.21999 0 m /o glyphshow
12.22 0 m /s glyphshow
16.11 0 m /e glyphshow
20.5499 0 m /c glyphshow
24.9899 0 m /space glyphshow
27.4899 0 m /a glyphshow
31.9299 0 m /n glyphshow
36.9299 0 m /d glyphshow
41.9299 0 m /space glyphshow
44.4299 0 m /Scaron glyphshow
49.9898 0 m /a glyphshow
54.4298 0 m /r glyphshow
57.7598 0 m /l glyphshow
60.5398 0 m /e glyphshow
64.9798 0 m /r glyphshow
grestore
[5.55 2.4] 0 setdash
gsave
196.473597 202.384375 m
216.473597 202.384375 l
stroke
grestore
/STIXGeneral-Regular 10.000 selectfont
gsave

224.474 198.884 translate
0 rotate
0 0 m /S glyphshow
5.55998 0 m /a glyphshow
9.99997 0 m /d glyphshow
15 0 m /a glyphshow
19.4399 0 m /t glyphshow
22.2199 0 m /space glyphshow
24.7199 0 m /a glyphshow
29.1599 0 m /n glyphshow
34.1599 0 m /d glyphshow
39.1599 0 m /space glyphshow
41.6599 0 m /C glyphshow
48.3298 0 m /o glyphshow
53.3298 0 m /u glyphshow
58.3298 0 m /t glyphshow
61.1098 0 m /u glyphshow
66.1098 0 m /r glyphshow
69.4398 0 m /i glyphshow
72.2197 0 m /e glyphshow
76.6597 0 m /r glyphshow
grestore
[9.6 2.4 1.5 2.4] 0 setdash
gsave
196.473597 188.2125 m
216.473597 188.2125 l
stroke
grestore
/STIXGeneral-Regular 10.000 selectfont
gsave

224.474 184.712 translate
0 rotate
0 0 m /W glyphshow
9.43999 0 m /a glyphshow
13.88 0 m /n glyphshow
18.88 0 m /space glyphshow
21.3799 0 m /e glyphshow
25.8199 0 m /t glyphshow
28.5999 0 m /period glyphshow
31.0999 0 m /space glyphshow
33.5999 0 m /a glyphshow
38.0399 0 m /l glyphshow
grestore
gsave
365.18205 41.60625 m
630.440022 41.60625 l
630.440022 271.80625 l
365.18205 271.80625 l
cl
1.000 setgray
fill
grestore
0.800 setlinewidth
2 setlinecap
[] 0 setdash
0.690 setgray
gsave
265.258 230.2 365.182 41.606 clipbox
382.645367 41.60625 m
382.645367 271.80625 l
stroke
grestore
0 setlinecap
0.000 setgray
gsave
/o {
gsave
newpath
translate
0.8 setlinewidth
1 setlinejoin

0 setlinecap

0 0 m
0 -3.5 l

gsave
0.000 setgray
fill
grestore
stroke
grestore
} bind def
382.645 41.6063 o
grestore
gsave
367.645 26.4031 translate
0 rotate
/STIXGeneral-Regular 12.0 selectfont
0 0.890625 moveto
/one glyphshow
5.99998 0.890625 moveto
/zero glyphshow
12 0.890625 moveto
/zero glyphshow
18 0.890625 moveto
/zero glyphshow
23.9999 0.890625 moveto
/zero glyphshow
grestore
2 setlinecap
0.690 setgray
gsave
265.258 230.2 365.182 41.606 clipbox
428.529018 41.60625 m
428.529018 271.80625 l
stroke
grestore
0 setlinecap
0.000 setgray
gsave
/o {
gsave
newpath
translate
0.8 setlinewidth
1 setlinejoin

0 setlinecap

0 0 m
0 -3.5 l

gsave
0.000 setgray
fill
grestore
stroke
grestore
} bind def
428.529 41.6063 o
grestore
gsave
413.529 26.4031 translate
0 rotate
/STIXGeneral-Regular 12.0 selectfont
0 0.890625 moveto
/two glyphshow
5.99998 0.890625 moveto
/zero glyphshow
12 0.890625 moveto
/zero glyphshow
18 0.890625 moveto
/zero glyphshow
23.9999 0.890625 moveto
/zero glyphshow
grestore
2 setlinecap
0.690 setgray
gsave
265.258 230.2 365.182 41.606 clipbox
474.412668 41.60625 m
474.412668 271.80625 l
stroke
grestore
0 setlinecap
0.000 setgray
gsave
/o {
gsave
newpath
translate
0.8 setlinewidth
1 setlinejoin

0 setlinecap

0 0 m
0 -3.5 l

gsave
0.000 setgray
fill
grestore
stroke
grestore
} bind def
474.413 41.6063 o
grestore
gsave
459.413 26.4031 translate
0 rotate
/STIXGeneral-Regular 12.0 selectfont
0 0.890625 moveto
/three glyphshow
5.99998 0.890625 moveto
/zero glyphshow
12 0.890625 moveto
/zero glyphshow
18 0.890625 moveto
/zero glyphshow
23.9999 0.890625 moveto
/zero glyphshow
grestore
2 setlinecap
0.690 setgray
gsave
265.258 230.2 365.182 41.606 clipbox
520.296319 41.60625 m
520.296319 271.80625 l
stroke
grestore
0 setlinecap
0.000 setgray
gsave
/o {
gsave
newpath
translate
0.8 setlinewidth
1 setlinejoin

0 setlinecap

0 0 m
0 -3.5 l

gsave
0.000 setgray
fill
grestore
stroke
grestore
} bind def
520.296 41.6063 o
grestore
gsave
505.296 26.4031 translate
0 rotate
/STIXGeneral-Regular 12.0 selectfont
0 0.890625 moveto
/four glyphshow
5.99998 0.890625 moveto
/zero glyphshow
12 0.890625 moveto
/zero glyphshow
18 0.890625 moveto
/zero glyphshow
23.9999 0.890625 moveto
/zero glyphshow
grestore
2 setlinecap
0.690 setgray
gsave
265.258 230.2 365.182 41.606 clipbox
566.179969 41.60625 m
566.179969 271.80625 l
stroke
grestore
0 setlinecap
0.000 setgray
gsave
/o {
gsave
newpath
translate
0.8 setlinewidth
1 setlinejoin

0 setlinecap

0 0 m
0 -3.5 l

gsave
0.000 setgray
fill
grestore
stroke
grestore
} bind def
566.18 41.6063 o
grestore
gsave
551.18 26.4031 translate
0 rotate
/STIXGeneral-Regular 12.0 selectfont
0 0.75 moveto
/five glyphshow
5.99998 0.75 moveto
/zero glyphshow
12 0.75 moveto
/zero glyphshow
18 0.75 moveto
/zero glyphshow
23.9999 0.75 moveto
/zero glyphshow
grestore
2 setlinecap
0.690 setgray
gsave
265.258 230.2 365.182 41.606 clipbox
612.06362 41.60625 m
612.06362 271.80625 l
stroke
grestore
0 setlinecap
0.000 setgray
gsave
/o {
gsave
newpath
translate
0.8 setlinewidth
1 setlinejoin

0 setlinecap

0 0 m
0 -3.5 l

gsave
0.000 setgray
fill
grestore
stroke
grestore
} bind def
612.064 41.6063 o
grestore
gsave
597.064 26.4031 translate
0 rotate
/STIXGeneral-Regular 12.0 selectfont
0 0.796875 moveto
/six glyphshow
5.99998 0.796875 moveto
/zero glyphshow
12 0.796875 moveto
/zero glyphshow
18 0.796875 moveto
/zero glyphshow
23.9999 0.796875 moveto
/zero glyphshow
grestore
gsave
491.811 10.2313 translate
0 rotate
/Cmmi10 14.0 selectfont
0 0.4375 moveto
/N glyphshow
grestore
2 setlinecap
0.690 setgray
gsave
265.258 230.2 365.182 41.606 clipbox
365.18205 54.158527 m
630.440022 54.158527 l
stroke
grestore
0 setlinecap
0.000 setgray
gsave
/o {
gsave
newpath
translate
0.8 setlinewidth
1 setlinejoin

0 setlinecap

-0 0 m
-3.5 0 l

gsave
0.000 setgray
fill
grestore
stroke
grestore
} bind def
365.182 54.1585 o
grestore
gsave
341.182 49.4632 translate
0 rotate
/STIXGeneral-Regular 12.0 selectfont
0 0.998438 moveto
/one glyphshow
5.99998 0.998438 moveto
/zero glyphshow
/STIXGeneral-Regular 8.399999999999999 selectfont
12.1892 5.32344 moveto
/zero glyphshow
grestore
2 setlinecap
0.690 setgray
gsave
265.258 230.2 365.182 41.606 clipbox
365.18205 134.696812 m
630.440022 134.696812 l
stroke
grestore
0 setlinecap
0.000 setgray
gsave
/o {
gsave
newpath
translate
0.8 setlinewidth
1 setlinejoin

0 setlinecap

-0 0 m
-3.5 0 l

gsave
0.000 setgray
fill
grestore
stroke
grestore
} bind def
365.182 134.697 o
grestore
gsave
341.182 130.001 translate
0 rotate
/STIXGeneral-Regular 12.0 selectfont
0 0.998438 moveto
/one glyphshow
5.99998 0.998438 moveto
/zero glyphshow
/STIXGeneral-Regular 8.399999999999999 selectfont
12.1892 5.32344 moveto
/one glyphshow
grestore
2 setlinecap
0.690 setgray
gsave
265.258 230.2 365.182 41.606 clipbox
365.18205 215.235096 m
630.440022 215.235096 l
stroke
grestore
0 setlinecap
0.000 setgray
gsave
/o {
gsave
newpath
translate
0.8 setlinewidth
1 setlinejoin

0 setlinecap

-0 0 m
-3.5 0 l

gsave
0.000 setgray
fill
grestore
stroke
grestore
} bind def
365.182 215.235 o
grestore
gsave
341.182 210.54 translate
0 rotate
/STIXGeneral-Regular 12.0 selectfont
0 0.998438 moveto
/one glyphshow
5.99998 0.998438 moveto
/zero glyphshow
/STIXGeneral-Regular 8.399999999999999 selectfont
12.1892 5.32344 moveto
/two glyphshow
grestore
0.600 setlinewidth
gsave
/o {
gsave
newpath
translate
0.6 setlinewidth
1 setlinejoin

0 setlinecap

-0 0 m
-2 0 l

gsave
0.000 setgray
fill
grestore
stroke
grestore
} bind def
365.182 41.683 o
grestore
gsave
/o {
gsave
newpath
translate
0.6 setlinewidth
1 setlinejoin

0 setlinecap

-0 0 m
-2 0 l

gsave
0.000 setgray
fill
grestore
stroke
grestore
} bind def
365.182 46.3536 o
grestore
gsave
/o {
gsave
newpath
translate
0.6 setlinewidth
1 setlinejoin

0 setlinecap

-0 0 m
-2 0 l

gsave
0.000 setgray
fill
grestore
stroke
grestore
} bind def
365.182 50.4733 o
grestore
gsave
/o {
gsave
newpath
translate
0.6 setlinewidth
1 setlinejoin

0 setlinecap

-0 0 m
-2 0 l

gsave
0.000 setgray
fill
grestore
stroke
grestore
} bind def
365.182 78.403 o
grestore
gsave
/o {
gsave
newpath
translate
0.6 setlinewidth
1 setlinejoin

0 setlinecap

-0 0 m
-2 0 l

gsave
0.000 setgray
fill
grestore
stroke
grestore
} bind def
365.182 92.5851 o
grestore
gsave
/o {
gsave
newpath
translate
0.6 setlinewidth
1 setlinejoin

0 setlinecap

-0 0 m
-2 0 l

gsave
0.000 setgray
fill
grestore
stroke
grestore
} bind def
365.182 102.647 o
grestore
gsave
/o {
gsave
newpath
translate
0.6 setlinewidth
1 setlinejoin

0 setlinecap

-0 0 m
-2 0 l

gsave
0.000 setgray
fill
grestore
stroke
grestore
} bind def
365.182 110.452 o
grestore
gsave
/o {
gsave
newpath
translate
0.6 setlinewidth
1 setlinejoin

0 setlinecap

-0 0 m
-2 0 l

gsave
0.000 setgray
fill
grestore
stroke
grestore
} bind def
365.182 116.829 o
grestore
gsave
/o {
gsave
newpath
translate
0.6 setlinewidth
1 setlinejoin

0 setlinecap

-0 0 m
-2 0 l

gsave
0.000 setgray
fill
grestore
stroke
grestore
} bind def
365.182 122.221 o
grestore
gsave
/o {
gsave
newpath
translate
0.6 setlinewidth
1 setlinejoin

0 setlinecap

-0 0 m
-2 0 l

gsave
0.000 setgray
fill
grestore
stroke
grestore
} bind def
365.182 126.892 o
grestore
gsave
/o {
gsave
newpath
translate
0.6 setlinewidth
1 setlinejoin

0 setlinecap

-0 0 m
-2 0 l

gsave
0.000 setgray
fill
grestore
stroke
grestore
} bind def
365.182 131.012 o
grestore
gsave
/o {
gsave
newpath
translate
0.6 setlinewidth
1 setlinejoin

0 setlinecap

-0 0 m
-2 0 l

gsave
0.000 setgray
fill
grestore
stroke
grestore
} bind def
365.182 158.941 o
grestore
gsave
/o {
gsave
newpath
translate
0.6 setlinewidth
1 setlinejoin

0 setlinecap

-0 0 m
-2 0 l

gsave
0.000 setgray
fill
grestore
stroke
grestore
} bind def
365.182 173.123 o
grestore
gsave
/o {
gsave
newpath
translate
0.6 setlinewidth
1 setlinejoin

0 setlinecap

-0 0 m
-2 0 l

gsave
0.000 setgray
fill
grestore
stroke
grestore
} bind def
365.182 183.186 o
grestore
gsave
/o {
gsave
newpath
translate
0.6 setlinewidth
1 setlinejoin

0 setlinecap

-0 0 m
-2 0 l

gsave
0.000 setgray
fill
grestore
stroke
grestore
} bind def
365.182 190.991 o
grestore
gsave
/o {
gsave
newpath
translate
0.6 setlinewidth
1 setlinejoin

0 setlinecap

-0 0 m
-2 0 l

gsave
0.000 setgray
fill
grestore
stroke
grestore
} bind def
365.182 197.368 o
grestore
gsave
/o {
gsave
newpath
translate
0.6 setlinewidth
1 setlinejoin

0 setlinecap

-0 0 m
-2 0 l

gsave
0.000 setgray
fill
grestore
stroke
grestore
} bind def
365.182 202.76 o
grestore
gsave
/o {
gsave
newpath
translate
0.6 setlinewidth
1 setlinejoin

0 setlinecap

-0 0 m
-2 0 l

gsave
0.000 setgray
fill
grestore
stroke
grestore
} bind def
365.182 207.43 o
grestore
gsave
/o {
gsave
newpath
translate
0.6 setlinewidth
1 setlinejoin

0 setlinecap

-0 0 m
-2 0 l

gsave
0.000 setgray
fill
grestore
stroke
grestore
} bind def
365.182 211.55 o
grestore
gsave
/o {
gsave
newpath
translate
0.6 setlinewidth
1 setlinejoin

0 setlinecap

-0 0 m
-2 0 l

gsave
0.000 setgray
fill
grestore
stroke
grestore
} bind def
365.182 239.48 o
grestore
gsave
/o {
gsave
newpath
translate
0.6 setlinewidth
1 setlinejoin

0 setlinecap

-0 0 m
-2 0 l

gsave
0.000 setgray
fill
grestore
stroke
grestore
} bind def
365.182 253.662 o
grestore
gsave
/o {
gsave
newpath
translate
0.6 setlinewidth
1 setlinejoin

0 setlinecap

-0 0 m
-2 0 l

gsave
0.000 setgray
fill
grestore
stroke
grestore
} bind def
365.182 263.724 o
grestore
gsave
/o {
gsave
newpath
translate
0.6 setlinewidth
1 setlinejoin

0 setlinecap

-0 0 m
-2 0 l

gsave
0.000 setgray
fill
grestore
stroke
grestore
} bind def
365.182 271.529 o
grestore
/STIXGeneral-Regular 14.000 selectfont
gsave

334.151 97.9953 translate
90 rotate
0 0 m /e glyphshow
6.21599 0 m /x glyphshow
13.216 0 m /e glyphshow
19.432 0 m /c glyphshow
25.648 0 m /u glyphshow
32.648 0 m /t glyphshow
36.54 0 m /i glyphshow
40.432 0 m /o glyphshow
47.432 0 m /n glyphshow
54.432 0 m /space glyphshow
57.932 0 m /t glyphshow
61.824 0 m /i glyphshow
65.716 0 m /m glyphshow
76.608 0 m /e glyphshow
82.8239 0 m /space glyphshow
86.3239 0 m /bracketleft glyphshow
90.9859 0 m /m glyphshow
101.878 0 m /i glyphshow
105.77 0 m /n glyphshow
112.77 0 m /bracketright glyphshow
grestore
1.500 setlinewidth
2 setlinecap
0.122 0.467 0.706 setrgbcolor
gsave
265.258 230.2 365.182 41.606 clipbox
367.503763 69.610827 m
383.95764 103.699019 l
410.221441 141.65225 l
450.401754 173.601186 l
512.867756 204.018158 l
610.65958 237.047351 l
stroke
grestore
1.000 setlinewidth
0 setlinecap
gsave
265.258 230.2 365.182 41.606 clipbox
/o {
gsave
newpath
translate
1.0 setlinewidth
1 setlinejoin

0 setlinecap

-3.5 -3.5 m
3.5 3.5 l
-3.5 3.5 m
3.5 -3.5 l

gsave
0.122 0.467 0.706 setrgbcolor
fill
grestore
stroke
grestore
} bind def
367.504 69.6108 o
383.958 103.699 o
410.221 141.652 o
450.402 173.601 o
512.868 204.018 o
610.66 237.047 o
grestore
1.500 setlinewidth
[5.55 2.4] 0 setdash
1.000 0.498 0.055 setrgbcolor
gsave
265.258 230.2 365.182 41.606 clipbox
365.18205 82.623127 m
380.493424 115.183037 l
404.550222 149.458239 l
442.266583 194.005528 l
500.465405 218.093801 l
591.310445 261.342614 l
stroke
grestore
1.000 setlinewidth
0 setlinejoin
[] 0 setdash
gsave
265.258 230.2 365.182 41.606 clipbox
/o {
gsave
newpath
translate
1.0 setlinewidth
0 setlinejoin

0 setlinecap

3.5 -0 m
-3.5 3.5 l
-3.5 -3.5 l
cl

gsave
1.000 0.498 0.055 setrgbcolor
fill
grestore
stroke
grestore
} bind def
365.182 82.6231 o
380.493 115.183 o
404.55 149.458 o
442.267 194.006 o
500.465 218.094 o
591.31 261.343 o
grestore
1.500 setlinewidth
1 setlinejoin
[1.5 2.475] 0 setdash
0.173 0.627 0.173 setrgbcolor
gsave
265.258 230.2 365.182 41.606 clipbox
369.894301 52.069886 m
387.330088 88.955502 l
415.484296 123.422494 l
458.651634 156.34602 l
525.825299 193.980333 l
630.440022 228.305653 l
stroke
grestore
1.000 setlinewidth
[] 0 setdash
gsave
265.258 230.2 365.182 41.606 clipbox
/o {
gsave
newpath
translate
1.0 setlinewidth
1 setlinejoin

0 setlinecap

0 -1.75 m
0.464105 -1.75 0.909265 -1.565609 1.237437 -1.237437 c
1.565609 -0.909265 1.75 -0.464105 1.75 0 c
1.75 0.464105 1.565609 0.909265 1.237437 1.237437 c
0.909265 1.565609 0.464105 1.75 0 1.75 c
-0.464105 1.75 -0.909265 1.565609 -1.237437 1.237437 c
-1.565609 0.909265 -1.75 0.464105 -1.75 0 c
-1.75 -0.464105 -1.565609 -0.909265 -1.237437 -1.237437 c
-0.909265 -1.565609 -0.464105 -1.75 0 -1.75 c
cl

gsave
0.173 0.627 0.173 setrgbcolor
fill
grestore
stroke
grestore
} bind def
369.894 52.0699 o
387.33 88.9555 o
415.484 123.422 o
458.652 156.346 o
525.825 193.98 o
630.44 228.306 o
grestore
0.800 setlinewidth
0 setlinejoin
2 setlinecap
0.000 setgray
gsave
365.18205 41.60625 m
365.18205 271.80625 l
stroke
grestore
gsave
630.440022 41.60625 m
630.440022 271.80625 l
stroke
grestore
gsave
365.18205 41.60625 m
630.440022 41.60625 l
stroke
grestore
gsave
365.18205 271.80625 m
630.440022 271.80625 l
stroke
grestore
1.000 setlinewidth
0 setlinecap
0.800 setgray
gsave
372.18205 221.259375 m
439.7133 221.259375 l
441.046633 221.259375 441.7133 221.926042 441.7133 223.259375 c
441.7133 264.80625 l
441.7133 266.139583 441.046633 266.80625 439.7133 266.80625 c
372.18205 266.80625 l
370.848717 266.80625 370.18205 266.139583 370.18205 264.80625 c
370.18205 223.259375 l
370.18205 221.926042 370.848717 221.259375 372.18205 221.259375 c
cl
gsave
1.000 setgray
fill
grestore
stroke
grestore
1.500 setlinewidth
1 setlinejoin
2 setlinecap
0.122 0.467 0.706 setrgbcolor
gsave
374.18205 259.30625 m
384.18205 259.30625 l
394.18205 259.30625 l
stroke
grestore
1.000 setlinewidth
0 setlinecap
gsave
/o {
gsave
newpath
translate
1.0 setlinewidth
1 setlinejoin

0 setlinecap

-3.5 -3.5 m
3.5 3.5 l
-3.5 3.5 m
3.5 -3.5 l

gsave
0.122 0.467 0.706 setrgbcolor
fill
grestore
stroke
grestore
} bind def
384.182 259.306 o
grestore
0.000 setgray
/STIXGeneral-Regular 10.000 selectfont
gsave

402.182 255.806 translate
0 rotate
0 0 m /h glyphshow
4.99998 0 m /y glyphshow
9.99997 0 m /b glyphshow
15 0 m /r glyphshow
18.3299 0 m /i glyphshow
21.1099 0 m /d glyphshow
grestore
1.500 setlinewidth
[5.55 2.4] 0 setdash
1.000 0.498 0.055 setrgbcolor
gsave
374.18205 245.11875 m
384.18205 245.11875 l
394.18205 245.11875 l
stroke
grestore
1.000 setlinewidth
0 setlinejoin
[] 0 setdash
gsave
/o {
gsave
newpath
translate
1.0 setlinewidth
0 setlinejoin

0 setlinecap

3.5 -0 m
-3.5 3.5 l
-3.5 -3.5 l
cl

gsave
1.000 0.498 0.055 setrgbcolor
fill
grestore
stroke
grestore
} bind def
384.182 245.119 o
grestore
0.000 setgray
/STIXGeneral-Regular 10.000 selectfont
gsave

402.182 241.619 translate
0 rotate
0 0 m /s glyphshow
3.88998 0 m /c glyphshow
8.32997 0 m /a glyphshow
12.77 0 m /t glyphshow
15.5499 0 m /t glyphshow
18.3299 0 m /e glyphshow
22.7699 0 m /r glyphshow
26.0999 0 m /e glyphshow
30.5399 0 m /d glyphshow
grestore
1.500 setlinewidth
1 setlinejoin
[1.5 2.475] 0 setdash
0.173 0.627 0.173 setrgbcolor
gsave
374.18205 230.946875 m
384.18205 230.946875 l
394.18205 230.946875 l
stroke
grestore
1.000 setlinewidth
[] 0 setdash
gsave
/o {
gsave
newpath
translate
1.0 setlinewidth
1 setlinejoin

0 setlinecap

0 -1.75 m
0.464105 -1.75 0.909265 -1.565609 1.237437 -1.237437 c
1.565609 -0.909265 1.75 -0.464105 1.75 0 c
1.75 0.464105 1.565609 0.909265 1.237437 1.237437 c
0.909265 1.565609 0.464105 1.75 0 1.75 c
-0.464105 1.75 -0.909265 1.565609 -1.237437 1.237437 c
-1.565609 0.909265 -1.75 0.464105 -1.75 0 c
-1.75 -0.464105 -1.565609 -0.909265 -1.237437 -1.237437 c
-0.909265 -1.565609 -0.464105 -1.75 0 -1.75 c
cl

gsave
0.173 0.627 0.173 setrgbcolor
fill
grestore
stroke
grestore
} bind def
384.182 230.947 o
grestore
0.000 setgray
/STIXGeneral-Regular 10.000 selectfont
gsave

402.182 227.447 translate
0 rotate
0 0 m /r glyphshow
3.32999 0 m /e glyphshow
7.76997 0 m /g glyphshow
12.77 0 m /u glyphshow
17.7699 0 m /l glyphshow
20.5499 0 m /a glyphshow
24.9899 0 m /r glyphshow
grestore

end
showpage
