%!PS-Adobe-3.0 EPSF-3.0
%%Title: duck_nusselt_and_delta_h.eps
%%Creator: Matplotlib v3.5.3, https://matplotlib.org/
%%CreationDate: Tue Apr 18 16:30:07 2023
%%Orientation: portrait
%%BoundingBox: 21 273 591 519
%%HiResBoundingBox: 21.600000 273.600000 590.400000 518.400000
%%EndComments
%%BeginProlog
/mpldict 13 dict def
mpldict begin
/_d { bind def } bind def
/m { moveto } _d
/l { lineto } _d
/r { rlineto } _d
/c { curveto } _d
/cl { closepath } _d
/ce { closepath eofill } _d
/box {
      m
      1 index 0 r
      0 exch r
      neg 0 r
      cl
    } _d
/clipbox {
      box
      clip
      newpath
    } _d
/sc { setcachedevice } _d
%!PS-Adobe-3.0 Resource-Font
%%Creator: Converted from TrueType to Type 3 by Matplotlib.
10 dict begin
/FontName /STIXGeneral-Regular def
/PaintType 0 def
/FontMatrix [0.001 0 0 0.001 0 0] def
/FontBBox [-970 -443 2000 1023] def
/FontType 3 def
/Encoding [/space /comma /period /zero /one /two /three /four /five /six /seven /eight /a /b /c /d /e /h /i /l /m /n /o /r /s /t /u /y] def
/CharStrings 29 dict dup begin
/.notdef 0 def
/space{250 0 0 0 0 0 sc
ce} _d
/comma{250 0 55 -141 195 102 sc
83 -141 m
73 -122 l
128 -85 156 -49 156 -15 c
156 -6 151 -2 142 -2 c
139 -2 135 -3 128 -4 c
122 -5 117 -6 113 -6 c
74 -6 55 11 55 45 c
55 62 60 76 71 86 c
82 97 97 102 115 102 c
138 102 157 94 172 77 c
187 61 195 40 195 15 c
195 -16 185 -45 164 -74 c
144 -103 117 -125 83 -141 c

ce} _d
/period{250 0 70 -11 181 100 sc
181 43 m
181 28 175 16 164 5 c
153 -6 140 -11 125 -11 c
110 -11 97 -6 86 5 c
75 16 70 29 70 44 c
70 59 75 72 86 83 c
97 94 111 100 126 100 c
141 100 153 94 164 83 c
175 72 181 58 181 43 c

ce} _d
/zero{500 0 24 -14 476 676 sc
476 330 m
476 285 472 243 463 203 c
454 164 441 127 424 94 c
407 61 384 34 354 15 c
324 -4 289 -14 250 -14 c
209 -14 174 -4 143 17 c
112 38 89 65 72 100 c
55 135 43 172 35 211 c
28 250 24 292 24 336 c
24 398 32 454 47 503 c
62 553 88 594 123 627 c
159 660 203 676 254 676 c
319 676 373 644 414 580 c
455 516 476 433 476 330 c

380 325 m
380 430 369 511 346 566 c
324 622 291 650 248 650 c
207 650 175 622 153 566 c
131 510 120 431 120 329 c
120 226 131 148 153 93 c
175 39 207 12 250 12 c
292 12 324 39 346 93 c
369 148 380 225 380 325 c

ce} _d
/one{500 0 111 0 394 676 sc
394 0 m
118 0 l
118 15 l
155 17 180 24 193 35 c
206 47 213 67 213 95 c
213 544 l
213 577 203 593 183 593 c
174 593 159 589 138 581 c
111 571 l
111 585 l
290 676 l
299 673 l
299 76 l
299 54 306 38 319 29 c
332 20 357 15 394 15 c
394 0 l

ce} _d
/two{500 0 29 0 474 676 sc
474 137 m
420 0 l
29 0 l
29 12 l
207 201 l
254 250 287 294 307 335 c
327 376 337 418 337 461 c
337 506 325 540 300 565 c
275 590 241 602 198 602 c
162 602 133 593 112 574 c
91 555 71 521 51 472 c
30 477 l
41 539 64 588 98 623 c
133 658 179 676 238 676 c
293 676 338 659 372 626 c
406 593 423 551 423 500 c
423 425 380 342 295 252 c
130 76 l
364 76 l
386 76 403 80 416 89 c
429 98 444 116 460 143 c
474 137 l

ce} _d
/three{500 0 41 -14 431 676 sc
61 510 m
45 514 l
60 564 84 603 117 632 c
150 661 191 676 241 676 c
288 676 325 663 354 638 c
383 613 397 580 397 539 c
397 484 366 438 304 401 c
341 385 368 367 387 348 c
416 315 431 272 431 219 c
431 166 416 119 385 79 c
362 48 330 25 287 9 c
245 -6 200 -14 153 -14 c
78 -14 41 5 41 43 c
41 54 45 62 53 69 c
61 76 71 79 82 79 c
99 79 119 70 143 53 c
172 32 201 22 229 22 c
266 22 296 37 321 66 c
346 96 359 132 359 175 c
359 252 324 300 255 320 c
234 327 200 330 153 330 c
153 344 l
190 357 218 369 237 380 c
291 411 318 455 318 514 c
318 547 308 573 289 590 c
270 607 244 616 210 616 c
150 616 100 581 61 510 c

ce} _d
/four{500 0 12 0 473 676 sc
473 167 m
370 167 l
370 0 l
292 0 l
292 167 l
12 167 l
12 231 l
326 676 l
370 676 l
370 231 l
473 231 l
473 167 l

292 231 m
292 574 l
52 231 l
292 231 l

ce} _d
/five{500 0 31 -14 438 688 sc
438 681 m
402 596 l
398 587 389 583 375 583 c
181 583 l
141 498 l
214 484 267 469 300 452 c
333 436 363 409 391 370 c
414 338 426 296 426 243 c
426 195 418 155 402 122 c
387 89 362 60 328 35 c
283 2 226 -14 158 -14 c
120 -14 89 -8 66 3 c
43 14 31 29 31 48 c
31 73 46 86 76 86 c
100 86 125 76 150 55 c
176 34 200 23 221 23 c
256 23 287 40 314 75 c
342 110 356 149 356 192 c
356 256 334 306 289 342 c
231 389 160 412 76 412 c
68 412 64 415 64 420 c
65 425 l
174 662 l
381 662 l
392 662 401 664 407 667 c
414 670 421 677 429 688 c
438 681 l

ce} _d
/six{500 0 34 -14 468 684 sc
446 684 m
448 668 l
369 655 304 623 251 572 c
198 521 165 458 152 383 c
191 413 233 428 279 428 c
338 428 384 409 417 372 c
451 335 468 284 468 219 c
468 154 451 100 417 59 c
378 10 325 -14 258 -14 c
177 -14 118 20 81 87 c
50 144 34 208 34 279 c
34 388 70 480 143 555 c
184 598 227 628 270 645 c
314 663 373 676 446 684 c

378 188 m
378 317 333 382 243 382 c
210 382 182 373 160 355 c
138 338 127 308 127 266 c
127 188 139 126 163 81 c
188 36 223 14 269 14 c
304 14 331 30 350 61 c
369 93 378 135 378 188 c

ce} _d
/seven{500 0 20 -8 449 662 sc
449 646 m
237 -8 l
172 -8 l
370 588 l
155 588 l
126 588 105 583 91 573 c
77 563 59 541 38 506 c
20 515 l
80 662 l
449 662 l
449 646 l

ce} _d
/eight{500 0 56 -14 445 676 sc
445 155 m
445 104 427 63 391 32 c
356 1 308 -14 248 -14 c
192 -14 146 1 110 32 c
74 63 56 102 56 149 c
56 184 65 214 82 239 c
99 264 134 295 186 332 c
136 373 103 407 86 432 c
70 457 62 487 62 520 c
62 567 80 605 116 633 c
153 662 199 676 256 676 c
305 676 345 662 376 634 c
408 607 424 573 424 533 c
424 496 414 467 395 445 c
376 423 341 398 290 371 c
350 331 391 295 412 264 c
434 233 445 196 445 155 c

355 533 m
355 568 345 595 326 616 c
307 637 280 648 246 648 c
212 648 185 639 165 621 c
146 604 136 580 136 549 c
136 518 146 490 165 465 c
185 440 217 415 261 389 c
295 409 319 430 333 452 c
348 475 355 502 355 533 c

271 272 m
212 312 l
183 288 162 264 150 241 c
138 218 132 191 132 158 c
132 113 143 77 166 52 c
189 27 220 14 259 14 c
292 14 318 24 338 44 c
359 65 369 91 369 124 c
369 154 361 180 346 203 c
331 226 306 249 271 272 c

ce} _d
/a{444 0 37 -10 442 460 sc
442 66 m
442 38 l
417 6 387 -10 352 -10 c
314 -10 293 14 288 63 c
287 63 l
244 14 196 -10 142 -10 c
111 -10 85 -1 66 17 c
47 36 37 61 37 94 c
37 141 60 180 107 211 c
139 232 199 259 287 292 c
287 346 l
287 376 280 398 265 413 c
251 428 232 436 209 436 c
189 436 172 431 159 421 c
146 412 139 400 139 387 c
139 381 140 374 142 367 c
144 360 145 352 145 345 c
145 335 140 326 131 317 c
122 308 112 304 99 304 c
88 304 78 308 69 317 c
60 326 56 337 56 350 c
56 382 73 409 107 430 c
138 450 177 460 222 460 c
276 460 315 445 340 415 c
352 401 360 387 363 372 c
366 358 368 335 368 304 c
368 113 l
368 69 378 47 399 47 c
412 47 427 53 442 66 c

287 127 m
287 268 l
226 247 183 225 159 202 c
136 181 125 156 125 125 c
125 100 131 80 144 67 c
157 54 173 48 194 48 c
216 48 235 53 252 64 c
266 74 275 83 280 92 c
285 101 287 112 287 127 c

ce} _d
/b{500 0 3 -10 468 683 sc
153 681 m
153 376 l
164 401 181 422 205 437 c
230 452 257 460 288 460 c
341 460 384 439 417 397 c
451 355 468 303 468 240 c
468 167 446 107 401 60 c
356 13 301 -10 234 -10 c
193 -10 156 -3 121 10 c
86 24 69 39 69 56 c
69 566 l
69 591 66 606 60 613 c
54 620 41 624 20 624 c
15 624 10 623 3 622 c
3 639 l
33 648 l
101 669 139 680 148 683 c
153 681 l

153 318 m
153 74 l
153 59 162 46 181 36 c
200 27 223 22 250 22 c
289 22 320 36 343 65 c
368 96 380 140 380 197 c
380 262 367 313 341 350 c
319 381 289 397 252 397 c
225 397 202 389 182 373 c
163 358 153 339 153 318 c

ce} _d
/c{444 0 25 -10 412 460 sc
398 156 m
412 147 l
383 91 356 53 330 32 c
296 4 258 -10 215 -10 c
160 -10 114 11 78 52 c
43 94 25 147 25 212 c
25 297 53 362 109 409 c
150 443 195 460 244 460 c
286 460 322 450 352 429 c
383 409 398 385 398 357 c
398 346 393 336 384 327 c
375 319 364 315 351 315 c
328 315 312 330 303 361 c
297 383 l
292 402 285 414 277 421 c
269 428 256 431 238 431 c
197 431 164 415 139 383 c
114 351 102 309 102 257 c
102 200 116 153 145 116 c
174 80 211 62 257 62 c
286 62 310 69 331 82 c
352 96 374 121 398 156 c

ce} _d
/d{500 0 27 -10 491 683 sc
491 42 m
344 -10 l
340 -7 l
340 57 l
308 12 265 -10 212 -10 c
157 -10 112 10 78 49 c
44 89 27 141 27 205 c
27 276 47 336 88 385 c
129 435 178 460 235 460 c
271 460 306 446 340 417 c
340 573 l
340 594 337 607 331 614 c
325 621 313 624 294 624 c
285 624 277 624 272 623 c
272 639 l
333 655 382 670 419 683 c
424 681 l
424 114 l
424 91 427 75 432 68 c
438 61 450 57 468 57 c
472 57 480 57 491 58 c
491 42 l

340 102 m
340 332 l
340 359 330 382 309 402 c
289 422 265 432 238 432 c
200 432 170 415 147 381 c
124 347 113 302 113 245 c
113 184 125 134 150 97 c
175 60 209 42 251 42 c
282 42 307 53 325 74 c
335 85 340 95 340 102 c

ce} _d
/e{444 0 25 -10 424 460 sc
408 164 m
424 157 l
384 46 314 -10 215 -10 c
156 -10 110 10 76 51 c
42 92 25 148 25 217 c
25 288 44 347 82 392 c
120 437 170 460 232 460 c
292 460 338 437 371 391 c
390 364 402 326 405 277 c
97 277 l
100 235 104 203 109 181 c
115 159 126 137 143 114 c
171 77 208 59 254 59 c
287 59 314 67 336 83 c
359 99 383 126 408 164 c

99 309 m
303 309 l
297 351 287 381 273 398 c
260 415 237 424 205 424 c
177 424 154 414 135 394 c
116 375 104 346 99 309 c

ce} _d
/h{500 0 9 0 487 683 sc
487 0 m
275 0 l
275 15 l
304 18 323 25 331 35 c
339 45 343 67 343 102 c
343 300 l
343 371 318 406 269 406 c
249 406 231 401 214 392 c
197 383 178 366 157 343 c
157 102 l
157 67 161 45 169 35 c
177 25 196 18 225 15 c
225 0 l
9 0 l
9 15 l
38 19 55 26 62 35 c
69 44 73 67 73 102 c
73 573 l
73 594 70 608 63 614 c
57 621 43 624 22 624 c
16 624 12 624 10 623 c
10 639 l
37 647 l
88 662 127 674 152 683 c
157 680 l
157 376 l
180 406 203 427 226 440 c
249 453 275 460 304 460 c
386 460 427 407 427 301 c
427 102 l
427 67 430 45 436 36 c
443 27 460 20 487 15 c
487 0 l

ce} _d
/i{278 0 16 0 253 683 sc
180 632 m
180 617 175 605 165 595 c
155 586 143 581 128 581 c
114 581 102 586 92 595 c
83 605 78 617 78 632 c
78 646 83 658 93 668 c
103 678 115 683 129 683 c
144 683 156 678 165 668 c
175 658 180 646 180 632 c

253 0 m
16 0 l
16 15 l
51 17 72 23 81 33 c
90 43 95 67 95 104 c
95 331 l
95 354 93 371 88 380 c
83 389 75 394 62 394 c
46 394 32 392 20 389 c
20 405 l
175 460 l
179 456 l
179 105 l
179 68 183 44 191 34 c
200 24 220 18 253 15 c
253 0 l

ce} _d
/l{278 0 19 0 257 683 sc
257 0 m
21 0 l
21 15 l
52 18 73 24 83 34 c
93 45 98 64 98 92 c
98 561 l
98 585 95 602 89 611 c
83 620 72 625 56 625 c
42 625 30 624 19 623 c
19 639 l
82 654 135 669 177 683 c
182 679 l
182 87 l
182 59 187 40 196 31 c
205 22 226 17 257 15 c
257 0 l

ce} _d
/m{778 0 16 0 775 460 sc
775 0 m
557 0 l
557 15 l
585 18 603 23 610 32 c
618 41 622 61 622 90 c
622 296 l
622 336 616 365 604 382 c
593 399 573 408 545 408 c
522 408 502 403 485 394 c
469 385 453 369 438 347 c
438 95 l
438 63 443 42 452 31 c
462 21 481 16 510 15 c
510 0 l
286 0 l
286 15 l
315 17 334 22 342 29 c
350 37 354 56 354 86 c
354 297 l
354 371 332 408 289 408 c
270 408 250 404 229 395 c
208 387 193 377 183 365 c
174 355 170 349 170 348 c
170 70 l
170 49 175 34 184 27 c
193 20 211 16 238 15 c
238 0 l
16 0 l
16 15 l
44 16 63 21 72 30 c
81 40 86 59 86 88 c
86 336 l
86 361 83 378 78 387 c
73 397 64 402 51 402 c
41 402 30 401 19 398 c
19 415 l
64 428 111 443 158 460 c
166 457 l
166 383 l
168 383 l
198 414 224 435 247 445 c
270 455 295 460 321 460 c
374 460 409 432 427 376 c
479 432 533 460 590 460 c
667 460 706 400 706 280 c
706 77 l
706 55 709 40 716 31 c
723 23 734 18 749 17 c
775 15 l
775 0 l

ce} _d
/n{500 0 16 0 485 460 sc
485 0 m
277 0 l
278 15 l
303 17 319 24 327 36 c
336 49 340 72 340 105 c
340 304 l
340 371 316 405 267 405 c
250 405 235 401 220 393 c
205 385 187 370 164 348 c
164 72 l
164 52 168 38 177 30 c
186 22 204 17 229 15 c
229 0 l
18 0 l
18 15 l
43 17 60 23 68 33 c
76 44 80 64 80 94 c
80 337 l
80 362 78 379 73 388 c
68 397 59 402 45 402 c
32 402 22 401 16 398 c
16 415 l
63 428 108 443 153 460 c
161 457 l
161 379 l
162 379 l
209 433 257 460 306 460 c
344 460 373 447 393 420 c
414 393 424 355 424 306 c
424 85 l
424 58 428 41 436 32 c
444 23 460 18 485 15 c
485 0 l

ce} _d
/o{500 0 29 -10 470 460 sc
470 231 m
470 161 449 103 407 58 c
366 13 312 -10 245 -10 c
184 -10 132 12 91 57 c
50 102 29 159 29 228 c
29 297 50 353 91 396 c
132 439 187 460 254 460 c
316 460 367 439 408 396 c
449 354 470 299 470 231 c

380 204 m
380 280 363 339 330 382 c
303 415 272 432 235 432 c
200 432 172 418 151 389 c
130 361 119 322 119 273 c
119 188 137 119 172 68 c
195 35 225 18 262 18 c
299 18 327 34 348 67 c
369 100 380 146 380 204 c

ce} _d
/r{333 0 5 0 335 460 sc
160 458 m
160 366 l
185 402 206 427 223 440 c
240 453 259 460 280 460 c
297 460 311 455 320 446 c
330 437 335 424 335 407 c
335 393 331 382 324 374 c
317 366 308 362 296 362 c
283 362 270 369 256 382 c
245 392 237 397 230 397 c
216 397 201 387 184 368 c
168 349 160 331 160 315 c
160 90 l
160 61 166 42 177 32 c
188 22 211 16 245 15 c
245 0 l
5 0 l
5 15 l
37 21 57 28 64 35 c
72 42 76 59 76 84 c
76 334 l
76 356 73 371 68 380 c
63 389 55 394 42 394 c
31 394 20 393 7 390 c
7 406 l
49 419 98 437 155 460 c
160 458 l

ce} _d
/s{389 0 51 -10 348 459 sc
156 301 m
260 238 l
293 218 316 199 329 182 c
342 165 348 142 348 115 c
348 82 334 52 306 27 c
279 2 246 -10 208 -10 c
177 -10 152 -7 135 -1 c
117 5 102 8 89 8 c
78 8 70 4 65 -4 c
52 -4 l
52 153 l
68 153 l
79 104 94 69 114 46 c
134 23 161 12 195 12 c
220 12 240 19 255 33 c
270 47 278 65 278 86 c
278 117 260 142 225 161 c
171 191 l
91 236 51 284 51 336 c
51 375 63 405 88 426 c
113 448 147 459 189 459 c
218 459 241 455 256 448 c
268 443 277 440 284 440 c
289 440 294 443 300 450 c
311 450 l
316 314 l
301 314 l
290 359 275 391 258 409 c
241 428 218 437 188 437 c
165 437 147 431 133 420 c
120 409 113 392 113 369 c
113 358 117 345 124 332 c
132 319 143 309 156 301 c

ce} _d
/t{278 0 13 -10 279 579 sc
266 77 m
279 66 l
247 15 207 -10 158 -10 c
99 -10 70 32 70 117 c
70 418 l
17 418 l
14 420 13 422 13 425 c
13 430 19 437 30 444 c
55 459 88 494 127 551 c
128 553 131 557 136 563 c
141 570 145 575 147 579 c
152 579 154 575 154 566 c
154 450 l
255 450 l
255 418 l
154 418 l
154 132 l
154 100 158 77 166 63 c
174 49 187 42 206 42 c
226 42 246 54 266 77 c

ce} _d
/u{500 0 9 -10 480 450 sc
480 50 m
480 36 l
428 22 382 7 343 -9 c
338 -6 l
338 76 l
336 76 l
294 19 246 -10 193 -10 c
155 -10 125 2 103 25 c
82 48 71 79 71 118 c
71 369 l
71 394 67 411 58 420 c
49 429 33 435 9 436 c
9 450 l
155 450 l
155 127 l
155 104 162 85 175 70 c
189 55 206 48 226 48 c
259 48 287 58 310 79 c
319 87 325 94 328 101 c
331 108 333 120 333 137 c
333 368 l
333 394 328 411 319 418 c
310 426 290 431 259 433 c
259 450 l
417 450 l
417 107 l
417 84 421 68 428 61 c
436 54 451 50 474 50 c
480 50 l

ce} _d
/y{500 0 14 -218 475 450 sc
475 450 m
475 435 l
463 434 453 429 446 422 c
439 415 432 402 425 384 c
275 -25 l
249 -96 223 -145 196 -174 c
170 -203 138 -218 100 -218 c
79 -218 62 -212 49 -201 c
36 -190 30 -177 30 -160 c
30 -147 34 -136 42 -127 c
51 -118 61 -114 73 -114 c
92 -114 110 -118 125 -127 c
134 -132 142 -134 151 -134 c
165 -134 182 -119 201 -90 c
210 -77 219 -58 228 -33 c
237 -8 241 9 241 18 c
241 27 227 60 199 119 c
67 401 l
58 420 41 432 14 436 c
14 450 l
219 450 l
219 435 l
198 434 183 432 174 428 c
166 424 162 417 162 408 c
162 401 166 387 175 367 c
287 117 l
384 393 l
387 399 388 405 388 411 c
388 427 373 435 342 435 c
342 450 l
475 450 l

ce} _d
end readonly def

/BuildGlyph {
 exch begin
 CharStrings exch
 2 copy known not {pop /.notdef} if
 true 3 1 roll get exec
 end
} _d

/BuildChar {
 1 index /Encoding get exch get
 1 index /BuildGlyph get exec
} _d

FontName currentdict end definefont pop
%!PS-Adobe-3.0 Resource-Font
%%Creator: Converted from TrueType to Type 3 by Matplotlib.
10 dict begin
/FontName /Cmr10 def
/PaintType 0 def
/FontMatrix [0.00048828125 0 0 0.00048828125 0 0] def
/FontBBox [-90 -512 2066 1536] def
/FontType 3 def
/Encoding [/N /zero /four /u /seven /equal] def
/CharStrings 7 dict dup begin
/.notdef 0 def
/N{1536 0 63 0 1470 1399 sc
63 0 m
63 72 l
204 72 274 112 274 193 c
274 1315 l
229 1323 159 1327 63 1327 c
63 1399 l
455 1399 l
462 1399 466 1396 469 1391 c
1194 324 l
1194 1206 l
1194 1287 1124 1327 983 1327 c
983 1399 l
1470 1399 l
1470 1327 l
1330 1327 1260 1287 1260 1206 c
1260 18 l
1260 14 1257 10 1252 6 c
1247 2 1242 0 1239 0 c
1214 0 l
1207 0 1203 3 1200 8 c
340 1274 l
340 193 l
340 112 410 72 551 72 c
551 0 l
63 0 l

ce} _d
/zero{1024 0 80 -45 942 1364 sc
512 -45 m
345 -45 231 24 170 161 c
110 299 80 463 80 653 c
80 772 91 883 112 988 c
134 1093 177 1181 241 1254 c
306 1327 396 1364 512 1364 c
602 1364 676 1342 733 1298 c
790 1254 834 1197 864 1127 c
894 1058 914 983 925 903 c
936 824 942 740 942 653 c
942 536 931 426 909 323 c
888 221 845 134 782 62 c
719 -9 629 -45 512 -45 c

512 8 m
588 8 645 47 682 125 c
719 203 742 289 751 384 c
760 479 764 579 764 686 c
764 789 760 883 751 970 c
742 1057 719 1135 682 1205 c
645 1276 589 1311 512 1311 c
435 1311 377 1276 340 1205 c
303 1134 280 1056 271 969 c
262 883 258 789 258 686 c
258 610 260 538 263 471 c
267 404 277 334 293 262 c
309 191 335 130 370 81 c
406 32 453 8 512 8 c

ce} _d
/four{1024 0 57 0 965 1364 sc
57 338 m
57 410 l
690 1354 l
695 1361 702 1364 711 1364 c
741 1364 l
756 1364 764 1356 764 1341 c
764 410 l
965 410 l
965 338 l
764 338 l
764 137 l
764 109 784 91 824 83 c
864 76 910 72 963 72 c
963 0 l
399 0 l
399 72 l
452 72 498 76 538 83 c
578 91 598 109 598 137 c
598 338 l
57 338 l

125 410 m
610 410 l
610 1135 l
125 410 l

ce} _d
/u{1137 0 61 -23 1100 905 sc
221 244 m
221 696 l
221 733 215 759 204 775 c
193 792 178 802 157 805 c
136 809 104 811 61 811 c
61 883 l
371 905 l
371 244 l
371 191 375 149 382 119 c
390 90 406 68 431 53 c
456 38 496 31 551 31 c
624 31 683 62 726 123 c
769 184 791 254 791 332 c
791 696 l
791 733 785 759 774 775 c
763 792 747 802 726 805 c
706 809 674 811 631 811 c
631 883 l
940 905 l
940 186 l
940 150 945 124 956 107 c
967 91 983 81 1004 77 c
1025 74 1057 72 1100 72 c
1100 0 l
797 -23 l
797 150 l
772 99 736 57 691 25 c
646 -7 596 -23 541 -23 c
443 -23 365 -2 307 39 c
250 81 221 149 221 244 c

ce} _d
/seven{1024 0 115 -45 993 1384 sc
356 53 m
356 129 363 203 376 276 c
389 349 409 420 434 491 c
460 562 491 632 527 700 c
564 769 604 833 647 893 c
834 1153 l
600 1153 l
357 1153 232 1150 225 1143 c
207 1121 190 1058 174 954 c
115 954 l
182 1384 l
242 1384 l
242 1378 l
242 1353 284 1337 367 1330 c
450 1323 532 1319 612 1319 c
993 1319 l
993 1266 l
993 1265 993 1264 992 1263 c
992 1262 992 1261 991 1260 c
709 864 l
640 761 596 647 579 522 c
562 397 553 240 553 53 c
553 26 543 3 524 -16 c
505 -35 482 -45 455 -45 c
428 -45 404 -35 385 -16 c
366 3 356 26 356 53 c

ce} _d
/equal{1591 0 115 272 1477 752 sc
154 272 m
143 272 133 276 126 285 c
119 294 115 303 115 313 c
115 324 119 334 126 342 c
133 350 143 354 154 354 c
1440 354 l
1450 354 1459 350 1466 342 c
1473 334 1477 324 1477 313 c
1477 303 1473 294 1466 285 c
1459 276 1450 272 1440 272 c
154 272 l

154 670 m
143 670 133 674 126 682 c
119 690 115 700 115 711 c
115 721 119 730 126 739 c
133 748 143 752 154 752 c
1440 752 l
1450 752 1459 748 1466 739 c
1473 730 1477 721 1477 711 c
1477 700 1473 690 1466 682 c
1459 674 1450 670 1440 670 c
154 670 l

ce} _d
end readonly def

/BuildGlyph {
 exch begin
 CharStrings exch
 2 copy known not {pop /.notdef} if
 true 3 1 roll get exec
 end
} _d

/BuildChar {
 1 index /Encoding get exch get
 1 index /BuildGlyph get exec
} _d

FontName currentdict end definefont pop
%!PS-Adobe-3.0 Resource-Font
%%Creator: Converted from TrueType to Type 3 by Matplotlib.
10 dict begin
/FontName /Cmmi10 def
/PaintType 0 def
/FontMatrix [0.00048828125 0 0 0.00048828125 0 0] def
/FontBBox [-70 -512 2146 1536] def
/FontType 3 def
/Encoding [/h /delta] def
/CharStrings 3 dict dup begin
/.notdef 0 def
/h{1180 0 109 -23 1124 1421 sc
109 37 m
109 45 110 51 111 55 c
408 1239 l
413 1262 417 1281 418 1294 c
418 1316 374 1327 285 1327 c
271 1327 264 1336 264 1354 c
265 1357 266 1363 268 1372 c
271 1381 274 1387 277 1392 c
281 1397 286 1399 293 1399 c
569 1421 l
575 1421 l
575 1420 577 1418 582 1415 c
587 1413 589 1412 590 1411 c
593 1404 594 1399 594 1395 c
434 756 l
518 855 618 905 733 905 c
781 905 822 897 857 880 c
892 863 920 838 939 804 c
959 771 969 731 969 684 c
969 628 956 560 931 481 c
906 402 875 313 838 215 c
819 170 809 129 809 92 c
809 51 825 31 856 31 c
909 31 954 59 989 116 c
1025 173 1050 235 1065 301 c
1068 309 1073 313 1081 313 c
1106 313 l
1111 313 1116 311 1119 307 c
1122 304 1124 300 1124 295 c
1124 294 1123 292 1122 289 c
1110 240 1092 191 1068 143 c
1045 96 1015 56 979 24 c
943 -7 901 -23 852 -23 c
804 -23 763 -7 729 26 c
695 59 678 100 678 147 c
678 172 683 199 694 227 c
733 330 765 421 790 502 c
816 583 829 654 829 715 c
829 754 821 787 806 813 c
791 839 765 852 729 852 c
656 852 592 829 537 784 c
482 739 435 680 395 606 c
256 47 l
251 26 240 10 225 -3 c
210 -16 192 -23 172 -23 c
155 -23 140 -17 127 -5 c
115 6 109 20 109 37 c

ce} _d
/delta{909 0 82 -31 924 1460 sc
410 -31 m
363 -31 319 -22 278 -4 c
237 13 202 39 171 72 c
141 105 119 142 104 183 c
89 224 82 269 82 317 c
82 402 102 485 142 565 c
183 646 238 715 307 774 c
377 833 453 872 535 893 c
495 967 464 1031 443 1084 c
422 1138 412 1193 412 1249 c
412 1290 422 1327 441 1358 c
460 1390 487 1415 521 1433 c
555 1451 593 1460 635 1460 c
676 1460 756 1446 877 1419 c
908 1412 924 1393 924 1364 c
924 1341 916 1321 899 1302 c
882 1283 863 1274 840 1274 c
823 1274 808 1278 795 1285 c
782 1293 761 1307 732 1326 c
703 1345 678 1360 655 1370 c
632 1381 609 1386 584 1386 c
556 1386 531 1377 508 1360 c
486 1343 475 1321 475 1294 c
475 1251 494 1201 532 1144 c
571 1088 625 1016 696 928 c
777 825 817 712 817 588 c
817 527 808 460 790 389 c
773 318 747 250 713 187 c
680 124 637 71 584 30 c
532 -11 474 -31 410 -31 c

414 25 m
467 25 513 53 551 108 c
590 163 619 229 638 305 c
658 382 668 446 668 498 c
668 600 632 715 561 842 c
489 822 427 780 375 716 c
323 652 284 578 257 495 c
230 412 217 333 217 258 c
217 193 234 137 268 92 c
302 47 351 25 414 25 c

ce} _d
end readonly def

/BuildGlyph {
 exch begin
 CharStrings exch
 2 copy known not {pop /.notdef} if
 true 3 1 roll get exec
 end
} _d

/BuildChar {
 1 index /Encoding get exch get
 1 index /BuildGlyph get exec
} _d

FontName currentdict end definefont pop
end
%%EndProlog
mpldict begin
21.6 273.6 translate
568.8 244.8 0 0 clipbox
gsave
0 0 m
568.8 0 l
568.8 244.8 l
0 244.8 l
cl
1.000 setgray
fill
grestore
gsave
45.2 42.0125 m
350.916066 42.0125 l
350.916066 237.6 l
45.2 237.6 l
cl
1.000 setgray
fill
grestore
0.800 setlinewidth
1 setlinejoin
2 setlinecap
[] 0 setdash
0.690 setgray
gsave
305.716 195.587 45.2 42.013 clipbox
58.165905 42.0125 m
58.165905 237.6 l
stroke
grestore
0 setlinecap
0.000 setgray
gsave
/o {
gsave
newpath
translate
0.8 setlinewidth
1 setlinejoin

0 setlinecap

0 0 m
0 -3.5 l

gsave
0.000 setgray
fill
grestore
stroke
grestore
} bind def
58.1659 42.0125 o
grestore
gsave
44.665905 26.809375 translate
0.000000 rotate
/STIXGeneral-Regular 12.0 selectfont
0.000000 0.890625 moveto
/zero glyphshow
5.999985 0.890625 moveto
/period glyphshow
8.999969 0.890625 moveto
/zero glyphshow
14.999954 0.890625 moveto
/zero glyphshow
20.999939 0.890625 moveto
/zero glyphshow
grestore
2 setlinecap
0.690 setgray
gsave
305.716 195.587 45.2 42.013 clipbox
104.641535 42.0125 m
104.641535 237.6 l
stroke
grestore
0 setlinecap
0.000 setgray
gsave
/o {
gsave
newpath
translate
0.8 setlinewidth
1 setlinejoin

0 setlinecap

0 0 m
0 -3.5 l

gsave
0.000 setgray
fill
grestore
stroke
grestore
} bind def
104.642 42.0125 o
grestore
gsave
91.141535 26.809375 translate
0.000000 rotate
/STIXGeneral-Regular 12.0 selectfont
0.000000 0.750000 moveto
/zero glyphshow
5.999985 0.750000 moveto
/period glyphshow
8.999969 0.750000 moveto
/zero glyphshow
14.999954 0.750000 moveto
/two glyphshow
20.999939 0.750000 moveto
/five glyphshow
grestore
2 setlinecap
0.690 setgray
gsave
305.716 195.587 45.2 42.013 clipbox
151.117166 42.0125 m
151.117166 237.6 l
stroke
grestore
0 setlinecap
0.000 setgray
gsave
/o {
gsave
newpath
translate
0.8 setlinewidth
1 setlinejoin

0 setlinecap

0 0 m
0 -3.5 l

gsave
0.000 setgray
fill
grestore
stroke
grestore
} bind def
151.117 42.0125 o
grestore
gsave
137.617166 26.809375 translate
0.000000 rotate
/STIXGeneral-Regular 12.0 selectfont
0.000000 0.750000 moveto
/zero glyphshow
5.999985 0.750000 moveto
/period glyphshow
8.999969 0.750000 moveto
/zero glyphshow
14.999954 0.750000 moveto
/five glyphshow
20.999939 0.750000 moveto
/zero glyphshow
grestore
2 setlinecap
0.690 setgray
gsave
305.716 195.587 45.2 42.013 clipbox
197.592796 42.0125 m
197.592796 237.6 l
stroke
grestore
0 setlinecap
0.000 setgray
gsave
/o {
gsave
newpath
translate
0.8 setlinewidth
1 setlinejoin

0 setlinecap

0 0 m
0 -3.5 l

gsave
0.000 setgray
fill
grestore
stroke
grestore
} bind def
197.593 42.0125 o
grestore
gsave
184.092796 26.809375 translate
0.000000 rotate
/STIXGeneral-Regular 12.0 selectfont
0.000000 0.750000 moveto
/zero glyphshow
5.999985 0.750000 moveto
/period glyphshow
8.999969 0.750000 moveto
/zero glyphshow
14.999954 0.750000 moveto
/seven glyphshow
20.999939 0.750000 moveto
/five glyphshow
grestore
2 setlinecap
0.690 setgray
gsave
305.716 195.587 45.2 42.013 clipbox
244.068426 42.0125 m
244.068426 237.6 l
stroke
grestore
0 setlinecap
0.000 setgray
gsave
/o {
gsave
newpath
translate
0.8 setlinewidth
1 setlinejoin

0 setlinecap

0 0 m
0 -3.5 l

gsave
0.000 setgray
fill
grestore
stroke
grestore
} bind def
244.068 42.0125 o
grestore
gsave
230.568426 26.809375 translate
0.000000 rotate
/STIXGeneral-Regular 12.0 selectfont
0.000000 0.890625 moveto
/zero glyphshow
5.999985 0.890625 moveto
/period glyphshow
8.999969 0.890625 moveto
/one glyphshow
14.999954 0.890625 moveto
/zero glyphshow
20.999939 0.890625 moveto
/zero glyphshow
grestore
2 setlinecap
0.690 setgray
gsave
305.716 195.587 45.2 42.013 clipbox
290.544056 42.0125 m
290.544056 237.6 l
stroke
grestore
0 setlinecap
0.000 setgray
gsave
/o {
gsave
newpath
translate
0.8 setlinewidth
1 setlinejoin

0 setlinecap

0 0 m
0 -3.5 l

gsave
0.000 setgray
fill
grestore
stroke
grestore
} bind def
290.544 42.0125 o
grestore
gsave
277.044056 26.809375 translate
0.000000 rotate
/STIXGeneral-Regular 12.0 selectfont
0.000000 0.750000 moveto
/zero glyphshow
5.999985 0.750000 moveto
/period glyphshow
8.999969 0.750000 moveto
/one glyphshow
14.999954 0.750000 moveto
/two glyphshow
20.999939 0.750000 moveto
/five glyphshow
grestore
2 setlinecap
0.690 setgray
gsave
305.716 195.587 45.2 42.013 clipbox
337.019686 42.0125 m
337.019686 237.6 l
stroke
grestore
0 setlinecap
0.000 setgray
gsave
/o {
gsave
newpath
translate
0.8 setlinewidth
1 setlinejoin

0 setlinecap

0 0 m
0 -3.5 l

gsave
0.000 setgray
fill
grestore
stroke
grestore
} bind def
337.02 42.0125 o
grestore
gsave
323.519686 26.809375 translate
0.000000 rotate
/STIXGeneral-Regular 12.0 selectfont
0.000000 0.750000 moveto
/zero glyphshow
5.999985 0.750000 moveto
/period glyphshow
8.999969 0.750000 moveto
/one glyphshow
14.999954 0.750000 moveto
/five glyphshow
20.999939 0.750000 moveto
/zero glyphshow
grestore
/STIXGeneral-Regular 14.000 selectfont
gsave

154.300220 10.637500 translate
0.000000 rotate
0.000000 0 m /s glyphshow
5.445999 0 m /i glyphshow
9.337997 0 m /m glyphshow
20.229996 0 m /u glyphshow
27.229996 0 m /l glyphshow
31.121994 0 m /a glyphshow
37.337982 0 m /t glyphshow
41.229980 0 m /i glyphshow
45.121979 0 m /o glyphshow
52.121979 0 m /n glyphshow
59.121979 0 m /space glyphshow
62.621979 0 m /t glyphshow
66.513977 0 m /i glyphshow
70.405975 0 m /m glyphshow
81.297974 0 m /e glyphshow
grestore
2 setlinecap
0.690 setgray
gsave
305.716 195.587 45.2 42.013 clipbox
45.2 50.902841 m
350.916066 50.902841 l
stroke
grestore
0 setlinecap
0.000 setgray
gsave
/o {
gsave
newpath
translate
0.8 setlinewidth
1 setlinejoin

0 setlinecap

-0 0 m
-3.5 0 l

gsave
0.000 setgray
fill
grestore
stroke
grestore
} bind def
45.2 50.9028 o
grestore
gsave
32.200000 46.801278 translate
0.000000 rotate
/STIXGeneral-Regular 12.0 selectfont
0.000000 0.890625 moveto
/zero glyphshow
grestore
2 setlinecap
0.690 setgray
gsave
305.716 195.587 45.2 42.013 clipbox
45.2 79.126145 m
350.916066 79.126145 l
stroke
grestore
0 setlinecap
0.000 setgray
gsave
/o {
gsave
newpath
translate
0.8 setlinewidth
1 setlinejoin

0 setlinecap

-0 0 m
-3.5 0 l

gsave
0.000 setgray
fill
grestore
stroke
grestore
} bind def
45.2 79.1261 o
grestore
gsave
32.200000 75.024583 translate
0.000000 rotate
/STIXGeneral-Regular 12.0 selectfont
0.000000 0.890625 moveto
/two glyphshow
grestore
2 setlinecap
0.690 setgray
gsave
305.716 195.587 45.2 42.013 clipbox
45.2 107.34945 m
350.916066 107.34945 l
stroke
grestore
0 setlinecap
0.000 setgray
gsave
/o {
gsave
newpath
translate
0.8 setlinewidth
1 setlinejoin

0 setlinecap

-0 0 m
-3.5 0 l

gsave
0.000 setgray
fill
grestore
stroke
grestore
} bind def
45.2 107.349 o
grestore
gsave
32.200000 103.247887 translate
0.000000 rotate
/STIXGeneral-Regular 12.0 selectfont
0.000000 0.890625 moveto
/four glyphshow
grestore
2 setlinecap
0.690 setgray
gsave
305.716 195.587 45.2 42.013 clipbox
45.2 135.572754 m
350.916066 135.572754 l
stroke
grestore
0 setlinecap
0.000 setgray
gsave
/o {
gsave
newpath
translate
0.8 setlinewidth
1 setlinejoin

0 setlinecap

-0 0 m
-3.5 0 l

gsave
0.000 setgray
fill
grestore
stroke
grestore
} bind def
45.2 135.573 o
grestore
gsave
32.200000 131.471192 translate
0.000000 rotate
/STIXGeneral-Regular 12.0 selectfont
0.000000 0.796875 moveto
/six glyphshow
grestore
2 setlinecap
0.690 setgray
gsave
305.716 195.587 45.2 42.013 clipbox
45.2 163.796059 m
350.916066 163.796059 l
stroke
grestore
0 setlinecap
0.000 setgray
gsave
/o {
gsave
newpath
translate
0.8 setlinewidth
1 setlinejoin

0 setlinecap

-0 0 m
-3.5 0 l

gsave
0.000 setgray
fill
grestore
stroke
grestore
} bind def
45.2 163.796 o
grestore
gsave
32.200000 159.694496 translate
0.000000 rotate
/STIXGeneral-Regular 12.0 selectfont
0.000000 0.890625 moveto
/eight glyphshow
grestore
2 setlinecap
0.690 setgray
gsave
305.716 195.587 45.2 42.013 clipbox
45.2 192.019363 m
350.916066 192.019363 l
stroke
grestore
0 setlinecap
0.000 setgray
gsave
/o {
gsave
newpath
translate
0.8 setlinewidth
1 setlinejoin

0 setlinecap

-0 0 m
-3.5 0 l

gsave
0.000 setgray
fill
grestore
stroke
grestore
} bind def
45.2 192.019 o
grestore
gsave
26.200000 187.917801 translate
0.000000 rotate
/STIXGeneral-Regular 12.0 selectfont
0.000000 0.890625 moveto
/one glyphshow
5.999985 0.890625 moveto
/zero glyphshow
grestore
2 setlinecap
0.690 setgray
gsave
305.716 195.587 45.2 42.013 clipbox
45.2 220.242668 m
350.916066 220.242668 l
stroke
grestore
0 setlinecap
0.000 setgray
gsave
/o {
gsave
newpath
translate
0.8 setlinewidth
1 setlinejoin

0 setlinecap

-0 0 m
-3.5 0 l

gsave
0.000 setgray
fill
grestore
stroke
grestore
} bind def
45.2 220.243 o
grestore
gsave
26.200000 216.141105 translate
0.000000 rotate
/STIXGeneral-Regular 12.0 selectfont
0.000000 0.890625 moveto
/one glyphshow
5.999985 0.890625 moveto
/two glyphshow
grestore
gsave
19.168750 130.306250 translate
90.000000 rotate
/Cmr10 14.0 selectfont
0.000000 0.562500 moveto
/N glyphshow
10.500000 0.562500 moveto
/u glyphshow
0.0 12.25 18.2724609375 0.875 rectfill
grestore
1.500 setlinewidth
2 setlinecap
1.000 0.498 0.055 setrgbcolor
gsave
305.716 195.587 45.2 42.013 clipbox
60.955053 50.902849 m
63.744201 53.963167 l
66.533349 93.301823 l
69.322497 117.292802 l
72.111645 103.606725 l
74.900793 108.147604 l
77.689941 128.561877 l
80.479088 134.387737 l
83.268236 134.024247 l
86.057384 126.149129 l
88.846532 119.015904 l
91.63568 125.318288 l
94.424828 147.951112 l
97.213976 172.121722 l
100.003124 176.430745 l
102.792271 163.460834 l
105.581419 154.625054 l
108.370567 157.334312 l
111.159715 172.662604 l
113.948863 186.278797 l
116.738011 198.333446 l
119.527159 203.192049 l
122.316307 198.501148 l
125.105455 195.767844 l
127.894602 197.567201 l
130.68375 198.859664 l
133.472898 199.807039 l
136.262046 201.400553 l
139.051194 203.04846 l
141.840342 204.401238 l
144.62949 205.180966 l
147.418638 205.419741 l
150.207786 205.777293 l
152.996933 206.709728 l
155.786081 207.968168 l
158.575229 209.048653 l
161.364377 209.9568 l
164.153525 210.908448 l
166.942673 211.865649 l
169.731821 212.732571 l
172.520969 213.480899 l
175.310116 214.139328 l
178.099264 214.778627 l
180.888412 215.43082 l
183.67756 216.04917 l
186.466708 216.606289 l
189.255856 217.129477 l
192.045004 217.636941 l
194.834152 218.122206 l
197.6233 218.577172 l
200.412447 219.001535 l
203.201595 219.401868 l
205.990743 219.785498 l
208.779891 220.150877 l
211.569039 220.493856 l
214.358187 220.816509 l
217.147335 221.122815 l
219.936483 221.413681 l
222.725631 221.688641 l
225.514778 221.948083 l
228.303926 222.193077 l
231.093074 222.425009 l
233.882222 222.644594 l
236.67137 222.851984 l
239.460518 223.047672 l
242.249666 223.232545 l
245.038814 223.407281 l
247.827961 223.572298 l
250.617109 223.728049 l
253.406257 223.875032 l
256.195405 224.01377 l
258.984553 224.144729 l
261.773701 224.268309 l
264.562849 224.384881 l
267.351997 224.494842 l
270.141145 224.598575 l
272.930292 224.696419 l
275.71944 224.788694 l
278.508588 224.875706 l
281.297736 224.957754 l
284.086884 225.035118 l
286.876032 225.108064 l
289.66518 225.176835 l
292.454328 225.241669 l
295.243476 225.30279 l
298.032623 225.36041 l
300.821771 225.414727 l
303.610919 225.465929 l
306.400067 225.514195 l
309.189215 225.559692 l
311.978363 225.60258 l
314.767511 225.643007 l
317.556659 225.681114 l
320.345806 225.717036 l
323.134954 225.750898 l
325.924102 225.782819 l
328.71325 225.812909 l
331.502398 225.841276 l
334.291546 225.868017 l
337.019881 225.892693 l
stroke
grestore
1.000 setlinewidth
0 setlinecap
gsave
305.716 195.587 45.2 42.013 clipbox
/o {
gsave
newpath
translate
1.0 setlinewidth
1 setlinejoin

0 setlinecap

0 -2.5 m
0.663008 -2.5 1.29895 -2.236584 1.767767 -1.767767 c
2.236584 -1.29895 2.5 -0.663008 2.5 0 c
2.5 0.663008 2.236584 1.29895 1.767767 1.767767 c
1.29895 2.236584 0.663008 2.5 0 2.5 c
-0.663008 2.5 -1.29895 2.236584 -1.767767 1.767767 c
-2.236584 1.29895 -2.5 0.663008 -2.5 0 c
-2.5 -0.663008 -2.236584 -1.29895 -1.767767 -1.767767 c
-1.29895 -2.236584 -0.663008 -2.5 0 -2.5 c
cl

gsave
grestore
stroke
grestore
} bind def
60.9551 50.9028 o
63.7442 53.9632 o
66.5333 93.3018 o
69.3225 117.293 o
72.1116 103.607 o
74.9008 108.148 o
77.6899 128.562 o
80.4791 134.388 o
83.2682 134.024 o
86.0574 126.149 o
88.8465 119.016 o
91.6357 125.318 o
94.4248 147.951 o
97.214 172.122 o
100.003 176.431 o
102.792 163.461 o
105.581 154.625 o
108.371 157.334 o
111.16 172.663 o
113.949 186.279 o
116.738 198.333 o
119.527 203.192 o
122.316 198.501 o
125.105 195.768 o
127.895 197.567 o
130.684 198.86 o
133.473 199.807 o
136.262 201.401 o
139.051 203.048 o
141.84 204.401 o
144.629 205.181 o
147.419 205.42 o
150.208 205.777 o
152.997 206.71 o
155.786 207.968 o
158.575 209.049 o
161.364 209.957 o
164.154 210.908 o
166.943 211.866 o
169.732 212.733 o
172.521 213.481 o
175.31 214.139 o
178.099 214.779 o
180.888 215.431 o
183.678 216.049 o
186.467 216.606 o
189.256 217.129 o
192.045 217.637 o
194.834 218.122 o
197.623 218.577 o
200.412 219.002 o
203.202 219.402 o
205.991 219.785 o
208.78 220.151 o
211.569 220.494 o
214.358 220.817 o
217.147 221.123 o
219.936 221.414 o
222.726 221.689 o
225.515 221.948 o
228.304 222.193 o
231.093 222.425 o
233.882 222.645 o
236.671 222.852 o
239.461 223.048 o
242.25 223.233 o
245.039 223.407 o
247.828 223.572 o
250.617 223.728 o
253.406 223.875 o
256.195 224.014 o
258.985 224.145 o
261.774 224.268 o
264.563 224.385 o
267.352 224.495 o
270.141 224.599 o
272.93 224.696 o
275.719 224.789 o
278.509 224.876 o
281.298 224.958 o
284.087 225.035 o
286.876 225.108 o
289.665 225.177 o
292.454 225.242 o
295.243 225.303 o
298.033 225.36 o
300.822 225.415 o
303.611 225.466 o
306.4 225.514 o
309.189 225.56 o
311.978 225.603 o
314.768 225.643 o
317.557 225.681 o
320.346 225.717 o
323.135 225.751 o
325.924 225.783 o
328.713 225.813 o
331.502 225.841 o
334.292 225.868 o
337.02 225.893 o
grestore
1.500 setlinewidth
2 setlinecap
0.173 0.627 0.173 setrgbcolor
gsave
305.716 195.587 45.2 42.013 clipbox
60.955053 50.902861 m
63.744201 55.734944 l
66.533349 104.64916 l
69.322497 118.007191 l
72.111645 105.387057 l
74.900793 106.937182 l
77.689941 122.454127 l
80.479088 123.16602 l
83.268236 114.560043 l
86.057384 111.157183 l
88.846532 121.941484 l
91.63568 144.132343 l
94.424828 166.548086 l
97.213976 173.542552 l
100.003124 162.668702 l
102.792271 156.493707 l
105.581419 160.866101 l
108.370567 177.185467 l
111.159715 190.168829 l
113.948863 199.987538 l
116.738011 203.091925 l
119.527159 199.290665 l
122.316307 197.538664 l
125.105455 199.650738 l
127.894602 200.27651 l
130.68375 200.138822 l
133.472898 201.535744 l
136.262046 203.62316 l
139.051194 204.744727 l
141.840342 204.621789 l
144.62949 204.347696 l
147.418638 205.163688 l
150.207786 206.684407 l
152.996933 207.849777 l
155.786081 208.722679 l
158.575229 209.858105 l
161.364377 211.143272 l
164.153525 212.204074 l
166.942673 212.957807 l
169.731821 213.588185 l
172.520969 214.284197 l
175.310116 215.005553 l
178.099264 215.610128 l
180.888412 216.126048 l
183.67756 216.658278 l
186.466708 217.202215 l
189.255856 217.702237 l
192.045004 218.14995 l
194.834152 218.574726 l
197.6233 218.996046 l
200.412447 219.400446 l
203.201595 219.769831 l
205.990743 220.113326 l
208.779891 220.445087 l
211.569039 220.76123 l
214.358187 221.054554 l
217.147335 221.327678 l
219.936483 221.586057 l
222.725631 221.831016 l
225.514778 222.060661 l
228.303926 222.274869 l
231.093074 222.476436 l
233.882222 222.666955 l
236.67137 222.845818 l
239.460518 223.013267 l
242.249666 223.170722 l
245.038814 223.318986 l
247.827961 223.458247 l
250.617109 223.588891 l
253.406257 223.711591 l
256.195405 223.826924 l
258.984553 223.935222 l
261.773701 224.036807 l
264.562849 224.132165 l
267.351997 224.221714 l
270.141145 224.305732 l
272.930292 224.384538 l
275.71944 224.458497 l
278.508588 224.527905 l
281.297736 224.593012 l
284.086884 224.654085 l
286.876032 224.711391 l
289.66518 224.765163 l
292.454328 224.815605 l
295.243476 224.862924 l
298.032623 224.907324 l
300.821771 224.948986 l
303.610919 224.988069 l
306.400067 225.024737 l
309.189215 225.059145 l
311.978363 225.091431 l
314.767511 225.121724 l
317.556659 225.150148 l
320.345806 225.176822 l
323.134954 225.201854 l
325.924102 225.225344 l
328.71325 225.247389 l
331.502398 225.268079 l
334.291546 225.287499 l
337.019881 225.305341 l
stroke
grestore
1.000 setlinewidth
0 setlinecap
gsave
305.716 195.587 45.2 42.013 clipbox
/o {
gsave
newpath
translate
1.0 setlinewidth
1 setlinejoin

0 setlinecap

-2.5 -2.5 m
2.5 2.5 l
-2.5 2.5 m
2.5 -2.5 l

gsave
grestore
stroke
grestore
} bind def
60.9551 50.9029 o
63.7442 55.7349 o
66.5333 104.649 o
69.3225 118.007 o
72.1116 105.387 o
74.9008 106.937 o
77.6899 122.454 o
80.4791 123.166 o
83.2682 114.56 o
86.0574 111.157 o
88.8465 121.941 o
91.6357 144.132 o
94.4248 166.548 o
97.214 173.543 o
100.003 162.669 o
102.792 156.494 o
105.581 160.866 o
108.371 177.185 o
111.16 190.169 o
113.949 199.988 o
116.738 203.092 o
119.527 199.291 o
122.316 197.539 o
125.105 199.651 o
127.895 200.277 o
130.684 200.139 o
133.473 201.536 o
136.262 203.623 o
139.051 204.745 o
141.84 204.622 o
144.629 204.348 o
147.419 205.164 o
150.208 206.684 o
152.997 207.85 o
155.786 208.723 o
158.575 209.858 o
161.364 211.143 o
164.154 212.204 o
166.943 212.958 o
169.732 213.588 o
172.521 214.284 o
175.31 215.006 o
178.099 215.61 o
180.888 216.126 o
183.678 216.658 o
186.467 217.202 o
189.256 217.702 o
192.045 218.15 o
194.834 218.575 o
197.623 218.996 o
200.412 219.4 o
203.202 219.77 o
205.991 220.113 o
208.78 220.445 o
211.569 220.761 o
214.358 221.055 o
217.147 221.328 o
219.936 221.586 o
222.726 221.831 o
225.515 222.061 o
228.304 222.275 o
231.093 222.476 o
233.882 222.667 o
236.671 222.846 o
239.461 223.013 o
242.25 223.171 o
245.039 223.319 o
247.828 223.458 o
250.617 223.589 o
253.406 223.712 o
256.195 223.827 o
258.985 223.935 o
261.774 224.037 o
264.563 224.132 o
267.352 224.222 o
270.141 224.306 o
272.93 224.385 o
275.719 224.458 o
278.509 224.528 o
281.298 224.593 o
284.087 224.654 o
286.876 224.711 o
289.665 224.765 o
292.454 224.816 o
295.243 224.863 o
298.033 224.907 o
300.822 224.949 o
303.611 224.988 o
306.4 225.025 o
309.189 225.059 o
311.978 225.091 o
314.768 225.122 o
317.557 225.15 o
320.346 225.177 o
323.135 225.202 o
325.924 225.225 o
328.713 225.247 o
331.502 225.268 o
334.292 225.287 o
337.02 225.305 o
grestore
1.500 setlinewidth
2 setlinecap
0.122 0.467 0.706 setrgbcolor
gsave
305.716 195.587 45.2 42.013 clipbox
59.096185 50.902841 m
62.817303 50.966293 l
63.747582 54.754232 l
64.677862 83.061224 l
65.608141 91.461125 l
66.53842 98.263423 l
67.4687 120.204759 l
68.398979 122.880114 l
69.329259 116.086302 l
70.259538 110.764939 l
71.189818 108.075347 l
72.120097 106.730543 l
73.050377 106.265828 l
73.980656 107.375913 l
74.910935 110.731695 l
77.701774 125.461523 l
78.632053 127.070233 l
79.562333 126.044944 l
80.492612 123.45527 l
82.353171 117.320203 l
83.283451 115.142779 l
84.21373 114.291701 l
85.144009 114.973308 l
86.074289 117.128311 l
87.004568 120.540017 l
87.934848 124.895823 l
88.865127 129.94919 l
89.795407 135.728865 l
93.516524 161.692157 l
94.446804 166.729513 l
95.377083 169.98516 l
96.307363 170.900657 l
97.237642 169.882736 l
98.167922 167.56494 l
100.028481 161.739631 l
100.95876 159.330276 l
101.88904 157.752717 l
102.819319 157.223671 l
103.749598 158.004993 l
104.679878 160.309994 l
105.610157 164.042635 l
108.400996 178.144021 l
110.261555 185.655445 l
112.122113 191.960153 l
113.982672 197.625233 l
114.912952 199.949203 l
115.843231 201.580236 l
116.773511 202.306419 l
117.70379 202.122418 l
118.63407 201.268789 l
120.494629 199.146094 l
121.424908 198.519047 l
122.355187 198.330844 l
123.285467 198.503886 l
127.936864 200.354841 l
129.797423 200.60143 l
132.588261 200.9527 l
134.44882 201.493632 l
139.100218 203.319779 l
140.960776 203.556855 l
144.681894 203.757581 l
146.542453 204.221977 l
148.403012 205.006375 l
151.19385 206.543335 l
153.984689 208.052747 l
156.775527 209.287256 l
162.357204 211.440023 l
165.148042 212.324293 l
167.938881 212.979221 l
185.61419 216.277791 l
194.916985 217.886043 l
203.2895 219.060513 l
211.662015 220.024898 l
221.895089 220.997188 l
233.988722 221.914644 l
247.012634 222.676187 l
261.897105 223.323796 l
279.572415 223.867363 l
301.899121 224.315053 l
330.737784 224.649548 l
337.019733 224.698611 l
337.019733 224.698611 l
stroke
grestore
1.000 setlinewidth
0 setlinecap
gsave
305.716 195.587 45.2 42.013 clipbox
/o {
gsave
newpath
translate
1.0 setlinewidth
1 setlinejoin

0 setlinecap

0 -1.25 m
0.331504 -1.25 0.649475 -1.118292 0.883883 -0.883883 c
1.118292 -0.649475 1.25 -0.331504 1.25 0 c
1.25 0.331504 1.118292 0.649475 0.883883 0.883883 c
0.649475 1.118292 0.331504 1.25 0 1.25 c
-0.331504 1.25 -0.649475 1.118292 -0.883883 0.883883 c
-1.118292 0.649475 -1.25 0.331504 -1.25 0 c
-1.25 -0.331504 -1.118292 -0.649475 -0.883883 -0.883883 c
-0.649475 -1.118292 -0.331504 -1.25 0 -1.25 c
cl

gsave
0.122 0.467 0.706 setrgbcolor
fill
grestore
stroke
grestore
} bind def
59.0962 50.9028 o
60.0265 50.9028 o
60.9567 50.9028 o
61.887 50.903 o
62.8173 50.9663 o
63.7476 54.7542 o
64.6779 83.0612 o
65.6081 91.4611 o
66.5384 98.2634 o
67.4687 120.205 o
68.399 122.88 o
69.3293 116.086 o
70.2595 110.765 o
71.1898 108.075 o
72.1201 106.731 o
73.0504 106.266 o
73.9807 107.376 o
74.9109 110.732 o
75.8412 115.792 o
76.7715 121.236 o
77.7018 125.462 o
78.6321 127.07 o
79.5623 126.045 o
80.4926 123.455 o
81.4229 120.309 o
82.3532 117.32 o
83.2835 115.143 o
84.2137 114.292 o
85.144 114.973 o
86.0743 117.128 o
87.0046 120.54 o
87.9348 124.896 o
88.8651 129.949 o
89.7954 135.729 o
90.7257 142.312 o
91.656 149.256 o
92.5862 155.811 o
93.5165 161.692 o
94.4468 166.73 o
95.3771 169.985 o
96.3074 170.901 o
97.2376 169.883 o
98.1679 167.565 o
99.0982 164.647 o
100.028 161.74 o
100.959 159.33 o
101.889 157.753 o
102.819 157.224 o
103.75 158.005 o
104.68 160.31 o
105.61 164.043 o
106.54 168.715 o
107.471 173.61 o
108.401 178.144 o
109.331 182.125 o
110.262 185.655 o
111.192 188.896 o
112.122 191.96 o
113.052 194.892 o
113.983 197.625 o
114.913 199.949 o
115.843 201.58 o
116.774 202.306 o
117.704 202.122 o
118.634 201.269 o
119.564 200.146 o
120.495 199.146 o
121.425 198.519 o
122.355 198.331 o
123.285 198.504 o
124.216 198.892 o
125.146 199.35 o
126.076 199.776 o
127.007 200.116 o
127.937 200.355 o
128.867 200.506 o
129.797 200.601 o
130.728 200.685 o
131.658 200.793 o
132.588 200.953 o
133.519 201.183 o
134.449 201.494 o
135.379 201.876 o
136.309 202.296 o
137.24 202.707 o
138.17 203.059 o
139.1 203.32 o
140.03 203.481 o
140.961 203.557 o
141.891 203.582 o
142.821 203.599 o
143.752 203.647 o
144.682 203.758 o
145.612 203.947 o
146.542 204.222 o
147.473 204.579 o
148.403 205.006 o
149.333 205.49 o
150.264 206.009 o
151.194 206.543 o
152.124 207.072 o
153.054 207.578 o
153.985 208.053 o
154.915 208.492 o
155.845 208.901 o
156.776 209.287 o
157.706 209.66 o
158.636 210.026 o
159.566 210.39 o
160.497 210.749 o
161.427 211.101 o
162.357 211.44 o
163.287 211.76 o
164.218 212.055 o
165.148 212.324 o
166.078 212.566 o
167.009 212.783 o
167.939 212.979 o
168.869 213.159 o
169.799 213.327 o
170.73 213.49 o
171.66 213.652 o
172.59 213.816 o
173.521 213.985 o
174.451 214.16 o
175.381 214.34 o
176.311 214.523 o
177.242 214.708 o
178.172 214.891 o
179.102 215.073 o
180.033 215.251 o
180.963 215.426 o
181.893 215.598 o
182.823 215.768 o
183.754 215.938 o
184.684 216.108 o
185.614 216.278 o
186.544 216.448 o
187.475 216.619 o
188.405 216.789 o
189.335 216.956 o
190.266 217.121 o
191.196 217.282 o
192.126 217.439 o
193.056 217.592 o
193.987 217.741 o
194.917 217.886 o
195.847 218.027 o
196.778 218.165 o
197.708 218.301 o
198.638 218.433 o
199.568 218.564 o
200.499 218.692 o
201.429 218.817 o
202.359 218.94 o
203.289 219.061 o
204.22 219.178 o
205.15 219.293 o
206.08 219.404 o
207.011 219.513 o
207.941 219.62 o
208.871 219.724 o
209.801 219.826 o
210.732 219.926 o
211.662 220.025 o
212.592 220.122 o
213.523 220.217 o
214.453 220.311 o
215.383 220.403 o
216.313 220.493 o
217.244 220.581 o
218.174 220.667 o
219.104 220.752 o
220.035 220.835 o
220.965 220.917 o
221.895 220.997 o
222.825 221.076 o
223.756 221.153 o
224.686 221.229 o
225.616 221.304 o
226.546 221.377 o
227.477 221.449 o
228.407 221.519 o
229.337 221.588 o
230.268 221.656 o
231.198 221.723 o
232.128 221.788 o
233.058 221.852 o
233.989 221.915 o
234.919 221.976 o
235.849 222.037 o
236.78 222.096 o
237.71 222.154 o
238.64 222.211 o
239.57 222.267 o
240.501 222.322 o
241.431 222.375 o
242.361 222.428 o
243.292 222.48 o
244.222 222.53 o
245.152 222.58 o
246.082 222.628 o
247.013 222.676 o
247.943 222.723 o
248.873 222.769 o
249.803 222.814 o
250.734 222.858 o
251.664 222.901 o
252.594 222.943 o
253.525 222.985 o
254.455 223.026 o
255.385 223.066 o
256.315 223.105 o
257.246 223.143 o
258.176 223.181 o
259.106 223.218 o
260.037 223.254 o
260.967 223.289 o
261.897 223.324 o
262.827 223.358 o
263.758 223.391 o
264.688 223.424 o
265.618 223.456 o
266.549 223.487 o
267.479 223.518 o
268.409 223.548 o
269.339 223.578 o
270.27 223.607 o
271.2 223.635 o
272.13 223.663 o
273.06 223.691 o
273.991 223.717 o
274.921 223.744 o
275.851 223.769 o
276.782 223.795 o
277.712 223.819 o
278.642 223.844 o
279.572 223.867 o
280.503 223.891 o
281.433 223.913 o
282.363 223.936 o
283.294 223.958 o
284.224 223.979 o
285.154 224 o
286.084 224.021 o
287.015 224.041 o
287.945 224.061 o
288.875 224.08 o
289.805 224.099 o
290.736 224.118 o
291.666 224.136 o
292.596 224.154 o
293.527 224.172 o
294.457 224.189 o
295.387 224.206 o
296.317 224.223 o
297.248 224.239 o
298.178 224.255 o
299.108 224.27 o
300.039 224.285 o
300.969 224.3 o
301.899 224.315 o
302.829 224.329 o
303.76 224.343 o
304.69 224.357 o
305.62 224.371 o
306.551 224.384 o
307.481 224.397 o
308.411 224.41 o
309.341 224.422 o
310.272 224.434 o
311.202 224.446 o
312.132 224.458 o
313.062 224.47 o
313.993 224.481 o
314.923 224.492 o
315.853 224.503 o
316.784 224.513 o
317.714 224.524 o
318.644 224.534 o
319.574 224.544 o
320.505 224.554 o
321.435 224.563 o
322.365 224.573 o
323.296 224.582 o
324.226 224.591 o
325.156 224.6 o
326.086 224.609 o
327.017 224.617 o
327.947 224.626 o
328.877 224.634 o
329.808 224.642 o
330.738 224.65 o
331.668 224.657 o
332.598 224.665 o
333.529 224.672 o
334.459 224.679 o
335.389 224.687 o
336.319 224.693 o
337.02 224.699 o
grestore
0.800 setlinewidth
0 setlinejoin
2 setlinecap
0.000 setgray
gsave
45.2 42.0125 m
45.2 237.6 l
stroke
grestore
gsave
350.916066 42.0125 m
350.916066 237.6 l
stroke
grestore
gsave
45.2 42.0125 m
350.916066 42.0125 l
stroke
grestore
gsave
45.2 237.6 m
350.916066 237.6 l
stroke
grestore
1.000 setlinewidth
0 setlinecap
gsave
305.716 195.587 45.2 42.013 clipbox
318.429434 221.653833 m
337.019686 221.653833 l
337.019686 228.709659 l
318.429434 228.709659 l
318.429434 221.653833 l
cl
stroke
grestore
1 setlinejoin
1 setlinecap
gsave
176.657908 169.144375 m
223.915084 188.99947 271.172259 208.854564 318.429434 228.709659 c
stroke
grestore
gsave
329.515941 110.468125 m
332.017189 147.530028 334.518438 184.59193 337.019686 221.653833 c
stroke
grestore
gsave
176.657908 110.468125 m
329.515941 110.468125 l
329.515941 169.144375 l
176.657908 169.144375 l
cl
1.000 setgray
fill
grestore
0.800 setlinewidth
0 setlinecap
gsave
/o {
gsave
newpath
translate
0.8 setlinewidth
1 setlinejoin

0 setlinecap

0 0 m
0 -3.5 l

gsave
0.000 setgray
fill
grestore
stroke
grestore
} bind def
176.658 110.468 o
grestore
gsave
/o {
gsave
newpath
translate
0.8 setlinewidth
1 setlinejoin

0 setlinecap

0 0 m
0 -3.5 l

gsave
0.000 setgray
fill
grestore
stroke
grestore
} bind def
214.872 110.468 o
grestore
gsave
/o {
gsave
newpath
translate
0.8 setlinewidth
1 setlinejoin

0 setlinecap

0 0 m
0 -3.5 l

gsave
0.000 setgray
fill
grestore
stroke
grestore
} bind def
253.087 110.468 o
grestore
gsave
/o {
gsave
newpath
translate
0.8 setlinewidth
1 setlinejoin

0 setlinecap

0 0 m
0 -3.5 l

gsave
0.000 setgray
fill
grestore
stroke
grestore
} bind def
291.301 110.468 o
grestore
gsave
/o {
gsave
newpath
translate
0.8 setlinewidth
1 setlinejoin

0 setlinecap

0 0 m
0 -3.5 l

gsave
0.000 setgray
fill
grestore
stroke
grestore
} bind def
329.516 110.468 o
grestore
gsave
/o {
gsave
newpath
translate
0.8 setlinewidth
1 setlinejoin

0 setlinecap

-0 0 m
-3.5 0 l

gsave
0.000 setgray
fill
grestore
stroke
grestore
} bind def
176.658 128.071 o
grestore
gsave
142.657908 123.969437 translate
0.000000 rotate
/STIXGeneral-Regular 12.0 selectfont
0.000000 0.750000 moveto
/one glyphshow
5.999985 0.750000 moveto
/two glyphshow
11.999969 0.750000 moveto
/period glyphshow
14.999954 0.750000 moveto
/two glyphshow
20.999939 0.750000 moveto
/five glyphshow
grestore
gsave
/o {
gsave
newpath
translate
0.8 setlinewidth
1 setlinejoin

0 setlinecap

-0 0 m
-3.5 0 l

gsave
0.000 setgray
fill
grestore
stroke
grestore
} bind def
176.658 157.409 o
grestore
gsave
142.657908 153.307562 translate
0.000000 rotate
/STIXGeneral-Regular 12.0 selectfont
0.000000 0.750000 moveto
/one glyphshow
5.999985 0.750000 moveto
/two glyphshow
11.999969 0.750000 moveto
/period glyphshow
14.999954 0.750000 moveto
/five glyphshow
20.999939 0.750000 moveto
/zero glyphshow
grestore
1.500 setlinewidth
2 setlinecap
1.000 0.498 0.055 setrgbcolor
gsave
152.858 58.676 176.658 110.468 clipbox
-1 141.084222 m
8.945478 141.292019 l
31.879199 141.743722 l
54.81292 142.169518 l
77.746641 142.570897 l
100.680363 142.949249 l
123.614084 143.305902 l
146.547805 143.642093 l
169.481526 143.958998 l
192.415248 144.257725 l
215.348969 144.539321 l
238.28269 144.804771 l
261.216411 145.055005 l
284.150133 145.290899 l
307.083854 145.513279 l
329.517542 145.718485 l
stroke
grestore
1.000 setlinewidth
0 setlinecap
gsave
152.858 58.676 176.658 110.468 clipbox
/o {
gsave
newpath
translate
1.0 setlinewidth
1 setlinejoin

0 setlinecap

0 -2.5 m
0.663008 -2.5 1.29895 -2.236584 1.767767 -1.767767 c
2.236584 -1.29895 2.5 -0.663008 2.5 0 c
2.5 0.663008 2.236584 1.29895 1.767767 1.767767 c
1.29895 2.236584 0.663008 2.5 0 2.5 c
-0.663008 2.5 -1.29895 2.236584 -1.767767 1.767767 c
-2.236584 1.29895 -2.5 0.663008 -2.5 0 c
-2.5 -0.663008 -2.236584 -1.29895 -1.767767 -1.767767 c
-1.29895 -2.236584 -0.663008 -2.5 0 -2.5 c
cl

gsave
grestore
stroke
grestore
} bind def
-1 141.084 o
8.94548 141.292 o
31.8792 141.744 o
54.8129 142.17 o
77.7466 142.571 o
100.68 142.949 o
123.614 143.306 o
146.548 143.642 o
169.482 143.959 o
192.415 144.258 o
215.349 144.539 o
238.283 144.805 o
261.216 145.055 o
284.15 145.291 o
307.084 145.513 o
329.518 145.718 o
grestore
1.500 setlinewidth
2 setlinecap
0.173 0.627 0.173 setrgbcolor
gsave
152.858 58.676 176.658 110.468 clipbox
-1 137.364038 m
8.945478 137.524159 l
31.879199 137.870615 l
54.81292 138.195636 l
77.746641 138.500566 l
100.680363 138.786701 l
123.614084 139.055194 l
146.547805 139.307105 l
169.481526 139.543479 l
192.415248 139.765301 l
215.348969 139.973466 l
238.28269 140.16881 l
261.216411 140.352134 l
284.150133 140.524197 l
307.083854 140.685693 l
329.517542 140.834067 l
stroke
grestore
1.000 setlinewidth
0 setlinecap
gsave
152.858 58.676 176.658 110.468 clipbox
/o {
gsave
newpath
translate
1.0 setlinewidth
1 setlinejoin

0 setlinecap

-2.5 -2.5 m
2.5 2.5 l
-2.5 2.5 m
2.5 -2.5 l

gsave
grestore
stroke
grestore
} bind def
-1 137.364 o
8.94548 137.524 o
31.8792 137.871 o
54.8129 138.196 o
77.7466 138.501 o
100.68 138.787 o
123.614 139.055 o
146.548 139.307 o
169.482 139.543 o
192.415 139.765 o
215.349 139.973 o
238.283 140.169 o
261.216 140.352 o
284.15 140.524 o
307.084 140.686 o
329.518 140.834 o
grestore
1.500 setlinewidth
2 setlinecap
0.122 0.467 0.706 setrgbcolor
gsave
152.858 58.676 176.658 110.468 clipbox
-1 131.902588 m
63.685313 132.950078 l
140.177383 133.978707 l
224.318661 134.894761 l
323.758352 135.74571 l
329.516323 135.788498 l
329.516323 135.788498 l
stroke
grestore
1.000 setlinewidth
0 setlinecap
gsave
152.858 58.676 176.658 110.468 clipbox
/o {
gsave
newpath
translate
1.0 setlinewidth
1 setlinejoin

0 setlinecap

0 -1.25 m
0.331504 -1.25 0.649475 -1.118292 0.883883 -0.883883 c
1.118292 -0.649475 1.25 -0.331504 1.25 0 c
1.25 0.331504 1.118292 0.649475 0.883883 0.883883 c
0.649475 1.118292 0.331504 1.25 0 1.25 c
-0.331504 1.25 -0.649475 1.118292 -0.883883 0.883883 c
-1.118292 0.649475 -1.25 0.331504 -1.25 0 c
-1.25 -0.331504 -1.118292 -0.649475 -0.883883 -0.883883 c
-0.649475 -1.118292 -0.331504 -1.25 0 -1.25 c
cl

gsave
0.122 0.467 0.706 setrgbcolor
fill
grestore
stroke
grestore
} bind def
-1 131.903 o
2.49166 131.964 o
10.1409 132.096 o
17.7901 132.226 o
25.4393 132.353 o
33.0885 132.477 o
40.7377 132.599 o
48.3869 132.718 o
56.0361 132.835 o
63.6853 132.95 o
71.3345 133.063 o
78.9837 133.173 o
86.6329 133.281 o
94.2821 133.387 o
101.931 133.49 o
109.581 133.592 o
117.23 133.692 o
124.879 133.789 o
132.528 133.885 o
140.177 133.979 o
147.827 134.071 o
155.476 134.161 o
163.125 134.249 o
170.774 134.336 o
178.423 134.42 o
186.073 134.503 o
193.722 134.585 o
201.371 134.665 o
209.02 134.743 o
216.669 134.82 o
224.319 134.895 o
231.968 134.968 o
239.617 135.041 o
247.266 135.111 o
254.915 135.181 o
262.565 135.249 o
270.214 135.315 o
277.863 135.38 o
285.512 135.444 o
293.162 135.507 o
300.811 135.569 o
308.46 135.629 o
316.109 135.688 o
323.758 135.746 o
329.516 135.788 o
grestore
0.800 setlinewidth
0 setlinejoin
2 setlinecap
0.000 setgray
gsave
176.657908 110.468125 m
176.657908 169.144375 l
stroke
grestore
gsave
329.515941 110.468125 m
329.515941 169.144375 l
stroke
grestore
gsave
176.657908 110.468125 m
329.515941 110.468125 l
stroke
grestore
gsave
176.657908 169.144375 m
329.515941 169.144375 l
stroke
grestore
1.000 setlinewidth
0 setlinecap
0.800 setgray
gsave
240.916066 47.0125 m
343.916066 47.0125 l
345.249399 47.0125 345.916066 47.679167 345.916066 49.0125 c
345.916066 92.2 l
345.916066 93.533333 345.249399 94.2 343.916066 94.2 c
240.916066 94.2 l
239.582732 94.2 238.916066 93.533333 238.916066 92.2 c
238.916066 49.0125 l
238.916066 47.679167 239.582732 47.0125 240.916066 47.0125 c
cl
gsave
1.000 setgray
fill
grestore
stroke
grestore
1.500 setlinewidth
1 setlinejoin
2 setlinecap
1.000 0.498 0.055 setrgbcolor
gsave
242.916066 85.871875 m
252.916066 85.871875 l
262.916066 85.871875 l
stroke
grestore
1.000 setlinewidth
0 setlinecap
gsave
/o {
gsave
newpath
translate
1.0 setlinewidth
1 setlinejoin

0 setlinecap

0 -2.5 m
0.663008 -2.5 1.29895 -2.236584 1.767767 -1.767767 c
2.236584 -1.29895 2.5 -0.663008 2.5 0 c
2.5 0.663008 2.236584 1.29895 1.767767 1.767767 c
1.29895 2.236584 0.663008 2.5 0 2.5 c
-0.663008 2.5 -1.29895 2.236584 -1.767767 1.767767 c
-2.236584 1.29895 -2.5 0.663008 -2.5 0 c
-2.5 -0.663008 -2.236584 -1.29895 -1.767767 -1.767767 c
-1.29895 -2.236584 -0.663008 -2.5 0 -2.5 c
cl

gsave
grestore
stroke
grestore
} bind def
252.916 85.8719 o
grestore
0.000 setgray
gsave
270.916066 82.371875 translate
0.000000 rotate
/STIXGeneral-Regular 10.0 selectfont
0.000000 0.875000 moveto
/s glyphshow
3.889984 0.875000 moveto
/c glyphshow
8.329971 0.875000 moveto
/a glyphshow
12.769958 0.875000 moveto
/t glyphshow
15.549942 0.875000 moveto
/t glyphshow
18.329926 0.875000 moveto
/e glyphshow
22.769913 0.875000 moveto
/r glyphshow
26.099899 0.875000 moveto
/e glyphshow
30.539886 0.875000 moveto
/d glyphshow
35.539871 0.875000 moveto
/comma glyphshow
38.039856 0.875000 moveto
/space glyphshow
/Cmmi10 10.0 selectfont
40.539841 0.875000 moveto
/delta glyphshow
/Cmmi10 7.0 selectfont
44.978317 -0.825625 moveto
/h glyphshow
/Cmr10 10.0 selectfont
51.405114 0.875000 moveto
/equal glyphshow
60.929528 0.875000 moveto
/seven glyphshow
65.929528 0.875000 moveto
/zero glyphshow
grestore
1.500 setlinewidth
2 setlinecap
0.173 0.627 0.173 setrgbcolor
gsave
242.916066 70.871875 m
252.916066 70.871875 l
262.916066 70.871875 l
stroke
grestore
1.000 setlinewidth
0 setlinecap
gsave
/o {
gsave
newpath
translate
1.0 setlinewidth
1 setlinejoin

0 setlinecap

-2.5 -2.5 m
2.5 2.5 l
-2.5 2.5 m
2.5 -2.5 l

gsave
grestore
stroke
grestore
} bind def
252.916 70.8719 o
grestore
0.000 setgray
gsave
270.916066 67.371875 translate
0.000000 rotate
/STIXGeneral-Regular 10.0 selectfont
0.000000 0.875000 moveto
/s glyphshow
3.889984 0.875000 moveto
/c glyphshow
8.329971 0.875000 moveto
/a glyphshow
12.769958 0.875000 moveto
/t glyphshow
15.549942 0.875000 moveto
/t glyphshow
18.329926 0.875000 moveto
/e glyphshow
22.769913 0.875000 moveto
/r glyphshow
26.099899 0.875000 moveto
/e glyphshow
30.539886 0.875000 moveto
/d glyphshow
35.539871 0.875000 moveto
/comma glyphshow
38.039856 0.875000 moveto
/space glyphshow
/Cmmi10 10.0 selectfont
40.539841 0.875000 moveto
/delta glyphshow
/Cmmi10 7.0 selectfont
44.978317 -0.825625 moveto
/h glyphshow
/Cmr10 10.0 selectfont
51.405114 0.875000 moveto
/equal glyphshow
60.929528 0.875000 moveto
/four glyphshow
grestore
1.500 setlinewidth
2 setlinecap
0.122 0.467 0.706 setrgbcolor
gsave
242.916066 56.7 m
252.916066 56.7 l
262.916066 56.7 l
stroke
grestore
1.000 setlinewidth
0 setlinecap
gsave
/o {
gsave
newpath
translate
1.0 setlinewidth
1 setlinejoin

0 setlinecap

0 -1.25 m
0.331504 -1.25 0.649475 -1.118292 0.883883 -0.883883 c
1.118292 -0.649475 1.25 -0.331504 1.25 0 c
1.25 0.331504 1.118292 0.649475 0.883883 0.883883 c
0.649475 1.118292 0.331504 1.25 0 1.25 c
-0.331504 1.25 -0.649475 1.118292 -0.883883 0.883883 c
-1.118292 0.649475 -1.25 0.331504 -1.25 0 c
-1.25 -0.331504 -1.118292 -0.649475 -0.883883 -0.883883 c
-0.649475 -1.118292 -0.331504 -1.25 0 -1.25 c
cl

gsave
0.122 0.467 0.706 setrgbcolor
fill
grestore
stroke
grestore
} bind def
252.916 56.7 o
grestore
0.000 setgray
/STIXGeneral-Regular 10.000 selectfont
gsave

270.916066 53.200000 translate
0.000000 rotate
0.000000 0 m /h glyphshow
4.999985 0 m /y glyphshow
9.999969 0 m /b glyphshow
14.999954 0 m /r glyphshow
18.329941 0 m /i glyphshow
21.109924 0 m /d glyphshow
grestore
gsave
408.741967 42.0125 m
561.6 42.0125 l
561.6 237.6 l
408.741967 237.6 l
cl
1.000 setgray
fill
grestore
0.800 setlinewidth
2 setlinecap
0.690 setgray
gsave
152.858 195.587 408.742 42.013 clipbox
453.374629 42.0125 m
453.374629 237.6 l
stroke
grestore
0 setlinecap
0.000 setgray
gsave
/o {
gsave
newpath
translate
0.8 setlinewidth
1 setlinejoin

0 setlinecap

0 0 m
0 -3.5 l

gsave
0.000 setgray
fill
grestore
stroke
grestore
} bind def
453.375 42.0125 o
grestore
gsave
447.374629 26.809375 translate
0.000000 rotate
/STIXGeneral-Regular 12.0 selectfont
0.000000 0.890625 moveto
/two glyphshow
5.999985 0.890625 moveto
/zero glyphshow
grestore
2 setlinecap
0.690 setgray
gsave
152.858 195.587 408.742 42.013 clipbox
500.48034 42.0125 m
500.48034 237.6 l
stroke
grestore
0 setlinecap
0.000 setgray
gsave
/o {
gsave
newpath
translate
0.8 setlinewidth
1 setlinejoin

0 setlinecap

0 0 m
0 -3.5 l

gsave
0.000 setgray
fill
grestore
stroke
grestore
} bind def
500.48 42.0125 o
grestore
gsave
494.480340 26.809375 translate
0.000000 rotate
/STIXGeneral-Regular 12.0 selectfont
0.000000 0.890625 moveto
/four glyphshow
5.999985 0.890625 moveto
/zero glyphshow
grestore
2 setlinecap
0.690 setgray
gsave
152.858 195.587 408.742 42.013 clipbox
547.586051 42.0125 m
547.586051 237.6 l
stroke
grestore
0 setlinecap
0.000 setgray
gsave
/o {
gsave
newpath
translate
0.8 setlinewidth
1 setlinejoin

0 setlinecap

0 0 m
0 -3.5 l

gsave
0.000 setgray
fill
grestore
stroke
grestore
} bind def
547.586 42.0125 o
grestore
gsave
541.586051 26.809375 translate
0.000000 rotate
/STIXGeneral-Regular 12.0 selectfont
0.000000 0.796875 moveto
/six glyphshow
5.999985 0.796875 moveto
/zero glyphshow
grestore
gsave
478.670984 10.231250 translate
0.000000 rotate
/Cmmi10 14.0 selectfont
0.000000 0.015625 moveto
/delta glyphshow
/Cmmi10 9.799999999999999 selectfont
6.213867 -2.365250 moveto
/h glyphshow
grestore
2 setlinecap
0.690 setgray
gsave
152.858 195.587 408.742 42.013 clipbox
408.741967 50.982665 m
561.6 50.982665 l
stroke
grestore
0 setlinecap
0.000 setgray
gsave
/o {
gsave
newpath
translate
0.8 setlinewidth
1 setlinejoin

0 setlinecap

-0 0 m
-3.5 0 l

gsave
0.000 setgray
fill
grestore
stroke
grestore
} bind def
408.742 50.9827 o
grestore
gsave
374.741967 46.881103 translate
0.000000 rotate
/STIXGeneral-Regular 12.0 selectfont
0.000000 0.750000 moveto
/one glyphshow
5.999985 0.750000 moveto
/two glyphshow
11.999969 0.750000 moveto
/period glyphshow
14.999954 0.750000 moveto
/one glyphshow
20.999939 0.750000 moveto
/five glyphshow
grestore
2 setlinecap
0.690 setgray
gsave
152.858 195.587 408.742 42.013 clipbox
408.741967 78.861995 m
561.6 78.861995 l
stroke
grestore
0 setlinecap
0.000 setgray
gsave
/o {
gsave
newpath
translate
0.8 setlinewidth
1 setlinejoin

0 setlinecap

-0 0 m
-3.5 0 l

gsave
0.000 setgray
fill
grestore
stroke
grestore
} bind def
408.742 78.862 o
grestore
gsave
374.741967 74.760432 translate
0.000000 rotate
/STIXGeneral-Regular 12.0 selectfont
0.000000 0.890625 moveto
/one glyphshow
5.999985 0.890625 moveto
/two glyphshow
11.999969 0.890625 moveto
/period glyphshow
14.999954 0.890625 moveto
/two glyphshow
20.999939 0.890625 moveto
/zero glyphshow
grestore
2 setlinecap
0.690 setgray
gsave
152.858 195.587 408.742 42.013 clipbox
408.741967 106.741324 m
561.6 106.741324 l
stroke
grestore
0 setlinecap
0.000 setgray
gsave
/o {
gsave
newpath
translate
0.8 setlinewidth
1 setlinejoin

0 setlinecap

-0 0 m
-3.5 0 l

gsave
0.000 setgray
fill
grestore
stroke
grestore
} bind def
408.742 106.741 o
grestore
gsave
374.741967 102.639762 translate
0.000000 rotate
/STIXGeneral-Regular 12.0 selectfont
0.000000 0.750000 moveto
/one glyphshow
5.999985 0.750000 moveto
/two glyphshow
11.999969 0.750000 moveto
/period glyphshow
14.999954 0.750000 moveto
/two glyphshow
20.999939 0.750000 moveto
/five glyphshow
grestore
2 setlinecap
0.690 setgray
gsave
152.858 195.587 408.742 42.013 clipbox
408.741967 134.620654 m
561.6 134.620654 l
stroke
grestore
0 setlinecap
0.000 setgray
gsave
/o {
gsave
newpath
translate
0.8 setlinewidth
1 setlinejoin

0 setlinecap

-0 0 m
-3.5 0 l

gsave
0.000 setgray
fill
grestore
stroke
grestore
} bind def
408.742 134.621 o
grestore
gsave
374.741967 130.519091 translate
0.000000 rotate
/STIXGeneral-Regular 12.0 selectfont
0.000000 0.890625 moveto
/one glyphshow
5.999985 0.890625 moveto
/two glyphshow
11.999969 0.890625 moveto
/period glyphshow
14.999954 0.890625 moveto
/three glyphshow
20.999939 0.890625 moveto
/zero glyphshow
grestore
2 setlinecap
0.690 setgray
gsave
152.858 195.587 408.742 42.013 clipbox
408.741967 162.499983 m
561.6 162.499983 l
stroke
grestore
0 setlinecap
0.000 setgray
gsave
/o {
gsave
newpath
translate
0.8 setlinewidth
1 setlinejoin

0 setlinecap

-0 0 m
-3.5 0 l

gsave
0.000 setgray
fill
grestore
stroke
grestore
} bind def
408.742 162.5 o
grestore
gsave
374.741967 158.398421 translate
0.000000 rotate
/STIXGeneral-Regular 12.0 selectfont
0.000000 0.750000 moveto
/one glyphshow
5.999985 0.750000 moveto
/two glyphshow
11.999969 0.750000 moveto
/period glyphshow
14.999954 0.750000 moveto
/three glyphshow
20.999939 0.750000 moveto
/five glyphshow
grestore
2 setlinecap
0.690 setgray
gsave
152.858 195.587 408.742 42.013 clipbox
408.741967 190.379313 m
561.6 190.379313 l
stroke
grestore
0 setlinecap
0.000 setgray
gsave
/o {
gsave
newpath
translate
0.8 setlinewidth
1 setlinejoin

0 setlinecap

-0 0 m
-3.5 0 l

gsave
0.000 setgray
fill
grestore
stroke
grestore
} bind def
408.742 190.379 o
grestore
gsave
374.741967 186.277750 translate
0.000000 rotate
/STIXGeneral-Regular 12.0 selectfont
0.000000 0.890625 moveto
/one glyphshow
5.999985 0.890625 moveto
/two glyphshow
11.999969 0.890625 moveto
/period glyphshow
14.999954 0.890625 moveto
/four glyphshow
20.999939 0.890625 moveto
/zero glyphshow
grestore
2 setlinecap
0.690 setgray
gsave
152.858 195.587 408.742 42.013 clipbox
408.741967 218.258643 m
561.6 218.258643 l
stroke
grestore
0 setlinecap
0.000 setgray
gsave
/o {
gsave
newpath
translate
0.8 setlinewidth
1 setlinejoin

0 setlinecap

-0 0 m
-3.5 0 l

gsave
0.000 setgray
fill
grestore
stroke
grestore
} bind def
408.742 218.259 o
grestore
gsave
374.741967 214.157080 translate
0.000000 rotate
/STIXGeneral-Regular 12.0 selectfont
0.000000 0.750000 moveto
/one glyphshow
5.999985 0.750000 moveto
/two glyphshow
11.999969 0.750000 moveto
/period glyphshow
14.999954 0.750000 moveto
/four glyphshow
20.999939 0.750000 moveto
/five glyphshow
grestore
gsave
367.710717 130.306250 translate
90.000000 rotate
/Cmr10 14.0 selectfont
0.000000 0.562500 moveto
/N glyphshow
10.500000 0.562500 moveto
/u glyphshow
0.0 12.25 18.2724609375 0.875 rectfill
grestore
1.500 setlinewidth
2 setlinecap
0.122 0.467 0.706 setrgbcolor
gsave
152.858 195.587 408.742 42.013 clipbox
415.69006 167.383534 m
420.400631 60.217366 l
422.755916 100.939639 l
425.111202 132.498758 l
427.466487 118.375742 l
429.821773 67.014306 l
432.177058 50.902841 l
434.532344 98.456029 l
436.88763 122.794493 l
439.242915 98.291675 l
441.598201 95.535114 l
443.953486 103.854139 l
446.308772 114.173585 l
448.664057 158.62754 l
451.019343 162.324802 l
453.374629 128.954911 l
455.729914 118.725029 l
458.0852 112.962979 l
460.440485 169.588929 l
462.795771 128.320804 l
465.151056 138.142459 l
467.506342 124.161154 l
469.861627 131.397332 l
472.216913 162.661324 l
474.572199 168.878179 l
476.927484 173.280733 l
479.28277 153.288564 l
481.638055 135.212184 l
483.993341 129.174905 l
486.348626 158.766366 l
488.703912 178.48273 l
491.059197 149.010477 l
493.414483 165.822056 l
495.769769 192.638825 l
498.125054 146.276217 l
500.48034 182.439145 l
502.835625 171.866116 l
505.190911 138.773849 l
507.546196 192.950044 l
509.901482 186.713376 l
512.256768 165.557487 l
514.612053 188.515947 l
516.967339 152.088557 l
519.322624 210.067547 l
521.67791 182.747156 l
524.033195 173.894443 l
526.388481 151.951432 l
528.743766 228.709659 l
531.099052 161.866496 l
533.454338 153.640247 l
535.809623 161.718508 l
538.164909 182.141069 l
540.520194 156.920906 l
542.87548 187.892655 l
545.230765 162.666734 l
547.586051 143.734569 l
549.941336 204.443603 l
554.651908 197.028194 l
stroke
grestore
1.000 setlinewidth
0 setlinecap
gsave
152.858 195.587 408.742 42.013 clipbox
/o {
gsave
newpath
translate
1.0 setlinewidth
1 setlinejoin

0 setlinecap

0 -1.5 m
0.397805 -1.5 0.77937 -1.341951 1.06066 -1.06066 c
1.341951 -0.77937 1.5 -0.397805 1.5 0 c
1.5 0.397805 1.341951 0.77937 1.06066 1.06066 c
0.77937 1.341951 0.397805 1.5 0 1.5 c
-0.397805 1.5 -0.77937 1.341951 -1.06066 1.06066 c
-1.341951 0.77937 -1.5 0.397805 -1.5 0 c
-1.5 -0.397805 -1.341951 -0.77937 -1.06066 -1.06066 c
-0.77937 -1.341951 -0.397805 -1.5 0 -1.5 c
cl

gsave
0.122 0.467 0.706 setrgbcolor
fill
grestore
stroke
grestore
} bind def
415.69 167.384 o
420.401 60.2174 o
422.756 100.94 o
425.111 132.499 o
427.466 118.376 o
429.822 67.0143 o
432.177 50.9028 o
434.532 98.456 o
436.888 122.794 o
439.243 98.2917 o
441.598 95.5351 o
443.953 103.854 o
446.309 114.174 o
448.664 158.628 o
451.019 162.325 o
453.375 128.955 o
455.73 118.725 o
458.085 112.963 o
460.44 169.589 o
462.796 128.321 o
465.151 138.142 o
467.506 124.161 o
469.862 131.397 o
472.217 162.661 o
474.572 168.878 o
476.927 173.281 o
479.283 153.289 o
481.638 135.212 o
483.993 129.175 o
486.349 158.766 o
488.704 178.483 o
491.059 149.01 o
493.414 165.822 o
495.77 192.639 o
498.125 146.276 o
500.48 182.439 o
502.836 171.866 o
505.191 138.774 o
507.546 192.95 o
509.901 186.713 o
512.257 165.557 o
514.612 188.516 o
516.967 152.089 o
519.323 210.068 o
521.678 182.747 o
524.033 173.894 o
526.388 151.951 o
528.744 228.71 o
531.099 161.866 o
533.454 153.64 o
535.81 161.719 o
538.165 182.141 o
540.52 156.921 o
542.875 187.893 o
545.231 162.667 o
547.586 143.735 o
549.941 204.444 o
554.652 197.028 o
grestore
1.500 setlinewidth
[5.55 2.4] 0 setdash
1.000 0.000 0.000 setrgbcolor
gsave
152.858 195.587 408.742 42.013 clipbox
415.69006 197.028194 m
554.651908 197.028194 l
stroke
grestore
0.800 setlinewidth
0 setlinejoin
2 setlinecap
[] 0 setdash
0.000 setgray
gsave
408.741967 42.0125 m
408.741967 237.6 l
stroke
grestore
gsave
561.6 42.0125 m
561.6 237.6 l
stroke
grestore
gsave
408.741967 42.0125 m
561.6 42.0125 l
stroke
grestore
gsave
408.741967 237.6 m
561.6 237.6 l
stroke
grestore

end
showpage
