%!PS-Adobe-3.0 EPSF-3.0
%%Title: duck_nusselt_delta_h.eps
%%Creator: Matplotlib v3.5.3, https://matplotlib.org/
%%CreationDate: Tue Apr 18 16:29:56 2023
%%Orientation: portrait
%%BoundingBox: 98 275 514 517
%%HiResBoundingBox: 98.131228 275.484188 513.868772 516.515813
%%EndComments
%%BeginProlog
/mpldict 13 dict def
mpldict begin
/_d { bind def } bind def
/m { moveto } _d
/l { lineto } _d
/r { rlineto } _d
/c { curveto } _d
/cl { closepath } _d
/ce { closepath eofill } _d
/box {
      m
      1 index 0 r
      0 exch r
      neg 0 r
      cl
    } _d
/clipbox {
      box
      clip
      newpath
    } _d
/sc { setcachedevice } _d
%!PS-Adobe-3.0 Resource-Font
%%Creator: Converted from TrueType to Type 3 by Matplotlib.
10 dict begin
/FontName /STIXGeneral-Regular def
/PaintType 0 def
/FontMatrix [0.001 0 0 0.001 0 0] def
/FontBBox [-970 -443 2000 1023] def
/FontType 3 def
/Encoding [/period /zero /one /two /three /four /five /six] def
/CharStrings 9 dict dup begin
/.notdef 0 def
/period{250 0 70 -11 181 100 sc
181 43 m
181 28 175 16 164 5 c
153 -6 140 -11 125 -11 c
110 -11 97 -6 86 5 c
75 16 70 29 70 44 c
70 59 75 72 86 83 c
97 94 111 100 126 100 c
141 100 153 94 164 83 c
175 72 181 58 181 43 c

ce} _d
/zero{500 0 24 -14 476 676 sc
476 330 m
476 285 472 243 463 203 c
454 164 441 127 424 94 c
407 61 384 34 354 15 c
324 -4 289 -14 250 -14 c
209 -14 174 -4 143 17 c
112 38 89 65 72 100 c
55 135 43 172 35 211 c
28 250 24 292 24 336 c
24 398 32 454 47 503 c
62 553 88 594 123 627 c
159 660 203 676 254 676 c
319 676 373 644 414 580 c
455 516 476 433 476 330 c

380 325 m
380 430 369 511 346 566 c
324 622 291 650 248 650 c
207 650 175 622 153 566 c
131 510 120 431 120 329 c
120 226 131 148 153 93 c
175 39 207 12 250 12 c
292 12 324 39 346 93 c
369 148 380 225 380 325 c

ce} _d
/one{500 0 111 0 394 676 sc
394 0 m
118 0 l
118 15 l
155 17 180 24 193 35 c
206 47 213 67 213 95 c
213 544 l
213 577 203 593 183 593 c
174 593 159 589 138 581 c
111 571 l
111 585 l
290 676 l
299 673 l
299 76 l
299 54 306 38 319 29 c
332 20 357 15 394 15 c
394 0 l

ce} _d
/two{500 0 29 0 474 676 sc
474 137 m
420 0 l
29 0 l
29 12 l
207 201 l
254 250 287 294 307 335 c
327 376 337 418 337 461 c
337 506 325 540 300 565 c
275 590 241 602 198 602 c
162 602 133 593 112 574 c
91 555 71 521 51 472 c
30 477 l
41 539 64 588 98 623 c
133 658 179 676 238 676 c
293 676 338 659 372 626 c
406 593 423 551 423 500 c
423 425 380 342 295 252 c
130 76 l
364 76 l
386 76 403 80 416 89 c
429 98 444 116 460 143 c
474 137 l

ce} _d
/three{500 0 41 -14 431 676 sc
61 510 m
45 514 l
60 564 84 603 117 632 c
150 661 191 676 241 676 c
288 676 325 663 354 638 c
383 613 397 580 397 539 c
397 484 366 438 304 401 c
341 385 368 367 387 348 c
416 315 431 272 431 219 c
431 166 416 119 385 79 c
362 48 330 25 287 9 c
245 -6 200 -14 153 -14 c
78 -14 41 5 41 43 c
41 54 45 62 53 69 c
61 76 71 79 82 79 c
99 79 119 70 143 53 c
172 32 201 22 229 22 c
266 22 296 37 321 66 c
346 96 359 132 359 175 c
359 252 324 300 255 320 c
234 327 200 330 153 330 c
153 344 l
190 357 218 369 237 380 c
291 411 318 455 318 514 c
318 547 308 573 289 590 c
270 607 244 616 210 616 c
150 616 100 581 61 510 c

ce} _d
/four{500 0 12 0 473 676 sc
473 167 m
370 167 l
370 0 l
292 0 l
292 167 l
12 167 l
12 231 l
326 676 l
370 676 l
370 231 l
473 231 l
473 167 l

292 231 m
292 574 l
52 231 l
292 231 l

ce} _d
/five{500 0 31 -14 438 688 sc
438 681 m
402 596 l
398 587 389 583 375 583 c
181 583 l
141 498 l
214 484 267 469 300 452 c
333 436 363 409 391 370 c
414 338 426 296 426 243 c
426 195 418 155 402 122 c
387 89 362 60 328 35 c
283 2 226 -14 158 -14 c
120 -14 89 -8 66 3 c
43 14 31 29 31 48 c
31 73 46 86 76 86 c
100 86 125 76 150 55 c
176 34 200 23 221 23 c
256 23 287 40 314 75 c
342 110 356 149 356 192 c
356 256 334 306 289 342 c
231 389 160 412 76 412 c
68 412 64 415 64 420 c
65 425 l
174 662 l
381 662 l
392 662 401 664 407 667 c
414 670 421 677 429 688 c
438 681 l

ce} _d
/six{500 0 34 -14 468 684 sc
446 684 m
448 668 l
369 655 304 623 251 572 c
198 521 165 458 152 383 c
191 413 233 428 279 428 c
338 428 384 409 417 372 c
451 335 468 284 468 219 c
468 154 451 100 417 59 c
378 10 325 -14 258 -14 c
177 -14 118 20 81 87 c
50 144 34 208 34 279 c
34 388 70 480 143 555 c
184 598 227 628 270 645 c
314 663 373 676 446 684 c

378 188 m
378 317 333 382 243 382 c
210 382 182 373 160 355 c
138 338 127 308 127 266 c
127 188 139 126 163 81 c
188 36 223 14 269 14 c
304 14 331 30 350 61 c
369 93 378 135 378 188 c

ce} _d
end readonly def

/BuildGlyph {
 exch begin
 CharStrings exch
 2 copy known not {pop /.notdef} if
 true 3 1 roll get exec
 end
} _d

/BuildChar {
 1 index /Encoding get exch get
 1 index /BuildGlyph get exec
} _d

FontName currentdict end definefont pop
%!PS-Adobe-3.0 Resource-Font
%%Creator: Converted from TrueType to Type 3 by Matplotlib.
10 dict begin
/FontName /Cmmi10 def
/PaintType 0 def
/FontMatrix [0.00048828125 0 0 0.00048828125 0 0] def
/FontBBox [-70 -512 2146 1536] def
/FontType 3 def
/Encoding [/h /delta] def
/CharStrings 3 dict dup begin
/.notdef 0 def
/h{1180 0 109 -23 1124 1421 sc
109 37 m
109 45 110 51 111 55 c
408 1239 l
413 1262 417 1281 418 1294 c
418 1316 374 1327 285 1327 c
271 1327 264 1336 264 1354 c
265 1357 266 1363 268 1372 c
271 1381 274 1387 277 1392 c
281 1397 286 1399 293 1399 c
569 1421 l
575 1421 l
575 1420 577 1418 582 1415 c
587 1413 589 1412 590 1411 c
593 1404 594 1399 594 1395 c
434 756 l
518 855 618 905 733 905 c
781 905 822 897 857 880 c
892 863 920 838 939 804 c
959 771 969 731 969 684 c
969 628 956 560 931 481 c
906 402 875 313 838 215 c
819 170 809 129 809 92 c
809 51 825 31 856 31 c
909 31 954 59 989 116 c
1025 173 1050 235 1065 301 c
1068 309 1073 313 1081 313 c
1106 313 l
1111 313 1116 311 1119 307 c
1122 304 1124 300 1124 295 c
1124 294 1123 292 1122 289 c
1110 240 1092 191 1068 143 c
1045 96 1015 56 979 24 c
943 -7 901 -23 852 -23 c
804 -23 763 -7 729 26 c
695 59 678 100 678 147 c
678 172 683 199 694 227 c
733 330 765 421 790 502 c
816 583 829 654 829 715 c
829 754 821 787 806 813 c
791 839 765 852 729 852 c
656 852 592 829 537 784 c
482 739 435 680 395 606 c
256 47 l
251 26 240 10 225 -3 c
210 -16 192 -23 172 -23 c
155 -23 140 -17 127 -5 c
115 6 109 20 109 37 c

ce} _d
/delta{909 0 82 -31 924 1460 sc
410 -31 m
363 -31 319 -22 278 -4 c
237 13 202 39 171 72 c
141 105 119 142 104 183 c
89 224 82 269 82 317 c
82 402 102 485 142 565 c
183 646 238 715 307 774 c
377 833 453 872 535 893 c
495 967 464 1031 443 1084 c
422 1138 412 1193 412 1249 c
412 1290 422 1327 441 1358 c
460 1390 487 1415 521 1433 c
555 1451 593 1460 635 1460 c
676 1460 756 1446 877 1419 c
908 1412 924 1393 924 1364 c
924 1341 916 1321 899 1302 c
882 1283 863 1274 840 1274 c
823 1274 808 1278 795 1285 c
782 1293 761 1307 732 1326 c
703 1345 678 1360 655 1370 c
632 1381 609 1386 584 1386 c
556 1386 531 1377 508 1360 c
486 1343 475 1321 475 1294 c
475 1251 494 1201 532 1144 c
571 1088 625 1016 696 928 c
777 825 817 712 817 588 c
817 527 808 460 790 389 c
773 318 747 250 713 187 c
680 124 637 71 584 30 c
532 -11 474 -31 410 -31 c

414 25 m
467 25 513 53 551 108 c
590 163 619 229 638 305 c
658 382 668 446 668 498 c
668 600 632 715 561 842 c
489 822 427 780 375 716 c
323 652 284 578 257 495 c
230 412 217 333 217 258 c
217 193 234 137 268 92 c
302 47 351 25 414 25 c

ce} _d
end readonly def

/BuildGlyph {
 exch begin
 CharStrings exch
 2 copy known not {pop /.notdef} if
 true 3 1 roll get exec
 end
} _d

/BuildChar {
 1 index /Encoding get exch get
 1 index /BuildGlyph get exec
} _d

FontName currentdict end definefont pop
%!PS-Adobe-3.0 Resource-Font
%%Creator: Converted from TrueType to Type 3 by Matplotlib.
10 dict begin
/FontName /Cmr10 def
/PaintType 0 def
/FontMatrix [0.00048828125 0 0 0.00048828125 0 0] def
/FontBBox [-90 -512 2066 1536] def
/FontType 3 def
/Encoding [/u /N] def
/CharStrings 3 dict dup begin
/.notdef 0 def
/u{1137 0 61 -23 1100 905 sc
221 244 m
221 696 l
221 733 215 759 204 775 c
193 792 178 802 157 805 c
136 809 104 811 61 811 c
61 883 l
371 905 l
371 244 l
371 191 375 149 382 119 c
390 90 406 68 431 53 c
456 38 496 31 551 31 c
624 31 683 62 726 123 c
769 184 791 254 791 332 c
791 696 l
791 733 785 759 774 775 c
763 792 747 802 726 805 c
706 809 674 811 631 811 c
631 883 l
940 905 l
940 186 l
940 150 945 124 956 107 c
967 91 983 81 1004 77 c
1025 74 1057 72 1100 72 c
1100 0 l
797 -23 l
797 150 l
772 99 736 57 691 25 c
646 -7 596 -23 541 -23 c
443 -23 365 -2 307 39 c
250 81 221 149 221 244 c

ce} _d
/N{1536 0 63 0 1470 1399 sc
63 0 m
63 72 l
204 72 274 112 274 193 c
274 1315 l
229 1323 159 1327 63 1327 c
63 1399 l
455 1399 l
462 1399 466 1396 469 1391 c
1194 324 l
1194 1206 l
1194 1287 1124 1327 983 1327 c
983 1399 l
1470 1399 l
1470 1327 l
1330 1327 1260 1287 1260 1206 c
1260 18 l
1260 14 1257 10 1252 6 c
1247 2 1242 0 1239 0 c
1214 0 l
1207 0 1203 3 1200 8 c
340 1274 l
340 193 l
340 112 410 72 551 72 c
551 0 l
63 0 l

ce} _d
end readonly def

/BuildGlyph {
 exch begin
 CharStrings exch
 2 copy known not {pop /.notdef} if
 true 3 1 roll get exec
 end
} _d

/BuildChar {
 1 index /Encoding get exch get
 1 index /BuildGlyph get exec
} _d

FontName currentdict end definefont pop
end
%%EndProlog
mpldict begin
98.131 275.484 translate
415.738 241.032 0 0 clipbox
gsave
0 0 m
415.737544 0 l
415.737544 241.031625 l
0 241.031625 l
cl
1.000 setgray
fill
grestore
gsave
54.2 42.0125 m
408.537544 42.0125 l
408.537544 233.831625 l
54.2 233.831625 l
cl
1.000 setgray
fill
grestore
0.800 setlinewidth
1 setlinejoin
2 setlinecap
[] 0 setdash
0.690 setgray
gsave
354.338 191.819 54.2 42.013 clipbox
103.064731 42.0125 m
103.064731 233.831625 l
stroke
grestore
0 setlinecap
0.000 setgray
gsave
/o {
gsave
newpath
translate
0.8 setlinewidth
1 setlinejoin

0 setlinecap

0 0 m
0 -3.5 l

gsave
0.000 setgray
fill
grestore
stroke
grestore
} bind def
103.065 42.0125 o
grestore
gsave
97.064731 26.809375 translate
0.000000 rotate
/STIXGeneral-Regular 12.0 selectfont
0.000000 0.890625 moveto
/one glyphshow
5.999985 0.890625 moveto
/zero glyphshow
grestore
2 setlinecap
0.690 setgray
gsave
354.338 191.819 54.2 42.013 clipbox
157.662195 42.0125 m
157.662195 233.831625 l
stroke
grestore
0 setlinecap
0.000 setgray
gsave
/o {
gsave
newpath
translate
0.8 setlinewidth
1 setlinejoin

0 setlinecap

0 0 m
0 -3.5 l

gsave
0.000 setgray
fill
grestore
stroke
grestore
} bind def
157.662 42.0125 o
grestore
gsave
151.662195 26.809375 translate
0.000000 rotate
/STIXGeneral-Regular 12.0 selectfont
0.000000 0.890625 moveto
/two glyphshow
5.999985 0.890625 moveto
/zero glyphshow
grestore
2 setlinecap
0.690 setgray
gsave
354.338 191.819 54.2 42.013 clipbox
212.259659 42.0125 m
212.259659 233.831625 l
stroke
grestore
0 setlinecap
0.000 setgray
gsave
/o {
gsave
newpath
translate
0.8 setlinewidth
1 setlinejoin

0 setlinecap

0 0 m
0 -3.5 l

gsave
0.000 setgray
fill
grestore
stroke
grestore
} bind def
212.26 42.0125 o
grestore
gsave
206.259659 26.809375 translate
0.000000 rotate
/STIXGeneral-Regular 12.0 selectfont
0.000000 0.890625 moveto
/three glyphshow
5.999985 0.890625 moveto
/zero glyphshow
grestore
2 setlinecap
0.690 setgray
gsave
354.338 191.819 54.2 42.013 clipbox
266.857124 42.0125 m
266.857124 233.831625 l
stroke
grestore
0 setlinecap
0.000 setgray
gsave
/o {
gsave
newpath
translate
0.8 setlinewidth
1 setlinejoin

0 setlinecap

0 0 m
0 -3.5 l

gsave
0.000 setgray
fill
grestore
stroke
grestore
} bind def
266.857 42.0125 o
grestore
gsave
260.857124 26.809375 translate
0.000000 rotate
/STIXGeneral-Regular 12.0 selectfont
0.000000 0.890625 moveto
/four glyphshow
5.999985 0.890625 moveto
/zero glyphshow
grestore
2 setlinecap
0.690 setgray
gsave
354.338 191.819 54.2 42.013 clipbox
321.454588 42.0125 m
321.454588 233.831625 l
stroke
grestore
0 setlinecap
0.000 setgray
gsave
/o {
gsave
newpath
translate
0.8 setlinewidth
1 setlinejoin

0 setlinecap

0 0 m
0 -3.5 l

gsave
0.000 setgray
fill
grestore
stroke
grestore
} bind def
321.455 42.0125 o
grestore
gsave
315.454588 26.809375 translate
0.000000 rotate
/STIXGeneral-Regular 12.0 selectfont
0.000000 0.750000 moveto
/five glyphshow
5.999985 0.750000 moveto
/zero glyphshow
grestore
2 setlinecap
0.690 setgray
gsave
354.338 191.819 54.2 42.013 clipbox
376.052053 42.0125 m
376.052053 233.831625 l
stroke
grestore
0 setlinecap
0.000 setgray
gsave
/o {
gsave
newpath
translate
0.8 setlinewidth
1 setlinejoin

0 setlinecap

0 0 m
0 -3.5 l

gsave
0.000 setgray
fill
grestore
stroke
grestore
} bind def
376.052 42.0125 o
grestore
gsave
370.052053 26.809375 translate
0.000000 rotate
/STIXGeneral-Regular 12.0 selectfont
0.000000 0.796875 moveto
/six glyphshow
5.999985 0.796875 moveto
/zero glyphshow
grestore
gsave
224.868772 10.231250 translate
0.000000 rotate
/Cmmi10 14.0 selectfont
0.000000 0.015625 moveto
/delta glyphshow
/Cmmi10 9.799999999999999 selectfont
6.213867 -2.365250 moveto
/h glyphshow
grestore
2 setlinecap
0.690 setgray
gsave
354.338 191.819 54.2 42.013 clipbox
54.2 78.152017 m
408.537544 78.152017 l
stroke
grestore
0 setlinecap
0.000 setgray
gsave
/o {
gsave
newpath
translate
0.8 setlinewidth
1 setlinejoin

0 setlinecap

-0 0 m
-3.5 0 l

gsave
0.000 setgray
fill
grestore
stroke
grestore
} bind def
54.2 78.152 o
grestore
gsave
26.200000 74.050455 translate
0.000000 rotate
/STIXGeneral-Regular 12.0 selectfont
0.000000 0.890625 moveto
/one glyphshow
5.999985 0.890625 moveto
/two glyphshow
11.999969 0.890625 moveto
/period glyphshow
14.999954 0.890625 moveto
/two glyphshow
grestore
2 setlinecap
0.690 setgray
gsave
354.338 191.819 54.2 42.013 clipbox
54.2 132.836377 m
408.537544 132.836377 l
stroke
grestore
0 setlinecap
0.000 setgray
gsave
/o {
gsave
newpath
translate
0.8 setlinewidth
1 setlinejoin

0 setlinecap

-0 0 m
-3.5 0 l

gsave
0.000 setgray
fill
grestore
stroke
grestore
} bind def
54.2 132.836 o
grestore
gsave
26.200000 128.734815 translate
0.000000 rotate
/STIXGeneral-Regular 12.0 selectfont
0.000000 0.890625 moveto
/one glyphshow
5.999985 0.890625 moveto
/two glyphshow
11.999969 0.890625 moveto
/period glyphshow
14.999954 0.890625 moveto
/three glyphshow
grestore
2 setlinecap
0.690 setgray
gsave
354.338 191.819 54.2 42.013 clipbox
54.2 187.520737 m
408.537544 187.520737 l
stroke
grestore
0 setlinecap
0.000 setgray
gsave
/o {
gsave
newpath
translate
0.8 setlinewidth
1 setlinejoin

0 setlinecap

-0 0 m
-3.5 0 l

gsave
0.000 setgray
fill
grestore
stroke
grestore
} bind def
54.2 187.521 o
grestore
gsave
26.200000 183.419174 translate
0.000000 rotate
/STIXGeneral-Regular 12.0 selectfont
0.000000 0.890625 moveto
/one glyphshow
5.999985 0.890625 moveto
/two glyphshow
11.999969 0.890625 moveto
/period glyphshow
14.999954 0.890625 moveto
/four glyphshow
grestore
gsave
19.168750 128.422062 translate
90.000000 rotate
/Cmr10 14.0 selectfont
0.000000 0.562500 moveto
/N glyphshow
10.500000 0.562500 moveto
/u glyphshow
0.0 12.25 18.2724609375 0.875 rectfill
grestore
1.500 setlinewidth
2 setlinecap
0.122 0.467 0.706 setrgbcolor
gsave
354.338 191.819 54.2 42.013 clipbox
70.306252 164.968016 m
81.225745 59.866613 l
86.685491 99.804293 l
92.145238 130.755364 l
97.604984 116.904455 l
103.064731 66.532597 l
108.524477 50.731551 l
113.984224 97.368534 l
119.44397 121.23807 l
124.903716 97.207346 l
130.363463 94.503897 l
135.823209 102.662639 l
141.282956 112.78326 l
146.742702 156.380723 l
152.202449 160.006751 l
157.662195 127.279795 l
163.121941 117.247012 l
168.581688 111.59598 l
174.041434 167.13092 l
179.501181 126.657906 l
184.960927 136.290328 l
190.420674 122.5784 l
195.88042 129.675159 l
201.340167 160.336789 l
206.799913 166.433864 l
212.259659 170.751594 l
217.719406 151.144613 l
223.179152 133.41651 l
228.638899 127.495551 l
234.098645 156.516875 l
239.558392 175.853364 l
245.018138 146.948952 l
250.477885 163.436623 l
255.937631 189.736715 l
261.397377 144.267373 l
266.857124 179.733552 l
272.31687 169.364232 l
277.776617 136.909553 l
283.236363 190.041937 l
288.69611 183.925432 l
294.155856 163.177151 l
299.615602 185.693272 l
305.075349 149.967726 l
310.535095 206.829639 l
315.994842 180.035628 l
321.454588 171.35348 l
326.914335 149.833244 l
332.374081 225.112574 l
337.833828 159.557275 l
343.293574 151.489521 l
348.75332 159.412138 l
354.213067 179.441218 l
359.672813 154.706972 l
365.13256 185.081989 l
370.592306 160.342094 l
376.052053 141.774694 l
381.511799 201.314051 l
392.431292 194.041514 l
stroke
grestore
1.000 setlinewidth
0 setlinecap
gsave
354.338 191.819 54.2 42.013 clipbox
/o {
gsave
newpath
translate
1.0 setlinewidth
1 setlinejoin

0 setlinecap

0 -1.5 m
0.397805 -1.5 0.77937 -1.341951 1.06066 -1.06066 c
1.341951 -0.77937 1.5 -0.397805 1.5 0 c
1.5 0.397805 1.341951 0.77937 1.06066 1.06066 c
0.77937 1.341951 0.397805 1.5 0 1.5 c
-0.397805 1.5 -0.77937 1.341951 -1.06066 1.06066 c
-1.341951 0.77937 -1.5 0.397805 -1.5 0 c
-1.5 -0.397805 -1.341951 -0.77937 -1.06066 -1.06066 c
-0.77937 -1.341951 -0.397805 -1.5 0 -1.5 c
cl

gsave
0.122 0.467 0.706 setrgbcolor
fill
grestore
stroke
grestore
} bind def
70.3063 164.968 o
81.2257 59.8666 o
86.6855 99.8043 o
92.1452 130.755 o
97.605 116.904 o
103.065 66.5326 o
108.524 50.7316 o
113.984 97.3685 o
119.444 121.238 o
124.904 97.2073 o
130.363 94.5039 o
135.823 102.663 o
141.283 112.783 o
146.743 156.381 o
152.202 160.007 o
157.662 127.28 o
163.122 117.247 o
168.582 111.596 o
174.041 167.131 o
179.501 126.658 o
184.961 136.29 o
190.421 122.578 o
195.88 129.675 o
201.34 160.337 o
206.8 166.434 o
212.26 170.752 o
217.719 151.145 o
223.179 133.417 o
228.639 127.496 o
234.099 156.517 o
239.558 175.853 o
245.018 146.949 o
250.478 163.437 o
255.938 189.737 o
261.397 144.267 o
266.857 179.734 o
272.317 169.364 o
277.777 136.91 o
283.236 190.042 o
288.696 183.925 o
294.156 163.177 o
299.616 185.693 o
305.075 149.968 o
310.535 206.83 o
315.995 180.036 o
321.455 171.353 o
326.914 149.833 o
332.374 225.113 o
337.834 159.557 o
343.294 151.49 o
348.753 159.412 o
354.213 179.441 o
359.673 154.707 o
365.133 185.082 o
370.592 160.342 o
376.052 141.775 o
381.512 201.314 o
392.431 194.042 o
grestore
1.500 setlinewidth
[5.55 2.4] 0 setdash
1.000 0.000 0.000 setrgbcolor
gsave
354.338 191.819 54.2 42.013 clipbox
70.306252 194.041514 m
392.431292 194.041514 l
stroke
grestore
0.800 setlinewidth
0 setlinejoin
2 setlinecap
[] 0 setdash
0.000 setgray
gsave
54.2 42.0125 m
54.2 233.831625 l
stroke
grestore
gsave
408.537544 42.0125 m
408.537544 233.831625 l
stroke
grestore
gsave
54.2 42.0125 m
408.537544 42.0125 l
stroke
grestore
gsave
54.2 233.831625 m
408.537544 233.831625 l
stroke
grestore

end
showpage
