%!PS-Adobe-3.0 EPSF-3.0
%%Title: dvd_symmetry.eps
%%Creator: Matplotlib v3.5.3, https://matplotlib.org/
%%CreationDate: Tue Apr 18 16:26:42 2023
%%Orientation: portrait
%%BoundingBox: 58 292 554 500
%%HiResBoundingBox: 58.737140 292.187500 553.262860 499.812500
%%EndComments
%%BeginProlog
/mpldict 12 dict def
mpldict begin
/_d { bind def } bind def
/m { moveto } _d
/l { lineto } _d
/r { rlineto } _d
/c { curveto } _d
/cl { closepath } _d
/ce { closepath eofill } _d
/box {
      m
      1 index 0 r
      0 exch r
      neg 0 r
      cl
    } _d
/clipbox {
      box
      clip
      newpath
    } _d
/sc { setcachedevice } _d
%!PS-Adobe-3.0 Resource-Font
%%Creator: Converted from TrueType to Type 3 by Matplotlib.
10 dict begin
/FontName /STIXGeneral-Regular def
/PaintType 0 def
/FontMatrix [0.001 0 0 0.001 0 0] def
/FontBBox [-970 -443 2000 1023] def
/FontType 3 def
/Encoding [/minus /period /zero /one /two /four /five /six /eight /nine /a /b /c /d /e /g /h /i /l /r /s /t /u /y] def
/CharStrings 25 dict dup begin
/.notdef 0 def
/minus{685 0 64 220 621 286 sc
621 220 m
64 220 l
64 286 l
621 286 l
621 220 l

ce} _d
/period{250 0 70 -11 181 100 sc
181 43 m
181 28 175 16 164 5 c
153 -6 140 -11 125 -11 c
110 -11 97 -6 86 5 c
75 16 70 29 70 44 c
70 59 75 72 86 83 c
97 94 111 100 126 100 c
141 100 153 94 164 83 c
175 72 181 58 181 43 c

ce} _d
/zero{500 0 24 -14 476 676 sc
476 330 m
476 285 472 243 463 203 c
454 164 441 127 424 94 c
407 61 384 34 354 15 c
324 -4 289 -14 250 -14 c
209 -14 174 -4 143 17 c
112 38 89 65 72 100 c
55 135 43 172 35 211 c
28 250 24 292 24 336 c
24 398 32 454 47 503 c
62 553 88 594 123 627 c
159 660 203 676 254 676 c
319 676 373 644 414 580 c
455 516 476 433 476 330 c

380 325 m
380 430 369 511 346 566 c
324 622 291 650 248 650 c
207 650 175 622 153 566 c
131 510 120 431 120 329 c
120 226 131 148 153 93 c
175 39 207 12 250 12 c
292 12 324 39 346 93 c
369 148 380 225 380 325 c

ce} _d
/one{500 0 111 0 394 676 sc
394 0 m
118 0 l
118 15 l
155 17 180 24 193 35 c
206 47 213 67 213 95 c
213 544 l
213 577 203 593 183 593 c
174 593 159 589 138 581 c
111 571 l
111 585 l
290 676 l
299 673 l
299 76 l
299 54 306 38 319 29 c
332 20 357 15 394 15 c
394 0 l

ce} _d
/two{500 0 29 0 474 676 sc
474 137 m
420 0 l
29 0 l
29 12 l
207 201 l
254 250 287 294 307 335 c
327 376 337 418 337 461 c
337 506 325 540 300 565 c
275 590 241 602 198 602 c
162 602 133 593 112 574 c
91 555 71 521 51 472 c
30 477 l
41 539 64 588 98 623 c
133 658 179 676 238 676 c
293 676 338 659 372 626 c
406 593 423 551 423 500 c
423 425 380 342 295 252 c
130 76 l
364 76 l
386 76 403 80 416 89 c
429 98 444 116 460 143 c
474 137 l

ce} _d
/four{500 0 12 0 473 676 sc
473 167 m
370 167 l
370 0 l
292 0 l
292 167 l
12 167 l
12 231 l
326 676 l
370 676 l
370 231 l
473 231 l
473 167 l

292 231 m
292 574 l
52 231 l
292 231 l

ce} _d
/five{500 0 31 -14 438 688 sc
438 681 m
402 596 l
398 587 389 583 375 583 c
181 583 l
141 498 l
214 484 267 469 300 452 c
333 436 363 409 391 370 c
414 338 426 296 426 243 c
426 195 418 155 402 122 c
387 89 362 60 328 35 c
283 2 226 -14 158 -14 c
120 -14 89 -8 66 3 c
43 14 31 29 31 48 c
31 73 46 86 76 86 c
100 86 125 76 150 55 c
176 34 200 23 221 23 c
256 23 287 40 314 75 c
342 110 356 149 356 192 c
356 256 334 306 289 342 c
231 389 160 412 76 412 c
68 412 64 415 64 420 c
65 425 l
174 662 l
381 662 l
392 662 401 664 407 667 c
414 670 421 677 429 688 c
438 681 l

ce} _d
/six{500 0 34 -14 468 684 sc
446 684 m
448 668 l
369 655 304 623 251 572 c
198 521 165 458 152 383 c
191 413 233 428 279 428 c
338 428 384 409 417 372 c
451 335 468 284 468 219 c
468 154 451 100 417 59 c
378 10 325 -14 258 -14 c
177 -14 118 20 81 87 c
50 144 34 208 34 279 c
34 388 70 480 143 555 c
184 598 227 628 270 645 c
314 663 373 676 446 684 c

378 188 m
378 317 333 382 243 382 c
210 382 182 373 160 355 c
138 338 127 308 127 266 c
127 188 139 126 163 81 c
188 36 223 14 269 14 c
304 14 331 30 350 61 c
369 93 378 135 378 188 c

ce} _d
/eight{500 0 56 -14 445 676 sc
445 155 m
445 104 427 63 391 32 c
356 1 308 -14 248 -14 c
192 -14 146 1 110 32 c
74 63 56 102 56 149 c
56 184 65 214 82 239 c
99 264 134 295 186 332 c
136 373 103 407 86 432 c
70 457 62 487 62 520 c
62 567 80 605 116 633 c
153 662 199 676 256 676 c
305 676 345 662 376 634 c
408 607 424 573 424 533 c
424 496 414 467 395 445 c
376 423 341 398 290 371 c
350 331 391 295 412 264 c
434 233 445 196 445 155 c

355 533 m
355 568 345 595 326 616 c
307 637 280 648 246 648 c
212 648 185 639 165 621 c
146 604 136 580 136 549 c
136 518 146 490 165 465 c
185 440 217 415 261 389 c
295 409 319 430 333 452 c
348 475 355 502 355 533 c

271 272 m
212 312 l
183 288 162 264 150 241 c
138 218 132 191 132 158 c
132 113 143 77 166 52 c
189 27 220 14 259 14 c
292 14 318 24 338 44 c
359 65 369 91 369 124 c
369 154 361 180 346 203 c
331 226 306 249 271 272 c

ce} _d
/nine{500 0 30 -22 459 676 sc
59 -22 m
56 -2 l
133 11 197 44 250 95 c
303 146 340 213 360 294 c
321 256 271 237 210 237 c
156 237 112 256 79 293 c
46 330 30 379 30 440 c
30 507 50 563 89 608 c
129 653 179 676 238 676 c
301 676 354 651 395 600 c
438 547 459 478 459 394 c
459 335 449 280 428 228 c
408 177 378 133 339 97 c
298 60 257 33 218 16 c
179 0 126 -13 59 -22 c

362 355 m
362 394 l
362 563 318 648 230 648 c
199 648 174 637 157 614 c
147 601 139 581 132 554 c
125 527 122 501 122 474 c
122 415 133 367 155 332 c
178 297 208 280 245 280 c
272 280 298 286 323 299 c
349 312 362 331 362 355 c

ce} _d
/a{444 0 37 -10 442 460 sc
442 66 m
442 38 l
417 6 387 -10 352 -10 c
314 -10 293 14 288 63 c
287 63 l
244 14 196 -10 142 -10 c
111 -10 85 -1 66 17 c
47 36 37 61 37 94 c
37 141 60 180 107 211 c
139 232 199 259 287 292 c
287 346 l
287 376 280 398 265 413 c
251 428 232 436 209 436 c
189 436 172 431 159 421 c
146 412 139 400 139 387 c
139 381 140 374 142 367 c
144 360 145 352 145 345 c
145 335 140 326 131 317 c
122 308 112 304 99 304 c
88 304 78 308 69 317 c
60 326 56 337 56 350 c
56 382 73 409 107 430 c
138 450 177 460 222 460 c
276 460 315 445 340 415 c
352 401 360 387 363 372 c
366 358 368 335 368 304 c
368 113 l
368 69 378 47 399 47 c
412 47 427 53 442 66 c

287 127 m
287 268 l
226 247 183 225 159 202 c
136 181 125 156 125 125 c
125 100 131 80 144 67 c
157 54 173 48 194 48 c
216 48 235 53 252 64 c
266 74 275 83 280 92 c
285 101 287 112 287 127 c

ce} _d
/b{500 0 3 -10 468 683 sc
153 681 m
153 376 l
164 401 181 422 205 437 c
230 452 257 460 288 460 c
341 460 384 439 417 397 c
451 355 468 303 468 240 c
468 167 446 107 401 60 c
356 13 301 -10 234 -10 c
193 -10 156 -3 121 10 c
86 24 69 39 69 56 c
69 566 l
69 591 66 606 60 613 c
54 620 41 624 20 624 c
15 624 10 623 3 622 c
3 639 l
33 648 l
101 669 139 680 148 683 c
153 681 l

153 318 m
153 74 l
153 59 162 46 181 36 c
200 27 223 22 250 22 c
289 22 320 36 343 65 c
368 96 380 140 380 197 c
380 262 367 313 341 350 c
319 381 289 397 252 397 c
225 397 202 389 182 373 c
163 358 153 339 153 318 c

ce} _d
/c{444 0 25 -10 412 460 sc
398 156 m
412 147 l
383 91 356 53 330 32 c
296 4 258 -10 215 -10 c
160 -10 114 11 78 52 c
43 94 25 147 25 212 c
25 297 53 362 109 409 c
150 443 195 460 244 460 c
286 460 322 450 352 429 c
383 409 398 385 398 357 c
398 346 393 336 384 327 c
375 319 364 315 351 315 c
328 315 312 330 303 361 c
297 383 l
292 402 285 414 277 421 c
269 428 256 431 238 431 c
197 431 164 415 139 383 c
114 351 102 309 102 257 c
102 200 116 153 145 116 c
174 80 211 62 257 62 c
286 62 310 69 331 82 c
352 96 374 121 398 156 c

ce} _d
/d{500 0 27 -10 491 683 sc
491 42 m
344 -10 l
340 -7 l
340 57 l
308 12 265 -10 212 -10 c
157 -10 112 10 78 49 c
44 89 27 141 27 205 c
27 276 47 336 88 385 c
129 435 178 460 235 460 c
271 460 306 446 340 417 c
340 573 l
340 594 337 607 331 614 c
325 621 313 624 294 624 c
285 624 277 624 272 623 c
272 639 l
333 655 382 670 419 683 c
424 681 l
424 114 l
424 91 427 75 432 68 c
438 61 450 57 468 57 c
472 57 480 57 491 58 c
491 42 l

340 102 m
340 332 l
340 359 330 382 309 402 c
289 422 265 432 238 432 c
200 432 170 415 147 381 c
124 347 113 302 113 245 c
113 184 125 134 150 97 c
175 60 209 42 251 42 c
282 42 307 53 325 74 c
335 85 340 95 340 102 c

ce} _d
/e{444 0 25 -10 424 460 sc
408 164 m
424 157 l
384 46 314 -10 215 -10 c
156 -10 110 10 76 51 c
42 92 25 148 25 217 c
25 288 44 347 82 392 c
120 437 170 460 232 460 c
292 460 338 437 371 391 c
390 364 402 326 405 277 c
97 277 l
100 235 104 203 109 181 c
115 159 126 137 143 114 c
171 77 208 59 254 59 c
287 59 314 67 336 83 c
359 99 383 126 408 164 c

99 309 m
303 309 l
297 351 287 381 273 398 c
260 415 237 424 205 424 c
177 424 154 414 135 394 c
116 375 104 346 99 309 c

ce} _d
/g{500 0 28 -218 470 460 sc
470 388 m
387 388 l
400 359 406 331 406 304 c
406 253 389 214 354 188 c
319 162 285 149 250 149 c
243 149 230 150 212 152 c
193 154 l
180 150 166 141 153 127 c
140 113 133 101 133 91 c
133 76 159 67 211 64 c
340 58 l
377 57 406 46 428 27 c
450 8 461 -18 461 -49 c
461 -88 441 -123 401 -154 c
346 -197 279 -218 201 -218 c
153 -218 112 -208 78 -189 c
45 -170 28 -148 28 -121 c
28 -102 35 -84 50 -65 c
65 -47 90 -25 126 1 c
105 11 90 20 83 27 c
76 34 73 43 73 54 c
73 73 88 96 119 123 c
134 136 149 150 162 163 c
129 180 105 198 90 219 c
76 240 69 266 69 297 c
69 342 85 381 117 412 c
150 444 189 460 236 460 c
263 460 289 455 316 445 c
338 437 l
357 430 376 427 393 427 c
470 427 l
470 388 l

152 338 m
152 335 l
152 287 161 248 180 218 c
199 189 224 174 255 174 c
278 174 296 182 309 198 c
322 215 329 237 329 264 c
329 308 319 348 299 385 c
282 416 258 432 226 432 c
203 432 184 424 171 407 c
158 390 152 367 152 338 c

433 -64 m
433 -45 424 -32 405 -25 c
387 -18 355 -15 309 -15 c
243 -15 189 -11 147 -2 c
127 -26 114 -43 107 -54 c
101 -65 98 -77 98 -88 c
98 -110 111 -128 137 -141 c
164 -154 199 -161 243 -161 c
300 -161 345 -152 380 -134 c
415 -117 433 -93 433 -64 c

ce} _d
/h{500 0 9 0 487 683 sc
487 0 m
275 0 l
275 15 l
304 18 323 25 331 35 c
339 45 343 67 343 102 c
343 300 l
343 371 318 406 269 406 c
249 406 231 401 214 392 c
197 383 178 366 157 343 c
157 102 l
157 67 161 45 169 35 c
177 25 196 18 225 15 c
225 0 l
9 0 l
9 15 l
38 19 55 26 62 35 c
69 44 73 67 73 102 c
73 573 l
73 594 70 608 63 614 c
57 621 43 624 22 624 c
16 624 12 624 10 623 c
10 639 l
37 647 l
88 662 127 674 152 683 c
157 680 l
157 376 l
180 406 203 427 226 440 c
249 453 275 460 304 460 c
386 460 427 407 427 301 c
427 102 l
427 67 430 45 436 36 c
443 27 460 20 487 15 c
487 0 l

ce} _d
/i{278 0 16 0 253 683 sc
180 632 m
180 617 175 605 165 595 c
155 586 143 581 128 581 c
114 581 102 586 92 595 c
83 605 78 617 78 632 c
78 646 83 658 93 668 c
103 678 115 683 129 683 c
144 683 156 678 165 668 c
175 658 180 646 180 632 c

253 0 m
16 0 l
16 15 l
51 17 72 23 81 33 c
90 43 95 67 95 104 c
95 331 l
95 354 93 371 88 380 c
83 389 75 394 62 394 c
46 394 32 392 20 389 c
20 405 l
175 460 l
179 456 l
179 105 l
179 68 183 44 191 34 c
200 24 220 18 253 15 c
253 0 l

ce} _d
/l{278 0 19 0 257 683 sc
257 0 m
21 0 l
21 15 l
52 18 73 24 83 34 c
93 45 98 64 98 92 c
98 561 l
98 585 95 602 89 611 c
83 620 72 625 56 625 c
42 625 30 624 19 623 c
19 639 l
82 654 135 669 177 683 c
182 679 l
182 87 l
182 59 187 40 196 31 c
205 22 226 17 257 15 c
257 0 l

ce} _d
/r{333 0 5 0 335 460 sc
160 458 m
160 366 l
185 402 206 427 223 440 c
240 453 259 460 280 460 c
297 460 311 455 320 446 c
330 437 335 424 335 407 c
335 393 331 382 324 374 c
317 366 308 362 296 362 c
283 362 270 369 256 382 c
245 392 237 397 230 397 c
216 397 201 387 184 368 c
168 349 160 331 160 315 c
160 90 l
160 61 166 42 177 32 c
188 22 211 16 245 15 c
245 0 l
5 0 l
5 15 l
37 21 57 28 64 35 c
72 42 76 59 76 84 c
76 334 l
76 356 73 371 68 380 c
63 389 55 394 42 394 c
31 394 20 393 7 390 c
7 406 l
49 419 98 437 155 460 c
160 458 l

ce} _d
/s{389 0 51 -10 348 459 sc
156 301 m
260 238 l
293 218 316 199 329 182 c
342 165 348 142 348 115 c
348 82 334 52 306 27 c
279 2 246 -10 208 -10 c
177 -10 152 -7 135 -1 c
117 5 102 8 89 8 c
78 8 70 4 65 -4 c
52 -4 l
52 153 l
68 153 l
79 104 94 69 114 46 c
134 23 161 12 195 12 c
220 12 240 19 255 33 c
270 47 278 65 278 86 c
278 117 260 142 225 161 c
171 191 l
91 236 51 284 51 336 c
51 375 63 405 88 426 c
113 448 147 459 189 459 c
218 459 241 455 256 448 c
268 443 277 440 284 440 c
289 440 294 443 300 450 c
311 450 l
316 314 l
301 314 l
290 359 275 391 258 409 c
241 428 218 437 188 437 c
165 437 147 431 133 420 c
120 409 113 392 113 369 c
113 358 117 345 124 332 c
132 319 143 309 156 301 c

ce} _d
/t{278 0 13 -10 279 579 sc
266 77 m
279 66 l
247 15 207 -10 158 -10 c
99 -10 70 32 70 117 c
70 418 l
17 418 l
14 420 13 422 13 425 c
13 430 19 437 30 444 c
55 459 88 494 127 551 c
128 553 131 557 136 563 c
141 570 145 575 147 579 c
152 579 154 575 154 566 c
154 450 l
255 450 l
255 418 l
154 418 l
154 132 l
154 100 158 77 166 63 c
174 49 187 42 206 42 c
226 42 246 54 266 77 c

ce} _d
/u{500 0 9 -10 480 450 sc
480 50 m
480 36 l
428 22 382 7 343 -9 c
338 -6 l
338 76 l
336 76 l
294 19 246 -10 193 -10 c
155 -10 125 2 103 25 c
82 48 71 79 71 118 c
71 369 l
71 394 67 411 58 420 c
49 429 33 435 9 436 c
9 450 l
155 450 l
155 127 l
155 104 162 85 175 70 c
189 55 206 48 226 48 c
259 48 287 58 310 79 c
319 87 325 94 328 101 c
331 108 333 120 333 137 c
333 368 l
333 394 328 411 319 418 c
310 426 290 431 259 433 c
259 450 l
417 450 l
417 107 l
417 84 421 68 428 61 c
436 54 451 50 474 50 c
480 50 l

ce} _d
/y{500 0 14 -218 475 450 sc
475 450 m
475 435 l
463 434 453 429 446 422 c
439 415 432 402 425 384 c
275 -25 l
249 -96 223 -145 196 -174 c
170 -203 138 -218 100 -218 c
79 -218 62 -212 49 -201 c
36 -190 30 -177 30 -160 c
30 -147 34 -136 42 -127 c
51 -118 61 -114 73 -114 c
92 -114 110 -118 125 -127 c
134 -132 142 -134 151 -134 c
165 -134 182 -119 201 -90 c
210 -77 219 -58 228 -33 c
237 -8 241 9 241 18 c
241 27 227 60 199 119 c
67 401 l
58 420 41 432 14 436 c
14 450 l
219 450 l
219 435 l
198 434 183 432 174 428 c
166 424 162 417 162 408 c
162 401 166 387 175 367 c
287 117 l
384 393 l
387 399 388 405 388 411 c
388 427 373 435 342 435 c
342 450 l
475 450 l

ce} _d
end readonly def

/BuildGlyph {
 exch begin
 CharStrings exch
 2 copy known not {pop /.notdef} if
 true 3 1 roll get exec
 end
} _d

/BuildChar {
 1 index /Encoding get exch get
 1 index /BuildGlyph get exec
} _d

FontName currentdict end definefont pop
%!PS-Adobe-3.0 Resource-Font
%%Creator: Converted from TrueType to Type 3 by Matplotlib.
10 dict begin
/FontName /Cmmi10 def
/PaintType 0 def
/FontMatrix [0.00048828125 0 0 0.00048828125 0 0] def
/FontBBox [-70 -512 2146 1536] def
/FontType 3 def
/Encoding [/x /y /v] def
/CharStrings 4 dict dup begin
/.notdef 0 def
/x{1169 0 63 -23 1077 905 sc
160 59 m
184 40 218 31 262 31 c
305 31 342 51 375 92 c
408 133 430 178 442 227 c
535 590 l
550 656 557 701 557 725 c
557 759 547 789 528 814 c
509 839 483 852 449 852 c
406 852 365 838 327 811 c
289 784 257 750 231 708 c
205 667 187 625 176 582 c
173 573 168 569 160 569 c
135 569 l
124 569 119 575 119 588 c
119 594 l
132 645 155 694 187 742 c
219 791 258 830 304 860 c
351 890 400 905 453 905 c
503 905 548 892 588 865 c
629 838 657 802 674 756 c
697 798 727 833 763 862 c
800 891 840 905 883 905 c
912 905 942 900 973 889 c
1004 879 1029 863 1048 842 c
1067 821 1077 794 1077 762 c
1077 727 1066 697 1043 672 c
1021 647 993 635 958 635 c
936 635 918 642 903 656 c
888 670 881 688 881 709 c
881 738 891 763 910 784 c
930 806 954 819 981 823 c
956 842 922 852 879 852 c
835 852 797 832 764 791 c
732 750 709 705 696 655 c
606 293 l
591 238 584 193 584 158 c
584 123 594 93 613 68 c
633 43 659 31 692 31 c
756 31 813 59 863 115 c
914 172 947 234 963 301 c
966 309 971 313 979 313 c
1004 313 l
1009 313 1014 311 1017 307 c
1020 304 1022 300 1022 295 c
1022 294 1021 292 1020 289 c
1001 208 960 135 898 72 c
836 9 766 -23 688 -23 c
638 -23 593 -10 552 17 c
512 44 484 81 467 127 c
446 87 416 52 378 22 c
341 -8 301 -23 258 -23 c
229 -23 198 -18 167 -7 c
136 3 111 19 92 40 c
73 61 63 88 63 121 c
63 153 74 182 96 208 c
119 235 147 248 180 248 c
203 248 222 241 237 227 c
252 214 260 196 260 174 c
260 145 250 120 231 99 c
212 78 189 64 160 59 c

ce} _d
/y{1004 0 55 -420 1008 905 sc
172 -293 m
201 -342 251 -367 322 -367 c
387 -367 443 -344 490 -299 c
537 -254 575 -199 604 -134 c
633 -70 656 -4 672 63 c
611 6 546 -23 475 -23 c
421 -23 375 -14 337 5 c
299 24 269 51 248 88 c
227 125 217 170 217 223 c
217 268 223 313 235 360 c
247 407 264 460 285 517 c
307 575 326 625 342 668 c
360 718 369 759 369 791 c
369 832 354 852 324 852 c
270 852 225 824 190 768 c
155 713 130 651 113 582 c
110 573 105 569 96 569 c
72 569 l
61 569 55 575 55 588 c
55 594 l
77 675 111 747 156 810 c
201 873 259 905 328 905 c
377 905 418 889 451 857 c
485 825 502 784 502 735 c
502 710 496 683 485 655 c
479 638 465 602 444 546 c
423 490 406 444 395 407 c
384 370 374 334 367 299 c
360 264 356 228 356 193 c
356 148 366 109 385 78 c
404 47 435 31 477 31 c
562 31 638 83 705 186 c
860 817 l
865 835 875 850 892 863 c
909 876 927 883 946 883 c
963 883 977 878 989 867 c
1002 856 1008 842 1008 825 c
1008 817 1007 812 1006 809 c
803 -6 l
785 -76 752 -143 704 -207 c
656 -271 598 -322 530 -361 c
463 -400 392 -420 319 -420 c
284 -420 249 -413 214 -399 c
179 -386 151 -365 130 -338 c
109 -311 98 -279 98 -242 c
98 -205 109 -172 131 -145 c
153 -118 182 -104 219 -104 c
241 -104 259 -111 274 -124 c
289 -138 297 -156 297 -178 c
297 -209 285 -237 262 -260 c
239 -283 211 -295 180 -295 c
179 -294 177 -294 176 -293 c
175 -293 173 -293 172 -293 c

ce} _d
/v{991 0 55 -23 956 907 sc
219 231 m
219 262 223 295 230 332 c
237 369 245 399 252 422 c
259 446 276 492 302 561 c
328 630 341 665 342 668 c
360 718 369 759 369 791 c
369 832 354 852 324 852 c
270 852 225 824 190 768 c
155 713 130 651 113 582 c
110 573 105 569 96 569 c
72 569 l
61 569 55 575 55 588 c
55 594 l
77 675 111 747 156 810 c
201 873 259 905 328 905 c
377 905 418 889 451 857 c
485 825 502 784 502 735 c
502 710 496 683 485 655 c
458 586 437 530 422 488 c
407 447 392 400 379 348 c
366 297 360 249 360 205 c
360 154 372 112 395 79 c
419 47 456 31 506 31 c
601 31 686 104 762 250 c
786 297 809 353 830 417 c
851 481 862 533 862 573 c
862 614 855 646 842 669 c
829 692 811 716 790 741 c
769 766 758 786 758 801 c
758 828 769 852 791 874 c
813 896 837 907 864 907 c
897 907 920 892 934 862 c
949 832 956 798 956 760 c
956 715 949 661 936 598 c
923 535 905 470 882 403 c
859 336 838 283 819 244 c
729 66 624 -23 504 -23 c
418 -23 349 -2 297 41 c
245 84 219 148 219 231 c

ce} _d
end readonly def

/BuildGlyph {
 exch begin
 CharStrings exch
 2 copy known not {pop /.notdef} if
 true 3 1 roll get exec
 end
} _d

/BuildChar {
 1 index /Encoding get exch get
 1 index /BuildGlyph get exec
} _d

FontName currentdict end definefont pop
end
%%EndProlog
mpldict begin
58.737 292.188 translate
494.526 207.625 0 0 clipbox
gsave
0 0 m
494.525721 0 l
494.525721 207.625 l
0 207.625 l
cl
1.000 setgray
fill
grestore
gsave
57.79375 41.60625 m
479.825721 41.60625 l
479.825721 200.425 l
57.79375 200.425 l
cl
1.000 setgray
fill
grestore
0.800 setlinewidth
1 setlinejoin
2 setlinecap
[] 0 setdash
0.690 setgray
gsave
422.032 158.819 57.794 41.606 clipbox
57.79375 41.60625 m
57.79375 200.425 l
stroke
grestore
0 setlinecap
0.000 setgray
gsave
/o {
gsave
newpath
translate
0.8 setlinewidth
1 setlinejoin

0 setlinecap

0 0 m
0 -3.5 l

gsave
0.000 setgray
fill
grestore
stroke
grestore
} bind def
57.7938 41.6063 o
grestore
gsave
50.293750 26.403125 translate
0.000000 rotate
/STIXGeneral-Regular 12.0 selectfont
0.000000 0.890625 moveto
/zero glyphshow
5.999985 0.890625 moveto
/period glyphshow
8.999969 0.890625 moveto
/zero glyphshow
grestore
2 setlinecap
0.690 setgray
gsave
422.032 158.819 57.794 41.606 clipbox
142.200144 41.60625 m
142.200144 200.425 l
stroke
grestore
0 setlinecap
0.000 setgray
gsave
/o {
gsave
newpath
translate
0.8 setlinewidth
1 setlinejoin

0 setlinecap

0 0 m
0 -3.5 l

gsave
0.000 setgray
fill
grestore
stroke
grestore
} bind def
142.2 41.6063 o
grestore
gsave
134.700144 26.403125 translate
0.000000 rotate
/STIXGeneral-Regular 12.0 selectfont
0.000000 0.890625 moveto
/zero glyphshow
5.999985 0.890625 moveto
/period glyphshow
8.999969 0.890625 moveto
/two glyphshow
grestore
2 setlinecap
0.690 setgray
gsave
422.032 158.819 57.794 41.606 clipbox
226.606538 41.60625 m
226.606538 200.425 l
stroke
grestore
0 setlinecap
0.000 setgray
gsave
/o {
gsave
newpath
translate
0.8 setlinewidth
1 setlinejoin

0 setlinecap

0 0 m
0 -3.5 l

gsave
0.000 setgray
fill
grestore
stroke
grestore
} bind def
226.607 41.6063 o
grestore
gsave
219.106538 26.403125 translate
0.000000 rotate
/STIXGeneral-Regular 12.0 selectfont
0.000000 0.890625 moveto
/zero glyphshow
5.999985 0.890625 moveto
/period glyphshow
8.999969 0.890625 moveto
/four glyphshow
grestore
2 setlinecap
0.690 setgray
gsave
422.032 158.819 57.794 41.606 clipbox
311.012932 41.60625 m
311.012932 200.425 l
stroke
grestore
0 setlinecap
0.000 setgray
gsave
/o {
gsave
newpath
translate
0.8 setlinewidth
1 setlinejoin

0 setlinecap

0 0 m
0 -3.5 l

gsave
0.000 setgray
fill
grestore
stroke
grestore
} bind def
311.013 41.6063 o
grestore
gsave
303.512932 26.403125 translate
0.000000 rotate
/STIXGeneral-Regular 12.0 selectfont
0.000000 0.796875 moveto
/zero glyphshow
5.999985 0.796875 moveto
/period glyphshow
8.999969 0.796875 moveto
/six glyphshow
grestore
2 setlinecap
0.690 setgray
gsave
422.032 158.819 57.794 41.606 clipbox
395.419327 41.60625 m
395.419327 200.425 l
stroke
grestore
0 setlinecap
0.000 setgray
gsave
/o {
gsave
newpath
translate
0.8 setlinewidth
1 setlinejoin

0 setlinecap

0 0 m
0 -3.5 l

gsave
0.000 setgray
fill
grestore
stroke
grestore
} bind def
395.419 41.6063 o
grestore
gsave
387.919327 26.403125 translate
0.000000 rotate
/STIXGeneral-Regular 12.0 selectfont
0.000000 0.890625 moveto
/zero glyphshow
5.999985 0.890625 moveto
/period glyphshow
8.999969 0.890625 moveto
/eight glyphshow
grestore
2 setlinecap
0.690 setgray
gsave
422.032 158.819 57.794 41.606 clipbox
479.825721 41.60625 m
479.825721 200.425 l
stroke
grestore
0 setlinecap
0.000 setgray
gsave
/o {
gsave
newpath
translate
0.8 setlinewidth
1 setlinejoin

0 setlinecap

0 0 m
0 -3.5 l

gsave
0.000 setgray
fill
grestore
stroke
grestore
} bind def
479.826 41.6063 o
grestore
gsave
472.325721 26.403125 translate
0.000000 rotate
/STIXGeneral-Regular 12.0 selectfont
0.000000 0.890625 moveto
/one glyphshow
5.999985 0.890625 moveto
/period glyphshow
8.999969 0.890625 moveto
/zero glyphshow
grestore
gsave
264.809735 10.231250 translate
0.000000 rotate
/Cmmi10 14.0 selectfont
0.000000 0.812500 moveto
/x glyphshow
grestore
2 setlinecap
0.690 setgray
gsave
422.032 158.819 57.794 41.606 clipbox
57.79375 55.380987 m
479.825721 55.380987 l
stroke
grestore
0 setlinecap
0.000 setgray
gsave
/o {
gsave
newpath
translate
0.8 setlinewidth
1 setlinejoin

0 setlinecap

-0 0 m
-3.5 0 l

gsave
0.000 setgray
fill
grestore
stroke
grestore
} bind def
57.7938 55.381 o
grestore
gsave
23.793750 51.279425 translate
0.000000 rotate
/STIXGeneral-Regular 12.0 selectfont
0.000000 0.890625 moveto
/minus glyphshow
8.219986 0.890625 moveto
/two glyphshow
14.219971 0.890625 moveto
/zero glyphshow
20.219955 0.890625 moveto
/zero glyphshow
grestore
2 setlinecap
0.690 setgray
gsave
422.032 158.819 57.794 41.606 clipbox
57.79375 86.00876 m
479.825721 86.00876 l
stroke
grestore
0 setlinecap
0.000 setgray
gsave
/o {
gsave
newpath
translate
0.8 setlinewidth
1 setlinejoin

0 setlinecap

-0 0 m
-3.5 0 l

gsave
0.000 setgray
fill
grestore
stroke
grestore
} bind def
57.7938 86.0088 o
grestore
gsave
23.793750 81.907198 translate
0.000000 rotate
/STIXGeneral-Regular 12.0 selectfont
0.000000 0.890625 moveto
/minus glyphshow
8.219986 0.890625 moveto
/one glyphshow
14.219971 0.890625 moveto
/zero glyphshow
20.219955 0.890625 moveto
/zero glyphshow
grestore
2 setlinecap
0.690 setgray
gsave
422.032 158.819 57.794 41.606 clipbox
57.79375 116.636533 m
479.825721 116.636533 l
stroke
grestore
0 setlinecap
0.000 setgray
gsave
/o {
gsave
newpath
translate
0.8 setlinewidth
1 setlinejoin

0 setlinecap

-0 0 m
-3.5 0 l

gsave
0.000 setgray
fill
grestore
stroke
grestore
} bind def
57.7938 116.637 o
grestore
gsave
44.793750 112.534971 translate
0.000000 rotate
/STIXGeneral-Regular 12.0 selectfont
0.000000 0.890625 moveto
/zero glyphshow
grestore
2 setlinecap
0.690 setgray
gsave
422.032 158.819 57.794 41.606 clipbox
57.79375 147.264306 m
479.825721 147.264306 l
stroke
grestore
0 setlinecap
0.000 setgray
gsave
/o {
gsave
newpath
translate
0.8 setlinewidth
1 setlinejoin

0 setlinecap

-0 0 m
-3.5 0 l

gsave
0.000 setgray
fill
grestore
stroke
grestore
} bind def
57.7938 147.264 o
grestore
gsave
32.793750 143.162744 translate
0.000000 rotate
/STIXGeneral-Regular 12.0 selectfont
0.000000 0.890625 moveto
/one glyphshow
5.999985 0.890625 moveto
/zero glyphshow
11.999969 0.890625 moveto
/zero glyphshow
grestore
2 setlinecap
0.690 setgray
gsave
422.032 158.819 57.794 41.606 clipbox
57.79375 177.892079 m
479.825721 177.892079 l
stroke
grestore
0 setlinecap
0.000 setgray
gsave
/o {
gsave
newpath
translate
0.8 setlinewidth
1 setlinejoin

0 setlinecap

-0 0 m
-3.5 0 l

gsave
0.000 setgray
fill
grestore
stroke
grestore
} bind def
57.7938 177.892 o
grestore
gsave
32.793750 173.790517 translate
0.000000 rotate
/STIXGeneral-Regular 12.0 selectfont
0.000000 0.890625 moveto
/two glyphshow
5.999985 0.890625 moveto
/zero glyphshow
11.999969 0.890625 moveto
/zero glyphshow
grestore
gsave
14.793750 114.515625 translate
90.000000 rotate
/Cmmi10 14.0 selectfont
0.000000 0.796875 moveto
/v glyphshow
/Cmmi10 9.799999999999999 selectfont
6.774414 -1.584000 moveto
/y glyphshow
grestore
1.000 setlinewidth
0.122 0.467 0.706 setrgbcolor
gsave
422.032 158.819 57.794 41.606 clipbox
/o {
gsave
newpath
translate
1.0 setlinewidth
1 setlinejoin

0 setlinecap

0 -1.5 m
0.397805 -1.5 0.77937 -1.341951 1.06066 -1.06066 c
1.341951 -0.77937 1.5 -0.397805 1.5 0 c
1.5 0.397805 1.341951 0.77937 1.06066 1.06066 c
0.77937 1.341951 0.397805 1.5 0 1.5 c
-0.397805 1.5 -0.77937 1.341951 -1.06066 1.06066 c
-1.341951 0.77937 -1.5 0.397805 -1.5 0 c
-1.5 -0.397805 -1.341951 -0.77937 -1.06066 -1.06066 c
-0.77937 -1.341951 -0.397805 -1.5 0 -1.5 c
cl

gsave
grestore
stroke
grestore
} bind def
57.7938 116.637 o
57.7938 116.637 o
57.7938 116.637 o
61.0401 89.5643 o
61.0401 89.7122 o
64.2865 70.1606 o
64.2865 70.4388 o
65.7124 63.6289 o
67.5329 57.9485 o
67.5329 57.6565 o
70.7793 51.3273 o
70.7793 51.1256 o
71.5701 50.1624 o
74.0257 49.4191 o
74.0257 49.3253 o
75.3646 49.689 o
77.2721 51.1265 o
77.2721 51.1359 o
80.5185 55.5919 o
80.5185 55.4701 o
81.7441 57.9553 o
83.7649 61.53 o
83.7649 61.75 o
85.2953 65.2851 o
87.0113 68.5188 o
87.0113 68.8074 o
90.2577 75.7818 o
90.2577 76.1065 o
91.7306 79.6896 o
93.5041 82.8627 o
93.5041 83.1933 o
94.9949 86.6004 o
96.7505 89.7622 o
96.7505 89.4509 o
99.5468 95.1446 o
99.9969 95.3565 o
99.9969 95.6253 o
103.243 100.707 o
103.243 100.494 o
104.162 102.195 o
106.49 104.849 o
106.49 105.001 o
107.764 106.596 o
109.736 108.453 o
109.736 108.545 o
111.136 109.913 o
112.983 111.392 o
112.983 111.361 o
116.229 113.65 o
116.229 113.624 o
116.616 113.823 o
119.475 115.404 o
119.475 115.331 o
120.68 115.762 o
122.722 116.702 o
122.722 116.591 o
124.238 116.936 o
125.968 117.479 o
125.968 117.62 o
129.215 118.066 o
129.215 118.227 o
130.457 118.071 o
132.461 118.585 o
132.461 118.411 o
135.707 118.567 o
135.707 118.747 o
136.569 118.41 o
138.954 118.582 o
138.954 118.762 o
140.54 118.396 o
142.2 118.497 o
142.2 118.672 o
145.447 118.346 o
145.447 118.509 o
146.363 118.144 o
148.693 118.301 o
148.693 118.151 o
151.939 117.933 o
151.939 118.067 o
152.596 117.764 o
155.186 117.825 o
155.186 117.709 o
156.237 117.534 o
158.432 117.589 o
158.432 117.49 o
159.582 117.331 o
161.679 117.366 o
161.679 117.284 o
164.925 117.162 o
164.925 117.097 o
165.864 116.99 o
168.171 116.98 o
168.171 116.931 o
169.646 116.826 o
171.418 116.824 o
171.418 116.789 o
174.664 116.692 o
174.664 116.67 o
175.042 116.636 o
177.911 116.584 o
177.911 116.573 o
178.534 116.547 o
181.157 116.499 o
181.157 116.497 o
182.686 116.468 o
184.403 116.433 o
184.403 116.439 o
187.65 116.385 o
187.65 116.398 o
189.201 116.395 o
190.896 116.371 o
190.896 116.353 o
194.143 116.333 o
194.143 116.355 o
195.384 116.371 o
197.389 116.324 o
197.389 116.349 o
198.868 116.37 o
200.635 116.323 o
200.635 116.351 o
202.129 116.376 o
203.882 116.329 o
203.882 116.358 o
205.473 116.386 o
207.128 116.339 o
207.128 116.369 o
210.375 116.353 o
210.375 116.384 o
211.814 116.415 o
213.621 116.369 o
213.621 116.4 o
216.867 116.386 o
216.867 116.417 o
218.446 116.45 o
220.114 116.435 o
220.114 116.404 o
223.36 116.453 o
223.36 116.422 o
224.222 116.483 o
226.607 116.44 o
226.607 116.47 o
227.618 116.501 o
229.853 116.458 o
229.853 116.487 o
233.099 116.503 o
233.099 116.474 o
233.463 116.531 o
236.346 116.49 o
236.346 116.519 o
237.649 116.548 o
239.592 116.505 o
239.592 116.533 o
242.836 116.572 o
242.839 116.547 o
242.839 116.519 o
246.085 116.56 o
246.085 116.533 o
246.906 116.588 o
249.331 116.546 o
249.331 116.573 o
250.872 116.601 o
252.578 116.558 o
252.578 116.585 o
255.824 116.57 o
255.824 116.596 o
256.371 116.623 o
259.071 116.607 o
259.071 116.581 o
260.204 116.635 o
262.317 116.618 o
262.317 116.593 o
264.789 116.651 o
265.563 116.604 o
265.563 116.629 o
268.81 116.614 o
268.81 116.665 o
268.81 116.64 o
272.056 116.65 o
272.056 116.676 o
274.661 116.634 o
275.303 116.661 o
275.303 116.687 o
278.549 116.672 o
278.549 116.698 o
279.037 116.649 o
281.795 116.683 o
281.795 116.709 o
282.81 116.663 o
285.042 116.694 o
285.042 116.721 o
286.928 116.678 o
288.288 116.733 o
288.288 116.706 o
290.787 116.691 o
291.535 116.719 o
291.535 116.746 o
294.781 116.759 o
294.781 116.732 o
294.918 116.707 o
298.027 116.773 o
298.027 116.745 o
298.691 116.723 o
301.274 116.788 o
301.274 116.76 o
302.34 116.74 o
304.52 116.775 o
304.52 116.804 o
305.911 116.758 o
307.767 116.791 o
307.767 116.82 o
309.273 116.775 o
311.013 116.808 o
311.013 116.838 o
313.35 116.794 o
314.259 116.825 o
314.259 116.855 o
317.3 116.815 o
317.506 116.842 o
317.506 116.873 o
320.749 116.833 o
320.752 116.891 o
320.752 116.86 o
323.999 116.877 o
323.999 116.908 o
324.702 116.854 o
327.245 116.893 o
327.245 116.924 o
329.709 116.879 o
330.491 116.908 o
330.491 116.938 o
333.693 116.893 o
333.738 116.919 o
333.738 116.948 o
336.984 116.954 o
336.984 116.926 o
338.024 116.905 o
340.231 116.953 o
340.231 116.928 o
342.942 116.903 o
343.477 116.944 o
343.477 116.921 o
346.723 116.924 o
346.723 116.906 o
347.007 116.889 o
349.97 116.879 o
349.97 116.893 o
350.804 116.861 o
353.216 116.846 o
353.216 116.839 o
355.798 116.796 o
356.463 116.782 o
356.463 116.781 o
359.709 116.707 o
359.709 116.697 o
360.021 116.711 o
362.955 116.612 o
362.955 116.59 o
364.427 116.585 o
366.202 116.46 o
366.202 116.494 o
369.448 116.353 o
369.448 116.305 o
370.175 116.367 o
372.695 116.126 o
372.695 116.189 o
373.941 116.183 o
375.941 115.923 o
375.941 116.003 o
378.731 115.92 o
379.187 115.799 o
379.187 115.701 o
382.113 115.711 o
382.434 115.58 o
382.434 115.466 o
385.68 115.355 o
385.68 115.225 o
386.153 115.451 o
388.927 115.138 o
388.927 114.992 o
391.74 115.122 o
392.173 114.786 o
392.173 114.946 o
395.419 114.797 o
395.419 114.626 o
396.32 114.929 o
398.666 114.717 o
398.666 114.538 o
399.737 114.878 o
401.912 114.737 o
401.912 114.556 o
403.28 114.947 o
405.159 114.895 o
405.159 114.718 o
408.054 115.353 o
408.405 115.236 o
408.405 115.071 o
411.651 115.669 o
411.651 115.813 o
411.769 115.981 o
414.898 116.575 o
414.898 116.689 o
415.625 117.033 o
418.144 117.862 o
418.144 117.938 o
419.253 118.518 o
421.391 119.606 o
421.391 119.638 o
423.009 120.683 o
424.637 121.886 o
424.637 121.867 o
427.524 124.289 o
427.883 124.779 o
427.883 124.704 o
431.13 128.358 o
431.13 128.222 o
431.63 128.68 o
434.376 132.685 o
434.376 132.487 o
435.738 134.301 o
437.623 137.538 o
437.623 137.791 o
439.894 141.252 o
440.869 143.369 o
440.869 143.665 o
443.443 148.17 o
444.115 149.902 o
444.115 150.221 o
446.925 155.639 o
447.362 156.96 o
447.362 157.283 o
450.608 164.255 o
450.608 164.552 o
451.422 165.777 o
453.855 171.572 o
453.855 171.326 o
455.875 175.134 o
457.101 177.743 o
457.101 177.59 o
459.863 181.622 o
460.347 182.255 o
460.347 182.266 o
463.594 184.252 o
463.594 184.12 o
463.611 184.389 o
466.84 182.42 o
466.84 182.195 o
467.942 180.965 o
470.087 175.445 o
470.087 175.704 o
473.333 162.872 o
473.333 163.101 o
473.419 162.9 o
476.579 143.664 o
476.579 143.558 o
479.826 116.637 o
479.826 116.637 o
479.826 116.637 o
grestore
0.173 0.627 0.173 setrgbcolor
gsave
422.032 158.819 57.794 41.606 clipbox
/o {
gsave
newpath
translate
1.0 setlinewidth
1 setlinejoin

0 setlinecap

0 -1.5 m
0.397805 -1.5 0.77937 -1.341951 1.06066 -1.06066 c
1.341951 -0.77937 1.5 -0.397805 1.5 0 c
1.5 0.397805 1.341951 0.77937 1.06066 1.06066 c
0.77937 1.341951 0.397805 1.5 0 1.5 c
-0.397805 1.5 -0.77937 1.341951 -1.06066 1.06066 c
-1.341951 0.77937 -1.5 0.397805 -1.5 0 c
-1.5 -0.397805 -1.341951 -0.77937 -1.06066 -1.06066 c
-0.77937 -1.341951 -0.397805 -1.5 0 -1.5 c
cl

gsave
grestore
stroke
grestore
} bind def
57.7938 116.637 o
57.7938 116.637 o
57.7938 116.637 o
61.0317 89.6223 o
63.6518 73.102 o
63.6877 73.2279 o
66.49 60.4035 o
66.7548 59.8677 o
69.6381 52.3005 o
69.7024 52.4217 o
72.8918 48.8253 o
75.6191 49.1812 o
78.2636 51.6792 o
81.4234 56.6206 o
84.6258 63.1125 o
87.5257 69.4164 o
87.8598 70.656 o
90.1987 75.6954 o
93.2838 82.3876 o
94.2478 84.886 o
96.5392 89.1028 o
99.5125 94.4985 o
100.518 96.5941 o
102.632 99.6733 o
103.766 101.582 o
105.272 103.287 o
106.905 105.579 o
108.474 107.184 o
110.95 109.724 o
112.913 111.431 o
114.657 112.699 o
115.153 113.029 o
117.836 114.653 o
118.155 114.76 o
121.022 116.152 o
121.39 116.182 o
124.26 117.263 o
124.628 117.184 o
127.428 118.042 o
127.658 117.893 o
130.671 118.508 o
130.915 118.33 o
133.673 118.636 o
136.924 118.713 o
138.557 118.501 o
139.896 118.818 o
141.056 118.562 o
143.496 118.58 o
143.868 118.36 o
146.282 118.508 o
146.534 118.309 o
149.353 118.024 o
149.611 118.158 o
152.592 117.825 o
152.621 117.994 o
155.341 117.7 o
155.475 117.838 o
158.463 117.514 o
161.712 117.292 o
161.967 117.365 o
164.89 117.118 o
168.007 116.935 o
171.167 116.802 o
174.362 116.673 o
177.26 116.575 o
177.575 116.582 o
180.614 116.498 o
183.049 116.451 o
183.708 116.435 o
186.668 116.394 o
188.91 116.383 o
189.878 116.359 o
192.309 116.355 o
192.696 116.329 o
195.523 116.349 o
195.909 116.321 o
198.621 116.332 o
201.312 116.353 o
201.638 116.325 o
204.458 116.355 o
204.66 116.321 o
207.497 116.356 o
210.005 116.344 o
210.04 116.386 o
213.21 116.408 o
213.251 116.357 o
216.415 116.421 o
216.473 116.38 o
219.2 116.412 o
222.33 116.412 o
222.436 116.452 o
224.923 116.447 o
228.156 116.468 o
229.197 116.439 o
231.891 116.472 o
231.891 116.503 o
234.886 116.499 o
237.823 116.499 o
238.121 116.541 o
241.072 116.517 o
241.353 116.552 o
244.053 116.517 o
244.539 116.559 o
247.267 116.555 o
250.508 116.571 o
253.01 116.554 o
253.413 116.595 o
256.208 116.59 o
258.846 116.617 o
260.853 116.592 o
262.62 116.623 o
264.103 116.601 o
266.087 116.638 o
268.986 116.62 o
269.562 116.65 o
273.687 116.625 o
274.108 116.662 o
277.756 116.669 o
279.921 116.656 o
281.175 116.7 o
283.583 116.69 o
285.894 116.679 o
287.896 116.713 o
290.999 116.717 o
294.204 116.725 o
296.141 116.761 o
297.411 116.734 o
299.265 116.767 o
301.529 116.735 o
302.444 116.775 o
304.635 116.762 o
305.628 116.798 o
308.755 116.806 o
310.48 116.789 o
311.988 116.828 o
314.777 116.86 o
315.517 116.828 o
317.736 116.863 o
320.558 116.864 o
323.389 116.903 o
323.451 116.867 o
326.058 116.899 o
328.695 116.93 o
328.883 116.894 o
331.91 116.949 o
332.128 116.911 o
335.17 116.959 o
335.364 116.925 o
338.511 116.938 o
341.067 116.953 o
341.33 116.924 o
344.232 116.949 o
344.453 116.924 o
347.426 116.933 o
347.515 116.914 o
350.775 116.885 o
353.495 116.852 o
356.159 116.802 o
359.383 116.727 o
359.72 116.731 o
362.642 116.631 o
365.476 116.513 o
365.749 116.538 o
368.585 116.387 o
368.783 116.431 o
371.319 116.28 o
372.275 116.156 o
374.448 116.131 o
375.352 115.991 o
377.619 115.964 o
378.527 115.801 o
381.632 115.618 o
384.744 115.435 o
386.53 115.153 o
387.708 115.291 o
389.057 115.067 o
390.969 115.089 o
392.261 114.835 o
394.099 114.878 o
395.898 114.551 o
397.06 114.842 o
397.907 114.634 o
401.118 114.651 o
403.159 114.548 o
403.855 114.838 o
405.848 114.826 o
407.062 115.122 o
409.068 115.187 o
411.084 115.733 o
412.322 115.832 o
415.408 116.711 o
416.676 117.36 o
417.755 117.713 o
420.546 119.136 o
421.676 119.766 o
423.621 121.097 o
424.913 122.111 o
426.866 123.766 o
430.017 126.967 o
431.181 128.498 o
433.113 130.865 o
435.553 134.246 o
437.552 137.734 o
438.747 139.463 o
440.652 143.261 o
443.828 149.599 o
447.069 156.618 o
450.329 163.963 o
453.429 170.829 o
456.688 177.178 o
459.661 181.554 o
460.169 182.178 o
462.209 183.799 o
462.666 183.956 o
465.385 183.715 o
467.274 181.564 o
468.223 180.34 o
469.597 177.028 o
471.994 169.301 o
473.43 162.55 o
475.213 152.993 o
476.617 143.379 o
479.826 116.637 o
479.826 116.637 o
479.826 116.637 o
grestore
0.839 0.153 0.157 setrgbcolor
gsave
422.032 158.819 57.794 41.606 clipbox
/o {
gsave
newpath
translate
1.0 setlinewidth
1 setlinejoin

0 setlinecap

0 -1.5 m
0.397805 -1.5 0.77937 -1.341951 1.06066 -1.06066 c
1.341951 -0.77937 1.5 -0.397805 1.5 0 c
1.5 0.397805 1.341951 0.77937 1.06066 1.06066 c
0.77937 1.341951 0.397805 1.5 0 1.5 c
-0.397805 1.5 -0.77937 1.341951 -1.06066 1.06066 c
-1.341951 0.77937 -1.5 0.397805 -1.5 0 c
-1.5 -0.397805 -1.341951 -0.77937 -1.06066 -1.06066 c
-0.77937 -1.341951 -0.397805 -1.5 0 -1.5 c
cl

gsave
grestore
stroke
grestore
} bind def
57.7938 116.637 o
57.7938 116.637 o
57.7938 116.637 o
61.0401 89.1332 o
61.0401 89.5413 o
61.0401 89.3343 o
64.2865 69.7317 o
64.2865 70.0121 o
64.2865 70.3045 o
67.5329 57.9451 o
67.5329 57.6643 o
67.5329 57.4012 o
70.7793 51.4362 o
70.7793 51.2351 o
70.7793 51.0563 o
74.0257 49.6907 o
74.0257 49.5494 o
74.0257 49.6075 o
77.2721 51.6451 o
77.2721 51.7166 o
77.2721 51.5997 o
80.5185 56.1009 o
80.5185 56.2638 o
80.5185 56.4522 o
83.7649 62.7771 o
83.7649 62.2434 o
83.7649 62.4987 o
87.0113 69.5488 o
87.0113 69.2335 o
87.0113 69.8838 o
90.2577 76.4527 o
90.2577 76.7945 o
90.2577 77.1523 o
93.5041 83.4542 o
93.5041 83.7924 o
93.5041 84.1427 o
96.7505 90.2525 o
96.7505 90.5714 o
96.7505 89.9425 o
99.9969 95.7455 o
99.9969 96.28 o
99.9969 96.0098 o
103.243 100.993 o
103.243 100.785 o
103.243 101.204 o
106.49 105.051 o
106.49 105.196 o
106.49 105.344 o
109.736 108.743 o
109.736 108.577 o
109.736 108.659 o
112.983 111.444 o
112.983 111.422 o
112.983 111.468 o
116.229 113.661 o
116.229 113.63 o
116.229 113.601 o
119.475 115.375 o
119.475 115.298 o
119.475 115.224 o
122.722 116.528 o
122.722 116.417 o
122.722 116.643 o
125.968 117.395 o
125.968 117.538 o
125.968 117.256 o
129.215 117.968 o
129.215 117.81 o
129.215 118.131 o
132.461 118.481 o
132.461 118.307 o
132.461 118.138 o
135.707 118.644 o
135.707 118.465 o
135.707 118.292 o
138.954 118.487 o
138.954 118.664 o
138.954 118.316 o
142.2 118.581 o
142.2 118.411 o
142.2 118.247 o
145.447 118.115 o
145.447 118.268 o
145.447 118.426 o
148.693 118.227 o
148.693 117.943 o
148.693 118.083 o
151.939 117.752 o
151.939 117.876 o
151.939 118.004 o
155.186 117.662 o
155.186 117.773 o
155.186 117.554 o
158.432 117.361 o
158.432 117.452 o
158.432 117.546 o
161.679 117.332 o
161.679 117.255 o
161.679 117.18 o
164.925 117.137 o
164.925 117.076 o
164.925 117.016 o
168.171 116.964 o
168.171 116.917 o
168.171 116.872 o
171.418 116.814 o
171.418 116.781 o
171.418 116.749 o
174.664 116.647 o
174.664 116.667 o
174.664 116.688 o
177.911 116.564 o
177.911 116.585 o
177.911 116.575 o
181.157 116.503 o
181.157 116.502 o
181.157 116.5 o
184.403 116.441 o
184.403 116.447 o
184.403 116.452 o
187.65 116.395 o
187.65 116.408 o
187.65 116.419 o
190.896 116.382 o
190.896 116.364 o
190.896 116.397 o
194.143 116.346 o
194.143 116.367 o
194.143 116.386 o
197.389 116.383 o
197.389 116.362 o
197.389 116.337 o
200.635 116.336 o
200.635 116.386 o
200.635 116.363 o
203.882 116.342 o
203.882 116.394 o
203.882 116.37 o
207.128 116.381 o
207.128 116.352 o
207.128 116.406 o
210.375 116.395 o
210.375 116.42 o
210.375 116.365 o
213.621 116.381 o
213.621 116.41 o
213.621 116.435 o
216.867 116.397 o
216.867 116.427 o
216.867 116.452 o
220.114 116.415 o
220.114 116.444 o
220.114 116.469 o
223.36 116.432 o
223.36 116.461 o
223.36 116.485 o
226.607 116.501 o
226.607 116.477 o
226.607 116.449 o
229.853 116.493 o
229.853 116.466 o
229.853 116.517 o
233.099 116.481 o
233.099 116.532 o
233.099 116.508 o
236.346 116.496 o
236.346 116.523 o
236.346 116.546 o
239.592 116.511 o
239.592 116.537 o
239.592 116.559 o
242.839 116.524 o
242.839 116.55 o
242.839 116.572 o
246.085 116.537 o
246.085 116.562 o
246.085 116.584 o
249.331 116.574 o
249.331 116.549 o
249.331 116.596 o
252.578 116.607 o
252.578 116.585 o
252.578 116.561 o
255.824 116.572 o
255.824 116.618 o
255.824 116.596 o
259.071 116.629 o
259.071 116.606 o
259.071 116.583 o
262.317 116.593 o
262.317 116.639 o
262.317 116.617 o
265.563 116.649 o
265.563 116.604 o
265.563 116.627 o
268.81 116.614 o
268.81 116.637 o
268.81 116.659 o
272.056 116.624 o
272.056 116.647 o
272.056 116.67 o
275.303 116.634 o
275.303 116.657 o
275.303 116.68 o
278.549 116.645 o
278.549 116.667 o
278.549 116.691 o
281.795 116.701 o
281.795 116.678 o
281.795 116.655 o
285.042 116.688 o
285.042 116.666 o
285.042 116.713 o
288.288 116.7 o
288.288 116.724 o
288.288 116.677 o
291.535 116.689 o
291.535 116.711 o
291.535 116.736 o
294.781 116.749 o
294.781 116.701 o
294.781 116.724 o
298.027 116.714 o
298.027 116.737 o
298.027 116.763 o
301.274 116.777 o
301.274 116.751 o
301.274 116.727 o
304.52 116.741 o
304.52 116.792 o
304.52 116.765 o
307.767 116.808 o
307.767 116.78 o
307.767 116.756 o
311.013 116.824 o
311.013 116.772 o
311.013 116.796 o
314.259 116.788 o
314.259 116.813 o
314.259 116.841 o
317.506 116.805 o
317.506 116.83 o
317.506 116.859 o
320.752 116.821 o
320.752 116.847 o
320.752 116.876 o
323.999 116.838 o
323.999 116.863 o
323.999 116.893 o
327.245 116.854 o
327.245 116.879 o
327.245 116.908 o
330.491 116.921 o
330.491 116.892 o
330.491 116.868 o
333.738 116.903 o
333.738 116.879 o
333.738 116.931 o
336.984 116.887 o
336.984 116.937 o
336.984 116.91 o
340.231 116.891 o
340.231 116.912 o
340.231 116.936 o
343.477 116.887 o
343.477 116.906 o
343.477 116.928 o
346.723 116.876 o
346.723 116.891 o
346.723 116.909 o
349.97 116.855 o
349.97 116.865 o
349.97 116.878 o
353.216 116.826 o
353.216 116.821 o
353.216 116.833 o
356.463 116.77 o
356.463 116.771 o
356.463 116.773 o
359.709 116.709 o
359.709 116.688 o
359.709 116.698 o
362.955 116.626 o
362.955 116.585 o
362.955 116.606 o
366.202 116.492 o
366.202 116.459 o
366.202 116.524 o
369.448 116.356 o
369.448 116.309 o
369.448 116.401 o
372.695 116.257 o
372.695 116.197 o
372.695 116.136 o
375.941 116.093 o
375.941 116.018 o
375.941 115.94 o
379.187 115.912 o
379.187 115.821 o
379.187 115.726 o
382.434 115.719 o
382.434 115.611 o
382.434 115.5 o
385.68 115.269 o
385.68 115.397 o
385.68 115.521 o
388.927 115.045 o
388.927 115.329 o
388.927 115.19 o
392.173 115.158 o
392.173 115.005 o
392.173 114.846 o
395.419 115.026 o
395.419 114.862 o
395.419 114.692 o
398.666 114.957 o
398.666 114.785 o
398.666 114.609 o
401.912 114.807 o
401.912 114.981 o
401.912 114.629 o
405.159 115.135 o
405.159 114.966 o
405.159 114.791 o
408.405 115.142 o
408.405 115.305 o
408.405 115.463 o
411.651 116.017 o
411.651 115.735 o
411.651 115.878 o
414.898 116.857 o
414.898 116.631 o
414.898 116.745 o
418.144 118.05 o
418.144 117.898 o
418.144 117.975 o
421.391 119.644 o
421.391 119.613 o
421.391 119.673 o
424.637 121.806 o
424.637 121.83 o
424.637 121.853 o
427.883 124.533 o
427.883 124.617 o
427.883 124.699 o
431.13 127.933 o
431.13 128.08 o
431.13 128.225 o
434.376 132.073 o
434.376 132.284 o
434.376 132.491 o
437.623 137.532 o
437.623 137.268 o
437.623 136.998 o
440.869 143.026 o
440.869 142.708 o
440.869 143.337 o
444.115 149.488 o
444.115 149.826 o
444.115 149.137 o
447.362 156.129 o
447.362 156.487 o
447.362 156.829 o
450.608 164.049 o
450.608 163.399 o
450.608 163.734 o
453.855 170.506 o
453.855 170.785 o
453.855 171.04 o
457.101 177.183 o
457.101 177.02 o
457.101 176.832 o
460.347 181.568 o
460.347 181.685 o
460.347 181.64 o
463.594 183.594 o
463.594 183.677 o
463.594 183.735 o
466.84 181.848 o
466.84 182.228 o
466.84 182.049 o
470.087 175.618 o
470.087 175.881 o
470.087 175.337 o
473.333 163.268 o
473.333 162.976 o
473.333 163.549 o
476.579 144.144 o
476.579 143.736 o
476.579 143.943 o
479.826 116.637 o
479.826 116.637 o
479.826 116.637 o
grestore
0.800 setlinewidth
0 setlinejoin
2 setlinecap
0.000 setgray
gsave
57.79375 41.60625 m
57.79375 200.425 l
stroke
grestore
gsave
479.825721 41.60625 m
479.825721 200.425 l
stroke
grestore
gsave
57.79375 41.60625 m
479.825721 41.60625 l
stroke
grestore
gsave
57.79375 200.425 m
479.825721 200.425 l
stroke
grestore
1.000 setlinewidth
0 setlinecap
gsave
422.032 158.819 57.794 41.606 clipbox
437.622524 147.264306 m
479.825721 147.264306 l
479.825721 193.205966 l
437.622524 193.205966 l
437.622524 147.264306 l
cl
stroke
grestore
1 setlinejoin
1 setlinecap
gsave
205.50494 192.484062 m
282.877468 192.724697 360.249996 192.965331 437.622524 193.205966 c
stroke
grestore
gsave
332.114531 65.429062 m
381.351594 92.707477 430.588657 119.985892 479.825721 147.264306 c
stroke
grestore
gsave
205.50494 65.429062 m
332.114531 65.429062 l
332.114531 192.484062 l
205.50494 192.484062 l
cl
1.000 setgray
fill
grestore
0.800 setlinewidth
0 setlinecap
gsave
/o {
gsave
newpath
translate
0.8 setlinewidth
1 setlinejoin

0 setlinecap

0 0 m
0 -3.5 l

gsave
0.000 setgray
fill
grestore
stroke
grestore
} bind def
205.505 65.4291 o
grestore
gsave
195.004940 50.225937 translate
0.000000 rotate
/STIXGeneral-Regular 12.0 selectfont
0.000000 0.890625 moveto
/zero glyphshow
5.999985 0.890625 moveto
/period glyphshow
8.999969 0.890625 moveto
/nine glyphshow
14.999954 0.890625 moveto
/zero glyphshow
grestore
gsave
/o {
gsave
newpath
translate
0.8 setlinewidth
1 setlinejoin

0 setlinecap

0 0 m
0 -3.5 l

gsave
0.000 setgray
fill
grestore
stroke
grestore
} bind def
268.81 65.4291 o
grestore
gsave
258.309735 50.225937 translate
0.000000 rotate
/STIXGeneral-Regular 12.0 selectfont
0.000000 0.750000 moveto
/zero glyphshow
5.999985 0.750000 moveto
/period glyphshow
8.999969 0.750000 moveto
/nine glyphshow
14.999954 0.750000 moveto
/five glyphshow
grestore
gsave
/o {
gsave
newpath
translate
0.8 setlinewidth
1 setlinejoin

0 setlinecap

0 0 m
0 -3.5 l

gsave
0.000 setgray
fill
grestore
stroke
grestore
} bind def
332.115 65.4291 o
grestore
gsave
321.614531 50.225937 translate
0.000000 rotate
/STIXGeneral-Regular 12.0 selectfont
0.000000 0.890625 moveto
/one glyphshow
5.999985 0.890625 moveto
/period glyphshow
8.999969 0.890625 moveto
/zero glyphshow
14.999954 0.890625 moveto
/zero glyphshow
grestore
gsave
/o {
gsave
newpath
translate
0.8 setlinewidth
1 setlinejoin

0 setlinecap

-0 0 m
-3.5 0 l

gsave
0.000 setgray
fill
grestore
stroke
grestore
} bind def
205.505 65.4291 o
grestore
gsave
180.504940 61.327500 translate
0.000000 rotate
/STIXGeneral-Regular 12.0 selectfont
0.000000 0.890625 moveto
/one glyphshow
5.999985 0.890625 moveto
/zero glyphshow
11.999969 0.890625 moveto
/zero glyphshow
grestore
gsave
/o {
gsave
newpath
translate
0.8 setlinewidth
1 setlinejoin

0 setlinecap

-0 0 m
-3.5 0 l

gsave
0.000 setgray
fill
grestore
stroke
grestore
} bind def
205.505 107.781 o
grestore
gsave
180.504940 103.679167 translate
0.000000 rotate
/STIXGeneral-Regular 12.0 selectfont
0.000000 0.750000 moveto
/one glyphshow
5.999985 0.750000 moveto
/five glyphshow
11.999969 0.750000 moveto
/zero glyphshow
grestore
gsave
/o {
gsave
newpath
translate
0.8 setlinewidth
1 setlinejoin

0 setlinecap

-0 0 m
-3.5 0 l

gsave
0.000 setgray
fill
grestore
stroke
grestore
} bind def
205.505 150.132 o
grestore
gsave
180.504940 146.030833 translate
0.000000 rotate
/STIXGeneral-Regular 12.0 selectfont
0.000000 0.890625 moveto
/two glyphshow
5.999985 0.890625 moveto
/zero glyphshow
11.999969 0.890625 moveto
/zero glyphshow
grestore
gsave
/o {
gsave
newpath
translate
0.8 setlinewidth
1 setlinejoin

0 setlinecap

-0 0 m
-3.5 0 l

gsave
0.000 setgray
fill
grestore
stroke
grestore
} bind def
205.505 192.484 o
grestore
gsave
180.504940 188.382500 translate
0.000000 rotate
/STIXGeneral-Regular 12.0 selectfont
0.000000 0.750000 moveto
/two glyphshow
5.999985 0.750000 moveto
/five glyphshow
11.999969 0.750000 moveto
/zero glyphshow
grestore
1.000 setlinewidth
0.122 0.467 0.706 setrgbcolor
gsave
126.61 127.055 205.505 65.429 clipbox
/o {
gsave
newpath
translate
1.0 setlinewidth
1 setlinejoin

0 setlinecap

0 -1.5 m
0.397805 -1.5 0.77937 -1.341951 1.06066 -1.06066 c
1.341951 -0.77937 1.5 -0.397805 1.5 0 c
1.5 0.397805 1.341951 0.77937 1.06066 1.06066 c
0.77937 1.341951 0.397805 1.5 0 1.5 c
-0.397805 1.5 -0.77937 1.341951 -1.06066 1.06066 c
-1.341951 0.77937 -1.5 0.397805 -1.5 0 c
-1.5 -0.397805 -1.341951 -0.77937 -1.06066 -1.06066 c
-0.77937 -1.341951 -0.397805 -1.5 0 -1.5 c
cl

gsave
grestore
stroke
grestore
} bind def
171.474 -1 o
175.21 1.88925 o
176.287 3.24485 o
176.287 3.03579 o
186.027 13.1434 o
186.027 12.7651 o
187.528 14.0335 o
195.766 25.1086 o
195.766 24.5616 o
199.851 29.5774 o
205.505 38.5303 o
205.505 39.2302 o
212.318 48.8002 o
215.244 54.6565 o
215.244 55.4739 o
222.967 67.9334 o
224.983 72.7237 o
224.983 73.6071 o
233.411 88.5895 o
234.723 92.2436 o
234.723 93.1356 o
244.462 112.419 o
244.462 113.24 o
246.904 116.626 o
254.201 132.655 o
254.201 131.974 o
260.262 142.506 o
263.94 149.72 o
263.94 149.298 o
272.226 160.448 o
273.679 162.197 o
273.679 162.228 o
283.419 167.723 o
283.419 167.357 o
283.471 168.099 o
293.158 162.655 o
293.158 162.033 o
296.462 158.632 o
302.897 143.366 o
302.897 144.082 o
312.636 108.594 o
312.636 109.225 o
312.896 108.672 o
322.375 55.4718 o
322.375 55.1781 o
329.724 -1 o
grestore
0.173 0.627 0.173 setrgbcolor
gsave
126.61 127.055 205.505 65.429 clipbox
/o {
gsave
newpath
translate
1.0 setlinewidth
1 setlinejoin

0 setlinecap

0 -1.5 m
0.397805 -1.5 0.77937 -1.341951 1.06066 -1.06066 c
1.341951 -0.77937 1.5 -0.397805 1.5 0 c
1.5 0.397805 1.341951 0.77937 1.06066 1.06066 c
0.77937 1.341951 0.397805 1.5 0 1.5 c
-0.397805 1.5 -0.77937 1.341951 -1.06066 1.06066 c
-1.341951 0.77937 -1.5 0.397805 -1.5 0 c
-1.5 -0.397805 -1.341951 -0.77937 -1.06066 -1.06066 c
-0.77937 -1.341951 -0.397805 -1.5 0 -1.5 c
cl

gsave
grestore
stroke
grestore
} bind def
171.389 -1 o
173.236 0.443684 o
182.688 9.2948 o
186.18 13.5296 o
191.975 20.0751 o
199.297 29.4255 o
205.293 39.0729 o
208.88 43.8531 o
214.594 54.3584 o
224.12 71.8846 o
233.844 91.2985 o
243.624 111.609 o
252.923 130.599 o
262.702 148.158 o
271.619 160.26 o
273.144 161.984 o
279.264 166.468 o
280.636 166.902 o
288.792 166.236 o
294.46 160.286 o
297.307 156.903 o
301.429 147.743 o
308.619 126.373 o
312.928 107.702 o
318.278 81.2735 o
322.489 54.6848 o
329.736 -1 o
grestore
0.839 0.153 0.157 setrgbcolor
gsave
126.61 127.055 205.505 65.429 clipbox
/o {
gsave
newpath
translate
1.0 setlinewidth
1 setlinejoin

0 setlinecap

0 -1.5 m
0.397805 -1.5 0.77937 -1.341951 1.06066 -1.06066 c
1.341951 -0.77937 1.5 -0.397805 1.5 0 c
1.5 0.397805 1.341951 0.77937 1.06066 1.06066 c
0.77937 1.341951 0.397805 1.5 0 1.5 c
-0.397805 1.5 -0.77937 1.341951 -1.06066 1.06066 c
-1.341951 0.77937 -1.5 0.397805 -1.5 0 c
-1.5 -0.397805 -1.341951 -0.77937 -1.06066 -1.06066 c
-0.77937 -1.341951 -0.397805 -1.5 0 -1.5 c
cl

gsave
grestore
stroke
grestore
} bind def
171.605 -1 o
176.287 2.5634 o
176.287 2.79516 o
176.287 3.0223 o
186.027 11.9656 o
186.027 12.373 o
186.027 12.7738 o
195.766 23.417 o
195.766 24.0007 o
195.766 24.5738 o
205.505 38.5148 o
205.505 37.7841 o
205.505 37.0369 o
215.244 53.7091 o
215.244 52.8273 o
215.244 54.5666 o
224.983 71.5783 o
224.983 72.5135 o
224.983 70.6095 o
234.723 89.9452 o
234.723 90.9346 o
234.723 91.8798 o
244.462 111.848 o
244.462 110.05 o
244.462 110.976 o
254.201 129.707 o
254.201 130.476 o
254.201 131.182 o
263.94 148.172 o
263.94 147.722 o
263.94 147.201 o
273.679 160.299 o
273.679 160.622 o
273.679 160.496 o
283.419 165.901 o
283.419 166.131 o
283.419 166.292 o
293.158 161.072 o
293.158 162.123 o
293.158 161.628 o
302.897 143.844 o
302.897 144.572 o
302.897 143.067 o
312.636 109.689 o
312.636 108.88 o
312.636 110.464 o
322.375 56.7996 o
322.375 55.6708 o
322.375 56.2434 o
329.758 -1 o
grestore
0.800 setlinewidth
0 setlinejoin
2 setlinecap
0.000 setgray
gsave
205.50494 65.429062 m
205.50494 192.484062 l
stroke
grestore
gsave
332.114531 65.429062 m
332.114531 192.484062 l
stroke
grestore
gsave
205.50494 65.429062 m
332.114531 65.429062 l
stroke
grestore
gsave
205.50494 192.484062 m
332.114531 192.484062 l
stroke
grestore
1.000 setlinewidth
0 setlinecap
0.800 setgray
gsave
64.79375 149.878125 m
132.325 149.878125 l
133.658333 149.878125 134.325 150.544792 134.325 151.878125 c
134.325 193.425 l
134.325 194.758333 133.658333 195.425 132.325 195.425 c
64.79375 195.425 l
63.460417 195.425 62.79375 194.758333 62.79375 193.425 c
62.79375 151.878125 l
62.79375 150.544792 63.460417 149.878125 64.79375 149.878125 c
cl
gsave
1.000 setgray
fill
grestore
stroke
grestore
1 setlinejoin
0.122 0.467 0.706 setrgbcolor
gsave
/o {
gsave
newpath
translate
1.0 setlinewidth
1 setlinejoin

0 setlinecap

0 -1.5 m
0.397805 -1.5 0.77937 -1.341951 1.06066 -1.06066 c
1.341951 -0.77937 1.5 -0.397805 1.5 0 c
1.5 0.397805 1.341951 0.77937 1.06066 1.06066 c
0.77937 1.341951 0.397805 1.5 0 1.5 c
-0.397805 1.5 -0.77937 1.341951 -1.06066 1.06066 c
-1.341951 0.77937 -1.5 0.397805 -1.5 0 c
-1.5 -0.397805 -1.341951 -0.77937 -1.06066 -1.06066 c
-0.77937 -1.341951 -0.397805 -1.5 0 -1.5 c
cl

gsave
grestore
stroke
grestore
} bind def
76.7938 187.925 o
grestore
0.000 setgray
/STIXGeneral-Regular 10.000 selectfont
gsave

94.793750 184.425000 translate
0.000000 rotate
0.000000 0 m /h glyphshow
4.999985 0 m /y glyphshow
9.999969 0 m /b glyphshow
14.999954 0 m /r glyphshow
18.329941 0 m /i glyphshow
21.109924 0 m /d glyphshow
grestore
0.173 0.627 0.173 setrgbcolor
gsave
/o {
gsave
newpath
translate
1.0 setlinewidth
1 setlinejoin

0 setlinecap

0 -1.5 m
0.397805 -1.5 0.77937 -1.341951 1.06066 -1.06066 c
1.341951 -0.77937 1.5 -0.397805 1.5 0 c
1.5 0.397805 1.341951 0.77937 1.06066 1.06066 c
0.77937 1.341951 0.397805 1.5 0 1.5 c
-0.397805 1.5 -0.77937 1.341951 -1.06066 1.06066 c
-1.341951 0.77937 -1.5 0.397805 -1.5 0 c
-1.5 -0.397805 -1.341951 -0.77937 -1.06066 -1.06066 c
-0.77937 -1.341951 -0.397805 -1.5 0 -1.5 c
cl

gsave
grestore
stroke
grestore
} bind def
76.7938 173.737 o
grestore
0.000 setgray
gsave

94.793750 170.237500 translate
0.000000 rotate
0.000000 0 m /s glyphshow
3.889984 0 m /c glyphshow
8.329971 0 m /a glyphshow
12.769958 0 m /t glyphshow
15.549942 0 m /t glyphshow
18.329926 0 m /e glyphshow
22.769913 0 m /r glyphshow
26.099899 0 m /e glyphshow
30.539886 0 m /d glyphshow
grestore
0.839 0.153 0.157 setrgbcolor
gsave
/o {
gsave
newpath
translate
1.0 setlinewidth
1 setlinejoin

0 setlinecap

0 -1.5 m
0.397805 -1.5 0.77937 -1.341951 1.06066 -1.06066 c
1.341951 -0.77937 1.5 -0.397805 1.5 0 c
1.5 0.397805 1.341951 0.77937 1.06066 1.06066 c
0.77937 1.341951 0.397805 1.5 0 1.5 c
-0.397805 1.5 -0.77937 1.341951 -1.06066 1.06066 c
-1.341951 0.77937 -1.5 0.397805 -1.5 0 c
-1.5 -0.397805 -1.341951 -0.77937 -1.06066 -1.06066 c
-0.77937 -1.341951 -0.397805 -1.5 0 -1.5 c
cl

gsave
grestore
stroke
grestore
} bind def
76.7938 159.566 o
grestore
0.000 setgray
gsave

94.793750 156.065625 translate
0.000000 rotate
0.000000 0 m /r glyphshow
3.329987 0 m /e glyphshow
7.769974 0 m /g glyphshow
12.769958 0 m /u glyphshow
17.769943 0 m /l glyphshow
20.549927 0 m /a glyphshow
24.989914 0 m /r glyphshow
grestore

end
showpage
