%!PS-Adobe-3.0 EPSF-3.0
%%Title: dvd_domain.eps
%%Creator: Matplotlib v3.7.2, https://matplotlib.org/
%%CreationDate: Wed Oct 18 01:43:12 2023
%%Orientation: portrait
%%BoundingBox: 165 259 447 533
%%HiResBoundingBox: 165.630076 259.314551 446.369924 532.685449
%%EndComments
%%BeginProlog
/mpldict 12 dict def
mpldict begin
/_d { bind def } bind def
/m { moveto } _d
/l { lineto } _d
/r { rlineto } _d
/c { curveto } _d
/cl { closepath } _d
/ce { closepath eofill } _d
/box {
      m
      1 index 0 r
      0 exch r
      neg 0 r
      cl
    } _d
/clipbox {
      box
      clip
      newpath
    } _d
/sc { setcachedevice } _d
%!PS-Adobe-3.0 Resource-Font
%%Creator: Converted from TrueType to Type 3 by Matplotlib.
10 dict begin
/FontName /STIXGeneral-Regular def
/PaintType 0 def
/FontMatrix [0.001 0 0 0.001 0 0] def
/FontBBox [-970 -443 2000 1023] def
/FontType 3 def
/Encoding [/B /D /e /F /i /k /l /hyphen /period /M /zero /one /two /R /four /six /eight] def
/CharStrings 18 dict dup begin
/.notdef 0 def
/B{667 0 17 0 593 662 sc
422 349 m
422 348 l
472 340 513 322 544 293 c
577 264 593 225 593 178 c
593 123 571 79 528 47 c
485 16 427 0 354 0 c
17 0 l
17 19 l
56 20 82 27 94 38 c
107 50 113 75 113 113 c
113 550 l
113 589 107 613 96 623 c
85 634 58 640 17 643 c
17 662 l
297 662 l
383 662 448 647 492 618 c
537 589 559 548 559 495 c
559 450 545 415 518 391 c
499 374 467 360 422 349 c

215 366 m
307 366 l
407 366 457 407 457 490 c
457 533 442 566 412 589 c
383 613 339 625 280 625 c
239 625 l
223 625 215 614 215 593 c
215 366 l

215 326 m
215 82 l
215 65 219 54 228 47 c
237 40 254 37 277 37 c
322 37 356 39 377 44 c
398 49 419 61 440 80 c
465 102 478 135 478 179 c
478 230 462 265 431 286 c
424 291 416 296 409 299 c
402 303 395 306 389 308 c
384 311 376 313 367 315 c
358 317 350 318 345 319 c
340 320 332 321 319 322 c
306 323 297 323 291 323 c
285 324 273 324 255 325 c
238 326 224 326 215 326 c

ce} _d
/D{722 0 16 0 685 662 sc
16 662 m
286 662 l
416 662 516 632 586 571 c
652 514 685 435 685 334 c
685 212 640 122 549 64 c
483 21 399 0 297 0 c
16 0 l
16 19 l
55 22 79 28 89 39 c
99 50 104 76 104 115 c
104 550 l
104 589 99 613 89 623 c
79 634 55 640 16 643 c
16 662 l

206 583 m
206 84 l
206 66 209 54 215 47 c
222 40 235 37 254 37 c
306 37 348 41 380 48 c
412 55 443 69 472 89 c
541 136 576 215 576 328 c
576 425 544 501 481 556 c
452 581 421 599 387 609 c
353 620 310 625 259 625 c
240 625 226 622 218 616 c
210 610 206 599 206 583 c

ce} _d
/e{444 0 25 -10 424 460 sc
408 164 m
424 157 l
384 46 314 -10 215 -10 c
156 -10 110 10 76 51 c
42 92 25 148 25 217 c
25 288 44 347 82 392 c
120 437 170 460 232 460 c
292 460 338 437 371 391 c
390 364 402 326 405 277 c
97 277 l
100 235 104 203 109 181 c
115 159 126 137 143 114 c
171 77 208 59 254 59 c
287 59 314 67 336 83 c
359 99 383 126 408 164 c

99 309 m
303 309 l
297 351 287 381 273 398 c
260 415 237 424 205 424 c
177 424 154 414 135 394 c
116 375 104 346 99 309 c

ce} _d
/F{556 0 11 0 546 662 sc
546 519 m
521 519 l
514 564 501 593 483 605 c
466 618 427 624 367 624 c
235 624 l
221 624 212 621 207 616 c
203 611 201 601 201 585 c
201 368 l
343 368 l
385 368 413 374 427 386 c
442 398 451 424 456 463 c
479 463 l
479 230 l
456 230 l
452 271 443 297 429 309 c
415 321 386 327 343 327 c
201 327 l
201 112 l
201 74 206 49 217 38 c
228 27 253 21 292 19 c
292 0 l
11 0 l
11 19 l
49 22 73 29 83 40 c
94 52 99 80 99 123 c
99 551 l
99 588 94 611 84 622 c
74 633 50 640 12 643 c
12 662 l
541 662 l
546 519 l

ce} _d
/i{278 0 16 0 253 683 sc
180 632 m
180 617 175 605 165 595 c
155 586 143 581 128 581 c
114 581 102 586 92 595 c
83 605 78 617 78 632 c
78 646 83 658 93 668 c
103 678 115 683 129 683 c
144 683 156 678 165 668 c
175 658 180 646 180 632 c

253 0 m
16 0 l
16 15 l
51 17 72 23 81 33 c
90 43 95 67 95 104 c
95 331 l
95 354 93 371 88 380 c
83 389 75 394 62 394 c
46 394 32 392 20 389 c
20 405 l
175 460 l
179 456 l
179 105 l
179 68 183 44 191 34 c
200 24 220 18 253 15 c
253 0 l

ce} _d
/k{500 0 7 0 505 683 sc
505 0 m
287 0 l
287 15 l
306 15 l
320 15 327 20 327 30 c
327 36 323 44 316 53 c
166 251 l
166 67 l
166 50 170 37 178 29 c
187 21 201 17 221 16 c
241 15 l
241 0 l
7 0 l
7 15 l
43 21 64 27 71 33 c
78 40 82 56 82 82 c
82 564 l
82 588 79 604 73 612 c
67 621 56 625 39 625 c
35 625 24 624 7 623 c
7 639 l
37 647 l
77 658 119 670 162 683 c
166 681 l
166 261 l
303 383 l
318 397 326 409 326 418 c
326 425 322 429 315 431 c
308 434 295 435 276 436 c
276 450 l
480 450 l
480 435 l
447 435 417 428 391 413 c
366 399 323 364 264 309 c
235 282 l
388 88 l
424 42 463 18 505 15 c
505 0 l

ce} _d
/l{278 0 19 0 257 683 sc
257 0 m
21 0 l
21 15 l
52 18 73 24 83 34 c
93 45 98 64 98 92 c
98 561 l
98 585 95 602 89 611 c
83 620 72 625 56 625 c
42 625 30 624 19 623 c
19 639 l
82 654 135 669 177 683 c
182 679 l
182 87 l
182 59 187 40 196 31 c
205 22 226 17 257 15 c
257 0 l

ce} _d
/hyphen{333 0 39 194 285 257 sc
285 194 m
39 194 l
39 257 l
285 257 l
285 194 l

ce} _d
/period{250 0 70 -11 181 100 sc
181 43 m
181 28 175 16 164 5 c
153 -6 140 -11 125 -11 c
110 -11 97 -6 86 5 c
75 16 70 29 70 44 c
70 59 75 72 86 83 c
97 94 111 100 126 100 c
141 100 153 94 164 83 c
175 72 181 58 181 43 c

ce} _d
/M{889 0 12 0 864 662 sc
864 0 m
584 0 l
584 19 l
623 22 648 29 658 41 c
669 54 674 81 674 123 c
674 572 l
419 0 l
405 0 l
153 549 l
153 151 l
153 97 159 62 170 46 c
181 30 207 21 246 19 c
246 0 l
12 0 l
12 19 l
41 21 62 25 75 32 c
88 39 96 50 101 67 c
106 84 109 112 109 151 c
109 549 l
109 587 103 611 92 622 c
81 633 55 640 14 643 c
14 662 l
212 662 l
443 160 l
664 662 l
863 662 l
863 643 l
827 642 803 636 792 624 c
781 612 776 587 776 550 c
776 112 l
776 77 781 53 792 41 c
803 29 827 22 864 19 c
864 0 l

ce} _d
/zero{500 0 24 -14 476 676 sc
476 330 m
476 285 472 243 463 203 c
454 164 441 127 424 94 c
407 61 384 34 354 15 c
324 -4 289 -14 250 -14 c
209 -14 174 -4 143 17 c
112 38 89 65 72 100 c
55 135 43 172 35 211 c
28 250 24 292 24 336 c
24 398 32 454 47 503 c
62 553 88 594 123 627 c
159 660 203 676 254 676 c
319 676 373 644 414 580 c
455 516 476 433 476 330 c

380 325 m
380 430 369 511 346 566 c
324 622 291 650 248 650 c
207 650 175 622 153 566 c
131 510 120 431 120 329 c
120 226 131 148 153 93 c
175 39 207 12 250 12 c
292 12 324 39 346 93 c
369 148 380 225 380 325 c

ce} _d
/one{500 0 111 0 394 676 sc
394 0 m
118 0 l
118 15 l
155 17 180 24 193 35 c
206 47 213 67 213 95 c
213 544 l
213 577 203 593 183 593 c
174 593 159 589 138 581 c
111 571 l
111 585 l
290 676 l
299 673 l
299 76 l
299 54 306 38 319 29 c
332 20 357 15 394 15 c
394 0 l

ce} _d
/two{500 0 29 0 474 676 sc
474 137 m
420 0 l
29 0 l
29 12 l
207 201 l
254 250 287 294 307 335 c
327 376 337 418 337 461 c
337 506 325 540 300 565 c
275 590 241 602 198 602 c
162 602 133 593 112 574 c
91 555 71 521 51 472 c
30 477 l
41 539 64 588 98 623 c
133 658 179 676 238 676 c
293 676 338 659 372 626 c
406 593 423 551 423 500 c
423 425 380 342 295 252 c
130 76 l
364 76 l
386 76 403 80 416 89 c
429 98 444 116 460 143 c
474 137 l

ce} _d
/R{667 0 17 0 660 662 sc
660 0 m
498 0 l
260 308 l
204 306 l
204 112 l
204 74 209 50 219 39 c
230 28 254 22 293 19 c
293 0 l
17 0 l
17 19 l
55 22 79 30 88 41 c
97 52 102 80 102 124 c
102 551 l
102 588 97 612 88 623 c
79 634 55 640 17 643 c
17 662 l
289 662 l
380 662 450 642 498 603 c
531 576 547 536 547 483 c
547 392 487 338 366 319 c
566 66 l
580 49 593 37 606 31 c
619 25 637 21 660 19 c
660 0 l

204 583 m
204 343 l
252 344 288 346 311 351 c
334 356 358 364 381 377 c
419 398 438 436 438 491 c
438 580 377 625 255 625 c
237 625 224 622 216 616 c
208 611 204 600 204 583 c

ce} _d
/four{500 0 12 0 473 676 sc
473 167 m
370 167 l
370 0 l
292 0 l
292 167 l
12 167 l
12 231 l
326 676 l
370 676 l
370 231 l
473 231 l
473 167 l

292 231 m
292 574 l
52 231 l
292 231 l

ce} _d
/six{500 0 34 -14 468 684 sc
446 684 m
448 668 l
369 655 304 623 251 572 c
198 521 165 458 152 383 c
191 413 233 428 279 428 c
338 428 384 409 417 372 c
451 335 468 284 468 219 c
468 154 451 100 417 59 c
378 10 325 -14 258 -14 c
177 -14 118 20 81 87 c
50 144 34 208 34 279 c
34 388 70 480 143 555 c
184 598 227 628 270 645 c
314 663 373 676 446 684 c

378 188 m
378 317 333 382 243 382 c
210 382 182 373 160 355 c
138 338 127 308 127 266 c
127 188 139 126 163 81 c
188 36 223 14 269 14 c
304 14 331 30 350 61 c
369 93 378 135 378 188 c

ce} _d
/eight{500 0 56 -14 445 676 sc
445 155 m
445 104 427 63 391 32 c
356 1 308 -14 248 -14 c
192 -14 146 1 110 32 c
74 63 56 102 56 149 c
56 184 65 214 82 239 c
99 264 134 295 186 332 c
136 373 103 407 86 432 c
70 457 62 487 62 520 c
62 567 80 605 116 633 c
153 662 199 676 256 676 c
305 676 345 662 376 634 c
408 607 424 573 424 533 c
424 496 414 467 395 445 c
376 423 341 398 290 371 c
350 331 391 295 412 264 c
434 233 445 196 445 155 c

355 533 m
355 568 345 595 326 616 c
307 637 280 648 246 648 c
212 648 185 639 165 621 c
146 604 136 580 136 549 c
136 518 146 490 165 465 c
185 440 217 415 261 389 c
295 409 319 430 333 452 c
348 475 355 502 355 533 c

271 272 m
212 312 l
183 288 162 264 150 241 c
138 218 132 191 132 158 c
132 113 143 77 166 52 c
189 27 220 14 259 14 c
292 14 318 24 338 44 c
359 65 369 91 369 124 c
369 154 361 180 346 203 c
331 226 306 249 271 272 c

ce} _d
end readonly def

/BuildGlyph {
 exch begin
 CharStrings exch
 2 copy known not {pop /.notdef} if
 true 3 1 roll get exec
 end
} _d

/BuildChar {
 1 index /Encoding get exch get
 1 index /BuildGlyph get exec
} _d

FontName currentdict end definefont pop
%!PS-Adobe-3.0 Resource-Font
%%Creator: Converted from TrueType to Type 3 by Matplotlib.
10 dict begin
/FontName /Cmmi10 def
/PaintType 0 def
/FontMatrix [0.00048828125 0 0 0.00048828125 0 0] def
/FontBBox [-70 -512 2146 1536] def
/FontType 3 def
/Encoding [/x /y] def
/CharStrings 3 dict dup begin
/.notdef 0 def
/x{1169 0 63 -23 1077 905 sc
160 59 m
184 40 218 31 262 31 c
305 31 342 51 375 92 c
408 133 430 178 442 227 c
535 590 l
550 656 557 701 557 725 c
557 759 547 789 528 814 c
509 839 483 852 449 852 c
406 852 365 838 327 811 c
289 784 257 750 231 708 c
205 667 187 625 176 582 c
173 573 168 569 160 569 c
135 569 l
124 569 119 575 119 588 c
119 594 l
132 645 155 694 187 742 c
219 791 258 830 304 860 c
351 890 400 905 453 905 c
503 905 548 892 588 865 c
629 838 657 802 674 756 c
697 798 727 833 763 862 c
800 891 840 905 883 905 c
912 905 942 900 973 889 c
1004 879 1029 863 1048 842 c
1067 821 1077 794 1077 762 c
1077 727 1066 697 1043 672 c
1021 647 993 635 958 635 c
936 635 918 642 903 656 c
888 670 881 688 881 709 c
881 738 891 763 910 784 c
930 806 954 819 981 823 c
956 842 922 852 879 852 c
835 852 797 832 764 791 c
732 750 709 705 696 655 c
606 293 l
591 238 584 193 584 158 c
584 123 594 93 613 68 c
633 43 659 31 692 31 c
756 31 813 59 863 115 c
914 172 947 234 963 301 c
966 309 971 313 979 313 c
1004 313 l
1009 313 1014 311 1017 307 c
1020 304 1022 300 1022 295 c
1022 294 1021 292 1020 289 c
1001 208 960 135 898 72 c
836 9 766 -23 688 -23 c
638 -23 593 -10 552 17 c
512 44 484 81 467 127 c
446 87 416 52 378 22 c
341 -8 301 -23 258 -23 c
229 -23 198 -18 167 -7 c
136 3 111 19 92 40 c
73 61 63 88 63 121 c
63 153 74 182 96 208 c
119 235 147 248 180 248 c
203 248 222 241 237 227 c
252 214 260 196 260 174 c
260 145 250 120 231 99 c
212 78 189 64 160 59 c

ce} _d
/y{1004 0 55 -420 1008 905 sc
172 -293 m
201 -342 251 -367 322 -367 c
387 -367 443 -344 490 -299 c
537 -254 575 -199 604 -134 c
633 -70 656 -4 672 63 c
611 6 546 -23 475 -23 c
421 -23 375 -14 337 5 c
299 24 269 51 248 88 c
227 125 217 170 217 223 c
217 268 223 313 235 360 c
247 407 264 460 285 517 c
307 575 326 625 342 668 c
360 718 369 759 369 791 c
369 832 354 852 324 852 c
270 852 225 824 190 768 c
155 713 130 651 113 582 c
110 573 105 569 96 569 c
72 569 l
61 569 55 575 55 588 c
55 594 l
77 675 111 747 156 810 c
201 873 259 905 328 905 c
377 905 418 889 451 857 c
485 825 502 784 502 735 c
502 710 496 683 485 655 c
479 638 465 602 444 546 c
423 490 406 444 395 407 c
384 370 374 334 367 299 c
360 264 356 228 356 193 c
356 148 366 109 385 78 c
404 47 435 31 477 31 c
562 31 638 83 705 186 c
860 817 l
865 835 875 850 892 863 c
909 876 927 883 946 883 c
963 883 977 878 989 867 c
1002 856 1008 842 1008 825 c
1008 817 1007 812 1006 809 c
803 -6 l
785 -76 752 -143 704 -207 c
656 -271 598 -322 530 -361 c
463 -400 392 -420 319 -420 c
284 -420 249 -413 214 -399 c
179 -386 151 -365 130 -338 c
109 -311 98 -279 98 -242 c
98 -205 109 -172 131 -145 c
153 -118 182 -104 219 -104 c
241 -104 259 -111 274 -124 c
289 -138 297 -156 297 -178 c
297 -209 285 -237 262 -260 c
239 -283 211 -295 180 -295 c
179 -294 177 -294 176 -293 c
175 -293 173 -293 172 -293 c

ce} _d
end readonly def

/BuildGlyph {
 exch begin
 CharStrings exch
 2 copy known not {pop /.notdef} if
 true 3 1 roll get exec
 end
} _d

/BuildChar {
 1 index /Encoding get exch get
 1 index /BuildGlyph get exec
} _d

FontName currentdict end definefont pop
end
%%EndProlog
mpldict begin
165.63 259.315 translate
280.74 273.371 0 0 clipbox
gsave
0 0 m
280.739847 0 l
280.739847 273.370898 l
0 273.370898 l
cl
1.000 setgray
fill
grestore
gsave
45.79375 41.60625 m
270.358398 41.60625 l
270.358398 266.170898 l
45.79375 266.170898 l
cl
1.000 setgray
fill
grestore
1.500 setlinewidth
1 setlinejoin
0 setlinecap
[] 0 setdash
0.122 0.467 0.706 setrgbcolor
gsave
224.565 224.565 45.794 41.606 clipbox
/o {
gsave
newpath
translate
1.5 setlinewidth
1 setlinejoin

0 setlinecap

-0.866025 -0.866025 m
0.866025 0.866025 l
-0.866025 0.866025 m
0.866025 -0.866025 l

gsave
0.122 0.467 0.706 setrgbcolor
fill
grestore
stroke
grestore
} bind def
53.3351 49.1476 o
53.3351 52.3704 o
53.3351 55.5932 o
53.3351 58.816 o
53.3351 62.0388 o
53.3351 65.2616 o
53.3351 68.4844 o
53.3351 71.7072 o
53.3351 74.93 o
53.3351 78.1528 o
53.3351 81.3756 o
53.3351 84.5984 o
53.3351 87.8212 o
53.3351 91.044 o
53.3351 94.2668 o
53.3351 97.4896 o
53.3351 100.712 o
53.3351 103.935 o
53.3351 107.158 o
53.3351 110.381 o
53.3351 113.604 o
53.3351 116.826 o
53.3351 120.049 o
53.3351 123.272 o
53.3351 126.495 o
53.3351 129.718 o
53.3351 132.94 o
53.3351 136.163 o
53.3351 139.386 o
53.3351 142.609 o
53.3351 145.832 o
53.3351 149.054 o
56.5579 49.1476 o
56.5579 52.3704 o
56.5579 55.5932 o
56.5579 58.816 o
56.5579 62.0388 o
56.5579 65.2616 o
56.5579 68.4844 o
56.5579 71.7072 o
56.5579 74.93 o
56.5579 78.1528 o
56.5579 81.3756 o
56.5579 84.5984 o
56.5579 87.8212 o
56.5579 91.044 o
56.5579 94.2668 o
56.5579 97.4896 o
56.5579 100.712 o
56.5579 103.935 o
56.5579 107.158 o
56.5579 110.381 o
56.5579 113.604 o
56.5579 116.826 o
56.5579 120.049 o
56.5579 123.272 o
56.5579 126.495 o
56.5579 129.718 o
56.5579 132.94 o
56.5579 136.163 o
56.5579 139.386 o
56.5579 142.609 o
56.5579 145.832 o
56.5579 149.054 o
59.7807 49.1476 o
59.7807 52.3704 o
59.7807 55.5932 o
59.7807 58.816 o
59.7807 62.0388 o
59.7807 65.2616 o
59.7807 68.4844 o
59.7807 71.7072 o
59.7807 74.93 o
59.7807 78.1528 o
59.7807 81.3756 o
59.7807 84.5984 o
59.7807 87.8212 o
59.7807 91.044 o
59.7807 94.2668 o
59.7807 97.4896 o
59.7807 100.712 o
59.7807 103.935 o
59.7807 107.158 o
59.7807 110.381 o
59.7807 113.604 o
59.7807 116.826 o
59.7807 120.049 o
59.7807 123.272 o
59.7807 126.495 o
59.7807 129.718 o
59.7807 132.94 o
59.7807 136.163 o
59.7807 139.386 o
59.7807 142.609 o
59.7807 145.832 o
59.7807 149.054 o
63.0035 49.1476 o
63.0035 52.3704 o
63.0035 55.5932 o
63.0035 58.816 o
63.0035 62.0388 o
63.0035 65.2616 o
63.0035 68.4844 o
63.0035 71.7072 o
63.0035 74.93 o
63.0035 78.1528 o
63.0035 81.3756 o
63.0035 84.5984 o
63.0035 87.8212 o
63.0035 91.044 o
63.0035 94.2668 o
63.0035 97.4896 o
63.0035 100.712 o
63.0035 103.935 o
63.0035 107.158 o
63.0035 110.381 o
63.0035 113.604 o
63.0035 116.826 o
63.0035 120.049 o
63.0035 123.272 o
63.0035 126.495 o
63.0035 129.718 o
63.0035 132.94 o
63.0035 136.163 o
63.0035 139.386 o
63.0035 142.609 o
63.0035 145.832 o
63.0035 149.054 o
66.2263 49.1476 o
66.2263 52.3704 o
66.2263 55.5932 o
66.2263 58.816 o
66.2263 62.0388 o
66.2263 65.2616 o
66.2263 68.4844 o
66.2263 71.7072 o
66.2263 74.93 o
66.2263 78.1528 o
66.2263 81.3756 o
66.2263 84.5984 o
66.2263 87.8212 o
66.2263 91.044 o
66.2263 94.2668 o
66.2263 97.4896 o
66.2263 100.712 o
66.2263 103.935 o
66.2263 107.158 o
66.2263 110.381 o
66.2263 113.604 o
66.2263 116.826 o
66.2263 120.049 o
66.2263 123.272 o
66.2263 126.495 o
66.2263 129.718 o
66.2263 132.94 o
66.2263 136.163 o
66.2263 139.386 o
66.2263 142.609 o
66.2263 145.832 o
66.2263 149.054 o
69.4491 49.1476 o
69.4491 52.3704 o
69.4491 55.5932 o
69.4491 58.816 o
69.4491 62.0388 o
69.4491 65.2616 o
69.4491 68.4844 o
69.4491 71.7072 o
69.4491 74.93 o
69.4491 78.1528 o
69.4491 81.3756 o
69.4491 84.5984 o
69.4491 87.8212 o
69.4491 91.044 o
69.4491 94.2668 o
69.4491 97.4896 o
69.4491 100.712 o
69.4491 103.935 o
69.4491 107.158 o
69.4491 110.381 o
69.4491 113.604 o
69.4491 116.826 o
69.4491 120.049 o
69.4491 123.272 o
69.4491 126.495 o
69.4491 129.718 o
69.4491 132.94 o
69.4491 136.163 o
69.4491 139.386 o
69.4491 142.609 o
69.4491 145.832 o
69.4491 149.054 o
72.6719 49.1476 o
72.6719 52.3704 o
72.6719 55.5932 o
72.6719 58.816 o
72.6719 62.0388 o
72.6719 65.2616 o
72.6719 68.4844 o
72.6719 71.7072 o
72.6719 74.93 o
72.6719 78.1528 o
72.6719 81.3756 o
72.6719 84.5984 o
72.6719 87.8212 o
72.6719 91.044 o
72.6719 94.2668 o
72.6719 97.4896 o
72.6719 100.712 o
72.6719 103.935 o
72.6719 107.158 o
72.6719 110.381 o
72.6719 113.604 o
72.6719 116.826 o
72.6719 120.049 o
72.6719 123.272 o
72.6719 126.495 o
72.6719 129.718 o
72.6719 132.94 o
72.6719 136.163 o
72.6719 139.386 o
72.6719 142.609 o
72.6719 145.832 o
72.6719 149.054 o
75.8947 49.1476 o
75.8947 52.3704 o
75.8947 55.5932 o
75.8947 58.816 o
75.8947 62.0388 o
75.8947 65.2616 o
75.8947 68.4844 o
75.8947 71.7072 o
75.8947 74.93 o
75.8947 78.1528 o
75.8947 81.3756 o
75.8947 84.5984 o
75.8947 87.8212 o
75.8947 91.044 o
75.8947 94.2668 o
75.8947 97.4896 o
75.8947 100.712 o
75.8947 103.935 o
75.8947 107.158 o
75.8947 110.381 o
75.8947 113.604 o
75.8947 116.826 o
75.8947 120.049 o
75.8947 123.272 o
75.8947 126.495 o
75.8947 129.718 o
75.8947 132.94 o
75.8947 136.163 o
75.8947 139.386 o
75.8947 142.609 o
75.8947 145.832 o
75.8947 149.054 o
79.1175 49.1476 o
79.1175 52.3704 o
79.1175 55.5932 o
79.1175 58.816 o
79.1175 62.0388 o
79.1175 65.2616 o
79.1175 68.4844 o
79.1175 71.7072 o
79.1175 74.93 o
79.1175 78.1528 o
79.1175 81.3756 o
79.1175 84.5984 o
79.1175 87.8212 o
79.1175 91.044 o
79.1175 94.2668 o
79.1175 97.4896 o
79.1175 100.712 o
79.1175 103.935 o
79.1175 107.158 o
79.1175 110.381 o
79.1175 113.604 o
79.1175 116.826 o
79.1175 120.049 o
79.1175 123.272 o
79.1175 126.495 o
79.1175 129.718 o
79.1175 132.94 o
79.1175 136.163 o
79.1175 139.386 o
79.1175 142.609 o
79.1175 145.832 o
79.1175 149.054 o
82.3403 49.1476 o
82.3403 52.3704 o
82.3403 55.5932 o
82.3403 58.816 o
82.3403 62.0388 o
82.3403 65.2616 o
82.3403 68.4844 o
82.3403 71.7072 o
82.3403 74.93 o
82.3403 78.1528 o
82.3403 81.3756 o
82.3403 84.5984 o
82.3403 87.8212 o
82.3403 91.044 o
82.3403 94.2668 o
82.3403 97.4896 o
82.3403 100.712 o
82.3403 103.935 o
82.3403 107.158 o
82.3403 110.381 o
82.3403 113.604 o
82.3403 116.826 o
82.3403 120.049 o
82.3403 123.272 o
82.3403 126.495 o
82.3403 129.718 o
82.3403 132.94 o
82.3403 136.163 o
82.3403 139.386 o
82.3403 142.609 o
82.3403 145.832 o
82.3403 149.054 o
85.5631 49.1476 o
85.5631 52.3704 o
85.5631 55.5932 o
85.5631 58.816 o
85.5631 62.0388 o
85.5631 65.2616 o
85.5631 68.4844 o
85.5631 71.7072 o
85.5631 74.93 o
85.5631 78.1528 o
85.5631 81.3756 o
85.5631 84.5984 o
85.5631 87.8212 o
85.5631 91.044 o
85.5631 94.2668 o
85.5631 97.4896 o
85.5631 100.712 o
85.5631 103.935 o
85.5631 107.158 o
85.5631 110.381 o
85.5631 113.604 o
85.5631 116.826 o
85.5631 120.049 o
85.5631 123.272 o
85.5631 126.495 o
85.5631 129.718 o
85.5631 132.94 o
85.5631 136.163 o
85.5631 139.386 o
85.5631 142.609 o
85.5631 145.832 o
85.5631 149.054 o
88.7859 49.1476 o
88.7859 52.3704 o
88.7859 55.5932 o
88.7859 58.816 o
88.7859 62.0388 o
88.7859 65.2616 o
88.7859 68.4844 o
88.7859 71.7072 o
88.7859 74.93 o
88.7859 78.1528 o
88.7859 81.3756 o
88.7859 84.5984 o
88.7859 87.8212 o
88.7859 91.044 o
88.7859 94.2668 o
88.7859 97.4896 o
88.7859 100.712 o
88.7859 103.935 o
88.7859 107.158 o
88.7859 110.381 o
88.7859 113.604 o
88.7859 116.826 o
88.7859 120.049 o
88.7859 123.272 o
88.7859 126.495 o
88.7859 129.718 o
88.7859 132.94 o
88.7859 136.163 o
88.7859 139.386 o
88.7859 142.609 o
88.7859 145.832 o
88.7859 149.054 o
92.0087 49.1476 o
92.0087 52.3704 o
92.0087 55.5932 o
92.0087 58.816 o
92.0087 62.0388 o
92.0087 65.2616 o
92.0087 68.4844 o
92.0087 71.7072 o
92.0087 74.93 o
92.0087 78.1528 o
92.0087 81.3756 o
92.0087 84.5984 o
92.0087 87.8212 o
92.0087 91.044 o
92.0087 94.2668 o
92.0087 97.4896 o
92.0087 100.712 o
92.0087 103.935 o
92.0087 107.158 o
92.0087 110.381 o
92.0087 113.604 o
92.0087 116.826 o
92.0087 120.049 o
92.0087 123.272 o
92.0087 126.495 o
92.0087 129.718 o
92.0087 132.94 o
92.0087 136.163 o
92.0087 139.386 o
92.0087 142.609 o
92.0087 145.832 o
92.0087 149.054 o
95.2315 49.1476 o
95.2315 52.3704 o
95.2315 55.5932 o
95.2315 58.816 o
95.2315 62.0388 o
95.2315 65.2616 o
95.2315 68.4844 o
95.2315 71.7072 o
95.2315 74.93 o
95.2315 78.1528 o
95.2315 81.3756 o
95.2315 84.5984 o
95.2315 87.8212 o
95.2315 91.044 o
95.2315 94.2668 o
95.2315 97.4896 o
95.2315 100.712 o
95.2315 103.935 o
95.2315 107.158 o
95.2315 110.381 o
95.2315 113.604 o
95.2315 116.826 o
95.2315 120.049 o
95.2315 123.272 o
95.2315 126.495 o
95.2315 129.718 o
95.2315 132.94 o
95.2315 136.163 o
95.2315 139.386 o
95.2315 142.609 o
95.2315 145.832 o
95.2315 149.054 o
98.4543 49.1476 o
98.4543 52.3704 o
98.4543 55.5932 o
98.4543 58.816 o
98.4543 62.0388 o
98.4543 65.2616 o
98.4543 68.4844 o
98.4543 71.7072 o
98.4543 74.93 o
98.4543 78.1528 o
98.4543 81.3756 o
98.4543 84.5984 o
98.4543 87.8212 o
98.4543 91.044 o
98.4543 94.2668 o
98.4543 97.4896 o
98.4543 100.712 o
98.4543 103.935 o
98.4543 107.158 o
98.4543 110.381 o
98.4543 113.604 o
98.4543 116.826 o
98.4543 120.049 o
98.4543 123.272 o
98.4543 126.495 o
98.4543 129.718 o
98.4543 132.94 o
98.4543 136.163 o
98.4543 139.386 o
98.4543 142.609 o
98.4543 145.832 o
98.4543 149.054 o
101.677 49.1476 o
101.677 52.3704 o
101.677 55.5932 o
101.677 58.816 o
101.677 62.0388 o
101.677 65.2616 o
101.677 68.4844 o
101.677 71.7072 o
101.677 74.93 o
101.677 78.1528 o
101.677 81.3756 o
101.677 84.5984 o
101.677 87.8212 o
101.677 91.044 o
101.677 94.2668 o
101.677 97.4896 o
101.677 100.712 o
101.677 103.935 o
101.677 107.158 o
101.677 110.381 o
101.677 113.604 o
101.677 116.826 o
101.677 120.049 o
101.677 123.272 o
101.677 126.495 o
101.677 129.718 o
101.677 132.94 o
101.677 136.163 o
101.677 139.386 o
101.677 142.609 o
101.677 145.832 o
101.677 149.054 o
104.9 49.1476 o
104.9 52.3704 o
104.9 55.5932 o
104.9 58.816 o
104.9 62.0388 o
104.9 65.2616 o
104.9 68.4844 o
104.9 71.7072 o
104.9 74.93 o
104.9 78.1528 o
104.9 81.3756 o
104.9 84.5984 o
104.9 87.8212 o
104.9 91.044 o
104.9 94.2668 o
104.9 97.4896 o
104.9 100.712 o
104.9 103.935 o
104.9 107.158 o
104.9 110.381 o
104.9 113.604 o
104.9 116.826 o
104.9 120.049 o
104.9 123.272 o
104.9 126.495 o
104.9 129.718 o
104.9 132.94 o
104.9 136.163 o
104.9 139.386 o
104.9 142.609 o
104.9 145.832 o
104.9 149.054 o
108.123 49.1476 o
108.123 52.3704 o
108.123 55.5932 o
108.123 58.816 o
108.123 62.0388 o
108.123 65.2616 o
108.123 68.4844 o
108.123 71.7072 o
108.123 74.93 o
108.123 78.1528 o
108.123 81.3756 o
108.123 84.5984 o
108.123 87.8212 o
108.123 91.044 o
108.123 94.2668 o
108.123 97.4896 o
108.123 100.712 o
108.123 103.935 o
108.123 107.158 o
108.123 110.381 o
108.123 113.604 o
108.123 116.826 o
108.123 120.049 o
108.123 123.272 o
108.123 126.495 o
108.123 129.718 o
108.123 132.94 o
108.123 136.163 o
108.123 139.386 o
108.123 142.609 o
108.123 145.832 o
108.123 149.054 o
111.345 49.1476 o
111.345 52.3704 o
111.345 55.5932 o
111.345 58.816 o
111.345 62.0388 o
111.345 65.2616 o
111.345 68.4844 o
111.345 71.7072 o
111.345 74.93 o
111.345 78.1528 o
111.345 81.3756 o
111.345 84.5984 o
111.345 87.8212 o
111.345 91.044 o
111.345 94.2668 o
111.345 97.4896 o
111.345 100.712 o
111.345 103.935 o
111.345 107.158 o
111.345 110.381 o
111.345 113.604 o
111.345 116.826 o
111.345 120.049 o
111.345 123.272 o
111.345 126.495 o
111.345 129.718 o
111.345 132.94 o
111.345 136.163 o
111.345 139.386 o
111.345 142.609 o
111.345 145.832 o
111.345 149.054 o
114.568 49.1476 o
114.568 52.3704 o
114.568 55.5932 o
114.568 58.816 o
114.568 62.0388 o
114.568 65.2616 o
114.568 68.4844 o
114.568 71.7072 o
114.568 74.93 o
114.568 78.1528 o
114.568 81.3756 o
114.568 84.5984 o
114.568 87.8212 o
114.568 91.044 o
114.568 94.2668 o
114.568 97.4896 o
114.568 100.712 o
114.568 103.935 o
114.568 107.158 o
114.568 110.381 o
114.568 113.604 o
114.568 116.826 o
114.568 120.049 o
114.568 123.272 o
114.568 126.495 o
114.568 129.718 o
114.568 132.94 o
114.568 136.163 o
114.568 139.386 o
114.568 142.609 o
114.568 145.832 o
114.568 149.054 o
117.791 49.1476 o
117.791 52.3704 o
117.791 55.5932 o
117.791 58.816 o
117.791 62.0388 o
117.791 65.2616 o
117.791 68.4844 o
117.791 71.7072 o
117.791 74.93 o
117.791 78.1528 o
117.791 81.3756 o
117.791 84.5984 o
117.791 87.8212 o
117.791 91.044 o
117.791 94.2668 o
117.791 97.4896 o
117.791 100.712 o
117.791 103.935 o
117.791 107.158 o
117.791 110.381 o
117.791 113.604 o
117.791 116.826 o
117.791 120.049 o
117.791 123.272 o
117.791 126.495 o
117.791 129.718 o
117.791 132.94 o
117.791 136.163 o
117.791 139.386 o
117.791 142.609 o
117.791 145.832 o
117.791 149.054 o
121.014 49.1476 o
121.014 52.3704 o
121.014 55.5932 o
121.014 58.816 o
121.014 62.0388 o
121.014 65.2616 o
121.014 68.4844 o
121.014 71.7072 o
121.014 74.93 o
121.014 78.1528 o
121.014 81.3756 o
121.014 84.5984 o
121.014 87.8212 o
121.014 91.044 o
121.014 94.2668 o
121.014 97.4896 o
121.014 100.712 o
121.014 103.935 o
121.014 107.158 o
121.014 110.381 o
121.014 113.604 o
121.014 116.826 o
121.014 120.049 o
121.014 123.272 o
121.014 126.495 o
121.014 129.718 o
121.014 132.94 o
121.014 136.163 o
121.014 139.386 o
121.014 142.609 o
121.014 145.832 o
121.014 149.054 o
124.237 49.1476 o
124.237 52.3704 o
124.237 55.5932 o
124.237 58.816 o
124.237 62.0388 o
124.237 65.2616 o
124.237 68.4844 o
124.237 71.7072 o
124.237 74.93 o
124.237 78.1528 o
124.237 81.3756 o
124.237 84.5984 o
124.237 87.8212 o
124.237 91.044 o
124.237 94.2668 o
124.237 97.4896 o
124.237 100.712 o
124.237 103.935 o
124.237 107.158 o
124.237 110.381 o
124.237 113.604 o
124.237 116.826 o
124.237 120.049 o
124.237 123.272 o
124.237 126.495 o
124.237 129.718 o
124.237 132.94 o
124.237 136.163 o
124.237 139.386 o
124.237 142.609 o
124.237 145.832 o
124.237 149.054 o
127.459 49.1476 o
127.459 52.3704 o
127.459 55.5932 o
127.459 58.816 o
127.459 62.0388 o
127.459 65.2616 o
127.459 68.4844 o
127.459 71.7072 o
127.459 74.93 o
127.459 78.1528 o
127.459 81.3756 o
127.459 84.5984 o
127.459 87.8212 o
127.459 91.044 o
127.459 94.2668 o
127.459 97.4896 o
127.459 100.712 o
127.459 103.935 o
127.459 107.158 o
127.459 110.381 o
127.459 113.604 o
127.459 116.826 o
127.459 120.049 o
127.459 123.272 o
127.459 126.495 o
127.459 129.718 o
127.459 132.94 o
127.459 136.163 o
127.459 139.386 o
127.459 142.609 o
127.459 145.832 o
127.459 149.054 o
130.682 49.1476 o
130.682 52.3704 o
130.682 55.5932 o
130.682 58.816 o
130.682 62.0388 o
130.682 65.2616 o
130.682 68.4844 o
130.682 71.7072 o
130.682 74.93 o
130.682 78.1528 o
130.682 81.3756 o
130.682 84.5984 o
130.682 87.8212 o
130.682 91.044 o
130.682 94.2668 o
130.682 97.4896 o
130.682 100.712 o
130.682 103.935 o
130.682 107.158 o
130.682 110.381 o
130.682 113.604 o
130.682 116.826 o
130.682 120.049 o
130.682 123.272 o
130.682 126.495 o
130.682 129.718 o
130.682 132.94 o
130.682 136.163 o
130.682 139.386 o
130.682 142.609 o
130.682 145.832 o
130.682 149.054 o
133.905 49.1476 o
133.905 52.3704 o
133.905 55.5932 o
133.905 58.816 o
133.905 62.0388 o
133.905 65.2616 o
133.905 68.4844 o
133.905 71.7072 o
133.905 74.93 o
133.905 78.1528 o
133.905 81.3756 o
133.905 84.5984 o
133.905 87.8212 o
133.905 91.044 o
133.905 94.2668 o
133.905 97.4896 o
133.905 100.712 o
133.905 103.935 o
133.905 107.158 o
133.905 110.381 o
133.905 113.604 o
133.905 116.826 o
133.905 120.049 o
133.905 123.272 o
133.905 126.495 o
133.905 129.718 o
133.905 132.94 o
133.905 136.163 o
133.905 139.386 o
133.905 142.609 o
133.905 145.832 o
133.905 149.054 o
137.128 49.1476 o
137.128 52.3704 o
137.128 55.5932 o
137.128 58.816 o
137.128 62.0388 o
137.128 65.2616 o
137.128 68.4844 o
137.128 71.7072 o
137.128 74.93 o
137.128 78.1528 o
137.128 81.3756 o
137.128 84.5984 o
137.128 87.8212 o
137.128 91.044 o
137.128 94.2668 o
137.128 97.4896 o
137.128 100.712 o
137.128 103.935 o
137.128 107.158 o
137.128 110.381 o
137.128 113.604 o
137.128 116.826 o
137.128 120.049 o
137.128 123.272 o
137.128 126.495 o
137.128 129.718 o
137.128 132.94 o
137.128 136.163 o
137.128 139.386 o
137.128 142.609 o
137.128 145.832 o
137.128 149.054 o
140.351 49.1476 o
140.351 52.3704 o
140.351 55.5932 o
140.351 58.816 o
140.351 62.0388 o
140.351 65.2616 o
140.351 68.4844 o
140.351 71.7072 o
140.351 74.93 o
140.351 78.1528 o
140.351 81.3756 o
140.351 84.5984 o
140.351 87.8212 o
140.351 91.044 o
140.351 94.2668 o
140.351 97.4896 o
140.351 100.712 o
140.351 103.935 o
140.351 107.158 o
140.351 110.381 o
140.351 113.604 o
140.351 116.826 o
140.351 120.049 o
140.351 123.272 o
140.351 126.495 o
140.351 129.718 o
140.351 132.94 o
140.351 136.163 o
140.351 139.386 o
140.351 142.609 o
140.351 145.832 o
140.351 149.054 o
143.573 49.1476 o
143.573 52.3704 o
143.573 55.5932 o
143.573 58.816 o
143.573 62.0388 o
143.573 65.2616 o
143.573 68.4844 o
143.573 71.7072 o
143.573 74.93 o
143.573 78.1528 o
143.573 81.3756 o
143.573 84.5984 o
143.573 87.8212 o
143.573 91.044 o
143.573 94.2668 o
143.573 97.4896 o
143.573 100.712 o
143.573 103.935 o
143.573 107.158 o
143.573 110.381 o
143.573 113.604 o
143.573 116.826 o
143.573 120.049 o
143.573 123.272 o
143.573 126.495 o
143.573 129.718 o
143.573 132.94 o
143.573 136.163 o
143.573 139.386 o
143.573 142.609 o
143.573 145.832 o
143.573 149.054 o
146.796 49.1476 o
146.796 52.3704 o
146.796 55.5932 o
146.796 58.816 o
146.796 62.0388 o
146.796 65.2616 o
146.796 68.4844 o
146.796 71.7072 o
146.796 74.93 o
146.796 78.1528 o
146.796 81.3756 o
146.796 84.5984 o
146.796 87.8212 o
146.796 91.044 o
146.796 94.2668 o
146.796 97.4896 o
146.796 100.712 o
146.796 103.935 o
146.796 107.158 o
146.796 110.381 o
146.796 113.604 o
146.796 116.826 o
146.796 120.049 o
146.796 123.272 o
146.796 126.495 o
146.796 129.718 o
146.796 132.94 o
146.796 136.163 o
146.796 139.386 o
146.796 142.609 o
146.796 145.832 o
146.796 149.054 o
150.019 49.1476 o
150.019 52.3704 o
150.019 55.5932 o
150.019 58.816 o
150.019 62.0388 o
150.019 65.2616 o
150.019 68.4844 o
150.019 71.7072 o
150.019 74.93 o
150.019 78.1528 o
150.019 81.3756 o
150.019 84.5984 o
150.019 87.8212 o
150.019 91.044 o
150.019 94.2668 o
150.019 97.4896 o
150.019 100.712 o
150.019 103.935 o
150.019 107.158 o
150.019 110.381 o
150.019 113.604 o
150.019 116.826 o
150.019 120.049 o
150.019 123.272 o
150.019 126.495 o
150.019 129.718 o
150.019 132.94 o
150.019 136.163 o
150.019 139.386 o
150.019 142.609 o
150.019 145.832 o
150.019 149.054 o
153.242 49.1476 o
153.242 52.3704 o
153.242 55.5932 o
153.242 58.816 o
153.242 62.0388 o
153.242 65.2616 o
153.242 68.4844 o
153.242 71.7072 o
153.242 74.93 o
153.242 78.1528 o
153.242 81.3756 o
153.242 84.5984 o
153.242 87.8212 o
153.242 91.044 o
153.242 94.2668 o
153.242 97.4896 o
153.242 100.712 o
153.242 103.935 o
153.242 107.158 o
153.242 110.381 o
153.242 113.604 o
153.242 116.826 o
153.242 120.049 o
153.242 123.272 o
153.242 126.495 o
153.242 129.718 o
153.242 132.94 o
153.242 136.163 o
153.242 139.386 o
153.242 142.609 o
153.242 145.832 o
153.242 149.054 o
162.91 158.723 o
162.91 161.946 o
162.91 165.168 o
162.91 168.391 o
162.91 171.614 o
162.91 174.837 o
162.91 178.06 o
162.91 181.282 o
162.91 184.505 o
162.91 187.728 o
162.91 190.951 o
162.91 194.174 o
162.91 197.396 o
162.91 200.619 o
162.91 203.842 o
162.91 207.065 o
162.91 210.288 o
162.91 213.51 o
162.91 216.733 o
162.91 219.956 o
162.91 223.179 o
162.91 226.402 o
162.91 229.624 o
162.91 232.847 o
162.91 236.07 o
162.91 239.293 o
162.91 242.516 o
162.91 245.738 o
162.91 248.961 o
162.91 252.184 o
162.91 255.407 o
162.91 258.63 o
166.133 158.723 o
166.133 161.946 o
166.133 165.168 o
166.133 168.391 o
166.133 171.614 o
166.133 174.837 o
166.133 178.06 o
166.133 181.282 o
166.133 184.505 o
166.133 187.728 o
166.133 190.951 o
166.133 194.174 o
166.133 197.396 o
166.133 200.619 o
166.133 203.842 o
166.133 207.065 o
166.133 210.288 o
166.133 213.51 o
166.133 216.733 o
166.133 219.956 o
166.133 223.179 o
166.133 226.402 o
166.133 229.624 o
166.133 232.847 o
166.133 236.07 o
166.133 239.293 o
166.133 242.516 o
166.133 245.738 o
166.133 248.961 o
166.133 252.184 o
166.133 255.407 o
166.133 258.63 o
169.356 158.723 o
169.356 161.946 o
169.356 165.168 o
169.356 168.391 o
169.356 171.614 o
169.356 174.837 o
169.356 178.06 o
169.356 181.282 o
169.356 184.505 o
169.356 187.728 o
169.356 190.951 o
169.356 194.174 o
169.356 197.396 o
169.356 200.619 o
169.356 203.842 o
169.356 207.065 o
169.356 210.288 o
169.356 213.51 o
169.356 216.733 o
169.356 219.956 o
169.356 223.179 o
169.356 226.402 o
169.356 229.624 o
169.356 232.847 o
169.356 236.07 o
169.356 239.293 o
169.356 242.516 o
169.356 245.738 o
169.356 248.961 o
169.356 252.184 o
169.356 255.407 o
169.356 258.63 o
172.579 158.723 o
172.579 161.946 o
172.579 165.168 o
172.579 168.391 o
172.579 171.614 o
172.579 174.837 o
172.579 178.06 o
172.579 181.282 o
172.579 184.505 o
172.579 187.728 o
172.579 190.951 o
172.579 194.174 o
172.579 197.396 o
172.579 200.619 o
172.579 203.842 o
172.579 207.065 o
172.579 210.288 o
172.579 213.51 o
172.579 216.733 o
172.579 219.956 o
172.579 223.179 o
172.579 226.402 o
172.579 229.624 o
172.579 232.847 o
172.579 236.07 o
172.579 239.293 o
172.579 242.516 o
172.579 245.738 o
172.579 248.961 o
172.579 252.184 o
172.579 255.407 o
172.579 258.63 o
175.801 158.723 o
175.801 161.946 o
175.801 165.168 o
175.801 168.391 o
175.801 171.614 o
175.801 174.837 o
175.801 178.06 o
175.801 181.282 o
175.801 184.505 o
175.801 187.728 o
175.801 190.951 o
175.801 194.174 o
175.801 197.396 o
175.801 200.619 o
175.801 203.842 o
175.801 207.065 o
175.801 210.288 o
175.801 213.51 o
175.801 216.733 o
175.801 219.956 o
175.801 223.179 o
175.801 226.402 o
175.801 229.624 o
175.801 232.847 o
175.801 236.07 o
175.801 239.293 o
175.801 242.516 o
175.801 245.738 o
175.801 248.961 o
175.801 252.184 o
175.801 255.407 o
175.801 258.63 o
179.024 158.723 o
179.024 161.946 o
179.024 165.168 o
179.024 168.391 o
179.024 171.614 o
179.024 174.837 o
179.024 178.06 o
179.024 181.282 o
179.024 184.505 o
179.024 187.728 o
179.024 190.951 o
179.024 194.174 o
179.024 197.396 o
179.024 200.619 o
179.024 203.842 o
179.024 207.065 o
179.024 210.288 o
179.024 213.51 o
179.024 216.733 o
179.024 219.956 o
179.024 223.179 o
179.024 226.402 o
179.024 229.624 o
179.024 232.847 o
179.024 236.07 o
179.024 239.293 o
179.024 242.516 o
179.024 245.738 o
179.024 248.961 o
179.024 252.184 o
179.024 255.407 o
179.024 258.63 o
182.247 158.723 o
182.247 161.946 o
182.247 165.168 o
182.247 168.391 o
182.247 171.614 o
182.247 174.837 o
182.247 178.06 o
182.247 181.282 o
182.247 184.505 o
182.247 187.728 o
182.247 190.951 o
182.247 194.174 o
182.247 197.396 o
182.247 200.619 o
182.247 203.842 o
182.247 207.065 o
182.247 210.288 o
182.247 213.51 o
182.247 216.733 o
182.247 219.956 o
182.247 223.179 o
182.247 226.402 o
182.247 229.624 o
182.247 232.847 o
182.247 236.07 o
182.247 239.293 o
182.247 242.516 o
182.247 245.738 o
182.247 248.961 o
182.247 252.184 o
182.247 255.407 o
182.247 258.63 o
185.47 158.723 o
185.47 161.946 o
185.47 165.168 o
185.47 168.391 o
185.47 171.614 o
185.47 174.837 o
185.47 178.06 o
185.47 181.282 o
185.47 184.505 o
185.47 187.728 o
185.47 190.951 o
185.47 194.174 o
185.47 197.396 o
185.47 200.619 o
185.47 203.842 o
185.47 207.065 o
185.47 210.288 o
185.47 213.51 o
185.47 216.733 o
185.47 219.956 o
185.47 223.179 o
185.47 226.402 o
185.47 229.624 o
185.47 232.847 o
185.47 236.07 o
185.47 239.293 o
185.47 242.516 o
185.47 245.738 o
185.47 248.961 o
185.47 252.184 o
185.47 255.407 o
185.47 258.63 o
188.693 158.723 o
188.693 161.946 o
188.693 165.168 o
188.693 168.391 o
188.693 171.614 o
188.693 174.837 o
188.693 178.06 o
188.693 181.282 o
188.693 184.505 o
188.693 187.728 o
188.693 190.951 o
188.693 194.174 o
188.693 197.396 o
188.693 200.619 o
188.693 203.842 o
188.693 207.065 o
188.693 210.288 o
188.693 213.51 o
188.693 216.733 o
188.693 219.956 o
188.693 223.179 o
188.693 226.402 o
188.693 229.624 o
188.693 232.847 o
188.693 236.07 o
188.693 239.293 o
188.693 242.516 o
188.693 245.738 o
188.693 248.961 o
188.693 252.184 o
188.693 255.407 o
188.693 258.63 o
191.915 158.723 o
191.915 161.946 o
191.915 165.168 o
191.915 168.391 o
191.915 171.614 o
191.915 174.837 o
191.915 178.06 o
191.915 181.282 o
191.915 184.505 o
191.915 187.728 o
191.915 190.951 o
191.915 194.174 o
191.915 197.396 o
191.915 200.619 o
191.915 203.842 o
191.915 207.065 o
191.915 210.288 o
191.915 213.51 o
191.915 216.733 o
191.915 219.956 o
191.915 223.179 o
191.915 226.402 o
191.915 229.624 o
191.915 232.847 o
191.915 236.07 o
191.915 239.293 o
191.915 242.516 o
191.915 245.738 o
191.915 248.961 o
191.915 252.184 o
191.915 255.407 o
191.915 258.63 o
195.138 158.723 o
195.138 161.946 o
195.138 165.168 o
195.138 168.391 o
195.138 171.614 o
195.138 174.837 o
195.138 178.06 o
195.138 181.282 o
195.138 184.505 o
195.138 187.728 o
195.138 190.951 o
195.138 194.174 o
195.138 197.396 o
195.138 200.619 o
195.138 203.842 o
195.138 207.065 o
195.138 210.288 o
195.138 213.51 o
195.138 216.733 o
195.138 219.956 o
195.138 223.179 o
195.138 226.402 o
195.138 229.624 o
195.138 232.847 o
195.138 236.07 o
195.138 239.293 o
195.138 242.516 o
195.138 245.738 o
195.138 248.961 o
195.138 252.184 o
195.138 255.407 o
195.138 258.63 o
198.361 158.723 o
198.361 161.946 o
198.361 165.168 o
198.361 168.391 o
198.361 171.614 o
198.361 174.837 o
198.361 178.06 o
198.361 181.282 o
198.361 184.505 o
198.361 187.728 o
198.361 190.951 o
198.361 194.174 o
198.361 197.396 o
198.361 200.619 o
198.361 203.842 o
198.361 207.065 o
198.361 210.288 o
198.361 213.51 o
198.361 216.733 o
198.361 219.956 o
198.361 223.179 o
198.361 226.402 o
198.361 229.624 o
198.361 232.847 o
198.361 236.07 o
198.361 239.293 o
198.361 242.516 o
198.361 245.738 o
198.361 248.961 o
198.361 252.184 o
198.361 255.407 o
198.361 258.63 o
201.584 158.723 o
201.584 161.946 o
201.584 165.168 o
201.584 168.391 o
201.584 171.614 o
201.584 174.837 o
201.584 178.06 o
201.584 181.282 o
201.584 184.505 o
201.584 187.728 o
201.584 190.951 o
201.584 194.174 o
201.584 197.396 o
201.584 200.619 o
201.584 203.842 o
201.584 207.065 o
201.584 210.288 o
201.584 213.51 o
201.584 216.733 o
201.584 219.956 o
201.584 223.179 o
201.584 226.402 o
201.584 229.624 o
201.584 232.847 o
201.584 236.07 o
201.584 239.293 o
201.584 242.516 o
201.584 245.738 o
201.584 248.961 o
201.584 252.184 o
201.584 255.407 o
201.584 258.63 o
204.807 158.723 o
204.807 161.946 o
204.807 165.168 o
204.807 168.391 o
204.807 171.614 o
204.807 174.837 o
204.807 178.06 o
204.807 181.282 o
204.807 184.505 o
204.807 187.728 o
204.807 190.951 o
204.807 194.174 o
204.807 197.396 o
204.807 200.619 o
204.807 203.842 o
204.807 207.065 o
204.807 210.288 o
204.807 213.51 o
204.807 216.733 o
204.807 219.956 o
204.807 223.179 o
204.807 226.402 o
204.807 229.624 o
204.807 232.847 o
204.807 236.07 o
204.807 239.293 o
204.807 242.516 o
204.807 245.738 o
204.807 248.961 o
204.807 252.184 o
204.807 255.407 o
204.807 258.63 o
208.029 158.723 o
208.029 161.946 o
208.029 165.168 o
208.029 168.391 o
208.029 171.614 o
208.029 174.837 o
208.029 178.06 o
208.029 181.282 o
208.029 184.505 o
208.029 187.728 o
208.029 190.951 o
208.029 194.174 o
208.029 197.396 o
208.029 200.619 o
208.029 203.842 o
208.029 207.065 o
208.029 210.288 o
208.029 213.51 o
208.029 216.733 o
208.029 219.956 o
208.029 223.179 o
208.029 226.402 o
208.029 229.624 o
208.029 232.847 o
208.029 236.07 o
208.029 239.293 o
208.029 242.516 o
208.029 245.738 o
208.029 248.961 o
208.029 252.184 o
208.029 255.407 o
208.029 258.63 o
211.252 158.723 o
211.252 161.946 o
211.252 165.168 o
211.252 168.391 o
211.252 171.614 o
211.252 174.837 o
211.252 178.06 o
211.252 181.282 o
211.252 184.505 o
211.252 187.728 o
211.252 190.951 o
211.252 194.174 o
211.252 197.396 o
211.252 200.619 o
211.252 203.842 o
211.252 207.065 o
211.252 210.288 o
211.252 213.51 o
211.252 216.733 o
211.252 219.956 o
211.252 223.179 o
211.252 226.402 o
211.252 229.624 o
211.252 232.847 o
211.252 236.07 o
211.252 239.293 o
211.252 242.516 o
211.252 245.738 o
211.252 248.961 o
211.252 252.184 o
211.252 255.407 o
211.252 258.63 o
214.475 158.723 o
214.475 161.946 o
214.475 165.168 o
214.475 168.391 o
214.475 171.614 o
214.475 174.837 o
214.475 178.06 o
214.475 181.282 o
214.475 184.505 o
214.475 187.728 o
214.475 190.951 o
214.475 194.174 o
214.475 197.396 o
214.475 200.619 o
214.475 203.842 o
214.475 207.065 o
214.475 210.288 o
214.475 213.51 o
214.475 216.733 o
214.475 219.956 o
214.475 223.179 o
214.475 226.402 o
214.475 229.624 o
214.475 232.847 o
214.475 236.07 o
214.475 239.293 o
214.475 242.516 o
214.475 245.738 o
214.475 248.961 o
214.475 252.184 o
214.475 255.407 o
214.475 258.63 o
217.698 158.723 o
217.698 161.946 o
217.698 165.168 o
217.698 168.391 o
217.698 171.614 o
217.698 174.837 o
217.698 178.06 o
217.698 181.282 o
217.698 184.505 o
217.698 187.728 o
217.698 190.951 o
217.698 194.174 o
217.698 197.396 o
217.698 200.619 o
217.698 203.842 o
217.698 207.065 o
217.698 210.288 o
217.698 213.51 o
217.698 216.733 o
217.698 219.956 o
217.698 223.179 o
217.698 226.402 o
217.698 229.624 o
217.698 232.847 o
217.698 236.07 o
217.698 239.293 o
217.698 242.516 o
217.698 245.738 o
217.698 248.961 o
217.698 252.184 o
217.698 255.407 o
217.698 258.63 o
220.921 158.723 o
220.921 161.946 o
220.921 165.168 o
220.921 168.391 o
220.921 171.614 o
220.921 174.837 o
220.921 178.06 o
220.921 181.282 o
220.921 184.505 o
220.921 187.728 o
220.921 190.951 o
220.921 194.174 o
220.921 197.396 o
220.921 200.619 o
220.921 203.842 o
220.921 207.065 o
220.921 210.288 o
220.921 213.51 o
220.921 216.733 o
220.921 219.956 o
220.921 223.179 o
220.921 226.402 o
220.921 229.624 o
220.921 232.847 o
220.921 236.07 o
220.921 239.293 o
220.921 242.516 o
220.921 245.738 o
220.921 248.961 o
220.921 252.184 o
220.921 255.407 o
220.921 258.63 o
224.143 158.723 o
224.143 161.946 o
224.143 165.168 o
224.143 168.391 o
224.143 171.614 o
224.143 174.837 o
224.143 178.06 o
224.143 181.282 o
224.143 184.505 o
224.143 187.728 o
224.143 190.951 o
224.143 194.174 o
224.143 197.396 o
224.143 200.619 o
224.143 203.842 o
224.143 207.065 o
224.143 210.288 o
224.143 213.51 o
224.143 216.733 o
224.143 219.956 o
224.143 223.179 o
224.143 226.402 o
224.143 229.624 o
224.143 232.847 o
224.143 236.07 o
224.143 239.293 o
224.143 242.516 o
224.143 245.738 o
224.143 248.961 o
224.143 252.184 o
224.143 255.407 o
224.143 258.63 o
227.366 158.723 o
227.366 161.946 o
227.366 165.168 o
227.366 168.391 o
227.366 171.614 o
227.366 174.837 o
227.366 178.06 o
227.366 181.282 o
227.366 184.505 o
227.366 187.728 o
227.366 190.951 o
227.366 194.174 o
227.366 197.396 o
227.366 200.619 o
227.366 203.842 o
227.366 207.065 o
227.366 210.288 o
227.366 213.51 o
227.366 216.733 o
227.366 219.956 o
227.366 223.179 o
227.366 226.402 o
227.366 229.624 o
227.366 232.847 o
227.366 236.07 o
227.366 239.293 o
227.366 242.516 o
227.366 245.738 o
227.366 248.961 o
227.366 252.184 o
227.366 255.407 o
227.366 258.63 o
230.589 158.723 o
230.589 161.946 o
230.589 165.168 o
230.589 168.391 o
230.589 171.614 o
230.589 174.837 o
230.589 178.06 o
230.589 181.282 o
230.589 184.505 o
230.589 187.728 o
230.589 190.951 o
230.589 194.174 o
230.589 197.396 o
230.589 200.619 o
230.589 203.842 o
230.589 207.065 o
230.589 210.288 o
230.589 213.51 o
230.589 216.733 o
230.589 219.956 o
230.589 223.179 o
230.589 226.402 o
230.589 229.624 o
230.589 232.847 o
230.589 236.07 o
230.589 239.293 o
230.589 242.516 o
230.589 245.738 o
230.589 248.961 o
230.589 252.184 o
230.589 255.407 o
230.589 258.63 o
233.812 158.723 o
233.812 161.946 o
233.812 165.168 o
233.812 168.391 o
233.812 171.614 o
233.812 174.837 o
233.812 178.06 o
233.812 181.282 o
233.812 184.505 o
233.812 187.728 o
233.812 190.951 o
233.812 194.174 o
233.812 197.396 o
233.812 200.619 o
233.812 203.842 o
233.812 207.065 o
233.812 210.288 o
233.812 213.51 o
233.812 216.733 o
233.812 219.956 o
233.812 223.179 o
233.812 226.402 o
233.812 229.624 o
233.812 232.847 o
233.812 236.07 o
233.812 239.293 o
233.812 242.516 o
233.812 245.738 o
233.812 248.961 o
233.812 252.184 o
233.812 255.407 o
233.812 258.63 o
237.035 158.723 o
237.035 161.946 o
237.035 165.168 o
237.035 168.391 o
237.035 171.614 o
237.035 174.837 o
237.035 178.06 o
237.035 181.282 o
237.035 184.505 o
237.035 187.728 o
237.035 190.951 o
237.035 194.174 o
237.035 197.396 o
237.035 200.619 o
237.035 203.842 o
237.035 207.065 o
237.035 210.288 o
237.035 213.51 o
237.035 216.733 o
237.035 219.956 o
237.035 223.179 o
237.035 226.402 o
237.035 229.624 o
237.035 232.847 o
237.035 236.07 o
237.035 239.293 o
237.035 242.516 o
237.035 245.738 o
237.035 248.961 o
237.035 252.184 o
237.035 255.407 o
237.035 258.63 o
240.257 158.723 o
240.257 161.946 o
240.257 165.168 o
240.257 168.391 o
240.257 171.614 o
240.257 174.837 o
240.257 178.06 o
240.257 181.282 o
240.257 184.505 o
240.257 187.728 o
240.257 190.951 o
240.257 194.174 o
240.257 197.396 o
240.257 200.619 o
240.257 203.842 o
240.257 207.065 o
240.257 210.288 o
240.257 213.51 o
240.257 216.733 o
240.257 219.956 o
240.257 223.179 o
240.257 226.402 o
240.257 229.624 o
240.257 232.847 o
240.257 236.07 o
240.257 239.293 o
240.257 242.516 o
240.257 245.738 o
240.257 248.961 o
240.257 252.184 o
240.257 255.407 o
240.257 258.63 o
243.48 158.723 o
243.48 161.946 o
243.48 165.168 o
243.48 168.391 o
243.48 171.614 o
243.48 174.837 o
243.48 178.06 o
243.48 181.282 o
243.48 184.505 o
243.48 187.728 o
243.48 190.951 o
243.48 194.174 o
243.48 197.396 o
243.48 200.619 o
243.48 203.842 o
243.48 207.065 o
243.48 210.288 o
243.48 213.51 o
243.48 216.733 o
243.48 219.956 o
243.48 223.179 o
243.48 226.402 o
243.48 229.624 o
243.48 232.847 o
243.48 236.07 o
243.48 239.293 o
243.48 242.516 o
243.48 245.738 o
243.48 248.961 o
243.48 252.184 o
243.48 255.407 o
243.48 258.63 o
246.703 158.723 o
246.703 161.946 o
246.703 165.168 o
246.703 168.391 o
246.703 171.614 o
246.703 174.837 o
246.703 178.06 o
246.703 181.282 o
246.703 184.505 o
246.703 187.728 o
246.703 190.951 o
246.703 194.174 o
246.703 197.396 o
246.703 200.619 o
246.703 203.842 o
246.703 207.065 o
246.703 210.288 o
246.703 213.51 o
246.703 216.733 o
246.703 219.956 o
246.703 223.179 o
246.703 226.402 o
246.703 229.624 o
246.703 232.847 o
246.703 236.07 o
246.703 239.293 o
246.703 242.516 o
246.703 245.738 o
246.703 248.961 o
246.703 252.184 o
246.703 255.407 o
246.703 258.63 o
249.926 158.723 o
249.926 161.946 o
249.926 165.168 o
249.926 168.391 o
249.926 171.614 o
249.926 174.837 o
249.926 178.06 o
249.926 181.282 o
249.926 184.505 o
249.926 187.728 o
249.926 190.951 o
249.926 194.174 o
249.926 197.396 o
249.926 200.619 o
249.926 203.842 o
249.926 207.065 o
249.926 210.288 o
249.926 213.51 o
249.926 216.733 o
249.926 219.956 o
249.926 223.179 o
249.926 226.402 o
249.926 229.624 o
249.926 232.847 o
249.926 236.07 o
249.926 239.293 o
249.926 242.516 o
249.926 245.738 o
249.926 248.961 o
249.926 252.184 o
249.926 255.407 o
249.926 258.63 o
253.149 158.723 o
253.149 161.946 o
253.149 165.168 o
253.149 168.391 o
253.149 171.614 o
253.149 174.837 o
253.149 178.06 o
253.149 181.282 o
253.149 184.505 o
253.149 187.728 o
253.149 190.951 o
253.149 194.174 o
253.149 197.396 o
253.149 200.619 o
253.149 203.842 o
253.149 207.065 o
253.149 210.288 o
253.149 213.51 o
253.149 216.733 o
253.149 219.956 o
253.149 223.179 o
253.149 226.402 o
253.149 229.624 o
253.149 232.847 o
253.149 236.07 o
253.149 239.293 o
253.149 242.516 o
253.149 245.738 o
253.149 248.961 o
253.149 252.184 o
253.149 255.407 o
253.149 258.63 o
256.371 158.723 o
256.371 161.946 o
256.371 165.168 o
256.371 168.391 o
256.371 171.614 o
256.371 174.837 o
256.371 178.06 o
256.371 181.282 o
256.371 184.505 o
256.371 187.728 o
256.371 190.951 o
256.371 194.174 o
256.371 197.396 o
256.371 200.619 o
256.371 203.842 o
256.371 207.065 o
256.371 210.288 o
256.371 213.51 o
256.371 216.733 o
256.371 219.956 o
256.371 223.179 o
256.371 226.402 o
256.371 229.624 o
256.371 232.847 o
256.371 236.07 o
256.371 239.293 o
256.371 242.516 o
256.371 245.738 o
256.371 248.961 o
256.371 252.184 o
256.371 255.407 o
256.371 258.63 o
259.594 158.723 o
259.594 161.946 o
259.594 165.168 o
259.594 168.391 o
259.594 171.614 o
259.594 174.837 o
259.594 178.06 o
259.594 181.282 o
259.594 184.505 o
259.594 187.728 o
259.594 190.951 o
259.594 194.174 o
259.594 197.396 o
259.594 200.619 o
259.594 203.842 o
259.594 207.065 o
259.594 210.288 o
259.594 213.51 o
259.594 216.733 o
259.594 219.956 o
259.594 223.179 o
259.594 226.402 o
259.594 229.624 o
259.594 232.847 o
259.594 236.07 o
259.594 239.293 o
259.594 242.516 o
259.594 245.738 o
259.594 248.961 o
259.594 252.184 o
259.594 255.407 o
259.594 258.63 o
262.817 158.723 o
262.817 161.946 o
262.817 165.168 o
262.817 168.391 o
262.817 171.614 o
262.817 174.837 o
262.817 178.06 o
262.817 181.282 o
262.817 184.505 o
262.817 187.728 o
262.817 190.951 o
262.817 194.174 o
262.817 197.396 o
262.817 200.619 o
262.817 203.842 o
262.817 207.065 o
262.817 210.288 o
262.817 213.51 o
262.817 216.733 o
262.817 219.956 o
262.817 223.179 o
262.817 226.402 o
262.817 229.624 o
262.817 232.847 o
262.817 236.07 o
262.817 239.293 o
262.817 242.516 o
262.817 245.738 o
262.817 248.961 o
262.817 252.184 o
262.817 255.407 o
262.817 258.63 o
53.3351 45.9248 o
56.5579 45.9248 o
59.7807 45.9248 o
63.0035 45.9248 o
66.2263 45.9248 o
69.4491 45.9248 o
72.6719 45.9248 o
75.8947 45.9248 o
79.1175 45.9248 o
82.3403 45.9248 o
85.5631 45.9248 o
88.7859 45.9248 o
92.0087 45.9248 o
95.2315 45.9248 o
98.4543 45.9248 o
101.677 45.9248 o
104.9 45.9248 o
108.123 45.9248 o
111.345 45.9248 o
114.568 45.9248 o
117.791 45.9248 o
121.014 45.9248 o
124.237 45.9248 o
127.459 45.9248 o
130.682 45.9248 o
133.905 45.9248 o
137.128 45.9248 o
140.351 45.9248 o
143.573 45.9248 o
146.796 45.9248 o
150.019 45.9248 o
153.242 45.9248 o
162.91 261.852 o
166.133 261.852 o
169.356 261.852 o
172.579 261.852 o
175.801 261.852 o
179.024 261.852 o
182.247 261.852 o
185.47 261.852 o
188.693 261.852 o
191.915 261.852 o
195.138 261.852 o
198.361 261.852 o
201.584 261.852 o
204.807 261.852 o
208.029 261.852 o
211.252 261.852 o
214.475 261.852 o
217.698 261.852 o
220.921 261.852 o
224.143 261.852 o
227.366 261.852 o
230.589 261.852 o
233.812 261.852 o
237.035 261.852 o
240.257 261.852 o
243.48 261.852 o
246.703 261.852 o
249.926 261.852 o
253.149 261.852 o
256.371 261.852 o
259.594 261.852 o
262.817 261.852 o
50.1123 49.1476 o
50.1123 52.3704 o
50.1123 55.5932 o
50.1123 58.816 o
50.1123 62.0388 o
50.1123 65.2616 o
50.1123 68.4844 o
50.1123 71.7072 o
50.1123 74.93 o
50.1123 78.1528 o
50.1123 81.3756 o
50.1123 84.5984 o
50.1123 87.8212 o
50.1123 91.044 o
50.1123 94.2668 o
50.1123 97.4896 o
50.1123 100.712 o
50.1123 103.935 o
50.1123 107.158 o
50.1123 110.381 o
50.1123 113.604 o
50.1123 116.826 o
50.1123 120.049 o
50.1123 123.272 o
50.1123 126.495 o
50.1123 129.718 o
50.1123 132.94 o
50.1123 136.163 o
50.1123 139.386 o
50.1123 142.609 o
50.1123 145.832 o
50.1123 149.054 o
266.04 158.723 o
266.04 161.946 o
266.04 165.168 o
266.04 168.391 o
266.04 171.614 o
266.04 174.837 o
266.04 178.06 o
266.04 181.282 o
266.04 184.505 o
266.04 187.728 o
266.04 190.951 o
266.04 194.174 o
266.04 197.396 o
266.04 200.619 o
266.04 203.842 o
266.04 207.065 o
266.04 210.288 o
266.04 213.51 o
266.04 216.733 o
266.04 219.956 o
266.04 223.179 o
266.04 226.402 o
266.04 229.624 o
266.04 232.847 o
266.04 236.07 o
266.04 239.293 o
266.04 242.516 o
266.04 245.738 o
266.04 248.961 o
266.04 252.184 o
266.04 255.407 o
266.04 258.63 o
grestore
1.000 setlinewidth
1.000 0.498 0.055 setrgbcolor
gsave
224.565 224.565 45.794 41.606 clipbox
/o {
gsave
newpath
translate
1.0 setlinewidth
1 setlinejoin

0 setlinecap

0 -0.866025 m
0.229673 -0.866025 0.449969 -0.774776 0.612372 -0.612372 c
0.774776 -0.449969 0.866025 -0.229673 0.866025 0 c
0.866025 0.229673 0.774776 0.449969 0.612372 0.612372 c
0.449969 0.774776 0.229673 0.866025 0 0.866025 c
-0.229673 0.866025 -0.449969 0.774776 -0.612372 0.612372 c
-0.774776 0.449969 -0.866025 0.229673 -0.866025 0 c
-0.866025 -0.229673 -0.774776 -0.449969 -0.612372 -0.612372 c
-0.449969 -0.774776 -0.229673 -0.866025 0 -0.866025 c
cl

gsave
1.000 0.498 0.055 setrgbcolor
fill
grestore
stroke
grestore
} bind def
53.3351 261.852 o
56.5579 261.852 o
59.7807 261.852 o
63.0035 261.852 o
66.2263 261.852 o
69.4491 261.852 o
72.6719 261.852 o
75.8947 261.852 o
79.1175 261.852 o
82.3403 261.852 o
85.5631 261.852 o
88.7859 261.852 o
92.0087 261.852 o
95.2315 261.852 o
98.4543 261.852 o
101.677 261.852 o
104.9 261.852 o
108.123 261.852 o
111.345 261.852 o
114.568 261.852 o
117.791 261.852 o
121.014 261.852 o
124.237 261.852 o
127.459 261.852 o
130.682 261.852 o
133.905 261.852 o
137.128 261.852 o
140.351 261.852 o
143.573 261.852 o
146.796 261.852 o
150.019 261.852 o
153.242 261.852 o
156.465 45.9248 o
156.465 261.852 o
159.687 45.9248 o
159.687 261.852 o
162.91 45.9248 o
166.133 45.9248 o
169.356 45.9248 o
172.579 45.9248 o
175.801 45.9248 o
179.024 45.9248 o
182.247 45.9248 o
185.47 45.9248 o
188.693 45.9248 o
191.915 45.9248 o
195.138 45.9248 o
198.361 45.9248 o
201.584 45.9248 o
204.807 45.9248 o
208.029 45.9248 o
211.252 45.9248 o
214.475 45.9248 o
217.698 45.9248 o
220.921 45.9248 o
224.143 45.9248 o
227.366 45.9248 o
230.589 45.9248 o
233.812 45.9248 o
237.035 45.9248 o
240.257 45.9248 o
243.48 45.9248 o
246.703 45.9248 o
249.926 45.9248 o
253.149 45.9248 o
256.371 45.9248 o
259.594 45.9248 o
262.817 45.9248 o
266.04 49.1476 o
266.04 52.3704 o
266.04 55.5932 o
266.04 58.816 o
266.04 62.0388 o
266.04 65.2616 o
266.04 68.4844 o
266.04 71.7072 o
266.04 74.93 o
266.04 78.1528 o
266.04 81.3756 o
266.04 84.5984 o
266.04 87.8212 o
266.04 91.044 o
266.04 94.2668 o
266.04 97.4896 o
266.04 100.712 o
266.04 103.935 o
266.04 107.158 o
266.04 110.381 o
266.04 113.604 o
266.04 116.826 o
266.04 120.049 o
266.04 123.272 o
266.04 126.495 o
266.04 129.718 o
266.04 132.94 o
266.04 136.163 o
266.04 139.386 o
266.04 142.609 o
266.04 145.832 o
266.04 149.054 o
50.1123 152.277 o
266.04 152.277 o
50.1123 155.5 o
266.04 155.5 o
50.1123 158.723 o
50.1123 161.946 o
50.1123 165.168 o
50.1123 168.391 o
50.1123 171.614 o
50.1123 174.837 o
50.1123 178.06 o
50.1123 181.282 o
50.1123 184.505 o
50.1123 187.728 o
50.1123 190.951 o
50.1123 194.174 o
50.1123 197.396 o
50.1123 200.619 o
50.1123 203.842 o
50.1123 207.065 o
50.1123 210.288 o
50.1123 213.51 o
50.1123 216.733 o
50.1123 219.956 o
50.1123 223.179 o
50.1123 226.402 o
50.1123 229.624 o
50.1123 232.847 o
50.1123 236.07 o
50.1123 239.293 o
50.1123 242.516 o
50.1123 245.738 o
50.1123 248.961 o
50.1123 252.184 o
50.1123 255.407 o
50.1123 258.63 o
53.3351 152.277 o
56.5579 152.277 o
59.7807 152.277 o
63.0035 152.277 o
66.2263 152.277 o
69.4491 152.277 o
72.6719 152.277 o
75.8947 152.277 o
79.1175 152.277 o
82.3403 152.277 o
85.5631 152.277 o
88.7859 152.277 o
92.0087 152.277 o
95.2315 152.277 o
98.4543 152.277 o
101.677 152.277 o
104.9 152.277 o
108.123 152.277 o
111.345 152.277 o
114.568 152.277 o
117.791 152.277 o
121.014 152.277 o
124.237 152.277 o
127.459 152.277 o
130.682 152.277 o
133.905 152.277 o
137.128 152.277 o
140.351 152.277 o
143.573 152.277 o
146.796 152.277 o
150.019 152.277 o
153.242 152.277 o
156.465 49.1476 o
156.465 52.3704 o
156.465 55.5932 o
156.465 58.816 o
156.465 62.0388 o
156.465 65.2616 o
156.465 68.4844 o
156.465 71.7072 o
156.465 74.93 o
156.465 78.1528 o
156.465 81.3756 o
156.465 84.5984 o
156.465 87.8212 o
156.465 91.044 o
156.465 94.2668 o
156.465 97.4896 o
156.465 100.712 o
156.465 103.935 o
156.465 107.158 o
156.465 110.381 o
156.465 113.604 o
156.465 116.826 o
156.465 120.049 o
156.465 123.272 o
156.465 126.495 o
156.465 129.718 o
156.465 132.94 o
156.465 136.163 o
156.465 139.386 o
156.465 142.609 o
156.465 145.832 o
156.465 149.054 o
156.465 152.277 o
159.687 155.5 o
159.687 158.723 o
159.687 161.946 o
159.687 165.168 o
159.687 168.391 o
159.687 171.614 o
159.687 174.837 o
159.687 178.06 o
159.687 181.282 o
159.687 184.505 o
159.687 187.728 o
159.687 190.951 o
159.687 194.174 o
159.687 197.396 o
159.687 200.619 o
159.687 203.842 o
159.687 207.065 o
159.687 210.288 o
159.687 213.51 o
159.687 216.733 o
159.687 219.956 o
159.687 223.179 o
159.687 226.402 o
159.687 229.624 o
159.687 232.847 o
159.687 236.07 o
159.687 239.293 o
159.687 242.516 o
159.687 245.738 o
159.687 248.961 o
159.687 252.184 o
159.687 255.407 o
159.687 258.63 o
162.91 155.5 o
166.133 155.5 o
169.356 155.5 o
172.579 155.5 o
175.801 155.5 o
179.024 155.5 o
182.247 155.5 o
185.47 155.5 o
188.693 155.5 o
191.915 155.5 o
195.138 155.5 o
198.361 155.5 o
201.584 155.5 o
204.807 155.5 o
208.029 155.5 o
211.252 155.5 o
214.475 155.5 o
217.698 155.5 o
220.921 155.5 o
224.143 155.5 o
227.366 155.5 o
230.589 155.5 o
233.812 155.5 o
237.035 155.5 o
240.257 155.5 o
243.48 155.5 o
246.703 155.5 o
249.926 155.5 o
253.149 155.5 o
256.371 155.5 o
259.594 155.5 o
262.817 155.5 o
54.5526 258.851 o
57.8814 258.896 o
61.646 258.912 o
65.2267 258.772 o
70.8274 258.921 o
75.582 258.629 o
79.9465 258.721 o
83.7175 258.921 o
88.2571 258.657 o
92.8348 258.721 o
96.3873 258.827 o
101.14 258.658 o
104.974 258.614 o
109.243 258.813 o
112.667 258.895 o
116.032 258.963 o
120.255 258.704 o
123.964 258.625 o
128.26 258.714 o
131.702 258.778 o
136.793 258.631 o
140.878 258.657 o
144.135 258.662 o
147.563 258.706 o
151.602 259.027 o
155.387 258.798 o
160.988 48.8912 o
166.62 49.1269 o
170.305 49.0214 o
173.783 48.9314 o
180.253 48.9214 o
183.58 48.8766 o
189.738 48.9903 o
192.984 48.9823 o
198.762 49.1388 o
202.324 49.0779 o
206.126 48.883 o
211.957 49.0862 o
217.195 49.1244 o
221.449 49.1204 o
225.423 48.9002 o
228.772 48.8425 o
235.092 48.9 o
238.434 48.846 o
243.022 49.1311 o
247.205 49.1246 o
251.424 48.7966 o
257.929 48.7647 o
262.465 49.1445 o
262.854 52.9518 o
263.201 57.153 o
262.99 63.1284 o
262.962 69.4915 o
263.121 73.1107 o
262.818 78.4834 o
262.872 82.0486 o
263.203 86.1609 o
263.003 92.1688 o
263.108 95.644 o
263.169 102.212 o
262.816 106.844 o
262.864 111.017 o
262.975 114.651 o
263.038 121.265 o
263.209 128.069 o
263.103 134.306 o
262.882 140.106 o
263.141 144.053 o
263.165 150.546 o
53.0718 156.816 o
52.9256 160.328 o
53.291 164.547 o
52.981 169.895 o
53.2332 173.971 o
53.3512 178.059 o
53.254 182.07 o
53.3188 187.271 o
53.2619 191.706 o
53.1946 195.169 o
52.93 198.994 o
53.1697 202.773 o
53.3473 206.906 o
53.3512 210.279 o
53.2701 214.231 o
53.1548 217.844 o
53.0489 221.322 o
53.3413 226.148 o
53.3463 229.445 o
53.3009 233.416 o
53.0571 237.419 o
53.0014 240.757 o
53.0575 244.391 o
53.3381 248.671 o
53.3217 252.62 o
56.9823 155.488 o
60.3242 155.47 o
63.866 155.399 o
67.2832 155.339 o
73.1091 155.486 o
76.906 155.354 o
83.3192 155.365 o
89.5422 155.427 o
96.7604 155.132 o
103.27 155.097 o
109.671 155.122 o
115.772 155.284 o
122.257 155.268 o
125.832 155.096 o
131.816 155.311 o
137.003 155.514 o
141.258 155.386 o
147.528 155.432 o
151.605 155.101 o
159.704 52.3867 o
159.678 55.9965 o
159.625 59.5255 o
159.446 63.3035 o
159.316 66.7979 o
159.603 70.9062 o
159.699 75.0982 o
159.477 79.3432 o
159.613 83.8358 o
159.699 87.65 o
159.703 91.0726 o
159.675 94.695 o
159.326 99.0066 o
159.664 104.443 o
159.622 107.882 o
159.47 111.589 o
159.588 115.968 o
159.685 120.4 o
159.632 123.95 o
159.532 127.534 o
159.438 131.656 o
159.583 135.289 o
159.674 139.82 o
159.545 146.834 o
159.484 150.227 o
156.393 155.515 o
156.556 159.552 o
156.845 163.498 o
156.558 169.225 o
156.487 175.334 o
156.498 178.626 o
156.627 182.342 o
156.497 188.289 o
156.834 192.483 o
156.711 198.673 o
156.481 204.3 o
156.489 207.578 o
156.499 210.856 o
156.76 214.897 o
156.675 221.146 o
156.683 227.612 o
156.476 233.27 o
156.66 237.22 o
156.716 243.803 o
156.801 247.207 o
156.827 253.704 o
162.363 152.308 o
165.879 152.271 o
169.377 152.261 o
173.441 152.378 o
177.37 152.666 o
181.52 152.344 o
185.799 152.278 o
189.669 152.412 o
192.995 152.446 o
197.666 152.337 o
201.828 152.27 o
205.274 152.295 o
209.37 152.552 o
213.229 152.51 o
217.3 152.286 o
220.882 152.261 o
224.424 152.273 o
228.836 152.614 o
232.234 152.672 o
237.007 152.261 o
241.149 152.386 o
246.043 152.329 o
249.524 152.286 o
253.26 152.263 o
256.725 152.28 o
54.827 255.624 o
59.1769 255.928 o
63.307 256.131 o
67.3407 256.318 o
71.0563 255.691 o
74.6873 255.516 o
78.9069 255.654 o
82.4983 255.92 o
86.3084 256.07 o
90.1155 256.004 o
94.3149 255.84 o
98.1027 256.079 o
101.696 255.467 o
105.738 255.467 o
110.114 255.694 o
113.653 255.81 o
117.728 256.204 o
121.621 255.767 o
125.073 255.582 o
129.163 255.603 o
132.788 255.727 o
136.906 255.394 o
140.3 255.47 o
144.074 255.424 o
148.521 255.611 o
152.653 255.963 o
163.369 51.0873 o
167.401 52.2701 o
171.554 52.0098 o
175.832 51.4402 o
181.189 52.0222 o
186.622 49.9904 o
190.176 52.1995 o
195.711 50.7305 o
200.021 52.1232 o
204.198 51.7198 o
208.444 51.1446 o
213.813 51.74 o
219.236 51.639 o
222.86 52.0357 o
226.356 52.0017 o
231.719 50.1873 o
236.173 51.953 o
239.765 51.7986 o
244.621 51.9478 o
248.81 51.9378 o
254.499 49.8111 o
259.377 51.662 o
260.518 55.1958 o
261.575 59.954 o
262.123 66.2494 o
259.754 63.269 o
260.351 71.4084 o
260.913 75.4806 o
259.695 79.3418 o
260.491 84.2447 o
261.839 89.0988 o
259.917 93.1546 o
263.032 98.882 o
260.005 96.5721 o
260.532 104.093 o
260.213 108.771 o
259.996 112.522 o
261.85 117.688 o
262.6 124.474 o
259.85 121.84 o
260.14 129.104 o
260.653 136.424 o
260.331 132.63 o
260.347 142.122 o
261.993 147.082 o
260.457 152.322 o
55.9827 159.258 o
56.4915 165.044 o
55.902 168.496 o
55.7759 171.964 o
55.9271 175.769 o
56.2171 179.568 o
55.7239 184.165 o
56.5549 187.406 o
56.4705 192.148 o
56.088 196.624 o
55.9271 200.222 o
55.9158 204.49 o
56.5484 209.761 o
56.3553 213.245 o
56.3471 217.297 o
56.2666 220.952 o
56.5568 225.76 o
56.4587 230.341 o
56.3175 234.595 o
56.1124 238.494 o
55.9946 243.025 o
55.6695 246.422 o
56.1969 250.193 o
61.7548 158.376 o
65.1902 158.355 o
69.3763 157.811 o
73.9986 158.601 o
79.8438 156.718 o
84.9638 158.155 o
92.7197 156.054 o
89.9274 158.642 o
99.9249 155.823 o
97.0816 158.355 o
105.01 157.829 o
112.658 156.374 o
109.403 158.35 o
118.965 155.826 o
116.244 158.488 o
121.725 158.463 o
128.421 157.043 o
133.428 158.121 o
138.099 158.562 o
143.752 157.453 o
149.114 158.256 o
153.032 158.009 o
162.836 55.2776 o
162.398 61.1982 o
162.461 64.4886 o
162.574 69.6174 o
162.674 73.8177 o
162.08 77.4159 o
162.114 81.2233 o
162.628 85.0188 o
162.83 88.4803 o
162.762 92.1394 o
162.642 95.9949 o
162.459 99.8292 o
162.796 103.619 o
162.848 107.602 o
162.698 111.329 o
162.801 115.563 o
162.589 118.965 o
162.492 125.47 o
162.093 129.517 o
162.508 136.682 o
162.785 140.722 o
159.778 143.057 o
162.5 145.509 o
162.497 149.039 o
153.905 161.412 o
154.74 165.96 o
154.78 171.932 o
153.467 176.504 o
153.81 180.432 o
154.628 184.89 o
154.137 190.506 o
154.034 194.11 o
154.603 201.132 o
153.72 197.429 o
153.465 205.48 o
153.668 209.168 o
153.747 212.564 o
154.932 217.57 o
153.836 222.705 o
154.794 230.243 o
153.597 226.629 o
153.503 234.554 o
156.13 240.415 o
153.782 245.176 o
155.713 250.258 o
153.709 252.829 o
166.202 149.048 o
170.416 149.193 o
174.919 149.496 o
178.388 149.591 o
182.416 149.231 o
187.312 149.414 o
195.237 150.109 o
191.465 149.592 o
198.422 149.187 o
202.359 149.075 o
206.824 149.451 o
210.236 149.43 o
213.84 149.33 o
217.993 149.122 o
221.33 149.054 o
225.701 149.297 o
229.075 149.383 o
232.347 149.435 o
236.214 149.121 o
240.992 149.151 o
245.394 149.156 o
248.964 149.096 o
252.493 149.116 o
255.825 149.169 o
57.243 253.329 o
61.0504 253.286 o
64.9519 253.341 o
69.0565 253.143 o
73.4365 252.528 o
77.8896 252.579 o
81.7222 252.776 o
85.5885 252.912 o
90.1375 252.765 o
94.0554 252.611 o
98.4348 252.857 o
102.77 252.412 o
106.303 252.277 o
110.359 252.464 o
113.721 252.572 o
118.091 252.985 o
121.566 252.528 o
125.794 252.424 o
130.302 252.571 o
134.4 252.917 o
137.935 252.323 o
141.418 252.43 o
145.875 252.732 o
149.504 252.525 o
168.506 55.3149 o
173.078 54.8682 o
177.502 54.2154 o
184.124 53.393 o
180.792 55.2367 o
192.994 53.7957 o
189.529 55.3731 o
202.134 54.5774 o
198.34 54.8918 o
205.899 54.476 o
210.201 53.8657 o
216.435 53.6415 o
219.904 54.8084 o
224.076 55.0378 o
229.339 53.2652 o
232.599 53.3042 o
237.394 54.9531 o
241.419 54.5835 o
245.952 54.9005 o
252.046 52.0772 o
249.677 55.0584 o
255.591 52.8608 o
258.017 57.254 o
259.044 67.2518 o
256.863 64.7305 o
257.471 60.9717 o
257.526 72.9932 o
257.787 76.3298 o
257.479 81.7041 o
259.031 87.1358 o
257.175 91.4312 o
260.043 100.129 o
256.91 97.5262 o
257.708 105.678 o
257.036 109.401 o
258.995 115.602 o
259.556 125.58 o
256.783 122.88 o
257.914 119.244 o
256.955 129.69 o
257.445 136.875 o
257.133 133.143 o
258.187 144.536 o
257.383 140.814 o
259.399 149.021 o
58.9984 160.439 o
59.7264 164.883 o
59.1296 168.766 o
58.9706 172.497 o
59.0778 176.52 o
59.3493 180.393 o
58.9054 184.772 o
59.526 188.696 o
59.6139 192.929 o
59.2543 197.306 o
59.1448 200.591 o
59.1034 203.916 o
58.9482 207.586 o
59.3587 211.371 o
59.2285 214.74 o
59.4347 218.275 o
59.2927 222.107 o
59.3908 227.328 o
59.6422 230.938 o
59.5452 234.326 o
59.2597 237.728 o
58.916 241.627 o
58.8262 245.697 o
59.3789 249.588 o
62.9322 161.393 o
66.6121 161.265 o
70.1131 160.965 o
76.9751 159.878 o
73.7038 161.826 o
81.3089 159.607 o
86.8904 160.759 o
93.7829 159.113 o
90.6591 161.798 o
101.208 158.797 o
98.6483 161.19 o
104.351 161 o
111.809 160.518 o
108.085 161.308 o
118.374 160.928 o
124.909 159.053 o
122.148 161.674 o
130.201 159.749 o
134.637 161.125 o
140.489 160.747 o
145.887 159.889 o
149.519 161.47 o
165.256 57.4309 o
165.633 61.0393 o
165.537 65.5028 o
165.811 69.4994 o
165.906 74.0406 o
165.206 78.2641 o
165.335 81.5635 o
165.828 85.5157 o
166.014 89.0726 o
165.669 93.5665 o
165.456 97.5982 o
165.769 102.334 o
165.914 106.557 o
165.546 109.786 o
165.865 114.511 o
165.811 118.634 o
163.9 121.927 o
165.73 125.382 o
165.257 128.822 o
163.732 132.311 o
165.37 135.166 o
165.804 139.547 o
164.835 143.229 o
152.161 167.919 o
152.08 164.112 o
151.626 172.668 o
150.46 177.708 o
151.077 182.171 o
152.321 187.164 o
151.043 191.466 o
150.915 194.987 o
151.482 201.998 o
150.635 198.414 o
150.554 206.9 o
150.583 210.156 o
151.97 215.272 o
152.089 219.122 o
150.977 224.227 o
151.611 230.841 o
150.478 227.502 o
150.767 236.287 o
153.255 241.907 o
152.253 248.031 o
150.594 244.605 o
167.353 146.021 o
170.998 146.007 o
174.771 146.261 o
178.539 146.356 o
182.347 145.993 o
186.611 146.252 o
193.918 147.151 o
189.828 146.797 o
197.181 146.196 o
200.72 146.282 o
204.509 146.653 o
208.792 146.531 o
213.017 146.197 o
216.4 146.302 o
221.356 145.815 o
225.227 146.093 o
229.233 146.148 o
232.544 146.202 o
237.598 146.192 o
242.056 146.092 o
245.46 145.918 o
248.722 145.866 o
252.581 145.879 o
65.781 250.21 o
69.1467 249.905 o
72.7155 249.37 o
76.7968 249.53 o
80.3315 249.85 o
87.7178 250.471 o
83.9254 250.133 o
91.4813 249.818 o
95.5891 249.758 o
99.3191 249.742 o
103.72 249.315 o
107.778 249.394 o
111.915 249.624 o
115.799 250.088 o
120.635 249.426 o
123.953 249.76 o
127.76 249.85 o
131.351 249.507 o
135.227 249.786 o
138.728 249.182 o
142.407 249.346 o
146.161 249.506 o
170.586 57.7973 o
175.321 57.2047 o
183.976 56.6285 o
180.132 58.4076 o
192.57 57.0067 o
189.528 58.612 o
203.793 57.3593 o
198.549 58.1239 o
208.193 56.763 o
213.071 55.367 o
216.549 56.8784 o
221.572 57.5844 o
227.23 55.7718 o
231.039 56.1424 o
239.142 57.6802 o
235.341 57.4578 o
242.877 57.4758 o
247.603 57.6868 o
252.855 55.686 o
256.485 69.2381 o
253.922 66.087 o
254.237 61.1545 o
254.359 73.6722 o
255.42 78.54 o
255.644 84.3732 o
256 88.2783 o
255.223 94.0156 o
257.64 102.301 o
254.424 99.6022 o
254.59 106.554 o
256.607 112.611 o
253.85 109.985 o
255.831 116.297 o
255.672 125.922 o
253.546 122.763 o
254.685 119.497 o
254.169 131.343 o
254.819 138.771 o
254.375 134.841 o
254.789 142.754 o
62.9582 165.097 o
61.7973 170.603 o
61.7508 174.159 o
61.9594 177.998 o
62.1319 182.05 o
62.5431 189.874 o
62.7927 193.55 o
62.4637 197.742 o
62.2183 201.613 o
61.7156 205.831 o
61.8039 209.247 o
62.1343 213.04 o
62.0743 216.398 o
62.0356 220.205 o
61.9454 223.966 o
62.6271 227.197 o
62.8809 230.896 o
62.7834 234.393 o
62.299 238.848 o
61.9776 242.684 o
62.0565 245.933 o
62.5393 250.297 o
67.57 164.359 o
71.1783 164.023 o
76.725 163.107 o
83.0879 162.313 o
87.1687 163.985 o
95.1641 162.043 o
92.4557 164.493 o
100.924 163.495 o
105.36 164.078 o
114.778 161.814 o
111.494 163.741 o
118.994 164.107 o
125.39 162.256 o
122.825 164.841 o
131.057 162.872 o
136.928 163.415 o
143.175 162.557 o
147.988 164.324 o
168.839 60.5755 o
168.51 64.2183 o
169.035 69.1852 o
169.048 73.2545 o
168.224 77.089 o
168.488 80.8197 o
169 86.1735 o
169.203 89.6368 o
168.905 93.4247 o
168.674 97.9617 o
169.007 102.429 o
169.102 105.984 o
168.718 110.44 o
169.103 114.538 o
168.936 117.785 o
167.584 121.344 o
168.968 125.31 o
168.399 129.606 o
167.977 133.244 o
168.004 137.051 o
167.897 142.019 o
149.499 169.765 o
148.689 174.034 o
147.857 179.635 o
149.135 184.763 o
149.236 188.151 o
147.924 192.338 o
147.82 195.942 o
148.738 203.718 o
147.954 200.232 o
147.506 207.997 o
149.454 213.192 o
149.131 216.832 o
149.087 220.337 o
147.742 224.064 o
148.817 232.48 o
147.542 228.869 o
153.104 238.529 o
149.357 239.203 o
147.558 235.848 o
147.819 246.275 o
148.147 242.482 o
171.499 142.807 o
175.381 143.08 o
178.789 143.127 o
183.102 142.844 o
186.803 143.019 o
192.677 144.159 o
196.661 142.999 o
200.987 143.054 o
205.531 143.579 o
208.77 143.292 o
212.706 142.973 o
218.118 143.556 o
221.829 142.611 o
225.82 142.909 o
229.27 142.91 o
233.758 143.199 o
237.108 142.991 o
240.56 143.219 o
244.126 142.966 o
248.458 142.638 o
66.1367 246.991 o
69.6556 246.706 o
73.9301 246.368 o
77.4276 246.353 o
81.0017 246.682 o
86.991 247.315 o
91.077 246.605 o
95.2823 246.534 o
98.5843 246.587 o
102.026 246.554 o
106.398 246.464 o
110.237 246.853 o
114.032 247.172 o
118.601 246.905 o
122.404 246.713 o
126.205 247.008 o
130.192 246.483 o
133.669 246.946 o
137.151 246.353 o
140.867 246.496 o
172.768 60.1911 o
176.086 60.3518 o
184.155 59.8625 o
180.452 61.6307 o
195.143 58.973 o
191.053 61.4693 o
187.282 60.9455 o
205.356 60.1963 o
201.578 59.7221 o
197.984 61.3132 o
211.127 58.1353 o
217.78 59.8745 o
222.607 60.6535 o
228.859 58.5713 o
225.071 58.1861 o
241.018 60.3205 o
237.21 60.2802 o
233.555 60.1601 o
244.877 60.0233 o
249.438 60.3558 o
253.34 70.0118 o
251.018 67.5212 o
251.661 63.7683 o
252.205 76.0909 o
252.537 80.0167 o
252.679 85.676 o
252.996 89.4894 o
252.376 95.5603 o
254.504 103.112 o
251.288 100.414 o
251.351 106.511 o
253.46 113.379 o
250.853 111.214 o
253.293 128.12 o
250.85 124.559 o
251.005 120.754 o
251.357 132.949 o
251.702 139.651 o
65.4017 167.223 o
65.0356 170.54 o
64.9756 173.856 o
65.0991 177.203 o
65.2273 181.097 o
63.9953 184.7 o
65.2299 188.065 o
65.6671 192.058 o
65.1006 195.823 o
65.3568 200.813 o
64.9147 205.325 o
64.9752 209.905 o
65.3622 213.307 o
64.9757 217.837 o
64.6673 222.093 o
65.5499 225.802 o
65.7495 229.393 o
65.6334 232.854 o
65.1276 236.628 o
65.1987 240.291 o
68.7155 167.389 o
74.076 165.47 o
79.8123 164.087 o
83.6892 165.496 o
89.3373 166.391 o
97.0184 164.699 o
94.0447 167.315 o
102.122 166.504 o
108.051 165.88 o
114.957 165.048 o
120.009 167.183 o
127.666 164.56 o
123.664 167.969 o
133.251 165.255 o
137.422 166.616 o
143.808 165.733 o
140.35 164.14 o
171.075 66.1963 o
172.258 69.5013 o
172.27 72.9286 o
171.429 76.6169 o
171.708 80.4774 o
172.137 85.3674 o
172.438 89.4628 o
172.136 93.1971 o
171.907 98.1643 o
172.114 101.514 o
172.274 105.328 o
171.73 109.247 o
172.178 115.555 o
170.803 120.432 o
171.764 123.676 o
171.386 127.465 o
171.245 131.153 o
170.676 135.221 o
170.571 139.027 o
146.639 171.284 o
147.171 167.514 o
146.352 176.277 o
145.987 182.279 o
146.118 185.941 o
144.988 193.705 o
145.717 189.968 o
145.219 197.871 o
145.513 204.023 o
144.785 209.754 o
146.223 212.968 o
145.98 217.58 o
144.745 225.293 o
145.647 221.593 o
145.589 232.741 o
146.147 238.771 o
144.695 245.42 o
174.218 140.057 o
178.066 139.97 o
182.053 139.779 o
185.993 139.883 o
189.535 141.28 o
193.774 141.112 o
197.189 139.803 o
201.636 139.881 o
205.635 140.342 o
209.496 140.135 o
212.922 139.742 o
215.892 141.203 o
220.021 139.923 o
223.826 140.061 o
227.723 140.064 o
231.498 140.559 o
235.766 140.043 o
240.923 140.001 o
245.378 139.979 o
65.3619 243.846 o
69.6021 243.468 o
73.1596 243.222 o
77.1787 243.124 o
81.7023 243.519 o
84.8413 244.892 o
88.8398 244.263 o
92.6131 243.753 o
96.602 243.576 o
100.869 243.529 o
104.828 243.631 o
108.728 243.988 o
113.302 244.016 o
119.754 243.878 o
123.741 243.763 o
130.685 243.281 o
134.7 243.876 o
138.012 243.231 o
141.432 243.307 o
173.993 63.1896 o
183.474 63.029 o
180.372 64.8686 o
193.74 63.2773 o
190.164 64.5838 o
208.582 60.488 o
206.075 63.3544 o
202.229 62.895 o
199.251 64.294 o
213.857 59.8781 o
218.858 62.9286 o
225.395 62.3033 o
229.7 61.6991 o
242.901 62.9558 o
239.093 62.9257 o
235.337 62.9228 o
247.721 63.102 o
251.313 72.5377 o
248.609 69.6855 o
249.768 78.2239 o
250.823 82.7648 o
249.694 86.9336 o
251.174 92.1671 o
249.559 97.1597 o
248.663 102.311 o
248.864 108.586 o
252.328 116.413 o
247.714 112.012 o
250.112 128.733 o
247.897 125.888 o
248.064 122.11 o
248.807 118.376 o
249.26 135.418 o
248.361 131.718 o
68.1961 171.249 o
68.0891 174.749 o
68.0995 178.423 o
68.3007 182.119 o
68.3888 187.349 o
68.8253 191.339 o
68.1711 194.792 o
67.8555 198.752 o
68.0889 202.552 o
68.0891 205.968 o
68.1508 209.267 o
68.5997 213.209 o
68.0627 216.857 o
67.6415 220.811 o
68.4152 224.291 o
68.5991 227.853 o
68.794 232.146 o
68.3253 236.113 o
68.4268 240.026 o
71.491 169.058 o
76.6429 167.445 o
80.8002 167.171 o
86.1705 167.577 o
90.5163 169.408 o
97.9649 167.796 o
94.8803 170.444 o
104.774 168.364 o
101.173 169.601 o
111.101 166.968 o
107.959 169.118 o
114.872 168.286 o
121.048 170.251 o
129.763 167.029 o
126.693 169.117 o
133.401 168.49 o
140.471 167.709 o
137.324 169.853 o
143.936 168.97 o
174.768 67.4534 o
175.039 71.2485 o
174.724 75.043 o
174.271 78.4963 o
174.384 82.3022 o
175.334 85.8862 o
175.547 90.3691 o
175.016 94.6791 o
175.003 99.1144 o
175.17 102.586 o
175.036 107.019 o
174.669 110.608 o
174.878 117.345 o
174.031 120.687 o
174.686 125.074 o
174.473 128.444 o
174.33 132.139 o
173.81 136.039 o
143.74 172.728 o
144.115 178.62 o
143.088 183.725 o
143.131 187.194 o
142.035 195.036 o
142.555 190.671 o
143.805 200.785 o
142.943 205.994 o
142.408 211.954 o
143.076 219.015 o
143.718 215.262 o
141.872 223.797 o
143.559 228.306 o
143.288 235.021 o
143.402 240.491 o
177.601 136.764 o
181.689 136.561 o
184.967 136.81 o
188.598 137.957 o
192.612 138.089 o
196.696 136.602 o
203.536 137.258 o
206.885 137.354 o
210.731 137.141 o
214.136 136.739 o
218.188 137.253 o
221.994 137.354 o
226.237 137.186 o
230.798 137.397 o
234.611 137.017 o
238.287 138.01 o
242.277 137.059 o
245.723 136.758 o
72.4483 240.062 o
76.8038 239.906 o
80.0748 240.719 o
83.8626 241.106 o
87.9827 241.139 o
92.2435 240.536 o
96.0754 240.38 o
101.994 240.492 o
106.164 240.68 o
110.351 241.184 o
116.452 243.262 o
120.582 240.747 o
124.745 240.684 o
126.98 243.767 o
129.483 240.274 o
134.107 240.692 o
137.531 240.028 o
177.12 64.0313 o
183.77 66.2544 o
179.72 68.0413 o
195.661 65.8849 o
191.875 67.3335 o
188.078 67.0614 o
211.427 62.0352 o
206.962 66.4695 o
203.356 65.9314 o
200.16 67.4028 o
215.301 62.7773 o
217.469 65.8547 o
221.913 64.0039 o
227.563 64.7095 o
232.014 63.9652 o
244.317 65.8685 o
240.814 65.6699 o
236.396 65.9838 o
247.817 66.3395 o
248.623 74.3424 o
245.696 71.103 o
248.078 80.9875 o
246.617 77.4715 o
248.315 89.8644 o
246.48 86.528 o
248.083 93.1365 o
246.647 98.5758 o
245.987 104.135 o
245.638 108.295 o
249.537 114.77 o
246.138 114.841 o
244.536 111.387 o
245.347 127.886 o
245.209 124.081 o
245.451 120.196 o
248.522 138.572 o
245.57 133.36 o
70.7953 176.529 o
70.882 180.163 o
70.9589 183.97 o
71.4842 188.303 o
71.834 192.538 o
70.7118 196.801 o
70.7403 200.692 o
71.2399 205.218 o
71.3077 208.543 o
71.6117 214.4 o
70.8044 218.581 o
71.6468 224.074 o
71.8271 227.588 o
71.8838 231.175 o
71.1659 234.557 o
74.2672 170.727 o
78.8418 169.824 o
83.2978 169.233 o
87.1467 170.666 o
91.7759 172.392 o
97.7533 171.94 o
104.691 171.602 o
110.232 171.425 o
117.701 169.863 o
114.246 171.464 o
123.678 172.14 o
120.063 173.336 o
129.018 171.372 o
133.337 171.729 o
138.212 172.968 o
177.561 73.2814 o
177.278 77.035 o
177.524 81.5056 o
178.506 85.2344 o
178.371 88.7834 o
177.928 92.5651 o
178.012 95.9101 o
178.123 99.987 o
178.07 104.028 o
177.893 108.544 o
177.365 112.403 o
177.975 116.4 o
177.169 121.493 o
177.806 125.943 o
177.24 130.128 o
141.575 175.137 o
141.286 180.196 o
139.976 184.623 o
140.039 188.158 o
141.014 198.109 o
138.796 195.015 o
140.976 202.362 o
140.997 208.583 o
140.092 214.217 o
139.916 219.726 o
140.059 226.482 o
138.759 222.903 o
142.618 231.406 o
141.582 237.774 o
140.143 234.249 o
178.341 133.611 o
182.865 133.544 o
187.011 134.298 o
191.052 135.25 o
194.433 134.285 o
198.2 133.733 o
199.889 137.146 o
202.272 134.276 o
205.928 134.26 o
210.376 133.922 o
214.169 133.5 o
217.592 134.069 o
220.91 134.302 o
224.656 134.359 o
228.437 134.809 o
231.831 134.327 o
236.233 134.213 o
239.614 135.055 o
73.7048 237.077 o
78.1774 236.973 o
81.3467 237.74 o
85.7266 238.457 o
90.7032 237.686 o
95.2066 237.26 o
98.7745 238.59 o
101.8 237.259 o
105.053 237.638 o
108.876 238.301 o
112.638 238.891 o
116.851 240.048 o
120.903 237.524 o
125.123 237.467 o
130.815 237.322 o
135.122 237.616 o
184.733 69.3466 o
180.533 71.1766 o
196.887 68.883 o
192.752 70.4514 o
189.421 70.0088 o
211.939 65.2334 o
209.586 68.3678 o
205.968 69.552 o
202.721 69.3859 o
220.35 67.3359 o
216.951 69.0519 o
223.977 66.5 o
230.003 66.8393 o
243.024 68.8381 o
238.947 68.317 o
235.436 69.0772 o
244.614 74.1557 o
245.357 82.7442 o
244.014 79.399 o
245.15 90.5533 o
243.366 87.4182 o
245.435 95.0015 o
243.837 100.188 o
243.118 105.639 o
243.349 116.489 o
241.311 111.084 o
243.071 130.19 o
242.453 126.433 o
242.124 123.094 o
71.322 173.333 o
73.9974 176.042 o
74.0873 179.697 o
74.1978 183.983 o
74.705 187.961 o
74.9115 191.528 o
73.7452 195.153 o
73.7452 199.483 o
73.5769 202.975 o
74.0949 206.747 o
73.5846 210.847 o
74.8484 214.518 o
74.0354 218.355 o
74.0296 221.88 o
74.4696 225.662 o
75.0143 230.344 o
76.9328 172.566 o
81.1332 172.113 o
88.2949 173.694 o
84.6212 172.694 o
94.1801 174.562 o
100.605 173.476 o
105.731 174.669 o
111.222 174.509 o
115.822 174.294 o
126.206 174.165 o
122.102 175.853 o
130.51 174.247 o
135.052 174.476 o
180.097 75.2963 o
179.755 79.1582 o
181.138 83.346 o
181.536 88.092 o
180.857 93.9486 o
180.608 97.8466 o
180.951 101.564 o
180.495 106.175 o
180.879 109.799 o
180.667 114.598 o
180.521 118.403 o
180.195 122.647 o
181.008 126.43 o
180.461 130.467 o
138.699 176.627 o
138.073 180.607 o
136.815 185.329 o
138.306 190.894 o
138.355 199.959 o
135.787 196.214 o
138.943 204.884 o
138.025 209.87 o
136.868 214.529 o
136.713 219.249 o
139.811 229.711 o
136.911 227.243 o
135.568 222.348 o
136.948 233.714 o
183.842 130.455 o
188.09 131.244 o
191.759 132.089 o
195.153 131.127 o
198.752 130.542 o
202.029 131.046 o
205.668 131.032 o
209.154 130.922 o
215.839 130.725 o
219.479 131.396 o
223.503 131.333 o
229.006 131.621 o
232.848 131.252 o
237.095 131.091 o
75.3634 234.295 o
79.5851 234.056 o
83.4271 235.258 o
87.5733 235.796 o
90.6693 234.448 o
94.7852 234.049 o
98.1976 235.403 o
101.895 234.021 o
105.717 234.468 o
109.374 235.1 o
112.908 235.663 o
116.013 236.92 o
122.204 234.558 o
126.235 234.425 o
130.299 234.124 o
185.606 72.4657 o
199.463 70.8457 o
195.816 71.9399 o
193.004 73.6806 o
213.184 68.2234 o
209.79 71.6003 o
206.388 72.7636 o
203.113 72.601 o
222.582 69.6825 o
219.311 71.2704 o
215.57 71.9817 o
226.715 68.231 o
232.046 69.3525 o
241.987 71.9065 o
238.693 71.5459 o
234.938 72.2776 o
242.182 76.2952 o
242.356 83.9625 o
240.785 79.643 o
242.762 92.741 o
240.942 89.5656 o
242.551 96.4751 o
240.697 99.3965 o
240.252 107.147 o
240.798 103.379 o
240.151 117.004 o
238.228 110.092 o
239.415 113.71 o
239.914 129.464 o
239.347 125.515 o
239.399 121.343 o
77.0851 177.02 o
77.2211 180.515 o
77.2696 185.01 o
77.7619 189.031 o
77.8614 192.866 o
76.7735 196.302 o
76.9275 200.086 o
76.4927 204.385 o
77.2175 207.608 o
78.0864 214.442 o
77.2456 217.924 o
77.0644 223.012 o
77.4118 227.017 o
81.5837 175.32 o
90.5798 175.99 o
86.8177 176.577 o
94.5664 177.778 o
97.3579 175.189 o
101.681 176.531 o
108.373 176.542 o
104.766 177.761 o
113.307 176.988 o
117.943 176.741 o
127.537 177.118 o
123.789 178.618 o
132.1 177.069 o
135.626 177.664 o
183.267 75.9597 o
182.748 80.3967 o
183.906 85.0277 o
184.645 88.9984 o
183.956 93.0075 o
183.789 97.2375 o
184.118 100.885 o
183.571 105.162 o
183.826 108.455 o
183.068 112.186 o
183.694 115.751 o
183.458 119.767 o
183.324 123.483 o
184.234 126.723 o
135.207 182.116 o
135.937 188.447 o
133.579 185.457 o
135.741 192.873 o
136.187 202.365 o
134.211 199.043 o
132.609 195.589 o
136.076 206.391 o
135.049 211.149 o
134.228 216.406 o
135.539 230.177 o
133.697 226.845 o
132.641 223.735 o
133.345 219.993 o
133.725 233.397 o
187.297 128.104 o
191.224 128.895 o
194.491 127.957 o
198.544 127.31 o
202.152 127.81 o
205.834 127.797 o
209.32 127.688 o
212.282 130.08 o
215.026 127.59 o
218.661 128.262 o
221.899 128.519 o
225.683 128.938 o
230.202 128.61 o
233.451 128.069 o
78.6403 230.958 o
82.2396 232.2 o
85.6214 232.876 o
89.3968 231.469 o
93.1813 231.235 o
96.9658 231.654 o
100.272 231.219 o
104.059 231.611 o
109.085 231.874 o
113.409 232.463 o
117.515 234.05 o
120.346 231.905 o
124.648 231.601 o
128.869 231.218 o
188.361 74.1682 o
199.939 74.0495 o
195.196 76.0648 o
191.414 76.5023 o
212.131 73.839 o
208.295 75.3813 o
203.903 75.742 o
225.038 71.7937 o
221.651 73.5089 o
217.104 74.8343 o
230.635 72.268 o
238.117 74.7332 o
234.063 75.396 o
240.084 86.2704 o
238.806 82.2075 o
237.734 78.5539 o
239.584 93.3679 o
237.759 90.1649 o
238.13 101.372 o
238.025 97.5662 o
237.025 106.876 o
236.964 116.429 o
235.451 111.759 o
236.845 127.573 o
236.616 123.772 o
236.284 120.456 o
80.1197 179.07 o
79.9838 183.242 o
80.4816 187.272 o
81.0042 192.082 o
80.0118 196.365 o
80.1059 200.709 o
79.7119 204.028 o
80.4423 207.305 o
78.5018 210.581 o
81.1934 213.527 o
80.3513 217.005 o
79.8242 221.317 o
80.3625 225.681 o
90.4546 179.226 o
86.5302 179.803 o
97.2318 179.618 o
93.6399 180.882 o
100.881 179.67 o
110.643 178.853 o
106.817 180.267 o
115.009 179.743 o
119.841 179.366 o
129.47 179.716 o
126.267 180.703 o
122.572 181.62 o
186.284 77.1371 o
185.513 82.084 o
187.138 85.2423 o
187.874 89.2547 o
187.156 93.504 o
186.989 97.7408 o
187.292 101.533 o
186.753 105.766 o
186.655 110.034 o
186.112 113.294 o
186.419 117.501 o
186.245 121.418 o
131.969 182.069 o
133.067 189.949 o
130.442 186.264 o
133.384 203.988 o
131.293 200.45 o
129.673 196.958 o
130.4 193.22 o
133.231 207.938 o
132.42 213.041 o
131.041 216.987 o
131.858 229.511 o
129.833 225.35 o
130.237 221.564 o
188.02 124.946 o
191.679 125.688 o
194.799 124.732 o
197.985 124.119 o
201.867 124.583 o
205.425 124.584 o
210.008 124.523 o
213.604 124.68 o
217.712 125.166 o
221.45 125.311 o
224.938 125.786 o
228.907 125.642 o
232.529 124.964 o
81.6887 229.009 o
85.3223 229.651 o
88.8031 228.285 o
92.6311 228.043 o
96.733 228.423 o
100.964 228.054 o
104.621 228.422 o
108.317 228.728 o
112.479 229.36 o
116.072 230.62 o
119.694 228.733 o
123.802 228.475 o
127.6 228.238 o
200.795 77.1733 o
194.95 79.2944 o
190.432 79.5888 o
214.094 76.4152 o
210.439 77.8086 o
206.649 78.1708 o
227.365 74.0469 o
223.979 75.7609 o
220.229 76.4188 o
234.164 78.6334 o
231.015 76.4924 o
236.889 85.7387 o
235.593 82.617 o
236.39 93.9022 o
234.585 90.8099 o
235.579 103.368 o
235.444 99.5626 o
234 108.036 o
234.12 117.98 o
234.132 114.717 o
232.23 111.419 o
83.3583 179.116 o
83.2201 183.373 o
83.3142 188.843 o
84.2338 192.328 o
82.6293 198.273 o
83.1907 201.696 o
83.2287 205.654 o
82.8737 209.445 o
84.2665 212.504 o
83.4086 215.935 o
82.8136 220.07 o
82.7508 223.493 o
90.4579 182.465 o
98.795 182.455 o
95.6516 183.42 o
103.092 182.037 o
111.099 182.059 o
108.076 183.252 o
117.547 181.755 o
127.732 183.592 o
122.534 184.859 o
190.046 86.6685 o
189.393 82.9174 o
190.672 90.8859 o
190.32 94.1992 o
189.903 99.1532 o
190.311 102.706 o
189.91 106.49 o
189.841 110.617 o
189.169 114.364 o
189.391 118.789 o
129.047 189.187 o
130.217 204.665 o
128.364 201.832 o
126.937 198.691 o
127.18 194.891 o
130.324 209.366 o
129.352 214.08 o
128.087 218.314 o
126.646 224.777 o
189.857 122.279 o
194.222 121.545 o
198.009 120.88 o
201.635 121.353 o
205.292 121.348 o
209.733 121.296 o
213.745 121.444 o
216.968 122.014 o
221.148 122.086 o
225.141 122.553 o
229.328 122.43 o
85.2814 226.412 o
89.2783 225.081 o
92.9426 224.819 o
96.7417 225.184 o
102.12 225.029 o
106.459 225.755 o
110.72 226.556 o
113.966 226.483 o
117.7 226.181 o
121.505 226.047 o
202.823 79.6987 o
199.02 79.8824 o
196.509 82.1336 o
192.685 81.9152 o
216.269 78.8154 o
213.06 79.7126 o
209.438 80.889 o
227.744 77.2635 o
224.064 78.9987 o
219.579 79.5918 o
231.78 80.8255 o
233.849 86.8558 o
234.167 96.2579 o
231.8 92.4644 o
232.382 103.885 o
232.232 99.9805 o
230.865 107.225 o
232.209 120.595 o
231.042 116.971 o
229.612 113.326 o
86.4574 183.273 o
85.922 186.922 o
87.2272 191.091 o
86.3352 194.792 o
85.8673 198.198 o
86.4259 201.542 o
86.4499 205.993 o
86.6763 210.34 o
87.0693 214.127 o
85.8266 218.09 o
85.7479 222.265 o
91.6949 185.459 o
100.575 185.161 o
96.5247 186.539 o
104.193 185.083 o
114.209 182.967 o
111.197 185.297 o
108.094 186.491 o
118.218 184.924 o
126.303 186.498 o
122.234 188.084 o
193.193 85.903 o
193.677 89.6777 o
193.352 93.0614 o
192.339 96.7317 o
193.15 101.148 o
193.117 106.037 o
192.96 109.746 o
192.205 113.236 o
192.102 117.017 o
126.753 191.474 o
127.864 206.891 o
125.433 203.21 o
124.095 200.244 o
124.01 195.556 o
127.334 210.613 o
126.154 214.591 o
126.095 220.868 o
196.209 118.188 o
200.013 118.336 o
203.507 118.645 o
207.311 118.815 o
211.662 118.694 o
215.783 118.927 o
219.759 119.16 o
224.39 119.403 o
228.39 119.33 o
89.4981 221.85 o
93.552 221.638 o
97.7025 222.091 o
101.217 221.918 o
105.744 222.596 o
110.128 223.372 o
114.633 223.313 o
118.138 222.971 o
122.39 222.932 o
202.269 82.8899 o
198.604 84.6041 o
216.707 82.0245 o
212.847 82.9445 o
208.573 84.0101 o
228.204 80.4697 o
224.795 82.1541 o
220.321 82.7444 o
231.211 84.0142 o
230.957 88.315 o
230.928 96.2812 o
228.605 92.9964 o
229.143 103.874 o
229.024 99.5385 o
227.94 108.616 o
227.031 115.282 o
88.8796 188.242 o
90.3728 191.863 o
89.5368 195.283 o
89.0715 198.671 o
89.5748 202.301 o
89.6884 206.044 o
89.9135 210.235 o
90.2655 214.651 o
89.0654 218.061 o
93.3343 188.252 o
101.759 188.176 o
97.8223 189.507 o
114.152 186.624 o
110.848 188.517 o
106.695 189.412 o
117.831 188.139 o
123.102 191.204 o
196.303 87.7819 o
196.292 91.5894 o
195.482 95.9502 o
195.897 99.4319 o
195.631 103.23 o
196.289 106.692 o
196.121 110.456 o
195.37 113.925 o
124.637 207.172 o
122.387 204.311 o
120.863 200.465 o
120.855 196.289 o
124.098 210.745 o
124.326 217.265 o
198.154 115.599 o
201.642 115.536 o
205.402 116.017 o
209.412 116.35 o
212.701 115.626 o
216.924 115.895 o
220.337 115.973 o
223.76 116.225 o
93.0257 218.442 o
97.2653 218.882 o
101.174 218.68 o
104.366 219.665 o
108.106 220.38 o
111.458 220.419 o
115.224 220.129 o
118.936 219.832 o
205.42 82.1421 o
203.954 85.656 o
199.898 87.5732 o
216.764 85.2629 o
212.685 86.1794 o
208.636 87.2484 o
227.487 83.9555 o
223.914 85.2708 o
227.96 89.5443 o
227.694 96.4671 o
225.491 93.8851 o
226.395 105.589 o
226.663 101.791 o
224.703 108.514 o
225.062 112.71 o
93.4977 192.715 o
92.5778 196.398 o
92.063 199.912 o
92.5088 203.673 o
92.5822 207.498 o
93.1184 210.703 o
93.5041 214.609 o
103.229 191.062 o
99.8302 192.048 o
113.528 190.336 o
109.946 191.628 o
106.853 192.647 o
117.829 191.378 o
199.522 91.8231 o
198.713 95.7254 o
199.119 99.762 o
198.813 103.835 o
199.432 107.475 o
198.851 112.198 o
121.408 207.415 o
119.151 204.452 o
117.668 200.992 o
117.764 197.259 o
122.192 213.364 o
121.12 216.801 o
202.361 112.378 o
206.792 113.092 o
211.085 112.819 o
214.871 113.222 o
218.152 112.898 o
97.6261 215.663 o
101.016 215.445 o
104.585 216.433 o
108.385 217.153 o
112.183 217.262 o
116.391 217.108 o
205.459 88.524 o
216.291 88.4671 o
219.665 86.7032 o
211.918 89.3262 o
208.744 90.4855 o
224.616 88.4326 o
225.195 98.5277 o
222.675 92.2846 o
223.157 105.511 o
222.418 110.81 o
96.482 193.973 o
95.567 197.645 o
95.3439 202.106 o
95.6001 206.322 o
96.3301 210.284 o
102.838 194.277 o
114.083 193.527 o
110.401 194.835 o
106.647 195.879 o
202.22 90.0315 o
202.06 93.8357 o
201.474 97.4198 o
201.845 101.512 o
201.799 105.088 o
202.336 108.909 o
119.476 210.015 o
117.261 207.082 o
115.505 203.403 o
114.706 199.68 o
118.817 214.525 o
205.329 110.203 o
208.887 110.44 o
212.668 109.993 o
216.803 109.954 o
99.2453 212.732 o
103.048 212.923 o
106.399 213.75 o
111.162 214.188 o
114.439 214.523 o
205.164 91.7494 o
219.144 90.0008 o
215.714 91.6541 o
212.197 92.5531 o
208.905 93.7205 o
222.54 100.382 o
222.611 96.5749 o
219.642 93.4223 o
220.403 107.215 o
220.685 103.418 o
99.3622 195.455 o
98.3528 199.297 o
98.4929 202.864 o
98.7826 206.924 o
102.554 197.504 o
110.398 198.073 o
107.164 199.076 o
204.748 95.6429 o
204.223 99.3133 o
204.67 103.094 o
116.604 211.513 o
114.178 208.076 o
112.595 204.826 o
205.973 107.029 o
209.518 107.263 o
212.81 106.757 o
216.91 106.716 o
100.484 209.739 o
104.066 209.848 o
108.347 211.162 o
112.252 211.138 o
216.315 94.8368 o
212.393 95.7861 o
208.589 96.9439 o
219.372 99.7063 o
217.491 102.881 o
101.178 200.88 o
101.317 204.451 o
111.51 201.116 o
107.594 202.287 o
207.33 100.227 o
207.741 104.126 o
110.872 207.569 o
211.955 103.633 o
104.576 206.65 o
215.317 97.918 o
211.841 98.9777 o
214.647 101.332 o
104.173 202.115 o
107.874 206.344 o
grestore
0.800 setlinewidth
0.000 setgray
gsave
/o {
gsave
newpath
translate
0.8 setlinewidth
1 setlinejoin

0 setlinecap

0 0 m
0 -3.5 l

gsave
0.000 setgray
fill
grestore
stroke
grestore
} bind def
50.1123 41.6063 o
grestore
gsave
42.6123 26.4031 translate
0 rotate
/STIXGeneral-Regular 12.0 selectfont
0 0.890625 moveto
/zero glyphshow
5.99998 0.890625 moveto
/period glyphshow
8.99997 0.890625 moveto
/zero glyphshow
grestore
gsave
/o {
gsave
newpath
translate
0.8 setlinewidth
1 setlinejoin

0 setlinecap

0 0 m
0 -3.5 l

gsave
0.000 setgray
fill
grestore
stroke
grestore
} bind def
93.2978 41.6063 o
grestore
gsave
85.7978 26.4031 translate
0 rotate
/STIXGeneral-Regular 12.0 selectfont
0 0.890625 moveto
/zero glyphshow
5.99998 0.890625 moveto
/period glyphshow
8.99997 0.890625 moveto
/two glyphshow
grestore
gsave
/o {
gsave
newpath
translate
0.8 setlinewidth
1 setlinejoin

0 setlinecap

0 0 m
0 -3.5 l

gsave
0.000 setgray
fill
grestore
stroke
grestore
} bind def
136.483 41.6063 o
grestore
gsave
128.983 26.4031 translate
0 rotate
/STIXGeneral-Regular 12.0 selectfont
0 0.890625 moveto
/zero glyphshow
5.99998 0.890625 moveto
/period glyphshow
8.99997 0.890625 moveto
/four glyphshow
grestore
gsave
/o {
gsave
newpath
translate
0.8 setlinewidth
1 setlinejoin

0 setlinecap

0 0 m
0 -3.5 l

gsave
0.000 setgray
fill
grestore
stroke
grestore
} bind def
179.669 41.6063 o
grestore
gsave
172.169 26.4031 translate
0 rotate
/STIXGeneral-Regular 12.0 selectfont
0 0.796875 moveto
/zero glyphshow
5.99998 0.796875 moveto
/period glyphshow
8.99997 0.796875 moveto
/six glyphshow
grestore
gsave
/o {
gsave
newpath
translate
0.8 setlinewidth
1 setlinejoin

0 setlinecap

0 0 m
0 -3.5 l

gsave
0.000 setgray
fill
grestore
stroke
grestore
} bind def
222.854 41.6063 o
grestore
gsave
215.354 26.4031 translate
0 rotate
/STIXGeneral-Regular 12.0 selectfont
0 0.890625 moveto
/zero glyphshow
5.99998 0.890625 moveto
/period glyphshow
8.99997 0.890625 moveto
/eight glyphshow
grestore
gsave
/o {
gsave
newpath
translate
0.8 setlinewidth
1 setlinejoin

0 setlinecap

0 0 m
0 -3.5 l

gsave
0.000 setgray
fill
grestore
stroke
grestore
} bind def
266.04 41.6063 o
grestore
gsave
258.54 26.4031 translate
0 rotate
/STIXGeneral-Regular 12.0 selectfont
0 0.890625 moveto
/one glyphshow
5.99998 0.890625 moveto
/period glyphshow
8.99997 0.890625 moveto
/zero glyphshow
grestore
gsave
154.076 10.2313 translate
0 rotate
/Cmmi10 14.0 selectfont
0 0.8125 moveto
/x glyphshow
grestore
gsave
/o {
gsave
newpath
translate
0.8 setlinewidth
1 setlinejoin

0 setlinecap

-0 0 m
-3.5 0 l

gsave
0.000 setgray
fill
grestore
stroke
grestore
} bind def
45.7938 45.9248 o
grestore
gsave
23.7938 41.8232 translate
0 rotate
/STIXGeneral-Regular 12.0 selectfont
0 0.890625 moveto
/zero glyphshow
5.99998 0.890625 moveto
/period glyphshow
8.99997 0.890625 moveto
/zero glyphshow
grestore
gsave
/o {
gsave
newpath
translate
0.8 setlinewidth
1 setlinejoin

0 setlinecap

-0 0 m
-3.5 0 l

gsave
0.000 setgray
fill
grestore
stroke
grestore
} bind def
45.7938 89.1103 o
grestore
gsave
23.7938 85.0087 translate
0 rotate
/STIXGeneral-Regular 12.0 selectfont
0 0.890625 moveto
/zero glyphshow
5.99998 0.890625 moveto
/period glyphshow
8.99997 0.890625 moveto
/two glyphshow
grestore
gsave
/o {
gsave
newpath
translate
0.8 setlinewidth
1 setlinejoin

0 setlinecap

-0 0 m
-3.5 0 l

gsave
0.000 setgray
fill
grestore
stroke
grestore
} bind def
45.7938 132.296 o
grestore
gsave
23.7938 128.194 translate
0 rotate
/STIXGeneral-Regular 12.0 selectfont
0 0.890625 moveto
/zero glyphshow
5.99998 0.890625 moveto
/period glyphshow
8.99997 0.890625 moveto
/four glyphshow
grestore
gsave
/o {
gsave
newpath
translate
0.8 setlinewidth
1 setlinejoin

0 setlinecap

-0 0 m
-3.5 0 l

gsave
0.000 setgray
fill
grestore
stroke
grestore
} bind def
45.7938 175.481 o
grestore
gsave
23.7938 171.38 translate
0 rotate
/STIXGeneral-Regular 12.0 selectfont
0 0.796875 moveto
/zero glyphshow
5.99998 0.796875 moveto
/period glyphshow
8.99997 0.796875 moveto
/six glyphshow
grestore
gsave
/o {
gsave
newpath
translate
0.8 setlinewidth
1 setlinejoin

0 setlinecap

-0 0 m
-3.5 0 l

gsave
0.000 setgray
fill
grestore
stroke
grestore
} bind def
45.7938 218.667 o
grestore
gsave
23.7938 214.565 translate
0 rotate
/STIXGeneral-Regular 12.0 selectfont
0 0.890625 moveto
/zero glyphshow
5.99998 0.890625 moveto
/period glyphshow
8.99997 0.890625 moveto
/eight glyphshow
grestore
gsave
/o {
gsave
newpath
translate
0.8 setlinewidth
1 setlinejoin

0 setlinecap

-0 0 m
-3.5 0 l

gsave
0.000 setgray
fill
grestore
stroke
grestore
} bind def
45.7938 261.852 o
grestore
gsave
23.7938 257.751 translate
0 rotate
/STIXGeneral-Regular 12.0 selectfont
0 0.890625 moveto
/one glyphshow
5.99998 0.890625 moveto
/period glyphshow
8.99997 0.890625 moveto
/zero glyphshow
grestore
gsave
16.7625 150.389 translate
90 rotate
/Cmmi10 14.0 selectfont
0 0.8125 moveto
/y glyphshow
grestore
0 setlinejoin
2 setlinecap
gsave
45.79375 41.60625 m
45.79375 266.170898 l
stroke
grestore
gsave
270.358398 41.60625 m
270.358398 266.170898 l
stroke
grestore
gsave
45.79375 41.60625 m
270.358398 41.60625 l
stroke
grestore
gsave
45.79375 266.170898 m
270.358398 266.170898 l
stroke
grestore
1.000 setlinewidth
0 setlinecap
0.800 setgray
gsave
191.358398 46.60625 m
263.358398 46.60625 l
264.691732 46.60625 265.358398 47.272917 265.358398 48.60625 c
265.358398 75.95 l
265.358398 77.283333 264.691732 77.95 263.358398 77.95 c
191.358398 77.95 l
190.025065 77.95 189.358398 77.283333 189.358398 75.95 c
189.358398 48.60625 l
189.358398 47.272917 190.025065 46.60625 191.358398 46.60625 c
cl
gsave
1.000 setgray
fill
grestore
stroke
grestore
1.500 setlinewidth
1 setlinejoin
0.122 0.467 0.706 setrgbcolor
gsave
/o {
gsave
newpath
translate
1.5 setlinewidth
1 setlinejoin

0 setlinecap

-0.866025 -0.866025 m
0.866025 0.866025 l
-0.866025 0.866025 m
0.866025 -0.866025 l

gsave
0.122 0.467 0.706 setrgbcolor
fill
grestore
stroke
grestore
} bind def
203.358 69.575 o
grestore
0.000 setgray
/STIXGeneral-Regular 10.000 selectfont
gsave

221.358 66.95 translate
0 rotate
0 0 m /F glyphshow
5.55998 0 m /D glyphshow
12.78 0 m /M glyphshow
21.67 0 m /hyphen glyphshow
24.9999 0 m /l glyphshow
27.7799 0 m /i glyphshow
30.5599 0 m /k glyphshow
35.5599 0 m /e glyphshow
grestore
1.000 setlinewidth
1.000 0.498 0.055 setrgbcolor
gsave
/o {
gsave
newpath
translate
1.0 setlinewidth
1 setlinejoin

0 setlinecap

0 -0.866025 m
0.229673 -0.866025 0.449969 -0.774776 0.612372 -0.612372 c
0.774776 -0.449969 0.866025 -0.229673 0.866025 0 c
0.866025 0.229673 0.774776 0.449969 0.612372 0.612372 c
0.449969 0.774776 0.229673 0.866025 0 0.866025 c
-0.229673 0.866025 -0.449969 0.774776 -0.612372 0.612372 c
-0.774776 0.449969 -0.866025 0.229673 -0.866025 0 c
-0.866025 -0.229673 -0.774776 -0.449969 -0.612372 -0.612372 c
-0.449969 -0.774776 -0.229673 -0.866025 0 -0.866025 c
cl

gsave
1.000 0.498 0.055 setrgbcolor
fill
grestore
stroke
grestore
} bind def
203.358 55.4031 o
grestore
0.000 setgray
/STIXGeneral-Regular 10.000 selectfont
gsave

221.358 52.7781 translate
0 rotate
0 0 m /R glyphshow
6.66998 0 m /B glyphshow
13.34 0 m /F glyphshow
18.8999 0 m /hyphen glyphshow
22.2299 0 m /F glyphshow
27.7899 0 m /D glyphshow
grestore

end
showpage
