<?xml version="1.0" encoding="UTF-8" standalone="no"?>
<svg
   xmlns:dc="http://purl.org/dc/elements/1.1/"
   xmlns:cc="http://creativecommons.org/ns#"
   xmlns:rdf="http://www.w3.org/1999/02/22-rdf-syntax-ns#"
   xmlns:svg="http://www.w3.org/2000/svg"
   xmlns="http://www.w3.org/2000/svg"
   xmlns:sodipodi="http://sodipodi.sourceforge.net/DTD/sodipodi-0.dtd"
   xmlns:inkscape="http://www.inkscape.org/namespaces/inkscape"
   width="182mm"
   height="83mm"
   viewBox="0 0 182 83"
   version="1.1"
   id="svg8"
   inkscape:version="1.0.2 (394de47547, 2021-03-26)"
   sodipodi:docname="fig_01.svg">
  <defs
     id="defs2">
    <marker
       style="overflow:visible"
       id="marker1331"
       refX="0"
       refY="0"
       orient="auto"
       inkscape:stockid="Arrow1Lend"
       inkscape:isstock="true">
      <path
         transform="matrix(-0.8,0,0,-0.8,-10,0)"
         style="fill:#0000fd;fill-opacity:1;fill-rule:evenodd;stroke:#0000ff;stroke-width:1pt;stroke-opacity:1"
         d="M 0,0 5,-5 -12.5,0 5,5 Z"
         id="path1329" />
    </marker>
    <marker
       style="overflow:visible"
       id="marker1331-1"
       refX="0"
       refY="0"
       orient="auto"
       inkscape:stockid="Arrow1Lend"
       inkscape:isstock="true">
      <path
         transform="matrix(-0.8,0,0,-0.8,-10,0)"
         style="fill:#000000;fill-opacity:1;fill-rule:evenodd;stroke:#000000;stroke-width:1pt;stroke-opacity:1"
         d="M 0,0 5,-5 -12.5,0 5,5 Z"
         id="path1329-2" />
    </marker>
    <marker
       style="overflow:visible"
       id="Arrow1Lend"
       refX="0"
       refY="0"
       orient="auto"
       inkscape:stockid="Arrow1Lend"
       inkscape:isstock="true"
       inkscape:collect="always">
      <path
         transform="matrix(-0.8,0,0,-0.8,-10,0)"
         style="fill:#0000ff;fill-opacity:1;fill-rule:evenodd;stroke:#0000fe;stroke-width:1pt;stroke-opacity:1"
         d="M 0,0 5,-5 -12.5,0 5,5 Z"
         id="path1042" />
    </marker>
    <marker
       style="overflow:visible"
       id="marker1331-6"
       refX="0"
       refY="0"
       orient="auto"
       inkscape:stockid="Arrow1Lend"
       inkscape:isstock="true">
      <path
         transform="matrix(-0.8,0,0,-0.8,-10,0)"
         style="fill:#0000fd;fill-opacity:1;fill-rule:evenodd;stroke:#0000ff;stroke-width:1pt;stroke-opacity:1"
         d="M 0,0 5,-5 -12.5,0 5,5 Z"
         id="path1329-26" />
    </marker>
    <marker
       style="overflow:visible"
       id="marker1331-1-1"
       refX="0"
       refY="0"
       orient="auto"
       inkscape:stockid="Arrow1Lend"
       inkscape:isstock="true">
      <path
         transform="matrix(-0.8,0,0,-0.8,-10,0)"
         style="fill:#000000;fill-opacity:1;fill-rule:evenodd;stroke:#000000;stroke-width:1pt;stroke-opacity:1"
         d="M 0,0 5,-5 -12.5,0 5,5 Z"
         id="path1329-2-8" />
    </marker>
  </defs>
  <sodipodi:namedview
     id="base"
     pagecolor="#ffffff"
     bordercolor="#666666"
     borderopacity="1.0"
     inkscape:pageopacity="0.0"
     inkscape:pageshadow="2"
     inkscape:zoom="1"
     inkscape:cx="544.54433"
     inkscape:cy="301.0795"
     inkscape:document-units="mm"
     inkscape:current-layer="layer1"
     inkscape:document-rotation="0"
     showgrid="false"
     inkscape:window-width="2508"
     inkscape:window-height="1016"
     inkscape:window-x="52"
     inkscape:window-y="27"
     inkscape:window-maximized="1" />
  <metadata
     id="metadata5">
    <rdf:RDF>
      <cc:Work
         rdf:about="">
        <dc:format>image/svg+xml</dc:format>
        <dc:type
           rdf:resource="http://purl.org/dc/dcmitype/StillImage" />
        <dc:title></dc:title>
      </cc:Work>
    </rdf:RDF>
  </metadata>
  <g
     inkscape:label="Layer 1"
     inkscape:groupmode="layer"
     id="layer1">
    <rect
       style="fill:#ffffff;fill-opacity:1;stroke:#000000;stroke-width:1.3;stroke-miterlimit:4;stroke-dasharray:none;stroke-opacity:1"
       id="rect2231"
       width="182.66339"
       height="83.156441"
       x="-0.51750714"
       y="-0.0096893311" />
    <rect
       style="fill:none;fill-opacity:0.141164;stroke:#000000;stroke-width:0.312873;stroke-miterlimit:4;stroke-dasharray:none;stroke-opacity:1"
       id="rect951"
       width="31.44916"
       height="11.31409"
       x="7.7271605"
       y="33.023533" />
    <text
       xml:space="preserve"
       style="font-size:6.07062px;line-height:1.25;font-family:sans-serif;word-spacing:0px;stroke-width:0.413905"
       x="13.846841"
       y="40.941753"
       id="text955"><tspan
         sodipodi:role="line"
         id="tspan953"
         x="13.846841"
         y="40.941753"
         style="stroke-width:0.413905">Client</tspan></text>
    <text
       xml:space="preserve"
       style="font-size:6.07062px;line-height:1.25;font-family:sans-serif;word-spacing:0px;stroke-width:0.413905"
       x="76.089203"
       y="36.649158"
       id="text959"><tspan
         sodipodi:role="line"
         id="tspan957"
         x="76.089203"
         y="36.649158"
         style="stroke-width:0.413905">   Load </tspan><tspan
         sodipodi:role="line"
         x="76.089203"
         y="44.237434"
         style="stroke-width:0.413905"
         id="tspan965">Balancer</tspan></text>
    <text
       xml:space="preserve"
       style="font-size:6.07062px;line-height:1.25;font-family:sans-serif;word-spacing:0px;stroke-width:0.413905"
       x="145.96799"
       y="14.732855"
       id="text963"><tspan
         sodipodi:role="line"
         id="tspan961"
         x="145.96799"
         y="14.732855"
         style="stroke-width:0.413905">Server A</tspan></text>
    <rect
       style="fill:none;fill-opacity:0.141164;stroke:#000000;stroke-width:0.312873;stroke-miterlimit:4;stroke-dasharray:none"
       id="rect951-5"
       width="31.44916"
       height="11.31409"
       x="143.20401"
       y="7.0535898" />
    <text
       xml:space="preserve"
       style="font-size:6.07062px;line-height:1.25;font-family:sans-serif;word-spacing:0px;stroke-width:0.413905"
       x="146.1308"
       y="64.343239"
       id="text963-6"><tspan
         sodipodi:role="line"
         id="tspan961-2"
         x="146.1308"
         y="64.343239"
         style="stroke-width:0.413905">Server B</tspan></text>
    <rect
       style="fill:none;fill-opacity:0.141164;stroke:#000000;stroke-width:0.312873;stroke-miterlimit:4;stroke-dasharray:none"
       id="rect951-5-9"
       width="31.44916"
       height="11.31409"
       x="143.20401"
       y="56.936516" />
    <rect
       style="fill:none;fill-opacity:0.141164;stroke:#000000;stroke-width:0.312873;stroke-miterlimit:4;stroke-dasharray:none"
       id="rect1035"
       width="39.038383"
       height="18.980146"
       x="69.888245"
       y="28.992855" />
    <path
       style="fill:#0000ff;fill-opacity:1;stroke:#0000fe;stroke-width:0.413905px;stroke-linecap:butt;stroke-linejoin:miter;stroke-opacity:1;marker-end:url(#Arrow1Lend)"
       d="m 41.866337,38.650322 h 25.35454"
       id="path1037" />
    <path
       style="fill:#0000fd;fill-opacity:1;stroke:#0000ff;stroke-width:0.413905px;stroke-linecap:butt;stroke-linejoin:miter;stroke-opacity:1;marker-end:url(#marker1331-6)"
       d="M 111.3947,32.704123 138.30251,17.168888"
       id="path1321" />
    <path
       style="fill:none;stroke:#000000;stroke-width:0.413905px;stroke-linecap:butt;stroke-linejoin:miter;stroke-opacity:1;marker-end:url(#marker1331-1-1)"
       d="m 111.3947,44.053493 26.90781,15.53524"
       id="path1321-7" />
    <text
       xml:space="preserve"
       style="font-size:6.07062px;line-height:1.25;font-family:sans-serif;word-spacing:0px;stroke-width:0.413905"
       x="11.132007"
       y="52.084354"
       id="text2083"><tspan
         sodipodi:role="line"
         id="tspan2081"
         x="11.132007"
         y="52.084354"
         style="stroke-width:0.413905">1.1.1.1</tspan></text>
    <text
       xml:space="preserve"
       style="font-size:6.07062px;line-height:1.25;font-family:sans-serif;word-spacing:0px;stroke-width:0.413905"
       x="79.533295"
       y="55.490208"
       id="text2087"><tspan
         sodipodi:role="line"
         id="tspan2085"
         x="79.533295"
         y="55.490208"
         style="stroke-width:0.413905">1.1.1.2</tspan></text>
    <text
       xml:space="preserve"
       style="font-size:6.07062px;line-height:1.25;font-family:sans-serif;word-spacing:0px;stroke-width:0.413905"
       x="148.39108"
       y="24.895359"
       id="text2091"><tspan
         sodipodi:role="line"
         id="tspan2089"
         x="148.39108"
         y="24.895359"
         style="stroke-width:0.413905">2.2.2.2</tspan></text>
    <text
       xml:space="preserve"
       style="font-size:6.07062px;line-height:1.25;font-family:sans-serif;word-spacing:0px;stroke-width:0.413905"
       x="148.6506"
       y="76.950638"
       id="text2095"><tspan
         sodipodi:role="line"
         id="tspan2093"
         x="148.6506"
         y="76.950638"
         style="stroke-width:0.413905">2.2.2.3</tspan></text>
  </g>
</svg>
