<?xml version="1.0" encoding="UTF-8" standalone="no"?>
<svg
   xmlns:dc="http://purl.org/dc/elements/1.1/"
   xmlns:cc="http://creativecommons.org/ns#"
   xmlns:rdf="http://www.w3.org/1999/02/22-rdf-syntax-ns#"
   xmlns:svg="http://www.w3.org/2000/svg"
   xmlns="http://www.w3.org/2000/svg"
   xmlns:xlink="http://www.w3.org/1999/xlink"
   xmlns:sodipodi="http://sodipodi.sourceforge.net/DTD/sodipodi-0.dtd"
   xmlns:inkscape="http://www.inkscape.org/namespaces/inkscape"
   width="205mm"
   height="76mm"
   viewBox="0 0 205 76"
   version="1.1"
   id="svg8"
   inkscape:version="1.0.2 (394de47547, 2021-03-26)"
   sodipodi:docname="fig_03.svg">
  <defs
     id="defs2">
    <rect
       x="71.846207"
       y="104.73569"
       width="61.851513"
       height="32.149513"
       id="rect1246" />
    <marker
       style="overflow:visible"
       id="Arrow1Lstart"
       refX="0"
       refY="0"
       orient="auto"
       inkscape:stockid="Arrow1Lstart"
       inkscape:isstock="true">
      <path
         transform="matrix(0.8,0,0,0.8,10,0)"
         style="fill:#000000;fill-opacity:1;fill-rule:evenodd;stroke:#000000;stroke-width:1pt;stroke-opacity:1"
         d="M 0,0 5,-5 -12.5,0 5,5 Z"
         id="path930" />
    </marker>
    <marker
       style="overflow:visible"
       id="Arrow1Lend"
       refX="0"
       refY="0"
       orient="auto"
       inkscape:stockid="Arrow1Lend"
       inkscape:isstock="true">
      <path
         transform="matrix(-0.8,0,0,-0.8,-10,0)"
         style="fill:#000000;fill-opacity:1;fill-rule:evenodd;stroke:#000000;stroke-width:1pt;stroke-opacity:1"
         d="M 0,0 5,-5 -12.5,0 5,5 Z"
         id="path933" />
    </marker>
    <style
       id="style833">.cls-1{fill:#a9b5af;}.cls-2{fill:#f60;}</style>
    <marker
       style="overflow:visible"
       id="Arrow1Lstart-7"
       refX="0"
       refY="0"
       orient="auto"
       inkscape:stockid="Arrow1Lstart"
       inkscape:isstock="true">
      <path
         transform="matrix(0.8,0,0,0.8,10,0)"
         style="fill:#000000;fill-opacity:1;fill-rule:evenodd;stroke:#000000;stroke-width:1pt;stroke-opacity:1"
         d="M 0,0 5,-5 -12.5,0 5,5 Z"
         id="path930-5" />
    </marker>
    <marker
       style="overflow:visible"
       id="Arrow1Lend-3"
       refX="0"
       refY="0"
       orient="auto"
       inkscape:stockid="Arrow1Lend"
       inkscape:isstock="true">
      <path
         transform="matrix(-0.8,0,0,-0.8,-10,0)"
         style="fill:#000000;fill-opacity:1;fill-rule:evenodd;stroke:#000000;stroke-width:1pt;stroke-opacity:1"
         d="M 0,0 5,-5 -12.5,0 5,5 Z"
         id="path933-5" />
    </marker>
    <marker
       style="overflow:visible"
       id="Arrow1Lend-2"
       refX="0"
       refY="0"
       orient="auto"
       inkscape:stockid="Arrow1Lend"
       inkscape:isstock="true">
      <path
         transform="matrix(-0.8,0,0,-0.8,-10,0)"
         style="fill:#000000;fill-opacity:1;fill-rule:evenodd;stroke:#000000;stroke-width:1pt;stroke-opacity:1"
         d="M 0,0 5,-5 -12.5,0 5,5 Z"
         id="path933-9" />
    </marker>
    <marker
       style="overflow:visible"
       id="Arrow1Lend-27"
       refX="0"
       refY="0"
       orient="auto"
       inkscape:stockid="Arrow1Lend"
       inkscape:isstock="true">
      <path
         transform="matrix(-0.8,0,0,-0.8,-10,0)"
         style="fill:#000000;fill-opacity:1;fill-rule:evenodd;stroke:#000000;stroke-width:1pt;stroke-opacity:1"
         d="M 0,0 5,-5 -12.5,0 5,5 Z"
         id="path933-0" />
    </marker>
    <marker
       style="overflow:visible"
       id="Arrow1Lend-36"
       refX="0"
       refY="0"
       orient="auto"
       inkscape:stockid="Arrow1Lend"
       inkscape:isstock="true">
      <path
         transform="matrix(-0.8,0,0,-0.8,-10,0)"
         style="fill:#000000;fill-opacity:1;fill-rule:evenodd;stroke:#000000;stroke-width:1pt;stroke-opacity:1"
         d="M 0,0 5,-5 -12.5,0 5,5 Z"
         id="path933-06" />
    </marker>
    <marker
       style="overflow:visible"
       id="Arrow1Lend-2-2"
       refX="0"
       refY="0"
       orient="auto"
       inkscape:stockid="Arrow1Lend"
       inkscape:isstock="true">
      <path
         transform="matrix(-0.8,0,0,-0.8,-10,0)"
         style="fill:#000000;fill-opacity:1;fill-rule:evenodd;stroke:#000000;stroke-width:1pt;stroke-opacity:1"
         d="M 0,0 5,-5 -12.5,0 5,5 Z"
         id="path933-9-6" />
    </marker>
    <marker
       style="overflow:visible"
       id="Arrow1Lend-27-1"
       refX="0"
       refY="0"
       orient="auto"
       inkscape:stockid="Arrow1Lend"
       inkscape:isstock="true">
      <path
         transform="matrix(-0.8,0,0,-0.8,-10,0)"
         style="fill:#000000;fill-opacity:1;fill-rule:evenodd;stroke:#000000;stroke-width:1pt;stroke-opacity:1"
         d="M 0,0 5,-5 -12.5,0 5,5 Z"
         id="path933-0-8" />
    </marker>
    <marker
       style="overflow:visible"
       id="Arrow1Lend-36-3"
       refX="0"
       refY="0"
       orient="auto"
       inkscape:stockid="Arrow1Lend"
       inkscape:isstock="true">
      <path
         transform="matrix(-0.8,0,0,-0.8,-10,0)"
         style="fill:#000000;fill-opacity:1;fill-rule:evenodd;stroke:#000000;stroke-width:1pt;stroke-opacity:1"
         d="M 0,0 5,-5 -12.5,0 5,5 Z"
         id="path933-06-6" />
    </marker>
    <marker
       style="overflow:visible"
       id="Arrow1Lend-2-2-7"
       refX="0"
       refY="0"
       orient="auto"
       inkscape:stockid="Arrow1Lend"
       inkscape:isstock="true">
      <path
         transform="matrix(-0.8,0,0,-0.8,-10,0)"
         style="fill:#000000;fill-opacity:1;fill-rule:evenodd;stroke:#000000;stroke-width:1pt;stroke-opacity:1"
         d="M 0,0 5,-5 -12.5,0 5,5 Z"
         id="path933-9-6-5" />
    </marker>
    <marker
       style="overflow:visible"
       id="Arrow1Lend-27-1-3"
       refX="0"
       refY="0"
       orient="auto"
       inkscape:stockid="Arrow1Lend"
       inkscape:isstock="true">
      <path
         transform="matrix(-0.8,0,0,-0.8,-10,0)"
         style="fill:#000000;fill-opacity:1;fill-rule:evenodd;stroke:#000000;stroke-width:1pt;stroke-opacity:1"
         d="M 0,0 5,-5 -12.5,0 5,5 Z"
         id="path933-0-8-5" />
    </marker>
    <marker
       style="overflow:visible"
       id="Arrow1Lend-2-2-7-0"
       refX="0"
       refY="0"
       orient="auto"
       inkscape:stockid="Arrow1Lend"
       inkscape:isstock="true">
      <path
         transform="matrix(-0.8,0,0,-0.8,-10,0)"
         style="fill:#000000;fill-opacity:1;fill-rule:evenodd;stroke:#000000;stroke-width:1pt;stroke-opacity:1"
         d="M 0,0 5,-5 -12.5,0 5,5 Z"
         id="path933-9-6-5-9" />
    </marker>
    <marker
       style="overflow:visible"
       id="Arrow1Lend-2-2-7-1"
       refX="0"
       refY="0"
       orient="auto"
       inkscape:stockid="Arrow1Lend"
       inkscape:isstock="true">
      <path
         transform="matrix(-0.8,0,0,-0.8,-10,0)"
         style="fill:#000000;fill-opacity:1;fill-rule:evenodd;stroke:#000000;stroke-width:1pt;stroke-opacity:1"
         d="M 0,0 5,-5 -12.5,0 5,5 Z"
         id="path933-9-6-5-2" />
    </marker>
    <marker
       style="overflow:visible"
       id="Arrow1Lstart-7-3"
       refX="0"
       refY="0"
       orient="auto"
       inkscape:stockid="Arrow1Lstart"
       inkscape:isstock="true">
      <path
         transform="matrix(0.8,0,0,0.8,10,0)"
         style="fill:#000000;fill-opacity:1;fill-rule:evenodd;stroke:#000000;stroke-width:1pt;stroke-opacity:1"
         d="M 0,0 5,-5 -12.5,0 5,5 Z"
         id="path930-5-6" />
    </marker>
    <marker
       style="overflow:visible"
       id="Arrow1Lend-36-3-7"
       refX="0"
       refY="0"
       orient="auto"
       inkscape:stockid="Arrow1Lend"
       inkscape:isstock="true">
      <path
         transform="matrix(-0.8,0,0,-0.8,-10,0)"
         style="fill:#000000;fill-opacity:1;fill-rule:evenodd;stroke:#000000;stroke-width:1pt;stroke-opacity:1"
         d="M 0,0 5,-5 -12.5,0 5,5 Z"
         id="path933-06-6-5" />
    </marker>
    <marker
       style="overflow:visible"
       id="Arrow1Lstart-7-3-2"
       refX="0"
       refY="0"
       orient="auto"
       inkscape:stockid="Arrow1Lstart"
       inkscape:isstock="true">
      <path
         transform="matrix(0.8,0,0,0.8,10,0)"
         style="fill:#000000;fill-opacity:1;fill-rule:evenodd;stroke:#000000;stroke-width:1pt;stroke-opacity:1"
         d="M 0,0 5,-5 -12.5,0 5,5 Z"
         id="path930-5-6-0" />
    </marker>
    <marker
       style="overflow:visible"
       id="Arrow1Lend-36-3-7-2"
       refX="0"
       refY="0"
       orient="auto"
       inkscape:stockid="Arrow1Lend"
       inkscape:isstock="true">
      <path
         transform="matrix(-0.8,0,0,-0.8,-10,0)"
         style="fill:#000000;fill-opacity:1;fill-rule:evenodd;stroke:#000000;stroke-width:1pt;stroke-opacity:1"
         d="M 0,0 5,-5 -12.5,0 5,5 Z"
         id="path933-06-6-5-3" />
    </marker>
    <marker
       style="overflow:visible"
       id="Arrow1Lstart-7-7"
       refX="0"
       refY="0"
       orient="auto"
       inkscape:stockid="Arrow1Lstart"
       inkscape:isstock="true">
      <path
         transform="matrix(0.8,0,0,0.8,10,0)"
         style="fill:#000000;fill-opacity:1;fill-rule:evenodd;stroke:#000000;stroke-width:1pt;stroke-opacity:1"
         d="M 0,0 5,-5 -12.5,0 5,5 Z"
         id="path930-5-5" />
    </marker>
    <marker
       style="overflow:visible"
       id="Arrow1Lend-36-3-9"
       refX="0"
       refY="0"
       orient="auto"
       inkscape:stockid="Arrow1Lend"
       inkscape:isstock="true">
      <path
         transform="matrix(-0.8,0,0,-0.8,-10,0)"
         style="fill:#000000;fill-opacity:1;fill-rule:evenodd;stroke:#000000;stroke-width:1pt;stroke-opacity:1"
         d="M 0,0 5,-5 -12.5,0 5,5 Z"
         id="path933-06-6-2" />
    </marker>
  </defs>
  <sodipodi:namedview
     id="base"
     pagecolor="#ffffff"
     bordercolor="#666666"
     borderopacity="1.0"
     inkscape:pageopacity="0.0"
     inkscape:pageshadow="2"
     inkscape:zoom="0.44199681"
     inkscape:cx="689.36919"
     inkscape:cy="276.11747"
     inkscape:document-units="mm"
     inkscape:current-layer="layer1"
     inkscape:document-rotation="0"
     showgrid="false"
     inkscape:window-width="2508"
     inkscape:window-height="1016"
     inkscape:window-x="52"
     inkscape:window-y="27"
     inkscape:window-maximized="1" />
  <metadata
     id="metadata5">
    <rdf:RDF>
      <cc:Work
         rdf:about="">
        <dc:format>image/svg+xml</dc:format>
        <dc:type
           rdf:resource="http://purl.org/dc/dcmitype/StillImage" />
        <dc:title />
      </cc:Work>
    </rdf:RDF>
  </metadata>
  <g
     inkscape:label="Layer 1"
     inkscape:groupmode="layer"
     id="layer1">
    <text
       xml:space="preserve"
       id="text1244"
       style="font-size:3.88056px;line-height:1.25;font-family:sans-serif;word-spacing:0px;white-space:pre;shape-inside:url(#rect1246);" />
    <rect
       style="fill:#ffffff;fill-opacity:1;stroke:#000000;stroke-width:0.857685;stroke-miterlimit:4;stroke-dasharray:none"
       id="rect1666"
       width="202.77103"
       height="73.18969"
       x="1.1522392"
       y="1.1566405" />
    <path
       style="fill:none;stroke:#000000;stroke-width:0.321;stroke-linecap:butt;stroke-linejoin:miter;stroke-miterlimit:4;stroke-dasharray:none;stroke-opacity:1;marker-start:url(#Arrow1Lstart-7-3-2);marker-end:url(#Arrow1Lend-36-3-7-2)"
       d="m 138.97603,45.099204 h 24.5467"
       id="path1406-19-3-2" />
    <text
       xml:space="preserve"
       style="font-size:5.64444px;line-height:1.25;font-family:sans-serif;word-spacing:0px;stroke-width:0.264583"
       x="5.0564051"
       y="47.254059"
       id="text891-7-8"><tspan
         sodipodi:role="line"
         id="tspan889-3-9"
         x="5.0564051"
         y="47.254059"
         style="font-size:5.64444px;stroke-width:0.264583">Producer</tspan></text>
    <text
       xml:space="preserve"
       style="font-size:5.64444px;line-height:1.25;font-family:sans-serif;word-spacing:0px;stroke-width:0.264583"
       x="168.91377"
       y="47.70401"
       id="text895-6-7"><tspan
         sodipodi:role="line"
         id="tspan893-1-3"
         x="168.91377"
         y="47.70401"
         style="font-size:5.64444px;stroke-width:0.264583">Consumer</tspan></text>
    <rect
       style="fill:none;stroke:#000000;stroke-width:0.5;stroke-miterlimit:4;stroke-dasharray:none"
       id="rect883-3-2-6"
       width="27.325018"
       height="11.740967"
       x="3.977329"
       y="39.305626" />
    <rect
       style="fill:none;stroke:#000000;stroke-width:0.5;stroke-miterlimit:4;stroke-dasharray:none"
       id="rect883-6-9-1"
       width="33.839043"
       height="11.632768"
       x="166.09007"
       y="39.75029" />
    <rect
       style="fill:none;stroke:#000000;stroke-width:0.5;stroke-miterlimit:4;stroke-dasharray:none"
       id="rect926-3-2"
       width="73.762527"
       height="56.272991"
       x="62.692314"
       y="15.840669" />
    <path
       style="fill:none;stroke:#000000;stroke-width:0.321;stroke-linecap:butt;stroke-linejoin:miter;stroke-miterlimit:4;stroke-dasharray:none;stroke-opacity:1;marker-start:url(#Arrow1Lstart-7-7);marker-end:url(#Arrow1Lend-36-3-9)"
       d="M 34.57148,45.099204 H 59.118182"
       id="path1406-19-9" />
    <image
       width="20.979265"
       height="9.5543423"
       preserveAspectRatio="none"
       xlink:href="data:image/png;base64,iVBORw0KGgoAAAANSUhEUgAABbIAAAKYCAYAAACmdQ5TAAAABHNCSVQICAgIfAhkiAAAIABJREFU eJzs3duS28qOLVDasf7/l90P3tUul6USJZFMYGKMl47oOKeXlEBeOJVm/dio4teF/60fF/63AAAA AADeItC83pWB9TP0AgAAAABQkvDyfFWD60f0BgAAAABQgrDyHF3D6+/oFQAAAABgCeHkcRLD63v0 DQAAAABwGYHkeyaF17foHwAAAADgdILI10wPsG/RSwAAAADAKYSP+wmv99FTAAAAAMChhI6PCbBf o7cAAAAAgEMIG+8TYB9DjwEAAAAAbxEy/kuAfQ69BgAAAAC8RLj4NyH2+fQcAAAAAPAUoeJvAuxr 6TsAAAAAYLfpgaIAe63p/QcAAAAA7DA5SBRi1zC5BwEAAACAHSaGiALsmib2IgAAAACww7TwUIhd 27R+BAAAAAB2mBQcCrH7mNSXAAAAAMADUwJDIXY/U3oTAAAAAHggPSwUYPeW3p8AAAAAwA7JQaEQ O0NyjwIAAAAAO6SGhELsLKl9CgAAAADskBgQCrEzJfYqAAAAALBDWjgoxM6X1rMAAAAAwANJoaAQ e46kvgUAAAAAHkgJBIXY86T0LgAAAADwQEIYKMSeK6F/AQAAAIAHfq7+AG8SYgMAAAAAhOt8o1WI zbb17mEAAAAAYIeuIaAQm8+69jEAAAAAsEPHAFCIzS0dexkAAAAA2KFb+CfE5jvd+hkAAAAA2KH7 H3uEz/zQAQAAAACBOt1gFVKyV6e+BgAAAAAe6HIjW4gNAAAAADBUh5urQmxe0aG3AQAAAIAdutzI hmf5AQQAAAAAQlQPsoWRAAAAAADDVX79ghCbI1TucQAAAABgh+o3suFdfhABAAAAgOaqBtnCRwAA AAAAtm2r+doFITZnqNjrAAAAAMAOVW9kw9H8QAIAAAAATVULsoWNAAAAAAD8pVqQDWfyQwkAAAAA NPTf6g/wiZDxe8++49l4AgAAAAARKv0BPMHrH2fUxfj+UanvAQAAAIAHqgR6QtbrazF5zKv0PQAA AACwQ5VAb2qoWmH8jT0AAAAAUFqFMG9ikFph3L+aVoeKNQAAAAAAbqgQ5k0KUCuM9yPqAQAAAACU sjrIE5rWNaE23WoCAAAAACOtDvKEpbWpDwAAAACw3MoQT0jaR3KtUmoEAAAAALF+rv4AwZIC0qTv AgAAAAA040b28ZJDXzUDAAAAAC636ka2QLSn9O8HAAAAABTk1SLHmRLyTvmeAAAAAEARguxjTAt3 075v6r8QAAAAAIAIK4LstNAwLdTda+r3BgAAAAAu5kY27xBmAwAAAACnE2S/R5CbMwZp/1IAAAAA AGJcHWQnhYUpAS4AAAAAQGluZL9GiP034wEAAAAAnEaQzVESwuykfzEAAAAAADGuDLJTQsKEwBYA AAAAoA03sp8jxP6e8QEAAAAADifIBgAAAACgNEH2fm4b79N9nFJegQMAAAAAMQTZAAAAAACUdlWQ 7ZbrLN1vZQMAAAAAhbiRvY9gFgAAAABgEUE2ZxH+AwAAAACHEGQ/JpAFAAAAAFhIkA3/8k53AAAA AChEkM2Z3GYHAAAAAN4myP6eIBYAAAAAYLErgmyvaQAAAAAA4GVuZAMAAAAAUJogm7N5PQsAAAAA 8BZBNgAAAAAApQmyAQAAAAAoTZB9n1diAAAAAAAUIMgGAAAAAKA0QTYAAAAAAKUJsgEAAAAAKE2Q DQAAAABAaYJsAAAAAABKE2QDAAAAAFCaIBsAAAAAgNIE2QAAAAAAlCbIvu/X6g8AAAAAAIAgGwAA AACA4gTZAAAAAACUJsjmbF7RAgAAAAC8RZANAAAAAEBpgmwAAAAAAEq7Isj+ccF/4yxeiwEAAAAA sJgb2ZzJDwEAAAAAwNsE2fCvzv+KAAAAAADiCLIfc6sYAAAAAGAhQTZn8QMAAAAAAHAIQfY+QlkA AAAAgEWuCrK9c3gWwT8AAAAAcBg3sgEAAAAAKE2QvZ9bxvt0Hyf/egAAAAAAihFkAwAAAABQmiD7 Od1vG5/N+AAAAAAAh7syyE55ZYOwFgAAAADgQm5kc5SEgD/lxxYAAAAAiCLIfk1CaHsk4wEAAAAA nEaQ/TrhLQAAAADABa4OstNe3SDMNgYAAAAAwMncyOYdSSF22o8sAAAAABBDkP2+pDD3GVO/NwAA AABwsRVBduLN12mh7rTvCwAAAAAs5Eb2caaEu4nfM/HHFQAAAACIIcg+VmLI+1n69wMAAAAAClp5 EzU9FE275Ztar7Q6AQAAAEAcN7LPkxT8Jn0XAAAAAKCZ1bdRJwSkq8f4HeoDAAAAACy3OsSbEJR+ WD3Wz5pQm2414Tln9bC+AQAAALhYhUBmQmD6ocJ4P6IedFOlZ/UTAAAAwEkqBC9VQqgrVRj3r6bV oWINeKxbn+ozAAAAgANUCFm6BVNHMv7rVBh79knpUT0HAAAA8KIqwUpKUPWOK2sxfbyr9D33pfeo HgQAAAB4QpUwJT20etYZdTHGf1Tpe/42tUf1IwAAAMADlQKUqSHWXs/WynjeVqnn0adf6U8AAACA GyqFJgItrlCp5ycz37+nTwEAAAA+qRaWCLc4U7V+n8gcf46eBQAAANhqhiSCLs5Ssd+nMK/fo3cB AACA0SqGIwIvzlCx1ycwn4+ljwEAAICRqoYiwi+OVrXXU5nD59LPAAAAwCg/V38AuIDQ71pC7PMZ YwAAAGCUygGfoIYjVO7xNObsGnocAAAAiFc9ABGM8a7qPZ7APK1BrwMAAACxvFqEZIK98wmx61AL AAAAIFaHoE84wys69HZ35mZNeh8AAACI0yXwEJjxrC693ZH52IM5AAAAAMToFHQIz9irU193Yx72 Yi4AAAAAEbwjmzSCu/MIsftRMwAAACBCt9BPKMN3uvVzJ+Zef+YHAAAA0FbHYEOgxi0de7kD8y2L eQIAAAC01PHVIoIYuIYQO4+aAgAAAC11DoUFMnzo3MdVmV/ZzBkAAACgle5hhrCN7j1ckXk1g7kD AAAAtNHx1SLwQRB3PCH2HGoNAAAAtJEQBApjZkro3WrMpZnMJQAAAKC8lABDADdLSt9WYg7NZk4B AAAApSWFF4K4GZJ6tgpzh20ztwAAAIDC0oILgVy2tH6twJzhM3MMAAAAKCntjz3+2AQxqdQVAAAA AIZKDgfdNM2R3KcrmSPcYr4BAAAA5aQHFoK6/tJ7dBVzg++YdwAAAEApE8IKgV1PE3pzFXOCPcxB AAAAoIwpQYXgrpcpfbmCucAzzEUAAACghLQ/9niPPwLZhzoBAAAAAH+ZGBq6kVrTxF68mt7nFeYm AAAAsNzUgEKgV8vUPrySnucd5igAAACw1H+rP8AiH6GMcG8t4RgAAAAA8JAgUZi9it67jh7nCOYs AAAAsIxg4g9h3zX03LX0NUcyfwEAAIAlfq7+AIX82IQ0ZzO+AAAAAMDTBIv3ucl6HH22hh7mDOYz AAAAcDmBxPcEge/RX2vpX85ibgMAAACXEkbsJxTcT1+tp185kzkOAAAAXEoY8TwB4X36qQY9+ppb /Wss7zPfAQAAgMsIIl4n4PpND9WjN/91ZJ8a39/MfQAAAOAygohjTAy29E5NE3vxlqv6c/p4WwcA AACASwghjpccbOmX+pL775GV/Tl13K0JAAAAwCWEEOdKCLf0SB8J/faKaj06rQ7Vxh8AAAAIJIC4 VoeAS0/01aG/jlS5VyfVonIdAAAAgBACiOtVDbj0Qm9V++oMnXp1Sl061QQAAABo6OfqDwDwhG6B 6Y+t32cGAAAAKEeQDXTQPRDu/NkBAAAAlhNkQ3/pr69ICYFTvsct6T0IAAAALCbIBipLC3/Tvg8A AADAJYQq16t6c1Ev9FS1n941oR8TazehbgAAAMACbmQD1UwJQ6d8TwAAAIC3CbKBSqaFu9O+LwAA AMBLBNnQV9qrKYS6/aX1JAAAAFCEIBtgLQE+AAAAwAOCbKCC6WHu9O8PAAAA8C1BNrCaEPe3lHHw ehEAAADgcIJs6CklLEwJbwEAAAA4kSAboA7BPgAAAMANgmxgFaHtbcYFAAAA4AtBNvST8FoRYW22 hB4FAAAAChFkA9Qj6AcAAAD4RJANXE1ICwAAAMBTBNkANQn8AQAAAP5HkA1cSTgLAAAAwNME2dCL P6I3S+fgX68CAAAAhxFkA1fpHMoCAAAAsJAgGwAAAACA0gTZALW5yQ4AAACM99/qDwCMIIwFAIB6 jvy7Js78AJxKkA0AAADZ/CFuANoTZAPU92Pz8AEAwD7OjQBEEmQDcJZfm39iCgBwNsE1ACMIsqGP rgdUQSYAAByr67MBALxMkA0AXKHrA7cf4wCoouteepWO4+OcAfAEQTYAAADU1DGcBYBTCLIBAACg FgE2AHzxc/UHAGAX/+wQACDfr02IDQA3uZENAAAA6wiuAWAHQTYAAABcT4ANAE8QZAMAAMB1BNgA 8ALvyAYAAIBrCLEB4EVuZAMAAMC5BNgA8CY3sgEAAOA8QmwAOIAgG6AHD0AAAP04wwHAQbxaBAAA AI4lwAaAg7mRDQAAAMcRYgPACQTZAAAAcAwhNgCcRJANffxY/QFe5DAPAMAEzr0AcCJBNgBn6frj CwDAs4TYAHAyQTZAfR6MAAAAgNEE2QAAAPA6lw4A4AKCbOAKDvcAACRyzgWAi/y3+gNQxtcDmHfb AgAA3CfEBoALCbLP1/Vwc+tzC7fhel3XEAAAAIDDCLKPlR44ff5+Qm2e9WvTNwAAZEh/9gOAcgTZ 75t6gPEqkjV+bHN7biK1BgAAANgE2a8SLv3LbW3gM+sAAJDK8yAALCDI3s9hZT+hNvd4vch+1hwA gHqc0QBgEUH29xxS3vcxhsJLAAAAAOAlgux/Ca/P4ZY2H9zKfsw6BAAAAPDJz9UfoJBfm/DoKsb6 PQkhsPpnS+hRAICvnGEBYCE3sh1GVvLaEfiXNQkAAADgi8lBtrCoDoH2TF4xAgBAF54fb3OeB+Ay E4NsB5C6BNrzCLP/Zn0CAKADZ3gALjcpyBYQ9SHQvk8f50qprXkLAJDLWQ+AZSYE2Snh0EQC7b+l 9rJb2bm1BQBIMP2sNv2sDkARP1d/gBP92hw4Uqhj/hikf7/vTP7uAADUJsQGoIzUG9mCoTxTb2dP 6mU3s/tTPwCADM51AJSTdiPbLex8k+o76bt+mPadp31fAABq+7EJsQEoKinIFgjNMeEHi/Tv950p 333K9wQA6GzKmU2ADUB5CUH2hFCT2xLrrp9/Sx+DxO/nwQcAoCfnOABa6P6O7MQwiOckvTtbP/8t 8Z3ZagwAQBVpZ20AwnW9ke3WKl917gf9fF/SuCR9FwAAehNiA9BOxyBbGMQ9HQPhbp93hY51/ar7 53/EgxAAQB/ObgC01C3ITg+DOEaXPunyOavoOF4JITwAABn8QUcAWuvyjmxBEM+q/H5l/fy6Tu9E n1LnDrUAAHjFlPMcALTQ4Ua2wwOvqtg7FT9TR5VvOlf+bAAAzOTyAQDtVb+RLQziXVVuZuvlc1S6 oT2xxhXGHQAAABigcpA9MRTiHKvDTr18vlU1VlsAAKpz+QCACFWDbOEQZ1hxO1svX+vzeJ9VazX9 zQMRAAAAcJmKQbaQiDNdFWbr4/Vu1eCV2qslAABduXwAQIxqQbbAiCucHWbr47rU5hgeiAAAAIBL /Vz9Af7n1yZg4lpn9Zs+BgAAAICDVQiyBX+scmTv+TGGKdzGBgDowbkNgCirg2zBH6sd0YP6GAAA AABOtDrIhgpeDaLdwmYat3oAAACAJVYG2QJAKnm2H/Uv0wixAQD6cHYDIM6qIFsISEV7+1L/AgAA AMCFVgTZQkAq+64/vUqEqdzoAQAAAJa6OsgWAtKV3mUqITYAMJHzPwAUc2WQ7SBAF197Ve8CAABd uIgAQKT/LvrvCALpRs+ChyAAAACgiCtuZAsEAfoRYgMAAABlrPhjjwAAAAAAsNvZrxZxGxugH7ex ATja0c8F9ioA4LMjzxrOGUWdGWQLsQH6sWED8Korz//f/bfsZQCQxzmD04JsITZAPzZkAPaqfN6/ 9dnscUyh14EUVc8azhkLnf1qEQB6sPEC8J2qD5N7ff789jwAqKfzWePrZ3fWOMkZQXbnxoNpPhZX 83Y2mywAt6SeDzxsAuR7dQ+zJ1wn9ZyxbX5AP83Rg5nchJDk1tw3f2eyqXKVrmuMOfJY19p+ps5/ JNTzHXqht+n9u9rq+dOx/qvHrLura65e7+s4T4+kh9505I3s6c0IXdxbOH9s5vE0NlHgWfaJTOr6 x8dYVNgju9bl6rHrOk7A81bPd7e8X7e6dlVUuqndsibekQ1z7FkkhdlzrN40gV6S94bJ62FyXd9V 6UETYDJ7VV9q971KP563cVSQrTmhtmcWRmF2PhslsFf6fjB1PUyv69E8aAJcK2mfmrh3JNXvCs4Z T3AjG/K9shgKs3PZHIE9JuwBE9fDCXU9kwdNgHOl7VPT9ou0+l3NOWOHI4JsjXqdPc2sHnx4d/ET ZuexIQKPTFn3p62HU+p6FQ+aAMdK3Kcm7RGJ9VvJOeMb7wbZmvV4R4SP96jXHEcteMLsHDZB4JEp 6/2k9XBKTVfxoAnwntR9asq+kFq/KpwzbvBqkfWubMiv/y2LTp4z+kmY3Z+ND3hkyjo/ZT2cUs8q PGgCPCd5n5qwFyTXryLnjE/eCbI17uuqNN/nz6Ge/Z3ZV8LsvqqsN0BdU9b3CevhlFpW9Wub0WcA r0rfpybsAek1rEygvbmRfaXqjSbU7u2K/vr4b+iPHqqvOUANU9b0CWvilFpW5yET4F8T9qj0dX9C DbsY/cP5q0G2Bt6vY3MJLPtY0V9uZ9fXcd0BrjdlLU9fE6fUsZvRD5kAn0zYp9LX+wk17GbsD+ev BNkaeJ+EZhJo17ayx4TZdSWsPcD5pqzh6WvilDp2NfYhE2Cbs0clr/FTatjZuB/OvVrkeIkNJNCu pUqP6YtaqvQFUN+UdTt5XZxSwxTjHjKB8absU8lr+5QaJhj1w/nPJ//fa+T7fmz5TTPhO1ZXcfwr fqZp1ADYa8pZLnldnFLDNL82tQNmmLLWpZ417Fd9jajbs0E2t6UuYPcItK9Xfcyrf75Uxh14xojD 7Za9Lk6pYTI1BJJNWeNSzxpT6pcsvobPBNnxg/GC6SHS5O9+pU7j3OmzdmesgWdMOcelro1uR2VR SyCRta039csRfW50I/t1qQ9Kz5oe5p+t49jqiXMZX+BZsQfZIdQvk7oCKaJDsxsSn8Um1W+SyLr6 Y4/PS1y0jvBjC50kiyT0mT8GeayEngCuN2kNTlwnJ9VvolF/nAmING2fSlyvp9Vwmrg/OL33RrbG /i2q+CcwPsdIG0c3iN9j/IBXTTq/Ja6Tk+o3nVoDHU1bu9LOGtNu0k8WVWevFtkvbdE6i3F6XXpg mf79jma8APZJXCujHjjYRc2BTqatWWlnjWn1I6jme4LsmC/7hrRF62wCuOdNGi/98T3jAxxhyvkt cb2cUjv+pfZAB9PWqrSzxrT68UdE7d3Ifixt0bqSsdtn6jj92IS2H4wFcKSIQ+oOiWvmlNpxnx4A qCPtrGGPoX0PPAqy23/BN6UtWisYw/sEl39MHYup3xs4z5SzW+LaOaV2PKYXgKomrU9pZ41JteN7 rXvhv9UfoLC0RWulH1vziXIC/XXb53FJ7Rm1B86Sum5+lbiOTqkd++kJoJpJ61LiWQM+azufBdm3 WbSOJ8z+TW/t93WsuvaPmgNX6LpGPitxTZ1SOwD6mrRXOWtAYd8F2VMbPXHRoga99Z4uwbY6A1er uh4eLXF9nVI7APqatFc5a0BxbmT/LXHRqmTqrWx9dY5b43p1f6ktsNqUfdV6CwCcKfGsMeWcyCCC 7D8SF62KJobZvzb9dZW94/yoB9UL6GDKfpq6Jk+pHwB9TdmrEs8aU2rHMPeC7GkNn7hoVTYxzKYW cx7obso+mrpeT6kfAH1N2asSzxpTasdAP1d/AMZK3CwA4ApTHk5SzwpT6gcA1aWeNSCWINvCxTU8 tAJwhCn7Ser5bEr9AOhtwn7lrAEN3QqyJzV96sLVhfEHgP2mnNGcDwBgnSnnjURqRzw3slnNwyoA 8CH5XODhEgBqSDxvOGcwwuQgO3HhojYbCwCvmrCHJJ/NJtQPgP4m7FfJ5w2I9zXInrBobZuFqxr1 AID7JpzPnAUAYC3njb4m1A62bZt9IxsAoDoPJv2pIQDVTdirhNgQYGKQnbp4dacuAPC3KQ8myWeA KTUEoK8Je1XyWQNG+W/1B4BPfmz5m+ivzSYKwGPp++EHeyLwrjPXkc5rsfWVPTr3+F7Jc2FC/eAv n29kT5gAyQsYAJBhwpls2/LPZVPqCABVJZ81nDMYyY1sAIA6pjyUJD9YbtucOp7h6N5QC4Db0tfH 9LMGrzmqL9LnT1mTgmyLWA8TXi8CALdM2f+cyfhwRS98/W9MmWcA30lfC9PPGun1O9JZvXDr/666 XGBSkA1VeE82AFNN2P88xHxvdQ8ItoHp0te91fsMa62svzPGBQTZVORWNgDTTNj3PFjOVbn2nz/b hHkIzJa+zlXeb46SXsNXVK37x+dSswN9BNnpg1q1qQEA0s9h2zbnLDahls/oVncPnECy9LWt257z ivQaPqtLzf1ofiA3sgEA1plwmO3ykMExEuot0AbSpK9nCXsP+3WutzPGmwTZVOX1IgCkm7DPdX7Q eNaEen4nsdYeNgHqS9x/brEXZdXaGeNFE4LspEYHADJMOLQ6g82RXmsPm0BnyWtX+v7Db8l1dsZ4 0oQgGyr6tWUvxgDcN+GgOm2Pm1DTW6bV2cMm0E3yejVpD0qu43cm1dgZY6efqz8AfGPSogXADBMO p/bvfD+22XWe/N2BPiacOcg1da+d+r13+2/LXtw0AABQRfKZ68PEs9eEun42sca3uDkFVJa+Nk3a i9Jr+dWk2t7jjPENN7IBADiCB498avwvYwJUkx5+WXdzqe3fjMcNgmwAgPN5qMyUXtcP018l8oix AapI35emrbfp9fzgnHGfcflCkE11Ji0A3aU/hNirs6nvPsYJWM15g47U9TFj9ElykK3QAMBq6Q+V k02orfP0c9woA1ZJ35OsrZnUdT9njP9JDrIBAFZKf6jcNgfqZGr7OmMHXCn9vDF1TVVXbhk/boJs AIDjpT98bNvsg3R6fSfX9ijGELiC/YiO1PU9o8dPkA3rpB86AKaasL6PPkCHU9vjGEvgTOnnjclr aHJtJ9f1SGPHUZANAHCc5AePD2MPzgOo7fGMKXCG9POGtTOTuh5r5HgKsulg5OQEoJ30h8ptsydv W26d1Ragh9R96IP9KJO6cghBNgAAe3gAyaW25zK+APtYLzN/qFDX84wbW0E2AMD7Eh86Pht3SIaD mUPAEZLPG9bJTOp6vlFjLMgGAHhP8kPltg07HD+QWGv1vY6xBt6RuAd9sD7+llxjzjVmDgmyAQBe l/7AMeZQPJT6AvSQfN6wF+VS22uNGG9BNgDAa5IfKrdtyGF4MPVdw7gDz0o+b1gTc6ktpxBkAwA8 L/mhcts8fNySXnOuY34Be9l7gGfEnzEE2QAAz0l/qIw/AKPGAA04b8ySVG+1XSt6/AXZAAD7JT1k 3BJ98GXbNjWuQh2A7zhv0JXacipBNgDAPh4q50qvPWuYc8BXv7b8PcfaB+eLnWeCbACAxzxUkkCd AepKP2tsm33onpTaq28tkfUQZNNByqIOQE/p+1DkIReaMP+Abcs/a2yb9Q44gCAbAOC+9AdLD5Vz qDVATelnjW2zB02gxjXF1UWQDQAwU9zB9iQTAgbWMhdhrgl7jDUunxpzGUE2rGOxBwCu4MwBwAr2 n8cm/JjBWlHzMDnIthgAANwWdaAFAMpx1gAOlxxkAwDwLw+WUI95CSSxps2h1lxKkE11btYDwHE8 bMyj5gBcyb4D9cTMS0E2AMAMMQfYC/lBnSuZo0B31rFZ1JvLCbIBAPJ50JhJ3QG4ij3neX4w50oR czQ9yLYoAADTRRxaAYCynDWAS6QH2fTmhwgAeI8HS+jFnAW6sW7NpO4s8XPTfAAAiZzxAIAzOWtA L+3n7IQb2W71UlH7xQOA0uwz6AEAAKJMCLLpyQ8QAPAaAeYxnEUA4D7njbnUnmUE2QAAOTxYQH/m MVCddQpYYkqQ7UYNAJDOQyUAcDbnjWPIqVil9RyeEmTTiwUdAJ7T+kDK4fQDAGewvwBLfQTZFiMA gL78CAwAAESbdCPbA14PE+rkhyMAzjBhDwUAYB15BktNCrIBANIJswGAszhnAEtNC7IturWpDwAA ANTluR1Y5nOQ7Z8HAAD05wETADiTswb01jYDnnYje9ssuFVNqUvbxQKAVqbsq5DKmREA4IuJQfa2 ebgDAPI57wAAZ3HOAC43NcimFhsgAAAA9OJZHrjU1yB70j9hs+ACAOmcdwCAMzlrAJdxI5vVJm16 k34oAqCOSXstAAAQanqQ7cFuLeMPANew5wIAZ3HOAC4xPcjeNgvuKsYdAAAAMnjGB053K8ie+PoD Cy5nmzivAKjFeQcAOJOzBnAqN7JZweYGAGvYgwEAgJb+W/0BCvm1uTV7BQ/QVPGoF60HQCpnHgDg LM4ZwGnuBdk/tpmBowX3XBN7imsd2WN7/29ZMyDb1DMRAHCNxLOGbAU4hRvZ/7LgniNtY36Wvjpe lZ669TnUGrJ4wAQAzuSsAbCDIPs2C+6x0jbkV+mr93Tqo6+fVd2BiuxLAFBHYpgNcKjv/tjj9Acb G8gxjOPffm3G5Bm/towx+7XlfBeYKvVcZE2CmsxNIIG1DDjUd0E2Ft13Gb/7jM19EwLfCd8REqWG 2QBADYlnDc88wGEeBdmJi+izLLqvMW6PCTL/mBzsTv3e0FXi2cgaBAB1JJ41AA7hRvY+HvCeY7ye M3m8hLh/TA7zoZvEB0xrDwBwFueMHGqZoW0dBdn7tS3yxYzTayYFmAJUx3l3AAAZR0lEQVTbx4wP sIJ1BwBq8KM5wA17guzEBfRVwqXvGZv3JY+h+fM8YwZ1OR9Rmb0DoL/Es4b9CXiLG9mvsfj+Tdh2 rLSx1B/vM4ZQkwdM4AzmIfAh8awB8LK9QbbF818OmL8Zh3OkBJcJ36GSlL6AJIlnJOsMAHAW54zf Op8h1bC31vVzI/s9k0Olyd/9Sl3HWH+cy/gCZ7PG9H7ABCBH4n7knAG85JkgO3HxPMq0UGnSd62g U391+qwJjDXU4IxERfYIgByJZw37FPA0N7KPlb4QCynXqj721T9fKvMSavCACRzBvAMAuOPZIDvx Ie1oiaFS4nfqqmId9EcNagDrJZ6TrC0AUINzBpWoXU/t6+ZG9nkSwr2E75CoUl2qfA5+q9QbQA7r CgDUIMwGRnslyE5cOM/0a+sXLnX7vFOtrJEeqU1tYB3nJCqxH/SiXsAeiWcN6x+cL2KeuZF9rcqh duXPxn0raqZHelAnWMcDJgAAj3Q/MzofcrlXg+zuk62C1cHxr239Z+A4V9VQr/RifgNHmrieJJx5 J9YNIF3C/vSV/Qp4yI3sGq4IlQXX+c6sq77pTe3geokPmMB57NXAsxLPGtbCftSsh5g6/ffG/98f W9BAFLN3XD82LnXgw0cvHHmo0V8Zfm2Zh12oLPGsZC0BAM7krAHc9e6NbIvLWm7Jcs9RfaG/sqgn XC/xrGQt6UfNalMf4FWJ5wz6sY/VFlUfrxaBXO/+0BG12PH/1BU4wqS1REgAQGWJ+5RzBnDTEUG2 SQe1vXIImHRwmEh94VrOSlRg7a9JXYAjJJ41rI+9qFdNcXVxIxtmeGbxilvouEmd4VoeMAEAnuOs AfzlqCA78eEM0ux51YiDwizqDbzLOtKLetWiHsCR5DKsZl+rJbIeR97ItmhCD/cWs8hFjofUHa6T elaasI6k1g6ALIn7lXMGPC923ni1CMz09XZ27CLHLuoP1/GgwmrW/BrUAWA/a2YfasWpjg6yPZxB L3teN8IM+gCuk3hesob0ol4AuRLPGdtm7+pErdaKHv8zbmSnLpoA6aI3POB01hDYx1wBziaX6UfN OEL8GeOsV4uYgAA9xW98UETqWSl5DUmrWXKtKjPuwFXS9q1ts4Z2olacwjuyAfjKoQOukfiASS/W ewC6sXf1oVbXGjHeZwbZHs4A+hqxCUIBiecl6wfcZm4AV0s8Z2xb7nqaWK/UWlUzZpzPvpGdOAkB APhe6mE68WybWqtqjDOwSuLeRS/2wHONGt8rXi1i0aQrvct0ozZEWCh1v7GG9KFW5zK+wGqJZw1r KwycB1e9Iztx0STbjy//E6YatzHCIvabPlJrZb0/h3EFOE/iGuucwV4jx9Qfe4R/fd04ftz438Ek IzdI4BDWj17U61jGE6gk9ZnWWtuHWh1n7FheGWSnLppk+a5P9TAAZ0rdZ8YetJtSr2MYR6Ci1LMG fdgf3zd6DK++kW3RpLI9/amHmWr0ZgkXSt1n0taQ1Dp9SKvX1YwfwLXS1l3nDO4ZP3YrXi2SPiHp 6Zm+9KoRphq/acJF7DFUYM1/jXEDqks9Z1h/e/m1qdmzjNe27h3ZqQsnPb3aj/oYAPZLO3xPOAek 1exsxgvoInUPS1qHU2v0VVLNzmSc/mflH3ucMimp7d0+dDubaWygcI3UvcUa0o+a7WOcgG5Szxr0 Yw/9nvH5ZGWQvW0WTtY6sv/0MgBHS91bHMb7UbPvGR+AOpLW5NSz4C1JdTuK16/csDrI3rZZE5M6 zug7vcwUNlOA3ybt/R6mbjMmQGep+5i1uSdnjT+Mwx0Vguxty108qenMfvOqEQCOlLqnOJz3pXa/ edgGUjhr1JZan++k1O4VzhcP/Lf6A3zyY1MsznfVJqCf63q2B9Txtl/bzEMVrJC6p6SsI6n1+U5K 7V41rd4AcLWPvXbSecP5YoeKDaFwnGVVv+vpdc6quZr+UXEfoaau86ZSj3cdw0cqjfGrUmuzR0L9 9ppc52ck9UTnmifVYa+u9apSq67j90iV8X1Xan32SqnjLdNr+5Qqrxb5LLk5WWdlX+npa/3Yzn/F yxX/DQD6mLwfTPknsBO+IzBb6l5m/c6QeN5I/E6nqxhkb1vuAsoaFfqpwmdItypYnh5o23jhOqlr jXUkQ+rDWOr3Argl9ayRQG1+S9iXE77DMpXekf3VxyRVXN5RabHX08erWN9tU2PgPKnvY05453Jq bZ6V8k5LtQTIkXDO4G8dzxvOFgeoeiP7s05NSR2Vb8lW/VzdVB7Hyp8NoKqEw731/4+Ot41+bT0/ N8CRUveyhLU9tTbvqL53V/987XQIsrfNZOU5HfqlctBeXZex6/I5j2BThmtNWVvI0OHhrcNnBLhS 6lnDWp+tSmhc5XNEqvxqka/8c0326Lbh6uv9utX2g1fKAGdI3T8S/ulvam3e9XlMKtRYjQDoyDlj n69jdNbZQy0uVuEQ+QqNwldde/kzfX1fQn23Lb/GKXXiHF37v3pfdx3XR6qP+yOpdTnLFfVWk+t0 n7+fde6bpDrs1bVelWvVdUwfqTzme6TWZaV7PWGsi+k8eTUTHzr38Vf6+l9J9d227Bqn1Ypjde39 6n3ddVz3qD72jyTX5iqv9oCxX6v73P2scy8l1WGvrvWqXquu4/pI9XF/JLUu8C0Tl8669+89+voP Ne4ntWa8r2vfd+jprmP7SIex/05qXeCR7nP3s87zOKkOe3WtV4dadR3bRzqM/XdS6wJ3dfljj/dM +mNq/C257vr6t+QxSP5uwPVS15TuD2epdQEAgCW6B9kfPCjMMSnknfI9b5nw3Sd8R4B3CbMBYL3U /cw5A5pJCbK3bVbAOdXE+k7s60nfN/G7dj8MQleJ68kH6woArJd61uh+zkitC9yUFGR/mBj8pVPT Od9/yvf8bOJ3Bs5hPalJXQCgtu5hNoyRGGR/8NDQnwD7b+ljkf79vjP5uwPHSl1Puj9gptYFgFns ZzWpC2MkB9nbJgjtSt3uSx2bxO/0rKQx6B44ATV1X1uS1nkA5krdz5wzoIH0IPtDaviXRp32Sxqn pO/yLmMBHCF5Len+kAkACVLPGs4ZUNyUIPuDoLQmdQGAY9lXa1IXAKitc5jtnEG8aUH2B8FpDeqA +v/LmAB8r/MD5rZZ5wHIYD+rSV2INjXI/iBIXcO4v6/7Q/y26YHvJIxNQo9CdwlryT3d15jk2gAw R+p+5pwBRU0Psj8IVq9hnAHgWsn7rodMAFgvdT9zzoCCBNl/+7EJW49mTLlFPzxmjICjWE8AAJ4n zIZiBNn3CV9fJ7wGAK7gARMA1rOf1aU2RBFkPyaU3cc4sZce2a/7WHUPmCBJ9/XkO93XmuTa8Dp9 AXSTum51P2fALW3nqyD7OcLavxmPNWykALwieb/uvjcm14bn6QeAWpwzSNK6HwTZr/uxzQtyJ35n jqVvnmfMgCNZU+pSG7ZNHwC9Ja9hwmwo4L/VHyDI10XBIgcAcJ1fW//zy4+t/xmS13XvX4Bts5dV pja0P2u4kX2ebreXu31eAOA1yft8wsNZcn24T92BJKlrWso5I7U+fC+i7oLs61gsmE7/v87YAUdL Xlc8ZNKNWgP0kXDO2DZ7zzQx9RZkAwBATTEPHdylxkCq5PVNmE0nUXUWZANwppRDHiSKOtR+kbT2 JNdpOrUF0lnn6lOjbHH1FWRDL0kP5gCsF3e4/SRpz0yu01RqCkyRut45Z1BdZF0F2cAVIhfQixlD 4CzWlx7UKYdaAmQQZlNR9N9aEWQDAJAq6QFz28IfTIZQP2Ci5LUv6azhnNFffP0E2QAAJB96kx4w PyTXK5m6AZNZA/tQq55G1E2QDQDAtmUffoXZrOSGG0A25wxWG1MvQTYAAB/GHIJDCEjrUx+AP5LX xNQwO7lmCcbVSJANAMAEiQ+YH0Y9wDSiLgD/Sl4bU88ayTXrbGRdBNkAAHyWfChOfcDctoE3cgpT C4DvWSP7sbfVMrYWgmyAPsZuVsDlkteb5DB72zxormbsAWZzzuBM48dfkA0AAHnGP+hczHgDPCd5 zUwPs7fNvnc14/0/gmwAAG5JPixPeMD8kFzHCjxYArwuef2cctZIrmEVxvgTQTZAH1MOQ0AdyQfn SWuqsPV4xhTgGNbS/uyJ5zCuN/y3+gMAAFDaxwE6Mfj9tc16QPj8XRPreYVJ/QJwldSzhnMGr5jU M08TZAMAsEfqQ+ZU6vkcD5VQn3naX+LeNC3M/pBYy7Nd3Sct+7Llh26u6iTWCz1U7Z9H9Ncx1B+A s3TdY85mDwOA9zln3Oes8QQ3sgEAAP8c+G8eKgHgOM4Zf3POeJEgGwAA+Gzqw6aHSgA4n3MGLxNk AwAA93x96Ep74PRQCQDrOGfwFEE2cIWpf+DiSGkbOgA9dX/gdB4BgLq6nzO2zVnjVIJs6OXH1nMh BwAy3XtYq3Je8TAJAH3d2sernDG2zTnjcoJsAM5kYweYae/6/+7DqH0GAGa56ozxyn+TkwmyAQCA VTwYAgBncMYI9HP1BwDGqPTPf7oxdgAAAMBogmwAAAAAAEoTZAMAAAAAUJogG7iSV2Q8z5gBAAAA 4wmyoR9/sIAu9CoAAABwCEE2cDU3jPczVgAAAACbIBsAAAAAgOIE2cAKbho/ZowAAAAA/keQDT15 9zAAAAAAYwiygVXcOL4vYWz82AIAAAAcRpANrJQQ2B7NmAAAAAB8IcgGAAAAAKA0QTb0lfLqBjeQ /zAWAAAAADcIsoEKBLhZY5DyIwsAAABQhCAbqCIpyH3W5O8OAAAA8JAgG3pLu/k6MdCd+J0BAAAA niLIBqqZFOwmfte0H1cAAACAAgTZQEWJAe9XE74jAAAAwCEE2dBf6g3Y5KA39bul9iIAAACwmCAb qCwx8E38TgAAAACnEmQD1SUFv0nfBQAAAOAy/hn49aoGWXqhv6q9daSufao2AAAAAG9wIxvopGMg 3PEzAwAAAJTiBt31qoZaeiFD1f46Q/WeVQsAAACAg/y3+gMAvOgjKK4Wok4KsAEAAAAu4dUikKVa qHuFX1uN8LjK5wAAAACIMzH0ulrXYEtv9NW1545yde8abwAAAICTCSDOkRZs6ZN+0nrwHWf0r/H9 w/oAAAAAnE4AcZwpwZae6WFKP77i2R42lvdZDwAAAIBLCCHeMz3g0j+1Te9PzmX+AwAAAJf5b/UH aEpA+NvncRBqAQAAAACnED4+R4D9mJ6qRc9yBvMcAAAAuJQb2Y8JAp/zMV6CLgAAAADgEMLG+wTY x9Bj6+lljmROAwAAAJcTSNwm+DueXltLT3ME8xgAAABY4ufqD1DMr03gdxbjCgAAAAC8xO2634Ss 19J3a+hz3mHeAgAAAMsIJoR7K+m/6+l3XmGuAgAAAEtNfrWI14isZ/wBAAAAgIem3rIToNYztRdX 0P88w9wEAAAAlpsWUAjwapvWjyuZC+xhTgIAAAAlTHq1iOCuPjW6joASAAAAgDamhFkC0n6m9OZK 5gXfMQcBAACAMtKDCkFdb+n9WYE5wi3mHgAAAFBKclghoMuQ3KNVmCt8Zs4BAAAA5aQGFoK5LKl9 Wok5w7aZawAAAEBRiaGFQC5TYq9WY+7MZo4BAAAAZaUFF4K4bGn9WpE5NJO5BQAAAJSWFF4I4GZI 6tmqzKVZzCkAAACgvJQAQ/A2S0rfVmZOzWAuAQAAAC0khBgCt5kSerc6cyubOQQAAAC00T3IELTN 1r1/OzDHMpk7AAAAQCudwwwBG9vWu4e7MNeymDMAAABAO10DDcEan3Xt407MuQzmCgAAANBSx1BD oMYtHXu5G3OvN3MEAAAAaOvn6g8ABxGynk8Q2pfaAQAAAK11CzeElTzSrae7Mhd7MB8AAACACJ1u ZAvOoA4BaX1qBAAAAMToEnQIsXlGl75OYG7WZA4AAAAAUbqEHcIyntWlt1OYozXoewAAACBSh9BD QMarOvR3EnN1Lf0OAAAAxKoefAjGeEf1/k5l3l5LnwMAAADxKgcgwjCOULnH05nD59LbAAAAwBg/ V38AOJkwdR1B63mMLQAAADBK1TBE+MiRqvb5JOb0MfQyAAAAMFLVUEToxdGq9vo05vZr9C8AAAAw WsVwRNDFGSr2+mTm+T76FgAAAGCrF5IItzhTtX7nN/P+X3oVAAAA4JNqYYlAi7NV63n+mD7/9SYA AADAHZWCk+kh1iPP1MpY3lep57lvSg/rRwAAAIAdKoUoU4KrPc6oi/H9o1Lf81ha7+o/AAAAgCdV CVTSgqpXXFmL6eNdpe95Xtfe1XMAAAAAb6gSrnQNp46wsgbGne6q9rD+AgAAADhQhbClahB1pgrj /tW0OlSsAce5qp/1EQAAAMAFKoQwkwLUCuP9iHoAAAAAAKX8XPzfF5rW0+VzAgAAAABD/Lf6AwzQ MRj++MyTfmgAAAAAAIpafSM7XccQ+7Pun/8RQT0AAAAANLAyyE4PEVNC4JTvAQAAAAA0tTKkTA2y k4NfNQMAAAAALrfqRrZAtKf07wcAAAAAFOQd2ceZEvJO+Z4AAAAAQBGC7GNMC3fTvm/qvxAAAAAA gAgrguy00DAt1N1r6vcGAAAAAC7mRjYAAAAAAKUJst8z/VZy0vdP+5cCAAAAABDj6iA7KSxMCnHf YRwAAAAAgFO5kf0a4e3fjAcAAAAAcBpBNgAAAAAApQmyn+f28W0J45L06hsAAAAAiHFlkJ0QEiaE tWcyPgAAAADA4dzIBgAAAACgNEH2fm4b72OcAAAAAIBDCbLhbwmvwAEAAACAKILsfdwyfo7xAgAA AAAOc1WQ7ZYrAAAAAAAvcSMbAAAAAIDSBNmPeU3Ga4wbAAAAAHAIQTYAAAAAAKUJsuFf3ukOAAAA AIUIsr/n9RjvMX4AAAAAwNsE2QAAAAAAlHZFkO01DQAAAAAAvMyNbAAAAAAAShNkAwAAAABQmiD7 Pn+o8BjGEQAAAAB4iyAbAAAAAIDSBNkAAAAAAJQmyAYAAAAAoDRBNgAAAAAApQmyAQAAAAAoTZAN AAAAAEBpgmwAAAAAAEoTZAMAAAAAUJogGwAAAACA0gTZAAAAAACUJsgGAAAAAKA0QfZ9v1Z/gBDG EQAAAAB4iyAbAAAAAIDSrgiyf1zw3wAAAAAAIJQb2QAAAAAAlCbI/p73O7/H+AEAAAAAbxNkw7+8 DgcAAAAAChFkAwAAAABQmiD7Ma/HeI1xAwAAAAAOIcgGAAAAAKC0q4Js7xwGAAAAAOAlbmTv4zUZ zzFeAAAAAMBhBNnwN/96AAAAAACKEWTv55bxPsYJAAAAADiUIBsAAAAAgNKuDLITXtngtvH3jA8A AAAAcDg3sgEAAAAAKE2Q/Ty3jm9LGJeEfzUAAAAAAHEE2a9JCG2PZDwAAAAAgNNcHWQn3XgV3v5m HAAAAACAU7mRDb8l/cgCAAAAAFEE2e+Zfht5+vcHAAAAAC6wIshOu/k6Ncyd+r0BAAAAgIu5kX2M aaFu2vdN+3EFAAAAAKIIso+TFu7eM+V7AgAAAABFrAqyU2/Apoe86d8PAAAAACjIjezjpYa9qd8r 9UcVAAAAAIghyD5HWuib9n0AAAAAgEZW30adEJCuHuN3pNenc20AAAAAYAw3ss/XNQzu+rkBAAAA gDAVbqROCkwrjPcj6gEAAAAAlFIhyJsUnH6oMO5fTatDxRoAAAAAADdUCfOmhagfKoy/sQcAAAAA SqsS5k0NUz+sqMPkMa/S9wAAAADADpUCvcnB6mdn1sQY/1ap7wEAAACAByoFekLW+16pk/G8rVLP AwAAAAA7VAv1hK+crVrPAwAAAAAP/Fz9AeBCQmwAAAAAaKhakC1oBAAAAADgL9WCbDiLH0kAAAAA oKmq4Z53ZXOkqn0OAAAAAOxQ9Ua24BEAAAAAgG3b6gbZcBQ/igAAAABAc9VDPq8Y4R3V+xsAAAAA 2KH6jWxBJAAAAADAcNWDbHiVH0EAAAAAIESXsM8rRnhGl74GAAAAAHbociNbMAkAAAD/186d5DYU w0AU9P1PnUU2CeJAtP0HsVl1BfXqgRAADNUtELvMZqXbpgEAAACAhS4X2VAhYgMAAABAoI7hz1U2 z3TcMgAAAABQ0DX+idn81HXHAAAAAEBB5wAoZvN49N4wAAAAAFDQ+Y9sARMAAAAAYICEGOwye66E /QIAAAAACykhUMyeJ2W7AAAAAMBCUgwUs+dI2i0AAAAAsJAWBMXsfGmbBQAAAAAWEqOgmJ0rca8A AAAAwEJqGBSzs6TuFAAAAAAoSA6EYnaG5I0CAAAAAAXpkVDM7i19nwAAAABAwYRQKGb3NGGbAAAA AEDBpFgoaPcxaZcAAAAAwMK0YChm723aHgEAAACAgonhUMze08QtAgAAAAAFk+OhoL2PyTsEAAAA ABamB0Qx+17T9wcAAAAAFAiJ3wTt69keAAAAAFAiJv4maJ/P5gAAAACAl4iKf4nZ57A1AAAAAOAt 4uL/BO1j2BgAAAAA8BGRcU3Qfo9tAQAAAACHEBvrBO0amwIAAAAADiU6vk7Qfs6WAAAAAIBTiI+f EbVtCAAAAAA4mQh5jGlB224AAAAAgMsIksdLjdq2AgAAAADcQpw8X+ewbR8AAAAAwO2EyuvtHLbt AQAAAADYjnC5hzvitrcHAAAAAFr4AqIf2nUeyyd8AAAAAElFTkSuQmCC "
       id="image71-3"
       x="66.007683"
       y="2.750031" />
    <text
       xml:space="preserve"
       style="font-size:3.88056px;line-height:1.25;font-family:sans-serif;word-spacing:0px;stroke-width:0.264583"
       x="104.73135"
       y="9.2759409"
       id="text77-1"><tspan
         sodipodi:role="line"
         id="tspan75-9"
         x="104.73135"
         y="9.2759409"
         style="stroke-width:0.264583">Broker (9092)</tspan></text>
    <text
       xml:space="preserve"
       style="font-size:3.52778px;line-height:1.25;font-family:sans-serif;word-spacing:0px;stroke-width:0.264583"
       x="88.945518"
       y="22.380447"
       id="text891-7-6-4"><tspan
         sodipodi:role="line"
         id="tspan889-3-2-7"
         x="88.945518"
         y="22.380447"
         style="font-size:3.52778px;stroke-width:0.264583">Users Topic</tspan></text>
    <rect
       style="fill:none;stroke:#000000;stroke-width:0.5;stroke-miterlimit:4;stroke-dasharray:none"
       id="rect883-3-2-9-8"
       width="68.063576"
       height="50.526257"
       x="65.188797"
       y="18.694824" />
    <path
       style="fill:none;stroke:#000000;stroke-width:0.5;stroke-linecap:butt;stroke-linejoin:miter;stroke-miterlimit:4;stroke-dasharray:none;stroke-opacity:1"
       d="M 64.978534,23.662764 H 133.3045"
       id="path957-4" />
    <rect
       style="fill:#ffffff;stroke:#000000;stroke-width:0.5;stroke-miterlimit:4;stroke-dasharray:none"
       id="rect1408-50"
       width="28.954128"
       height="40.057396"
       x="67.694443"
       y="26.250198" />
    <rect
       style="fill:#ffffff;stroke:#000000;stroke-width:0.5;stroke-miterlimit:4;stroke-dasharray:none"
       id="rect1408-5-3"
       width="28.954128"
       height="40.057396"
       x="101.86374"
       y="26.250198" />
    <path
       style="fill:none;stroke:#000000;stroke-width:0.5;stroke-linecap:butt;stroke-linejoin:miter;stroke-miterlimit:4;stroke-dasharray:none;stroke-opacity:1"
       d="M 67.626608,32.146834 H 96.723726"
       id="path1454-61" />
    <path
       style="fill:none;stroke:#000000;stroke-width:0.5;stroke-linecap:butt;stroke-linejoin:miter;stroke-miterlimit:4;stroke-dasharray:none;stroke-opacity:1"
       d="m 101.67141,32.146834 h 29.09711"
       id="path1454-6-0" />
    <text
       xml:space="preserve"
       style="font-size:3.88056px;line-height:1.25;font-family:sans-serif;word-spacing:0px;stroke-width:0.264583"
       x="71.198845"
       y="30.355423"
       id="text1478-6"><tspan
         sodipodi:role="line"
         id="tspan1476-3"
         x="71.198845"
         y="30.355423"
         style="stroke-width:0.264583">Patition A-M</tspan></text>
    <text
       xml:space="preserve"
       style="font-size:3.88056px;line-height:1.25;font-family:sans-serif;word-spacing:0px;stroke-width:0.264583"
       x="103.77625"
       y="30.383949"
       id="text1482-2"><tspan
         sodipodi:role="line"
         id="tspan1480-0"
         x="103.77625"
         y="30.383949"
         style="stroke-width:0.264583">Partition N-Z</tspan></text>
    <rect
       style="fill:#ffffff;stroke:#000000;stroke-width:0.499999;stroke-miterlimit:4;stroke-dasharray:none"
       id="rect969-5-2-6"
       width="24.87842"
       height="4.5117064"
       x="69.725838"
       y="35.019234" />
    <text
       xml:space="preserve"
       style="font-size:3.14569px;line-height:1.25;font-family:sans-serif;word-spacing:0px;stroke-width:0.214478"
       x="77.577225"
       y="38.187866"
       id="text973-3-9-1"><tspan
         sodipodi:role="line"
         id="tspan971-5-1-5"
         x="77.577225"
         y="38.187866"
         style="stroke-width:0.214478">Carla</tspan></text>
    <rect
       style="fill:#ffffff;stroke:#000000;stroke-width:0.499999;stroke-miterlimit:4;stroke-dasharray:none"
       id="rect969-6-2-5"
       width="24.87842"
       height="4.5117064"
       x="69.725838"
       y="41.455833" />
    <text
       xml:space="preserve"
       style="font-size:3.14569px;line-height:1.25;font-family:sans-serif;word-spacing:0px;stroke-width:0.214478"
       x="78.41642"
       y="44.624466"
       id="text973-2-7-4"><tspan
         sodipodi:role="line"
         id="tspan971-9-0-7"
         x="78.41642"
         y="44.624466"
         style="stroke-width:0.214478">João</tspan></text>
    <rect
       style="fill:#ffffff;stroke:#000000;stroke-width:0.499999;stroke-miterlimit:4;stroke-dasharray:none"
       id="rect969-6-9-6"
       width="24.87842"
       height="4.5117064"
       x="103.80218"
       y="35.019234" />
    <text
       xml:space="preserve"
       style="font-size:3.14569px;line-height:1.25;font-family:sans-serif;word-spacing:0px;stroke-width:0.214478"
       x="109.90423"
       y="38.187851"
       id="text973-2-3-5"><tspan
         sodipodi:role="line"
         id="tspan971-9-6-6"
         x="109.90423"
         y="38.187851"
         style="stroke-width:0.214478">Oswaldo</tspan></text>
    <rect
       style="fill:#ffffff;stroke:#000000;stroke-width:0.499999;stroke-miterlimit:4;stroke-dasharray:none"
       id="rect969-6-0-9"
       width="24.87842"
       height="4.5117064"
       x="103.84134"
       y="41.455833" />
    <text
       xml:space="preserve"
       style="font-size:3.14569px;line-height:1.25;font-family:sans-serif;word-spacing:0px;stroke-width:0.214478"
       x="110.27799"
       y="44.624443"
       id="text973-2-6-3"><tspan
         sodipodi:role="line"
         id="tspan971-9-2-7"
         x="110.27799"
         y="44.624443"
         style="stroke-width:0.214478">Ronaldo</tspan></text>
    <rect
       style="fill:#ffffff;stroke:#000000;stroke-width:0.499999;stroke-miterlimit:4;stroke-dasharray:none"
       id="rect969-61-4"
       width="24.87842"
       height="4.5117064"
       x="69.725838"
       y="47.625519" />
    <text
       xml:space="preserve"
       style="font-size:3.14569px;line-height:1.25;font-family:sans-serif;word-spacing:0px;stroke-width:0.214478"
       x="78.51236"
       y="50.794136"
       id="text973-8-5"><tspan
         sodipodi:role="line"
         id="tspan971-79-2"
         x="78.51236"
         y="50.794136"
         style="stroke-width:0.214478">José</tspan></text>
  </g>
</svg>
