{
    "name": "Logic.States",
    "rootNamespace": "",
    "references": [
        "GUID:0d8beb7f090555447a6cf5ce9e54dbb4",
        "GUID:5dc3d285832e39a4f8620b8754b40896"
    ],
    "includePlatforms": [],
    "excludePlatforms": [],
    "allowUnsafeCode": false,
    "overrideReferences": false,
    "precompiledReferences": [],
    "autoReferenced": true,
    "defineConstraints": [],
    "versionDefines": [],
    "noEngineReferences": false
}