%YAML 1.1
%TAG !u! tag:unity3d.com,2011:
--- !u!1001 &2918733202838462513
PrefabInstance:
  m_ObjectHideFlags: 0
  serializedVersion: 2
  m_Modification:
    m_TransformParent: {fileID: 0}
    m_Modifications:
    - target: {fileID: -690322820716332814, guid: 89fc3977bae01404388b1a2fcc6b5f41, type: 3}
      propertyPath: _poolKey
      value: archer_base
      objectReference: {fileID: 0}
    - target: {fileID: 4286829527521793506, guid: 89fc3977bae01404388b1a2fcc6b5f41, type: 3}
      propertyPath: m_Controller
      value: 
      objectReference: {fileID: 22100000, guid: 5ce6af21c32941b4fbb447936698b4a5, type: 2}
    - target: {fileID: 8241129919209666386, guid: 89fc3977bae01404388b1a2fcc6b5f41, type: 3}
      propertyPath: m_RootOrder
      value: 0
      objectReference: {fileID: 0}
    - target: {fileID: 8241129919209666386, guid: 89fc3977bae01404388b1a2fcc6b5f41, type: 3}
      propertyPath: m_LocalEulerAnglesHint.x
      value: 0
      objectReference: {fileID: 0}
    - target: {fileID: 8241129919209666386, guid: 89fc3977bae01404388b1a2fcc6b5f41, type: 3}
      propertyPath: m_LocalEulerAnglesHint.y
      value: 0
      objectReference: {fileID: 0}
    - target: {fileID: 8241129919209666386, guid: 89fc3977bae01404388b1a2fcc6b5f41, type: 3}
      propertyPath: m_LocalEulerAnglesHint.z
      value: 0
      objectReference: {fileID: 0}
    - target: {fileID: 8241129919209666387, guid: 89fc3977bae01404388b1a2fcc6b5f41, type: 3}
      propertyPath: m_Name
      value: P_Archer_Base
      objectReference: {fileID: 0}
    m_RemovedComponents: []
  m_SourcePrefab: {fileID: 100100000, guid: 89fc3977bae01404388b1a2fcc6b5f41, type: 3}
