%YAML 1.1
%TAG !u! tag:unity3d.com,2011:
--- !u!114 &11400000
MonoBehaviour:
  m_ObjectHideFlags: 0
  m_CorrespondingSourceObject: {fileID: 0}
  m_PrefabInstance: {fileID: 0}
  m_PrefabAsset: {fileID: 0}
  m_GameObject: {fileID: 0}
  m_Enabled: 1
  m_EditorHideFlags: 0
  m_Script: {fileID: 11500000, guid: e9c7a07a83ea42bd820a27b93c61e50e, type: 3}
  m_Name: SO_Item_Grenade
  m_EditorClassIdentifier: 
  serializationData:
    SerializedFormat: 2
    SerializedBytes: 
    ReferencedUnityObjects: []
    SerializedBytesString: 
    Prefab: {fileID: 0}
    PrefabModificationsReferencedUnityObjects: []
    PrefabModifications: []
    SerializationNodes:
    - Name: _components
      Entry: 7
      Data: 0|Game.Items.Components.ItemComponent[], Game.Items
    - Name: 
      Entry: 12
      Data: 1
    - Name: 
      Entry: 7
      Data: 1|Game.Items.Components.StackComponent, Game.Items
    - Name: 
      Entry: 8
      Data: 
    - Name: 
      Entry: 13
      Data: 
    - Name: 
      Entry: 8
      Data: 
  _id: item_grenade
  _meta:
    _name: Gold
    _description: Bang-bang in one motion
    _icon: {fileID: 0}
