%YAML 1.1
%TAG !u! tag:unity3d.com,2011:
--- !u!114 &11400000
MonoBehaviour:
  m_ObjectHideFlags: 0
  m_CorrespondingSourceObject: {fileID: 0}
  m_PrefabInstance: {fileID: 0}
  m_PrefabAsset: {fileID: 0}
  m_GameObject: {fileID: 0}
  m_Enabled: 1
  m_EditorHideFlags: 0
  m_Script: {fileID: 11500000, guid: 8c42134ca9b0451488a0e809dbd27420, type: 3}
  m_Name: SO_Player_Red
  m_EditorClassIdentifier: 
  _name: Red
  _color: 0
  _heroes:
  - {fileID: 11400000, guid: 6c2a36c68b4461a4fbab3725bcba9724, type: 2}
  - {fileID: 11400000, guid: 6fce07f639909624087cef62a365538f, type: 2}
  - {fileID: 11400000, guid: 5ceafe5399ff104429deecb6aea62e2d, type: 2}
  - {fileID: 11400000, guid: 4bce014ddeedc2d468bf184f4c19c5b6, type: 2}
