%YAML 1.1
%TAG !u! tag:unity3d.com,2011:
--- !u!114 &11400000
MonoBehaviour:
  m_ObjectHideFlags: 0
  m_CorrespondingSourceObject: {fileID: 0}
  m_PrefabInstance: {fileID: 0}
  m_PrefabAsset: {fileID: 0}
  m_GameObject: {fileID: 0}
  m_Enabled: 1
  m_EditorHideFlags: 0
  m_Script: {fileID: 11500000, guid: e9c7a07a83ea42bd820a27b93c61e50e, type: 3}
  m_Name: SO_Item_Equip_Body_1
  m_EditorClassIdentifier: 
  serializationData:
    SerializedFormat: 2
    SerializedBytes: 
    ReferencedUnityObjects:
    - {fileID: 11400000, guid: 71c9af8362e52fa4b8a67c842158a89e, type: 2}
    - {fileID: 11400000, guid: 57e6cb2b3ed1f744db8b840f484c3124, type: 2}
    SerializedBytesString: 
    Prefab: {fileID: 0}
    PrefabModificationsReferencedUnityObjects: []
    PrefabModifications: []
    SerializationNodes:
    - Name: _components
      Entry: 7
      Data: 0|Game.Items.Components.ItemComponent[], Game.Items
    - Name: 
      Entry: 12
      Data: 3
    - Name: 
      Entry: 7
      Data: 1|Game.Items.Components.EquipmentComponent, Game.Items
    - Name: _type
      Entry: 3
      Data: 1
    - Name: 
      Entry: 8
      Data: 
    - Name: 
      Entry: 7
      Data: 2|Game.Items.Components.StatAffectComponent, Game.Items
    - Name: _stat
      Entry: 10
      Data: 0
    - Name: _affectType
      Entry: 3
      Data: 1
    - Name: _value
      Entry: 4
      Data: 2
    - Name: 
      Entry: 8
      Data: 
    - Name: 
      Entry: 7
      Data: 3|Game.Items.Components.StatAffectComponent, Game.Items
    - Name: _stat
      Entry: 10
      Data: 1
    - Name: _affectType
      Entry: 3
      Data: 1
    - Name: _value
      Entry: 4
      Data: -1
    - Name: 
      Entry: 8
      Data: 
    - Name: 
      Entry: 13
      Data: 
    - Name: 
      Entry: 8
      Data: 
  _id: equip_body_cool_armor
  _meta:
    _name: Cool Armor
    _description: To cool to be true
    _icon: {fileID: 0}
