%YAML 1.1
%TAG !u! tag:unity3d.com,2011:
--- !u!1001 &1737414019471153398
PrefabInstance:
  m_ObjectHideFlags: 0
  serializedVersion: 2
  m_Modification:
    m_TransformParent: {fileID: 0}
    m_Modifications:
    - target: {fileID: -2920119508871511015, guid: 7abfb19faaf1147e9816d9c6709f4689, type: 3}
      propertyPath: serializedData.Animator
      value: 
      objectReference: {fileID: 5737197939333532245}
    - target: {fileID: -2920119508871511015, guid: 7abfb19faaf1147e9816d9c6709f4689, type: 3}
      propertyPath: serializedData.Transform
      value: 
      objectReference: {fileID: 5117112085631506360}
    - target: {fileID: -1541513340673767854, guid: 7abfb19faaf1147e9816d9c6709f4689, type: 3}
      propertyPath: serializedData.Config
      value: 
      objectReference: {fileID: 11400000, guid: 48b432ff844f16744bc4eee226a213eb, type: 2}
    - target: {fileID: -214150437047124505, guid: 7abfb19faaf1147e9816d9c6709f4689, type: 3}
      propertyPath: _config
      value: 
      objectReference: {fileID: 11400000, guid: 48b432ff844f16744bc4eee226a213eb, type: 2}
    - target: {fileID: 981802089077454633, guid: 7abfb19faaf1147e9816d9c6709f4689, type: 3}
      propertyPath: m_Name
      value: P_TownHall_Blue
      objectReference: {fileID: 0}
    - target: {fileID: 6854243942854037326, guid: 7abfb19faaf1147e9816d9c6709f4689, type: 3}
      propertyPath: m_RootOrder
      value: 0
      objectReference: {fileID: 0}
    - target: {fileID: 6854243942854037326, guid: 7abfb19faaf1147e9816d9c6709f4689, type: 3}
      propertyPath: m_LocalPosition.x
      value: -8
      objectReference: {fileID: 0}
    - target: {fileID: 6854243942854037326, guid: 7abfb19faaf1147e9816d9c6709f4689, type: 3}
      propertyPath: m_LocalPosition.y
      value: 0
      objectReference: {fileID: 0}
    - target: {fileID: 6854243942854037326, guid: 7abfb19faaf1147e9816d9c6709f4689, type: 3}
      propertyPath: m_LocalPosition.z
      value: 0
      objectReference: {fileID: 0}
    - target: {fileID: 6854243942854037326, guid: 7abfb19faaf1147e9816d9c6709f4689, type: 3}
      propertyPath: m_LocalRotation.w
      value: 0.7071068
      objectReference: {fileID: 0}
    - target: {fileID: 6854243942854037326, guid: 7abfb19faaf1147e9816d9c6709f4689, type: 3}
      propertyPath: m_LocalRotation.x
      value: -0
      objectReference: {fileID: 0}
    - target: {fileID: 6854243942854037326, guid: 7abfb19faaf1147e9816d9c6709f4689, type: 3}
      propertyPath: m_LocalRotation.y
      value: 0.7071068
      objectReference: {fileID: 0}
    - target: {fileID: 6854243942854037326, guid: 7abfb19faaf1147e9816d9c6709f4689, type: 3}
      propertyPath: m_LocalRotation.z
      value: -0
      objectReference: {fileID: 0}
    - target: {fileID: 6854243942854037326, guid: 7abfb19faaf1147e9816d9c6709f4689, type: 3}
      propertyPath: m_LocalEulerAnglesHint.x
      value: 0
      objectReference: {fileID: 0}
    - target: {fileID: 6854243942854037326, guid: 7abfb19faaf1147e9816d9c6709f4689, type: 3}
      propertyPath: m_LocalEulerAnglesHint.y
      value: 90
      objectReference: {fileID: 0}
    - target: {fileID: 6854243942854037326, guid: 7abfb19faaf1147e9816d9c6709f4689, type: 3}
      propertyPath: m_LocalEulerAnglesHint.z
      value: 0
      objectReference: {fileID: 0}
    m_RemovedComponents: []
  m_SourcePrefab: {fileID: 100100000, guid: 7abfb19faaf1147e9816d9c6709f4689, type: 3}
--- !u!4 &5117112085631506360 stripped
Transform:
  m_CorrespondingSourceObject: {fileID: 6854243942854037326, guid: 7abfb19faaf1147e9816d9c6709f4689, type: 3}
  m_PrefabInstance: {fileID: 1737414019471153398}
  m_PrefabAsset: {fileID: 0}
--- !u!95 &5737197939333532245 stripped
Animator:
  m_CorrespondingSourceObject: {fileID: 6305628784578564771, guid: 7abfb19faaf1147e9816d9c6709f4689, type: 3}
  m_PrefabInstance: {fileID: 1737414019471153398}
  m_PrefabAsset: {fileID: 0}
