%YAML 1.1
%TAG !u! tag:unity3d.com,2011:
--- !u!114 &11400000
MonoBehaviour:
  m_ObjectHideFlags: 0
  m_CorrespondingSourceObject: {fileID: 0}
  m_PrefabInstance: {fileID: 0}
  m_PrefabAsset: {fileID: 0}
  m_GameObject: {fileID: 0}
  m_Enabled: 1
  m_EditorHideFlags: 0
  m_Script: {fileID: 11500000, guid: c2bb081a495feec44ab23ed60e2a7ed1, type: 3}
  m_Name: SO_TownHall_Blue
  m_EditorClassIdentifier: 
  serializationData:
    SerializedFormat: 2
    SerializedBytes: 
    ReferencedUnityObjects:
    - {fileID: 11400000, guid: c158226b2fd60734da64ba9bb9b21f02, type: 2}
    - {fileID: 7157401258665180231, guid: 95d81ce0c1ea57f49a6f602fd2c96e17, type: 3}
    - {fileID: 11400000, guid: 28622098f80ef644bb64d87d3fe56e00, type: 2}
    - {fileID: 5021044846915273929, guid: b6412bbcf49f6e1448ce9fa9cb7ae2e1, type: 3}
    SerializedBytesString: 
    Prefab: {fileID: 0}
    PrefabModificationsReferencedUnityObjects: []
    PrefabModifications: []
    SerializationNodes:
    - Name: _producableUnits
      Entry: 7
      Data: 0|System.Collections.Generic.Dictionary`2[[Game.Unit.Configs.UnitConfig,
        Assembly-CSharp],[Essentials.PoolObject, AKerp.Essentials]], mscorlib
    - Name: comparer
      Entry: 7
      Data: 1|System.Collections.Generic.ObjectEqualityComparer`1[[Game.Unit.Configs.UnitConfig,
        Assembly-CSharp]], mscorlib
    - Name: 
      Entry: 8
      Data: 
    - Name: 
      Entry: 12
      Data: 2
    - Name: 
      Entry: 7
      Data: 
    - Name: $k
      Entry: 10
      Data: 0
    - Name: $v
      Entry: 10
      Data: 1
    - Name: 
      Entry: 8
      Data: 
    - Name: 
      Entry: 7
      Data: 
    - Name: $k
      Entry: 10
      Data: 2
    - Name: $v
      Entry: 10
      Data: 3
    - Name: 
      Entry: 8
      Data: 
    - Name: 
      Entry: 13
      Data: 
    - Name: 
      Entry: 8
      Data: 
  _hp: 10
  _radius: 3.5
  _team: {fileID: 11400000, guid: f6931c50dedd1324bae4d1f8d749fc7a, type: 2}
