%YAML 1.1
%TAG !u! tag:unity3d.com,2011:
--- !u!114 &11400000
MonoBehaviour:
  m_ObjectHideFlags: 0
  m_CorrespondingSourceObject: {fileID: 0}
  m_PrefabInstance: {fileID: 0}
  m_PrefabAsset: {fileID: 0}
  m_GameObject: {fileID: 0}
  m_Enabled: 1
  m_EditorHideFlags: 0
  m_Script: {fileID: 11500000, guid: d08730eed4484cc1ac9f8037ef2f28a0, type: 3}
  m_Name: SO_Upgrade_Speed
  m_EditorClassIdentifier: 
  serializationData:
    SerializedFormat: 2
    SerializedBytes: 
    ReferencedUnityObjects:
    - {fileID: 11400000, guid: d8846047fa827204189454e8b96281a9, type: 2}
    SerializedBytesString: 
    Prefab: {fileID: 0}
    PrefabModificationsReferencedUnityObjects: []
    PrefabModifications: []
    SerializationNodes:
    - Name: _statTable
      Entry: 7
      Data: 0|AKerp.Upgrades.Impl.UpgradeSpeedTable, AKerp.Upgrades.Impl
    - Name: _dataOnLevel
      Entry: 7
      Data: 1|System.Collections.Generic.Dictionary`2[[System.Int32, mscorlib],[System.Int32,
        mscorlib]], mscorlib
    - Name: comparer
      Entry: 7
      Data: 2|System.Collections.Generic.GenericEqualityComparer`1[[System.Int32,
        mscorlib]], mscorlib
    - Name: 
      Entry: 8
      Data: 
    - Name: 
      Entry: 12
      Data: 5
    - Name: 
      Entry: 7
      Data: 
    - Name: $k
      Entry: 3
      Data: 1
    - Name: $v
      Entry: 3
      Data: 5
    - Name: 
      Entry: 8
      Data: 
    - Name: 
      Entry: 7
      Data: 
    - Name: $k
      Entry: 3
      Data: 2
    - Name: $v
      Entry: 3
      Data: 6
    - Name: 
      Entry: 8
      Data: 
    - Name: 
      Entry: 7
      Data: 
    - Name: $k
      Entry: 3
      Data: 3
    - Name: $v
      Entry: 3
      Data: 7
    - Name: 
      Entry: 8
      Data: 
    - Name: 
      Entry: 7
      Data: 
    - Name: $k
      Entry: 3
      Data: 4
    - Name: $v
      Entry: 3
      Data: 8
    - Name: 
      Entry: 8
      Data: 
    - Name: 
      Entry: 7
      Data: 
    - Name: $k
      Entry: 3
      Data: 5
    - Name: $v
      Entry: 3
      Data: 10
    - Name: 
      Entry: 8
      Data: 
    - Name: 
      Entry: 13
      Data: 
    - Name: 
      Entry: 8
      Data: 
    - Name: _minSpeed
      Entry: 3
      Data: 4
    - Name: _maxSpeed
      Entry: 3
      Data: 10
    - Name: 
      Entry: 8
      Data: 
    - Name: _requirementsPerLevel
      Entry: 7
      Data: 3|System.Collections.Generic.Dictionary`2[[System.Int32, mscorlib],[AKerp.Upgrades.Requirements.UpgradeRequirement[],
        Game]], mscorlib
    - Name: comparer
      Entry: 7
      Data: 4|System.Collections.Generic.GenericEqualityComparer`1[[System.Int32,
        mscorlib]], mscorlib
    - Name: 
      Entry: 8
      Data: 
    - Name: 
      Entry: 12
      Data: 2
    - Name: 
      Entry: 7
      Data: 
    - Name: $k
      Entry: 3
      Data: 3
    - Name: $v
      Entry: 7
      Data: 5|AKerp.Upgrades.Requirements.UpgradeRequirement[], Game
    - Name: 
      Entry: 12
      Data: 1
    - Name: 
      Entry: 7
      Data: 6|AKerp.Upgrades.Requirements.UpgradeLevelRequirement, Game
    - Name: _lockingUpgradeLevels
      Entry: 7
      Data: 7|System.Collections.Generic.List`1[[AKerp.Upgrades.Requirements.UpgradeLevelData,
        Game]], mscorlib
    - Name: 
      Entry: 12
      Data: 1
    - Name: 
      Entry: 7
      Data: 8|AKerp.Upgrades.Requirements.UpgradeLevelData, Game
    - Name: _upgrade
      Entry: 10
      Data: 0
    - Name: _level
      Entry: 3
      Data: 4
    - Name: 
      Entry: 8
      Data: 
    - Name: 
      Entry: 13
      Data: 
    - Name: 
      Entry: 8
      Data: 
    - Name: 
      Entry: 8
      Data: 
    - Name: 
      Entry: 13
      Data: 
    - Name: 
      Entry: 8
      Data: 
    - Name: 
      Entry: 8
      Data: 
    - Name: 
      Entry: 7
      Data: 
    - Name: $k
      Entry: 3
      Data: 5
    - Name: $v
      Entry: 7
      Data: 9|AKerp.Upgrades.Requirements.UpgradeRequirement[], Game
    - Name: 
      Entry: 12
      Data: 1
    - Name: 
      Entry: 7
      Data: 10|AKerp.Upgrades.Requirements.UpgradeLevelRequirement, Game
    - Name: _lockingUpgradeLevels
      Entry: 7
      Data: 11|System.Collections.Generic.List`1[[AKerp.Upgrades.Requirements.UpgradeLevelData,
        Game]], mscorlib
    - Name: 
      Entry: 12
      Data: 1
    - Name: 
      Entry: 7
      Data: 12|AKerp.Upgrades.Requirements.UpgradeLevelData, Game
    - Name: _upgrade
      Entry: 10
      Data: 0
    - Name: _level
      Entry: 3
      Data: 5
    - Name: 
      Entry: 8
      Data: 
    - Name: 
      Entry: 13
      Data: 
    - Name: 
      Entry: 8
      Data: 
    - Name: 
      Entry: 8
      Data: 
    - Name: 
      Entry: 13
      Data: 
    - Name: 
      Entry: 8
      Data: 
    - Name: 
      Entry: 8
      Data: 
    - Name: 
      Entry: 13
      Data: 
    - Name: 
      Entry: 8
      Data: 
  _id: upgrade_speed
  _maxLevel: 5
  _priceTable:
    _basePrice: 2
    _pricePower: 3
