{
    "name": "Otus.Environment",
    "rootNamespace": "",
    "references": [
        "GUID:25a9df42577d273469178cf014f81bbf"
    ],
    "includePlatforms": [],
    "excludePlatforms": [],
    "allowUnsafeCode": false,
    "overrideReferences": false,
    "precompiledReferences": [],
    "autoReferenced": true,
    "defineConstraints": [],
    "versionDefines": [],
    "noEngineReferences": false
}