3
{"Name":"Эксперт1","FieldOfActivity":"Строительство","Contacts":"expert@mail.ru,8(913)111-11-11","Info":"ffffff","competent":11}
{"Name":"Эксперт2","FieldOfActivity":"Область1","Contacts":"88005553535","Info":"тест","competent":9}
{"Name":"Эксперт3","FieldOfActivity":"1","Contacts":"2234","Info":"","competent":9}
