<svg width="30" height="30" viewBox="0 0 36 36" fill="none" xmlns="http://www.w3.org/2000/svg">
<circle cx="18" cy="18" r="5.66667" stroke="#FCFCFC" stroke-width="2"/>
<path d="M16.2845 2.44624C17.0611 1.15027 18.939 1.15027 19.7156 2.44624L21.748 5.83789C22.2009 6.59369 23.0951 6.96406 23.9497 6.74988L27.7851 5.78874C29.2506 5.42148 30.5785 6.7494 30.2113 8.21491L29.2501 12.0503C29.036 12.905 29.4063 13.7991 30.1621 14.252L33.5538 16.2844C34.8497 17.061 34.8497 18.939 33.5538 19.7155L30.1621 21.7479C29.4063 22.2008 29.036 23.095 29.2501 23.9497L30.2113 27.785C30.5785 29.2506 29.2506 30.5785 27.7851 30.2112L23.9497 29.2501C23.0951 29.0359 22.2009 29.4063 21.748 30.1621L19.7156 33.5537C18.939 34.8497 17.0611 34.8497 16.2845 33.5537L14.2521 30.1621C13.7992 29.4063 12.905 29.0359 12.0504 29.2501L8.21497 30.2112C6.74946 30.5785 5.42154 29.2506 5.7888 27.785L6.74994 23.9497C6.96412 23.095 6.59375 22.2008 5.83795 21.7479L2.4463 19.7155C1.15034 18.939 1.15034 17.061 2.4463 16.2844L5.83795 14.252C6.59375 13.7991 6.96412 12.905 6.74994 12.0503L5.7888 8.21491C5.42154 6.7494 6.74946 5.42148 8.21497 5.78874L12.0504 6.74988C12.905 6.96406 13.7992 6.59369 14.2521 5.83789L16.2845 2.44624Z" stroke="#FCFCFC" stroke-width="2"/>
</svg>
