 -0.837084	  2.372120	  1.689152
 -0.828796	  2.348634	  1.672428
 -0.805429	  2.312731	  1.665861
 -0.782273	  2.267836	  1.654229
 -0.769875	  2.225676	  1.640235
 -0.747620	  2.178520	  1.625240
 -0.722994	  2.127943	  1.614151
 -0.707097	  2.090379	  1.601994
 -0.684875	  2.041590	  1.584279
 -0.671893	  2.002455	  1.573935
 -0.644556	  1.954030	  1.562147
 -0.628455	  1.906582	  1.552530
 -0.612414	  1.870013	  1.540397
 -0.592890	  1.826101	  1.527275
 -0.573235	  1.774821	  1.512594
 -0.551563	  1.732625	  1.503356
 -0.528838	  1.693897	  1.484970
 -0.513699	  1.641354	  1.479952
 -0.485665	  1.602693	  1.471069
 -0.457483	  1.562898	  1.464055
 -0.439522	  1.517595	  1.450713
 -0.403687	  1.479076	  1.453744
 -0.407086	  1.428621	  1.421500
 -0.364852	  1.383312	  1.427370
 -0.344028	  1.339205	  1.413571
 -0.334996	  1.298043	  1.381166
 -0.282056	  1.257073	  1.414882
 -0.300494	  1.207704	  1.358897
 -0.273796	  1.156904	  1.385242
 -0.241210	  1.128170	  1.326151
 -0.237868	  1.063324	  1.348446
 -0.206277	  1.034152	  1.324801
 -0.199905	  0.991875	  1.286148
 -0.180862	  0.934955	  1.302083
 -0.163337	  0.899508	  1.279346
 -0.143277	  0.850357	  1.258299
 -0.134410	  0.808733	  1.242056
 -0.117547	  0.757742	  1.221236
 -0.096880	  0.712735	  1.207933
 -0.081476	  0.670404	  1.197500
 -0.063510	  0.628721	  1.186294
 -0.044065	  0.582746	  1.173356
 -0.018131	  0.534717	  1.158966
  0.001342	  0.491066	  1.148179
  0.019665	  0.451606	  1.139298
  0.038083	  0.407232	  1.123343
  0.058326	  0.365376	  1.113351
  0.079243	  0.320251	  1.095539
  0.085188	  0.277320	  1.084913
  0.090515	  0.228510	  1.047497
  0.106484	  0.182128	  1.032670
  0.130063	  0.134831	  1.017395
  0.144312	  0.100503	  1.003697
  0.168904	  0.048157	  0.990399
  0.183201	  0.000669	  0.977013
  0.208168	 -0.036333	  0.969549
  0.223378	 -0.085923	  0.945018
  0.248235	 -0.127911	  0.953159
  0.266447	 -0.172591	  0.932860
  0.290658	 -0.216167	  0.929491
  0.328848	 -0.258983	  0.934656
  0.347402	 -0.305493	  0.920118
  0.369846	 -0.346786	  0.913084
  0.387936	 -0.394913	  0.897816
  0.407724	 -0.437666	  0.884698
  0.428903	 -0.474947	  0.873563
  0.450648	 -0.522036	  0.860083
  0.465511	 -0.570521	  0.845377
  0.483414	 -0.615980	  0.838405
  0.507632	 -0.660242	  0.817029
  0.525430	 -0.702209	  0.808872
  0.546957	 -0.742408	  0.792026
  0.562031	 -0.787473	  0.780835
  0.583339	 -0.828104	  0.770334
  0.606191	 -0.878075	  0.759208
  0.625970	 -0.923916	  0.750347
  0.638481	 -0.967137	  0.736788
  0.665676	 -1.009488	  0.723637
  0.680895	 -1.052706	  0.704889
  0.696860	 -1.095984	  0.694647
  0.724101	 -1.141526	  0.679180
  0.737613	 -1.188341	  0.669553
  0.761423	 -1.234331	  0.660425
  0.781759	 -1.277471	  0.643187
  0.800173	 -1.315280	  0.632013
  0.819652	 -1.366807	  0.622265
  0.834126	 -1.404446	  0.606100
  0.851111	 -1.453180	  0.608349
  0.857123	 -1.509331	  0.625823
  0.877204	 -1.562950	  0.610450
  0.896963	 -1.608381	  0.598042
  0.915406	 -1.649426	  0.582617
  0.940631	 -1.697608	  0.566456
  0.959244	 -1.734240	  0.555424
  0.984322	 -1.768815	  0.534120
  1.009810	 -1.809702	  0.496572
  1.034781	 -1.850797	  0.477780
  1.052237	 -1.892615	  0.466473
  1.074555	 -1.934532	  0.461842
  1.093563	 -1.987774	  0.445314
  1.111614	 -2.031841	  0.429517
  1.128558	 -2.071436	  0.414503
  1.148543	 -2.114365	  0.408084
  1.173691	 -2.156611	  0.392613
  1.187592	 -2.202060	  0.384760
  1.208821	 -2.252918	  0.371703
  1.232580	 -2.293760	  0.357532
  1.245320	 -2.342030	  0.347248
  1.266382	 -2.379755	  0.327646
  1.283517	 -2.425559	  0.316768
  1.310459	 -2.474061	  0.305663
  1.322518	 -2.509921	  0.292732
  1.345328	 -2.557032	  0.279032
  1.367059	 -2.599275	  0.267319
  1.379353	 -2.652278	  0.250612
  1.393146	 -2.678801	  0.253118
