  1.768726	 -1.715394	  0.000852
  1.791724	 -1.730087	 -0.004658
  1.773949	 -1.723527	 -0.000436
  1.758544	 -1.711916	  0.003360
  1.742300	 -1.706232	  0.007852
  1.725369	 -1.695624	  0.015820
  1.707619	 -1.674889	  0.020034
  1.691137	 -1.659134	  0.018610
  1.680853	 -1.651831	  0.016330
  1.660577	 -1.637174	  0.011051
  1.645327	 -1.626902	  0.010829
  1.628834	 -1.614838	  0.013612
  1.612862	 -1.593798	  0.017272
  1.606349	 -1.584883	  0.017640
  1.596283	 -1.567718	  0.018020
  1.582579	 -1.548453	  0.017044
  1.571864	 -1.534496	  0.017816
  1.558347	 -1.516758	  0.018023
  1.546926	 -1.497517	  0.017640
  1.541496	 -1.487393	  0.018260
  1.525492	 -1.472652	  0.019270
  1.510868	 -1.448505	  0.019057
  1.502512	 -1.437007	  0.017685
  1.497054	 -1.423610	  0.016136
  1.491262	 -1.402254	  0.011522
  1.483211	 -1.382860	  0.007630
  1.481328	 -1.352149	  0.003302
  1.487754	 -1.329107	  0.006327
  1.494915	 -1.314630	  0.013135
  1.501345	 -1.303752	  0.023637
  1.505488	 -1.285031	  0.034652
  1.509013	 -1.269706	  0.048666
  1.512644	 -1.256954	  0.063435
  1.516448	 -1.243951	  0.077738
  1.519785	 -1.234512	  0.093799
  1.521388	 -1.233712	  0.113579
  1.522222	 -1.233772	  0.133665
  1.522620	 -1.234868	  0.153697
  1.522640	 -1.236969	  0.173826
  1.522560	 -1.242048	  0.193217
  1.518149	 -1.247836	  0.211741
  1.512060	 -1.253079	  0.230822
  1.509861	 -1.257530	  0.250717
  1.514069	 -1.259385	  0.273612
  1.524254	 -1.264352	  0.293489
  1.535033	 -1.268227	  0.311218
  1.541884	 -1.272616	  0.329590
  1.543151	 -1.277329	  0.348967
  1.541704	 -1.281720	  0.367875
  1.539832	 -1.287094	  0.385016
  1.539830	 -1.288628	  0.404396
  1.540054	 -1.285443	  0.423408
  1.540697	 -1.278505	  0.442454
  1.532662	 -1.268578	  0.461514
  1.519580	 -1.260446	  0.475387
  1.506233	 -1.254996	  0.486731
  1.491222	 -1.249034	  0.502433
  1.478034	 -1.239999	  0.516137
  1.464626	 -1.226720	  0.524127
  1.450628	 -1.211893	  0.528218
  1.435454	 -1.197779	  0.527333
  1.420786	 -1.181871	  0.526144
  1.406156	 -1.168003	  0.522156
  1.391652	 -1.155229	  0.517272
  1.378121	 -1.141186	  0.513070
  1.363394	 -1.128140	  0.508021
  1.347734	 -1.115919	  0.503470
  1.329595	 -1.105684	  0.500169
  1.310475	 -1.096035	  0.499230
  1.291174	 -1.090017	  0.499029
  1.272326	 -1.083728	  0.499093
  1.253120	 -1.077797	  0.498747
  1.233935	 -1.072469	  0.498281
  1.214929	 -1.065974	  0.498537
  1.194860	 -1.062440	  0.499454
  1.174762	 -1.058444	  0.501929
  1.154612	 -1.057448	  0.504861
  1.135001	 -1.056068	  0.508476
  1.114931	 -1.056287	  0.511067
  1.094513	 -1.056685	  0.513785
  1.073224	 -1.058180	  0.516743
  1.052858	 -1.060486	  0.519548
  1.033017	 -1.064392	  0.521297
  1.013008	 -1.068410	  0.523203
  0.992920	 -1.073017	  0.526152
  0.974220	 -1.075669	  0.530126
  0.959721	 -1.073514	  0.530461
  0.950775	 -1.071875	  0.527940
  0.934349	 -1.065917	  0.520233
  0.917618	 -1.056021	  0.511212
  0.902917	 -1.043791	  0.502953
  0.889613	 -1.032784	  0.493113
  0.877508	 -1.021897	  0.481458
  0.865437	 -1.010606	  0.469621
  0.855240	 -0.999369	  0.456386
  0.845594	 -0.988535	  0.442444
  0.836272	 -0.977800	  0.428481
  0.827737	 -0.966462	  0.414333
  0.819079	 -0.955276	  0.400115
  0.810447	 -0.944179	  0.386122
  0.801821	 -0.932675	  0.372084
  0.792838	 -0.921745	  0.358000
  0.783535	 -0.910666	  0.344297
  0.773403	 -0.899647	  0.331871
  0.761846	 -0.889542	  0.322437
  0.749465	 -0.879323	  0.313053
  0.734384	 -0.868657	  0.305834
  0.719042	 -0.857912	  0.299355
  0.703886	 -0.846577	  0.294805
  0.689189	 -0.835630	  0.292973
  0.674084	 -0.825381	  0.290071
  0.657616	 -0.814448	  0.289905
  0.640987	 -0.803260	  0.290797
  0.624846	 -0.791449	  0.292058
  0.608998	 -0.779694	  0.293774
  0.593297	 -0.768249	  0.296531
  0.577237	 -0.757496	  0.298685
  0.560871	 -0.747062	  0.302381
  0.544504	 -0.736763	  0.307070
  0.528471	 -0.726359	  0.312048
  0.512081	 -0.716606	  0.317478
  0.495325	 -0.707453	  0.323362
  0.478897	 -0.698057	  0.329624
  0.462076	 -0.688780	  0.335288
  0.445448	 -0.679495	  0.341547
  0.429396	 -0.669688	  0.348307
  0.413779	 -0.659006	  0.354622
  0.397929	 -0.648013	  0.360271
  0.382116	 -0.636073	  0.364230
  0.366781	 -0.623482	  0.368708
  0.351166	 -0.610916	  0.371869
  0.335406	 -0.598503	  0.374241
  0.319791	 -0.586348	  0.375688
  0.304347	 -0.573731	  0.377654
  0.288624	 -0.561678	  0.379456
  0.273257	 -0.550112	  0.380883
  0.259567	 -0.538862	  0.379319
  0.240445	 -0.525957	  0.380440
  0.219969	 -0.517577	  0.388982
  0.200471	 -0.509690	  0.397636
  0.189212	 -0.505161	  0.401812
  0.170995	 -0.494159	  0.406987
  0.159285	 -0.477522	  0.410875
  0.149167	 -0.456469	  0.418352
  0.138463	 -0.439337	  0.425603
  0.130209	 -0.426712	  0.429966
  0.119714	 -0.409374	  0.437403
  0.101066	 -0.390534	  0.447601
  0.087205	 -0.381648	  0.451275
  0.076317	 -0.375756	  0.452914
  0.052054	 -0.365167	  0.462897
  0.030609	 -0.353284	  0.472022
  0.019104	 -0.346437	  0.475487
  0.003768	 -0.337138	  0.479916
 -0.016644	 -0.322060	  0.485857
 -0.029949	 -0.311582	  0.488643
 -0.043476	 -0.300940	  0.490026
 -0.059002	 -0.284420	  0.491051
 -0.074381	 -0.270602	  0.492043
 -0.090140	 -0.258187	  0.493410
 -0.106150	 -0.246028	  0.495086
 -0.121841	 -0.233775	  0.497594
 -0.136763	 -0.221871	  0.500830
 -0.151187	 -0.210227	  0.504933
 -0.166146	 -0.198804	  0.509431
 -0.180697	 -0.187169	  0.516258
 -0.194744	 -0.176107	  0.523787
 -0.208837	 -0.164936	  0.532021
 -0.222904	 -0.153674	  0.540790
 -0.237378	 -0.142494	  0.549378
 -0.251673	 -0.130835	  0.557293
 -0.265902	 -0.118607	  0.564722
 -0.280294	 -0.106043	  0.571523
 -0.294565	 -0.093016	  0.577667
 -0.308387	 -0.079206	  0.582915
 -0.321718	 -0.064854	  0.587256
 -0.334624	 -0.051243	  0.593804
 -0.350833	 -0.037012	  0.599877
 -0.367817	 -0.023282	  0.603330
 -0.382570	 -0.010861	  0.601796
 -0.393586	  0.001233	  0.598171
 -0.405317	  0.017823	  0.596105
 -0.426467	  0.036749	  0.597724
 -0.445776	  0.045201	  0.598709
 -0.458966	  0.049498	  0.599700
 -0.481791	  0.059770	  0.600278
 -0.495906	  0.069284	  0.600093
 -0.507877	  0.081971	  0.599235
 -0.524601	  0.099587	  0.598568
 -0.539443	  0.112857	  0.599790
 -0.552660	  0.124476	  0.600928
 -0.572231	  0.138380	  0.602484
 -0.589187	  0.144786	  0.603732
 -0.610017	  0.151233	  0.606301
 -0.628390	  0.161378	  0.609659
 -0.641193	  0.172184	  0.609934
 -0.659757	  0.190304	  0.610277
 -0.669659	  0.202380	  0.611141
 -0.679976	  0.217188	  0.612570
 -0.695512	  0.236604	  0.615942
 -0.707872	  0.249249	  0.621188
 -0.722379	  0.261685	  0.628145
 -0.749720	  0.274418	  0.637803
 -0.762745	  0.279622	  0.641719
 -0.773515	  0.285363	  0.643503
 -0.793479	  0.298145	  0.644643
 -0.812322	  0.307779	  0.646594
 -0.829069	  0.316140	  0.652387
 -0.850874	  0.328246	  0.658465
 -0.865036	  0.336482	  0.657450
 -0.877390	  0.345214	  0.655624
 -0.896870	  0.358469	  0.652672
 -0.918160	  0.370054	  0.652157
 -0.930005	  0.380062	  0.654206
 -0.942484	  0.394785	  0.659901
 -0.963379	  0.411824	  0.672861
 -0.983184	  0.419800	  0.682828
 -0.998182	  0.421661	  0.685890
 -1.016548	  0.421922	  0.689694
 -1.039615	  0.426195	  0.692952
 -1.057208	  0.435403	  0.696422
 -1.073988	  0.448734	  0.698130
 -1.089629	  0.462682	  0.700166
 -1.103266	  0.474588	  0.705125
 -1.116624	  0.489473	  0.709991
 -1.130656	  0.503958	  0.715181
 -1.143289	  0.518253	  0.720257
 -1.153832	  0.534748	  0.724736
 -1.164697	  0.552137	  0.729900
 -1.177917	  0.567244	  0.735630
 -1.194489	  0.579014	  0.742528
 -1.211792	  0.590865	  0.749935
 -1.223229	  0.601444	  0.756685
 -1.233067	  0.613595	  0.764172
 -1.247647	  0.629113	  0.777596
 -1.263575	  0.643168	  0.789396
 -1.276742	  0.652803	  0.794150
 -1.289074	  0.662067	  0.797664
 -1.311197	  0.673323	  0.799902
 -1.331180	  0.683980	  0.803822
 -1.348604	  0.692978	  0.808569
 -1.361197	  0.703353	  0.812869
 -1.372394	  0.712242	  0.818903
 -1.387506	  0.721718	  0.831587
 -1.403344	  0.731909	  0.843020
 -1.424754	  0.746571	  0.852233
 -1.440505	  0.759184	  0.855179
 -1.449423	  0.766678	  0.857625
 -1.467850	  0.778351	  0.860414
 -1.486983	  0.791796	  0.865138
 -1.498542	  0.801866	  0.869450
 -1.515206	  0.814674	  0.872443
 -1.533815	  0.825134	  0.882160
 -1.548769	  0.834466	  0.894188
 -1.561414	  0.843357	  0.906650
 -1.575653	  0.853937	  0.916456
 -1.594226	  0.864047	  0.925564
 -1.609689	  0.873829	  0.934243
 -1.620371	  0.882597	  0.939433
 -1.634083	  0.899903	  0.941956
 -1.646667	  0.918011	  0.942510
 -1.660396	  0.933865	  0.942590
 -1.675039	  0.948182	  0.941121
 -1.690970	  0.962255	  0.940082
 -1.706681	  0.973738	  0.941762
 -1.723203	  0.985112	  0.946166
 -1.738047	  0.997673	  0.954419
 -1.752819	  1.010689	  0.960575
 -1.768064	  1.020804	  0.965622
 -1.785463	  1.029163	  0.967713
 -1.802186	  1.041092	  0.967488
 -1.818025	  1.057420	  0.966622
 -1.831230	  1.073949	  0.969842
 -1.843512	  1.087553	  0.974673
 -1.858705	  1.098041	  0.982001
 -1.876280	  1.105441	  0.988673
 -1.895528	  1.113705	  0.994376
 -1.912795	  1.124268	  0.997739
 -1.930020	  1.135617	  1.000220
 -1.946419	  1.146579	  1.001351
 -1.963219	  1.159746	  0.999590
 -1.979565	  1.171093	  1.001605
