 -0.810481	  2.745421	  0.993319
 -0.802457	  2.718239	  0.983484
 -0.787827	  2.682884	  0.957122
 -0.776471	  2.647674	  0.925061
 -0.768920	  2.605002	  0.898797
 -0.762051	  2.568232	  0.865297
 -0.750864	  2.532851	  0.833234
 -0.742155	  2.496043	  0.802554
 -0.732938	  2.459085	  0.770212
 -0.722456	  2.421463	  0.737111
 -0.710790	  2.383736	  0.705202
 -0.697728	  2.347375	  0.673820
 -0.685515	  2.311084	  0.643588
 -0.674496	  2.273760	  0.613962
 -0.664784	  2.235134	  0.583846
 -0.656548	  2.196248	  0.553580
 -0.649361	  2.157751	  0.522592
 -0.642673	  2.120005	  0.490584
 -0.634862	  2.083532	  0.457220
 -0.625337	  2.047671	  0.423421
 -0.613828	  2.012334	  0.390127
 -0.599921	  1.976293	  0.358000
 -0.583885	  1.938179	  0.328439
 -0.566158	  1.898565	  0.303039
 -0.547610	  1.857778	  0.282287
 -0.528667	  1.815136	  0.266822
 -0.510434	  1.771152	  0.255945
 -0.494077	  1.727918	  0.249312
 -0.480206	  1.688043	  0.246660
 -0.465440	  1.643944	  0.248034
 -0.448705	  1.588668	  0.255400
 -0.433162	  1.521086	  0.266349
 -0.423125	  1.444498	  0.276208
 -0.415077	  1.370091	  0.284357
 -0.405531	  1.305212	  0.288105
 -0.396571	  1.247630	  0.285163
 -0.387821	  1.186415	  0.275368
 -0.376526	  1.119233	  0.256634
 -0.363927	  1.056597	  0.230998
 -0.351475	  1.000514	  0.197532
 -0.341014	  0.948480	  0.158479
 -0.333326	  0.905907	  0.114127
 -0.326594	  0.870053	  0.068870
 -0.321679	  0.840601	  0.007114
 -0.312334	  0.818214	 -0.070626
 -0.301132	  0.808638	 -0.138802
 -0.297648	  0.807925	 -0.190361
 -0.292440	  0.815297	 -0.248236
 -0.284257	  0.825671	 -0.319210
 -0.271391	  0.829906	 -0.392433
 -0.257361	  0.822633	 -0.460128
 -0.246569	  0.803548	 -0.516176
 -0.237370	  0.777399	 -0.559725
 -0.229202	  0.746269	 -0.598038
 -0.222388	  0.710141	 -0.632154
 -0.216276	  0.670093	 -0.662092
 -0.210500	  0.626990	 -0.688254
 -0.205164	  0.582610	 -0.710539
 -0.199470	  0.538118	 -0.729629
 -0.191364	  0.494926	 -0.745497
 -0.179965	  0.452875	 -0.758627
 -0.159999	  0.398964	 -0.772986
 -0.120026	  0.319495	 -0.791569
 -0.066263	  0.232443	 -0.809465
 -0.027552	  0.169935	 -0.822160
 -0.010889	  0.142796	 -0.829393
 -0.002108	  0.126008	 -0.837027
  0.005058	  0.107812	 -0.849745
  0.010688	  0.086712	 -0.871690
  0.014146	  0.060529	 -0.909946
  0.009978	  0.029121	 -0.981723
 -0.002014	  0.005470	 -1.071914
 -0.013307	 -0.014547	 -1.144782
 -0.017679	 -0.034738	 -1.194312
 -0.017049	 -0.059277	 -1.236413
 -0.012587	 -0.089983	 -1.275880
 -0.004466	 -0.125371	 -1.311730
  0.006140	 -0.162841	 -1.344253
  0.018439	 -0.201435	 -1.374941
  0.032227	 -0.239265	 -1.404035
  0.046848	 -0.276373	 -1.432143
  0.061762	 -0.314302	 -1.460697
  0.076716	 -0.352013	 -1.489501
  0.091417	 -0.389182	 -1.518497
  0.105806	 -0.426469	 -1.548452
  0.119684	 -0.464349	 -1.579705
  0.132553	 -0.503189	 -1.611396
  0.144553	 -0.542125	 -1.642591
  0.155296	 -0.580708	 -1.672586
  0.165039	 -0.619821	 -1.702531
  0.174090	 -0.658840	 -1.731228
  0.181927	 -0.699473	 -1.760321
  0.187741	 -0.740688	 -1.788261
  0.192430	 -0.781683	 -1.815031
  0.198784	 -0.822859	 -1.841935
  0.207741	 -0.862960	 -1.869436
  0.218089	 -0.902179	 -1.897905
  0.229338	 -0.940799	 -1.926801
  0.242171	 -0.979841	 -1.955749
  0.256128	 -1.018751	 -1.984339
  0.268772	 -1.057314	 -2.013803
  0.280271	 -1.094894	 -2.045555
  0.291852	 -1.132339	 -2.078196
  0.303005	 -1.170242	 -2.110385
  0.312035	 -1.207178	 -2.142696
  0.324836	 -1.238571	 -2.178757
  0.335092	 -1.276356	 -2.208600
  0.349429	 -1.312486	 -2.239000
  0.357179	 -1.352624	 -2.267532
  0.371548	 -1.390656	 -2.297693
  0.383592	 -1.432627	 -2.324525
  0.391831	 -1.468704	 -2.359222
  0.400385	 -1.507486	 -2.389272
  0.410810	 -1.545297	 -2.420384
  0.423919	 -1.584644	 -2.451251
  0.430869	 -1.625411	 -2.484430
  0.435177	 -1.641665	 -2.509274
