 -0.560391	 -1.907856	  1.417112
 -0.562379	 -1.917245	  1.436049
 -0.560507	 -1.908399	  1.418210
 -0.557496	 -1.899488	  1.400559
 -0.552280	 -1.890536	  1.383452
 -0.547063	 -1.881584	  1.366346
 -0.541131	 -1.872749	  1.349411
 -0.534678	 -1.864010	  1.332619
 -0.528225	 -1.855270	  1.315827
 -0.521935	 -1.846707	  1.298883
 -0.515646	 -1.838145	  1.281938
 -0.509873	 -1.829627	  1.264788
 -0.504578	 -1.821154	  1.247462
 -0.499591	 -1.812660	  1.230056
 -0.496052	 -1.804095	  1.212333
 -0.492513	 -1.795529	  1.194609
 -0.490609	 -1.786215	  1.177014
 -0.488823	 -1.776849	  1.159433
 -0.487529	 -1.767066	  1.142037
 -0.486518	 -1.757049	  1.124756
 -0.485464	 -1.746966	  1.107516
 -0.484299	 -1.736720	  1.090379
 -0.483134	 -1.726474	  1.073242
 -0.481328	 -1.716073	  1.056255
 -0.479343	 -1.705630	  1.039314
 -0.477182	 -1.695227	  1.022370
 -0.474207	 -1.685017	  1.005431
 -0.471233	 -1.674808	  0.988493
 -0.467844	 -1.664820	  0.971500
 -0.463991	 -1.655088	  0.954458
 -0.460137	 -1.645356	  0.937415
 -0.455754	 -1.635938	  0.920324
 -0.451206	 -1.626621	  0.903222
 -0.446588	 -1.617363	  0.886105
 -0.441541	 -1.608478	  0.868913
 -0.436493	 -1.599593	  0.851721
 -0.431297	 -1.590997	  0.834426
 -0.425924	 -1.582756	  0.817013
 -0.420550	 -1.574515	  0.799600
 -0.415213	 -1.566855	  0.781913
 -0.409892	 -1.559425	  0.764123
 -0.404571	 -1.551995	  0.746333
 -0.399902	 -1.545467	  0.728014
 -0.395275	 -1.538998	  0.709663
 -0.391492	 -1.532977	  0.690970
 -0.389737	 -1.528073	  0.671660
 -0.387932	 -1.523071	  0.652380
 -0.385300	 -1.516469	  0.633685
 -0.382663	 -1.509760	  0.615030
 -0.379993	 -1.502432	  0.596613
 -0.376400	 -1.494510	  0.578604
 -0.372125	 -1.486162	  0.560939
 -0.366577	 -1.476703	  0.544214
 -0.361023	 -1.467239	  0.527493
 -0.354935	 -1.457414	  0.511171
 -0.347284	 -1.446581	  0.496201
 -0.339633	 -1.435748	  0.481231
 -0.331982	 -1.424915	  0.466260
 -0.322067	 -1.413395	  0.453261
 -0.311084	 -1.401628	  0.441390
 -0.300100	 -1.389862	  0.429520
 -0.289116	 -1.378096	  0.417649
 -0.278133	 -1.366330	  0.405778
 -0.266140	 -1.355695	  0.393816
 -0.253273	 -1.346167	  0.381831
 -0.240406	 -1.336638	  0.369845
 -0.227539	 -1.327110	  0.357860
 -0.214672	 -1.317581	  0.345875
 -0.201805	 -1.308053	  0.333889
 -0.185410	 -1.301078	  0.324804
 -0.167635	 -1.295602	  0.317451
 -0.149860	 -1.290126	  0.310098
 -0.132086	 -1.284649	  0.302744
 -0.114311	 -1.279173	  0.295391
 -0.096209	 -1.274690	  0.288165
 -0.077224	 -1.276531	  0.282151
 -0.058238	 -1.278373	  0.276136
 -0.039253	 -1.280214	  0.270122
 -0.020268	 -1.282055	  0.264108
 -0.002508	 -1.283925	  0.255104
  0.013228	 -1.285766	  0.242897
  0.019808	 -1.275740	  0.226892
  0.016767	 -1.260536	  0.214258
  0.013423	 -1.244355	  0.202989
  0.009951	 -1.227776	  0.192355
  0.006479	 -1.211196	  0.181722
  0.004024	 -1.194158	  0.171541
  0.002024	 -1.176934	  0.161574
  0.001025	 -1.159423	  0.151963
  0.000731	 -1.141741	  0.142621
  0.000770	 -1.123997	  0.133394
  0.001148	 -1.106194	  0.124288
  0.001526	 -1.088392	  0.115182
  0.001903	 -1.070589	  0.106076
  0.000495	 -1.052657	  0.097331
 -0.000980	 -1.034724	  0.088601
 -0.002455	 -1.016790	  0.079871
 -0.003929	 -0.998856	  0.071142
 -0.005404	 -0.980923	  0.062412
 -0.008377	 -0.963114	  0.053809
 -0.012804	 -0.945526	  0.045379
 -0.017230	 -0.927938	  0.036948
 -0.021656	 -0.910350	  0.028518
 -0.027758	 -0.893524	  0.019593
 -0.035706	 -0.877757	  0.010201
 -0.043655	 -0.861989	  0.000809
 -0.052969	 -0.847283	 -0.009040
 -0.064725	 -0.834982	 -0.019550
 -0.076480	 -0.822680	 -0.030060
 -0.088236	 -0.810378	 -0.040570
 -0.101123	 -0.799393	 -0.051213
 -0.115984	 -0.791304	 -0.061877
 -0.130845	 -0.783215	 -0.072541
 -0.145705	 -0.775126	 -0.083205
 -0.160566	 -0.767037	 -0.093869
 -0.176540	 -0.761981	 -0.104792
 -0.192781	 -0.757927	 -0.115736
 -0.209023	 -0.753873	 -0.126680
 -0.225403	 -0.750772	 -0.137729
 -0.241964	 -0.751023	 -0.148939
 -0.258525	 -0.751274	 -0.160149
 -0.274782	 -0.754591	 -0.171317
 -0.290720	 -0.759505	 -0.182355
 -0.306658	 -0.764420	 -0.193392
 -0.322595	 -0.769334	 -0.204430
 -0.335587	 -0.777819	 -0.217049
 -0.347138	 -0.787628	 -0.230100
 -0.358690	 -0.797437	 -0.243152
 -0.370241	 -0.807246	 -0.256204
 -0.381792	 -0.817055	 -0.269256
 -0.393344	 -0.826864	 -0.282308
 -0.404895	 -0.836673	 -0.295359
 -0.413728	 -0.846980	 -0.310048
 -0.416480	 -0.857475	 -0.326849
 -0.419232	 -0.867971	 -0.343650
 -0.421984	 -0.878466	 -0.360451
 -0.424737	 -0.888962	 -0.377252
 -0.427489	 -0.899458	 -0.394052
 -0.430241	 -0.909953	 -0.410853
 -0.432994	 -0.920449	 -0.427654
 -0.435746	 -0.930944	 -0.444455
 -0.435769	 -0.938005	 -0.463167
 -0.434512	 -0.943315	 -0.482408
 -0.433254	 -0.948626	 -0.501649
 -0.431996	 -0.953936	 -0.520890
 -0.430738	 -0.959246	 -0.540131
 -0.429481	 -0.964556	 -0.559372
 -0.427481	 -0.967902	 -0.578989
 -0.424132	 -0.967403	 -0.598700
 -0.420784	 -0.966904	 -0.618412
 -0.417435	 -0.966405	 -0.638123
 -0.413547	 -0.965610	 -0.657725
 -0.406990	 -0.963334	 -0.676482
 -0.400433	 -0.961057	 -0.695239
 -0.393120	 -0.958770	 -0.713713
 -0.382192	 -0.956481	 -0.730307
 -0.371264	 -0.954192	 -0.746900
 -0.358707	 -0.952228	 -0.762342
 -0.344180	 -0.950729	 -0.776006
 -0.329653	 -0.949229	 -0.789671
 -0.315125	 -0.947730	 -0.803335
 -0.299214	 -0.945943	 -0.815320
 -0.283169	 -0.944126	 -0.827120
 -0.267123	 -0.942310	 -0.838920
 -0.251077	 -0.940494	 -0.850719
 -0.235031	 -0.938677	 -0.862519
 -0.219099	 -0.935698	 -0.874236
 -0.203524	 -0.930576	 -0.885690
 -0.187949	 -0.925455	 -0.897144
 -0.172375	 -0.920333	 -0.908598
 -0.156800	 -0.915211	 -0.920052
 -0.141225	 -0.910089	 -0.931506
 -0.125943	 -0.904751	 -0.943252
 -0.112400	 -0.898289	 -0.956474
 -0.098858	 -0.891827	 -0.969697
 -0.085315	 -0.885364	 -0.982919
 -0.077381	 -0.880284	 -1.000561
 -0.082919	 -0.879092	 -1.019742
 -0.095070	 -0.880241	 -1.035586
 -0.109878	 -0.879620	 -1.049015
 -0.125258	 -0.878559	 -1.061756
 -0.140639	 -0.877499	 -1.074496
 -0.156019	 -0.876439	 -1.087237
 -0.172114	 -0.872517	 -1.098444
 -0.188390	 -0.863949	 -1.106297
 -0.204666	 -0.855380	 -1.114149
 -0.220942	 -0.846812	 -1.122002
 -0.237218	 -0.838243	 -1.129855
 -0.253494	 -0.829675	 -1.137708
 -0.269770	 -0.821106	 -1.145561
 -0.285655	 -0.812130	 -1.153753
 -0.299074	 -0.801083	 -1.163647
 -0.312494	 -0.790037	 -1.173542
 -0.325913	 -0.778991	 -1.183437
 -0.339332	 -0.767945	 -1.193331
 -0.352752	 -0.756899	 -1.203226
 -0.365909	 -0.745710	 -1.213310
 -0.373597	 -0.732550	 -1.226260
 -0.381284	 -0.719390	 -1.239211
 -0.388971	 -0.706230	 -1.252162
 -0.396659	 -0.693070	 -1.265112
 -0.402120	 -0.680047	 -1.279275
 -0.406252	 -0.667200	 -1.294036
 -0.410384	 -0.654353	 -1.308796
 -0.414150	 -0.641627	 -1.323758
 -0.416554	 -0.629397	 -1.339400
 -0.418959	 -0.617167	 -1.355041
 -0.421172	 -0.605099	 -1.370835
 -0.422781	 -0.593556	 -1.387089
 -0.424391	 -0.582014	 -1.403342
 -0.425793	 -0.570734	 -1.419799
 -0.426945	 -0.559779	 -1.436492
 -0.428096	 -0.548824	 -1.453185
 -0.429061	 -0.538384	 -1.470216
 -0.429980	 -0.528074	 -1.487330
 -0.430892	 -0.517947	 -1.504552
 -0.431786	 -0.508367	 -1.522085
 -0.432680	 -0.498787	 -1.539619
 -0.434072	 -0.489680	 -1.557371
 -0.435562	 -0.480669	 -1.575163
 -0.437394	 -0.471907	 -1.593048
 -0.439922	 -0.463666	 -1.611095
 -0.442449	 -0.455424	 -1.629142
 -0.445304	 -0.448202	 -1.647573
 -0.448277	 -0.441364	 -1.666131
 -0.451250	 -0.434525	 -1.684689
 -0.453796	 -0.429172	 -1.703790
 -0.456337	 -0.423832	 -1.722896
 -0.458818	 -0.418754	 -1.742081
 -0.460935	 -0.415249	 -1.761657
 -0.463051	 -0.411743	 -1.781233
 -0.464967	 -0.408364	 -1.800853
 -0.465925	 -0.405594	 -1.820637
 -0.466883	 -0.402823	 -1.840421
 -0.467615	 -0.399849	 -1.860185
 -0.466831	 -0.395533	 -1.879698
 -0.466048	 -0.391218	 -1.899211
 -0.464884	 -0.386027	 -1.918490
 -0.462985	 -0.379161	 -1.937179
 -0.461087	 -0.372296	 -1.955867
 -0.458514	 -0.363867	 -1.973821
 -0.455817	 -0.355153	 -1.991620
 -0.452963	 -0.345910	 -2.009125
 -0.449933	 -0.336072	 -2.026272
 -0.446917	 -0.326184	 -2.043393
 -0.444006	 -0.315929	 -2.060315
 -0.441095	 -0.305674	 -2.077238
 -0.438201	 -0.295199	 -2.094027
 -0.435316	 -0.284610	 -2.110747
 -0.432405	 -0.274051	 -2.127481
 -0.429381	 -0.263621	 -2.144276
 -0.426356	 -0.253191	 -2.161071
 -0.423401	 -0.243044	 -2.178050
 -0.420483	 -0.233043	 -2.195123
 -0.418078	 -0.223242	 -2.212390
 -0.416906	 -0.213951	 -2.230063
 -0.416192	 -0.204791	 -2.247827
 -0.417365	 -0.196225	 -2.265862
 -0.418587	 -0.187636	 -2.283882
 -0.420529	 -0.178720	 -2.301679
 -0.422470	 -0.169804	 -2.319476
 -0.424192	 -0.160425	 -2.337056
 -0.425818	 -0.150845	 -2.354537
 -0.427364	 -0.141238	 -2.372011
 -0.428042	 -0.131349	 -2.389381
 -0.428720	 -0.121459	 -2.406752
 -0.429398	 -0.111570	 -2.424123
 -0.430046	 -0.101081	 -2.442584
 -0.430180	 -0.091304	 -2.460031
