  0.731560	  1.193142	  2.187975
  0.747531	  1.206460	  2.196116
  0.733024	  1.194717	  2.188929
  0.717286	  1.184212	  2.182451
  0.701548	  1.173708	  2.175973
  0.686742	  1.161747	  2.169830
  0.672010	  1.149684	  2.163713
  0.657277	  1.137620	  2.157596
  0.643886	  1.123953	  2.151775
  0.630601	  1.110172	  2.145979
  0.617316	  1.096390	  2.140183
  0.604508	  1.082331	  2.133995
  0.591731	  1.068255	  2.127782
  0.578877	  1.054258	  2.121547
  0.565849	  1.040447	  2.115260
  0.552777	  1.026674	  2.108982
  0.538982	  1.013553	  2.102853
  0.525188	  1.000432	  2.096725
  0.510421	  0.988487	  2.090459
  0.495645	  0.976555	  2.084192
  0.480776	  0.964787	  2.077834
  0.465871	  0.953084	  2.071440
  0.450966	  0.941381	  2.065046
  0.436783	  0.929261	  2.057838
  0.422749	  0.917063	  2.050473
  0.408714	  0.904865	  2.043108
  0.395075	  0.892532	  2.035243
  0.382660	  0.879880	  2.025981
  0.370245	  0.867227	  2.016718
  0.357830	  0.854575	  2.007456
  0.345983	  0.841875	  1.997539
  0.334364	  0.829163	  1.987370
  0.322745	  0.816450	  1.977202
  0.311302	  0.803829	  1.966726
  0.299920	  0.791240	  1.956143
  0.288542	  0.778662	  1.945545
  0.277228	  0.766289	  1.934641
  0.265913	  0.753917	  1.923737
  0.254675	  0.741563	  1.912732
  0.243547	  0.729239	  1.901585
  0.232419	  0.716914	  1.890437
  0.221499	  0.704285	  1.879425
  0.210644	  0.691564	  1.868454
  0.199777	  0.678750	  1.857605
  0.188879	  0.665669	  1.847112
  0.177981	  0.652587	  1.836618
  0.166912	  0.639322	  1.826544
  0.155822	  0.626036	  1.816518
  0.144538	  0.612728	  1.806744
  0.133128	  0.599406	  1.797133
  0.121440	  0.586142	  1.787782
  0.109401	  0.572958	  1.778768
  0.096992	  0.559756	  1.770298
  0.084206	  0.546553	  1.762413
  0.070900	  0.533379	  1.755384
  0.057362	  0.520231	  1.748762
  0.043437	  0.507094	  1.742975
  0.029440	  0.493961	  1.737352
  0.014887	  0.481080	  1.732628
  0.000292	  0.468222	  1.727976
 -0.013984	  0.455034	  1.723257
 -0.028049	  0.441636	  1.718495
 -0.042114	  0.428238	  1.713733
 -0.055434	  0.414288	  1.708445
 -0.067943	  0.399807	  1.702628
 -0.080452	  0.385326	  1.696812
 -0.093733	  0.371531	  1.691043
 -0.107332	  0.358036	  1.685300
 -0.121073	  0.344810	  1.679279
 -0.134989	  0.331939	  1.672903
 -0.148906	  0.319067	  1.666527
 -0.163406	  0.307097	  1.659710
 -0.177945	  0.295193	  1.652862
 -0.192758	  0.283683	  1.645926
 -0.207778	  0.272485	  1.638925
 -0.222848	  0.261340	  1.631948
 -0.238109	  0.250400	  1.625063
 -0.253370	  0.239460	  1.618178
 -0.268637	  0.228462	  1.611397
 -0.283905	  0.217449	  1.604644
 -0.299119	  0.206323	  1.597954
 -0.314180	  0.194892	  1.591436
 -0.329241	  0.183461	  1.584918
 -0.344070	  0.171665	  1.578516
 -0.358791	  0.159707	  1.572169
 -0.373505	  0.147741	  1.565820
 -0.387779	  0.135303	  1.559373
 -0.402053	  0.122866	  1.552927
 -0.416228	  0.110346	  1.546421
 -0.429742	  0.097305	  1.539542
 -0.443256	  0.084264	  1.532663
 -0.456665	  0.071136	  1.525746
 -0.469327	  0.057418	  1.518570
 -0.481989	  0.043701	  1.511395
 -0.494531	  0.029879	  1.504206
 -0.506553	  0.015630	  1.496965
 -0.518574	  0.001381	  1.489724
 -0.530463	 -0.012912	  1.482349
 -0.542101	 -0.027281	  1.474728
 -0.553739	 -0.041651	  1.467107
 -0.565278	 -0.055855	  1.459041
 -0.576735	 -0.069925	  1.450628
 -0.588193	 -0.083995	  1.442216
 -0.599611	 -0.097546	  1.432943
 -0.611010	 -0.110911	  1.423381
 -0.622420	 -0.124247	  1.413791
 -0.634170	 -0.136516	  1.403235
 -0.645920	 -0.148784	  1.392679
 -0.657964	 -0.160450	  1.381777
 -0.670287	 -0.171495	  1.370546
 -0.682616	 -0.182525	  1.359305
 -0.695374	 -0.192251	  1.347362
 -0.708132	 -0.201977	  1.335419
 -0.721074	 -0.211132	  1.323226
 -0.734166	 -0.219782	  1.310825
 -0.747347	 -0.228221	  1.298373
 -0.760886	 -0.235749	  1.285723
 -0.774445	 -0.243229	  1.273066
 -0.788547	 -0.249241	  1.260221
 -0.802649	 -0.255254	  1.247377
 -0.817044	 -0.259757	  1.234242
 -0.831463	 -0.264104	  1.221082
 -0.845929	 -0.267415	  1.207674
 -0.860402	 -0.269962	  1.194108
 -0.874876	 -0.272508	  1.180543
 -0.889300	 -0.273098	  1.166701
 -0.903714	 -0.273535	  1.152843
 -0.918147	 -0.273821	  1.139000
 -0.932753	 -0.271708	  1.125502
 -0.947359	 -0.269595	  1.112005
 -0.962112	 -0.266892	  1.098774
 -0.977213	 -0.262385	  1.086459
 -0.992314	 -0.257879	  1.074145
 -1.007640	 -0.253163	  1.062192
 -1.023238	 -0.248185	  1.050706
 -1.038836	 -0.243208	  1.039219
 -1.055275	 -0.239968	  1.028299
 -1.071924	 -0.237232	  1.017560
 -1.089076	 -0.236109	  1.007335
 -1.106649	 -0.236899	  0.997817
 -1.124333	 -0.238370	  0.988593
 -1.142216	 -0.242266	  0.980529
 -1.160098	 -0.246162	  0.972464
 -1.177963	 -0.250993	  0.964879
 -1.195749	 -0.256845	  0.957852
 -1.213536	 -0.262696	  0.950825
 -1.231323	 -0.268548	  0.943798
 -1.248496	 -0.275798	  0.936549
 -1.265389	 -0.283604	  0.929221
 -1.282283	 -0.291409	  0.921894
 -1.299176	 -0.299215	  0.914567
 -1.316069	 -0.307020	  0.907240
 -1.331577	 -0.316487	  0.898880
 -1.346660	 -0.326391	  0.890254
 -1.361744	 -0.336294	  0.881629
 -1.376828	 -0.346198	  0.873003
 -1.391912	 -0.356101	  0.864378
 -1.406284	 -0.366655	  0.855319
 -1.418854	 -0.378599	  0.845352
 -1.431423	 -0.390544	  0.835385
 -1.443993	 -0.402488	  0.825418
 -1.456562	 -0.414432	  0.815451
 -1.469128	 -0.426380	  0.805483
 -1.479125	 -0.440157	  0.794984
 -1.489122	 -0.453935	  0.784484
 -1.499119	 -0.467713	  0.773985
 -1.509116	 -0.481490	  0.763486
 -1.518075	 -0.496066	  0.753127
 -1.525793	 -0.511478	  0.742985
 -1.533512	 -0.526891	  0.732843
 -1.541231	 -0.542304	  0.722700
 -1.547317	 -0.559071	  0.713654
 -1.553224	 -0.575968	  0.704732
 -1.558726	 -0.593246	  0.696295
 -1.563081	 -0.611449	  0.689245
 -1.567257	 -0.629806	  0.682493
 -1.570319	 -0.648955	  0.677600
 -1.573376	 -0.668109	  0.672724
 -1.575720	 -0.687763	  0.669859
 -1.578065	 -0.707418	  0.666994
 -1.580325	 -0.727162	  0.664744
 -1.582477	 -0.746990	  0.663264
 -1.584628	 -0.766819	  0.661783
 -1.587192	 -0.786620	  0.660619
 -1.590290	 -0.806364	  0.659867
 -1.593387	 -0.826109	  0.659116
 -1.597152	 -0.845740	  0.658465
 -1.602078	 -0.865118	  0.657990
 -1.607004	 -0.884496	  0.657515
 -1.612918	 -0.903599	  0.657180
 -1.619521	 -0.922476	  0.656944
 -1.626276	 -0.941299	  0.656675
 -1.634004	 -0.959739	  0.656187
 -1.641733	 -0.978179	  0.655699
 -1.650096	 -0.996316	  0.654649
 -1.658552	 -1.014405	  0.653516
 -1.667423	 -1.032260	  0.651938
 -1.676436	 -1.050030	  0.650207
 -1.686022	 -1.067486	  0.648359
 -1.695777	 -1.084844	  0.646477
 -1.706435	 -1.101638	  0.644395
 -1.717176	 -1.118378	  0.642293
 -1.728879	 -1.134382	  0.639663
 -1.740609	 -1.150363	  0.637016
 -1.753247	 -1.165502	  0.633683
 -1.765991	 -1.180532	  0.630266
 -1.779181	 -1.195024	  0.626265
 -1.792599	 -1.209214	  0.621952
 -1.806077	 -1.223290	  0.617456
 -1.819811	 -1.236810	  0.612110
 -1.833545	 -1.250331	  0.606765
 -1.847329	 -1.263582	  0.600899
 -1.861149	 -1.276566	  0.594542
 -1.874969	 -1.289551	  0.588185
 -1.888799	 -1.302253	  0.581301
 -1.902629	 -1.314882	  0.574284
 -1.916436	 -1.327504	  0.567208
 -1.930086	 -1.340072	  0.559743
 -1.943736	 -1.352640	  0.552278
 -1.957224	 -1.365314	  0.544701
 -1.970441	 -1.378163	  0.536940
 -1.983657	 -1.391011	  0.529178
 -1.996599	 -1.404036	  0.521249
 -2.009348	 -1.417180	  0.513206
 -2.022098	 -1.430324	  0.505163
 -2.034686	 -1.443434	  0.496817
 -2.047254	 -1.456540	  0.488434
 -2.059822	 -1.469646	  0.480050
 -2.072389	 -1.482753	  0.471667
 -2.084957	 -1.495859	  0.463284
 -2.104868	 -1.516315	  0.449922
 -2.117503	 -1.529292	  0.441441
