 -1.873467	  1.423087	 -1.037957
 -1.907584	  1.438965	 -1.028730
 -1.890090	  1.431080	 -1.033429
 -1.872027	  1.423530	 -1.037814
 -1.853340	  1.416951	 -1.041534
 -1.833904	  1.410924	 -1.046638
 -1.817710	  1.402824	 -1.054140
 -1.802653	  1.392025	 -1.060995
 -1.785866	  1.382611	 -1.070317
 -1.768279	  1.376536	 -1.078011
 -1.751730	  1.368297	 -1.081401
 -1.734566	  1.358057	 -1.086616
 -1.717273	  1.349027	 -1.092969
 -1.702296	  1.339978	 -1.103183
 -1.689949	  1.328283	 -1.113414
 -1.677828	  1.315677	 -1.123593
 -1.665725	  1.303261	 -1.133311
 -1.653326	  1.290198	 -1.142012
 -1.643405	  1.275941	 -1.152435
 -1.636619	  1.261000	 -1.164759
 -1.631671	  1.246043	 -1.176496
 -1.628008	  1.228866	 -1.187674
 -1.627315	  1.210654	 -1.194572
 -1.628349	  1.191576	 -1.202368
 -1.629300	  1.173081	 -1.209860
 -1.631984	  1.154507	 -1.217100
 -1.635482	  1.135982	 -1.223775
 -1.638997	  1.117455	 -1.230437
 -1.642513	  1.098928	 -1.237099
 -1.646047	  1.080390	 -1.243713
 -1.650259	  1.061582	 -1.247677
 -1.654602	  1.041989	 -1.249251
 -1.659922	  1.022301	 -1.249886
 -1.668447	  1.002517	 -1.251228
 -1.673319	  0.985351	 -1.257278
 -1.677410	  0.965972	 -1.259336
 -1.681606	  0.946073	 -1.260945
 -1.685860	  0.927091	 -1.264767
 -1.688642	  0.907819	 -1.266671
 -1.690446	  0.887838	 -1.267044
 -1.693508	  0.867740	 -1.267589
 -1.696451	  0.848052	 -1.269078
 -1.698541	  0.828267	 -1.270621
 -1.701213	  0.808370	 -1.271290
 -1.704316	  0.788604	 -1.271595
 -1.704995	  0.768621	 -1.271378
 -1.704771	  0.748781	 -1.270825
 -1.704704	  0.729746	 -1.268675
 -1.705426	  0.708631	 -1.264869
 -1.706165	  0.687962	 -1.263908
 -1.706706	  0.670338	 -1.267796
 -1.705675	  0.648114	 -1.273057
 -1.704755	  0.626514	 -1.270665
 -1.699943	  0.609370	 -1.267224
 -1.694784	  0.589177	 -1.266353
 -1.694902	  0.568173	 -1.267574
 -1.690530	  0.548657	 -1.268205
 -1.681744	  0.531960	 -1.271559
 -1.677605	  0.512688	 -1.274057
 -1.671316	  0.490392	 -1.276101
 -1.663359	  0.472600	 -1.279069
 -1.659239	  0.455581	 -1.281403
 -1.648942	  0.437465	 -1.284755
 -1.640300	  0.420034	 -1.285317
 -1.632050	  0.402441	 -1.290082
 -1.622677	  0.385181	 -1.295408
 -1.611444	  0.370722	 -1.301471
 -1.600846	  0.352536	 -1.305520
 -1.587858	  0.335788	 -1.307285
 -1.575791	  0.319752	 -1.309487
 -1.567330	  0.306629	 -1.315196
 -1.553324	  0.292127	 -1.321408
 -1.538724	  0.278549	 -1.326420
 -1.524444	  0.265405	 -1.331246
 -1.509097	  0.253498	 -1.335969
 -1.491829	  0.244433	 -1.340379
 -1.474521	  0.235432	 -1.344784
 -1.457213	  0.226430	 -1.349189
 -1.439855	  0.217591	 -1.353580
 -1.420298	  0.215505	 -1.357035
 -1.400665	  0.213784	 -1.360440
 -1.381032	  0.212069	 -1.363846
 -1.361410	  0.210343	 -1.367234
 -1.341920	  0.208416	 -1.369767
 -1.321903	  0.213402	 -1.369442
 -1.302231	  0.218087	 -1.369549
 -1.283721	  0.224915	 -1.372629
 -1.266114	  0.232713	 -1.375765
 -1.247965	  0.239913	 -1.376920
 -1.229763	  0.249554	 -1.374996
 -1.215600	  0.259759	 -1.370736
 -1.192555	  0.269134	 -1.371889
 -1.176397	  0.278062	 -1.375992
 -1.162010	  0.291370	 -1.373533
 -1.148023	  0.303800	 -1.364802
 -1.131516	  0.317452	 -1.357454
 -1.113285	  0.325527	 -1.361485
 -1.098919	  0.336074	 -1.360000
 -1.081910	  0.351746	 -1.355981
 -1.068994	  0.362122	 -1.351814
 -1.052190	  0.373014	 -1.347475
 -1.034898	  0.385702	 -1.344309
 -1.023805	  0.399987	 -1.337159
 -1.009048	  0.412552	 -1.332338
 -0.993029	  0.425873	 -1.327074
 -0.982857	  0.439072	 -1.320370
 -0.973232	  0.453688	 -1.308490
 -0.956585	  0.468968	 -1.296728
 -0.945835	  0.481840	 -1.290132
 -0.934215	  0.493564	 -1.279595
 -0.918169	  0.501761	 -1.276150
 -0.900193	  0.514708	 -1.273600
 -0.891717	  0.530427	 -1.261240
 -0.878953	  0.541643	 -1.246283
 -0.859705	  0.547648	 -1.243154
 -0.843469	  0.558272	 -1.236726
 -0.833343	  0.575393	 -1.230284
 -0.818497	  0.586794	 -1.222697
 -0.804950	  0.597468	 -1.213073
 -0.792749	  0.605840	 -1.199981
 -0.774922	  0.619206	 -1.192741
 -0.757484	  0.627224	 -1.189047
 -0.746614	  0.637710	 -1.177986
 -0.733519	  0.646631	 -1.164634
 -0.718232	  0.655693	 -1.153854
 -0.704032	  0.662781	 -1.143173
 -0.688358	  0.669748	 -1.132161
 -0.673459	  0.678300	 -1.123144
 -0.657081	  0.685924	 -1.114285
 -0.640540	  0.691767	 -1.103181
 -0.623200	  0.697157	 -1.089657
 -0.608027	  0.708715	 -1.083968
 -0.592109	  0.713368	 -1.079550
 -0.572312	  0.715094	 -1.069517
 -0.554266	  0.717913	 -1.057388
 -0.539602	  0.725080	 -1.049762
 -0.522561	  0.732398	 -1.042469
 -0.501458	  0.732891	 -1.033844
 -0.485455	  0.737503	 -1.027158
 -0.468241	  0.737232	 -1.016599
 -0.451083	  0.736546	 -1.000729
 -0.435991	  0.738251	 -0.990872
 -0.420095	  0.739239	 -0.983613
 -0.398406	  0.738940	 -0.976025
 -0.380740	  0.740027	 -0.970880
 -0.361293	  0.742662	 -0.963574
 -0.341469	  0.738278	 -0.952670
 -0.326883	  0.731261	 -0.948041
 -0.307488	  0.727367	 -0.943577
 -0.287706	  0.722481	 -0.939269
 -0.270221	  0.713901	 -0.933182
 -0.253962	  0.703223	 -0.928943
 -0.237258	  0.692622	 -0.926734
 -0.220411	  0.682128	 -0.926124
 -0.203917	  0.670075	 -0.925633
 -0.189269	  0.658533	 -0.925464
 -0.179114	  0.637911	 -0.926404
 -0.172151	  0.620399	 -0.926373
 -0.152800	  0.609360	 -0.927604
 -0.130266	  0.601134	 -0.925836
 -0.117494	  0.585568	 -0.919007
 -0.107907	  0.568076	 -0.916390
 -0.099206	  0.550673	 -0.920525
 -0.086653	  0.535414	 -0.927336
 -0.074154	  0.519060	 -0.934577
 -0.064164	  0.502589	 -0.938541
 -0.056621	  0.484594	 -0.943069
 -0.047999	  0.467623	 -0.950834
 -0.039456	  0.449748	 -0.955226
 -0.028498	  0.433811	 -0.956575
 -0.019766	  0.417418	 -0.963715
 -0.012748	  0.397592	 -0.971222
 -0.009387	  0.378173	 -0.972354
  0.000073	  0.361245	 -0.972732
  0.008281	  0.344554	 -0.979265
  0.014913	  0.324286	 -0.984412
  0.014113	  0.302042	 -0.984349
  0.024452	  0.286760	 -0.984226
  0.034585	  0.269276	 -0.989441
  0.044464	  0.251482	 -0.990632
  0.046053	  0.227057	 -0.991444
  0.040879	  0.208622	 -1.000366
  0.045136	  0.192901	 -1.015502
  0.050158	  0.174943	 -1.017945
  0.050903	  0.153622	 -1.014681
  0.050468	  0.133777	 -1.012854
  0.050787	  0.110648	 -1.020093
  0.052583	  0.092419	 -1.028935
  0.057196	  0.076439	 -1.040362
  0.064315	  0.057107	 -1.047672
  0.070007	  0.040250	 -1.047050
  0.070939	  0.018268	 -1.048644
  0.068865	 -0.001744	 -1.052317
  0.070781	 -0.020276	 -1.059633
  0.076344	 -0.040747	 -1.063347
  0.079516	 -0.060732	 -1.067361
  0.076593	 -0.078386	 -1.078038
  0.076882	 -0.094400	 -1.090337
  0.079510	 -0.111847	 -1.102247
  0.098129	 -0.121947	 -1.114402
  0.114818	 -0.124901	 -1.127790
  0.114369	 -0.136524	 -1.141981
  0.108802	 -0.153235	 -1.157506
  0.105815	 -0.148255	 -1.182102
  0.119832	 -0.152010	 -1.198801
  0.122956	 -0.153400	 -1.218213
  0.120305	 -0.144870	 -1.239704
  0.123184	 -0.139415	 -1.259943
  0.131881	 -0.136551	 -1.274621
  0.134474	 -0.130543	 -1.293553
  0.133573	 -0.123668	 -1.316517
  0.147988	 -0.121000	 -1.332664
  0.154231	 -0.118090	 -1.351363
  0.161270	 -0.108457	 -1.365910
  0.169094	 -0.099685	 -1.382944
  0.172014	 -0.092056	 -1.402242
  0.181307	 -0.084461	 -1.419342
  0.193655	 -0.075580	 -1.433082
  0.203060	 -0.067061	 -1.449053
  0.216601	 -0.059312	 -1.463834
  0.230992	 -0.060073	 -1.475846
  0.246701	 -0.061185	 -1.488684
  0.270959	 -0.052511	 -1.501042
  0.283057	 -0.044645	 -1.507578
  0.292055	 -0.039420	 -1.524966
  0.310474	 -0.031956	 -1.539528
  0.322803	 -0.027026	 -1.548775
  0.337440	 -0.024934	 -1.559401
  0.358728	 -0.020965	 -1.570745
  0.369757	 -0.017164	 -1.583018
  0.387850	 -0.015381	 -1.592394
  0.405610	 -0.013749	 -1.603401
  0.424292	 -0.010935	 -1.611027
  0.444316	 -0.009349	 -1.614546
  0.462591	 -0.007450	 -1.620128
  0.481686	 -0.007581	 -1.631279
  0.501151	 -0.007287	 -1.641162
  0.518966	 -0.006733	 -1.638425
  0.538507	 -0.005630	 -1.642167
  0.557639	 -0.010567	 -1.652556
  0.577403	 -0.012117	 -1.659116
  0.595416	 -0.012821	 -1.660598
  0.614246	 -0.017974	 -1.668996
  0.630231	 -0.025006	 -1.685302
  0.646295	 -0.025189	 -1.685602
  0.665576	 -0.029615	 -1.692697
  0.683519	 -0.035031	 -1.703631
  0.700555	 -0.040043	 -1.713586
  0.717295	 -0.043041	 -1.723717
  0.729877	 -0.046873	 -1.734993
  0.748682	 -0.051546	 -1.749989
  0.768113	 -0.054924	 -1.756715
  0.787349	 -0.060978	 -1.756952
  0.800172	 -0.068820	 -1.763739
  0.820114	 -0.077833	 -1.767898
  0.838973	 -0.083721	 -1.772171
  0.854691	 -0.089603	 -1.778115
  0.873662	 -0.097780	 -1.780708
  0.893841	 -0.104354	 -1.784802
  0.913070	 -0.109410	 -1.791162
  0.930245	 -0.114554	 -1.792839
  0.950191	 -0.120802	 -1.792611
  0.969559	 -0.125464	 -1.796081
  0.990747	 -0.131249	 -1.800942
  1.005822	 -0.139360	 -1.800144
  1.023306	 -0.148224	 -1.799614
  1.042532	 -0.156874	 -1.802746
  1.060493	 -0.164272	 -1.807398
  1.077575	 -0.172985	 -1.813980
  1.094043	 -0.181979	 -1.821275
  1.110465	 -0.189964	 -1.826470
  1.129698	 -0.197984	 -1.829568
  1.147745	 -0.206795	 -1.835731
  1.164487	 -0.214605	 -1.842282
  1.177728	 -0.224034	 -1.850088
  1.192406	 -0.235333	 -1.863678
  1.213153	 -0.240741	 -1.868516
  1.231736	 -0.245774	 -1.870194
  1.249966	 -0.254986	 -1.870714
  1.266849	 -0.266315	 -1.873279
  1.283175	 -0.276985	 -1.877784
  1.298149	 -0.288851	 -1.883449
  1.315340	 -0.300024	 -1.890784
  1.333113	 -0.307054	 -1.893964
  1.351075	 -0.314797	 -1.894836
  1.371773	 -0.322967	 -1.898148
  1.385864	 -0.333005	 -1.905352
  1.400204	 -0.345819	 -1.911394
  1.416080	 -0.357504	 -1.917447
  1.432346	 -0.367622	 -1.921704
  1.449036	 -0.378637	 -1.924613
  1.467533	 -0.388432	 -1.930506
  1.480356	 -0.399836	 -1.938740
  1.493051	 -0.413237	 -1.944931
  1.508668	 -0.425949	 -1.950992
  1.525771	 -0.435744	 -1.954652
  1.542666	 -0.445966	 -1.957702
  1.558802	 -0.457134	 -1.962013
  1.574570	 -0.468634	 -1.967441
  1.591484	 -0.481028	 -1.973622
  1.606948	 -0.492329	 -1.979381
