 0.0 0.0 0.0 0
 -0.6951739146515814 0.7112979175499947 -0.10406969240387184 1000
 0.6849296508022414 0.6454633942510681 0.3380671237103801 1000
 0.7992121599265041 -0.44915668511842954 -0.3983644005669128 1000
 0.18498785498645282 0.20676537773980586 -0.9611438872903609 1000
 0.8227933825989758 0.5524796460948171 -0.13095911652985728 1000
 0.38218705240576617 -0.06716441250003294 0.9214173856982064 1000
 0.4016367741360734 -0.8962256482237433 -0.18611418303691882 1000
 0.8358994518100852 0.050104158224094086 -0.5470710006866146 1000
 0.0 0.0 0.0 0
 -0.4049636012143597 -0.5879672824893803 -0.7008166353715857 1000
 0.01658073634657256 0.9998826881857292 -0.011031275931876916 1000
 0.03564088815154273 0.6603535082240146 0.7498673024395752 1000
 0.8446813670290366 0.3404551332687217 -0.4124968974731017 1000
 0.053391168518877055 -0.003089126890814281 0.9982979717595547 1000
 -0.7283702331973467 0.2555668427189447 0.6362769776557319 1000
 -0.4950967580978639 -0.7486501106891089 0.4413493082425415 1000
 0.300044945149883 0.8016601660198046 0.5162673814091907 1000
 0.0 0.0 0.0 0
 0.4271192464404082 0.25248407415264307 0.8682954230096229 1000
 -0.49079162204103327 0.3943744976785833 0.7765689533551393 1000
 -0.6822443312207975 0.11437620133277276 -0.7226117609655766 1000
 -0.6962274800444889 -0.6403416438095959 0.322855811832659 1000
 0.6800356421353535 -0.7145059462801215 -0.16413646199399257 1000
 0.37584963307952113 -0.5476573925747433 0.7474854069961653 1000
 -0.7256166629587888 -0.24257006930729028 0.6440894502418182 1000
 -0.5773991097267975 0.7255817800634494 -0.37530034442651067 1000
 0.0 0.0 0.0 0
 -0.2689267400027855 -0.9627627797687384 -0.006421713435356774 1000
 -0.8137934955291367 -0.43206672177192357 -0.3876551232367915 1000
 -0.16501697524212602 0.541293938564334 0.8240511330951802 1000
 -0.3665675711943933 -0.6706295547983858 0.6449986170369375 1000
 -0.25046049508781887 -0.13097123426464405 -0.9589724063785986 1000
 -0.05097665876156429 0.6780610789617482 -0.732979231260161 1000
 -0.37961349740217754 -0.2287452811169541 0.8967486765849239 1000
 -0.33025587622922326 0.8332213643145602 -0.44394393144388267 1000
 0.0 0.0 0.0 0
 0.5972607493313274 0.7825541912595022 -0.1761889186366937 1000
 -0.5482484306793086 -0.3656171390991699 -0.7520989069627834 1000
 -0.7728512266074512 -0.6224293796455053 -0.12018589303853115 1000
 0.05530850914078306 -0.18682691188990436 -0.9805700759304792 1000
 0.8517810694858687 -0.5108616936082534 0.11833570749869424 1000
 -0.031287177720071835 0.9768006151494644 -0.21074076671100053 1000
 0.7350017207860261 0.49328282224922415 -0.46560125398823904 1000
 -0.9666643688288014 -0.23627775395624054 -0.10225859876904814 1000
 0.0 0.0 0.0 0
 0.3591455285739747 -0.8601416477874668 -0.361503575427383 1000
 -0.3920776559346172 0.2515418845254079 0.8843437069636567 1000
 0.9495828538566261 -0.08555528090113122 0.3040027920454573 1000
 0.0038645849938674925 -0.8806766120911433 0.47345197211384704 1000
 0.7858504765641066 -0.1830371451121668 0.5898961196627369 1000
 0.6345156357007231 -0.3869986141825455 -0.6695035329795477 1000
 0.26609472465073564 0.6686624895114148 0.6932193539085922 1000
 -0.8489970580649968 -0.20052882187426518 0.48985323005436965 1000
 0.0 0.0 0.0 0
