 -0.799208	 -1.989770	  1.299138
 -0.799652	 -1.990740	  1.301270
 -0.783936	 -1.979363	  1.286701
 -0.782680	 -1.967563	  1.269243
 -0.784724	 -1.960009	  1.250268
 -0.785464	 -1.953449	  1.237710
 -0.785867	 -1.940715	  1.213308
 -0.786047	 -1.934783	  1.191018
 -0.789581	 -1.925850	  1.174757
 -0.794242	 -1.920497	  1.165480
 -0.800808	 -1.908196	  1.138575
 -0.802959	 -1.903794	  1.121425
 -0.803258	 -1.899545	  1.104403
 -0.797696	 -1.895174	  1.082736
 -0.794934	 -1.889573	  1.063884
 -0.788833	 -1.881154	  1.044375
 -0.783448	 -1.872909	  1.023033
 -0.783408	 -1.864838	  1.007701
 -0.786984	 -1.853601	  0.993116
 -0.791471	 -1.843475	  0.974848
 -0.792276	 -1.834792	  0.957641
 -0.792387	 -1.825040	  0.937205
 -0.792863	 -1.817145	  0.920873
 -0.792812	 -1.808168	  0.904443
 -0.793802	 -1.797917	  0.884784
 -0.795472	 -1.790227	  0.867143
 -0.798058	 -1.782001	  0.850770
 -0.802429	 -1.772339	  0.832406
 -0.808227	 -1.761256	  0.813745
 -0.810277	 -1.749857	  0.800125
 -0.803181	 -1.738360	  0.783058
 -0.797723	 -1.728677	  0.762693
 -0.794348	 -1.714632	  0.748290
 -0.796980	 -1.699466	  0.737596
 -0.802509	 -1.683755	  0.723563
 -0.803836	 -1.669101	  0.708006
 -0.802909	 -1.656458	  0.692878
 -0.800901	 -1.645372	  0.678239
 -0.796353	 -1.632357	  0.661963
 -0.788855	 -1.619126	  0.645454
 -0.784660	 -1.605672	  0.631416
 -0.779348	 -1.588190	  0.617931
 -0.777770	 -1.575553	  0.610036
 -0.775020	 -1.557132	  0.598983
 -0.776461	 -1.541610	  0.586141
 -0.778821	 -1.532028	  0.569605
 -0.781395	 -1.522350	  0.555807
 -0.786450	 -1.504830	  0.533731
 -0.788375	 -1.490290	  0.519296
 -0.790824	 -1.472493	  0.508324
 -0.790115	 -1.464565	  0.501474
 -0.786002	 -1.452128	  0.484122
 -0.780948	 -1.426947	  0.462484
 -0.781841	 -1.415267	  0.456277
 -0.787019	 -1.390003	  0.446196
 -0.794749	 -1.374446	  0.440611
 -0.801312	 -1.354136	  0.438969
 -0.802894	 -1.331626	  0.438914
 -0.801094	 -1.310344	  0.437011
 -0.794179	 -1.290560	  0.436140
 -0.786319	 -1.273142	  0.436281
 -0.778529	 -1.253319	  0.435485
 -0.771222	 -1.231917	  0.431721
 -0.767453	 -1.212232	  0.423633
 -0.765774	 -1.190939	  0.417458
 -0.765229	 -1.178817	  0.411372
 -0.763078	 -1.160889	  0.403283
 -0.759717	 -1.140869	  0.393879
 -0.754355	 -1.116571	  0.385152
 -0.751788	 -1.106207	  0.377583
 -0.746856	 -1.088420	  0.368038
 -0.742438	 -1.073300	  0.353872
 -0.740035	 -1.058501	  0.340246
 -0.736129	 -1.042663	  0.325726
 -0.728392	 -1.028275	  0.311474
 -0.724513	 -1.016597	  0.300100
 -0.718949	 -1.003292	  0.282649
 -0.715573	 -0.987903	  0.270357
 -0.711125	 -0.975408	  0.259967
 -0.707008	 -0.960995	  0.243943
 -0.701890	 -0.950852	  0.225428
 -0.698131	 -0.944549	  0.212477
 -0.694989	 -0.933792	  0.192399
 -0.690391	 -0.923050	  0.175378
 -0.683070	 -0.916181	  0.158178
 -0.674177	 -0.910243	  0.138522
 -0.668702	 -0.903004	  0.123158
 -0.663085	 -0.897924	  0.102307
 -0.662997	 -0.898652	  0.081873
 -0.663089	 -0.899851	  0.060762
 -0.661716	 -0.904292	  0.041481
 -0.656871	 -0.906764	  0.022103
 -0.650685	 -0.910826	  0.003981
 -0.644879	 -0.908682	 -0.015282
 -0.639470	 -0.913113	 -0.029103
 -0.629810	 -0.916172	 -0.047595
 -0.624065	 -0.917479	 -0.060251
 -0.615251	 -0.923012	 -0.071652
 -0.607788	 -0.933164	 -0.092701
 -0.601812	 -0.947063	 -0.109027
 -0.594682	 -0.959197	 -0.120282
 -0.589002	 -0.972453	 -0.133147
 -0.590967	 -0.985438	 -0.150091
 -0.593867	 -0.994209	 -0.167106
 -0.588498	 -1.004970	 -0.183839
 -0.581430	 -1.012211	 -0.199240
 -0.575240	 -1.012011	 -0.217430
 -0.576400	 -1.013484	 -0.239842
 -0.578275	 -1.019780	 -0.262446
 -0.576659	 -1.020811	 -0.284640
 -0.575419	 -1.016206	 -0.306280
 -0.578982	 -1.005116	 -0.321563
 -0.583003	 -0.998013	 -0.338815
 -0.580943	 -0.985513	 -0.358557
 -0.575239	 -0.976247	 -0.371677
 -0.565762	 -0.965015	 -0.388757
 -0.562395	 -0.951562	 -0.407582
 -0.565397	 -0.941695	 -0.421988
 -0.570768	 -0.929585	 -0.441491
 -0.570710	 -0.917859	 -0.459375
 -0.568132	 -0.909025	 -0.472042
 -0.563043	 -0.894390	 -0.489688
 -0.560566	 -0.876533	 -0.504508
 -0.557518	 -0.862369	 -0.516727
 -0.553238	 -0.853430	 -0.527810
 -0.544161	 -0.841740	 -0.545935
 -0.537480	 -0.828258	 -0.558245
 -0.531393	 -0.812574	 -0.569510
 -0.521540	 -0.793980	 -0.584354
 -0.509371	 -0.782926	 -0.596227
 -0.497715	 -0.775462	 -0.604053
 -0.481658	 -0.770329	 -0.614164
 -0.461047	 -0.760637	 -0.632064
 -0.451153	 -0.751950	 -0.642894
 -0.439661	 -0.738389	 -0.654459
 -0.427874	 -0.722893	 -0.657376
 -0.414469	 -0.704571	 -0.652202
 -0.398991	 -0.690420	 -0.646450
 -0.380064	 -0.664578	 -0.642211
 -0.363794	 -0.647926	 -0.645136
 -0.360472	 -0.643259	 -0.648866
 -0.348349	 -0.635429	 -0.658809
 -0.329063	 -0.620038	 -0.673308
 -0.312843	 -0.604192	 -0.681646
 -0.302283	 -0.591428	 -0.682699
 -0.291126	 -0.570378	 -0.679064
 -0.281371	 -0.551264	 -0.680826
 -0.274289	 -0.533637	 -0.685812
 -0.267819	 -0.518155	 -0.692790
 -0.261082	 -0.504209	 -0.703782
 -0.248333	 -0.484070	 -0.714015
 -0.238284	 -0.473591	 -0.721592
 -0.231611	 -0.465438	 -0.726481
 -0.220845	 -0.450417	 -0.741035
 -0.212887	 -0.441433	 -0.749732
 -0.208080	 -0.435061	 -0.757713
 -0.204913	 -0.424164	 -0.776225
 -0.202945	 -0.413999	 -0.792242
 -0.210897	 -0.408223	 -0.811828
 -0.209294	 -0.401398	 -0.829375
 -0.215678	 -0.400156	 -0.852104
 -0.219150	 -0.394900	 -0.872766
 -0.237822	 -0.402706	 -0.885875
 -0.238853	 -0.394249	 -0.899327
 -0.253086	 -0.394464	 -0.926336
 -0.265763	 -0.391401	 -0.945288
 -0.283474	 -0.398076	 -0.955228
 -0.290678	 -0.390540	 -0.970400
 -0.304961	 -0.389420	 -0.991336
 -0.314879	 -0.389394	 -1.002777
 -0.332716	 -0.394096	 -1.015642
 -0.345005	 -0.404559	 -1.032169
 -0.356785	 -0.422389	 -1.043970
 -0.371369	 -0.433467	 -1.053414
 -0.388116	 -0.436535	 -1.065572
 -0.402702	 -0.437816	 -1.077279
 -0.414178	 -0.439553	 -1.089781
 -0.434648	 -0.437171	 -1.115494
 -0.446455	 -0.435573	 -1.127949
 -0.456755	 -0.433626	 -1.135323
 -0.472008	 -0.430857	 -1.151442
 -0.484737	 -0.423435	 -1.174455
 -0.488790	 -0.415912	 -1.191439
 -0.491519	 -0.407212	 -1.204330
 -0.500582	 -0.396266	 -1.224700
 -0.508128	 -0.388087	 -1.246070
 -0.505536	 -0.379160	 -1.263421
 -0.501637	 -0.370310	 -1.280698
 -0.499488	 -0.354868	 -1.300187
 -0.499342	 -0.343771	 -1.308955
 -0.503727	 -0.330005	 -1.325467
 -0.505085	 -0.318311	 -1.345184
 -0.503171	 -0.311856	 -1.362377
 -0.500081	 -0.303338	 -1.382255
 -0.498247	 -0.292531	 -1.400318
 -0.497469	 -0.282525	 -1.414078
 -0.495647	 -0.267460	 -1.438327
 -0.488236	 -0.259778	 -1.457587
 -0.481599	 -0.254826	 -1.469737
 -0.471047	 -0.249166	 -1.483932
 -0.460610	 -0.243708	 -1.502312
 -0.452869	 -0.238980	 -1.521984
 -0.451314	 -0.232339	 -1.542155
 -0.450595	 -0.216585	 -1.559561
 -0.444452	 -0.201308	 -1.570394
 -0.435920	 -0.187808	 -1.580530
 -0.429137	 -0.169989	 -1.598382
 -0.428003	 -0.158097	 -1.613130
 -0.426176	 -0.149796	 -1.626677
 -0.419426	 -0.138871	 -1.644569
 -0.417902	 -0.129919	 -1.662955
 -0.425243	 -0.126619	 -1.684432
 -0.433520	 -0.116490	 -1.705327
 -0.434383	 -0.100239	 -1.719668
 -0.428800	 -0.086780	 -1.731135
 -0.418543	 -0.069752	 -1.750891
 -0.413319	 -0.058315	 -1.766343
 -0.411438	 -0.050301	 -1.778224
 -0.411106	 -0.043995	 -1.796616
 -0.406184	 -0.040756	 -1.819343
 -0.396975	 -0.033638	 -1.841923
 -0.393478	 -0.027035	 -1.853728
 -0.394533	 -0.019236	 -1.873489
 -0.392247	 -0.016047	 -1.895385
 -0.383163	 -0.010392	 -1.915421
 -0.373627	  0.002574	 -1.930905
 -0.370564	  0.016451	 -1.942062
 -0.370192	  0.029482	 -1.960690
 -0.372475	  0.034159	 -1.979576
 -0.371938	  0.040290	 -1.999287
 -0.369934	  0.050122	 -2.017011
 -0.368457	  0.061712	 -2.033261
 -0.367353	  0.073978	 -2.049023
 -0.366334	  0.086083	 -2.064910
 -0.365305	  0.096918	 -2.081690
 -0.364242	  0.107707	 -2.098496
 -0.362986	  0.117921	 -2.115643
 -0.361420	  0.127201	 -2.133291
 -0.359890	  0.136490	 -2.150933
 -0.358624	  0.145522	 -2.168730
 -0.357500	  0.154461	 -2.186563
 -0.354508	  0.162027	 -2.204263
 -0.347844	  0.167406	 -2.222420
 -0.342168	  0.176759	 -2.240855
 -0.342493	  0.189245	 -2.257858
 -0.347837	  0.202071	 -2.274525
 -0.350289	  0.211038	 -2.294296
 -0.347412	  0.215664	 -2.311872
 -0.341988	  0.223240	 -2.329354
 -0.338712	  0.235215	 -2.345037
 -0.338179	  0.247772	 -2.361747
 -0.336524	  0.256440	 -2.380056
 -0.331848	  0.263536	 -2.398072
 -0.328023	  0.272851	 -2.415347
 -0.327970	  0.284767	 -2.431131
 -0.328264	  0.298542	 -2.452351
 -0.320227	  0.317415	 -2.496363
 -0.318701	  0.326985	 -2.513858
