  0.442428	  1.180555	  2.755258
  0.438048	  1.168866	  2.727978
  0.457236	  1.195870	  2.688158
  0.469457	  1.211043	  2.643852
  0.480266	  1.229182	  2.599620
  0.494925	  1.244030	  2.555444
  0.502666	  1.267073	  2.512205
  0.516064	  1.282913	  2.465291
  0.528074	  1.304900	  2.419868
  0.539606	  1.324848	  2.376647
  0.543260	  1.342767	  2.331960
  0.551592	  1.360478	  2.284118
  0.565567	  1.381551	  2.241769
  0.572559	  1.396181	  2.194210
  0.583573	  1.415792	  2.149439
  0.597474	  1.434452	  2.104275
  0.611751	  1.454019	  2.061037
  0.626362	  1.472873	  2.018055
  0.639979	  1.490531	  1.975088
  0.652850	  1.507846	  1.931688
  0.667937	  1.525704	  1.885959
  0.683713	  1.544453	  1.840825
  0.696003	  1.564105	  1.795980
  0.704053	  1.582812	  1.752455
  0.711880	  1.601770	  1.708244
  0.720068	  1.618493	  1.664474
  0.727765	  1.634704	  1.617298
  0.734285	  1.651889	  1.568069
  0.742764	  1.671255	  1.520173
  0.752126	  1.691448	  1.475088
  0.762624	  1.712280	  1.432023
  0.773502	  1.732531	  1.391285
  0.786602	  1.755169	  1.347425
  0.799648	  1.777341	  1.305681
  0.813124	  1.799371	  1.263420
  0.827509	  1.822158	  1.218427
  0.841186	  1.845205	  1.173572
  0.853686	  1.867020	  1.129906
  0.865606	  1.888016	  1.085608
  0.876863	  1.907589	  1.042064
  0.888587	  1.926344	  0.998493
  0.900035	  1.943766	  0.956656
  0.913024	  1.962002	  0.911876
  0.925081	  1.979440	  0.868581
  0.936433	  1.997190	  0.825994
  0.947949	  2.016577	  0.780261
  0.958904	  2.035864	  0.733134
  0.967368	  2.056335	  0.686011
  0.975563	  2.077049	  0.643621
  0.984926	  2.098855	  0.600238
  0.995107	  2.120953	  0.557292
  1.005993	  2.143256	  0.514957
  1.016666	  2.165455	  0.471822
  1.026933	  2.187069	  0.428167
  1.037111	  2.207783	  0.385223
  1.047673	  2.228916	  0.340578
  1.058823	  2.249375	  0.297058
  1.070835	  2.269566	  0.252848
  1.083853	  2.288656	  0.207659
  1.096750	  2.305098	  0.162359
  1.111265	  2.320590	  0.115266
  1.125909	  2.334670	  0.071052
  1.141446	  2.351647	  0.026507
  1.156004	  2.370352	 -0.019144
  1.166513	  2.389189	 -0.066048
  1.172729	  2.408264	 -0.113016
  1.179972	  2.426696	 -0.157125
  1.188462	  2.446543	 -0.200903
  1.198437	  2.464962	 -0.244688
  1.210142	  2.482217	 -0.292288
  1.221381	  2.499282	 -0.337802
  1.232764	  2.518678	 -0.381991
  1.241677	  2.535158	 -0.423693
  1.254730	  2.551766	 -0.469162
  1.263897	  2.576539	 -0.515309
  1.274463	  2.592691	 -0.558707
  1.284521	  2.608154	 -0.606429
  1.292098	  2.627399	 -0.653650
  1.305019	  2.653673	 -0.660187
