 -1.595959	  1.224781	  1.637563
 -1.601198	  1.223157	  1.636871
 -1.582245	  1.229033	  1.639373
 -1.563292	  1.234908	  1.641875
 -1.544371	  1.241113	  1.643744
 -1.525470	  1.247451	  1.645351
 -1.506578	  1.253845	  1.646845
 -1.487795	  1.260692	  1.647389
 -1.469012	  1.267540	  1.647932
 -1.450331	  1.274683	  1.647950
 -1.431769	  1.282113	  1.647448
 -1.413207	  1.289543	  1.646945
 -1.394745	  1.297176	  1.646000
 -1.376299	  1.304839	  1.644992
 -1.357860	  1.312508	  1.643894
 -1.339449	  1.320198	  1.642518
 -1.321038	  1.327888	  1.641141
 -1.302659	  1.335587	  1.639426
 -1.284295	  1.343289	  1.637571
 -1.265901	  1.350915	  1.635702
 -1.247384	  1.358222	  1.633775
 -1.228866	  1.365530	  1.631848
 -1.209915	  1.371801	  1.630611
 -1.190768	  1.377513	  1.629741
 -1.171621	  1.383224	  1.628872
 -1.151901	  1.386547	  1.629178
 -1.132167	  1.389783	  1.629525
 -1.112395	  1.392765	  1.629936
 -1.092499	  1.394687	  1.630612
 -1.072604	  1.396610	  1.631288
 -1.052699	  1.398261	  1.632335
 -1.032796	  1.399717	  1.633647
 -1.012901	  1.401180	  1.635081
 -0.993061	  1.402681	  1.637112
 -0.973221	  1.404181	  1.639143
 -0.953582	  1.406673	  1.641988
 -0.934026	  1.409551	  1.645034
 -0.915283	  1.415051	  1.649332
 -0.904136	  1.426413	  1.661441
 -0.894359	  1.438245	  1.674265
 -0.886983	  1.450219	  1.688485
 -0.882681	  1.462057	  1.704020
 -0.878379	  1.473896	  1.719555
 -0.874077	  1.485735	  1.735090
 -0.869775	  1.497573	  1.750625
 -0.865473	  1.509412	  1.766160
 -0.855528	  1.520362	  1.779621
 -0.845234	  1.531215	  1.792897
 -0.834941	  1.542068	  1.806173
 -0.824648	  1.552921	  1.819449
 -0.814354	  1.563774	  1.832726
 -0.804061	  1.574627	  1.846002
 -0.793768	  1.585480	  1.859278
 -0.783474	  1.596333	  1.872554
 -0.771612	  1.607290	  1.885476
 -0.756320	  1.616463	  1.894532
