 -1.682948	 -1.671643	 -0.418491
 -1.671738	 -1.710870	 -0.420558
 -1.681962	 -1.694226	 -0.410968
 -1.684069	 -1.675551	 -0.414604
 -1.685328	 -1.654214	 -0.421145
 -1.690103	 -1.632966	 -0.422007
 -1.695181	 -1.613244	 -0.421274
 -1.700840	 -1.593834	 -0.419915
 -1.707749	 -1.575351	 -0.416693
 -1.714385	 -1.556527	 -0.414180
 -1.721889	 -1.538020	 -0.410505
 -1.729856	 -1.520007	 -0.406183
 -1.738063	 -1.502546	 -0.401139
 -1.746693	 -1.485167	 -0.396082
 -1.756283	 -1.468642	 -0.390263
 -1.766231	 -1.452501	 -0.383708
 -1.776454	 -1.436587	 -0.376916
 -1.786896	 -1.420472	 -0.371023
 -1.797081	 -1.403627	 -0.367117
 -1.806530	 -1.386177	 -0.363689
 -1.815645	 -1.369490	 -0.359408
 -1.823742	 -1.351274	 -0.355100
 -1.828688	 -1.331837	 -0.350895
 -1.832375	 -1.313214	 -0.347635
 -1.834721	 -1.294404	 -0.343231
 -1.839552	 -1.271163	 -0.331173
 -1.848009	 -1.252609	 -0.321519
 -1.852813	 -1.240266	 -0.316474
 -1.860014	 -1.226298	 -0.310860
 -1.870942	 -1.207410	 -0.307298
 -1.883609	 -1.188379	 -0.302979
 -1.893842	 -1.172434	 -0.297732
 -1.902684	 -1.156146	 -0.292033
 -1.910689	 -1.136644	 -0.287533
 -1.916565	 -1.119034	 -0.284730
 -1.922449	 -1.100728	 -0.281061
 -1.928840	 -1.081654	 -0.276765
 -1.935488	 -1.062893	 -0.272837
 -1.942460	 -1.045037	 -0.268397
 -1.948978	 -1.027021	 -0.263563
 -1.955580	 -1.008071	 -0.258995
 -1.962706	 -0.990276	 -0.255206
 -1.970142	 -0.971841	 -0.252042
 -1.976879	 -0.952502	 -0.248001
 -1.980371	 -0.935037	 -0.242942
 -1.982269	 -0.916446	 -0.236678
 -1.982674	 -0.896725	 -0.231295
 -1.984825	 -0.873865	 -0.225879
 -1.992994	 -0.851974	 -0.219819
 -1.999670	 -0.841160	 -0.215814
 -2.011344	 -0.828025	 -0.211299
 -2.027467	 -0.804281	 -0.204461
 -2.031801	 -0.786142	 -0.200032
 -2.031974	 -0.767721	 -0.196856
 -2.033891	 -0.748785	 -0.195410
 -2.041447	 -0.732304	 -0.192699
 -2.049252	 -0.710745	 -0.189031
 -2.053551	 -0.686666	 -0.184697
 -2.057553	 -0.671695	 -0.182411
 -2.067545	 -0.659575	 -0.178243
 -2.088723	 -0.646263	 -0.170810
 -2.101885	 -0.625529	 -0.161267
 -2.108852	 -0.606929	 -0.155297
 -2.109532	 -0.590069	 -0.154715
 -2.106843	 -0.571399	 -0.156370
 -2.120740	 -0.543537	 -0.163138
 -2.133732	 -0.527751	 -0.165762
 -2.143369	 -0.514310	 -0.167514
 -2.157088	 -0.498319	 -0.166640
 -2.172917	 -0.482200	 -0.162268
 -2.182823	 -0.470018	 -0.157775
 -2.194379	 -0.453107	 -0.153578
 -2.207203	 -0.436822	 -0.149760
 -2.220380	 -0.423457	 -0.144680
 -2.233743	 -0.409141	 -0.139956
 -2.246530	 -0.389855	 -0.139304
 -2.257492	 -0.373106	 -0.141146
 -2.268432	 -0.356997	 -0.140434
 -2.277068	 -0.343934	 -0.135392
 -2.285249	 -0.326241	 -0.124618
 -2.293368	 -0.312122	 -0.117985
 -2.299677	 -0.292058	 -0.108028
 -2.306596	 -0.264821	 -0.105563
 -2.313616	 -0.249474	 -0.105512
 -2.320666	 -0.234630	 -0.104821
 -2.331158	 -0.213981	 -0.100563
 -2.334659	 -0.196139	 -0.093873
 -2.335780	 -0.179910	 -0.087271
 -2.337368	 -0.158167	 -0.078040
 -2.343507	 -0.139344	 -0.072009
 -2.349678	 -0.123596	 -0.069021
 -2.357956	 -0.102072	 -0.066231
 -2.361334	 -0.084083	 -0.062129
 -2.361437	 -0.067257	 -0.057701
 -2.359867	 -0.041199	 -0.052495
 -2.360043	 -0.019156	 -0.049820
 -2.361406	 -0.006307	 -0.049050
 -2.368266	  0.015131	 -0.044139
 -2.378436	  0.036746	 -0.041295
 -2.390713	  0.052066	 -0.040772
 -2.404112	  0.068022	 -0.039420
 -2.413664	  0.086842	 -0.038608
 -2.421024	  0.108302	 -0.039246
 -2.428520	  0.126780	 -0.037699
