  1.868977	 -1.017531	 -1.151968
  1.875701	 -1.034534	 -1.156845
  1.869321	 -1.017859	 -1.151438
  1.862714	 -0.998392	 -1.147384
  1.857319	 -0.977581	 -1.142819
  1.849087	 -0.963055	 -1.134527
  1.842232	 -0.945062	 -1.128354
  1.836564	 -0.925925	 -1.122451
  1.828748	 -0.910009	 -1.114250
  1.821627	 -0.892616	 -1.106985
  1.815837	 -0.874241	 -1.100723
  1.808073	 -0.857993	 -1.092245
  1.800864	 -0.840703	 -1.084033
  1.796099	 -0.822766	 -1.078218
  1.788462	 -0.805798	 -1.069615
  1.781605	 -0.788457	 -1.061069
  1.777576	 -0.770588	 -1.055684
  1.770517	 -0.753422	 -1.046996
  1.762929	 -0.735090	 -1.036216
  1.759935	 -0.718309	 -1.031577
  1.757299	 -0.700522	 -1.025557
  1.754594	 -0.680902	 -1.016628
  1.752774	 -0.663509	 -1.006028
  1.748236	 -0.647200	 -0.994798
  1.743148	 -0.630614	 -0.985573
  1.738606	 -0.613267	 -0.978335
  1.734993	 -0.595569	 -0.968117
  1.729431	 -0.579591	 -0.956253
  1.722243	 -0.564279	 -0.946788
  1.715613	 -0.548019	 -0.937070
  1.710328	 -0.532301	 -0.925190
  1.702303	 -0.517540	 -0.913367
  1.693516	 -0.502946	 -0.904006
  1.685414	 -0.486712	 -0.895035
  1.678149	 -0.469926	 -0.886528
  1.671097	 -0.453710	 -0.876961
  1.663009	 -0.438171	 -0.867753
  1.656522	 -0.422853	 -0.858880
  1.649238	 -0.404461	 -0.850419
  1.639990	 -0.386772	 -0.842957
  1.632887	 -0.371902	 -0.834423
  1.627318	 -0.355766	 -0.823803
  1.620001	 -0.337767	 -0.814966
  1.616806	 -0.319042	 -0.813511
  1.614843	 -0.298601	 -0.811761
  1.611521	 -0.279625	 -0.807362
  1.611202	 -0.261258	 -0.801921
  1.612370	 -0.237702	 -0.801168
  1.607874	 -0.218510	 -0.803818
  1.598700	 -0.201379	 -0.803691
  1.596907	 -0.180339	 -0.804685
  1.601760	 -0.161420	 -0.802738
  1.604361	 -0.140244	 -0.806543
  1.599831	 -0.119776	 -0.812903
  1.596974	 -0.101548	 -0.813021
  1.600273	 -0.082781	 -0.815413
  1.600817	 -0.061769	 -0.818207
  1.599223	 -0.046788	 -0.829584
  1.596818	 -0.028940	 -0.841448
  1.596775	 -0.010969	 -0.849834
  1.597558	  0.006758	 -0.859365
  1.599590	  0.022828	 -0.868518
  1.598984	  0.036490	 -0.884076
  1.595237	  0.044672	 -0.901988
  1.590216	  0.053554	 -0.918833
  1.586870	  0.061797	 -0.936599
  1.585027	  0.070126	 -0.953466
  1.583296	  0.081093	 -0.971176
  1.580072	  0.091989	 -0.991281
  1.573184	  0.097078	 -1.008406
  1.567894	  0.105147	 -1.026010
  1.563837	  0.114415	 -1.043421
  1.558357	  0.119969	 -1.061282
  1.551726	  0.122108	 -1.081059
  1.543447	  0.126043	 -1.100105
  1.535660	  0.132267	 -1.117541
  1.527561	  0.140029	 -1.131343
  1.519501	  0.150595	 -1.147535
  1.513152	  0.161783	 -1.163535
  1.505282	  0.174215	 -1.176908
  1.497167	  0.185525	 -1.188242
  1.488102	  0.200712	 -1.199012
  1.480761	  0.216487	 -1.209507
  1.468057	  0.230917	 -1.216629
  1.458495	  0.248562	 -1.216265
  1.452696	  0.266424	 -1.220938
  1.448206	  0.285066	 -1.223012
  1.442080	  0.304626	 -1.221762
  1.438042	  0.323146	 -1.218127
  1.434837	  0.343372	 -1.216062
  1.431550	  0.362073	 -1.208176
  1.427185	  0.374986	 -1.194733
  1.423919	  0.389991	 -1.182008
  1.421769	  0.403683	 -1.167326
  1.418501	  0.411268	 -1.149421
  1.415978	  0.420034	 -1.132039
  1.414526	  0.429950	 -1.113770
  1.410114	  0.435733	 -1.094340
  1.406003	  0.437954	 -1.074555
  1.404474	  0.437833	 -1.055620
  1.403824	  0.434969	 -1.034814
  1.402001	  0.431388	 -1.014758
  1.400354	  0.426733	 -0.995721
  1.399752	  0.418809	 -0.977547
  1.402838	  0.408731	 -0.956154
  1.408418	  0.399688	 -0.939641
  1.405795	  0.396941	 -0.920614
  1.403933	  0.396987	 -0.899098
  1.404136	  0.391961	 -0.878505
  1.410493	  0.387343	 -0.860355
  1.417078	  0.383471	 -0.842890
  1.421893	  0.377615	 -0.823400
  1.428940	  0.371931	 -0.805455
  1.435335	  0.368996	 -0.786245
  1.439427	  0.369849	 -0.766498
  1.437527	  0.372439	 -0.745109
  1.431792	  0.372388	 -0.724769
  1.429481	  0.367199	 -0.706141
  1.430281	  0.364187	 -0.686285
  1.429122	  0.367746	 -0.667091
  1.421569	  0.375704	 -0.647570
  1.411520	  0.383782	 -0.632365
  1.406379	  0.390239	 -0.613236
  1.400687	  0.395886	 -0.598076
  1.391277	  0.403084	 -0.580140
  1.383296	  0.414240	 -0.563306
  1.380044	  0.421407	 -0.550162
  1.374969	  0.430185	 -0.530903
  1.367333	  0.442072	 -0.511625
  1.356989	  0.450639	 -0.498584
  1.344238	  0.460811	 -0.486411
  1.338823	  0.474566	 -0.470093
  1.337342	  0.484933	 -0.457587
  1.333056	  0.496396	 -0.440828
  1.328411	  0.509885	 -0.422508
  1.321544	  0.519941	 -0.409378
  1.316396	  0.527998	 -0.392059
  1.318575	  0.541596	 -0.372476
  1.321054	  0.557454	 -0.361052
  1.324060	  0.565356	 -0.340816
  1.326150	  0.573951	 -0.322583
  1.326654	  0.579307	 -0.308347
  1.326866	  0.587954	 -0.287366
  1.328873	  0.594879	 -0.269427
  1.331070	  0.602005	 -0.252284
  1.330395	  0.612010	 -0.230394
  1.324882	  0.619548	 -0.213227
  1.317740	  0.625909	 -0.194995
  1.317585	  0.632500	 -0.176192
  1.318515	  0.641263	 -0.157399
  1.320656	  0.647749	 -0.139628
  1.321994	  0.654240	 -0.122152
  1.322639	  0.661679	 -0.099251
  1.319820	  0.668378	 -0.080317
  1.316040	  0.681368	 -0.067351
  1.315714	  0.692486	 -0.050850
  1.318024	  0.701008	 -0.033814
  1.318196	  0.711117	 -0.013299
  1.325550	  0.717702	  0.003831
  1.326682	  0.725205	  0.020141
  1.336876	  0.731301	  0.033339
  1.348797	  0.737857	  0.048990
  1.360421	  0.743833	  0.064691
  1.371791	  0.749641	  0.080086
  1.383160	  0.755449	  0.095481
  1.394568	  0.761288	  0.110809
  1.407908	  0.769030	  0.123213
  1.423186	  0.779291	  0.131201
  1.438463	  0.789536	  0.138869
  1.453608	  0.799834	  0.147097
  1.467271	  0.811205	  0.154832
  1.468052	  0.830361	  0.158113
  1.464258	  0.849910	  0.161090
  1.458873	  0.869025	  0.163596
  1.453642	  0.888141	  0.166031
  1.448973	  0.907251	  0.168775
  1.444070	  0.926439	  0.173450
  1.438466	  0.943933	  0.181827
  1.434126	  0.962046	  0.188967
  1.429061	  0.979447	  0.197795
  1.421090	  0.992240	  0.211554
  1.413265	  1.004873	  0.224710
  1.404634	  1.017857	  0.236958
  1.395773	  1.030460	  0.249221
  1.386454	  1.042408	  0.263116
  1.376845	  1.054704	  0.275989
  1.368333	  1.069568	  0.284652
  1.358435	  1.089992	  0.287663
  1.348830	  1.105586	  0.293273
  1.339760	  1.120153	  0.299442
  1.330579	  1.139078	  0.301304
  1.319960	  1.156225	  0.305067
  1.311468	  1.171979	  0.307597
  1.303825	  1.190788	  0.304444
  1.294176	  1.209635	  0.302967
  1.284555	  1.225804	  0.305484
  1.275439	  1.245221	  0.303760
  1.271022	  1.262989	  0.293624
  1.268159	  1.279438	  0.282590
  1.265057	  1.296432	  0.272421
  1.261178	  1.313512	  0.262403
  1.256526	  1.328112	  0.249578
  1.251067	  1.342873	  0.237118
  1.245968	  1.357545	  0.224546
  1.239528	  1.372086	  0.212641
  1.229905	  1.385448	  0.200747
  1.220241	  1.398133	  0.188057
  1.211470	  1.410555	  0.176441
  1.200324	  1.424129	  0.167029
  1.187686	  1.437046	  0.157463
  1.175952	  1.447222	  0.144127
  1.164553	  1.456995	  0.128678
  1.148731	  1.464360	  0.121455
  1.132067	  1.474490	  0.113707
  1.119702	  1.484536	  0.104693
  1.105220	  1.495726	  0.097103
  1.088614	  1.506836	  0.090475
  1.069340	  1.515595	  0.081445
  1.051214	  1.520942	  0.077946
  1.032758	  1.529267	  0.075872
  1.018672	  1.541318	  0.079109
  1.003048	  1.556169	  0.084673
  0.988176	  1.568469	  0.091593
  0.971016	  1.578370	  0.095237
  0.955927	  1.589515	  0.096142
  0.942767	  1.604283	  0.097253
  0.930174	  1.620060	  0.100384
  0.918549	  1.635909	  0.105037
  0.907388	  1.651900	  0.109585
  0.897399	  1.668333	  0.115075
  0.887450	  1.684779	  0.120598
  0.878563	  1.701587	  0.126801
  0.869804	  1.718434	  0.133080
  0.861533	  1.735498	  0.139438
  0.853833	  1.752788	  0.145880
  0.845656	  1.769651	  0.152675
  0.837655	  1.786095	  0.160228
  0.830068	  1.803099	  0.168473
  0.823127	  1.820559	  0.177135
  0.818519	  1.840241	  0.183100
  0.815841	  1.859509	  0.184776
  0.811485	  1.880428	  0.184384
  0.806099	  1.899269	  0.186254
  0.805082	  1.918124	  0.194413
  0.802359	  1.937725	  0.203531
  0.794957	  1.954205	  0.211186
  0.791529	  1.972598	  0.216411
  0.793346	  1.993697	  0.221147
  0.793956	  2.011166	  0.229327
  0.792631	  2.028400	  0.239939
  0.790796	  2.046150	  0.249891
  0.780017	  2.064895	  0.255549
  0.772436	  2.081339	  0.262730
  0.773202	  2.103736	  0.270983
  0.779946	  2.129673	  0.271138
  0.777577	  2.139728	  0.275981
  0.775168	  2.157518	  0.289470
  0.763902	  2.172331	  0.303018
  0.755695	  2.191332	  0.310773
  0.753223	  2.208638	  0.314546
  0.748016	  2.227982	  0.321736
  0.741646	  2.245702	  0.329107
  0.736307	  2.263051	  0.336829
  0.731837	  2.282123	  0.343202
  0.723581	  2.301481	  0.347983
  0.714371	  2.314700	  0.355668
  0.704834	  2.331437	  0.364810
  0.699413	  2.351604	  0.368556
  0.691596	  2.369186	  0.374011
