 -0.579353	  1.811553	  1.636634
 -0.597107	  1.854574	  1.644939
 -0.589209	  1.836622	  1.641020
 -0.581224	  1.818730	  1.637009
 -0.572972	  1.800958	  1.632999
 -0.563971	  1.783552	  1.628996
 -0.554970	  1.766147	  1.624993
 -0.544707	  1.749180	  1.622383
 -0.534075	  1.732330	  1.620644
 -0.522560	  1.715993	  1.621362
 -0.509945	  1.700675	  1.623852
 -0.497008	  1.685733	  1.626913
 -0.483279	  1.671664	  1.630600
 -0.469161	  1.658076	  1.634607
 -0.455043	  1.644489	  1.638615
 -0.440382	  1.631462	  1.642530
 -0.425080	  1.619154	  1.646322
 -0.409779	  1.606846	  1.650114
 -0.394477	  1.594538	  1.653906
 -0.378714	  1.582850	  1.657770
 -0.362445	  1.571904	  1.661708
 -0.346177	  1.560958	  1.665647
 -0.329908	  1.550012	  1.669586
 -0.313687	  1.539092	  1.673784
 -0.297500	  1.528192	  1.678164
 -0.281314	  1.517292	  1.682544
 -0.265288	  1.506165	  1.686945
 -0.249705	  1.494445	  1.691394
 -0.234121	  1.482725	  1.695843
 -0.219044	  1.470283	  1.700073
 -0.204593	  1.457038	  1.704036
 -0.190141	  1.443792	  1.708000
 -0.177401	  1.428717	  1.711228
 -0.164862	  1.413456	  1.714371
 -0.153093	  1.397507	  1.717041
 -0.142757	  1.380482	  1.718866
 -0.132421	  1.363458	  1.720692
 -0.122926	  1.345887	  1.721739
 -0.114785	  1.327619	  1.721594
 -0.106644	  1.309352	  1.721449
 -0.098503	  1.291084	  1.721304
 -0.091774	  1.272383	  1.719067
 -0.085687	  1.253590	  1.715941
 -0.079600	  1.234797	  1.712814
 -0.073513	  1.216005	  1.709688
 -0.068586	  1.197382	  1.704309
 -0.064545	  1.179068	  1.697361
 -0.060504	  1.160754	  1.690413
 -0.056463	  1.142441	  1.683465
 -0.052890	  1.124856	  1.674633
 -0.049733	  1.108015	  1.664318
 -0.046577	  1.091173	  1.654002
 -0.043420	  1.074332	  1.643686
 -0.040715	  1.059345	  1.630722
 -0.038100	  1.044738	  1.617314
 -0.035484	  1.030130	  1.603906
 -0.033247	  1.016221	  1.589710
 -0.031585	  1.003430	  1.574425
 -0.029923	  0.990639	  1.559140
 -0.028822	  0.978317	  1.543425
 -0.028646	  0.966813	  1.527066
 -0.028470	  0.955308	  1.510707
 -0.029786	  0.944624	  1.493851
 -0.031694	  0.934290	  1.476835
 -0.034464	  0.923719	  1.460084
 -0.038183	  0.912913	  1.443670
 -0.040997	  0.899699	  1.428924
 -0.043204	  0.885119	  1.415412
 -0.045411	  0.870539	  1.401901
 -0.050402	  0.855415	  1.389804
 -0.056601	  0.840170	  1.378439
 -0.062801	  0.824925	  1.367074
 -0.069000	  0.809680	  1.355709
 -0.073666	  0.792881	  1.345909
 -0.077779	  0.775614	  1.336694
 -0.081892	  0.758346	  1.327479
 -0.082850	  0.740139	  1.319259
 -0.080731	  0.721535	  1.312231
 -0.078613	  0.702931	  1.305203
 -0.074666	  0.684662	  1.298083
 -0.069344	  0.666757	  1.290935
 -0.064023	  0.648852	  1.283787
 -0.058096	  0.631362	  1.276110
 -0.051873	  0.614089	  1.268176
 -0.045651	  0.596816	  1.260242
 -0.039880	  0.579745	  1.251568
 -0.034184	  0.562709	  1.242773
 -0.028625	  0.545647	  1.233943
 -0.023890	  0.528439	  1.224917
 -0.019156	  0.511232	  1.215890
 -0.014927	  0.493902	  1.206846
 -0.011178	  0.476468	  1.197791
 -0.007428	  0.459033	  1.188736
 -0.004820	  0.441867	  1.178810
 -0.002261	  0.424715	  1.168847
 -0.000598	  0.407926	  1.158106
  0.000228	  0.391533	  1.146679
  0.000554	  0.375410	  1.134849
 -0.000879	  0.360393	  1.121717
 -0.002311	  0.345376	  1.108586
 -0.005629	  0.331833	  1.094248
 -0.008984	  0.318322	  1.079888
 -0.012729	  0.305002	  1.065448
 -0.017058	  0.291980	  1.050898
 -0.021388	  0.278959	  1.036347
 -0.025717	  0.265938	  1.021797
 -0.029861	  0.252035	  1.008030
 -0.033932	  0.237816	  0.994567
 -0.038003	  0.223598	  0.981104
 -0.042074	  0.209379	  0.967641
 -0.046102	  0.195009	  0.954326
 -0.049747	  0.179434	  0.942320
 -0.053392	  0.163859	  0.930315
 -0.057038	  0.148284	  0.918309
 -0.060683	  0.132709	  0.906304
 -0.062515	  0.116029	  0.895422
 -0.063686	  0.099008	  0.884986
 -0.064857	  0.081988	  0.874549
 -0.064271	  0.064506	  0.864851
 -0.062083	  0.046749	  0.855912
 -0.059833	  0.028988	  0.846996
 -0.054585	  0.011255	  0.839382
 -0.049336	 -0.006479	  0.831767
 -0.041538	 -0.024132	  0.826518
 -0.033068	 -0.041737	  0.822240
 -0.023120	 -0.059056	  0.821200
 -0.012307	 -0.073975	  0.828979
 -0.001607	 -0.087947	  0.838482
  0.009502	 -0.101213	  0.848512
  0.022198	 -0.110673	  0.860731
  0.034894	 -0.120133	  0.872950
  0.047592	 -0.129593	  0.885169
  0.062152	 -0.137342	  0.896481
  0.076712	 -0.145092	  0.907792
  0.091272	 -0.152841	  0.919104
  0.105832	 -0.160590	  0.930416
  0.120392	 -0.168340	  0.941727
  0.135650	 -0.177225	  0.951121
  0.151075	 -0.186427	  0.959918
  0.166500	 -0.195628	  0.968716
  0.181926	 -0.204829	  0.977514
  0.197351	 -0.214030	  0.986311
  0.212777	 -0.223231	  0.995109
  0.228695	 -0.233643	  1.001289
  0.244723	 -0.244524	  1.006260
  0.260751	 -0.255405	  1.011231
  0.276779	 -0.266285	  1.016203
  0.292807	 -0.277166	  1.021174
  0.308831	 -0.288344	  1.025450
  0.324643	 -0.300475	  1.027132
  0.340454	 -0.312606	  1.028813
  0.356266	 -0.324737	  1.030495
  0.372067	 -0.336887	  1.032139
  0.387012	 -0.350155	  1.031365
  0.401957	 -0.363423	  1.030591
  0.416903	 -0.376691	  1.029817
  0.431238	 -0.390497	  1.027843
  0.444974	 -0.404717	  1.024821
  0.458710	 -0.418936	  1.021800
  0.472153	 -0.433325	  1.018301
  0.484441	 -0.448223	  1.013100
  0.496730	 -0.463121	  1.007900
  0.509018	 -0.478019	  1.002699
  0.519587	 -0.493535	  0.995804
  0.530008	 -0.509091	  0.988774
  0.540429	 -0.524647	  0.981744
  0.549400	 -0.540645	  0.973770
  0.557591	 -0.556821	  0.965330
  0.565783	 -0.572998	  0.956891
  0.572903	 -0.589540	  0.948193
  0.579168	 -0.606330	  0.939314
  0.585433	 -0.623121	  0.930435
  0.590824	 -0.640530	  0.922199
  0.596074	 -0.658032	  0.914068
  0.601058	 -0.675849	  0.906469
  0.605746	 -0.693986	  0.899465
  0.610404	 -0.712292	  0.892893
  0.614982	 -0.730951	  0.887336
  0.619639	 -0.749680	  0.882087
  0.624571	 -0.768618	  0.877964
  0.629652	 -0.787541	  0.873949
  0.635687	 -0.806320	  0.870642
  0.641721	 -0.825099	  0.867336
  0.648408	 -0.843631	  0.863895
  0.655222	 -0.862112	  0.860428
  0.662036	 -0.880581	  0.856897
  0.668847	 -0.899019	  0.853203
  0.675659	 -0.917457	  0.849509
  0.682068	 -0.936066	  0.845952
  0.688315	 -0.954739	  0.842449
  0.694424	 -0.973471	  0.839015
  0.699999	 -0.992415	  0.835847
  0.705574	 -1.011359	  0.832678
  0.711187	 -1.030252	  0.829275
  0.716817	 -1.049118	  0.825759
  0.722521	 -1.067955	  0.822205
  0.728664	 -1.086610	  0.818430
  0.734807	 -1.105265	  0.814656
  0.741786	 -1.123619	  0.810855
  0.749122	 -1.141830	  0.807045
  0.756727	 -1.159907	  0.803120
  0.765181	 -1.177519	  0.798836
  0.773635	 -1.195130	  0.794551
  0.782231	 -1.212518	  0.789674
  0.790937	 -1.229707	  0.784315
  0.799643	 -1.246897	  0.778955
  0.808480	 -1.263953	  0.773385
  0.817337	 -1.280987	  0.767782
  0.826196	 -1.298594	  0.764393
  0.831965	 -1.316931	  0.769914
  0.834913	 -1.333584	  0.780591
  0.837862	 -1.350237	  0.791267
  0.839886	 -1.366533	  0.802683
  0.841615	 -1.382703	  0.814325
  0.843344	 -1.398874	  0.825967
  0.845073	 -1.415044	  0.837608
  0.846802	 -1.431215	  0.849250
  0.849689	 -1.448659	  0.858597
  0.853246	 -1.466698	  0.866468
  0.856802	 -1.484737	  0.874339
  0.860359	 -1.502775	  0.882209
  0.863915	 -1.520814	  0.890080
  0.867472	 -1.538853	  0.897951
  0.870865	 -1.557271	  0.904970
  0.873391	 -1.576908	  0.907798
  0.875918	 -1.596545	  0.910626
  0.878445	 -1.616183	  0.913454
  0.880971	 -1.635820	  0.916282
  0.883498	 -1.655457	  0.919111
  0.884583	 -1.675398	  0.920189
  0.884765	 -1.695398	  0.920172
  0.884946	 -1.715397	  0.920154
  0.885127	 -1.735396	  0.920136
  0.885108	 -1.755166	  0.917113
  0.885024	 -1.774764	  0.913126
  0.884940	 -1.794363	  0.909140
  0.885687	 -1.812841	  0.901523
  0.886913	 -1.830327	  0.891894
  0.888139	 -1.847814	  0.882265
  0.890450	 -1.863252	  0.869763
  0.893633	 -1.876502	  0.855123
  0.896816	 -1.889752	  0.840484
  0.899999	 -1.903001	  0.825844
  0.905073	 -1.913539	  0.809620
  0.911648	 -1.921441	  0.792464
  0.918223	 -1.929343	  0.775308
  0.924798	 -1.937245	  0.758152
  0.931373	 -1.945147	  0.740996
  0.937948	 -1.953049	  0.723840
  0.948995	 -1.955919	  0.707417
  0.960103	 -1.958705	  0.691020
  0.971211	 -1.961491	  0.674624
  0.982319	 -1.964277	  0.658227
  0.993428	 -1.967063	  0.641831
  1.005038	 -1.969725	  0.625765
  1.017627	 -1.972128	  0.610411
  1.030216	 -1.974531	  0.595057
  1.042805	 -1.976934	  0.579703
  1.055405	 -1.982643	  0.565259
  1.066834	 -1.993216	  0.552705
  1.074886	 -2.009524	  0.544387
  1.082939	 -2.025833	  0.536068
  1.089551	 -2.043520	  0.529479
  1.095947	 -2.061382	  0.523149
  1.102465	 -2.079651	  0.518274
  1.108989	 -2.097943	  0.513498
  1.116013	 -2.116343	  0.510018
  1.123104	 -2.134751	  0.506721
  1.130208	 -2.153316	  0.504511
  1.137313	 -2.171909	  0.502560
  1.144417	 -2.190503	  0.500608
  1.151930	 -2.211461	  0.498485
  1.158447	 -2.230277	  0.496614
