 -0.022354	 -2.295794	  0.971171
 -0.009549	 -2.318150	  0.991902
 -0.017518	 -2.304718	  0.979409
 -0.026216	 -2.291593	  0.967077
 -0.034913	 -2.278467	  0.954745
 -0.044527	 -2.265993	  0.942417
 -0.054212	 -2.253573	  0.930091
 -0.064298	 -2.241707	  0.917542
 -0.074585	 -2.230135	  0.904883
 -0.085237	 -2.219089	  0.892056
 -0.096275	 -2.208635	  0.879061
 -0.107727	 -2.198750	  0.865979
 -0.119660	 -2.189566	  0.852816
 -0.132075	 -2.181000	  0.839683
 -0.144909	 -2.173000	  0.826595
 -0.158203	 -2.165429	  0.813713
 -0.171939	 -2.158290	  0.801049
 -0.185849	 -2.151184	  0.788559
 -0.200553	 -2.144243	  0.776913
 -0.215256	 -2.137302	  0.765267
 -0.230357	 -2.130112	  0.754300
 -0.245947	 -2.122612	  0.744266
 -0.261537	 -2.115111	  0.734232
 -0.277276	 -2.107332	  0.724652
 -0.293355	 -2.098835	  0.716329
 -0.309435	 -2.090338	  0.708007
 -0.325514	 -2.081841	  0.699684
 -0.341583	 -2.071983	  0.693005
 -0.357635	 -2.061941	  0.686565
 -0.373688	 -2.051899	  0.680125
 -0.389395	 -2.040821	  0.674599
 -0.404763	 -2.028940	  0.669837
 -0.420131	 -2.017059	  0.665075
 -0.434906	 -2.004246	  0.660890
 -0.449052	 -1.990576	  0.657281
 -0.463197	 -1.976905	  0.653671
 -0.476141	 -1.961979	  0.650566
 -0.488869	 -1.946849	  0.647550
 -0.500733	 -1.930986	  0.644790
 -0.512053	 -1.914704	  0.642189
 -0.522537	 -1.897846	  0.639766
 -0.532359	 -1.880574	  0.637483
 -0.541673	 -1.863000	  0.635388
 -0.550120	 -1.844959	  0.633608
 -0.558567	 -1.826917	  0.631828
 -0.565932	 -1.808367	  0.630549
 -0.573043	 -1.789710	  0.629386
 -0.580154	 -1.771053	  0.628223
 -0.586462	 -1.752079	  0.627788
 -0.592457	 -1.732999	  0.627631
 -0.598452	 -1.713919	  0.627475
 -0.604376	 -1.694817	  0.627449
 -0.609583	 -1.675547	  0.628699
 -0.614791	 -1.656278	  0.629950
 -0.619999	 -1.637008	  0.631201
 -0.625166	 -1.617732	  0.632521
 -0.629814	 -1.598403	  0.634711
 -0.634461	 -1.579075	  0.636900
 -0.639109	 -1.559746	  0.639089
 -0.643757	 -1.540417	  0.641278
 -0.647993	 -1.521111	  0.644334
 -0.652203	 -1.501808	  0.647443
 -0.656413	 -1.482505	  0.650552
 -0.660623	 -1.463202	  0.653662
 -0.664343	 -1.443586	  0.654836
 -0.667994	 -1.423943	  0.655749
 -0.671646	 -1.404300	  0.656662
 -0.675239	 -1.384642	  0.657455
 -0.678635	 -1.364936	  0.657839
 -0.682030	 -1.345230	  0.658224
 -0.685426	 -1.325524	  0.658609
 -0.688290	 -1.306060	  0.655013
 -0.690991	 -1.286796	  0.650364
 -0.693692	 -1.267532	  0.645715
 -0.695957	 -1.248403	  0.640334
 -0.697774	 -1.229447	  0.634223
 -0.699592	 -1.210490	  0.628111
 -0.701339	 -1.191748	  0.621354
 -0.702901	 -1.173635	  0.613018
 -0.704462	 -1.155523	  0.604681
 -0.706024	 -1.137410	  0.596345
 -0.706817	 -1.119864	  0.586778
 -0.706776	 -1.103049	  0.575950
 -0.706735	 -1.086234	  0.565122
 -0.706694	 -1.069419	  0.554294
 -0.711322	 -1.053906	  0.542550
 -0.716000	 -1.038412	  0.530800
 -0.727317	 -1.027006	  0.518890
 -0.740520	 -1.017401	  0.507339
 -0.753723	 -1.007797	  0.495788
 -0.765823	 -0.998883	  0.482592
 -0.777586	 -0.990184	  0.468955
 -0.789348	 -0.981485	  0.455318
 -0.801344	 -0.973707	  0.441332
 -0.813381	 -0.966111	  0.427282
 -0.825122	 -0.958474	  0.413005
 -0.835948	 -0.950729	  0.398078
 -0.846774	 -0.942984	  0.383151
 -0.856640	 -0.934708	  0.367849
 -0.866243	 -0.926294	  0.352454
 -0.875354	 -0.917530	  0.336956
 -0.883531	 -0.908143	  0.321303
 -0.891708	 -0.898755	  0.305650
 -0.898738	 -0.888716	  0.289846
 -0.905413	 -0.878486	  0.274009
 -0.911972	 -0.868172	  0.258178
 -0.917312	 -0.857027	  0.242454
 -0.922651	 -0.845881	  0.226730
 -0.927410	 -0.834135	  0.211257
 -0.931499	 -0.821736	  0.196106
 -0.935500	 -0.809239	  0.181013
 -0.938231	 -0.795405	  0.166829
 -0.940962	 -0.781572	  0.152646
 -0.942374	 -0.766342	  0.139759
 -0.943579	 -0.750914	  0.127090
 -0.943391	 -0.734275	  0.115994
 -0.942830	 -0.717369	  0.105323
 -0.941201	 -0.699788	  0.095929
 -0.939403	 -0.682122	  0.086727
 -0.936538	 -0.663990	  0.078787
 -0.933672	 -0.645859	  0.070848
 -0.930493	 -0.627541	  0.063476
 -0.926917	 -0.609016	  0.056839
 -0.923342	 -0.590491	  0.050203
 -0.919777	 -0.571907	  0.043727
 -0.916306	 -0.552907	  0.038534
 -0.912835	 -0.533908	  0.033342
 -0.909364	 -0.514908	  0.028149
 -0.906051	 -0.495798	  0.023269
 -0.903118	 -0.476450	  0.019138
 -0.900185	 -0.457102	  0.015007
 -0.897251	 -0.437755	  0.010876
 -0.894583	 -0.418354	  0.006813
 -0.892732	 -0.398817	  0.002960
 -0.890881	 -0.379279	 -0.000893
 -0.889029	 -0.359741	 -0.004745
 -0.887774	 -0.340204	 -0.008836
 -0.887851	 -0.320741	 -0.013440
 -0.887928	 -0.301279	 -0.018045
 -0.888005	 -0.281816	 -0.022650
 -0.889151	 -0.262580	 -0.028001
 -0.891052	 -0.243554	 -0.033868
 -0.892952	 -0.224528	 -0.039734
 -0.894852	 -0.205503	 -0.045600
 -0.898316	 -0.187205	 -0.052895
 -0.901875	 -0.168960	 -0.060274
 -0.905434	 -0.150716	 -0.067654
 -0.909380	 -0.132735	 -0.075473
 -0.914343	 -0.115555	 -0.084429
 -0.919306	 -0.098375	 -0.093385
 -0.924269	 -0.081195	 -0.102341
 -0.929945	 -0.064687	 -0.112103
 -0.936269	 -0.048872	 -0.122585
 -0.942593	 -0.033056	 -0.133067
 -0.948917	 -0.017240	 -0.143549
 -0.956254	 -0.002371	 -0.154732
 -0.964117	  0.011954	 -0.166263
 -0.971980	  0.026278	 -0.177795
 -0.979843	  0.040603	 -0.189327
 -0.989075	  0.053758	 -0.201231
 -0.998771	  0.066474	 -0.213243
 -1.008466	  0.079191	 -0.225255
 -1.018162	  0.091907	 -0.237267
 -1.029671	  0.103201	 -0.249099
 -1.041421	  0.114286	 -0.260892
 -1.053170	  0.125370	 -0.272686
 -1.064996	  0.136387	 -0.284466
 -1.078681	  0.145572	 -0.295795
 -1.092366	  0.154756	 -0.307125
 -1.106052	  0.163941	 -0.318454
 -1.119737	  0.173125	 -0.329784
 -1.134687	  0.180205	 -0.341025
 -1.149640	  0.187281	 -0.352265
 -1.164593	  0.194356	 -0.363506
 -1.179546	  0.201432	 -0.374747
 -1.195104	  0.206803	 -0.386108
 -1.210840	  0.211582	 -0.397490
 -1.226575	  0.216361	 -0.408872
 -1.242311	  0.221139	 -0.420254
 -1.258256	  0.225032	 -0.431682
 -1.274495	  0.227315	 -0.443133
 -1.290733	  0.229597	 -0.454583
 -1.306971	  0.231879	 -0.466034
 -1.323209	  0.234162	 -0.477484
 -1.339500	  0.234467	 -0.489082
 -1.355791	  0.234763	 -0.500680
 -1.372082	  0.235060	 -0.512279
 -1.388373	  0.235357	 -0.523877
 -1.404284	  0.234509	 -0.535964
 -1.420166	  0.233578	 -0.548085
 -1.436047	  0.232647	 -0.560205
 -1.451724	  0.231452	 -0.572567
 -1.467146	  0.229940	 -0.585212
 -1.482567	  0.228428	 -0.597857
 -1.497898	  0.226729	 -0.610588
 -1.513197	  0.224966	 -0.623348
 -1.528582	  0.223455	 -0.636038
 -1.544088	  0.222184	 -0.648605
 -1.559841	  0.221349	 -0.660899
 -1.575884	  0.221395	 -0.672841
 -1.592051	  0.222308	 -0.684581
 -1.608321	  0.223989	 -0.696090
 -1.624669	  0.226310	 -0.707375
 -1.641015	  0.230049	 -0.718275
 -1.657306	  0.234370	 -0.729043
 -1.673447	  0.239812	 -0.739524
 -1.689400	  0.246235	 -0.749733
 -1.705152	  0.253513	 -0.759679
 -1.720725	  0.261608	 -0.769269
 -1.736054	  0.270612	 -0.778431
 -1.751281	  0.279996	 -0.787379
 -1.766109	  0.290616	 -0.795586
 -1.780936	  0.301236	 -0.803794
 -1.794959	  0.313209	 -0.811540
 -1.808800	  0.325458	 -0.819182
 -1.822318	  0.338034	 -0.826871
 -1.834407	  0.351903	 -0.834713
 -1.846497	  0.365771	 -0.842555
 -1.857857	  0.380002	 -0.850828
 -1.867661	  0.394873	 -0.859923
 -1.877466	  0.409744	 -0.869019
 -1.886517	  0.424735	 -0.878680
 -1.894408	  0.439843	 -0.889143
 -1.902299	  0.454951	 -0.899606
 -1.909629	  0.470116	 -0.910390
 -1.916569	  0.485311	 -0.921389
 -1.923508	  0.500505	 -0.932387
 -1.931000	  0.515682	 -0.943042
 -1.938499	  0.530859	 -0.953693
 -1.946387	  0.545859	 -0.964313
 -1.954675	  0.560669	 -0.974895
 -1.962975	  0.575470	 -0.985479
 -1.971998	  0.589793	 -0.996130
 -1.981021	  0.604116	 -1.006780
 -1.990285	  0.618206	 -1.017535
 -1.999751	  0.632094	 -1.028375
 -2.009238	  0.645961	 -1.039225
 -2.019051	  0.659482	 -1.050219
 -2.028864	  0.673003	 -1.061214
 -2.038884	  0.686344	 -1.072242
 -2.049046	  0.699561	 -1.083290
 -2.059317	  0.712729	 -1.094295
 -2.070121	  0.725651	 -1.105079
 -2.080925	  0.738573	 -1.115862
 -2.091729	  0.751495	 -1.126646
 -2.102534	  0.764417	 -1.137430
 -2.119260	  0.784114	 -1.153809
 -2.130272	  0.796962	 -1.164470
