 -0.201476	  1.521904	  2.612301
 -0.199481	  1.506836	  2.586436
 -0.173332	  1.493527	  2.547607
 -0.151059	  1.485141	  2.504616
 -0.133841	  1.468014	  2.462795
 -0.114602	  1.460954	  2.416508
 -0.092239	  1.445941	  2.374228
 -0.074047	  1.434639	  2.327215
 -0.051656	  1.430525	  2.281983
 -0.031235	  1.413110	  2.240510
 -0.009254	  1.403733	  2.197160
  0.013729	  1.392908	  2.152891
  0.031992	  1.375695	  2.108736
  0.056291	  1.356645	  2.070069
  0.077246	  1.342225	  2.027822
  0.105254	  1.330514	  1.986954
  0.129350	  1.312823	  1.945210
  0.157219	  1.298031	  1.904509
  0.182691	  1.283136	  1.862566
  0.207333	  1.268011	  1.820951
  0.231720	  1.253140	  1.779969
  0.255935	  1.238753	  1.739545
  0.279848	  1.224914	  1.699165
  0.302090	  1.211796	  1.658144
  0.324016	  1.198545	  1.614211
  0.344599	  1.185951	  1.570535
  0.364256	  1.173652	  1.527632
  0.383856	  1.161031	  1.484541
  0.403953	  1.147139	  1.439372
  0.423567	  1.132922	  1.393019
  0.442062	  1.120170	  1.348854
  0.460997	  1.108714	  1.305419
  0.480576	  1.099610	  1.261188
  0.500206	  1.091096	  1.214861
  0.519564	  1.072835	  1.171891
  0.534802	  1.055077	  1.126051
  0.551664	  1.038408	  1.082180
  0.570378	  1.022180	  1.039200
  0.590005	  1.006821	  0.996563
  0.610518	  0.992751	  0.953327
  0.632351	  0.980565	  0.909824
  0.656881	  0.970839	  0.865422
  0.681542	  0.963010	  0.821752
  0.704503	  0.955285	  0.779095
  0.726494	  0.946603	  0.734291
  0.744646	  0.936193	  0.686935
  0.752939	  0.925288	  0.641362
  0.748410	  0.918905	  0.597202
  0.723844	  0.920231	  0.540176
  0.661207	  0.936259	  0.462384
  0.594246	  0.966663	  0.391112
  0.527669	  1.013864	  0.301627
  0.473001	  1.056255	  0.183592
  0.442224	  1.066575	  0.063644
  0.436919	  1.052411	 -0.045623
  0.439592	  1.046499	 -0.080067
  0.448339	  1.042825	 -0.113951
  0.487262	  1.029498	 -0.190458
  0.575884	  0.977565	 -0.260873
  0.708582	  0.926502	 -0.298111
  0.780230	  0.885187	 -0.291893
  0.838944	  0.841266	 -0.276946
  0.887549	  0.803807	 -0.269682
  0.942415	  0.756170	 -0.262065
  1.018601	  0.701686	 -0.256339
  1.101090	  0.655095	 -0.245127
  1.148047	  0.641731	 -0.250133
  1.178615	  0.631943	 -0.277189
  1.202896	  0.622020	 -0.318554
  1.223962	  0.611092	 -0.362466
  1.244523	  0.600853	 -0.406814
  1.265633	  0.591604	 -0.451188
  1.288077	  0.583222	 -0.494680
  1.311779	  0.575043	 -0.538024
  1.337335	  0.566479	 -0.581356
  1.363923	  0.556538	 -0.624400
  1.389746	  0.545910	 -0.666295
  1.413870	  0.535185	 -0.706393
  1.438569	  0.522747	 -0.749308
  1.462933	  0.509159	 -0.792481
  1.485664	  0.495318	 -0.833536
  1.508390	  0.481042	 -0.875280
  1.531194	  0.465223	 -0.918446
  1.551425	  0.449536	 -0.959337
  1.571810	  0.434591	 -1.001583
  1.592965	  0.421360	 -1.044747
  1.614146	  0.408938	 -1.088617
  1.635165	  0.396403	 -1.132167
  1.655953	  0.383650	 -1.176011
  1.676669	  0.370228	 -1.220752
  1.697245	  0.356069	 -1.265061
  1.717198	  0.341852	 -1.306423
  1.738498	  0.326908	 -1.349444
  1.758795	  0.310855	 -1.391702
  1.777886	  0.293778	 -1.435024
  1.795418	  0.276823	 -1.480694
  1.811866	  0.261046	 -1.526306
  1.828420	  0.246654	 -1.569338
  1.846810	  0.232643	 -1.612510
  1.866151	  0.220217	 -1.655660
  1.888574	  0.207689	 -1.700524
  1.913795	  0.193226	 -1.744173
  1.938852	  0.178313	 -1.786694
  1.962362	  0.163001	 -1.828790
  1.982940	  0.147766	 -1.870625
  2.005696	  0.134663	 -1.912122
  2.038360	  0.124822	 -1.949470
  2.056841	  0.105518	 -1.993641
  2.073635	  0.092450	 -2.038721
  2.102147	  0.086112	 -2.080277
  2.113659	  0.064260	 -2.127984
  2.134796	  0.064903	 -2.149264
