 -0.703102	  2.625782	 -1.338587
 -0.696141	  2.599784	 -1.325334
 -0.684333	  2.559861	 -1.323113
 -0.673991	  2.512292	 -1.338138
 -0.668050	  2.460867	 -1.347548
 -0.658458	  2.414233	 -1.347551
 -0.652491	  2.361069	 -1.353832
 -0.643059	  2.316127	 -1.361549
 -0.643641	  2.265525	 -1.373236
 -0.633743	  2.212629	 -1.378981
 -0.627455	  2.165455	 -1.388013
 -0.621649	  2.114762	 -1.396034
 -0.611727	  2.070718	 -1.402578
 -0.607995	  2.020397	 -1.412377
 -0.603644	  1.974437	 -1.417741
 -0.594741	  1.920259	 -1.425217
 -0.584857	  1.871112	 -1.437698
 -0.578968	  1.827017	 -1.440197
 -0.575178	  1.780727	 -1.447593
 -0.567647	  1.733471	 -1.458356
 -0.556317	  1.685015	 -1.464011
 -0.552048	  1.633234	 -1.470884
 -0.545356	  1.585501	 -1.482627
 -0.535246	  1.533120	 -1.489270
 -0.531389	  1.489703	 -1.496390
 -0.523501	  1.439863	 -1.506737
 -0.518681	  1.392648	 -1.516458
 -0.509808	  1.339396	 -1.524748
 -0.503194	  1.290989	 -1.530665
 -0.495941	  1.247393	 -1.537958
 -0.489128	  1.194825	 -1.545879
 -0.482579	  1.145842	 -1.552290
 -0.475615	  1.098512	 -1.557722
 -0.467115	  1.046812	 -1.564793
 -0.461342	  0.997836	 -1.573220
 -0.453257	  0.955250	 -1.584955
 -0.468204	  0.918318	 -1.661937
 -0.513977	  0.889203	 -1.816246
 -0.442629	  0.846571	 -1.795614
 -0.423527	  0.834550	 -1.920768
 -0.599471	  0.735469	 -1.883053
 -0.598145	  0.697893	 -1.941010
 -0.561807	  0.635507	 -2.034495
 -0.489581	  0.617162	 -2.109948
 -0.526385	  0.584554	 -2.174646
 -0.542493	  0.555146	 -2.115155
 -0.611822	  0.537280	 -2.216783
 -0.637720	  0.436156	 -2.185351
 -0.614113	  0.403832	 -2.227651
 -0.531029	  0.232081	 -2.293102
 -0.618953	  0.222011	 -2.207903
 -0.522052	  0.099568	 -2.084375
 -0.443489	 -0.004828	 -1.974511
 -0.426585	 -0.023352	 -1.915279
 -0.408818	 -0.038341	 -1.901224
 -0.366115	 -0.063588	 -1.877436
 -0.358254	 -0.082416	 -1.825983
 -0.323335	 -0.111097	 -1.772538
 -0.296307	 -0.166275	 -1.757180
 -0.290770	 -0.211303	 -1.762969
 -0.283142	 -0.264493	 -1.768991
 -0.276417	 -0.313321	 -1.778022
 -0.267496	 -0.361139	 -1.785628
 -0.260202	 -0.412390	 -1.795251
 -0.254485	 -0.453492	 -1.802463
 -0.247742	 -0.508073	 -1.812857
 -0.243118	 -0.549961	 -1.820510
 -0.234767	 -0.599478	 -1.826324
 -0.224474	 -0.646146	 -1.835362
 -0.218697	 -0.695671	 -1.846386
 -0.213973	 -0.748403	 -1.849475
 -0.203407	 -0.795799	 -1.855207
 -0.197973	 -0.848462	 -1.864528
 -0.195197	 -0.890106	 -1.874659
 -0.185549	 -0.938847	 -1.883673
 -0.182177	 -0.988673	 -1.890847
 -0.171965	 -1.035367	 -1.894498
 -0.165100	 -1.089883	 -1.908493
 -0.160207	 -1.136733	 -1.914806
 -0.147295	 -1.188973	 -1.924920
 -0.142367	 -1.231556	 -1.931921
 -0.138810	 -1.280367	 -1.934484
 -0.126893	 -1.330326	 -1.939724
 -0.122157	 -1.375679	 -1.949502
 -0.112187	 -1.425513	 -1.954275
 -0.112473	 -1.474103	 -1.963973
 -0.106189	 -1.526341	 -1.969427
 -0.096558	 -1.577079	 -1.978374
 -0.094065	 -1.619181	 -1.991241
 -0.084108	 -1.670792	 -1.996533
 -0.073613	 -1.720613	 -2.008270
 -0.066512	 -1.767391	 -2.011554
 -0.059545	 -1.819870	 -2.020850
 -0.057988	 -1.866247	 -2.024851
 -0.052833	 -1.916638	 -2.037573
 -0.044406	 -1.962229	 -2.044779
 -0.035428	 -2.009189	 -2.052034
 -0.028685	 -2.062246	 -2.056535
 -0.019017	 -2.109292	 -2.069088
 -0.019595	 -2.162712	 -2.079013
 -0.019791	 -2.184339	 -2.099803
