  0.350397	  3.009462	 -0.035484
  0.346928	  2.979666	 -0.035133
  0.358304	  2.932486	 -0.026561
  0.378374	  2.887978	 -0.019313
  0.402798	  2.845929	 -0.013566
  0.428409	  2.804291	 -0.008989
  0.453920	  2.762126	 -0.004994
  0.478307	  2.719059	 -0.001918
  0.500841	  2.674879	 -0.001088
  0.521565	  2.629629	 -0.000647
  0.541815	  2.584856	  0.003709
  0.561487	  2.539625	  0.011685
  0.580987	  2.493902	  0.020292
  0.600401	  2.447664	  0.029601
  0.619222	  2.401927	  0.039305
  0.637840	  2.356558	  0.049040
  0.656755	  2.311642	  0.057790
  0.675648	  2.267523	  0.065825
  0.695771	  2.222675	  0.072483
  0.718142	  2.177881	  0.077632
  0.743164	  2.134637	  0.079320
  0.770920	  2.094112	  0.078768
  0.801639	  2.057841	  0.074885
  0.834499	  2.026226	  0.067239
  0.868601	  1.998040	  0.057927
  0.910917	  1.969478	  0.045073
  0.964555	  1.940343	  0.026870
  1.029080	  1.909493	  0.001721
  1.099858	  1.877379	 -0.030933
  1.166345	  1.842071	 -0.066108
  1.213393	  1.805195	 -0.102123
  1.251901	  1.769281	 -0.129048
  1.278679	  1.721092	 -0.154918
  1.303226	  1.664580	 -0.172684
  1.317692	  1.608828	 -0.183160
  1.332009	  1.560367	 -0.189606
  1.353852	  1.510687	 -0.192947
  1.381371	  1.462996	 -0.197437
  1.405460	  1.421872	 -0.199636
  1.426755	  1.395396	 -0.198220
  1.445934	  1.376832	 -0.198574
  1.480289	  1.345991	 -0.200331
  1.528348	  1.296301	 -0.200574
  1.580008	  1.243233	 -0.195167
  1.619446	  1.202159	 -0.185227
  1.645356	  1.175374	 -0.174132
  1.666286	  1.155256	 -0.161747
  1.681397	  1.142221	 -0.144890
  1.694277	  1.132686	 -0.122834
  1.710291	  1.121867	 -0.090186
  1.730861	  1.111216	 -0.037149
  1.749073	  1.102054	  0.062833
  1.771651	  1.078439	  0.226170
  1.814105	  1.036248	  0.411953
  1.878053	  0.937560	  0.547819
  1.856231	  0.799502	  0.613899
  1.837730	  0.655060	  0.629517
  1.823057	  0.516770	  0.604070
  1.721737	  0.418013	  0.549369
  1.659355	  0.347514	  0.525419
  1.610837	  0.290864	  0.517759
  1.556917	  0.234087	  0.510589
  1.537205	  0.199078	  0.506713
  1.539508	  0.192527	  0.506048
  1.588893	  0.166700	  0.499213
  1.659268	  0.150768	  0.500615
  1.720935	  0.139115	  0.514369
  1.778344	  0.128955	  0.536877
  1.837811	  0.117295	  0.569030
  1.903865	  0.105562	  0.606674
  1.979747	  0.093578	  0.646467
  2.061970	  0.080351	  0.668517
  2.145537	  0.053073	  0.664140
  2.229988	  0.006835	  0.635748
  2.307510	 -0.051737	  0.587668
  2.366787	 -0.114702	  0.542343
  2.397820	 -0.196417	  0.544644
  2.388786	 -0.280514	  0.577397
  2.344570	 -0.351772	  0.593906
  2.292118	 -0.411637	  0.590994
  2.242137	 -0.465814	  0.574241
  2.198839	 -0.516857	  0.541699
  2.166193	 -0.570444	  0.501663
  2.148188	 -0.628336	  0.459333
  2.144743	 -0.684928	  0.425778
  2.153526	 -0.736871	  0.409539
  2.168619	 -0.785527	  0.407973
  2.186920	 -0.831744	  0.413509
  2.207381	 -0.876188	  0.420451
  2.228837	 -0.919853	  0.427315
  2.250719	 -0.963127	  0.433536
  2.273173	 -1.005887	  0.438767
  2.296962	 -1.048455	  0.442876
  2.323445	 -1.091397	  0.446978
  2.351554	 -1.134273	  0.452497
  2.378662	 -1.177708	  0.458892
  2.402033	 -1.221764	  0.465505
  2.422959	 -1.265288	  0.472475
  2.442571	 -1.308468	  0.480218
  2.461508	 -1.351666	  0.488998
  2.480233	 -1.396048	  0.497982
  2.498532	 -1.443077	  0.505317
  2.512860	 -1.493458	  0.510196
  2.519506	 -1.546731	  0.509618
  2.544701	 -1.562199	  0.514714
