 -0.500435	  0.826261	  2.287559
 -0.505850	  0.817715	  2.300065
 -0.505120	  0.832608	  2.287516
 -0.499664	  0.845078	  2.270320
 -0.492403	  0.855118	  2.254274
 -0.485068	  0.866661	  2.239256
 -0.480161	  0.880090	  2.224477
 -0.477597	  0.891084	  2.210771
 -0.471704	  0.902620	  2.192551
 -0.462062	  0.913847	  2.174264
 -0.455316	  0.921505	  2.162160
 -0.444088	  0.928194	  2.146896
 -0.425505	  0.936056	  2.131807
 -0.411363	  0.946711	  2.118341
 -0.401873	  0.957713	  2.103961
 -0.395910	  0.964678	  2.091570
 -0.388994	  0.974133	  2.072792
 -0.383811	  0.986399	  2.050301
 -0.379095	  0.993163	  2.035180
 -0.371585	  1.002071	  2.021673
 -0.361954	  1.008898	  2.008826
 -0.345233	  1.017581	  1.991253
 -0.333036	  1.023697	  1.973285
 -0.327440	  1.026664	  1.956249
 -0.328121	  1.031841	  1.934296
 -0.332008	  1.039520	  1.910902
 -0.329392	  1.045318	  1.892820
 -0.323436	  1.050583	  1.877246
 -0.313830	  1.058092	  1.858647
 -0.303883	  1.066071	  1.842662
 -0.294009	  1.074962	  1.830755
 -0.280401	  1.088574	  1.812625
 -0.273792	  1.098252	  1.795050
 -0.271800	  1.103728	  1.785017
 -0.263417	  1.110067	  1.766066
 -0.258300	  1.116077	  1.743792
 -0.257057	  1.119416	  1.724099
 -0.247635	  1.127344	  1.707602
 -0.237806	  1.136435	  1.694003
 -0.234100	  1.146194	  1.674632
 -0.223509	  1.156532	  1.654847
 -0.210148	  1.164823	  1.642281
 -0.196695	  1.172923	  1.633551
 -0.172775	  1.184549	  1.624613
 -0.153726	  1.191458	  1.621461
 -0.138596	  1.195692	  1.619086
 -0.113072	  1.201160	  1.611355
 -0.098364	  1.206389	  1.602554
 -0.083861	  1.214587	  1.589516
 -0.069778	  1.226802	  1.578062
 -0.060346	  1.239894	  1.567733
 -0.048437	  1.253969	  1.554870
 -0.033749	  1.263034	  1.546299
 -0.021217	  1.270151	  1.540038
 -0.000614	  1.282774	  1.530812
  0.012542	  1.297548	  1.510189
  0.015500	  1.304650	  1.495540
  0.017189	  1.311545	  1.483499
  0.019890	  1.320074	  1.461626
  0.023281	  1.325569	  1.440284
  0.023720	  1.328267	  1.427121
  0.019088	  1.328620	  1.403788
  0.016075	  1.333508	  1.380514
  0.015193	  1.338757	  1.365614
  0.013739	  1.349056	  1.344447
  0.011073	  1.356428	  1.322917
  0.009125	  1.359506	  1.312695
  0.006971	  1.369865	  1.295143
  0.001652	  1.384984	  1.274228
 -0.000833	  1.391419	  1.253979
 -0.000854	  1.395231	  1.237675
 -0.001938	  1.401770	  1.218383
  0.002751	  1.406865	  1.196367
  0.005908	  1.413080	  1.179387
  0.008733	  1.414098	  1.160305
  0.012301	  1.413696	  1.133690
  0.014559	  1.417181	  1.114164
  0.015846	  1.422121	  1.098796
  0.016993	  1.430199	  1.077905
  0.015547	  1.436664	  1.058745
  0.017247	  1.443376	  1.040877
  0.023815	  1.453282	  1.017213
  0.027693	  1.459480	  1.005175
  0.033044	  1.467190	  0.991528
  0.037278	  1.481968	  0.972404
  0.041808	  1.494024	  0.958732
  0.045900	  1.504127	  0.947031
  0.052465	  1.522212	  0.923671
  0.052459	  1.531772	  0.911100
  0.050647	  1.539716	  0.899939
  0.051087	  1.552668	  0.881033
  0.057658	  1.563291	  0.863332
  0.066448	  1.579562	  0.836343
  0.067730	  1.585331	  0.827180
  0.069895	  1.592956	  0.813756
  0.084261	  1.615368	  0.788682
  0.091838	  1.621366	  0.783418
  0.102850	  1.629649	  0.775338
  0.116260	  1.644287	  0.765075
  0.128723	  1.660300	  0.755966
  0.142730	  1.674868	  0.745749
  0.154662	  1.696005	  0.736407
  0.160344	  1.714641	  0.727566
  0.162818	  1.722575	  0.721943
  0.165600	  1.743461	  0.707470
  0.170133	  1.761611	  0.693331
  0.174134	  1.774808	  0.683175
  0.184290	  1.789761	  0.669959
  0.194861	  1.804043	  0.657833
  0.204539	  1.814770	  0.650026
  0.217735	  1.827416	  0.642285
  0.235592	  1.843132	  0.635894
  0.248895	  1.854469	  0.631671
  0.264173	  1.869583	  0.623915
  0.274512	  1.880847	  0.615088
  0.282305	  1.895991	  0.605378
  0.288946	  1.911771	  0.593687
  0.298892	  1.932858	  0.582860
  0.307398	  1.948981	  0.577781
  0.313211	  1.958871	  0.571478
  0.325284	  1.978310	  0.558806
  0.340718	  1.997344	  0.557416
  0.351849	  2.010666	  0.558807
  0.367213	  2.025559	  0.563035
  0.374223	  2.041832	  0.555922
  0.382965	  2.060057	  0.545956
  0.393375	  2.077377	  0.542634
  0.403761	  2.094286	  0.539941
  0.414135	  2.111175	  0.537257
  0.423964	  2.128449	  0.535041
  0.432467	  2.146528	  0.534185
  0.440995	  2.164601	  0.533383
  0.449637	  2.182629	  0.532675
  0.457903	  2.200841	  0.532570
  0.466074	  2.219097	  0.532611
  0.474261	  2.237357	  0.532666
  0.482792	  2.255444	  0.531649
  0.491419	  2.273211	  0.528525
  0.499963	  2.290834	  0.525246
  0.502506	  2.298498	  0.508658
  0.500225	  2.301166	  0.490481
  0.494658	  2.305781	  0.468369
  0.490156	  2.310280	  0.447558
  0.494390	  2.320013	  0.428850
  0.500575	  2.330459	  0.404456
  0.502072	  2.332192	  0.382867
  0.502838	  2.331390	  0.368077
  0.500545	  2.327645	  0.351209
  0.495484	  2.325360	  0.329081
  0.492452	  2.327232	  0.307607
  0.487366	  2.329538	  0.288144
  0.480849	  2.328348	  0.272896
  0.474875	  2.323670	  0.254797
  0.477854	  2.317968	  0.229994
  0.484528	  2.315252	  0.204119
  0.483308	  2.315165	  0.188192
  0.480741	  2.315439	  0.169774
  0.478343	  2.315568	  0.147629
  0.475277	  2.318442	  0.130193
  0.475351	  2.323329	  0.111364
  0.472393	  2.333577	  0.082923
  0.470098	  2.338794	  0.067391
  0.470562	  2.341642	  0.053356
  0.471269	  2.345759	  0.035280
  0.473241	  2.348990	  0.008687
  0.471857	  2.347461	 -0.015110
  0.472511	  2.348612	 -0.024911
  0.472068	  2.349732	 -0.043823
  0.476042	  2.355758	 -0.064215
  0.481210	  2.363623	 -0.083204
  0.486205	  2.370105	 -0.098636
  0.490471	  2.373746	 -0.119616
  0.494793	  2.376020	 -0.135350
  0.501036	  2.378691	 -0.154767
  0.508760	  2.383867	 -0.173952
  0.516811	  2.389242	 -0.190432
  0.524589	  2.393784	 -0.207036
  0.532923	  2.400219	 -0.224788
  0.541193	  2.405890	 -0.241312
  0.549671	  2.411684	 -0.258005
  0.558557	  2.418222	 -0.274157
  0.567079	  2.423424	 -0.290597
  0.577110	  2.429649	 -0.306492
  0.586705	  2.435675	 -0.322082
  0.597389	  2.441310	 -0.337185
  0.607349	  2.446677	 -0.353698
  0.618940	  2.453043	 -0.368699
  0.630266	  2.458808	 -0.384103
  0.641479	  2.464872	 -0.399549
  0.652821	  2.470601	 -0.414390
  0.664189	  2.477027	 -0.429904
  0.675197	  2.482800	 -0.445568
  0.686310	  2.489951	 -0.460653
  0.699014	  2.496540	 -0.478510
  0.710391	  2.501976	 -0.496162
  0.713607	  2.499776	 -0.522858
  0.724298	  2.506718	 -0.538269
