 -0.754377	  1.645636	  1.679614
 -0.757398	  1.650244	  1.686277
 -0.752342	  1.653002	  1.661629
 -0.741728	  1.639693	  1.648779
 -0.734897	  1.626072	  1.636776
 -0.729461	  1.611363	  1.622623
 -0.721499	  1.599861	  1.607877
 -0.712909	  1.590871	  1.592139
 -0.704947	  1.581739	  1.576185
 -0.696692	  1.572556	  1.560508
 -0.686647	  1.565357	  1.544862
 -0.676836	  1.558720	  1.528702
 -0.667136	  1.552223	  1.512420
 -0.656401	  1.548336	  1.495854
 -0.644853	  1.546861	  1.479478
 -0.633682	  1.545255	  1.463596
 -0.624338	  1.540929	  1.444683
 -0.611675	  1.541026	  1.426331
 -0.596122	  1.545613	  1.412038
 -0.581547	  1.547489	  1.400841
 -0.566854	  1.547928	  1.383255
 -0.549203	  1.556613	  1.369902
 -0.531647	  1.567703	  1.362649
 -0.515167	  1.576802	  1.360971
 -0.496892	  1.582721	  1.353508
 -0.480619	  1.586873	  1.344206
 -0.464671	  1.590021	  1.336663
 -0.444389	  1.594772	  1.327598
 -0.427786	  1.596659	  1.314492
 -0.415178	  1.596287	  1.304693
 -0.401582	  1.593256	  1.294502
 -0.386116	  1.589794	  1.284054
 -0.371988	  1.584602	  1.272235
 -0.357909	  1.578615	  1.259133
 -0.344872	  1.573508	  1.246713
 -0.331848	  1.565194	  1.231626
 -0.320485	  1.556854	  1.218724
 -0.309023	  1.551814	  1.207389
 -0.289977	  1.539226	  1.185774
 -0.282760	  1.528910	  1.175016
 -0.277366	  1.520396	  1.167915
 -0.267778	  1.509776	  1.152496
 -0.258420	  1.500165	  1.136525
 -0.252238	  1.485496	  1.124465
 -0.233650	  1.476021	  1.113985
 -0.206567	  1.470223	  1.093400
 -0.201350	  1.468546	  1.085273
 -0.191160	  1.465301	  1.071950
 -0.175121	  1.458381	  1.057352
 -0.160182	  1.449924	  1.047684
 -0.146183	  1.439410	  1.041337
 -0.131525	  1.424252	  1.032571
 -0.122932	  1.407970	  1.019093
 -0.116063	  1.399870	  1.010529
 -0.112726	  1.391050	  1.004093
 -0.112869	  1.378999	  0.996187
 -0.114272	  1.362489	  0.981930
 -0.118009	  1.350337	  0.971708
 -0.126714	  1.335684	  0.960646
 -0.136591	  1.318303	  0.951082
 -0.147585	  1.304827	  0.943678
 -0.162920	  1.294595	  0.932628
 -0.180074	  1.283440	  0.919290
 -0.193526	  1.268598	  0.915992
 -0.204460	  1.248334	  0.920445
 -0.207300	  1.228125	  0.922109
 -0.215922	  1.208477	  0.918168
 -0.225425	  1.191070	  0.914112
 -0.233502	  1.173613	  0.908703
 -0.241638	  1.155678	  0.904473
 -0.248704	  1.137170	  0.900474
 -0.255868	  1.118790	  0.897099
 -0.263425	  1.100703	  0.893793
 -0.271182	  1.082410	  0.891322
 -0.277799	  1.063260	  0.889743
 -0.284424	  1.044374	  0.887003
 -0.290524	  1.025501	  0.883401
 -0.295480	  1.006950	  0.877673
 -0.299197	  0.988860	  0.871340
 -0.302713	  0.969885	  0.869672
 -0.309048	  0.948378	  0.871787
 -0.312865	  0.927332	  0.870034
 -0.312135	  0.906406	  0.864139
 -0.312721	  0.885835	  0.854261
 -0.320357	  0.867787	  0.845083
 -0.328008	  0.851499	  0.832938
 -0.327812	  0.833366	  0.819089
 -0.323307	  0.817653	  0.804308
 -0.320008	  0.805942	  0.788526
 -0.319944	  0.791323	  0.775608
 -0.319816	  0.774495	  0.764082
 -0.319178	  0.759770	  0.751142
 -0.317760	  0.746259	  0.741262
 -0.310889	  0.730631	  0.727238
 -0.304914	  0.713648	  0.707138
 -0.302494	  0.702593	  0.693352
 -0.302507	  0.695144	  0.684187
 -0.308040	  0.678369	  0.663376
 -0.313688	  0.663083	  0.643850
 -0.317046	  0.650585	  0.631512
 -0.315331	  0.636958	  0.614461
 -0.308619	  0.628195	  0.600311
 -0.294939	  0.617763	  0.581212
 -0.287544	  0.609334	  0.568409
 -0.284667	  0.600609	  0.558110
 -0.282297	  0.581044	  0.535545
 -0.277864	  0.569344	  0.517461
 -0.275832	  0.563251	  0.509184
 -0.266573	  0.547296	  0.492825
 -0.255561	  0.529733	  0.476948
 -0.251043	  0.521019	  0.468367
 -0.243083	  0.507945	  0.452722
 -0.234262	  0.497271	  0.435839
 -0.226465	  0.489003	  0.422516
 -0.216108	  0.477511	  0.406370
 -0.207267	  0.468377	  0.392073
 -0.198720	  0.457579	  0.376861
 -0.189130	  0.441878	  0.361669
 -0.181662	  0.429671	  0.353682
 -0.170969	  0.412489	  0.345495
 -0.157726	  0.389790	  0.332377
 -0.152759	  0.380326	  0.325461
 -0.146404	  0.374507	  0.314130
 -0.135492	  0.359884	  0.298422
 -0.126574	  0.343415	  0.286966
 -0.118834	  0.327299	  0.277416
 -0.111193	  0.311414	  0.267941
 -0.103715	  0.295193	  0.258744
 -0.096285	  0.279450	  0.248920
 -0.088831	  0.263640	  0.239326
 -0.081182	  0.248498	  0.228937
 -0.073499	  0.233475	  0.218272
 -0.065861	  0.218591	  0.207484
 -0.058277	  0.204186	  0.196079
 -0.050726	  0.190149	  0.184752
 -0.046323	  0.178891	  0.173516
 -0.047969	  0.164114	  0.160939
 -0.043129	  0.136878	  0.142261
 -0.035468	  0.127009	  0.129067
 -0.032177	  0.119669	  0.123275
 -0.027257	  0.102038	  0.107816
 -0.019508	  0.086960	  0.089490
 -0.014735	  0.077893	  0.078853
 -0.008227	  0.063480	  0.062276
 -0.001167	  0.051374	  0.044129
  0.003337	  0.042515	  0.031667
  0.010237	  0.029228	  0.019417
  0.018180	  0.012872	  0.005323
  0.025087	  0.002571	 -0.005284
  0.036703	 -0.012002	 -0.025774
  0.044544	 -0.022837	 -0.045219
  0.048668	 -0.026307	 -0.053995
  0.052824	 -0.033935	 -0.066912
  0.060990	 -0.053209	 -0.092701
  0.067418	 -0.066558	 -0.108878
  0.070686	 -0.072731	 -0.114917
  0.086598	 -0.091692	 -0.130977
  0.095972	 -0.101111	 -0.143387
  0.101161	 -0.106102	 -0.157078
  0.108618	 -0.109137	 -0.176579
  0.119840	 -0.121977	 -0.197422
  0.126279	 -0.134184	 -0.208381
  0.135445	 -0.148646	 -0.219154
  0.144230	 -0.162261	 -0.233281
  0.149326	 -0.171903	 -0.247363
  0.153008	 -0.179854	 -0.261499
  0.161694	 -0.193218	 -0.282281
  0.172178	 -0.207496	 -0.294749
  0.181796	 -0.220452	 -0.301797
  0.195238	 -0.236815	 -0.311813
  0.207976	 -0.249266	 -0.328113
  0.215482	 -0.256657	 -0.338303
  0.220210	 -0.271036	 -0.352733
  0.224901	 -0.287086	 -0.367292
  0.230567	 -0.299168	 -0.383617
  0.230779	 -0.309025	 -0.401271
  0.229644	 -0.318622	 -0.418538
  0.231293	 -0.325570	 -0.436630
  0.237427	 -0.330417	 -0.457060
  0.249765	 -0.352131	 -0.470586
  0.257816	 -0.368455	 -0.480239
  0.265344	 -0.376094	 -0.487478
  0.280325	 -0.386791	 -0.506928
  0.290793	 -0.398732	 -0.523118
  0.297936	 -0.406975	 -0.531065
  0.308417	 -0.421550	 -0.532726
  0.326077	 -0.451654	 -0.547900
  0.327626	 -0.467123	 -0.562792
  0.324243	 -0.480547	 -0.575370
  0.316027	 -0.493878	 -0.598639
  0.317568	 -0.501208	 -0.620840
  0.324812	 -0.507952	 -0.634958
  0.334900	 -0.517090	 -0.648394
  0.345401	 -0.526492	 -0.662233
  0.353531	 -0.536441	 -0.677317
  0.360936	 -0.547902	 -0.698513
  0.366477	 -0.553253	 -0.713764
  0.376006	 -0.557561	 -0.732869
  0.385540	 -0.563429	 -0.747149
  0.396193	 -0.572710	 -0.761971
  0.404659	 -0.583555	 -0.778000
  0.411251	 -0.593922	 -0.795494
  0.416417	 -0.602458	 -0.809807
  0.422123	 -0.613584	 -0.826311
  0.428657	 -0.624426	 -0.842266
  0.436323	 -0.633993	 -0.858070
  0.442778	 -0.645165	 -0.872674
  0.449915	 -0.656697	 -0.888041
  0.456737	 -0.668413	 -0.903767
  0.462847	 -0.679631	 -0.919328
  0.469376	 -0.690514	 -0.933303
  0.476812	 -0.703541	 -0.947085
  0.483877	 -0.717966	 -0.959637
  0.490809	 -0.733546	 -0.970574
  0.498733	 -0.748407	 -0.978885
  0.510005	 -0.762560	 -0.988810
  0.519778	 -0.770905	 -1.005337
  0.524339	 -0.781913	 -1.031586
  0.521630	 -0.800090	 -1.047715
  0.518083	 -0.816598	 -1.055654
  0.520632	 -0.837148	 -1.062295
  0.526735	 -0.854298	 -1.071331
  0.536384	 -0.870066	 -1.081951
  0.547215	 -0.886951	 -1.090725
  0.558072	 -0.903009	 -1.094427
  0.567664	 -0.919417	 -1.098779
  0.573646	 -0.937019	 -1.106250
  0.577783	 -0.954759	 -1.115131
  0.583394	 -0.971595	 -1.124063
  0.589823	 -0.985967	 -1.132772
  0.596808	 -0.997915	 -1.145435
  0.598871	 -1.017315	 -1.161310
  0.603317	 -1.044975	 -1.177631
  0.605799	 -1.052056	 -1.181805
  0.610370	 -1.060987	 -1.187017
  0.618638	 -1.077762	 -1.203072
  0.627073	 -1.100587	 -1.214922
  0.638761	 -1.117079	 -1.221028
  0.653302	 -1.127092	 -1.225577
  0.664946	 -1.141883	 -1.239483
  0.661412	 -1.154739	 -1.255675
  0.661725	 -1.169064	 -1.271492
  0.663450	 -1.185173	 -1.284560
  0.664398	 -1.200300	 -1.299234
  0.666490	 -1.215314	 -1.313087
  0.673917	 -1.232115	 -1.324515
  0.694109	 -1.244381	 -1.336198
  0.712654	 -1.251111	 -1.349525
  0.722327	 -1.260257	 -1.365474
  0.728612	 -1.270360	 -1.379952
  0.735691	 -1.277801	 -1.389386
  0.752068	 -1.288980	 -1.406290
  0.764033	 -1.298714	 -1.425893
  0.767520	 -1.307025	 -1.442682
  0.766887	 -1.313502	 -1.459428
  0.766073	 -1.320182	 -1.477986
  0.774263	 -1.332048	 -1.499063
  0.786042	 -1.342857	 -1.517983
  0.794656	 -1.350048	 -1.531618
  0.800458	 -1.356404	 -1.544709
  0.803746	 -1.361732	 -1.566485
  0.812261	 -1.368134	 -1.586131
  0.825368	 -1.374950	 -1.603248
  0.834516	 -1.379634	 -1.613667
  0.840118	 -1.387614	 -1.629396
  0.851107	 -1.400484	 -1.646057
  0.860778	 -1.413490	 -1.659202
  0.868302	 -1.428302	 -1.671751
  0.874116	 -1.443850	 -1.683510
  0.879353	 -1.457910	 -1.693650
  0.891063	 -1.472737	 -1.702436
  0.902571	 -1.486758	 -1.712204
  0.919173	 -1.504051	 -1.735439
  0.898723	 -1.547835	 -1.757235
  0.904099	 -1.563329	 -1.768681
