 -1.917608	 -1.188624	  0.746123
 -1.960252	 -1.187769	  0.760890
 -1.941917	 -1.190980	  0.753421
 -1.926058	 -1.191161	  0.746537
 -1.910037	 -1.188439	  0.738342
 -1.880031	 -1.185464	  0.727939
 -1.863984	 -1.188320	  0.720994
 -1.851970	 -1.191021	  0.714907
 -1.833556	 -1.194576	  0.704351
 -1.817804	 -1.198201	  0.694296
 -1.801607	 -1.201339	  0.684128
 -1.779063	 -1.204058	  0.670831
 -1.763156	 -1.205572	  0.664402
 -1.743475	 -1.206598	  0.657795
 -1.726739	 -1.206957	  0.652023
 -1.714050	 -1.204011	  0.646573
 -1.685184	 -1.194906	  0.633142
 -1.665560	 -1.191924	  0.623775
 -1.653161	 -1.191165	  0.616143
 -1.635493	 -1.190963	  0.611047
 -1.613989	 -1.189350	  0.599285
 -1.599441	 -1.186742	  0.589515
 -1.576669	 -1.184457	  0.580576
 -1.563084	 -1.181874	  0.573037
 -1.546114	 -1.174811	  0.564513
 -1.527050	 -1.167287	  0.558013
 -1.509955	 -1.159469	  0.551898
 -1.493553	 -1.153334	  0.545686
 -1.474059	 -1.146333	  0.539223
 -1.456377	 -1.139015	  0.532443
 -1.439934	 -1.130649	  0.522386
 -1.426844	 -1.123853	  0.512856
 -1.409532	 -1.113325	  0.497748
 -1.397924	 -1.106405	  0.490060
 -1.379181	 -1.093392	  0.480702
 -1.359884	 -1.086039	  0.473212
 -1.345478	 -1.084054	  0.468556
 -1.320915	 -1.079219	  0.468839
 -1.301679	 -1.071385	  0.462567
 -1.291976	 -1.062982	  0.449544
 -1.280514	 -1.050328	  0.435539
 -1.266866	 -1.039183	  0.426534
 -1.247747	 -1.032594	  0.423510
 -1.228830	 -1.023646	  0.417962
 -1.215540	 -1.012460	  0.403640
 -1.202012	 -1.002982	  0.387614
 -1.188118	 -0.995856	  0.379062
 -1.171933	 -0.987892	  0.372238
 -1.156858	 -0.977971	  0.365309
 -1.141327	 -0.965255	  0.358077
 -1.129371	 -0.951843	  0.356057
 -1.115603	 -0.935489	  0.354349
 -1.097919	 -0.922343	  0.350437
 -1.078486	 -0.913132	  0.347297
 -1.059334	 -0.906855	  0.346736
 -1.040996	 -0.902835	  0.350282
 -1.020990	 -0.898936	  0.352143
 -0.997306	 -0.888336	  0.349391
 -0.982327	 -0.877400	  0.349676
 -0.971724	 -0.868822	  0.351696
 -0.960151	 -0.859061	  0.352364
 -0.942838	 -0.843053	  0.353994
 -0.925657	 -0.822417	  0.358218
 -0.915731	 -0.810215	  0.359465
 -0.898972	 -0.798506	  0.360838
 -0.866429	 -0.791686	  0.357876
 -0.852488	 -0.790388	  0.353548
 -0.836138	 -0.788362	  0.348979
 -0.809933	 -0.781768	  0.343382
 -0.794198	 -0.775534	  0.343083
 -0.780409	 -0.766900	  0.344969
 -0.760969	 -0.754630	  0.350778
 -0.745227	 -0.745423	  0.354603
 -0.726223	 -0.727946	  0.359821
 -0.706522	 -0.714768	  0.360625
 -0.696186	 -0.708790	  0.360097
 -0.675685	 -0.702693	  0.359781
 -0.652178	 -0.698181	  0.357217
 -0.633668	 -0.699461	  0.350714
 -0.617359	 -0.699307	  0.345085
 -0.597660	 -0.692803	  0.342813
 -0.566703	 -0.689303	  0.341086
 -0.550490	 -0.690445	  0.336449
 -0.536430	 -0.692234	  0.332288
 -0.514830	 -0.693332	  0.325367
 -0.495489	 -0.694651	  0.318466
 -0.478005	 -0.697222	  0.310594
 -0.459405	 -0.699793	  0.302903
 -0.440632	 -0.702649	  0.294815
 -0.424080	 -0.705641	  0.286450
 -0.408354	 -0.711082	  0.276625
 -0.391706	 -0.720703	  0.266990
 -0.373718	 -0.727641	  0.260320
 -0.352552	 -0.732496	  0.253854
 -0.338349	 -0.738417	  0.248881
 -0.322177	 -0.745924	  0.242344
 -0.304688	 -0.754473	  0.231454
 -0.286545	 -0.763851	  0.217773
 -0.280799	 -0.766857	  0.212331
 -0.261937	 -0.775827	  0.201498
 -0.235650	 -0.784629	  0.186362
 -0.224578	 -0.786326	  0.178658
 -0.212375	 -0.790644	  0.171520
 -0.194109	 -0.797476	  0.159991
 -0.177692	 -0.804584	  0.150394
 -0.159552	 -0.810952	  0.139400
 -0.142018	 -0.815544	  0.129794
 -0.128899	 -0.818242	  0.124330
 -0.107365	 -0.821353	  0.117476
 -0.086173	 -0.824467	  0.104932
 -0.074521	 -0.828418	  0.094087
 -0.058322	 -0.832153	  0.076701
 -0.046120	 -0.834507	  0.064962
 -0.032383	 -0.835844	  0.051276
 -0.017402	 -0.837628	  0.038924
  0.002130	 -0.841119	  0.028821
  0.019308	 -0.844733	  0.018963
  0.035057	 -0.849466	  0.006659
  0.051200	 -0.852242	 -0.003188
  0.072649	 -0.853361	 -0.011026
  0.093567	 -0.854991	 -0.020217
  0.109418	 -0.857729	 -0.030727
  0.121042	 -0.860761	 -0.038914
  0.138173	 -0.860522	 -0.054159
  0.152444	 -0.854157	 -0.069317
  0.165528	 -0.848398	 -0.084174
  0.181476	 -0.843062	 -0.096216
  0.194297	 -0.834199	 -0.109158
  0.205232	 -0.825436	 -0.123483
  0.214222	 -0.816896	 -0.139198
  0.222443	 -0.809034	 -0.155654
  0.229839	 -0.801997	 -0.172854
  0.237188	 -0.794982	 -0.190081
  0.244626	 -0.788586	 -0.207509
  0.252166	 -0.783460	 -0.225309
  0.259732	 -0.778348	 -0.243103
  0.267286	 -0.773251	 -0.260906
  0.275247	 -0.768906	 -0.278728
  0.283798	 -0.765720	 -0.296524
  0.292355	 -0.762555	 -0.314322
  0.300925	 -0.759393	 -0.332112
  0.309495	 -0.756233	 -0.349892
  0.318637	 -0.754046	 -0.367566
  0.327622	 -0.751703	 -0.385311
  0.336675	 -0.749672	 -0.403028
  0.346068	 -0.748301	 -0.420678
  0.355375	 -0.747050	 -0.438425
  0.364888	 -0.746086	 -0.456066
  0.375019	 -0.745405	 -0.473425
  0.385175	 -0.744389	 -0.490688
  0.396553	 -0.743288	 -0.507402
  0.409703	 -0.744074	 -0.521638
  0.422423	 -0.746928	 -0.533824
  0.433547	 -0.750040	 -0.557514
  0.443537	 -0.748641	 -0.575774
  0.453194	 -0.745408	 -0.590615
  0.463248	 -0.738869	 -0.604784
  0.476346	 -0.735357	 -0.620508
  0.496610	 -0.738717	 -0.636948
  0.510548	 -0.743108	 -0.648717
  0.523570	 -0.746963	 -0.659802
  0.545124	 -0.748029	 -0.673387
  0.561763	 -0.745405	 -0.681201
  0.575732	 -0.741365	 -0.689850
  0.594975	 -0.736849	 -0.704992
  0.609028	 -0.737110	 -0.718946
  0.618927	 -0.738891	 -0.730941
  0.636982	 -0.746332	 -0.751362
  0.655636	 -0.749383	 -0.763318
  0.671229	 -0.751217	 -0.770469
  0.693058	 -0.749135	 -0.779057
  0.713007	 -0.744961	 -0.786458
  0.725620	 -0.742153	 -0.790151
  0.745631	 -0.737307	 -0.795862
  0.766284	 -0.735906	 -0.804049
  0.785520	 -0.736493	 -0.810377
  0.804545	 -0.736542	 -0.816602
  0.823675	 -0.737806	 -0.822191
  0.842732	 -0.739649	 -0.828051
  0.861752	 -0.741553	 -0.833934
  0.880826	 -0.744108	 -0.839366
  0.899929	 -0.747889	 -0.843914
  0.919037	 -0.751690	 -0.848438
  0.938135	 -0.755500	 -0.852951
  0.956917	 -0.760212	 -0.856858
  0.973887	 -0.764207	 -0.856782
  0.995467	 -0.769994	 -0.861403
  1.015952	 -0.778402	 -0.868589
  1.032334	 -0.784957	 -0.870460
  1.049655	 -0.792129	 -0.870530
  1.070307	 -0.801124	 -0.874974
  1.084293	 -0.806903	 -0.883327
  1.103229	 -0.814725	 -0.896101
  1.123029	 -0.823708	 -0.900275
  1.137148	 -0.829721	 -0.900863
  1.157483	 -0.839106	 -0.900439
  1.174744	 -0.847556	 -0.900853
  1.192797	 -0.856409	 -0.900814
  1.217149	 -0.868887	 -0.904128
  1.230496	 -0.875146	 -0.908296
  1.244088	 -0.879953	 -0.910960
  1.267993	 -0.884496	 -0.915418
  1.291857	 -0.887948	 -0.930236
  1.303955	 -0.894588	 -0.942732
  1.315142	 -0.903645	 -0.948429
  1.333798	 -0.913462	 -0.954160
  1.349822	 -0.922340	 -0.963625
  1.365848	 -0.928628	 -0.971916
  1.384768	 -0.930478	 -0.978091
  1.400646	 -0.932426	 -0.984655
  1.419219	 -0.931708	 -0.994240
  1.442968	 -0.930247	 -1.003139
  1.466476	 -0.928166	 -1.002902
  1.478899	 -0.926224	 -1.001712
  1.501064	 -0.922815	 -1.003324
  1.524397	 -0.918602	 -1.002036
  1.539713	 -0.915676	 -1.000174
  1.558773	 -0.910825	 -0.997307
  1.584880	 -0.904015	 -0.990768
  1.594725	 -0.900633	 -0.985029
  1.611056	 -0.893025	 -0.971643
  1.632072	 -0.884894	 -0.961659
  1.646284	 -0.879149	 -0.957397
  1.667422	 -0.871947	 -0.954488
  1.688551	 -0.864482	 -0.946789
  1.700783	 -0.859335	 -0.940772
  1.714500	 -0.845480	 -0.932140
  1.725447	 -0.827198	 -0.926664
  1.739993	 -0.813226	 -0.920108
  1.754642	 -0.800141	 -0.914678
  1.770348	 -0.787357	 -0.912407
  1.784147	 -0.776906	 -0.908507
  1.802167	 -0.766794	 -0.899859
  1.828363	 -0.754884	 -0.896296
  1.841605	 -0.744029	 -0.901960
  1.849226	 -0.727126	 -0.915004
  1.864553	 -0.706806	 -0.933053
  1.882110	 -0.699799	 -0.938237
  1.897191	 -0.695572	 -0.940710
  1.918155	 -0.690169	 -0.944519
  1.934607	 -0.682483	 -0.946296
  1.958991	 -0.669097	 -0.945572
  1.980475	 -0.657232	 -0.952485
  1.993540	 -0.650011	 -0.959308
  2.008344	 -0.644986	 -0.966937
  2.026763	 -0.641531	 -0.977870
  2.041456	 -0.634648	 -0.994944
  2.055886	 -0.632224	 -1.011661
  2.072163	 -0.632907	 -1.020606
  2.090441	 -0.626831	 -1.031144
  2.107651	 -0.625659	 -1.043181
  2.124840	 -0.634566	 -1.054171
  2.141833	 -0.632000	 -1.064401
