  2.167857	 -0.007473	 -1.101278
  2.172988	 -0.008594	 -1.115303
  2.178119	 -0.009715	 -1.129328
  2.167403	 -0.011196	 -1.112321
  2.159994	 -0.009187	 -1.093730
  2.152477	 -0.010072	 -1.074828
  2.148421	 -0.015914	 -1.054623
  2.145768	 -0.018589	 -1.035401
  2.139122	 -0.017742	 -1.016141
  2.131305	 -0.015427	 -0.998155
  2.123567	 -0.012852	 -0.979437
  2.116380	 -0.009323	 -0.960924
  2.109528	 -0.007588	 -0.942335
  2.102691	 -0.006532	 -0.923871
  2.096377	 -0.004042	 -0.904786
  2.088467	 -0.003515	 -0.887274
  2.081373	 -0.000622	 -0.868223
  2.072945	  0.000988	 -0.850724
  2.066292	  0.003833	 -0.831882
  2.059367	  0.006390	 -0.813405
  2.053421	  0.009591	 -0.794459
  2.049383	  0.013251	 -0.775183
  2.045301	  0.016895	 -0.756063
  2.040402	  0.020089	 -0.737054
  2.035039	  0.021619	 -0.718297
  2.032420	  0.022733	 -0.695947
  2.032469	  0.026589	 -0.677119
  2.032649	  0.033697	 -0.658374
  2.031676	  0.037549	 -0.638455
  2.029636	  0.039148	 -0.618986
  2.028553	  0.043549	 -0.599966
  2.029419	  0.046985	 -0.578053
  2.027935	  0.046776	 -0.559186
  2.023874	  0.047454	 -0.539923
  2.021514	  0.046433	 -0.518483
  2.022045	  0.050722	 -0.499600
  2.020371	  0.055368	 -0.480342
  2.018133	  0.057021	 -0.459334
  2.016581	  0.058318	 -0.440504
  2.013978	  0.062104	 -0.420584
  2.011316	  0.067913	 -0.402032
  2.008909	  0.073147	 -0.382498
  2.007045	  0.077189	 -0.362845
  2.015424	  0.064958	 -0.350065
  2.025606	  0.048295	 -0.341694
  2.036261	  0.033406	 -0.333586
  2.045203	  0.018613	 -0.327159
  2.054632	  0.002130	 -0.321322
  2.065856	 -0.014724	 -0.314884
  2.075183	 -0.030974	 -0.307549
  2.082141	 -0.047001	 -0.298781
  2.089923	 -0.063430	 -0.290540
  2.097287	 -0.078773	 -0.280192
  2.102494	 -0.091609	 -0.266052
  2.108095	 -0.104354	 -0.251670
  2.113649	 -0.117102	 -0.237315
  2.118522	 -0.130044	 -0.222885
  2.123559	 -0.143080	 -0.209099
  2.126746	 -0.156632	 -0.196121
  2.130224	 -0.167252	 -0.176168
  2.133851	 -0.174773	 -0.158480
  2.140843	 -0.184179	 -0.144248
  2.146087	 -0.194327	 -0.126763
  2.148096	 -0.202402	 -0.108253
  2.146390	 -0.208645	 -0.090060
  2.144516	 -0.213594	 -0.069023
  2.147805	 -0.219150	 -0.051570
  2.149858	 -0.224947	 -0.033332
  2.153597	 -0.230840	 -0.011372
  2.151226	 -0.232105	  0.006795
  2.148481	 -0.233120	  0.027032
  2.152833	 -0.236977	  0.046508
  2.153559	 -0.237149	  0.067686
  2.149259	 -0.233726	  0.085580
  2.143886	 -0.228378	  0.104241
  2.138211	 -0.220357	  0.123018
  2.130178	 -0.213909	  0.139210
  2.119581	 -0.212827	  0.155313
  2.115665	 -0.211148	  0.171622
  2.109032	 -0.213215	  0.190664
  2.102890	 -0.214008	  0.209494
  2.091513	 -0.205648	  0.223405
  2.080624	 -0.195301	  0.236650
  2.068947	 -0.185145	  0.249260
  2.058081	 -0.174628	  0.262624
  2.046317	 -0.164437	  0.274880
  2.034114	 -0.153486	  0.285837
  2.020940	 -0.141361	  0.293981
  2.006947	 -0.129050	  0.301331
  1.992608	 -0.117078	  0.308521
  1.978439	 -0.105445	  0.315805
  1.963283	 -0.093624	  0.320418
  1.948267	 -0.081193	  0.325023
  1.933392	 -0.068592	  0.329591
  1.918636	 -0.055850	  0.333853
  1.904168	 -0.042481	  0.336859
  1.891243	 -0.027414	  0.340981
  1.881386	 -0.010957	  0.345653
  1.871358	  0.005192	  0.348873
  1.861253	  0.021102	  0.347883
  1.851568	  0.042725	  0.346101
  1.842415	  0.061177	  0.350853
  1.830730	  0.074244	  0.358492
  1.816674	  0.088974	  0.365745
  1.805384	  0.105164	  0.370994
  1.795326	  0.124478	  0.377428
  1.787467	  0.141706	  0.381464
  1.788370	  0.164270	  0.379819
  1.791035	  0.186210	  0.381410
  1.789260	  0.205683	  0.398282
  1.786299	  0.227225	  0.401063
  1.776375	  0.232804	  0.412825
  1.765710	  0.249143	  0.422496
  1.752802	  0.264320	  0.432063
  1.742992	  0.279750	  0.442496
  1.734581	  0.288550	  0.459027
  1.728735	  0.293153	  0.478135
  1.721432	  0.298376	  0.495733
  1.715433	  0.302856	  0.513641
  1.710664	  0.305816	  0.534737
  1.703602	  0.310192	  0.552290
  1.695380	  0.316028	  0.569911
  1.689677	  0.319881	  0.588690
  1.685348	  0.323188	  0.607651
  1.680100	  0.326629	  0.627177
  1.677057	  0.325335	  0.648371
  1.673151	  0.325428	  0.666293
  1.669848	  0.329622	  0.686925
  1.667887	  0.331637	  0.707919
  1.661087	  0.333486	  0.725050
  1.654005	  0.336863	  0.745373
  1.651207	  0.337894	  0.765765
  1.651541	  0.335116	  0.783133
  1.644377	  0.339091	  0.804177
  1.640090	  0.341746	  0.823300
  1.637729	  0.340215	  0.840847
  1.629122	  0.344730	  0.862521
  1.618716	  0.352520	  0.882097
  1.619408	  0.351487	  0.897104
  1.614650	  0.352481	  0.918059
  1.609578	  0.353990	  0.936741
  1.601912	  0.356432	  0.955848
  1.594460	  0.358787	  0.974389
  1.588865	  0.361428	  0.993723
  1.584093	  0.364740	  1.013103
  1.579745	  0.367946	  1.032250
  1.574532	  0.370223	  1.051219
  1.568498	  0.371851	  1.070179
  1.563468	  0.373513	  1.089579
  1.559715	  0.375622	  1.109439
  1.555648	  0.377810	  1.128874
  1.552190	  0.380202	  1.148496
  1.549622	  0.385070	  1.167908
  1.548812	  0.391472	  1.186948
  1.546581	  0.397889	  1.205617
  1.544363	  0.402400	  1.224600
  1.539273	  0.407800	  1.242585
  1.533897	  0.412737	  1.261593
  1.527907	  0.417740	  1.280013
  1.522383	  0.421190	  1.298767
  1.519440	  0.420012	  1.321445
  1.519445	  0.417386	  1.341898
  1.517449	  0.420286	  1.360604
  1.513877	  0.424531	  1.379026
  1.508797	  0.428396	  1.398539
  1.503054	  0.431968	  1.417398
  1.497147	  0.435905	  1.436103
  1.492655	  0.439150	  1.455711
  1.488814	  0.442514	  1.475081
  1.485373	  0.443883	  1.494787
  1.481139	  0.445860	  1.514384
  1.476931	  0.447647	  1.533747
  1.475116	  0.449092	  1.553901
  1.474538	  0.450169	  1.573510
  1.474518	  0.450168	  1.593721
  1.472314	  0.449358	  1.613534
  1.467894	  0.447972	  1.632920
  1.460028	  0.449432	  1.652851
  1.452451	  0.454453	  1.670598
  1.448011	  0.459420	  1.688875
  1.441820	  0.461455	  1.707851
  1.436081	  0.462188	  1.727581
  1.427364	  0.464852	  1.745437
  1.421333	  0.470137	  1.763319
  1.414297	  0.473127	  1.781940
  1.406164	  0.474411	  1.800124
  1.398286	  0.478203	  1.818012
  1.389518	  0.484080	  1.835128
  1.380203	  0.486863	  1.852868
  1.370727	  0.487180	  1.871250
  1.361103	  0.490035	  1.888247
  1.352423	  0.496523	  1.904937
  1.346202	  0.505806	  1.931182
  1.337672	  0.510486	  1.948655
  1.329142	  0.515166	  1.966128
