 -2.283336	 -0.002714	  1.149330
 -2.294096	 -0.009886	  1.148089
 -2.277532	  0.001159	  1.149998
 -2.261058	  0.012371	  1.151686
 -2.245041	  0.024330	  1.152351
 -2.229023	  0.036289	  1.152999
 -2.212469	  0.047496	  1.152460
 -2.195260	  0.057401	  1.150079
 -2.178043	  0.067293	  1.147680
 -2.160749	  0.076982	  1.145057
 -2.142812	  0.084190	  1.139942
 -2.124869	  0.091375	  1.134802
 -2.106834	  0.098553	  1.130041
 -2.087972	  0.105171	  1.129636
 -2.069234	  0.111557	  1.129003
 -2.050466	  0.115535	  1.127031
 -2.027791	  0.118839	  1.125536
 -2.007945	  0.122791	  1.125374
 -1.991634	  0.132639	  1.128259
 -1.973275	  0.142413	  1.129158
 -1.952016	  0.151634	  1.132450
 -1.940712	  0.164686	  1.138234
 -1.926998	  0.180170	  1.142937
 -1.910430	  0.192991	  1.146889
 -1.892219	  0.199197	  1.145615
 -1.870636	  0.206132	  1.144553
 -1.852923	  0.217242	  1.149356
 -1.838912	  0.229930	  1.152694
 -1.825465	  0.243776	  1.153978
 -1.809765	  0.258990	  1.155793
 -1.799377	  0.275312	  1.158103
 -1.787525	  0.291118	  1.155562
 -1.773109	  0.305183	  1.152178
 -1.758900	  0.318445	  1.149202
 -1.742122	  0.328273	  1.147232
 -1.724149	  0.334730	  1.146102
 -1.699865	  0.341657	  1.139104
 -1.686717	  0.351652	  1.131631
 -1.674163	  0.365859	  1.127027
 -1.658601	  0.379135	  1.122475
 -1.641315	  0.388211	  1.119636
 -1.623753	  0.397605	  1.119563
 -1.604106	  0.406984	  1.115606
 -1.590252	  0.417082	  1.111064
 -1.573456	  0.428604	  1.110971
 -1.554332	  0.438732	  1.110182
 -1.536251	  0.448632	  1.106751
 -1.522131	  0.459532	  1.107599
 -1.508016	  0.472906	  1.113705
 -1.490118	  0.482439	  1.115997
 -1.469426	  0.495284	  1.114029
 -1.455729	  0.506162	  1.117989
 -1.442519	  0.516372	  1.121134
 -1.425478	  0.525462	  1.115584
 -1.399588	  0.534145	  1.108942
 -1.382359	  0.537188	  1.115314
 -1.368050	  0.541168	  1.126016
 -1.347246	  0.554944	  1.131986
 -1.328309	  0.566539	  1.130228
 -1.313856	  0.571928	  1.128427
 -1.298185	  0.579227	  1.125612
 -1.273720	  0.592690	  1.130514
 -1.258972	  0.597976	  1.134201
 -1.240278	  0.604369	  1.138520
 -1.216745	  0.607996	  1.137505
 -1.199959	  0.612678	  1.137335
 -1.178956	  0.621614	  1.139828
 -1.164174	  0.634063	  1.145329
 -1.153375	  0.648166	  1.153142
 -1.134918	  0.659465	  1.161951
 -1.118099	  0.666534	  1.166932
 -1.102686	  0.675268	  1.173497
 -1.081353	  0.682742	  1.183070
 -1.059906	  0.684609	  1.187417
 -1.045813	  0.684925	  1.189380
 -1.026814	  0.688769	  1.196452
 -1.005926	  0.691014	  1.202879
 -0.987025	  0.686642	  1.206560
 -0.967880	  0.683664	  1.212672
 -0.949580	  0.687293	  1.222080
 -0.932079	  0.687815	  1.229660
 -0.911197	  0.674568	  1.234053
 -0.891854	  0.665523	  1.236125
 -0.875783	  0.663566	  1.239441
 -0.856218	  0.662701	  1.247355
 -0.838111	  0.657790	  1.256153
 -0.820872	  0.650274	  1.263965
 -0.803264	  0.645871	  1.270695
 -0.782235	  0.640778	  1.274736
 -0.764744	  0.629382	  1.278076
 -0.751472	  0.619663	  1.286467
 -0.736056	  0.609715	  1.296466
 -0.718828	  0.596589	  1.301749
 -0.699416	  0.590751	  1.300498
 -0.680855	  0.587395	  1.303665
 -0.664026	  0.579754	  1.310486
 -0.644971	  0.565303	  1.314150
 -0.625158	  0.555251	  1.311170
 -0.607719	  0.556711	  1.309884
 -0.586640	  0.555205	  1.311952
 -0.567104	  0.553360	  1.312380
 -0.546899	  0.549506	  1.310002
 -0.527411	  0.545670	  1.307596
 -0.507966	  0.541707	  1.305120
 -0.488434	  0.539329	  1.301956
 -0.469645	  0.538643	  1.298139
 -0.454221	  0.548491	  1.291889
 -0.438890	  0.559281	  1.285486
 -0.424485	  0.569889	  1.276726
 -0.410122	  0.580722	  1.267946
 -0.395549	  0.591200	  1.259151
 -0.381109	  0.601903	  1.250221
 -0.366167	  0.611345	  1.240644
 -0.351350	  0.619636	  1.229910
 -0.336614	  0.627758	  1.219086
 -0.321519	  0.635444	  1.208418
 -0.306332	  0.642801	  1.197578
 -0.291508	  0.649391	  1.186314
 -0.278186	  0.654653	  1.175325
 -0.262533	  0.660763	  1.159397
 -0.249992	  0.669117	  1.144126
 -0.237431	  0.677102	  1.136061
 -0.225400	  0.685096	  1.128686
 -0.208855	  0.699210	  1.117401
 -0.204522	  0.710092	  1.101501
 -0.204067	  0.725087	  1.085579
 -0.201125	  0.741078	  1.077995
 -0.194694	  0.760775	  1.074809
 -0.189115	  0.779949	  1.078763
 -0.179054	  0.798137	  1.085881
 -0.164389	  0.814488	  1.090734
 -0.149876	  0.830170	  1.088349
 -0.145953	  0.848842	  1.084362
 -0.144532	  0.870854	  1.082910
 -0.143456	  0.889781	  1.085056
 -0.142127	  0.908013	  1.086871
 -0.138682	  0.932353	  1.093388
 -0.132278	  0.945863	  1.098274
 -0.127603	  0.965872	  1.104204
 -0.125858	  0.983493	  1.111836
 -0.129627	  1.002755	  1.120766
 -0.132914	  1.022199	  1.128656
 -0.129598	  1.038372	  1.139140
 -0.126534	  1.056322	  1.148794
 -0.123908	  1.073298	  1.159219
 -0.122119	  1.091314	  1.168446
 -0.118769	  1.109467	  1.176550
 -0.115777	  1.127612	  1.184389
 -0.112656	  1.145776	  1.192234
 -0.108870	  1.163932	  1.199973
 -0.100688	  1.181285	  1.206469
 -0.092450	  1.198358	  1.212827
 -0.083927	  1.215343	  1.219059
 -0.075357	  1.232321	  1.225285
 -0.066465	  1.249309	  1.231388
 -0.054713	  1.264879	  1.235492
 -0.043718	  1.280952	  1.239163
 -0.029767	  1.294957	  1.242106
 -0.009894	  1.307832	  1.244051
  0.002304	  1.320680	  1.245761
  0.013541	  1.338210	  1.248807
  0.029370	  1.350836	  1.249414
  0.044045	  1.361303	  1.248214
  0.059977	  1.378215	  1.247527
  0.077858	  1.391748	  1.248077
  0.092555	  1.396397	  1.244970
  0.112814	  1.404771	  1.240529
  0.129117	  1.415803	  1.239288
  0.143808	  1.428164	  1.238959
  0.160042	  1.441045	  1.236522
  0.179624	  1.453372	  1.230177
  0.194075	  1.460254	  1.228028
  0.214354	  1.470119	  1.228962
  0.228111	  1.482169	  1.230206
  0.243246	  1.495917	  1.230940
  0.259183	  1.506886	  1.233610
  0.274657	  1.521165	  1.235627
  0.289748	  1.533212	  1.233981
  0.308816	  1.543189	  1.229512
  0.331662	  1.551791	  1.224983
  0.347842	  1.561421	  1.224860
  0.361486	  1.570503	  1.227381
  0.378188	  1.589420	  1.229346
  0.387313	  1.605743	  1.227190
  0.398142	  1.619776	  1.226259
  0.416480	  1.635503	  1.229246
  0.426450	  1.649726	  1.234685
  0.438360	  1.665583	  1.236718
  0.452140	  1.681312	  1.236434
  0.466432	  1.695217	  1.235973
  0.481720	  1.706431	  1.237535
  0.497756	  1.717126	  1.237761
  0.514868	  1.727908	  1.234522
  0.529975	  1.740696	  1.232763
  0.545100	  1.752136	  1.232673
  0.563197	  1.758441	  1.230201
  0.585181	  1.764172	  1.222758
  0.602664	  1.771522	  1.215063
  0.618176	  1.781829	  1.210875
  0.634898	  1.791259	  1.210541
  0.652586	  1.800166	  1.204847
  0.666907	  1.815873	  1.199217
  0.681210	  1.829367	  1.199473
  0.702448	  1.840622	  1.203620
  0.717828	  1.848860	  1.200256
  0.734241	  1.862548	  1.195111
  0.752477	  1.876112	  1.194790
  0.767052	  1.884825	  1.199111
  0.784085	  1.893498	  1.206363
  0.804221	  1.902518	  1.213036
  0.821915	  1.908557	  1.213558
  0.840439	  1.916391	  1.211649
  0.859669	  1.926878	  1.211640
  0.875840	  1.938751	  1.211341
  0.888959	  1.950983	  1.212906
  0.906917	  1.965144	  1.217300
  0.924918	  1.975019	  1.219859
  0.940183	  1.981384	  1.220716
  0.960936	  1.989429	  1.223134
  0.980032	  1.997976	  1.222386
  0.994567	  2.009176	  1.218266
  1.011323	  2.022346	  1.217191
  1.030218	  2.029280	  1.214706
  1.052427	  2.035072	  1.211975
  1.069827	  2.044931	  1.211772
