 -0.281695	  1.597270	 -1.802703
 -0.274036	  1.621039	 -1.818858
 -0.266377	  1.644808	 -1.835013
 -0.273142	  1.628112	 -1.826327
 -0.280472	  1.611237	 -1.818497
 -0.287759	  1.594310	 -1.810753
 -0.291304	  1.576137	 -1.803219
 -0.293981	  1.557769	 -1.795775
 -0.296604	  1.539391	 -1.788338
 -0.297585	  1.520753	 -1.781172
 -0.295568	  1.501970	 -1.774621
 -0.293481	  1.483183	 -1.768085
 -0.291392	  1.464396	 -1.761551
 -0.289218	  1.445557	 -1.755191
 -0.284679	  1.427219	 -1.749471
 -0.281135	  1.408235	 -1.743561
 -0.279028	  1.390456	 -1.737972
 -0.271642	  1.369917	 -1.729983
 -0.265345	  1.353611	 -1.721966
 -0.260506	  1.334465	 -1.715002
 -0.256007	  1.316019	 -1.710444
 -0.244536	  1.301169	 -1.704486
 -0.231232	  1.285846	 -1.694540
 -0.221919	  1.268766	 -1.688956
 -0.214166	  1.252172	 -1.682521
 -0.205447	  1.235520	 -1.675788
 -0.193990	  1.221178	 -1.669216
 -0.181698	  1.206713	 -1.661608
 -0.168841	  1.194229	 -1.652286
 -0.157171	  1.180050	 -1.642590
 -0.148813	  1.162674	 -1.636001
 -0.140135	  1.145000	 -1.629403
 -0.127946	  1.132200	 -1.619870
 -0.115720	  1.123144	 -1.606670
 -0.104839	  1.111805	 -1.594582
 -0.088402	  1.099881	 -1.583917
 -0.076281	  1.094799	 -1.572105
 -0.064568	  1.084524	 -1.558604
 -0.052487	  1.075751	 -1.544942
 -0.042199	  1.069847	 -1.530045
 -0.031501	  1.065691	 -1.511652
 -0.018577	  1.063236	 -1.495645
 -0.005329	  1.052221	 -1.485377
  0.005007	  1.041317	 -1.472269
  0.014484	  1.030046	 -1.454977
  0.027972	  1.026820	 -1.440083
  0.033974	  1.023497	 -1.423237
  0.041470	  1.017125	 -1.404882
  0.057863	  1.001736	 -1.398326
  0.062729	  0.993066	 -1.382553
  0.072183	  0.979474	 -1.369949
  0.084490	  0.965503	 -1.361038
  0.096882	  0.952107	 -1.353512
  0.109114	  0.942378	 -1.341586
  0.121284	  0.931220	 -1.330133
  0.138391	  0.923612	 -1.319547
  0.153005	  0.913442	 -1.311190
  0.165159	  0.901693	 -1.302052
  0.180035	  0.895962	 -1.289048
  0.195595	  0.890307	 -1.278009
  0.212535	  0.887360	 -1.266866
  0.226907	  0.884000	 -1.256698
  0.243756	  0.879243	 -1.246376
  0.261684	  0.873123	 -1.237705
  0.278924	  0.863849	 -1.232786
  0.298375	  0.853875	 -1.216920
  0.305551	  0.849733	 -1.198993
  0.311181	  0.849642	 -1.172873
  0.320115	  0.851712	 -1.158054
  0.336024	  0.845629	 -1.142480
  0.351783	  0.835295	 -1.136428
  0.371528	  0.827992	 -1.128631
  0.386683	  0.818935	 -1.116470
  0.398262	  0.809133	 -1.102394
  0.403188	  0.802018	 -1.084537
  0.413662	  0.794251	 -1.070020
  0.427153	  0.780958	 -1.054081
  0.433465	  0.769240	 -1.040485
  0.442463	  0.764153	 -1.024106
  0.448646	  0.758942	 -1.004397
  0.454660	  0.751789	 -0.988513
  0.464574	  0.739678	 -0.973766
  0.469602	  0.719777	 -0.960784
  0.468818	  0.713269	 -0.942607
  0.473592	  0.703157	 -0.925602
  0.477567	  0.690881	 -0.908761
  0.483311	  0.682785	 -0.892311
  0.495105	  0.674717	 -0.877366
  0.505510	  0.660505	 -0.864808
  0.509462	  0.647903	 -0.850241
  0.513795	  0.636491	 -0.836105
  0.519949	  0.622512	 -0.816839
  0.525497	  0.614543	 -0.801619
  0.532718	  0.605714	 -0.786308
  0.538469	  0.592446	 -0.771931
  0.542278	  0.578281	 -0.757262
  0.543299	  0.569187	 -0.738040
  0.546867	  0.559627	 -0.719792
  0.546058	  0.545722	 -0.706413
  0.545714	  0.534334	 -0.691598
  0.548785	  0.523326	 -0.672227
  0.549751	  0.508053	 -0.656420
  0.548955	  0.492017	 -0.646066
  0.554506	  0.477576	 -0.631471
  0.559750	  0.465875	 -0.616350
  0.558835	  0.455791	 -0.600638
  0.558179	  0.443362	 -0.584633
  0.559753	  0.429041	 -0.568371
  0.562006	  0.418621	 -0.551296
  0.573285	  0.411285	 -0.530979
  0.582926	  0.401725	 -0.517523
  0.583449	  0.389158	 -0.501258
  0.583194	  0.375609	 -0.487240
  0.586538	  0.367804	 -0.469239
  0.588979	  0.357874	 -0.451208
  0.592116	  0.345766	 -0.434467
  0.595594	  0.336552	 -0.418479
  0.598855	  0.327902	 -0.399369
  0.602143	  0.319884	 -0.382709
  0.605834	  0.316696	 -0.363802
  0.609184	  0.311655	 -0.341144
  0.611460	  0.301829	 -0.325258
  0.615405	  0.292713	 -0.308868
  0.617961	  0.287728	 -0.288275
  0.618952	  0.287687	 -0.267362
  0.625727	  0.292070	 -0.247523
  0.633625	  0.292812	 -0.229609
  0.635572	  0.293301	 -0.211247
  0.635368	  0.300162	 -0.191564
  0.636861	  0.310285	 -0.174647
  0.646899	  0.322752	 -0.162588
  0.658443	  0.331718	 -0.151928
  0.669880	  0.344283	 -0.141886
  0.682412	  0.359456	 -0.138095
  0.695426	  0.374065	 -0.134862
  0.709404	  0.387369	 -0.132422
  0.724452	  0.402355	 -0.133190
  0.735784	  0.418358	 -0.135064
  0.746757	  0.433960	 -0.136934
  0.757132	  0.450968	 -0.143216
  0.771811	  0.466379	 -0.147307
  0.785941	  0.478316	 -0.149494
  0.801393	  0.488634	 -0.154976
  0.815847	  0.502658	 -0.163532
  0.828635	  0.519266	 -0.167758
  0.841855	  0.531561	 -0.172487
  0.852852	  0.543010	 -0.182386
  0.865175	  0.556298	 -0.192792
  0.877236	  0.570237	 -0.201358
  0.888098	  0.585566	 -0.208122
  0.899457	  0.599706	 -0.215367
  0.911852	  0.612277	 -0.219669
  0.926642	  0.626411	 -0.223651
  0.942362	  0.644013	 -0.228984
  0.950891	  0.658938	 -0.237684
  0.958364	  0.672611	 -0.247352
  0.971555	  0.688991	 -0.250341
  0.984334	  0.703119	 -0.255090
  0.996281	  0.718259	 -0.250220
  1.010390	  0.733820	 -0.255579
  1.023594	  0.747412	 -0.258620
  1.033680	  0.768789	 -0.259002
  1.040947	  0.789399	 -0.256359
  1.049723	  0.801468	 -0.250389
  1.064306	  0.815251	 -0.248446
  1.081378	  0.829419	 -0.248710
  1.097815	  0.836839	 -0.249886
  1.110556	  0.851417	 -0.248551
  1.129268	  0.857408	 -0.245417
  1.146845	  0.865995	 -0.246159
  1.165224	  0.869260	 -0.260342
  1.182424	  0.883124	 -0.255169
  1.204000	  0.886275	 -0.246219
  1.225452	  0.880363	 -0.245398
  1.241111	  0.873689	 -0.256058
  1.258560	  0.873894	 -0.269011
  1.274434	  0.877660	 -0.283098
  1.291715	  0.876733	 -0.289551
  1.312700	  0.873935	 -0.291905
  1.329958	  0.874789	 -0.301659
  1.345100	  0.878353	 -0.313385
  1.360915	  0.880618	 -0.327138
  1.378627	  0.880092	 -0.338768
  1.392981	  0.882189	 -0.348885
  1.408287	  0.884864	 -0.363850
  1.426413	  0.888733	 -0.374029
  1.445139	  0.889984	 -0.385608
  1.463339	  0.895303	 -0.388958
  1.482390	  0.900762	 -0.394717
  1.501065	  0.906197	 -0.401148
  1.517975	  0.913127	 -0.407975
  1.535522	  0.918886	 -0.416588
  1.552580	  0.925624	 -0.424586
  1.570686	  0.932247	 -0.431473
  1.589118	  0.938958	 -0.436509
  1.607446	  0.946489	 -0.440250
  1.625119	  0.954890	 -0.443608
  1.642730	  0.963629	 -0.447331
  1.660183	  0.972680	 -0.451248
  1.677902	  0.981983	 -0.452764
  1.695017	  0.992060	 -0.450431
  1.712106	  1.002162	 -0.448001
  1.729195	  1.012265	 -0.445572
  1.746284	  1.022367	 -0.443142
  1.763302	  1.032465	 -0.440528
  1.777466	  1.042407	 -0.430580
  1.791386	  1.052302	 -0.420173
  1.805302	  1.062196	 -0.409760
  1.819205	  1.072086	 -0.399326
  1.832478	  1.081763	 -0.387944
  1.842636	  1.090207	 -0.372948
  1.852630	  1.098569	 -0.357827
  1.861842	  1.105939	 -0.342128
  1.869404	  1.111306	 -0.325430
  1.876133	  1.117587	 -0.307002
  1.883310	  1.128087	 -0.288728
  1.891814	  1.137016	 -0.273636
  1.900348	  1.139315	 -0.257390
  1.906040	  1.142815	 -0.237965
  1.910761	  1.146902	 -0.218555
  1.916930	  1.150439	 -0.199718
  1.923724	  1.151859	 -0.181368
  1.930071	  1.152099	 -0.162130
  1.934471	  1.154916	 -0.141949
  1.934689	  1.156780	 -0.122184
  1.935393	  1.156359	 -0.101984
  1.935636	  1.153381	 -0.082260
  1.935459	  1.151370	 -0.061926
  1.935229	  1.150390	 -0.041900
  1.937466	  1.148331	 -0.022323
  1.939761	  1.145381	 -0.002803
  1.941625	  1.139866	  0.016385
  1.943409	  1.133353	  0.035254
  1.944267	  1.126314	  0.054442
  1.945465	  1.119669	  0.071795
  1.944890	  1.114222	  0.091758
  1.943963	  1.108236	  0.111392
  1.943330	  1.099963	  0.131236
  1.942262	  1.094044	  0.146530
  1.942801	  1.086013	  0.165535
  1.943903	  1.076635	  0.184384
  1.946216	  1.063620	  0.198923
  1.948944	  1.052781	  0.215338
  1.954095	  1.043773	  0.230891
  1.959200	  1.031307	  0.247844
  1.961492	  1.016514	  0.260996
  1.967332	  1.000775	  0.270435
  1.970613	  0.988645	  0.285519
  1.978083	  0.976666	  0.298027
  1.985112	  0.964220	  0.313255
  2.000137	  0.952128	  0.321872
  2.008491	  0.934583	  0.328609
  2.017194	  0.919814	  0.337832
  2.028595	  0.906761	  0.348257
  2.044362	  0.895340	  0.353020
  2.065531	  0.884453	  0.356009
  2.078499	  0.872671	  0.362865
  2.088872	  0.859669	  0.373619
  2.101629	  0.848917	  0.384341
  2.115301	  0.837087	  0.393643
  2.128845	  0.828374	  0.403722
  2.145844	  0.819043	  0.415577
  2.164808	  0.808965	  0.419079
  2.181200	  0.802352	  0.423290
  2.195241	  0.794103	  0.433363
  2.210307	  0.785313	  0.444570
  2.228325	  0.780381	  0.453857
  2.245561	  0.772584	  0.462529
  2.258887	  0.763722	  0.473229
  2.273811	  0.756798	  0.484507
  2.289627	  0.750904	  0.495535
  2.305677	  0.744717	  0.506167
  2.321350	  0.738926	  0.517160
  2.331239	  0.735277	  0.524112
  2.337013	  0.733146	  0.528172
