 -1.900453	 -1.709579	 -0.230920
 -1.920278	 -1.705749	 -0.246335
 -1.904670	 -1.708765	 -0.234198
 -1.888796	 -1.711494	 -0.222342
 -1.872779	 -1.714064	 -0.210644
 -1.856762	 -1.716633	 -0.198945
 -1.840349	 -1.719289	 -0.187830
 -1.823914	 -1.721949	 -0.176747
 -1.807257	 -1.725142	 -0.166149
 -1.790293	 -1.729171	 -0.156350
 -1.773313	 -1.733289	 -0.146619
 -1.756068	 -1.739657	 -0.138740
 -1.738824	 -1.746025	 -0.130861
 -1.721701	 -1.752877	 -0.123124
 -1.704641	 -1.759964	 -0.115460
 -1.687627	 -1.766998	 -0.107647
 -1.670746	 -1.773884	 -0.099424
 -1.653865	 -1.780769	 -0.091200
 -1.637082	 -1.786661	 -0.082056
 -1.620352	 -1.792195	 -0.072598
 -1.603690	 -1.797489	 -0.062883
 -1.587587	 -1.801231	 -0.051628
 -1.571483	 -1.804972	 -0.040374
 -1.555624	 -1.808231	 -0.028631
 -1.540008	 -1.811047	 -0.016457
 -1.524394	 -1.813858	 -0.004280
 -1.509158	 -1.815980	  0.008502
 -1.493922	 -1.818103	  0.021284
 -1.478903	 -1.819934	  0.034363
 -1.464067	 -1.821526	  0.047680
 -1.449268	 -1.823064	  0.061046
 -1.434775	 -1.824180	  0.074783
 -1.420283	 -1.825296	  0.088521
 -1.405700	 -1.826395	  0.102163
 -1.391064	 -1.827486	  0.115750
 -1.376376	 -1.828622	  0.129277
 -1.361417	 -1.830004	  0.142481
 -1.346459	 -1.831385	  0.155684
 -1.331848	 -1.833164	  0.169225
 -1.317314	 -1.835026	  0.182837
 -1.303382	 -1.837410	  0.196987
 -1.289812	 -1.840091	  0.211432
 -1.276317	 -1.842973	  0.225909
 -1.262996	 -1.846301	  0.240452
 -1.249676	 -1.849630	  0.254994
 -1.235509	 -1.853189	  0.268656
 -1.220862	 -1.856881	  0.281764
 -1.206214	 -1.860572	  0.294872
 -1.189469	 -1.864396	  0.305118
 -1.172186	 -1.868235	  0.314422
 -1.154809	 -1.872212	  0.323489
 -1.136636	 -1.877623	  0.329851
 -1.118463	 -1.883035	  0.336212
 -1.101134	 -1.888729	  0.344413
 -1.084349	 -1.894555	  0.353595
 -1.068866	 -1.899359	  0.365309
 -1.054723	 -1.903236	  0.378908
 -1.041099	 -1.906693	  0.393136
 -1.028312	 -1.909500	  0.408256
 -1.015633	 -1.912423	  0.423445
 -1.003583	 -1.916005	  0.439000
 -0.991534	 -1.919587	  0.454556
 -0.979256	 -1.924116	  0.469680
 -0.966953	 -1.928753	  0.484752
 -0.954320	 -1.933591	  0.499483
 -0.941150	 -1.938760	  0.513618
 -0.927979	 -1.943929	  0.527753
 -0.914163	 -1.949181	  0.541227
 -0.899934	 -1.954481	  0.554245
 -0.885705	 -1.959781	  0.567262
 -0.870644	 -1.965141	  0.579279
 -0.855166	 -1.970524	  0.590745
 -0.839688	 -1.975906	  0.602211
 -0.823605	 -1.981265	  0.612823
 -0.807325	 -1.986612	  0.623136
 -0.791045	 -1.991959	  0.633450
 -0.774395	 -1.997553	  0.643015
 -0.757741	 -2.003149	  0.652573
 -0.741059	 -2.008929	  0.661969
 -0.724348	 -2.014909	  0.671187
 -0.707675	 -2.020917	  0.680456
 -0.691238	 -2.027087	  0.690035
 -0.674802	 -2.033258	  0.699615
 -0.658617	 -2.039097	  0.709811
 -0.642501	 -2.044849	  0.720164
 -0.626421	 -2.050263	  0.730753
 -0.610450	 -2.054875	  0.741873
 -0.594479	 -2.059487	  0.752993
 -0.578647	 -2.063487	  0.764540
 -0.562872	 -2.067255	  0.776243
 -0.547141	 -2.070936	  0.788032
 -0.531590	 -2.074270	  0.800159
 -0.516039	 -2.077604	  0.812285
 -0.500617	 -2.080973	  0.824566
 -0.485246	 -2.084356	  0.836907
 -0.469916	 -2.087821	  0.849275
 -0.454702	 -2.091518	  0.861720
 -0.439488	 -2.095216	  0.874164
 -0.424405	 -2.099314	  0.886642
 -0.409337	 -2.103458	  0.899124
 -0.394328	 -2.107905	  0.911572
 -0.379366	 -2.112580	  0.923992
 -0.364406	 -2.117351	  0.936380
 -0.349468	 -2.122638	  0.948582
 -0.334530	 -2.127925	  0.960785
 -0.319551	 -2.133644	  0.972740
 -0.304556	 -2.139554	  0.984581
 -0.289526	 -2.145547	  0.996336
 -0.274353	 -2.151882	  1.007722
 -0.259179	 -2.158218	  1.019108
 -0.243719	 -2.164143	  1.030327
 -0.228135	 -2.169886	  1.041470
 -0.212552	 -2.175630	  1.052613
 -0.196421	 -2.180023	  1.063591
 -0.180238	 -2.184274	  1.074547
 -0.164055	 -2.188524	  1.085503
 -0.147490	 -2.191315	  1.096356
 -0.130918	 -2.194082	  1.107207
 -0.114301	 -2.196679	  1.118029
 -0.097417	 -2.198160	  1.128648
 -0.080534	 -2.199640	  1.139266
 -0.063555	 -2.200778	  1.149774
 -0.046438	 -2.201375	  1.160101
 -0.029320	 -2.201972	  1.170428
 -0.012189	 -2.202115	  1.180747
  0.004946	 -2.202126	  1.191062
  0.021988	 -2.202164	  1.201530
  0.038823	 -2.202263	  1.212326
  0.055659	 -2.202362	  1.223121
  0.072097	 -2.202736	  1.234509
  0.088498	 -2.203133	  1.245947
  0.104659	 -2.203842	  1.257708
  0.120660	 -2.204751	  1.269672
  0.136730	 -2.206163	  1.281495
  0.152883	 -2.208350	  1.293083
  0.169037	 -2.210537	  1.304671
  0.185190	 -2.212724	  1.316259
  0.203130	 -2.215622	  1.328844
  0.219396	 -2.218456	  1.340131
