 -1.309761	 -1.468729	 -1.564558
 -1.297744	 -1.459668	 -1.560523
 -1.288374	 -1.452602	 -1.557376
 -1.275344	 -1.438147	 -1.548142
 -1.267193	 -1.428371	 -1.540154
 -1.256704	 -1.413501	 -1.526842
 -1.245783	 -1.398000	 -1.516995
 -1.235836	 -1.382729	 -1.510921
 -1.223788	 -1.364529	 -1.507004
 -1.213080	 -1.349691	 -1.505552
 -1.201015	 -1.334486	 -1.505619
 -1.188540	 -1.318123	 -1.507741
 -1.173908	 -1.296100	 -1.508365
 -1.163631	 -1.277003	 -1.504552
 -1.159185	 -1.267136	 -1.502173
 -1.150647	 -1.247380	 -1.493884
 -1.139899	 -1.230627	 -1.486875
 -1.129675	 -1.213493	 -1.481277
 -1.116223	 -1.195762	 -1.478122
 -1.102601	 -1.181835	 -1.475724
 -1.092503	 -1.168462	 -1.474656
 -1.077845	 -1.151383	 -1.473667
 -1.065138	 -1.134698	 -1.471496
 -1.056372	 -1.120932	 -1.469960
 -1.045586	 -1.102280	 -1.465056
 -1.034095	 -1.083859	 -1.462413
 -1.024547	 -1.069539	 -1.460229
 -1.007918	 -1.055570	 -1.460979
 -0.984649	 -1.043106	 -1.465560
 -0.967142	 -1.027472	 -1.470627
 -0.957960	 -1.012678	 -1.470840
 -0.952059	 -0.992830	 -1.475531
 -0.948159	 -0.973192	 -1.487067
 -0.944452	 -0.956751	 -1.500850
 -0.939855	 -0.942901	 -1.516244
 -0.932233	 -0.930784	 -1.532831
 -0.924753	 -0.920271	 -1.549096
 -0.918807	 -0.909809	 -1.565621
 -0.915484	 -0.901361	 -1.582990
 -0.912702	 -0.891607	 -1.600315
 -0.908697	 -0.881596	 -1.617330
 -0.901366	 -0.870812	 -1.632691
 -0.892068	 -0.860196	 -1.646801
 -0.883077	 -0.849065	 -1.660966
 -0.875348	 -0.837212	 -1.675228
 -0.868291	 -0.823932	 -1.688312
 -0.860461	 -0.809671	 -1.700041
 -0.852284	 -0.794937	 -1.710851
 -0.844002	 -0.780005	 -1.721255
 -0.835317	 -0.764986	 -1.731110
 -0.824289	 -0.749240	 -1.736460
 -0.813374	 -0.733494	 -1.742029
 -0.802542	 -0.717716	 -1.748225
 -0.790338	 -0.702528	 -1.752866
 -0.777138	 -0.688021	 -1.756192
 -0.763632	 -0.673441	 -1.755821
 -0.750002	 -0.658871	 -1.754087
 -0.735971	 -0.644886	 -1.750804
 -0.721251	 -0.632630	 -1.744516
 -0.705869	 -0.623006	 -1.736648
 -0.691570	 -0.614378	 -1.727673
 -0.677483	 -0.605446	 -1.717841
 -0.663224	 -0.597063	 -1.707037
 -0.648911	 -0.590170	 -1.696012
 -0.635819	 -0.585457	 -1.685085
 -0.622466	 -0.581004	 -1.673646
 -0.607462	 -0.577183	 -1.660749
 -0.590909	 -0.572257	 -1.648170
 -0.578235	 -0.562130	 -1.637556
 -0.569219	 -0.549572	 -1.622749
 -0.558281	 -0.543616	 -1.603065
 -0.547227	 -0.542792	 -1.584599
 -0.534941	 -0.541755	 -1.563635
 -0.523848	 -0.540495	 -1.547678
 -0.512853	 -0.535363	 -1.530641
 -0.504725	 -0.533100	 -1.518024
 -0.493908	 -0.532254	 -1.502461
 -0.485578	 -0.530429	 -1.487335
 -0.472258	 -0.530475	 -1.470971
 -0.456220	 -0.529873	 -1.453914
 -0.443628	 -0.525258	 -1.440338
 -0.428555	 -0.520340	 -1.427289
 -0.414078	 -0.516164	 -1.415898
 -0.402107	 -0.510912	 -1.408579
 -0.387203	 -0.501282	 -1.398364
 -0.377811	 -0.481907	 -1.385704
 -0.368594	 -0.465230	 -1.375221
 -0.364599	 -0.451487	 -1.366370
 -0.356452	 -0.432457	 -1.356818
 -0.353865	 -0.413177	 -1.344197
 -0.354337	 -0.395467	 -1.333768
 -0.353826	 -0.385012	 -1.329659
 -0.350533	 -0.364506	 -1.320499
 -0.346609	 -0.352863	 -1.311940
 -0.339469	 -0.334394	 -1.302694
 -0.330849	 -0.308943	 -1.293196
 -0.327557	 -0.295105	 -1.286981
 -0.323524	 -0.282702	 -1.281344
 -0.320565	 -0.262899	 -1.272134
 -0.317556	 -0.242846	 -1.261986
 -0.313336	 -0.225646	 -1.253514
 -0.311070	 -0.210594	 -1.243717
 -0.308074	 -0.180334	 -1.233962
 -0.306853	 -0.170339	 -1.232951
 -0.303038	 -0.153278	 -1.232641
 -0.299988	 -0.125903	 -1.226998
 -0.299849	 -0.106022	 -1.221415
 -0.300820	 -0.096125	 -1.216865
 -0.300174	 -0.073392	 -1.213337
 -0.296700	 -0.052541	 -1.212146
 -0.291209	 -0.034822	 -1.212988
 -0.280113	 -0.013509	 -1.215334
 -0.268902	  0.005927	 -1.213798
 -0.257102	  0.026113	 -1.201694
 -0.251373	  0.040101	 -1.192436
 -0.243280	  0.058401	 -1.185010
 -0.231550	  0.074039	 -1.177330
 -0.223175	  0.087791	 -1.172076
 -0.214198	  0.103184	 -1.169386
 -0.206579	  0.124085	 -1.165649
 -0.200655	  0.148745	 -1.163814
 -0.191921	  0.171292	 -1.156401
 -0.187398	  0.182226	 -1.150913
 -0.184848	  0.192187	 -1.145447
 -0.176777	  0.214641	 -1.142135
 -0.164631	  0.230567	 -1.138613
 -0.137015	  0.254126	 -1.124065
 -0.128863	  0.264366	 -1.119849
 -0.126286	  0.267268	 -1.119958
 -0.112064	  0.286785	 -1.120068
 -0.102095	  0.305829	 -1.117897
 -0.093005	  0.326493	 -1.110428
 -0.081974	  0.340880	 -1.102235
 -0.072190	  0.350051	 -1.094941
 -0.047920	  0.366602	 -1.071988
 -0.035120	  0.388542	 -1.060578
 -0.030784	  0.398441	 -1.052884
 -0.026888	  0.407870	 -1.046214
 -0.012076	  0.423406	 -1.030171
 -0.000417	  0.433052	 -1.020274
  0.014365	  0.445657	 -1.015156
  0.028971	  0.455244	 -1.006558
  0.044498	  0.467789	 -0.993561
  0.056466	  0.481191	 -0.984454
  0.065280	  0.493036	 -0.976464
  0.075257	  0.509467	 -0.969449
  0.085495	  0.526537	 -0.959722
  0.096710	  0.539554	 -0.948585
  0.108008	  0.551804	 -0.939638
  0.119726	  0.565357	 -0.933388
  0.134321	  0.581328	 -0.925608
  0.146738	  0.595832	 -0.917152
  0.159154	  0.609694	 -0.909818
  0.170284	  0.620847	 -0.902390
  0.185835	  0.634974	 -0.894743
  0.199339	  0.648922	 -0.887105
  0.208860	  0.661681	 -0.880397
  0.217453	  0.675220	 -0.873341
  0.231190	  0.695806	 -0.862111
  0.238673	  0.707589	 -0.854759
  0.246844	  0.720166	 -0.846963
  0.265004	  0.738752	 -0.833615
  0.281660	  0.750340	 -0.828073
  0.296947	  0.761104	 -0.827790
  0.315138	  0.772367	 -0.827264
  0.331401	  0.781513	 -0.823319
  0.348372	  0.795299	 -0.819742
  0.363318	  0.806985	 -0.814122
  0.371417	  0.814694	 -0.809931
  0.390639	  0.827449	 -0.798497
  0.412368	  0.840373	 -0.786853
  0.422216	  0.845255	 -0.784006
  0.446611	  0.856298	 -0.782659
  0.468524	  0.870297	 -0.784544
  0.479818	  0.875966	 -0.787752
  0.501596	  0.888387	 -0.789865
  0.522391	  0.894042	 -0.793639
  0.544150	  0.892998	 -0.798277
  0.560817	  0.887744	 -0.799962
  0.583879	  0.885395	 -0.805020
  0.604407	  0.889216	 -0.812468
  0.622011	  0.890759	 -0.819644
  0.633752	  0.888149	 -0.832992
  0.650720	  0.882597	 -0.861563
  0.660825	  0.881854	 -0.875997
  0.671091	  0.882541	 -0.884601
  0.691545	  0.884737	 -0.910442
  0.697993	  0.884971	 -0.921308
  0.713520	  0.887782	 -0.935166
  0.729619	  0.889677	 -0.945816
  0.748147	  0.892950	 -0.956422
  0.763177	  0.891893	 -0.969078
  0.774907	  0.894952	 -0.994673
  0.781496	  0.897670	 -1.003415
  0.794927	  0.904120	 -1.017433
  0.812770	  0.912813	 -1.031179
  0.828942	  0.917418	 -1.043949
  0.840903	  0.918905	 -1.054893
  0.856866	  0.918934	 -1.070906
  0.869885	  0.922937	 -1.087845
  0.877484	  0.933126	 -1.101288
  0.884704	  0.947665	 -1.114082
  0.894306	  0.961846	 -1.126768
  0.903263	  0.974565	 -1.137623
  0.914887	  0.986347	 -1.148692
  0.927403	  1.002965	 -1.157820
  0.934476	  1.025030	 -1.161927
  0.938310	  1.039527	 -1.163256
  0.944063	  1.060497	 -1.163682
  0.950174	  1.080350	 -1.165326
  0.954141	  1.099179	 -1.165990
  0.957522	  1.118524	 -1.164653
  0.961533	  1.135524	 -1.160889
  0.966941	  1.153984	 -1.153724
  0.967983	  1.177352	 -1.145443
  0.967965	  1.200488	 -1.143171
  0.967893	  1.213232	 -1.146045
  0.966594	  1.228553	 -1.153457
  0.966803	  1.258830	 -1.155621
  0.966735	  1.276629	 -1.149463
  0.965752	  1.293847	 -1.141823
  0.964405	  1.318310	 -1.136985
  0.963288	  1.335057	 -1.139305
  0.962154	  1.355824	 -1.143232
  0.961153	  1.375369	 -1.139832
  0.960409	  1.392082	 -1.131601
  0.958917	  1.415599	 -1.124219
  0.958454	  1.434610	 -1.125972
  0.958117	  1.454831	 -1.135212
  0.958391	  1.481835	 -1.138359
  0.958241	  1.497749	 -1.131030
  0.958288	  1.511614	 -1.121092
  0.956870	  1.539099	 -1.112246
  0.957388	  1.557219	 -1.109862
  0.960891	  1.572475	 -1.106148
  0.965307	  1.592289	 -1.090291
  0.961179	  1.608753	 -1.076251
  0.952608	  1.620258	 -1.064411
  0.942105	  1.643470	 -1.039485
  0.939100	  1.650493	 -1.029540
  0.935730	  1.656970	 -1.020084
  0.933012	  1.670481	 -1.003804
  0.927429	  1.684521	 -0.985938
  0.920953	  1.696048	 -0.970557
  0.912410	  1.705217	 -0.954986
  0.903655	  1.714173	 -0.939398
  0.894197	  1.722566	 -0.923941
  0.882066	  1.728572	 -0.909257
  0.869717	  1.734371	 -0.894636
  0.857370	  1.739905	 -0.879919
  0.845091	  1.743664	 -0.864596
  0.832817	  1.747276	 -0.849224
  0.820550	  1.750887	 -0.833851
  0.808573	  1.754581	 -0.818313
  0.800167	  1.759250	 -0.800828
  0.792548	  1.763634	 -0.782906
  0.785382	  1.767446	 -0.764482
  0.777190	  1.771974	 -0.746666
  0.768562	  1.777920	 -0.729895
  0.765921	  1.784889	 -0.711469
  0.764933	  1.791670	 -0.692649
  0.764027	  1.798451	 -0.673855
  0.763121	  1.805231	 -0.655062
  0.762223	  1.812009	 -0.636272
  0.761761	  1.818651	 -0.617494
  0.767032	  1.823476	 -0.599034
  0.779241	  1.825226	 -0.583466
  0.791991	  1.826731	 -0.568147
  0.804722	  1.828219	 -0.552911
  0.818403	  1.829112	 -0.539696
  0.838239	  1.827077	 -0.531360
  0.857283	  1.824839	 -0.520975
  0.870344	  1.824964	 -0.511426
  0.888752	  1.824408	 -0.502500
  0.907701	  1.822657	 -0.491198
  0.923598	  1.824731	 -0.476984
  0.937536	  1.830142	 -0.460291
  0.946257	  1.839622	 -0.445581
  0.961099	  1.846727	 -0.433959
  0.976504	  1.855019	 -0.423693
  0.990100	  1.864675	 -0.412790
  1.003469	  1.873824	 -0.401547
  1.016652	  1.881588	 -0.388177
  1.031071	  1.889434	 -0.375808
  1.043586	  1.900025	 -0.364746
  1.057202	  1.914899	 -0.353104
  1.068509	  1.931034	 -0.348132
  1.081882	  1.947848	 -0.346438
  1.095944	  1.964146	 -0.343101
  1.107200	  1.977056	 -0.336482
  1.117077	  1.987378	 -0.327620
  1.132565	  2.002551	 -0.311451
  1.147745	  2.020580	 -0.303699
  1.152053	  2.027390	 -0.301039
  1.159176	  2.044211	 -0.290760
  1.170316	  2.061922	 -0.276101
  1.184332	  2.076642	 -0.268782
  1.196002	  2.091461	 -0.268663
  1.204714	  2.109646	 -0.268464
  1.227455	  2.138688	 -0.252592
  1.239230	  2.152541	 -0.244260
