 -0.838753	 -2.211002	  0.628986
 -0.846040	 -2.220620	  0.634782
 -0.839564	 -2.204060	  0.622213
 -0.831428	 -2.191602	  0.614444
 -0.821294	 -2.174113	  0.602936
 -0.809467	 -2.158057	  0.594310
 -0.801663	 -2.146886	  0.588212
 -0.790942	 -2.129662	  0.577621
 -0.779716	 -2.113179	  0.568318
 -0.773376	 -2.102639	  0.561738
 -0.761518	 -2.086293	  0.551306
 -0.748503	 -2.070355	  0.541024
 -0.737630	 -2.058026	  0.533204
 -0.730669	 -2.046849	  0.528585
 -0.725170	 -2.023701	  0.524213
 -0.719529	 -2.005804	  0.513284
 -0.714711	 -1.992007	  0.497818
 -0.708791	 -1.981075	  0.480023
 -0.703008	 -1.965811	  0.460169
 -0.696905	 -1.950635	  0.448308
 -0.691689	 -1.935471	  0.440633
 -0.685122	 -1.923022	  0.435860
 -0.679902	 -1.902045	  0.428775
 -0.675204	 -1.881541	  0.423946
 -0.670522	 -1.863997	  0.414177
 -0.665203	 -1.843762	  0.395558
 -0.663877	 -1.836798	  0.384680
 -0.660343	 -1.829089	  0.371969
 -0.654088	 -1.817460	  0.354345
 -0.640042	 -1.802635	  0.338565
 -0.627766	 -1.790913	  0.328240
 -0.611440	 -1.769878	  0.313372
 -0.606600	 -1.759004	  0.306052
 -0.602867	 -1.749247	  0.299200
 -0.594510	 -1.731946	  0.290664
 -0.577614	 -1.718638	  0.282350
 -0.566270	 -1.707914	  0.269176
 -0.554806	 -1.696220	  0.253074
 -0.536587	 -1.686910	  0.241274
 -0.516775	 -1.681659	  0.235179
 -0.496654	 -1.682383	  0.234914
 -0.477189	 -1.679916	  0.229476
 -0.459245	 -1.675336	  0.221357
 -0.441365	 -1.670758	  0.213520
 -0.423159	 -1.666411	  0.205924
 -0.403738	 -1.665103	  0.199517
 -0.384166	 -1.665883	  0.194116
 -0.364636	 -1.667653	  0.190143
 -0.345030	 -1.669333	  0.187011
 -0.325259	 -1.670394	  0.183419
 -0.305722	 -1.672013	  0.178900
 -0.286598	 -1.674732	  0.173875
 -0.267231	 -1.678676	  0.169773
 -0.248067	 -1.683104	  0.165906
 -0.229023	 -1.687706	  0.161923
 -0.209981	 -1.692150	  0.157843
 -0.190980	 -1.695080	  0.152429
 -0.171979	 -1.697397	  0.146748
 -0.153879	 -1.696209	  0.138517
 -0.136185	 -1.693767	  0.129581
 -0.119496	 -1.687149	  0.120973
 -0.103966	 -1.679581	  0.113340
 -0.104729	 -1.660345	  0.110235
 -0.107893	 -1.641083	  0.106927
 -0.112170	 -1.622160	  0.101660
 -0.116202	 -1.603409	  0.095892
 -0.119989	 -1.584781	  0.089664
 -0.125819	 -1.567078	  0.082329
 -0.132270	 -1.550264	  0.073676
 -0.139954	 -1.533968	  0.065193
 -0.148382	 -1.518467	  0.056031
 -0.157213	 -1.503058	  0.047352
 -0.166896	 -1.487974	  0.038968
 -0.176747	 -1.472863	  0.030318
 -0.186638	 -1.457651	  0.022125
 -0.196903	 -1.442623	  0.013705
 -0.206563	 -1.427198	  0.005364
 -0.216313	 -1.411744	 -0.002835
 -0.225225	 -1.395975	 -0.011513
 -0.234288	 -1.380321	 -0.020166
 -0.243585	 -1.364870	 -0.028794
 -0.252928	 -1.349368	 -0.037365
 -0.261461	 -1.333544	 -0.046275
 -0.268879	 -1.316766	 -0.054374
 -0.276195	 -1.299946	 -0.062387
 -0.282903	 -1.283165	 -0.070958
 -0.290109	 -1.266329	 -0.078973
 -0.296628	 -1.249128	 -0.086798
 -0.300797	 -1.230652	 -0.093133
 -0.305132	 -1.211995	 -0.098886
 -0.309225	 -1.193335	 -0.104872
 -0.313031	 -1.174715	 -0.111171
 -0.316676	 -1.155881	 -0.117440
 -0.315981	 -1.136981	 -0.125205
 -0.312694	 -1.118771	 -0.133249
 -0.308926	 -1.100937	 -0.141506
 -0.304891	 -1.083212	 -0.149930
 -0.300231	 -1.065935	 -0.158893
 -0.295461	 -1.048459	 -0.167796
 -0.284909	 -1.034587	 -0.177842
 -0.276386	 -1.023120	 -0.187951
 -0.268308	 -1.012838	 -0.199805
 -0.254444	 -0.998785	 -0.215935
 -0.232857	 -0.977268	 -0.230680
 -0.224961	 -0.968727	 -0.232947
 -0.218365	 -0.959812	 -0.234500
 -0.204157	 -0.942718	 -0.235267
 -0.185696	 -0.926272	 -0.241145
 -0.166072	 -0.911903	 -0.250600
 -0.159812	 -0.905750	 -0.254885
 -0.151174	 -0.891356	 -0.266632
 -0.142816	 -0.866418	 -0.276096
 -0.133782	 -0.851215	 -0.278040
 -0.120168	 -0.837190	 -0.280363
 -0.107850	 -0.822043	 -0.285601
 -0.098819	 -0.805224	 -0.293339
 -0.088524	 -0.784376	 -0.307323
 -0.082598	 -0.774009	 -0.314361
 -0.074781	 -0.761114	 -0.319480
 -0.058490	 -0.741225	 -0.325109
 -0.050183	 -0.726391	 -0.330807
 -0.045052	 -0.709132	 -0.338624
 -0.038799	 -0.693551	 -0.350273
 -0.031883	 -0.682674	 -0.360353
 -0.021454	 -0.667414	 -0.374243
 -0.006845	 -0.647221	 -0.391534
 -0.000840	 -0.635071	 -0.398285
  0.003198	 -0.621299	 -0.402992
  0.006683	 -0.601046	 -0.408628
  0.011760	 -0.579399	 -0.414049
  0.020309	 -0.558433	 -0.423432
  0.026703	 -0.542474	 -0.436059
  0.030797	 -0.533036	 -0.443953
  0.035353	 -0.512390	 -0.456733
  0.040414	 -0.496005	 -0.463345
  0.047295	 -0.478612	 -0.469530
  0.055229	 -0.464510	 -0.475461
  0.065380	 -0.449249	 -0.485166
  0.073967	 -0.423278	 -0.501529
  0.076929	 -0.414096	 -0.506596
  0.080426	 -0.403041	 -0.512900
  0.092853	 -0.379312	 -0.528277
  0.102448	 -0.362449	 -0.541029
  0.105261	 -0.354926	 -0.546658
  0.110960	 -0.336555	 -0.558897
  0.114760	 -0.311579	 -0.571467
  0.116258	 -0.299727	 -0.577268
  0.119057	 -0.285082	 -0.586832
  0.128020	 -0.267382	 -0.599504
  0.136021	 -0.253592	 -0.607275
  0.146711	 -0.234652	 -0.613353
  0.154117	 -0.210483	 -0.617779
  0.157107	 -0.193726	 -0.619734
  0.162940	 -0.173894	 -0.622952
  0.165856	 -0.156438	 -0.636018
  0.164143	 -0.142771	 -0.655909
  0.163749	 -0.130109	 -0.671717
  0.173712	 -0.113063	 -0.686169
  0.189922	 -0.098608	 -0.698713
  0.200416	 -0.085871	 -0.708751
  0.210699	 -0.073807	 -0.717176
  0.226489	 -0.062592	 -0.727194
  0.240184	 -0.054502	 -0.736658
  0.251312	 -0.043768	 -0.748219
  0.260967	 -0.025869	 -0.766405
  0.265213	 -0.014214	 -0.777747
  0.271429	 -0.002631	 -0.789369
  0.280984	  0.013064	 -0.799898
  0.291487	  0.027383	 -0.806299
  0.307507	  0.046026	 -0.814681
  0.321166	  0.059509	 -0.824633
  0.328633	  0.066923	 -0.830491
  0.340582	  0.079076	 -0.844606
  0.348446	  0.095426	 -0.858498
  0.353590	  0.110812	 -0.867237
  0.360019	  0.130735	 -0.873331
  0.366865	  0.147226	 -0.881001
  0.371789	  0.161728	 -0.885813
  0.381889	  0.179936	 -0.893141
  0.392026	  0.197045	 -0.898336
  0.400155	  0.213442	 -0.901246
  0.406501	  0.230408	 -0.905627
  0.413620	  0.246614	 -0.910908
  0.422432	  0.261850	 -0.912945
  0.436721	  0.289230	 -0.914998
  0.442669	  0.300488	 -0.916111
  0.450037	  0.315036	 -0.918796
  0.460951	  0.336589	 -0.920369
  0.468949	  0.356539	 -0.924459
  0.473450	  0.371396	 -0.930186
  0.479711	  0.393288	 -0.938782
  0.487483	  0.414330	 -0.949133
  0.492419	  0.430682	 -0.953446
  0.495421	  0.454915	 -0.953064
  0.496031	  0.474305	 -0.948037
  0.496760	  0.492211	 -0.938650
  0.501062	  0.508995	 -0.933330
  0.509077	  0.526166	 -0.931714
  0.518938	  0.547568	 -0.931594
  0.522601	  0.575550	 -0.927691
  0.520337	  0.588496	 -0.924210
  0.516524	  0.606928	 -0.918861
  0.517362	  0.633394	 -0.913020
  0.520571	  0.646820	 -0.911460
  0.527445	  0.663006	 -0.909507
  0.533938	  0.682131	 -0.906159
  0.541582	  0.703535	 -0.896825
  0.547077	  0.731591	 -0.889102
  0.549587	  0.743223	 -0.887704
  0.551220	  0.753846	 -0.890825
  0.554595	  0.788110	 -0.894292
  0.553651	  0.809477	 -0.897416
  0.551444	  0.820041	 -0.899825
  0.545822	  0.842095	 -0.904100
  0.545444	  0.862133	 -0.907279
  0.546442	  0.883772	 -0.911621
  0.545340	  0.900675	 -0.914105
  0.543375	  0.925626	 -0.918655
  0.546169	  0.938310	 -0.928466
  0.553147	  0.950512	 -0.937243
  0.561893	  0.969011	 -0.944401
  0.568883	  0.988842	 -0.962248
  0.569491	  0.995680	 -0.972238
  0.568244	  1.008277	 -0.989378
  0.567968	  1.025937	 -1.010974
  0.567514	  1.033321	 -1.018555
  0.564358	  1.048153	 -1.034130
  0.565058	  1.061060	 -1.058448
  0.567223	  1.065387	 -1.070108
  0.570572	  1.074385	 -1.093160
  0.574955	  1.082408	 -1.109962
  0.587199	  1.090077	 -1.129591
  0.598716	  1.097550	 -1.146555
  0.606308	  1.102156	 -1.159577
  0.608148	  1.108063	 -1.180103
  0.607474	  1.114695	 -1.198044
  0.607933	  1.121021	 -1.216958
  0.614574	  1.124754	 -1.239354
  0.622172	  1.126821	 -1.255649
  0.636851	  1.124717	 -1.272902
  0.641380	  1.121604	 -1.288532
  0.628784	  1.111791	 -1.327982
  0.618959	  1.108049	 -1.347735
  0.615172	  1.107217	 -1.357708
  0.620425	  1.112139	 -1.377693
  0.631434	  1.116431	 -1.396311
  0.645705	  1.122276	 -1.415104
  0.655707	  1.126650	 -1.430397
  0.667695	  1.130573	 -1.450543
  0.678545	  1.129750	 -1.473640
  0.684942	  1.129341	 -1.491832
  0.689136	  1.130731	 -1.511218
  0.692868	  1.134002	 -1.533531
  0.700283	  1.139682	 -1.539009
  0.731689	  1.150762	 -1.555232
  0.754484	  1.158701	 -1.569975
  0.762642	  1.164792	 -1.576097
  0.770380	  1.168167	 -1.580877
  0.778496	  1.180223	 -1.603110
  0.786301	  1.196297	 -1.617579
  0.801894	  1.215234	 -1.619829
  0.815567	  1.231002	 -1.622576
  0.828445	  1.244128	 -1.631238
  0.842278	  1.254508	 -1.642240
  0.856146	  1.266103	 -1.653686
  0.864496	  1.279398	 -1.662517
  0.869412	  1.294843	 -1.672938
  0.874645	  1.311441	 -1.685909
  0.882255	  1.323722	 -1.698226
  0.894652	  1.335114	 -1.713796
  0.907267	  1.348197	 -1.727456
  0.915566	  1.366950	 -1.732887
  0.921926	  1.387367	 -1.734773
  0.929435	  1.406134	 -1.739561
  0.935932	  1.421203	 -1.745005
  0.943610	  1.440396	 -1.752462
  0.953889	  1.459539	 -1.763761
  0.965459	  1.472453	 -1.777592
  0.972678	  1.488888	 -1.786411
