 -0.225331	 -1.453092	 -2.024403
 -0.226306	 -1.460566	 -2.055938
 -0.243953	 -1.455622	 -2.036256
 -0.241427	 -1.453314	 -2.015726
 -0.239623	 -1.445214	 -1.999519
 -0.242389	 -1.436563	 -1.978686
 -0.244213	 -1.433725	 -1.956258
 -0.242921	 -1.426664	 -1.940922
 -0.243241	 -1.413870	 -1.926013
 -0.245695	 -1.406360	 -1.901689
 -0.241240	 -1.402467	 -1.877443
 -0.233249	 -1.397841	 -1.862269
 -0.224260	 -1.383210	 -1.847263
 -0.219911	 -1.361882	 -1.838439
 -0.216745	 -1.342908	 -1.829905
 -0.213971	 -1.325465	 -1.819321
 -0.211286	 -1.307913	 -1.809932
 -0.208721	 -1.290437	 -1.800854
 -0.203509	 -1.275452	 -1.791716
 -0.190959	 -1.268097	 -1.781927
 -0.177931	 -1.262885	 -1.772359
 -0.163346	 -1.259175	 -1.758099
 -0.145200	 -1.255477	 -1.749436
 -0.126329	 -1.250903	 -1.746453
 -0.108786	 -1.248432	 -1.737202
 -0.091955	 -1.245850	 -1.726719
 -0.076195	 -1.243927	 -1.715125
 -0.061449	 -1.242877	 -1.702045
 -0.046716	 -1.242340	 -1.688481
 -0.031631	 -1.240638	 -1.675432
 -0.017072	 -1.240227	 -1.661807
 -0.002437	 -1.239006	 -1.648312
  0.010926	 -1.237741	 -1.633790
  0.023970	 -1.236488	 -1.618721
  0.036670	 -1.235827	 -1.603302
  0.049776	 -1.234229	 -1.588232
  0.062353	 -1.233886	 -1.572677
  0.075539	 -1.231951	 -1.557722
  0.088144	 -1.231022	 -1.542204
  0.099878	 -1.228950	 -1.526082
  0.110757	 -1.226415	 -1.509476
  0.121399	 -1.223996	 -1.492713
  0.132341	 -1.220851	 -1.476230
  0.142978	 -1.218316	 -1.459526
  0.153609	 -1.215999	 -1.442758
  0.164317	 -1.212760	 -1.426261
  0.173240	 -1.210842	 -1.408809
  0.181028	 -1.207575	 -1.390951
  0.187795	 -1.205959	 -1.372460
  0.190052	 -1.205459	 -1.354481
  0.189816	 -1.204084	 -1.334382
  0.199517	 -1.197109	 -1.313706
  0.207805	 -1.195653	 -1.293265
  0.211492	 -1.196941	 -1.277910
  0.215619	 -1.198487	 -1.259965
  0.220289	 -1.201445	 -1.236200
  0.218966	 -1.207329	 -1.216819
  0.213984	 -1.215324	 -1.204549
  0.203429	 -1.230765	 -1.184814
  0.198838	 -1.239601	 -1.166822
  0.196546	 -1.246317	 -1.152093
  0.196522	 -1.255449	 -1.133310
  0.196461	 -1.267365	 -1.112931
  0.195024	 -1.275146	 -1.099592
  0.186448	 -1.280075	 -1.074883
  0.179735	 -1.278553	 -1.054535
  0.170084	 -1.279575	 -1.040703
  0.156280	 -1.282688	 -1.028271
  0.143900	 -1.288260	 -1.013049
  0.132821	 -1.293702	 -0.995619
  0.124914	 -1.296021	 -0.976244
  0.117440	 -1.293351	 -0.957212
  0.109842	 -1.289493	 -0.937982
  0.097701	 -1.287203	 -0.917471
  0.086153	 -1.286511	 -0.901386
  0.075217	 -1.286547	 -0.885851
  0.064428	 -1.288355	 -0.867851
  0.058433	 -1.288515	 -0.856728
  0.049837	 -1.290588	 -0.840028
  0.033696	 -1.295474	 -0.810488
  0.026398	 -1.293421	 -0.799352
  0.016512	 -1.289328	 -0.785235
  0.003765	 -1.282196	 -0.764426
 -0.006319	 -1.276609	 -0.749915
 -0.021733	 -1.263720	 -0.738024
 -0.033423	 -1.254128	 -0.731845
 -0.050073	 -1.252256	 -0.714851
 -0.061561	 -1.251944	 -0.697804
 -0.069795	 -1.247962	 -0.679399
 -0.078679	 -1.240118	 -0.662757
 -0.088628	 -1.231022	 -0.647542
 -0.098433	 -1.220931	 -0.632953
 -0.107236	 -1.210285	 -0.618459
 -0.116906	 -1.200799	 -0.603668
 -0.125746	 -1.190163	 -0.588845
 -0.134323	 -1.178762	 -0.574281
 -0.143115	 -1.166838	 -0.560730
 -0.150857	 -1.153794	 -0.547551
 -0.159065	 -1.141659	 -0.533986
 -0.165435	 -1.129693	 -0.519066
 -0.172446	 -1.119442	 -0.504135
 -0.174384	 -1.109640	 -0.487645
 -0.173469	 -1.103955	 -0.468639
 -0.178639	 -1.099029	 -0.451874
 -0.195886	 -1.089993	 -0.433072
 -0.207501	 -1.078552	 -0.416982
 -0.209113	 -1.070768	 -0.404358
 -0.205199	 -1.065044	 -0.385214
 -0.203687	 -1.060334	 -0.362445
 -0.205206	 -1.054919	 -0.347062
 -0.207821	 -1.046958	 -0.327775
 -0.211693	 -1.033161	 -0.300983
 -0.213874	 -1.028226	 -0.292533
 -0.215524	 -1.021241	 -0.277434
 -0.216071	 -1.015809	 -0.257184
 -0.217265	 -1.012186	 -0.239167
 -0.221695	 -1.009969	 -0.215027
 -0.227683	 -1.008927	 -0.194438
 -0.240107	 -1.004896	 -0.173674
 -0.253483	 -0.999930	 -0.165252
 -0.267161	 -0.996482	 -0.147328
 -0.271468	 -0.997571	 -0.122394
 -0.264133	 -0.996471	 -0.100404
 -0.255538	 -0.993078	 -0.082557
 -0.251996	 -0.989686	 -0.069066
 -0.253494	 -0.988973	 -0.045817
 -0.257105	 -0.994700	 -0.023339
 -0.260132	 -1.005219	 -0.000363
 -0.262810	 -1.010642	  0.009438
 -0.263357	 -1.017212	  0.023424
 -0.264580	 -1.026083	  0.048841
 -0.264144	 -1.029892	  0.070426
 -0.264116	 -1.028694	  0.088438
 -0.267220	 -1.028083	  0.109111
 -0.271212	 -1.030812	  0.128681
 -0.274116	 -1.031666	  0.147722
 -0.275327	 -1.031445	  0.168998
 -0.278830	 -1.032948	  0.191266
 -0.285495	 -1.037508	  0.206952
 -0.293665	 -1.049063	  0.220943
 -0.298636	 -1.062790	  0.240318
 -0.297814	 -1.070184	  0.264412
 -0.296871	 -1.070715	  0.283911
 -0.297963	 -1.071516	  0.304029
 -0.298837	 -1.073083	  0.323231
 -0.298165	 -1.074047	  0.339699
 -0.294654	 -1.076206	  0.359662
 -0.291666	 -1.078645	  0.384468
 -0.293480	 -1.077368	  0.405696
 -0.301040	 -1.071955	  0.428352
 -0.307584	 -1.068179	  0.446453
 -0.312390	 -1.067984	  0.467788
 -0.314290	 -1.069141	  0.480688
 -0.318870	 -1.073516	  0.499415
 -0.326085	 -1.070825	  0.522051
 -0.327394	 -1.070746	  0.544651
 -0.323402	 -1.072813	  0.560344
 -0.314948	 -1.074164	  0.581222
 -0.311180	 -1.074984	  0.603032
 -0.311536	 -1.075452	  0.619825
 -0.315204	 -1.071775	  0.646049
 -0.317255	 -1.068580	  0.665990
 -0.317402	 -1.066956	  0.678759
 -0.314895	 -1.064566	  0.700039
 -0.306975	 -1.064761	  0.727374
 -0.302750	 -1.065101	  0.738812
 -0.299893	 -1.065363	  0.767478
 -0.302349	 -1.062391	  0.781046
 -0.310238	 -1.056317	  0.797226
 -0.315814	 -1.042620	  0.821321
 -0.313748	 -1.031778	  0.841601
 -0.310325	 -1.025758	  0.857378
 -0.307650	 -1.024425	  0.878907
 -0.305353	 -1.023798	  0.896283
 -0.301561	 -1.023282	  0.915781
 -0.296633	 -1.020248	  0.944548
 -0.293237	 -1.022225	  0.958270
 -0.290562	 -1.025747	  0.973212
 -0.288618	 -1.029364	  1.002343
 -0.287602	 -1.028426	  1.020458
 -0.285400	 -1.029094	  1.034585
 -0.284954	 -1.030628	  1.063219
 -0.286074	 -1.025605	  1.082411
 -0.284077	 -1.023107	  1.095410
 -0.278273	 -1.021330	  1.120014
 -0.272207	 -1.016830	  1.136917
 -0.264936	 -1.011316	  1.147653
 -0.257915	 -0.991986	  1.182897
 -0.262945	 -0.979637	  1.205048
 -0.264811	 -0.978673	  1.210174
 -0.264865	 -0.975345	  1.224049
 -0.259678	 -0.969088	  1.250098
 -0.259699	 -0.966334	  1.277778
 -0.262484	 -0.965944	  1.294468
 -0.263412	 -0.965012	  1.307550
 -0.263005	 -0.966439	  1.338851
 -0.261539	 -0.969833	  1.360638
 -0.261342	 -0.973471	  1.369951
 -0.263610	 -0.981421	  1.388205
 -0.270307	 -0.993384	  1.411003
 -0.272301	 -1.000008	  1.433963
 -0.272819	 -1.001652	  1.448683
 -0.274721	 -1.001852	  1.465643
 -0.276918	 -1.004094	  1.486499
 -0.275820	 -1.009475	  1.510828
 -0.268613	 -1.015185	  1.528430
 -0.259229	 -1.021499	  1.545913
 -0.250525	 -1.030750	  1.569369
 -0.247237	 -1.039993	  1.594968
 -0.248116	 -1.042197	  1.599764
 -0.249164	 -1.050704	  1.618731
 -0.251212	 -1.059403	  1.640344
 -0.251218	 -1.065213	  1.656245
 -0.251999	 -1.074774	  1.676481
 -0.255130	 -1.082328	  1.693041
 -0.261463	 -1.088331	  1.710357
 -0.269481	 -1.098759	  1.736339
 -0.273709	 -1.106706	  1.753042
 -0.277785	 -1.112624	  1.764294
 -0.288000	 -1.124436	  1.780939
 -0.295263	 -1.138858	  1.800512
 -0.296639	 -1.144129	  1.820143
 -0.292986	 -1.144439	  1.837945
 -0.288807	 -1.145513	  1.861491
 -0.290785	 -1.150609	  1.876418
 -0.296464	 -1.159467	  1.897391
 -0.295542	 -1.166945	  1.919378
 -0.293590	 -1.173305	  1.933455
 -0.294074	 -1.181805	  1.950196
 -0.297596	 -1.187462	  1.973079
 -0.306053	 -1.191251	  1.989916
 -0.312241	 -1.193776	  2.010347
 -0.313188	 -1.194237	  2.030833
 -0.313734	 -1.194554	  2.050873
 -0.314021	 -1.194499	  2.070947
 -0.313906	 -1.193694	  2.091298
 -0.313635	 -1.189688	  2.111506
 -0.312497	 -1.184552	  2.130907
 -0.311990	 -1.179721	  2.150294
 -0.310353	 -1.174173	  2.169504
 -0.309561	 -1.168827	  2.188969
 -0.307497	 -1.161244	  2.207897
 -0.305546	 -1.152408	  2.226123
 -0.302945	 -1.142913	  2.243566
 -0.301114	 -1.133992	  2.261406
 -0.298275	 -1.124214	  2.278846
 -0.295463	 -1.112931	  2.295551
 -0.293338	 -1.101503	  2.311950
 -0.290384	 -1.089498	  2.327745
 -0.287414	 -1.077291	  2.343380
 -0.285340	 -1.064479	  2.358709
 -0.283608	 -1.051369	  2.373750
 -0.281014	 -1.037717	  2.388109
 -0.280068	 -1.024091	  2.402586
 -0.279512	 -1.009999	  2.416736
 -0.279124	 -0.995761	  2.430689
 -0.280039	 -0.981356	  2.444350
 -0.280641	 -0.966226	  2.457408
 -0.282493	 -0.951806	  2.471032
 -0.283918	 -0.936429	  2.483604
 -0.286929	 -0.921869	  2.496968
 -0.288793	 -0.906557	  2.509742
 -0.291581	 -0.891734	  2.522869
 -0.293436	 -0.876143	  2.535835
 -0.299213	 -0.857930	  2.552722
 -0.296253	 -0.824705	  2.574795
 -0.298399	 -0.809597	  2.587723
