 -0.528718	  2.499630	  0.044994
 -0.537650	  2.508684	  0.050949
 -0.524639	  2.496424	  0.041941
 -0.511835	  2.483646	  0.033331
 -0.499616	  2.469850	  0.025755
 -0.485610	  2.457265	  0.019802
 -0.468776	  2.445312	  0.013117
 -0.455010	  2.432411	  0.003781
 -0.447025	  2.418381	 -0.006178
 -0.437269	  2.403395	 -0.016023
 -0.425572	  2.389980	 -0.028447
 -0.420292	  2.376897	 -0.043822
 -0.415251	  2.367706	 -0.059805
 -0.408031	  2.353637	 -0.084304
 -0.414374	  2.340578	 -0.100947
 -0.428436	  2.328953	 -0.114082
 -0.441726	  2.320166	 -0.125856
 -0.451826	  2.310274	 -0.140337
 -0.461986	  2.301151	 -0.153100
 -0.473230	  2.288205	 -0.171617
 -0.470843	  2.277244	 -0.188657
 -0.462316	  2.267166	 -0.205818
 -0.464800	  2.252087	 -0.229746
 -0.475404	  2.242100	 -0.242151
 -0.484524	  2.234188	 -0.250923
 -0.498588	  2.222715	 -0.267356
 -0.509830	  2.214158	 -0.280669
 -0.521279	  2.204321	 -0.294028
 -0.533853	  2.189930	 -0.305655
 -0.543604	  2.177493	 -0.314569
 -0.552873	  2.163195	 -0.325238
 -0.562012	  2.145955	 -0.338463
 -0.568024	  2.133213	 -0.348459
 -0.572734	  2.114389	 -0.360327
 -0.573777	  2.095566	 -0.371888
 -0.575426	  2.085405	 -0.381390
 -0.586443	  2.071667	 -0.393999
 -0.597808	  2.055337	 -0.400849
 -0.610227	  2.038226	 -0.404616
 -0.621181	  2.019524	 -0.406924
 -0.627698	  2.001131	 -0.413014
 -0.630709	  1.982867	 -0.421858
 -0.631200	  1.967845	 -0.434616
 -0.639600	  1.949945	 -0.442076
 -0.649999	  1.930258	 -0.440894
 -0.654577	  1.909511	 -0.436548
 -0.647331	  1.888899	 -0.436112
 -0.625462	  1.870614	 -0.434935
 -0.609330	  1.849004	 -0.422043
 -0.604082	  1.831950	 -0.414882
 -0.591549	  1.813845	 -0.408286
 -0.579123	  1.798382	 -0.403844
 -0.569835	  1.790829	 -0.401944
 -0.554012	  1.779363	 -0.397076
 -0.539959	  1.769273	 -0.380196
 -0.527155	  1.756689	 -0.368915
 -0.514845	  1.748077	 -0.355705
 -0.502862	  1.741110	 -0.341306
 -0.490778	  1.734140	 -0.327028
 -0.478200	  1.726752	 -0.313319
 -0.465224	  1.718948	 -0.300107
 -0.452598	  1.711337	 -0.286328
 -0.440852	  1.704436	 -0.271489
 -0.429993	  1.698426	 -0.255877
 -0.419153	  1.692324	 -0.240280
 -0.409979	  1.684263	 -0.224544
 -0.406012	  1.674055	 -0.207876
 -0.402031	  1.664536	 -0.190616
 -0.397694	  1.654742	 -0.173574
 -0.393443	  1.644572	 -0.156710
 -0.389703	  1.634249	 -0.139946
 -0.386851	  1.623074	 -0.123615
 -0.384687	  1.611399	 -0.107814
 -0.381704	  1.597879	 -0.093463
 -0.377764	  1.583413	 -0.080334
 -0.373913	  1.569236	 -0.067500
 -0.368762	  1.555054	 -0.056820
 -0.364162	  1.544521	 -0.042501
 -0.362144	  1.529098	 -0.026745
 -0.354034	  1.504842	 -0.020828
 -0.350389	  1.492870	 -0.020471
 -0.340991	  1.477719	 -0.023743
 -0.329761	  1.458602	 -0.027241
 -0.318473	  1.446186	 -0.030068
 -0.303316	  1.429535	 -0.031502
 -0.283497	  1.410400	 -0.033095
 -0.272758	  1.396192	 -0.035801
 -0.261849	  1.380959	 -0.041065
 -0.252714	  1.371773	 -0.047535
 -0.240378	  1.364887	 -0.059371
 -0.224996	  1.358249	 -0.068370
 -0.208421	  1.347487	 -0.076677
 -0.195168	  1.331185	 -0.084215
 -0.184275	  1.315494	 -0.088423
 -0.170977	  1.301816	 -0.095994
 -0.156894	  1.292540	 -0.104683
 -0.145486	  1.280337	 -0.114449
 -0.135741	  1.265016	 -0.124050
 -0.126034	  1.250905	 -0.131685
 -0.120539	  1.234490	 -0.144160
 -0.112380	  1.216406	 -0.155332
 -0.097763	  1.201028	 -0.159023
 -0.084505	  1.186148	 -0.159789
 -0.076860	  1.169839	 -0.159337
 -0.076936	  1.147681	 -0.158497
 -0.074729	  1.124057	 -0.158421
 -0.060819	  1.107475	 -0.154786
 -0.036876	  1.097926	 -0.151839
 -0.023786	  1.083784	 -0.150364
 -0.019701	  1.065681	 -0.141276
 -0.013471	  1.046218	 -0.135142
 -0.008519	  1.030955	 -0.131181
 -0.001559	  1.008636	 -0.121772
  0.010117	  0.989964	 -0.110802
  0.019610	  0.977838	 -0.103224
  0.030794	  0.960219	 -0.094930
  0.039427	  0.947516	 -0.089355
  0.056471	  0.929104	 -0.077497
  0.072424	  0.914328	 -0.067306
  0.077270	  0.909415	 -0.065868
  0.092310	  0.895360	 -0.065455
  0.108198	  0.875908	 -0.063564
  0.120204	  0.854052	 -0.062589
  0.133773	  0.845199	 -0.068947
  0.137211	  0.839011	 -0.072624
  0.147027	  0.833250	 -0.071595
  0.163852	  0.820500	 -0.081210
  0.171514	  0.810270	 -0.085895
  0.178942	  0.800465	 -0.098251
  0.182287	  0.797275	 -0.111555
  0.186481	  0.783754	 -0.120399
  0.192803	  0.781994	 -0.139469
  0.195686	  0.774139	 -0.147009
  0.202817	  0.766410	 -0.158698
  0.207974	  0.755485	 -0.178866
  0.214895	  0.747833	 -0.199620
  0.231726	  0.737455	 -0.224479
  0.238262	  0.730685	 -0.233429
  0.244629	  0.720180	 -0.242970
  0.257707	  0.705736	 -0.258031
  0.264429	  0.698806	 -0.272963
  0.268601	  0.693308	 -0.293875
  0.275446	  0.688203	 -0.314112
  0.282444	  0.685157	 -0.331433
  0.289214	  0.684598	 -0.347730
  0.298318	  0.685390	 -0.366034
  0.307322	  0.682899	 -0.381905
  0.316327	  0.679364	 -0.401481
  0.325952	  0.677674	 -0.419928
  0.334365	  0.675624	 -0.436192
  0.342703	  0.670431	 -0.454028
  0.349369	  0.664037	 -0.471004
  0.355169	  0.657349	 -0.486831
  0.363874	  0.650156	 -0.505739
  0.375502	  0.645509	 -0.527555
  0.381991	  0.641555	 -0.540692
  0.389111	  0.634003	 -0.555336
  0.399731	  0.623228	 -0.575039
  0.406988	  0.613506	 -0.589854
  0.414937	  0.603973	 -0.601004
  0.422937	  0.590164	 -0.612588
  0.437027	  0.575721	 -0.630176
  0.452796	  0.566712	 -0.645494
  0.465617	  0.562414	 -0.653955
  0.482941	  0.558955	 -0.665557
  0.499749	  0.553860	 -0.682831
  0.507311	  0.550848	 -0.692113
  0.520016	  0.547245	 -0.713893
  0.536109	  0.541959	 -0.730407
  0.544992	  0.539226	 -0.739480
  0.558163	  0.533070	 -0.754191
  0.575018	  0.527332	 -0.767199
  0.589967	  0.522755	 -0.775693
  0.607744	  0.516779	 -0.784757
  0.626947	  0.512470	 -0.794266
  0.650871	  0.511935	 -0.802682
  0.665191	  0.515112	 -0.808150
  0.681530	  0.517386	 -0.819057
  0.699731	  0.519031	 -0.832738
  0.714640	  0.519633	 -0.841227
  0.733857	  0.516162	 -0.848055
  0.763060	  0.510133	 -0.848878
  0.773930	  0.508963	 -0.848895
  0.795844	  0.503542	 -0.852428
  0.820563	  0.498633	 -0.861785
  0.833401	  0.497565	 -0.865883
  0.854913	  0.499711	 -0.872852
  0.875768	  0.500300	 -0.878776
  0.894255	  0.501749	 -0.884618
  0.913697	  0.503645	 -0.891412
  0.928435	  0.506822	 -0.896602
  0.947389	  0.507216	 -0.902298
  0.967440	  0.501824	 -0.907325
  0.983053	  0.494714	 -0.910523
  0.997310	  0.488040	 -0.915177
  1.022416	  0.468245	 -0.926691
  1.032424	  0.458285	 -0.934414
  1.045485	  0.450569	 -0.940830
  1.059171	  0.439159	 -0.948750
  1.069705	  0.430254	 -0.952960
  1.080015	  0.415020	 -0.956709
  1.098393	  0.397748	 -0.961449
  1.115039	  0.383414	 -0.966547
  1.124869	  0.376983	 -0.970143
  1.137360	  0.366746	 -0.977194
  1.152818	  0.349658	 -0.982890
  1.162825	  0.333176	 -0.985929
  1.170155	  0.323065	 -0.987546
  1.188712	  0.304810	 -0.990032
  1.207851	  0.290254	 -0.991713
  1.221393	  0.277191	 -0.996398
  1.233652	  0.262809	 -1.004555
  1.245941	  0.250097	 -1.012881
  1.261442	  0.236964	 -1.021757
  1.274138	  0.225261	 -1.028505
  1.286526	  0.212596	 -1.033802
  1.299872	  0.197531	 -1.037569
  1.312812	  0.182253	 -1.041360
  1.325478	  0.167711	 -1.049077
  1.336255	  0.156055	 -1.060278
  1.345944	  0.145627	 -1.071258
  1.357637	  0.131691	 -1.082425
  1.373834	  0.116388	 -1.093447
  1.388155	  0.106230	 -1.104935
  1.394728	  0.099534	 -1.113112
  1.402042	  0.087007	 -1.128690
  1.409529	  0.068790	 -1.142792
  1.419501	  0.051992	 -1.152823
  1.429529	  0.039382	 -1.160999
  1.445287	  0.028808	 -1.169019
  1.465995	  0.019429	 -1.175197
  1.483131	  0.009883	 -1.183620
  1.497707	 -0.000234	 -1.196229
  1.507352	 -0.007306	 -1.205126
  1.524064	 -0.019261	 -1.215503
  1.537157	 -0.036897	 -1.221398
  1.545084	 -0.056327	 -1.226737
  1.553913	 -0.072579	 -1.230253
  1.565913	 -0.088184	 -1.236058
  1.576520	 -0.100908	 -1.239419
  1.586889	 -0.112121	 -1.249962
  1.607482	 -0.128729	 -1.268540
  1.619112	 -0.135972	 -1.276238
  1.629447	 -0.141661	 -1.285030
  1.647476	 -0.155056	 -1.298600
  1.661991	 -0.168546	 -1.303610
  1.676757	 -0.182874	 -1.305638
  1.690717	 -0.197144	 -1.307044
  1.703305	 -0.210655	 -1.307781
  1.721433	 -0.230860	 -1.313822
  1.731703	 -0.240942	 -1.322331
  1.741252	 -0.248148	 -1.333718
  1.757053	 -0.262892	 -1.351177
  1.767672	 -0.275068	 -1.359660
  1.777118	 -0.288274	 -1.360714
  1.789837	 -0.307151	 -1.362849
  1.802355	 -0.322214	 -1.370653
  1.814478	 -0.336143	 -1.378604
  1.826170	 -0.350998	 -1.385381
  1.837143	 -0.366894	 -1.390780
  1.847915	 -0.382870	 -1.396176
  1.858842	 -0.398859	 -1.401472
  1.870612	 -0.414352	 -1.406342
  1.882443	 -0.428736	 -1.412486
  1.894283	 -0.441948	 -1.420836
  1.907071	 -0.455045	 -1.429596
  1.921072	 -0.467330	 -1.437421
  1.935377	 -0.479337	 -1.444599
  1.949369	 -0.491513	 -1.451729
  1.962780	 -0.504140	 -1.459374
  1.976701	 -0.517062	 -1.466993
  1.991900	 -0.530097	 -1.474109
  2.004399	 -0.542614	 -1.483440
