 -1.868597	 -2.273554	  0.721250
 -1.850096	 -2.251043	  0.714109
 -1.806206	 -2.224008	  0.726598
 -1.759665	 -2.197813	  0.726834
 -1.716633	 -2.170865	  0.729818
 -1.674826	 -2.142036	  0.737065
 -1.632059	 -2.115163	  0.745633
 -1.592277	 -2.092329	  0.752326
 -1.549978	 -2.068286	  0.759486
 -1.506897	 -2.042905	  0.768286
 -1.464328	 -2.017409	  0.778422
 -1.420967	 -1.991238	  0.789540
 -1.380325	 -1.966228	  0.800170
 -1.340806	 -1.940973	  0.810167
 -1.299857	 -1.914171	  0.819303
 -1.256867	 -1.886931	  0.827243
 -1.214668	 -1.862396	  0.833123
 -1.174296	 -1.840449	  0.836889
 -1.129385	 -1.816227	  0.838534
 -1.082353	 -1.790440	  0.839083
 -1.037317	 -1.764703	  0.844269
 -0.995364	 -1.738992	  0.853361
 -0.956688	 -1.712795	  0.865342
 -0.916880	 -1.685165	  0.878807
 -0.878596	 -1.658568	  0.892044
 -0.840986	 -1.632241	  0.904882
 -0.802548	 -1.605142	  0.917232
 -0.762471	 -1.576820	  0.928840
 -0.720179	 -1.547671	  0.939189
 -0.676459	 -1.520071	  0.947516
 -0.631006	 -1.494553	  0.953868
 -0.587673	 -1.471989	  0.959228
 -0.545843	 -1.450791	  0.965570
 -0.505350	 -1.429494	  0.974976
 -0.470518	 -1.407886	  0.989961
 -0.438237	 -1.380532	  1.018738
 -0.405665	 -1.320960	  1.103882
 -0.412948	 -1.222940	  1.233312
 -0.418866	 -1.141533	  1.293179
 -0.413992	 -1.135867	  1.297483
 -0.347673	 -1.122509	  1.305111
 -0.282376	 -1.090090	  1.319138
 -0.242286	 -1.052327	  1.329737
 -0.210172	 -1.030455	  1.334171
 -0.178484	 -1.015511	  1.328913
 -0.131387	 -0.997721	  1.311177
 -0.069827	 -0.989781	  1.276954
 -0.001211	 -1.006063	  1.216828
  0.111184	 -1.046782	  1.111500
  0.179643	 -1.034478	  1.075242
  0.227060	 -1.014535	  1.069699
  0.270499	 -0.992421	  1.072937
  0.314644	 -0.969556	  1.080141
  0.359686	 -0.946016	  1.088402
  0.402528	 -0.923090	  1.095901
  0.447608	 -0.897250	  1.103483
  0.490137	 -0.871508	  1.110464
  0.530929	 -0.846105	  1.116961
  0.571154	 -0.821504	  1.122966
  0.613041	 -0.795639	  1.128939
  0.656131	 -0.768382	  1.135091
  0.697846	 -0.741378	  1.141811
  0.738161	 -0.716038	  1.149821
  0.779852	 -0.690802	  1.159254
  0.822250	 -0.666990	  1.167935
  0.863978	 -0.646075	  1.175091
  0.911135	 -0.621428	  1.179812
  0.956006	 -0.593865	  1.184203
  0.998086	 -0.567970	  1.187446
  1.037312	 -0.543661	  1.191085
  1.078844	 -0.515635	  1.196727
  1.120424	 -0.487062	  1.203530
  1.164554	 -0.460194	  1.211251
  1.208053	 -0.435582	  1.219897
  1.249887	 -0.412920	  1.229064
  1.291437	 -0.389378	  1.239282
  1.332628	 -0.365624	  1.250856
  1.370813	 -0.343763	  1.263663
  1.410659	 -0.319204	  1.278042
  1.451904	 -0.290473	  1.293117
  1.492053	 -0.260376	  1.306296
  1.530635	 -0.229870	  1.316978
  1.571647	 -0.196763	  1.325669
  1.610232	 -0.166281	  1.331533
  1.648164	 -0.137913	  1.336422
  1.688296	 -0.110436	  1.340849
  1.732438	 -0.082758	  1.344891
  1.774885	 -0.057616	  1.347279
  1.818802	 -0.032817	  1.349687
  1.863116	 -0.008962	  1.353045
  1.904824	  0.014442	  1.358642
  1.947981	  0.038301	  1.365762
  1.992406	  0.062268	  1.373977
  2.034327	  0.084366	  1.382563
  2.078873	  0.107135	  1.391762
  2.121350	  0.129005	  1.399622
  2.165167	  0.151651	  1.406661
  2.211288	  0.174699	  1.412712
  2.254626	  0.195145	  1.417480
  2.298692	  0.216568	  1.422941
  2.342294	  0.239135	  1.428960
  2.387447	  0.264518	  1.435221
  2.428763	  0.291160	  1.440642
  2.470857	  0.318626	  1.445372
  2.514231	  0.344261	  1.451320
  2.550944	  0.375333	  1.460155
  2.588921	  0.394120	  1.463611
  2.614810	  0.398061	  1.478248
