 -0.266189	  3.016574	 -0.101608
 -0.263553	  2.986707	 -0.100602
 -0.271223	  2.951371	 -0.072240
 -0.287173	  2.912026	 -0.053358
 -0.307218	  2.870233	 -0.031341
 -0.319858	  2.826969	 -0.005048
 -0.335309	  2.786332	  0.013548
 -0.350430	  2.742970	  0.040059
 -0.370200	  2.698592	  0.061616
 -0.388773	  2.660033	  0.084838
 -0.400470	  2.619647	  0.106174
 -0.422763	  2.579630	  0.127093
 -0.438629	  2.537001	  0.148360
 -0.459143	  2.496897	  0.171139
 -0.477530	  2.454540	  0.194138
 -0.493329	  2.416188	  0.215433
 -0.511249	  2.374705	  0.238687
 -0.529738	  2.333342	  0.261598
 -0.547485	  2.293570	  0.284079
 -0.565068	  2.255033	  0.306618
 -0.582776	  2.217995	  0.328494
 -0.602463	  2.177931	  0.351894
 -0.622363	  2.137490	  0.374988
 -0.642736	  2.096054	  0.398651
 -0.661174	  2.056287	  0.420622
 -0.678668	  2.013948	  0.443559
 -0.694338	  1.972572	  0.466135
 -0.708827	  1.931433	  0.489565
 -0.721641	  1.891541	  0.513258
 -0.733078	  1.852064	  0.537907
 -0.744787	  1.809106	  0.564794
 -0.756398	  1.765110	  0.589999
 -0.768882	  1.721923	  0.612481
 -0.783062	  1.677459	  0.634249
 -0.798256	  1.636066	  0.654056
 -0.814598	  1.595702	  0.674717
 -0.833584	  1.553922	  0.696370
 -0.857308	  1.513595	  0.715951
 -0.886795	  1.480827	  0.730930
 -0.919653	  1.457506	  0.741399
 -1.025179	  1.416117	  0.750062
 -1.136044	  1.378215	  0.731444
 -1.201733	  1.346010	  0.721302
 -1.260427	  1.313328	  0.722302
 -1.324537	  1.267804	  0.736912
 -1.348860	  1.252503	  0.742316
 -1.386165	  1.232882	  0.748755
 -1.441482	  1.195665	  0.760482
 -1.479123	  1.137167	  0.793274
 -1.464633	  1.063129	  0.842643
 -1.427516	  1.010506	  0.889375
 -1.411300	  0.986783	  0.912731
 -1.390942	  0.949542	  0.951803
 -1.369687	  0.922638	  0.986816
 -1.305053	  0.883967	  1.032910
 -1.200003	  0.801779	  1.106898
 -1.185479	  0.738588	  1.145271
 -1.190577	  0.694030	  1.170013
 -1.202469	  0.651353	  1.192707
 -1.215846	  0.613337	  1.211804
 -1.232276	  0.569678	  1.231958
 -1.249225	  0.524005	  1.251398
 -1.264262	  0.481387	  1.269634
 -1.279385	  0.440037	  1.287905
 -1.296973	  0.396304	  1.307859
 -1.315084	  0.354881	  1.327741
 -1.333734	  0.315229	  1.348346
 -1.353230	  0.273200	  1.373152
 -1.369797	  0.233834	  1.398451
 -1.385865	  0.191838	  1.424725
 -1.400806	  0.152550	  1.448473
 -1.415264	  0.114155	  1.471509
 -1.429475	  0.076398	  1.494939
 -1.446391	  0.034837	  1.519639
 -1.466231	 -0.010928	  1.543847
 -1.482993	 -0.053913	  1.566522
 -1.498698	 -0.092384	  1.584967
 -1.514235	 -0.134973	  1.603274
 -1.532644	 -0.174534	  1.621143
 -1.546737	 -0.218027	  1.645938
 -1.562690	 -0.256420	  1.675808
 -1.574509	 -0.297089	  1.692510
 -1.593325	 -0.341429	  1.710114
 -1.617329	 -0.378574	  1.735728
 -1.631600	 -0.423193	  1.761926
 -1.647944	 -0.466195	  1.784307
 -1.661167	 -0.508326	  1.807389
 -1.677690	 -0.549198	  1.829786
 -1.691159	 -0.587180	  1.849761
 -1.707386	 -0.631058	  1.874217
 -1.724251	 -0.673606	  1.898195
 -1.740802	 -0.713160	  1.919830
 -1.758315	 -0.752692	  1.942074
 -1.774560	 -0.792554	  1.964095
 -1.789310	 -0.832851	  1.985658
 -1.806771	 -0.872783	  2.010454
 -1.826393	 -0.914110	  2.033925
 -1.842168	 -0.955381	  2.049119
 -1.857715	 -0.997386	  2.076244
 -1.881873	 -1.045014	  2.089617
 -1.900692	 -1.055464	  2.110513
