  0.429601	 -2.275560	 -1.954014
  0.425347	 -2.253029	 -1.934668
  0.425589	 -2.244191	 -1.882276
  0.424622	 -2.229637	 -1.833160
  0.426060	 -2.219842	 -1.783370
  0.425133	 -2.211805	 -1.731622
  0.419829	 -2.203647	 -1.682170
  0.422901	 -2.190448	 -1.635388
  0.418817	 -2.182061	 -1.586896
  0.417833	 -2.174534	 -1.538260
  0.417497	 -2.163068	 -1.487738
  0.412283	 -2.149655	 -1.438593
  0.410329	 -2.139651	 -1.389595
  0.408432	 -2.129783	 -1.341664
  0.406469	 -2.121596	 -1.295401
  0.401166	 -2.112124	 -1.247510
  0.398711	 -2.104346	 -1.196678
  0.397130	 -2.095180	 -1.145655
  0.392077	 -2.086736	 -1.095445
  0.386449	 -2.079529	 -1.047334
  0.380858	 -2.072616	 -1.001295
  0.374819	 -2.065082	 -0.953278
  0.371402	 -2.056433	 -0.902146
  0.371295	 -2.047376	 -0.852990
  0.372037	 -2.037519	 -0.802276
  0.373631	 -2.028228	 -0.751941
  0.375574	 -2.020425	 -0.704243
  0.375864	 -2.012079	 -0.657527
  0.375576	 -2.002460	 -0.610999
  0.374768	 -1.991842	 -0.562394
  0.373321	 -1.981757	 -0.510942
  0.370518	 -1.972998	 -0.459770
  0.367594	 -1.964058	 -0.412181
  0.365064	 -1.954073	 -0.363919
  0.361967	 -1.943996	 -0.312974
  0.358148	 -1.935237	 -0.262939
  0.353828	 -1.926870	 -0.213516
  0.350018	 -1.919633	 -0.165566
  0.347143	 -1.911742	 -0.117300
  0.345427	 -1.903572	 -0.067844
  0.344890	 -1.895903	 -0.020535
  0.344791	 -1.887871	  0.028327
  0.344161	 -1.879528	  0.076506
  0.343330	 -1.871081	  0.125813
  0.343245	 -1.862477	  0.175088
  0.343365	 -1.853729	  0.225694
  0.343302	 -1.844903	  0.275406
  0.342677	 -1.835900	  0.323775
  0.341156	 -1.826227	  0.371687
  0.339651	 -1.816438	  0.419101
  0.337856	 -1.808880	  0.467686
  0.339750	 -1.808482	  0.516156
  0.354332	 -1.824862	  0.562671
  0.400131	 -1.880698	  0.626700
  0.477118	 -1.976692	  0.720194
  0.508594	 -2.018434	  0.785339
  0.514630	 -2.024678	  0.831635
  0.511989	 -2.020415	  0.872828
  0.498881	 -2.003117	  0.916560
  0.472800	 -1.972009	  0.950874
  0.421418	 -1.913583	  0.992906
  0.338605	 -1.790494	  1.038119
  0.315872	 -1.729910	  1.071129
  0.312538	 -1.703619	  1.112139
  0.315870	 -1.691711	  1.159958
  0.318872	 -1.684128	  1.209749
  0.319183	 -1.677129	  1.258041
  0.318033	 -1.669313	  1.307125
  0.316290	 -1.661209	  1.355097
  0.313886	 -1.652620	  1.404262
  0.310095	 -1.643623	  1.455285
  0.304525	 -1.635197	  1.504342
  0.299133	 -1.627955	  1.550466
  0.294284	 -1.621337	  1.598915
  0.289616	 -1.614458	  1.650287
  0.286247	 -1.605485	  1.701156
  0.281305	 -1.596815	  1.749930
  0.275891	 -1.588546	  1.798244
  0.273406	 -1.580842	  1.848657
  0.271865	 -1.571181	  1.898230
  0.269411	 -1.560279	  1.945388
  0.266577	 -1.550511	  1.991852
  0.263605	 -1.541221	  2.041170
  0.261331	 -1.531683	  2.091085
  0.259425	 -1.522513	  2.140988
  0.257894	 -1.514361	  2.189191
  0.256335	 -1.506708	  2.237299
  0.255016	 -1.499175	  2.285993
  0.253802	 -1.491005	  2.334114
  0.253162	 -1.481747	  2.383625
  0.252928	 -1.472252	  2.431323
  0.253247	 -1.462191	  2.480672
  0.252650	 -1.452199	  2.531124
  0.249436	 -1.443774	  2.577750
  0.239570	 -1.435643	  2.623268
  0.241966	 -1.450000	  2.649501
