  1.001604	 -1.788194	  1.263867
  1.014672	 -1.809368	  1.265960
  1.003584	 -1.793410	  1.263908
  0.992903	 -1.776207	  1.264628
  0.981430	 -1.758879	  1.262101
  0.971506	 -1.743199	  1.257862
  0.959732	 -1.726246	  1.254937
  0.949308	 -1.709405	  1.253675
  0.940821	 -1.692917	  1.249771
  0.928747	 -1.676342	  1.241943
  0.914480	 -1.660647	  1.242306
  0.907485	 -1.642340	  1.243382
  0.896049	 -1.623646	  1.241481
  0.884640	 -1.611768	  1.233649
  0.872872	 -1.596115	  1.227830
  0.858796	 -1.580408	  1.224675
  0.847887	 -1.565115	  1.218614
  0.837738	 -1.549126	  1.212049
  0.825562	 -1.533348	  1.208548
  0.814322	 -1.517752	  1.204169
  0.803951	 -1.501206	  1.197349
  0.791634	 -1.485818	  1.194382
  0.780234	 -1.470530	  1.193158
  0.768458	 -1.452545	  1.188840
  0.755529	 -1.437865	  1.184800
  0.743538	 -1.422446	  1.182271
  0.733716	 -1.407025	  1.180542
  0.721900	 -1.389658	  1.177864
  0.710656	 -1.373222	  1.175373
  0.699447	 -1.356844	  1.172892
  0.688306	 -1.340357	  1.170881
  0.677210	 -1.323806	  1.169162
  0.665996	 -1.307337	  1.167429
  0.654025	 -1.291421	  1.165599
  0.642245	 -1.275490	  1.162881
  0.630998	 -1.259646	  1.158142
  0.618287	 -1.244687	  1.154325
  0.603521	 -1.231395	  1.152040
  0.588744	 -1.218111	  1.149763
  0.574444	 -1.204220	  1.148184
  0.560989	 -1.189428	  1.147737
  0.547539	 -1.174633	  1.147293
  0.534099	 -1.159829	  1.146848
  0.522500	 -1.143542	  1.146488
  0.511239	 -1.127017	  1.146141
  0.499983	 -1.110489	  1.145797
  0.489170	 -1.093664	  1.145875
  0.478570	 -1.076897	  1.146398
  0.467782	 -1.060648	  1.147831
  0.456352	 -1.044451	  1.147801
  0.444509	 -1.026021	  1.145283
  0.433495	 -1.010675	  1.147403
  0.421230	 -0.994909	  1.151255
  0.409150	 -0.978983	  1.151807
  0.397112	 -0.963872	  1.152072
  0.383314	 -0.947446	  1.154916
  0.372032	 -0.932289	  1.153493
  0.359555	 -0.920145	  1.146942
  0.341677	 -0.902761	  1.140536
  0.330711	 -0.887784	  1.142091
  0.320855	 -0.869261	  1.146803
  0.310658	 -0.853398	  1.143865
  0.299781	 -0.837369	  1.135275
  0.289069	 -0.825090	  1.123715
  0.275070	 -0.808163	  1.117258
  0.259873	 -0.794149	  1.114909
  0.246875	 -0.782574	  1.108380
  0.237253	 -0.768608	  1.099669
  0.227638	 -0.751819	  1.091821
  0.217416	 -0.735635	  1.085438
  0.205358	 -0.720345	  1.080484
  0.193685	 -0.705176	  1.073432
  0.182876	 -0.689487	  1.067414
  0.174391	 -0.672606	  1.061031
  0.166513	 -0.655189	  1.055846
  0.158110	 -0.637206	  1.052273
  0.150390	 -0.618748	  1.049281
  0.141813	 -0.600790	  1.045479
  0.131783	 -0.583856	  1.042139
  0.121830	 -0.567127	  1.039631
  0.112759	 -0.549234	  1.036404
  0.103029	 -0.532924	  1.032839
  0.092716	 -0.516393	  1.031312
  0.082956	 -0.494964	  1.031652
  0.074866	 -0.479180	  1.028316
  0.064883	 -0.463386	  1.022318
  0.055356	 -0.445303	  1.019932
  0.046132	 -0.427524	  1.017120
  0.036671	 -0.411101	  1.011183
  0.027064	 -0.393134	  1.008156
  0.017671	 -0.376546	  1.007492
  0.007063	 -0.359153	  1.003040
 -0.002938	 -0.341027	  1.000118
 -0.012326	 -0.324865	  1.001349
 -0.023574	 -0.307894	  1.001779
 -0.035427	 -0.291108	  0.997449
 -0.049389	 -0.278344	  0.988446
 -0.064923	 -0.265718	  0.979730
 -0.075355	 -0.250617	  0.976691
 -0.084636	 -0.232927	  0.974934
 -0.095004	 -0.214110	  0.971245
 -0.108693	 -0.199182	  0.965445
 -0.120397	 -0.187139	  0.961611
 -0.132111	 -0.169862	  0.957820
 -0.145179	 -0.154681	  0.952935
 -0.160396	 -0.142555	  0.947267
 -0.172254	 -0.126852	  0.944363
 -0.182584	 -0.109574	  0.942228
 -0.194373	 -0.094313	  0.941481
 -0.208250	 -0.079132	  0.940595
 -0.220737	 -0.063830	  0.938993
 -0.235608	 -0.049568	  0.933099
 -0.248508	 -0.035065	  0.929621
 -0.259363	 -0.018587	  0.929602
 -0.271512	 -0.002533	  0.928707
 -0.285376	  0.011963	  0.926801
 -0.297755	  0.027720	  0.925648
 -0.309022	  0.044134	  0.926727
 -0.321894	  0.059471	  0.926935
 -0.336108	  0.073764	  0.925945
 -0.347633	  0.090211	  0.925056
 -0.358341	  0.106060	  0.924823
 -0.372787	  0.122004	  0.926719
 -0.387857	  0.134523	  0.929126
 -0.399302	  0.151865	  0.931129
 -0.407804	  0.170481	  0.933595
 -0.418376	  0.188871	  0.938085
 -0.430060	  0.201241	  0.935848
 -0.443663	  0.217681	  0.932263
 -0.455257	  0.235190	  0.930910
 -0.467476	  0.249106	  0.936297
 -0.482491	  0.264530	  0.940626
 -0.493015	  0.280904	  0.938358
 -0.504161	  0.298930	  0.936307
 -0.516949	  0.313190	  0.939587
 -0.531118	  0.324803	  0.939499
 -0.545560	  0.338119	  0.936572
 -0.558711	  0.359001	  0.929369
 -0.570910	  0.368198	  0.932388
 -0.588462	  0.377425	  0.928524
 -0.607329	  0.380814	  0.923735
 -0.627535	  0.377932	  0.920527
 -0.646341	  0.375276	  0.916120
 -0.665228	  0.372326	  0.910499
 -0.685316	  0.367374	  0.907684
 -0.704765	  0.361629	  0.909066
 -0.723847	  0.360144	  0.912264
 -0.745664	  0.359544	  0.912361
 -0.766558	  0.358029	  0.911118
 -0.784149	  0.353998	  0.906090
 -0.802086	  0.349688	  0.901340
 -0.822600	  0.343470	  0.896479
 -0.842325	  0.340957	  0.895656
 -0.861755	  0.339237	  0.895235
 -0.881598	  0.336502	  0.891357
 -0.901484	  0.335924	  0.888857
 -0.922126	  0.336805	  0.888574
 -0.941730	  0.335341	  0.885294
 -0.959868	  0.331029	  0.882628
 -0.981779	  0.328304	  0.880653
 -1.003483	  0.324573	  0.878654
 -1.017734	  0.320395	  0.873224
 -1.037729	  0.317755	  0.866275
 -1.056919	  0.316586	  0.861644
 -1.075832	  0.316077	  0.858066
 -1.098154	  0.312459	  0.854663
 -1.117396	  0.311001	  0.849051
 -1.133935	  0.314398	  0.842462
 -1.155046	  0.312566	  0.837652
 -1.177104	  0.311089	  0.833812
 -1.192453	  0.318702	  0.832037
 -1.212795	  0.323678	  0.828197
 -1.233914	  0.326356	  0.821317
 -1.252521	  0.329709	  0.816238
 -1.271173	  0.329366	  0.815962
 -1.290937	  0.337044	  0.816628
 -1.308752	  0.346423	  0.815247
 -1.326339	  0.355850	  0.812414
 -1.345304	  0.364074	  0.809564
 -1.364676	  0.369819	  0.809413
 -1.383279	  0.377149	  0.812005
 -1.398547	  0.389828	  0.812949
 -1.413106	  0.403665	  0.813064
 -1.427563	  0.417744	  0.813799
 -1.440491	  0.432865	  0.816971
 -1.453431	  0.445570	  0.822133
 -1.466926	  0.460142	  0.827182
 -1.477537	  0.475980	  0.833177
 -1.490356	  0.491836	  0.833345
 -1.501130	  0.507498	  0.835070
 -1.507226	  0.526424	  0.835402
 -1.518035	  0.545111	  0.832270
 -1.527502	  0.563238	  0.837811
 -1.534175	  0.580249	  0.841576
 -1.543741	  0.597590	  0.839619
 -1.552451	  0.616676	  0.838029
 -1.559662	  0.633032	  0.841984
 -1.561221	  0.653128	  0.852366
 -1.562570	  0.673365	  0.865652
 -1.568433	  0.692194	  0.872479
 -1.572591	  0.710112	  0.869731
 -1.578852	  0.727104	  0.870816
 -1.585829	  0.746027	  0.878198
 -1.587427	  0.769295	  0.879785
 -1.585628	  0.789797	  0.875398
 -1.585367	  0.809336	  0.872694
 -1.585839	  0.830960	  0.870782
 -1.585378	  0.847771	  0.877119
 -1.587308	  0.868081	  0.881060
 -1.583808	  0.889269	  0.884394
 -1.577742	  0.906587	  0.890608
 -1.576127	  0.926420	  0.892623
 -1.577011	  0.946489	  0.891192
 -1.572324	  0.967245	  0.892610
 -1.569641	  0.983883	  0.894320
 -1.563346	  1.001710	  0.889854
 -1.552148	  1.027700	  0.894688
 -1.546215	  1.042884	  0.904928
 -1.542458	  1.059897	  0.905461
 -1.539354	  1.080102	  0.901856
 -1.531935	  1.101166	  0.905731
 -1.525654	  1.118445	  0.909224
 -1.519956	  1.136387	  0.906463
 -1.512554	  1.157524	  0.905833
 -1.507823	  1.177378	  0.910619
 -1.504521	  1.193795	  0.909508
 -1.501542	  1.215770	  0.904764
 -1.500186	  1.236268	  0.902842
 -1.484962	  1.254870	  0.901416
 -1.471994	  1.269516	  0.904241
 -1.468063	  1.290652	  0.912906
 -1.461221	  1.305848	  0.913097
 -1.450721	  1.326091	  0.911638
 -1.448293	  1.346529	  0.913756
 -1.443901	  1.366961	  0.911781
 -1.442443	  1.382230	  0.911812
 -1.438892	  1.403199	  0.914384
 -1.435480	  1.425423	  0.916517
 -1.437359	  1.445468	  0.915545
 -1.444337	  1.463688	  0.911997
 -1.448184	  1.484402	  0.908170
 -1.453415	  1.500812	  0.904520
 -1.466355	  1.516412	  0.902043
 -1.477039	  1.535698	  0.903731
 -1.487711	  1.554731	  0.902856
 -1.501565	  1.569121	  0.896752
 -1.514020	  1.579561	  0.891616
 -1.528904	  1.593397	  0.887321
 -1.543566	  1.607874	  0.883037
 -1.557472	  1.620245	  0.876322
 -1.572141	  1.632465	  0.869932
 -1.588414	  1.645765	  0.863216
 -1.602867	  1.658484	  0.857800
