 -0.595081	  1.272309	  2.026360
 -0.601795	  1.281240	  2.034426
 -0.587378	  1.266006	  2.020157
 -0.579093	  1.258216	  2.011758
 -0.566471	  1.248705	  1.999768
 -0.552252	  1.236024	  1.985725
 -0.547212	  1.225552	  1.971737
 -0.540407	  1.216170	  1.957332
 -0.528977	  1.201788	  1.942994
 -0.524345	  1.188996	  1.930790
 -0.516712	  1.179313	  1.917623
 -0.503552	  1.165115	  1.902101
 -0.496919	  1.152451	  1.888965
 -0.489634	  1.141790	  1.873762
 -0.480827	  1.133929	  1.861864
 -0.469816	  1.121902	  1.846874
 -0.460244	  1.110027	  1.833563
 -0.450494	  1.099003	  1.819978
 -0.440639	  1.087674	  1.806754
 -0.430770	  1.075504	  1.794322
 -0.420876	  1.063134	  1.782084
 -0.410795	  1.050446	  1.770350
 -0.400447	  1.037163	  1.759556
 -0.390168	  1.023810	  1.748773
 -0.379837	  1.009994	  1.738638
 -0.369535	  0.995810	  1.729010
 -0.359270	  0.981577	  1.719414
 -0.349216	  0.966790	  1.710432
 -0.339216	  0.951916	  1.701565
 -0.329281	  0.936858	  1.692916
 -0.319643	  0.921325	  1.684789
 -0.309908	  0.905801	  1.676785
 -0.300141	  0.889925	  1.669505
 -0.290383	  0.873686	  1.663069
 -0.280499	  0.857480	  1.656784
 -0.270366	  0.841001	  1.651721
 -0.260243	  0.824299	  1.647411
 -0.250194	  0.807561	  1.642983
 -0.239892	  0.791472	  1.638428
 -0.229455	  0.775550	  1.634824
 -0.218092	  0.761586	  1.629382
 -0.201008	  0.742279	  1.620824
 -0.192981	  0.729343	  1.615516
 -0.184334	  0.715301	  1.607910
 -0.172681	  0.699421	  1.598631
 -0.164727	  0.683328	  1.590469
 -0.159470	  0.667527	  1.578915
 -0.150842	  0.651392	  1.568828
 -0.138875	  0.640757	  1.558922
 -0.127665	  0.629959	  1.549673
 -0.109655	  0.610341	  1.539138
 -0.099743	  0.599275	  1.530016
 -0.091463	  0.591171	  1.515872
 -0.082877	  0.584830	  1.499660
 -0.068258	  0.575108	  1.480267
 -0.060101	  0.569242	  1.469424
 -0.048495	  0.560279	  1.452316
 -0.036290	  0.552828	  1.436751
 -0.023423	  0.544810	  1.425822
 -0.009037	  0.533478	  1.415607
  0.003572	  0.523237	  1.405889
  0.017236	  0.514589	  1.391489
  0.026778	  0.504878	  1.380332
  0.034360	  0.490173	  1.365388
  0.041963	  0.477793	  1.348732
  0.053172	  0.469921	  1.333314
  0.063166	  0.463156	  1.322346
  0.070430	  0.455386	  1.308128
  0.081489	  0.449691	  1.289964
  0.095744	  0.442954	  1.270897
  0.098375	  0.434641	  1.254666
  0.093847	  0.427755	  1.234482
  0.092436	  0.425468	  1.213113
  0.097105	  0.419085	  1.191888
  0.101763	  0.405561	  1.176335
  0.103113	  0.392392	  1.165311
  0.101058	  0.381004	  1.145678
  0.099449	  0.375374	  1.125696
  0.098470	  0.373679	  1.106462
  0.095483	  0.368826	  1.084987
  0.092411	  0.363423	  1.065487
  0.092653	  0.360944	  1.049440
  0.092361	  0.360363	  1.027160
  0.086065	  0.361149	  1.007065
  0.076951	  0.357998	  0.987685
  0.072647	  0.349197	  0.970188
  0.071340	  0.336827	  0.954289
  0.074641	  0.321593	  0.939225
  0.079990	  0.311205	  0.922793
  0.085049	  0.304860	  0.906872
  0.089131	  0.295159	  0.888150
  0.090202	  0.282843	  0.870423
  0.094393	  0.276596	  0.856077
  0.101802	  0.269739	  0.838518
  0.109755	  0.258073	  0.820251
  0.111465	  0.242877	  0.807231
  0.113532	  0.226056	  0.797940
  0.120075	  0.208964	  0.786985
  0.127348	  0.193859	  0.773077
  0.138130	  0.179031	  0.762874
  0.149168	  0.165858	  0.756974
  0.164247	  0.151551	  0.751035
  0.182597	  0.139022	  0.747213
  0.198883	  0.128012	  0.745573
  0.213444	  0.114599	  0.745171
  0.222573	  0.101816	  0.742942
  0.234631	  0.083697	  0.741319
  0.244834	  0.068433	  0.745998
  0.260199	  0.055870	  0.752630
  0.274721	  0.043803	  0.756851
  0.284214	  0.028668	  0.760232
  0.299214	  0.013142	  0.766077
  0.319582	  0.006445	  0.774099
  0.339336	 -0.001936	  0.781934
  0.352031	 -0.010717	  0.787056
  0.363461	 -0.022766	  0.792705
  0.379780	 -0.038040	  0.797362
  0.397430	 -0.051091	  0.800272
  0.413175	 -0.059738	  0.810412
  0.430136	 -0.070863	  0.820018
  0.441644	 -0.083427	  0.819164
  0.456433	 -0.099149	  0.818948
  0.476866	 -0.112507	  0.825219
  0.488762	 -0.118200	  0.827150
  0.505516	 -0.130872	  0.829051
  0.514593	 -0.145451	  0.828528
  0.531220	 -0.162449	  0.837357
  0.546774	 -0.174841	  0.846215
  0.558320	 -0.183174	  0.851057
  0.574327	 -0.192281	  0.860507
  0.587319	 -0.205891	  0.871217
  0.595601	 -0.228078	  0.880066
  0.606108	 -0.246920	  0.885258
  0.619156	 -0.259217	  0.881279
  0.633268	 -0.276088	  0.879032
  0.647076	 -0.292486	  0.874737
  0.661455	 -0.304828	  0.867591
  0.672218	 -0.318785	  0.859530
  0.684220	 -0.334183	  0.849360
  0.699460	 -0.348148	  0.842660
  0.715944	 -0.357495	  0.832545
  0.725813	 -0.363560	  0.818881
  0.735793	 -0.372360	  0.803238
  0.749650	 -0.383150	  0.788739
  0.763101	 -0.395083	  0.778888
  0.776915	 -0.405180	  0.770446
  0.790687	 -0.413408	  0.759112
  0.804114	 -0.424968	  0.745930
  0.816317	 -0.434272	  0.738984
  0.832909	 -0.443808	  0.729548
  0.848497	 -0.454064	  0.719861
  0.860063	 -0.462152	  0.707273
  0.874418	 -0.469673	  0.692013
  0.889867	 -0.481655	  0.682101
  0.902432	 -0.492836	  0.677453
  0.918269	 -0.508914	  0.672239
  0.930881	 -0.523909	  0.663201
  0.938601	 -0.535300	  0.652537
  0.947637	 -0.550102	  0.641601
  0.959442	 -0.564265	  0.631877
  0.970974	 -0.578690	  0.623879
  0.982501	 -0.593421	  0.616486
  0.993080	 -0.608462	  0.608489
  1.003792	 -0.623556	  0.601423
  1.012833	 -0.640030	  0.593638
  1.019053	 -0.657888	  0.587408
  1.019887	 -0.677610	  0.581138
  1.022386	 -0.694645	  0.570597
  1.029144	 -0.709039	  0.564472
  1.034856	 -0.726061	  0.562928
  1.032162	 -0.747715	  0.564492
  1.031557	 -0.762935	  0.562135
  1.032565	 -0.781031	  0.566702
  1.031691	 -0.800480	  0.573549
  1.028790	 -0.820454	  0.578067
  1.030839	 -0.838609	  0.579384
  1.032762	 -0.858298	  0.586485
  1.032875	 -0.876795	  0.594951
  1.032033	 -0.894827	  0.603641
  1.032315	 -0.912888	  0.612220
  1.035491	 -0.930857	  0.620398
  1.038685	 -0.948769	  0.628667
  1.041890	 -0.966539	  0.637316
  1.045079	 -0.984270	  0.645723
  1.048411	 -1.000634	  0.655914
  1.053815	 -1.018641	  0.667293
  1.059144	 -1.037813	  0.674078
  1.064067	 -1.056871	  0.676505
  1.068820	 -1.075513	  0.676672
  1.074396	 -1.094924	  0.681599
  1.082952	 -1.111468	  0.688922
  1.092275	 -1.127398	  0.696616
  1.101566	 -1.143314	  0.704391
  1.110835	 -1.159221	  0.712205
  1.120210	 -1.175024	  0.720035
  1.134230	 -1.186208	  0.728810
  1.148067	 -1.196655	  0.736871
  1.161427	 -1.208380	  0.744953
  1.178349	 -1.219994	  0.756915
  1.192440	 -1.228419	  0.765689
  1.207691	 -1.237368	  0.769907
  1.228069	 -1.247693	  0.775193
  1.241949	 -1.254868	  0.785618
  1.255000	 -1.260056	  0.797616
  1.274855	 -1.267471	  0.810125
  1.291352	 -1.273891	  0.813765
  1.308825	 -1.280940	  0.818556
  1.326752	 -1.287915	  0.826300
  1.344164	 -1.294734	  0.829851
  1.365912	 -1.302735	  0.833867
  1.383336	 -1.309063	  0.843556
  1.395888	 -1.313498	  0.851327
  1.415365	 -1.318190	  0.857099
  1.435743	 -1.321749	  0.863618
  1.453668	 -1.328962	  0.867402
  1.467886	 -1.333335	  0.854984
  1.478213	 -1.333261	  0.836854
  1.489379	 -1.330729	  0.820549
  1.499782	 -1.328344	  0.802002
  1.507961	 -1.328565	  0.783707
  1.512307	 -1.325702	  0.763990
  1.516666	 -1.318078	  0.744856
  1.524536	 -1.312271	  0.727512
  1.534911	 -1.308924	  0.710468
  1.544344	 -1.307744	  0.693225
  1.552502	 -1.307274	  0.675090
  1.561781	 -1.307166	  0.657509
  1.572228	 -1.303796	  0.639916
  1.585217	 -1.299784	  0.623903
  1.596445	 -1.292967	  0.606892
  1.602208	 -1.288246	  0.588502
  1.609084	 -1.287831	  0.570845
  1.622059	 -1.289052	  0.554704
  1.630491	 -1.281874	  0.533882
  1.636280	 -1.271795	  0.515864
  1.637091	 -1.264608	  0.496681
  1.639692	 -1.262434	  0.477897
  1.646223	 -1.262164	  0.458551
  1.654232	 -1.262033	  0.439513
  1.659759	 -1.260812	  0.420545
  1.667748	 -1.259747	  0.401878
  1.676044	 -1.257182	  0.383654
  1.682943	 -1.252871	  0.365224
  1.688805	 -1.249988	  0.347432
  1.697527	 -1.250695	  0.332834
  1.705949	 -1.247874	  0.313445
  1.719292	 -1.248249	  0.300967
  1.734916	 -1.251037	  0.292912
  1.752124	 -1.253612	  0.281270
  1.764012	 -1.258886	  0.268101
  1.773647	 -1.262838	  0.251447
  1.786759	 -1.267369	  0.234474
  1.805686	 -1.270952	  0.220813
  1.821005	 -1.274399	  0.214970
  1.836547	 -1.287786	  0.208898
  1.845733	 -1.303836	  0.200357
  1.857452	 -1.315480	  0.190692
  1.875265	 -1.330879	  0.185018
  1.887258	 -1.341157	  0.179927
  1.898282	 -1.351977	  0.169708
  1.910789	 -1.366111	  0.163196
  1.923617	 -1.379341	  0.155502
  1.931997	 -1.396015	  0.149974
  1.939939	 -1.414652	  0.146103
  1.952061	 -1.429963	  0.141197
  1.964128	 -1.443816	  0.135228
  1.972785	 -1.460398	  0.127772
  1.979786	 -1.480776	  0.125509
  1.990883	 -1.498794	  0.124112
  2.003287	 -1.512734	  0.119365
  2.016180	 -1.528599	  0.112473
  2.026305	 -1.542056	  0.100906
  2.036569	 -1.556976	  0.090452
  2.046376	 -1.574202	  0.083724
  2.056899	 -1.589143	  0.073746
  2.067532	 -1.601868	  0.061517
  2.077310	 -1.611869	  0.044102
  2.087907	 -1.625640	  0.034200
