 -0.414985	 -2.245262	  0.913608
 -0.414707	 -2.259484	  0.921322
 -0.416118	 -2.242608	  0.912605
 -0.417639	 -2.225742	  0.903773
 -0.418430	 -2.203384	  0.895250
 -0.423812	 -2.186853	  0.886930
 -0.431770	 -2.172179	  0.875547
 -0.434778	 -2.155530	  0.865143
 -0.430823	 -2.132785	  0.853481
 -0.427035	 -2.119934	  0.842816
 -0.424326	 -2.103685	  0.829069
 -0.420974	 -2.089960	  0.818309
 -0.419453	 -2.070520	  0.807746
 -0.418781	 -2.053719	  0.796603
 -0.420048	 -2.039575	  0.787260
 -0.419992	 -2.020127	  0.773197
 -0.422537	 -2.003783	  0.763604
 -0.426195	 -1.987275	  0.756226
 -0.430066	 -1.968045	  0.746446
 -0.436786	 -1.950766	  0.738637
 -0.439287	 -1.934255	  0.729887
 -0.442615	 -1.912751	  0.722008
 -0.439177	 -1.890646	  0.719133
 -0.438296	 -1.871108	  0.718477
 -0.443309	 -1.853540	  0.715781
 -0.452300	 -1.836070	  0.710485
 -0.461001	 -1.815985	  0.707329
 -0.466426	 -1.796953	  0.703262
 -0.470716	 -1.779226	  0.697126
 -0.473641	 -1.760040	  0.686843
 -0.473673	 -1.740423	  0.678610
 -0.474647	 -1.724178	  0.676033
 -0.479567	 -1.704090	  0.676422
 -0.487128	 -1.679148	  0.672999
 -0.490460	 -1.663934	  0.670857
 -0.493729	 -1.643198	  0.668994
 -0.495431	 -1.621083	  0.670292
 -0.496453	 -1.604961	  0.672121
 -0.500734	 -1.583438	  0.674266
 -0.502099	 -1.562981	  0.674862
 -0.498809	 -1.545957	  0.675144
 -0.491698	 -1.522474	  0.677516
 -0.489478	 -1.504743	  0.684661
 -0.490832	 -1.485218	  0.691805
 -0.490974	 -1.465324	  0.697790
 -0.487717	 -1.445084	  0.698761
 -0.481683	 -1.426552	  0.697813
 -0.480277	 -1.405855	  0.696636
 -0.481120	 -1.386386	  0.693293
 -0.481273	 -1.365268	  0.688995
 -0.473419	 -1.343815	  0.684227
 -0.462713	 -1.327569	  0.685489
 -0.454021	 -1.311329	  0.689666
 -0.449413	 -1.290642	  0.691834
 -0.442536	 -1.271677	  0.693118
 -0.431011	 -1.254912	  0.692282
 -0.418735	 -1.238432	  0.689386
 -0.406848	 -1.223854	  0.686619
 -0.392554	 -1.208081	  0.682330
 -0.386682	 -1.188234	  0.676864
 -0.389307	 -1.164337	  0.671406
 -0.388003	 -1.145997	  0.663033
 -0.377343	 -1.132174	  0.652089
 -0.364347	 -1.119861	  0.644814
 -0.352430	 -1.105588	  0.634607
 -0.347803	 -1.091489	  0.617140
 -0.345775	 -1.074360	  0.606366
 -0.336837	 -1.058067	  0.598457
 -0.322479	 -1.046238	  0.589263
 -0.308612	 -1.032505	  0.578201
 -0.303149	 -1.017554	  0.570272
 -0.300385	 -1.000782	  0.561680
 -0.295907	 -0.980484	  0.550905
 -0.290554	 -0.961159	  0.537946
 -0.287191	 -0.950982	  0.525057
 -0.282496	 -0.942048	  0.510476
 -0.275822	 -0.924530	  0.494675
 -0.273162	 -0.906921	  0.481886
 -0.271818	 -0.896619	  0.471210
 -0.268259	 -0.883162	  0.451001
 -0.262580	 -0.870037	  0.438220
 -0.257883	 -0.854872	  0.426829
 -0.257328	 -0.838043	  0.413246
 -0.257162	 -0.824072	  0.402123
 -0.253163	 -0.808025	  0.389106
 -0.249016	 -0.792667	  0.376275
 -0.247064	 -0.775856	  0.365741
 -0.247543	 -0.758473	  0.353662
 -0.248389	 -0.746114	  0.339578
 -0.247868	 -0.734958	  0.325291
 -0.246847	 -0.711795	  0.309690
 -0.246957	 -0.694763	  0.301490
 -0.246937	 -0.683774	  0.294710
 -0.245741	 -0.668087	  0.278500
 -0.244415	 -0.650308	  0.265605
 -0.247021	 -0.629418	  0.258107
 -0.249024	 -0.616892	  0.248024
 -0.250210	 -0.601927	  0.232448
 -0.255388	 -0.584475	  0.220237
 -0.257985	 -0.561349	  0.214555
 -0.254059	 -0.545983	  0.210474
 -0.250859	 -0.527345	  0.202414
 -0.250040	 -0.510966	  0.191038
 -0.252382	 -0.493994	  0.175513
 -0.250218	 -0.478382	  0.158310
 -0.246549	 -0.463444	  0.150155
 -0.247890	 -0.445782	  0.144082
 -0.250158	 -0.426824	  0.130290
 -0.246506	 -0.411679	  0.117570
 -0.244269	 -0.395371	  0.110483
 -0.245211	 -0.376679	  0.101402
 -0.243466	 -0.359066	  0.085965
 -0.239112	 -0.344532	  0.076362
 -0.238461	 -0.326897	  0.070648
 -0.234503	 -0.306709	  0.063275
 -0.227092	 -0.288527	  0.048427
 -0.226483	 -0.276447	  0.036716
 -0.228201	 -0.259414	  0.028440
 -0.229222	 -0.239716	  0.020836
 -0.228089	 -0.220563	  0.012662
 -0.226878	 -0.203065	  0.003736
 -0.226489	 -0.187490	 -0.007699
 -0.226110	 -0.168041	 -0.018683
 -0.221930	 -0.147747	 -0.021421
 -0.214872	 -0.122521	 -0.021968
 -0.214763	 -0.107046	 -0.024304
 -0.219189	 -0.090217	 -0.030243
 -0.219955	 -0.067816	 -0.036636
 -0.217399	 -0.047286	 -0.040122
 -0.214411	 -0.032293	 -0.044014
 -0.213642	 -0.009298	 -0.052172
 -0.213678	  0.011469	 -0.053890
 -0.212961	  0.027284	 -0.052788
 -0.209781	  0.046982	 -0.054376
 -0.207358	  0.068022	 -0.059731
 -0.206720	  0.091352	 -0.070987
 -0.206352	  0.108460	 -0.079139
 -0.205831	  0.122393	 -0.084275
 -0.206406	  0.143833	 -0.091150
 -0.207403	  0.163778	 -0.098510
 -0.206035	  0.179905	 -0.103401
 -0.200049	  0.199185	 -0.110731
 -0.195868	  0.219227	 -0.122618
 -0.198664	  0.235714	 -0.130105
 -0.204848	  0.256247	 -0.134102
 -0.209783	  0.275480	 -0.138900
 -0.211038	  0.293502	 -0.147830
 -0.210102	  0.309389	 -0.159029
 -0.213542	  0.326296	 -0.174662
 -0.220561	  0.340035	 -0.184140
 -0.226671	  0.357018	 -0.194820
 -0.227648	  0.371834	 -0.209562
 -0.226573	  0.385206	 -0.221592
 -0.228028	  0.406260	 -0.233853
 -0.229342	  0.421778	 -0.244895
 -0.230597	  0.435481	 -0.255960
 -0.232904	  0.451683	 -0.268217
 -0.234029	  0.469389	 -0.279787
 -0.231490	  0.486459	 -0.294482
 -0.231204	  0.499976	 -0.306121
 -0.236171	  0.517469	 -0.315836
 -0.240382	  0.533604	 -0.324535
 -0.242790	  0.549444	 -0.337623
 -0.246221	  0.567592	 -0.347801
 -0.247375	  0.585695	 -0.359121
 -0.245559	  0.596966	 -0.372310
 -0.244762	  0.612932	 -0.383611
 -0.247713	  0.632545	 -0.398914
 -0.254511	  0.641937	 -0.411413
 -0.260851	  0.656589	 -0.429571
 -0.259492	  0.670565	 -0.442991
 -0.259974	  0.683787	 -0.452224
 -0.266662	  0.703166	 -0.469128
 -0.268426	  0.715313	 -0.482467
 -0.269819	  0.726633	 -0.495953
 -0.276784	  0.741321	 -0.510920
 -0.285213	  0.754111	 -0.523593
 -0.292542	  0.766986	 -0.535496
 -0.304116	  0.783786	 -0.546746
 -0.312195	  0.797028	 -0.553111
 -0.322807	  0.811836	 -0.562491
 -0.338090	  0.823167	 -0.575430
 -0.347998	  0.833183	 -0.587185
 -0.357751	  0.843290	 -0.602376
 -0.366091	  0.852172	 -0.619895
 -0.368178	  0.865012	 -0.640064
 -0.371731	  0.876359	 -0.653133
 -0.386358	  0.887948	 -0.663748
 -0.402466	  0.897692	 -0.673958
 -0.408793	  0.912030	 -0.686776
 -0.410270	  0.927661	 -0.702244
 -0.416100	  0.941062	 -0.716560
 -0.428434	  0.948946	 -0.727343
 -0.443978	  0.958501	 -0.738678
 -0.456187	  0.969948	 -0.755141
 -0.457437	  0.983589	 -0.767504
 -0.457393	  1.002233	 -0.779415
 -0.461020	  1.016773	 -0.791238
 -0.463332	  1.032032	 -0.800747
 -0.472937	  1.051716	 -0.808765
 -0.481280	  1.071183	 -0.812035
 -0.484930	  1.089631	 -0.809004
 -0.482705	  1.108946	 -0.805754
 -0.478956	  1.129359	 -0.803553
 -0.476844	  1.150334	 -0.801834
 -0.475180	  1.169623	 -0.804142
 -0.476516	  1.190658	 -0.805597
 -0.478595	  1.209501	 -0.816356
 -0.478828	  1.225424	 -0.830670
 -0.475330	  1.241115	 -0.842294
 -0.470449	  1.258260	 -0.852680
 -0.463031	  1.275670	 -0.862009
 -0.456271	  1.292845	 -0.868269
 -0.446539	  1.310248	 -0.875205
 -0.437810	  1.327327	 -0.878150
 -0.429744	  1.345129	 -0.880564
 -0.421311	  1.363957	 -0.885131
 -0.415467	  1.382567	 -0.889330
 -0.414435	  1.403291	 -0.891806
 -0.414705	  1.422720	 -0.893356
 -0.417494	  1.441321	 -0.894187
 -0.415651	  1.462774	 -0.890675
 -0.408122	  1.485250	 -0.888291
 -0.400206	  1.499187	 -0.892103
 -0.388380	  1.514996	 -0.895939
 -0.376622	  1.535247	 -0.896586
 -0.369573	  1.550590	 -0.892466
 -0.358470	  1.568250	 -0.889565
 -0.346132	  1.583950	 -0.891349
 -0.333003	  1.597307	 -0.895938
 -0.318394	  1.614415	 -0.901303
 -0.309644	  1.629875	 -0.899121
 -0.299365	  1.647250	 -0.896377
 -0.289198	  1.665370	 -0.897365
 -0.277068	  1.682788	 -0.900376
 -0.264769	  1.700242	 -0.898617
 -0.254413	  1.717193	 -0.897750
 -0.249033	  1.729642	 -0.901279
 -0.233451	  1.747375	 -0.905833
 -0.218568	  1.762889	 -0.908575
 -0.213464	  1.783510	 -0.914406
 -0.212516	  1.800878	 -0.921751
 -0.209703	  1.819156	 -0.927895
 -0.201868	  1.839593	 -0.930922
 -0.191361	  1.854569	 -0.931494
 -0.178991	  1.869956	 -0.932974
 -0.170361	  1.887301	 -0.938193
 -0.166406	  1.911082	 -0.942498
 -0.165761	  1.931304	 -0.942733
 -0.164681	  1.951508	 -0.944285
 -0.166072	  1.971022	 -0.951589
 -0.169465	  1.989381	 -0.962835
 -0.169171	  2.003586	 -0.972609
 -0.168896	  2.022605	 -0.984007
 -0.164406	  2.038230	 -0.994637
 -0.161381	  2.055901	 -1.004375
 -0.157696	  2.074344	 -1.012788
 -0.152900	  2.092135	 -1.018988
 -0.150020	  2.111207	 -1.026299
 -0.147982	  2.129612	 -1.034242
 -0.146743	  2.147693	 -1.042780
 -0.144562	  2.165658	 -1.051314
 -0.141802	  2.183571	 -1.059778
 -0.139042	  2.201491	 -1.068242
 -0.136096	  2.220570	 -1.077205
 -0.129793	  2.253055	 -1.092231
 -0.126132	  2.270912	 -1.100459
