 -1.053165	  1.538218	 -1.836530
 -1.067508	  1.538150	 -1.842504
 -1.051050	  1.544730	 -1.851769
 -1.034593	  1.551311	 -1.861035
 -1.018135	  1.557891	 -1.870300
 -1.001678	  1.564472	 -1.879565
 -0.985220	  1.571052	 -1.888830
 -0.968762	  1.577633	 -1.898096
 -0.952305	  1.584213	 -1.907361
 -0.934670	  1.590833	 -1.918006
 -0.918545	  1.596493	 -1.928395
