 -0.674035	  0.808157	  2.409907
 -0.696174	  0.772332	  2.429269
 -0.686595	  0.788502	  2.422430
 -0.677054	  0.804693	  2.415588
 -0.667718	  0.821341	  2.409616
 -0.658410	  0.838020	  2.403690
 -0.649456	  0.855105	  2.398406
 -0.640504	  0.872191	  2.393122
 -0.631685	  0.889398	  2.388004
 -0.622901	  0.906634	  2.382933
 -0.614042	  0.923837	  2.377876
 -0.605056	  0.940988	  2.372865
 -0.596068	  0.958134	  2.367842
 -0.586922	  0.975078	  2.362429
 -0.577727	  0.991950	  2.356883
 -0.568533	  1.008823	  2.351333
 -0.559182	  1.025292	  2.344906
 -0.549812	  1.041713	  2.338383
 -0.540448	  1.058136	  2.331855
 -0.530934	  1.074068	  2.324396
 -0.521410	  1.089955	  2.316851
 -0.511886	  1.105839	  2.309303
 -0.502204	  1.121163	  2.300851
 -0.492510	  1.136438	  2.292323
 -0.482815	  1.151713	  2.283796
 -0.472993	  1.166367	  2.274373
 -0.463159	  1.180975	  2.264891
 -0.453319	  1.195584	  2.255416
 -0.443278	  1.209496	  2.245137
 -0.433239	  1.223334	  2.234758
 -0.423190	  1.237177	  2.224394
 -0.412696	  1.250233	  2.213465
 -0.402213	  1.263282	  2.202519
 -0.391622	  1.276194	  2.191513
 -0.380676	  1.288612	  2.180289
 -0.369732	  1.301025	  2.169058
 -0.358710	  1.313189	  2.157632
 -0.347615	  1.325131	  2.146043
 -0.336523	  1.337072	  2.134451
 -0.325984	  1.349429	  2.122780
 -0.315447	  1.361799	  2.111120
 -0.305084	  1.375280	  2.100595
 -0.294727	  1.389325	  2.090826
 -0.284403	  1.404242	  2.082408
 -0.274464	  1.419722	  2.074560
 -0.264775	  1.435562	  2.067135
 -0.255186	  1.451483	  2.059760
 -0.245968	  1.467630	  2.052732
 -0.236677	  1.484435	  2.046193
 -0.227249	  1.500782	  2.039149
 -0.217773	  1.515883	  2.030500
 -0.208223	  1.531367	  2.022291
 -0.198354	  1.547118	  2.014186
 -0.188614	  1.561676	  2.004886
 -0.178817	  1.576765	  1.996134
 -0.168989	  1.591922	  1.987017
 -0.159335	  1.606369	  1.977357
 -0.149772	  1.621039	  1.967973
 -0.140098	  1.636185	  1.958259
 -0.130675	  1.650092	  1.947631
 -0.121412	  1.663687	  1.936376
 -0.112408	  1.677641	  1.925146
 -0.103451	  1.691915	  1.914302
 -0.094720	  1.706099	  1.903222
 -0.086120	  1.720246	  1.892001
 -0.077517	  1.734393	  1.880783
 -0.069187	  1.748465	  1.869269
 -0.060875	  1.762532	  1.857733
 -0.052612	  1.776631	  1.846204
 -0.044450	  1.790785	  1.834669
 -0.036299	  1.804930	  1.823117
 -0.028190	  1.819295	  1.811808
 -0.020088	  1.833668	  1.800503
 -0.011890	  1.848077	  1.789317
 -0.003611	  1.862528	  1.778243
  0.004741	  1.876993	  1.767243
  0.013340	  1.891532	  1.756537
  0.021946	  1.906076	  1.745841
  0.030922	  1.920673	  1.735529
  0.039925	  1.935283	  1.725256
  0.049313	  1.949817	  1.715226
  0.058876	  1.964314	  1.705307
  0.068653	  1.978823	  1.695616
  0.078665	  1.993337	  1.686179
  0.088432	  2.008243	  1.677100
  0.097810	  2.023715	  1.668577
  0.107205	  2.039220	  1.660041
  0.116793	  2.055156	  1.651295
  0.125730	  2.070990	  1.642964
