 -1.642071	 -1.813255	  0.732741
 -1.649719	 -1.816329	  0.749447
 -1.641508	 -1.813030	  0.731511
 -1.633335	 -1.809685	  0.713571
 -1.627289	 -1.803814	  0.695439
 -1.621579	 -1.797575	  0.677316
 -1.615893	 -1.791310	  0.659195
 -1.611527	 -1.783878	  0.641150
 -1.607933	 -1.775816	  0.623203
 -1.604369	 -1.767744	  0.605255
 -1.601816	 -1.759922	  0.587027
 -1.599501	 -1.752152	  0.568745
 -1.597266	 -1.744862	  0.550255
 -1.594990	 -1.737973	  0.531626
 -1.592928	 -1.731090	  0.512966
 -1.591523	 -1.723653	  0.494469
 -1.590458	 -1.716141	  0.475964
 -1.588968	 -1.708530	  0.457513
 -1.587835	 -1.700174	  0.439446
 -1.586752	 -1.691760	  0.421324
 -1.585392	 -1.683479	  0.403158
 -1.583551	 -1.675282	  0.385009
 -1.581146	 -1.667046	  0.366947
 -1.576458	 -1.658750	  0.349366
 -1.571715	 -1.650458	  0.331795
 -1.566567	 -1.641592	  0.314634
 -1.561657	 -1.632299	  0.297648
 -1.557468	 -1.623259	  0.280276
 -1.552854	 -1.613751	  0.263524
 -1.551509	 -1.605320	  0.246348
 -1.552043	 -1.596935	  0.227551
 -1.550799	 -1.587393	  0.213042
 -1.545188	 -1.572670	  0.191082
 -1.535580	 -1.561119	  0.173566
 -1.527949	 -1.554943	  0.162252
 -1.517316	 -1.549926	  0.145686
 -1.508815	 -1.543378	  0.123258
 -1.504395	 -1.536910	  0.109420
 -1.501631	 -1.526343	  0.094770
 -1.499710	 -1.510658	  0.076158
 -1.498442	 -1.498156	  0.057890
 -1.496540	 -1.488739	  0.039741
 -1.490513	 -1.483066	  0.021558
 -1.481988	 -1.480325	  0.003422
 -1.475595	 -1.477713	 -0.017810
 -1.473301	 -1.473915	 -0.034135
 -1.474162	 -1.469026	 -0.055261
 -1.472182	 -1.463735	 -0.077251
 -1.466635	 -1.459856	 -0.092294
 -1.456824	 -1.461585	 -0.111053
 -1.442462	 -1.459666	 -0.132189
 -1.438117	 -1.455585	 -0.155956
 -1.443862	 -1.454135	 -0.177383
 -1.451834	 -1.453620	 -0.193226
 -1.451794	 -1.447175	 -0.211053
 -1.450929	 -1.439674	 -0.232198
 -1.450215	 -1.433285	 -0.251256
 -1.449468	 -1.426597	 -0.270124
 -1.448698	 -1.420124	 -0.289038
 -1.448199	 -1.413645	 -0.307957
 -1.447830	 -1.406983	 -0.326828
 -1.447206	 -1.400350	 -0.345708
 -1.445801	 -1.392627	 -0.364155
 -1.443662	 -1.383890	 -0.381994
 -1.442129	 -1.375122	 -0.399931
 -1.440573	 -1.365680	 -0.417583
 -1.438234	 -1.354882	 -0.433617
 -1.440635	 -1.343580	 -0.449282
 -1.444956	 -1.333365	 -0.466298
 -1.442952	 -1.326770	 -0.485987
 -1.431866	 -1.316540	 -0.508118
 -1.419755	 -1.306734	 -0.521990
 -1.406708	 -1.294991	 -0.536489
 -1.397460	 -1.288447	 -0.552242
 -1.392125	 -1.286647	 -0.567155
 -1.383980	 -1.286372	 -0.587532
 -1.372494	 -1.285773	 -0.607310
 -1.364383	 -1.282294	 -0.624922
 -1.358035	 -1.274931	 -0.647388
 -1.354661	 -1.270804	 -0.658894
 -1.347151	 -1.262397	 -0.675682
 -1.342087	 -1.255390	 -0.693743
 -1.335961	 -1.247695	 -0.721385
 -1.335442	 -1.244798	 -0.733509
 -1.336448	 -1.241015	 -0.752717
 -1.337251	 -1.242152	 -0.765428
 -1.340659	 -1.250373	 -0.783641
 -1.340987	 -1.254663	 -0.794665
 -1.333289	 -1.268378	 -0.808765
 -1.322028	 -1.282305	 -0.819984
 -1.312563	 -1.296816	 -0.830837
 -1.305969	 -1.312218	 -0.842135
 -1.301338	 -1.328221	 -0.853358
 -1.296652	 -1.344258	 -0.864373
 -1.291811	 -1.360253	 -0.875350
 -1.284303	 -1.374001	 -0.887772
 -1.276214	 -1.387165	 -0.900471
 -1.268115	 -1.400316	 -0.913176
 -1.260093	 -1.413406	 -0.925962
 -1.256085	 -1.423351	 -0.942807
 -1.255353	 -1.430266	 -0.961546
 -1.254685	 -1.437121	 -0.980322
 -1.254043	 -1.443884	 -0.999120
 -1.254677	 -1.445986	 -1.018985
 -1.255884	 -1.445908	 -1.038945
 -1.257102	 -1.445788	 -1.058908
 -1.258321	 -1.445667	 -1.078870
 -1.259505	 -1.445484	 -1.098827
 -1.258973	 -1.442126	 -1.118526
 -1.257314	 -1.436580	 -1.137664
 -1.255751	 -1.430934	 -1.156790
 -1.254198	 -1.425299	 -1.175920
 -1.252556	 -1.419787	 -1.194639
 -1.254544	 -1.412044	 -1.209914
 -1.262591	 -1.397639	 -1.225104
 -1.265142	 -1.384527	 -1.255488
 -1.253656	 -1.382420	 -1.272859
 -1.242840	 -1.379854	 -1.286509
 -1.228615	 -1.376695	 -1.303104
 -1.216435	 -1.372139	 -1.324621
 -1.208393	 -1.369378	 -1.340174
 -1.198988	 -1.365728	 -1.357235
 -1.190745	 -1.361833	 -1.373259
 -1.183529	 -1.354708	 -1.393222
 -1.177369	 -1.345186	 -1.413581
 -1.174572	 -1.338370	 -1.425406
 -1.172149	 -1.327385	 -1.443197
 -1.166157	 -1.314198	 -1.463589
 -1.161155	 -1.306745	 -1.476294
 -1.153547	 -1.297614	 -1.493003
 -1.147073	 -1.286244	 -1.510040
 -1.145896	 -1.274103	 -1.522474
 -1.144690	 -1.256437	 -1.536771
 -1.138229	 -1.240760	 -1.549787
 -1.130439	 -1.228125	 -1.560079
 -1.124628	 -1.214473	 -1.569899
 -1.120100	 -1.200312	 -1.582113
 -1.112950	 -1.183833	 -1.594715
 -1.109949	 -1.164072	 -1.600551
 -1.111162	 -1.143883	 -1.605233
 -1.108460	 -1.122983	 -1.613565
 -1.102665	 -1.107267	 -1.623383
 -1.100232	 -1.096236	 -1.632789
 -1.101370	 -1.082531	 -1.648265
 -1.108547	 -1.066822	 -1.661310
 -1.117147	 -1.047244	 -1.672634
 -1.120755	 -1.028981	 -1.683843
 -1.122161	 -1.014156	 -1.691672
 -1.121557	 -0.992850	 -1.696104
 -1.122695	 -0.972018	 -1.698552
 -1.123582	 -0.953763	 -1.703381
 -1.124040	 -0.936378	 -1.710509
 -1.124041	 -0.918439	 -1.721783
 -1.124229	 -0.902563	 -1.735568
 -1.127808	 -0.885055	 -1.745982
 -1.132172	 -0.870074	 -1.756512
 -1.134626	 -0.858452	 -1.768580
 -1.137613	 -0.841850	 -1.779458
 -1.137556	 -0.827452	 -1.789893
 -1.138387	 -0.814001	 -1.800050
 -1.140527	 -0.799092	 -1.813452
 -1.140653	 -0.785068	 -1.828656
 -1.138685	 -0.773209	 -1.845339
 -1.137185	 -0.766207	 -1.858069
 -1.132540	 -0.754998	 -1.876501
 -1.124772	 -0.745138	 -1.892460
 -1.118143	 -0.734219	 -1.907915
 -1.115577	 -0.722845	 -1.923923
 -1.112908	 -0.714184	 -1.942816
 -1.104751	 -0.707898	 -1.964190
 -1.097702	 -0.706160	 -1.980290
 -1.090016	 -0.703795	 -2.000297
 -1.084614	 -0.698573	 -2.019113
 -1.081706	 -0.691750	 -2.035226
 -1.076585	 -0.682752	 -2.056143
 -1.069826	 -0.678971	 -2.072414
 -1.061376	 -0.677750	 -2.089424
 -1.053692	 -0.675230	 -2.111901
 -1.051579	 -0.668376	 -2.130826
 -1.052230	 -0.660220	 -2.151137
 -1.053984	 -0.656405	 -2.167632
 -1.055789	 -0.653719	 -2.187459
 -1.048158	 -0.652414	 -2.216902
 -1.042757	 -0.651226	 -2.228591
 -1.036394	 -0.638676	 -2.245146
 -1.032304	 -0.634228	 -2.264211
