  1.254266	  1.511679	  2.307064
  1.241848	  1.496711	  2.284222
  1.215735	  1.464566	  2.264670
  1.180559	  1.436151	  2.252521
  1.150083	  1.407642	  2.228456
  1.119171	  1.377221	  2.205025
  1.084995	  1.345338	  2.187130
  1.048785	  1.319686	  2.162490
  1.014892	  1.289621	  2.138907
  0.985814	  1.255763	  2.114559
  0.950962	  1.226546	  2.093282
  0.918679	  1.195169	  2.072817
  0.889191	  1.163174	  2.050233
  0.853958	  1.133843	  2.032375
  0.815262	  1.107401	  2.015701
  0.778491	  1.076793	  1.999743
  0.745149	  1.041954	  1.984739
  0.713322	  1.006845	  1.968667
  0.681019	  0.972772	  1.952504
  0.646949	  0.940481	  1.936846
  0.610286	  0.910739	  1.920886
  0.572662	  0.881091	  1.904462
  0.536538	  0.850026	  1.885697
  0.504401	  0.817816	  1.862185
  0.474383	  0.785606	  1.836515
  0.445241	  0.754106	  1.810244
  0.416381	  0.723432	  1.783261
  0.387825	  0.692209	  1.755527
  0.359770	  0.659695	  1.728121
  0.331534	  0.626421	  1.701787
  0.303130	  0.592918	  1.676736
  0.274119	  0.559279	  1.652540
  0.243959	  0.526069	  1.629894
  0.212565	  0.492567	  1.609956
  0.179813	  0.459622	  1.593151
  0.144255	  0.427977	  1.579598
  0.107227	  0.396751	  1.568244
  0.074488	  0.362688	  1.555741
  0.040114	  0.328223	  1.542193
  0.009374	  0.292495	  1.525599
 -0.025677	  0.259738	  1.508494
 -0.063273	  0.230266	  1.490839
 -0.101607	  0.202538	  1.472912
 -0.139920	  0.175261	  1.455164
 -0.178245	  0.147433	  1.437749
 -0.215786	  0.118641	  1.421238
 -0.252263	  0.088736	  1.405310
 -0.287953	  0.057217	  1.389051
 -0.321938	  0.023983	  1.371651
 -0.354047	 -0.011024	  1.353470
 -0.384662	 -0.047290	  1.335083
 -0.413657	 -0.082901	  1.316350
 -0.441834	 -0.117735	  1.296107
 -0.469882	 -0.150909	  1.273249
 -0.498977	 -0.182010	  1.247586
 -0.530172	 -0.210613	  1.219780
 -0.562348	 -0.235488	  1.190375
 -0.594742	 -0.257058	  1.160415
 -0.627038	 -0.275126	  1.130904
 -0.659770	 -0.288973	  1.101713
 -0.694300	 -0.298921	  1.070903
 -0.732923	 -0.304882	  1.035294
 -0.777660	 -0.304786	  0.992489
 -0.828230	 -0.295138	  0.945225
 -0.880865	 -0.276453	  0.901884
 -0.929481	 -0.258511	  0.865115
 -0.976200	 -0.248960	  0.833945
 -1.025147	 -0.250166	  0.805827
 -1.082678	 -0.262495	  0.777867
 -1.149426	 -0.284709	  0.749731
 -1.220246	 -0.318185	  0.718515
 -1.285824	 -0.361721	  0.681617
 -1.338636	 -0.412210	  0.640382
 -1.376679	 -0.464743	  0.601290
 -1.401793	 -0.515679	  0.569157
 -1.417660	 -0.561723	  0.546130
 -1.427506	 -0.605500	  0.530272
 -1.434542	 -0.654293	  0.519162
 -1.439471	 -0.714982	  0.512140
 -1.445531	 -0.787402	  0.509364
 -1.456248	 -0.864131	  0.509226
 -1.473477	 -0.933362	  0.509728
 -1.493296	 -0.988863	  0.510495
 -1.511913	 -1.033002	  0.509664
 -1.529786	 -1.071153	  0.507498
 -1.548553	 -1.108108	  0.503953
 -1.569310	 -1.145268	  0.499825
 -1.592983	 -1.182701	  0.495077
 -1.619655	 -1.219434	  0.488457
 -1.649458	 -1.254688	  0.479840
 -1.681579	 -1.288278	  0.468617
 -1.715224	 -1.320924	  0.454669
 -1.749863	 -1.352783	  0.438273
 -1.784151	 -1.383479	  0.420499
 -1.818289	 -1.414728	  0.401371
 -1.850948	 -1.446569	  0.381797
 -1.882137	 -1.478839	  0.361778
 -1.912749	 -1.511255	  0.341168
 -1.944143	 -1.543447	  0.319788
 -1.977003	 -1.575152	  0.298165
 -2.010740	 -1.606293	  0.277236
 -2.044983	 -1.636793	  0.256767
 -2.078161	 -1.666950	  0.236789
 -2.110744	 -1.698141	  0.217094
 -2.143713	 -1.731731	  0.199276
 -2.176039	 -1.766739	  0.184669
 -2.208227	 -1.802429	  0.169307
 -2.244439	 -1.836923	  0.157011
 -2.282428	 -1.866997	  0.135054
 -2.315834	 -1.903710	  0.113141
 -2.338993	 -1.922747	  0.114273
