 -2.013628	  1.350954	 -0.053428
 -2.042903	  1.371056	 -0.021399
 -2.033033	  1.363037	 -0.033880
 -2.022410	  1.355244	 -0.049606
 -2.008390	  1.342796	 -0.067123
 -1.994299	  1.337365	 -0.076131
 -1.977898	  1.334870	 -0.084782
 -1.958370	  1.327692	 -0.098014
 -1.948002	  1.315841	 -0.113582
 -1.944839	  1.306149	 -0.127049
 -1.933603	  1.298185	 -0.144101
 -1.915704	  1.294734	 -0.156283
 -1.899173	  1.292375	 -0.167021
 -1.885126	  1.286597	 -0.181000
 -1.872036	  1.280172	 -0.194761
 -1.859417	  1.272737	 -0.208339
 -1.846824	  1.265603	 -0.222075
 -1.835210	  1.258212	 -0.236569
 -1.824165	  1.250906	 -0.251606
 -1.814166	  1.243367	 -0.267183
 -1.805496	  1.235135	 -0.283137
 -1.797382	  1.227036	 -0.299342
 -1.792995	  1.219866	 -0.317321
 -1.789118	  1.213039	 -0.335668
 -1.787754	  1.206994	 -0.354563
 -1.787154	  1.201255	 -0.373653
 -1.786790	  1.195637	 -0.392864
 -1.786643	  1.189911	 -0.412039
 -1.786356	  1.183791	 -0.431081
 -1.785268	  1.176999	 -0.449587
 -1.785571	  1.173666	 -0.468211
 -1.785202	  1.172549	 -0.490290
 -1.780754	  1.161219	 -0.510904
 -1.776037	  1.147269	 -0.525688
 -1.772283	  1.138378	 -0.540763
 -1.768201	  1.131368	 -0.560462
 -1.763995	  1.121946	 -0.577556
 -1.760739	  1.113111	 -0.593416
 -1.755742	  1.105365	 -0.613379
 -1.750402	  1.094614	 -0.630691
 -1.748330	  1.082214	 -0.642104
 -1.744441	  1.066901	 -0.659254
 -1.737723	  1.055785	 -0.678223
 -1.733959	  1.049662	 -0.689822
 -1.728029	  1.034663	 -0.708473
 -1.716841	  1.021449	 -0.727298
 -1.708235	  1.018548	 -0.736842
 -1.693219	  1.014208	 -0.751829
 -1.679577	  1.007951	 -0.767029
 -1.669712	  1.000817	 -0.784586
 -1.657799	  0.997277	 -0.802760
 -1.637962	  0.997613	 -0.815770
 -1.617190	  1.000290	 -0.821742
 -1.594554	  0.999655	 -0.821139
 -1.576724	  0.995551	 -0.823649
 -1.558851	  0.991121	 -0.829355
 -1.540460	  0.991322	 -0.831409
 -1.514396	  0.991859	 -0.826053
 -1.497189	  0.991203	 -0.823319
 -1.479210	  0.990859	 -0.825835
 -1.459274	  0.992059	 -0.833152
 -1.435725	  0.990777	 -0.836578
 -1.414596	  0.987532	 -0.835584
 -1.394896	  0.980718	 -0.833144
 -1.379793	  0.968889	 -0.829494
 -1.362458	  0.956129	 -0.828925
 -1.343335	  0.946273	 -0.829390
 -1.322161	  0.938838	 -0.827539
 -1.301737	  0.935469	 -0.824886
 -1.279553	  0.933840	 -0.817759
 -1.266514	  0.930502	 -0.809495
 -1.250141	  0.917617	 -0.801368
 -1.238613	  0.899466	 -0.795922
 -1.226482	  0.884751	 -0.788329
 -1.206057	  0.875669	 -0.778252
 -1.186993	  0.869328	 -0.775200
 -1.173137	  0.857095	 -0.776157
 -1.164120	  0.838610	 -0.778730
 -1.153165	  0.819590	 -0.782392
 -1.138191	  0.804113	 -0.783067
 -1.125246	  0.789975	 -0.778085
 -1.116183	  0.775072	 -0.769673
 -1.106661	  0.759112	 -0.759320
 -1.091030	  0.740537	 -0.753547
 -1.079743	  0.722917	 -0.754801
 -1.075821	  0.707632	 -0.756422
 -1.072254	  0.687714	 -0.756019
 -1.061871	  0.664326	 -0.757571
 -1.053019	  0.648392	 -0.762789
 -1.046068	  0.632286	 -0.771125
 -1.039093	  0.612097	 -0.783628
 -1.029822	  0.597029	 -0.789836
 -1.024564	  0.583056	 -0.792548
 -1.012201	  0.555426	 -0.797860
 -1.003422	  0.540408	 -0.798706
 -0.999051	  0.524866	 -0.796219
 -0.991317	  0.501704	 -0.795621
 -0.983371	  0.485726	 -0.793692
 -0.974316	  0.470238	 -0.790172
 -0.960571	  0.450002	 -0.789756
 -0.947471	  0.430877	 -0.792041
 -0.938970	  0.418867	 -0.796167
 -0.925557	  0.402650	 -0.806137
 -0.914040	  0.390732	 -0.811811
 -0.902289	  0.375459	 -0.821712
 -0.891972	  0.359773	 -0.831461
 -0.880674	  0.345623	 -0.838120
 -0.869348	  0.329108	 -0.843247
 -0.859696	  0.314662	 -0.846969
 -0.846642	  0.300406	 -0.850577
 -0.832087	  0.280147	 -0.852391
 -0.825056	  0.266782	 -0.852690
 -0.811777	  0.250338	 -0.856895
 -0.797560	  0.233269	 -0.864538
 -0.783502	  0.218649	 -0.871769
 -0.772257	  0.208578	 -0.877974
 -0.747203	  0.199157	 -0.884223
 -0.733614	  0.194688	 -0.886471
 -0.719548	  0.189534	 -0.888939
 -0.701318	  0.174802	 -0.897236
 -0.684354	  0.152343	 -0.907009
 -0.674236	  0.144573	 -0.911907
 -0.657348	  0.133649	 -0.919086
 -0.638071	  0.125093	 -0.924870
 -0.625574	  0.120700	 -0.930074
 -0.604984	  0.106295	 -0.936495
 -0.593532	  0.098214	 -0.940303
 -0.576061	  0.086422	 -0.942838
 -0.556105	  0.075978	 -0.947858
 -0.540876	  0.064035	 -0.955406
 -0.530877	  0.049653	 -0.961740
 -0.520408	  0.031925	 -0.968987
 -0.506903	  0.018943	 -0.980237
 -0.494957	  0.011117	 -0.993242
 -0.484417	  0.001948	 -1.004088
 -0.466940	 -0.012101	 -1.010122
 -0.450802	 -0.023693	 -1.016531
 -0.440161	 -0.033155	 -1.025281
 -0.429347	 -0.042489	 -1.031551
 -0.410210	 -0.061308	 -1.040715
 -0.397014	 -0.072850	 -1.049544
 -0.386446	 -0.083084	 -1.062080
 -0.377657	 -0.096414	 -1.076598
 -0.371192	 -0.107891	 -1.086242
 -0.358517	 -0.119084	 -1.102473
 -0.346927	 -0.129430	 -1.114939
 -0.339873	 -0.136934	 -1.126874
 -0.330366	 -0.151336	 -1.140874
 -0.319737	 -0.159579	 -1.150764
 -0.306409	 -0.176184	 -1.164833
 -0.290557	 -0.192811	 -1.171461
 -0.276154	 -0.205722	 -1.180447
 -0.267724	 -0.211190	 -1.190719
 -0.262388	 -0.221162	 -1.209233
 -0.255931	 -0.231438	 -1.228879
 -0.246321	 -0.236705	 -1.251894
 -0.240254	 -0.239682	 -1.263505
 -0.235447	 -0.251049	 -1.280170
 -0.234532	 -0.265034	 -1.295915
 -0.237131	 -0.272089	 -1.319787
 -0.237632	 -0.273533	 -1.343680
 -0.234226	 -0.278412	 -1.363865
 -0.229597	 -0.286629	 -1.377446
 -0.225021	 -0.299663	 -1.394377
 -0.221638	 -0.313302	 -1.408313
 -0.217857	 -0.325109	 -1.425243
 -0.212722	 -0.336548	 -1.441407
 -0.205890	 -0.349446	 -1.455386
 -0.199140	 -0.362461	 -1.468522
 -0.194717	 -0.374993	 -1.483828
 -0.191478	 -0.386112	 -1.500365
 -0.188416	 -0.396783	 -1.517038
 -0.184025	 -0.407626	 -1.533192
 -0.180154	 -0.417983	 -1.549857
 -0.175509	 -0.428151	 -1.566518
 -0.170275	 -0.437586	 -1.583447
 -0.163853	 -0.445899	 -1.600586
 -0.155372	 -0.452325	 -1.617603
 -0.145742	 -0.457948	 -1.634223
 -0.134195	 -0.461736	 -1.650113
 -0.122578	 -0.465042	 -1.665996
 -0.110390	 -0.467603	 -1.681609
 -0.097650	 -0.469812	 -1.696928
 -0.084537	 -0.471323	 -1.712012
 -0.070515	 -0.471861	 -1.726204
 -0.057631	 -0.474081	 -1.739633
 -0.045861	 -0.479688	 -1.755546
 -0.029775	 -0.482118	 -1.769005
 -0.005992	 -0.474999	 -1.780257
  0.006177	 -0.466863	 -1.792866
  0.014811	 -0.461010	 -1.807498
  0.028360	 -0.460255	 -1.824678
  0.042975	 -0.463582	 -1.837183
  0.058056	 -0.460703	 -1.852383
  0.075209	 -0.453258	 -1.866107
  0.095105	 -0.449158	 -1.871475
  0.113222	 -0.450053	 -1.874349
  0.132038	 -0.453147	 -1.881560
  0.150384	 -0.452587	 -1.889481
  0.176660	 -0.440126	 -1.900834
  0.187711	 -0.431243	 -1.910243
  0.195368	 -0.424635	 -1.919160
  0.213141	 -0.413384	 -1.933516
  0.230755	 -0.405870	 -1.940555
  0.248676	 -0.401894	 -1.944690
  0.268551	 -0.394952	 -1.952243
  0.280835	 -0.385690	 -1.961991
  0.292778	 -0.373790	 -1.974292
  0.310264	 -0.363063	 -1.982841
  0.331096	 -0.356998	 -1.986599
  0.349243	 -0.354195	 -1.990895
  0.366678	 -0.347915	 -2.003416
  0.379416	 -0.338003	 -2.016490
  0.387149	 -0.318214	 -2.026064
  0.394278	 -0.294265	 -2.033362
  0.407488	 -0.281264	 -2.041159
  0.428652	 -0.282203	 -2.050933
  0.449168	 -0.287685	 -2.061465
  0.462627	 -0.284122	 -2.070427
  0.478328	 -0.275760	 -2.082094
  0.492645	 -0.271746	 -2.094834
  0.508876	 -0.273069	 -2.107201
  0.524608	 -0.276028	 -2.119207
  0.539223	 -0.280991	 -2.130906
  0.549775	 -0.289731	 -2.144801
  0.562968	 -0.296699	 -2.163525
  0.577024	 -0.297728	 -2.180440
  0.597039	 -0.297855	 -2.190501
  0.615099	 -0.301752	 -2.194796
  0.632271	 -0.310708	 -2.202018
  0.646227	 -0.321388	 -2.210740
  0.658375	 -0.329471	 -2.225939
  0.671930	 -0.333654	 -2.242531
  0.688520	 -0.335808	 -2.256084
  0.707453	 -0.339577	 -2.263018
  0.724851	 -0.346452	 -2.267694
  0.742041	 -0.354883	 -2.276458
  0.757846	 -0.361510	 -2.287484
  0.773123	 -0.369040	 -2.297973
  0.788216	 -0.376945	 -2.308354
  0.803072	 -0.385005	 -2.318815
  0.817568	 -0.393270	 -2.329840
