 -1.263123	  1.749076	  2.127476
 -1.250617	  1.731759	  2.106412
 -1.207731	  1.702627	  2.107231
 -1.174441	  1.670975	  2.101138
 -1.140255	  1.637109	  2.093492
 -1.105442	  1.601461	  2.080270
 -1.070969	  1.562188	  2.071968
 -1.032775	  1.527967	  2.067478
 -0.999425	  1.492963	  2.060612
 -0.960819	  1.462246	  2.051688
 -0.930323	  1.424729	  2.040098
 -0.898176	  1.387127	  2.036365
 -0.864286	  1.354545	  2.023402
 -0.831060	  1.316722	  2.019698
 -0.794935	  1.278741	  2.014473
 -0.761657	  1.246784	  2.006108
 -0.729588	  1.210139	  1.997098
 -0.696685	  1.173487	  1.988448
 -0.663117	  1.137656	  1.979138
 -0.628948	  1.102817	  1.969512
 -0.595062	  1.070364	  1.959933
 -0.560062	  1.038123	  1.950081
 -0.523811	  1.004500	  1.939308
 -0.486433	  0.970010	  1.929576
 -0.449496	  0.935600	  1.921148
 -0.414000	  0.902011	  1.914123
 -0.377358	  0.866763	  1.907565
 -0.343593	  0.834087	  1.902262
 -0.310656	  0.802001	  1.896273
 -0.273195	  0.766711	  1.889146
 -0.234858	  0.731933	  1.882676
 -0.201094	  0.701141	  1.878028
 -0.165074	  0.667129	  1.873421
 -0.127429	  0.629953	  1.869309
 -0.093490	  0.592664	  1.864529
 -0.060982	  0.552737	  1.858844
 -0.031278	  0.515019	  1.854196
 -0.000667	  0.477853	  1.849813
  0.032074	  0.440148	  1.844827
  0.067131	  0.402997	  1.840015
  0.102158	  0.368712	  1.835523
  0.139567	  0.334100	  1.829894
  0.177594	  0.300390	  1.822561
  0.217020	  0.270556	  1.812814
  0.257832	  0.249514	  1.799550
  0.326407	  0.241808	  1.774248
  0.454719	  0.306832	  1.733764
  0.515238	  0.338687	  1.726589
  0.622731	  0.326992	  1.743240
  0.692526	  0.311166	  1.761387
  0.736761	  0.276650	  1.784520
  0.769420	  0.233403	  1.824805
  0.775280	  0.207629	  1.854592
  0.773250	  0.164740	  1.898762
  0.781824	  0.102330	  1.904135
  0.761696	 -0.012106	  1.877281
  0.712139	 -0.119836	  1.769304
  0.730360	 -0.185420	  1.717866
  0.757270	 -0.222452	  1.698803
  0.790748	 -0.259356	  1.686079
  0.824376	 -0.296172	  1.677450
  0.858470	 -0.332960	  1.671437
  0.889363	 -0.367356	  1.666905
  0.921181	 -0.404222	  1.661712
  0.962406	 -0.438961	  1.656104
  0.999930	 -0.472566	  1.651195
  1.035019	 -0.504188	  1.645030
  1.071940	 -0.536471	  1.636543
  1.111193	 -0.570965	  1.627795
  1.144765	 -0.602505	  1.622314
  1.179722	 -0.636354	  1.616377
  1.215271	 -0.672146	  1.610106
  1.248952	 -0.708957	  1.604260
  1.279542	 -0.746826	  1.598392
  1.308915	 -0.782997	  1.588451
  1.339176	 -0.820517	  1.574205
  1.371447	 -0.860087	  1.559044
  1.403602	 -0.898072	  1.545679
  1.435206	 -0.934114	  1.534176
  1.468604	 -0.970023	  1.523826
  1.504601	 -1.004272	  1.515465
  1.544161	 -1.039496	  1.509256
  1.580731	 -1.071244	  1.505732
  1.617119	 -1.102499	  1.503482
  1.656506	 -1.135704	  1.502335
  1.695439	 -1.167989	  1.501942
  1.734140	 -1.200191	  1.501166
  1.768456	 -1.230708	  1.500114
  1.805244	 -1.263853	  1.499335
  1.845200	 -1.299676	  1.495319
  1.883730	 -1.336641	  1.487527
  1.917616	 -1.371259	  1.479372
  1.949519	 -1.406137	  1.470394
  1.984100	 -1.442963	  1.461011
  2.015302	 -1.476626	  1.443362
  2.050935	 -1.507931	  1.441481
  2.085572	 -1.541429	  1.432574
  2.114562	 -1.584474	  1.420587
  2.135708	 -1.600319	  1.434793
