 0.0 0.0 0.0 0
 0.12110628046308887 -0.1692159767049033 0.9779142201953097 1000
 -0.6925023670973337 -0.4534604103276703 0.5613556161917772 1000
 0.1564360668719365 0.7489169854441586 -0.6439651433850068 1000
 0.953314728313809 0.30122918359503426 0.022203777395682106 1000
 0.6264588845282535 -0.46611244012832564 0.625442610599273 1000
 0.03802609966578188 -0.26429162412436263 -0.9640922949396049 1000
 -0.7780884884855238 0.6019332701527086 -0.1827009643367501 1000
 0.33428685406540226 0.314348813546609 -0.8883901860223891 1000
 0.0 0.0 0.0 0
 -0.07998182436415491 -0.9772435658189994 0.19434227753308805 1000
 0.6300848653063665 -0.5603575013351272 -0.5380683350740036 1000
 -0.7644314941227157 -0.5197652426764692 -0.38253572813370373 1000
 0.2296030909940627 -0.5661887875433087 0.7921885365657659 1000
 -0.9717471540253418 0.14602498081985055 -0.18844143286498904 1000
 0.446353130437507 0.786689267666121 -0.4266742071974583 1000
 0.8890561325661721 0.3340620077944262 -0.3135741827619696 1000
 0.48435100454156904 0.7748306288393123 0.4058073446994872 1000
 0.0 0.0 0.0 0
 -0.11047638980252128 0.9899190036339935 0.08369189650427497 1000
 0.07432526816765359 -0.8592801314163211 0.506439937470334 1000
 0.6752097783458877 0.30012904623097414 0.6738919133173973 1000
 0.5171432154848756 -0.6951248035131514 0.4985472918578192 1000
 -0.4489540575614003 -0.5788909246656027 0.6802606497063887 1000
 -0.9943874130771791 0.05109459129392993 0.08993895404206778 1000
 0.08336080166729398 0.04987532844655135 -0.9952353632974132 1000
 -0.7062434788514134 0.16862871137295465 -0.6881071909815719 1000
 0.0 0.0 0.0 0
 -0.8142943919667598 -0.05830143510652752 0.5766555175111081 1000
 0.012981957000016794 0.49662587314146733 0.8671904121465621 1000
 0.8529439481255942 0.5107180874479533 -0.10706379644598714 1000
 -0.1806271348506212 -0.9705835721369441 -0.155892166748507 1000
 -0.5958858109744312 0.3871472960467048 0.7037386385889786 1000
 -0.6100384428751615 -0.5794861022326105 -0.5391984379926413 1000
 -0.65439243184014 -0.6402611853693236 0.4013865464359958 1000
 0.5792327218270492 -0.741675599773866 -0.3387148633657871 1000
 0.0 0.0 0.0 0
 -0.984117864752245 -0.08550308146285535 -0.15303349743058786 1000
 -0.7147393107906514 0.5753448629739237 -0.3970113427347143 1000
 -0.19400192148832265 -0.8844827661192679 0.42316721387277456 1000
 -0.9119909954066209 0.24663217811980442 0.3279008890093488 1000
 -0.19814675792848935 0.9283475691618133 0.3153896846026839 1000
 -0.909890595362505 0.0812431883665125 -0.40662962117252244 1000
 -0.024881770607272563 0.6697066075327432 -0.7424870081815781 1000
 -0.42950014131983366 0.6071292693684888 0.6686139984193625 1000
 0.0 0.0 0.0 0
 -0.45492923198904645 0.4825904947327388 -0.7485484675526803 1000
 -0.2504583701230878 -0.5223555875815629 -0.8147982848273589 1000
 0.547931317385798 -0.7812538289174424 0.2998795195235894 1000
 0.6704019064651591 0.031263944291383114 0.741467362461238 1000
 0.06964162552943529 0.09485502852962557 0.9931422695446315 1000
 -0.5934487063514248 -0.7703533074485168 -0.23152411242233648 1000
 0.7525890257699915 -0.12844786064106692 -0.6461044074971996 1000
 -0.374486548570135 0.9269129821643323 0.016767481482073382 1000
 0.0 0.0 0.0 0
 -0.14032009698641 -0.9896396035607695 0.02092188915482668 1000
 -0.2741137890928889 -0.5381802605772297 0.7968604882626341 1000
 0.7374143080514903 -0.3208016851261698 0.5935885924621118 1000
 0.4066650625832148 0.6867403571809562 0.6024186324252947 1000
 0.524305737749563 0.8089379188588343 -0.2642384090082741 1000
 0.8294361783296251 -0.554316131273159 -0.06622879047894005 1000
 0.23724753682330985 -0.85460754359792 -0.4625716730375964 1000
 -0.42086178121467077 0.6426059339269291 -0.6403381722142709 1000
 0.0 0.0 0.0 0
 0.932862298717675 0.08451295083285798 0.34961906809082577 1000
 -0.19757537699176853 0.5002708719408445 0.8427093360667764 1000
 -0.5732350208066396 0.8073966401728213 0.13781246808054254 1000
 -0.8258968121876762 -0.5630902216573342 -0.03892117536930062 1000
