  2.276026	  1.296092	  0.304796
  2.288622	  1.288799	  0.351284
  2.283994	  1.291325	  0.331993
  2.279341	  1.293927	  0.312716
  2.274937	  1.296308	  0.293354
  2.270759	  1.298504	  0.273927
  2.266796	  1.300700	  0.254448
  2.263126	  1.302806	  0.234913
  2.259698	  1.304924	  0.215320
  2.256377	  1.306919	  0.195701
  2.252993	  1.308855	  0.176096
  2.249712	  1.310697	  0.156453
  2.246389	  1.312415	  0.136826
  2.242981	  1.314152	  0.117209
  2.240195	  1.315495	  0.097449
  2.237618	  1.316819	  0.077655
  2.235245	  1.317914	  0.057827
  2.233142	  1.318791	  0.037957
  2.231068	  1.319643	  0.018083
  2.229352	  1.320141	 -0.001837
  2.227637	  1.320638	 -0.021757
  2.226100	  1.320902	 -0.041696
  2.224665	  1.321036	 -0.061644
  2.223247	  1.321129	 -0.081594
  2.221903	  1.321036	 -0.101548
  2.220564	  1.320944	 -0.121503
  2.218780	  1.320826	 -0.141424
  2.216536	  1.320681	 -0.161297
  2.214299	  1.320536	 -0.181170
  2.211256	  1.320492	 -0.200937
  2.207632	  1.320521	 -0.220607
  2.204009	  1.320550	 -0.240276
  2.199550	  1.320725	 -0.259771
  2.194673	  1.320974	 -0.279166
  2.189799	  1.321225	 -0.298563
  2.183705	  1.321829	 -0.317602
  2.177238	  1.322544	 -0.336515
  2.170754	  1.323263	 -0.355423
  2.162911	  1.324751	 -0.373764
  2.154861	  1.326324	 -0.392003
  2.146909	  1.327980	 -0.410276
  2.139133	  1.329890	 -0.428596
  2.131631	  1.331779	 -0.447028
  2.124599	  1.333459	 -0.465653
  2.117828	  1.335116	 -0.484387
  2.111348	  1.336927	 -0.503191
  2.105126	  1.338894	 -0.522039
  2.098882	  1.341127	 -0.540840
  2.092905	  1.343632	 -0.559693
  2.086791	  1.346238	 -0.578484
  2.081105	  1.349045	 -0.597353
  2.075549	  1.351840	 -0.616264
  2.070986	  1.354789	 -0.635405
  2.066990	  1.357747	 -0.654729
  2.064118	  1.360336	 -0.674235
  2.061367	  1.363009	 -0.693811
  2.059328	  1.365318	 -0.713535
  2.057350	  1.367418	 -0.733310
  2.055170	  1.369333	 -0.753068
  2.053405	  1.371050	 -0.772922
  2.051476	  1.372797	 -0.792754
  2.049335	  1.374133	 -0.812637
  2.046790	  1.375262	 -0.832478
  2.043772	  1.376342	 -0.852178
  2.040685	  1.376845	 -0.871970
  2.037868	  1.377341	 -0.891771
  2.034932	  1.377759	 -0.911553
  2.031185	  1.377774	 -0.931203
  2.027427	  1.377789	 -0.950847
  2.023359	  1.377821	 -0.970431
  2.018615	  1.377903	 -0.989862
  2.013862	  1.377966	 -1.009289
  2.008579	  1.378679	 -1.028566
  2.002997	  1.379749	 -1.047730
  1.997503	  1.380794	 -1.066586
  1.992051	  1.382478	 -1.083585
  1.985870	  1.384532	 -1.102495
