  0.826079	 -1.249897	  2.013511
  0.821117	 -1.246359	  2.005581
  0.816040	 -1.242740	  1.997469
  0.808665	 -1.234761	  1.980560
  0.802106	 -1.226605	  1.964043
  0.793300	 -1.218042	  1.947419
  0.787201	 -1.207726	  1.930816
  0.783889	 -1.196495	  1.913655
  0.782559	 -1.187835	  1.897099
  0.780408	 -1.172762	  1.878838
  0.774646	 -1.159562	  1.860695
  0.767193	 -1.153570	  1.844847
  0.758966	 -1.152715	  1.827971
  0.751890	 -1.150081	  1.809882
  0.743656	 -1.145447	  1.790062
  0.735937	 -1.142815	  1.771475
  0.728725	 -1.136518	  1.753562
  0.721609	 -1.130009	  1.736018
  0.714416	 -1.123413	  1.718560
  0.707100	 -1.116670	  1.701211
  0.699788	 -1.109928	  1.683860
  0.692634	 -1.102466	  1.666738
  0.685672	 -1.094182	  1.649917
  0.678704	 -1.085882	  1.633107
  0.671736	 -1.077419	  1.616380
  0.665124	 -1.067070	  1.600593
  0.658514	 -1.056713	  1.584812
  0.651904	 -1.046366	  1.569024
  0.645390	 -1.034976	  1.553930
  0.638909	 -1.023195	  1.539124
  0.632442	 -1.011421	  1.524312
  0.625559	 -0.999543	  1.509860
  0.618993	 -0.986238	  1.497303
  0.610976	 -0.969699	  1.488824
  0.601666	 -0.954959	  1.476617
  0.591890	 -0.946345	  1.450515
  0.585760	 -0.943530	  1.436350
  0.574948	 -0.941108	  1.422910
  0.558809	 -0.935107	  1.403320
  0.550785	 -0.926543	  1.384351
  0.548771	 -0.915919	  1.369498
  0.545261	 -0.903168	  1.352445
  0.540899	 -0.893669	  1.338057
  0.534925	 -0.885520	  1.324478
  0.524921	 -0.871929	  1.303600
  0.515360	 -0.860509	  1.285115
  0.511595	 -0.857085	  1.279459
  0.500120	 -0.846242	  1.262016
  0.488165	 -0.829611	  1.245879
  0.483146	 -0.817716	  1.234598
  0.479903	 -0.805186	  1.220292
  0.472051	 -0.789277	  1.204438
  0.465094	 -0.775858	  1.193740
  0.461168	 -0.768902	  1.183146
  0.451981	 -0.761198	  1.159584
  0.444248	 -0.757857	  1.129175
  0.443101	 -0.755403	  1.105165
  0.442310	 -0.751855	  1.092381
  0.439481	 -0.748315	  1.076775
  0.429533	 -0.739779	  1.060090
  0.422545	 -0.729601	  1.042745
  0.416611	 -0.718075	  1.019225
  0.413189	 -0.714521	  1.010298
  0.405905	 -0.706470	  0.987522
  0.401852	 -0.699954	  0.966417
  0.398071	 -0.695511	  0.951321
  0.390544	 -0.690800	  0.931019
  0.381961	 -0.686248	  0.914000
  0.373621	 -0.684340	  0.908456
  0.352737	 -0.683467	  0.889835
  0.337702	 -0.678857	  0.865297
  0.330194	 -0.675485	  0.851119
  0.323146	 -0.671051	  0.831401
  0.319852	 -0.666076	  0.815134
  0.314533	 -0.658509	  0.796902
  0.307053	 -0.648479	  0.776771
  0.302414	 -0.639846	  0.761947
  0.293098	 -0.634404	  0.745453
  0.279792	 -0.631680	  0.726347
  0.265577	 -0.628329	  0.705087
  0.257971	 -0.623875	  0.692067
  0.250341	 -0.619063	  0.673924
  0.245088	 -0.616596	  0.656570
  0.239641	 -0.614981	  0.638723
  0.232851	 -0.607920	  0.618498
  0.224477	 -0.596821	  0.601592
  0.208303	 -0.580951	  0.588060
  0.191025	 -0.567254	  0.577078
  0.178831	 -0.556931	  0.566263
  0.169838	 -0.552462	  0.560130
  0.157327	 -0.551946	  0.542790
  0.145541	 -0.544231	  0.516770
  0.143027	 -0.527717	  0.499925
  0.140645	 -0.513573	  0.483828
  0.136249	 -0.495502	  0.463327
  0.135526	 -0.481793	  0.452246
  0.134002	 -0.478915	  0.448004
  0.130527	 -0.466042	  0.431803
  0.118954	 -0.442192	  0.406970
  0.112886	 -0.432687	  0.397182
  0.101091	 -0.422776	  0.379905
  0.098244	 -0.419805	  0.372114
  0.087608	 -0.412546	  0.352261
  0.072571	 -0.400341	  0.329274
  0.064741	 -0.395154	  0.320625
  0.051230	 -0.386169	  0.308553
  0.037350	 -0.377228	  0.296385
  0.026358	 -0.371177	  0.283803
  0.012337	 -0.368682	  0.263594
 -0.007322	 -0.356995	  0.244079
 -0.011648	 -0.352908	  0.238842
 -0.018589	 -0.344827	  0.225177
 -0.024679	 -0.333492	  0.203889
 -0.043190	 -0.320783	  0.186591
 -0.055399	 -0.313449	  0.178186
 -0.064298	 -0.295981	  0.167331
 -0.066626	 -0.281484	  0.156249
 -0.079365	 -0.279344	  0.140135
 -0.088404	 -0.280497	  0.114821
 -0.089040	 -0.276950	  0.090314
 -0.088643	 -0.263304	  0.073510
 -0.090600	 -0.252927	  0.061684
 -0.091549	 -0.243075	  0.039313
 -0.092065	 -0.235592	  0.020763
 -0.096788	 -0.228785	  0.004929
 -0.110933	 -0.217901	 -0.012507
 -0.126796	 -0.209609	 -0.026407
 -0.138189	 -0.198914	 -0.041055
 -0.142186	 -0.182338	 -0.055139
 -0.145586	 -0.168622	 -0.066477
 -0.155539	 -0.157174	 -0.080960
 -0.170656	 -0.144824	 -0.100229
 -0.176017	 -0.137439	 -0.112266
 -0.180225	 -0.131952	 -0.124588
 -0.183302	 -0.118890	 -0.146871
 -0.190703	 -0.109782	 -0.169236
 -0.194433	 -0.106737	 -0.181148
 -0.198027	 -0.101244	 -0.196188
 -0.207733	 -0.080915	 -0.218740
 -0.212161	 -0.069623	 -0.229445
 -0.216652	 -0.054005	 -0.240774
 -0.226265	 -0.036850	 -0.249672
 -0.239462	 -0.023954	 -0.259229
 -0.246801	 -0.018786	 -0.267383
 -0.257931	 -0.004966	 -0.295720
 -0.268891	  0.001766	 -0.309224
 -0.273400	  0.007481	 -0.322454
 -0.281331	  0.016806	 -0.349472
 -0.289200	  0.025135	 -0.365697
 -0.293982	  0.027354	 -0.382255
 -0.295241	  0.033352	 -0.398152
 -0.310295	  0.037728	 -0.425677
 -0.316039	  0.044741	 -0.440125
 -0.322022	  0.047567	 -0.448585
 -0.327624	  0.054009	 -0.467604
 -0.345969	  0.066671	 -0.492316
 -0.354759	  0.070840	 -0.499611
 -0.365362	  0.081210	 -0.515314
 -0.380468	  0.083222	 -0.531680
 -0.395855	  0.086525	 -0.546845
 -0.403637	  0.092847	 -0.563436
 -0.416141	  0.095624	 -0.579741
 -0.423498	  0.098478	 -0.587616
 -0.434543	  0.099165	 -0.607996
 -0.444134	  0.099304	 -0.629166
 -0.459141	  0.097149	 -0.645692
 -0.481764	  0.098834	 -0.658745
 -0.499607	  0.106108	 -0.671577
 -0.510687	  0.114237	 -0.683207
 -0.520992	  0.126415	 -0.700610
 -0.526127	  0.132876	 -0.713494
 -0.533117	  0.141849	 -0.730839
 -0.547758	  0.156594	 -0.748692
 -0.557150	  0.164076	 -0.755372
 -0.575557	  0.174632	 -0.767050
 -0.589981	  0.184062	 -0.780756
 -0.599950	  0.193956	 -0.792375
 -0.608006	  0.204106	 -0.804028
 -0.618228	  0.217722	 -0.820337
 -0.630094	  0.227006	 -0.832043
 -0.643765	  0.237571	 -0.841142
 -0.657652	  0.248435	 -0.853014
 -0.668696	  0.255912	 -0.868494
 -0.676394	  0.262488	 -0.883303
 -0.682813	  0.271760	 -0.896788
 -0.695550	  0.284308	 -0.924818
 -0.701895	  0.289146	 -0.931839
 -0.715701	  0.299046	 -0.944698
 -0.738504	  0.312127	 -0.964139
 -0.752377	  0.320966	 -0.975308
 -0.756393	  0.323653	 -0.980867
 -0.768388	  0.329520	 -0.989247
 -0.788721	  0.340855	 -1.008153
 -0.801265	  0.347988	 -1.024172
 -0.811577	  0.354925	 -1.032820
 -0.827510	  0.361057	 -1.053681
 -0.827569	  0.371005	 -1.063615
 -0.837473	  0.374597	 -1.076950
 -0.846251	  0.382849	 -1.099468
 -0.856819	  0.394375	 -1.119820
 -0.861421	  0.402295	 -1.124765
 -0.868203	  0.409444	 -1.133905
 -0.878163	  0.424240	 -1.153555
 -0.886962	  0.433205	 -1.170547
 -0.893436	  0.440130	 -1.185161
 -0.900039	  0.446148	 -1.204320
 -0.911148	  0.449861	 -1.221838
 -0.918902	  0.455378	 -1.238680
 -0.922492	  0.458212	 -1.250837
 -0.924789	  0.458889	 -1.266075
 -0.927791	  0.457584	 -1.300531
 -0.927809	  0.458962	 -1.321384
 -0.929832	  0.459827	 -1.331579
 -0.933814	  0.461161	 -1.355228
 -0.943512	  0.463198	 -1.377206
 -0.954866	  0.469653	 -1.395911
 -0.964043	  0.482322	 -1.413081
 -0.967899	  0.498956	 -1.428578
 -0.968907	  0.514948	 -1.442937
 -0.970736	  0.529114	 -1.460167
 -0.973389	  0.536214	 -1.476409
 -0.975488	  0.542550	 -1.496392
 -0.977833	  0.551061	 -1.510969
 -0.977864	  0.562576	 -1.527412
 -0.975515	  0.571090	 -1.546978
 -0.972347	  0.572834	 -1.569018
 -0.971822	  0.572724	 -1.587539
 -0.973219	  0.576143	 -1.608862
 -0.976702	  0.583648	 -1.632563
 -0.983087	  0.592991	 -1.651924
 -0.986179	  0.597400	 -1.664511
 -0.990346	  0.608191	 -1.682053
 -0.992610	  0.620326	 -1.697632
 -0.992983	  0.631554	 -1.716294
 -0.992807	  0.638359	 -1.735390
 -0.991709	  0.642146	 -1.758814
 -0.990161	  0.645103	 -1.779848
 -0.991528	  0.647936	 -1.796197
 -0.997870	  0.653675	 -1.814192
 -1.012846	  0.674575	 -1.837373
 -1.017148	  0.683755	 -1.844551
 -1.020956	  0.695598	 -1.857079
 -1.021815	  0.711931	 -1.878224
 -1.021472	  0.718090	 -1.892130
 -1.023014	  0.724337	 -1.910145
 -1.028615	  0.730178	 -1.932507
 -1.034408	  0.737562	 -1.955106
 -1.034682	  0.745864	 -1.971986
 -1.032434	  0.754817	 -1.986710
 -1.028814	  0.763643	 -2.001650
 -1.030617	  0.780604	 -2.023793
 -1.032514	  0.793420	 -2.032506
 -1.036454	  0.812542	 -2.047516
 -1.045553	  0.826961	 -2.069806
 -1.046810	  0.830762	 -2.083820
 -1.048976	  0.836957	 -2.109301
 -1.048563	  0.839459	 -2.120448
