  1.884766	  1.245996	 -0.832154
  1.899022	  1.276289	 -0.829382
  1.891408	  1.260111	 -0.830863
  1.869957	  1.214716	 -0.833470
  1.849623	  1.169838	 -0.834932
  1.830612	  1.128368	 -0.834659
  1.811751	  1.089472	 -0.832105
  1.790550	  1.049135	 -0.826962
  1.767958	  1.007302	 -0.819779
  1.742585	  0.960556	 -0.812868
  1.713964	  0.907922	 -0.812254
  1.690016	  0.858575	 -0.819634
  1.670387	  0.819075	 -0.826239
  1.642952	  0.775339	 -0.831300
  1.621690	  0.712521	 -0.831382
  1.617619	  0.655556	 -0.826894
  1.614620	  0.613182	 -0.819238
  1.606986	  0.574819	 -0.811290
  1.594576	  0.534588	 -0.801282
  1.578434	  0.489673	 -0.791290
  1.560458	  0.442143	 -0.784024
  1.541192	  0.394955	 -0.779149
  1.521310	  0.349176	 -0.775905
  1.500038	  0.308504	 -0.774474
  1.475258	  0.271350	 -0.774179
  1.446985	  0.229861	 -0.773829
  1.419664	  0.184431	 -0.773689
  1.392429	  0.139603	 -0.774185
  1.362491	  0.092664	 -0.779010
  1.333078	  0.043602	 -0.787389
  1.306190	 -0.007390	 -0.798078
  1.282663	 -0.059083	 -0.810130
  1.262149	 -0.112549	 -0.823549
  1.245639	 -0.166287	 -0.838043
  1.235785	 -0.217038	 -0.848753
  1.229555	 -0.263038	 -0.849926
  1.224165	 -0.303862	 -0.845227
  1.212194	 -0.346032	 -0.842432
  1.197566	 -0.393805	 -0.842346
  1.183109	 -0.435630	 -0.844272
  1.162140	 -0.476205	 -0.850648
  1.142914	 -0.524130	 -0.852135
  1.126225	 -0.569890	 -0.851296
  1.111119	 -0.611660	 -0.850502
  1.093348	 -0.652284	 -0.845476
  1.070854	 -0.697090	 -0.840502
  1.046435	 -0.744600	 -0.841194
  1.022266	 -0.791636	 -0.845417
  0.998515	 -0.839391	 -0.851825
  0.975939	 -0.889344	 -0.858362
  0.956227	 -0.939306	 -0.863366
  0.940128	 -0.988179	 -0.865864
  0.926534	 -1.037927	 -0.866091
  0.914342	 -1.088837	 -0.865187
  0.904122	 -1.135749	 -0.863609
  0.892276	 -1.180817	 -0.861529
  0.878007	 -1.225368	 -0.859677
  0.861989	 -1.268573	 -0.859773
  0.844149	 -1.310712	 -0.863263
  0.827087	 -1.349368	 -0.862164
  0.800555	 -1.395571	 -0.861476
  0.778267	 -1.447671	 -0.865926
  0.758220	 -1.494091	 -0.872921
  0.741291	 -1.541904	 -0.876530
  0.724197	 -1.587663	 -0.878894
  0.706387	 -1.635091	 -0.879744
  0.689081	 -1.683263	 -0.879837
  0.672387	 -1.730784	 -0.879391
  0.655743	 -1.777345	 -0.878556
  0.638840	 -1.823360	 -0.877367
  0.621746	 -1.868962	 -0.876347
  0.604099	 -1.917231	 -0.875419
  0.587685	 -1.968615	 -0.873885
  0.574147	 -2.019020	 -0.870744
  0.561333	 -2.066194	 -0.867431
  0.547883	 -2.111901	 -0.864051
  0.534176	 -2.154215	 -0.860598
  0.509756	 -2.219139	 -0.854168
  0.501796	 -2.238755	 -0.852013
