 -1.414740	 -2.618689	 -0.567347
 -1.400732	 -2.592761	 -0.561730
 -1.417635	 -2.544106	 -0.547428
 -1.430548	 -2.495606	 -0.534541
 -1.455654	 -2.452160	 -0.527787
 -1.472820	 -2.406025	 -0.515456
 -1.491936	 -2.361071	 -0.503749
 -1.511595	 -2.316516	 -0.492425
 -1.531173	 -2.272596	 -0.481232
 -1.551251	 -2.229048	 -0.469619
 -1.572203	 -2.185862	 -0.457144
 -1.593988	 -2.142745	 -0.443832
 -1.615482	 -2.098476	 -0.430984
 -1.636213	 -2.053551	 -0.419201
 -1.656119	 -2.008406	 -0.408453
 -1.675064	 -1.963383	 -0.398917
 -1.693380	 -1.918231	 -0.390843
 -1.711684	 -1.871191	 -0.384279
 -1.728963	 -1.823145	 -0.378669
 -1.744567	 -1.776044	 -0.373985
 -1.759050	 -1.730079	 -0.369981
 -1.773303	 -1.683918	 -0.366391
 -1.788149	 -1.636513	 -0.362638
 -1.804584	 -1.588172	 -0.357399
 -1.823742	 -1.541553	 -0.348126
 -1.845711	 -1.498247	 -0.336161
 -1.869563	 -1.456452	 -0.323504
 -1.892656	 -1.413819	 -0.310509
 -1.914113	 -1.370398	 -0.296783
 -1.933844	 -1.326698	 -0.282613
 -1.952628	 -1.282332	 -0.269694
 -1.970322	 -1.237487	 -0.257854
 -1.987649	 -1.192086	 -0.246972
 -2.004596	 -1.146240	 -0.236406
 -2.021413	 -1.099799	 -0.225537
 -2.038994	 -1.053483	 -0.214495
 -2.056465	 -1.007576	 -0.202439
 -2.073306	 -0.961757	 -0.190068
 -2.089426	 -0.915631	 -0.177750
 -2.104509	 -0.869334	 -0.165696
 -2.118128	 -0.823285	 -0.154181
 -2.132046	 -0.776315	 -0.143421
 -2.148029	 -0.729341	 -0.134590
 -2.166978	 -0.682605	 -0.126999
 -2.188844	 -0.636966	 -0.120406
 -2.213186	 -0.592743	 -0.114707
 -2.238842	 -0.550486	 -0.109682
 -2.265867	 -0.509563	 -0.104287
 -2.294646	 -0.468415	 -0.097503
 -2.322675	 -0.426553	 -0.090188
 -2.348964	 -0.383899	 -0.082256
 -2.372350	 -0.340031	 -0.072795
 -2.390340	 -0.294562	 -0.059902
 -2.405779	 -0.247871	 -0.045190
 -2.419776	 -0.200518	 -0.031794
 -2.432516	 -0.153265	 -0.020440
 -2.444621	 -0.106725	 -0.010780
 -2.457091	 -0.060136	 -0.001962
 -2.471224	 -0.012206	  0.005807
 -2.487953	  0.035508	  0.011315
 -2.506552	  0.081458	  0.016044
 -2.525342	  0.126455	  0.020316
 -2.544281	  0.171396	  0.023934
 -2.564278	  0.217308	  0.026983
 -2.585965	  0.263844	  0.030012
 -2.606470	  0.310671	  0.034725
 -2.623438	  0.358066	  0.043884
 -2.638484	  0.405205	  0.056979
 -2.653546	  0.450996	  0.072778
 -2.669747	  0.494840	  0.090365
 -2.687761	  0.537956	  0.109262
 -2.708394	  0.581415	  0.127562
 -2.731346	  0.624768	  0.143086
 -2.754282	  0.667393	  0.155639
 -2.775663	  0.710733	  0.166600
 -2.799020	  0.754300	  0.176477
 -2.817862	  0.800648	  0.174808
 -2.836702	  0.843987	  0.185598
 -2.859813	  0.887054	  0.186027
 -2.888411	  0.895924	  0.187887
