 -0.877485	 -2.900001	  0.030211
 -0.868797	 -2.871288	  0.029912
 -0.843751	 -2.839038	  0.063493
 -0.817972	 -2.808657	  0.097632
 -0.786589	 -2.776525	  0.123536
 -0.753693	 -2.749323	  0.153173
 -0.729732	 -2.723717	  0.189775
 -0.707002	 -2.699476	  0.227336
 -0.683219	 -2.675465	  0.263378
 -0.659119	 -2.651269	  0.298884
 -0.635031	 -2.626528	  0.334230
 -0.610881	 -2.600583	  0.369637
 -0.586726	 -2.572691	  0.404877
 -0.563596	 -2.542358	  0.439069
 -0.542809	 -2.509873	  0.471207
 -0.521486	 -2.476630	  0.501950
 -0.499751	 -2.445439	  0.531450
 -0.475525	 -2.417457	  0.560972
 -0.448911	 -2.390887	  0.591060
 -0.424112	 -2.364955	  0.623308
 -0.398723	 -2.339665	  0.657952
 -0.372696	 -2.315634	  0.693256
 -0.346193	 -2.291256	  0.729336
 -0.320005	 -2.264501	  0.766160
 -0.295955	 -2.235270	  0.802087
 -0.274127	 -2.204188	  0.836856
 -0.254390	 -2.171898	  0.870409
 -0.236133	 -2.138046	  0.903373
 -0.219309	 -2.103104	  0.934449
 -0.203197	 -2.066659	  0.964351
 -0.187475	 -2.029335	  0.992703
 -0.170565	 -1.990087	  1.020173
 -0.152082	 -1.949977	  1.045592
 -0.131741	 -1.910147	  1.069606
 -0.109252	 -1.872063	  1.093706
 -0.086045	 -1.836573	  1.118495
 -0.061997	 -1.801516	  1.146848
 -0.038724	 -1.769563	  1.177767
 -0.016290	 -1.739959	  1.211885
  0.005316	 -1.712458	  1.248747
  0.027095	 -1.685994	  1.286402
  0.050038	 -1.659509	  1.323224
  0.073822	 -1.633678	  1.358252
  0.098317	 -1.608098	  1.391816
  0.123745	 -1.582189	  1.424524
  0.149979	 -1.555779	  1.456369
  0.176897	 -1.528649	  1.487278
  0.204841	 -1.499920	  1.518038
  0.232631	 -1.469837	  1.547774
  0.259709	 -1.440095	  1.576072
  0.287245	 -1.410458	  1.603836
  0.316587	 -1.380724	  1.631094
  0.347533	 -1.351661	  1.656163
  0.375740	 -1.320673	  1.682430
  0.398160	 -1.285724	  1.710354
  0.417918	 -1.248547	  1.741555
  0.437789	 -1.214024	  1.774511
  0.456581	 -1.181871	  1.808583
  0.475605	 -1.152843	  1.844695
  0.496313	 -1.126731	  1.882984
  0.515429	 -1.099746	  1.922269
  0.533184	 -1.071585	  1.960142
  0.551227	 -1.045319	  1.998008
  0.570028	 -1.020918	  2.036863
  0.589834	 -0.998092	  2.076799
  0.613133	 -0.974249	  2.113859
  0.639257	 -0.949918	  2.148480
  0.665905	 -0.923094	  2.180564
  0.690355	 -0.892276	  2.210016
  0.714298	 -0.861197	  2.239805
  0.744974	 -0.834448	  2.270054
  0.774169	 -0.804815	  2.298237
  0.801778	 -0.776230	  2.328591
  0.827643	 -0.746381	  2.360224
  0.852397	 -0.714455	  2.392477
  0.876182	 -0.681952	  2.424269
  0.899183	 -0.649858	  2.454879
  0.921746	 -0.618667	  2.484159
  0.944440	 -0.587821	  2.512792
  0.967696	 -0.556762	  2.541408
  0.991560	 -0.525359	  2.570385
  1.015674	 -0.494089	  2.599891
  1.040633	 -0.463775	  2.629539
  1.059723	 -0.430826	  2.662974
  1.083198	 -0.409919	  2.701425
  1.105903	 -0.375945	  2.726321
  1.127324	 -0.349392	  2.758091
  1.138598	 -0.352886	  2.785672
