  0.763381	 -1.854085	 -2.271677
  0.755823	 -1.835728	 -2.249186
  0.773711	 -1.784352	 -2.254899
  0.797261	 -1.737636	 -2.253661
  0.821842	 -1.692053	 -2.251580
  0.845589	 -1.647840	 -2.248893
  0.868455	 -1.604503	 -2.245689
  0.891717	 -1.559522	 -2.240822
  0.913952	 -1.514877	 -2.233475
  0.934060	 -1.470484	 -2.225671
  0.953104	 -1.425907	 -2.218014
  0.972276	 -1.382343	 -2.209377
  0.992963	 -1.337676	 -2.199477
  1.014530	 -1.293236	 -2.188787
  1.033594	 -1.248088	 -2.179465
  1.051181	 -1.200171	 -2.171677
  1.071695	 -1.153390	 -2.169674
  1.093506	 -1.109787	 -2.169171
  1.113322	 -1.064363	 -2.163851
  1.130253	 -1.016755	 -2.160740
  1.146960	 -0.969617	 -2.159841
  1.162815	 -0.922744	 -2.161167
  1.178025	 -0.874961	 -2.165187
  1.193807	 -0.826321	 -2.169797
  1.210142	 -0.779388	 -2.173929
  1.226645	 -0.733948	 -2.177753
  1.243770	 -0.688099	 -2.181023
  1.262507	 -0.640983	 -2.182176
  1.282605	 -0.594405	 -2.180260
  1.303590	 -0.548648	 -2.174873
  1.324961	 -0.502885	 -2.166177
  1.346768	 -0.458050	 -2.155810
  1.369884	 -0.414237	 -2.148396
  1.394848	 -0.371816	 -2.142769
  1.420454	 -0.330889	 -2.136019
  1.446874	 -0.290871	 -2.128661
  1.473459	 -0.247659	 -2.122674
  1.497808	 -0.203257	 -2.116228
  1.520813	 -0.158703	 -2.109139
  1.542313	 -0.113912	 -2.101710
  1.562031	 -0.068892	 -2.094322
  1.581034	 -0.021563	 -2.087537
  1.598416	  0.025263	 -2.082439
  1.616092	  0.070232	 -2.077684
  1.634090	  0.114375	 -2.069392
  1.653112	  0.158764	 -2.061059
  1.679924	  0.200916	 -2.050307
  1.703551	  0.245155	 -2.041968
  1.724507	  0.290294	 -2.034003
  1.743166	  0.337229	 -2.029381
  1.758624	  0.384575	 -2.027477
  1.774150	  0.432962	 -2.026274
  1.791230	  0.479866	 -2.027143
  1.809059	  0.525222	 -2.028523
  1.829667	  0.570870	 -2.028314
  1.848203	  0.618535	 -2.027806
  1.870145	  0.663433	 -2.027339
  1.883627	  0.710772	 -2.020495
  1.906053	  0.754382	 -2.019691
  1.928229	  0.798686	 -2.022374
  1.945911	  0.845879	 -2.014048
  1.963876	  0.893009	 -2.011514
  1.983857	  0.936617	 -2.008715
  2.004141	  0.975954	 -2.007719
  2.024182	  0.985713	 -2.027796
