  2.853854	 -0.143259	 -1.007914
  2.825598	 -0.141841	 -0.997935
  2.787391	 -0.123953	 -0.970183
  2.746025	 -0.111195	 -0.946558
  2.704582	 -0.098005	 -0.922231
  2.661467	 -0.084510	 -0.899134
  2.618923	 -0.070594	 -0.875581
  2.579553	 -0.058330	 -0.853017
  2.536063	 -0.047101	 -0.829599
  2.494486	 -0.037078	 -0.807032
  2.451769	 -0.027280	 -0.783179
  2.410624	 -0.018316	 -0.759148
  2.369145	 -0.009932	 -0.733198
  2.325187	 -0.000512	 -0.704691
  2.282862	  0.011186	 -0.680076
  2.239511	  0.024677	 -0.656827
  2.196892	  0.039937	 -0.635302
  2.155530	  0.056112	 -0.614973
  2.115227	  0.073307	 -0.595843
  2.072443	  0.093565	 -0.576722
  2.027777	  0.115018	 -0.558777
  1.986357	  0.134491	 -0.539969
  1.948275	  0.159852	 -0.518305
  1.938789	  0.217968	 -0.500581
  2.029652	  0.345668	 -0.497474
  2.074502	  0.411970	 -0.532282
  2.051899	  0.416445	 -0.576969
  2.014476	  0.420462	 -0.610993
  1.964737	  0.379857	 -0.645564
  1.851242	  0.375073	 -0.687090
  1.724166	  0.346826	 -0.578177
  1.626006	  0.367358	 -0.425709
  1.532806	  0.366820	 -0.356465
  1.490134	  0.355326	 -0.304779
  1.449469	  0.348089	 -0.249564
  1.409712	  0.350269	 -0.221107
  1.367919	  0.359635	 -0.196530
  1.324719	  0.371861	 -0.173613
  1.279269	  0.383514	 -0.152071
  1.235599	  0.390922	 -0.137335
  1.192882	  0.392742	 -0.133199
  1.134668	  0.383455	 -0.145402
  0.996751	  0.312995	 -0.212274
  0.877435	  0.261291	 -0.264212
  0.832234	  0.251086	 -0.270866
  0.768095	  0.257836	 -0.263629
  0.714279	  0.287225	 -0.235539
  0.689720	  0.308335	 -0.216700
  0.672722	  0.339539	 -0.183185
  0.674035	  0.365627	 -0.137102
  0.691188	  0.400777	 -0.071566
  0.709189	  0.483116	  0.079558
  0.679759	  0.531926	  0.163338
  0.647831	  0.553771	  0.200551
  0.610940	  0.568859	  0.229947
  0.567816	  0.581746	  0.258504
  0.524971	  0.593266	  0.282931
  0.480969	  0.605917	  0.305529
  0.438985	  0.619357	  0.326018
  0.398508	  0.633366	  0.346333
  0.359992	  0.646813	  0.367667
  0.318116	  0.661521	  0.390959
  0.275307	  0.676959	  0.413466
  0.234597	  0.691957	  0.434355
  0.191594	  0.707693	  0.455659
  0.148061	  0.725770	  0.477321
  0.105428	  0.743908	  0.499233
  0.061297	  0.761311	  0.521419
  0.018267	  0.777595	  0.544273
 -0.022092	  0.792085	  0.566429
 -0.061332	  0.805878	  0.588482
 -0.100667	  0.818860	  0.611984
 -0.141940	  0.832005	  0.638167
 -0.180620	  0.844433	  0.663586
 -0.219852	  0.856829	  0.689637
 -0.262370	  0.870607	  0.716624
 -0.304664	  0.884180	  0.740023
 -0.361400	  0.897831	  0.761510
 -0.451376	  0.893506	  0.741499
 -0.596404	  0.873506	  0.646348
 -0.682021	  0.870821	  0.596225
 -0.731937	  0.863595	  0.550311
 -0.773170	  0.866866	  0.519753
 -0.808663	  0.870870	  0.500434
 -0.862301	  0.889367	  0.482417
 -0.924548	  0.917577	  0.468209
 -0.995711	  0.956459	  0.474244
 -1.052590	  0.990802	  0.481297
 -1.125890	  1.032631	  0.513024
 -1.231826	  1.079662	  0.573682
 -1.327448	  1.121521	  0.708018
 -1.345964	  1.155823	  0.856230
 -1.333814	  1.182142	  0.954751
 -1.316579	  1.195852	  1.014121
 -1.299937	  1.204918	  1.045862
 -1.277095	  1.208227	  1.083884
 -1.248334	  1.212222	  1.129227
 -1.230466	  1.215407	  1.177530
 -1.232701	  1.220973	  1.220835
 -1.262223	  1.229466	  1.260105
 -1.304088	  1.239984	  1.284582
 -1.347606	  1.251602	  1.301534
 -1.396064	  1.264184	  1.317483
 -1.444097	  1.276196	  1.332252
 -1.487657	  1.289643	  1.348139
 -1.530684	  1.306328	  1.367317
 -1.571022	  1.324171	  1.388008
 -1.613484	  1.343587	  1.413011
 -1.651878	  1.359985	  1.438925
 -1.692159	  1.374957	  1.467110
 -1.731242	  1.385341	  1.495681
 -1.771316	  1.394539	  1.519796
 -1.812558	  1.401991	  1.543359
 -1.854086	  1.410314	  1.570962
 -1.901350	  1.419437	  1.594646
 -1.943564	  1.432300	  1.621431
 -1.979977	  1.455088	  1.646233
 -2.028672	  1.459494	  1.659629
 -2.048959	  1.474089	  1.676225
