 -2.060235	 -0.292867	 -1.415487
 -2.098217	 -0.319822	 -1.426928
 -2.082313	 -0.308563	 -1.422421
 -2.066415	 -0.297308	 -1.417888
 -2.050454	 -0.286139	 -1.413358
 -2.034448	 -0.275038	 -1.408820
 -2.018437	 -0.263949	 -1.404275
 -2.002214	 -0.253308	 -1.399422
 -1.985977	 -0.242693	 -1.394553
 -1.969630	 -0.232251	 -1.389681
 -1.953110	 -0.222087	 -1.384803
 -1.936580	 -0.211941	 -1.379927
 -1.919769	 -0.202256	 -1.375069
 -1.902918	 -0.192641	 -1.370215
 -1.886006	 -0.183159	 -1.365352
 -1.868864	 -0.174793	 -1.359728
 -1.851749	 -0.167834	 -1.352230
 -1.834951	 -0.159301	 -1.343895
 -1.818905	 -0.148501	 -1.336321
 -1.804008	 -0.137036	 -1.328881
 -1.787558	 -0.126547	 -1.326512
 -1.769754	 -0.119930	 -1.321646
 -1.751861	 -0.115174	 -1.314578
 -1.734358	 -0.104133	 -1.305453
 -1.721200	 -0.091144	 -1.296658
 -1.705006	 -0.081156	 -1.294821
 -1.685913	 -0.075523	 -1.292159
 -1.668002	 -0.069013	 -1.285991
 -1.652911	 -0.051132	 -1.276515
 -1.641078	 -0.035121	 -1.270471
 -1.627292	 -0.026806	 -1.265002
 -1.609818	 -0.020093	 -1.258895
 -1.591143	 -0.012984	 -1.253111
 -1.574076	 -0.003440	 -1.245906
 -1.558508	  0.006441	 -1.238005
 -1.543027	  0.016318	 -1.230065
 -1.527619	  0.026378	 -1.222255
 -1.512189	  0.036544	 -1.214611
 -1.497957	  0.046613	 -1.206603
 -1.485528	  0.057302	 -1.196382
 -1.467340	  0.064933	 -1.182894
 -1.448146	  0.068267	 -1.173036
 -1.431985	  0.078486	 -1.169374
 -1.419755	  0.088366	 -1.163677
 -1.400979	  0.098242	 -1.152724
 -1.384611	  0.111234	 -1.143722
 -1.375267	  0.125093	 -1.140251
 -1.363612	  0.140411	 -1.136941
 -1.346622	  0.155512	 -1.129520
 -1.329438	  0.169203	 -1.121218
 -1.317791	  0.176122	 -1.114230
 -1.301892	  0.183251	 -1.102099
 -1.289258	  0.191804	 -1.090133
 -1.275110	  0.203418	 -1.080228
 -1.258805	  0.212758	 -1.070984
 -1.242264	  0.219954	 -1.061422
 -1.229440	  0.225355	 -1.047932
 -1.217260	  0.232754	 -1.031217
 -1.200843	  0.242425	 -1.017120
 -1.189875	  0.249036	 -1.012381
 -1.173632	  0.258062	 -1.001779
 -1.162305	  0.266365	 -0.986702
 -1.154617	  0.277387	 -0.968439
 -1.139677	  0.292788	 -0.956235
 -1.125773	  0.301454	 -0.951493
 -1.106999	  0.308939	 -0.947936
 -1.086518	  0.323175	 -0.936789
 -1.075624	  0.329159	 -0.929710
 -1.063590	  0.338764	 -0.921258
 -1.046935	  0.345669	 -0.906730
 -1.033887	  0.355159	 -0.893174
 -1.020565	  0.364416	 -0.882323
 -1.002525	  0.376409	 -0.872126
 -0.988239	  0.380796	 -0.867762
 -0.969553	  0.387087	 -0.859443
 -0.951920	  0.395355	 -0.850588
 -0.938205	  0.404479	 -0.841700
 -0.924673	  0.414044	 -0.827867
 -0.914257	  0.421367	 -0.814108
 -0.904222	  0.428970	 -0.795772
 -0.888453	  0.440549	 -0.777937
 -0.875442	  0.448421	 -0.770839
 -0.857953	  0.458017	 -0.765848
 -0.838214	  0.465520	 -0.761985
 -0.820957	  0.470456	 -0.759122
 -0.799232	  0.480265	 -0.752491
 -0.788443	  0.491757	 -0.744732
 -0.776914	  0.506788	 -0.738079
 -0.756900	  0.524438	 -0.732497
 -0.743522	  0.531518	 -0.727188
 -0.727634	  0.534913	 -0.716912
 -0.708733	  0.539661	 -0.708372
 -0.688305	  0.548902	 -0.700223
 -0.675291	  0.558345	 -0.693511
 -0.661048	  0.570773	 -0.688168
 -0.642453	  0.585762	 -0.683409
 -0.627859	  0.593038	 -0.677537
 -0.611333	  0.595313	 -0.669148
 -0.591700	  0.600686	 -0.658250
 -0.576774	  0.608814	 -0.650972
 -0.559634	  0.614037	 -0.644468
 -0.537730	  0.619491	 -0.633448
 -0.525441	  0.623345	 -0.622894
 -0.513203	  0.634379	 -0.606573
 -0.498457	  0.651443	 -0.595235
 -0.485996	  0.659255	 -0.592861
 -0.468380	  0.662286	 -0.588071
 -0.441007	  0.669588	 -0.575813
 -0.421136	  0.673071	 -0.569943
 -0.410865	  0.674000	 -0.567113
 -0.390469	  0.667962	 -0.562241
 -0.366648	  0.667421	 -0.554691
 -0.351410	  0.666800	 -0.543656
 -0.338738	  0.667726	 -0.528798
 -0.317931	  0.672960	 -0.513933
 -0.300771	  0.678328	 -0.506261
 -0.287557	  0.682417	 -0.499097
 -0.264666	  0.681257	 -0.489579
 -0.244187	  0.678575	 -0.484901
 -0.229533	  0.674793	 -0.483174
 -0.205107	  0.672624	 -0.475921
 -0.188533	  0.675805	 -0.469614
 -0.173879	  0.679893	 -0.464156
 -0.148701	  0.679886	 -0.453165
 -0.131778	  0.680442	 -0.444969
 -0.117932	  0.683967	 -0.438605
 -0.094960	  0.690677	 -0.431464
 -0.075910	  0.690614	 -0.425156
 -0.060141	  0.690134	 -0.416141
 -0.051511	  0.696232	 -0.400098
 -0.032187	  0.704791	 -0.389779
 -0.014644	  0.725017	 -0.388278
  0.008387	  0.739301	 -0.384450
  0.030592	  0.743087	 -0.386056
  0.044143	  0.752850	 -0.388066
  0.066449	  0.746530	 -0.376011
  0.081303	  0.745201	 -0.369793
  0.100938	  0.745870	 -0.353815
  0.121317	  0.750367	 -0.345152
  0.135958	  0.752449	 -0.339672
  0.154579	  0.760383	 -0.331464
  0.174824	  0.767230	 -0.324343
  0.188532	  0.777119	 -0.322630
  0.202800	  0.795379	 -0.320526
  0.221498	  0.811438	 -0.314255
  0.236209	  0.817889	 -0.310956
  0.251891	  0.827419	 -0.309536
  0.271983	  0.836835	 -0.308617
  0.291919	  0.835445	 -0.310525
  0.314296	  0.830331	 -0.316604
  0.339978	  0.835350	 -0.315509
  0.354436	  0.844242	 -0.315139
  0.370079	  0.849410	 -0.321637
  0.392276	  0.853245	 -0.328204
  0.407134	  0.858950	 -0.331401
  0.427315	  0.860516	 -0.340315
  0.450758	  0.860362	 -0.346258
  0.465048	  0.864123	 -0.347061
  0.484310	  0.864796	 -0.353033
  0.503605	  0.862518	 -0.359931
  0.525823	  0.865757	 -0.364065
  0.543966	  0.870402	 -0.370104
  0.563080	  0.876070	 -0.378892
  0.581855	  0.878432	 -0.384230
  0.601219	  0.874259	 -0.386725
  0.621377	  0.868026	 -0.385886
  0.646709	  0.861398	 -0.375875
  0.672931	  0.863998	 -0.364671
  0.682969	  0.866963	 -0.362346
  0.703723	  0.877012	 -0.364562
  0.724622	  0.880126	 -0.368809
  0.744592	  0.878063	 -0.373244
  0.764351	  0.876639	 -0.378969
  0.784795	  0.877304	 -0.381013
  0.804809	  0.876208	 -0.379464
  0.824383	  0.872290	 -0.379526
  0.844316	  0.869507	 -0.383277
  0.865965	  0.871440	 -0.387084
  0.885197	  0.875323	 -0.384648
  0.904050	  0.876622	 -0.379647
  0.922916	  0.877279	 -0.375551
  0.944590	  0.887638	 -0.372815
  0.960695	  0.900025	 -0.374246
  0.977020	  0.907707	 -0.376720
  0.997843	  0.910335	 -0.380300
  1.024378	  0.905481	 -0.378155
  1.042564	  0.902082	 -0.371950
  1.061575	  0.904459	 -0.364419
  1.080120	  0.910397	 -0.358800
  1.099630	  0.916665	 -0.355499
  1.118111	  0.921673	 -0.354998
  1.137963	  0.925918	 -0.354943
  1.156109	  0.932872	 -0.352999
  1.175422	  0.943637	 -0.348248
  1.192695	  0.954447	 -0.343725
  1.206751	  0.972122	 -0.334791
  1.220038	  0.983990	 -0.326963
  1.232651	  0.991493	 -0.323125
  1.251858	  1.002302	 -0.322489
  1.268118	  1.016866	 -0.322819
  1.280339	  1.034593	 -0.322403
  1.291385	  1.050889	 -0.315961
  1.303227	  1.069154	 -0.308293
  1.309409	  1.083176	 -0.309704
  1.316355	  1.098166	 -0.314019
  1.322152	  1.116086	 -0.319750
  1.329161	  1.134068	 -0.317474
  1.333906	  1.152059	 -0.313488
  1.342926	  1.171446	 -0.308699
  1.349339	  1.189028	 -0.303615
  1.355120	  1.206473	 -0.300387
  1.359207	  1.227177	 -0.303908
  1.365934	  1.248336	 -0.308085
  1.373377	  1.266829	 -0.310239
  1.381406	  1.283057	 -0.310792
  1.390842	  1.302375	 -0.311679
  1.399820	  1.321405	 -0.311550
  1.405216	  1.340949	 -0.312896
  1.409039	  1.361385	 -0.313555
  1.413444	  1.381474	 -0.313714
  1.416590	  1.402203	 -0.310225
  1.415442	  1.420940	 -0.300693
  1.409934	  1.441832	 -0.289142
  1.406414	  1.459283	 -0.283696
  1.403251	  1.478876	 -0.280563
  1.397602	  1.499229	 -0.279040
  1.391869	  1.519734	 -0.278621
  1.388553	  1.538171	 -0.277659
  1.390862	  1.558651	 -0.271787
  1.396240	  1.580441	 -0.260606
  1.401303	  1.596997	 -0.254110
  1.406477	  1.613732	 -0.251083
  1.408947	  1.636093	 -0.248735
  1.410192	  1.655394	 -0.247586
  1.410996	  1.677490	 -0.247531
  1.406934	  1.697298	 -0.245494
  1.399598	  1.715632	 -0.242598
  1.392844	  1.734783	 -0.239651
  1.386757	  1.753785	 -0.236579
  1.380947	  1.772676	 -0.232404
  1.376263	  1.791762	 -0.227652
  1.371196	  1.809650	 -0.220554
  1.366048	  1.827261	 -0.211985
  1.360018	  1.844491	 -0.202741
  1.351725	  1.860976	 -0.194222
  1.345172	  1.878581	 -0.187482
  1.337280	  1.896565	 -0.181994
  1.330359	  1.914379	 -0.177342
  1.324145	  1.932928	 -0.171324
  1.317628	  1.952002	 -0.165099
  1.310610	  1.971253	 -0.160369
  1.302669	  1.986059	 -0.156272
  1.293247	  2.004649	 -0.149870
  1.282467	  2.022016	 -0.140909
  1.270066	  2.033352	 -0.129820
  1.258292	  2.046404	 -0.119754
  1.246279	  2.058815	 -0.109447
  1.234181	  2.071657	 -0.099707
  1.221771	  2.083976	 -0.090000
  1.208531	  2.095474	 -0.079799
  1.195205	  2.106402	 -0.069553
  1.182282	  2.117025	 -0.058822
  1.171254	  2.127930	 -0.047069
  1.161009	  2.139039	 -0.032731
  1.151663	  2.146198	 -0.016255
  1.137741	  2.152974	 -0.001978
  1.126681	  2.162508	  0.007941
  1.115954	  2.175630	  0.018738
  1.107862	  2.181108	  0.038303
  1.096405	  2.180986	  0.054218
  1.090302	  2.181317	  0.070813
  1.088075	  2.185215	  0.091780
  1.084530	  2.192836	  0.110592
  1.082001	  2.198011	  0.125399
  1.081554	  2.203704	  0.148090
  1.086849	  2.206626	  0.167528
  1.093217	  2.206488	  0.181755
  1.100737	  2.202380	  0.207900
  1.104390	  2.197545	  0.229347
  1.104721	  2.196736	  0.239869
  1.107895	  2.196909	  0.258380
  1.120536	  2.188473	  0.288512
  1.126158	  2.188148	  0.302165
  1.130745	  2.189621	  0.315278
  1.141827	  2.184952	  0.334568
  1.156412	  2.173167	  0.348648
  1.171456	  2.166191	  0.362351
  1.184203	  2.166569	  0.380296
  1.196311	  2.170209	  0.399093
  1.204918	  2.173061	  0.412199
  1.212916	  2.172206	  0.428861
  1.223595	  2.169157	  0.448658
  1.236192	  2.164044	  0.462883
  1.250142	  2.161990	  0.477483
  1.264261	  2.161602	  0.491827
  1.278475	  2.162330	  0.505916
  1.292948	  2.163984	  0.519628
  1.307851	  2.167164	  0.532576
  1.322984	  2.171289	  0.544978
  1.338706	  2.177048	  0.555878
  1.354370	  2.182895	  0.566574
  1.370417	  2.189530	  0.576497
