 0.0 0.0 0.0 0
 -0.45890186044238546 0.4281156023618884 0.7210564558205393 1000
 0.8183891027048085 0.3768342953510938 -0.2680857545490053 1000
 -0.3685658629282186 -0.35794481239542586 -0.9712160876867678 1000
 0.34154549566547954 -0.9286111813903271 -0.10599611733788689 1000
 0.5291643516135455 -0.4903809553790741 0.8090788251600496 1000
 0.6852172159968479 -0.614684412833485 -0.2797469654052498 1000
 -0.13606255423482397 -0.9909273802769183 -0.0481627155017699 1000
 -0.545614387377139 0.05203826493393704 -0.974338709216413 1000
 0.0 0.0 0.0 0
 -0.07644367739069072 0.6016876222057562 -0.8191311909061518 1000
 0.9776264273002353 -0.20442300530079596 0.24815196227676173 1000
 0.6577780458218938 -0.6334257496096192 0.5378179101681257 1000
 0.8246801141622472 0.5626751154784326 0.23740075400710092 1000
 0.421861438351795 0.8960750911810677 0.2582336264307268 1000
 0.7633019239434973 -0.10786678022980334 0.8105999958864867 1000
 0.22243844266270313 0.08424586900870834 1.0504836302035216 1000
 -0.650384278687677 -0.356045152907289 0.5472808475452478 1000
 0.0 0.0 0.0 0
 -0.2649139467872743 0.7410037522974428 -0.6690345916401919 1000
 -0.9806371659467404 -0.06852404748582616 -0.3935549161195823 1000
 0.4156721562078344 -0.6280296846486203 -0.6115227633893637 1000
 -0.4821810183916819 0.8628355731219516 -0.2271019232927943 1000
 -0.8349724307303336 -0.5117204208562987 0.02161244357220815 1000
 -0.13269150976340438 -0.7314968553343342 0.6407653925473107 1000
 0.14465001805945962 0.7294313716520637 0.7400958867617449 1000
 0.7334166578320429 -0.407632054255483 0.7001783540667426 1000
 0.0 0.0 0.0 0
 -0.8638982911485082 -0.40265675346139 -0.5001286830210167 1000
 -0.5607992510446624 0.20731689452003152 0.7175658283031485 1000
 -0.5009266647202761 -0.17120094182419793 -0.9827133494734038 1000
 -0.8962996361706924 0.39328411333610847 -0.3826016686537979 1000
 0.20741600707378915 -0.42323797183554196 -0.8790921601325451 1000
 0.6110358622361571 0.48830967057639496 0.7824092220958213 1000
 -0.552486953212035 0.7777011868499396 0.21869135278454022 1000
 0.45236200954868067 0.4956594818013017 -0.6568940081686592 1000
 0.0 0.0 0.0 0
 -0.9929768486539372 -0.009693199273837744 -0.08751039698334151 1000
 -0.14082458054551897 -0.30043116577568507 -1.010851826936057 1000
 0.44576937505249115 0.7779174934097243 -0.3415553531961968 1000
 -0.10123639270834994 0.8453536704454853 0.5457106712389799 1000
 0.8510817434707508 -0.12994155150570688 -0.3538035057381318 1000
 -0.304399009341306 0.09926700521271536 -1.0371640284664911 1000
 -0.9256396718905312 -0.3119675397010446 0.021696243056687048 1000
 0.7800728534018678 0.36853813393739365 0.6924379206649334 1000
 0.0 0.0 0.0 0
 -0.47739507835491846 0.6777325117372354 -0.6546802185459717 1000
 -0.6493311681153238 -0.5334639985561225 0.41033979171876567 1000
 -0.04286936375934125 0.008627696009923358 1.0222864615238487 1000
 -0.24260518141622228 0.5886762050390326 0.7630141453646129 1000
 0.7176164148202363 0.6712324031498027 -0.023216934211891416 1000
 0.3391365755793674 -0.25265937503470365 -0.8722042212161228 1000
 -0.8000605159161753 0.4866019952413881 -0.5118227616019724 1000
 0.3716509941879719 0.7598678302171227 0.6482229688378285 1000
 0.0 0.0 0.0 0
 -0.8364412803866812 0.42056950309364644 0.2022920503889566 1000
 -0.2871222404573028 -0.28056243326585667 0.8770621031423631 1000
 0.5176241188812878 0.3924399798871274 0.9024869168141009 1000
 0.9626537738757469 -0.14964442711595677 0.4245803073730274 1000
 0.5282075640573048 -0.6875715531261111 -0.4248468415049229 1000
 -0.5357678735692076 -0.8137144517201588 -0.36820480795352883 1000
 0.21530819425077868 -0.3772298234050301 0.9623946726846337 1000
 0.6833071341699828 -0.2788873401456954 -0.5639463276551726 1000
 0.0 0.0 0.0 0
 -0.7947398080855241 -0.5643514033540653 -0.40954030089123505 1000
 0.6496389548766485 0.04185838731851585 0.9171700337137876 1000
 -0.03839097941673192 0.36923180049870097 0.9609296069981446 1000
 -0.012637471103828478 0.9978644078540008 -0.04679982011102901 1000
