 0.0 0.0 0.0 0
 0.8111217502061856 -0.38125392317426077 0.13372104930050516 1000
 0.19290004569415453 -0.7554036486719063 -0.861318220807378 1000
 -0.44273609075134346 0.8719948022522327 0.03274625511945481 1000
 -0.8054343354358005 0.592823636316607 0.37588572451269187 1000
 0.40159947350703673 -0.881239006702778 -0.5358207873415439 1000
 0.4909412885125283 0.14857232685370336 0.7854249245196783 1000
 -0.6272657574732573 0.66283306433848 -0.14015601014174567 1000
 -0.7598090013378905 -0.006850481078088652 1.0390130388355945 1000
 0.0 0.0 0.0 0
 -0.3004321450188443 -0.9318095901009609 0.25553269284562496 1000
 -0.8780393628183071 -0.2774368006151905 -0.11313951156750751 1000
 0.13455369983578175 0.6698644008786161 0.8375691238783424 1000
 -0.5655890013148536 -0.3795536319933367 -0.6361336270887188 1000
 -0.3405269897309822 -0.9329584548430245 -0.09312643791736985 1000
 0.7001012435602443 0.6199530464669673 0.1801209273043355 1000
 0.05257116651006112 0.5064560492761162 -0.9395345593076072 1000
 0.8661216551101806 -0.1676833053220383 -0.8978605270127143 1000
 0.0 0.0 0.0 0
 0.31784751987730364 0.8722807911242825 -0.460366831695265 1000
 0.9126285854518811 0.09335273686433504 0.08927204222650703 1000
