  1.503729	 -1.886198	  0.484262
  1.515465	 -1.907200	  0.474964
  1.504374	 -1.891323	  0.480768
  1.496119	 -1.875069	  0.488140
  1.483484	 -1.860217	  0.493222
  1.470984	 -1.843599	  0.497634
  1.464079	 -1.827653	  0.504522
  1.451500	 -1.812505	  0.509255
  1.437725	 -1.796090	  0.512256
  1.430339	 -1.780224	  0.518188
  1.418714	 -1.765592	  0.523511
  1.403543	 -1.748224	  0.526007
  1.396098	 -1.730099	  0.529566
  1.389316	 -1.711461	  0.536325
  1.378527	 -1.699435	  0.542061
  1.363613	 -1.684044	  0.546364
  1.350943	 -1.668608	  0.549980
  1.339053	 -1.652962	  0.553762
  1.326629	 -1.637520	  0.556450
  1.314173	 -1.622082	  0.559006
  1.301438	 -1.606912	  0.561783
  1.288033	 -1.592446	  0.565103
  1.274622	 -1.577985	  0.568421
  1.260914	 -1.564000	  0.572485
  1.246830	 -1.550815	  0.577758
  1.232794	 -1.537586	  0.583042
  1.218563	 -1.524815	  0.588908
  1.204121	 -1.512677	  0.595550
  1.189679	 -1.500537	  0.602186
  1.175330	 -1.488607	  0.609379
  1.161004	 -1.476791	  0.616802
  1.146769	 -1.464886	  0.624288
  1.133298	 -1.452471	  0.632336
  1.119920	 -1.440081	  0.640556
  1.107093	 -1.427448	  0.649257
  1.094429	 -1.414698	  0.658052
  1.081993	 -1.401830	  0.666984
  1.070268	 -1.388649	  0.676407
  1.058597	 -1.375435	  0.685838
  1.048022	 -1.361894	  0.696069
  1.037691	 -1.348323	  0.706533
  1.027652	 -1.334653	  0.717089
  1.019173	 -1.320293	  0.727818
  1.011415	 -1.305089	  0.739332
  1.001937	 -1.290599	  0.749883
  0.989415	 -1.277889	  0.758468
  0.976959	 -1.264010	  0.766189
  0.965459	 -1.249450	  0.773923
  0.954385	 -1.234772	  0.781823
  0.943218	 -1.219587	  0.788539
  0.932023	 -1.204404	  0.795192
  0.920111	 -1.189606	  0.801493
  0.907837	 -1.175039	  0.807621
  0.895356	 -1.160639	  0.813695
  0.881915	 -1.147044	  0.819571
  0.869205	 -1.132843	  0.825382
  0.857404	 -1.117659	  0.831110
  0.845986	 -1.102182	  0.836980
  0.834888	 -1.086580	  0.843176
  0.824230	 -1.071509	  0.849789
  0.810797	 -1.057638	  0.858080
  0.794654	 -1.046755	  0.868227
  0.776229	 -1.039379	  0.877575
  0.757935	 -1.030031	  0.881126
  0.744809	 -1.015483	  0.882731
  0.734434	 -0.997959	  0.883657
  0.723933	 -0.979808	  0.885473
  0.712748	 -0.962573	  0.885671
  0.697860	 -0.947703	  0.885859
  0.680349	 -0.936401	  0.887977
  0.663462	 -0.925833	  0.892364
  0.649535	 -0.913399	  0.899896
  0.636894	 -0.899237	  0.907974
  0.625546	 -0.884553	  0.915948
  0.612526	 -0.870260	  0.923717
  0.598780	 -0.856615	  0.930160
  0.585456	 -0.842508	  0.932359
  0.572705	 -0.827622	  0.936583
  0.561535	 -0.811246	  0.937988
  0.551530	 -0.794544	  0.942095
  0.541774	 -0.778477	  0.947376
  0.532254	 -0.764935	  0.952878
  0.513150	 -0.748680	  0.961530
  0.494551	 -0.738047	  0.967861
  0.480888	 -0.733056	  0.970241
  0.463488	 -0.721825	  0.974793
  0.449256	 -0.702428	  0.982755
  0.441580	 -0.688759	  0.987872
  0.429772	 -0.676073	  0.994713
  0.414359	 -0.659927	  1.004413
  0.408119	 -0.645881	  1.010816
  0.395837	 -0.631777	  1.019233
  0.382361	 -0.616337	  1.026486
  0.374589	 -0.598777	  1.031020
  0.365468	 -0.582647	  1.038222
  0.354159	 -0.566750	  1.049916
  0.343553	 -0.553725	  1.060778
  0.327258	 -0.543572	  1.069772
  0.309750	 -0.535291	  1.075838
  0.295078	 -0.524190	  1.081392
  0.283268	 -0.508790	  1.088654
  0.271187	 -0.491562	  1.097290
  0.263462	 -0.475712	  1.103966
  0.255113	 -0.458210	  1.109402
  0.245053	 -0.442238	  1.112744
  0.232394	 -0.426645	  1.121118
  0.221613	 -0.412186	  1.133866
  0.213497	 -0.393596	  1.142171
  0.207932	 -0.377329	  1.143302
  0.199052	 -0.358060	  1.143561
  0.189942	 -0.339394	  1.144772
  0.181557	 -0.320821	  1.147377
  0.173409	 -0.302525	  1.153346
  0.165341	 -0.286031	  1.161832
  0.154304	 -0.271132	  1.171060
  0.141578	 -0.257375	  1.176334
  0.128863	 -0.241685	  1.179772
  0.116161	 -0.226543	  1.183007
  0.103954	 -0.211364	  1.188349
  0.093038	 -0.195475	  1.194686
  0.082839	 -0.179358	  1.200827
  0.073562	 -0.162616	  1.206281
  0.064729	 -0.145555	  1.209451
  0.057243	 -0.126045	  1.211975
  0.052797	 -0.106715	  1.217758
  0.043334	 -0.088979	  1.231650
  0.032432	 -0.074787	  1.242947
  0.017501	 -0.060756	  1.248419
  0.000255	 -0.048629	  1.251619
 -0.012084	 -0.039511	  1.257490
 -0.024472	 -0.024300	  1.268222
 -0.038804	 -0.008164	  1.274213
 -0.055122	  0.003509	  1.278959
 -0.069489	  0.008598	  1.285150
 -0.086817	  0.015845	  1.295309
 -0.104902	  0.024718	  1.300207
 -0.125376	  0.040531	  1.302949
 -0.137537	  0.051561	  1.309534
 -0.149523	  0.062297	  1.317539
 -0.165439	  0.077322	  1.323018
 -0.180574	  0.088917	  1.331060
 -0.192897	  0.097255	  1.339046
 -0.210261	  0.111863	  1.344960
 -0.224551	  0.124102	  1.352380
 -0.235963	  0.132896	  1.360220
 -0.251405	  0.149138	  1.365725
 -0.263623	  0.161978	  1.373388
 -0.274076	  0.173116	  1.382227
 -0.285982	  0.190602	  1.387043
 -0.299446	  0.208401	  1.390758
 -0.314364	  0.222255	  1.394993
 -0.327144	  0.230760	  1.400754
 -0.343324	  0.242407	  1.411636
 -0.358033	  0.256808	  1.422324
 -0.367353	  0.272977	  1.426874
 -0.374777	  0.290116	  1.426326
 -0.384899	  0.305929	  1.428138
 -0.394214	  0.323375	  1.432682
 -0.411028	  0.349939	  1.435391
 -0.422391	  0.362514	  1.439611
 -0.428196	  0.369820	  1.442481
 -0.439118	  0.389731	  1.450655
 -0.452097	  0.406803	  1.459246
 -0.461244	  0.417526	  1.470642
 -0.471894	  0.433295	  1.481166
 -0.481421	  0.449717	  1.485807
 -0.489077	  0.467229	  1.490369
 -0.498300	  0.487827	  1.497184
 -0.502959	  0.502364	  1.501368
 -0.507524	  0.520793	  1.507678
 -0.519058	  0.542736	  1.518776
 -0.529213	  0.555094	  1.526182
 -0.544427	  0.565385	  1.531435
 -0.565415	  0.577212	  1.534411
 -0.581283	  0.591955	  1.538297
 -0.589313	  0.606574	  1.546054
 -0.594034	  0.624654	  1.556084
 -0.602617	  0.642216	  1.564747
 -0.616778	  0.654281	  1.571905
 -0.630924	  0.667575	  1.579581
 -0.640229	  0.681282	  1.584648
 -0.650722	  0.696252	  1.591382
 -0.674553	  0.713934	  1.608449
 -0.682148	  0.723239	  1.612956
 -0.691180	  0.728710	  1.620338
 -0.704906	  0.749662	  1.626999
 -0.720635	  0.762807	  1.632058
 -0.734536	  0.773036	  1.637001
 -0.750260	  0.784608	  1.645993
 -0.766756	  0.794922	  1.655208
 -0.783862	  0.807789	  1.656311
 -0.798916	  0.821115	  1.655655
 -0.813238	  0.833005	  1.659368
 -0.830351	  0.846205	  1.665298
 -0.843324	  0.857189	  1.669009
 -0.857655	  0.869779	  1.676565
 -0.873277	  0.883780	  1.684309
 -0.884835	  0.896511	  1.687556
 -0.898122	  0.910542	  1.694063
 -0.914619	  0.923891	  1.702915
 -0.927881	  0.935501	  1.706613
 -0.940940	  0.949280	  1.709424
 -0.953770	  0.962895	  1.714724
 -0.967615	  0.976222	  1.723121
 -0.981585	  0.988190	  1.731177
 -0.995200	  0.999960	  1.739910
 -1.008255	  1.011967	  1.749383
 -1.021152	  1.024140	  1.758854
 -1.032741	  1.036905	  1.768666
 -1.043137	  1.050103	  1.779261
 -1.051862	  1.064908	  1.790030
 -1.061999	  1.080825	  1.798935
 -1.073895	  1.094658	  1.806134
 -1.087268	  1.106969	  1.812961
 -1.101942	  1.119556	  1.821120
 -1.114810	  1.138236	  1.825379
 -1.123148	  1.156594	  1.830515
 -1.131260	  1.170517	  1.837717
 -1.143584	  1.185380	  1.842221
 -1.157904	  1.203812	  1.835432
 -1.168704	  1.220406	  1.838260
