 -0.401142	  2.230124	  0.954296
 -0.401112	  2.231617	  0.956110
 -0.401788	  2.197403	  0.914536
 -0.398663	  2.166241	  0.869633
 -0.395156	  2.137724	  0.830732
 -0.390850	  2.107414	  0.790521
 -0.387152	  2.077975	  0.748957
 -0.384732	  2.050784	  0.709291
 -0.383349	  2.027222	  0.676979
 -0.383189	  2.006950	  0.655630
 -0.393198	  1.970280	  0.636618
 -0.403037	  1.951948	  0.632838
 -0.412307	  1.938783	  0.631619
 -0.468109	  1.883078	  0.626009
 -0.589325	  1.767972	  0.600000
 -0.670763	  1.597013	  0.567885
 -0.715569	  1.444425	  0.486451
 -0.720766	  1.365789	  0.429617
 -0.715752	  1.341075	  0.408487
 -0.705636	  1.324091	  0.389051
 -0.687267	  1.306069	  0.363948
 -0.616190	  1.269658	  0.293989
 -0.468247	  1.233230	  0.182314
 -0.265522	  1.247403	  0.123633
 -0.123359	  1.276873	  0.064753
 -0.022439	  1.263228	  0.011929
  0.046648	  1.231847	 -0.017255
  0.080102	  1.207210	 -0.036986
  0.096441	  1.191319	 -0.051657
  0.104838	  1.180359	 -0.063731
  0.110088	  1.169354	 -0.077696
  0.112424	  1.153146	 -0.099869
  0.108108	  1.131347	 -0.128406
  0.095059	  1.101398	 -0.159803
  0.079851	  1.070889	 -0.181974
  0.058518	  1.026303	 -0.199901
  0.031911	  0.946906	 -0.211553
  0.021400	  0.845223	 -0.212148
  0.019375	  0.749227	 -0.216437
  0.016917	  0.656567	 -0.241267
  0.013308	  0.586855	 -0.286672
  0.009417	  0.554062	 -0.328960
  0.005311	  0.539016	 -0.375052
  0.000587	  0.538208	 -0.432725
 -0.003552	  0.551575	 -0.488955
 -0.007918	  0.576915	 -0.547502
 -0.014662	  0.613500	 -0.624427
 -0.018149	  0.633490	 -0.714866
 -0.014198	  0.610418	 -0.786621
 -0.002815	  0.574224	 -0.831379
  0.011220	  0.543840	 -0.859748
  0.034027	  0.506643	 -0.889965
  0.080963	  0.445103	 -0.932440
  0.151220	  0.367619	 -0.978355
  0.205560	  0.310912	 -1.013757
  0.231200	  0.280779	 -1.037016
  0.241984	  0.263763	 -1.053229
  0.246818	  0.251346	 -1.067374
  0.248383	  0.238156	 -1.085277
  0.245064	  0.221611	 -1.112302
  0.232360	  0.199687	 -1.155513
  0.203027	  0.171145	 -1.225408
  0.161911	  0.142192	 -1.308491
  0.128730	  0.118772	 -1.361033
  0.105662	  0.094722	 -1.389717
  0.080634	  0.048774	 -1.432020
  0.081806	  0.012698	 -1.490920
  0.087251	 -0.009948	 -1.520977
  0.091241	 -0.036334	 -1.545692
  0.094546	 -0.070525	 -1.573760
  0.098060	 -0.109076	 -1.603008
  0.103261	 -0.151631	 -1.634806
  0.110405	 -0.194647	 -1.668309
  0.119016	 -0.236490	 -1.703258
  0.128763	 -0.277223	 -1.740146
  0.138624	 -0.315127	 -1.777761
  0.147309	 -0.349842	 -1.814962
  0.154858	 -0.382973	 -1.851673
  0.162096	 -0.415618	 -1.888392
  0.170942	 -0.448444	 -1.925061
  0.182308	 -0.483385	 -1.964567
  0.195576	 -0.519354	 -2.007688
  0.210302	 -0.553030	 -2.055039
  0.223440	 -0.579230	 -2.097744
  0.233016	 -0.600801	 -2.129265
  0.241954	 -0.624797	 -2.157496
  0.253584	 -0.658200	 -2.191387
  0.265785	 -0.694665	 -2.231297
  0.277080	 -0.728534	 -2.271728
  0.289680	 -0.766398	 -2.320324
  0.297390	 -0.790676	 -2.352994
