 -1.986966	 -0.502169	 -1.165638
 -2.024948	 -0.529124	 -1.177079
 -2.008860	 -0.512651	 -1.177584
 -1.996176	 -0.503631	 -1.168857
 -1.979703	 -0.493673	 -1.158847
 -1.962109	 -0.481981	 -1.155718
 -1.947078	 -0.470988	 -1.155447
 -1.930561	 -0.459521	 -1.152524
 -1.912566	 -0.448445	 -1.145948
 -1.897260	 -0.441871	 -1.140367
 -1.879472	 -0.431841	 -1.135216
 -1.862908	 -0.422680	 -1.130315
 -1.844952	 -0.417489	 -1.124037
 -1.824817	 -0.407612	 -1.116212
 -1.813144	 -0.395614	 -1.114706
 -1.797015	 -0.381100	 -1.112860
 -1.778273	 -0.370015	 -1.106601
 -1.761111	 -0.369289	 -1.097938
 -1.740019	 -0.366811	 -1.088349
 -1.725313	 -0.354935	 -1.084677
 -1.710140	 -0.341497	 -1.081726
 -1.693822	 -0.329751	 -1.077259
 -1.676968	 -0.320314	 -1.071346
 -1.659415	 -0.312293	 -1.065871
 -1.643118	 -0.302481	 -1.059627
 -1.630121	 -0.287979	 -1.051380
 -1.617330	 -0.274596	 -1.042495
 -1.600401	 -0.266608	 -1.035151
 -1.585716	 -0.256593	 -1.030162
 -1.570012	 -0.243795	 -1.025115
 -1.553518	 -0.231002	 -1.015277
 -1.540748	 -0.221951	 -1.002621
 -1.527657	 -0.213125	 -0.991986
 -1.513953	 -0.201877	 -0.984967
 -1.497726	 -0.189349	 -0.980641
 -1.484397	 -0.174121	 -0.974200
 -1.469306	 -0.162242	 -0.963337
 -1.450330	 -0.160974	 -0.954375
 -1.430925	 -0.158710	 -0.950463
 -1.412437	 -0.148250	 -0.946692
 -1.399166	 -0.133828	 -0.937650
 -1.385839	 -0.127531	 -0.924804
 -1.367058	 -0.122611	 -0.915126
 -1.349364	 -0.112349	 -0.909693
 -1.331550	 -0.096482	 -0.903371
 -1.322358	 -0.089170	 -0.896729
 -1.309782	 -0.080930	 -0.884404
 -1.295324	 -0.064910	 -0.874711
 -1.277325	 -0.049388	 -0.868220
 -1.265705	 -0.040818	 -0.862496
 -1.254787	 -0.030137	 -0.851474
 -1.242940	 -0.014394	 -0.834516
 -1.229148	 -0.006130	 -0.820707
 -1.212058	 -0.001496	 -0.809452
 -1.195471	 -0.001936	 -0.802004
 -1.177019	 -0.003019	 -0.790806
 -1.161409	  0.004669	 -0.777523
 -1.146994	  0.018641	 -0.765074
 -1.133955	  0.028782	 -0.755735
 -1.120863	  0.038312	 -0.750302
 -1.105025	  0.051113	 -0.745696
 -1.090425	  0.056386	 -0.737774
 -1.063063	  0.058507	 -0.716476
 -1.053554	  0.066452	 -0.704515
 -1.041870	  0.071189	 -0.695449
 -1.029293	  0.086248	 -0.685452
 -1.016766	  0.098450	 -0.677074
 -1.003591	  0.113060	 -0.663358
 -0.992393	  0.120711	 -0.652614
 -0.980898	  0.127857	 -0.642910
 -0.960480	  0.145298	 -0.630121
 -0.944031	  0.149882	 -0.620880
 -0.933036	  0.154577	 -0.618267
 -0.909533	  0.156853	 -0.611369
 -0.890816	  0.170630	 -0.602507
 -0.881022	  0.185738	 -0.588498
 -0.873593	  0.196830	 -0.577306
 -0.860069	  0.206775	 -0.565994
 -0.842040	  0.212645	 -0.557804
 -0.823316	  0.215176	 -0.548383
 -0.805062	  0.221045	 -0.539830
 -0.791388	  0.233970	 -0.532977
 -0.780329	  0.251263	 -0.524783
 -0.765180	  0.265851	 -0.518216
 -0.747524	  0.269090	 -0.514229
 -0.727070	  0.273826	 -0.508099
 -0.710274	  0.284212	 -0.500995
 -0.698966	  0.294852	 -0.489882
 -0.684211	  0.306512	 -0.478382
 -0.665184	  0.315896	 -0.472016
 -0.649774	  0.319671	 -0.466391
 -0.631603	  0.328309	 -0.458346
 -0.616015	  0.337846	 -0.451073
 -0.600928	  0.345363	 -0.442946
 -0.579235	  0.355136	 -0.435502
 -0.566227	  0.364682	 -0.430849
 -0.552269	  0.374516	 -0.421880
 -0.534858	  0.383416	 -0.413938
 -0.515999	  0.385507	 -0.407960
 -0.497986	  0.386156	 -0.398630
 -0.481072	  0.394767	 -0.386189
 -0.465819	  0.400525	 -0.377112
 -0.448412	  0.398566	 -0.370808
 -0.423934	  0.397688	 -0.365715
 -0.404905	  0.403459	 -0.358855
 -0.393571	  0.410423	 -0.349234
 -0.374900	  0.412696	 -0.338262
 -0.357058	  0.413071	 -0.330728
 -0.337616	  0.417319	 -0.322188
 -0.316742	  0.418275	 -0.315083
 -0.302877	  0.413483	 -0.308532
 -0.282528	  0.406334	 -0.294606
 -0.262628	  0.407348	 -0.284131
 -0.249300	  0.412439	 -0.278770
 -0.228378	  0.418371	 -0.271971
 -0.211235	  0.416213	 -0.262414
 -0.197505	  0.411679	 -0.250913
 -0.174639	  0.404649	 -0.232965
 -0.156968	  0.402356	 -0.228832
 -0.139762	  0.401937	 -0.227976
 -0.111013	  0.405392	 -0.224287
 -0.094828	  0.412111	 -0.222307
 -0.078634	  0.420889	 -0.221582
 -0.054836	  0.433105	 -0.223035
 -0.033378	  0.439220	 -0.223715
 -0.018211	  0.445190	 -0.222501
 -0.000819	  0.454783	 -0.215897
  0.015800	  0.461887	 -0.204835
  0.032234	  0.467391	 -0.193807
  0.050033	  0.469334	 -0.181531
  0.066921	  0.471944	 -0.172000
  0.082922	  0.479630	 -0.164942
  0.101457	  0.493180	 -0.159632
  0.115617	  0.500748	 -0.152095
  0.131934	  0.504622	 -0.140737
  0.151783	  0.504855	 -0.133827
  0.175640	  0.509338	 -0.131766
  0.191070	  0.516934	 -0.131054
  0.205623	  0.523199	 -0.127111
  0.235157	  0.523847	 -0.112900
  0.255380	  0.525865	 -0.101687
  0.266296	  0.527104	 -0.095276
  0.279219	  0.546496	 -0.089997
  0.294756	  0.569429	 -0.086542
  0.308086	  0.580032	 -0.082636
  0.323119	  0.584775	 -0.080860
  0.348478	  0.588031	 -0.078301
  0.367875	  0.595614	 -0.076489
  0.382859	  0.598608	 -0.080926
  0.400942	  0.610705	 -0.077646
  0.420394	  0.625242	 -0.076964
  0.433976	  0.630722	 -0.076446
  0.453238	  0.638110	 -0.074443
  0.478759	  0.643345	 -0.078336
  0.491317	  0.648982	 -0.080617
  0.510995	  0.656546	 -0.085602
  0.533456	  0.663374	 -0.087658
  0.553840	  0.659997	 -0.088525
  0.574196	  0.653870	 -0.093324
  0.590654	  0.651662	 -0.100496
  0.610061	  0.655480	 -0.108439
  0.630101	  0.657476	 -0.112591
  0.651038	  0.655567	 -0.115745
  0.670647	  0.653572	 -0.118181
  0.688885	  0.655199	 -0.120928
  0.709993	  0.657388	 -0.120323
  0.731703	  0.655782	 -0.118762
  0.748616	  0.651136	 -0.118877
  0.769307	  0.646593	 -0.122062
  0.789642	  0.644387	 -0.126603
  0.808871	  0.646153	 -0.129870
  0.829350	  0.648861	 -0.130841
  0.851187	  0.647977	 -0.130220
  0.869372	  0.645564	 -0.131515
  0.888778	  0.645458	 -0.134064
  0.909664	  0.648630	 -0.132855
  0.929540	  0.654128	 -0.127133
  0.947467	  0.658900	 -0.121625
  0.966927	  0.664395	 -0.116611
  0.986220	  0.669271	 -0.113147
  1.005128	  0.673849	 -0.112857
  1.023756	  0.680722	 -0.113115
  1.043458	  0.685821	 -0.111133
  1.066485	  0.685628	 -0.106684
  1.084801	  0.685387	 -0.103987
  1.104171	  0.691562	 -0.101784
  1.119307	  0.703299	 -0.099537
  1.136563	  0.715977	 -0.098254
  1.158968	  0.724122	 -0.097891
  1.180021	  0.725023	 -0.096441
  1.198836	  0.725996	 -0.093173
  1.214752	  0.731892	 -0.091892
  1.231794	  0.742346	 -0.091029
  1.252081	  0.746561	 -0.089900
  1.269709	  0.753964	 -0.088623
  1.285317	  0.773311	 -0.083582
  1.295613	  0.790484	 -0.074183
  1.308311	  0.803614	 -0.068977
  1.326174	  0.813022	 -0.069070
  1.347347	  0.819241	 -0.072223
  1.364137	  0.824567	 -0.070289
  1.385098	  0.839330	 -0.052645
  1.395261	  0.857933	 -0.044070
  1.403301	  0.874364	 -0.045845
  1.412120	  0.890022	 -0.052239
  1.427368	  0.904309	 -0.055206
  1.447805	  0.916016	 -0.056167
  1.464271	  0.924795	 -0.049838
  1.473391	  0.944690	 -0.042298
  1.481387	  0.964531	 -0.035360
  1.494376	  0.978198	 -0.036157
  1.503049	  0.989508	 -0.038610
  1.504975	  1.013130	 -0.036793
  1.507825	  1.026758	 -0.036368
  1.509368	  1.046804	 -0.038278
  1.509981	  1.077588	 -0.034505
  1.514961	  1.091454	 -0.032634
  1.527795	  1.105033	 -0.036294
  1.546329	  1.123481	 -0.036928
  1.554881	  1.143625	 -0.027350
  1.554950	  1.163153	 -0.022071
  1.555664	  1.183051	 -0.026327
  1.560044	  1.203199	 -0.030525
  1.563210	  1.220959	 -0.031148
  1.565472	  1.240153	 -0.028090
  1.567408	  1.264034	 -0.026145
  1.569202	  1.286252	 -0.028285
  1.571811	  1.302904	 -0.028303
  1.577973	  1.322648	 -0.024417
  1.584152	  1.342735	 -0.019843
  1.587017	  1.355309	 -0.018503
  1.585832	  1.380476	 -0.012787
  1.586297	  1.401993	 -0.009918
  1.585347	  1.414864	 -0.008768
  1.581581	  1.435998	 -0.000944
  1.585569	  1.461546	  0.007629
  1.591503	  1.477339	  0.008608
  1.592554	  1.495093	  0.010016
  1.589014	  1.517465	  0.011762
  1.589167	  1.539482	  0.007256
  1.589567	  1.556347	  0.005570
  1.588139	  1.576616	  0.010521
  1.587148	  1.596915	  0.015094
  1.586064	  1.616735	  0.018544
  1.581228	  1.635307	  0.024162
  1.576392	  1.653878	  0.029778
  1.571951	  1.672341	  0.035459
  1.569979	  1.690796	  0.040374
  1.565277	  1.710826	  0.041169
  1.552413	  1.731108	  0.042197
  1.541981	  1.748996	  0.048134
  1.539065	  1.764934	  0.054729
  1.534686	  1.783795	  0.058821
  1.526394	  1.804056	  0.066249
  1.522007	  1.819149	  0.076709
  1.520481	  1.836302	  0.085678
  1.513951	  1.854887	  0.092845
  1.508482	  1.871893	  0.101530
  1.502736	  1.889277	  0.110178
  1.494148	  1.906213	  0.116071
  1.489135	  1.923562	  0.125498
  1.485944	  1.942115	  0.138941
  1.476041	  1.957492	  0.144862
  1.464302	  1.971801	  0.146327
  1.450590	  1.987164	  0.153191
  1.438862	  2.001569	  0.161737
  1.427602	  2.015702	  0.170248
  1.417544	  2.030804	  0.177410
  1.409625	  2.048229	  0.184263
  1.411424	  2.062712	  0.195230
  1.420320	  2.073251	  0.207936
  1.431469	  2.082183	  0.222063
  1.443080	  2.092156	  0.234911
  1.454176	  2.100816	  0.249197
  1.465493	  2.110470	  0.262410
  1.476764	  2.119366	  0.276613
  1.487986	  2.128583	  0.290257
  1.499470	  2.137775	  0.304276
  1.510913	  2.144485	  0.319677
  1.522360	  2.146826	  0.336295
  1.538407	  2.153461	  0.346218
