  2.201361	 -0.203431	  1.181865
  2.246202	 -0.193232	  1.182155
  2.227082	 -0.198093	  1.184125
  2.210631	 -0.204841	  1.186761
  2.187785	 -0.213562	  1.191430
  2.171513	 -0.216544	  1.191656
  2.150605	 -0.221193	  1.192821
  2.130024	 -0.227022	  1.195448
  2.114209	 -0.229114	  1.194912
  2.091787	 -0.234702	  1.196646
  2.070346	 -0.245952	  1.205856
  2.061247	 -0.251555	  1.209846
  2.041854	 -0.259362	  1.209334
  2.019300	 -0.265769	  1.208374
  1.999322	 -0.268646	  1.216671
  1.981114	 -0.271885	  1.225000
  1.963786	 -0.278565	  1.229094
  1.945537	 -0.285840	  1.233022
  1.926612	 -0.290748	  1.239081
  1.908215	 -0.297614	  1.243141
  1.890793	 -0.305083	  1.245241
  1.872499	 -0.312951	  1.247053
  1.854241	 -0.324189	  1.246789
  1.836362	 -0.334099	  1.248150
  1.818819	 -0.343986	  1.248271
  1.802478	 -0.350964	  1.251845
  1.774205	 -0.360496	  1.256861
  1.754471	 -0.356993	  1.267620
  1.736377	 -0.358411	  1.280933
  1.728523	 -0.356637	  1.289087
  1.710640	 -0.364550	  1.302379
  1.686220	 -0.375360	  1.307550
  1.670353	 -0.375943	  1.305727
  1.647382	 -0.375021	  1.306753
  1.628945	 -0.382088	  1.313894
  1.615318	 -0.391847	  1.323503
  1.597448	 -0.399344	  1.332739
  1.579121	 -0.404685	  1.340299
  1.560983	 -0.409788	  1.346618
  1.543386	 -0.417984	  1.352089
  1.522061	 -0.423746	  1.360952
  1.503649	 -0.425845	  1.370502
  1.482997	 -0.421188	  1.369971
  1.461281	 -0.412974	  1.363890
  1.439090	 -0.403698	  1.364627
  1.420778	 -0.402469	  1.374213
  1.404629	 -0.409556	  1.386623
  1.386751	 -0.417952	  1.395833
  1.365294	 -0.417518	  1.402201
  1.344498	 -0.410624	  1.403528
  1.326998	 -0.405905	  1.399772
  1.305771	 -0.403387	  1.401381
  1.285971	 -0.400011	  1.403897
  1.266331	 -0.398202	  1.407246
  1.246793	 -0.397151	  1.411372
  1.227773	 -0.394212	  1.415519
  1.208634	 -0.388751	  1.422411
  1.188844	 -0.386632	  1.432210
  1.167919	 -0.390825	  1.438564
  1.150402	 -0.395383	  1.439075
  1.130133	 -0.396674	  1.440784
  1.109160	 -0.399177	  1.446110
  1.090137	 -0.405116	  1.447639
  1.071514	 -0.408595	  1.448950
  1.050154	 -0.412603	  1.453239
  1.030639	 -0.418946	  1.456281
  1.014146	 -0.427093	  1.452908
  0.997087	 -0.430807	  1.452020
  0.972180	 -0.438957	  1.451755
  0.950642	 -0.448296	  1.452254
  0.937853	 -0.452513	  1.453548
  0.921000	 -0.457396	  1.453628
  0.895073	 -0.466692	  1.452303
  0.880579	 -0.470446	  1.453569
  0.862225	 -0.475064	  1.454070
  0.840134	 -0.482993	  1.452788
  0.822003	 -0.486734	  1.454834
  0.803437	 -0.489532	  1.456383
  0.781098	 -0.496378	  1.455598
  0.760993	 -0.498842	  1.460087
  0.740250	 -0.497589	  1.467340
  0.724582	 -0.497776	  1.466676
  0.703200	 -0.502764	  1.461869
  0.683014	 -0.506837	  1.460319
  0.663846	 -0.508187	  1.460324
  0.643563	 -0.506659	  1.460549
  0.622673	 -0.508709	  1.460991
  0.601996	 -0.519025	  1.459778
  0.585749	 -0.529883	  1.458914
  0.567251	 -0.536988	  1.461797
  0.546912	 -0.539191	  1.467399
  0.527369	 -0.542488	  1.471266
  0.508532	 -0.549260	  1.473680
  0.490582	 -0.556232	  1.475589
  0.472328	 -0.560602	  1.478980
  0.452147	 -0.566270	  1.485685
  0.433845	 -0.577755	  1.490579
  0.419192	 -0.589411	  1.487660
  0.402896	 -0.599815	  1.479245
  0.385895	 -0.609201	  1.477126
  0.360264	 -0.619561	  1.492522
  0.347468	 -0.623185	  1.500237
  0.331217	 -0.626158	  1.505885
  0.309483	 -0.630651	  1.510992
  0.289388	 -0.637623	  1.514864
  0.272198	 -0.644170	  1.515087
  0.252646	 -0.649793	  1.517923
  0.233554	 -0.655806	  1.521409
  0.215002	 -0.662159	  1.521556
  0.194335	 -0.667232	  1.523828
  0.175965	 -0.669916	  1.528013
  0.156670	 -0.673581	  1.530086
  0.136468	 -0.676717	  1.534289
  0.118390	 -0.676158	  1.540049
  0.099880	 -0.673744	  1.549011
  0.074768	 -0.671662	  1.560844
  0.058737	 -0.673381	  1.564735
  0.042676	 -0.678399	  1.566754
  0.020199	 -0.684494	  1.565377
 -0.002982	 -0.687072	  1.567683
 -0.017958	 -0.684600	  1.572539
 -0.035948	 -0.679059	  1.580357
 -0.058039	 -0.675849	  1.586446
 -0.074769	 -0.671932	  1.590529
 -0.096829	 -0.665062	  1.595842
 -0.117213	 -0.665173	  1.598277
 -0.134984	 -0.672367	  1.599600
 -0.156523	 -0.678712	  1.602175
 -0.174954	 -0.678626	  1.606301
 -0.193202	 -0.675237	  1.612597
 -0.217173	 -0.676663	  1.618242
 -0.233108	 -0.685229	  1.621116
 -0.249300	 -0.694683	  1.625646
 -0.268832	 -0.702451	  1.630206
 -0.285094	 -0.712027	  1.632285
 -0.303743	 -0.723357	  1.633816
 -0.324344	 -0.728852	  1.634540
 -0.341916	 -0.730041	  1.635808
 -0.361936	 -0.733070	  1.642483
 -0.380820	 -0.738416	  1.647450
 -0.397652	 -0.746745	  1.651038
 -0.417042	 -0.751640	  1.660351
 -0.437322	 -0.755440	  1.667829
 -0.454966	 -0.759143	  1.669817
 -0.474978	 -0.762986	  1.673123
 -0.493720	 -0.767093	  1.675625
 -0.512108	 -0.771696	  1.675515
 -0.534075	 -0.779088	  1.676444
 -0.547934	 -0.782172	  1.685326
 -0.568724	 -0.780427	  1.697465
 -0.598047	 -0.780452	  1.704770
 -0.609768	 -0.781954	  1.708202
 -0.622355	 -0.786110	  1.713513
 -0.645087	 -0.789842	  1.722033
 -0.667910	 -0.789030	  1.723931
 -0.683055	 -0.794632	  1.724865
 -0.703192	 -0.806697	  1.727727
 -0.724640	 -0.807897	  1.724185
 -0.752772	 -0.799314	  1.722880
 -0.768643	 -0.793903	  1.722543
 -0.789134	 -0.794468	  1.722338
 -0.806243	 -0.800373	  1.724075
 -0.826782	 -0.807551	  1.726786
 -0.846681	 -0.812063	  1.726818
 -0.866520	 -0.816424	  1.725938
 -0.886442	 -0.821756	  1.724516
 -0.905425	 -0.827746	  1.723032
 -0.924064	 -0.834457	  1.722270
 -0.943006	 -0.840929	  1.721339
 -0.962046	 -0.847126	  1.719759
 -0.981471	 -0.852330	  1.717338
 -1.001410	 -0.854321	  1.716754
 -1.023714	 -0.853666	  1.722641
 -1.044813	 -0.857326	  1.734845
 -1.059428	 -0.864882	  1.742259
 -1.076324	 -0.874017	  1.743123
 -1.094826	 -0.882520	  1.740964
 -1.114480	 -0.889398	  1.739988
 -1.134351	 -0.893735	  1.743278
 -1.153608	 -0.897646	  1.747060
 -1.172848	 -0.900826	  1.751481
 -1.192074	 -0.903784	  1.756136
 -1.211328	 -0.907063	  1.760443
 -1.230605	 -0.910829	  1.764213
 -1.249882	 -0.914600	  1.767976
 -1.269269	 -0.918850	  1.770436
 -1.288666	 -0.923177	  1.772684
 -1.308143	 -0.926994	  1.775136
 -1.327816	 -0.927727	  1.778656
 -1.347487	 -0.928452	  1.782193
 -1.366923	 -0.930209	  1.786565
 -1.386143	 -0.932549	  1.791526
 -1.405244	 -0.935844	  1.796519
 -1.424240	 -0.940015	  1.801304
 -1.443336	 -0.944220	  1.805262
 -1.461554	 -0.950396	  1.810627
 -1.479880	 -0.957866	  1.816658
 -1.499236	 -0.963682	  1.818417
 -1.519585	 -0.967351	  1.816638
 -1.538354	 -0.973707	  1.819344
