 -2.990895	 -0.474481	 -0.101555
 -2.961282	 -0.469784	 -0.100549
 -2.914820	 -0.471125	 -0.120176
 -2.868871	 -0.473652	 -0.143670
 -2.822114	 -0.481301	 -0.165508
 -2.775274	 -0.482114	 -0.184350
 -2.728812	 -0.476457	 -0.200535
 -2.682562	 -0.477874	 -0.218252
 -2.636396	 -0.478806	 -0.239718
 -2.590048	 -0.482664	 -0.260415
 -2.546112	 -0.486285	 -0.284042
 -2.504294	 -0.485745	 -0.308435
 -2.460438	 -0.483886	 -0.332313
 -2.415592	 -0.487980	 -0.355985
 -2.371634	 -0.495621	 -0.379318
 -2.328757	 -0.505252	 -0.402218
 -2.286967	 -0.515868	 -0.425803
 -2.246047	 -0.527356	 -0.451164
 -2.205070	 -0.540366	 -0.476570
 -2.161628	 -0.553346	 -0.501077
 -2.116518	 -0.560954	 -0.526083
 -2.072232	 -0.562154	 -0.549730
 -2.027609	 -0.558954	 -0.571489
 -1.981278	 -0.555798	 -0.592602
 -1.934422	 -0.554848	 -0.612586
 -1.887420	 -0.557016	 -0.631196
 -1.840073	 -0.561646	 -0.648943
 -1.793171	 -0.564890	 -0.666917
 -1.747529	 -0.566153	 -0.685635
 -1.701731	 -0.566479	 -0.708198
 -1.660225	 -0.564016	 -0.735706
 -1.620311	 -0.566862	 -0.764752
 -1.585978	 -0.565400	 -0.796670
 -1.584250	 -0.544482	 -0.845402
 -1.609454	 -0.536453	 -0.895320
 -1.583572	 -0.465090	 -0.942242
 -1.531506	 -0.386554	 -1.008937
 -1.497041	 -0.335825	 -1.071956
 -1.420325	 -0.272373	 -1.072642
 -1.300208	 -0.303592	 -1.068426
 -1.169277	 -0.329613	 -1.046640
 -1.078714	 -0.383373	 -1.012888
 -1.029105	 -0.430606	 -1.000473
 -1.002856	 -0.459953	 -0.993353
 -0.983355	 -0.475903	 -0.985836
 -0.964264	 -0.487626	 -0.979868
 -0.912920	 -0.509325	 -1.177826
 -0.892655	 -0.561166	 -1.269403
 -0.888295	 -0.593546	 -1.301264
 -0.886019	 -0.621793	 -1.326305
 -0.886917	 -0.629534	 -1.448657
 -0.878920	 -0.599253	 -1.531382
 -0.819711	 -0.567912	 -1.620356
 -0.763723	 -0.538089	 -1.657641
 -0.726963	 -0.513787	 -1.631584
 -0.704599	 -0.531652	 -1.560966
 -0.668854	 -0.595853	 -1.441841
 -0.574060	 -0.697257	 -1.385994
 -0.468772	 -0.754938	 -1.372542
 -0.388195	 -0.767205	 -1.388430
 -0.332680	 -0.769351	 -1.406209
 -0.285719	 -0.769405	 -1.424014
 -0.240922	 -0.768535	 -1.443154
 -0.194350	 -0.767198	 -1.464511
 -0.147954	 -0.766282	 -1.487603
 -0.103598	 -0.766607	 -1.511930
 -0.060416	 -0.768682	 -1.537849
 -0.017820	 -0.771459	 -1.564538
  0.024779	 -0.773381	 -1.591124
  0.068059	 -0.774120	 -1.617133
  0.110667	 -0.773658	 -1.641073
  0.154716	 -0.772049	 -1.663825
  0.198731	 -0.769723	 -1.684741
  0.245301	 -0.768730	 -1.706057
  0.291397	 -0.771151	 -1.727243
  0.335715	 -0.776822	 -1.746804
  0.380259	 -0.783534	 -1.764030
  0.425500	 -0.790589	 -1.780899
  0.472524	 -0.796684	 -1.799885
  0.519187	 -0.800509	 -1.822081
  0.564516	 -0.802347	 -1.846039
  0.608393	 -0.802730	 -1.870216
  0.651747	 -0.803120	 -1.895414
  0.694917	 -0.804794	 -1.922479
  0.736486	 -0.809131	 -1.949757
  0.776741	 -0.815560	 -1.976897
  0.819385	 -0.822588	 -2.004456
  0.864247	 -0.828337	 -2.030587
  0.908958	 -0.830902	 -2.054066
  0.952154	 -0.829971	 -2.075464
  0.995777	 -0.828554	 -2.098243
  1.035927	 -0.829314	 -2.124041
  1.074474	 -0.831440	 -2.154335
  1.112884	 -0.833752	 -2.187118
  1.153638	 -0.836515	 -2.220340
  1.196924	 -0.839408	 -2.250342
  1.242833	 -0.841794	 -2.274944
  1.288574	 -0.843794	 -2.294757
  1.334827	 -0.845781	 -2.312205
  1.383280	 -0.848288	 -2.328571
  1.432203	 -0.851903	 -2.342881
  1.480662	 -0.858969	 -2.356991
  1.524899	 -0.871165	 -2.373938
  1.565145	 -0.885916	 -2.401140
  1.580797	 -0.894775	 -2.425151
