  0.466745	  1.680539	  1.882269
  0.467991	  1.680721	  1.885341
  0.460827	  1.680537	  1.866640
  0.453345	  1.679867	  1.848215
  0.446065	  1.680156	  1.829699
  0.440219	  1.681743	  1.811248
  0.435438	  1.685615	  1.791155
  0.429026	  1.689545	  1.772012
  0.420011	  1.691200	  1.755179
  0.409933	  1.693392	  1.738603
  0.400317	  1.697950	  1.722056
  0.393723	  1.699373	  1.697279
  0.390982	  1.693638	  1.677017
  0.388213	  1.686491	  1.662624
  0.381598	  1.677054	  1.637253
  0.375393	  1.676617	  1.617253
  0.371239	  1.677555	  1.603646
  0.364816	  1.677581	  1.580060
  0.358387	  1.681336	  1.559891
  0.352467	  1.687165	  1.542554
  0.344499	  1.692703	  1.524318
  0.334307	  1.697056	  1.505147
  0.323663	  1.704607	  1.489273
  0.313613	  1.710485	  1.475935
  0.303941	  1.711261	  1.459334
  0.294682	  1.713967	  1.439032
  0.286614	  1.722041	  1.421374
  0.277813	  1.729805	  1.404881
  0.268816	  1.733395	  1.389951
  0.258709	  1.736350	  1.373727
  0.252557	  1.742530	  1.353993
  0.247922	  1.749676	  1.330843
  0.244248	  1.751994	  1.318129
  0.237526	  1.755208	  1.300154
  0.228169	  1.764135	  1.276708
  0.219609	  1.768678	  1.262225
  0.210322	  1.770927	  1.246183
  0.199258	  1.769975	  1.227067
  0.191218	  1.771362	  1.212079
  0.181864	  1.778336	  1.193523
  0.173111	  1.788465	  1.173710
  0.168194	  1.794963	  1.157238
  0.164293	  1.798380	  1.133970
  0.158608	  1.799490	  1.112941
  0.151362	  1.797435	  1.099243
  0.141529	  1.797971	  1.082855
  0.126746	  1.798108	  1.066356
  0.115708	  1.796918	  1.047952
  0.109534	  1.797320	  1.032656
  0.098875	  1.799203	  1.013709
  0.086533	  1.802492	  0.996199
  0.077346	  1.806313	  0.981581
  0.066291	  1.811695	  0.966924
  0.052001	  1.819583	  0.946098
  0.050233	  1.823194	  0.927645
  0.055764	  1.826803	  0.906123
  0.058375	  1.831859	  0.883120
  0.053258	  1.834991	  0.868590
  0.041764	  1.842148	  0.848129
  0.033573	  1.848460	  0.826475
  0.035491	  1.855583	  0.806964
  0.040920	  1.862833	  0.793437
  0.048359	  1.872625	  0.772538
  0.056578	  1.879988	  0.753089
  0.063371	  1.886524	  0.738643
  0.070765	  1.894610	  0.721003
  0.077650	  1.903557	  0.702818
  0.087331	  1.914005	  0.688272
  0.102103	  1.922944	  0.678155
  0.120052	  1.930460	  0.668802
  0.135698	  1.937290	  0.658617
  0.147002	  1.943878	  0.644301
  0.146375	  1.944880	  0.626498
  0.152487	  1.963428	  0.613416
  0.147751	  1.967800	  0.585937
  0.157761	  1.976013	  0.573253
  0.158343	  1.969272	  0.552463
  0.150403	  1.959128	  0.537187
  0.136217	  1.949333	  0.526780
  0.117728	  1.939033	  0.513757
  0.102156	  1.927977	  0.496735
  0.093508	  1.916581	  0.485306
  0.085656	  1.905675	  0.469019
  0.077305	  1.899013	  0.450238
  0.071053	  1.893359	  0.431202
  0.065690	  1.888672	  0.415194
  0.056718	  1.880866	  0.399499
  0.050173	  1.873239	  0.382811
  0.038913	  1.865504	  0.361638
  0.030596	  1.863193	  0.347346
  0.022558	  1.859637	  0.331027
  0.007351	  1.853561	  0.321710
 -0.008254	  1.841836	  0.297684
 -0.008265	  1.841284	  0.287544
 -0.044439	  1.825729	  0.309510
 -0.039617	  1.814683	  0.270179
 -0.107281	  1.776342	  0.291855
 -0.076450	  1.810611	  0.299104
 -0.019890	  2.038598	  0.431613
  0.075170	  2.217940	  0.365601
  0.058898	  2.139567	  0.350253
  0.143839	  2.231800	  0.452789
 -0.456497	  1.825767	  0.363341
 -0.204627	  2.014533	  0.279505
 -0.074261	  2.185055	  0.151650
 -0.072748	  2.119263	  0.120273
  0.043679	  2.171181	  0.160849
  0.032155	  2.041667	  0.099619
  0.099730	  2.177256	  0.088857
  0.026684	  1.984190	  0.051354
  0.041435	  1.982540	  0.037234
  0.071647	  2.069720	  0.071186
 -0.003858	  2.026435	 -0.038042
  0.026140	  2.062089	  0.002211
  0.015905	  2.048367	 -0.018114
  0.005296	  2.066330	 -0.035732
 -0.000543	  2.075773	 -0.045246
 -0.009936	  2.092504	 -0.059758
 -0.015761	  2.107253	 -0.069490
 -0.021687	  2.119605	 -0.078099
 -0.024707	  2.133806	 -0.086933
 -0.032581	  2.148582	 -0.096511
 -0.039052	  2.164470	 -0.105365
 -0.047617	  2.181495	 -0.114837
 -0.051465	  2.198211	 -0.123772
 -0.058166	  2.212317	 -0.136281
 -0.066973	  2.223292	 -0.148630
 -0.084799	  2.240846	 -0.157253
 -0.095325	  2.259827	 -0.162109
 -0.106733	  2.270476	 -0.165601
 -0.111976	  2.283978	 -0.175089
 -0.120572	  2.295831	 -0.187609
 -0.127715	  2.307092	 -0.199431
 -0.137346	  2.319104	 -0.210579
 -0.147066	  2.331496	 -0.223311
 -0.155064	  2.345407	 -0.235981
 -0.164426	  2.357927	 -0.249817
 -0.169193	  2.362705	 -0.266687
 -0.177663	  2.366718	 -0.285010
 -0.187075	  2.370315	 -0.296697
 -0.200565	  2.376634	 -0.307109
 -0.216662	  2.384734	 -0.313919
 -0.232913	  2.388560	 -0.326287
 -0.248350	  2.392077	 -0.342939
 -0.254871	  2.397365	 -0.362669
 -0.259183	  2.394782	 -0.383471
 -0.265058	  2.395164	 -0.401021
 -0.275178	  2.394336	 -0.413106
 -0.289394	  2.394669	 -0.422148
 -0.304173	  2.393495	 -0.436156
 -0.317093	  2.388395	 -0.452976
 -0.327039	  2.385604	 -0.469169
 -0.337855	  2.382662	 -0.487111
 -0.347304	  2.378545	 -0.502632
 -0.356123	  2.371990	 -0.516723
 -0.364312	  2.366626	 -0.531011
 -0.374296	  2.360768	 -0.546724
 -0.382652	  2.354057	 -0.559876
 -0.391403	  2.344519	 -0.575791
 -0.400253	  2.334912	 -0.591213
 -0.408305	  2.326432	 -0.606502
 -0.418078	  2.315417	 -0.621560
 -0.426119	  2.307644	 -0.637442
 -0.436231	  2.297330	 -0.652154
 -0.442593	  2.287324	 -0.665796
 -0.449037	  2.275297	 -0.679898
 -0.456408	  2.265875	 -0.694537
 -0.463452	  2.254690	 -0.708307
 -0.467983	  2.241895	 -0.721229
 -0.476320	  2.230057	 -0.738887
 -0.489430	  2.223836	 -0.762872
 -0.497596	  2.218324	 -0.778954
 -0.509014	  2.209108	 -0.801027
 -0.516725	  2.208984	 -0.821284
 -0.524772	  2.209397	 -0.838565
 -0.532838	  2.209946	 -0.856547
 -0.542135	  2.210261	 -0.875070
 -0.549041	  2.211359	 -0.892164
 -0.559331	  2.209821	 -0.911082
 -0.565604	  2.211661	 -0.928197
 -0.576108	  2.209764	 -0.945906
 -0.583729	  2.210492	 -0.963449
 -0.592061	  2.210089	 -0.979826
 -0.601305	  2.209185	 -0.997092
 -0.612712	  2.206796	 -1.014413
 -0.620025	  2.207804	 -1.031345
 -0.630066	  2.205652	 -1.050308
 -0.638925	  2.204723	 -1.069360
 -0.647409	  2.204630	 -1.089042
 -0.655750	  2.203322	 -1.108369
 -0.662763	  2.202590	 -1.127603
 -0.670024	  2.201924	 -1.147508
 -0.677579	  2.200723	 -1.166877
 -0.683241	  2.201385	 -1.185036
 -0.689584	  2.201573	 -1.205012
 -0.695770	  2.201460	 -1.223597
 -0.702629	  2.201442	 -1.241655
 -0.709504	  2.202531	 -1.260389
 -0.717518	  2.202194	 -1.279819
 -0.723287	  2.204337	 -1.298253
 -0.731677	  2.203778	 -1.315845
 -0.738386	  2.205924	 -1.334901
 -0.747278	  2.205500	 -1.353453
 -0.753661	  2.207484	 -1.371207
 -0.762653	  2.208336	 -1.392081
 -0.764081	  2.215889	 -1.416054
 -0.750230	  2.238323	 -1.436862
 -0.757896	  2.240059	 -1.455253
