  0.618392	 -2.931339	 -0.453587
  0.612269	 -2.902316	 -0.449096
  0.595070	 -2.854318	 -0.439010
  0.579597	 -2.807900	 -0.421966
  0.554318	 -2.766289	 -0.411166
  0.536713	 -2.722873	 -0.396608
  0.514442	 -2.677890	 -0.384535
  0.495245	 -2.631761	 -0.375833
  0.476978	 -2.586344	 -0.369210
  0.456932	 -2.538944	 -0.366514
  0.437369	 -2.491054	 -0.367853
  0.419150	 -2.445377	 -0.367375
  0.401416	 -2.401385	 -0.363515
  0.384184	 -2.356182	 -0.353425
  0.368119	 -2.310652	 -0.340249
  0.352219	 -2.264882	 -0.325872
  0.336374	 -2.215669	 -0.309755
  0.323316	 -2.166913	 -0.295618
  0.311989	 -2.119144	 -0.283685
  0.299542	 -2.071987	 -0.274042
  0.285991	 -2.026363	 -0.265501
  0.271709	 -1.980780	 -0.256316
  0.257322	 -1.935044	 -0.245014
  0.244202	 -1.888213	 -0.231536
  0.231421	 -1.840578	 -0.217911
  0.218176	 -1.793774	 -0.204173
  0.204524	 -1.749910	 -0.190793
  0.190732	 -1.706817	 -0.176803
  0.180185	 -1.660761	 -0.160314
  0.170751	 -1.610562	 -0.146340
  0.157373	 -1.560781	 -0.136930
  0.141943	 -1.512386	 -0.130778
  0.124923	 -1.464587	 -0.127312
  0.106024	 -1.417583	 -0.126610
  0.083917	 -1.370539	 -0.128640
  0.060596	 -1.325880	 -0.130097
  0.037297	 -1.282969	 -0.129187
  0.013198	 -1.238721	 -0.125050
 -0.009958	 -1.196841	 -0.116695
 -0.033558	 -1.156688	 -0.104163
 -0.058602	 -1.115824	 -0.089312
 -0.082943	 -1.072140	 -0.075601
 -0.104782	 -1.025769	 -0.064041
 -0.122831	 -0.979095	 -0.055700
 -0.137490	 -0.930581	 -0.049273
 -0.148407	 -0.879149	 -0.042057
 -0.156414	 -0.829733	 -0.034395
 -0.162961	 -0.782777	 -0.026342
 -0.169343	 -0.735135	 -0.017261
 -0.176685	 -0.686312	 -0.006389
 -0.187084	 -0.637273	  0.007500
 -0.201394	 -0.588083	  0.023629
 -0.218052	 -0.542610	  0.039400
 -0.236873	 -0.499770	  0.054280
 -0.257879	 -0.457977	  0.068134
 -0.281658	 -0.415614	  0.081072
 -0.306031	 -0.373754	  0.093215
 -0.331129	 -0.330788	  0.105699
 -0.356333	 -0.288244	  0.118043
 -0.379859	 -0.247843	  0.128916
 -0.402424	 -0.204321	  0.139464
 -0.421299	 -0.160043	  0.149820
 -0.437878	 -0.112125	  0.161519
 -0.451540	 -0.065440	  0.173563
 -0.464002	 -0.017714	  0.185852
 -0.475664	  0.030327	  0.197096
 -0.487357	  0.078387	  0.206198
 -0.500420	  0.124739	  0.211454
 -0.516241	  0.171517	  0.215369
 -0.533918	  0.218329	  0.221490
 -0.553655	  0.266334	  0.229979
 -0.573527	  0.310799	  0.240152
 -0.593419	  0.354447	  0.251135
 -0.612524	  0.399749	  0.261875
 -0.628869	  0.444177	  0.271005
 -0.645497	  0.491125	  0.278841
 -0.662583	  0.537241	  0.284395
 -0.681060	  0.583969	  0.288460
 -0.701599	  0.631081	  0.291338
 -0.723938	  0.676429	  0.294815
 -0.746756	  0.720623	  0.300370
 -0.769853	  0.763720	  0.308225
 -0.793873	  0.806407	  0.318328
 -0.816383	  0.848724	  0.332011
 -0.835970	  0.889654	  0.346808
 -0.855067	  0.933951	  0.361787
 -0.873908	  0.981677	  0.375225
 -0.892199	  1.028622	  0.386099
 -0.910533	  1.074509	  0.394633
 -0.928096	  1.117567	  0.400289
 -0.946214	  1.162458	  0.404238
 -0.964236	  1.209718	  0.407140
 -0.980456	  1.257523	  0.409080
 -0.995146	  1.308570	  0.411332
 -1.007620	  1.357983	  0.414454
 -1.020162	  1.406916	  0.419241
 -1.033423	  1.452534	  0.426541
 -1.049043	  1.497709	  0.436246
 -1.066549	  1.544434	  0.448035
 -1.082836	  1.592152	  0.461248
 -1.098321	  1.639663	  0.475505
 -1.113247	  1.683529	  0.489645
 -1.128614	  1.726654	  0.504319
 -1.146485	  1.772322	  0.520237
 -1.164590	  1.817835	  0.535994
 -1.181600	  1.860667	  0.550141
 -1.201035	  1.905602	  0.562770
 -1.218968	  1.949094	  0.571756
 -1.235467	  1.994046	  0.579835
 -1.251758	  2.038408	  0.591743
 -1.270384	  2.084823	  0.605123
 -1.286826	  2.130827	  0.617078
 -1.301863	  2.176576	  0.630730
 -1.316067	  2.222763	  0.644117
 -1.329840	  2.267584	  0.655832
 -1.345677	  2.312671	  0.666464
 -1.366146	  2.356938	  0.675039
 -1.387990	  2.402907	  0.680739
 -1.408517	  2.449929	  0.682220
 -1.423935	  2.497847	  0.683645
 -1.427790	  2.547705	  0.686015
 -1.442068	  2.573182	  0.692875
