 -2.521325	 -1.475232	 -0.804680
 -2.496362	 -1.460625	 -0.796713
 -2.455010	 -1.463830	 -0.761817
 -2.410828	 -1.476213	 -0.737280
 -2.376336	 -1.487750	 -0.702386
 -2.332256	 -1.501171	 -0.683602
 -2.289908	 -1.512123	 -0.660382
 -2.247662	 -1.526178	 -0.635021
 -2.206654	 -1.538742	 -0.607282
 -2.168096	 -1.550077	 -0.577042
 -2.131269	 -1.560373	 -0.545670
 -2.095146	 -1.571191	 -0.513513
 -2.060983	 -1.582897	 -0.479989
 -2.027484	 -1.590663	 -0.445406
 -1.992935	 -1.600158	 -0.411745
 -1.957429	 -1.611223	 -0.380489
 -1.920342	 -1.622418	 -0.349895
 -1.882128	 -1.631953	 -0.319345
 -1.842616	 -1.639857	 -0.288829
 -1.802061	 -1.646750	 -0.259153
 -1.761314	 -1.653774	 -0.231075
 -1.721487	 -1.663027	 -0.206726
 -1.679535	 -1.677415	 -0.185543
 -1.637402	 -1.693803	 -0.164708
 -1.594975	 -1.710340	 -0.142390
 -1.552133	 -1.724273	 -0.116810
 -1.510207	 -1.734574	 -0.087170
 -1.470741	 -1.742417	 -0.056481
 -1.433177	 -1.748525	 -0.025242
 -1.396296	 -1.753588	  0.007116
 -1.359726	 -1.757829	  0.040781
 -1.324385	 -1.761569	  0.073288
 -1.288028	 -1.765782	  0.104470
 -1.251693	 -1.771342	  0.137438
 -1.217652	 -1.779807	  0.175397
 -1.185176	 -1.790376	  0.216102
 -1.151798	 -1.799296	  0.247133
 -1.115881	 -1.806576	  0.267230
 -1.063962	 -1.817035	  0.281634
 -1.015272	 -1.831360	  0.304293
 -0.977333	 -1.842115	  0.337880
 -0.944040	 -1.849987	  0.374709
 -0.913981	 -1.859032	  0.411031
 -0.882641	 -1.870615	  0.447396
 -0.848734	 -1.883366	  0.482770
 -0.811521	 -1.896428	  0.516196
 -0.772106	 -1.909567	  0.546057
 -0.730909	 -1.922843	  0.573490
 -0.690981	 -1.936094	  0.597981
 -0.651476	 -1.950135	  0.621231
 -0.611370	 -1.964984	  0.644941
 -0.571007	 -1.979357	  0.671002
 -0.530933	 -1.991089	  0.698887
 -0.491271	 -2.000845	  0.728094
 -0.451707	 -2.009635	  0.758640
 -0.412474	 -2.018426	  0.789816
 -0.374850	 -2.027507	  0.820116
 -0.338095	 -2.037433	  0.850014
 -0.300258	 -2.049112	  0.880725
 -0.262005	 -2.062335	  0.911132
 -0.223896	 -2.076893	  0.940516
 -0.187363	 -2.091229	  0.967570
 -0.148206	 -2.104398	  0.995896
 -0.106928	 -2.114505	  1.024443
 -0.065542	 -2.121397	  1.052210
 -0.024205	 -2.125632	  1.078977
  0.017124	 -2.128148	  1.104703
  0.058603	 -2.129496	  1.130656
  0.101527	 -2.131234	  1.159099
  0.142670	 -2.133745	  1.188503
  0.180426	 -2.137184	  1.217470
  0.218432	 -2.142462	  1.246124
  0.258973	 -2.150238	  1.274853
  0.298876	 -2.160232	  1.301153
  0.340239	 -2.172969	  1.326758
  0.381110	 -2.188873	  1.351599
  0.422716	 -2.205941	  1.377509
  0.459545	 -2.220636	  1.407008
  0.496184	 -2.228913	  1.436913
  0.534685	 -2.239526	  1.466285
  0.572523	 -2.243652	  1.501965
  0.609328	 -2.259750	  1.535209
  0.644625	 -2.272552	  1.568071
  0.685386	 -2.283749	  1.593765
  0.721143	 -2.292597	  1.627204
  0.761481	 -2.296983	  1.655446
  0.799754	 -2.310995	  1.678416
  0.831723	 -2.324044	  1.705009
  0.840040	 -2.347284	  1.722059
