 0.0 0.0 0.0 0
 0.5095862088191573 -0.4025131142224422 0.7610486769322112 1000
 -0.06550269520820018 -0.516215341334556 -0.8544449182313095 1000
 -0.5974593909100735 -0.5697551957177625 0.564717002724354 1000
 0.5121669010842103 0.787584383205887 0.34313686010686634 1000
 0.04962394587592028 0.8584261816528753 -0.510335139539272 1000
 -0.9024448200236818 -0.3250966495382848 0.28304860937903614 1000
 0.27825493869476736 -0.9593166733601746 0.03609306450191199 1000
 0.24033658504551375 0.6263565108670128 0.7423421362034907 1000
 0.0 0.0 0.0 0
 -0.3585433971945774 0.5507798721792238 -0.7538349718143946 1000
 0.36403622463549135 0.9070467067264455 -0.2119478685192366 1000
 -0.4535510334237577 0.6429818797431409 0.616574214837288 1000
 -0.6268343920188688 -0.6206279189856465 -0.47017191659847235 1000
 0.18453715594077122 -0.07226389401827243 0.980262193343499 1000
 -0.3586186699965293 -0.40899348595788587 0.8392234374550895 1000
 -0.32644029443029116 -0.8885113385749484 -0.32172711324353453 1000
 0.7608788666255807 -0.09954976381586267 0.642338068968964 1000
 0.0 0.0 0.0 0
 -0.12679263362807214 -0.9266080552885496 0.35367236240909405 1000
 0.6949230007437994 -0.6144560771123098 -0.3728615726204356 1000
