  1.690295	 -1.786069	 -0.809892
  1.689992	 -1.794666	 -0.803964
  1.691131	 -1.762366	 -0.826234
  1.692616	 -1.722346	 -0.855054
  1.693547	 -1.682886	 -0.885165
  1.693354	 -1.643335	 -0.917359
  1.691273	 -1.605483	 -0.950462
  1.687845	 -1.572040	 -0.983223
  1.684518	 -1.542772	 -1.017964
  1.680064	 -1.511613	 -1.058953
  1.672667	 -1.474731	 -1.103135
  1.663626	 -1.433912	 -1.143464
  1.654934	 -1.392898	 -1.178265
  1.647260	 -1.351691	 -1.209471
  1.640884	 -1.310492	 -1.237005
  1.635386	 -1.268768	 -1.262637
  1.629569	 -1.227217	 -1.287032
  1.621953	 -1.188427	 -1.315632
  1.615231	 -1.149281	 -1.343793
  1.611117	 -1.111470	 -1.369685
  1.609454	 -1.075824	 -1.396088
  1.609562	 -1.040751	 -1.424173
  1.610971	 -1.005562	 -1.453804
  1.613403	 -0.968257	 -1.485850
  1.615677	 -0.928344	 -1.519672
  1.616564	 -0.886355	 -1.553836
  1.615735	 -0.843248	 -1.587548
  1.613091	 -0.798172	 -1.620687
  1.608492	 -0.751252	 -1.651493
  1.602049	 -0.704058	 -1.680024
  1.593999	 -0.658095	 -1.706443
  1.585394	 -0.616311	 -1.730113
  1.577933	 -0.577886	 -1.752405
  1.572571	 -0.538911	 -1.775737
  1.568512	 -0.498666	 -1.800439
  1.565263	 -0.457840	 -1.826312
  1.561463	 -0.417240	 -1.854805
  1.556105	 -0.375044	 -1.885046
  1.548455	 -0.330180	 -1.914170
  1.538280	 -0.287599	 -1.943925
  1.525782	 -0.248636	 -1.975420
  1.511942	 -0.213363	 -2.007057
  1.499806	 -0.180650	 -2.037086
  1.491224	 -0.148984	 -2.066064
  1.480691	 -0.092150	 -2.120637
  1.479080	 -0.081414	 -2.131214
