  1.808610	 -1.643601	 -0.263255
  1.801736	 -1.657929	 -0.261908
  1.813711	 -1.640249	 -0.261735
  1.819402	 -1.621497	 -0.263142
  1.825929	 -1.604148	 -0.267683
  1.832717	 -1.584393	 -0.270864
  1.841232	 -1.566664	 -0.271764
  1.852228	 -1.549703	 -0.272950
  1.861720	 -1.531094	 -0.273462
  1.866925	 -1.512713	 -0.277232
  1.873645	 -1.494591	 -0.283220
  1.880119	 -1.474873	 -0.287020
  1.890472	 -1.458857	 -0.287282
  1.902247	 -1.442078	 -0.289202
  1.911735	 -1.424343	 -0.291119
  1.919448	 -1.406771	 -0.295483
  1.929288	 -1.389144	 -0.299608
  1.938244	 -1.369340	 -0.299021
  1.947195	 -1.351385	 -0.297473
  1.957224	 -1.336716	 -0.300286
  1.968407	 -1.320541	 -0.303835
  1.979453	 -1.302946	 -0.306115
  1.989825	 -1.285906	 -0.307776
  1.999602	 -1.268977	 -0.310345
  2.009820	 -1.251127	 -0.313577
  2.019648	 -1.234337	 -0.316236
  2.030757	 -1.217889	 -0.315536
  2.041620	 -1.200274	 -0.316630
  2.053268	 -1.182665	 -0.317248
  2.064540	 -1.168348	 -0.313979
  2.075412	 -1.150871	 -0.314088
  2.086430	 -1.132174	 -0.316492
  2.096594	 -1.118403	 -0.313290
  2.106431	 -1.100344	 -0.313689
  2.117251	 -1.081197	 -0.314823
  2.126392	 -1.065590	 -0.312506
  2.134938	 -1.048226	 -0.310752
  2.145781	 -1.027621	 -0.308945
  2.155860	 -1.011266	 -0.305341
  2.163177	 -0.995830	 -0.300199
  2.170613	 -0.977138	 -0.296303
  2.177716	 -0.958028	 -0.293500
  2.184662	 -0.939458	 -0.290878
  2.190577	 -0.920457	 -0.288882
  2.196346	 -0.901403	 -0.286974
  2.202255	 -0.882359	 -0.285418
  2.208518	 -0.863457	 -0.284852
  2.215291	 -0.844982	 -0.285670
  2.223059	 -0.826361	 -0.286929
  2.230782	 -0.807036	 -0.287756
  2.237565	 -0.788970	 -0.289588
  2.242784	 -0.768560	 -0.286892
  2.248684	 -0.750081	 -0.283595
  2.257035	 -0.732238	 -0.280065
  2.265306	 -0.713998	 -0.278273
  2.272721	 -0.695395	 -0.277771
  2.280238	 -0.676980	 -0.276620
  2.288588	 -0.659242	 -0.273231
  2.296037	 -0.640297	 -0.268797
  2.300837	 -0.620205	 -0.267480
  2.308982	 -0.603521	 -0.269214
  2.319022	 -0.585972	 -0.268823
  2.326606	 -0.565269	 -0.268938
  2.331122	 -0.545828	 -0.266685
  2.339523	 -0.529789	 -0.261563
  2.348784	 -0.511613	 -0.259098
  2.356854	 -0.492962	 -0.257630
  2.364533	 -0.474933	 -0.254237
  2.373382	 -0.457694	 -0.248804
  2.381083	 -0.439257	 -0.244512
  2.389381	 -0.421307	 -0.243921
  2.399809	 -0.404406	 -0.242776
  2.410946	 -0.387139	 -0.239112
  2.419072	 -0.368634	 -0.235968
  2.427698	 -0.351292	 -0.235657
  2.438904	 -0.321924	 -0.232706
  2.447831	 -0.304158	 -0.230543
