 -0.684945	 -2.175015	  1.052845
 -0.684667	 -2.189237	  1.060559
 -0.700617	 -2.181087	  1.047895
 -0.707851	 -2.162755	  1.030732
 -0.706853	 -2.140987	  1.017509
 -0.704068	 -2.127648	  1.009652
 -0.700577	 -2.109928	  1.000741
 -0.697054	 -2.085973	  0.993673
 -0.696903	 -2.065839	  0.988693
 -0.696865	 -2.053468	  0.985217
 -0.696222	 -2.028335	  0.971613
 -0.698594	 -2.018508	  0.962294
 -0.701470	 -2.002318	  0.948788
 -0.704499	 -1.986388	  0.935124
 -0.706365	 -1.972965	  0.924697
 -0.709939	 -1.954900	  0.910655
 -0.713909	 -1.933512	  0.896882
 -0.715357	 -1.921075	  0.892347
 -0.716213	 -1.898560	  0.889228
 -0.714795	 -1.880338	  0.884422
 -0.715370	 -1.849639	  0.881607
 -0.716366	 -1.836225	  0.880876
 -0.720025	 -1.820356	  0.876091
 -0.725909	 -1.803227	  0.869832
 -0.731691	 -1.779816	  0.861173
 -0.734261	 -1.764211	  0.855904
 -0.738396	 -1.744982	  0.851775
 -0.742599	 -1.725606	  0.849513
 -0.745461	 -1.703208	  0.846822
 -0.748628	 -1.683114	  0.843543
 -0.757585	 -1.661542	  0.840478
 -0.759071	 -1.650466	  0.841667
 -0.759965	 -1.630329	  0.846154
 -0.764934	 -1.608544	  0.852516
 -0.769346	 -1.591944	  0.858315
 -0.769670	 -1.550692	  0.861866
 -0.768543	 -1.539505	  0.860168
 -0.768618	 -1.527901	  0.858259
 -0.763163	 -1.507321	  0.858109
 -0.758022	 -1.481133	  0.861455
 -0.753733	 -1.464516	  0.862885
 -0.747037	 -1.442680	  0.864334
 -0.745410	 -1.429777	  0.867126
 -0.745317	 -1.409403	  0.876040
 -0.750160	 -1.388773	  0.883811
 -0.753103	 -1.367126	  0.889554
 -0.750346	 -1.346699	  0.897774
 -0.731134	 -1.323642	  0.904146
 -0.713930	 -1.306980	  0.900288
 -0.705959	 -1.295037	  0.896703
 -0.702186	 -1.273308	  0.894925
 -0.698187	 -1.254688	  0.892169
 -0.694190	 -1.234413	  0.887760
 -0.687473	 -1.215234	  0.884134
 -0.680158	 -1.196231	  0.885826
 -0.673982	 -1.176680	  0.889218
 -0.666590	 -1.157177	  0.891493
 -0.657767	 -1.138413	  0.890277
 -0.649235	 -1.120418	  0.885968
 -0.642128	 -1.101875	  0.880353
 -0.635805	 -1.083207	  0.875058
 -0.628041	 -1.065265	  0.870251
 -0.618983	 -1.047490	  0.866102
 -0.609507	 -1.030380	  0.860587
 -0.600084	 -1.013755	  0.853527
 -0.591646	 -0.997196	  0.845935
 -0.583825	 -0.980259	  0.838484
 -0.576047	 -0.962979	  0.831877
 -0.567896	 -0.945699	  0.825365
 -0.560832	 -0.928131	  0.817504
 -0.554106	 -0.912643	  0.806617
 -0.549997	 -0.898675	  0.794735
 -0.544045	 -0.882582	  0.784356
 -0.528573	 -0.863966	  0.775143
 -0.519019	 -0.849035	  0.763455
 -0.514603	 -0.838936	  0.756525
 -0.507697	 -0.823547	  0.746271
 -0.496307	 -0.803918	  0.734451
 -0.487359	 -0.789245	  0.721745
 -0.480759	 -0.778943	  0.712770
 -0.474392	 -0.764636	  0.699088
 -0.468627	 -0.746335	  0.679317
 -0.465385	 -0.735636	  0.666591
 -0.464466	 -0.727903	  0.656623
 -0.461067	 -0.709135	  0.644544
 -0.455436	 -0.691181	  0.631984
 -0.450466	 -0.676467	  0.618869
 -0.445461	 -0.662225	  0.605440
 -0.441847	 -0.649243	  0.590661
 -0.440313	 -0.634344	  0.577301
 -0.440604	 -0.620516	  0.562840
 -0.440542	 -0.605775	  0.549285
 -0.439565	 -0.591783	  0.535111
 -0.438334	 -0.577270	  0.521441
 -0.437502	 -0.561946	  0.508656
 -0.436983	 -0.545797	  0.496823
 -0.436656	 -0.529379	  0.485408
 -0.436413	 -0.512634	  0.474473
 -0.436183	 -0.495796	  0.463685
 -0.435819	 -0.478719	  0.453292
 -0.435259	 -0.461473	  0.443165
 -0.434846	 -0.444214	  0.433048
 -0.434739	 -0.427077	  0.422748
 -0.434790	 -0.410003	  0.412352
 -0.434556	 -0.392765	  0.402200
 -0.434219	 -0.375489	  0.392127
 -0.433829	 -0.358270	  0.381964
 -0.433319	 -0.341112	  0.371700
 -0.432765	 -0.323838	  0.361652
 -0.432002	 -0.306601	  0.351607
 -0.430733	 -0.289981	  0.341482
 -0.425193	 -0.273627	  0.329936
 -0.417926	 -0.258169	  0.319781
 -0.416418	 -0.239752	  0.314856
 -0.425719	 -0.218874	  0.311390
 -0.436614	 -0.197140	  0.299043
 -0.438824	 -0.182666	  0.287827
 -0.437049	 -0.164263	  0.272197
 -0.428475	 -0.142864	  0.253780
 -0.427308	 -0.137720	  0.250370
 -0.423257	 -0.122147	  0.237430
 -0.421516	 -0.103632	  0.227819
 -0.412510	 -0.074410	  0.220042
 -0.408726	 -0.062900	  0.219398
 -0.403708	 -0.045879	  0.219354
 -0.397310	 -0.027771	  0.218749
 -0.387835	 -0.002877	  0.215453
 -0.383796	  0.018364	  0.209857
 -0.386069	  0.036163	  0.203748
 -0.396011	  0.056227	  0.194873
 -0.404436	  0.075524	  0.188485
 -0.405333	  0.094372	  0.186104
 -0.395737	  0.117078	  0.184691
 -0.380146	  0.134417	  0.180710
 -0.368250	  0.149527	  0.171903
 -0.364517	  0.167257	  0.159390
 -0.365480	  0.186950	  0.152031
 -0.367994	  0.211546	  0.144723
 -0.378861	  0.229233	  0.139762
 -0.391528	  0.246260	  0.132944
 -0.395470	  0.266304	  0.126648
 -0.393408	  0.282230	  0.123063
 -0.384575	  0.301413	  0.116950
 -0.376867	  0.322193	  0.108353
 -0.379049	  0.345381	  0.103650
 -0.387484	  0.364366	  0.098748
 -0.393297	  0.376296	  0.087209
 -0.396841	  0.392918	  0.073399
 -0.401091	  0.411746	  0.064203
 -0.406776	  0.428877	  0.053858
 -0.411025	  0.443489	  0.041653
 -0.412189	  0.460595	  0.030796
 -0.414985	  0.477620	  0.020011
 -0.418278	  0.494132	  0.008845
 -0.420583	  0.509150	 -0.001225
 -0.428848	  0.524383	 -0.004998
 -0.438173	  0.551114	 -0.007929
 -0.438782	  0.575687	 -0.021665
 -0.439435	  0.586727	 -0.032136
 -0.442377	  0.598501	 -0.042594
 -0.441654	  0.617519	 -0.067368
 -0.441135	  0.627130	 -0.082236
 -0.441453	  0.634084	 -0.095779
 -0.441748	  0.648792	 -0.119777
 -0.441934	  0.659126	 -0.131878
 -0.444295	  0.669871	 -0.143112
 -0.450130	  0.690214	 -0.164706
 -0.448561	  0.712131	 -0.177718
 -0.447873	  0.719392	 -0.181050
 -0.443876	  0.741685	 -0.190069
 -0.442459	  0.763168	 -0.203065
 -0.445520	  0.775720	 -0.210560
 -0.450712	  0.792905	 -0.220366
 -0.455893	  0.811013	 -0.232750
 -0.460511	  0.825919	 -0.243398
 -0.467016	  0.842157	 -0.253713
 -0.474134	  0.856993	 -0.263831
 -0.483224	  0.872041	 -0.277333
 -0.491477	  0.883761	 -0.288834
 -0.501485	  0.897087	 -0.300844
 -0.508827	  0.910061	 -0.311747
 -0.516125	  0.924548	 -0.323390
 -0.525523	  0.943714	 -0.333309
 -0.535191	  0.959962	 -0.348626
 -0.539165	  0.965686	 -0.370714
 -0.544721	  0.966096	 -0.389570
 -0.554794	  0.970819	 -0.408238
 -0.565009	  0.979799	 -0.423840
 -0.575572	  0.988724	 -0.438017
 -0.585780	  0.998452	 -0.452293
 -0.595384	  1.008924	 -0.466404
 -0.604142	  1.021540	 -0.479149
 -0.612924	  1.035123	 -0.490695
 -0.621626	  1.049226	 -0.500690
 -0.628286	  1.065505	 -0.504597
 -0.631548	  1.085272	 -0.503694
 -0.633139	  1.106212	 -0.506084
 -0.634780	  1.124319	 -0.511489
 -0.637099	  1.143709	 -0.512566
 -0.639419	  1.164629	 -0.511667
 -0.640275	  1.184995	 -0.514989
 -0.642599	  1.202774	 -0.520944
 -0.647223	  1.223192	 -0.521357
 -0.646350	  1.245709	 -0.522352
 -0.641998	  1.266784	 -0.527924
 -0.637589	  1.283944	 -0.539670
 -0.635921	  1.298657	 -0.553295
 -0.635835	  1.315145	 -0.564598
 -0.633550	  1.333982	 -0.572673
 -0.627635	  1.352892	 -0.578443
 -0.619491	  1.370933	 -0.583712
 -0.612751	  1.389485	 -0.589056
 -0.606921	  1.408701	 -0.592714
 -0.600915	  1.428027	 -0.597725
 -0.592906	  1.445894	 -0.603759
 -0.582712	  1.462132	 -0.609072
 -0.573026	  1.479298	 -0.612189
 -0.565490	  1.498015	 -0.611175
 -0.558985	  1.516674	 -0.609290
 -0.552298	  1.534888	 -0.608121
 -0.543228	  1.552002	 -0.607169
 -0.533054	  1.569159	 -0.606970
 -0.521753	  1.585228	 -0.606122
 -0.510540	  1.601328	 -0.604772
 -0.495204	  1.616393	 -0.602928
 -0.480780	  1.630591	 -0.603254
 -0.470955	  1.646602	 -0.605412
 -0.464041	  1.668091	 -0.616322
 -0.465153	  1.691029	 -0.629110
 -0.462759	  1.716294	 -0.633429
 -0.453706	  1.732526	 -0.628687
 -0.438037	  1.745192	 -0.616177
 -0.419861	  1.755439	 -0.605381
 -0.406579	  1.769857	 -0.606685
 -0.394909	  1.788654	 -0.610899
 -0.383796	  1.805045	 -0.613482
 -0.372948	  1.822928	 -0.614420
 -0.363648	  1.840302	 -0.616848
 -0.354316	  1.855007	 -0.619968
 -0.344832	  1.867126	 -0.618461
 -0.323533	  1.888454	 -0.608692
 -0.312403	  1.907437	 -0.600777
 -0.306752	  1.931174	 -0.591118
 -0.308505	  1.955201	 -0.593059
 -0.302890	  1.969121	 -0.602461
 -0.293985	  1.986537	 -0.606166
 -0.290176	  2.012838	 -0.616905
 -0.290328	  2.029464	 -0.634655
 -0.284857	  2.035919	 -0.650839
 -0.277243	  2.049886	 -0.663676
 -0.271483	  2.070001	 -0.667241
 -0.269109	  2.090160	 -0.671975
 -0.268008	  2.107254	 -0.683310
 -0.264990	  2.122472	 -0.695560
 -0.263485	  2.140456	 -0.704396
 -0.262289	  2.158592	 -0.712420
 -0.260688	  2.176742	 -0.720404
 -0.259261	  2.194883	 -0.728476
 -0.258806	  2.212937	 -0.736829
 -0.258220	  2.231105	 -0.745246
 -0.257774	  2.249288	 -0.753764
 -0.256116	  2.267507	 -0.762196
 -0.254763	  2.285706	 -0.770766
 -0.252310	  2.303997	 -0.779243
 -0.250870	  2.322071	 -0.788095
 -0.247404	  2.340117	 -0.796329
 -0.246699	  2.359901	 -0.806357
 -0.231530	  2.383930	 -0.814099
 -0.227869	  2.401788	 -0.822327
