  2.149560	 -1.256007	 -0.084890
  2.176553	 -1.263505	 -0.074964
  2.157864	 -1.264204	 -0.081493
  2.139663	 -1.258870	 -0.088177
  2.119489	 -1.252370	 -0.089497
  2.101536	 -1.249597	 -0.089444
  2.075968	 -1.250093	 -0.099951
  2.057585	 -1.250385	 -0.108752
  2.042914	 -1.248094	 -0.110135
  2.024678	 -1.244644	 -0.110218
  2.003687	 -1.246583	 -0.117519
  1.983608	 -1.245814	 -0.129527
  1.965963	 -1.239853	 -0.137844
  1.950468	 -1.230177	 -0.145036
  1.929724	 -1.218499	 -0.151208
  1.915441	 -1.214726	 -0.157781
  1.896133	 -1.215909	 -0.165530
  1.876554	 -1.214965	 -0.174166
  1.859327	 -1.210425	 -0.185789
  1.844071	 -1.203703	 -0.196731
  1.826069	 -1.198494	 -0.204259
  1.807548	 -1.198491	 -0.209877
  1.788998	 -1.198263	 -0.217950
  1.771100	 -1.195114	 -0.228056
  1.754776	 -1.187823	 -0.237878
  1.737246	 -1.179057	 -0.244187
  1.718939	 -1.174767	 -0.249303
  1.701195	 -1.171656	 -0.255798
  1.684946	 -1.165651	 -0.265477
  1.666405	 -1.152944	 -0.274788
  1.647439	 -1.142316	 -0.277912
  1.634232	 -1.137985	 -0.280310
  1.617618	 -1.130086	 -0.287311
  1.596444	 -1.115174	 -0.294267
  1.583473	 -1.109959	 -0.296525
  1.565287	 -1.102040	 -0.300886
  1.546979	 -1.087726	 -0.306273
  1.532508	 -1.079492	 -0.309175
  1.515727	 -1.071826	 -0.312942
  1.495764	 -1.058190	 -0.318475
  1.481038	 -1.048803	 -0.321468
  1.463636	 -1.042074	 -0.323541
  1.439026	 -1.036749	 -0.325416
  1.423025	 -1.031925	 -0.328018
  1.406553	 -1.023956	 -0.331840
  1.383044	 -1.015027	 -0.331043
  1.363087	 -1.009608	 -0.331030
  1.350818	 -1.004212	 -0.338845
  1.333562	 -0.996801	 -0.351602
  1.315398	 -0.991731	 -0.359358
  1.293897	 -0.985884	 -0.360176
  1.275056	 -0.976597	 -0.356768
  1.256747	 -0.966719	 -0.358527
  1.238959	 -0.957736	 -0.365319
  1.222612	 -0.950225	 -0.375616
  1.206122	 -0.942461	 -0.387099
  1.190106	 -0.939093	 -0.399381
  1.172859	 -0.934887	 -0.409448
  1.155451	 -0.934926	 -0.415521
  1.135590	 -0.930384	 -0.420964
  1.116804	 -0.927658	 -0.426205
  1.098597	 -0.922896	 -0.433168
  1.081926	 -0.917184	 -0.443129
  1.065659	 -0.912058	 -0.453082
  1.048054	 -0.911222	 -0.461240
  1.026079	 -0.907955	 -0.467090
  1.009449	 -0.899392	 -0.471460
  0.998249	 -0.884510	 -0.485256
  0.986589	 -0.872609	 -0.497493
  0.968185	 -0.863250	 -0.511718
  0.956443	 -0.861306	 -0.522852
  0.938068	 -0.858983	 -0.537702
  0.922128	 -0.853276	 -0.548935
  0.905014	 -0.850268	 -0.553280
  0.886397	 -0.845416	 -0.556547
  0.865160	 -0.835876	 -0.563655
  0.851994	 -0.826966	 -0.578551
  0.842564	 -0.822942	 -0.595055
  0.824007	 -0.818052	 -0.609088
  0.802914	 -0.812966	 -0.613958
  0.785815	 -0.811339	 -0.614854
  0.765392	 -0.813335	 -0.621313
  0.746581	 -0.813180	 -0.629104
  0.725112	 -0.808763	 -0.634051
  0.706807	 -0.808064	 -0.639526
  0.691006	 -0.811216	 -0.648667
  0.670001	 -0.810800	 -0.661398
  0.651441	 -0.805576	 -0.664396
  0.633444	 -0.801282	 -0.663055
  0.611391	 -0.800147	 -0.666831
  0.588265	 -0.796153	 -0.673266
  0.575078	 -0.793498	 -0.675830
  0.553243	 -0.791156	 -0.677462
  0.533319	 -0.786871	 -0.679065
  0.514632	 -0.781290	 -0.682349
  0.493253	 -0.779654	 -0.686999
  0.471517	 -0.778362	 -0.687749
  0.455685	 -0.773292	 -0.684832
  0.436134	 -0.762635	 -0.683496
  0.417895	 -0.753941	 -0.682903
  0.396522	 -0.753778	 -0.683549
  0.375832	 -0.756673	 -0.686262
  0.356855	 -0.754211	 -0.689584
  0.336389	 -0.747223	 -0.689058
  0.315082	 -0.743504	 -0.689905
  0.299491	 -0.743908	 -0.701923
  0.283619	 -0.742579	 -0.716565
  0.265892	 -0.743333	 -0.729349
  0.243401	 -0.740723	 -0.733337
  0.228275	 -0.733031	 -0.736144
  0.211450	 -0.724547	 -0.747307
  0.195899	 -0.721126	 -0.759870
  0.180886	 -0.717608	 -0.770907
  0.163089	 -0.708093	 -0.779532
  0.139984	 -0.701019	 -0.783110
  0.120333	 -0.704956	 -0.786078
  0.102396	 -0.708853	 -0.795522
  0.086091	 -0.705091	 -0.808933
  0.069464	 -0.697929	 -0.816512
  0.049451	 -0.693013	 -0.819652
  0.032692	 -0.682636	 -0.824061
  0.016665	 -0.666929	 -0.834523
  0.000251	 -0.656818	 -0.844362
 -0.015648	 -0.654987	 -0.846889
 -0.037524	 -0.651456	 -0.849438
 -0.056414	 -0.645075	 -0.854568
 -0.070319	 -0.633294	 -0.862106
 -0.087710	 -0.620229	 -0.871079
 -0.106206	 -0.616072	 -0.873881
 -0.125323	 -0.614248	 -0.871725
 -0.145870	 -0.609747	 -0.873745
 -0.161991	 -0.602968	 -0.883705
 -0.184281	 -0.596683	 -0.900076
 -0.204766	 -0.593155	 -0.904470
 -0.216585	 -0.589409	 -0.910345
 -0.235904	 -0.582793	 -0.911281
 -0.257680	 -0.580370	 -0.911163
 -0.277705	 -0.580725	 -0.913184
 -0.301532	 -0.583310	 -0.913279
 -0.322824	 -0.579330	 -0.916752
 -0.334660	 -0.575779	 -0.920023
 -0.356432	 -0.570869	 -0.918952
 -0.377949	 -0.566805	 -0.923240
 -0.396805	 -0.560652	 -0.931307
 -0.413291	 -0.553092	 -0.934936
 -0.434801	 -0.547437	 -0.935659
 -0.455985	 -0.545166	 -0.940324
 -0.471419	 -0.537685	 -0.947422
 -0.488342	 -0.526373	 -0.952097
 -0.503617	 -0.512987	 -0.953319
 -0.520542	 -0.501297	 -0.955374
 -0.537397	 -0.491085	 -0.958525
 -0.556034	 -0.484221	 -0.960961
 -0.575406	 -0.478854	 -0.964324
 -0.595592	 -0.475108	 -0.966494
 -0.614889	 -0.472064	 -0.961525
 -0.634617	 -0.472147	 -0.958556
 -0.656196	 -0.479299	 -0.959268
 -0.678931	 -0.476613	 -0.957164
 -0.692959	 -0.470896	 -0.947307
 -0.708845	 -0.470160	 -0.934802
 -0.725561	 -0.469207	 -0.925009
 -0.746008	 -0.470258	 -0.922583
 -0.764100	 -0.468820	 -0.918428
 -0.784072	 -0.470077	 -0.915851
 -0.801859	 -0.474933	 -0.917462
 -0.820040	 -0.486239	 -0.923724
 -0.836270	 -0.497055	 -0.929993
 -0.856924	 -0.498726	 -0.937744
 -0.870844	 -0.499642	 -0.945584
 -0.885450	 -0.510769	 -0.954736
 -0.906992	 -0.523867	 -0.963082
 -0.923384	 -0.520259	 -0.969429
 -0.941549	 -0.513038	 -0.977274
 -0.959890	 -0.516609	 -0.984547
 -0.979029	 -0.514330	 -0.988997
 -0.995444	 -0.502556	 -0.992130
 -1.010705	 -0.489794	 -0.997471
 -1.024898	 -0.476582	 -1.001104
 -1.039767	 -0.463449	 -1.003959
 -1.054762	 -0.450526	 -1.006590
 -1.069938	 -0.437813	 -1.009424
 -1.085630	 -0.426031	 -1.013224
 -1.101133	 -0.414239	 -1.017391
 -1.116552	 -0.402546	 -1.022421
 -1.131830	 -0.392336	 -1.029957
 -1.146696	 -0.381443	 -1.037502
 -1.161433	 -0.371566	 -1.046587
 -1.176147	 -0.362512	 -1.056781
 -1.190407	 -0.353975	 -1.068028
 -1.204379	 -0.344970	 -1.078262
 -1.218961	 -0.334032	 -1.086826
 -1.230323	 -0.321832	 -1.100897
 -1.238870	 -0.312869	 -1.119292
 -1.249452	 -0.310546	 -1.132954
 -1.264931	 -0.307034	 -1.146872
 -1.278483	 -0.304037	 -1.162719
 -1.287993	 -0.299083	 -1.182278
 -1.297821	 -0.292760	 -1.196416
 -1.312544	 -0.284260	 -1.209357
 -1.324561	 -0.270641	 -1.219984
 -1.335341	 -0.261075	 -1.232045
 -1.351218	 -0.254441	 -1.245675
 -1.366843	 -0.245958	 -1.257213
 -1.374159	 -0.236646	 -1.270881
 -1.385382	 -0.231245	 -1.285689
 -1.401965	 -0.220996	 -1.299470
 -1.412332	 -0.210186	 -1.310182
 -1.422576	 -0.204665	 -1.323019
 -1.442042	 -0.200881	 -1.333897
 -1.460893	 -0.191916	 -1.342024
 -1.470006	 -0.182032	 -1.352932
 -1.482346	 -0.175199	 -1.365595
 -1.500134	 -0.168731	 -1.376483
 -1.517552	 -0.162880	 -1.384814
 -1.534920	 -0.157057	 -1.392844
 -1.552633	 -0.151105	 -1.399975
 -1.570346	 -0.145152	 -1.407101
 -1.588169	 -0.138791	 -1.413572
 -1.606050	 -0.132129	 -1.419561
 -1.624019	 -0.125664	 -1.425506
 -1.642476	 -0.120453	 -1.431176
 -1.660937	 -0.115247	 -1.436843
 -1.679301	 -0.109755	 -1.442552
 -1.697620	 -0.104136	 -1.448280
 -1.715924	 -0.098537	 -1.454080
 -1.734168	 -0.093015	 -1.460136
 -1.752412	 -0.087502	 -1.466194
 -1.771498	 -0.084253	 -1.471201
 -1.790680	 -0.081336	 -1.476057
 -1.810103	 -0.078525	 -1.479903
 -1.829773	 -0.075866	 -1.482354
 -1.849442	 -0.073200	 -1.484811
 -1.868971	 -0.070502	 -1.488180
 -1.888467	 -0.067796	 -1.491727
 -1.907947	 -0.064754	 -1.495089
 -1.927359	 -0.060927	 -1.498004
 -1.946769	 -0.057096	 -1.500931
 -1.965867	 -0.053310	 -1.505505
 -1.984865	 -0.049537	 -1.510489
 -2.003865	 -0.045757	 -1.515478
 -2.022520	 -0.041138	 -1.521210
 -2.040860	 -0.036045	 -1.527352
