  0.068347	 -0.643894	  2.426862
  0.070889	 -0.634552	  2.417089
  0.072215	 -0.629678	  2.411989
  0.075725	 -0.618215	  2.398210
  0.081556	 -0.605210	  2.384401
  0.088533	 -0.592146	  2.371148
  0.097267	 -0.579055	  2.359100
  0.107927	 -0.565334	  2.348882
  0.122651	 -0.552919	  2.343454
  0.137421	 -0.540539	  2.338109
  0.152199	 -0.528162	  2.332784
  0.167566	 -0.515962	  2.328981
  0.184227	 -0.505111	  2.331001
  0.200717	 -0.494486	  2.332860
  0.217895	 -0.484204	  2.333575
  0.234728	 -0.475384	  2.335748
  0.253890	 -0.463236	  2.345515
  0.266542	 -0.452984	  2.352690
  0.275901	 -0.442936	  2.352046
  0.282657	 -0.432758	  2.345015
  0.291192	 -0.424187	  2.322921
  0.299722	 -0.414413	  2.308178
  0.305647	 -0.406582	  2.294058
  0.308838	 -0.396571	  2.276065
  0.315028	 -0.386611	  2.257663
  0.323223	 -0.387134	  2.240612
  0.331276	 -0.383528	  2.220681
  0.337538	 -0.372661	  2.201896
  0.341832	 -0.365382	  2.188625
  0.350097	 -0.358442	  2.170011
  0.356269	 -0.351439	  2.152433
  0.362264	 -0.343949	  2.134332
  0.369062	 -0.336877	  2.116879
  0.375744	 -0.330060	  2.099450
  0.381855	 -0.325421	  2.081367
  0.388007	 -0.322539	  2.061344
  0.394570	 -0.321052	  2.042775
  0.400558	 -0.319402	  2.023484
  0.406721	 -0.318787	  2.005143
  0.411583	 -0.314810	  1.983817
  0.410067	 -0.331951	  1.967296
  0.417020	 -0.319973	  1.952965
  0.419331	 -0.324476	  1.932850
  0.419250	 -0.328034	  1.914023
  0.419754	 -0.332807	  1.894667
  0.420379	 -0.336434	  1.875386
  0.421227	 -0.339043	  1.854670
  0.425851	 -0.342072	  1.834204
  0.428617	 -0.351827	  1.814739
  0.426491	 -0.360364	  1.798505
  0.422801	 -0.365970	  1.778110
  0.411259	 -0.371683	  1.757899
  0.401378	 -0.377692	  1.741281
  0.388798	 -0.386482	  1.727761
  0.375231	 -0.389690	  1.714528
  0.362435	 -0.392991	  1.699025
  0.351173	 -0.397955	  1.683092
  0.339115	 -0.402320	  1.667990
  0.326990	 -0.404792	  1.652335
  0.312611	 -0.410320	  1.638330
  0.301131	 -0.416124	  1.624634
  0.289584	 -0.417516	  1.607828
  0.278082	 -0.426000	  1.588454
  0.269736	 -0.429912	  1.572385
  0.259010	 -0.433466	  1.557301
  0.241585	 -0.431626	  1.546573
  0.224327	 -0.429935	  1.531679
  0.213120	 -0.430430	  1.516061
  0.200922	 -0.426645	  1.501637
  0.185574	 -0.423644	  1.489167
  0.171020	 -0.421148	  1.470953
  0.161061	 -0.410993	  1.457218
  0.147074	 -0.421229	  1.440511
  0.131210	 -0.418746	  1.433036
  0.116305	 -0.411945	  1.419172
  0.100557	 -0.407182	  1.407127
  0.084317	 -0.399636	  1.399182
  0.069528	 -0.390330	  1.387851
  0.058383	 -0.380462	  1.371936
  0.049381	 -0.371898	  1.357838
  0.033402	 -0.362612	  1.347757
  0.018534	 -0.349664	  1.341788
  0.002954	 -0.343267	  1.332267
 -0.013100	 -0.333783	  1.319921
 -0.029649	 -0.326272	  1.309766
 -0.048419	 -0.320240	  1.303804
 -0.062716	 -0.309808	  1.292511
 -0.069485	 -0.291748	  1.283921
 -0.082738	 -0.274846	  1.280499
 -0.094497	 -0.261213	  1.276777
 -0.109298	 -0.248455	  1.267015
 -0.121572	 -0.233738	  1.255084
 -0.135525	 -0.225993	  1.248054
 -0.150953	 -0.214000	  1.238911
 -0.162817	 -0.201751	  1.230038
 -0.173821	 -0.190326	  1.218624
 -0.187886	 -0.176993	  1.207704
 -0.197729	 -0.159774	  1.202212
 -0.198349	 -0.142327	  1.191021
 -0.200767	 -0.123357	  1.181885
 -0.206881	 -0.104782	  1.171905
 -0.214055	 -0.088959	  1.163634
 -0.219854	 -0.082041	  1.142650
 -0.216277	 -0.085639	  1.123459
 -0.220588	 -0.075379	  1.114273
 -0.217806	 -0.060456	  1.095448
 -0.202672	 -0.059286	  1.078549
 -0.185641	 -0.054704	  1.066946
 -0.166857	 -0.053577	  1.061583
 -0.144989	 -0.049462	  1.056084
 -0.130072	 -0.045038	  1.044166
 -0.114517	 -0.045088	  1.031074
 -0.099043	 -0.041590	  1.018222
 -0.082491	 -0.039811	  1.008159
 -0.066730	 -0.038031	  0.996133
 -0.050249	 -0.033373	  0.982518
 -0.034603	 -0.031776	  0.973125
 -0.017484	 -0.027911	  0.962034
 -0.001311	 -0.022205	  0.949382
  0.012593	 -0.018071	  0.937493
  0.027740	 -0.013330	  0.925351
  0.043891	 -0.009756	  0.912881
  0.059377	 -0.005972	  0.900880
  0.075925	 -0.002362	  0.889906
  0.090558	  0.005207	  0.878503
  0.106745	  0.014052	  0.865780
  0.117682	  0.020982	  0.850411
  0.126758	  0.023934	  0.833153
  0.132964	  0.033126	  0.811689
  0.146299	  0.041087	  0.799468
  0.159530	  0.050824	  0.786842
  0.167798	  0.062352	  0.771443
  0.174448	  0.075057	  0.757238
  0.176681	  0.088003	  0.741981
  0.183903	  0.095606	  0.723388
  0.187362	  0.108600	  0.708128
  0.192298	  0.127783	  0.695458
  0.191091	  0.139444	  0.682210
  0.195231	  0.148995	  0.663835
  0.195705	  0.161914	  0.649828
  0.195507	  0.179553	  0.635199
  0.194952	  0.193705	  0.619439
  0.195768	  0.205250	  0.607626
  0.195441	  0.217376	  0.590684
  0.194812	  0.230095	  0.573981
  0.197478	  0.242390	  0.561949
  0.202030	  0.254147	  0.547425
  0.205849	  0.265120	  0.530199
  0.211914	  0.276560	  0.515734
  0.219859	  0.287508	  0.501059
  0.224395	  0.297677	  0.484256
  0.231430	  0.307204	  0.468018
  0.238909	  0.320832	  0.454251
  0.245329	  0.332205	  0.439212
  0.249662	  0.340820	  0.422173
  0.254064	  0.351716	  0.405525
  0.254799	  0.364894	  0.386068
  0.256863	  0.370451	  0.370396
  0.262035	  0.379895	  0.352564
  0.266823	  0.390373	  0.336257
  0.267596	  0.403166	  0.319446
  0.267711	  0.416121	  0.302857
  0.269403	  0.430115	  0.286696
  0.272492	  0.439616	  0.273771
  0.275072	  0.450766	  0.257068
  0.280886	  0.464388	  0.239832
  0.288117	  0.477470	  0.224194
  0.288637	  0.490293	  0.209678
  0.284779	  0.501877	  0.195110
  0.285702	  0.513463	  0.178646
  0.284970	  0.529799	  0.162773
  0.287493	  0.541079	  0.149693
  0.286064	  0.556054	  0.134135
  0.284181	  0.569061	  0.119316
  0.278752	  0.577726	  0.103957
  0.270811	  0.592955	  0.082764
  0.266347	  0.597545	  0.065372
  0.256318	  0.596428	  0.045342
  0.254551	  0.606245	  0.042347
  0.257444	  0.638614	  0.023874
  0.236754	  0.639428	  0.013414
  0.218396	  0.642688	  0.001843
  0.207005	  0.641755	 -0.013923
  0.194418	  0.637187	 -0.029778
  0.185179	  0.629590	 -0.046968
  0.173025	  0.631854	 -0.065154
  0.162213	  0.633652	 -0.079104
  0.148068	  0.634633	 -0.094440
  0.135028	  0.638463	 -0.111608
  0.126377	  0.640247	 -0.128905
  0.117417	  0.640552	 -0.146157
  0.104518	  0.639901	 -0.160388
  0.094947	  0.645596	 -0.180041
  0.090750	  0.649939	 -0.198473
  0.078915	  0.652440	 -0.214662
  0.073056	  0.657621	 -0.231843
  0.063891	  0.658939	 -0.249501
  0.057489	  0.658933	 -0.264880
  0.048076	  0.663319	 -0.285928
  0.038971	  0.669114	 -0.308321
  0.029666	  0.666867	 -0.322270
  0.038560	  0.682053	 -0.338469
  0.051555	  0.709285	 -0.354373
  0.044330	  0.719859	 -0.371098
  0.051568	  0.724970	 -0.379783
  0.052822	  0.736038	 -0.401640
  0.053012	  0.736223	 -0.420073
  0.062763	  0.744897	 -0.440683
  0.071930	  0.755447	 -0.458278
  0.070813	  0.768915	 -0.470920
  0.071066	  0.783902	 -0.485911
  0.075913	  0.797880	 -0.499441
  0.082314	  0.809104	 -0.511113
  0.091594	  0.825372	 -0.519141
  0.099666	  0.843182	 -0.529108
  0.106764	  0.858150	 -0.541780
  0.115999	  0.871028	 -0.550650
  0.126358	  0.887283	 -0.558923
  0.136249	  0.902648	 -0.564418
  0.147593	  0.918351	 -0.572169
  0.156318	  0.934670	 -0.579864
  0.165947	  0.950204	 -0.588095
  0.173906	  0.966780	 -0.596131
  0.183379	  0.982676	 -0.604188
  0.190410	  1.000597	 -0.611030
  0.197017	  1.019492	 -0.615913
  0.202907	  1.038103	 -0.620092
  0.207414	  1.057240	 -0.623943
  0.213662	  1.075777	 -0.628097
  0.218156	  1.094934	 -0.631924
  0.224387	  1.113454	 -0.636083
  0.228456	  1.132492	 -0.640254
  0.234383	  1.150721	 -0.644282
  0.242615	  1.167152	 -0.646086
  0.252197	  1.186288	 -0.646434
  0.261982	  1.201035	 -0.646998
  0.273657	  1.220942	 -0.646164
  0.289145	  1.231142	 -0.639783
  0.298241	  1.245804	 -0.640663
  0.313708	  1.265796	 -0.636873
  0.323614	  1.275421	 -0.635511
  0.341453	  1.283727	 -0.617946
  0.353967	  1.295901	 -0.611361
  0.366234	  1.316065	 -0.612917
  0.379818	  1.328832	 -0.605217
  0.398402	  1.345161	 -0.594845
  0.400075	  1.385973	 -0.667588
  0.393239	  1.402053	 -0.713872
  0.419135	  1.384586	 -0.630658
  0.435220	  1.402772	 -0.631219
  0.447973	  1.416534	 -0.627016
  0.431888	  1.421787	 -0.683861
  0.395909	  1.398288	 -0.727278
  0.487142	  1.447389	 -0.613814
  0.496156	  1.464277	 -0.639824
  0.502746	  1.466514	 -0.646722
  0.511077	  1.482260	 -0.671025
  0.452107	  1.467991	 -0.695962
  0.478739	  1.470265	 -0.682478
  0.503049	  1.504353	 -0.731426
  0.486491	  1.500802	 -0.744329
  0.469362	  1.499015	 -0.752660
  0.452715	  1.497306	 -0.763659
  0.436081	  1.495973	 -0.772349
  0.421590	  1.498002	 -0.790114
  0.415979	  1.507230	 -0.797930
  0.393031	  1.498886	 -0.813010
  0.386253	  1.510149	 -0.824414
  0.379017	  1.520057	 -0.841183
  0.369608	  1.532873	 -0.855519
  0.362007	  1.538456	 -0.874781
  0.357723	  1.544903	 -0.893770
  0.352207	  1.555977	 -0.907242
  0.345130	  1.566158	 -0.922978
  0.342688	  1.584981	 -0.938967
  0.343556	  1.591663	 -0.955865
  0.335013	  1.602420	 -0.968336
  0.330781	  1.616613	 -0.985169
  0.330768	  1.624691	 -1.004700
  0.338594	  1.639894	 -1.015659
  0.339850	  1.653552	 -1.031247
  0.338891	  1.664113	 -1.048286
  0.341819	  1.677342	 -1.061946
  0.350868	  1.689288	 -1.078630
  0.351824	  1.704400	 -1.093514
  0.348718	  1.716302	 -1.104716
  0.352346	  1.728881	 -1.121190
  0.355114	  1.744200	 -1.138294
  0.356852	  1.753245	 -1.155204
  0.355653	  1.767755	 -1.170605
  0.358452	  1.777307	 -1.190466
  0.359890	  1.788719	 -1.203090
  0.360522	  1.801784	 -1.218286
  0.355662	  1.814385	 -1.235224
  0.359619	  1.831829	 -1.244085
  0.361070	  1.841246	 -1.261178
  0.363753	  1.849259	 -1.279568
  0.365361	  1.864380	 -1.295024
  0.365325	  1.876809	 -1.311359
  0.362195	  1.891965	 -1.323025
  0.363288	  1.922324	 -1.348071
  0.367214	  1.935234	 -1.362833
