  0.395597	  2.075616	  1.364466
  0.412781	  2.091165	  1.370782
  0.395117	  2.075182	  1.364290
  0.359654	  2.045873	  1.349789
  0.321798	  2.017600	  1.332178
  0.284131	  1.990355	  1.312118
  0.247867	  1.966384	  1.290255
  0.211476	  1.944853	  1.266677
  0.174103	  1.921510	  1.243882
  0.135459	  1.893700	  1.224351
  0.095593	  1.858641	  1.208043
  0.057217	  1.816705	  1.194775
  0.023167	  1.773012	  1.184407
 -0.006831	  1.729887	  1.174424
 -0.034197	  1.687956	  1.163337
 -0.061004	  1.646511	  1.150998
 -0.087634	  1.606804	  1.137946
 -0.113048	  1.570117	  1.125113
 -0.139072	  1.528662	  1.110481
 -0.166825	  1.459588	  1.082708
 -0.152203	  1.360641	  1.024356
 -0.104909	  1.276024	  0.959211
 -0.070950	  1.237171	  0.912728
 -0.094983	  1.232111	  0.867826
 -0.159487	  1.235436	  0.768647
 -0.227259	  1.218029	  0.617869
 -0.274940	  1.134041	  0.469261
 -0.314133	  1.081915	  0.389118
 -0.338495	  1.057021	  0.356378
 -0.353160	  1.042689	  0.342807
 -0.363303	  1.033039	  0.340259
 -0.393531	  1.005947	  0.341508
 -0.448241	  0.960672	  0.356938
 -0.495607	  0.925362	  0.380322
 -0.531067	  0.901158	  0.404312
 -0.577697	  0.871079	  0.442106
 -0.641676	  0.833535	  0.492901
 -0.725888	  0.794952	  0.545143
 -0.817490	  0.757440	  0.587318
 -0.879433	  0.726942	  0.608931
 -0.920919	  0.702511	  0.617792
 -0.960996	  0.675314	  0.620429
 -1.001815	  0.645225	  0.618998
 -1.040885	  0.615613	  0.614770
 -1.080540	  0.585594	  0.608905
 -1.119650	  0.557528	  0.601636
 -1.160879	  0.528288	  0.590927
 -1.204502	  0.495185	  0.573590
 -1.248719	  0.458063	  0.547758
 -1.291403	  0.417913	  0.500855
 -1.329985	  0.375157	  0.416133
 -1.348485	  0.339677	  0.304789
 -1.348121	  0.317970	  0.220554
 -1.350227	  0.290369	  0.156902
 -1.356751	  0.244422	  0.097011
 -1.363258	  0.220447	  0.074576
 -1.428949	  0.200077	  0.091399
 -1.499890	  0.173214	  0.107796
 -1.578516	  0.134897	  0.121716
 -1.660632	  0.069113	  0.140260
 -1.731250	 -0.012511	  0.170303
 -1.783663	 -0.078235	  0.182222
 -1.818118	 -0.121796	  0.179638
 -1.849481	 -0.152508	  0.171028
 -1.883076	 -0.175977	  0.160481
 -1.921105	 -0.192232	  0.149902
 -1.973557	 -0.199994	  0.137597
 -2.057036	 -0.188771	  0.119019
 -2.157338	 -0.146336	  0.092066
 -2.208222	 -0.168561	  0.077349
 -2.209912	 -0.264430	  0.069226
 -2.193126	 -0.382099	  0.051228
 -2.188869	 -0.453125	  0.035712
 -2.200032	 -0.492164	  0.022651
 -2.224216	 -0.524153	  0.009336
 -2.256980	 -0.552227	 -0.006647
 -2.294610	 -0.579076	 -0.023686
 -2.333382	 -0.606295	 -0.039687
 -2.372877	 -0.634551	 -0.055478
 -2.422438	 -0.672575	 -0.075350
 -2.449550	 -0.694849	 -0.086431
