  1.437695	 -0.010725	  2.667174
  1.423460	 -0.010619	  2.640767
  1.441774	 -0.032420	  2.603254
  1.458843	 -0.057349	  2.566350
  1.473681	 -0.086105	  2.529154
  1.491046	 -0.112821	  2.491233
  1.503273	 -0.134824	  2.447324
  1.514045	 -0.162704	  2.407725
  1.528822	 -0.186466	  2.369366
  1.544733	 -0.210826	  2.331093
  1.558617	 -0.238488	  2.292329
  1.571650	 -0.265259	  2.251503
  1.586933	 -0.291134	  2.211786
  1.601531	 -0.314972	  2.173650
  1.613626	 -0.339260	  2.133961
  1.626164	 -0.365100	  2.093940
  1.640538	 -0.392052	  2.053717
  1.656996	 -0.420047	  2.013735
  1.674339	 -0.448565	  1.975714
  1.691733	 -0.476161	  1.939124
  1.708715	 -0.501763	  1.903036
  1.727295	 -0.526886	  1.864278
  1.747392	 -0.550211	  1.824319
  1.767883	 -0.572525	  1.784888
  1.788742	 -0.596165	  1.744978
  1.807843	 -0.621008	  1.707753
  1.826638	 -0.646107	  1.671800
  1.845442	 -0.672163	  1.635411
  1.864168	 -0.698501	  1.598680
  1.882371	 -0.725968	  1.560785
  1.897834	 -0.754788	  1.523162
  1.910665	 -0.785302	  1.485397
  1.922641	 -0.816079	  1.446568
  1.934842	 -0.844607	  1.408780
  1.948674	 -0.873097	  1.369330
  1.963279	 -0.900646	  1.329302
  1.977573	 -0.925843	  1.291868
  1.992800	 -0.951368	  1.255066
  2.010200	 -0.978913	  1.215220
  2.026267	 -1.004043	  1.173662
  2.041559	 -1.026767	  1.134525
  2.061015	 -1.045419	  1.095408
  2.074699	 -1.073420	  1.057719
  2.086985	 -1.096965	  1.014888
  2.100091	 -1.121246	  0.973562
  2.113463	 -1.149843	  0.936227
  2.123804	 -1.179047	  0.898958
  2.140999	 -1.207377	  0.862127
  2.159594	 -1.235398	  0.824707
  2.176078	 -1.264588	  0.787485
  2.191796	 -1.294258	  0.749683
  2.207720	 -1.322740	  0.711139
  2.223765	 -1.350131	  0.672345
  2.239206	 -1.376335	  0.633818
  2.254015	 -1.401650	  0.594293
  2.267747	 -1.425180	  0.554863
  2.281481	 -1.448789	  0.515074
  2.296039	 -1.473434	  0.473830
  2.311220	 -1.497629	  0.432110
  2.325757	 -1.519616	  0.391520
  2.340619	 -1.542636	  0.349317
  2.357801	 -1.568349	  0.308468
  2.377256	 -1.593514	  0.269763
  2.394900	 -1.617252	  0.232459
  2.406206	 -1.646350	  0.196063
  2.423445	 -1.671856	  0.157330
  2.444658	 -1.697539	  0.119290
  2.452614	 -1.726022	  0.074381
  2.477140	 -1.743283	  0.075125
