  2.399718	  0.339274	  0.150412
  2.417894	  0.345725	  0.156981
  2.436070	  0.352176	  0.163550
  2.419043	  0.345308	  0.154907
  2.400041	  0.341917	  0.149510
  2.380856	  0.339636	  0.144652
  2.361899	  0.336541	  0.138729
  2.343359	  0.332025	  0.132743
  2.325185	  0.327320	  0.126417
  2.308523	  0.321839	  0.117901
  2.290529	  0.316274	  0.108466
  2.274393	  0.312026	  0.099551
  2.252661	  0.310713	  0.093421
  2.232520	  0.308581	  0.091870
  2.213653	  0.303358	  0.086059
  2.199330	  0.295114	  0.076982
  2.183685	  0.285105	  0.067029
  2.171132	  0.272932	  0.058983
  2.155979	  0.261993	  0.052714
  2.141796	  0.250042	  0.045242
  2.134302	  0.234832	  0.038438
  2.126885	  0.217906	  0.031419
  2.125412	  0.197008	  0.029116
  2.130382	  0.178033	  0.027834
  2.132079	  0.159658	  0.022559
  2.128388	  0.140395	  0.019194
  2.124030	  0.119305	  0.018040
  2.124584	  0.100167	  0.015111
  2.132010	  0.077726	  0.011773
  2.131884	  0.057690	  0.011290
  2.129750	  0.036053	  0.015633
  2.121876	  0.019084	  0.018386
  2.115759	  0.000027	  0.016776
  2.112608	 -0.021356	  0.016597
  2.104202	 -0.039406	  0.019163
  2.095155	 -0.056361	  0.019826
  2.084747	 -0.074024	  0.020258
  2.075778	 -0.092756	  0.021134
  2.067463	 -0.110846	  0.021464
  2.059887	 -0.129305	  0.021465
  2.052073	 -0.147786	  0.021411
  2.044257	 -0.166195	  0.021358
  2.035057	 -0.183951	  0.021364
  2.022709	 -0.199570	  0.021526
  2.003374	 -0.197180	  0.020322
  1.987163	 -0.186090	  0.019670
  1.970239	 -0.177019	  0.020846
  1.951323	 -0.164908	  0.022761
  1.936384	 -0.150416	  0.023225
  1.924123	 -0.135629	  0.024590
  1.909817	 -0.120986	  0.021878
  1.895011	 -0.108273	  0.023482
  1.874927	 -0.099337	  0.022256
  1.856683	 -0.090953	  0.019113
  1.841802	 -0.080444	  0.012792
  1.826631	 -0.066328	  0.002502
  1.811044	 -0.051245	 -0.001391
  1.796181	 -0.041240	  0.001365
  1.779615	 -0.031201	  0.001979
  1.762215	 -0.019639	  0.001485
  1.745683	 -0.009357	  0.000071
  1.729101	  0.002689	 -0.002191
  1.713385	  0.011581	 -0.004655
  1.695229	  0.020285	 -0.006157
  1.675820	  0.024896	 -0.004529
  1.654642	  0.018906	  0.000702
  1.637349	  0.017666	  0.008812
  1.618987	  0.013114	  0.012692
  1.597970	  0.007171	  0.012057
  1.578098	  0.005025	  0.017876
  1.562599	 -0.001229	  0.021375
  1.544783	 -0.010841	  0.018901
  1.524182	 -0.020819	  0.015435
  1.505474	 -0.027506	  0.022138
  1.485721	 -0.031170	  0.021907
  1.466972	 -0.036879	  0.014884
  1.451449	 -0.043083	  0.006630
  1.431977	 -0.049985	  0.000927
  1.415655	 -0.056118	 -0.007041
  1.398890	 -0.063762	 -0.014219
  1.380216	 -0.071568	 -0.015253
  1.359157	 -0.077403	 -0.012043
  1.339856	 -0.080922	 -0.007885
  1.320774	 -0.081908	 -0.009774
  1.301263	 -0.086544	 -0.014125
  1.282165	 -0.092521	 -0.017414
  1.264044	 -0.100633	 -0.019778
  1.247215	 -0.111227	 -0.021666
  1.230128	 -0.122173	 -0.024630
  1.212678	 -0.132128	 -0.025839
  1.191956	 -0.136789	 -0.026112
  1.174070	 -0.143509	 -0.030743
  1.157375	 -0.151996	 -0.036615
  1.139290	 -0.160235	 -0.040901
  1.120990	 -0.167809	 -0.045374
  1.102436	 -0.173312	 -0.050552
  1.084128	 -0.178041	 -0.057040
  1.064968	 -0.181326	 -0.063130
  1.045780	 -0.185986	 -0.064929
  1.027141	 -0.190578	 -0.067843
  1.007021	 -0.199498	 -0.074771
  0.992155	 -0.210280	 -0.079501
  0.972678	 -0.215813	 -0.081242
  0.952844	 -0.218931	 -0.078545
  0.932761	 -0.221693	 -0.082223
  0.912294	 -0.225353	 -0.089278
  0.895063	 -0.232696	 -0.093879
  0.877743	 -0.240476	 -0.093322
  0.856547	 -0.242047	 -0.094285
  0.836618	 -0.247816	 -0.097670
  0.819257	 -0.254889	 -0.099164
  0.798809	 -0.257182	 -0.100758
  0.777823	 -0.257156	 -0.103326
  0.758047	 -0.260958	 -0.105388
  0.740898	 -0.268729	 -0.105300
  0.721086	 -0.275011	 -0.105382
  0.701565	 -0.280193	 -0.106322
  0.682225	 -0.285179	 -0.107372
  0.663028	 -0.290511	 -0.109116
  0.643959	 -0.296099	 -0.111385
  0.624919	 -0.301788	 -0.113642
  0.606337	 -0.308903	 -0.115652
  0.587869	 -0.316374	 -0.117417
  0.569841	 -0.324982	 -0.118357
  0.551818	 -0.333599	 -0.119299
  0.533855	 -0.342122	 -0.121460
  0.516030	 -0.350509	 -0.124911
  0.498206	 -0.358896	 -0.128372
  0.480385	 -0.367279	 -0.131846
  0.462744	 -0.375283	 -0.136818
  0.445149	 -0.383213	 -0.142067
  0.427553	 -0.391137	 -0.147322
  0.409890	 -0.398592	 -0.153013
  0.392171	 -0.405536	 -0.159165
  0.374455	 -0.412477	 -0.165324
  0.356959	 -0.419617	 -0.171874
  0.339797	 -0.427035	 -0.178976
  0.322642	 -0.434465	 -0.186083
  0.305998	 -0.442923	 -0.193255
  0.289414	 -0.451543	 -0.200369
  0.272841	 -0.461068	 -0.206172
  0.256430	 -0.470870	 -0.212294
  0.239319	 -0.479980	 -0.217497
  0.222046	 -0.488115	 -0.222769
  0.205358	 -0.496147	 -0.229844
  0.187366	 -0.505214	 -0.236077
  0.170456	 -0.514553	 -0.241510
  0.151747	 -0.520530	 -0.244305
  0.132669	 -0.525673	 -0.248857
  0.114320	 -0.528225	 -0.254494
  0.094981	 -0.531295	 -0.260535
  0.074013	 -0.533505	 -0.264219
  0.055620	 -0.540752	 -0.266307
  0.038057	 -0.549101	 -0.270526
  0.019597	 -0.554606	 -0.275298
 -0.000514	 -0.556351	 -0.280251
 -0.020537	 -0.557051	 -0.283992
 -0.040339	 -0.561261	 -0.288373
 -0.056378	 -0.569789	 -0.294057
 -0.079433	 -0.570730	 -0.295501
 -0.098835	 -0.568200	 -0.297937
 -0.116307	 -0.570349	 -0.296823
 -0.139233	 -0.574241	 -0.296622
 -0.159955	 -0.567208	 -0.295600
 -0.177758	 -0.568382	 -0.295490
 -0.198462	 -0.571490	 -0.299356
 -0.219319	 -0.576355	 -0.308883
 -0.239302	 -0.584252	 -0.310072
 -0.254199	 -0.590412	 -0.308781
 -0.275310	 -0.591734	 -0.312303
 -0.295502	 -0.592260	 -0.314730
 -0.316984	 -0.596231	 -0.315633
 -0.337219	 -0.597653	 -0.313757
 -0.354532	 -0.595948	 -0.313826
 -0.374576	 -0.599554	 -0.316150
 -0.393065	 -0.604160	 -0.317280
 -0.418095	 -0.610364	 -0.325916
 -0.432475	 -0.613789	 -0.334158
 -0.447564	 -0.620174	 -0.333392
 -0.466161	 -0.633206	 -0.334077
 -0.483528	 -0.644645	 -0.335641
 -0.501749	 -0.653961	 -0.348804
 -0.514494	 -0.662801	 -0.356754
 -0.530713	 -0.670637	 -0.363741
 -0.549570	 -0.674283	 -0.372182
 -0.566107	 -0.680244	 -0.383300
 -0.586341	 -0.684028	 -0.391727
 -0.604719	 -0.685772	 -0.396966
 -0.622372	 -0.690549	 -0.404963
 -0.636119	 -0.705292	 -0.415530
 -0.648521	 -0.720355	 -0.423465
 -0.667342	 -0.728040	 -0.433420
 -0.684660	 -0.730428	 -0.436935
 -0.702091	 -0.741737	 -0.441287
 -0.712781	 -0.758553	 -0.446809
 -0.721469	 -0.772806	 -0.453309
 -0.737486	 -0.780060	 -0.459105
 -0.745853	 -0.799030	 -0.458789
 -0.753711	 -0.816471	 -0.458583
 -0.758693	 -0.840389	 -0.466610
 -0.759571	 -0.858883	 -0.471351
 -0.765691	 -0.877902	 -0.468747
 -0.774799	 -0.893238	 -0.467552
 -0.781835	 -0.911593	 -0.472526
 -0.780949	 -0.931545	 -0.476540
 -0.782263	 -0.950113	 -0.476615
 -0.786104	 -0.970880	 -0.478035
 -0.788897	 -0.992356	 -0.482406
 -0.790500	 -1.009719	 -0.487097
 -0.797046	 -1.027881	 -0.486706
 -0.801583	 -1.049673	 -0.483392
 -0.802832	 -1.068391	 -0.479587
 -0.800991	 -1.091699	 -0.487464
 -0.800147	 -1.112386	 -0.493007
 -0.808972	 -1.127358	 -0.492664
 -0.820471	 -1.145256	 -0.497013
 -0.829488	 -1.161038	 -0.499689
 -0.837121	 -1.176966	 -0.509262
 -0.846431	 -1.190880	 -0.520695
 -0.857094	 -1.203004	 -0.532394
 -0.867738	 -1.215134	 -0.544308
 -0.877168	 -1.227948	 -0.556135
 -0.884173	 -1.242594	 -0.568073
 -0.890815	 -1.254997	 -0.581773
 -0.903093	 -1.267052	 -0.597199
 -0.913910	 -1.272400	 -0.612612
 -0.926123	 -1.268498	 -0.630827
 -0.936716	 -1.269609	 -0.646555
 -0.948450	 -1.277261	 -0.661561
 -0.961258	 -1.285622	 -0.675863
 -0.972845	 -1.288394	 -0.692118
 -0.983897	 -1.293339	 -0.707504
 -0.997620	 -1.296548	 -0.721555
 -1.009522	 -1.300812	 -0.738716
 -1.025718	 -1.291910	 -0.750025
 -1.043219	 -1.290101	 -0.759601
 -1.056755	 -1.292213	 -0.773522
 -1.074696	 -1.286631	 -0.781514
 -1.092743	 -1.274472	 -0.786684
 -1.104583	 -1.267970	 -0.802205
 -1.121340	 -1.263607	 -0.807441
 -1.141786	 -1.257983	 -0.809312
 -1.160751	 -1.252202	 -0.810089
 -1.177852	 -1.243046	 -0.810979
 -1.190073	 -1.229191	 -0.806096
 -1.200519	 -1.214780	 -0.799688
 -1.211553	 -1.199370	 -0.793113
 -1.225757	 -1.185448	 -0.786808
 -1.239132	 -1.172610	 -0.779906
 -1.252741	 -1.163272	 -0.768372
 -1.266192	 -1.155277	 -0.755280
 -1.281786	 -1.148446	 -0.744384
 -1.300074	 -1.140358	 -0.735332
 -1.315202	 -1.132603	 -0.724313
 -1.323595	 -1.128433	 -0.708452
 -1.337424	 -1.125562	 -0.692664
 -1.356456	 -1.115206	 -0.679619
 -1.375541	 -1.119698	 -0.670243
 -1.389861	 -1.131127	 -0.663666
 -1.398980	 -1.132643	 -0.643476
 -1.417041	 -1.118553	 -0.654935
 -1.428646	 -1.127849	 -0.647170
 -1.442935	 -1.134003	 -0.655291
 -1.454640	 -1.127472	 -0.663038
 -1.468936	 -1.118865	 -0.673192
 -1.483636	 -1.119233	 -0.692286
 -1.502021	 -1.126176	 -0.699824
 -1.506792	 -1.127919	 -0.715895
 -1.525008	 -1.136258	 -0.722028
 -1.544854	 -1.144398	 -0.726584
 -1.561802	 -1.149257	 -0.734316
 -1.579213	 -1.154497	 -0.743129
 -1.598581	 -1.160015	 -0.748962
 -1.616598	 -1.166101	 -0.751046
 -1.636772	 -1.172353	 -0.751906
 -1.655762	 -1.177638	 -0.756402
 -1.672991	 -1.183349	 -0.759508
 -1.693710	 -1.189751	 -0.758941
 -1.712831	 -1.195291	 -0.758497
 -1.729339	 -1.204141	 -0.758917
 -1.749020	 -1.213698	 -0.759241
 -1.770598	 -1.217965	 -0.758485
 -1.786785	 -1.220721	 -0.762137
 -1.806205	 -1.228344	 -0.764686
 -1.825098	 -1.236142	 -0.766208
 -1.844304	 -1.240062	 -0.770133
 -1.865307	 -1.241297	 -0.775342
 -1.884465	 -1.245598	 -0.777172
 -1.902166	 -1.253792	 -0.777749
 -1.920592	 -1.261551	 -0.779852
 -1.939882	 -1.267630	 -0.782386
 -1.959033	 -1.273007	 -0.784661
 -1.978164	 -1.278374	 -0.786936
 -1.995248	 -1.283167	 -0.788967
 -1.997293	 -1.283741	 -0.789210
