 -2.584036	  1.084845	  1.151855
 -2.558452	  1.074103	  1.140450
 -2.512074	  1.051836	  1.155438
 -2.468847	  1.032394	  1.161184
 -2.427514	  1.002656	  1.176896
 -2.382033	  0.986153	  1.189326
 -2.340656	  0.956086	  1.197268
 -2.298229	  0.934134	  1.205272
 -2.255968	  0.911304	  1.212344
 -2.217109	  0.884901	  1.229814
 -2.172193	  0.864706	  1.241010
 -2.130401	  0.837907	  1.244323
 -2.089224	  0.813627	  1.258285
 -2.042648	  0.794109	  1.269574
 -1.999297	  0.768955	  1.280356
 -1.955374	  0.743314	  1.288619
 -1.916342	  0.722819	  1.296804
 -1.870587	  0.698250	  1.305774
 -1.827198	  0.673126	  1.316178
 -1.788154	  0.650483	  1.325726
 -1.748100	  0.624085	  1.336693
 -1.703222	  0.596021	  1.345734
 -1.662633	  0.573853	  1.354693
 -1.622645	  0.546072	  1.365644
 -1.580441	  0.524913	  1.375387
 -1.537612	  0.498820	  1.386278
 -1.497884	  0.475512	  1.397635
 -1.455765	  0.449482	  1.409475
 -1.413330	  0.427791	  1.422317
 -1.372884	  0.405754	  1.432822
 -1.328849	  0.382302	  1.443948
 -1.283628	  0.355772	  1.455617
 -1.242563	  0.335327	  1.464015
 -1.202183	  0.310861	  1.472725
 -1.160814	  0.288168	  1.483508
 -1.118357	  0.263340	  1.492435
 -1.071987	  0.239147	  1.506029
 -1.028691	  0.213185	  1.513392
 -0.985636	  0.190270	  1.527613
 -0.947730	  0.168561	  1.535651
 -0.903553	  0.143801	  1.547769
 -0.859574	  0.119045	  1.556301
 -0.819750	  0.096608	  1.564442
 -0.775113	  0.070428	  1.573083
 -0.734111	  0.046922	  1.584921
 -0.692298	  0.024809	  1.593385
 -0.646218	 -0.002891	  1.603723
 -0.604789	 -0.024698	  1.613067
 -0.561202	 -0.050474	  1.624508
 -0.520007	 -0.073114	  1.632911
 -0.476762	 -0.097460	  1.643801
 -0.434602	 -0.121872	  1.655470
 -0.391221	 -0.146133	  1.662228
 -0.352547	 -0.164720	  1.659386
 -0.309149	 -0.166461	  1.600517
 -0.218673	 -0.170585	  1.476524
 -0.087133	 -0.126860	  1.436502
 -0.055745	 -0.142145	  1.414690
  0.007949	 -0.202892	  1.349855
  0.039814	 -0.223495	  1.347569
  0.077482	 -0.278063	  1.400495
  0.100194	 -0.347211	  1.401619
  0.124123	 -0.369123	  1.423643
  0.128619	 -0.372346	  1.471847
  0.165631	 -0.437631	  1.479759
  0.270100	 -0.412896	  1.538600
  0.339745	 -0.413001	  1.535591
  0.329638	 -0.448319	  1.610784
  0.289109	 -0.502050	  1.778368
  0.326861	 -0.554726	  1.831993
  0.366509	 -0.581693	  1.847347
  0.409270	 -0.605813	  1.858019
  0.450599	 -0.628286	  1.868013
  0.496597	 -0.653493	  1.879351
  0.538612	 -0.677320	  1.890296
  0.578882	 -0.700938	  1.901216
  0.621449	 -0.723923	  1.911537
  0.665276	 -0.745811	  1.920287
  0.709566	 -0.768320	  1.929869
  0.752077	 -0.793056	  1.941468
  0.795527	 -0.817856	  1.952358
  0.835276	 -0.841529	  1.964855
  0.880057	 -0.863649	  1.973194
  0.921512	 -0.890089	  1.984324
  0.964937	 -0.912659	  1.992696
  1.006342	 -0.940668	  2.005033
  1.047484	 -0.961289	  2.015045
  1.087349	 -0.987638	  2.025349
  1.130954	 -1.011630	  2.038127
  1.170949	 -1.035911	  2.047455
  1.216282	 -1.062320	  2.056883
  1.259032	 -1.085303	  2.064710
  1.301892	 -1.109568	  2.072971
  1.340160	 -1.137083	  2.082358
  1.386082	 -1.158455	  2.095383
  1.429311	 -1.181253	  2.101777
  1.468662	 -1.202641	  2.116228
  1.510957	 -1.234118	  2.125366
  1.553099	 -1.251195	  2.130265
  1.594457	 -1.276626	  2.145619
  1.633417	 -1.307467	  2.149995
  1.649751	 -1.320541	  2.171495
