  0.321075	  0.820327	 -2.417185
  0.331046	  0.820754	 -2.429124
  0.317410	  0.820858	 -2.414494
  0.298989	  0.828559	 -2.413324
  0.280568	  0.836260	 -2.412154
  0.263213	  0.846103	 -2.413547
  0.246161	  0.856371	 -2.415491
  0.229108	  0.866639	 -2.417435
  0.212055	  0.876906	 -2.419378
  0.196354	  0.889169	 -2.421136
  0.181044	  0.901925	 -2.422840
  0.165735	  0.914681	 -2.424544
  0.150425	  0.927437	 -2.426248
  0.135116	  0.940193	 -2.427952
  0.119806	  0.952949	 -2.429656
  0.104497	  0.965705	 -2.431360
  0.089188	  0.978461	 -2.433065
  0.073878	  0.991217	 -2.434769
  0.058569	  1.003973	 -2.436473
  0.043259	  1.016729	 -2.438177
  0.027950	  1.029485	 -2.439881
  0.013283	  1.042215	 -2.440968
 -0.001667	  1.055476	 -2.441769
