  0.844568	 -2.326620	  0.198297
  0.844538	 -2.344195	  0.203723
  0.844567	 -2.325086	  0.197821
  0.843959	 -2.306092	  0.191586
  0.842267	 -2.287356	  0.184801
  0.840535	 -2.268627	  0.178145
  0.838587	 -2.250735	  0.171812
  0.839123	 -2.235595	  0.167182
  0.841350	 -2.210237	  0.160969
  0.837959	 -2.183877	  0.150914
  0.835335	 -2.172309	  0.144381
  0.832812	 -2.160241	  0.137565
  0.829987	 -2.136640	  0.126816
  0.827986	 -2.121042	  0.119123
  0.824387	 -2.103898	  0.108084
  0.820605	 -2.086522	  0.096366
  0.817936	 -2.071643	  0.087158
  0.815457	 -2.052307	  0.076236
  0.813497	 -2.035695	  0.066157
  0.812076	 -2.021306	  0.056929
  0.811860	 -1.997151	  0.045049
  0.813477	 -1.981926	  0.040730
  0.816532	 -1.963550	  0.038268
  0.818456	 -1.938508	  0.031575
  0.817910	 -1.923051	  0.024798
  0.814922	 -1.905383	  0.013869
  0.811682	 -1.887919	  0.002591
  0.809730	 -1.873276	 -0.006097
  0.808640	 -1.850261	 -0.015757
  0.809593	 -1.833276	 -0.018759
  0.812599	 -1.814975	 -0.019531
  0.815629	 -1.786606	 -0.023862
  0.816241	 -1.774056	 -0.027800
  0.813979	 -1.755528	 -0.038187
  0.811252	 -1.730473	 -0.046960
  0.810894	 -1.718134	 -0.050138
  0.809738	 -1.700150	 -0.055164
  0.807344	 -1.678057	 -0.060907
  0.806558	 -1.657424	 -0.063706
  0.804705	 -1.637281	 -0.066643
  0.800574	 -1.617677	 -0.069049
  0.798215	 -1.597968	 -0.071579
  0.794515	 -1.578592	 -0.075645
  0.790555	 -1.560799	 -0.083653
  0.787416	 -1.542557	 -0.091936
  0.785136	 -1.521720	 -0.096153
  0.785548	 -1.500800	 -0.095652
  0.784632	 -1.479904	 -0.091762
  0.780604	 -1.459490	 -0.088245
  0.772708	 -1.439798	 -0.086260
  0.765963	 -1.420545	 -0.086005
  0.761668	 -1.400792	 -0.087467
  0.756977	 -1.381046	 -0.090568
  0.750336	 -1.361108	 -0.095678
  0.743349	 -1.342243	 -0.101776
  0.736930	 -1.326334	 -0.108565
  0.732736	 -1.307704	 -0.116762
  0.727435	 -1.289800	 -0.127187
  0.716311	 -1.273566	 -0.141014
  0.702142	 -1.259691	 -0.153997
  0.692489	 -1.246196	 -0.162590
  0.685821	 -1.233252	 -0.167208
  0.679309	 -1.214391	 -0.171384
  0.674043	 -1.194831	 -0.177099
  0.671427	 -1.175951	 -0.183861
  0.669430	 -1.158574	 -0.191761
  0.667204	 -1.141106	 -0.200047
  0.665825	 -1.122572	 -0.207064
  0.663249	 -1.103741	 -0.214090
  0.661409	 -1.085150	 -0.218765
  0.660762	 -1.068011	 -0.219785
  0.661586	 -1.049029	 -0.217442
  0.668223	 -1.026519	 -0.210943
  0.677233	 -1.008947	 -0.206323
  0.688620	 -0.988074	 -0.206309
  0.696493	 -0.965227	 -0.214099
  0.701479	 -0.943972	 -0.219681
  0.698282	 -0.921099	 -0.226101
  0.688784	 -0.899218	 -0.236532
  0.674779	 -0.876066	 -0.252160
  0.669295	 -0.865097	 -0.258683
  0.660727	 -0.853912	 -0.264884
  0.651111	 -0.831754	 -0.275445
  0.644764	 -0.815103	 -0.283535
  0.641105	 -0.802371	 -0.290540
  0.634447	 -0.779425	 -0.298660
  0.628945	 -0.762462	 -0.304656
  0.623979	 -0.748077	 -0.308904
  0.614796	 -0.727122	 -0.314104
  0.605798	 -0.709004	 -0.317037
  0.594197	 -0.687311	 -0.323463
  0.586634	 -0.671903	 -0.330880
  0.580126	 -0.658507	 -0.342099
  0.575854	 -0.642762	 -0.356139
  0.570546	 -0.627395	 -0.368369
  0.564380	 -0.613468	 -0.381454
  0.560068	 -0.598853	 -0.395124
  0.556333	 -0.581674	 -0.406163
  0.551884	 -0.564470	 -0.414305
  0.546122	 -0.547764	 -0.420884
  0.538946	 -0.530605	 -0.426735
  0.528607	 -0.506667	 -0.438529
  0.525561	 -0.488815	 -0.452258
  0.526063	 -0.480212	 -0.458565
  0.529600	 -0.465826	 -0.465834
  0.541037	 -0.441366	 -0.470114
  0.549643	 -0.411713	 -0.479087
  0.549106	 -0.397162	 -0.486623
  0.545081	 -0.384429	 -0.494823
  0.540471	 -0.364162	 -0.509305
  0.538764	 -0.346541	 -0.517839
  0.537149	 -0.333212	 -0.522741
  0.532147	 -0.314844	 -0.529238
  0.528537	 -0.296213	 -0.537850
  0.525736	 -0.272901	 -0.552958
  0.524023	 -0.254552	 -0.564413
  0.522701	 -0.244789	 -0.568670
  0.516077	 -0.229617	 -0.577521
  0.509954	 -0.209550	 -0.586601
  0.505745	 -0.189219	 -0.595675
  0.503051	 -0.169944	 -0.604812
  0.501328	 -0.152616	 -0.613924
  0.500904	 -0.136179	 -0.622745
  0.502122	 -0.117681	 -0.631033
  0.504053	 -0.098834	 -0.639052
  0.506732	 -0.080755	 -0.648208
  0.509621	 -0.064042	 -0.659129
  0.511274	 -0.049596	 -0.670186
  0.510225	 -0.032209	 -0.681936
  0.506551	 -0.013404	 -0.690578
  0.500411	  0.005953	 -0.697334
  0.494911	  0.022068	 -0.704611
  0.489017	  0.039275	 -0.713527
  0.482875	  0.059203	 -0.724113
  0.479961	  0.075400	 -0.728206
  0.480588	  0.093510	 -0.731171
  0.474345	  0.121875	 -0.735467
  0.472680	  0.133212	 -0.737887
  0.468707	  0.152668	 -0.747533
  0.467592	  0.172770	 -0.755428
  0.465310	  0.188346	 -0.760603
  0.459464	  0.206032	 -0.766377
  0.449728	  0.230161	 -0.776188
  0.448179	  0.251559	 -0.784917
  0.447899	  0.265529	 -0.790124
  0.450700	  0.285143	 -0.791952
  0.454789	  0.303806	 -0.793592
  0.455397	  0.323494	 -0.795995
  0.452143	  0.354655	 -0.794092
  0.451373	  0.375840	 -0.794326
  0.451484	  0.388382	 -0.796008
  0.453812	  0.404929	 -0.798467
  0.457720	  0.424734	 -0.805670
  0.460927	  0.443851	 -0.814834
  0.462374	  0.463196	 -0.823729
  0.463151	  0.482547	 -0.831508
  0.462237	  0.499667	 -0.838346
  0.458393	  0.517180	 -0.844829
  0.452629	  0.543529	 -0.852785
  0.447366	  0.560707	 -0.858017
  0.442909	  0.573113	 -0.861673
  0.434585	  0.594017	 -0.868152
  0.428971	  0.615369	 -0.876007
  0.425064	  0.630177	 -0.878333
  0.418221	  0.653791	 -0.882078
  0.412297	  0.666445	 -0.883991
  0.406897	  0.685440	 -0.889183
  0.403384	  0.706233	 -0.894939
  0.393981	  0.726761	 -0.901906
  0.389735	  0.736711	 -0.905047
  0.378109	  0.766522	 -0.917013
  0.370939	  0.777707	 -0.917575
  0.356314	  0.796504	 -0.918075
  0.347917	  0.806654	 -0.919728
  0.336798	  0.830189	 -0.922248
  0.327890	  0.850627	 -0.922977
  0.324060	  0.863102	 -0.920622
  0.320539	  0.887401	 -0.923958
  0.320288	  0.915042	 -0.927808
  0.320085	  0.936178	 -0.929829
  0.317241	  0.948925	 -0.930735
  0.308091	  0.963714	 -0.933069
  0.298315	  0.982728	 -0.934590
  0.290656	  1.005497	 -0.945126
  0.287094	  1.031089	 -0.957593
  0.286198	  1.041428	 -0.961048
  0.285518	  1.061611	 -0.967452
  0.288705	  1.079242	 -0.972368
  0.291637	  1.098789	 -0.978040
  0.292995	  1.119278	 -0.982185
  0.288749	  1.138796	 -0.987070
  0.284233	  1.156100	 -0.996423
  0.282317	  1.170542	 -1.008029
  0.282619	  1.188555	 -1.017494
  0.282187	  1.208040	 -1.024344
  0.279231	  1.226719	 -1.030912
  0.276755	  1.245092	 -1.037434
  0.269939	  1.263114	 -1.039640
  0.260983	  1.281005	 -1.040831
  0.252104	  1.298898	 -1.042032
  0.243048	  1.316705	 -1.043186
  0.234453	  1.334702	 -1.044424
  0.225571	  1.352602	 -1.045591
  0.217743	  1.371023	 -1.044926
  0.211419	  1.389759	 -1.041842
  0.204949	  1.408357	 -1.038683
  0.197524	  1.426108	 -1.034659
  0.191512	  1.442494	 -1.025098
  0.184105	  1.457238	 -1.014919
  0.177366	  1.469510	 -1.006959
  0.171053	  1.482238	 -1.003869
  0.168279	  1.488958	 -1.018741
  0.170484	  1.490997	 -1.039693
  0.177748	  1.497958	 -1.057616
  0.186018	  1.505722	 -1.073924
  0.198136	  1.514303	 -1.092323
  0.208708	  1.519305	 -1.113645
  0.215162	  1.519549	 -1.133067
  0.214809	  1.515556	 -1.153326
  0.215475	  1.517309	 -1.171120
  0.214390	  1.545746	 -1.199774
  0.212398	  1.558666	 -1.208801
  0.211821	  1.569343	 -1.215974
  0.213043	  1.585337	 -1.231307
  0.212626	  1.606921	 -1.249773
  0.209265	  1.617736	 -1.260420
  0.204178	  1.633737	 -1.272475
  0.207034	  1.646644	 -1.285003
  0.215561	  1.665022	 -1.298265
  0.216652	  1.686164	 -1.307936
  0.216410	  1.705166	 -1.315783
  0.215581	  1.725341	 -1.323816
  0.213029	  1.745244	 -1.330668
  0.210953	  1.763686	 -1.337052
  0.208351	  1.782529	 -1.345440
  0.204752	  1.801720	 -1.353486
  0.200801	  1.819123	 -1.360603
  0.193322	  1.836529	 -1.368995
  0.187247	  1.854515	 -1.377001
  0.182172	  1.870626	 -1.384490
  0.173849	  1.889623	 -1.394551
  0.167536	  1.908263	 -1.401027
  0.165525	  1.924630	 -1.406311
  0.166912	  1.943095	 -1.415092
  0.166932	  1.963345	 -1.424310
  0.163254	  1.982060	 -1.429075
  0.160573	  2.001750	 -1.435294
  0.156089	  2.023367	 -1.439127
  0.149394	  2.046725	 -1.441127
  0.123306	  2.066845	 -1.430288
  0.120978	  2.086170	 -1.434883
