 -0.646258	  2.393913	 -0.388230
 -0.650521	  2.380836	 -0.398051
 -0.651302	  2.378438	 -0.399852
 -0.656606	  2.363026	 -0.411444
 -0.662007	  2.347641	 -0.423024
 -0.667462	  2.332250	 -0.434573
 -0.673172	  2.316832	 -0.445961
 -0.678885	  2.301413	 -0.457345
 -0.684767	  2.285818	 -0.468399
 -0.690807	  2.270061	 -0.479135
 -0.696850	  2.254300	 -0.489863
 -0.703101	  2.238209	 -0.499961
 -0.709413	  2.222025	 -0.509872
 -0.715723	  2.205807	 -0.519729
 -0.722004	  2.189200	 -0.528935
 -0.728283	  2.172588	 -0.538134
 -0.734425	  2.155808	 -0.547118
 -0.740392	  2.138823	 -0.555830
 -0.746361	  2.121837	 -0.564538
 -0.752794	  2.104849	 -0.572906
 -0.759320	  2.087862	 -0.581205
 -0.766096	  2.070956	 -0.589467
 -0.773583	  2.054296	 -0.597614
 -0.781081	  2.037646	 -0.605770
 -0.789099	  2.021796	 -0.614962
 -0.797188	  2.006068	 -0.624300
 -0.805438	  1.990790	 -0.634226
 -0.813772	  1.975772	 -0.644471
 -0.822001	  1.960727	 -0.654765
 -0.829924	  1.945608	 -0.665187
 -0.837836	  1.930484	 -0.675611
 -0.844702	  1.914855	 -0.686032
 -0.851204	  1.899066	 -0.696444
 -0.857679	  1.883247	 -0.706829
 -0.864320	  1.867483	 -0.717022
 -0.872079	  1.851754	 -0.727026
 -0.880174	  1.836092	 -0.736273
 -0.886961	  1.818979	 -0.745967
 -0.893599	  1.802075	 -0.754328
 -0.896108	  1.784021	 -0.763728
 -0.897584	  1.767494	 -0.773551
 -0.900654	  1.750379	 -0.783791
 -0.905335	  1.732519	 -0.792046
 -0.910498	  1.714626	 -0.799452
 -0.916003	  1.696481	 -0.805804
 -0.922370	  1.677845	 -0.809277
 -0.928744	  1.659204	 -0.812725
 -0.935120	  1.640561	 -0.816151
 -0.941997	  1.621798	 -0.816875
 -0.949256	  1.603276	 -0.814827
 -0.956513	  1.584755	 -0.812757
 -0.963772	  1.566234	 -0.810684
 -0.971091	  1.547801	 -0.808122
 -0.978705	  1.530129	 -0.802679
 -0.986320	  1.512463	 -0.797208
 -0.993935	  1.494796	 -0.791738
 -1.001550	  1.477133	 -0.786260
 -1.009330	  1.459795	 -0.780027
 -1.017202	  1.442670	 -0.773335
 -1.025075	  1.425548	 -0.766640
 -1.032954	  1.408426	 -0.759949
 -1.041537	  1.391415	 -0.753872
 -1.051026	  1.374608	 -0.748629
 -1.060523	  1.357804	 -0.743393
 -1.070063	  1.341021	 -0.738214
 -1.083495	  1.326221	 -0.738325
 -1.097085	  1.311552	 -0.738690
 -1.110675	  1.296883	 -0.739056
 -1.124307	  1.282276	 -0.739449
 -1.141976	  1.273661	 -0.743052
 -1.159712	  1.265173	 -0.746711
 -1.177449	  1.256686	 -0.750371
 -1.195185	  1.248200	 -0.754030
 -1.212922	  1.239713	 -0.757689
 -1.230665	  1.231233	 -0.761314
 -1.249279	  1.223930	 -0.761504
 -1.267978	  1.216861	 -0.761093
 -1.286756	  1.210567	 -0.760380
 -1.306022	  1.205504	 -0.758196
 -1.325808	  1.199527	 -0.755001
 -1.344205	  1.193115	 -0.750591
 -1.361032	  1.183840	 -0.745551
 -1.377770	  1.170749	 -0.744662
 -1.392415	  1.157341	 -0.739601
 -1.406399	  1.144396	 -0.740950
 -1.422736	  1.133235	 -0.739599
 -1.438595	  1.121127	 -0.739250
 -1.451755	  1.102235	 -0.742562
 -1.460105	  1.085056	 -0.742039
 -1.472347	  1.071049	 -0.738039
 -1.483740	  1.053111	 -0.736375
 -1.490435	  1.032347	 -0.737071
 -1.497192	  1.017556	 -0.733446
 -1.503959	  0.998646	 -0.734494
 -1.506558	  0.977281	 -0.741824
 -1.504812	  0.969108	 -0.744593
 -1.498355	  0.958811	 -0.755994
 -1.488344	  0.957605	 -0.773893
 -1.482114	  0.953238	 -0.794364
 -1.474051	  0.948760	 -0.809636
 -1.462903	  0.945208	 -0.827268
 -1.452880	  0.946353	 -0.845836
 -1.443361	  0.950186	 -0.861597
 -1.432372	  0.956084	 -0.878784
 -1.421234	  0.955571	 -0.896144
 -1.410720	  0.952683	 -0.910955
 -1.398328	  0.952409	 -0.928560
 -1.389407	  0.952627	 -0.946826
 -1.379319	  0.952208	 -0.962648
 -1.370283	  0.948987	 -0.980350
 -1.359002	  0.948919	 -0.998971
 -1.345059	  0.951339	 -1.013131
 -1.335276	  0.955042	 -1.032162
 -1.328868	  0.954920	 -1.050606
 -1.321745	  0.953817	 -1.066901
 -1.312057	  0.952360	 -1.086986
 -1.305785	  0.952009	 -1.106243
 -1.296506	  0.951233	 -1.123812
 -1.286719	  0.949764	 -1.139476
 -1.276757	  0.948466	 -1.158054
 -1.267742	  0.946952	 -1.175942
 -1.260432	  0.941909	 -1.193956
 -1.254304	  0.934937	 -1.211711
 -1.248144	  0.927962	 -1.229411
 -1.241988	  0.920996	 -1.247058
 -1.235415	  0.915082	 -1.264860
 -1.227457	  0.910380	 -1.282879
 -1.220674	  0.902894	 -1.300687
 -1.217849	  0.889766	 -1.316749
 -1.216253	  0.876153	 -1.331860
 -1.211627	  0.864537	 -1.346575
 -1.206356	  0.850373	 -1.362009
 -1.205523	  0.836890	 -1.375671
 -1.205292	  0.823557	 -1.390000
 -1.203524	  0.806737	 -1.403839
 -1.199916	  0.792795	 -1.415121
 -1.198812	  0.776832	 -1.427161
 -1.198442	  0.759529	 -1.438847
 -1.193692	  0.744152	 -1.449637
 -1.188820	  0.726796	 -1.461029
 -1.188314	  0.709478	 -1.470507
 -1.190622	  0.692327	 -1.479345
 -1.192501	  0.672724	 -1.489128
 -1.188901	  0.656528	 -1.497632
 -1.186611	  0.638622	 -1.506361
 -1.186553	  0.619524	 -1.513527
 -1.186543	  0.601513	 -1.521833
 -1.184162	  0.583050	 -1.530388
 -1.185074	  0.564766	 -1.538168
 -1.187382	  0.545935	 -1.545567
 -1.189025	  0.528459	 -1.554638
 -1.186439	  0.511606	 -1.564016
 -1.185138	  0.490622	 -1.575529
 -1.186367	  0.473393	 -1.586436
 -1.189316	  0.462691	 -1.596699
 -1.192421	  0.444442	 -1.609564
 -1.194807	  0.426384	 -1.620674
 -1.196057	  0.412131	 -1.630939
 -1.198300	  0.395514	 -1.643563
 -1.201075	  0.379190	 -1.655196
 -1.204536	  0.363060	 -1.666534
 -1.208343	  0.346944	 -1.677764
 -1.212217	  0.330793	 -1.688926
 -1.216443	  0.313863	 -1.698792
 -1.220923	  0.296550	 -1.707784
 -1.225340	  0.279235	 -1.716762
 -1.229741	  0.261730	 -1.725411
 -1.234261	  0.243978	 -1.733446
 -1.238695	  0.226267	 -1.741637
 -1.243215	  0.208797	 -1.749370
 -1.248217	  0.191093	 -1.757407
 -1.252134	  0.174472	 -1.765869
 -1.255756	  0.152039	 -1.774498
 -1.260288	  0.136091	 -1.779378
 -1.265070	  0.119419	 -1.787097
 -1.267689	  0.100556	 -1.796879
 -1.272824	  0.083231	 -1.802649
 -1.280692	  0.064745	 -1.807391
 -1.283471	  0.044596	 -1.817492
 -1.281135	  0.028570	 -1.830077
 -1.283141	  0.013446	 -1.841440
 -1.287123	 -0.005653	 -1.849066
 -1.293428	 -0.021215	 -1.859117
 -1.295162	 -0.037703	 -1.870655
 -1.298225	 -0.055743	 -1.879173
 -1.304202	 -0.071594	 -1.889959
 -1.307766	 -0.087743	 -1.902497
 -1.310926	 -0.104566	 -1.909757
 -1.316801	 -0.121390	 -1.920601
 -1.321467	 -0.136944	 -1.933523
 -1.323073	 -0.153983	 -1.942277
 -1.326429	 -0.170875	 -1.952627
 -1.331211	 -0.185790	 -1.965678
 -1.333756	 -0.200257	 -1.978390
 -1.335574	 -0.218161	 -1.990523
 -1.339976	 -0.232826	 -2.001490
 -1.343880	 -0.249351	 -2.012393
 -1.344435	 -0.267289	 -2.022117
 -1.348384	 -0.282984	 -2.034402
 -1.356034	 -0.297686	 -2.045953
 -1.356844	 -0.314701	 -2.056909
 -1.357757	 -0.334966	 -2.072268
 -1.362337	 -0.346806	 -2.081888
