  1.729692	 -0.884430	  1.602069
  1.719445	 -0.875273	  1.589781
  1.715399	 -0.871657	  1.584929
  1.705096	 -0.866759	  1.579646
  1.685478	 -0.859660	  1.575320
  1.663832	 -0.847592	  1.567657
  1.650271	 -0.835573	  1.559408
  1.636882	 -0.818379	  1.553237
  1.628443	 -0.803381	  1.550167
  1.620056	 -0.791020	  1.548675
  1.601087	 -0.771959	  1.544296
  1.583395	 -0.760298	  1.537462
  1.570910	 -0.753569	  1.532632
  1.557878	 -0.744605	  1.526377
  1.537701	 -0.731839	  1.518954
  1.521947	 -0.722945	  1.514566
  1.506186	 -0.713098	  1.510858
  1.489768	 -0.701406	  1.506703
  1.472492	 -0.689070	  1.503075
  1.457550	 -0.678650	  1.500223
  1.440439	 -0.667898	  1.497990
  1.421881	 -0.655888	  1.496988
  1.405147	 -0.642824	  1.496036
  1.393904	 -0.630564	  1.492929
  1.382764	 -0.614172	  1.483155
  1.369519	 -0.603316	  1.469030
  1.352377	 -0.594032	  1.460331
  1.335670	 -0.584106	  1.454743
  1.319524	 -0.573801	  1.448510
  1.303251	 -0.563698	  1.442271
  1.286892	 -0.553729	  1.436199
  1.269872	 -0.544378	  1.431266
  1.252838	 -0.535095	  1.426640
  1.235537	 -0.526394	  1.422375
  1.218685	 -0.517820	  1.416227
  1.202206	 -0.508823	  1.408825
  1.187129	 -0.499020	  1.399966
  1.173045	 -0.489360	  1.391005
  1.157801	 -0.484176	  1.377965
  1.143954	 -0.474846	  1.360128
  1.133355	 -0.461030	  1.350394
  1.123197	 -0.447370	  1.341391
  1.113186	 -0.432991	  1.330310
  1.100387	 -0.412142	  1.317842
  1.094380	 -0.402726	  1.314084
  1.082624	 -0.384973	  1.308624
  1.070322	 -0.369979	  1.299354
  1.060783	 -0.360503	  1.288545
  1.048870	 -0.350129	  1.270441
  1.037338	 -0.335626	  1.253654
  1.031588	 -0.324344	  1.247083
  1.019615	 -0.309196	  1.239387
  1.006326	 -0.292428	  1.231813
  0.995384	 -0.276479	  1.230321
  0.983090	 -0.261578	  1.223226
  0.972098	 -0.248988	  1.211623
  0.963884	 -0.238820	  1.196509
  0.957381	 -0.230161	  1.179696
  0.950931	 -0.221512	  1.162857
  0.944560	 -0.212972	  1.145956
  0.941330	 -0.209805	  1.126508
  0.939443	 -0.208882	  1.106620
  0.937585	 -0.207980	  1.086727
  0.935727	 -0.207078	  1.066834
  0.933787	 -0.206195	  1.046953
  0.927453	 -0.205343	  1.028055
  0.918981	 -0.205317	  1.009923
  0.911290	 -0.205614	  0.991329
  0.903768	 -0.204861	  0.972515
  0.895514	 -0.201382	  0.954552
  0.888300	 -0.198607	  0.937122
  0.882084	 -0.198006	  0.917470
  0.869649	 -0.193690	  0.899549
  0.854561	 -0.183378	  0.883295
  0.843970	 -0.173306	  0.869676
  0.834914	 -0.165655	  0.856720
  0.826387	 -0.157583	  0.839525
  0.819439	 -0.148988	  0.822223
  0.813449	 -0.141706	  0.805538
  0.804669	 -0.134853	  0.787340
  0.794397	 -0.128025	  0.774283
  0.784246	 -0.119186	  0.763175
  0.768466	 -0.105060	  0.751115
  0.758587	 -0.085587	  0.733823
  0.756900	 -0.076627	  0.726267
  0.755942	 -0.065044	  0.718787
  0.745221	 -0.042840	  0.716121
  0.728528	 -0.026084	  0.719153
  0.715621	 -0.017566	  0.719004
  0.697131	 -0.003722	  0.709001
  0.674655	  0.016187	  0.708742
  0.667292	  0.022940	  0.711111
  0.653607	  0.036680	  0.719561
  0.640751	  0.050460	  0.729927
  0.630306	  0.062291	  0.738607
  0.614097	  0.079143	  0.747668
  0.601841	  0.092060	  0.750214
  0.587591	  0.106433	  0.749692
  0.565821	  0.123362	  0.753170
  0.556104	  0.130231	  0.757466
  0.543921	  0.140447	  0.771800
  0.533170	  0.149652	  0.783970
  0.516993	  0.163320	  0.792721
  0.502057	  0.175600	  0.799298
  0.486664	  0.186883	  0.805736
  0.469872	  0.196116	  0.811183
  0.450333	  0.203727	  0.816036
  0.432038	  0.213947	  0.818220
  0.416719	  0.226746	  0.821127
  0.404073	  0.239533	  0.825264
  0.386888	  0.249498	  0.826603
  0.369795	  0.259964	  0.825815
  0.352724	  0.270026	  0.823538
  0.336638	  0.280806	  0.820602
  0.320002	  0.292422	  0.817215
  0.302377	  0.305066	  0.815381
  0.287205	  0.317396	  0.816798
  0.272872	  0.326641	  0.817153
  0.254070	  0.334864	  0.814317
  0.235841	  0.343806	  0.812578
  0.219760	  0.354396	  0.811187
  0.202439	  0.366744	  0.807042
  0.184758	  0.377382	  0.804965
  0.167495	  0.387481	  0.806108
  0.152617	  0.396718	  0.810250
  0.134093	  0.407882	  0.815156
  0.117052	  0.419645	  0.817796
  0.100500	  0.429490	  0.818899
  0.084516	  0.441994	  0.817589
  0.068798	  0.454967	  0.815277
  0.052954	  0.466725	  0.815475
  0.037945	  0.479913	  0.815267
  0.023160	  0.492839	  0.813995
  0.007861	  0.505525	  0.811000
 -0.007914	  0.517728	  0.807667
 -0.024295	  0.529435	  0.806468
 -0.040358	  0.541115	  0.806787
 -0.056476	  0.552623	  0.807635
 -0.073263	  0.564167	  0.805574
 -0.089967	  0.574970	  0.801547
 -0.106941	  0.584627	  0.795947
 -0.123879	  0.592686	  0.788326
 -0.140559	  0.599515	  0.779468
 -0.157031	  0.606840	  0.770315
 -0.173014	  0.614853	  0.760807
 -0.186956	  0.622297	  0.751266
 -0.201498	  0.629096	  0.739652
 -0.217582	  0.639968	  0.725158
 -0.232544	  0.648347	  0.713919
 -0.244721	  0.655105	  0.704543
 -0.257886	  0.665499	  0.691808
 -0.267931	  0.676590	  0.680442
 -0.279491	  0.689173	  0.666375
 -0.291114	  0.696806	  0.656872
 -0.307363	  0.705011	  0.647027
 -0.328552	  0.714590	  0.636275
 -0.341475	  0.723933	  0.628442
 -0.355035	  0.738489	  0.618452
 -0.365004	  0.751677	  0.610207
 -0.371902	  0.764045	  0.604472
 -0.383453	  0.779433	  0.595626
 -0.399961	  0.800530	  0.583405
 -0.407956	  0.811614	  0.577200
 -0.414867	  0.820138	  0.572098
 -0.428693	  0.836553	  0.564361
 -0.447032	  0.856936	  0.555806
 -0.456495	  0.866167	  0.553219
 -0.468386	  0.878014	  0.547314
 -0.484441	  0.893656	  0.537271
 -0.498295	  0.905780	  0.530076
 -0.513289	  0.919108	  0.523113
 -0.524440	  0.929779	  0.519267
 -0.538431	  0.942668	  0.510908
 -0.550647	  0.953856	  0.502978
 -0.568491	  0.964939	  0.492916
 -0.586621	  0.974407	  0.484689
 -0.605095	  0.982194	  0.479817
 -0.614862	  0.986555	  0.474700
 -0.631749	  0.998081	  0.468575
 -0.656943	  1.020067	  0.461948
 -0.668022	  1.027841	  0.458248
 -0.679758	  1.036452	  0.456524
 -0.706288	  1.045098	  0.447776
 -0.705367	  1.068627	  0.448069
 -0.726082	  1.069282	  0.441206
 -0.742323	  1.089903	  0.432646
 -0.752003	  1.103700	  0.420388
 -0.769658	  1.119696	  0.411213
 -0.774028	  1.127391	  0.406505
 -0.786387	  1.133040	  0.402595
 -0.812081	  1.148475	  0.397723
 -0.830294	  1.154254	  0.391132
 -0.848921	  1.163295	  0.388787
 -0.867356	  1.174744	  0.379023
 -0.884021	  1.184595	  0.380060
 -0.891408	  1.189245	  0.363069
 -0.913168	  1.200773	  0.370391
 -0.934521	  1.214458	  0.370349
 -0.946236	  1.218943	  0.384768
 -0.962262	  1.228903	  0.373346
 -0.979893	  1.238385	  0.378144
 -1.003975	  1.249616	  0.374872
 -1.021193	  1.256980	  0.383472
 -1.040672	  1.260099	  0.376894
 -1.063348	  1.274413	  0.384746
 -1.069396	  1.280724	  0.384253
 -1.084453	  1.286535	  0.389845
 -1.111771	  1.297961	  0.395127
 -1.131267	  1.304559	  0.406835
 -1.146221	  1.309118	  0.418257
 -1.157847	  1.313456	  0.425541
 -1.175612	  1.321026	  0.437934
 -1.186328	  1.326630	  0.443232
 -1.206278	  1.337436	  0.450983
 -1.223657	  1.348768	  0.456496
 -1.233007	  1.356741	  0.458727
 -1.246845	  1.370210	  0.462801
 -1.262757	  1.385558	  0.466576
 -1.282505	  1.406375	  0.460074
 -1.297315	  1.430649	  0.452754
 -1.304280	  1.443510	  0.449473
 -1.311096	  1.451101	  0.446311
 -1.324058	  1.468246	  0.445316
 -1.341381	  1.477387	  0.444903
 -1.356109	  1.483342	  0.443265
 -1.376303	  1.492443	  0.441132
 -1.394145	  1.504155	  0.439292
 -1.405260	  1.512693	  0.434875
 -1.422028	  1.523962	  0.428011
 -1.438240	  1.532520	  0.421914
 -1.454681	  1.541807	  0.414595
 -1.474268	  1.559807	  0.400885
 -1.478688	  1.572041	  0.378799
 -1.479190	  1.577412	  0.367890
 -1.479265	  1.585935	  0.347581
 -1.480083	  1.594995	  0.328558
 -1.480951	  1.603011	  0.314860
 -1.482437	  1.613789	  0.295870
 -1.484342	  1.623990	  0.273341
 -1.485728	  1.629286	  0.257961
 -1.486439	  1.634857	  0.241342
 -1.482590	  1.639578	  0.219071
 -1.478566	  1.641754	  0.198401
 -1.477205	  1.639967	  0.175075
 -1.477214	  1.637892	  0.150380
 -1.477463	  1.638033	  0.136855
 -1.478698	  1.641756	  0.115105
 -1.486979	  1.645829	  0.101127
 -1.498903	  1.646720	  0.081732
 -1.519390	  1.649314	  0.063619
 -1.543161	  1.667832	  0.046687
 -1.552007	  1.678734	  0.039197
 -1.562389	  1.689658	  0.029454
 -1.572199	  1.705111	  0.019213
 -1.577982	  1.723499	  0.010801
 -1.581165	  1.739979	 -0.001064
 -1.586315	  1.756091	 -0.016730
 -1.593609	  1.769281	 -0.032173
 -1.607762	  1.780741	 -0.047321
 -1.620322	  1.787509	 -0.055947
 -1.635876	  1.794476	 -0.059063
 -1.651809	  1.811057	 -0.063123
 -1.662394	  1.827326	 -0.072289
 -1.679709	  1.849769	 -0.083254
 -1.686166	  1.857635	 -0.087189
