  1.113846	 -0.781503	  2.042759
  1.127317	 -0.783419	  2.049020
  1.140788	 -0.785335	  2.055281
  1.126067	 -0.779872	  2.040376
  1.107226	 -0.778989	  2.033507
  1.088505	 -0.777021	  2.026877
  1.068807	 -0.775411	  2.022066
  1.048785	 -0.775031	  2.016349
  1.029355	 -0.776980	  2.010538
  1.012560	 -0.780312	  2.000131
  0.995286	 -0.780195	  1.990348
  0.977555	 -0.778365	  1.981017
  0.960149	 -0.777760	  1.970879
  0.942200	 -0.780280	  1.960585
  0.924236	 -0.784451	  1.952497
  0.905632	 -0.786275	  1.947310
  0.886625	 -0.787019	  1.940787
  0.867871	 -0.788437	  1.932876
  0.850016	 -0.789280	  1.924128
  0.831417	 -0.789329	  1.916273
  0.810923	 -0.792955	  1.910525
  0.793240	 -0.795060	  1.902761
  0.777856	 -0.799808	  1.889786
  0.761541	 -0.805007	  1.880734
  0.743658	 -0.804936	  1.872527
  0.723991	 -0.804489	  1.865280
  0.703410	 -0.807778	  1.858947
  0.684734	 -0.812498	  1.852467
  0.671004	 -0.817044	  1.840241
  0.654736	 -0.818473	  1.827190
  0.638627	 -0.820268	  1.814109
  0.621576	 -0.823093	  1.802619
  0.602718	 -0.826620	  1.797566
  0.583429	 -0.829674	  1.791004
  0.565633	 -0.832974	  1.784237
  0.547846	 -0.835768	  1.775342
  0.530015	 -0.838386	  1.765979
  0.511954	 -0.840650	  1.758227
  0.489843	 -0.840088	  1.754127
  0.469687	 -0.836242	  1.750396
  0.453574	 -0.834610	  1.741555
  0.436343	 -0.833787	  1.730517
  0.419950	 -0.833917	  1.718598
  0.403647	 -0.834018	  1.706900
  0.383745	 -0.832054	  1.698244
  0.363300	 -0.830135	  1.694738
  0.344980	 -0.825659	  1.690339
  0.327931	 -0.822828	  1.681116
  0.310054	 -0.821180	  1.671228
  0.292158	 -0.820551	  1.661795
  0.274165	 -0.818575	  1.653624
  0.256219	 -0.816228	  1.645004
  0.238759	 -0.812858	  1.636141
  0.221314	 -0.810367	  1.626000
  0.204428	 -0.809691	  1.615049
  0.185203	 -0.810533	  1.607200
  0.165958	 -0.811265	  1.599969
  0.148880	 -0.807879	  1.593686
  0.131492	 -0.806342	  1.583590
  0.113583	 -0.804954	  1.573009
  0.094414	 -0.803112	  1.565551
  0.074612	 -0.796543	  1.560778
  0.057302	 -0.790565	  1.554363
  0.039988	 -0.784240	  1.546270
  0.021436	 -0.777813	  1.539199
  0.001870	 -0.774367	  1.532706
 -0.013160	 -0.774962	  1.524045
 -0.031313	 -0.773845	  1.513618
 -0.051646	 -0.774032	  1.505343
 -0.070048	 -0.770700	  1.499890
 -0.087588	 -0.764772	  1.493228
 -0.108050	 -0.760750	  1.487512
 -0.126144	 -0.761532	  1.481178
 -0.144406	 -0.763308	  1.472905
 -0.164476	 -0.762621	  1.466495
 -0.182145	 -0.758160	  1.460715
 -0.201011	 -0.752944	  1.453700
 -0.220358	 -0.750935	  1.447541
 -0.237830	 -0.752722	  1.439833
 -0.257894	 -0.754718	  1.432144
 -0.277988	 -0.753701	  1.427369
 -0.293436	 -0.749398	  1.420180
 -0.311858	 -0.746336	  1.411789
 -0.334111	 -0.746892	  1.404076
 -0.352033	 -0.749013	  1.399065
 -0.370275	 -0.749321	  1.395681
 -0.392302	 -0.752039	  1.390393
 -0.407910	 -0.753723	  1.384423
 -0.426804	 -0.753879	  1.378076
 -0.449498	 -0.754706	  1.373535
 -0.467607	 -0.759396	  1.366633
 -0.482422	 -0.763621	  1.356992
 -0.501679	 -0.767920	  1.348105
 -0.520092	 -0.770654	  1.345109
 -0.540838	 -0.769830	  1.344599
 -0.564950	 -0.769512	  1.335543
 -0.580146	 -0.770855	  1.329674
 -0.599164	 -0.768609	  1.330496
 -0.620277	 -0.762922	  1.327393
 -0.640647	 -0.765798	  1.321453
 -0.658714	 -0.772367	  1.319961
 -0.677860	 -0.770291	  1.324483
 -0.698152	 -0.762470	  1.330258
 -0.716951	 -0.759608	  1.329058
 -0.741987	 -0.763341	  1.323460
 -0.760188	 -0.766221	  1.324459
 -0.776946	 -0.757410	  1.333676
 -0.797174	 -0.745841	  1.338462
 -0.811824	 -0.729909	  1.342219
 -0.826799	 -0.721760	  1.347868
 -0.845103	 -0.713572	  1.356527
 -0.861205	 -0.710110	  1.363616
 -0.878153	 -0.701352	  1.373773
 -0.892438	 -0.690571	  1.384120
 -0.904872	 -0.678301	  1.393520
 -0.916921	 -0.665787	  1.403686
 -0.928468	 -0.653187	  1.414149
 -0.940119	 -0.640881	  1.424897
 -0.952195	 -0.629414	  1.435936
 -0.964969	 -0.618983	  1.447275
 -0.978116	 -0.608765	  1.458347
 -0.995042	 -0.599424	  1.463439
 -1.011991	 -0.590088	  1.468496
 -1.028952	 -0.580781	  1.473517
 -1.048677	 -0.579031	  1.470815
 -1.068399	 -0.577567	  1.467836
 -1.088122	 -0.576104	  1.464856
 -1.107839	 -0.574638	  1.461856
 -1.126884	 -0.572620	  1.456095
 -1.145909	 -0.570591	  1.450272
 -1.164935	 -0.568561	  1.444449
 -1.183818	 -0.566221	  1.438289
 -1.202117	 -0.562806	  1.430976
 -1.220414	 -0.559386	  1.423659
 -1.238710	 -0.555967	  1.416344
 -1.257113	 -0.552638	  1.409252
 -1.275659	 -0.549438	  1.402486
 -1.294206	 -0.546239	  1.395721
 -1.312750	 -0.543062	  1.388947
 -1.330317	 -0.545910	  1.379839
 -1.344881	 -0.554704	  1.369332
 -1.359434	 -0.563519	  1.358820
 -1.374047	 -0.572249	  1.348322
 -1.390008	 -0.578893	  1.338271
 -1.405981	 -0.585518	  1.328222
 -1.421937	 -0.592138	  1.318153
 -1.433165	 -0.597263	  1.302423
 -1.442270	 -0.601680	  1.285212
 -1.448524	 -0.605328	  1.267179
 -1.449464	 -0.607616	  1.247714
 -1.452058	 -0.609942	  1.226672
 -1.455127	 -0.609951	  1.206251
 -1.459698	 -0.606576	  1.186839
 -1.462273	 -0.608183	  1.168535
 -1.464622	 -0.610555	  1.148416
 -1.471363	 -0.609346	  1.128079
 -1.480627	 -0.608644	  1.110506
 -1.485480	 -0.610523	  1.092066
 -1.487158	 -0.612080	  1.072701
 -1.494346	 -0.610688	  1.049824
 -1.500488	 -0.610355	  1.030259
 -1.509095	 -0.618799	  1.013327
 -1.520965	 -0.623133	  0.999468
 -1.531003	 -0.623394	  0.980575
 -1.542644	 -0.622686	  0.964764
 -1.557237	 -0.622063	  0.949757
 -1.571339	 -0.621701	  0.932993
 -1.577411	 -0.627750	  0.915482
 -1.585761	 -0.634744	  0.898091
 -1.593689	 -0.637218	  0.881278
 -1.605242	 -0.638767	  0.863400
 -1.617778	 -0.641620	  0.847563
 -1.636217	 -0.646149	  0.833449
 -1.651829	 -0.652091	  0.824100
 -1.668217	 -0.657095	  0.816976
 -1.686670	 -0.660890	  0.806834
 -1.704796	 -0.667195	  0.799733
 -1.722812	 -0.672458	  0.794753
 -1.743329	 -0.671901	  0.785745
 -1.759781	 -0.674584	  0.776682
 -1.777201	 -0.678227	  0.770371
 -1.795673	 -0.681736	  0.762142
 -1.814224	 -0.685320	  0.751636
 -1.830701	 -0.686429	  0.745370
 -1.851228	 -0.690082	  0.739460
 -1.871388	 -0.692906	  0.731058
 -1.886869	 -0.690626	  0.723817
 -1.906953	 -0.690020	  0.718288
 -1.926350	 -0.690584	  0.712083
 -1.944423	 -0.690499	  0.703948
 -1.963717	 -0.691113	  0.697958
 -1.983105	 -0.692884	  0.693367
 -2.002512	 -0.694667	  0.688888
 -2.021805	 -0.696531	  0.683918
 -2.040861	 -0.698366	  0.678076
 -2.059744	 -0.700074	  0.671728
 -2.077982	 -0.701246	  0.663743
 -2.096236	 -0.703698	  0.655725
 -2.114460	 -0.706701	  0.647473
 -2.132605	 -0.706792	  0.638977
 -2.150077	 -0.707620	  0.630117
 -2.168313	 -0.710174	  0.621858
 -2.187553	 -0.710693	  0.614330
 -2.205772	 -0.709688	  0.607027
 -2.223853	 -0.707583	  0.599412
 -2.242950	 -0.706311	  0.593063
 -2.262656	 -0.706293	  0.587438
 -2.281823	 -0.707540	  0.580151
 -2.300161	 -0.709146	  0.572306
 -2.316659	 -0.704226	  0.559133
 -2.335034	 -0.702968	  0.551338
 -2.353409	 -0.701710	  0.543543
