 -0.837084	  2.372120	  1.689152
 -0.828796	  2.348634	  1.672428
 -0.804011	  2.310507	  1.665387
 -0.782511	  2.268653	  1.654502
 -0.768888	  2.223288	  1.639462
 -0.747187	  2.178127	  1.624905
 -0.723255	  2.133914	  1.610944
 -0.702796	  2.091798	  1.593582
 -0.682290	  2.048586	  1.578361
 -0.662764	  2.004124	  1.567302
 -0.640859	  1.958943	  1.558648
 -0.622099	  1.913349	  1.549903
 -0.604677	  1.870380	  1.540042
 -0.585801	  1.825833	  1.528338
 -0.565333	  1.780594	  1.515214
 -0.542972	  1.738174	  1.504144
 -0.517187	  1.701268	  1.501172
 -0.487317	  1.669411	  1.507206
 -0.436821	  1.630763	  1.526444
 -0.358231	  1.587704	  1.561487
 -0.290880	  1.553377	  1.587970
 -0.233834	  1.520150	  1.605069
 -0.190476	  1.492739	  1.616814
 -0.147749	  1.459289	  1.626205
 -0.114846	  1.425701	  1.633650
 -0.088264	  1.382297	  1.637239
 -0.060607	  1.306832	  1.635867
 -0.038843	  1.228614	  1.626657
 -0.025146	  1.175465	  1.607099
 -0.013048	  1.128219	  1.577711
 -0.000518	  1.082927	  1.538043
  0.004613	  1.047880	  1.503556
  0.003658	  1.013020	  1.465044
 -0.002787	  0.981520	  1.427551
 -0.014129	  0.961040	  1.401077
 -0.051282	  0.919309	  1.341411
 -0.088846	  0.853858	  1.273558
 -0.105153	  0.778507	  1.228689
 -0.098154	  0.718854	  1.206109
 -0.081625	  0.673513	  1.190186
 -0.061286	  0.631413	  1.174167
 -0.039824	  0.588036	  1.157483
 -0.018791	  0.541626	  1.141078
 -0.002322	  0.497440	  1.124963
  0.008505	  0.456923	  1.107548
  0.013576	  0.419193	  1.087250
  0.012431	  0.389826	  1.066630
  0.005762	  0.364875	  1.042542
 -0.016792	  0.321165	  0.987218
 -0.061687	  0.242381	  0.886044
 -0.088013	  0.170273	  0.813165
 -0.087959	  0.114546	  0.775825
 -0.078057	  0.070218	  0.753853
 -0.063361	  0.020173	  0.733447
 -0.043884	 -0.031513	  0.716027
 -0.025608	 -0.070321	  0.706432
  0.003301	 -0.109552	  0.711802
  0.048518	 -0.161296	  0.730860
  0.090929	 -0.193274	  0.774793
  0.148457	 -0.224377	  0.832443
  0.248497	 -0.278748	  0.895250
  0.319491	 -0.324038	  0.917710
  0.362270	 -0.358445	  0.921735
  0.398134	 -0.394930	  0.917192
  0.428349	 -0.433770	  0.906352
  0.453468	 -0.473717	  0.891495
  0.475680	 -0.516880	  0.873584
  0.494550	 -0.561637	  0.854312
  0.509780	 -0.605204	  0.835727
  0.524016	 -0.650665	  0.817784
  0.538157	 -0.694690	  0.802723
  0.552853	 -0.739123	  0.789986
  0.567874	 -0.784273	  0.779905
  0.585629	 -0.830119	  0.770865
  0.605322	 -0.877187	  0.760783
  0.623886	 -0.923014	  0.750520
  0.640545	 -0.968419	  0.740776
  0.656712	 -1.014308	  0.730230
  0.673077	 -1.059629	  0.719085
  0.690311	 -1.105086	  0.708187
  0.710020	 -1.151212	  0.697772
  0.731443	 -1.196664	  0.686688
  0.753572	 -1.241415	  0.674319
  0.775237	 -1.284124	  0.661546
  0.795372	 -1.324922	  0.651198
  0.810690	 -1.364264	  0.650810
  0.816465	 -1.407567	  0.673563
  0.813574	 -1.486874	  0.753347
  0.812482	 -1.602274	  0.833596
  0.811771	 -1.684175	  0.854417
  0.815385	 -1.742886	  0.855967
  0.823464	 -1.786647	  0.845732
  0.833642	 -1.819048	  0.826329
  0.846826	 -1.842435	  0.792983
  0.886877	 -1.860155	  0.683453
  0.966991	 -1.856069	  0.554960
  1.020153	 -1.866663	  0.493909
  1.049857	 -1.894968	  0.466306
  1.072012	 -1.935815	  0.449165
  1.090523	 -1.982008	  0.433861
  1.107744	 -2.027782	  0.419460
  1.125186	 -2.071513	  0.407140
  1.143449	 -2.115297	  0.396767
  1.163011	 -2.160082	  0.389206
  1.181459	 -2.206966	  0.381870
  1.199917	 -2.255218	  0.373321
  1.219988	 -2.301078	  0.362737
  1.240506	 -2.344293	  0.350229
  1.260739	 -2.386461	  0.336423
  1.281658	 -2.429795	  0.322720
  1.306012	 -2.471871	  0.310163
  1.323608	 -2.513054	  0.292083
  1.345115	 -2.556572	  0.279171
  1.367490	 -2.601695	  0.266500
  1.379353	 -2.652278	  0.250612
  1.393146	 -2.678801	  0.253118
