 -1.303842	 -1.330038	 -1.654332
 -1.315428	 -1.336014	 -1.653698
 -1.299121	 -1.322415	 -1.653363
 -1.277228	 -1.313985	 -1.652112
 -1.263342	 -1.309611	 -1.655637
 -1.245562	 -1.299960	 -1.657794
 -1.224332	 -1.289957	 -1.658068
 -1.207368	 -1.284734	 -1.662625
 -1.190038	 -1.277815	 -1.665947
 -1.169488	 -1.268829	 -1.665911
 -1.151324	 -1.264731	 -1.667286
 -1.131948	 -1.259811	 -1.668714
 -1.112437	 -1.251238	 -1.669425
 -1.096256	 -1.243917	 -1.674604
 -1.077359	 -1.236416	 -1.679911
 -1.059267	 -1.227790	 -1.679820
 -1.041702	 -1.220109	 -1.681237
 -1.020319	 -1.212395	 -1.683762
 -1.003985	 -1.202032	 -1.680060
 -0.991663	 -1.189673	 -1.674923
 -0.974346	 -1.174050	 -1.668125
 -0.957832	 -1.164661	 -1.666401
 -0.941715	 -1.155409	 -1.669020
 -0.923901	 -1.143266	 -1.667310
 -0.911091	 -1.129996	 -1.662117
 -0.898655	 -1.114943	 -1.654447
 -0.880972	 -1.102923	 -1.646315
 -0.862890	 -1.098382	 -1.646503
 -0.842447	 -1.092081	 -1.645628
 -0.824124	 -1.081472	 -1.639860
 -0.814112	 -1.067715	 -1.634295
 -0.798209	 -1.057105	 -1.632544
 -0.775286	 -1.050405	 -1.629191
 -0.756823	 -1.045292	 -1.624115
 -0.741836	 -1.037013	 -1.620005
 -0.723182	 -1.028549	 -1.616627
 -0.702537	 -1.023712	 -1.611858
 -0.688304	 -1.015281	 -1.607059
 -0.669941	 -1.008142	 -1.605102
 -0.647345	 -1.002130	 -1.599786
 -0.633495	 -0.993055	 -1.592422
 -0.616695	 -0.981881	 -1.586944
 -0.601017	 -0.971450	 -1.583238
 -0.582976	 -0.963425	 -1.576584
 -0.564222	 -0.956029	 -1.570718
 -0.546984	 -0.949626	 -1.564483
 -0.526719	 -0.943137	 -1.562616
 -0.505074	 -0.937865	 -1.566606
 -0.485114	 -0.931441	 -1.576327
 -0.469615	 -0.923856	 -1.577526
 -0.451884	 -0.914224	 -1.573865
 -0.434507	 -0.902423	 -1.573691
 -0.415371	 -0.893538	 -1.577538
 -0.397015	 -0.889882	 -1.580486
 -0.376886	 -0.886036	 -1.581347
 -0.357142	 -0.879716	 -1.584149
 -0.340814	 -0.868571	 -1.586784
 -0.324988	 -0.858371	 -1.588025
 -0.308142	 -0.848346	 -1.591478
 -0.288091	 -0.839326	 -1.597986
 -0.269711	 -0.831711	 -1.599012
 -0.253797	 -0.818098	 -1.596442
 -0.238056	 -0.799922	 -1.592888
 -0.227080	 -0.787272	 -1.591233
 -0.212733	 -0.778009	 -1.589928
 -0.192636	 -0.769639	 -1.588166
 -0.170534	 -0.760294	 -1.586270
 -0.153721	 -0.752269	 -1.580460
 -0.138904	 -0.739759	 -1.572074
 -0.127615	 -0.728666	 -1.572379
 -0.108708	 -0.708121	 -1.582098
 -0.095414	 -0.689774	 -1.595265
 -0.083430	 -0.670221	 -1.604751
 -0.077993	 -0.663032	 -1.607674
 -0.056724	 -0.651690	 -1.598765
 -0.037062	 -0.642906	 -1.588858
 -0.022078	 -0.633772	 -1.583657
 -0.005396	 -0.623595	 -1.582782
  0.014697	 -0.616158	 -1.580830
  0.032800	 -0.606313	 -1.581220
  0.047238	 -0.595399	 -1.582593
  0.066473	 -0.584376	 -1.585070
  0.082600	 -0.576616	 -1.586375
  0.100924	 -0.566825	 -1.587130
  0.119779	 -0.557566	 -1.588233
  0.137466	 -0.552040	 -1.586071
  0.159116	 -0.546178	 -1.583403
  0.176068	 -0.537487	 -1.586452
  0.191534	 -0.527129	 -1.591779
  0.211009	 -0.515554	 -1.595787
  0.228940	 -0.510267	 -1.594202
  0.249059	 -0.504626	 -1.591033
  0.267877	 -0.498176	 -1.591926
  0.285461	 -0.490661	 -1.594196
  0.306512	 -0.482104	 -1.594031
  0.326592	 -0.475493	 -1.592950
  0.342236	 -0.469096	 -1.590767
  0.355749	 -0.450423	 -1.586424
  0.371070	 -0.430621	 -1.581904
  0.382830	 -0.419818	 -1.579603
  0.398380	 -0.408477	 -1.580886
  0.417135	 -0.395115	 -1.581993
  0.434439	 -0.385815	 -1.582874
  0.453153	 -0.379085	 -1.581187
  0.469328	 -0.368164	 -1.584060
  0.485553	 -0.358461	 -1.581949
  0.501819	 -0.351621	 -1.583717
  0.519526	 -0.348456	 -1.586449
  0.534326	 -0.345298	 -1.597934
  0.545593	 -0.336699	 -1.613312
  0.550109	 -0.324464	 -1.629216
  0.554789	 -0.317493	 -1.645771
  0.556933	 -0.310810	 -1.666112
  0.558958	 -0.298303	 -1.682528
  0.564754	 -0.285911	 -1.694660
  0.571148	 -0.269739	 -1.709988
  0.572283	 -0.256532	 -1.726131
  0.573283	 -0.251806	 -1.742981
  0.577117	 -0.239094	 -1.761658
  0.581914	 -0.223020	 -1.774574
  0.591218	 -0.209193	 -1.781979
  0.599483	 -0.192996	 -1.793995
  0.602973	 -0.177022	 -1.807442
  0.609730	 -0.164895	 -1.816829
  0.622452	 -0.152154	 -1.826419
  0.640524	 -0.140282	 -1.838706
  0.650885	 -0.130163	 -1.851022
  0.660159	 -0.118121	 -1.863677
  0.674251	 -0.108950	 -1.872556
  0.689979	 -0.100643	 -1.882035
  0.704499	 -0.091541	 -1.894088
  0.721208	 -0.082702	 -1.907861
  0.737621	 -0.075882	 -1.912976
  0.757631	 -0.068571	 -1.913506
  0.777808	 -0.061633	 -1.915466
  0.794208	 -0.054231	 -1.919367
  0.813680	 -0.047189	 -1.920873
  0.836919	 -0.045435	 -1.922793
  0.856924	 -0.044898	 -1.923378
  0.872435	 -0.039744	 -1.919128
  0.892090	 -0.031568	 -1.915013
  0.908426	 -0.021846	 -1.909755
  0.925992	 -0.014390	 -1.902535
  0.943055	 -0.008612	 -1.893658
  0.957559	 -0.004052	 -1.880690
  0.971827	  0.000370	 -1.867404
  0.983097	  0.002725	 -1.851052
  0.994322	  0.005037	 -1.834647
  1.003892	  0.006733	 -1.817149
  1.011644	  0.007723	 -1.798713
  1.018100	  0.008492	 -1.780125
  1.023013	  0.009824	 -1.759887
  1.028837	  0.011885	 -1.740510
  1.039152	  0.012443	 -1.723948
  1.048727	  0.012017	 -1.706352
  1.054159	  0.012602	 -1.686685
  1.058715	  0.014681	 -1.666810
  1.067052	  0.016319	 -1.648309
  1.077238	  0.016042	 -1.631484
  1.092129	  0.015425	 -1.617006
  1.106564	  0.015396	 -1.603043
  1.120682	  0.015568	 -1.588869
  1.134826	  0.015564	 -1.574745
  1.149016	  0.015569	 -1.560648
  1.165834	  0.018857	 -1.550322
  1.183800	  0.024665	 -1.543686
  1.201704	  0.030644	 -1.537077
  1.219583	  0.037893	 -1.531824
  1.236512	  0.048547	 -1.531105
  1.253450	  0.059160	 -1.530427
  1.270040	  0.070346	 -1.530198
  1.286410	  0.081829	 -1.530426
  1.302740	  0.093415	 -1.530572
  1.319005	  0.105027	 -1.530027
  1.335306	  0.116603	 -1.529391
  1.351664	  0.128052	 -1.528544
  1.368245	  0.139295	 -1.527606
  1.385005	  0.150169	 -1.526052
  1.401819	  0.160543	 -1.523473
  1.418352	  0.171663	 -1.521353
  1.434482	  0.183310	 -1.519304
  1.450302	  0.195312	 -1.517067
  1.466144	  0.207297	 -1.514808
  1.481980	  0.219422	 -1.513326
  1.497776	  0.231610	 -1.511905
  1.512935	  0.244649	 -1.512277
  1.527722	  0.258056	 -1.513543
  1.542690	  0.271281	 -1.514553
  1.558292	  0.283794	 -1.514604
  1.573902	  0.296299	 -1.514644
  1.590326	  0.307676	 -1.513771
  1.607426	  0.317849	 -1.511997
  1.623662	  0.329057	 -1.511026
  1.639113	  0.341066	 -1.511034
  1.656967	  0.352597	 -1.510144
  1.674479	  0.363962	 -1.508696
  1.694611	  0.371917	 -1.504632
  1.711536	  0.372369	 -1.499285
  1.734887	  0.375271	 -1.492585
  1.751889	  0.383910	 -1.490718
  1.766859	  0.393535	 -1.491169
  1.789414	  0.401386	 -1.487959
  1.807879	  0.412695	 -1.486629
  1.818537	  0.423937	 -1.488002
  1.837338	  0.434754	 -1.488301
  1.856364	  0.443017	 -1.487641
  1.874732	  0.451340	 -1.487481
  1.892940	  0.459618	 -1.487347
  1.911275	  0.467594	 -1.487752
  1.929648	  0.475477	 -1.488322
  1.948007	  0.483352	 -1.488895
  1.966231	  0.491100	 -1.489716
  1.984623	  0.498913	 -1.490563
