 -1.571014	  1.275788	 -1.487949
 -1.564629	  1.274757	 -1.475442
 -1.561946	  1.274324	 -1.470187
 -1.551474	  1.275902	 -1.453223
 -1.540990	  1.277504	 -1.436267
 -1.530507	  1.279107	 -1.419310
 -1.520023	  1.280710	 -1.402353
 -1.509538	  1.282338	 -1.385403
 -1.498709	  1.286849	 -1.369207
 -1.487821	  1.292313	 -1.353346
 -1.476932	  1.297784	 -1.337487
 -1.466044	  1.303255	 -1.321628
 -1.455155	  1.308726	 -1.305769
 -1.444266	  1.314196	 -1.289910
 -1.433412	  1.319658	 -1.274031
 -1.426801	  1.324061	 -1.255682
 -1.421265	  1.328170	 -1.236908
 -1.415739	  1.332276	 -1.218130
 -1.410213	  1.336383	 -1.199353
 -1.404687	  1.340490	 -1.180575
 -1.399216	  1.344620	 -1.161798
 -1.400576	  1.351687	 -1.143162
 -1.403831	  1.359829	 -1.125362
 -1.408132	  1.369111	 -1.108714
 -1.415400	  1.379120	 -1.092591
 -1.424516	  1.389300	 -1.079520
 -1.434300	  1.398205	 -1.063854
 -1.445062	  1.406503	 -1.050530
 -1.456016	  1.413605	 -1.034851
 -1.466249	  1.421018	 -1.019334
 -1.477356	  1.428471	 -1.004502
 -1.487654	  1.437159	 -0.989657
 -1.498244	  1.446381	 -0.975363
 -1.508980	  1.456061	 -0.961772
 -1.520079	  1.465750	 -0.947734
 -1.531512	  1.475849	 -0.934759
 -1.543249	  1.485452	 -0.921435
 -1.555883	  1.494149	 -0.908741
 -1.568398	  1.503200	 -0.895389
 -1.582391	  1.511060	 -0.884089
 -1.596231	  1.519949	 -0.872276
 -1.610459	  1.528467	 -0.860776
 -1.625234	  1.535328	 -0.849057
 -1.639409	  1.543333	 -0.837199
 -1.653644	  1.550976	 -0.825297
 -1.667947	  1.557135	 -0.812113
 -1.681064	  1.564680	 -0.799039
 -1.695164	  1.569471	 -0.785897
 -1.708974	  1.575885	 -0.772604
 -1.723654	  1.581204	 -0.760427
 -1.738778	  1.586933	 -0.748848
 -1.753922	  1.593367	 -0.737175
 -1.777495	  1.604746	 -0.717844
 -1.782863	  1.607471	 -0.713266
