 -1.960941	  0.605577	 -2.229100
 -1.941525	  0.599581	 -2.207030
 -1.898132	  0.614779	 -2.182593
 -1.850217	  0.628147	 -2.168453
 -1.799796	  0.632237	 -2.158256
 -1.751878	  0.643310	 -2.143253
 -1.705553	  0.652145	 -2.123509
 -1.659407	  0.663144	 -2.105072
 -1.614319	  0.674632	 -2.085388
 -1.570099	  0.686491	 -2.065513
 -1.525626	  0.697883	 -2.048276
 -1.480390	  0.708499	 -2.032260
 -1.434976	  0.718661	 -2.014953
 -1.389950	  0.730180	 -1.996540
 -1.345610	  0.743090	 -1.977052
 -1.301377	  0.757122	 -1.956780
 -1.257328	  0.772301	 -1.937055
 -1.213806	  0.788176	 -1.918219
 -1.170454	  0.804540	 -1.900008
 -1.127607	  0.821041	 -1.882265
 -1.084900	  0.837894	 -1.864528
 -1.042100	  0.855669	 -1.846437
 -0.999279	  0.873935	 -1.828070
 -0.955988	  0.891791	 -1.808860
 -0.913075	  0.909482	 -1.790268
 -0.870783	  0.927665	 -1.773571
 -0.830189	  0.946538	 -1.759587
 -0.792192	  0.966269	 -1.748387
 -0.756156	  0.986850	 -1.739622
 -0.720287	  1.008642	 -1.732812
 -0.679228	  1.034089	 -1.727293
 -0.628223	  1.064408	 -1.723088
 -0.567094	  1.096807	 -1.720433
 -0.503780	  1.125367	 -1.717289
 -0.448919	  1.143949	 -1.710575
 -0.408292	  1.151957	 -1.701911
 -0.375233	  1.152775	 -1.691883
 -0.335963	  1.146498	 -1.675914
 -0.285264	  1.130107	 -1.648703
 -0.228853	  1.105167	 -1.608874
 -0.175231	  1.078321	 -1.561121
 -0.128962	  1.051005	 -1.510302
 -0.087503	  1.023401	 -1.454078
 -0.049472	  0.992361	 -1.386938
 -0.011391	  0.955768	 -1.317794
  0.056858	  0.894828	 -1.270873
  0.129036	  0.854454	 -1.224337
  0.197393	  0.837198	 -1.186731
  0.252655	  0.835249	 -1.158659
  0.299520	  0.840749	 -1.132188
  0.341678	  0.858510	 -1.109672
  0.381504	  0.879596	 -1.082898
  0.415933	  0.910093	 -1.063043
  0.446186	  0.943153	 -1.046613
  0.477378	  0.978301	 -1.029394
  0.505528	  1.012980	 -1.016386
  0.532540	  1.056119	 -1.016785
  0.570440	  1.111086	 -1.025455
  0.625077	  1.160806	 -1.036566
  0.670198	  1.212332	 -1.030727
  0.715671	  1.258443	 -1.021283
  0.762434	  1.291904	 -1.015928
  0.806469	  1.313136	 -1.014899
  0.848410	  1.327561	 -1.014145
  0.890293	  1.339145	 -1.011487
  0.934248	  1.348377	 -1.006172
  0.980384	  1.354643	 -0.998000
  1.027764	  1.357966	 -0.987886
  1.075642	  1.360344	 -0.975855
  1.122940	  1.364225	 -0.962122
  1.169522	  1.370723	 -0.947135
  1.215591	  1.380611	 -0.930958
  1.261292	  1.393591	 -0.914764
  1.306948	  1.408620	 -0.899901
  1.352664	  1.424692	 -0.886165
  1.398878	  1.439747	 -0.872286
  1.445281	  1.452249	 -0.856540
  1.491153	  1.462707	 -0.837740
  1.536065	  1.472146	 -0.817174
  1.580029	  1.481515	 -0.795213
  1.623166	  1.491606	 -0.771851
  1.665872	  1.501912	 -0.747929
  1.708556	  1.512073	 -0.723985
  1.751288	  1.522105	 -0.700486
  1.794721	  1.532268	 -0.677844
  1.839917	  1.542357	 -0.656742
  1.885385	  1.551884	 -0.638045
  1.932481	  1.561368	 -0.620723
  1.979889	  1.570404	 -0.605410
  2.026642	  1.578464	 -0.592187
  2.073679	  1.584828	 -0.579444
  2.121779	  1.589050	 -0.567722
  2.171714	  1.597060	 -0.559651
  2.218823	  1.616913	 -0.554136
  2.266654	  1.630274	 -0.544296
  2.309748	  1.646600	 -0.524457
  2.355761	  1.656820	 -0.510011
  2.399282	  1.671805	 -0.495859
  2.443617	  1.673035	 -0.479260
  2.468053	  1.689765	 -0.484052
