  0.503735	  2.166047	  1.150825
  0.500970	  2.163558	  1.148061
  0.491262	  2.154821	  1.138359
  0.474982	  2.146892	  1.128580
  0.454659	  2.140438	  1.122632
  0.441178	  2.129423	  1.116054
  0.428192	  2.114914	  1.108229
  0.413010	  2.101643	  1.101305
  0.398725	  2.091262	  1.092329
  0.384280	  2.083593	  1.082281
  0.373184	  2.073958	  1.069090
  0.356662	  2.066742	  1.053303
  0.340504	  2.060726	  1.045925
  0.324520	  2.054092	  1.036521
  0.310496	  2.049463	  1.024391
  0.293166	  2.043182	  1.013398
  0.277084	  2.030376	  1.007254
  0.260176	  2.019129	  1.001478
  0.243984	  2.017383	  0.991277
  0.228282	  2.015665	  0.978333
  0.210827	  2.012521	  0.965275
  0.192658	  2.008564	  0.957051
  0.175304	  2.001253	  0.951447
  0.159632	  1.995748	  0.941885
  0.143925	  1.992525	  0.929715
  0.127302	  1.984392	  0.919988
  0.106422	  1.975741	  0.913925
  0.089204	  1.970377	  0.907359
  0.074276	  1.968518	  0.898009
  0.055321	  1.967626	  0.885529
  0.038127	  1.967873	  0.877061
  0.022499	  1.966264	  0.868088
  0.005446	  1.962945	  0.856635
 -0.011887	  1.961034	  0.843978
 -0.027942	  1.962449	  0.831743
 -0.043635	  1.964457	  0.820598
 -0.059788	  1.963856	  0.808922
 -0.076586	  1.964130	  0.795607
 -0.090923	  1.968540	  0.781394
 -0.100562	  1.974560	  0.766438
 -0.113990	  1.983300	  0.753238
 -0.129117	  1.990271	  0.740318
 -0.140959	  1.990596	  0.724747
 -0.156296	  1.991081	  0.710095
 -0.170635	  2.001065	  0.699363
 -0.181785	  2.013585	  0.686111
 -0.192954	  2.018387	  0.670466
 -0.209447	  2.023111	  0.661023
 -0.224294	  2.030457	  0.651377
 -0.239655	  2.038850	  0.634226
 -0.249535	  2.047664	  0.621057
 -0.262285	  2.052687	  0.607847
 -0.278533	  2.056290	  0.596106
 -0.294394	  2.059338	  0.584369
 -0.306428	  2.060980	  0.568320
 -0.321329	  2.065155	  0.553192
 -0.335585	  2.062877	  0.541942
 -0.350075	  2.057243	  0.528495
 -0.366370	  2.052095	  0.517057
 -0.380458	  2.050433	  0.503345
 -0.392402	  2.041588	  0.490459
 -0.404184	  2.031431	  0.477763
 -0.415620	  2.020824	  0.465655
 -0.426280	  2.005941	  0.457823
 -0.437939	  1.988158	  0.453939
 -0.450972	  1.972977	  0.448119
 -0.460679	  1.959559	  0.439602
 -0.463824	  1.941358	  0.431222
 -0.469280	  1.924431	  0.423261
 -0.477647	  1.907884	  0.415396
 -0.486826	  1.892627	  0.409310
 -0.497422	  1.875490	  0.402474
 -0.504271	  1.859980	  0.400317
 -0.508246	  1.833762	  0.387208
 -0.508017	  1.817386	  0.376595
 -0.514778	  1.805899	  0.365593
 -0.514475	  1.788727	  0.355895
 -0.524530	  1.769793	  0.352963
 -0.532812	  1.750213	  0.347890
 -0.549877	  1.735867	  0.347341
 -0.563605	  1.723419	  0.336511
 -0.571031	  1.704770	  0.335908
 -0.580951	  1.683088	  0.337315
 -0.596169	  1.671720	  0.334202
 -0.606917	  1.659770	  0.332121
 -0.620944	  1.641257	  0.331255
 -0.636211	  1.627885	  0.329444
 -0.650300	  1.610693	  0.330789
 -0.658048	  1.594973	  0.329466
 -0.670592	  1.580223	  0.321561
 -0.684067	  1.566189	  0.318648
 -0.697501	  1.549892	  0.318845
 -0.711918	  1.534737	  0.318882
 -0.727414	  1.525722	  0.308391
 -0.741847	  1.512030	  0.298646
 -0.755717	  1.496237	  0.297618
 -0.766563	  1.480237	  0.301450
 -0.778045	  1.463446	  0.298168
 -0.794575	  1.450377	  0.293085
 -0.810059	  1.436624	  0.297995
 -0.822496	  1.422594	  0.311830
 -0.836565	  1.407913	  0.316714
 -0.855495	  1.398521	  0.308893
 -0.870190	  1.384233	  0.315081
 -0.882598	  1.370521	  0.322035
 -0.893837	  1.349294	  0.316028
 -0.902290	  1.331993	  0.309635
 -0.915834	  1.320867	  0.310675
 -0.934748	  1.306392	  0.313657
 -0.948636	  1.294972	  0.310460
 -0.962343	  1.279375	  0.316023
 -0.981411	  1.278484	  0.320556
 -1.000974	  1.271227	  0.327325
 -1.018103	  1.259027	  0.330323
 -1.037457	  1.252328	  0.326661
 -1.058004	  1.248460	  0.318785
 -1.075204	  1.246800	  0.315367
 -1.096154	  1.242319	  0.311442
 -1.116472	  1.236312	  0.318167
 -1.135543	  1.233734	  0.322913
 -1.154320	  1.225492	  0.323858
 -1.175702	  1.221802	  0.323418
 -1.197585	  1.223680	  0.328025
 -1.212091	  1.222092	  0.338109
 -1.232429	  1.217721	  0.342522
 -1.252105	  1.213936	  0.344968
 -1.270859	  1.211020	  0.350278
 -1.291510	  1.213692	  0.356863
 -1.311129	  1.217858	  0.360648
 -1.330483	  1.217978	  0.363695
 -1.348121	  1.215568	  0.372532
 -1.365990	  1.218628	  0.384642
 -1.386492	  1.220414	  0.388452
 -1.405833	  1.219809	  0.389306
 -1.425209	  1.221012	  0.390628
 -1.447514	  1.224797	  0.391824
 -1.463741	  1.233911	  0.388135
 -1.483654	  1.238853	  0.388445
 -1.503286	  1.243244	  0.386335
 -1.520642	  1.249015	  0.383068
 -1.540273	  1.255251	  0.380470
 -1.562210	  1.256459	  0.380432
 -1.580446	  1.261100	  0.371098
 -1.591747	  1.276231	  0.358479
 -1.601176	  1.291065	  0.347152
 -1.611953	  1.301775	  0.337458
 -1.625337	  1.311209	  0.323725
 -1.634238	  1.321806	  0.309416
 -1.641736	  1.332750	  0.296168
 -1.651919	  1.341469	  0.277645
 -1.657695	  1.349121	  0.261609
 -1.662462	  1.356812	  0.245776
 -1.666339	  1.364897	  0.225833
 -1.672997	  1.368147	  0.208152
 -1.677587	  1.372019	  0.189541
 -1.679772	  1.376993	  0.168466
 -1.685966	  1.380277	  0.149439
 -1.689904	  1.376584	  0.129880
 -1.691273	  1.372564	  0.112022
 -1.693334	  1.369954	  0.091190
 -1.695745	  1.368129	  0.071297
 -1.697956	  1.364162	  0.051824
 -1.699810	  1.357051	  0.033224
 -1.701663	  1.349915	  0.014633
 -1.703517	  1.342778	 -0.003958
 -1.705370	  1.335642	 -0.022549
 -1.707112	  1.328389	 -0.041022
 -1.708263	  1.317839	 -0.057978
 -1.708384	  1.306783	 -0.074091
 -1.709559	  1.297292	 -0.092217
 -1.712575	  1.289908	 -0.111377
 -1.716376	  1.282367	 -0.130494
 -1.719932	  1.272794	 -0.147119
 -1.721395	  1.260577	 -0.162733
 -1.720952	  1.249060	 -0.178997
 -1.720406	  1.239303	 -0.196821
 -1.720556	  1.230649	 -0.215132
 -1.723907	  1.220850	 -0.232665
 -1.726116	  1.208030	 -0.248125
 -1.726213	  1.195766	 -0.264209
 -1.723749	  1.184513	 -0.280314
 -1.721831	  1.173692	 -0.297168
 -1.719652	  1.163020	 -0.314013
 -1.717763	  1.152396	 -0.330971
 -1.717729	  1.142363	 -0.347900
 -1.719043	  1.132716	 -0.365049
 -1.723099	  1.122629	 -0.382091
 -1.729573	  1.112472	 -0.397860
 -1.737715	  1.102216	 -0.412043
 -1.745709	  1.091652	 -0.426131
 -1.758497	  1.084274	 -0.440454
 -1.774715	  1.079037	 -0.452221
 -1.788930	  1.068819	 -0.460553
 -1.802930	  1.060874	 -0.471489
 -1.818994	  1.056716	 -0.483891
 -1.836761	  1.051121	 -0.492895
 -1.851425	  1.043333	 -0.501738
 -1.868132	  1.039824	 -0.513746
 -1.885857	  1.036493	 -0.523481
 -1.901775	  1.029900	 -0.532141
 -1.918868	  1.026318	 -0.542639
 -1.936126	  1.023898	 -0.552713
 -1.952754	  1.017526	 -0.561614
 -1.971274	  1.009916	 -0.569135
 -1.989295	  1.007191	 -0.578768
 -2.003890	  1.007093	 -0.590978
 -2.019799	  1.004551	 -0.603089
 -2.036582	  1.000574	 -0.614485
 -2.053568	  0.996357	 -0.623616
 -2.069649	  0.991334	 -0.634986
 -2.086378	  0.985799	 -0.643843
 -2.102235	  0.979585	 -0.654421
 -2.118237	  0.973130	 -0.664541
 -2.133945	  0.967179	 -0.675527
 -2.150319	  0.961107	 -0.685989
 -2.164719	  0.957318	 -0.697983
 -2.181200	  0.952138	 -0.709218
 -2.199397	  0.945487	 -0.720213
 -2.214044	  0.939726	 -0.728374
