  0.849670	 -0.632534	  2.299167
  0.865940	 -0.641801	  2.309158
  0.850600	 -0.633075	  2.299749
  0.834354	 -0.625214	  2.291132
  0.817915	 -0.617556	  2.282700
  0.801018	 -0.610564	  2.274600
  0.783977	 -0.603798	  2.266611
  0.766753	 -0.597622	  2.258538
  0.749387	 -0.591951	  2.250397
  0.731910	 -0.587006	  2.242027
  0.714286	 -0.583583	  2.233215
  0.696667	 -0.581013	  2.224112
  0.679392	 -0.581770	  2.214067
  0.662133	 -0.582577	  2.203999
  0.646220	 -0.586256	  2.192460
  0.630819	 -0.590800	  2.180536
  0.615429	 -0.595358	  2.168605
  0.601244	 -0.601265	  2.155805
  0.588256	 -0.608329	  2.142337
  0.575275	 -0.615400	  2.128865
  0.562299	 -0.622475	  2.115391
  0.549724	 -0.629669	  2.102265
  0.536126	 -0.636895	  2.088883
  0.523291	 -0.643477	  2.076584
  0.510830	 -0.656152	  2.060369
  0.502043	 -0.666316	  2.047202
  0.489365	 -0.672650	  2.036271
  0.474541	 -0.682327	  2.024141
  0.463956	 -0.690763	  2.008541
  0.454536	 -0.696852	  1.992137
  0.442667	 -0.705346	  1.977934
  0.430599	 -0.716008	  1.966048
  0.418917	 -0.725363	  1.953214
  0.406728	 -0.733076	  1.939338
  0.394688	 -0.740902	  1.924807
  0.383359	 -0.749064	  1.910468
  0.372368	 -0.756168	  1.895485
  0.360588	 -0.762891	  1.880647
  0.348865	 -0.769102	  1.865537
  0.337577	 -0.774589	  1.850142
  0.325056	 -0.779464	  1.835789
  0.311769	 -0.781825	  1.820308
  0.298710	 -0.783599	  1.805448
  0.286611	 -0.784611	  1.790145
  0.277865	 -0.783898	  1.770657
  0.271302	 -0.785937	  1.752350
  0.259742	 -0.784921	  1.736342
  0.246008	 -0.782434	  1.721962
  0.231915	 -0.777943	  1.708639
  0.218357	 -0.770743	  1.695874
  0.207791	 -0.759145	  1.682326
  0.199920	 -0.747974	  1.667090
  0.189463	 -0.739996	  1.654839
  0.176465	 -0.729279	  1.643836
  0.162881	 -0.718362	  1.633396
  0.149985	 -0.708463	  1.622624
  0.137969	 -0.695613	  1.614186
  0.125914	 -0.683296	  1.605396
  0.113030	 -0.667769	  1.598803
  0.100282	 -0.648956	  1.592157
  0.091744	 -0.632339	  1.588800
  0.078955	 -0.619653	  1.588174
  0.063059	 -0.607831	  1.583214
  0.045618	 -0.595678	  1.578626
  0.030690	 -0.582770	  1.576738
  0.018626	 -0.568046	  1.578039
  0.005729	 -0.549769	  1.576424
 -0.008568	 -0.534784	  1.573778
 -0.020655	 -0.524871	  1.572504
 -0.036577	 -0.510480	  1.569925
 -0.049488	 -0.493052	  1.565948
 -0.061527	 -0.478100	  1.567106
 -0.076202	 -0.465248	  1.569096
 -0.093819	 -0.453310	  1.568918
 -0.110934	 -0.440748	  1.565441
 -0.121895	 -0.427127	  1.561395
 -0.137223	 -0.412911	  1.559183
 -0.153327	 -0.401384	  1.558401
 -0.167951	 -0.389987	  1.558274
 -0.185653	 -0.373824	  1.554040
 -0.200065	 -0.365527	  1.548845
 -0.215180	 -0.351407	  1.541173
 -0.231451	 -0.338686	  1.535796
 -0.243032	 -0.324420	  1.535449
 -0.252543	 -0.307618	  1.537035
 -0.265587	 -0.289183	  1.535585
 -0.282156	 -0.277194	  1.530677
 -0.299839	 -0.268119	  1.524573
 -0.312734	 -0.257430	  1.513779
 -0.324031	 -0.243377	  1.502385
 -0.339121	 -0.231781	  1.492001
 -0.355132	 -0.222162	  1.490447
 -0.370614	 -0.212982	  1.484291
 -0.385297	 -0.199725	  1.473741
 -0.399050	 -0.186920	  1.467281
 -0.414165	 -0.175761	  1.463935
 -0.429763	 -0.165370	  1.455741
 -0.445124	 -0.154284	  1.441335
 -0.456163	 -0.146811	  1.434174
 -0.473204	 -0.138558	  1.425185
 -0.490802	 -0.127559	  1.418233
 -0.506830	 -0.119700	  1.410010
 -0.521313	 -0.107059	  1.403990
 -0.534871	 -0.094919	  1.396218
 -0.548876	 -0.083655	  1.387142
 -0.565419	 -0.074200	  1.376850
 -0.580428	 -0.067148	  1.369903
 -0.598828	 -0.059248	  1.361497
 -0.619515	 -0.048052	  1.357597
 -0.626534	 -0.035807	  1.348248
 -0.639201	 -0.024572	  1.336382
 -0.654224	 -0.014618	  1.326148
 -0.667709	 -0.003366	  1.316817
 -0.680630	  0.010076	  1.304347
 -0.695854	  0.018847	  1.297802
 -0.711650	  0.025171	  1.287398
 -0.726435	  0.033038	  1.276314
 -0.742628	  0.039540	  1.265606
 -0.757579	  0.048976	  1.253463
 -0.768222	  0.056987	  1.242820
 -0.787383	  0.067498	  1.233112
 -0.802995	  0.072835	  1.223227
 -0.815956	  0.073351	  1.208732
 -0.831671	  0.076091	  1.195568
 -0.847857	  0.080387	  1.184483
 -0.863467	  0.083565	  1.173773
 -0.880968	  0.086865	  1.162912
 -0.897468	  0.091956	  1.152729
 -0.912868	  0.095723	  1.140714
 -0.926708	  0.098372	  1.126384
 -0.943870	  0.101336	  1.113897
 -0.960649	  0.102607	  1.103962
 -0.979043	  0.097999	  1.095541
 -0.997825	  0.096105	  1.086533
 -1.017454	  0.101327	  1.078786
 -1.031299	  0.103999	  1.067684
 -1.047403	  0.105276	  1.054840
 -1.063718	  0.108664	  1.042639
 -1.080441	  0.112055	  1.032423
 -1.097432	  0.112688	  1.022979
 -1.115541	  0.113759	  1.012535
 -1.132273	  0.118138	  1.002247
 -1.147773	  0.122596	  0.989167
 -1.162821	  0.129059	  0.976413
 -1.173234	  0.140424	  0.964664
 -1.187436	  0.150816	  0.953367
 -1.205674	  0.151424	  0.943299
 -1.226204	  0.154941	  0.934568
 -1.238666	  0.165428	  0.924235
 -1.248764	  0.177926	  0.909899
 -1.258446	  0.191604	  0.898976
 -1.273516	  0.203067	  0.889777
 -1.292294	  0.206526	  0.882664
 -1.311611	  0.213101	  0.873610
 -1.325788	  0.226629	  0.865310
 -1.335829	  0.240399	  0.857662
 -1.347377	  0.254910	  0.850676
 -1.360907	  0.268851	  0.843310
 -1.374193	  0.282063	  0.836211
 -1.385460	  0.297945	  0.831662
 -1.396454	  0.314108	  0.827434
 -1.407637	  0.330091	  0.823248
 -1.419568	  0.345635	  0.819061
 -1.432029	  0.360614	  0.814866
 -1.442984	  0.377727	  0.812018
 -1.452639	  0.396078	  0.809736
 -1.461942	  0.412849	  0.807121
 -1.468635	  0.431780	  0.804065
 -1.474063	  0.450772	  0.802123
 -1.478188	  0.473242	  0.803504
 -1.484227	  0.491456	  0.800631
 -1.493432	  0.507781	  0.797393
 -1.501712	  0.527207	  0.793758
 -1.507237	  0.544974	  0.794528
 -1.516914	  0.564417	  0.798215
 -1.526970	  0.583630	  0.798522
 -1.535078	  0.601180	  0.799563
 -1.540163	  0.617252	  0.801260
 -1.545563	  0.638253	  0.802196
 -1.552022	  0.657632	  0.801044
 -1.563013	  0.673660	  0.799936
 -1.578102	  0.690312	  0.805307
 -1.589073	  0.705042	  0.816371
 -1.598300	  0.722905	  0.822667
 -1.611940	  0.736471	  0.820374
 -1.627646	  0.748765	  0.818080
 -1.641696	  0.761465	  0.822165
 -1.657500	  0.772431	  0.819643
 -1.675884	  0.780128	  0.814720
 -1.693236	  0.790146	  0.810110
 -1.710266	  0.798662	  0.812008
 -1.727297	  0.808414	  0.812030
 -1.746464	  0.815380	  0.812998
 -1.763891	  0.822391	  0.816947
 -1.782214	  0.828326	  0.820790
 -1.801870	  0.830261	  0.823187
 -1.822281	  0.830793	  0.823834
 -1.842483	  0.828271	  0.822037
 -1.860930	  0.822806	  0.816846
 -1.879540	  0.814998	  0.811989
 -1.895035	  0.806820	  0.804454
 -1.909243	  0.795030	  0.798285
 -1.924351	  0.782114	  0.790990
 -1.934022	  0.770557	  0.777267
 -1.945938	  0.755072	  0.764921
 -1.948264	  0.748047	  0.749377
 -1.952716	  0.743332	  0.729152
 -1.959773	  0.734498	  0.711804
 -1.967169	  0.726123	  0.696539
 -1.970355	  0.716425	  0.679435
 -1.973823	  0.708209	  0.660743
 -1.979819	  0.702173	  0.643184
 -1.984740	  0.696055	  0.623943
 -1.984834	  0.689733	  0.605519
 -1.986540	  0.685406	  0.586634
 -1.990677	  0.679822	  0.565447
 -1.994280	  0.672952	  0.547223
 -1.992325	  0.669392	  0.528454
 -1.989314	  0.665759	  0.508451
 -1.991329	  0.664619	  0.488494
 -1.996369	  0.665647	  0.469512
 -1.996948	  0.664713	  0.447586
 -1.996103	  0.665895	  0.427011
 -1.998912	  0.666652	  0.407821
 -2.000975	  0.665443	  0.389333
 -2.003828	  0.663542	  0.369780
 -2.008104	  0.659319	  0.350517
 -2.014101	  0.657933	  0.331330
 -2.020338	  0.658613	  0.313211
 -2.019935	  0.652278	  0.289441
 -2.020886	  0.650861	  0.269420
 -2.029148	  0.657209	  0.251217
 -2.037904	  0.664260	  0.235801
 -2.050349	  0.666534	  0.217953
 -2.064591	  0.668233	  0.204966
 -2.074367	  0.672676	  0.188482
 -2.086566	  0.677214	  0.170617
 -2.101941	  0.679586	  0.157704
 -2.116812	  0.682761	  0.146325
 -2.132345	  0.687590	  0.134590
 -2.148159	  0.694144	  0.123910
 -2.164813	  0.700127	  0.113547
 -2.182202	  0.704294	  0.104286
 -2.198449	  0.706620	  0.093038
 -2.213466	  0.710280	  0.080982
 -2.228580	  0.715958	  0.069545
 -2.247416	  0.720696	  0.059730
 -2.266078	  0.720679	  0.052424
 -2.281998	  0.724011	  0.042110
 -2.297550	  0.728588	  0.030079
 -2.313952	  0.730189	  0.017875
 -2.333112	  0.734957	  0.011823
 -2.350644	  0.737596	  0.002569
