 -0.022713	 -1.124259	 -2.813614
 -0.022488	 -1.113128	 -2.785757
 -0.031677	 -1.091208	 -2.738879
 -0.049734	 -1.078935	 -2.691615
 -0.066049	 -1.068777	 -2.644053
 -0.089997	 -1.051778	 -2.602940
 -0.109994	 -1.037511	 -2.558996
 -0.126836	 -1.023602	 -2.512892
 -0.140615	 -1.009021	 -2.465416
 -0.150813	 -0.993939	 -2.417588
 -0.158212	 -0.978143	 -2.370339
 -0.167598	 -0.960434	 -2.325248
 -0.179216	 -0.940273	 -2.281494
 -0.192303	 -0.917108	 -2.238336
 -0.206229	 -0.892167	 -2.197198
 -0.222094	 -0.864423	 -2.159461
 -0.238999	 -0.834467	 -2.122228
 -0.257075	 -0.808791	 -2.080396
 -0.276366	 -0.788829	 -2.036849
 -0.295791	 -0.771970	 -1.992182
 -0.315059	 -0.757255	 -1.946014
 -0.333357	 -0.744912	 -1.900983
 -0.351053	 -0.734378	 -1.857476
 -0.369409	 -0.722753	 -1.813475
 -0.387552	 -0.709544	 -1.767976
 -0.404077	 -0.695216	 -1.722735
 -0.419172	 -0.679366	 -1.677875
 -0.434584	 -0.661431	 -1.632418
 -0.448304	 -0.642005	 -1.585440
 -0.459337	 -0.621223	 -1.541411
 -0.468290	 -0.597106	 -1.501058
 -0.474864	 -0.569529	 -1.465036
 -0.477851	 -0.539132	 -1.435320
 -0.475695	 -0.506394	 -1.412698
 -0.464252	 -0.458719	 -1.391242
 -0.423364	 -0.373442	 -1.364793
 -0.394188	 -0.268382	 -1.322134
 -0.396410	 -0.190831	 -1.255211
 -0.398117	 -0.168401	 -1.201535
 -0.409564	 -0.168154	 -1.172372
 -0.432533	 -0.181044	 -1.128964
 -0.464775	 -0.219961	 -1.048874
 -0.537163	 -0.276763	 -0.966637
 -0.594996	 -0.311139	 -0.898581
 -0.622748	 -0.325438	 -0.845384
 -0.642303	 -0.330765	 -0.802400
 -0.661043	 -0.331755	 -0.759677
 -0.679971	 -0.329313	 -0.715417
 -0.698268	 -0.324329	 -0.672015
 -0.716226	 -0.316263	 -0.628524
 -0.733093	 -0.303836	 -0.581263
 -0.739038	 -0.285582	 -0.531796
 -0.749621	 -0.269279	 -0.483959
 -0.766808	 -0.258059	 -0.440371
 -0.786420	 -0.248591	 -0.393341
 -0.804848	 -0.239621	 -0.346853
 -0.811196	 -0.221577	 -0.297451
 -0.815082	 -0.200649	 -0.250738
 -0.820214	 -0.179913	 -0.205827
 -0.827183	 -0.159803	 -0.161698
 -0.836821	 -0.139764	 -0.116749
 -0.848605	 -0.118293	 -0.072056
 -0.862001	 -0.096690	 -0.028620
 -0.876440	 -0.075403	  0.014704
 -0.891715	 -0.053990	  0.058734
 -0.906919	 -0.033213	  0.102747
 -0.921558	 -0.014128	  0.144885
 -0.936011	  0.003160	  0.188876
 -0.950941	  0.016177	  0.232278
 -0.968375	  0.026882	  0.275709
 -0.989502	  0.038193	  0.321531
 -1.009431	  0.055587	  0.367380
 -1.026483	  0.078280	  0.409952
 -1.042642	  0.101517	  0.451420
 -1.059058	  0.123061	  0.493387
 -1.075665	  0.141958	  0.535842
 -1.092685	  0.157257	  0.579368
 -1.110401	  0.170191	  0.625932
 -1.126469	  0.181762	  0.673461
 -1.139742	  0.192560	  0.720492
 -1.151534	  0.201660	  0.768215
 -1.162993	  0.210677	  0.816190
 -1.175820	  0.222377	  0.865309
 -1.188758	  0.236372	  0.913374
 -1.200779	  0.251053	  0.960358
 -1.211775	  0.265888	  1.007115
 -1.222403	  0.282283	  1.053639
 -1.233151	  0.301142	  1.099599
 -1.243841	  0.322509	  1.143512
 -1.253615	  0.345379	  1.186063
 -1.262401	  0.369623	  1.230052
 -1.270159	  0.394432	  1.275275
 -1.278173	  0.418730	  1.319330
 -1.286916	  0.442245	  1.361509
 -1.296194	  0.465988	  1.404634
 -1.306160	  0.488816	  1.448608
 -1.317223	  0.509838	  1.492856
 -1.329722	  0.528555	  1.537828
 -1.343431	  0.543477	  1.583779
 -1.357176	  0.554833	  1.630027
 -1.370556	  0.563623	  1.677899
 -1.384772	  0.572487	  1.725713
 -1.399695	  0.585094	  1.771707
 -1.414041	  0.601022	  1.816307
 -1.427538	  0.619408	  1.861717
 -1.440161	  0.639520	  1.906853
 -1.452385	  0.659482	  1.951316
 -1.464415	  0.678457	  1.994234
 -1.477255	  0.700105	  2.036723
 -1.491077	  0.720780	  2.079509
 -1.505228	  0.741127	  2.123101
 -1.520582	  0.761534	  2.167183
 -1.539460	  0.781239	  2.211202
 -1.565717	  0.797690	  2.251545
 -1.585680	  0.804663	  2.296218
 -1.601357	  0.821332	  2.339671
 -1.620285	  0.835728	  2.382485
 -1.636488	  0.844085	  2.406310
