 -1.869003	 -1.663148	 -1.709288
 -1.850498	 -1.646681	 -1.692364
 -1.802156	 -1.620559	 -1.682404
 -1.757629	 -1.590955	 -1.684454
 -1.711178	 -1.571446	 -1.679295
 -1.669626	 -1.544864	 -1.674923
 -1.630439	 -1.518116	 -1.666254
 -1.586020	 -1.495863	 -1.663853
 -1.540070	 -1.470605	 -1.656149
 -1.496669	 -1.444602	 -1.654337
 -1.455606	 -1.418193	 -1.656998
 -1.412701	 -1.395594	 -1.658012
 -1.368982	 -1.371432	 -1.655647
 -1.324641	 -1.346099	 -1.653218
 -1.279409	 -1.321611	 -1.653767
 -1.236115	 -1.299857	 -1.657058
 -1.191145	 -1.278545	 -1.661586
 -1.145443	 -1.257899	 -1.665799
 -1.096489	 -1.236868	 -1.668312
 -1.050896	 -1.216314	 -1.668280
 -1.005901	 -1.192581	 -1.665848
 -0.966759	 -1.167198	 -1.661724
 -0.928762	 -1.139143	 -1.655580
 -0.886823	 -1.109223	 -1.647405
 -0.844516	 -1.081357	 -1.638284
 -0.800154	 -1.055132	 -1.629221
 -0.757249	 -1.032356	 -1.621473
 -0.713327	 -1.011042	 -1.614143
 -0.666769	 -0.989786	 -1.606705
 -0.624157	 -0.968744	 -1.600187
 -0.581188	 -0.947665	 -1.593956
 -0.535230	 -0.927850	 -1.588377
 -0.486606	 -0.908756	 -1.585360
 -0.439733	 -0.889704	 -1.586853
 -0.393407	 -0.871394	 -1.590401
 -0.345311	 -0.851110	 -1.594327
 -0.299683	 -0.829508	 -1.598066
 -0.255655	 -0.804870	 -1.600815
 -0.211970	 -0.775767	 -1.602109
 -0.171942	 -0.744464	 -1.601536
 -0.134601	 -0.712587	 -1.599247
 -0.094013	 -0.679655	 -1.595224
 -0.053038	 -0.650442	 -1.591133
 -0.011247	 -0.624414	 -1.587902
  0.030759	 -0.600863	 -1.585672
  0.073722	 -0.578402	 -1.584048
  0.119902	 -0.555425	 -1.583346
  0.164232	 -0.533983	 -1.584121
  0.207830	 -0.512834	 -1.585390
  0.252226	 -0.490994	 -1.585331
  0.298193	 -0.467696	 -1.583319
  0.344538	 -0.442650	 -1.578761
  0.387650	 -0.418056	 -1.572343
  0.429982	 -0.393836	 -1.565021
  0.475499	 -0.370450	 -1.558502
  0.516153	 -0.350275	 -1.557770
  0.550079	 -0.331489	 -1.571287
  0.568650	 -0.316040	 -1.608029
  0.580932	 -0.267565	 -1.706196
  0.628529	 -0.153214	 -1.822870
  0.680735	 -0.100114	 -1.869324
  0.719851	 -0.075007	 -1.894127
  0.766780	 -0.051770	 -1.914343
  0.820718	 -0.029229	 -1.923762
  0.882835	 -0.003108	 -1.916933
  0.936675	  0.019568	 -1.893792
  0.964166	  0.028217	 -1.871324
  0.993877	  0.030819	 -1.831185
  1.027776	  0.027837	 -1.760983
  1.080582	  0.021472	 -1.621502
  1.160873	  0.020940	 -1.539116
  1.213342	  0.042652	 -1.522902
  1.256637	  0.069400	 -1.520992
  1.300546	  0.098539	 -1.520262
  1.344857	  0.127414	 -1.518689
  1.387458	  0.153311	 -1.515646
  1.427077	  0.178704	 -1.512684
  1.466330	  0.205980	 -1.509043
  1.505520	  0.231609	 -1.506466
  1.544510	  0.260845	 -1.510268
  1.589549	  0.291556	 -1.509452
  1.633689	  0.318149	 -1.504769
  1.677479	  0.342549	 -1.498671
  1.722072	  0.365903	 -1.492648
  1.767304	  0.387632	 -1.487509
  1.809174	  0.408074	 -1.484334
  1.855540	  0.431783	 -1.482661
  1.901712	  0.454313	 -1.481787
  1.943919	  0.474444	 -1.482340
  1.990310	  0.496583	 -1.483924
  2.035483	  0.518791	 -1.484475
  2.080150	  0.540999	 -1.483375
  2.124165	  0.563215	 -1.480311
  2.169214	  0.586617	 -1.475722
  2.211202	  0.609159	 -1.470606
  2.253989	  0.635649	 -1.469058
  2.302704	  0.656735	 -1.466220
  2.343463	  0.685558	 -1.459959
  2.390370	  0.707807	 -1.461339
  2.435725	  0.733368	 -1.455813
  2.478176	  0.753044	 -1.445443
  2.513677	  0.773770	 -1.443159
  2.538814	  0.781508	 -1.457591
