  0.823572	  2.479637	  1.534284
  0.815418	  2.455086	  1.519093
  0.789176	  2.427726	  1.506077
  0.757153	  2.395942	  1.493641
  0.725151	  2.362704	  1.475754
  0.685893	  2.332221	  1.458989
  0.653540	  2.297020	  1.436949
  0.621495	  2.264223	  1.419560
  0.589668	  2.225960	  1.411236
  0.555808	  2.194552	  1.393070
  0.526294	  2.156600	  1.377417
  0.492919	  2.121249	  1.361680
  0.456577	  2.088208	  1.343501
  0.424253	  2.058635	  1.328568
  0.391681	  2.026683	  1.312552
  0.356170	  1.991727	  1.294123
  0.322614	  1.960559	  1.277512
  0.287366	  1.927352	  1.259889
  0.254855	  1.898653	  1.242370
  0.220719	  1.868560	  1.222084
  0.188753	  1.841699	  1.205195
  0.150749	  1.809010	  1.187931
  0.113580	  1.774023	  1.171765
  0.079347	  1.736748	  1.156583
  0.050053	  1.703485	  1.142821
  0.021028	  1.667940	  1.128750
 -0.010748	  1.631643	  1.113551
 -0.044300	  1.593691	  1.094962
 -0.074770	  1.561860	  1.077995
 -0.102849	  1.530192	  1.063039
 -0.119534	  1.491013	  1.059837
 -0.041284	  1.402420	  1.090520
  0.036845	  1.275948	  1.033384
  0.054540	  1.221675	  0.934129
  0.057735	  1.218668	  0.914195
  0.063264	  1.227972	  0.880720
  0.019630	  1.204684	  0.827551
 -0.063416	  1.145378	  0.750912
 -0.165244	  1.085594	  0.629782
 -0.202337	  1.130808	  0.375904
 -0.207978	  1.136145	  0.298581
 -0.213681	  1.133765	  0.265493
 -0.281950	  1.120378	  0.150830
 -0.290609	  1.101522	  0.116170
 -0.326351	  1.021910	  0.183518
 -0.348053	  0.978461	  0.237419
 -0.453578	  0.916730	  0.319730
 -0.501809	  0.890347	  0.358216
 -0.516008	  0.876124	  0.368016
 -0.568556	  0.817558	  0.400553
 -0.630058	  0.776702	  0.442143
 -0.720984	  0.762788	  0.508028
 -0.843362	  0.758359	  0.608347
 -0.892896	  0.734180	  0.628685
 -0.929231	  0.706708	  0.628246
 -0.965892	  0.674163	  0.615890
 -1.001434	  0.641177	  0.600323
 -1.035523	  0.609200	  0.585184
 -1.071060	  0.576136	  0.569236
 -1.104048	  0.545794	  0.553954
 -1.135974	  0.515254	  0.538963
 -1.171084	  0.480835	  0.522132
 -1.205212	  0.447980	  0.504502
 -1.230864	  0.420115	  0.478393
 -1.235179	  0.393980	  0.418494
 -1.206366	  0.343812	  0.268819
 -1.210268	  0.324670	  0.211404
 -1.225648	  0.313074	  0.162431
 -1.235239	  0.266510	  0.021912
 -1.243420	  0.210201	 -0.030561
 -1.250590	  0.185677	 -0.040227
 -1.277204	  0.158719	 -0.039230
 -1.300128	  0.155857	 -0.023720
 -1.334830	  0.161131	  0.074849
 -1.394681	  0.144901	  0.118413
 -1.464028	  0.092799	  0.100686
 -1.533276	  0.077248	  0.106897
 -1.640185	  0.046500	  0.132865
 -1.701911	 -0.060905	  0.174360
 -1.768255	 -0.111266	  0.199947
 -1.802480	 -0.140420	  0.195907
 -1.835413	 -0.175014	  0.181010
 -1.867652	 -0.206331	  0.165231
 -1.902322	 -0.236594	  0.147351
 -1.946289	 -0.256183	  0.128429
 -2.031023	 -0.245873	  0.102629
 -2.201330	 -0.134739	  0.059438
 -2.280606	 -0.107092	  0.034340
 -2.207633	 -0.242165	  0.049088
 -2.123439	 -0.421505	  0.048514
 -2.137230	 -0.469858	  0.034344
 -2.168512	 -0.506301	  0.015465
 -2.200974	 -0.539740	 -0.003963
 -2.235729	 -0.571619	 -0.021429
 -2.271098	 -0.603050	 -0.037618
 -2.305865	 -0.634183	 -0.052855
 -2.341379	 -0.665908	 -0.068307
 -2.377953	 -0.699671	 -0.084961
 -2.413227	 -0.733313	 -0.102518
 -2.441841	 -0.762108	 -0.117947
 -2.471568	 -0.793778	 -0.133732
 -2.504628	 -0.832781	 -0.150078
 -2.539130	 -0.865886	 -0.168033
 -2.575121	 -0.899832	 -0.182646
 -2.610802	 -0.931659	 -0.198146
 -2.642027	 -0.960931	 -0.215496
 -2.673846	 -0.997502	 -0.231224
 -2.705647	 -1.024471	 -0.253707
 -2.742342	 -1.059140	 -0.270376
 -2.775232	 -1.101379	 -0.291640
 -2.802984	 -1.112393	 -0.294556
