  0.246654	  0.405858	 -2.326875
  0.278702	  0.386572	 -2.352560
  0.264560	  0.404275	 -2.349012
  0.251615	  0.411373	 -2.336905
  0.236517	  0.421797	 -2.328516
  0.220992	  0.435217	 -2.318236
  0.208749	  0.441936	 -2.307022
  0.194031	  0.451409	 -2.297468
  0.175902	  0.465063	 -2.280547
  0.164052	  0.470721	 -2.264759
  0.156497	  0.471966	 -2.253475
  0.143148	  0.474415	 -2.236077
  0.130585	  0.476605	 -2.218298
  0.119369	  0.479763	 -2.202474
  0.106693	  0.486985	 -2.188128
  0.094136	  0.493892	 -2.174190
  0.081083	  0.502070	 -2.161452
  0.067645	  0.511939	 -2.149765
  0.054388	  0.522809	 -2.138725
  0.041690	  0.533736	 -2.127312
  0.029927	  0.545167	 -2.115934
  0.020343	  0.557930	 -2.102062
  0.015760	  0.571597	 -2.083725
  0.014510	  0.579846	 -2.061067
  0.009543	  0.583902	 -2.038561
 -0.003017	  0.587670	 -2.025273
 -0.018201	  0.596815	 -2.017062
 -0.029634	  0.609722	 -2.004709
 -0.035959	  0.619936	 -1.986099
 -0.044794	  0.623853	 -1.969673
 -0.057656	  0.631678	 -1.956314
 -0.071167	  0.640879	 -1.944791
 -0.078691	  0.651553	 -1.927639
 -0.088749	  0.657611	 -1.908801
 -0.103983	  0.661057	 -1.894710
 -0.120274	  0.664767	 -1.884756
 -0.131484	  0.668866	 -1.868404
 -0.139257	  0.674899	 -1.848015
 -0.151576	  0.685830	 -1.833224
 -0.166971	  0.696952	 -1.824937
 -0.183036	  0.706467	 -1.817807
 -0.196121	  0.715170	 -1.804312
 -0.208840	  0.723129	 -1.791025
 -0.221569	  0.731059	 -1.777794
 -0.234971	  0.738506	 -1.764952
 -0.248921	  0.745404	 -1.752414
 -0.262686	  0.751973	 -1.739454
 -0.277175	  0.757588	 -1.726791
 -0.292268	  0.763122	 -1.715061
 -0.305592	  0.766948	 -1.701540
 -0.318910	  0.768625	 -1.684767
 -0.333636	  0.776379	 -1.672546
 -0.354551	  0.789083	 -1.671129
 -0.377010	  0.799009	 -1.668257
 -0.391922	  0.803856	 -1.660112
 -0.406149	  0.808979	 -1.651595
 -0.423963	  0.817400	 -1.644122
 -0.442564	  0.825788	 -1.636167
 -0.456626	  0.830866	 -1.627919
 -0.473738	  0.837433	 -1.620012
 -0.493708	  0.845386	 -1.613763
 -0.508892	  0.851301	 -1.604409
 -0.522206	  0.858139	 -1.593340
 -0.539220	  0.868758	 -1.580734
 -0.556267	  0.874605	 -1.571682
 -0.572064	  0.877845	 -1.561228
 -0.591621	  0.883422	 -1.549449
 -0.608079	  0.889036	 -1.542929
 -0.624937	  0.896426	 -1.539287
 -0.647374	  0.917582	 -1.538627
 -0.660956	  0.933921	 -1.536423
 -0.668384	  0.946261	 -1.533864
 -0.685791	  0.961435	 -1.525211
 -0.706850	  0.962756	 -1.517974
 -0.722869	  0.959793	 -1.509916
 -0.745120	  0.972674	 -1.499032
 -0.762432	  0.987552	 -1.495484
 -0.771460	  0.996126	 -1.494319
 -0.792379	  1.001978	 -1.489117
 -0.815307	  1.013481	 -1.488065
 -0.834582	  1.026914	 -1.492629
 -0.850411	  1.032501	 -1.501347
 -0.870059	  1.038276	 -1.504340
 -0.888617	  1.048450	 -1.507364
 -0.903682	  1.058548	 -1.516622
 -0.920166	  1.067013	 -1.524828
 -0.938107	  1.074846	 -1.530007
 -0.956133	  1.082465	 -1.534149
 -0.973931	  1.089582	 -1.540168
 -0.989993	  1.095339	 -1.550805
 -1.005896	  1.101010	 -1.561514
 -1.021823	  1.106854	 -1.572113
 -1.037747	  1.112731	 -1.582691
 -1.053648	  1.118565	 -1.593325
 -1.069563	  1.124415	 -1.603932
 -1.085479	  1.130262	 -1.614538
 -1.101387	  1.136001	 -1.625193
 -1.116668	  1.138090	 -1.637900
 -1.131631	  1.139073	 -1.651132
 -1.146584	  1.140043	 -1.664378
 -1.161537	  1.141019	 -1.677624
 -1.176493	  1.141922	 -1.690868
 -1.191578	  1.140814	 -1.703941
 -1.206635	  1.137438	 -1.716659
 -1.221696	  1.133998	 -1.729360
 -1.236745	  1.130537	 -1.742070
 -1.251792	  1.127069	 -1.754782
 -1.266784	  1.123576	 -1.767476
 -1.281033	  1.120250	 -1.779544
 -1.292444	  1.117274	 -1.789543
 -1.306402	  1.112462	 -1.803035
