  0.888195	 -0.601254	  2.265442
  0.904465	 -0.610521	  2.275433
  0.889132	 -0.601789	  2.266017
  0.873026	 -0.593785	  2.257269
  0.856590	 -0.586123	  2.248835
  0.839904	 -0.578816	  2.240577
  0.822863	 -0.572048	  2.232590
  0.805805	 -0.565331	  2.224595
  0.788438	 -0.559662	  2.216455
  0.771071	 -0.553994	  2.208315
  0.753499	 -0.549885	  2.199694
  0.735873	 -0.546467	  2.190882
  0.718283	 -0.544638	  2.181542
  0.701012	 -0.545423	  2.171487
  0.683742	 -0.546207	  2.161431
  0.667932	 -0.550070	  2.149806
  0.652536	 -0.554620	  2.137880
  0.637139	 -0.559170	  2.125953
  0.623097	 -0.565225	  2.113063
  0.610116	 -0.572296	  2.099590
  0.597136	 -0.579367	  2.086118
  0.584155	 -0.586438	  2.072646
  0.571836	 -0.594175	  2.058921
  0.559867	 -0.602246	  2.045078
  0.547898	 -0.610316	  2.031236
  0.535929	 -0.618387	  2.017393
  0.523952	 -0.626574	  2.003627
  0.511961	 -0.634962	  1.989994
  0.499971	 -0.643349	  1.976360
  0.487980	 -0.651737	  1.962727
  0.476042	 -0.660196	  1.949091
  0.464421	 -0.669068	  1.935444
  0.452800	 -0.677940	  1.921797
  0.441179	 -0.686812	  1.908150
  0.429535	 -0.695432	  1.894362
  0.417852	 -0.703545	  1.880301
  0.406170	 -0.711657	  1.866241
  0.394487	 -0.719770	  1.852181
  0.382914	 -0.726004	  1.837107
  0.371370	 -0.731940	  1.821892
  0.359826	 -0.737877	  1.806677
  0.348226	 -0.742103	  1.790943
  0.336644	 -0.745026	  1.774902
  0.325063	 -0.747950	  1.758860
  0.313423	 -0.749021	  1.742631
  0.301921	 -0.746891	  1.726409
  0.290418	 -0.744761	  1.710187
  0.278915	 -0.742631	  1.693965
  0.267065	 -0.734549	  1.680028
  0.255218	 -0.726411	  1.666121
  0.243370	 -0.718273	  1.652214
  0.231205	 -0.708218	  1.639928
  0.218917	 -0.696319	  1.629564
  0.206629	 -0.684420	  1.619200
  0.194301	 -0.672320	  1.609120
  0.181784	 -0.658548	  1.601797
  0.169266	 -0.644776	  1.594473
  0.156733	 -0.630975	  1.587229
  0.143877	 -0.616464	  1.582316
  0.131021	 -0.601952	  1.577402
  0.118099	 -0.587353	  1.572944
  0.105022	 -0.572541	  1.569847
  0.091945	 -0.557728	  1.566751
  0.078736	 -0.542886	  1.564466
  0.065463	 -0.528038	  1.562631
  0.052091	 -0.513257	  1.560985
  0.038412	 -0.498703	  1.559944
  0.024734	 -0.484149	  1.558903
  0.010630	 -0.470023	  1.557668
 -0.003488	 -0.455911	  1.556428
 -0.017837	 -0.442056	  1.554969
 -0.032486	 -0.428552	  1.553220
 -0.047135	 -0.415048	  1.551471
 -0.061916	 -0.401672	  1.549861
 -0.077011	 -0.388613	  1.548592
 -0.092106	 -0.375555	  1.547322
 -0.107201	 -0.362496	  1.546052
 -0.122140	 -0.349349	  1.544052
 -0.136993	 -0.336165	  1.541694
 -0.151847	 -0.322981	  1.539337
 -0.166645	 -0.309765	  1.536820
 -0.180841	 -0.296276	  1.532753
 -0.195036	 -0.282788	  1.528686
 -0.209210	 -0.269308	  1.524516
 -0.223152	 -0.255931	  1.519350
 -0.237094	 -0.242554	  1.514184
 -0.251194	 -0.229582	  1.508446
 -0.265337	 -0.216733	  1.502541
 -0.279741	 -0.204405	  1.496173
 -0.294241	 -0.192285	  1.489626
 -0.308896	 -0.180568	  1.482703
 -0.323635	 -0.169089	  1.475562
 -0.338499	 -0.157894	  1.468232
 -0.353508	 -0.147046	  1.460678
 -0.368533	 -0.136254	  1.453078
 -0.383697	 -0.125935	  1.445105
 -0.398861	 -0.115615	  1.437132
 -0.414086	 -0.105590	  1.428905
 -0.429347	 -0.095752	  1.420519
 -0.444618	 -0.085932	  1.412130
 -0.460008	 -0.076333	  1.403703
 -0.475397	 -0.066734	  1.395276
 -0.490669	 -0.057038	  1.386746
 -0.505822	 -0.047247	  1.378114
 -0.520975	 -0.037456	  1.369481
 -0.535806	 -0.027359	  1.360643
 -0.550586	 -0.017217	  1.351772
 -0.565269	 -0.006978	  1.342853
 -0.579680	  0.003526	  1.333797
 -0.594091	  0.014029	  1.324742
 -0.608411	  0.024543	  1.315556
 -0.622691	  0.035063	  1.306313
 -0.637001	  0.045501	  1.297024
 -0.651460	  0.055521	  1.287509
 -0.665919	  0.065541	  1.277994
 -0.680610	  0.074712	  1.267990
 -0.695401	  0.083455	  1.257754
 -0.710234	  0.091849	  1.247289
 -0.725161	  0.099016	  1.236072
 -0.740087	  0.106184	  1.224856
 -0.755206	  0.111944	  1.213098
 -0.770343	  0.117525	  1.201277
 -0.785706	  0.122246	  1.189373
 -0.801206	  0.126370	  1.177427
 -0.816889	  0.130119	  1.165594
 -0.832962	  0.132997	  1.154046
 -0.849048	  0.135850	  1.142508
 -0.865544	  0.137844	  1.131378
 -0.882041	  0.139838	  1.120247
 -0.898703	  0.141552	  1.109319
 -0.915433	  0.143150	  1.098476
 -0.932220	  0.144730	  1.087721
 -0.949132	  0.146271	  1.077155
 -0.966043	  0.147811	  1.066590
 -0.982992	  0.149538	  1.056113
 -0.999949	  0.151313	  1.045658
 -1.016877	  0.153172	  1.035171
 -1.033614	  0.155556	  1.024485
 -1.050352	  0.157941	  1.013800
 -1.066883	  0.160788	  1.002910
 -1.082892	  0.164697	  0.991577
 -1.098901	  0.168606	  0.980244
 -1.114680	  0.173209	  0.968848
 -1.129998	  0.179024	  0.957380
 -1.145316	  0.184839	  0.945911
 -1.160440	  0.191525	  0.934660
 -1.175255	  0.199347	  0.923737
 -1.190071	  0.207168	  0.912813
 -1.204657	  0.215980	  0.902344
 -1.219043	  0.225510	  0.892234
 -1.233429	  0.235039	  0.882123
 -1.247559	  0.245775	  0.872900
 -1.261609	  0.256816	  0.863916
 -1.275659	  0.267857	  0.854932
 -1.289103	  0.280640	  0.847458
 -1.302378	  0.293802	  0.840351
 -1.315653	  0.306965	  0.833244
 -1.328796	  0.320357	  0.826321
 -1.339790	  0.336521	  0.822094
 -1.350783	  0.352685	  0.817866
 -1.361776	  0.368849	  0.813639
 -1.372770	  0.385013	  0.809412
 -1.383128	  0.401750	  0.805865
 -1.391387	  0.419908	  0.804430
 -1.399647	  0.438066	  0.802995
 -1.407906	  0.456225	  0.801560
 -1.416166	  0.474383	  0.800125
 -1.424425	  0.492541	  0.798689
 -1.431891	  0.511087	  0.798140
 -1.439250	  0.529679	  0.797709
 -1.446609	  0.548271	  0.797277
 -1.453967	  0.566863	  0.796846
 -1.461326	  0.585455	  0.796414
 -1.468897	  0.603967	  0.796534
 -1.476519	  0.622456	  0.796788
 -1.484140	  0.640945	  0.797042
 -1.491762	  0.659434	  0.797295
 -1.500319	  0.677498	  0.797981
 -1.509046	  0.695477	  0.798747
 -1.517823	  0.713432	  0.799522
 -1.527919	  0.730667	  0.800522
 -1.538016	  0.747902	  0.801521
 -1.549881	  0.763982	  0.802339
 -1.562132	  0.779771	  0.803114
 -1.576063	  0.794110	  0.803696
 -1.590560	  0.807875	  0.804307
 -1.606643	  0.819743	  0.805005
 -1.622726	  0.831610	  0.805702
 -1.640080	  0.841486	  0.806849
 -1.657795	  0.850679	  0.808139
 -1.675510	  0.859873	  0.809429
 -1.693780	  0.867847	  0.811044
 -1.712747	  0.873832	  0.813152
 -1.731713	  0.879818	  0.815260
 -1.750680	  0.885803	  0.817368
 -1.770218	  0.889699	  0.819123
 -1.790190	  0.889373	  0.820127
 -1.810162	  0.889046	  0.821132
 -1.830134	  0.888720	  0.822136
 -1.850101	  0.887687	  0.822662
 -1.868156	  0.880087	  0.818633
 -1.886212	  0.872487	  0.814604
 -1.904268	  0.864887	  0.810574
 -1.922323	  0.857287	  0.806544
 -1.935492	  0.846472	  0.796074
 -1.948661	  0.835658	  0.785604
 -1.961830	  0.824843	  0.775134
 -1.973161	  0.814176	  0.762570
 -1.981009	  0.804200	  0.747115
 -1.988858	  0.794224	  0.731659
 -1.996421	  0.784398	  0.715967
 -2.000844	  0.776369	  0.698191
 -2.005266	  0.768339	  0.680416
 -2.009689	  0.760310	  0.662640
 -2.013120	  0.753148	  0.644284
 -2.015416	  0.747004	  0.625390
 -2.017713	  0.740861	  0.606496
 -2.020009	  0.734717	  0.587602
 -2.022306	  0.728574	  0.568708
 -2.023580	  0.724874	  0.549095
 -2.024746	  0.721432	  0.529428
 -2.025913	  0.717989	  0.509761
 -2.027080	  0.714546	  0.490094
 -2.028247	  0.711103	  0.470427
 -2.029463	  0.709708	  0.450513
 -2.030684	  0.708591	  0.430582
 -2.031906	  0.707473	  0.410650
 -2.033127	  0.706356	  0.390719
 -2.035361	  0.705758	  0.370853
 -2.038896	  0.705835	  0.351168
 -2.042430	  0.705912	  0.331483
 -2.046370	  0.706146	  0.311876
 -2.053508	  0.707640	  0.293253
 -2.060646	  0.709135	  0.274631
 -2.069754	  0.711413	  0.256971
 -2.080615	  0.714406	  0.240446
 -2.091477	  0.717398	  0.223921
 -2.105266	  0.721624	  0.210065
 -2.119069	  0.725855	  0.196224
 -2.133570	  0.730079	  0.183113
 -2.149190	  0.734264	  0.171345
 -2.164810	  0.738449	  0.159576
 -2.181041	  0.742591	  0.148650
 -2.197476	  0.746716	  0.138026
 -2.213955	  0.750814	  0.127459
 -2.230671	  0.754757	  0.117211
 -2.247387	  0.758701	  0.106963
 -2.264229	  0.762497	  0.096867
 -2.281145	  0.766206	  0.086861
 -2.298122	  0.769844	  0.076934
 -2.315440	  0.773072	  0.067466
 -2.332759	  0.776300	  0.057997
 -2.350044	  0.779365	  0.048629
 -2.367576	  0.782004	  0.039375
