 -0.863141	  2.083504	  2.023586
 -0.854595	  2.062875	  2.003550
 -0.828964	  2.037007	  1.974836
 -0.820141	  2.005783	  1.936135
 -0.802402	  1.969732	  1.906627
 -0.787013	  1.939052	  1.870258
 -0.770834	  1.902450	  1.840952
 -0.750712	  1.871414	  1.807629
 -0.737483	  1.842589	  1.769500
 -0.723605	  1.810552	  1.732972
 -0.707642	  1.779445	  1.696011
 -0.691605	  1.748763	  1.660010
 -0.675274	  1.717765	  1.622942
 -0.658319	  1.687343	  1.585483
 -0.640483	  1.659463	  1.549095
 -0.621669	  1.641210	  1.515824
 -0.598249	  1.638648	  1.480465
 -0.551713	  1.667415	  1.432578
 -0.493957	  1.719035	  1.396045
 -0.453695	  1.751786	  1.368690
 -0.383721	  1.786590	  1.323548
 -0.341854	  1.793498	  1.293262
 -0.323553	  1.791923	  1.280865
 -0.257634	  1.768215	  1.237827
 -0.166910	  1.724387	  1.163918
 -0.077857	  1.667907	  1.080003
  0.005735	  1.607671	  1.014113
  0.054330	  1.562460	  0.981466
  0.076414	  1.527821	  0.961356
  0.084553	  1.493853	  0.941116
  0.078266	  1.435015	  0.904675
  0.042471	  1.353279	  0.852145
 -0.014709	  1.253441	  0.794098
 -0.070967	  1.161181	  0.753480
 -0.105932	  1.113601	  0.748062
 -0.150267	  1.061064	  0.751708
 -0.188282	  1.001148	  0.754452
 -0.212913	  0.937871	  0.747271
 -0.219431	  0.889542	  0.731078
 -0.217109	  0.845642	  0.705506
 -0.209233	  0.806753	  0.672114
 -0.198361	  0.773190	  0.635527
 -0.185607	  0.742297	  0.598126
 -0.171642	  0.712886	  0.560695
 -0.156013	  0.682991	  0.522480
 -0.139175	  0.653469	  0.485261
 -0.121481	  0.624867	  0.450289
 -0.101920	  0.594722	  0.415124
 -0.082168	  0.563969	  0.381775
 -0.061381	  0.530972	  0.347804
 -0.041771	  0.497869	  0.315171
 -0.024283	  0.465563	  0.285172
 -0.007321	  0.431503	  0.255204
  0.009972	  0.393372	  0.224505
  0.027744	  0.355334	  0.192442
  0.044165	  0.321297	  0.160597
  0.060332	  0.288126	  0.128478
  0.076174	  0.254578	  0.093237
  0.090270	  0.222292	  0.057063
  0.103721	  0.191536	  0.023605
  0.119155	  0.159727	 -0.010450
  0.136362	  0.128435	 -0.045289
  0.154185	  0.097888	 -0.080902
  0.173298	  0.067751	 -0.117316
  0.192632	  0.038879	 -0.153179
  0.211583	  0.009095	 -0.188778
  0.229532	 -0.021643	 -0.223189
  0.246064	 -0.052404	 -0.256257
  0.262678	 -0.084818	 -0.291565
  0.279429	 -0.116944	 -0.327691
  0.295684	 -0.148244	 -0.364062
  0.310270	 -0.178809	 -0.399301
  0.325049	 -0.210960	 -0.435054
  0.340047	 -0.243221	 -0.470163
  0.355027	 -0.274676	 -0.505065
  0.370865	 -0.306102	 -0.541615
  0.387843	 -0.335938	 -0.577582
  0.405859	 -0.365378	 -0.614224
  0.424169	 -0.393798	 -0.650267
  0.441896	 -0.421215	 -0.685926
  0.460585	 -0.450063	 -0.723263
  0.480441	 -0.479729	 -0.759826
  0.499908	 -0.508054	 -0.793534
  0.518695	 -0.537726	 -0.829213
  0.534469	 -0.567502	 -0.864710
  0.548939	 -0.597919	 -0.900383
  0.563952	 -0.630203	 -0.937318
  0.579312	 -0.663361	 -0.971256
  0.596663	 -0.697388	 -1.004614
  0.614956	 -0.732537	 -1.037903
  0.633060	 -0.768918	 -1.068699
  0.649433	 -0.805786	 -1.098574
  0.664409	 -0.840984	 -1.127883
  0.679930	 -0.876382	 -1.159043
  0.694984	 -0.912817	 -1.191017
  0.709672	 -0.949124	 -1.222673
  0.724981	 -0.985119	 -1.254082
  0.741655	 -1.021301	 -1.286945
  0.759188	 -1.055229	 -1.320723
  0.776567	 -1.086211	 -1.354071
  0.794798	 -1.116591	 -1.390396
  0.813538	 -1.144910	 -1.427755
  0.831808	 -1.172397	 -1.465425
  0.849139	 -1.197850	 -1.500930
  0.867340	 -1.224131	 -1.537924
  0.885862	 -1.251663	 -1.576353
  0.903908	 -1.280399	 -1.614084
  0.922023	 -1.310258	 -1.649223
  0.939197	 -1.342328	 -1.683126
  0.954508	 -1.378655	 -1.718018
  0.968266	 -1.414185	 -1.749565
  0.983698	 -1.449671	 -1.781501
  1.000554	 -1.485580	 -1.816606
  1.016983	 -1.519379	 -1.850371
  1.034413	 -1.551705	 -1.883140
  1.051193	 -1.582772	 -1.915916
  1.067434	 -1.613948	 -1.949590
  1.083665	 -1.646201	 -1.984573
  1.099763	 -1.677860	 -2.020366
  1.116285	 -1.708281	 -2.058299
  1.131483	 -1.739494	 -2.096803
  1.137608	 -1.772730	 -2.136182
  1.148984	 -1.790458	 -2.157544
