  1.584164	  2.443500	 -0.837038
  1.568479	  2.419307	 -0.828751
  1.582001	  2.376817	 -0.836811
  1.592623	  2.332299	 -0.854721
  1.607560	  2.288087	 -0.866973
  1.622368	  2.244696	 -0.884850
  1.626275	  2.195063	 -0.893785
  1.635878	  2.148478	 -0.911382
  1.640678	  2.102144	 -0.926999
  1.647730	  2.055413	 -0.944865
  1.663337	  2.011655	 -0.963793
  1.676685	  1.968368	 -0.981761
  1.687657	  1.922010	 -0.998821
  1.700085	  1.876352	 -1.010906
  1.709981	  1.833309	 -1.027159
  1.718212	  1.788738	 -1.044326
  1.729671	  1.741989	 -1.058529
  1.743060	  1.694600	 -1.070099
  1.756237	  1.647494	 -1.081243
  1.769087	  1.600214	 -1.091924
  1.782618	  1.553241	 -1.102466
  1.797313	  1.506289	 -1.112847
  1.812359	  1.460146	 -1.122885
  1.826446	  1.417345	 -1.132408
  1.841405	  1.372329	 -1.143090
  1.856593	  1.325905	 -1.155107
  1.871256	  1.278655	 -1.169711
  1.885029	  1.232163	 -1.186971
  1.897107	  1.186644	 -1.206796
  1.907502	  1.143568	 -1.226992
  1.916785	  1.100907	 -1.247598
  1.925492	  1.056411	 -1.269113
  1.933342	  1.012040	 -1.289631
  1.941827	  0.964589	 -1.309841
  1.950181	  0.919228	 -1.326906
  1.959345	  0.872991	 -1.341470
  1.968433	  0.824497	 -1.352940
  1.974180	  0.779054	 -1.361115
  1.976321	  0.731779	 -1.370889
  1.986492	  0.682777	 -1.381386
  1.994372	  0.635674	 -1.395150
  2.005429	  0.588426	 -1.412351
  2.018678	  0.543161	 -1.428256
  2.033124	  0.498465	 -1.443677
  2.048524	  0.453240	 -1.458799
  2.064186	  0.409265	 -1.471530
  2.080070	  0.366159	 -1.482498
  2.094956	  0.320953	 -1.492607
  2.107499	  0.272796	 -1.502263
  2.117341	  0.225687	 -1.511496
  2.124811	  0.177155	 -1.523515
  2.129167	  0.130273	 -1.541591
  2.133506	  0.083443	 -1.561535
  2.138655	  0.036662	 -1.580524
  2.144796	 -0.008854	 -1.597546
  2.152588	 -0.055364	 -1.615281
  2.162493	 -0.102378	 -1.631392
  2.176260	 -0.149879	 -1.643797
  2.188972	 -0.193507	 -1.659084
  2.210096	 -0.236051	 -1.665611
  2.221025	 -0.279488	 -1.684109
  2.235116	 -0.325252	 -1.697328
  2.247769	 -0.371664	 -1.715269
  2.250583	 -0.421200	 -1.726382
  2.269728	 -0.464531	 -1.742801
  2.274537	 -0.513503	 -1.753792
  2.285234	 -0.557529	 -1.769293
  2.299372	 -0.602610	 -1.788456
  2.304189	 -0.654738	 -1.806109
  2.327231	 -0.661285	 -1.824170
