 -2.203256	  0.801604	 -0.666069
 -2.207583	  0.806065	 -0.658032
 -2.211910	  0.810526	 -0.649995
 -2.207386	  0.807231	 -0.672575
 -2.206245	  0.799805	 -0.683014
 -2.201684	  0.779994	 -0.695406
 -2.178317	  0.760046	 -0.715786
 -2.168446	  0.755888	 -0.726247
 -2.160006	  0.752870	 -0.736663
 -2.144405	  0.743223	 -0.755142
 -2.131856	  0.733424	 -0.768927
 -2.122195	  0.725839	 -0.779372
 -2.111035	  0.720508	 -0.794124
 -2.099983	  0.713507	 -0.810036
 -2.090659	  0.696783	 -0.826495
 -2.085993	  0.679356	 -0.843518
 -2.083629	  0.672004	 -0.854440
 -2.079935	  0.662595	 -0.873699
 -2.069350	  0.655175	 -0.892174
 -2.056722	  0.651357	 -0.905573
 -2.036223	  0.649267	 -0.923308
 -2.024457	  0.642343	 -0.940492
 -2.019198	  0.635041	 -0.953564
 -2.013676	  0.624130	 -0.969509
 -2.007888	  0.612250	 -0.986868
 -2.003915	  0.599865	 -1.003276
 -1.999067	  0.589017	 -1.018078
 -1.994728	  0.577926	 -1.033477
 -1.988701	  0.566768	 -1.049964
 -1.981866	  0.558613	 -1.062606
 -1.966633	  0.555368	 -1.076046
 -1.945234	  0.549782	 -1.097312
 -1.938522	  0.536693	 -1.116648
 -1.935477	  0.530055	 -1.126288
 -1.927570	  0.518401	 -1.143840
 -1.921714	  0.503417	 -1.163435
 -1.919414	  0.494982	 -1.173883
 -1.913821	  0.482739	 -1.190753
 -1.911144	  0.465590	 -1.212069
 -1.917989	  0.448720	 -1.227880
 -1.924015	  0.434700	 -1.239887
 -1.918576	  0.425565	 -1.252352
 -1.907603	  0.416223	 -1.269468
 -1.900647	  0.406239	 -1.286606
 -1.897376	  0.397188	 -1.303787
 -1.898080	  0.389663	 -1.321981
 -1.898200	  0.386427	 -1.341443
 -1.883531	  0.391053	 -1.363297
 -1.862021	  0.386270	 -1.385663
 -1.854814	  0.380638	 -1.394851
 -1.849629	  0.370825	 -1.406139
 -1.846204	  0.363328	 -1.428194
 -1.834614	  0.356916	 -1.448753
 -1.826346	  0.351958	 -1.462044
 -1.816843	  0.343464	 -1.478541
 -1.807252	  0.335516	 -1.495755
 -1.798816	  0.328593	 -1.509891
 -1.790832	  0.321535	 -1.526368
 -1.781254	  0.313010	 -1.545293
 -1.771887	  0.304603	 -1.560214
 -1.764781	  0.298708	 -1.572593
 -1.756063	  0.293821	 -1.590772
 -1.742445	  0.285297	 -1.610556
 -1.732033	  0.276720	 -1.622838
 -1.715087	  0.264603	 -1.640861
 -1.702014	  0.248427	 -1.655484
 -1.696645	  0.240199	 -1.660200
 -1.693162	  0.223974	 -1.670753
 -1.690899	  0.215146	 -1.691962
 -1.684322	  0.209419	 -1.711058
 -1.676613	  0.201519	 -1.727959
 -1.669039	  0.193038	 -1.744488
 -1.661459	  0.184520	 -1.760962
 -1.653617	  0.175704	 -1.778021
 -1.644890	  0.165802	 -1.797498
 -1.637724	  0.157534	 -1.814240
 -1.630558	  0.149266	 -1.830982
