  1.435871	  0.003973	  2.131132
  1.421432	  0.009836	  2.150536
  1.433034	  0.005126	  2.134941
  1.444200	  0.000841	  2.118911
  1.454917	 -0.003014	  2.102471
  1.465633	 -0.006870	  2.086030
  1.477326	 -0.009588	  2.070034
  1.489258	 -0.012016	  2.054167
  1.501366	 -0.014114	  2.038388
  1.514345	 -0.014434	  2.023175
  1.527338	 -0.014775	  2.007975
  1.541198	 -0.016712	  1.993690
  1.555209	 -0.018956	  1.979596
  1.569778	 -0.022485	  1.966359
  1.584434	 -0.026229	  1.953275
  1.599196	 -0.030061	  1.940337
  1.614050	 -0.033919	  1.927519
  1.629290	 -0.037706	  1.915165
  1.644869	 -0.041460	  1.903189
  1.660347	 -0.044838	  1.891371
  1.676619	 -0.047859	  1.881302
  1.695031	 -0.052515	  1.874060
  1.713754	 -0.056892	  1.865405
  1.728468	 -0.061549	  1.850281
  1.740094	 -0.070922	  1.834295
  1.751263	 -0.080892	  1.821777
  1.767926	 -0.089406	  1.810435
  1.788203	 -0.088652	  1.799394
  1.807809	 -0.083457	  1.787473
  1.817961	 -0.083275	  1.773242
  1.827981	 -0.090602	  1.758425
  1.843084	 -0.101852	  1.746140
  1.856176	 -0.113496	  1.735479
  1.869815	 -0.123737	  1.724764
  1.883548	 -0.134687	  1.715085
  1.897026	 -0.145898	  1.705405
  1.909280	 -0.157797	  1.694976
  1.921538	 -0.169694	  1.684575
  1.933394	 -0.181352	  1.673459
  1.944727	 -0.192718	  1.661525
  1.956065	 -0.204083	  1.649595
  1.967444	 -0.215484	  1.637627
  1.979547	 -0.227632	  1.624820
  1.994053	 -0.242487	  1.608290
  2.004899	 -0.253646	  1.595726
