  1.972246	 -2.291527	 -0.200125
  1.952719	 -2.268838	 -0.198143
  1.939880	 -2.226297	 -0.219812
  1.920733	 -2.188883	 -0.243984
  1.908068	 -2.148679	 -0.271176
  1.890092	 -2.108068	 -0.294634
  1.870529	 -2.067606	 -0.315638
  1.849541	 -2.027540	 -0.336117
  1.827238	 -1.988405	 -0.356937
  1.803415	 -1.949717	 -0.378063
  1.777806	 -1.911203	 -0.399517
  1.750498	 -1.872720	 -0.421602
  1.723403	 -1.836323	 -0.444412
  1.697085	 -1.802402	 -0.468414
  1.671017	 -1.769197	 -0.493100
  1.645579	 -1.735204	 -0.517546
  1.620376	 -1.700601	 -0.540943
  1.594669	 -1.664384	 -0.563238
  1.570977	 -1.629736	 -0.585513
  1.548208	 -1.594085	 -0.612394
  1.525766	 -1.556196	 -0.637384
  1.501831	 -1.517079	 -0.658408
  1.477530	 -1.481512	 -0.680558
  1.452403	 -1.449918	 -0.706126
  1.426079	 -1.416621	 -0.733290
  1.400409	 -1.380270	 -0.758529
  1.377302	 -1.343861	 -0.781932
  1.355602	 -1.306797	 -0.806440
  1.335702	 -1.269321	 -0.831408
  1.317341	 -1.230285	 -0.856763
  1.299952	 -1.189135	 -0.881793
  1.283081	 -1.147394	 -0.906690
  1.266697	 -1.106711	 -0.931053
  1.248865	 -1.067160	 -0.954979
  1.228530	 -1.027464	 -0.979319
  1.205829	 -0.988334	 -1.002654
  1.182411	 -0.951426	 -1.024123
  1.158581	 -0.915078	 -1.045629
  1.133316	 -0.876891	 -1.067265
  1.106460	 -0.838922	 -1.086695
  1.075835	 -0.808390	 -1.108188
  1.028495	 -0.815002	 -1.149777
  0.977007	 -0.824849	 -1.209771
  0.937945	 -0.826119	 -1.281686
  0.923342	 -0.815688	 -1.324068
  0.909499	 -0.793703	 -1.386087
  0.898756	 -0.774187	 -1.463021
  0.896147	 -0.757128	 -1.546263
  0.904142	 -0.730343	 -1.638789
  0.935676	 -0.687022	 -1.765237
  0.972478	 -0.641611	 -1.884586
  0.997471	 -0.593369	 -1.951427
  1.004346	 -0.553287	 -1.978669
  1.002352	 -0.506019	 -1.986819
  0.998329	 -0.457408	 -1.988879
  0.985264	 -0.383304	 -1.980924
  0.960022	 -0.327563	 -1.938601
  0.920444	 -0.278559	 -1.846800
  0.839737	 -0.220205	 -1.693600
  0.734984	 -0.131016	 -1.597507
  0.656956	 -0.046319	 -1.583677
  0.622686	  0.001052	 -1.594685
  0.605626	  0.032228	 -1.609176
  0.592730	  0.059843	 -1.629061
  0.580870	  0.095701	 -1.665870
  0.584297	  0.137913	 -1.736428
  0.610963	  0.174208	 -1.824713
  0.637139	  0.254344	 -1.944482
  0.765972	  0.319100	 -2.080149
  0.867751	  0.344635	 -2.195017
  0.904042	  0.347768	 -2.313894
  0.914511	  0.348191	 -2.399517
  0.918798	  0.361903	 -2.481818
  0.928028	  0.426897	 -2.547552
  0.855455	  0.508432	 -2.509774
  0.787028	  0.556792	 -2.475626
  0.708015	  0.600157	 -2.437491
  0.631217	  0.631261	 -2.392795
  0.559881	  0.641309	 -2.325916
  0.437158	  0.628716	 -2.184871
  0.279227	  0.664480	 -2.054589
  0.177355	  0.736356	 -2.013149
  0.128065	  0.790393	 -2.022988
  0.098955	  0.834945	 -2.043438
  0.075349	  0.876019	 -2.064729
  0.054329	  0.916989	 -2.084961
  0.034134	  0.958290	 -2.104537
  0.014106	  0.999319	 -2.124152
 -0.006461	  1.040334	 -2.145437
 -0.026633	  1.079517	 -2.167861
 -0.047209	  1.119004	 -2.192339
 -0.066543	  1.155414	 -2.217359
 -0.085681	  1.190938	 -2.244051
 -0.106615	  1.226915	 -2.273035
 -0.128597	  1.262626	 -2.302578
 -0.150790	  1.296884	 -2.330741
 -0.173944	  1.330265	 -2.358251
 -0.199229	  1.363912	 -2.383537
 -0.225950	  1.398526	 -2.406872
 -0.248660	  1.430691	 -2.434300
 -0.275183	  1.470044	 -2.451179
 -0.301322	  1.508817	 -2.471699
 -0.322614	  1.544749	 -2.498417
 -0.348864	  1.578558	 -2.527142
 -0.352353	  1.594344	 -2.552414
