 -1.409013	  1.676453	 -1.055063
 -1.416266	  1.693879	 -1.084485
 -1.412272	  1.683970	 -1.067577
 -1.408748	  1.674249	 -1.050458
 -1.405224	  1.664528	 -1.033338
 -1.400864	  1.655249	 -1.016166
 -1.396156	  1.646162	 -0.998983
 -1.391408	  1.637106	 -0.981794
 -1.385650	  1.628903	 -0.964486
 -1.379892	  1.620700	 -0.947179
 -1.374122	  1.612334	 -0.929953
 -1.368340	  1.603793	 -0.912818
 -1.362625	  1.595123	 -0.895725
 -1.357304	  1.585721	 -0.878894
 -1.351982	  1.576318	 -0.862063
 -1.347210	  1.566347	 -0.845396
 -1.342536	  1.556275	 -0.828761
 -1.338165	  1.545949	 -0.812200
 -1.334071	  1.535395	 -0.795712
 -1.329853	  1.524790	 -0.779289
 -1.325061	  1.513956	 -0.763174
 -1.320268	  1.503123	 -0.747060
 -1.315313	  1.491629	 -0.731461
 -1.310337	  1.480054	 -0.715928
 -1.306680	  1.467537	 -0.700764
 -1.303379	  1.454782	 -0.685717
 -1.302216	  1.441387	 -0.670911
 -1.301581	  1.427860	 -0.656193
 -1.302719	  1.414385	 -0.641458
 -1.305208	  1.401022	 -0.626787
 -1.307697	  1.387659	 -0.612116
 -1.312517	  1.375399	 -0.597068
 -1.318442	  1.363751	 -0.581928
 -1.324368	  1.352103	 -0.566788
 -1.330857	  1.340913	 -0.551534
 -1.340265	  1.332482	 -0.536029
 -1.349673	  1.324051	 -0.520524
 -1.359080	  1.315621	 -0.505018
 -1.369939	  1.307897	 -0.490104
 -1.382997	  1.301452	 -0.476394
 -1.396055	  1.295007	 -0.462685
 -1.409113	  1.288562	 -0.448975
 -1.422171	  1.282117	 -0.435265
 -1.434093	  1.277244	 -0.419965
 -1.445345	  1.273224	 -0.403927
 -1.456598	  1.269204	 -0.387889
 -1.467850	  1.265185	 -0.371850
 -1.479103	  1.261165	 -0.355812
 -1.490991	  1.257355	 -0.340186
 -1.503332	  1.253703	 -0.324878
 -1.515674	  1.250050	 -0.309570
 -1.528016	  1.246398	 -0.294261
 -1.537559	  1.240744	 -0.277620
 -1.546164	  1.234505	 -0.260678
 -1.554767	  1.228264	 -0.243735
 -1.556900	  1.216455	 -0.227735
 -1.559033	  1.204647	 -0.211734
 -1.559003	  1.190603	 -0.197495
 -1.556884	  1.174826	 -0.185388
 -1.554765	  1.159048	 -0.173281
 -1.549117	  1.142254	 -0.164004
 -1.542826	  1.125368	 -0.155327
 -1.536535	  1.108482	 -0.146650
 -1.527217	  1.092634	 -0.138775
 -1.516273	  1.077577	 -0.131459
 -1.505330	  1.062521	 -0.124142
 -1.494386	  1.047464	 -0.116826
 -1.480346	  1.035430	 -0.109206
 -1.466145	  1.023590	 -0.101580
 -1.451944	  1.011750	 -0.093954
 -1.437744	  0.999910	 -0.086328
 -1.422056	  0.991585	 -0.077131
 -1.406198	  0.983833	 -0.067727
 -1.390341	  0.976081	 -0.058323
 -1.374483	  0.968329	 -0.048918
 -1.358594	  0.960755	 -0.039422
 -1.342427	  0.956564	 -0.028419
 -1.326260	  0.952373	 -0.017416
 -1.310094	  0.948182	 -0.006413
 -1.293927	  0.943991	  0.004591
 -1.277764	  0.939812	  0.015605
 -1.262665	  0.938109	  0.028609
 -1.247565	  0.936406	  0.041613
 -1.232466	  0.934703	  0.054617
 -1.217366	  0.933000	  0.067621
 -1.203152	  0.932621	  0.081685
 -1.189131	  0.932508	  0.095947
 -1.175109	  0.932394	  0.110209
 -1.162077	  0.933078	  0.125364
 -1.149361	  0.934002	  0.140774
 -1.136645	  0.934927	  0.156183
 -1.125301	  0.936095	  0.172613
 -1.114275	  0.937317	  0.189254
 -1.103249	  0.938539	  0.205895
 -1.092900	  0.939797	  0.222964
 -1.083391	  0.941096	  0.240510
 -1.073882	  0.942396	  0.258057
 -1.064564	  0.943513	  0.275718
 -1.055936	  0.943985	  0.293755
 -1.047308	  0.944458	  0.311793
 -1.038913	  0.944033	  0.329941
 -1.030631	  0.943202	  0.348126
 -1.022554	  0.941084	  0.366300
 -1.014584	  0.938275	  0.384427
 -1.006849	  0.933980	  0.402363
 -0.999357	  0.928025	  0.419925
 -0.992081	  0.920959	  0.437162
 -0.985214	  0.912207	  0.453783
 -0.978684	  0.902688	  0.470115
 -0.973074	  0.891291	  0.485563
 -0.967464	  0.879894	  0.501011
 -0.963172	  0.866828	  0.515532
 -0.960325	  0.852202	  0.528873
 -0.957479	  0.837575	  0.542213
 -0.954781	  0.822823	  0.555445
 -0.955743	  0.805605	  0.565575
 -0.956706	  0.788387	  0.575705
 -0.957668	  0.771169	  0.585835
 -0.958631	  0.753951	  0.595965
 -0.959381	  0.737856	  0.607813
 -0.959907	  0.723087	  0.621289
 -0.960433	  0.708318	  0.634765
 -0.960959	  0.693548	  0.648240
 -0.961755	  0.678624	  0.661530
 -0.962934	  0.663487	  0.674549
 -0.964112	  0.648351	  0.687569
 -0.966073	  0.632189	  0.699186
 -0.968056	  0.616000	  0.710760
 -0.968999	  0.600524	  0.723394
 -0.969764	  0.585181	  0.736201
 -0.969371	  0.570716	  0.750006
 -0.967947	  0.557128	  0.764613
 -0.966153	  0.543860	  0.779470
 -0.962650	  0.532216	  0.795349
 -0.959147	  0.520572	  0.811228
 -0.954970	  0.509722	  0.827502
 -0.950098	  0.499742	  0.844135
 -0.945227	  0.489761	  0.860768
 -0.939468	  0.481280	  0.877941
 -0.933503	  0.473169	  0.895222
 -0.926734	  0.466504	  0.912822
 -0.919421	  0.460898	  0.930573
 -0.911648	  0.456064	  0.948355
 -0.902802	  0.453182	  0.966059
 -0.893956	  0.450300	  0.983764
 -0.884523	  0.448878	  1.001342
 -0.874502	  0.449099	  1.018649
 -0.864482	  0.449320	  1.035956
 -0.854420	  0.450111	  1.053223
 -0.844291	  0.454465	  1.069910
 -0.834162	  0.458819	  1.086597
 -0.824034	  0.463173	  1.103283
 -0.814185	  0.469482	  1.119507
 -0.804685	  0.477542	  1.135153
 -0.795186	  0.485602	  1.150799
 -0.785686	  0.493662	  1.166445
 -0.776290	  0.502310	  1.181837
 -0.766936	  0.511180	  1.197128
 -0.757582	  0.520051	  1.212419
 -0.748154	  0.528789	  1.227741
 -0.737563	  0.535238	  1.243433
 -0.726972	  0.541686	  1.259125
 -0.716380	  0.548134	  1.274818
 -0.706142	  0.549588	  1.291937
 -0.695980	  0.550520	  1.309137
 -0.686040	  0.551081	  1.326483
 -0.678480	  0.548098	  1.344757
 -0.670919	  0.545115	  1.363031
 -0.663637	  0.541977	  1.381392
 -0.657651	  0.538143	  1.400086
 -0.651666	  0.534308	  1.418781
 -0.646009	  0.530243	  1.437528
 -0.640761	  0.525897	  1.456332
 -0.635513	  0.521550	  1.475135
 -0.630319	  0.516606	  1.493805
 -0.625129	  0.511625	  1.512467
 -0.619863	  0.506268	  1.531003
 -0.614544	  0.500644	  1.549444
 -0.609198	  0.494792	  1.567806
 -0.603792	  0.488429	  1.585980
 -0.598392	  0.482057	  1.604152
 -0.593433	  0.475049	  1.622216
 -0.588473	  0.468041	  1.640279
 -0.583949	  0.460711	  1.658329
 -0.579710	  0.453176	  1.676364
 -0.575499	  0.445634	  1.694403
 -0.572107	  0.437897	  1.712531
 -0.568714	  0.430160	  1.730659
 -0.565692	  0.422443	  1.748861
 -0.563065	  0.414751	  1.767135
 -0.560438	  0.407058	  1.785408
 -0.558325	  0.399617	  1.803852
 -0.556251	  0.392194	  1.822307
 -0.554241	  0.384937	  1.840835
 -0.552423	  0.378192	  1.859576
 -0.550606	  0.371447	  1.878316
 -0.548702	  0.364919	  1.897125
 -0.546729	  0.358567	  1.915986
 -0.544740	  0.352203	  1.934842
 -0.542587	  0.345730	  1.953643
 -0.540434	  0.339257	  1.972444
 -0.538889	  0.331798	  1.990936
 -0.537511	  0.324073	  2.009332
 -0.536539	  0.313529	  2.026299
 -0.535658	  0.302404	  2.042896
 -0.532440	  0.291302	  2.059218
 -0.528804	  0.280220	  2.075465
 -0.523365	  0.269577	  2.091501
 -0.516855	  0.259246	  2.107340
 -0.510346	  0.248914	  2.123179
 -0.505227	  0.240643	  2.140654
 -0.501039	  0.233758	  2.158959
 -0.496851	  0.226874	  2.177264
 -0.492754	  0.220305	  2.195705
 -0.489323	  0.215977	  2.214927
 -0.485237	  0.210918	  2.233840
 -0.477747	  0.202086	  2.250147
 -0.470256	  0.193255	  2.266454
 -0.467291	  0.186196	  2.284930
 -0.464731	  0.179314	  2.303533
 -0.462170	  0.172432	  2.322137
 -0.458077	  0.167698	  2.341132
 -0.452833	  0.164707	  2.360199
 -0.447590	  0.161715	  2.379266
 -0.442346	  0.158723	  2.398334
 -0.434624	  0.153184	  2.424776
 -0.429001	  0.148750	  2.443451
