 -2.442390	 -0.888723	  1.557499
 -2.418208	 -0.879924	  1.542078
 -2.377130	 -0.860213	  1.518888
 -2.344711	 -0.847747	  1.482291
 -2.311130	 -0.832323	  1.448638
 -2.276223	 -0.816914	  1.416546
 -2.242202	 -0.802476	  1.383238
 -2.214524	 -0.790017	  1.343406
 -2.185436	 -0.766666	  1.309246
 -2.150728	 -0.753816	  1.274720
 -2.116584	 -0.734304	  1.243601
 -2.079440	 -0.722325	  1.213715
 -2.042841	 -0.714772	  1.181626
 -2.002414	 -0.702073	  1.154113
 -1.962715	 -0.692864	  1.124225
 -1.924338	 -0.681745	  1.093786
 -1.887941	 -0.666106	  1.062590
 -1.857052	 -0.645571	  1.030348
 -1.837971	 -0.643644	  0.989499
 -1.830519	 -0.689806	  0.927333
 -1.782299	 -0.757722	  0.847134
 -1.703541	 -0.810094	  0.776495
 -1.628727	 -0.839444	  0.732515
 -1.574946	 -0.854837	  0.707052
 -1.536602	 -0.860473	  0.691787
 -1.509205	 -0.856864	  0.682644
 -1.482432	 -0.844630	  0.674692
 -1.443804	 -0.806302	  0.662608
 -1.402254	 -0.717221	  0.639220
 -1.377643	 -0.609378	  0.598829
 -1.359294	 -0.533465	  0.556983
 -1.343067	 -0.490031	  0.528574
 -1.326373	 -0.459481	  0.505704
 -1.305259	 -0.431579	  0.481787
 -1.278895	 -0.405475	  0.456680
 -1.247302	 -0.380662	  0.430524
 -1.211279	 -0.357647	  0.404184
 -1.173895	 -0.337716	  0.380124
 -1.135208	 -0.319578	  0.358126
 -1.095590	 -0.301880	  0.338287
 -1.052623	 -0.283232	  0.318576
 -1.007833	 -0.269102	  0.293744
 -0.965141	 -0.260402	  0.263246
 -0.926545	 -0.254971	  0.228119
 -0.889887	 -0.249828	  0.190978
 -0.853936	 -0.243459	  0.153454
 -0.819470	 -0.235837	  0.115811
 -0.786542	 -0.227142	  0.077962
 -0.755376	 -0.217427	  0.039445
 -0.726049	 -0.206792	  0.000345
 -0.695749	 -0.194090	 -0.037321
 -0.664666	 -0.178735	 -0.072122
 -0.632604	 -0.161735	 -0.105048
 -0.599570	 -0.143608	 -0.137874
 -0.567534	 -0.125641	 -0.170501
 -0.536862	 -0.108842	 -0.203166
 -0.507055	 -0.093098	 -0.237915
 -0.478050	 -0.077415	 -0.275288
 -0.449844	 -0.061498	 -0.314707
 -0.421765	 -0.044827	 -0.354164
 -0.393017	 -0.026425	 -0.392380
 -0.363206	 -0.006477	 -0.429266
 -0.332371	  0.013921	 -0.465122
 -0.300481	  0.033563	 -0.499283
 -0.266953	  0.051575	 -0.531372
 -0.232439	  0.067007	 -0.560785
 -0.195095	  0.080144	 -0.589157
 -0.155389	  0.091503	 -0.616892
 -0.114693	  0.101389	 -0.643618
 -0.073220	  0.110370	 -0.670011
 -0.030544	  0.119594	 -0.697614
  0.010514	  0.129286	 -0.725897
  0.050578	  0.139482	 -0.754898
  0.089577	  0.149773	 -0.783740
  0.127263	  0.159740	 -0.811869
  0.164576	  0.169162	 -0.839515
  0.202312	  0.178324	 -0.866774
  0.242146	  0.186896	 -0.893849
  0.281967	  0.194604	 -0.920725
  0.320485	  0.202186	 -0.946653
  0.359323	  0.210567	 -0.971732
  0.397696	  0.219047	 -0.994453
  0.432251	  0.225517	 -1.012194
  0.457734	  0.228567	 -1.023206
  0.475771	  0.228856	 -1.029620
  0.501901	  0.226622	 -1.037463
  0.549074	  0.220573	 -1.050892
  0.607364	  0.213431	 -1.069364
  0.662746	  0.208469	 -1.089566
  0.718820	  0.204386	 -1.114649
  0.787662	  0.209338	 -1.152535
  0.869892	  0.237451	 -1.212329
  0.950664	  0.232658	 -1.279564
  1.018148	  0.214723	 -1.344850
  1.069613	  0.194483	 -1.390551
  1.113632	  0.204276	 -1.433043
  1.149823	  0.230398	 -1.475012
  1.175027	  0.273023	 -1.517390
  1.184841	  0.327139	 -1.555598
  1.176614	  0.389856	 -1.590354
  1.159154	  0.451644	 -1.631353
  1.146527	  0.503294	 -1.679581
  1.148389	  0.542357	 -1.727776
  1.162937	  0.576512	 -1.769521
  1.182159	  0.605782	 -1.803438
  1.203652	  0.630873	 -1.832445
  1.227948	  0.654945	 -1.861068
  1.254684	  0.678989	 -1.891365
  1.281982	  0.702328	 -1.924006
  1.309081	  0.724119	 -1.959793
  1.336065	  0.743298	 -1.996206
  1.364021	  0.760570	 -2.032795
  1.392345	  0.777017	 -2.069284
  1.421691	  0.793543	 -2.105620
  1.453764	  0.810335	 -2.141277
  1.488868	  0.826257	 -2.174957
  1.525493	  0.841138	 -2.206462
  1.561824	  0.854993	 -2.235945
  1.597832	  0.868185	 -2.265144
  1.633963	  0.880317	 -2.295244
  1.672529	  0.888029	 -2.326812
  1.689254	  0.896909	 -2.350080
