  1.530444	 -1.894751	  0.537302
  1.542180	 -1.915753	  0.528004
  1.536786	 -1.896595	  0.536118
  1.527561	 -1.881140	  0.542160
  1.514503	 -1.866172	  0.547158
  1.502938	 -1.850231	  0.552937
  1.491495	 -1.834415	  0.557854
  1.480488	 -1.820102	  0.562158
  1.467593	 -1.803615	  0.567324
  1.456448	 -1.788227	  0.571374
  1.446209	 -1.773176	  0.574575
  1.434036	 -1.754496	  0.578437
  1.426617	 -1.735403	  0.582946
  1.421123	 -1.715346	  0.589456
  1.413989	 -1.703309	  0.595805
  1.395935	 -1.688815	  0.599480
  1.380819	 -1.674711	  0.602357
  1.368114	 -1.659918	  0.607043
  1.355128	 -1.645304	  0.611338
  1.342341	 -1.630105	  0.614019
  1.329458	 -1.615021	  0.616446
  1.315815	 -1.600615	  0.619063
  1.302050	 -1.586495	  0.622163
  1.287878	 -1.572612	  0.624662
  1.272842	 -1.559525	  0.627632
  1.258726	 -1.545620	  0.631496
  1.245716	 -1.530994	  0.636532
  1.232576	 -1.517303	  0.643630
  1.219068	 -1.504717	  0.651445
  1.205214	 -1.493544	  0.659508
  1.189418	 -1.481606	  0.661163
  1.170018	 -1.468875	  0.661155
  1.150622	 -1.457721	  0.667707
  1.135884	 -1.447129	  0.679773
  1.128301	 -1.436876	  0.692841
  1.119421	 -1.422055	  0.704711
  1.107379	 -1.408981	  0.715738
  1.095476	 -1.396353	  0.725733
  1.083410	 -1.382352	  0.734414
  1.073302	 -1.367837	  0.744474
  1.065546	 -1.353557	  0.756256
  1.057867	 -1.339296	  0.768370
  1.049768	 -1.325342	  0.780489
  1.039320	 -1.311977	  0.790999
  1.026840	 -1.299010	  0.800239
  1.013950	 -1.286072	  0.808869
  1.003098	 -1.271628	  0.817434
  0.993306	 -1.256737	  0.826226
  0.983108	 -1.241704	  0.835019
  0.972198	 -1.226292	  0.842035
  0.961315	 -1.210598	  0.847838
  0.949970	 -1.195190	  0.853782
  0.938025	 -1.180306	  0.859846
  0.925968	 -1.165541	  0.865989
  0.913032	 -1.151441	  0.871961
  0.899758	 -1.137656	  0.877852
  0.886326	 -1.124066	  0.883822
  0.872430	 -1.110974	  0.889801
  0.858584	 -1.097962	  0.896009
  0.844987	 -1.084874	  0.902435
  0.832355	 -1.071140	  0.909733
  0.820445	 -1.056740	  0.917286
  0.808339	 -1.041906	  0.923745
  0.795451	 -1.027236	  0.929041
  0.781029	 -1.013846	  0.932141
  0.766579	 -1.000425	  0.936102
  0.752226	 -0.987034	  0.940369
  0.738643	 -0.973313	  0.945117
  0.726980	 -0.958950	  0.953072
  0.714953	 -0.944354	  0.961563
  0.701918	 -0.930070	  0.968204
  0.687348	 -0.916294	  0.971496
  0.671741	 -0.902723	  0.971787
  0.656971	 -0.890386	  0.971042
  0.643017	 -0.877852	  0.967923
  0.626561	 -0.857111	  0.965201
  0.613433	 -0.838878	  0.964625
  0.605280	 -0.827141	  0.965844
  0.593011	 -0.811059	  0.970557
  0.577153	 -0.794418	  0.975269
  0.567529	 -0.783278	  0.978020
  0.556576	 -0.768735	  0.985062
  0.541545	 -0.747434	  0.995106
  0.529612	 -0.734409	  1.002785
  0.518371	 -0.721744	  1.010371
  0.506671	 -0.709178	  1.017878
  0.492791	 -0.693996	  1.027881
  0.484707	 -0.680939	  1.035297
  0.473593	 -0.666007	  1.044669
  0.456602	 -0.651780	  1.055506
  0.444757	 -0.644729	  1.061703
  0.427324	 -0.634689	  1.070802
  0.410218	 -0.619082	  1.081230
  0.403407	 -0.611132	  1.085928
  0.390113	 -0.592675	  1.095183
  0.378919	 -0.576411	  1.103723
  0.368330	 -0.562824	  1.113695
  0.351666	 -0.551752	  1.123641
  0.334583	 -0.541588	  1.131602
  0.326164	 -0.534358	  1.135586
  0.314692	 -0.516290	  1.143620
  0.302948	 -0.492971	  1.153160
  0.296720	 -0.479281	  1.156742
  0.289926	 -0.465828	  1.160450
  0.277144	 -0.447603	  1.167668
  0.263514	 -0.432383	  1.176423
  0.253159	 -0.416841	  1.183045
  0.244255	 -0.399696	  1.188249
  0.236140	 -0.381404	  1.192301
  0.228250	 -0.363002	  1.194843
  0.220588	 -0.344691	  1.196307
  0.213113	 -0.325706	  1.198583
  0.207001	 -0.306719	  1.204355
  0.200060	 -0.287495	  1.214605
  0.187764	 -0.270824	  1.224812
  0.175119	 -0.260717	  1.230871
  0.161673	 -0.247691	  1.235097
  0.149959	 -0.230683	  1.237448
  0.140616	 -0.212927	  1.240727
  0.131403	 -0.195323	  1.244922
  0.120959	 -0.178373	  1.249391
  0.108167	 -0.162800	  1.254170
  0.094280	 -0.149472	  1.260149
  0.081572	 -0.138133	  1.266677
  0.071300	 -0.124597	  1.273621
  0.063297	 -0.104634	  1.282203
  0.053009	 -0.080982	  1.293606
  0.046273	 -0.067528	  1.298550
  0.040069	 -0.051906	  1.302602
  0.018588	 -0.032016	  1.307469
  0.007328	 -0.023300	  1.310618
 -0.006639	 -0.015400	  1.313986
 -0.022957	 -0.002619	  1.319216
 -0.045946	  0.014574	  1.328633
 -0.056368	  0.018693	  1.334381
 -0.074741	  0.025456	  1.342050
 -0.093127	  0.038465	  1.349403
 -0.107220	  0.049087	  1.354858
 -0.125183	  0.060787	  1.363170
 -0.137348	  0.069795	  1.369993
 -0.149313	  0.081297	  1.377356
 -0.165479	  0.097374	  1.386112
 -0.178098	  0.108520	  1.391641
 -0.191532	  0.120002	  1.398384
 -0.207549	  0.134415	  1.406970
 -0.219697	  0.145421	  1.413137
 -0.232543	  0.156893	  1.421189
 -0.246541	  0.171057	  1.432179
 -0.258078	  0.182608	  1.439836
 -0.271592	  0.193520	  1.447304
 -0.286089	  0.205106	  1.455479
 -0.303975	  0.224669	  1.464251
 -0.314441	  0.238390	  1.466667
 -0.323882	  0.253473	  1.468978
 -0.332256	  0.271997	  1.470453
 -0.340253	  0.290165	  1.469840
 -0.351755	  0.307864	  1.470836
 -0.365174	  0.324672	  1.475530
 -0.376899	  0.338513	  1.481120
 -0.393469	  0.352951	  1.490540
 -0.406251	  0.367311	  1.496735
 -0.413331	  0.381323	  1.502178
 -0.420334	  0.403155	  1.510831
 -0.424987	  0.416145	  1.516752
 -0.432684	  0.433313	  1.527154
 -0.446322	  0.451020	  1.535450
 -0.456886	  0.464089	  1.537174
 -0.469148	  0.479714	  1.539106
 -0.480643	  0.499094	  1.553123
 -0.486596	  0.511919	  1.567659
 -0.491034	  0.523177	  1.578901
 -0.496916	  0.542743	  1.587858
 -0.506095	  0.561219	  1.588940
 -0.521708	  0.581057	  1.593756
 -0.540558	  0.597885	  1.600795
 -0.544543	  0.602380	  1.602210
 -0.556292	  0.621903	  1.607845
 -0.566184	  0.640646	  1.612977
 -0.571992	  0.659634	  1.620588
 -0.587929	  0.685043	  1.633871
 -0.591775	  0.687611	  1.636644
 -0.604513	  0.700698	  1.649000
 -0.617951	  0.719063	  1.666392
 -0.640430	  0.733531	  1.678799
 -0.657300	  0.741426	  1.681074
 -0.671851	  0.746310	  1.681206
 -0.690442	  0.757616	  1.683613
 -0.706340	  0.768358	  1.688900
 -0.722105	  0.778675	  1.696695
 -0.736832	  0.788841	  1.703988
 -0.748658	  0.798323	  1.709494
 -0.768490	  0.816435	  1.716737
 -0.786685	  0.831155	  1.723202
 -0.797070	  0.839266	  1.726044
 -0.808307	  0.848507	  1.730326
 -0.828130	  0.865585	  1.740704
 -0.838683	  0.875789	  1.745284
 -0.850680	  0.886307	  1.751540
 -0.869689	  0.905089	  1.759657
 -0.882412	  0.917203	  1.762224
 -0.895896	  0.931559	  1.764703
 -0.907183	  0.942546	  1.764668
 -0.922861	  0.958568	  1.768380
 -0.936704	  0.971942	  1.774394
 -0.950462	  0.984311	  1.782836
 -0.963812	  0.996048	  1.791924
 -0.976814	  1.007999	  1.801119
 -0.989206	  1.020669	  1.810548
 -1.000923	  1.033732	  1.820352
 -1.011936	  1.047145	  1.830343
 -1.022927	  1.060058	  1.839532
 -1.036123	  1.072938	  1.848041
 -1.052597	  1.084050	  1.856421
 -1.070037	  1.094393	  1.864632
 -1.083868	  1.108257	  1.870630
 -1.090465	  1.121238	  1.878039
 -1.095126	  1.140871	  1.889726
 -1.099350	  1.162854	  1.896905
 -1.105957	  1.183780	  1.899704
 -1.128377	  1.196651	  1.889110
 -1.139177	  1.213245	  1.891937
