 -0.184675	 -1.824847	  1.754589
 -0.162838	 -1.846066	  1.771590
 -0.181465	 -1.838006	  1.762884
 -0.193203	 -1.825058	  1.754394
 -0.204391	 -1.810488	  1.746058
 -0.217505	 -1.797136	  1.737145
 -0.228025	 -1.785994	  1.725252
 -0.239292	 -1.774447	  1.713444
 -0.249076	 -1.762324	  1.701519
 -0.263346	 -1.750632	  1.692414
 -0.281342	 -1.739588	  1.685052
 -0.293105	 -1.725631	  1.675896
 -0.299373	 -1.709946	  1.666219
 -0.309201	 -1.693218	  1.658602
 -0.319791	 -1.679027	  1.652065
 -0.329453	 -1.663051	  1.644524
 -0.344738	 -1.645868	  1.639407
 -0.358582	 -1.636903	  1.635965
 -0.375848	 -1.630419	  1.631764
 -0.400019	 -1.618332	  1.624861
 -0.410403	 -1.606887	  1.618283
 -0.419586	 -1.588974	  1.609974
 -0.435033	 -1.573348	  1.602833
 -0.454323	 -1.567844	  1.597779
 -0.471108	 -1.566401	  1.594320
 -0.494394	 -1.560770	  1.586785
 -0.509144	 -1.552827	  1.577398
 -0.522793	 -1.542368	  1.569700
 -0.539886	 -1.532800	  1.562428
 -0.555967	 -1.524485	  1.557057
 -0.573133	 -1.514504	  1.550158
 -0.592469	 -1.507075	  1.540418
 -0.607343	 -1.501000	  1.535076
 -0.623284	 -1.489030	  1.529774
 -0.637569	 -1.476522	  1.523832
 -0.653077	 -1.464620	  1.517020
 -0.668017	 -1.453134	  1.510272
 -0.682127	 -1.441051	  1.502815
 -0.695671	 -1.428572	  1.494982
 -0.709062	 -1.416054	  1.486946
 -0.721523	 -1.402745	  1.478757
 -0.733791	 -1.389200	  1.470606
 -0.745998	 -1.375534	  1.462584
 -0.757834	 -1.361509	  1.454634
 -0.769663	 -1.347480	  1.446680
 -0.781292	 -1.333542	  1.438283
 -0.792820	 -1.319655	  1.429666
 -0.804350	 -1.305787	  1.421025
 -0.816081	 -1.293219	  1.410809
 -0.827843	 -1.280773	  1.400480
 -0.840968	 -1.268855	  1.391228
 -0.854895	 -1.257414	  1.382779
 -0.874626	 -1.259117	  1.384639
 -0.893785	 -1.263836	  1.388429
 -0.912796	 -1.268836	  1.392007
 -0.931791	 -1.274076	  1.395371
 -0.950806	 -1.279146	  1.398861
 -0.969834	 -1.284008	  1.402181
 -0.989324	 -1.286708	  1.405105
 -1.008931	 -1.289291	  1.408105
 -1.028434	 -1.292851	  1.410341
 -1.048123	 -1.297161	  1.412291
 -1.067788	 -1.299270	  1.415819
 -1.087299	 -1.299005	  1.419040
 -1.107434	 -1.298270	  1.418118
 -1.127623	 -1.297260	  1.417722
 -1.147173	 -1.294026	  1.418307
 -1.166750	 -1.292186	  1.417414
 -1.186459	 -1.288329	  1.413588
 -1.203996	 -1.280647	  1.408968
 -1.222135	 -1.273043	  1.406532
 -1.239314	 -1.264438	  1.401955
 -1.261937	 -1.259013	  1.392844
 -1.277724	 -1.262364	  1.390574
 -1.298756	 -1.263951	  1.385082
 -1.319813	 -1.259570	  1.377682
 -1.335192	 -1.248443	  1.371515
 -1.350864	 -1.234076	  1.362322
 -1.364749	 -1.229700	  1.356206
 -1.387668	 -1.230290	  1.350833
 -1.410056	 -1.223629	  1.343904
 -1.421245	 -1.209197	  1.333652
 -1.431420	 -1.194420	  1.321795
 -1.449735	 -1.183587	  1.315822
 -1.463612	 -1.174211	  1.315092
 -1.476107	 -1.159901	  1.311485
 -1.487444	 -1.141815	  1.300882
 -1.499867	 -1.128092	  1.294512
 -1.514259	 -1.118108	  1.288360
 -1.527469	 -1.103986	  1.278763
 -1.535197	 -1.083358	  1.269248
 -1.540146	 -1.065854	  1.265284
 -1.548487	 -1.046047	  1.263107
 -1.553893	 -1.029450	  1.264148
 -1.555558	 -1.009794	  1.268233
 -1.556770	 -0.984431	  1.273036
 -1.565150	 -0.964366	  1.274721
 -1.573478	 -0.946935	  1.274307
 -1.581267	 -0.926602	  1.269309
 -1.584083	 -0.907210	  1.260955
 -1.582820	 -0.889134	  1.247629
 -1.585237	 -0.878306	  1.234444
 -1.588403	 -0.860946	  1.225261
 -1.585134	 -0.845215	  1.212823
 -1.581191	 -0.827596	  1.195631
 -1.580487	 -0.813434	  1.180942
 -1.578448	 -0.802835	  1.170372
 -1.575777	 -0.789511	  1.154457
 -1.576819	 -0.777164	  1.140040
 -1.578163	 -0.760781	  1.125990
 -1.574563	 -0.741117	  1.107628
 -1.567805	 -0.734453	  1.096457
 -1.562331	 -0.726240	  1.080022
 -1.561335	 -0.712214	  1.063596
 -1.563510	 -0.694728	  1.053064
 -1.570679	 -0.676542	  1.040759
 -1.574551	 -0.665309	  1.027095
 -1.572937	 -0.654715	  1.014592
 -1.577083	 -0.635413	  0.999850
 -1.584818	 -0.624821	  0.989249
 -1.590734	 -0.614355	  0.975250
 -1.600943	 -0.599596	  0.964176
 -1.610299	 -0.578774	  0.957572
 -1.618012	 -0.563629	  0.949132
 -1.628968	 -0.554977	  0.936947
 -1.643118	 -0.546659	  0.922709
 -1.658253	 -0.544563	  0.907678
 -1.672701	 -0.542058	  0.893952
 -1.687214	 -0.539924	  0.880313
 -1.701712	 -0.537928	  0.866681
 -1.715538	 -0.535716	  0.852750
 -1.728137	 -0.531521	  0.837429
 -1.742762	 -0.529709	  0.822294
 -1.756340	 -0.534471	  0.806776
 -1.767252	 -0.543200	  0.792782
 -1.776324	 -0.550519	  0.776686
 -1.787388	 -0.556509	  0.760134
 -1.799657	 -0.562684	  0.745502
 -1.810402	 -0.571362	  0.731233
 -1.820011	 -0.578981	  0.715168
 -1.829770	 -0.587439	  0.699760
 -1.839976	 -0.598443	  0.686182
 -1.847742	 -0.607400	  0.670340
 -1.856234	 -0.615803	  0.653658
 -1.862670	 -0.625290	  0.636962
 -1.865180	 -0.638965	  0.622808
 -1.866094	 -0.656476	  0.610145
 -1.866866	 -0.668582	  0.595106
 -1.872627	 -0.679490	  0.577547
 -1.877009	 -0.689271	  0.563641
 -1.893896	 -0.683037	  0.554367
 -1.901681	 -0.676344	  0.558339
 -1.923950	 -0.691788	  0.538266
 -1.934660	 -0.694057	  0.531042
 -1.947585	 -0.679694	  0.524293
 -1.958920	 -0.664725	  0.515813
 -1.971855	 -0.651364	  0.507913
 -1.985430	 -0.639758	  0.503338
 -2.001361	 -0.626519	  0.497997
 -2.015821	 -0.614016	  0.488118
 -2.030436	 -0.600436	  0.477276
 -2.039518	 -0.590389	  0.468779
 -2.052147	 -0.578622	  0.462327
 -2.068230	 -0.561166	  0.453489
 -2.077377	 -0.550448	  0.446914
 -2.091281	 -0.538245	  0.438549
 -2.107453	 -0.523436	  0.429300
 -2.116812	 -0.511554	  0.421121
 -2.129578	 -0.498819	  0.412635
 -2.144032	 -0.485297	  0.403913
 -2.154608	 -0.472604	  0.395057
 -2.166336	 -0.459542	  0.385839
 -2.180377	 -0.445655	  0.377522
 -2.190481	 -0.429917	  0.368219
 -2.199274	 -0.415400	  0.358229
 -2.210960	 -0.404426	  0.349994
 -2.227137	 -0.392271	  0.342675
 -2.240884	 -0.380028	  0.334366
 -2.253774	 -0.367621	  0.325540
 -2.267521	 -0.358291	  0.311724
 -2.281126	 -0.346174	  0.302208
 -2.294633	 -0.336099	  0.290471
 -2.307728	 -0.328484	  0.278022
 -2.320723	 -0.320899	  0.265347
 -2.333887	 -0.312985	  0.252730
 -2.347581	 -0.304735	  0.240825
 -2.362019	 -0.295302	  0.232390
 -2.374516	 -0.287088	  0.221355
 -2.387710	 -0.277497	  0.210722
 -2.402328	 -0.266756	  0.202801
 -2.417123	 -0.255423	  0.195515
 -2.432405	 -0.244815	  0.189117
 -2.452479	 -0.233861	  0.183624
 -2.469153	 -0.223363	  0.179308
 -2.479490	 -0.209035	  0.172749
 -2.488016	 -0.195042	  0.158428
 -2.499608	 -0.183352	  0.145034
 -2.513438	 -0.171956	  0.137187
 -2.526186	 -0.158741	  0.133223
 -2.538144	 -0.145281	  0.126455
 -2.555151	 -0.131834	  0.114869
 -2.570286	 -0.122902	  0.106722
 -2.583739	 -0.112580	  0.102888
 -2.598958	 -0.098623	  0.099720
 -2.618816	 -0.087813	  0.089535
 -2.632093	 -0.079130	  0.074660
 -2.633817	 -0.063430	  0.052638
 -2.647423	 -0.051564	  0.044031
