  1.972246	 -2.291527	 -0.200125
  1.952719	 -2.268838	 -0.198143
  1.939848	 -2.226247	 -0.219816
  1.920113	 -2.188807	 -0.243555
  1.906957	 -2.148632	 -0.270493
  1.888747	 -2.108177	 -0.293874
  1.869102	 -2.067882	 -0.314751
  1.848084	 -2.027930	 -0.335351
  1.825796	 -1.989018	 -0.356248
  1.801974	 -1.950422	 -0.377470
  1.776565	 -1.911930	 -0.399028
  1.749446	 -1.873335	 -0.421284
  1.722602	 -1.836803	 -0.444240
  1.696591	 -1.802697	 -0.468307
  1.670838	 -1.769374	 -0.493078
  1.645576	 -1.735262	 -0.517622
  1.620494	 -1.700458	 -0.540774
  1.594760	 -1.663892	 -0.562796
  1.571041	 -1.629200	 -0.584815
  1.548202	 -1.593605	 -0.611799
  1.525980	 -1.555849	 -0.637071
  1.502212	 -1.516568	 -0.658136
  1.478047	 -1.480833	 -0.680157
  1.453066	 -1.448998	 -0.705548
  1.426886	 -1.415425	 -0.732368
  1.401282	 -1.378836	 -0.757516
  1.378279	 -1.342523	 -0.780695
  1.356478	 -1.305371	 -0.805000
  1.336450	 -1.267977	 -0.829785
  1.317828	 -1.229061	 -0.855101
  1.300150	 -1.188093	 -0.880109
  1.282986	 -1.146304	 -0.904840
  1.266260	 -1.105708	 -0.929006
  1.248153	 -1.066305	 -0.952873
  1.227610	 -1.026745	 -0.977261
  1.204814	 -0.987717	 -1.000741
  1.181416	 -0.950952	 -1.022200
  1.157651	 -0.914673	 -1.043744
  1.132568	 -0.876423	 -1.065475
  1.105901	 -0.838214	 -1.084855
  1.075663	 -0.807574	 -1.106424
  1.028744	 -0.815117	 -1.149431
  0.977306	 -0.825812	 -1.209831
  0.935062	 -0.830072	 -1.282169
  0.920814	 -0.820223	 -1.323683
  0.907650	 -0.798197	 -1.386648
  0.896936	 -0.779597	 -1.463768
  0.894659	 -0.763007	 -1.547445
  0.903217	 -0.736066	 -1.638959
  0.936403	 -0.691325	 -1.766735
  0.975413	 -0.644518	 -1.887210
  1.000906	 -0.594223	 -1.953132
  1.006377	 -0.553248	 -1.979616
  1.002395	 -0.505879	 -1.985980
  0.997968	 -0.458794	 -1.987055
  0.985545	 -0.382720	 -1.981087
  0.958801	 -0.326422	 -1.941746
  0.919179	 -0.277852	 -1.851759
  0.833168	 -0.221255	 -1.697320
  0.729776	 -0.130714	 -1.599666
  0.654045	 -0.045677	 -1.583403
  0.621053	  0.001288	 -1.593169
  0.604602	  0.032817	 -1.607437
  0.592672	  0.060464	 -1.627577
  0.582203	  0.095173	 -1.664692
  0.585165	  0.137413	 -1.736240
  0.609343	  0.174312	 -1.822381
  0.640790	  0.247763	 -1.942063
  0.772060	  0.313420	 -2.079848
  0.872640	  0.342918	 -2.193634
  0.906426	  0.346813	 -2.315223
  0.916122	  0.345811	 -2.399325
  0.919553	  0.359293	 -2.482245
  0.929963	  0.426387	 -2.549329
  0.853798	  0.509236	 -2.509877
  0.786535	  0.555946	 -2.477490
  0.706418	  0.599650	 -2.440268
  0.628952	  0.631349	 -2.395897
  0.559054	  0.642154	 -2.331107
  0.436640	  0.630512	 -2.187188
  0.276176	  0.666283	 -2.053840
  0.175295	  0.737489	 -2.013716
  0.127572	  0.790403	 -2.024329
  0.099150	  0.834524	 -2.044856
  0.075636	  0.875458	 -2.066156
  0.054574	  0.916336	 -2.086501
  0.034318	  0.957546	 -2.106126
  0.014215	  0.998255	 -2.125970
 -0.006524	  1.039128	 -2.147490
 -0.026817	  1.078077	 -2.169914
 -0.047612	  1.117547	 -2.194401
 -0.067121	  1.153808	 -2.219206
 -0.086512	  1.189405	 -2.245432
 -0.107721	  1.225617	 -2.273913
 -0.129767	  1.261561	 -2.303060
 -0.151859	  1.295985	 -2.330987
 -0.174916	  1.329465	 -2.358395
 -0.200141	  1.363404	 -2.383307
 -0.226583	  1.398303	 -2.406743
 -0.248786	  1.430562	 -2.434255
 -0.275166	  1.470019	 -2.451162
 -0.301363	  1.508879	 -2.471734
 -0.322562	  1.544684	 -2.498367
 -0.348864	  1.578558	 -2.527142
 -0.352353	  1.594344	 -2.552414
