  0.702673	  0.422622	 -2.239680
  0.730974	  0.450904	 -2.246949
  0.718617	  0.440770	 -2.244442
  0.702405	  0.425540	 -2.239675
  0.683826	  0.418357	 -2.235135
  0.665622	  0.413176	 -2.230159
  0.648092	  0.404422	 -2.224317
  0.630612	  0.396083	 -2.218547
  0.615880	  0.386308	 -2.209718
  0.599637	  0.378005	 -2.200432
  0.584339	  0.373175	 -2.188469
  0.568004	  0.372113	 -2.176528
  0.551343	  0.371313	 -2.165443
  0.534690	  0.370547	 -2.154392
  0.518040	  0.369785	 -2.143338
  0.501388	  0.369024	 -2.132286
  0.484737	  0.368262	 -2.121233
  0.468086	  0.367499	 -2.110181
  0.451403	  0.366730	 -2.099189
  0.433092	  0.365468	 -2.091280
  0.413573	  0.363675	 -2.087351
  0.394043	  0.361988	 -2.083424
  0.374500	  0.360480	 -2.079394
  0.354963	  0.358934	 -2.075419
  0.336032	  0.357355	 -2.070642
  0.317520	  0.355891	 -2.061637
  0.299331	  0.350484	 -2.052102
  0.276173	  0.341524	 -2.052484
  0.256559	  0.338352	 -2.062526
  0.238206	  0.336219	 -2.073382
  0.221264	  0.330420	 -2.078397
  0.203710	  0.322350	 -2.083885
  0.185823	  0.317714	 -2.090829
  0.169038	  0.310994	 -2.097873
  0.152261	  0.301976	 -2.106248
  0.137229	  0.297132	 -2.116310
  0.120910	  0.294480	 -2.125881
  0.097839	  0.290975	 -2.139128
  0.085345	  0.288354	 -2.151172
  0.076901	  0.285765	 -2.164070
  0.061405	  0.273254	 -2.182493
  0.040308	  0.260244	 -2.192907
  0.029372	  0.254691	 -2.196938
  0.015511	  0.253591	 -2.204442
 -0.000884	  0.248908	 -2.222001
 -0.016431	  0.244674	 -2.235455
 -0.031061	  0.246472	 -2.249349
 -0.046093	  0.251817	 -2.265375
 -0.062944	  0.252635	 -2.279446
 -0.078167	  0.243120	 -2.291136
 -0.086700	  0.226280	 -2.302154
 -0.095949	  0.205169	 -2.310632
 -0.112195	  0.188017	 -2.317038
 -0.128669	  0.182055	 -2.325937
 -0.140642	  0.180081	 -2.341699
 -0.153402	  0.181505	 -2.359311
 -0.174780	  0.183404	 -2.373204
 -0.193147	  0.172502	 -2.384162
 -0.195610	  0.151380	 -2.393254
 -0.210442	  0.143384	 -2.404027
