 -1.622002	  1.605591	 -1.993010
 -1.605942	  1.589694	 -1.973277
 -1.563622	  1.575704	 -1.945985
 -1.521928	  1.568676	 -1.915733
 -1.481390	  1.560270	 -1.885607
 -1.441643	  1.550882	 -1.855771
 -1.402252	  1.541107	 -1.826084
 -1.362872	  1.531293	 -1.796505
 -1.323344	  1.521709	 -1.767032
 -1.283527	  1.512442	 -1.737793
 -1.243395	  1.503499	 -1.708895
 -1.202894	  1.494816	 -1.680703
 -1.162074	  1.487285	 -1.654534
 -1.117980	  1.484947	 -1.633844
 -1.068061	  1.494274	 -1.626280
 -1.006706	  1.519282	 -1.636785
 -0.925242	  1.557801	 -1.675308
 -0.823257	  1.596515	 -1.742215
 -0.709346	  1.624557	 -1.819505
 -0.594494	  1.651120	 -1.877560
 -0.492620	  1.684654	 -1.897436
 -0.415557	  1.715416	 -1.884818
 -0.366198	  1.732563	 -1.856623
 -0.340705	  1.733375	 -1.833747
 -0.336160	  1.725334	 -1.819639
 -0.345075	  1.698243	 -1.801079
 -0.375666	  1.639015	 -1.775388
 -0.398462	  1.547475	 -1.740401
 -0.392615	  1.442988	 -1.702634
 -0.365527	  1.343419	 -1.669881
 -0.324190	  1.253866	 -1.638206
 -0.278098	  1.179120	 -1.606305
 -0.232380	  1.120197	 -1.576259
 -0.192688	  1.082912	 -1.545148
 -0.158636	  1.058020	 -1.513598
 -0.122330	  1.032834	 -1.473973
 -0.073795	  1.007992	 -1.413438
 -0.028663	  0.977251	 -1.335478
  0.037583	  0.898255	 -1.277228
  0.127890	  0.836234	 -1.220094
  0.209752	  0.825605	 -1.154812
  0.256348	  0.808073	 -1.119427
  0.284326	  0.793683	 -1.093439
  0.305792	  0.781146	 -1.066627
  0.322668	  0.768411	 -1.041669
  0.337543	  0.753768	 -1.014623
  0.353233	  0.736266	 -0.978463
  0.371067	  0.708602	 -0.933164
  0.390420	  0.671837	 -0.877008
  0.409891	  0.625332	 -0.814019
  0.425116	  0.573420	 -0.750582
  0.436840	  0.522109	 -0.690680
  0.444879	  0.475153	 -0.635272
  0.451860	  0.432277	 -0.582892
  0.460336	  0.389516	 -0.525849
  0.471946	  0.344079	 -0.458928
  0.487029	  0.302099	 -0.381598
  0.503509	  0.274240	 -0.296745
  0.516516	  0.267165	 -0.210244
  0.526328	  0.286070	 -0.135355
  0.542037	  0.322266	 -0.085082
  0.566059	  0.362810	 -0.056901
  0.600286	  0.407280	 -0.042612
  0.650105	  0.461141	 -0.040561
  0.712876	  0.523803	 -0.050311
  0.776356	  0.590453	 -0.077765
  0.840419	  0.664208	 -0.127464
  0.926043	  0.767022	 -0.170629
  1.016233	  0.897006	 -0.146705
  1.169961	  0.958283	 -0.145359
  1.332811	  0.944073	 -0.182763
  1.463540	  0.966294	 -0.293489
  1.574444	  1.001324	 -0.345713
  1.653282	  1.035521	 -0.369013
  1.710394	  1.069620	 -0.359981
  1.750733	  1.098686	 -0.328153
  1.780119	  1.123618	 -0.283285
  1.802037	  1.142726	 -0.231838
  1.818692	  1.153830	 -0.173840
  1.830576	  1.157911	 -0.103648
  1.837102	  1.151778	 -0.022246
  1.837897	  1.133858	  0.061926
  1.837544	  1.105932	  0.139928
  1.839843	  1.071306	  0.207577
  1.845732	  1.032911	  0.262441
  1.856309	  0.991851	  0.305868
  1.872704	  0.950094	  0.339119
  1.898002	  0.906456	  0.365917
  1.933634	  0.861299	  0.389940
  1.978733	  0.816172	  0.414158
  2.028451	  0.776038	  0.439023
  2.077561	  0.744160	  0.463346
  2.121774	  0.720203	  0.486203
  2.161972	  0.701424	  0.508374
  2.201152	  0.685322	  0.531599
  2.240409	  0.670779	  0.556729
  2.279974	  0.657159	  0.584085
  2.319056	  0.643805	  0.612956
  2.357743	  0.630056	  0.642413
  2.396464	  0.615883	  0.672185
  2.434580	  0.602282	  0.701145
  2.473206	  0.589037	  0.729408
  2.512991	  0.576026	  0.756248
  2.554526	  0.563364	  0.782099
  2.597308	  0.551800	  0.806476
  2.641376	  0.541841	  0.828877
  2.686622	  0.534447	  0.847261
  2.730582	  0.530210	  0.868672
  2.772841	  0.530891	  0.893283
  2.809401	  0.512195	  0.919196
  2.837495	  0.517317	  0.928388
