 -1.635447	  1.506118	  1.084923
 -1.648413	  1.516035	  1.090395
 -1.633351	  1.504514	  1.084038
 -1.617919	  1.493536	  1.077608
 -1.601876	  1.483546	  1.071065
 -1.585833	  1.473555	  1.064523
 -1.569950	  1.463765	  1.057321
 -1.554082	  1.453992	  1.050060
 -1.538514	  1.444009	  1.042446
 -1.523217	  1.433845	  1.034528
 -1.508007	  1.423601	  1.026546
 -1.493307	  1.412903	  1.018210
 -1.478608	  1.402206	  1.009875
 -1.464202	  1.391015	  1.001674
 -1.449934	  1.379605	  0.993536
 -1.435745	  1.368077	  0.985425
 -1.421909	  1.356048	  0.977434
 -1.408072	  1.344020	  0.969443
 -1.394670	  1.331557	  0.961377
 -1.381354	  1.319012	  0.953296
 -1.368638	  1.306130	  0.944790
 -1.356272	  1.293066	  0.936048
 -1.344314	  1.279788	  0.927065
 -1.333490	  1.265978	  0.917467
 -1.322665	  1.252167	  0.907869
 -1.312811	  1.237985	  0.897783
 -1.304548	  1.223311	  0.886994
 -1.296285	  1.208637	  0.876205
 -1.288121	  1.193946	  0.865363
 -1.284107	  1.178992	  0.852704
 -1.280092	  1.164038	  0.840045
 -1.276078	  1.149084	  0.827386
 -1.272083	  1.134281	  0.814544
 -1.268124	  1.119740	  0.801396
 -1.264165	  1.105199	  0.788247
 -1.260205	  1.090657	  0.775099
 -1.255881	  1.076284	  0.761881
 -1.251367	  1.062000	  0.748630
 -1.246853	  1.047716	  0.735379
 -1.242082	  1.033248	  0.722420
 -1.237199	  1.018702	  0.709592
 -1.231752	  1.004040	  0.697128
 -1.224090	  0.989082	  0.686286
 -1.216429	  0.974124	  0.675444
 -1.207197	  0.959315	  0.665672
 -1.196871	  0.944701	  0.656739
 -1.186545	  0.930088	  0.647805
 -1.175050	  0.915900	  0.639645
 -1.162919	  0.901989	  0.631944
 -1.150787	  0.888078	  0.624243
 -1.137749	  0.874649	  0.617195
 -1.124234	  0.861506	  0.610514
 -1.110720	  0.848364	  0.603834
 -1.096193	  0.836026	  0.597772
 -1.081494	  0.823838	  0.591823
 -1.066474	  0.811937	  0.586100
 -1.050636	  0.800839	  0.581000
 -1.034799	  0.789741	  0.575900
 -1.018340	  0.779270	  0.571487
 -1.001512	  0.769216	  0.567520
 -0.984684	  0.759162	  0.563553
 -0.967481	  0.749435	  0.560483
 -0.949915	  0.740099	  0.558415
 -0.932349	  0.730762	  0.556346
 -0.914765	  0.721442	  0.554367
 -0.896839	  0.712575	  0.554578
 -0.878914	  0.703707	  0.554789
 -0.860988	  0.694840	  0.555000
 -0.842968	  0.686431	  0.557136
 -0.824963	  0.678265	  0.560162
 -0.806959	  0.670099	  0.563188
 -0.789069	  0.662606	  0.568068
 -0.771368	  0.655641	  0.574244
 -0.753667	  0.648675	  0.580421
 -0.736149	  0.642255	  0.587626
 -0.719128	  0.636898	  0.596659
 -0.702107	  0.631541	  0.605692
 -0.685086	  0.626184	  0.614724
 -0.668166	  0.621727	  0.624411
 -0.651296	  0.617602	  0.634330
 -0.634426	  0.613477	  0.644249
 -0.617505	  0.609397	  0.654101
 -0.599488	  0.606440	  0.662263
 -0.581471	  0.603484	  0.670426
 -0.563453	  0.600527	  0.678589
 -0.544398	  0.597188	  0.683663
 -0.525232	  0.593801	  0.688268
 -0.505968	  0.589024	  0.690729
 -0.486922	  0.582925	  0.690990
 -0.468803	  0.574917	  0.688241
 -0.451157	  0.566299	  0.684452
 -0.435363	  0.556008	  0.677771
 -0.419588	  0.545703	  0.671064
 -0.404978	  0.534187	  0.663723
 -0.390432	  0.522609	  0.656350
 -0.375948	  0.510404	  0.649924
 -0.361548	  0.497734	  0.644260
 -0.347147	  0.485063	  0.638597
 -0.332387	  0.472438	  0.633829
 -0.317591	  0.459818	  0.629154
 -0.302654	  0.447450	  0.624266
 -0.287322	  0.435853	  0.618747
 -0.271990	  0.424257	  0.613228
 -0.256394	  0.413231	  0.607298
 -0.240678	  0.402484	  0.601173
 -0.224930	  0.391836	  0.594957
 -0.208974	  0.381928	  0.588085
 -0.193018	  0.372020	  0.581212
 -0.176946	  0.362550	  0.573999
 -0.160807	  0.353370	  0.566566
 -0.144648	  0.344249	  0.559103
 -0.128297	  0.335761	  0.551319
 -0.111946	  0.327274	  0.543534
 -0.095444	  0.319282	  0.535545
 -0.078837	  0.311671	  0.527405
 -0.062201	  0.304163	  0.519226
 -0.045377	  0.297424	  0.510768
 -0.028553	  0.290686	  0.502310
 -0.011686	  0.284354	  0.493625
  0.005194	  0.278180	  0.484853
  0.022030	  0.272069	  0.475953
  0.038787	  0.266072	  0.466830
  0.055544	  0.260074	  0.457708
  0.072303	  0.254127	  0.448554
  0.089062	  0.248183	  0.439399
  0.105751	  0.241858	  0.430375
  0.122329	  0.234984	  0.421547
  0.138907	  0.228110	  0.412719
  0.155143	  0.219743	  0.404572
  0.171273	  0.211003	  0.396608
  0.187403	  0.202180	  0.388734
  0.203472	  0.192308	  0.382077
  0.219542	  0.182437	  0.375420
  0.235605	  0.172323	  0.369120
  0.251637	  0.161790	  0.363460
  0.267669	  0.151258	  0.357801
  0.283568	  0.140362	  0.352461
  0.299419	  0.129345	  0.347230
  0.315214	  0.118242	  0.342008
  0.330803	  0.106835	  0.336825
  0.346392	  0.095429	  0.331642
  0.361799	  0.083825	  0.326351
  0.377148	  0.072161	  0.321028
  0.392470	  0.060379	  0.315886
  0.407673	  0.048179	  0.311412
  0.422876	  0.035978	  0.306938
  0.438116	  0.023602	  0.303120
  0.453374	  0.011079	  0.299901
  0.468632	 -0.001444	  0.296681
  0.484049	 -0.013992	  0.294477
  0.499500	 -0.026542	  0.292538
  0.514964	 -0.039089	  0.290682
  0.530555	 -0.051585	  0.289808
  0.546146	 -0.064081	  0.288934
  0.561842	 -0.076462	  0.288325
  0.577681	 -0.088671	  0.288098
  0.593520	 -0.100881	  0.287870
  0.609450	 -0.112943	  0.287012
  0.625393	 -0.124980	  0.286051
  0.641276	 -0.136951	  0.283944
  0.657061	 -0.148831	  0.280832
  0.672712	 -0.160556	  0.276640
  0.688048	 -0.171962	  0.270748
  0.703315	 -0.183382	  0.264705
  0.718132	 -0.194870	  0.257742
  0.732949	 -0.206358	  0.250779
  0.747430	 -0.218129	  0.243586
  0.761781	 -0.230005	  0.236307
  0.776057	 -0.241929	  0.228956
  0.790137	 -0.253970	  0.221422
  0.804216	 -0.266012	  0.213888
  0.818276	 -0.278168	  0.206502
  0.832331	 -0.290351	  0.199151
  0.846497	 -0.302478	  0.191921
  0.860912	 -0.314474	  0.184971
  0.875326	 -0.326470	  0.178021
  0.890097	 -0.338234	  0.171429
  0.905001	 -0.349906	  0.164976
  0.919947	 -0.361537	  0.158549
  0.935140	 -0.372930	  0.152271
  0.950332	 -0.384322	  0.145994
  0.965590	 -0.395270	  0.139115
  0.980873	 -0.405999	  0.131950
  0.996177	 -0.416378	  0.124330
  1.011487	 -0.426061	  0.115853
  1.026811	 -0.435573	  0.107212
  1.042166	 -0.443539	  0.097174
  1.057521	 -0.451505	  0.087135
  1.072891	 -0.457107	  0.075630
  1.088213	 -0.462028	  0.063754
  1.103534	 -0.466950	  0.051879
  1.118212	 -0.466575	  0.038299
  1.132814	 -0.465877	  0.024649
  1.147415	 -0.465179	  0.011000
  1.161671	 -0.462592	 -0.002787
  1.174149	 -0.454620	 -0.016232
  1.186626	 -0.446649	 -0.029677
  1.199104	 -0.438677	 -0.043122
  1.211581	 -0.430706	 -0.056567
  1.226303	 -0.421390	 -0.066390
  1.241277	 -0.411927	 -0.075676
  1.256250	 -0.402464	 -0.084963
  1.271677	 -0.393311	 -0.093809
  1.290379	 -0.387608	 -0.098017
  1.309081	 -0.381905	 -0.102225
  1.329020	 -0.380444	 -0.102747
  1.348928	 -0.381478	 -0.101129
  1.367569	 -0.386970	 -0.096399
  1.385207	 -0.394268	 -0.090430
  1.400875	 -0.404606	 -0.083529
  1.415691	 -0.415961	 -0.076349
  1.430161	 -0.428188	 -0.069936
  1.444079	 -0.441522	 -0.064596
  1.457996	 -0.454856	 -0.059257
  1.472121	 -0.468223	 -0.054588
  1.486852	 -0.481574	 -0.052410
  1.501584	 -0.494924	 -0.050232
  1.516316	 -0.508274	 -0.048054
  1.531134	 -0.521559	 -0.046069
  1.546941	 -0.533795	 -0.046716
  1.562748	 -0.546031	 -0.047363
  1.578555	 -0.558267	 -0.048011
  1.594362	 -0.570503	 -0.048658
  1.609280	 -0.583771	 -0.049848
  1.624034	 -0.597213	 -0.051133
  1.638787	 -0.610655	 -0.052419
  1.652411	 -0.625233	 -0.053784
  1.665009	 -0.640701	 -0.055210
  1.677607	 -0.656169	 -0.056636
  1.688467	 -0.672903	 -0.058063
  1.699323	 -0.689639	 -0.059491
  1.709405	 -0.706868	 -0.060722
  1.718788	 -0.724499	 -0.061777
  1.728172	 -0.742129	 -0.062833
  1.738087	 -0.759417	 -0.064509
  1.748931	 -0.775986	 -0.067321
  1.759774	 -0.792554	 -0.070132
  1.770618	 -0.809122	 -0.072944
  1.782105	 -0.825044	 -0.076759
  1.793839	 -0.840681	 -0.080979
  1.805573	 -0.856318	 -0.085198
  1.817365	 -0.871855	 -0.089616
  1.829467	 -0.886776	 -0.095178
  1.841568	 -0.901696	 -0.100740
  1.853801	 -0.916419	 -0.106535
  1.866295	 -0.930722	 -0.112807
  1.878804	 -0.945009	 -0.119086
  1.891886	 -0.958665	 -0.125594
  1.904968	 -0.972321	 -0.132103
  1.918604	 -0.985214	 -0.139020
  1.932345	 -0.997951	 -0.146016
  1.946464	 -1.009946	 -0.153551
  1.960786	 -1.021498	 -0.161389
  1.975297	 -1.032681	 -0.169412
  1.990113	 -1.043224	 -0.177738
  2.004929	 -1.053767	 -0.186065
  2.019946	 -1.063901	 -0.194539
  2.034971	 -1.074017	 -0.203019
  2.049963	 -1.084185	 -0.211495
  2.064915	 -1.094414	 -0.219968
  2.079868	 -1.104643	 -0.228441
  2.094768	 -1.115120	 -0.236701
  2.109664	 -1.125611	 -0.244949
  2.124483	 -1.136343	 -0.253025
  2.139175	 -1.147444	 -0.260831
  2.153866	 -1.158544	 -0.268638
  2.168558	 -1.169644	 -0.276444
  2.184693	 -1.182072	 -0.284948
  2.199221	 -1.193542	 -0.292524
