 0.0 0.0 0.0 0
 0.6441355073324525 -0.004800824289540068 -0.7648008893036832 1000
 0.07224438100122876 -0.12288711768016206 -0.9901765023075487 1000
 0.7046029234401556 0.7095479624804817 -0.018094452724048773 1000
 -0.7721141992379863 0.624718475384078 -0.12120845617726539 1000
 0.36478213815635274 0.43777501631354904 -0.8216367973586329 1000
 0.47842467040382153 -0.04051217791590957 0.8769587209153599 1000
 0.20252059777209538 -0.6751404826867612 0.7099441781686219 1000
 0.4598527490645431 0.8383297081886496 -0.2930882965014395 1000
 0.0 0.0 0.0 0
 -0.3572830784626376 -0.06586238527558058 0.9319307635495631 1000
 0.5410129712977255 -0.8413698562078926 -0.0019313084466691306 1000
 0.05781533121021426 -0.9234922159220731 0.3797203110295682 1000
 0.4145833644808606 -0.27620212109334774 -0.8672272033321287 1000
 -0.9970082811203264 0.04113972146676351 0.06154681709990627 1000
 -0.10545374284465234 0.7402839462228883 0.6635707852857307 1000
 -0.8339426209176277 -0.13781929487041158 0.5334337325089783 1000
 0.9088335060273233 -0.41122886057567587 0.06538717421417137 1000
 0.0 0.0 0.0 0
 0.8553958100028081 0.5177843185198384 -0.0025313483730942236 1000
 0.22493505492205834 -0.4831814126401488 0.8460886144762148 1000
 -0.6208091226277285 0.28391870723350104 0.7308879537555993 1000
 -0.5898523202190126 -0.4936646603329592 -0.6380089681741091 1000
 -0.2319865478434598 0.07977180775425483 -0.9689420520894385 1000
 -0.4983807412062124 -0.25220603596537156 0.8295467149096426 1000
 -0.2073849868772073 -0.9354936444577818 0.2843591187161711 1000
 -0.9233133007214669 0.200091810833158 0.32791739195769615 1000
 0.0 0.0 0.0 0
 -0.21051096814556594 0.873973143191004 0.4386548498207366 1000
 -0.4590699633551033 -0.1993074848112455 -0.8654728737767342 1000
 0.12011049460264464 0.44051633001373564 -0.8894621026651655 1000
 0.858925194159092 0.43470150862476137 0.272833482619202 1000
 -0.6996453979714633 0.7107754575759075 0.06820239002492104 1000
 -0.5522907454159389 -0.82988815131414 -0.07279140633553627 1000
 -0.8951807053719559 0.14215759360870278 -0.4222460459366672 1000
 -0.453629049259606 0.5060745979700036 0.7336417292911607 1000
 0.0 0.0 0.0 0
 0.0876501276372253 -0.984104399328633 0.15514504938027537 1000
 0.8035586056342128 -0.43357853210990877 -0.4067004103816666 1000
 -0.22090820261296773 -0.3987304465537179 -0.8897722163617947 1000
 0.7749979125196175 -0.03676754814982969 -0.631162723070117 1000
 -0.9699720794982468 0.24288372810391198 0.02976003387416266 1000
 -0.3274472890719972 0.2643678539187087 -0.9068329011972469 1000
 -0.30109205338705725 -0.6463109330283948 0.700991264735254 1000
 0.7166144568943884 -0.4055215394166092 0.5666189206505056 1000
 0.0 0.0 0.0 0
 0.3842218560187947 0.5914211980391206 0.7088663709525538 1000
 0.5320219902848611 0.8366869058442519 -0.1265172851515027 1000
 0.2982020795495523 0.26968034653659595 -0.9152972361174394 1000
 0.25464097659644025 -0.7799528061486841 -0.5722277459358329 1000
 -0.39910759688374575 0.7295796933819018 -0.5554517054744287 1000
 0.9198862659776038 0.029996509355132206 0.3905348474749575 1000
 -0.22779490540149613 0.37444608970410836 0.8985352563914372 1000
 -0.05602862699685521 0.566965233423826 -0.8220700803736343 1000
 0.0 0.0 0.0 0
 0.9300660130918608 0.2042664713780099 -0.3059451257369321 1000
 0.010203775171001017 -0.9334545272934336 -0.35785266304395685 1000
 0.6630395435651015 0.5903149030875183 0.4586675036033787 1000
 -0.5823383581942339 -0.6830209901167208 0.43994359142464873 1000
 0.34972997469141487 0.056964834428552935 0.9350956915957156 1000
 -0.7390319563498404 0.3454622774069508 0.5791818215228532 1000
