 -1.280345	 -2.086605	  0.304961
 -1.280921	 -2.088441	  0.304325
 -1.281497	 -2.090277	  0.303689
 -1.282642	 -2.074936	  0.311766
 -1.280018	 -2.056612	  0.318565
 -1.265857	 -2.027312	  0.321523
 -1.257501	 -2.012671	  0.326394
 -1.251566	 -2.002490	  0.329280
 -1.240311	 -1.981505	  0.336756
 -1.227534	 -1.963349	  0.348483
 -1.219099	 -1.953528	  0.357195
 -1.213321	 -1.947641	  0.368247
 -1.203205	 -1.925237	  0.381796
 -1.184581	 -1.905249	  0.392059
 -1.175344	 -1.893764	  0.395712
 -1.168469	 -1.885900	  0.398622
 -1.160709	 -1.870068	  0.413490
 -1.153023	 -1.850648	  0.427222
 -1.144664	 -1.834264	  0.433594
 -1.135341	 -1.818061	  0.440305
 -1.127464	 -1.802042	  0.449454
 -1.119306	 -1.785862	  0.457168
 -1.112091	 -1.768963	  0.463799
 -1.107552	 -1.750350	  0.469416
 -1.103684	 -1.732113	  0.476507
 -1.097973	 -1.715089	  0.481897
 -1.088216	 -1.698613	  0.486697
 -1.078147	 -1.680965	  0.494945
 -1.074100	 -1.665517	  0.501025
 -1.064975	 -1.641744	  0.509668
 -1.053185	 -1.623208	  0.519301
 -1.048047	 -1.612385	  0.526254
 -1.042008	 -1.595805	  0.535409
 -1.035215	 -1.577675	  0.543013
 -1.028634	 -1.559946	  0.548347
 -1.019123	 -1.543939	  0.552442
 -1.007021	 -1.524253	  0.556334
 -0.995077	 -1.504172	  0.561292
 -0.987853	 -1.494009	  0.564555
 -0.978648	 -1.483046	  0.568098
 -0.964110	 -1.461894	  0.575832
 -0.955492	 -1.438210	  0.583244
 -0.952371	 -1.426918	  0.584401
 -0.947305	 -1.402977	  0.587017
 -0.937566	 -1.383355	  0.590118
 -0.928542	 -1.371238	  0.592806
 -0.913858	 -1.358919	  0.599363
 -0.902040	 -1.342625	  0.603150
 -0.888005	 -1.317712	  0.598932
 -0.880700	 -1.308101	  0.597486
 -0.872602	 -1.290580	  0.598077
 -0.849062	 -1.268321	  0.605990
 -0.840966	 -1.258233	  0.609435
 -0.835236	 -1.250721	  0.612502
 -0.818717	 -1.237305	  0.619320
 -0.796773	 -1.222540	  0.623913
 -0.784300	 -1.214479	  0.624209
 -0.760626	 -1.202638	  0.620418
 -0.738096	 -1.194356	  0.620204
 -0.730403	 -1.192146	  0.620358
 -0.701436	 -1.184758	  0.622001
 -0.688140	 -1.180103	  0.623920
 -0.663223	 -1.170761	  0.626550
 -0.648684	 -1.166273	  0.626349
 -0.633400	 -1.161609	  0.626050
 -0.608681	 -1.153238	  0.622101
 -0.590489	 -1.146106	  0.620114
 -0.576670	 -1.139933	  0.616451
 -0.549146	 -1.130515	  0.612294
 -0.534308	 -1.125192	  0.611131
 -0.521241	 -1.118004	  0.611435
 -0.501914	 -1.107312	  0.616259
 -0.482333	 -1.096373	  0.622042
 -0.463815	 -1.088381	  0.625537
 -0.450265	 -1.079013	  0.629959
 -0.432521	 -1.069706	  0.633370
 -0.420439	 -1.060325	  0.637997
 -0.404322	 -1.044385	  0.641401
 -0.396506	 -1.034562	  0.644461
 -0.383535	 -1.019268	  0.653594
 -0.375549	 -1.003073	  0.663102
 -0.371815	 -0.987139	  0.670221
 -0.369221	 -0.970084	  0.675222
 -0.367299	 -0.952238	  0.681763
 -0.365197	 -0.929187	  0.691505
 -0.363269	 -0.918469	  0.694184
 -0.360739	 -0.899429	  0.700072
 -0.359580	 -0.882168	  0.706666
 -0.356707	 -0.864822	  0.714234
 -0.356046	 -0.845441	  0.723059
 -0.355480	 -0.828950	  0.730460
 -0.356104	 -0.809121	  0.739047
 -0.357326	 -0.785894	  0.748401
 -0.365957	 -0.765608	  0.752980
 -0.382880	 -0.750339	  0.756590
 -0.398846	 -0.743003	  0.759024
 -0.417852	 -0.730000	  0.762120
 -0.427786	 -0.717061	  0.762038
 -0.440960	 -0.701003	  0.758879
 -0.456797	 -0.686557	  0.762466
 -0.471596	 -0.674877	  0.769505
 -0.486817	 -0.663387	  0.775866
 -0.500598	 -0.651440	  0.783380
 -0.514938	 -0.642160	  0.788255
 -0.537304	 -0.629869	  0.791724
 -0.552477	 -0.613983	  0.800366
 -0.563245	 -0.595706	  0.815609
 -0.564323	 -0.585677	  0.825946
 -0.570818	 -0.569944	  0.836843
 -0.578775	 -0.548506	  0.851448
 -0.579043	 -0.533136	  0.862064
 -0.576397	 -0.513009	  0.871678
 -0.574331	 -0.492495	  0.888428
 -0.565365	 -0.475686	  0.902162
 -0.557927	 -0.467711	  0.908832
 -0.545913	 -0.449514	  0.914286
 -0.531664	 -0.430436	  0.924196
 -0.518628	 -0.417307	  0.935051
 -0.509018	 -0.408544	  0.940255
 -0.494268	 -0.392377	  0.943081
 -0.480557	 -0.375249	  0.950285
 -0.466530	 -0.363238	  0.957784
 -0.450344	 -0.353461	  0.964674
 -0.434942	 -0.343956	  0.969516
 -0.418930	 -0.329146	  0.974920
 -0.406053	 -0.313338	  0.979727
 -0.395629	 -0.296955	  0.985732
 -0.387056	 -0.279841	  0.993128
 -0.379874	 -0.262039	  1.000481
 -0.374389	 -0.244261	  1.008471
 -0.368644	 -0.225937	  1.014934
 -0.363614	 -0.206750	  1.019315
 -0.359132	 -0.187676	  1.022646
 -0.352801	 -0.169084	  1.026311
 -0.346090	 -0.150946	  1.031417
 -0.339282	 -0.133206	  1.037359
 -0.332583	 -0.116227	  1.043035
 -0.329281	 -0.097003	  1.047969
 -0.324761	 -0.077451	  1.054646
 -0.317727	 -0.058314	  1.060021
 -0.308717	 -0.040751	  1.064027
 -0.300591	 -0.023300	  1.067372
 -0.292419	 -0.001756	  1.071588
 -0.286916	  0.012124	  1.076808
 -0.280368	  0.031194	  1.083750
 -0.275123	  0.049390	  1.091436
 -0.271210	  0.063159	  1.095793
 -0.266297	  0.081331	  1.101785
 -0.258034	  0.110440	  1.112452
 -0.254294	  0.123197	  1.116738
 -0.252363	  0.137570	  1.123200
 -0.249345	  0.158999	  1.133973
 -0.244822	  0.179564	  1.143763
 -0.243548	  0.191192	  1.148443
 -0.241528	  0.213005	  1.155309
 -0.237155	  0.233431	  1.162368
 -0.233119	  0.248768	  1.172212
 -0.227622	  0.265291	  1.187354
 -0.222935	  0.278444	  1.200847
 -0.217973	  0.295528	  1.211161
 -0.218008	  0.309726	  1.217056
 -0.214367	  0.331253	  1.224699
 -0.212322	  0.350077	  1.234950
 -0.211216	  0.367909	  1.242301
 -0.209611	  0.388451	  1.249545
 -0.206652	  0.408469	  1.259881
 -0.201135	  0.427245	  1.266974
 -0.196504	  0.441484	  1.269355
 -0.186813	  0.458895	  1.274525
 -0.179213	  0.476814	  1.280247
 -0.175402	  0.497769	  1.290515
 -0.169360	  0.514486	  1.301896
 -0.157916	  0.529506	  1.311202
 -0.143437	  0.543713	  1.316191
 -0.136554	  0.560289	  1.319406
 -0.133032	  0.578049	  1.324451
 -0.131261	  0.595720	  1.327839
 -0.109357	  0.626306	  1.336041
 -0.083499	  0.638625	  1.342879
 -0.080005	  0.648356	  1.343808
 -0.068647	  0.648741	  1.346921
 -0.048314	  0.664816	  1.360521
 -0.032438	  0.677425	  1.370795
 -0.019310	  0.688873	  1.375473
 -0.001996	  0.702553	  1.378343
  0.010729	  0.713064	  1.380091
  0.023423	  0.731652	  1.385713
  0.032290	  0.747948	  1.390290
  0.041395	  0.765577	  1.393115
  0.056192	  0.789679	  1.395524
  0.063022	  0.798758	  1.396509
  0.076207	  0.815440	  1.398269
  0.086734	  0.834867	  1.403301
  0.096445	  0.853113	  1.411385
  0.107714	  0.874652	  1.424365
  0.108865	  0.881737	  1.428675
  0.114460	  0.897282	  1.436046
  0.122617	  0.920647	  1.443599
  0.133308	  0.937187	  1.450752
  0.145110	  0.952440	  1.459924
  0.153332	  0.966260	  1.469463
  0.162035	  0.981833	  1.479628
  0.169881	  0.998615	  1.487445
  0.175088	  1.012101	  1.491762
  0.182239	  1.038280	  1.500408
  0.189169	  1.056126	  1.511600
  0.193644	  1.066633	  1.519936
  0.202858	  1.081476	  1.533109
  0.210387	  1.097248	  1.543543
  0.215064	  1.112632	  1.551227
  0.221561	  1.128213	  1.558075
  0.231490	  1.147102	  1.566810
  0.244171	  1.169780	  1.576530
  0.251249	  1.184930	  1.582303
  0.252844	  1.192802	  1.585865
  0.261456	  1.216921	  1.595746
  0.268020	  1.235315	  1.601998
  0.273060	  1.248969	  1.604921
  0.280700	  1.272124	  1.607637
  0.283272	  1.289041	  1.610170
  0.285514	  1.312195	  1.613624
  0.288045	  1.334000	  1.617971
  0.295564	  1.353752	  1.626413
  0.303670	  1.365429	  1.634210
  0.318529	  1.379825	  1.646922
  0.331877	  1.392864	  1.656937
  0.347296	  1.404166	  1.668349
  0.359502	  1.417203	  1.679110
  0.355039	  1.436528	  1.690505
  0.345079	  1.455829	  1.700950
  0.345386	  1.473624	  1.713041
  0.349753	  1.486787	  1.725625
  0.353059	  1.507761	  1.737518
  0.362133	  1.531197	  1.746142
  0.371473	  1.544711	  1.749393
  0.380879	  1.558402	  1.752787
  0.390025	  1.578582	  1.759190
  0.396869	  1.593779	  1.763644
  0.407830	  1.612927	  1.770135
  0.414336	  1.634498	  1.775999
  0.416339	  1.649665	  1.778924
  0.417376	  1.668296	  1.785424
  0.424439	  1.686472	  1.789866
  0.431502	  1.704648	  1.794308
