  2.359492	  0.999867	  0.039133
  2.361173	  1.005107	  0.039252
  2.355067	  0.986067	  0.038821
  2.348961	  0.967027	  0.038390
  2.341947	  0.948302	  0.037953
  2.333261	  0.930292	  0.037507
  2.324574	  0.912282	  0.037061
  2.315826	  0.894303	  0.036617
  2.304277	  0.877979	  0.036222
  2.295758	  0.859923	  0.037411
  2.305490	  0.844185	  0.045000
  2.315223	  0.828447	  0.052590
  2.324683	  0.813716	  0.062260
  2.334131	  0.799024	  0.072000
  2.343579	  0.784332	  0.081740
  2.353028	  0.769639	  0.091480
  2.362476	  0.754947	  0.101220
  2.370166	  0.738996	  0.110516
  2.377422	  0.722772	  0.119688
  2.384677	  0.706547	  0.128861
  2.391932	  0.690323	  0.138033
  2.399187	  0.674099	  0.147206
  2.405669	  0.657281	  0.155876
  2.411329	  0.639904	  0.163999
  2.416988	  0.622526	  0.172122
  2.422648	  0.605148	  0.180245
  2.427975	  0.587544	  0.188101
  2.432295	  0.569330	  0.195142
  2.436615	  0.551116	  0.202183
  2.440936	  0.532901	  0.209224
  2.443658	  0.514059	  0.215352
  2.445766	  0.495024	  0.221117
  2.447874	  0.475990	  0.226883
  2.449412	  0.456854	  0.232490
  2.447282	  0.437478	  0.236968
  2.445152	  0.418103	  0.241446
  2.443022	  0.398727	  0.245924
  2.439040	  0.379472	  0.249581
  2.433139	  0.360560	  0.252326
  2.427239	  0.341648	  0.255070
  2.420940	  0.322804	  0.257354
  2.412997	  0.304451	  0.257632
  2.405054	  0.286098	  0.257909
  2.396734	  0.267916	  0.257501
  2.387336	  0.250442	  0.254983
  2.377938	  0.232968	  0.252466
  2.367917	  0.216260	  0.247944
  2.357548	  0.200185	  0.242105
  2.346844	  0.184731	  0.235281
  2.335587	  0.170685	  0.226563
  2.324331	  0.156640	  0.217844
  2.312103	  0.144124	  0.208157
  2.299416	  0.132466	  0.198002
  2.286729	  0.120807	  0.187847
  2.274042	  0.109149	  0.177692
  2.259426	  0.099580	  0.167955
  2.244799	  0.090024	  0.158222
  2.230173	  0.080467	  0.148488
  2.215547	  0.070911	  0.138755
  2.199506	  0.063464	  0.129413
  2.183429	  0.056081	  0.120086
  2.167351	  0.048698	  0.110758
  2.151273	  0.041316	  0.101431
  2.134553	  0.034938	  0.092501
  2.117275	  0.029554	  0.083986
  2.099997	  0.024170	  0.075472
  2.082720	  0.018786	  0.066958
  2.065442	  0.013402	  0.058443
  2.048164	  0.008018	  0.049929
  2.030115	  0.003739	  0.042453
  2.011241	  0.000978	  0.036440
  1.992367	 -0.001784	  0.030428
  1.973493	 -0.004546	  0.024416
  1.954619	 -0.007307	  0.018404
  1.935745	 -0.010069	  0.012392
  1.916871	 -0.012831	  0.006380
  1.897977	 -0.015536	  0.000404
  1.879019	 -0.018050	 -0.005450
  1.860061	 -0.020564	 -0.011304
  1.841103	 -0.023078	 -0.017158
  1.822145	 -0.025593	 -0.023012
  1.803186	 -0.028107	 -0.028866
  1.784679	 -0.031785	 -0.035494
  1.767477	 -0.037895	 -0.043665
  1.750275	 -0.044005	 -0.051835
  1.733073	 -0.050115	 -0.060006
  1.716590	 -0.057582	 -0.068524
  1.701134	 -0.066657	 -0.077399
  1.685678	 -0.075731	 -0.086274
  1.670451	 -0.085129	 -0.095208
  1.656546	 -0.096186	 -0.104396
  1.642641	 -0.107242	 -0.113584
  1.628963	 -0.118466	 -0.122906
  1.616502	 -0.130516	 -0.132882
  1.604041	 -0.142566	 -0.142858
  1.592142	 -0.154429	 -0.153707
  1.581034	 -0.165997	 -0.165657
  1.569925	 -0.177564	 -0.177606
  1.558817	 -0.189132	 -0.189556
  1.549390	 -0.201268	 -0.202357
  1.540224	 -0.213479	 -0.215274
  1.531057	 -0.225689	 -0.228192
  1.521890	 -0.237900	 -0.241110
  1.513814	 -0.251913	 -0.252875
  1.506200	 -0.266581	 -0.264139
  1.512821	 -0.285447	 -0.264633
  1.523571	 -0.301874	 -0.260813
  1.534322	 -0.318300	 -0.256993
  1.545072	 -0.334727	 -0.253173
  1.555822	 -0.351154	 -0.249353
  1.566572	 -0.367581	 -0.245532
  1.577322	 -0.384008	 -0.241712
  1.588072	 -0.400435	 -0.237892
  1.598822	 -0.416861	 -0.234072
  1.609573	 -0.433288	 -0.230252
  1.620323	 -0.449715	 -0.226431
  1.631073	 -0.466142	 -0.222611
  1.641823	 -0.482569	 -0.218791
  1.652573	 -0.498996	 -0.214971
  1.663323	 -0.515422	 -0.211151
  1.674073	 -0.531849	 -0.207331
  1.684693	 -0.548486	 -0.204097
  1.694030	 -0.566136	 -0.205234
  1.703368	 -0.583785	 -0.206371
  1.712706	 -0.601435	 -0.207508
  1.722044	 -0.619085	 -0.208645
  1.729953	 -0.635213	 -0.217439
  1.737761	 -0.651203	 -0.226569
  1.745569	 -0.667193	 -0.235699
  1.754999	 -0.679064	 -0.248743
  1.765111	 -0.687149	 -0.263987
  1.775222	 -0.695235	 -0.279231
  1.784241	 -0.702772	 -0.295413
  1.791566	 -0.709426	 -0.312793
  1.798891	 -0.716081	 -0.330172
  1.806216	 -0.722736	 -0.347552
  1.813541	 -0.729390	 -0.364932
  1.820866	 -0.736045	 -0.382312
  1.827782	 -0.744093	 -0.399265
  1.833227	 -0.756046	 -0.414347
  1.838671	 -0.768000	 -0.429430
  1.844116	 -0.779953	 -0.444512
  1.849561	 -0.791906	 -0.459594
  1.855005	 -0.803860	 -0.474676
  1.860450	 -0.815813	 -0.489758
  1.865895	 -0.827766	 -0.504841
  1.871339	 -0.839720	 -0.519923
  1.876784	 -0.851673	 -0.535005
  1.882229	 -0.863626	 -0.550087
  1.886366	 -0.882002	 -0.556813
  1.890320	 -0.900717	 -0.562653
  1.894275	 -0.919431	 -0.568494
  1.898229	 -0.938146	 -0.574335
  1.902184	 -0.956861	 -0.580175
  1.906138	 -0.975576	 -0.586016
  1.910092	 -0.994291	 -0.591857
  1.914047	 -1.013006	 -0.597697
  1.918001	 -1.031721	 -0.603538
  1.921956	 -1.050436	 -0.609378
  1.925378	 -1.069751	 -0.613282
  1.926797	 -1.089515	 -0.610567
  1.928217	 -1.109279	 -0.607852
  1.929636	 -1.129043	 -0.605137
  1.931056	 -1.148807	 -0.602423
  1.932475	 -1.168571	 -0.599708
  1.933895	 -1.188335	 -0.596993
  1.935314	 -1.208099	 -0.594278
  1.935175	 -1.227341	 -0.588828
  1.933459	 -1.245555	 -0.580747
  1.931743	 -1.263769	 -0.572666
  1.930027	 -1.281983	 -0.564585
  1.928311	 -1.300197	 -0.556504
  1.926215	 -1.318233	 -0.548118
  1.922106	 -1.335108	 -0.538200
  1.917997	 -1.351982	 -0.528282
  1.913888	 -1.368857	 -0.518365
  1.909337	 -1.385589	 -0.508398
  1.903345	 -1.401786	 -0.498311
  1.897353	 -1.417983	 -0.488223
  1.890439	 -1.434166	 -0.478721
  1.882222	 -1.450245	 -0.470121
  1.872293	 -1.466099	 -0.463047
  1.860381	 -1.481356	 -0.458013
  1.846288	 -1.495371	 -0.455781
  1.831052	 -1.508322	 -0.455393
  1.815213	 -1.520512	 -0.456113
  1.799355	 -1.532677	 -0.456839
  1.782865	 -1.543952	 -0.457813
  1.766374	 -1.555227	 -0.458786
  1.749884	 -1.566502	 -0.459760
  1.733394	 -1.577776	 -0.460733
  1.716601	 -1.588601	 -0.461635
  1.699761	 -1.599355	 -0.462525
  1.682921	 -1.610108	 -0.463415
  1.666082	 -1.620861	 -0.464305
  1.649242	 -1.631614	 -0.465195
  1.632371	 -1.642323	 -0.466027
  1.615482	 -1.653006	 -0.466824
  1.598593	 -1.663689	 -0.467621
  1.581704	 -1.674372	 -0.468418
  1.564826	 -1.685077	 -0.469138
  1.548036	 -1.695945	 -0.469288
  1.531247	 -1.706812	 -0.469437
  1.514458	 -1.717679	 -0.469587
  1.498174	 -1.729254	 -0.468663
  1.482338	 -1.741342	 -0.466902
  1.466502	 -1.753430	 -0.465141
  1.451629	 -1.766371	 -0.461773
  1.438511	 -1.780339	 -0.456047
  1.425392	 -1.794308	 -0.450321
  1.412273	 -1.808276	 -0.444595
  1.399011	 -1.820084	 -0.435394
  1.385976	 -1.830091	 -0.423994
  1.372942	 -1.840098	 -0.412593
  1.359908	 -1.850105	 -0.401193
  1.346874	 -1.860112	 -0.389792
  1.335344	 -1.866047	 -0.374566
  1.324152	 -1.871270	 -0.358835
  1.312960	 -1.876492	 -0.343104
  1.301768	 -1.881714	 -0.327373
  1.290576	 -1.886937	 -0.311642
  1.280193	 -1.891885	 -0.295280
  1.270981	 -1.896429	 -0.278120
  1.261768	 -1.900974	 -0.260959
  1.252556	 -1.905518	 -0.243799
  1.243344	 -1.910063	 -0.226638
  1.233510	 -1.915137	 -0.209979
  1.221654	 -1.921996	 -0.195405
  1.209797	 -1.928854	 -0.180832
  1.197941	 -1.935713	 -0.166258
  1.185802	 -1.949404	 -0.158183
  1.174705	 -1.965662	 -0.154643
  1.163608	 -1.981920	 -0.151103
  1.155264	 -2.000072	 -0.150171
  1.147801	 -2.018623	 -0.150617
  1.140698	 -2.037277	 -0.151872
  1.133117	 -2.055704	 -0.153589
  1.125062	 -2.073880	 -0.155770
  1.116998	 -2.092051	 -0.157955
  1.108561	 -2.110029	 -0.160326
  1.100125	 -2.128007	 -0.162697
  1.091761	 -2.146018	 -0.165074
  1.083483	 -2.164067	 -0.167460
  1.075205	 -2.182117	 -0.169846
  1.067255	 -2.200313	 -0.172231
  1.059304	 -2.218509	 -0.174616
  1.051719	 -2.236858	 -0.177023
  1.044313	 -2.255278	 -0.179442
  1.037218	 -2.273806	 -0.181965
  1.030516	 -2.292463	 -0.184616
  1.023974	 -2.310800	 -0.187265
  1.017686	 -2.329533	 -0.190350
