  1.616490	  1.259453	  2.231959
  1.600485	  1.246983	  2.209860
  1.632648	  1.246499	  2.170734
  1.655003	  1.240248	  2.125361
  1.668666	  1.234014	  2.081421
  1.692491	  1.229363	  2.035284
  1.722610	  1.229262	  2.000190
  1.744431	  1.224779	  1.953941
  1.765477	  1.221829	  1.905093
  1.788743	  1.218255	  1.860684
  1.808959	  1.212236	  1.818551
  1.831383	  1.202597	  1.776236
  1.853949	  1.197303	  1.732936
  1.876299	  1.192211	  1.691496
  1.896728	  1.190570	  1.643330
  1.925684	  1.185339	  1.597172
  1.945598	  1.179969	  1.554426
  1.967797	  1.177311	  1.509531
  1.991836	  1.175448	  1.467680
  2.014574	  1.169370	  1.425240
  2.040125	  1.161731	  1.384386
  2.065257	  1.155751	  1.339563
  2.086564	  1.151703	  1.294131
  2.107858	  1.149067	  1.248528
  2.128081	  1.147536	  1.207133
  2.149818	  1.145708	  1.164591
  2.173954	  1.141525	  1.116904
  2.193896	  1.135306	  1.075521
  2.218492	  1.129339	  1.030939
  2.241846	  1.122732	  0.984930
  2.263721	  1.116271	  0.939936
  2.286385	  1.112007	  0.897937
  2.308994	  1.109036	  0.858006
  2.332386	  1.106143	  0.813466
  2.353652	  1.102022	  0.769183
  2.374379	  1.098500	  0.727309
  2.398429	  1.096219	  0.682681
  2.417848	  1.094874	  0.639293
  2.439254	  1.091048	  0.591779
  2.466747	  1.085422	  0.543039
  2.490004	  1.080685	  0.500057
  2.509755	  1.071095	  0.461836
  2.537582	  1.067886	  0.418182
  2.553594	  1.061002	  0.369569
  2.583540	  1.055897	  0.332181
  2.602891	  1.053085	  0.284122
  2.628750	  1.046247	  0.242314
  2.646252	  1.044543	  0.193627
  2.667726	  1.038497	  0.149274
  2.688513	  1.037507	  0.106404
  2.712338	  1.034092	  0.065822
  2.741824	  1.027268	  0.019060
  2.758112	  1.028056	 -0.020602
  2.783655	  1.020800	 -0.071141
  2.805635	  1.011720	 -0.110839
  2.823109	  1.002207	 -0.160110
  2.851340	  1.012230	 -0.161711
