 -2.239399	  0.834672	 -0.265358
 -2.259729	  0.864355	 -0.297154
 -2.251914	  0.851821	 -0.283669
 -2.244165	  0.839273	 -0.270161
 -2.236578	  0.826742	 -0.256545
 -2.229529	  0.814296	 -0.242566
 -2.222488	  0.801856	 -0.228577
 -2.215556	  0.789975	 -0.214104
 -2.208646	  0.778934	 -0.198855
 -2.201807	  0.768001	 -0.183673
 -2.195526	  0.757678	 -0.167801
 -2.188954	  0.748870	 -0.151244
 -2.180618	  0.739054	 -0.135076
 -2.171989	  0.730066	 -0.119430
 -2.164022	  0.718480	 -0.105220
 -2.157542	  0.706316	 -0.091087
 -2.151516	  0.694230	 -0.075973
 -2.145814	  0.682513	 -0.060770
 -2.141248	  0.671047	 -0.045324
 -2.138394	  0.659520	 -0.029017
 -2.132751	  0.645739	 -0.013133
 -2.124581	  0.634532	 -0.000506
 -2.110607	  0.622407	  0.011521
 -2.099748	  0.608717	  0.023470
 -2.096001	  0.598243	  0.037896
 -2.090234	  0.587187	  0.054763
 -2.081234	  0.575285	  0.069151
 -2.069414	  0.564644	  0.080677
 -2.055925	  0.553395	  0.092648
 -2.046471	  0.541741	  0.105924
 -2.041325	  0.532257	  0.122090
 -2.034833	  0.521696	  0.138969
 -2.022605	  0.509630	  0.152394
 -2.009100	  0.501444	  0.162933
 -1.997711	  0.491271	  0.176147
 -1.989010	  0.479064	  0.189691
 -1.980313	  0.467159	  0.203241
 -1.971106	  0.455786	  0.217179
 -1.962219	  0.444615	  0.231179
 -1.953177	  0.433576	  0.245197
 -1.945981	  0.422609	  0.260293
 -1.938809	  0.411643	  0.275403
 -1.931666	  0.400684	  0.290528
 -1.927103	  0.390262	  0.306973
 -1.923233	  0.380017	  0.323708
 -1.919391	  0.369746	  0.340329
 -1.916321	  0.358667	  0.356655
 -1.915136	  0.347188	  0.372978
 -1.913964	  0.337369	  0.391542
 -1.916452	  0.333368	  0.411677
 -1.919714	  0.330244	  0.431498
 -1.921011	  0.323129	  0.449822
 -1.924614	  0.316734	  0.468049
 -1.931153	  0.314145	  0.487348
 -1.935146	  0.309196	  0.505865
 -1.940989	  0.303686	  0.524225
 -1.949715	  0.301595	  0.542244
 -1.958722	  0.299576	  0.559748
 -1.968190	  0.294878	  0.576470
 -1.977982	  0.291584	  0.595507
 -1.988946	  0.294062	  0.610654
 -2.004100	  0.296134	  0.623786
 -2.021942	  0.297500	  0.638310
 -2.034148	  0.299467	  0.654368
 -2.041878	  0.296865	  0.670040
 -2.056312	  0.295512	  0.685208
 -2.070477	  0.290984	  0.699110
 -2.084476	  0.287967	  0.714156
 -2.094981	  0.286696	  0.730136
 -2.108173	  0.287723	  0.745032
 -2.123511	  0.288329	  0.759591
 -2.136037	  0.287062	  0.777318
 -2.146254	  0.284416	  0.795075
 -2.150683	  0.282692	  0.814033
 -2.155197	  0.283759	  0.832772
 -2.161546	  0.285284	  0.852336
 -2.158862	  0.293077	  0.870992
 -2.150441	  0.303479	  0.885233
 -2.141990	  0.316297	  0.901169
 -2.135874	  0.325751	  0.915898
 -2.124952	  0.339967	  0.930639
 -2.115652	  0.348688	  0.946809
 -2.099587	  0.361458	  0.950717
 -2.085669	  0.374497	  0.957812
 -2.073149	  0.387988	  0.967839
 -2.067947	  0.403425	  0.980668
 -2.063197	  0.415166	  0.995697
 -2.048699	  0.426993	  1.008695
 -2.035133	  0.435875	  1.020347
 -2.024879	  0.452139	  1.029165
 -2.012351	  0.461784	  1.040954
 -2.004280	  0.474023	  1.053734
 -1.997002	  0.487255	  1.070759
 -1.991187	  0.502194	  1.078300
 -1.980988	  0.515614	  1.090266
 -1.972234	  0.527692	  1.104873
 -1.958984	  0.538392	  1.112303
 -1.951527	  0.551269	  1.127750
 -1.948042	  0.562662	  1.145216
 -1.943575	  0.568379	  1.164968
 -1.933578	  0.576582	  1.180141
 -1.925171	  0.588909	  1.193228
 -1.921187	  0.595154	  1.208012
 -1.914317	  0.607516	  1.222980
 -1.903949	  0.611063	  1.241396
 -1.897997	  0.614149	  1.256995
 -1.892215	  0.615660	  1.274664
 -1.881205	  0.621858	  1.295662
 -1.871685	  0.627691	  1.312330
 -1.866041	  0.621411	  1.329767
 -1.861152	  0.622770	  1.344132
 -1.854266	  0.621030	  1.363627
 -1.850601	  0.612417	  1.382418
 -1.848004	  0.602933	  1.399747
 -1.843951	  0.593196	  1.414978
 -1.838365	  0.584535	  1.428440
 -1.834649	  0.572713	  1.442558
 -1.831691	  0.559325	  1.457122
 -1.829756	  0.544808	  1.470583
 -1.827914	  0.529870	  1.482136
 -1.825836	  0.515384	  1.492142
 -1.824920	  0.497395	  1.500956
 -1.824482	  0.479438	  1.510269
 -1.825032	  0.460943	  1.518331
 -1.824343	  0.442672	  1.525586
 -1.821195	  0.425933	  1.532910
 -1.820102	  0.406581	  1.536370
 -1.817893	  0.387177	  1.540999
 -1.816801	  0.367452	  1.544023
 -1.815824	  0.347681	  1.546875
 -1.813857	  0.328173	  1.551368
 -1.812880	  0.308594	  1.553553
 -1.811553	  0.289600	  1.553713
 -1.808898	  0.270736	  1.553403
 -1.806333	  0.251047	  1.550972
 -1.803567	  0.231262	  1.548973
 -1.801903	  0.211551	  1.545293
 -1.799057	  0.191880	  1.543459
 -1.796226	  0.172230	  1.541610
 -1.794582	  0.152538	  1.537929
 -1.791922	  0.132772	  1.536016
 -1.789199	  0.113951	  1.532116
 -1.785345	  0.096253	  1.526985
 -1.781895	  0.078886	  1.517913
 -1.776665	  0.061065	  1.510514
 -1.772691	  0.043661	  1.501470
 -1.768787	  0.026266	  1.492311
 -1.763618	  0.008344	  1.484698
 -1.759267	 -0.009081	  1.475726
 -1.754107	 -0.028450	  1.472851
 -1.750602	 -0.049616	  1.478800
 -1.747990	 -0.066305	  1.490187
 -1.744040	 -0.080580	  1.502266
 -1.736862	 -0.095411	  1.518113
 -1.728830	 -0.107641	  1.532707
 -1.722141	 -0.119059	  1.547700
 -1.716072	 -0.129642	  1.562165
 -1.709349	 -0.142134	  1.579383
 -1.698843	 -0.150926	  1.594674
 -1.689938	 -0.157060	  1.608939
 -1.682528	 -0.168472	  1.627948
 -1.673870	 -0.179674	  1.641906
 -1.659707	 -0.187490	  1.651642
 -1.646654	 -0.195270	  1.665125
 -1.634848	 -0.201702	  1.679075
 -1.626341	 -0.211643	  1.695113
 -1.613802	 -0.220556	  1.708349
 -1.604611	 -0.231471	  1.722380
 -1.596246	 -0.239258	  1.738630
 -1.587557	 -0.247823	  1.755260
 -1.579773	 -0.259116	  1.768214
 -1.571513	 -0.269618	  1.781994
 -1.565583	 -0.279416	  1.798949
 -1.556915	 -0.288006	  1.817441
 -1.546650	 -0.297523	  1.829636
 -1.537955	 -0.311095	  1.842734
 -1.529887	 -0.322424	  1.855560
 -1.522295	 -0.335110	  1.869281
 -1.515011	 -0.348260	  1.882599
 -1.506091	 -0.359802	  1.896611
 -1.498514	 -0.373226	  1.909633
 -1.489003	 -0.384299	  1.923388
 -1.479619	 -0.396284	  1.936936
 -1.469914	 -0.408154	  1.950524
 -1.459598	 -0.418338	  1.964150
 -1.449931	 -0.428229	  1.978296
 -1.441985	 -0.439782	  1.992854
 -1.433535	 -0.449006	  2.008620
 -1.425591	 -0.457708	  2.024612
 -1.418784	 -0.468652	  2.039791
 -1.411010	 -0.478269	  2.055372
 -1.403463	 -0.488608	  2.070725
 -1.395603	 -0.498411	  2.086338
 -1.388484	 -0.510100	  2.101029
 -1.379410	 -0.520294	  2.115125
 -1.369688	 -0.531210	  2.128612
 -1.359941	 -0.543879	  2.140819
 -1.349820	 -0.555672	  2.153297
 -1.340686	 -0.568469	  2.165127
 -1.330949	 -0.580230	  2.177287
 -1.323015	 -0.594567	  2.188494
 -1.313683	 -0.607133	  2.200886
 -1.305603	 -0.621456	  2.212786
 -1.296021	 -0.633885	  2.226032
 -1.286990	 -0.646361	  2.239347
 -1.277927	 -0.657442	  2.252793
 -1.268950	 -0.669147	  2.266739
 -1.259573	 -0.680790	  2.281174
 -1.248550	 -0.689205	  2.296064
 -1.239987	 -0.700785	  2.308967
 -1.231067	 -0.710732	  2.321302
 -1.223997	 -0.724714	  2.332577
 -1.216147	 -0.738515	  2.345182
 -1.208637	 -0.752766	  2.358024
 -1.200785	 -0.765129	  2.371437
 -1.193888	 -0.779255	  2.384386
 -1.185540	 -0.793198	  2.398783
 -1.163121	 -0.813337	  2.430785
 -1.154762	 -0.825395	  2.444376
