  2.387301	  0.518877	  0.149900
  2.428701	  0.518336	  0.145437
  2.404117	  0.509739	  0.128680
  2.385395	  0.509868	  0.131662
  2.370268	  0.511717	  0.134217
  2.345534	  0.511569	  0.136480
  2.326525	  0.515220	  0.146621
  2.314001	  0.522265	  0.162775
  2.295806	  0.528824	  0.178476
  2.275401	  0.528896	  0.181891
  2.253017	  0.524619	  0.179068
  2.228393	  0.522604	  0.181323
  2.214510	  0.528566	  0.194860
  2.199325	  0.535013	  0.208324
  2.181596	  0.543414	  0.224234
  2.169361	  0.550944	  0.240518
  2.165864	  0.562610	  0.257585
  2.163182	  0.575755	  0.274750
  2.161669	  0.589441	  0.288488
  2.164789	  0.607808	  0.301458
  2.164850	  0.623040	  0.317129
  2.159350	  0.627134	  0.336901
  2.153986	  0.630267	  0.358302
  2.155943	  0.643036	  0.376637
  2.158823	  0.655554	  0.390546
  2.160950	  0.666536	  0.407291
  2.164559	  0.679461	  0.424668
  2.167001	  0.689357	  0.437690
  2.168708	  0.699351	  0.454384
  2.171554	  0.709564	  0.474621
  2.173583	  0.715603	  0.488751
  2.176249	  0.725374	  0.507081
  2.177063	  0.738671	  0.523591
  2.174551	  0.753744	  0.543925
  2.177206	  0.762983	  0.555434
  2.182256	  0.774209	  0.566801
  2.184573	  0.786839	  0.585276
  2.183892	  0.794529	  0.608737
  2.179848	  0.801773	  0.625253
  2.171842	  0.810806	  0.644682
  2.161182	  0.819099	  0.664583
  2.151510	  0.828289	  0.681607
  2.142941	  0.836294	  0.696366
  2.136519	  0.842851	  0.709113
  2.127360	  0.851311	  0.726242
  2.119424	  0.860127	  0.741967
  2.115465	  0.869635	  0.759707
  2.114119	  0.877228	  0.775522
  2.111432	  0.886044	  0.796892
  2.105998	  0.898014	  0.817489
  2.093089	  0.907283	  0.832545
  2.082564	  0.908889	  0.843241
  2.073221	  0.909730	  0.863216
  2.065320	  0.914534	  0.882259
  2.057852	  0.922931	  0.899883
  2.050040	  0.932398	  0.916006
  2.041875	  0.941806	  0.931863
  2.032174	  0.951466	  0.946268
  2.023834	  0.961973	  0.961434
  2.016901	  0.973624	  0.976346
  2.010419	  0.985565	  0.990922
  2.004035	  0.997672	  1.005608
  1.997732	  1.009810	  1.020207
  1.991441	  1.021938	  1.034812
  1.986226	  1.035076	  1.048960
  1.981251	  1.048427	  1.062997
  1.976259	  1.061819	  1.077080
  1.970978	  1.076319	  1.092322
  1.965358	  1.095772	  1.112715
  1.961760	  1.109357	  1.126945
