 -2.152055	  0.302955	  2.111345
 -2.130747	  0.299955	  2.090441
 -2.101422	  0.274401	  2.064665
 -2.083288	  0.242666	  2.028454
 -2.054745	  0.212516	  1.997282
 -2.033095	  0.183405	  1.964809
 -2.014181	  0.153167	  1.929200
 -1.997065	  0.120873	  1.894159
 -1.981379	  0.088087	  1.860866
 -1.965506	  0.054021	  1.828497
 -1.947833	  0.019730	  1.798056
 -1.925503	 -0.014714	  1.768346
 -1.900636	 -0.048017	  1.739308
 -1.874017	 -0.081138	  1.709791
 -1.848633	 -0.111118	  1.682876
 -1.821651	 -0.142179	  1.654973
 -1.798416	 -0.174074	  1.624014
 -1.780252	 -0.206361	  1.590748
 -1.762602	 -0.241240	  1.557480
 -1.746083	 -0.279773	  1.524851
 -1.727631	 -0.315557	  1.496800
 -1.708420	 -0.348201	  1.469237
 -1.690168	 -0.382586	  1.437362
 -1.670541	 -0.416890	  1.404131
 -1.657302	 -0.446775	  1.364514
 -1.638784	 -0.476404	  1.331171
 -1.627332	 -0.507184	  1.293454
 -1.608527	 -0.538028	  1.257773
 -1.590916	 -0.573823	  1.223760
 -1.572994	 -0.611928	  1.194460
 -1.557671	 -0.650754	  1.168033
 -1.553924	 -0.686371	  1.144215
 -1.562154	 -0.712776	  1.126149
 -1.577536	 -0.728826	  1.115574
 -1.642404	 -0.769560	  1.085350
 -1.742258	 -0.859479	  0.988878
 -1.779231	 -0.931330	  0.911675
 -1.787526	 -0.974888	  0.866997
 -1.783150	 -1.020300	  0.825269
 -1.755066	 -1.074842	  0.782403
 -1.707009	 -1.117448	  0.749795
 -1.672121	 -1.137508	  0.734657
 -1.627253	 -1.153897	  0.720991
 -1.580900	 -1.162636	  0.711424
 -1.516842	 -1.166873	  0.702802
 -1.387873	 -1.159471	  0.689552
 -1.263215	 -1.166327	  0.660174
 -1.195624	 -1.189192	  0.626736
 -1.156015	 -1.213881	  0.595672
 -1.126701	 -1.241468	  0.561549
 -1.103974	 -1.272814	  0.524658
 -1.087341	 -1.304731	  0.490656
 -1.072270	 -1.339676	  0.457460
 -1.057353	 -1.376735	  0.426102
 -1.042991	 -1.414905	  0.399585
 -1.030094	 -1.456159	  0.376619
 -1.017705	 -1.499204	  0.360106
 -0.991742	 -1.570355	  0.349801
 -0.929505	 -1.678316	  0.383082
 -0.876700	 -1.756163	  0.421198
 -0.840417	 -1.805871	  0.438196
 -0.804096	 -1.856670	  0.444135
 -0.751039	 -1.924859	  0.436573
 -0.714069	 -1.968094	  0.421890
 -0.697381	 -1.986772	  0.407694
 -0.688399	 -1.995958	  0.394135
 -0.672882	 -2.011034	  0.346560
 -0.664694	 -2.015036	  0.282088
 -0.663092	 -2.012796	  0.191204
 -0.667866	 -2.017068	  0.100648
 -0.677791	 -2.025268	  0.035890
 -0.696509	 -2.037778	 -0.033406
 -0.709781	 -2.057902	 -0.133499
 -0.695175	 -2.081013	 -0.194529
 -0.674602	 -2.105362	 -0.234927
 -0.650821	 -2.132993	 -0.269461
 -0.627606	 -2.160107	 -0.299385
 -0.604400	 -2.188837	 -0.328638
 -0.580288	 -2.222628	 -0.359207
 -0.557301	 -2.255699	 -0.389563
 -0.534600	 -2.288205	 -0.421974
 -0.513110	 -2.318199	 -0.454898
 -0.491578	 -2.348134	 -0.489221
 -0.471184	 -2.377933	 -0.524747
 -0.451432	 -2.408627	 -0.558372
 -0.426972	 -2.441847	 -0.590047
 -0.404406	 -2.471685	 -0.619695
 -0.387927	 -2.497480	 -0.658442
 -0.360683	 -2.531668	 -0.684989
 -0.347986	 -2.566376	 -0.719535
 -0.321872	 -2.592839	 -0.752690
 -0.305630	 -2.625674	 -0.788375
 -0.282514	 -2.660972	 -0.818734
 -0.260771	 -2.691682	 -0.849297
 -0.244856	 -2.726914	 -0.884895
 -0.221566	 -2.762442	 -0.913881
 -0.198751	 -2.792950	 -0.947497
 -0.186989	 -2.828368	 -0.982532
 -0.188858	 -2.856652	 -0.992357
