  1.235384	  1.020607	  1.894798
  1.266952	  1.028108	  1.901789
  1.235521	  1.026242	  1.889049
  1.183971	  1.029743	  1.876689
  1.126446	  1.023242	  1.854986
  1.087483	  1.017924	  1.844101
  1.043550	  1.019439	  1.820686
  0.992072	  1.008505	  1.795852
  0.950054	  1.001571	  1.771178
  0.902959	  0.993146	  1.751144
  0.861027	  0.987677	  1.734495
  0.818474	  0.985031	  1.717758
  0.773669	  0.984198	  1.701032
  0.729542	  0.984896	  1.685264
  0.684542	  0.986247	  1.668725
  0.636122	  0.987457	  1.651044
  0.586674	  0.987790	  1.634277
  0.536535	  0.987375	  1.618252
  0.488385	  0.986784	  1.604595
  0.444141	  0.987803	  1.593436
  0.393166	  0.990325	  1.581710
  0.334558	  0.988532	  1.570525
  0.277668	  0.982898	  1.561895
  0.223385	  0.975044	  1.553562
  0.170971	  0.964811	  1.543911
  0.124853	  0.955433	  1.534380
  0.084446	  0.948938	  1.525320
  0.045736	  0.946098	  1.515130
  0.002943	  0.945846	  1.502034
 -0.044163	  0.946038	  1.487068
 -0.094369	  0.945021	  1.471011
 -0.151104	  0.940714	  1.452877
 -0.218056	  0.929183	  1.432191
 -0.317810	  0.889692	  1.404507
 -0.424738	  0.760011	  1.399518
 -0.453328	  0.627511	  1.428558
 -0.519446	  0.566848	  1.415671
 -0.561310	  0.530249	  1.407991
 -0.598329	  0.501749	  1.404186
 -0.638007	  0.474982	  1.403245
 -0.685189	  0.449722	  1.406657
 -0.726480	  0.435001	  1.411125
 -0.755782	  0.452785	  1.401368
 -0.783105	  0.473524	  1.388395
 -0.811520	  0.497325	  1.373365
 -0.834079	  0.520343	  1.359938
 -0.851662	  0.544962	  1.346599
 -0.877891	  0.608395	  1.314430
 -0.916526	  0.736991	  1.224343
 -1.003341	  0.824019	  1.098232
 -1.119282	  0.842485	  1.027217
 -1.203935	  0.838662	  1.002093
 -1.269312	  0.830449	  0.991831
 -1.328080	  0.820058	  0.987489
 -1.380206	  0.808130	  0.985042
 -1.427650	  0.795647	  0.981880
 -1.469685	  0.784099	  0.976358
 -1.505670	  0.775280	  0.967727
 -1.537326	  0.770511	  0.956673
 -1.571472	  0.768616	  0.941061
 -1.608202	  0.768702	  0.920541
 -1.647956	  0.770458	  0.894942
 -1.689014	  0.773565	  0.867157
 -1.733034	  0.777776	  0.839753
 -1.784290	  0.782169	  0.813138
 -1.842033	  0.782272	  0.788609
 -1.900639	  0.777894	  0.767916
 -1.957231	  0.769604	  0.751437
 -2.010848	  0.758668	  0.738320
 -2.058632	  0.746682	  0.727656
 -2.097130	  0.737260	  0.718038
 -2.130547	  0.732989	  0.706246
 -2.172011	  0.730120	  0.688070
 -2.211711	  0.725082	  0.667230
 -2.269885	  0.725611	  0.640896
 -2.296051	  0.728553	  0.630549
