 -0.595275	  1.929290	 -1.302430
 -0.598949	  1.963379	 -1.295193
 -0.597216	  1.943851	 -1.299378
 -0.593586	  1.924802	 -1.304504
 -0.589343	  1.906043	 -1.309601
 -0.585414	  1.887743	 -1.313602
 -0.578873	  1.871250	 -1.313594
 -0.560534	  1.853146	 -1.311550
 -0.548386	  1.829357	 -1.316086
 -0.543340	  1.808858	 -1.322295
 -0.543147	  1.794058	 -1.327166
 -0.544807	  1.777674	 -1.327417
 -0.543876	  1.760444	 -1.326068
 -0.538243	  1.726607	 -1.334940
 -0.532290	  1.705865	 -1.341776
 -0.529527	  1.696241	 -1.344104
 -0.524626	  1.676553	 -1.346704
 -0.527892	  1.655757	 -1.346518
 -0.532899	  1.634614	 -1.348763
 -0.536925	  1.614453	 -1.350111
 -0.536010	  1.594109	 -1.351311
 -0.533865	  1.574211	 -1.352680
 -0.532572	  1.554315	 -1.354257
 -0.531327	  1.534417	 -1.355841
 -0.530597	  1.514499	 -1.357478
 -0.530310	  1.494572	 -1.359160
 -0.530153	  1.474646	 -1.360845
 -0.531228	  1.454766	 -1.362730
 -0.532379	  1.434889	 -1.364619
 -0.533877	  1.415047	 -1.366634
 -0.535734	  1.395249	 -1.368768
 -0.537585	  1.375453	 -1.370931
 -0.538912	  1.355749	 -1.374084
 -0.539993	  1.336104	 -1.377676
 -0.541065	  1.316466	 -1.381306
 -0.541935	  1.297030	 -1.385865
 -0.543172	  1.277680	 -1.390868
 -0.544411	  1.258263	 -1.395814
 -0.544210	  1.239252	 -1.401571
 -0.546922	  1.220972	 -1.407949
 -0.552908	  1.202095	 -1.416739
 -0.552492	  1.181237	 -1.426712
 -0.546361	  1.163492	 -1.431713
 -0.541327	  1.145165	 -1.435289
 -0.538690	  1.124821	 -1.442778
 -0.532719	  1.106111	 -1.447355
 -0.526084	  1.086490	 -1.449046
 -0.521494	  1.066863	 -1.458358
 -0.514932	  1.052246	 -1.471833
 -0.506892	  1.040690	 -1.483834
 -0.496788	  1.024580	 -1.491067
 -0.484842	  1.001684	 -1.496894
 -0.477135	  0.983914	 -1.503336
 -0.472128	  0.969926	 -1.509102
 -0.467279	  0.955461	 -1.517487
 -0.460504	  0.935630	 -1.525809
 -0.454856	  0.918354	 -1.534509
 -0.448863	  0.900598	 -1.543422
 -0.443477	  0.883694	 -1.554436
 -0.439613	  0.868881	 -1.566816
 -0.434973	  0.854746	 -1.577292
 -0.427369	  0.836562	 -1.583999
 -0.425678	  0.811759	 -1.591161
 -0.433087	  0.787696	 -1.605203
 -0.438358	  0.777001	 -1.620078
 -0.436687	  0.766914	 -1.633338
 -0.433893	  0.750018	 -1.647075
 -0.440301	  0.734853	 -1.665477
 -0.442001	  0.724843	 -1.681521
 -0.441849	  0.713456	 -1.698098
 -0.443609	  0.697742	 -1.714187
 -0.445894	  0.689342	 -1.735210
 -0.448484	  0.683858	 -1.755528
 -0.454729	  0.680545	 -1.773715
 -0.463682	  0.673353	 -1.791676
 -0.471995	  0.667620	 -1.808187
 -0.483225	  0.661630	 -1.823856
 -0.498591	  0.649994	 -1.834462
 -0.511141	  0.630741	 -1.850032
 -0.513862	  0.622318	 -1.865205
 -0.515541	  0.614491	 -1.887694
 -0.515572	  0.607889	 -1.904854
 -0.510031	  0.594800	 -1.920910
 -0.500394	  0.580220	 -1.939743
 -0.498755	  0.569178	 -1.961102
 -0.506290	  0.556845	 -1.977975
 -0.512475	  0.549064	 -1.987529
 -0.524191	  0.538934	 -2.001942
 -0.531050	  0.532451	 -2.021544
 -0.533734	  0.524389	 -2.041509
 -0.538870	  0.513281	 -2.057780
 -0.544270	  0.499086	 -2.075677
 -0.546815	  0.489330	 -2.086187
 -0.549603	  0.472501	 -2.100202
 -0.551682	  0.457822	 -2.110963
 -0.552463	  0.443907	 -2.120941
 -0.555378	  0.424000	 -2.136696
 -0.560161	  0.412419	 -2.147767
 -0.565028	  0.399906	 -2.156163
 -0.566595	  0.379188	 -2.165878
 -0.569190	  0.361151	 -2.172876
 -0.570603	  0.349059	 -2.177423
 -0.570423	  0.326940	 -2.178074
 -0.571311	  0.305997	 -2.181650
 -0.573500	  0.290171	 -2.187812
 -0.574176	  0.266753	 -2.192838
 -0.571196	  0.245834	 -2.188540
 -0.567394	  0.231420	 -2.181027
 -0.563296	  0.214121	 -2.172105
 -0.557700	  0.191140	 -2.162654
 -0.554495	  0.175706	 -2.149992
 -0.552376	  0.168091	 -2.135240
 -0.550140	  0.159856	 -2.112236
 -0.543651	  0.144746	 -2.094579
 -0.536170	  0.127267	 -2.087358
 -0.530387	  0.103930	 -2.083277
 -0.529517	  0.088544	 -2.074325
 -0.526131	  0.076394	 -2.056227
 -0.526128	  0.069488	 -2.038635
 -0.523739	  0.056650	 -2.021320
 -0.520210	  0.043158	 -2.006522
 -0.512793	  0.030880	 -1.992490
 -0.504140	  0.019040	 -1.978855
 -0.495848	  0.008238	 -1.965071
 -0.489729	  0.005189	 -1.946533
 -0.482740	  0.005758	 -1.926499
 -0.471444	  0.001204	 -1.909773
 -0.453827	 -0.007223	 -1.895540
 -0.441118	 -0.016482	 -1.883434
 -0.435235	 -0.024217	 -1.869631
 -0.427434	 -0.029970	 -1.851637
 -0.408765	 -0.032528	 -1.835857
 -0.389443	 -0.036823	 -1.821563
 -0.379641	 -0.038494	 -1.812810
 -0.367152	 -0.044404	 -1.795855
 -0.353671	 -0.058597	 -1.776840
 -0.343607	 -0.067541	 -1.766395
 -0.331703	 -0.077512	 -1.753893
 -0.315314	 -0.092353	 -1.739183
 -0.303610	 -0.103240	 -1.727522
 -0.293389	 -0.112347	 -1.715258
 -0.285964	 -0.137418	 -1.706403
 -0.285436	 -0.159838	 -1.705247
 -0.289202	 -0.179428	 -1.705132
 -0.291517	 -0.208179	 -1.704752
 -0.279340	 -0.233822	 -1.699659
 -0.271219	 -0.245334	 -1.697828
 -0.261795	 -0.257017	 -1.692789
 -0.245206	 -0.273390	 -1.686000
 -0.236224	 -0.291066	 -1.680885
 -0.232549	 -0.310614	 -1.677975
 -0.230085	 -0.331203	 -1.679449
 -0.224942	 -0.350131	 -1.683148
 -0.219013	 -0.366943	 -1.688868
 -0.210959	 -0.385338	 -1.693292
 -0.202301	 -0.403576	 -1.695804
 -0.191727	 -0.421598	 -1.699238
 -0.180931	 -0.440905	 -1.707321
 -0.174017	 -0.458427	 -1.712607
 -0.169334	 -0.475375	 -1.716746
 -0.166256	 -0.496699	 -1.725446
 -0.171288	 -0.514106	 -1.737545
 -0.179356	 -0.530477	 -1.751595
 -0.181947	 -0.554836	 -1.761845
 -0.176893	 -0.570706	 -1.765249
 -0.170569	 -0.585134	 -1.768290
 -0.169013	 -0.611247	 -1.776528
 -0.168485	 -0.632418	 -1.781101
 -0.162267	 -0.648668	 -1.781599
 -0.151206	 -0.661438	 -1.782755
 -0.145262	 -0.679161	 -1.788164
 -0.146426	 -0.699634	 -1.793025
 -0.141966	 -0.725584	 -1.799331
 -0.135894	 -0.741496	 -1.806413
 -0.129803	 -0.759826	 -1.810601
 -0.124874	 -0.779626	 -1.807519
 -0.119792	 -0.797470	 -1.805573
 -0.113884	 -0.819106	 -1.804210
 -0.106397	 -0.847825	 -1.803915
 -0.104821	 -0.861547	 -1.802834
 -0.104345	 -0.880333	 -1.799342
 -0.104358	 -0.897976	 -1.797811
 -0.104402	 -0.920173	 -1.799776
 -0.102935	 -0.940682	 -1.803118
 -0.101606	 -0.957187	 -1.806104
 -0.099582	 -0.984477	 -1.810138
 -0.100742	 -1.001675	 -1.808897
 -0.102745	 -1.017848	 -1.805653
 -0.103072	 -1.042181	 -1.804939
 -0.099443	 -1.061186	 -1.809052
 -0.094479	 -1.078967	 -1.815441
 -0.093056	 -1.100439	 -1.817229
 -0.091414	 -1.117417	 -1.819215
 -0.086083	 -1.136628	 -1.826208
 -0.081664	 -1.158325	 -1.830316
 -0.081384	 -1.177790	 -1.828618
 -0.080214	 -1.200552	 -1.827821
 -0.075281	 -1.220909	 -1.832333
 -0.069026	 -1.238511	 -1.839195
 -0.066304	 -1.252656	 -1.842047
 -0.067286	 -1.275299	 -1.839126
 -0.067067	 -1.296497	 -1.838960
 -0.065296	 -1.316532	 -1.840870
 -0.063536	 -1.336348	 -1.842927
 -0.062490	 -1.356129	 -1.845655
 -0.061557	 -1.375920	 -1.848381
 -0.060413	 -1.395695	 -1.851171
 -0.059133	 -1.415456	 -1.853989
 -0.057953	 -1.435207	 -1.856799
 -0.058191	 -1.454880	 -1.860268
 -0.059027	 -1.474522	 -1.863921
 -0.059866	 -1.494181	 -1.867505
 -0.060269	 -1.513931	 -1.870624
 -0.060728	 -1.533689	 -1.873690
 -0.060149	 -1.553373	 -1.877009
 -0.057596	 -1.572893	 -1.880539
