 -0.257734	  1.161959	 -2.064166
 -0.303496	  1.147982	 -2.096087
 -0.287227	  1.147019	 -2.084489
 -0.270922	  1.146911	 -2.072897
 -0.254641	  1.146381	 -2.061293
 -0.238357	  1.145848	 -2.049694
 -0.222100	  1.145287	 -2.038063
 -0.207075	  1.143394	 -2.025007
 -0.193540	  1.140144	 -2.010649
 -0.180041	  1.136867	 -1.996261
 -0.166541	  1.133589	 -1.981873
 -0.153042	  1.130312	 -1.967485
 -0.139553	  1.127040	 -1.953086
 -0.126149	  1.123745	 -1.938630
 -0.116852	  1.119490	 -1.921459
 -0.108887	  1.114879	 -1.903711
 -0.100811	  1.110209	 -1.885986
 -0.092911	  1.105642	 -1.868164
 -0.085220	  1.101169	 -1.850243
 -0.077696	  1.096212	 -1.832842
 -0.071796	  1.085693	 -1.816649
 -0.066341	  1.073916	 -1.800282
 -0.062758	  1.065871	 -1.781750
 -0.064797	  1.062044	 -1.759003
 -0.067665	  1.058512	 -1.740709
 -0.068213	  1.049539	 -1.720978
 -0.071043	  1.039221	 -1.705538
 -0.078325	  1.029486	 -1.688466
 -0.084797	  1.020094	 -1.671954
 -0.092409	  1.006294	 -1.659179
 -0.100597	  0.989832	 -1.646137
 -0.106706	  0.979540	 -1.635889
 -0.120259	  0.969166	 -1.618427
 -0.128214	  0.959571	 -1.604907
 -0.137716	  0.951690	 -1.594354
 -0.150965	  0.938431	 -1.582425
 -0.164051	  0.930678	 -1.571848
 -0.178783	  0.925672	 -1.558616
 -0.197318	  0.922245	 -1.541541
 -0.210475	  0.916536	 -1.532905
 -0.225045	  0.909734	 -1.524152
 -0.239930	  0.903919	 -1.513657
 -0.253820	  0.900163	 -1.502929
 -0.274809	  0.895097	 -1.486348
 -0.294554	  0.884449	 -1.475550
 -0.301223	  0.879650	 -1.471660
 -0.319161	  0.873132	 -1.459332
 -0.332787	  0.877604	 -1.442609
 -0.346175	  0.873437	 -1.427737
 -0.359060	  0.865049	 -1.413598
 -0.372021	  0.860788	 -1.401022
 -0.379036	  0.855453	 -1.382142
 -0.391425	  0.852118	 -1.364209
 -0.401004	  0.857236	 -1.349711
 -0.409473	  0.860296	 -1.331324
 -0.416944	  0.855010	 -1.311583
 -0.420685	  0.843075	 -1.296143
 -0.422130	  0.828651	 -1.283287
 -0.424800	  0.819328	 -1.267989
 -0.430689	  0.812399	 -1.248057
 -0.435754	  0.802220	 -1.231608
 -0.443006	  0.788674	 -1.218191
 -0.452463	  0.775780	 -1.206007
 -0.463463	  0.765201	 -1.191501
 -0.476378	  0.758559	 -1.176589
 -0.486820	  0.755185	 -1.161611
 -0.498127	  0.751493	 -1.143076
 -0.503684	  0.745947	 -1.122748
 -0.504327	  0.733405	 -1.102886
 -0.500848	  0.715148	 -1.093881
 -0.497780	  0.689863	 -1.088752
 -0.505481	  0.667656	 -1.079257
 -0.515303	  0.654311	 -1.062532
 -0.520799	  0.651014	 -1.043925
 -0.532212	  0.647238	 -1.013447
 -0.544105	  0.640169	 -0.995248
 -0.547742	  0.636379	 -0.990298
 -0.560574	  0.624671	 -0.975468
 -0.566491	  0.612106	 -0.952117
 -0.569137	  0.610953	 -0.938821
 -0.576260	  0.607561	 -0.920474
 -0.586866	  0.600367	 -0.892788
 -0.595578	  0.594634	 -0.879929
 -0.604918	  0.589800	 -0.863146
 -0.615542	  0.580039	 -0.847926
 -0.625163	  0.568480	 -0.829898
 -0.633496	  0.563056	 -0.818940
 -0.645004	  0.556128	 -0.803874
 -0.655368	  0.548659	 -0.786184
 -0.666458	  0.543757	 -0.773044
 -0.679666	  0.538304	 -0.757567
 -0.688962	  0.531776	 -0.738441
 -0.698435	  0.527038	 -0.723472
 -0.710823	  0.519342	 -0.706791
 -0.726277	  0.513189	 -0.691319
 -0.738619	  0.506692	 -0.680101
 -0.752058	  0.501714	 -0.669582
 -0.770885	  0.493846	 -0.656692
 -0.782929	  0.488399	 -0.645783
 -0.797360	  0.483644	 -0.631006
 -0.813667	  0.480388	 -0.614185
 -0.824697	  0.477823	 -0.603583
 -0.839263	  0.476075	 -0.589999
 -0.858998	  0.477041	 -0.569957
 -0.869595	  0.479508	 -0.562213
 -0.888983	  0.484216	 -0.551187
 -0.910821	  0.486207	 -0.534986
 -0.919239	  0.487614	 -0.529754
 -0.932388	  0.488132	 -0.512609
 -0.946334	  0.488564	 -0.496531
 -0.960654	  0.487788	 -0.483475
 -0.975848	  0.485332	 -0.466516
 -0.991026	  0.488510	 -0.453186
 -1.006088	  0.494466	 -0.444844
 -1.022877	  0.497905	 -0.432490
 -1.034539	  0.493405	 -0.417787
 -1.046296	  0.487562	 -0.405158
 -1.067490	  0.480817	 -0.387313
 -1.077887	  0.478823	 -0.371660
 -1.086522	  0.478248	 -0.358558
 -1.095503	  0.483253	 -0.340338
 -1.106674	  0.498983	 -0.319079
 -1.120382	  0.505238	 -0.300538
 -1.135455	  0.501514	 -0.286584
 -1.145982	  0.498120	 -0.277468
 -1.156302	  0.491391	 -0.260463
 -1.164355	  0.487978	 -0.241450
 -1.173926	  0.483485	 -0.223151
 -1.184806	  0.480079	 -0.205634
 -1.195487	  0.478740	 -0.188236
 -1.202759	  0.479213	 -0.170457
 -1.208230	  0.480047	 -0.150589
 -1.214164	  0.478214	 -0.131704
 -1.222040	  0.474394	 -0.113450
 -1.229967	  0.472323	 -0.094116
 -1.235679	  0.473160	 -0.074727
 -1.238280	  0.474684	 -0.054677
 -1.238223	  0.475165	 -0.034519
 -1.237520	  0.473674	 -0.014462
 -1.237880	  0.470715	  0.005180
 -1.241822	  0.466873	  0.025499
 -1.247071	  0.464575	  0.045701
 -1.251374	  0.466359	  0.066023
 -1.251233	  0.470563	  0.086326
 -1.245520	  0.474415	  0.106306
 -1.237770	  0.476347	  0.125533
 -1.229032	  0.477935	  0.144393
 -1.221417	  0.480381	  0.163504
 -1.217588	  0.484711	  0.183438
 -1.218949	  0.489323	  0.204190
 -1.223352	  0.491744	  0.224049
 -1.224692	  0.492836	  0.242649
 -1.219199	  0.498771	  0.263445
 -1.208816	  0.506057	  0.284994
 -1.201731	  0.508625	  0.297816
 -1.192696	  0.508292	  0.316373
 -1.186024	  0.511503	  0.335742
 -1.185615	  0.515367	  0.353771
 -1.190080	  0.520135	  0.376775
 -1.195210	  0.527666	  0.392468
 -1.196887	  0.536829	  0.406455
 -1.198145	  0.548951	  0.426141
 -1.204844	  0.554656	  0.443880
 -1.206993	  0.557327	  0.461868
 -1.216321	  0.561263	  0.475884
 -1.221809	  0.568872	  0.499265
 -1.227265	  0.574552	  0.514043
 -1.232277	  0.577033	  0.535755
 -1.246820	  0.582332	  0.550233
 -1.263272	  0.590708	  0.561525
 -1.279330	  0.601674	  0.567364
 -1.293118	  0.611501	  0.578716
 -1.306177	  0.621671	  0.592189
 -1.325442	  0.634173	  0.596862
 -1.341323	  0.640328	  0.595097
 -1.361588	  0.645128	  0.599234
 -1.382009	  0.643697	  0.613532
 -1.388897	  0.649852	  0.619487
 -1.395409	  0.645028	  0.626473
 -1.411401	  0.640125	  0.640845
 -1.427559	  0.634346	  0.647756
 -1.437650	  0.624108	  0.652685
 -1.450592	  0.607805	  0.654038
 -1.461109	  0.591293	  0.657314
 -1.470557	  0.572012	  0.658820
 -1.478920	  0.553895	  0.666365
 -1.485201	  0.541677	  0.676524
 -1.490208	  0.529721	  0.696543
 -1.500681	  0.515036	  0.712129
 -1.510185	  0.503061	  0.719069
 -1.525751	  0.485973	  0.720496
 -1.539708	  0.472238	  0.730172
 -1.546643	  0.462014	  0.750890
 -1.548955	  0.449562	  0.767465
 -1.553149	  0.435816	  0.776578
 -1.568222	  0.422742	  0.789287
 -1.581024	  0.418010	  0.803845
 -1.590502	  0.409161	  0.820628
 -1.595211	  0.393120	  0.839563
 -1.597643	  0.384170	  0.857136
 -1.604348	  0.385352	  0.875922
 -1.615045	  0.388073	  0.896046
 -1.622884	  0.387604	  0.915587
 -1.627317	  0.391006	  0.932477
 -1.639852	  0.399990	  0.949521
 -1.651402	  0.402951	  0.968287
 -1.653073	  0.396671	  0.988261
 -1.657038	  0.387557	  1.011410
 -1.667295	  0.385347	  1.028802
 -1.677970	  0.389148	  1.041089
 -1.692439	  0.396243	  1.057870
 -1.704822	  0.396985	  1.075480
 -1.711407	  0.393905	  1.091574
 -1.720993	  0.390061	  1.111858
 -1.734137	  0.386702	  1.128851
 -1.745030	  0.385597	  1.142013
 -1.753752	  0.388139	  1.158920
 -1.765494	  0.391133	  1.176759
 -1.777773	  0.391241	  1.193016
 -1.790007	  0.391243	  1.208851
 -1.802778	  0.391137	  1.224242
 -1.815532	  0.391034	  1.239644
 -1.828554	  0.390766	  1.254827
 -1.842002	  0.390271	  1.269638
 -1.855517	  0.389726	  1.284372
 -1.869163	  0.388415	  1.298919
 -1.882719	  0.387092	  1.313569
 -1.895817	  0.385310	  1.328579
 -1.908843	  0.383459	  1.343642
 -1.921300	  0.381491	  1.359159
 -1.933531	  0.379512	  1.374677
 -1.944996	  0.377792	  1.389830
 -1.956585	  0.376256	  1.406057
