  2.166057	  0.356632	 -1.310664
  2.186243	  0.376535	 -1.312363
  2.172065	  0.362456	 -1.311518
  2.158145	  0.348128	 -1.312397
  2.144824	  0.333328	 -1.314244
  2.132754	  0.317782	 -1.317791
  2.121873	  0.301461	 -1.321683
  2.111882	  0.284629	 -1.325795
  2.101768	  0.267892	 -1.329987
  2.091427	  0.251328	 -1.334311
  2.081083	  0.234765	 -1.338630
  2.070571	  0.218191	 -1.342480
  2.060016	  0.201615	 -1.346197
  2.049595	  0.184992	 -1.350077
  2.039400	  0.168294	 -1.354231
  2.029204	  0.151616	 -1.358461
  2.018998	  0.135146	 -1.363419
  2.008785	  0.118691	 -1.368409
  1.998181	  0.102519	 -1.373376
  1.987736	  0.085862	 -1.377533
  1.977240	  0.069359	 -1.382494
  1.965004	  0.055199	 -1.388225
  1.951902	  0.039158	 -1.389404
  1.941141	  0.020011	 -1.390735
  1.931992	  0.000229	 -1.398230
  1.921013	 -0.015214	 -1.412220
  1.908909	 -0.022725	 -1.425045
  1.892116	 -0.032117	 -1.434019
  1.874385	 -0.039953	 -1.437150
  1.858474	 -0.052359	 -1.442500
  1.843096	 -0.064110	 -1.447910
  1.827632	 -0.075444	 -1.452700
  1.814211	 -0.089501	 -1.456817
  1.800516	 -0.103335	 -1.461199
  1.786222	 -0.116615	 -1.465360
  1.772342	 -0.130295	 -1.468822
  1.759103	 -0.145058	 -1.471863
  1.746579	 -0.160518	 -1.474244
  1.733384	 -0.175533	 -1.475548
  1.720917	 -0.189754	 -1.475647
  1.711901	 -0.208247	 -1.471137
  1.703653	 -0.229326	 -1.468903
  1.691283	 -0.246596	 -1.470786
  1.679113	 -0.258365	 -1.470614
  1.666619	 -0.276744	 -1.468586
  1.653357	 -0.294381	 -1.470537
  1.641096	 -0.305259	 -1.471382
  1.626624	 -0.322742	 -1.470735
  1.610030	 -0.342570	 -1.475735
  1.595077	 -0.352291	 -1.481700
  1.582228	 -0.357535	 -1.484902
  1.563146	 -0.369404	 -1.485944
  1.563462	 -0.384993	 -1.496178
  1.571212	 -0.399647	 -1.507518
  1.578762	 -0.414313	 -1.518863
  1.586647	 -0.428915	 -1.530004
  1.594594	 -0.443488	 -1.541046
  1.597828	 -0.460100	 -1.551344
  1.597755	 -0.477636	 -1.560887
  1.598817	 -0.494760	 -1.570294
  1.605320	 -0.511956	 -1.580125
  1.612336	 -0.527924	 -1.591893
  1.612108	 -0.546392	 -1.599593
  1.597296	 -0.566674	 -1.602647
  1.580956	 -0.583271	 -1.609981
  1.573653	 -0.600007	 -1.617902
  1.568057	 -0.612703	 -1.624886
  1.558033	 -0.628852	 -1.631574
  1.544864	 -0.645485	 -1.637888
  1.538412	 -0.658682	 -1.644677
  1.529192	 -0.677602	 -1.653495
  1.513392	 -0.689641	 -1.653518
  1.493980	 -0.696617	 -1.649025
  1.475398	 -0.703621	 -1.647560
  1.459683	 -0.710787	 -1.646958
  1.442572	 -0.720055	 -1.647063
  1.414779	 -0.733744	 -1.646743
  1.398465	 -0.736008	 -1.644263
  1.381583	 -0.737805	 -1.640086
  1.365515	 -0.739863	 -1.636435
  1.340460	 -0.742681	 -1.627695
  1.323560	 -0.744079	 -1.622175
  1.307098	 -0.745096	 -1.617389
  1.285332	 -0.750380	 -1.611274
  1.265521	 -0.753945	 -1.604748
  1.250298	 -0.754985	 -1.600247
  1.230717	 -0.759730	 -1.596425
  1.211678	 -0.766378	 -1.592604
  1.194402	 -0.770848	 -1.588010
  1.175016	 -0.779409	 -1.583091
  1.159881	 -0.789785	 -1.580222
  1.148938	 -0.804056	 -1.581348
  1.135343	 -0.820579	 -1.582750
  1.122072	 -0.835893	 -1.583165
  1.110064	 -0.850556	 -1.586409
  1.098154	 -0.865819	 -1.591757
  1.084940	 -0.880764	 -1.596045
  1.073259	 -0.898540	 -1.599514
  1.065566	 -0.915338	 -1.605407
  1.062110	 -0.932443	 -1.615283
  1.058572	 -0.950453	 -1.627364
  1.045559	 -0.968864	 -1.638236
  1.030918	 -0.982648	 -1.640805
  1.019879	 -0.994507	 -1.641826
  1.006293	 -1.008732	 -1.649210
  0.996183	 -1.025830	 -1.658777
  0.985925	 -1.043765	 -1.667450
  0.972798	 -1.054967	 -1.672526
  0.955053	 -1.066664	 -1.676802
  0.935404	 -1.073013	 -1.680980
  0.915751	 -1.081325	 -1.686737
  0.900485	 -1.093989	 -1.690683
  0.887799	 -1.108036	 -1.693322
  0.873246	 -1.118474	 -1.699235
  0.854182	 -1.123709	 -1.709771
  0.832591	 -1.129161	 -1.718182
  0.814092	 -1.141759	 -1.721079
  0.802303	 -1.155207	 -1.721840
  0.788506	 -1.169232	 -1.724587
  0.770767	 -1.182611	 -1.727327
  0.759454	 -1.198414	 -1.724949
  0.745249	 -1.213597	 -1.723941
  0.729094	 -1.225917	 -1.725343
  0.712974	 -1.237685	 -1.726801
  0.696712	 -1.249274	 -1.727931
  0.680442	 -1.260850	 -1.729070
  0.664211	 -1.272463	 -1.730377
  0.647994	 -1.284089	 -1.731735
  0.632461	 -1.296608	 -1.733112
  0.617774	 -1.310090	 -1.734597
  0.603280	 -1.323711	 -1.736588
  0.590551	 -1.339010	 -1.739478
  0.577876	 -1.354493	 -1.742283
  0.566015	 -1.370585	 -1.744881
  0.555117	 -1.387327	 -1.746584
  0.544107	 -1.403939	 -1.748464
  0.533473	 -1.421060	 -1.749634
  0.523083	 -1.438326	 -1.750377
  0.513723	 -1.455711	 -1.749939
  0.503431	 -1.472903	 -1.750576
  0.492582	 -1.489665	 -1.752311
  0.481836	 -1.506515	 -1.754425
  0.471109	 -1.523334	 -1.756356
  0.461131	 -1.540668	 -1.757260
  0.451279	 -1.557950	 -1.758119
  0.441669	 -1.575357	 -1.758799
  0.430917	 -1.592259	 -1.760350
  0.419743	 -1.608759	 -1.762350
  0.408193	 -1.624942	 -1.764521
  0.396527	 -1.641036	 -1.766730
  0.384805	 -1.657100	 -1.768862
  0.372863	 -1.673039	 -1.770700
  0.360916	 -1.688973	 -1.772531
  0.348736	 -1.704777	 -1.773881
  0.335965	 -1.720169	 -1.773815
  0.323184	 -1.735551	 -1.773732
  0.310079	 -1.750659	 -1.773604
  0.296340	 -1.765190	 -1.773354
  0.282554	 -1.779673	 -1.773211
  0.268553	 -1.793819	 -1.775140
  0.254593	 -1.807987	 -1.777219
  0.241554	 -1.822815	 -1.780398
  0.228523	 -1.837647	 -1.783594
  0.215490	 -1.852496	 -1.786784
  0.202193	 -1.867591	 -1.789998
  0.187029	 -1.883434	 -1.792079
  0.172072	 -1.896695	 -1.791429
