  1.607634	  0.568711	  1.836722
  1.604290	  0.571296	  1.830266
  1.599242	  0.575200	  1.820518
  1.583904	  0.576618	  1.799642
  1.574377	  0.568600	  1.783398
  1.566139	  0.560738	  1.768615
  1.556874	  0.554093	  1.751653
  1.546406	  0.548355	  1.735000
  1.539610	  0.540766	  1.719692
  1.532695	  0.532186	  1.701024
  1.522936	  0.529274	  1.681777
  1.512915	  0.526908	  1.665599
  1.506355	  0.525771	  1.651015
  1.500112	  0.523602	  1.632226
  1.486048	  0.513916	  1.615723
  1.463425	  0.507831	  1.595581
  1.454620	  0.508471	  1.585998
  1.444044	  0.510893	  1.568934
  1.441321	  0.515933	  1.550636
  1.439105	  0.519798	  1.530002
  1.437455	  0.520748	  1.508655
  1.425647	  0.522408	  1.487297
  1.408321	  0.521073	  1.470383
  1.394464	  0.514897	  1.459956
  1.377803	  0.509887	  1.444097
  1.367058	  0.512405	  1.426601
  1.361428	  0.518696	  1.411321
  1.352936	  0.524190	  1.390618
  1.339999	  0.519740	  1.374940
  1.325261	  0.512369	  1.361198
  1.312387	  0.510803	  1.344442
  1.305467	  0.514677	  1.329267
  1.298381	  0.524266	  1.306347
  1.284575	  0.527255	  1.283594
  1.276733	  0.527665	  1.271927
  1.270091	  0.524494	  1.255457
  1.257849	  0.519741	  1.233881
  1.243007	  0.509152	  1.221580
  1.231450	  0.496610	  1.209114
  1.223167	  0.487538	  1.192504
  1.215130	  0.482883	  1.174479
  1.207202	  0.478257	  1.156686
  1.199204	  0.473792	  1.138912
  1.188838	  0.470015	  1.122237
  1.178394	  0.466262	  1.105599
  1.167928	  0.462587	  1.088963
  1.156790	  0.461262	  1.072411
  1.145601	  0.460456	  1.055860
  1.136223	  0.460819	  1.038206
  1.127700	  0.461724	  1.020137
  1.118538	  0.463367	  1.002437
  1.108788	  0.465645	  0.985122
  1.099012	  0.467787	  0.967809
  1.089415	  0.468596	  0.950282
  1.079884	  0.469075	  0.932707
  1.071100	  0.468321	  0.914760
  1.062772	  0.466891	  0.896634
  1.054497	  0.464999	  0.878525
  1.046271	  0.462458	  0.860472
  1.038033	  0.459882	  0.842431
  1.029498	  0.457075	  0.824562
  1.020936	  0.454260	  0.806708
  1.012260	  0.451475	  0.788904
  1.002665	  0.449217	  0.771502
  0.993104	  0.446922	  0.754098
  0.983936	  0.444779	  0.736461
  0.974867	  0.443118	  0.718740
  0.966506	  0.441158	  0.701885
  0.965496	  0.436048	  0.684636
  0.964858	  0.435102	  0.658611
  0.944538	  0.439381	  0.636282
  0.927585	  0.440925	  0.626679
  0.906992	  0.440419	  0.618259
  0.891087	  0.437961	  0.604332
  0.885002	  0.435911	  0.586771
  0.883373	  0.432881	  0.565914
  0.878368	  0.428624	  0.546385
  0.874704	  0.424185	  0.527529
  0.873204	  0.419137	  0.506561
  0.867472	  0.413538	  0.488556
  0.863266	  0.406942	  0.472116
  0.864922	  0.400801	  0.451109
  0.863114	  0.394259	  0.426301
  0.851945	  0.383220	  0.407429
  0.824802	  0.371032	  0.394966
  0.812903	  0.367887	  0.387380
  0.797411	  0.365409	  0.375804
  0.784547	  0.361138	  0.359025
  0.773913	  0.357220	  0.344733
  0.759511	  0.354928	  0.328855
  0.741093	  0.344622	  0.310290
  0.735506	  0.338077	  0.302739
  0.725247	  0.324985	  0.289411
  0.712816	  0.316245	  0.274189
  0.699775	  0.314625	  0.260286
  0.681823	  0.313817	  0.244683
  0.662667	  0.305927	  0.230544
  0.651808	  0.300211	  0.222962
  0.644778	  0.291450	  0.212380
  0.631652	  0.285980	  0.193061
  0.618764	  0.277942	  0.179178
  0.604310	  0.266940	  0.168207
  0.582838	  0.263702	  0.154455
  0.564387	  0.265206	  0.138938
  0.556188	  0.263341	  0.122981
  0.551924	  0.260848	  0.105394
  0.546121	  0.257713	  0.089565
  0.535951	  0.254523	  0.071484
  0.521481	  0.252297	  0.047503
  0.515606	  0.251329	  0.028433
  0.513461	  0.250418	  0.014586
  0.507972	  0.247832	 -0.007409
  0.501571	  0.248764	 -0.025924
  0.490065	  0.253306	 -0.047550
  0.477675	  0.257536	 -0.066645
  0.472012	  0.257571	 -0.075620
  0.459426	  0.258824	 -0.091724
  0.441623	  0.259509	 -0.121263
  0.436500	  0.259000	 -0.130593
  0.429752	  0.256940	 -0.149393
  0.421363	  0.256766	 -0.169180
  0.412396	  0.256263	 -0.182818
  0.399986	  0.255321	 -0.199677
  0.387065	  0.256248	 -0.220245
  0.378065	  0.257244	 -0.236690
  0.371464	  0.259623	 -0.258622
  0.364878	  0.259818	 -0.279951
  0.358799	  0.260286	 -0.289150
  0.345483	  0.260157	 -0.309319
  0.327257	  0.258507	 -0.331664
  0.319766	  0.261210	 -0.339755
  0.306528	  0.265531	 -0.359474
  0.297383	  0.271210	 -0.383163
  0.290697	  0.274881	 -0.395003
  0.283304	  0.278736	 -0.404046
  0.265359	  0.280782	 -0.423137
  0.246109	  0.278668	 -0.441923
  0.236426	  0.279313	 -0.451144
  0.228550	  0.278076	 -0.463412
  0.212377	  0.278948	 -0.484737
  0.197706	  0.275878	 -0.500762
  0.186374	  0.271889	 -0.513796
  0.179636	  0.267563	 -0.527048
  0.171711	  0.261964	 -0.546470
  0.162256	  0.255213	 -0.564344
  0.152137	  0.250064	 -0.586497
  0.144171	  0.248215	 -0.606151
  0.135105	  0.251791	 -0.623663
  0.123082	  0.255036	 -0.638150
  0.107229	  0.260322	 -0.654370
  0.088003	  0.264040	 -0.672486
  0.080211	  0.263807	 -0.682064
  0.072219	  0.260288	 -0.695280
  0.059385	  0.260433	 -0.714132
  0.043181	  0.255017	 -0.733224
  0.026495	  0.248468	 -0.751358
  0.018518	  0.246984	 -0.762205
  0.008311	  0.245526	 -0.775560
 -0.005218	  0.242616	 -0.795691
 -0.019227	  0.238694	 -0.806748
 -0.031294	  0.234787	 -0.822786
 -0.049789	  0.229603	 -0.838741
 -0.051324	  0.228776	 -0.853648
 -0.068518	  0.223935	 -0.864740
 -0.088075	  0.220642	 -0.883602
 -0.096005	  0.215744	 -0.892244
 -0.103106	  0.207626	 -0.901087
 -0.118354	  0.197768	 -0.928492
 -0.127745	  0.185694	 -0.942708
 -0.138124	  0.170721	 -0.956573
 -0.158555	  0.167245	 -0.976956
 -0.166976	  0.168157	 -0.985307
 -0.180931	  0.159624	 -0.991368
 -0.192967	  0.154629	 -1.006206
 -0.208177	  0.133829	 -1.018526
 -0.222988	  0.110251	 -1.029399
 -0.227841	  0.094441	 -1.034685
 -0.235773	  0.081686	 -1.040707
 -0.240942	  0.073139	 -1.044492
 -0.248001	  0.044034	 -1.052079
 -0.253510	  0.015146	 -1.054320
 -0.254936	  0.001240	 -1.056741
 -0.253900	 -0.011496	 -1.059526
 -0.253713	 -0.040111	 -1.060087
 -0.253673	 -0.060266	 -1.067803
 -0.254580	 -0.081178	 -1.079865
 -0.256416	 -0.094287	 -1.086685
 -0.261860	 -0.115398	 -1.094420
 -0.267412	 -0.131328	 -1.103162
 -0.275501	 -0.148807	 -1.110850
 -0.282958	 -0.169962	 -1.114927
 -0.285271	 -0.185499	 -1.116814
 -0.290813	 -0.204638	 -1.119354
 -0.298579	 -0.228744	 -1.122707
 -0.304438	 -0.246240	 -1.129498
 -0.307215	 -0.255998	 -1.135197
 -0.312715	 -0.273664	 -1.142486
 -0.314707	 -0.293226	 -1.152807
 -0.317456	 -0.313940	 -1.163437
 -0.321488	 -0.330504	 -1.173393
 -0.325468	 -0.343369	 -1.181690
 -0.325896	 -0.352605	 -1.187325
 -0.326478	 -0.363515	 -1.199510
 -0.324869	 -0.379083	 -1.217190
 -0.324249	 -0.390024	 -1.227811
 -0.323485	 -0.400136	 -1.248927
 -0.320831	 -0.403916	 -1.270256
 -0.318427	 -0.407455	 -1.289209
 -0.317432	 -0.402236	 -1.312314
 -0.319897	 -0.393542	 -1.336209
 -0.320735	 -0.393844	 -1.356088
 -0.321750	 -0.385944	 -1.374139
 -0.326893	 -0.381026	 -1.395113
 -0.330152	 -0.378291	 -1.408662
 -0.336869	 -0.371648	 -1.428129
 -0.341937	 -0.363987	 -1.446943
 -0.346014	 -0.359021	 -1.464576
 -0.348493	 -0.355435	 -1.488166
 -0.356753	 -0.352465	 -1.511077
 -0.360568	 -0.350475	 -1.521115
 -0.367868	 -0.345314	 -1.535262
 -0.375384	 -0.332113	 -1.558972
 -0.385524	 -0.321338	 -1.581124
 -0.395011	 -0.316808	 -1.593885
 -0.404268	 -0.313449	 -1.602773
 -0.411817	 -0.319297	 -1.625898
 -0.421191	 -0.329389	 -1.651523
 -0.433714	 -0.331878	 -1.671869
 -0.446728	 -0.329725	 -1.684292
 -0.463251	 -0.323665	 -1.699340
 -0.475839	 -0.317460	 -1.715561
 -0.486042	 -0.311201	 -1.733038
 -0.494804	 -0.298815	 -1.753946
 -0.501897	 -0.286848	 -1.769319
 -0.506178	 -0.277935	 -1.776526
 -0.516486	 -0.263863	 -1.792415
 -0.527031	 -0.242909	 -1.806137
 -0.532019	 -0.223314	 -1.813666
 -0.534018	 -0.205652	 -1.815589
 -0.537223	 -0.183599	 -1.815849
 -0.541034	 -0.163019	 -1.820278
 -0.544570	 -0.145132	 -1.826312
 -0.550054	 -0.127883	 -1.834696
 -0.555970	 -0.108723	 -1.837800
 -0.561163	 -0.089715	 -1.832763
 -0.567453	 -0.072236	 -1.826173
 -0.572798	 -0.054300	 -1.824790
 -0.575293	 -0.030033	 -1.827404
 -0.577639	 -0.008461	 -1.822308
 -0.582837	  0.003392	 -1.810841
 -0.588031	  0.015746	 -1.803259
 -0.585169	  0.029819	 -1.816502
 -0.581056	  0.042399	 -1.831632
 -0.578900	  0.052808	 -1.848461
 -0.582979	  0.055276	 -1.867793
 -0.587264	  0.057481	 -1.887199
 -0.591576	  0.059658	 -1.906603
 -0.596761	  0.060991	 -1.925809
 -0.605390	  0.057446	 -1.942890
 -0.612773	  0.049577	 -1.957577
 -0.616545	  0.034387	 -1.973453
 -0.621605	  0.023992	 -1.998206
 -0.633456	  0.022663	 -2.017317
 -0.642773	  0.021723	 -2.027788
 -0.656396	  0.020396	 -2.046818
 -0.670382	  0.025470	 -2.067535
 -0.679556	  0.026049	 -2.080907
 -0.690865	  0.022472	 -2.099524
 -0.700003	  0.019198	 -2.117721
 -0.707223	  0.019273	 -2.132698
 -0.715968	  0.018585	 -2.152517
 -0.725908	  0.018075	 -2.171376
 -0.736171	  0.017303	 -2.187451
 -0.745062	  0.016141	 -2.205181
 -0.754715	  0.016336	 -2.223876
 -0.764455	  0.015802	 -2.241437
 -0.773388	  0.014149	 -2.257828
 -0.781773	  0.013805	 -2.275979
 -0.790276	  0.013871	 -2.293868
 -0.797978	  0.011700	 -2.312598
 -0.807103	  0.009113	 -2.329926
 -0.820016	  0.005903	 -2.361681
 -0.823638	  0.001944	 -2.375756
