 -2.180126	 -0.691196	  0.892074
 -2.190449	 -0.698768	  0.886463
 -2.175649	 -0.688004	  0.894536
 -2.160928	 -0.677013	  0.902437
 -2.146931	 -0.664489	  0.909328
 -2.133083	 -0.651811	  0.916220
 -2.119473	 -0.638831	  0.923052
 -2.106515	 -0.625100	  0.929641
 -2.093178	 -0.612128	  0.936638
 -2.079245	 -0.599347	  0.944311
 -2.066827	 -0.585188	  0.950882
 -2.055540	 -0.570067	  0.957138
 -2.043290	 -0.555985	  0.964665
 -2.030969	 -0.542234	  0.971973
 -2.020261	 -0.526536	  0.978806
 -2.009699	 -0.510540	  0.986802
 -1.996159	 -0.498912	  0.996235
 -1.981934	 -0.488793	  1.005540
 -1.968376	 -0.476954	  1.014778
 -1.956233	 -0.464332	  1.024570
 -1.944218	 -0.451827	  1.034552
 -1.931736	 -0.440104	  1.044911
 -1.918541	 -0.429888	  1.055967
 -1.905333	 -0.419784	  1.067066
 -1.893530	 -0.411096	  1.080592
 -1.888489	 -0.408911	  1.099768
 -1.883580	 -0.406937	  1.119055
 -1.878669	 -0.405001	  1.138343
 -1.873776	 -0.403042	  1.157636
 -1.869975	 -0.401606	  1.177168
 -1.874169	 -0.403761	  1.196558
 -1.878488	 -0.406087	  1.215920
 -1.882508	 -0.409547	  1.235060
 -1.887499	 -0.415161	  1.253249
 -1.893606	 -0.420352	  1.272840
 -1.899893	 -0.425291	  1.290448
 -1.906325	 -0.425673	  1.311429
 -1.912201	 -0.422010	  1.330590
 -1.912661	 -0.415879	  1.353112
 -1.912016	 -0.416783	  1.371894
 -1.915904	 -0.422063	  1.391127
 -1.922384	 -0.428611	  1.409263
 -1.929992	 -0.433750	  1.427337
 -1.937944	 -0.435575	  1.447651
 -1.944898	 -0.435066	  1.468781
 -1.941664	 -0.437995	  1.497494
 -1.946240	 -0.440710	  1.516773
