 -2.083827	 -1.681248	  1.418439
 -2.063195	 -1.664602	  1.404395
 -2.020969	 -1.668552	  1.375959
 -1.990113	 -1.687875	  1.343644
 -1.954281	 -1.702563	  1.313992
 -1.923145	 -1.708825	  1.276048
 -1.888406	 -1.721005	  1.244417
 -1.851157	 -1.733177	  1.211202
 -1.813348	 -1.749190	  1.178948
 -1.776216	 -1.765924	  1.147899
 -1.740056	 -1.781631	  1.119090
 -1.704906	 -1.795833	  1.092166
 -1.668531	 -1.808462	  1.064250
 -1.630179	 -1.821283	  1.033623
 -1.593962	 -1.833936	  1.003125
 -1.556208	 -1.846800	  0.970387
 -1.522467	 -1.858613	  0.938809
 -1.488321	 -1.868687	  0.905129
 -1.451396	 -1.881012	  0.869321
 -1.418100	 -1.893699	  0.836605
 -1.384518	 -1.907706	  0.802941
 -1.351907	 -1.922520	  0.770578
 -1.318038	 -1.938573	  0.738401
 -1.282801	 -1.954874	  0.706796
 -1.247299	 -1.970384	  0.677757
 -1.209276	 -1.984985	  0.649310
 -1.169227	 -1.998686	  0.617687
 -1.133079	 -2.012303	  0.585965
 -1.100067	 -2.026003	  0.554520
 -1.067450	 -2.041279	  0.521269
 -1.035577	 -2.058809	  0.486245
 -1.006812	 -2.075873	  0.453194
 -0.976101	 -2.094022	  0.418533
 -0.944939	 -2.111627	  0.383480
 -0.912436	 -2.129730	  0.347943
 -0.878934	 -2.148817	  0.313011
 -0.846420	 -2.166334	  0.281402
 -0.814845	 -2.182117	  0.252209
 -0.779252	 -2.198487	  0.220877
 -0.743662	 -2.213777	  0.189776
 -0.708338	 -2.228305	  0.158847
 -0.671928	 -2.242800	  0.127004
 -0.636237	 -2.256704	  0.095917
 -0.598628	 -2.270836	  0.063476
 -0.563903	 -2.283422	  0.033759
 -0.529026	 -2.296753	  0.003946
 -0.490888	 -2.311474	 -0.027792
 -0.454164	 -2.324672	 -0.056190
 -0.417408	 -2.336606	 -0.085221
 -0.380197	 -2.347841	 -0.113426
 -0.343460	 -2.360058	 -0.142908
 -0.302334	 -2.370525	 -0.174545
 -0.266653	 -2.375102	 -0.210479
 -0.233014	 -2.386009	 -0.239575
 -0.197804	 -2.402735	 -0.271210
 -0.162296	 -2.418583	 -0.298938
 -0.126481	 -2.432024	 -0.331871
 -0.089115	 -2.447907	 -0.366908
 -0.055570	 -2.461172	 -0.399738
 -0.023602	 -2.474021	 -0.432394
  0.010092	 -2.486720	 -0.466392
  0.043468	 -2.498202	 -0.498083
  0.080890	 -2.510628	 -0.531175
  0.116574	 -2.522518	 -0.561727
  0.154091	 -2.535086	 -0.594563
  0.191181	 -2.550467	 -0.625970
  0.226884	 -2.566839	 -0.651683
  0.263880	 -2.580080	 -0.684657
  0.300693	 -2.592037	 -0.716547
  0.334914	 -2.612165	 -0.743768
  0.371171	 -2.627354	 -0.772041
  0.408082	 -2.642372	 -0.802072
  0.444614	 -2.657156	 -0.833018
  0.480618	 -2.671034	 -0.865394
  0.514639	 -2.683184	 -0.898045
  0.547869	 -2.694112	 -0.930250
  0.583038	 -2.705817	 -0.963782
  0.616958	 -2.720790	 -0.996772
  0.643598	 -2.739790	 -1.038909
  0.650034	 -2.767188	 -1.049298
