 -0.566085	  2.344477	  0.191720
 -0.575017	  2.353531	  0.197675
 -0.583949	  2.362585	  0.203630
 -0.566338	  2.348796	  0.194618
 -0.558730	  2.341915	  0.190514
 -0.541887	  2.325863	  0.181836
 -0.530444	  2.311875	  0.171055
 -0.520897	  2.299947	  0.159119
 -0.510028	  2.288350	  0.147682
 -0.501419	  2.276016	  0.136812
 -0.496878	  2.260165	  0.128268
 -0.494673	  2.240478	  0.112661
 -0.490371	  2.228392	  0.100460
 -0.486228	  2.216925	  0.087477
 -0.481162	  2.202339	  0.071639
 -0.481012	  2.192674	  0.061155
 -0.482735	  2.182954	  0.050948
 -0.483518	  2.167216	  0.033271
 -0.480572	  2.157027	  0.017944
 -0.480277	  2.147846	  0.000661
 -0.485422	  2.140743	 -0.014775
 -0.493599	  2.133585	 -0.032206
 -0.504888	  2.125611	 -0.050116
 -0.516188	  2.113711	 -0.064879
 -0.524082	  2.100989	 -0.075648
 -0.533011	  2.085741	 -0.089589
 -0.540744	  2.075640	 -0.101374
 -0.549064	  2.065745	 -0.113565
 -0.556984	  2.050771	 -0.131911
 -0.561323	  2.043625	 -0.143588
 -0.569569	  2.030565	 -0.160593
 -0.579009	  2.016531	 -0.175100
 -0.586510	  2.004885	 -0.184806
 -0.591928	  1.983462	 -0.196669
 -0.589032	  1.964455	 -0.200712
 -0.584599	  1.949626	 -0.203404
 -0.585640	  1.927201	 -0.201868
 -0.583603	  1.910062	 -0.190565
 -0.574667	  1.904809	 -0.174705
 -0.578388	  1.901923	 -0.175593
 -0.572892	  1.889911	 -0.161051
 -0.569849	  1.885704	 -0.151601
 -0.557220	  1.875413	 -0.124588
 -0.537570	  1.871737	 -0.109998
 -0.527694	  1.870851	 -0.099309
 -0.507028	  1.869053	 -0.078584
 -0.505581	  1.867428	 -0.067999
 -0.492465	  1.853346	 -0.047715
 -0.486300	  1.846997	 -0.034558
 -0.478082	  1.839024	 -0.022569
 -0.463505	  1.830688	 -0.005510
 -0.457598	  1.815699	  0.014543
 -0.453018	  1.799186	  0.030855
 -0.449657	  1.789880	  0.038715
 -0.445985	  1.776387	  0.049227
 -0.443876	  1.758037	  0.063041
 -0.446307	  1.744068	  0.077111
 -0.441940	  1.725956	  0.089668
 -0.434880	  1.716000	  0.103326
 -0.418591	  1.686300	  0.116832
 -0.412777	  1.669999	  0.129544
 -0.412347	  1.660681	  0.135223
 -0.408110	  1.652564	  0.143452
 -0.396346	  1.627165	  0.158473
 -0.391175	  1.613453	  0.166378
 -0.386103	  1.598699	  0.172996
 -0.373002	  1.578575	  0.175847
 -0.362293	  1.565989	  0.185060
 -0.361334	  1.555461	  0.183532
 -0.359748	  1.540263	  0.193644
 -0.336994	  1.515428	  0.190229
 -0.329964	  1.493155	  0.205780
 -0.317075	  1.478799	  0.209690
 -0.303974	  1.471627	  0.215444
 -0.288429	  1.461520	  0.201663
 -0.286201	  1.450131	  0.212914
 -0.269396	  1.432409	  0.210961
 -0.252026	  1.421887	  0.215545
 -0.237238	  1.410693	  0.209257
 -0.223632	  1.399868	  0.210716
 -0.208818	  1.380447	  0.207052
 -0.191851	  1.360875	  0.209708
 -0.187834	  1.352239	  0.209198
 -0.165303	  1.323643	  0.202771
 -0.156250	  1.312361	  0.198101
 -0.135803	  1.298118	  0.184597
 -0.126766	  1.290688	  0.170637
 -0.107266	  1.276721	  0.167864
 -0.094585	  1.264203	  0.162008
 -0.084687	  1.253900	  0.155143
 -0.071425	  1.241256	  0.142748
 -0.060567	  1.229873	  0.133843
 -0.052720	  1.217482	  0.122588
 -0.042662	  1.202040	  0.115770
 -0.033344	  1.195412	  0.107068
 -0.018853	  1.182918	  0.102898
 -0.015740	  1.175931	  0.094709
 -0.010504	  1.156816	  0.094522
 -0.007383	  1.140217	  0.097372
  0.000037	  1.127963	  0.104512
  0.016570	  1.107454	  0.109199
  0.024253	  1.097847	  0.115270
  0.034829	  1.087019	  0.122953
  0.052292	  1.073461	  0.130262
  0.069746	  1.058171	  0.139096
  0.084383	  1.043693	  0.145771
  0.098201	  1.032191	  0.150966
  0.108547	  1.018099	  0.155170
  0.119136	  0.999499	  0.157710
  0.129401	  0.979619	  0.160608
  0.138033	  0.963642	  0.164503
  0.151583	  0.946209	  0.169728
  0.168009	  0.928540	  0.167108
  0.179053	  0.914996	  0.166843
  0.187805	  0.897134	  0.172116
  0.193473	  0.873910	  0.183130
  0.198756	  0.854207	  0.190282
  0.202536	  0.838549	  0.191363
  0.210818	  0.810361	  0.193035
  0.217135	  0.787549	  0.194198
  0.224268	  0.779133	  0.192842
  0.230635	  0.766267	  0.188373
  0.240186	  0.750541	  0.169300
  0.256101	  0.726264	  0.162706
  0.271220	  0.711220	  0.150028
  0.283434	  0.694000	  0.141110
  0.292404	  0.673609	  0.139492
  0.297116	  0.653315	  0.135783
  0.308017	  0.640060	  0.121529
  0.321946	  0.624206	  0.105206
  0.336564	  0.612220	  0.089999
  0.345816	  0.602104	  0.078963
  0.351307	  0.586405	  0.064759
  0.356792	  0.573604	  0.045925
  0.358652	  0.569058	  0.030180
  0.364111	  0.558222	  0.002570
  0.369810	  0.552194	 -0.014583
  0.372453	  0.547195	 -0.032737
  0.379125	  0.545023	 -0.058786
  0.383579	  0.544270	 -0.074569
  0.389499	  0.541878	 -0.095154
  0.394287	  0.538889	 -0.121605
  0.395646	  0.538055	 -0.134483
  0.404331	  0.534530	 -0.156883
  0.414357	  0.531332	 -0.176339
  0.420488	  0.529910	 -0.189643
  0.427367	  0.528511	 -0.208829
  0.437631	  0.528698	 -0.228515
  0.448262	  0.531447	 -0.247343
  0.458480	  0.534208	 -0.263250
  0.470015	  0.535995	 -0.276699
  0.486451	  0.539430	 -0.294694
  0.501921	  0.539264	 -0.315131
  0.507638	  0.539165	 -0.320971
  0.510806	  0.534968	 -0.337260
  0.520460	  0.522180	 -0.356604
  0.535433	  0.510332	 -0.373905
  0.548354	  0.497115	 -0.395078
  0.552283	  0.494326	 -0.404616
  0.560602	  0.491713	 -0.422757
  0.568599	  0.489382	 -0.443009
  0.575959	  0.482132	 -0.456591
  0.585625	  0.474351	 -0.469951
  0.599284	  0.460063	 -0.494622
  0.603252	  0.455336	 -0.502882
  0.611861	  0.447176	 -0.512390
  0.624019	  0.439458	 -0.529075
  0.638773	  0.432931	 -0.538540
  0.655306	  0.427831	 -0.547227
  0.666985	  0.423142	 -0.553933
  0.681990	  0.419880	 -0.564214
  0.699427	  0.418751	 -0.572263
  0.710515	  0.416191	 -0.580198
  0.722707	  0.414728	 -0.583817
  0.743907	  0.409935	 -0.588432
  0.770711	  0.404809	 -0.599053
  0.786036	  0.399956	 -0.605217
  0.794032	  0.397021	 -0.613642
  0.810078	  0.393032	 -0.625001
  0.828364	  0.395293	 -0.634682
  0.853522	  0.401926	 -0.644679
  0.874746	  0.407042	 -0.652799
  0.884798	  0.408502	 -0.657756
  0.903470	  0.407327	 -0.666757
  0.924424	  0.402493	 -0.675419
  0.942546	  0.394834	 -0.679542
  0.964876	  0.389624	 -0.688673
  0.984658	  0.386378	 -0.693298
  0.998999	  0.383613	 -0.697011
  1.013683	  0.380018	 -0.701990
  1.033213	  0.370723	 -0.709126
  1.052816	  0.356740	 -0.715496
  1.065208	  0.354198	 -0.719831
  1.079636	  0.346518	 -0.725326
  1.099246	  0.334445	 -0.728803
  1.111156	  0.322544	 -0.729082
  1.125120	  0.307078	 -0.728840
  1.140676	  0.291212	 -0.729322
  1.154970	  0.279503	 -0.731862
  1.166085	  0.270092	 -0.737774
  1.178698	  0.252525	 -0.749581
  1.188904	  0.235190	 -0.755575
  1.196389	  0.222997	 -0.759567
  1.211583	  0.206310	 -0.764333
  1.229138	  0.191577	 -0.764075
  1.245447	  0.178787	 -0.760277
  1.263661	  0.167573	 -0.754716
  1.281684	  0.155732	 -0.758216
  1.302590	  0.144307	 -0.760448
  1.319001	  0.120287	 -0.769769
  1.318508	  0.099612	 -0.783258
  1.318531	  0.087436	 -0.804607
  1.334376	  0.068409	 -0.821499
  1.342896	  0.057402	 -0.825830
  1.354038	  0.041237	 -0.834707
  1.364915	  0.026811	 -0.844271
  1.375635	  0.015635	 -0.856139
  1.389937	  0.001655	 -0.869681
  1.403013	 -0.012670	 -0.878846
  1.410815	 -0.024510	 -0.885378
  1.419545	 -0.036970	 -0.898363
  1.430759	 -0.045146	 -0.911907
  1.447502	 -0.049161	 -0.925352
  1.468106	 -0.052964	 -0.935564
  1.488983	 -0.065003	 -0.947368
  1.500123	 -0.076757	 -0.955290
  1.511257	 -0.095019	 -0.962689
  1.518827	 -0.112053	 -0.968760
  1.525666	 -0.129001	 -0.970795
  1.536907	 -0.145752	 -0.977121
  1.552984	 -0.159383	 -0.988350
  1.561423	 -0.164739	 -0.998299
  1.572845	 -0.174976	 -1.010719
  1.585833	 -0.186783	 -1.020777
  1.598811	 -0.203418	 -1.031515
  1.612156	 -0.218201	 -1.038200
  1.620334	 -0.230986	 -1.043403
  1.632965	 -0.250708	 -1.046800
  1.643268	 -0.263730	 -1.050287
  1.655547	 -0.277063	 -1.052944
  1.670875	 -0.290568	 -1.061961
  1.684162	 -0.303798	 -1.066892
  1.698501	 -0.317859	 -1.070692
  1.714660	 -0.332739	 -1.078669
  1.726541	 -0.342576	 -1.085452
  1.737124	 -0.355334	 -1.098007
  1.755061	 -0.371670	 -1.109045
  1.768431	 -0.380488	 -1.112754
  1.784955	 -0.392284	 -1.113461
  1.797704	 -0.409979	 -1.113725
  1.809671	 -0.426504	 -1.119236
  1.821388	 -0.442231	 -1.124572
  1.831571	 -0.456541	 -1.131991
  1.842254	 -0.467700	 -1.137458
  1.854124	 -0.479964	 -1.142297
  1.864861	 -0.494676	 -1.149001
  1.877636	 -0.511128	 -1.155648
  1.891326	 -0.527433	 -1.164233
  1.906103	 -0.546145	 -1.171243
  1.920151	 -0.562600	 -1.179077
  1.931917	 -0.571887	 -1.186389
  1.942931	 -0.584617	 -1.194577
  1.953081	 -0.596547	 -1.202941
  1.966530	 -0.609868	 -1.209241
  1.983226	 -0.623859	 -1.217867
  1.998846	 -0.636571	 -1.229818
  2.012596	 -0.650190	 -1.251163
  2.008602	 -0.649707	 -1.288058
  2.021102	 -0.662224	 -1.297390
  2.033602	 -0.674741	 -1.306722
