 -2.463415	 -1.417048	  1.050932
 -2.439025	 -1.403018	  1.040527
 -2.389579	 -1.396697	  1.026231
 -2.342381	 -1.387513	  1.009742
 -2.300377	 -1.379974	  0.982493
 -2.252148	 -1.376623	  0.966741
 -2.205414	 -1.369773	  0.947711
 -2.161603	 -1.356617	  0.925243
 -2.113920	 -1.353696	  0.907487
 -2.068254	 -1.347102	  0.888872
 -2.022988	 -1.341281	  0.871886
 -1.978235	 -1.334612	  0.854757
 -1.933232	 -1.329124	  0.836456
 -1.887774	 -1.325042	  0.817592
 -1.842129	 -1.322158	  0.798468
 -1.796265	 -1.319262	  0.778631
 -1.750797	 -1.316610	  0.757753
 -1.705333	 -1.313695	  0.736689
 -1.660303	 -1.310527	  0.715797
 -1.615986	 -1.306468	  0.695397
 -1.572428	 -1.302138	  0.675785
 -1.528212	 -1.296959	  0.656360
 -1.482641	 -1.291117	  0.636252
 -1.436139	 -1.283871	  0.616123
 -1.390434	 -1.274939	  0.596228
 -1.346407	 -1.264422	  0.576828
 -1.302913	 -1.252527	  0.557628
 -1.258844	 -1.239818	  0.538652
 -1.214042	 -1.227017	  0.520723
 -1.169751	 -1.214058	  0.503832
 -1.126473	 -1.199774	  0.487503
 -1.085083	 -1.182294	  0.471101
 -1.046899	 -1.162356	  0.449776
 -1.004554	 -1.129162	  0.425279
 -0.955989	 -1.079888	  0.407094
 -0.912978	 -1.043665	  0.394676
 -0.838211	 -0.985014	  0.396580
 -0.764883	 -0.931262	  0.413027
 -0.716268	 -0.901887	  0.429747
 -0.675167	 -0.881182	  0.442253
 -0.631562	 -0.863536	  0.450782
 -0.592947	 -0.848896	  0.450423
 -0.531086	 -0.832453	  0.445082
 -0.467581	 -0.823121	  0.425631
 -0.421621	 -0.822215	  0.405509
 -0.378215	 -0.827411	  0.380623
 -0.335714	 -0.836927	  0.353964
 -0.303417	 -0.847636	  0.331313
 -0.263001	 -0.866899	  0.298665
 -0.222919	 -0.893735	  0.262522
 -0.186046	 -0.926046	  0.223654
 -0.147765	 -0.960778	  0.181564
 -0.101298	 -1.000318	  0.127758
 -0.053667	 -1.030527	  0.074815
 -0.016400	 -1.045556	  0.037450
  0.017943	 -1.052659	  0.009418
  0.056618	 -1.055014	 -0.015773
  0.099166	 -1.052334	 -0.038509
  0.145006	 -1.046117	 -0.059902
  0.191263	 -1.039172	 -0.081068
  0.235756	 -1.032262	 -0.100115
  0.279823	 -1.022842	 -0.116639
  0.324655	 -1.012112	 -0.133613
  0.369850	 -1.001116	 -0.154468
  0.404754	 -0.989735	 -0.184201
  0.420648	 -0.976526	 -0.221311
  0.432082	 -0.956498	 -0.287700
  0.455543	 -0.932809	 -0.397365
  0.482980	 -0.922222	 -0.473479
  0.513934	 -0.916227	 -0.525523
  0.553179	 -0.911393	 -0.568621
  0.598785	 -0.903910	 -0.608623
  0.644083	 -0.899750	 -0.640218
  0.690834	 -0.895306	 -0.669255
  0.734174	 -0.891377	 -0.692012
  0.775662	 -0.882942	 -0.710725
  0.825383	 -0.876138	 -0.726554
  0.880269	 -0.870555	 -0.736884
  0.933646	 -0.874019	 -0.738934
  0.985855	 -0.895246	 -0.736692
  1.036952	 -0.935269	 -0.733576
  1.100164	 -1.003114	 -0.741878
  1.152835	 -1.065464	 -0.762792
  1.203002	 -1.102843	 -0.781854
  1.253445	 -1.121770	 -0.802386
  1.306245	 -1.132671	 -0.834478
  1.343988	 -1.137222	 -0.861692
  1.389860	 -1.137440	 -0.895971
  1.431554	 -1.133267	 -0.928001
  1.461864	 -1.127425	 -0.941702
  1.519850	 -1.114264	 -0.948062
  1.583465	 -1.100032	 -0.939951
  1.635809	 -1.091803	 -0.936171
  1.677763	 -1.073381	 -0.934704
  1.721946	 -1.026073	 -0.925189
  1.766224	 -0.963549	 -0.894058
  1.834590	 -0.883731	 -0.839888
  1.900366	 -0.830246	 -0.825705
  1.952602	 -0.807655	 -0.838996
  1.999870	 -0.796810	 -0.858443
  2.046333	 -0.789364	 -0.879278
  2.091540	 -0.782806	 -0.900321
  2.135450	 -0.776847	 -0.921760
  2.179102	 -0.770948	 -0.943133
  2.223311	 -0.765083	 -0.964286
  2.268679	 -0.758977	 -0.985670
  2.314062	 -0.752884	 -1.007564
  2.358667	 -0.747267	 -1.028580
  2.402191	 -0.742171	 -1.049451
  2.445991	 -0.737019	 -1.069310
  2.490983	 -0.730347	 -1.086669
  2.536031	 -0.722680	 -1.106160
  2.581734	 -0.715220	 -1.126932
  2.629836	 -0.710082	 -1.140530
  2.668994	 -0.713666	 -1.169253
  2.695684	 -0.720802	 -1.180946
