 -0.799279	  0.555696	  2.280428
 -0.796671	  0.555758	  2.281931
 -0.813995	  0.555346	  2.271946
 -0.831319	  0.554935	  2.261961
 -0.848777	  0.553958	  2.252251
 -0.866327	  0.552531	  2.242766
 -0.883878	  0.551104	  2.233282
 -0.901426	  0.548693	  2.223996
 -0.918973	  0.546209	  2.214725
 -0.936475	  0.543400	  2.205464
 -0.953884	  0.539997	  2.196224
 -0.971292	  0.536595	  2.186987
 -0.988675	  0.532848	  2.177832
 -1.006049	  0.528964	  2.168718
 -1.023695	  0.526051	  2.159767
 -1.041737	  0.524984	  2.151198
 -1.059776	  0.523877	  2.142641
 -1.076183	  0.518612	  2.132494
 -1.092027	  0.512280	  2.122054
 -1.108773	  0.507093	  2.112432
 -1.127504	  0.505342	  2.105642
 -1.146239	  0.503606	  2.098852
 -1.163914	  0.498697	  2.090888
 -1.181012	  0.492525	  2.082535
 -1.197770	  0.487843	  2.072673
 -1.213684	  0.485368	  2.060807
 -1.229643	  0.482825	  2.049032
 -1.247543	  0.479186	  2.040894
 -1.265454	  0.475518	  2.032785
 -1.282777	  0.472965	  2.023121
 -1.299301	  0.471606	  2.011934
 -1.315898	  0.470123	  2.000878
 -1.333491	  0.466920	  1.991943
 -1.351073	  0.463077	  1.983268
 -1.368884	  0.458624	  1.975266
 -1.387020	  0.454617	  1.967681
 -1.405058	  0.451648	  1.959510
 -1.423672	  0.451636	  1.951640
 -1.442896	  0.451463	  1.944413
 -1.460031	  0.449812	  1.936262
 -1.478948	  0.451593	  1.928174
 -1.499226	  0.453135	  1.919559
 -1.514865	  0.452047	  1.911202
 -1.532746	  0.452436	  1.900500
 -1.549419	  0.437735	  1.887176
 -1.566902	  0.435586	  1.877704
