  1.734341	 -0.190238	  1.886372
  1.732771	 -0.181554	  1.904560
  1.734383	 -0.189750	  1.886666
  1.736173	 -0.197801	  1.870865
  1.736417	 -0.216912	  1.857798
  1.736332	 -0.236438	  1.839051
  1.737317	 -0.240600	  1.818603
  1.739429	 -0.232005	  1.792703
  1.742786	 -0.228210	  1.771857
  1.745935	 -0.235856	  1.755350
  1.750942	 -0.243020	  1.733153
  1.753237	 -0.255246	  1.711296
  1.754178	 -0.268204	  1.698308
  1.753784	 -0.282194	  1.690356
  1.757694	 -0.299836	  1.675179
  1.761926	 -0.316646	  1.662320
  1.765794	 -0.333024	  1.651039
  1.769244	 -0.348096	  1.638113
  1.772080	 -0.363547	  1.625731
  1.774378	 -0.379532	  1.613826
  1.776641	 -0.395537	  1.601743
  1.779344	 -0.409311	  1.587078
  1.780793	 -0.421782	  1.571894
  1.781096	 -0.436957	  1.556647
  1.784729	 -0.450588	  1.539742
  1.791149	 -0.459480	  1.522899
  1.797101	 -0.466996	  1.506474
  1.800944	 -0.477667	  1.490400
  1.804953	 -0.488455	  1.474361
  1.808892	 -0.500347	  1.458687
  1.812392	 -0.512663	  1.444075
  1.815412	 -0.524779	  1.428603
  1.817169	 -0.535644	  1.412482
  1.818363	 -0.545193	  1.395238
  1.819538	 -0.553177	  1.377014
  1.820300	 -0.559569	  1.357790
  1.819540	 -0.565663	  1.339253
  1.818950	 -0.570125	  1.319817
  1.818388	 -0.575187	  1.300809
  1.819583	 -0.581882	  1.281384
  1.824755	 -0.589579	  1.262372
  1.836945	 -0.596742	  1.244686
  1.855091	 -0.605323	  1.230666
  1.870476	 -0.615710	  1.222262
  1.883432	 -0.624069	  1.216860
  1.897703	 -0.636932	  1.207776
  1.909735	 -0.648647	  1.197143
  1.928244	 -0.652668	  1.192297
  1.947964	 -0.654714	  1.189360
  1.967577	 -0.657330	  1.186471
  1.987088	 -0.660716	  1.183371
  2.006755	 -0.664020	  1.180517
  2.026587	 -0.666660	  1.178042
  2.046544	 -0.667195	  1.175976
  2.066272	 -0.666886	  1.173819
  2.086213	 -0.667285	  1.171403
  2.106060	 -0.668607	  1.168888
  2.125829	 -0.670363	  1.166361
  2.145593	 -0.672157	  1.163880
  2.165359	 -0.673940	  1.161383
  2.185132	 -0.675588	  1.158798
  2.205015	 -0.675508	  1.156350
  2.224860	 -0.674279	  1.154192
