  1.223898	  2.179801	  0.336095
  1.227919	  2.188440	  0.340382
  1.220222	  2.171905	  0.332176
  1.212569	  2.155498	  0.323676
  1.205087	  2.139566	  0.314179
  1.197718	  2.123783	  0.304350
  1.190776	  2.108585	  0.293358
  1.184113	  2.093658	  0.281836
  1.178105	  2.079404	  0.269157
  1.172762	  2.065632	  0.255675
  1.168249	  2.052502	  0.241279
  1.164900	  2.040168	  0.225895
  1.162338	  2.028413	  0.209918
  1.161403	  2.017779	  0.193006
  1.161059	  2.007581	  0.175804
  1.162675	  1.998458	  0.158080
  1.164565	  1.989496	  0.140300
  1.168083	  1.981111	  0.122487
  1.171773	  1.972791	  0.104678
  1.176272	  1.964605	  0.086993
  1.181150	  1.956487	  0.069378
  1.186041	  1.948359	  0.051770
  1.191791	  1.939531	  0.034770
  1.197541	  1.930703	  0.017770
  1.203292	  1.921875	  0.000771
  1.209593	  1.911746	 -0.015282
  1.215950	  1.901484	 -0.031229
  1.222307	  1.891222	 -0.047175
  1.228836	  1.880089	 -0.062453
  1.235609	  1.867567	 -0.076501
  1.242381	  1.855045	 -0.090549
  1.249154	  1.842524	 -0.104596
  1.255997	  1.829518	 -0.118162
  1.263087	  1.814021	 -0.128629
  1.270178	  1.798523	 -0.139096
  1.277268	  1.783026	 -0.149564
  1.284358	  1.767529	 -0.160031
  1.291449	  1.751846	 -0.170218
  1.298189	  1.733570	 -0.174752
  1.304929	  1.715294	 -0.179286
  1.311669	  1.697018	 -0.183820
  1.318409	  1.678742	 -0.188355
  1.325149	  1.660466	 -0.192889
  1.331557	  1.641765	 -0.195925
  1.336731	  1.622508	 -0.194382
  1.341906	  1.603251	 -0.192840
  1.347081	  1.583993	 -0.191297
  1.352256	  1.564736	 -0.189755
  1.357431	  1.545479	 -0.188212
  1.362606	  1.526222	 -0.186670
  1.365286	  1.506889	 -0.182304
  1.367777	  1.487578	 -0.177735
  1.370269	  1.468267	 -0.173167
  1.372760	  1.448955	 -0.168599
  1.375252	  1.429644	 -0.164030
  1.377744	  1.410333	 -0.159462
  1.377171	  1.390807	 -0.155173
  1.375385	  1.371324	 -0.151023
  1.373600	  1.351840	 -0.146873
  1.371814	  1.332357	 -0.142724
  1.370029	  1.312874	 -0.138574
  1.367395	  1.293447	 -0.134620
  1.361162	  1.274684	 -0.131601
  1.354928	  1.255922	 -0.128581
  1.348695	  1.237160	 -0.125561
  1.342461	  1.218397	 -0.122541
  1.335766	  1.199753	 -0.119790
  1.326910	  1.181877	 -0.118365
  1.318055	  1.164001	 -0.116940
  1.309199	  1.146125	 -0.115515
  1.300344	  1.128249	 -0.114089
  1.291104	  1.110561	 -0.112764
  1.277641	  1.095771	 -0.112677
  1.264178	  1.080981	 -0.112590
  1.250716	  1.066191	 -0.112503
  1.237253	  1.051401	 -0.112415
  1.223790	  1.036612	 -0.112328
  1.208521	  1.023701	 -0.112743
  1.192880	  1.011247	 -0.113271
  1.177239	  0.998794	 -0.113799
  1.161598	  0.986341	 -0.114326
  1.145957	  0.973888	 -0.114854
  1.130021	  0.961803	 -0.114902
  1.114005	  0.949825	 -0.114813
  1.097989	  0.937847	 -0.114724
  1.081972	  0.925869	 -0.114636
  1.065904	  0.913962	 -0.114470
  1.049443	  0.902629	 -0.113694
  1.032982	  0.891297	 -0.112918
  1.016520	  0.879965	 -0.112142
  1.000059	  0.868632	 -0.111366
  0.983316	  0.857719	 -0.110606
  0.966509	  0.846904	 -0.109849
  0.949703	  0.836089	 -0.109092
  0.932880	  0.825298	 -0.108362
  0.915860	  0.814801	 -0.107964
  0.898840	  0.804305	 -0.107566
  0.881821	  0.793809	 -0.107167
  0.864738	  0.783407	 -0.107238
  0.847641	  0.773032	 -0.107435
  0.830544	  0.762657	 -0.107632
  0.813351	  0.752462	 -0.108328
  0.796140	  0.742307	 -0.109130
  0.778920	  0.732172	 -0.110006
  0.761645	  0.722195	 -0.111420
  0.744369	  0.712217	 -0.112833
  0.727147	  0.702213	 -0.114655
  0.709943	  0.692202	 -0.116609
  0.692947	  0.681899	 -0.118838
  0.676029	  0.671489	 -0.121168
  0.659472	  0.660553	 -0.123669
  0.642995	  0.649502	 -0.126197
  0.626933	  0.637870	 -0.128791
  0.610987	  0.626088	 -0.131414
  0.595460	  0.613779	 -0.134138
  0.580121	  0.601248	 -0.136907
  0.565253	  0.588184	 -0.139785
  0.550626	  0.574859	 -0.142697
  0.536511	  0.561006	 -0.145678
  0.522633	  0.546925	 -0.148697
  0.509280	  0.532361	 -0.151797
  0.496122	  0.517619	 -0.154881
  0.483525	  0.502383	 -0.157915
  0.471013	  0.487072	 -0.160915
  0.459184	  0.471177	 -0.163639
  0.447354	  0.455282	 -0.166363
  0.436293	  0.438823	 -0.168964
  0.425311	  0.422310	 -0.171552
  0.414786	  0.405498	 -0.174118
  0.404484	  0.388547	 -0.176673
  0.394403	  0.371471	 -0.179283
  0.384658	  0.354216	 -0.181976
  0.374927	  0.336953	 -0.184680
  0.365561	  0.319529	 -0.187629
  0.356196	  0.302105	 -0.190578
  0.346963	  0.284655	 -0.193780
  0.337807	  0.267192	 -0.197126
  0.328697	  0.249720	 -0.200553
  0.319763	  0.232218	 -0.204277
  0.310828	  0.214717	 -0.208001
  0.301996	  0.197213	 -0.211952
  0.293199	  0.179709	 -0.215981
  0.284429	  0.162203	 -0.220056
  0.275729	  0.144690	 -0.224253
  0.267030	  0.127177	 -0.228450
  0.258636	  0.109566	 -0.232855
  0.250309	  0.091935	 -0.237304
  0.242231	  0.074227	 -0.241909
  0.234436	  0.056439	 -0.246685
  0.226701	  0.038635	 -0.251499
  0.219316	  0.020741	 -0.256528
  0.211930	  0.002848	 -0.261557
  0.204742	 -0.015098	 -0.266680
  0.197605	 -0.033059	 -0.271828
  0.190538	 -0.051061	 -0.276922
  0.183573	 -0.069125	 -0.281941
  0.176607	 -0.087188	 -0.286960
  0.169620	 -0.105291	 -0.291807
  0.162633	 -0.123395	 -0.296646
  0.155521	 -0.141471	 -0.301410
  0.148236	 -0.159504	 -0.306069
  0.140950	 -0.177538	 -0.310728
  0.133339	 -0.195486	 -0.315195
  0.125658	 -0.213414	 -0.319621
  0.117894	 -0.231307	 -0.324044
  0.109816	 -0.249062	 -0.328459
  0.101737	 -0.266817	 -0.332873
  0.093301	 -0.284398	 -0.337318
  0.084596	 -0.301841	 -0.341784
  0.075891	 -0.319285	 -0.346250
  0.066713	 -0.336492	 -0.350685
  0.057486	 -0.353674	 -0.355117
  0.048164	 -0.370806	 -0.359545
  0.038601	 -0.387807	 -0.363963
  0.029038	 -0.404808	 -0.368381
  0.019492	 -0.421750	 -0.373052
  0.009954	 -0.438666	 -0.377835
  0.000491	 -0.455580	 -0.382771
 -0.008672	 -0.472475	 -0.388305
 -0.017835	 -0.489369	 -0.393839
 -0.026506	 -0.506301	 -0.400014
 -0.035056	 -0.523237	 -0.406341
 -0.043260	 -0.540199	 -0.413051
 -0.051086	 -0.557173	 -0.420165
 -0.058736	 -0.574158	 -0.427446
 -0.065757	 -0.591156	 -0.435304
 -0.072777	 -0.608155	 -0.443163
 -0.078990	 -0.625190	 -0.451601
 -0.085203	 -0.642226	 -0.460039
 -0.090886	 -0.659259	 -0.468847
 -0.096414	 -0.676288	 -0.477761
 -0.101716	 -0.693313	 -0.486818
 -0.106782	 -0.710330	 -0.496023
 -0.111823	 -0.727348	 -0.505242
 -0.116668	 -0.744363	 -0.514571
 -0.121512	 -0.761378	 -0.523899
 -0.126301	 -0.778288	 -0.533444
 -0.131065	 -0.795149	 -0.543088
 -0.135769	 -0.811941	 -0.552882
 -0.140328	 -0.828556	 -0.563038
 -0.144886	 -0.845172	 -0.573193
 -0.149047	 -0.861560	 -0.583876
 -0.153196	 -0.877941	 -0.594574
 -0.157467	 -0.894121	 -0.605528
 -0.161887	 -0.910040	 -0.616799
 -0.166308	 -0.925960	 -0.628069
 -0.171165	 -0.941463	 -0.639733
 -0.176472	 -0.956511	 -0.651791
 -0.181779	 -0.971560	 -0.663848
 -0.187267	 -0.986216	 -0.676301
 -0.193075	 -1.000118	 -0.689455
 -0.198883	 -1.014019	 -0.702608
 -0.204526	 -1.027590	 -0.716172
 -0.209777	 -1.040375	 -0.730628
 -0.215029	 -1.053159	 -0.745084
 -0.219881	 -1.065349	 -0.760180
 -0.224309	 -1.076891	 -0.775901
 -0.228737	 -1.088434	 -0.791623
 -0.233165	 -1.099976	 -0.807344
 -0.237593	 -1.111519	 -0.823066
 -0.246476	 -1.125162	 -0.834682
 -0.261407	 -1.138452	 -0.834015
 -0.276338	 -1.151743	 -0.833349
 -0.291269	 -1.165033	 -0.832683
 -0.306200	 -1.178323	 -0.832017
 -0.321131	 -1.191613	 -0.831351
 -0.336062	 -1.204903	 -0.830684
 -0.350992	 -1.218193	 -0.830018
 -0.365923	 -1.231483	 -0.829352
 -0.380854	 -1.244773	 -0.828686
 -0.396523	 -1.256342	 -0.833230
 -0.412198	 -1.267567	 -0.838548
 -0.427874	 -1.278791	 -0.843867
 -0.443550	 -1.290015	 -0.849186
 -0.459226	 -1.301239	 -0.854505
 -0.475253	 -1.309979	 -0.862674
 -0.491282	 -1.318568	 -0.870998
 -0.507312	 -1.327157	 -0.879322
 -0.523392	 -1.335697	 -0.887599
 -0.539513	 -1.344196	 -0.895837
 -0.555542	 -1.352524	 -0.904423
 -0.570624	 -1.359412	 -0.915606
 -0.585466	 -1.365949	 -0.927311
 -0.600094	 -1.372186	 -0.939440
 -0.614317	 -1.377033	 -0.952639
 -0.625143	 -1.390242	 -0.963046
 -0.626255	 -1.410209	 -0.963363
 -0.627367	 -1.430175	 -0.963680
 -0.629959	 -1.449896	 -0.961590
 -0.632696	 -1.469570	 -0.959261
 -0.635445	 -1.489229	 -0.956817
 -0.638248	 -1.508805	 -0.953827
 -0.641051	 -1.528380	 -0.950836
 -0.644814	 -1.547994	 -0.949764
 -0.648660	 -1.567600	 -0.948865
 -0.652748	 -1.587162	 -0.948077
 -0.657185	 -1.606653	 -0.947452
 -0.661623	 -1.626145	 -0.946827
 -0.666344	 -1.645574	 -0.946379
 -0.671357	 -1.664934	 -0.946114
 -0.676369	 -1.684294	 -0.945848
 -0.681479	 -1.703630	 -0.945847
 -0.686797	 -1.722902	 -0.946415
 -0.692115	 -1.742174	 -0.946983
 -0.697474	 -1.761429	 -0.947701
 -0.702967	 -1.780623	 -0.948897
 -0.708459	 -1.799816	 -0.950094
 -0.714161	 -1.818932	 -0.951540
 -0.720197	 -1.837910	 -0.953389
 -0.726232	 -1.856887	 -0.955237
 -0.732833	 -1.875616	 -0.957620
 -0.739624	 -1.894252	 -0.960183
 -0.746583	 -1.912806	 -0.962891
 -0.754143	 -1.931038	 -0.966119
 -0.761703	 -1.949271	 -0.969346
 -0.769772	 -1.967224	 -0.972892
 -0.778093	 -1.985030	 -0.976594
 -0.786456	 -2.002811	 -0.980322
 -0.795540	 -2.020137	 -0.984483
 -0.804623	 -2.037462	 -0.988645
 -0.813944	 -2.054608	 -0.993018
 -0.823621	 -2.071471	 -0.997708
 -0.833298	 -2.088334	 -1.002399
 -0.843301	 -2.104894	 -1.007470
 -0.853389	 -2.121371	 -1.012640
 -0.863283	 -2.137469	 -1.017746
 -0.873527	 -2.153741	 -1.023249
