 0.0 0.0 0.0 0
 0.23692001159070208 0.8445939963558654 0.2829890564414982 1000
 -0.9048243941576183 -0.4050919983931267 -0.26995727458776586 1000
 -0.9717370117002951 0.23014420476430186 0.15430952479839974 1000
 -0.61009611561144 -0.7864685218664396 -0.49530889312915916 1000
 -0.3535725940853971 -0.4518573135647224 0.1114152862698573 1000
 -0.11012866685754871 0.561150854808862 0.7131376914629932 1000
 0.3398182297369275 -0.60883479877098 -0.05615946141549697 1000
 0.4043306136249313 0.1827192790464607 0.5000292992823956 1000
 0.0 0.0 0.0 0
 0.35883033912598405 -0.25273900193647897 -0.5720579204961302 1000
 -0.24122094891595383 -0.6780401163366141 -0.08599541461816629 1000
 0.898705880210004 -0.4338263567479642 -0.32287210311797054 1000
 -0.045784214065528656 -0.2378162434262703 -0.5800977418749524 1000
 0.36182237137563644 0.9210803510207421 0.606773182650773 1000
 -0.7187889417013803 -0.17961237572521177 -0.3846659843343566 1000
 -0.49328152730097796 0.6624986874774207 0.16350936161784244 1000
 -0.04099229980630273 -0.9364365707180459 -0.7199054727738189 1000
 0.0 0.0 0.0 0
 0.9140418585317542 -0.33094583142200296 -0.12865822940956134 1000
 -0.7977853652951492 0.456657742585837 0.4836476725250406 1000
 -0.9964211112502148 -0.06623130220635234 0.022393759728275148 1000
 0.5814721103002707 0.6882803146802765 0.5891082774369734 1000
 -0.14134133690730638 0.1393573594193458 -0.3536527622701394 1000
 -0.14196528947154305 -0.987388617498568 -0.5597066088266958 1000
 -0.659891147119086 -0.6389832194295999 -0.1815698132222033 1000
 0.5566151929066343 0.07282233083779965 -0.35139038337804995 1000
 0.0 0.0 0.0 0
