 -0.575597	  1.257259	  2.082784
 -0.575597	  1.257259	  2.082784
 -0.563299	  1.250724	  2.078188
 -0.542770	  1.230868	  2.064851
 -0.532800	  1.217839	  2.050670
 -0.527366	  1.211161	  2.043349
 -0.514546	  1.196947	  2.027672
 -0.502114	  1.186187	  2.013186
 -0.494443	  1.180259	  2.004956
 -0.481304	  1.170268	  1.988931
 -0.468737	  1.159367	  1.968082
 -0.463303	  1.152302	  1.956585
 -0.458291	  1.141799	  1.941438
 -0.446900	  1.124644	  1.916016
 -0.443054	  1.117922	  1.906406
 -0.439967	  1.109925	  1.894732
 -0.432218	  1.097994	  1.878596
 -0.424542	  1.088361	  1.859634
 -0.418431	  1.076178	  1.841207
 -0.410324	  1.059396	  1.825840
 -0.401864	  1.044962	  1.817600
 -0.393097	  1.031883	  1.808617
 -0.382483	  1.014788	  1.796100
 -0.370713	  1.001402	  1.787237
 -0.361205	  0.990819	  1.776055
 -0.351752	  0.974875	  1.760860
 -0.342357	  0.959484	  1.750931
 -0.334739	  0.946548	  1.744120
 -0.326610	  0.927866	  1.734598
 -0.316420	  0.909438	  1.727326
 -0.307039	  0.896818	  1.722569
 -0.296776	  0.878890	  1.713771
 -0.284349	  0.859975	  1.707081
 -0.271862	  0.846067	  1.704419
 -0.259245	  0.832790	  1.700421
 -0.248198	  0.815171	  1.694756
 -0.238442	  0.798036	  1.690673
 -0.227841	  0.782688	  1.688208
 -0.217354	  0.770880	  1.683757
 -0.198522	  0.750581	  1.676595
 -0.188175	  0.733714	  1.671255
 -0.181872	  0.722540	  1.668128
 -0.173608	  0.702628	  1.661293
 -0.163938	  0.685721	  1.653926
 -0.155811	  0.673367	  1.646798
 -0.142050	  0.654209	  1.634477
 -0.129948	  0.641129	  1.625313
 -0.122315	  0.633259	  1.618869
 -0.109782	  0.617977	  1.606139
 -0.101224	  0.604344	  1.594499
 -0.093777	  0.591345	  1.583766
 -0.085055	  0.579543	  1.568881
 -0.076854	  0.573686	  1.552734
 -0.065680	  0.567095	  1.535804
 -0.046154	  0.555724	  1.514456
 -0.038955	  0.549899	  1.506698
 -0.029438	  0.540362	  1.499480
 -0.014084	  0.525270	  1.486475
 -0.000415	  0.514236	  1.474111
  0.012877	  0.507129	  1.457995
  0.023057	  0.499750	  1.442403
  0.030351	  0.496117	  1.434384
  0.045295	  0.485147	  1.417139
  0.055867	  0.475189	  1.402167
  0.065738	  0.457227	  1.386340
  0.072777	  0.447878	  1.375217
  0.082366	  0.439369	  1.362677
  0.093426	  0.432203	  1.350981
  0.103911	  0.427785	  1.336738
  0.116900	  0.423678	  1.323306
  0.129403	  0.416889	  1.307867
  0.145132	  0.403701	  1.289371
  0.153840	  0.388252	  1.273975
  0.156427	  0.373724	  1.257019
  0.156617	  0.364588	  1.242095
  0.149000	  0.362297	  1.217147
  0.142813	  0.360679	  1.191691
  0.141828	  0.357386	  1.174659
  0.142982	  0.351611	  1.160894
  0.145260	  0.339572	  1.142512
  0.146932	  0.328881	  1.125494
  0.146771	  0.319657	  1.106948
  0.143980	  0.315737	  1.084048
  0.138966	  0.315470	  1.058232
  0.136604	  0.315285	  1.039471
  0.135149	  0.314825	  1.027784
  0.132891	  0.312073	  1.009456
  0.129351	  0.302878	  0.985896
  0.124448	  0.292760	  0.959362
  0.123243	  0.288006	  0.949774
  0.121735	  0.283125	  0.935146
  0.126016	  0.271394	  0.914936
  0.132422	  0.259071	  0.903395
  0.137808	  0.242996	  0.891268
  0.140592	  0.232403	  0.880534
  0.142899	  0.218512	  0.866384
  0.150530	  0.203449	  0.853161
  0.162329	  0.186865	  0.846717
  0.174236	  0.170332	  0.839255
  0.190593	  0.155787	  0.832341
  0.204645	  0.147289	  0.827778
  0.212614	  0.135353	  0.819330
  0.222202	  0.117974	  0.815346
  0.228138	  0.106968	  0.813426
  0.236077	  0.089379	  0.807714
  0.252289	  0.071842	  0.808740
  0.263242	  0.063768	  0.811991
  0.280593	  0.055402	  0.818821
  0.306383	  0.045713	  0.827834
  0.321715	  0.041809	  0.834655
  0.337990	  0.040032	  0.843927
  0.358045	  0.024895	  0.854563
  0.367196	  0.018652	  0.858618
  0.380970	  0.006895	  0.866095
  0.401376	 -0.007971	  0.873470
  0.418477	 -0.018993	  0.876666
  0.432751	 -0.029494	  0.877398
  0.450856	 -0.042438	  0.879928
  0.467988	 -0.061531	  0.882951
  0.477952	 -0.075682	  0.885042
  0.487413	 -0.094035	  0.884184
  0.498821	 -0.107861	  0.881152
  0.515903	 -0.117278	  0.885297
  0.534382	 -0.126511	  0.893648
  0.547746	 -0.139915	  0.903374
  0.556658	 -0.155602	  0.910433
  0.566348	 -0.171124	  0.916599
  0.579314	 -0.185606	  0.924616
  0.590303	 -0.201934	  0.931595
  0.603759	 -0.217952	  0.936784
  0.619583	 -0.231009	  0.937063
  0.634595	 -0.243696	  0.935215
  0.648027	 -0.259122	  0.933736
  0.660443	 -0.274435	  0.929873
  0.671079	 -0.291002	  0.925028
  0.681794	 -0.307383	  0.917795
  0.695322	 -0.321108	  0.909570
  0.710352	 -0.330963	  0.902181
  0.723333	 -0.343261	  0.892628
  0.735738	 -0.355161	  0.881983
  0.749662	 -0.361757	  0.870798
  0.764456	 -0.370043	  0.859915
  0.782433	 -0.383228	  0.848757
  0.794306	 -0.394972	  0.837994
  0.800654	 -0.405012	  0.828437
  0.808568	 -0.419239	  0.813715
  0.824642	 -0.431710	  0.798361
  0.838522	 -0.437976	  0.791991
  0.856789	 -0.446393	  0.786088
  0.872391	 -0.456070	  0.775501
  0.885140	 -0.464313	  0.764443
  0.900327	 -0.473338	  0.751537
  0.915890	 -0.482140	  0.740592
  0.928673	 -0.490192	  0.735327
  0.950471	 -0.508303	  0.728914
  0.964532	 -0.521962	  0.719156
  0.972690	 -0.529634	  0.712241
  0.981277	 -0.541920	  0.696476
  0.988313	 -0.559728	  0.684614
  0.998698	 -0.575267	  0.675973
  1.009986	 -0.590485	  0.667225
  1.018183	 -0.607670	  0.661124
  1.028012	 -0.623656	  0.653478
  1.038283	 -0.638830	  0.645097
  1.047042	 -0.654810	  0.636510
  1.054280	 -0.670591	  0.627247
  1.056789	 -0.688899	  0.623604
  1.055159	 -0.710302	  0.623416
  1.056463	 -0.728894	  0.619817
  1.058648	 -0.743042	  0.619582
  1.059093	 -0.761798	  0.621966
  1.058564	 -0.781348	  0.623470
  1.060911	 -0.800494	  0.621636
  1.061052	 -0.819813	  0.626264
  1.060135	 -0.838259	  0.634392
  1.060811	 -0.856333	  0.642701
  1.060710	 -0.874501	  0.651306
  1.061898	 -0.892699	  0.659878
  1.065028	 -0.910695	  0.668236
  1.068955	 -0.928419	  0.676604
  1.072633	 -0.946176	  0.685050
  1.076123	 -0.963897	  0.693588
  1.079941	 -0.981396	  0.702738
  1.085116	 -0.999451	  0.710291
  1.090321	 -1.017877	  0.716640
  1.095250	 -1.036859	  0.720995
  1.100289	 -1.055808	  0.724404
  1.106961	 -1.073873	  0.729631
  1.116097	 -1.090001	  0.737167
  1.125388	 -1.105924	  0.744916
  1.134761	 -1.121663	  0.752662
  1.144140	 -1.135915	  0.759786
  1.154518	 -1.149136	  0.763113
  1.179339	 -1.164626	  0.768565
  1.198718	 -1.174489	  0.783544
  1.205483	 -1.178050	  0.790770
  1.218868	 -1.185189	  0.805304
  1.235642	 -1.194105	  0.815055
  1.251809	 -1.201993	  0.818834
  1.271659	 -1.211602	  0.824069
  1.287150	 -1.218163	  0.831377
  1.301994	 -1.223948	  0.841833
  1.325567	 -1.233094	  0.856943
  1.333663	 -1.236193	  0.862123
  1.351690	 -1.242946	  0.872849
  1.373999	 -1.251496	  0.885692
  1.387107	 -1.256434	  0.892039
  1.403773	 -1.262765	  0.891269
  1.426038	 -1.269743	  0.890511
  1.445586	 -1.276025	  0.894966
  1.463790	 -1.283028	  0.899871
  1.481726	 -1.290278	  0.904661
  1.499335	 -1.297575	  0.909436
  1.509761	 -1.313794	  0.906826
  1.512464	 -1.332092	  0.899696
  1.514598	 -1.350502	  0.892233
  1.516473	 -1.368636	  0.884309
  1.515432	 -1.382641	  0.870408
  1.511620	 -1.390508	  0.852555
  1.507568	 -1.397911	  0.834432
  1.503519	 -1.405305	  0.816297
  1.499545	 -1.412757	  0.798171
  1.495636	 -1.420327	  0.780063
  1.491392	 -1.427386	  0.761855
  1.486005	 -1.431562	  0.743089
  1.479410	 -1.432105	  0.724239
  1.472776	 -1.432524	  0.705407
  1.465875	 -1.434117	  0.686654
  1.458394	 -1.435032	  0.668006
  1.451391	 -1.434189	  0.649312
  1.445151	 -1.433679	  0.630269
  1.439945	 -1.432567	  0.610937
  1.436928	 -1.428578	  0.591521
  1.434273	 -1.424276	  0.572182
  1.431371	 -1.420058	  0.552841
  1.428521	 -1.415913	  0.533546
  1.425454	 -1.414237	  0.514214
  1.421052	 -1.416236	  0.493692
  1.415175	 -1.415571	  0.472339
  1.412957	 -1.411601	  0.451184
  1.415351	 -1.403990	  0.429477
  1.421817	 -1.390460	  0.411441
  1.429487	 -1.376207	  0.397008
  1.434484	 -1.367030	  0.382945
  1.431152	 -1.357109	  0.364777
  1.423019	 -1.345556	  0.345996
  1.418808	 -1.333315	  0.325668
  1.422949	 -1.323826	  0.307082
  1.432266	 -1.315447	  0.290073
  1.445268	 -1.309259	  0.272432
  1.460011	 -1.302960	  0.255532
  1.475331	 -1.297724	  0.239548
  1.486442	 -1.294651	  0.226360
  1.494107	 -1.291358	  0.207807
  1.500983	 -1.293414	  0.187409
  1.517804	 -1.302528	  0.169116
  1.535861	 -1.303857	  0.154512
  1.545912	 -1.302375	  0.146824
  1.561096	 -1.301206	  0.131457
  1.575163	 -1.303279	  0.114966
  1.589158	 -1.312358	  0.105466
  1.607701	 -1.326204	  0.101551
  1.630799	 -1.334261	  0.092832
  1.646778	 -1.338393	  0.080871
  1.654456	 -1.342362	  0.073078
  1.661413	 -1.354574	  0.057484
  1.672323	 -1.366329	  0.037514
  1.685429	 -1.369072	  0.022813
  1.700425	 -1.370158	  0.009797
  1.721675	 -1.374504	 -0.004697
  1.747305	 -1.384938	 -0.021448
  1.765837	 -1.398209	 -0.028922
  1.777313	 -1.407278	 -0.030507
  1.790911	 -1.426436	 -0.033399
  1.805177	 -1.451223	 -0.034028
  1.810378	 -1.469044	 -0.032474
  1.815407	 -1.489141	 -0.029990
  1.824396	 -1.510004	 -0.031091
  1.833003	 -1.524968	 -0.036045
  1.844782	 -1.539220	 -0.043264
  1.858441	 -1.560341	 -0.048199
  1.864338	 -1.579412	 -0.053548
  1.867539	 -1.596366	 -0.056439
  1.876525	 -1.614323	 -0.062364
  1.888229	 -1.636196	 -0.086324
  1.889618	 -1.640404	 -0.098070
