 0.0 0.0 0.0 0
 0.15942456172567432 0.7678838996643713 0.6093293744840718 1000
 -0.5374558863957335 0.8274761413290989 -0.11429587492423515 1000
 -0.7005772939970644 -0.5954509418013146 -0.35926211425088395 1000
 0.1592517458570724 -0.7869157460346267 0.5528481273039985 1000
 -0.440198941784163 0.033780740714110746 0.8918598612122683 1000
 -0.7421122006925618 -0.6625927204879617 0.11739115020811912 1000
 0.16846569362142227 -0.5465101402234955 -0.8140637535129236 1000
 0.7201648114622845 -0.5284485477543717 0.3886425570023003 1000
 0.0 0.0 0.0 0
 -0.3547667096207547 -0.6985435680204676 0.6052740282164595 1000
 0.505510817929766 0.4015291345133891 0.7241509673885874 1000
 0.662423192105845 -0.6760233919104025 -0.3602645130254514 1000
 -0.9563291297052207 0.18054738322189873 -0.17273820881948707 1000
 -0.4788943074188082 -0.04003269322787087 -0.8269514006350951 1000
 -0.6045635841836147 -0.6745905954441835 0.4253328312777923 1000
 -0.454926775394493 0.6260590894925814 -0.577808848054129 1000
 0.1994586529891979 -0.23069520877226013 -0.9369116319336246 1000
 0.0 0.0 0.0 0
 0.05815500049575095 0.6383592696422709 -0.7336585160343922 1000
 0.9179165208352027 0.25284860945260945 -0.3363101572509123 1000
 -0.7230025425134017 -0.22574322810421968 -0.6014776024932659 1000
 -0.1567709141393414 -0.5181406593048837 -0.8177848099397724 1000
 -0.09918023919824118 0.41114208097589533 -0.8642927100759823 1000
 -0.10256742240210795 0.8095140480064564 0.5824287847794408 1000
 0.8365718816075958 0.489100156358122 -0.26778169240395217 1000
 0.4878890165062775 -0.7655167376132764 0.36666475631964884 1000
 0.0 0.0 0.0 0
 0.566400602502276 -0.36722735159222814 0.6789328605966463 1000
 0.5901597341119618 -0.6027785644264403 -0.5614331457017242 1000
 0.532539153092045 0.5373746574553827 -0.6485078793461032 1000
 0.3594582894562859 0.2794487483145761 0.8501741193802896 1000
 -0.6349204641100452 0.7651947937477042 0.1531805255850086 1000
 0.9755795561495799 0.07316858044736613 0.15296274073931357 1000
 0.5171197625989589 0.7701272603014809 0.3516196342840312 1000
 -0.3039719495231109 0.11704858428004927 -0.8984179546827789 1000
 0.0 0.0 0.0 0
 0.856742166963198 0.10763866600788657 -0.5282900031977324 1000
 -0.15863853035585357 0.9807028546113256 0.1365796421989176 1000
 0.5702548499188499 0.7932542846592039 -0.21828121622402608 1000
 -0.01840013515305572 0.3876329894758839 0.9015921290844047 1000
 -0.7859466626288902 0.31224052843999295 0.561432893468035 1000
 0.8286179510121814 -0.04216676832071106 0.4987791105280268 1000
 0.49248570772453204 0.16116606361530922 -0.8495943175517743 1000
 -0.8085482542410005 0.5600681874683552 0.22694017482181933 1000
 0.0 0.0 0.0 0
 -0.9182208105898768 -0.3922203789541765 0.09127792922489064 1000
 0.3165149577147372 0.5921588559363188 0.7147723628202383 1000
 0.7445357634222262 0.6457470492139834 0.1387877377055184 1000
 -0.04033104132066989 0.08573486812828413 0.9679757116048995 1000
 0.3138587192049342 -0.9420628882952057 0.08195255383533068 1000
 -0.9651351856726527 0.2579505441059937 0.014745409568666878 1000
 -0.7356201587051336 -0.5295729981324273 0.4344622010162196 1000
 0.4260044561935126 0.9045995693232816 0.02777413375888832 1000
 0.0 0.0 0.0 0
 0.6589805363690582 -0.4490688526853217 0.5428097144347152 1000
 0.03634237581269395 0.2688641607453637 -0.928230702976717 1000
 -0.07402265426392415 -0.986843688984657 -0.1608982028177433 1000
 0.9350657054510847 -0.25979952747538526 -0.2840794618421642 1000
 0.11616834342580612 -0.8990519603113407 -0.4321886226266007 1000
 -0.19240803336152185 -0.9581262914535891 0.1940925321820313 1000
 0.08143298184120595 -0.5674734896196478 0.7784630798723045 1000
 -0.5078550796833547 0.8379360964672797 0.23597774035898705 1000
 0.0 0.0 0.0 0
 -0.8264639508004551 -0.563300328758404 0.02883314388662588 1000
 -0.5517702087672517 -0.25053812319596963 -0.7480879053850146 1000
 0.4887671314257307 0.6921411636116717 -0.5248647939667438 1000
 0.41598656054019034 -0.8683869041836463 0.22344206180723886 1000
