  1.103859	 -1.705254	  1.464528
  1.116927	 -1.726428	  1.466621
  1.103132	 -1.704075	  1.464412
  1.075558	 -1.660512	  1.458947
  1.047512	 -1.617475	  1.452404
  1.019102	 -1.575122	  1.444553
  0.990368	 -1.533426	  1.435259
  0.961421	 -1.492620	  1.424330
  0.932364	 -1.453087	  1.412299
  0.903810	 -1.414486	  1.401509
  0.875391	 -1.375863	  1.392231
  0.847439	 -1.337386	  1.384224
  0.819470	 -1.298119	  1.377169
  0.792749	 -1.259078	  1.371247
  0.765320	 -1.218159	  1.367002
  0.733092	 -1.175335	  1.362087
  0.702860	 -1.132690	  1.349288
  0.668347	 -1.101668	  1.343972
  0.638498	 -1.068837	  1.342986
  0.611968	 -1.029894	  1.342169
  0.585522	 -0.987758	  1.342786
  0.556389	 -0.945877	  1.344862
  0.525918	 -0.904896	  1.347240
  0.493509	 -0.863525	  1.349215
  0.459104	 -0.821041	  1.348017
  0.423698	 -0.778586	  1.341319
  0.388902	 -0.738290	  1.329460
  0.356062	 -0.699713	  1.314627
  0.325931	 -0.661858	  1.297563
  0.298939	 -0.626074	  1.280210
  0.275776	 -0.590354	  1.266067
  0.253562	 -0.550873	  1.255586
  0.230113	 -0.507991	  1.246849
  0.206260	 -0.464015	  1.239338
  0.182667	 -0.419881	  1.232296
  0.159565	 -0.376238	  1.224871
  0.136940	 -0.333219	  1.217724
  0.112873	 -0.289154	  1.210741
  0.085889	 -0.244429	  1.203402
  0.056166	 -0.200928	  1.194564
  0.024883	 -0.159808	  1.184227
 -0.006516	 -0.120422	  1.172391
 -0.037767	 -0.081867	  1.159528
 -0.068812	 -0.044724	  1.148220
 -0.099580	 -0.007875	  1.140505
 -0.129954	  0.029537	  1.134638
 -0.160075	  0.067238	  1.130211
 -0.189656	  0.104283	  1.127814
 -0.219506	  0.141960	  1.127551
 -0.249966	  0.180794	  1.129205
 -0.280799	  0.220437	  1.131267
 -0.311344	  0.260089	  1.133430
 -0.341895	  0.299885	  1.135963
 -0.373535	  0.339809	  1.138833
 -0.405564	  0.378831	  1.140923
 -0.439226	  0.419176	  1.141547
 -0.473796	  0.461782	  1.138240
 -0.509280	  0.504782	  1.128632
 -0.550613	  0.547278	  1.108259
 -0.606160	  0.572703	  1.079027
 -0.680891	  0.571905	  1.061156
 -0.774943	  0.556922	  1.053075
 -0.881553	  0.535448	  1.044808
 -0.990680	  0.519676	  1.032849
 -1.090346	  0.509487	  1.012744
 -1.170768	  0.506717	  0.993140
 -1.232744	  0.514429	  0.981110
 -1.276166	  0.530084	  0.976885
 -1.306804	  0.552840	  0.978313
 -1.336281	  0.592970	  0.985500
 -1.364131	  0.656590	  0.996898
 -1.381783	  0.739321	  1.012029
 -1.385644	  0.830068	  1.025758
 -1.375760	  0.915717	  1.033932
 -1.353771	  0.991692	  1.037063
 -1.329936	  1.058238	  1.039125
 -1.307899	  1.117679	  1.041300
 -1.286321	  1.176519	  1.044107
 -1.264819	  1.239411	  1.046795
 -1.246578	  1.304683	  1.048204
 -1.234687	  1.368779	  1.048354
 -1.230705	  1.428185	  1.046294
 -1.233727	  1.482373	  1.042801
 -1.243763	  1.536197	  1.039180
 -1.262556	  1.591612	  1.034774
 -1.289773	  1.644614	  1.027754
 -1.322828	  1.692369	  1.018289
 -1.359023	  1.734518	  1.007492
 -1.397037	  1.772516	  0.996153
 -1.450930	  1.820545	  0.978093
 -1.472312	  1.839360	  0.970081
