 0.0 0.0 0.0 0
 -0.012899112071816876 -0.6096470325943456 -0.40444070409457256 1000
 -0.20353097131071285 -0.11293758069652796 -0.5538596061527785 1000
 0.9985876829187439 0.0050007257301702135 -0.261301178236581 1000
 -0.24306502993136225 0.18057607224450042 0.663369480955236 1000
 -0.7490444514528174 -0.6428716078588159 0.44665457870984887 1000
 -0.705548074214129 0.4854611271049839 -0.21267833673278166 1000
 -0.2387656917545293 0.9165988013937152 -0.3017550983750027 1000
 0.2167433381716744 0.7212547456597591 0.23518151163816153 1000
 0.0 0.0 0.0 0
 -0.03315575535940629 -0.9252908074006432 0.42291033557330526 1000
 0.6359082558679786 -0.17462626156405045 0.33109489914339235 1000
 0.8588955952795008 -0.5113808428912392 -0.16453752938295996 1000
 -0.8092224069930373 -0.5009843879784757 0.13315820069555828 1000
