 -1.208762	  2.776875	 -0.093599
 -1.196794	  2.749381	 -0.092672
 -1.174319	  2.730614	 -0.047749
 -1.166838	  2.693991	 -0.010064
 -1.162025	  2.656919	  0.024558
 -1.159497	  2.618887	  0.057743
 -1.157994	  2.579838	  0.089374
 -1.156194	  2.540003	  0.118613
 -1.153410	  2.500109	  0.146152
 -1.148771	  2.458656	  0.173061
 -1.142222	  2.416409	  0.199438
 -1.134342	  2.375603	  0.224857
 -1.122334	  2.333878	  0.252415
 -1.103115	  2.291442	  0.276547
 -1.090881	  2.253865	  0.307878
 -1.079801	  2.220544	  0.339380
 -1.075232	  2.177745	  0.360140
 -1.059376	  2.136535	  0.384300
 -1.051216	  2.093877	  0.412260
 -1.038939	  2.058219	  0.445856
 -1.027549	  2.023250	  0.480012
 -1.025971	  1.989200	  0.517806
 -1.023423	  1.959947	  0.558057
 -1.019384	  1.934526	  0.599291
 -1.014825	  1.907458	  0.641755
 -1.012024	  1.876401	  0.683591
 -1.012712	  1.839138	  0.720071
 -1.014769	  1.802029	  0.754141
 -1.014072	  1.765677	  0.791990
 -1.009402	  1.727148	  0.829409
 -0.999343	  1.687192	  0.863548
 -0.984302	  1.646422	  0.894162
 -0.970283	  1.609072	  0.920917
 -0.962525	  1.580568	  0.944134
 -0.959784	  1.560710	  0.969187
 -0.964253	  1.538942	  1.023552
 -0.991238	  1.546935	  1.123637
 -1.024581	  1.536704	  1.200349
 -1.148804	  1.544893	  1.300901
 -1.248327	  1.541705	  1.383193
 -1.339628	  1.531547	  1.465057
 -1.423234	  1.476708	  1.547042
 -1.430651	  1.402239	  1.581117
 -1.417366	  1.351569	  1.595038
 -1.389069	  1.278509	  1.606873
 -1.359981	  1.208427	  1.610148
 -1.332445	  1.153150	  1.609689
 -1.292487	  1.092145	  1.607091
 -1.233755	  1.026046	  1.594242
 -1.143319	  0.961460	  1.543276
 -1.012419	  0.915625	  1.448532
 -0.884863	  0.858172	  1.409976
 -0.818954	  0.792989	  1.441325
 -0.795122	  0.747530	  1.475189
 -0.783664	  0.710161	  1.506748
 -0.776146	  0.673440	  1.539298
 -0.770267	  0.637090	  1.571674
 -0.765791	  0.601291	  1.602316
 -0.761182	  0.563036	  1.632943
 -0.755073	  0.522568	  1.664347
 -0.748462	  0.484516	  1.693702
 -0.741457	  0.447419	  1.722284
 -0.732452	  0.409656	  1.751211
 -0.722836	  0.370005	  1.781983
 -0.714518	  0.332749	  1.811821
 -0.707263	  0.294109	  1.843633
 -0.700528	  0.256251	  1.874891
 -0.691196	  0.215034	  1.902730
 -0.676089	  0.177754	  1.931347
 -0.664884	  0.150303	  1.972172
 -0.654664	  0.121625	  2.012253
 -0.646702	  0.088332	  2.051054
 -0.634994	  0.048845	  2.083921
 -0.623042	  0.008520	  2.110025
 -0.612563	 -0.028249	  2.136674
 -0.603947	 -0.067018	  2.166944
 -0.596751	 -0.108662	  2.197142
 -0.587054	 -0.148713	  2.226874
 -0.575286	 -0.186168	  2.256475
 -0.562815	 -0.223095	  2.286313
 -0.551178	 -0.262272	  2.315844
 -0.541273	 -0.302907	  2.343604
 -0.532514	 -0.342238	  2.369544
 -0.523837	 -0.381601	  2.395541
 -0.515345	 -0.422367	  2.422846
 -0.507522	 -0.464387	  2.451572
 -0.501605	 -0.505908	  2.480671
 -0.497560	 -0.546925	  2.510032
 -0.493914	 -0.586189	  2.538412
 -0.488986	 -0.626539	  2.567698
 -0.482955	 -0.665808	  2.597285
 -0.476723	 -0.704778	  2.628142
 -0.471716	 -0.741651	  2.660175
 -0.469838	 -0.775159	  2.697187
 -0.466676	 -0.811558	  2.731312
 -0.457948	 -0.850933	  2.758478
 -0.454283	 -0.884879	  2.793769
 -0.449539	 -0.930721	  2.816323
 -0.454034	 -0.940028	  2.844486
