  1.690460	 -0.915325	  1.560290
  1.706798	 -0.930858	  1.571733
  1.689842	 -0.914738	  1.559858
  1.656846	 -0.883618	  1.538280
  1.622223	 -0.852229	  1.518502
  1.583183	 -0.821316	  1.501612
  1.541384	 -0.792680	  1.489497
  1.499758	 -0.765648	  1.480848
  1.459439	 -0.738829	  1.472857
  1.420547	 -0.711471	  1.463209
  1.381259	 -0.682490	  1.450584
  1.341807	 -0.653675	  1.436198
  1.302920	 -0.627549	  1.422740
  1.262183	 -0.603378	  1.411312
  1.220515	 -0.579576	  1.397683
  1.180165	 -0.554656	  1.376932
  1.146027	 -0.525853	  1.350942
  1.115803	 -0.493991	  1.324919
  1.087211	 -0.460289	  1.299749
  1.058892	 -0.425105	  1.275392
  1.031000	 -0.390443	  1.252604
  1.003174	 -0.356744	  1.230514
  0.975771	 -0.324814	  1.207698
  0.950571	 -0.295356	  1.180171
  0.930886	 -0.268962	  1.128791
  0.922523	 -0.264902	  1.039247
  0.885294	 -0.258342	  0.960179
  0.851281	 -0.240892	  0.897988
  0.819306	 -0.219364	  0.836738
  0.787137	 -0.190947	  0.774065
  0.757115	 -0.161710	  0.725175
  0.730495	 -0.134076	  0.695955
  0.712881	 -0.111241	  0.683635
  0.692261	 -0.079281	  0.676177
  0.656854	 -0.034473	  0.675502
  0.617567	  0.005172	  0.683440
  0.583814	  0.037656	  0.695922
  0.542690	  0.076752	  0.716210
  0.499647	  0.115181	  0.740230
  0.450665	  0.156157	  0.767364
  0.381241	  0.207377	  0.788876
  0.312446	  0.253583	  0.794499
  0.264019	  0.282772	  0.793321
  0.222458	  0.305266	  0.788804
  0.178762	  0.328390	  0.783072
  0.133218	  0.352535	  0.778638
  0.089387	  0.379596	  0.778248
  0.047890	  0.409283	  0.781097
  0.007693	  0.440740	  0.781329
 -0.031867	  0.472928	  0.779005
 -0.073156	  0.504915	  0.772902
 -0.116926	  0.532901	  0.760628
 -0.158819	  0.556283	  0.740099
 -0.197191	  0.576657	  0.712810
 -0.232618	  0.596658	  0.681653
 -0.266479	  0.617618	  0.649114
 -0.299808	  0.642174	  0.618654
 -0.333144	  0.672369	  0.592045
 -0.365911	  0.706322	  0.569487
 -0.397319	  0.741993	  0.551279
 -0.428474	  0.778225	  0.536265
 -0.460443	  0.813395	  0.522421
 -0.493530	  0.846439	  0.507161
 -0.527432	  0.877015	  0.490153
 -0.562876	  0.907002	  0.471582
 -0.598986	  0.936669	  0.452131
 -0.635587	  0.966206	  0.432522
 -0.672537	  0.994614	  0.413096
 -0.709679	  1.021929	  0.394444
 -0.746270	  1.047618	  0.377337
 -0.784183	  1.073416	  0.361454
 -0.822111	  1.097966	  0.348158
 -0.859704	  1.120486	  0.337650
 -0.903172	  1.144595	  0.328496
 -0.966314	  1.178821	  0.322697
 -1.051011	  1.227379	  0.333282
 -1.133971	  1.274101	  0.368175
 -1.192162	  1.305071	  0.403016
 -1.231861	  1.326174	  0.424141
 -1.272261	  1.348796	  0.438088
 -1.312906	  1.373051	  0.444826
 -1.347325	  1.396432	  0.444108
 -1.384692	  1.426807	  0.435278
 -1.421190	  1.462677	  0.417210
 -1.448477	  1.495032	  0.393151
 -1.469247	  1.524199	  0.360965
 -1.483731	  1.545041	  0.323846
 -1.492802	  1.559091	  0.275957
 -1.496889	  1.569951	  0.219139
 -1.499166	  1.583719	  0.147931
 -1.512994	  1.610418	  0.059113
 -1.551088	  1.656883	 -0.010763
 -1.593501	  1.701086	 -0.048607
 -1.627986	  1.736611	 -0.073304
 -1.659736	  1.768307	 -0.094223
 -1.710897	  1.818560	 -0.125183
 -1.722746	  1.830696	 -0.132217
