  2.372895	  0.513990	  0.570725
  2.377722	  0.516013	  0.568626
  2.364970	  0.510765	  0.577797
  2.347854	  0.501417	  0.589440
  2.329498	  0.495034	  0.601743
  2.314253	  0.490584	  0.610773
  2.297009	  0.480849	  0.616105
  2.277423	  0.472012	  0.614945
  2.255127	  0.466033	  0.614618
  2.239436	  0.455340	  0.620300
  2.222471	  0.440593	  0.635781
  2.207287	  0.434690	  0.648151
  2.194084	  0.434017	  0.657661
  2.178160	  0.432700	  0.662311
  2.157418	  0.421826	  0.667012
  2.140307	  0.411305	  0.673250
  2.124013	  0.403202	  0.681057
  2.107490	  0.396262	  0.691653
  2.088212	  0.389993	  0.699004
  2.072095	  0.382398	  0.704792
  2.054733	  0.372604	  0.710760
  2.036114	  0.367498	  0.719685
  2.014481	  0.364281	  0.723102
  1.998026	  0.356357	  0.722312
  1.981793	  0.344895	  0.723039
  1.955039	  0.340663	  0.728054
  1.933949	  0.338842	  0.728293
  1.923890	  0.335250	  0.727342
  1.906285	  0.318435	  0.727717
  1.886635	  0.298637	  0.728063
  1.872967	  0.288024	  0.731168
  1.854415	  0.277565	  0.741392
  1.829787	  0.273255	  0.748852
  1.813736	  0.267320	  0.751409
  1.796379	  0.268045	  0.746289
  1.768263	  0.264933	  0.742237
  1.743253	  0.267827	  0.739841
  1.732627	  0.267946	  0.738115
  1.710464	  0.266998	  0.737146
  1.689335	  0.263734	  0.735885
  1.671318	  0.261121	  0.741842
  1.654085	  0.256919	  0.755538
  1.632687	  0.250847	  0.765872
  1.612345	  0.243872	  0.764879
  1.593541	  0.237670	  0.758169
  1.575025	  0.232689	  0.753811
  1.556531	  0.227167	  0.758418
  1.538004	  0.219146	  0.762552
  1.519631	  0.210746	  0.761270
  1.501110	  0.201885	  0.759141
  1.482881	  0.193319	  0.758914
  1.465120	  0.184187	  0.757755
  1.447513	  0.174710	  0.756615
  1.429888	  0.165412	  0.755745
  1.412439	  0.156246	  0.754703
  1.395582	  0.145543	  0.751416
  1.379241	  0.132891	  0.748026
  1.362134	  0.121148	  0.746732
  1.346428	  0.111923	  0.745681
  1.328334	  0.099303	  0.742387
  1.311481	  0.084598	  0.740626
  1.292622	  0.074246	  0.746523
  1.273663	  0.069869	  0.754517
  1.253841	  0.068658	  0.762378
  1.234601	  0.064519	  0.768057
  1.216392	  0.056843	  0.772907
  1.199052	  0.047955	  0.777909
  1.182613	  0.038583	  0.784608
  1.166135	  0.029248	  0.791110
  1.149360	  0.020467	  0.797626
  1.133099	  0.012627	  0.804677
  1.119048	  0.004408	  0.816829
  1.104334	 -0.003750	  0.831986
  1.086394	 -0.011055	  0.839709
  1.069795	 -0.017106	  0.840018
  1.045489	 -0.026761	  0.844835
  1.026283	 -0.035686	  0.853599
  1.018198	 -0.039338	  0.857631
  0.997755	 -0.047579	  0.864006
  0.977398	 -0.054345	  0.866014
  0.960636	 -0.060241	  0.868356
  0.938501	 -0.067736	  0.874415
  0.921388	 -0.074996	  0.887348
  0.911613	 -0.079340	  0.899381
  0.889138	 -0.082659	  0.910511
  0.861577	 -0.086661	  0.909926
  0.842410	 -0.094141	  0.902449
  0.832110	 -0.109535	  0.887748
  0.825542	 -0.127218	  0.872312
  0.816019	 -0.139958	  0.862266
  0.805320	 -0.152041	  0.851509
  0.798416	 -0.165229	  0.837834
  0.790575	 -0.178510	  0.823910
  0.780631	 -0.189132	  0.812254
  0.772339	 -0.200317	  0.797828
  0.764189	 -0.212961	  0.782748
  0.754043	 -0.225961	  0.772000
  0.744719	 -0.242805	  0.761296
  0.739918	 -0.258639	  0.751171
  0.732568	 -0.270260	  0.740740
  0.717762	 -0.285288	  0.729965
  0.708198	 -0.303425	  0.718535
  0.706332	 -0.317532	  0.705586
  0.706064	 -0.326422	  0.691232
  0.697607	 -0.341292	  0.677157
  0.688457	 -0.356215	  0.666555
  0.679551	 -0.371118	  0.656624
  0.667497	 -0.386178	  0.651479
  0.653061	 -0.399801	  0.652137
  0.637281	 -0.412227	  0.654608
  0.622798	 -0.425623	  0.656001
  0.609934	 -0.434948	  0.663777
  0.595199	 -0.441694	  0.675873
  0.584359	 -0.444975	  0.689732
  0.579937	 -0.436395	  0.707926
  0.577498	 -0.422679	  0.726237
  0.567941	 -0.421821	  0.748315
  0.554796	 -0.432718	  0.765179
  0.536430	 -0.441000	  0.778841
  0.518037	 -0.442426	  0.795582
  0.509737	 -0.439850	  0.809508
  0.501819	 -0.432210	  0.834346
  0.496180	 -0.426452	  0.849269
  0.488417	 -0.423910	  0.860787
  0.470201	 -0.420241	  0.877111
  0.455745	 -0.413094	  0.895239
  0.445235	 -0.407509	  0.904504
  0.434340	 -0.398230	  0.920604
  0.422460	 -0.393066	  0.934784
  0.407974	 -0.390731	  0.947319
  0.394931	 -0.383300	  0.963732
  0.384207	 -0.375939	  0.978308
  0.372004	 -0.363213	  0.993621
  0.354355	 -0.356976	  1.008301
  0.335367	 -0.359625	  1.013604
  0.314421	 -0.364321	  1.015767
  0.293735	 -0.367776	  1.016711
  0.276201	 -0.369208	  1.018090
  0.252768	 -0.372206	  1.020700
  0.233215	 -0.383123	  1.022488
  0.214796	 -0.390000	  1.024757
  0.199310	 -0.396691	  1.026156
  0.182414	 -0.399081	  1.028836
  0.163094	 -0.402849	  1.029902
  0.141125	 -0.410608	  1.029072
  0.121290	 -0.418824	  1.033644
  0.107464	 -0.425489	  1.038713
  0.089004	 -0.434122	  1.043520
  0.069075	 -0.441108	  1.045881
  0.050895	 -0.446514	  1.045955
  0.029075	 -0.452330	  1.041229
  0.006856	 -0.457085	  1.040673
 -0.007456	 -0.457400	  1.049984
 -0.026569	 -0.455867	  1.058417
 -0.053212	 -0.462355	  1.064027
 -0.066177	 -0.473047	  1.071896
 -0.079670	 -0.488478	  1.084132
 -0.096123	 -0.496970	  1.091834
 -0.115728	 -0.493977	  1.093032
 -0.141861	 -0.485060	  1.093168
 -0.165014	 -0.487602	  1.099867
 -0.178715	 -0.496951	  1.107756
 -0.190289	 -0.504008	  1.120425
 -0.206307	 -0.515170	  1.135103
 -0.220493	 -0.531879	  1.143561
 -0.238460	 -0.545112	  1.151213
 -0.253129	 -0.549072	  1.157137
 -0.269560	 -0.555315	  1.163941
 -0.292142	 -0.567686	  1.171507
 -0.304845	 -0.571121	  1.174413
 -0.324745	 -0.576234	  1.179594
 -0.340656	 -0.584547	  1.184153
 -0.360372	 -0.593402	  1.187910
 -0.377999	 -0.601773	  1.191496
 -0.396058	 -0.609515	  1.195322
 -0.414152	 -0.617429	  1.198456
 -0.432438	 -0.622773	  1.206226
 -0.452089	 -0.627969	  1.214045
 -0.468232	 -0.638339	  1.214650
 -0.482308	 -0.648491	  1.219107
 -0.499603	 -0.654299	  1.230823
 -0.516783	 -0.660550	  1.238909
 -0.530397	 -0.669254	  1.244858
 -0.541611	 -0.679279	  1.257984
 -0.553115	 -0.685757	  1.273641
 -0.569066	 -0.690715	  1.285240
 -0.584292	 -0.695603	  1.298498
 -0.595806	 -0.701896	  1.317689
 -0.604887	 -0.706926	  1.331589
 -0.611817	 -0.713311	  1.344277
 -0.623717	 -0.722186	  1.367698
 -0.628357	 -0.725289	  1.387688
 -0.627412	 -0.727675	  1.398477
 -0.631251	 -0.729869	  1.424367
 -0.639449	 -0.739700	  1.448624
 -0.647881	 -0.749468	  1.458808
 -0.660173	 -0.756176	  1.467021
 -0.677431	 -0.763035	  1.481591
 -0.694688	 -0.770380	  1.492362
 -0.710581	 -0.778577	  1.503720
 -0.718690	 -0.783947	  1.532385
 -0.722556	 -0.782270	  1.560101
 -0.719624	 -0.781553	  1.574768
 -0.722758	 -0.781000	  1.595093
 -0.732490	 -0.783526	  1.615450
 -0.744084	 -0.787727	  1.629713
 -0.760756	 -0.792437	  1.637984
 -0.779975	 -0.801155	  1.645818
 -0.798326	 -0.807999	  1.654839
 -0.812984	 -0.811286	  1.665540
 -0.826289	 -0.813684	  1.677409
 -0.840968	 -0.822416	  1.689664
 -0.854455	 -0.834825	  1.699225
 -0.866974	 -0.849147	  1.709688
 -0.881165	 -0.861687	  1.719425
 -0.896585	 -0.870443	  1.725944
 -0.917603	 -0.877908	  1.729259
 -0.939467	 -0.882707	  1.728097
 -0.961495	 -0.888120	  1.721394
 -0.977424	 -0.896895	  1.712220
 -0.989844	 -0.911517	  1.701970
 -0.999846	 -0.929153	  1.690856
 -1.010366	 -0.940500	  1.678656
 -1.025561	 -0.948307	  1.663972
 -1.042699	 -0.949086	  1.653860
 -1.060606	 -0.952193	  1.643412
 -1.077320	 -0.957133	  1.633063
 -1.092069	 -0.962771	  1.620435
 -1.105723	 -0.964002	  1.605784
 -1.119370	 -0.964950	  1.591172
 -1.133142	 -0.965580	  1.576650
 -1.146882	 -0.965636	  1.562161
 -1.159338	 -0.963079	  1.546636
 -1.171657	 -0.960253	  1.531130
 -1.183984	 -0.957618	  1.515594
 -1.196351	 -0.955211	  1.500062
 -1.208762	 -0.952902	  1.484562
 -1.222826	 -0.952159	  1.470367
 -1.237954	 -0.952686	  1.457318
 -1.253116	 -0.953205	  1.444291
 -1.268519	 -0.953076	  1.431636
 -1.285429	 -0.953017	  1.421142
 -1.304897	 -0.956450	  1.418001
 -1.323941	 -0.961018	  1.414778
 -1.342589	 -0.963755	  1.413154
 -1.363436	 -0.964405	  1.414151
 -1.381928	 -0.972341	  1.415738
 -1.396984	 -0.990143	  1.417976
 -1.411962	 -1.000629	  1.420545
 -1.438223	 -1.009262	  1.423292
 -1.450153	 -1.018102	  1.425575
 -1.466047	 -1.029328	  1.430160
 -1.486893	 -1.039780	  1.432133
 -1.499147	 -1.045703	  1.431260
 -1.521566	 -1.053779	  1.427901
 -1.542400	 -1.066350	  1.430978
 -1.551929	 -1.074557	  1.434471
 -1.567365	 -1.090402	  1.442795
 -1.587223	 -1.103040	  1.442806
 -1.602274	 -1.110505	  1.440509
 -1.621868	 -1.119960	  1.437286
 -1.641698	 -1.135110	  1.442484
 -1.649475	 -1.142434	  1.445994
 -1.666646	 -1.151966	  1.453988
 -1.687792	 -1.160134	  1.460089
 -1.704146	 -1.171171	  1.463367
