  0.744299	  2.498234	  0.172710
  0.738275	  2.514080	  0.168936
  0.745217	  2.495837	  0.173288
  0.752199	  2.477819	  0.177917
  0.759136	  2.460260	  0.183868
  0.767101	  2.442493	  0.190599
  0.776621	  2.424724	  0.193874
  0.786156	  2.407040	  0.193297
  0.795516	  2.389631	  0.190617
  0.806182	  2.371260	  0.191459
  0.819690	  2.356465	  0.194717
  0.829898	  2.339689	  0.204660
  0.839597	  2.322967	  0.212458
  0.844266	  2.305448	  0.214735
  0.853027	  2.286383	  0.214627
  0.857983	  2.267030	  0.211795
  0.863238	  2.248340	  0.209641
  0.872554	  2.229318	  0.207176
  0.887481	  2.208968	  0.205311
  0.904584	  2.196770	  0.210547
  0.923053	  2.189735	  0.214394
  0.941156	  2.183137	  0.210953
  0.957772	  2.173116	  0.201745
  0.976232	  2.161781	  0.193885
  0.992834	  2.151389	  0.188711
  1.005638	  2.142302	  0.182381
  1.020295	  2.130468	  0.173664
  1.033810	  2.114727	  0.169200
  1.048141	  2.100404	  0.168377
  1.064548	  2.089524	  0.166804
  1.083687	  2.076474	  0.162459
  1.099363	  2.063952	  0.154601
  1.107094	  2.054676	  0.148304
  1.124543	  2.047186	  0.137752
  1.147100	  2.038970	  0.130208
  1.161399	  2.032850	  0.124102
  1.174833	  2.022864	  0.113938
  1.190695	  2.010980	  0.103806
  1.207914	  2.001925	  0.096959
  1.225230	  1.995699	  0.089079
  1.240005	  1.989402	  0.079664
  1.255763	  1.979605	  0.070344
  1.269805	  1.968202	  0.061663
  1.283440	  1.957328	  0.052169
  1.297583	  1.948374	  0.040546
  1.313442	  1.942641	  0.029127
  1.332388	  1.935131	  0.020215
  1.350004	  1.924583	  0.014515
  1.361141	  1.908777	  0.009015
  1.370661	  1.892413	  0.001164
  1.381178	  1.876330	 -0.006647
  1.390190	  1.861339	 -0.015763
  1.400178	  1.845308	 -0.025965
  1.411904	  1.833389	 -0.035249
  1.423812	  1.821314	 -0.045215
  1.434529	  1.805489	 -0.056644
  1.445969	  1.790088	 -0.064169
  1.456736	  1.777504	 -0.067369
  1.467490	  1.760224	 -0.069339
  1.477295	  1.741342	 -0.072030
  1.487293	  1.724385	 -0.075398
  1.497530	  1.707405	 -0.077441
  1.508453	  1.691407	 -0.081674
  1.519537	  1.675109	 -0.085390
  1.529586	  1.658575	 -0.089754
  1.538600	  1.641140	 -0.094115
  1.548091	  1.624149	 -0.098614
  1.563266	  1.608340	 -0.102733
  1.582270	  1.595700	 -0.102235
  1.595569	  1.582560	 -0.096035
  1.603587	  1.566893	 -0.092195
  1.614249	  1.548245	 -0.089452
  1.623544	  1.530927	 -0.087278
  1.636736	  1.515353	 -0.084261
  1.649996	  1.500699	 -0.081133
  1.662997	  1.485912	 -0.077560
  1.675927	  1.471093	 -0.073959
  1.688862	  1.456355	 -0.069948
  1.701429	  1.441271	 -0.066323
  1.714282	  1.426303	 -0.062814
  1.725883	  1.411187	 -0.058138
  1.733866	  1.395755	 -0.051056
  1.741910	  1.374916	 -0.042163
  1.750278	  1.356261	 -0.036953
  1.763676	  1.343503	 -0.031276
  1.776063	  1.336481	 -0.019951
  1.786923	  1.326853	 -0.005225
  1.794566	  1.316461	  0.012331
  1.799822	  1.303609	  0.026635
  1.800843	  1.292996	  0.046110
  1.802411	  1.288909	  0.066381
  1.807841	  1.285391	  0.084527
  1.813745	  1.281285	  0.103225
  1.817019	  1.275673	  0.122572
  1.820937	  1.269650	  0.140764
  1.827492	  1.264867	  0.158716
  1.832400	  1.261583	  0.178282
  1.835411	  1.255787	  0.199609
  1.840443	  1.247764	  0.214622
  1.849106	  1.239893	  0.232140
  1.856860	  1.235939	  0.250948
  1.865153	  1.235661	  0.268335
  1.872388	  1.237488	  0.288045
  1.877533	  1.233064	  0.312265
  1.882442	  1.226365	  0.326208
  1.891618	  1.219509	  0.343321
  1.897261	  1.212535	  0.362336
  1.902030	  1.204964	  0.382218
  1.909902	  1.197178	  0.394141
  1.920014	  1.189552	  0.411990
  1.927817	  1.180191	  0.429043
  1.935239	  1.170075	  0.445062
  1.941372	  1.154956	  0.457580
  1.946857	  1.141176	  0.471254
  1.951735	  1.128086	  0.484522
  1.957059	  1.113210	  0.497000
  1.965057	  1.098023	  0.509362
  1.974048	  1.084153	  0.525862
  1.975073	  1.075393	  0.539159
  1.979497	  1.060934	  0.553574
  1.985817	  1.046684	  0.566861
  1.987127	  1.033668	  0.581303
  1.983613	  1.018439	  0.595095
  1.985618	  1.004583	  0.607008
  1.987379	  0.982067	  0.614234
  1.992250	  0.966716	  0.620688
  1.996834	  0.951034	  0.634946
  1.995146	  0.935443	  0.651001
  1.992315	  0.919548	  0.660347
  1.989538	  0.899845	  0.667759
  1.988912	  0.878804	  0.677771
  1.989285	  0.866554	  0.685360
  1.991117	  0.849528	  0.694696
  1.990783	  0.826743	  0.700074
  1.991809	  0.806090	  0.702859
  1.993185	  0.786098	  0.705837
  1.992725	  0.769690	  0.708470
  1.988136	  0.748871	  0.710500
  1.981134	  0.728656	  0.710919
  1.973910	  0.709346	  0.715524
  1.971040	  0.690978	  0.725913
  1.972434	  0.672687	  0.730484
  1.973308	  0.652446	  0.729432
  1.973709	  0.632093	  0.733154
  1.970139	  0.612318	  0.736103
  1.959042	  0.593266	  0.740388
  1.946615	  0.577832	  0.741420
  1.933969	  0.562285	  0.737548
  1.922410	  0.545440	  0.731272
  1.914210	  0.526716	  0.728045
  1.908184	  0.505526	  0.730587
  1.900744	  0.490093	  0.731722
  1.893394	  0.475811	  0.730540
  1.885599	  0.454591	  0.730312
  1.877573	  0.431389	  0.732816
  1.872638	  0.417741	  0.734980
  1.861410	  0.398602	  0.734873
  1.846845	  0.383940	  0.731874
  1.829747	  0.377024	  0.727564
  1.804524	  0.361949	  0.719644
  1.799684	  0.349080	  0.717541
  1.796292	  0.323904	  0.715645
  1.790775	  0.298750	  0.714898
  1.778017	  0.285699	  0.714279
  1.758687	  0.275549	  0.713007
  1.745108	  0.266569	  0.712082
  1.730705	  0.250112	  0.708786
  1.731160	  0.240258	  0.700224
  1.759846	  0.229086	  0.675018
  1.721163	  0.220438	  0.671841
  1.721241	  0.210205	  0.672235
  1.738384	  0.194399	  0.668699
  1.755284	  0.184188	  0.658218
  1.769439	  0.169731	  0.650891
  1.780149	  0.157543	  0.648968
  1.794788	  0.144339	  0.647719
  1.811103	  0.130205	  0.639792
  1.822573	  0.112913	  0.634156
  1.832300	  0.098192	  0.629746
  1.847425	  0.084513	  0.624445
  1.862753	  0.070291	  0.621025
  1.876613	  0.055250	  0.616478
  1.888916	  0.046808	  0.609307
  1.907847	  0.038239	  0.598917
  1.923612	  0.027540	  0.590372
  1.938364	  0.013315	  0.580457
  1.948672	  0.003422	  0.573910
  1.964327	 -0.011313	  0.568017
  1.977204	 -0.030414	  0.556557
  1.982356	 -0.041728	  0.547780
  1.991787	 -0.051775	  0.540102
  2.010994	 -0.065263	  0.536551
  2.027659	 -0.078608	  0.535176
  2.040992	 -0.095392	  0.529133
  2.049759	 -0.114340	  0.521433
  2.057508	 -0.129016	  0.509034
  2.068896	 -0.143083	  0.499635
  2.083130	 -0.151550	  0.489321
  2.098226	 -0.163614	  0.482231
  2.113444	 -0.173130	  0.473126
  2.127850	 -0.185751	  0.467150
  2.140629	 -0.197613	  0.460799
  2.141834	 -0.217062	  0.455128
  2.139141	 -0.222817	  0.455872
  2.145557	 -0.241776	  0.442973
  2.134668	 -0.258936	  0.432972
  2.126828	 -0.272127	  0.422594
  2.122076	 -0.289974	  0.408566
  2.112071	 -0.308929	  0.402627
  2.098485	 -0.324840	  0.401548
  2.082880	 -0.334368	  0.398758
  2.070690	 -0.350126	  0.391497
  2.061814	 -0.365795	  0.383287
  2.054500	 -0.382739	  0.375120
  2.048716	 -0.400679	  0.367752
  2.042697	 -0.417840	  0.359491
  2.038780	 -0.435288	  0.351184
  2.032656	 -0.451595	  0.342657
  2.024663	 -0.465922	  0.332440
  2.018702	 -0.483093	  0.323631
  2.012593	 -0.499592	  0.313203
  2.009463	 -0.517424	  0.305508
  2.008009	 -0.534871	  0.297405
  2.004300	 -0.552596	  0.289595
  2.002721	 -0.570824	  0.281798
  2.001862	 -0.589905	  0.275512
  2.001425	 -0.608083	  0.267726
  2.004134	 -0.627241	  0.264040
  2.002458	 -0.644891	  0.255682
  2.004415	 -0.664162	  0.251243
  2.005971	 -0.683184	  0.245635
  2.008106	 -0.702471	  0.242169
  2.012181	 -0.721679	  0.240785
  2.012768	 -0.739224	  0.238151
  2.016144	 -0.759212	  0.239415
  2.023102	 -0.780041	  0.241535
  2.032300	 -0.799124	  0.240186
  2.037641	 -0.814872	  0.238922
  2.039458	 -0.833648	  0.236653
  2.043544	 -0.853638	  0.234730
  2.049832	 -0.872831	  0.234591
  2.055949	 -0.890896	  0.233801
  2.060814	 -0.910208	  0.231138
  2.069075	 -0.927607	  0.231910
  2.078467	 -0.944753	  0.230747
  2.089152	 -0.964012	  0.229933
  2.099964	 -0.980179	  0.234420
  2.110162	 -0.997726	  0.242925
  2.115996	 -1.014349	  0.246781
  2.125045	 -1.032103	  0.244304
  2.136409	 -1.051869	  0.243339
  2.137278	 -1.073090	  0.239941
  2.147010	 -1.090403	  0.242294
