  0.143603	 -2.244686	  0.923777
  0.156408	 -2.267042	  0.944508
  0.148663	 -2.253521	  0.931970
  0.139968	 -2.240395	  0.919638
  0.131271	 -2.227269	  0.907306
  0.122369	 -2.214283	  0.894972
  0.112684	 -2.201863	  0.882645
  0.102998	 -2.189443	  0.870319
  0.092993	 -2.177463	  0.857814
  0.082706	 -2.165890	  0.845156
  0.072418	 -2.154317	  0.832497
  0.061404	 -2.143826	  0.819512
  0.050366	 -2.133373	  0.806516
  0.038906	 -2.123499	  0.793433
  0.026973	 -2.114315	  0.780270
  0.015040	 -2.105132	  0.767107
  0.002222	 -2.097111	  0.754016
 -0.010612	 -2.089111	  0.740928
 -0.023802	 -2.081441	  0.727998
 -0.037538	 -2.074302	  0.715334
 -0.051273	 -2.067163	  0.702670
 -0.065482	 -2.060115	  0.690487
 -0.080185	 -2.053174	  0.678841
 -0.094889	 -2.046233	  0.667195
 -0.109754	 -2.039191	  0.655818
 -0.125345	 -2.031690	  0.645784
 -0.140935	 -2.024189	  0.635750
 -0.156525	 -2.016688	  0.625716
 -0.172415	 -2.008607	  0.616651
 -0.188495	 -2.000110	  0.608328
 -0.204574	 -1.991613	  0.600006
 -0.220653	 -1.983116	  0.591684
 -0.236713	 -1.973155	  0.585137
 -0.252766	 -1.963113	  0.578697
 -0.268818	 -1.953071	  0.572257
 -0.284454	 -1.941811	  0.566899
 -0.299822	 -1.929930	  0.562137
 -0.315190	 -1.918049	  0.557376
 -0.329433	 -1.904504	  0.553679
 -0.343579	 -1.890833	  0.550070
 -0.356614	 -1.875993	  0.546928
 -0.369159	 -1.860702	  0.543966
 -0.380479	 -1.844420	  0.541366
 -0.390832	 -1.827477	  0.538970
 -0.400655	 -1.810205	  0.536687
 -0.409122	 -1.792174	  0.534900
 -0.417569	 -1.774133	  0.533120
 -0.424876	 -1.755558	  0.531867
 -0.431987	 -1.736901	  0.530705
 -0.439025	 -1.718212	  0.529609
 -0.445020	 -1.699133	  0.529452
 -0.451015	 -1.680053	  0.529296
 -0.457010	 -1.660973	  0.529140
 -0.462603	 -1.641780	  0.529710
 -0.467811	 -1.622510	  0.530961
 -0.473019	 -1.603241	  0.532211
 -0.478226	 -1.583971	  0.533462
 -0.483175	 -1.564667	  0.535151
 -0.487823	 -1.545338	  0.537340
 -0.492471	 -1.526009	  0.539529
 -0.497119	 -1.506680	  0.541719
 -0.501642	 -1.487354	  0.544172
 -0.505852	 -1.468051	  0.547282
 -0.510062	 -1.448748	  0.550392
 -0.514272	 -1.429445	  0.553501
 -0.518163	 -1.409913	  0.555334
 -0.521814	 -1.390270	  0.556246
 -0.525465	 -1.370627	  0.557159
 -0.529006	 -1.350955	  0.557843
 -0.532401	 -1.331249	  0.558227
 -0.535797	 -1.311543	  0.558611
 -0.538605	 -1.292142	  0.554646
 -0.541306	 -1.272879	  0.549997
 -0.543419	 -1.253804	  0.544366
 -0.545236	 -1.234848	  0.538254
 -0.547023	 -1.215984	  0.531855
 -0.548584	 -1.197871	  0.523519
 -0.550146	 -1.179758	  0.515183
 -0.551263	 -1.161961	  0.506127
 -0.551222	 -1.145146	  0.495299
 -0.551181	 -1.128331	  0.484470
 -0.551140	 -1.111516	  0.473642
 -0.554239	 -1.095461	  0.462124
 -0.558917	 -1.079968	  0.450375
 -0.563595	 -1.064474	  0.438625
 -0.568273	 -1.048980	  0.426875
 -0.573855	 -1.033884	  0.415003
 -0.587058	 -1.024279	  0.403452
 -0.600261	 -1.014674	  0.391901
 -0.613465	 -1.005070	  0.380350
 -0.626540	 -0.995544	  0.368590
 -0.638303	 -0.986845	  0.354953
 -0.650065	 -0.978146	  0.341316
 -0.662026	 -0.970223	  0.327382
 -0.674064	 -0.962628	  0.313332
 -0.685549	 -0.954958	  0.298866
 -0.696375	 -0.947213	  0.283939
 -0.706446	 -0.939046	  0.268711
 -0.716048	 -0.930631	  0.253317
 -0.724568	 -0.921467	  0.237715
 -0.732744	 -0.912080	  0.222061
 -0.739756	 -0.902030	  0.206255
 -0.746432	 -0.891800	  0.190419
 -0.752251	 -0.880973	  0.174643
 -0.757591	 -0.869827	  0.158918
 -0.762391	 -0.858123	  0.143427
 -0.766480	 -0.845724	  0.128276
 -0.770083	 -0.832790	  0.113453
 -0.772814	 -0.818956	  0.099270
 -0.774811	 -0.804317	  0.085789
 -0.776143	 -0.789011	  0.072986
 -0.776048	 -0.772446	  0.061779
 -0.775289	 -0.755405	  0.051337
 -0.773660	 -0.737824	  0.041943
 -0.771349	 -0.719918	  0.033338
 -0.768484	 -0.701786	  0.025399
 -0.765594	 -0.683640	  0.017503
 -0.762019	 -0.665115	  0.010866
 -0.758443	 -0.646590	  0.004230
 -0.754868	 -0.628065	 -0.002407
 -0.751354	 -0.609236	 -0.008162
 -0.747883	 -0.590236	 -0.013355
 -0.744412	 -0.571236	 -0.018548
 -0.740941	 -0.552237	 -0.023740
 -0.737715	 -0.533068	 -0.028447
 -0.734782	 -0.513720	 -0.032578
 -0.731849	 -0.494373	 -0.036709
 -0.728916	 -0.475025	 -0.040839
 -0.725982	 -0.455677	 -0.044970
 -0.724084	 -0.436146	 -0.048835
 -0.722233	 -0.416608	 -0.052688
 -0.720382	 -0.397070	 -0.056540
 -0.718530	 -0.377532	 -0.060393
 -0.717467	 -0.358000	 -0.064559
 -0.717544	 -0.338538	 -0.069164
 -0.717621	 -0.319075	 -0.073768
 -0.717698	 -0.299612	 -0.078373
 -0.717840	 -0.280161	 -0.083023
 -0.719740	 -0.261135	 -0.088890
 -0.721640	 -0.242110	 -0.094756
 -0.723540	 -0.223084	 -0.100622
 -0.725441	 -0.204059	 -0.106489
 -0.728772	 -0.185690	 -0.113664
 -0.732330	 -0.167445	 -0.121044
 -0.735889	 -0.149200	 -0.128424
 -0.739448	 -0.130955	 -0.135803
 -0.744096	 -0.113510	 -0.144410
 -0.749059	 -0.096330	 -0.153365
 -0.754022	 -0.079149	 -0.162321
 -0.758985	 -0.061969	 -0.171276
 -0.764846	 -0.045651	 -0.181245
 -0.771170	 -0.029835	 -0.191727
 -0.777494	 -0.014020	 -0.202209
 -0.783818	  0.001796	 -0.212692
 -0.790679	  0.017126	 -0.223550
 -0.798542	  0.031451	 -0.235082
 -0.806405	  0.045775	 -0.246613
 -0.814268	  0.060100	 -0.258145
 -0.822131	  0.074424	 -0.269676
 -0.831447	  0.087502	 -0.281601
 -0.841142	  0.100219	 -0.293613
 -0.850838	  0.112935	 -0.305625
 -0.860533	  0.125652	 -0.317637
 -0.870324	  0.138300	 -0.329644
 -0.882073	  0.149384	 -0.341437
 -0.893823	  0.160469	 -0.353231
 -0.905572	  0.171553	 -0.365024
 -0.917322	  0.182637	 -0.376818
 -0.929437	  0.193394	 -0.388544
 -0.943123	  0.202578	 -0.399874
 -0.956808	  0.211763	 -0.411203
 -0.970493	  0.220947	 -0.422533
 -0.984179	  0.230132	 -0.433862
 -0.998185	  0.238826	 -0.445186
 -1.013138	  0.245901	 -0.456427
 -1.028091	  0.252977	 -0.467667
 -1.043044	  0.260052	 -0.478908
 -1.057997	  0.267128	 -0.490148
 -1.073223	  0.273483	 -0.501452
 -1.088959	  0.278261	 -0.512834
 -1.104695	  0.283040	 -0.524216
 -1.120430	  0.287819	 -0.535598
 -1.136166	  0.292597	 -0.546980
 -1.152114	  0.296477	 -0.558408
 -1.168352	  0.298759	 -0.569859
 -1.184591	  0.301041	 -0.581309
 -1.200829	  0.303324	 -0.592760
 -1.217067	  0.305606	 -0.604210
 -1.233354	  0.306776	 -0.615758
 -1.249645	  0.307073	 -0.627356
 -1.265936	  0.307369	 -0.638954
 -1.282227	  0.307666	 -0.650553
 -1.298379	  0.307519	 -0.662346
 -1.314260	  0.306588	 -0.674467
 -1.330142	  0.305657	 -0.686588
 -1.346023	  0.304726	 -0.698709
 -1.361446	  0.303215	 -0.711352
 -1.376867	  0.301703	 -0.723997
 -1.392241	  0.300092	 -0.736688
 -1.407540	  0.298329	 -0.749449
 -1.422887	  0.296706	 -0.762170
 -1.438298	  0.295272	 -0.774837
 -1.454012	  0.294366	 -0.787176
 -1.469927	  0.294011	 -0.799282
 -1.486028	  0.294430	 -0.811139
 -1.502240	  0.295705	 -0.822782
 -1.518587	  0.298026	 -0.834068
 -1.534943	  0.301371	 -0.845082
 -1.551251	  0.305522	 -0.855890
 -1.567393	  0.310963	 -0.866371
 -1.583288	  0.317647	 -0.876502
 -1.599040	  0.324925	 -0.886448
 -1.614453	  0.333636	 -0.895752
 -1.629783	  0.342640	 -0.904913
 -1.644756	  0.352846	 -0.913378
 -1.659584	  0.363466	 -0.921585
 -1.673847	  0.375059	 -0.929468
 -1.687688	  0.387308	 -0.937110
 -1.700552	  0.400504	 -0.944880
 -1.712642	  0.414373	 -0.952722
 -1.723046	  0.429016	 -0.961515
 -1.732850	  0.443887	 -0.970611
 -1.740806	  0.458991	 -0.981031
 -1.748696	  0.474099	 -0.991495
 -1.755698	  0.489290	 -1.002459
 -1.762638	  0.504484	 -1.013457
 -1.769819	  0.519673	 -1.024308
 -1.777318	  0.534850	 -1.034959
 -1.784816	  0.550027	 -1.045609
 -1.792803	  0.564980	 -1.056220
 -1.801091	  0.579790	 -1.066803
 -1.809379	  0.594600	 -1.077385
 -1.818278	  0.609007	 -1.088026
 -1.827301	  0.623330	 -1.098677
 -1.836383	  0.637596	 -1.109354
 -1.845850	  0.651484	 -1.120194
 -1.855317	  0.665372	 -1.131034
 -1.864964	  0.679070	 -1.141955
 -1.874776	  0.692591	 -1.152951
 -1.884589	  0.706113	 -1.163946
 -1.894725	  0.719351	 -1.174991
 -1.904887	  0.732568	 -1.186039
 -1.915226	  0.745705	 -1.197016
 -1.926030	  0.758628	 -1.207800
 -1.936835	  0.771550	 -1.218584
 -1.947639	  0.784472	 -1.229367
 -1.958443	  0.797394	 -1.240151
 -1.973995	  0.815757	 -1.255430
 -1.985007	  0.828605	 -1.266092
