 -1.796694	  1.345189	 -0.782733
 -1.830811	  1.361067	 -0.773506
 -1.864928	  1.376945	 -0.764279
 -1.847264	  1.368919	 -0.769134
 -1.829541	  1.361492	 -0.774443
 -1.811559	  1.355036	 -0.780408
 -1.793347	  1.347903	 -0.785683
 -1.775932	  1.340902	 -0.791362
 -1.758519	  1.333262	 -0.797922
 -1.739983	  1.328391	 -0.804703
 -1.720359	  1.324858	 -0.809632
 -1.701565	  1.315850	 -0.813241
 -1.684671	  1.306663	 -0.818688
 -1.670756	  1.294014	 -0.827158
 -1.656546	  1.281920	 -0.835643
 -1.641909	  1.271287	 -0.843602
 -1.625601	  1.262460	 -0.851254
 -1.609584	  1.254515	 -0.860717
 -1.598751	  1.241459	 -0.875070
 -1.585192	  1.232655	 -0.885784
 -1.569918	  1.223217	 -0.893794
 -1.556445	  1.209412	 -0.904624
 -1.547274	  1.194364	 -0.915205
 -1.538571	  1.177583	 -0.922230
 -1.529447	  1.160011	 -0.926823
 -1.525106	  1.139210	 -0.933457
 -1.521638	  1.123999	 -0.944065
 -1.523227	  1.106726	 -0.957567
 -1.523030	  1.091471	 -0.972140
 -1.523817	  1.073807	 -0.977079
 -1.525000	  1.051485	 -0.978710
 -1.525965	  1.033258	 -0.985163
 -1.533497	  1.017539	 -0.998279
 -1.536651	  0.999950	 -1.008439
 -1.540377	  0.980858	 -1.010678
 -1.545097	  0.961319	 -1.013040
 -1.549370	  0.942156	 -1.017076
 -1.551452	  0.923111	 -1.019474
 -1.552424	  0.900972	 -1.019199
 -1.557857	  0.882547	 -1.026844
 -1.568163	  0.865382	 -1.033489
 -1.573289	  0.845880	 -1.032682
 -1.574846	  0.825209	 -1.031358
 -1.577291	  0.805573	 -1.030579
 -1.581742	  0.785189	 -1.031228
 -1.582937	  0.766052	 -1.032515
 -1.581438	  0.745398	 -1.031212
 -1.580105	  0.724429	 -1.026946
 -1.578479	  0.705048	 -1.025103
 -1.575347	  0.686117	 -1.027115
 -1.574030	  0.664360	 -1.026834
 -1.574648	  0.645164	 -1.024908
 -1.571549	  0.626046	 -1.025717
 -1.565372	  0.606506	 -1.027711
 -1.563354	  0.586390	 -1.027380
 -1.560975	  0.566553	 -1.027108
 -1.554388	  0.547759	 -1.029104
 -1.550279	  0.528418	 -1.029880
 -1.546832	  0.508376	 -1.030877
 -1.540701	  0.489981	 -1.033323
 -1.533197	  0.471647	 -1.037156
 -1.519905	  0.453331	 -1.041364
 -1.509530	  0.436816	 -1.041910
 -1.503030	  0.420418	 -1.044448
 -1.496338	  0.401680	 -1.049424
 -1.488335	  0.384322	 -1.054961
 -1.476049	  0.370103	 -1.062895
 -1.463192	  0.354083	 -1.068752
 -1.451717	  0.340033	 -1.073527
 -1.439119	  0.325723	 -1.076979
 -1.424718	  0.311175	 -1.080512
 -1.409946	  0.297880	 -1.081561
 -1.394378	  0.286571	 -1.086075
 -1.376281	  0.280307	 -1.091078
 -1.357761	  0.274262	 -1.092419
 -1.337109	  0.267440	 -1.095693
 -1.318939	  0.267752	 -1.102103
 -1.297888	  0.269228	 -1.106589
 -1.280031	  0.277301	 -1.107245
 -1.261871	  0.285663	 -1.107286
 -1.244214	  0.295383	 -1.105725
 -1.227312	  0.304313	 -1.103661
 -1.207827	  0.315472	 -1.103377
 -1.192635	  0.328549	 -1.101255
 -1.179265	  0.340996	 -1.096243
 -1.164528	  0.353717	 -1.090598
 -1.147480	  0.363302	 -1.087333
 -1.131967	  0.375112	 -1.081519
 -1.118223	  0.391487	 -1.075214
 -1.105979	  0.405188	 -1.071555
 -1.094051	  0.418021	 -1.062762
 -1.083335	  0.431398	 -1.051948
 -1.069502	  0.445336	 -1.045787
 -1.053228	  0.459333	 -1.041557
 -1.039838	  0.471786	 -1.036274
 -1.025067	  0.485056	 -1.033113
 -1.005931	  0.495504	 -1.029711
 -0.992881	  0.507648	 -1.016676
 -0.987529	  0.521172	 -1.004452
 -0.972837	  0.532455	 -0.994286
 -0.959737	  0.542420	 -0.984094
 -0.944274	  0.556655	 -0.974554
 -0.933423	  0.569314	 -0.966381
 -0.919974	  0.575608	 -0.956119
 -0.899685	  0.585427	 -0.948187
 -0.883277	  0.595746	 -0.944056
 -0.872313	  0.608539	 -0.934142
 -0.859805	  0.618241	 -0.917460
 -0.845077	  0.626380	 -0.907138
 -0.829224	  0.630398	 -0.896891
 -0.811304	  0.633240	 -0.888389
 -0.790814	  0.639695	 -0.880697
 -0.776427	  0.655394	 -0.872308
 -0.766671	  0.668378	 -0.859955
 -0.753667	  0.676023	 -0.844099
 -0.737674	  0.677495	 -0.831806
 -0.720659	  0.679161	 -0.822543
 -0.702838	  0.682442	 -0.811998
 -0.682981	  0.687169	 -0.803957
 -0.665712	  0.693001	 -0.798667
 -0.646509	  0.695159	 -0.791879
 -0.627011	  0.694872	 -0.783862
 -0.610727	  0.698058	 -0.774890
 -0.592530	  0.696445	 -0.766961
 -0.571302	  0.694458	 -0.758582
 -0.554859	  0.696766	 -0.752739
 -0.536453	  0.698821	 -0.743086
 -0.519459	  0.699379	 -0.731350
 -0.504433	  0.702578	 -0.720110
 -0.484043	  0.701924	 -0.713165
 -0.464464	  0.699271	 -0.707939
 -0.447801	  0.697904	 -0.700925
 -0.430658	  0.694716	 -0.695608
 -0.408245	  0.684441	 -0.693179
 -0.389742	  0.678686	 -0.688843
 -0.373268	  0.676084	 -0.679921
 -0.357836	  0.667173	 -0.676263
 -0.338713	  0.655124	 -0.672319
 -0.322584	  0.648967	 -0.671276
 -0.304998	  0.640470	 -0.668067
 -0.290154	  0.628000	 -0.662053
 -0.273786	  0.616230	 -0.658894
 -0.257578	  0.604682	 -0.659499
 -0.242429	  0.591262	 -0.660070
 -0.229850	  0.576427	 -0.658981
 -0.218116	  0.563047	 -0.659051
 -0.202339	  0.545015	 -0.662425
 -0.190074	  0.527604	 -0.668738
 -0.179171	  0.513765	 -0.668194
 -0.167171	  0.500046	 -0.665326
 -0.155118	  0.483000	 -0.669600
 -0.146845	  0.464243	 -0.673096
 -0.134236	  0.449316	 -0.669459
 -0.119371	  0.434690	 -0.672064
 -0.105021	  0.420344	 -0.677902
 -0.096719	  0.404320	 -0.682137
 -0.088968	  0.386136	 -0.688816
 -0.084328	  0.365207	 -0.698008
 -0.072085	  0.350934	 -0.702189
 -0.060755	  0.335142	 -0.701675
 -0.055037	  0.313903	 -0.698611
 -0.046365	  0.297079	 -0.705003
 -0.035029	  0.281160	 -0.711781
 -0.026648	  0.258000	 -0.708855
 -0.023324	  0.241469	 -0.706223
 -0.022060	  0.223009	 -0.710278
 -0.015086	  0.200892	 -0.722111
 -0.011012	  0.181241	 -0.733506
 -0.004194	  0.167032	 -0.734525
 -0.003128	  0.149519	 -0.736715
 -0.000890	  0.127552	 -0.743487
  0.007454	  0.110358	 -0.749476
  0.013832	  0.091434	 -0.756463
  0.018043	  0.073570	 -0.766141
  0.019042	  0.055883	 -0.771025
  0.020472	  0.033822	 -0.771977
  0.018033	  0.009257	 -0.771805
  0.015955	 -0.006039	 -0.777758
  0.018070	 -0.025460	 -0.782687
  0.022315	 -0.042459	 -0.790288
  0.027163	 -0.062914	 -0.800729
  0.029780	 -0.079925	 -0.809088
  0.031436	 -0.098724	 -0.812951
  0.034118	 -0.118413	 -0.813160
  0.035963	 -0.139287	 -0.815448
  0.036778	 -0.160643	 -0.824746
  0.037916	 -0.177449	 -0.833917
  0.042375	 -0.194756	 -0.840636
  0.047356	 -0.213785	 -0.847622
  0.046344	 -0.229894	 -0.855889
  0.048131	 -0.247092	 -0.864572
  0.052226	 -0.265695	 -0.874320
  0.059656	 -0.285413	 -0.885814
  0.066310	 -0.300799	 -0.892892
  0.071432	 -0.315953	 -0.903271
  0.073725	 -0.328710	 -0.917144
  0.077607	 -0.344234	 -0.930965
  0.084602	 -0.358251	 -0.944642
  0.092594	 -0.369620	 -0.958484
  0.101657	 -0.379988	 -0.971146
  0.113826	 -0.390004	 -0.989844
  0.121168	 -0.400645	 -1.004729
  0.124526	 -0.408867	 -1.022601
  0.132127	 -0.413301	 -1.039552
  0.143283	 -0.416058	 -1.057011
  0.149682	 -0.419898	 -1.075356
  0.154527	 -0.423835	 -1.096250
  0.162802	 -0.425757	 -1.113627
  0.170668	 -0.425733	 -1.130542
  0.176644	 -0.428003	 -1.152593
  0.183774	 -0.428921	 -1.169599
  0.188564	 -0.425416	 -1.187630
  0.192960	 -0.420931	 -1.208300
  0.200260	 -0.420751	 -1.228813
  0.201947	 -0.421686	 -1.247013
  0.202928	 -0.418913	 -1.265646
  0.205399	 -0.414601	 -1.286223
  0.208703	 -0.409105	 -1.305436
  0.212312	 -0.405087	 -1.323773
  0.216794	 -0.401546	 -1.344252
  0.220505	 -0.396465	 -1.363372
  0.224355	 -0.386186	 -1.381679
  0.235155	 -0.380563	 -1.396043
  0.245990	 -0.377605	 -1.413339
  0.253926	 -0.371814	 -1.428204
  0.262798	 -0.366062	 -1.445226
  0.271893	 -0.358448	 -1.463214
  0.279162	 -0.350650	 -1.479274
  0.288387	 -0.345564	 -1.494392
  0.300516	 -0.337674	 -1.509812
  0.311375	 -0.327074	 -1.523762
  0.322313	 -0.320838	 -1.536910
  0.338173	 -0.318067	 -1.548847
  0.356856	 -0.316833	 -1.561883
  0.370219	 -0.315554	 -1.576350
  0.381559	 -0.308955	 -1.590584
  0.399415	 -0.302774	 -1.598012
  0.420639	 -0.296029	 -1.603231
  0.439370	 -0.290455	 -1.606872
  0.455127	 -0.291576	 -1.616062
  0.471286	 -0.288670	 -1.627699
  0.489135	 -0.286921	 -1.638215
  0.508221	 -0.289658	 -1.645740
  0.527659	 -0.289277	 -1.649959
  0.546702	 -0.288374	 -1.654669
  0.567819	 -0.290441	 -1.659925
  0.583784	 -0.296285	 -1.668973
  0.599482	 -0.302169	 -1.680069
  0.615783	 -0.307204	 -1.690771
  0.632012	 -0.310450	 -1.701106
  0.646644	 -0.316053	 -1.713389
  0.665332	 -0.324523	 -1.723204
  0.681075	 -0.327813	 -1.728428
  0.698964	 -0.332542	 -1.738205
  0.716792	 -0.338419	 -1.750815
  0.733954	 -0.344640	 -1.752073
  0.752524	 -0.350944	 -1.753301
  0.774118	 -0.358873	 -1.753443
  0.790155	 -0.366313	 -1.758376
  0.807633	 -0.375569	 -1.760988
  0.827482	 -0.385466	 -1.758219
  0.845639	 -0.391471	 -1.758394
  0.864949	 -0.396608	 -1.758513
  0.885181	 -0.400356	 -1.760790
  0.904265	 -0.405844	 -1.765023
  0.921099	 -0.412268	 -1.770132
  0.939745	 -0.420933	 -1.774004
  0.958437	 -0.428837	 -1.777518
  0.976553	 -0.436304	 -1.781334
  0.994321	 -0.442895	 -1.787114
  1.011887	 -0.450423	 -1.793168
  1.028853	 -0.459083	 -1.799349
  1.044848	 -0.468373	 -1.806160
  1.060610	 -0.478831	 -1.813126
  1.076200	 -0.490222	 -1.817494
  1.095131	 -0.501609	 -1.819148
  1.113085	 -0.509621	 -1.822161
  1.130558	 -0.516426	 -1.827890
  1.147890	 -0.521498	 -1.837715
  1.165219	 -0.529040	 -1.845083
  1.182394	 -0.538842	 -1.848846
  1.198709	 -0.549206	 -1.853144
  1.215095	 -0.558337	 -1.860277
  1.233597	 -0.565084	 -1.865802
  1.252097	 -0.575412	 -1.867026
  1.266581	 -0.588205	 -1.870725
  1.279183	 -0.599133	 -1.880659
  1.296575	 -0.611059	 -1.891948
  1.313160	 -0.623474	 -1.895979
  1.326840	 -0.633945	 -1.892926
  1.345130	 -0.643527	 -1.895796
  1.362058	 -0.653162	 -1.900343
  1.379773	 -0.666919	 -1.904562
  1.393611	 -0.679908	 -1.909974
  1.406012	 -0.691205	 -1.917404
  1.421441	 -0.702717	 -1.924126
  1.427714	 -0.707285	 -1.926494
  1.438986	 -0.715492	 -1.930749
