  1.263040	 -0.984610	  1.653574
  1.267258	 -0.980549	  1.658290
  1.264341	 -0.994837	  1.645906
  1.242964	 -1.004765	  1.631108
  1.231313	 -1.010567	  1.620560
  1.221621	 -1.019407	  1.608591
  1.210751	 -1.031378	  1.592827
  1.198175	 -1.041515	  1.580529
  1.185343	 -1.052796	  1.573143
  1.170100	 -1.065898	  1.564876
  1.156184	 -1.075058	  1.551433
  1.147698	 -1.081095	  1.536408
  1.136037	 -1.089209	  1.517747
  1.118619	 -1.098588	  1.506035
  1.103503	 -1.108652	  1.504923
  1.086079	 -1.124198	  1.502471
  1.074898	 -1.134109	  1.491238
  1.062476	 -1.142148	  1.475940
  1.050250	 -1.151790	  1.462583
  1.036297	 -1.162593	  1.452587
  1.022604	 -1.173648	  1.443069
  1.008941	 -1.184878	  1.433723
  0.995241	 -1.196082	  1.424407
  0.981827	 -1.207607	  1.415103
  0.969126	 -1.218924	  1.406543
  0.955929	 -1.230778	  1.400820
  0.939945	 -1.244602	  1.396057
  0.922133	 -1.260768	  1.383327
  0.915551	 -1.268335	  1.373315
  0.904784	 -1.280627	  1.359688
  0.892265	 -1.293414	  1.350452
  0.880031	 -1.305355	  1.345750
  0.861350	 -1.323363	  1.336084
  0.853156	 -1.332694	  1.327297
  0.843531	 -1.345351	  1.316091
  0.831727	 -1.359793	  1.306466
  0.821838	 -1.372677	  1.299285
  0.806772	 -1.390864	  1.289275
  0.795440	 -1.403797	  1.280944
  0.786747	 -1.414341	  1.274517
  0.774511	 -1.431017	  1.265562
  0.764907	 -1.444711	  1.257572
  0.753263	 -1.460952	  1.247217
  0.738019	 -1.478913	  1.236516
  0.731437	 -1.485709	  1.232942
  0.721117	 -1.503449	  1.225992
  0.712290	 -1.521321	  1.219369
  0.702048	 -1.538014	  1.212327
  0.692126	 -1.554063	  1.205646
  0.682046	 -1.570023	  1.199067
  0.672162	 -1.586224	  1.192696
  0.662394	 -1.602479	  1.186266
  0.652953	 -1.618862	  1.179707
  0.644205	 -1.635310	  1.173429
  0.631664	 -1.650103	  1.169449
  0.617060	 -1.665622	  1.168900
  0.606980	 -1.686897	  1.166888
  0.604730	 -1.705873	  1.162677
  0.599915	 -1.725600	  1.159520
  0.585753	 -1.743770	  1.151290
  0.575104	 -1.759577	  1.138947
  0.572935	 -1.770029	  1.126538
  0.574216	 -1.787960	  1.108467
  0.571504	 -1.802876	  1.091978
  0.560472	 -1.814543	  1.085853
  0.540408	 -1.833149	  1.083374
  0.524539	 -1.849305	  1.081684
  0.508181	 -1.867036	  1.075218
  0.500056	 -1.880661	  1.065937
  0.494349	 -1.892501	  1.049841
  0.487432	 -1.902643	  1.030776
  0.478345	 -1.912730	  1.014602
  0.471115	 -1.922958	  1.005422
  0.460583	 -1.940797	  0.995170
  0.446628	 -1.954499	  0.982993
  0.435972	 -1.960239	  0.970921
  0.423054	 -1.968679	  0.955165
  0.411395	 -1.980719	  0.944476
  0.402683	 -1.995242	  0.936959
  0.389916	 -2.013836	  0.927396
  0.376021	 -2.023696	  0.915505
  0.364263	 -2.029469	  0.904115
  0.350735	 -2.039283	  0.890909
  0.339240	 -2.052480	  0.882048
  0.329671	 -2.067758	  0.875181
  0.312016	 -2.087434	  0.865221
  0.298111	 -2.095172	  0.856733
  0.287154	 -2.100371	  0.848893
  0.274033	 -2.110700	  0.835982
  0.261217	 -2.122736	  0.823200
  0.245572	 -2.135817	  0.812958
  0.232211	 -2.147318	  0.803514
