  2.005026	 -0.498996	  1.324513
  2.044833	 -0.517587	  1.340737
  2.028467	 -0.508916	  1.333190
  2.012345	 -0.499985	  1.325425
  1.996243	 -0.491033	  1.317640
  1.980911	 -0.481378	  1.309173
  1.965617	 -0.471691	  1.300673
  1.950546	 -0.461792	  1.292021
  1.936564	 -0.450949	  1.282697
  1.922585	 -0.440103	  1.273371
  1.909223	 -0.429023	  1.263630
  1.896806	 -0.417006	  1.253284
  1.883189	 -0.406192	  1.243210
  1.870636	 -0.396576	  1.232556
  1.856308	 -0.387203	  1.220765
  1.839630	 -0.379529	  1.208026
  1.825123	 -0.374953	  1.195864
  1.810200	 -0.368329	  1.186658
  1.793728	 -0.360810	  1.179025
  1.775811	 -0.350225	  1.169915
  1.762260	 -0.338443	  1.160941
  1.746835	 -0.328399	  1.156914
  1.730405	 -0.316266	  1.156198
  1.714421	 -0.305947	  1.150664
  1.697084	 -0.297411	  1.146189
  1.677896	 -0.287894	  1.145519
  1.661754	 -0.274409	  1.145340
  1.646062	 -0.265593	  1.141598
  1.629575	 -0.255343	  1.136445
  1.616580	 -0.240422	  1.130521
  1.601962	 -0.225915	  1.125858
  1.586867	 -0.216751	  1.124699
  1.568574	 -0.209669	  1.118779
  1.550325	 -0.202332	  1.110865
  1.534046	 -0.194280	  1.102676
  1.515517	 -0.183103	  1.100292
  1.497648	 -0.173833	  1.099828
  1.478509	 -0.167837	  1.104921
  1.459541	 -0.161807	  1.109667
  1.441828	 -0.151438	  1.115095
  1.426001	 -0.140383	  1.115879
  1.408137	 -0.131685	  1.115432
  1.389382	 -0.123595	  1.114708
  1.370987	 -0.115689	  1.114728
  1.351972	 -0.107163	  1.117830
  1.334955	 -0.097700	  1.121031
  1.318629	 -0.086592	  1.121850
  1.303404	 -0.073896	  1.121596
  1.287465	 -0.061623	  1.122742
  1.268885	 -0.051140	  1.124832
  1.250383	 -0.043234	  1.124053
  1.234206	 -0.032551	  1.120566
  1.219334	 -0.019665	  1.119293
  1.201674	 -0.008061	  1.120611
  1.183368	  0.001390	  1.118029
  1.170251	  0.013171	  1.112694
  1.155357	  0.026660	  1.110734
  1.135190	  0.037405	  1.107223
  1.120002	  0.046706	  1.102669
  1.105379	  0.059892	  1.098661
  1.092145	  0.073510	  1.094893
  1.076888	  0.086835	  1.090588
  1.062495	  0.099978	  1.086048
  1.048113	  0.113114	  1.081510
  1.033734	  0.126103	  1.076559
  1.019363	  0.138971	  1.071277
  1.004516	  0.151238	  1.065884
  0.988054	  0.161022	  1.060120
  0.971585	  0.170797	  1.054355
  0.954413	  0.179137	  1.048392
  0.937176	  0.187330	  1.042411
  0.919877	  0.195438	  1.036496
  0.902496	  0.203435	  1.030668
  0.885116	  0.211432	  1.024842
  0.867653	  0.219443	  1.019284
  0.850310	  0.227638	  1.013801
  0.833301	  0.236961	  1.009053
  0.816154	  0.246589	  1.005560
  0.798456	  0.255483	  1.002018
  0.781021	  0.264232	  0.998431
  0.763413	  0.273101	  0.993112
  0.746514	  0.282427	  0.988802
  0.730158	  0.293054	  0.983999
  0.713785	  0.303554	  0.980264
  0.697067	  0.314219	  0.976245
  0.679283	  0.323307	  0.971895
  0.660467	  0.328575	  0.964426
  0.643561	  0.332224	  0.956436
  0.625878	  0.341363	  0.945038
  0.611866	  0.352783	  0.937934
  0.599794	  0.365603	  0.928782
  0.585318	  0.376566	  0.915721
  0.566636	  0.377009	  0.907541
  0.549155	  0.382845	  0.899305
  0.533831	  0.393656	  0.891223
  0.521753	  0.405871	  0.881700
  0.506232	  0.418184	  0.871003
  0.490076	  0.423785	  0.860992
  0.471238	  0.425817	  0.854695
  0.449975	  0.432216	  0.846579
  0.434245	  0.440860	  0.841893
  0.419034	  0.454328	  0.841870
  0.403542	  0.469367	  0.838221
  0.390867	  0.482521	  0.832455
  0.373912	  0.495393	  0.828580
  0.357636	  0.507231	  0.827879
  0.341418	  0.514777	  0.821868
  0.325935	  0.522540	  0.811932
  0.307029	  0.535175	  0.809715
  0.291015	  0.544036	  0.810518
  0.269192	  0.549161	  0.804288
  0.250802	  0.557181	  0.797880
  0.239864	  0.570567	  0.797429
  0.222280	  0.584685	  0.797799
  0.205542	  0.595970	  0.798929
  0.188660	  0.606293	  0.800683
  0.169443	  0.615595	  0.800654
  0.154462	  0.623243	  0.799334
  0.136324	  0.634792	  0.798553
  0.119263	  0.645506	  0.796895
  0.102136	  0.656122	  0.795401
  0.085053	  0.665800	  0.793260
  0.067872	  0.674733	  0.791814
  0.048528	  0.684850	  0.790318
  0.029758	  0.692202	  0.786701
  0.015477	  0.703125	  0.780111
  0.000641	  0.714272	  0.775669
 -0.016587	  0.729057	  0.769555
 -0.031423	  0.737115	  0.764543
 -0.045639	  0.749211	  0.758245
 -0.060550	  0.763178	  0.749452
 -0.079525	  0.770392	  0.746756
 -0.102824	  0.775523	  0.752042
 -0.123864	  0.784697	  0.751478
 -0.129856	  0.800267	  0.742288
 -0.144108	  0.813739	  0.736650
 -0.163863	  0.823705	  0.730851
 -0.178300	  0.834151	  0.723581
 -0.191524	  0.848031	  0.717166
 -0.204243	  0.863986	  0.708411
 -0.219786	  0.873945	  0.703465
 -0.236992	  0.882164	  0.701472
 -0.254281	  0.893363	  0.692703
 -0.271002	  0.902018	  0.690702
 -0.290635	  0.908754	  0.695454
 -0.307643	  0.924614	  0.694442
 -0.317430	  0.944862	  0.684960
 -0.330464	  0.955702	  0.676697
 -0.348633	  0.963295	  0.673221
 -0.366793	  0.973557	  0.670295
 -0.380617	  0.984993	  0.671290
 -0.397945	  0.997748	  0.672170
 -0.413296	  1.010329	  0.671104
 -0.428954	  1.023098	  0.671714
 -0.444222	  1.036223	  0.671083
 -0.459653	  1.048700	  0.671710
 -0.476225	  1.059955	  0.671036
 -0.493431	  1.070406	  0.670515
 -0.510736	  1.080307	  0.671025
 -0.528747	  1.089949	  0.669453
 -0.546406	  1.099173	  0.668378
 -0.564143	  1.108306	  0.666424
 -0.582226	  1.117068	  0.663275
 -0.600027	  1.125554	  0.658962
 -0.616353	  1.134406	  0.653842
 -0.632234	  1.142483	  0.647591
 -0.653606	  1.151329	  0.641218
 -0.670819	  1.156742	  0.636477
 -0.687832	  1.163854	  0.634525
 -0.708469	  1.171001	  0.635495
 -0.729857	  1.176133	  0.633874
 -0.744114	  1.186193	  0.632045
 -0.762845	  1.195207	  0.633006
 -0.781022	  1.204821	  0.633852
 -0.796678	  1.216478	  0.632692
 -0.813697	  1.228517	  0.629805
 -0.829765	  1.239821	  0.625926
 -0.846633	  1.248464	  0.620212
 -0.864428	  1.258594	  0.618327
 -0.884044	  1.265553	  0.619866
 -0.901071	  1.272572	  0.624276
 -0.917141	  1.285886	  0.628745
 -0.932390	  1.298800	  0.631827
 -0.950596	  1.306899	  0.630447
 -0.969222	  1.313020	  0.631589
 -0.987013	  1.324747	  0.636290
 -1.001864	  1.338578	  0.639247
 -1.018886	  1.349765	  0.635202
 -1.034965	  1.361489	  0.634643
 -1.050773	  1.373432	  0.643638
 -1.066384	  1.386201	  0.648971
 -1.080256	  1.398865	  0.650744
 -1.097646	  1.409678	  0.652947
 -1.115230	  1.414170	  0.658606
 -1.133294	  1.422378	  0.666568
 -1.153623	  1.432052	  0.668655
 -1.170700	  1.442684	  0.662148
 -1.184784	  1.457251	  0.660668
 -1.199544	  1.471875	  0.658834
 -1.214003	  1.483270	  0.664519
 -1.230315	  1.492317	  0.668159
 -1.247952	  1.506299	  0.674525
 -1.262309	  1.521408	  0.670586
 -1.275731	  1.531471	  0.672726
 -1.292851	  1.541156	  0.666315
 -1.308626	  1.553288	  0.663388
 -1.318878	  1.569826	  0.652526
 -1.329366	  1.587694	  0.641652
 -1.342600	  1.594635	  0.629353
 -1.359588	  1.596792	  0.622953
 -1.377073	  1.604899	  0.609644
 -1.385527	  1.615273	  0.595727
 -1.392703	  1.626931	  0.576070
 -1.398426	  1.637822	  0.559727
 -1.409000	  1.647309	  0.547682
 -1.418792	  1.654441	  0.535208
 -1.430336	  1.663657	  0.519265
 -1.441517	  1.671786	  0.504814
 -1.451419	  1.680003	  0.489274
 -1.459310	  1.686269	  0.471919
 -1.467166	  1.692503	  0.454615
 -1.475022	  1.698736	  0.437311
 -1.482877	  1.704970	  0.420007
 -1.491440	  1.710240	  0.402718
 -1.501359	  1.713466	  0.385653
 -1.511281	  1.716690	  0.368590
 -1.523031	  1.720534	  0.352868
 -1.536836	  1.725099	  0.339141
 -1.552758	  1.731972	  0.329621
 -1.568166	  1.739987	  0.322528
 -1.586969	  1.750942	  0.316400
 -1.604150	  1.760122	  0.311007
 -1.621191	  1.764094	  0.303225
 -1.638799	  1.770489	  0.296877
 -1.657361	  1.779542	  0.290968
 -1.674474	  1.782343	  0.282933
 -1.691684	  1.786821	  0.276075
 -1.712086	  1.795594	  0.268939
 -1.729457	  1.796908	  0.259889
 -1.747244	  1.801405	  0.251926
