 -2.806660	 -0.019193	 -1.141574
 -2.778871	 -0.019003	 -1.130271
 -2.731712	 -0.007571	 -1.102241
 -2.690223	 -0.005047	 -1.073395
 -2.644679	  0.003440	 -1.048694
 -2.602336	  0.010619	 -1.023230
 -2.559054	  0.018975	 -0.996525
 -2.521085	  0.026780	 -0.971654
 -2.479570	  0.035538	 -0.945737
 -2.439231	  0.044416	 -0.921673
 -2.398182	  0.053213	 -0.898260
 -2.353495	  0.062206	 -0.874308
 -2.311617	  0.070589	 -0.850950
 -2.266467	  0.079087	 -0.823937
 -2.229826	  0.086612	 -0.800166
 -2.183844	  0.096180	 -0.769955
 -2.144027	  0.102314	 -0.745942
 -2.108194	  0.105596	 -0.720932
 -2.067410	  0.113019	 -0.687991
 -2.022799	  0.117454	 -0.662019
 -1.979414	  0.127217	 -0.637937
 -1.937265	  0.137899	 -0.612077
 -1.899310	  0.143010	 -0.590098
 -1.855825	  0.149768	 -0.564327
 -1.813193	  0.158141	 -0.539289
 -1.766029	  0.168474	 -0.511358
 -1.726800	  0.176484	 -0.488080
 -1.684925	  0.184371	 -0.462510
 -1.641186	  0.191240	 -0.437003
 -1.601074	  0.198308	 -0.412424
 -1.561010	  0.205192	 -0.386571
 -1.517626	  0.213795	 -0.359534
 -1.474289	  0.223422	 -0.332285
 -1.435714	  0.232764	 -0.307361
 -1.393428	  0.243354	 -0.280943
 -1.355560	  0.252517	 -0.258554
 -1.312473	  0.262569	 -0.234311
 -1.267822	  0.272045	 -0.209227
 -1.226152	  0.280207	 -0.184573
 -1.185907	  0.287465	 -0.159626
 -1.142091	  0.293686	 -0.131481
 -1.102808	  0.298596	 -0.106073
 -1.061704	  0.304384	 -0.078831
 -1.016908	  0.311468	 -0.048851
 -0.977612	  0.318469	 -0.023170
 -0.936824	  0.326655	  0.002162
 -0.898022	  0.334268	  0.025287
 -0.852318	  0.343191	  0.051761
 -0.813363	  0.353121	  0.073196
 -0.772034	  0.364283	  0.096797
 -0.725989	  0.373599	  0.124985
 -0.687510	  0.380619	  0.149850
 -0.643586	  0.388932	  0.176383
 -0.598268	  0.395500	  0.201877
 -0.556783	  0.401127	  0.226341
 -0.515495	  0.406731	  0.254044
 -0.477055	  0.414148	  0.280897
 -0.434383	  0.423477	  0.302606
 -0.389155	  0.427085	  0.333064
 -0.350941	  0.435242	  0.353548
 -0.312153	  0.447080	  0.381459
 -0.263312	  0.455158	  0.410985
 -0.227442	  0.461160	  0.430905
 -0.184727	  0.467424	  0.454325
 -0.141670	  0.474176	  0.479404
 -0.096723	  0.480711	  0.507280
 -0.051493	  0.487394	  0.536508
 -0.010618	  0.494010	  0.562665
  0.028875	  0.500673	  0.587000
  0.071152	  0.508232	  0.611701
  0.109471	  0.514961	  0.633215
  0.156830	  0.523507	  0.659335
  0.195608	  0.530525	  0.681792
  0.241213	  0.540549	  0.710300
  0.279230	  0.548731	  0.736924
  0.322295	  0.559280	  0.766044
  0.361896	  0.570135	  0.792895
  0.402668	  0.581373	  0.820617
  0.440968	  0.590830	  0.847193
  0.481800	  0.599854	  0.873470
  0.525372	  0.607869	  0.899811
  0.564171	  0.614452	  0.922821
  0.610598	  0.623011	  0.948772
  0.650989	  0.628176	  0.970690
  0.688687	  0.630645	  0.997102
  0.736459	  0.638350	  1.019266
  0.778225	  0.652701	  1.046970
  0.819009	  0.655490	  1.073997
  0.859223	  0.659958	  1.100384
  0.904847	  0.672914	  1.122444
  0.945814	  0.681336	  1.149052
  0.965804	  0.678356	  1.193432
  0.888967	  0.570424	  1.384535
  0.925401	  0.474200	  1.515975
  0.925530	  0.448280	  1.650773
  0.951139	  0.450768	  1.669293
  1.006863	  0.516549	  1.673812
  1.027808	  0.503455	  1.738463
  1.081576	  0.404013	  1.815218
  1.169236	  0.508218	  1.768488
  1.190510	  0.442499	  1.844840
  1.279739	  0.670152	  1.729256
  1.348769	  0.603099	  1.708237
  1.441417	  0.734690	  1.564106
  1.526924	  0.784396	  1.513868
  1.575231	  0.793205	  1.528841
  1.618667	  0.805098	  1.557417
  1.653735	  0.811218	  1.580270
  1.696484	  0.819652	  1.603400
  1.741879	  0.825295	  1.632581
  1.783144	  0.835549	  1.659352
  1.820804	  0.844170	  1.681440
  1.864571	  0.853945	  1.706607
  1.910657	  0.860465	  1.737426
  1.946116	  0.868940	  1.763355
  1.988880	  0.874971	  1.789679
  2.029743	  0.886046	  1.811982
  2.069066	  0.890024	  1.838804
  2.112350	  0.897962	  1.863780
  2.151390	  0.900040	  1.887180
  2.172904	  0.909040	  1.906052
