  1.077149	  1.000579	 -2.021018
  1.079748	  1.002284	 -2.025946
  1.070826	  0.996433	 -2.009030
  1.061891	  0.990580	 -1.992121
  1.052569	  0.984243	 -1.975600
  1.043153	  0.977799	 -1.959174
  1.033852	  0.971264	 -1.942718
  1.025015	  0.964443	 -1.926189
  1.017242	  0.957824	 -1.909948
  1.016776	  0.950349	 -1.892376
  1.018300	  0.940791	 -1.874639
  1.006539	  0.925433	 -1.854506
  0.989681	  0.919892	 -1.833219
  0.981542	  0.919606	 -1.820346
  0.973428	  0.913374	 -1.807412
  0.965908	  0.897091	 -1.791311
  0.961694	  0.883667	 -1.775356
  0.960188	  0.873970	 -1.759481
  0.962418	  0.864564	 -1.738993
  0.964310	  0.856631	 -1.719147
  0.966572	  0.850568	 -1.699264
  0.968119	  0.843590	 -1.679625
  0.971876	  0.836486	 -1.662622
  0.978349	  0.823344	 -1.643996
  0.996443	  0.814071	 -1.627957
  1.012846	  0.811239	 -1.613838
  1.024402	  0.817857	 -1.600310
  1.038899	  0.825262	 -1.580442
  1.056348	  0.822678	 -1.563512
  1.067569	  0.817433	 -1.551441
  1.080240	  0.810992	 -1.539512
  1.093527	  0.803182	 -1.524481
  1.106107	  0.793949	 -1.511960
  1.117430	  0.784769	 -1.501139
  1.134855	  0.774891	 -1.486418
  1.149546	  0.771062	 -1.474687
  1.159577	  0.766319	 -1.465216
  1.171544	  0.757372	 -1.448705
  1.189338	  0.747902	 -1.433357
  1.206008	  0.744640	 -1.424333
  1.220622	  0.742413	 -1.418068
  1.234885	  0.735529	 -1.403994
  1.243881	  0.722112	 -1.389973
  1.250184	  0.702288	 -1.371327
  1.251903	  0.691936	 -1.353261
  1.254073	  0.685672	 -1.342933
  1.261327	  0.675786	 -1.322247
  1.258520	  0.665212	 -1.294209
  1.250178	  0.663726	 -1.273531
  1.241150	  0.667276	 -1.260290
  1.233599	  0.674628	 -1.244299
  1.213522	  0.679801	 -1.233361
  1.196248	  0.670913	 -1.227757
  1.174296	  0.652706	 -1.223271
  1.158812	  0.647796	 -1.218422
  1.139608	  0.652642	 -1.213135
  1.114374	  0.652158	 -1.207297
  1.093675	  0.641945	 -1.202766
  1.082662	  0.633557	 -1.201415
  1.064583	  0.619354	 -1.199391
  1.046986	  0.614628	 -1.193749
  1.026132	  0.614493	 -1.188556
  0.998635	  0.607731	 -1.186873
  0.985869	  0.605199	 -1.187562
  0.972295	  0.598949	 -1.190009
  0.947038	  0.582129	 -1.183920
  0.932532	  0.563233	 -1.178079
  0.922373	  0.555453	 -1.176031
  0.902713	  0.544270	 -1.170733
  0.883202	  0.535695	 -1.159018
  0.869825	  0.529586	 -1.154042
  0.851236	  0.517814	 -1.143516
  0.842302	  0.504053	 -1.128402
  0.832795	  0.491505	 -1.121874
  0.815373	  0.477421	 -1.117974
  0.791766	  0.467531	 -1.110839
  0.772760	  0.460890	 -1.101815
  0.766875	  0.457815	 -1.100002
  0.745590	  0.447482	 -1.098816
  0.723127	  0.435682	 -1.090612
  0.710790	  0.429452	 -1.079786
  0.698613	  0.423826	 -1.068264
  0.671940	  0.411167	 -1.051293
  0.663889	  0.407209	 -1.043051
  0.655468	  0.403987	 -1.034614
  0.634320	  0.390347	 -1.013901
  0.623227	  0.377193	 -1.001703
  0.615112	  0.370287	 -0.998012
  0.598610	  0.357759	 -0.985490
  0.585773	  0.348502	 -0.973031
  0.578754	  0.342972	 -0.960522
  0.569862	  0.332766	 -0.940302
  0.554248	  0.310283	 -0.926159
  0.548162	  0.299647	 -0.923667
  0.537744	  0.281381	 -0.920646
  0.523523	  0.264433	 -0.912787
  0.511292	  0.253728	 -0.897271
  0.504536	  0.242688	 -0.882752
  0.498857	  0.232774	 -0.862223
  0.491511	  0.228413	 -0.842382
  0.482708	  0.223899	 -0.828625
  0.473753	  0.215838	 -0.813652
  0.466659	  0.202764	 -0.799796
  0.459538	  0.190515	 -0.787942
  0.451402	  0.179322	 -0.775221
  0.441545	  0.165947	 -0.760989
  0.432727	  0.150922	 -0.744464
  0.426996	  0.139584	 -0.726566
  0.421523	  0.131993	 -0.712349
  0.413812	  0.125933	 -0.693982
  0.405707	  0.122354	 -0.675892
  0.396546	  0.118981	 -0.656605
  0.390752	  0.115810	 -0.631148
  0.390752	  0.110999	 -0.614213
  0.392714	  0.104874	 -0.595962
  0.395483	  0.096937	 -0.574927
  0.399502	  0.087001	 -0.553792
  0.403289	  0.077404	 -0.538159
  0.404229	  0.065941	 -0.524424
  0.398354	  0.053698	 -0.506451
  0.386221	  0.045298	 -0.485185
  0.368528	  0.039686	 -0.466646
  0.358379	  0.033997	 -0.455176
  0.350589	  0.027139	 -0.443322
  0.342395	  0.015594	 -0.422428
  0.335120	  0.007397	 -0.403044
  0.327210	 -0.002317	 -0.388228
  0.322773	 -0.008919	 -0.378810
  0.308109	 -0.030567	 -0.356587
  0.301371	 -0.042025	 -0.340807
  0.296905	 -0.047785	 -0.330945
  0.290991	 -0.055329	 -0.318754
  0.283844	 -0.066077	 -0.304033
  0.272397	 -0.079456	 -0.283576
  0.261544	 -0.094585	 -0.264878
  0.255072	 -0.103041	 -0.256157
  0.246857	 -0.112508	 -0.245127
  0.232952	 -0.121644	 -0.226654
  0.227588	 -0.125146	 -0.217582
  0.219365	 -0.137305	 -0.196704
  0.213111	 -0.155835	 -0.174593
  0.209176	 -0.161441	 -0.168497
  0.199092	 -0.175090	 -0.157630
  0.184295	 -0.186280	 -0.138958
  0.175044	 -0.195519	 -0.121970
  0.172512	 -0.202341	 -0.111967
  0.164992	 -0.211485	 -0.087425
  0.147123	 -0.215224	 -0.064239
  0.134028	 -0.215787	 -0.055958
  0.120326	 -0.219159	 -0.050194
  0.102838	 -0.227425	 -0.040067
  0.084798	 -0.242026	 -0.035968
  0.068611	 -0.259419	 -0.020936
  0.059102	 -0.269135	 -0.002821
  0.052666	 -0.275177	  0.011372
  0.047604	 -0.283263	  0.026107
  0.044736	 -0.296339	  0.044038
  0.041350	 -0.307941	  0.058302
  0.019587	 -0.320510	  0.075189
  0.000762	 -0.326361	  0.091523
 -0.010655	 -0.327346	  0.103157
 -0.018070	 -0.329973	  0.117862
 -0.020570	 -0.336721	  0.139170
 -0.025649	 -0.344968	  0.156159
 -0.036531	 -0.355943	  0.170787
 -0.048621	 -0.362945	  0.186831
 -0.057187	 -0.365507	  0.203258
 -0.066864	 -0.370137	  0.221073
 -0.076941	 -0.379708	  0.236062
 -0.087049	 -0.387143	  0.251819
 -0.096351	 -0.396018	  0.267145
 -0.102682	 -0.405170	  0.283845
 -0.108159	 -0.412653	  0.301109
 -0.118805	 -0.423300	  0.314919
 -0.127071	 -0.436977	  0.329576
 -0.129762	 -0.447309	  0.347681
 -0.127722	 -0.452171	  0.368199
 -0.129401	 -0.453771	  0.389691
 -0.140527	 -0.453426	  0.413114
 -0.154111	 -0.455183	  0.427117
 -0.165212	 -0.461876	  0.438377
 -0.173378	 -0.472834	  0.451498
 -0.180918	 -0.480167	  0.470208
 -0.187789	 -0.486572	  0.487559
 -0.192362	 -0.493098	  0.505691
 -0.196397	 -0.499125	  0.524146
 -0.201309	 -0.502314	  0.543239
 -0.207332	 -0.508204	  0.561698
 -0.214613	 -0.511807	  0.579991
 -0.222728	 -0.517997	  0.597594
 -0.231501	 -0.522325	  0.615095
 -0.241481	 -0.526788	  0.632701
 -0.251600	 -0.532917	  0.649869
 -0.258901	 -0.537820	  0.667021
 -0.267114	 -0.540807	  0.686042
 -0.282815	 -0.539843	  0.702034
 -0.303185	 -0.545264	  0.714364
 -0.316802	 -0.563395	  0.728762
 -0.318060	 -0.578377	  0.741912
 -0.312884	 -0.591433	  0.758750
 -0.313736	 -0.608225	  0.774231
 -0.326702	 -0.625835	  0.797447
 -0.334098	 -0.630769	  0.809150
 -0.343746	 -0.635765	  0.819202
 -0.351161	 -0.639777	  0.843603
 -0.353329	 -0.645153	  0.866343
 -0.356751	 -0.649512	  0.883322
 -0.366756	 -0.660141	  0.897075
 -0.376631	 -0.676575	  0.911569
 -0.383888	 -0.694196	  0.928069
 -0.386791	 -0.704024	  0.936523
 -0.391742	 -0.719235	  0.949789
 -0.399381	 -0.730363	  0.966820
 -0.405864	 -0.738650	  0.982662
 -0.408566	 -0.747581	  0.998465
 -0.410536	 -0.759811	  1.014411
 -0.416836	 -0.772557	  1.031122
 -0.430039	 -0.782158	  1.046912
 -0.441679	 -0.788393	  1.061486
 -0.451110	 -0.797147	  1.080819
 -0.455317	 -0.802393	  1.094287
 -0.464452	 -0.807895	  1.113608
 -0.475957	 -0.816004	  1.131099
 -0.482087	 -0.825720	  1.143885
 -0.488532	 -0.838308	  1.160234
 -0.495722	 -0.847917	  1.172609
 -0.507258	 -0.862031	  1.187101
 -0.512708	 -0.873243	  1.197796
 -0.524093	 -0.889203	  1.211215
 -0.533900	 -0.901555	  1.222174
 -0.542813	 -0.913911	  1.233126
 -0.551953	 -0.929615	  1.248990
 -0.560129	 -0.943528	  1.267952
 -0.564556	 -0.953246	  1.282490
 -0.566857	 -0.961690	  1.294917
 -0.581643	 -0.973191	  1.310597
 -0.593553	 -0.979973	  1.322717
 -0.607051	 -0.987667	  1.336765
 -0.619566	 -0.994272	  1.353659
 -0.629063	 -0.996518	  1.370847
 -0.640433	 -0.995864	  1.388541
 -0.651556	 -1.001594	  1.404468
 -0.661427	 -1.008001	  1.420987
 -0.670784	 -1.017570	  1.436391
 -0.680163	 -1.025669	  1.452600
 -0.689321	 -1.034092	  1.468592
 -0.697807	 -1.044207	  1.483690
 -0.705505	 -1.052600	  1.500039
 -0.712398	 -1.062319	  1.516270
 -0.719003	 -1.071928	  1.532401
 -0.724875	 -1.081107	  1.549030
 -0.729296	 -1.090976	  1.565705
 -0.733750	 -1.099510	  1.583010
 -0.738442	 -1.110377	  1.599138
 -0.744239	 -1.119375	  1.615869
 -0.750951	 -1.127445	  1.632738
 -0.758122	 -1.135738	  1.649302
 -0.765784	 -1.141868	  1.667005
 -0.772659	 -1.149194	  1.683789
 -0.780111	 -1.158408	  1.699767
 -0.787171	 -1.168866	  1.715930
 -0.792360	 -1.179852	  1.731884
 -0.797089	 -1.188525	  1.749808
 -0.802499	 -1.194226	  1.768185
 -0.807897	 -1.199471	  1.787202
 -0.814759	 -1.204137	  1.805253
 -0.821010	 -1.208902	  1.823131
 -0.824687	 -1.212204	  1.842671
 -0.828388	 -1.218806	  1.861940
 -0.832610	 -1.221598	  1.881641
 -0.839455	 -1.228786	  1.899699
 -0.846157	 -1.238919	  1.915764
 -0.852247	 -1.248383	  1.932246
 -0.857814	 -1.257201	  1.949667
 -0.865773	 -1.261269	  1.974536
 -0.876167	 -1.293435	  2.004163
 -0.882367	 -1.300373	  2.021866
