  1.436877	 -1.100861	  1.598200
  1.441095	 -1.096800	  1.602916
  1.425854	 -1.111319	  1.596885
  1.413543	 -1.124499	  1.591474
  1.400912	 -1.138650	  1.579087
  1.391911	 -1.145946	  1.560277
  1.383605	 -1.153023	  1.544050
  1.373923	 -1.162803	  1.531128
  1.365449	 -1.177865	  1.521521
  1.352685	 -1.194109	  1.514355
  1.331927	 -1.202287	  1.498539
  1.318751	 -1.205419	  1.482814
  1.309506	 -1.207102	  1.469924
  1.296751	 -1.212170	  1.449166
  1.280680	 -1.223333	  1.433959
  1.270509	 -1.231654	  1.426330
  1.257064	 -1.242211	  1.418932
  1.241327	 -1.255514	  1.409086
  1.227712	 -1.266701	  1.401253
  1.212707	 -1.278701	  1.394800
  1.197591	 -1.291076	  1.387642
  1.183565	 -1.302338	  1.381128
  1.167687	 -1.313544	  1.377141
  1.147968	 -1.326513	  1.373213
  1.130912	 -1.337790	  1.363807
  1.119903	 -1.343423	  1.348505
  1.115204	 -1.353118	  1.331732
  1.107539	 -1.368050	  1.316015
  1.095703	 -1.379935	  1.304434
  1.087048	 -1.390848	  1.290172
  1.078075	 -1.403906	  1.273112
  1.066343	 -1.417213	  1.264656
  1.049462	 -1.432243	  1.265582
  1.027854	 -1.450773	  1.265523
  1.016314	 -1.461506	  1.259358
  1.006857	 -1.471679	  1.250279
  0.994953	 -1.486744	  1.237408
  0.986801	 -1.497340	  1.226933
  0.976090	 -1.513644	  1.208257
  0.964809	 -1.529330	  1.195503
  0.958932	 -1.536416	  1.191180
  0.948095	 -1.552797	  1.179579
  0.931017	 -1.568737	  1.175616
  0.913463	 -1.584867	  1.179757
  0.900531	 -1.599626	  1.180296
  0.888532	 -1.613701	  1.174388
  0.879009	 -1.633716	  1.166372
  0.870726	 -1.660336	  1.154886
  0.868240	 -1.666384	  1.151361
  0.859308	 -1.684664	  1.143808
  0.848228	 -1.702525	  1.135846
  0.840618	 -1.716958	  1.129046
  0.833159	 -1.734522	  1.119585
  0.825226	 -1.751132	  1.109856
  0.820037	 -1.766009	  1.099477
  0.815679	 -1.781734	  1.088933
  0.807605	 -1.800237	  1.078830
  0.800468	 -1.813007	  1.074431
  0.787887	 -1.836549	  1.068938
  0.776119	 -1.856063	  1.064079
  0.768910	 -1.867732	  1.059503
  0.758470	 -1.884257	  1.052038
  0.749787	 -1.898769	  1.045108
  0.738508	 -1.918735	  1.036805
  0.729259	 -1.933243	  1.027679
  0.720720	 -1.944214	  1.019001
  0.709770	 -1.959162	  1.004411
  0.700227	 -1.974468	  0.988368
  0.695749	 -1.982403	  0.980182
  0.685950	 -1.996021	  0.966954
  0.670190	 -2.009691	  0.957160
  0.659067	 -2.021939	  0.945356
  0.647728	 -2.033054	  0.933261
  0.638050	 -2.045435	  0.922472
  0.629780	 -2.062672	  0.913125
  0.618447	 -2.077692	  0.903198
  0.610793	 -2.088810	  0.891130
  0.601666	 -2.105120	  0.877418
  0.589597	 -2.120099	  0.867906
  0.578808	 -2.128618	  0.857158
  0.567956	 -2.137723	  0.844355
  0.547863	 -2.160093	  0.833526
  0.534088	 -2.167960	  0.826866
  0.522129	 -2.174618	  0.821668
  0.511205	 -2.183330	  0.810981
  0.493286	 -2.192832	  0.797043
  0.476670	 -2.199127	  0.787499
  0.462105	 -2.210955	  0.778672
  0.448387	 -2.222165	  0.769274
  0.435749	 -2.232372	  0.759375
  0.421033	 -2.244493	  0.755900
  0.408470	 -2.255739	  0.736175
  0.395108	 -2.267241	  0.726731
