  1.819453	 -1.627541	 -0.021699
  1.842451	 -1.642234	 -0.027209
  1.825931	 -1.631679	 -0.023251
  1.809342	 -1.620829	 -0.020588
  1.792751	 -1.609965	 -0.017992
  1.776616	 -1.598359	 -0.015773
  1.760703	 -1.586416	 -0.013731
  1.744983	 -1.574193	 -0.011870
  1.729568	 -1.561549	 -0.010287
  1.714205	 -1.548833	 -0.008774
  1.699177	 -1.535681	 -0.007689
  1.684148	 -1.522529	 -0.006603
  1.669696	 -1.508712	 -0.006162
  1.655274	 -1.494861	 -0.005749
  1.642017	 -1.479891	 -0.006160
  1.629284	 -1.464480	 -0.006762
  1.618346	 -1.447781	 -0.007976
  1.609014	 -1.430127	 -0.009108
  1.603324	 -1.410976	 -0.010039
  1.597633	 -1.391826	 -0.010970
  1.593823	 -1.372194	 -0.010661
  1.596871	 -1.352956	 -0.006122
  1.599919	 -1.333718	 -0.001584
  1.602967	 -1.314480	  0.002955
  1.606015	 -1.295242	  0.007494
  1.609529	 -1.277509	  0.016049
  1.613460	 -1.264607	  0.030818
  1.617391	 -1.251706	  0.045586
  1.621322	 -1.238804	  0.060354
  1.624155	 -1.231311	  0.078679
  1.624974	 -1.232587	  0.098622
  1.625794	 -1.233863	  0.118564
  1.626613	 -1.235139	  0.138507
  1.627432	 -1.236415	  0.158449
  1.627989	 -1.241010	  0.177906
  1.628353	 -1.247830	  0.196704
  1.628718	 -1.254649	  0.215502
  1.629083	 -1.261469	  0.234300
  1.629448	 -1.268289	  0.253097
  1.629813	 -1.275109	  0.271895
  1.630228	 -1.281156	  0.290954
  1.630715	 -1.286049	  0.310341
  1.631203	 -1.290943	  0.329727
  1.631691	 -1.295836	  0.349113
  1.632179	 -1.300729	  0.368499
  1.632106	 -1.304329	  0.388172
  1.629399	 -1.301572	  0.407795
  1.626692	 -1.298816	  0.427419
  1.623985	 -1.296060	  0.447042
  1.621278	 -1.293304	  0.466665
  1.616181	 -1.288316	  0.485351
  1.606836	 -1.279379	  0.500608
  1.597490	 -1.270442	  0.515866
  1.588144	 -1.261506	  0.531123
  1.578799	 -1.252569	  0.546381
  1.568243	 -1.242786	  0.560269
  1.555111	 -1.231311	  0.570060
  1.541979	 -1.219836	  0.579852
  1.528846	 -1.208361	  0.589643
  1.515074	 -1.194209	  0.592812
  1.501372	 -1.179772	  0.594772
  1.487670	 -1.165336	  0.596731
  1.473968	 -1.150899	  0.598690
  1.459668	 -1.137387	  0.595091
  1.445389	 -1.124212	  0.590346
  1.431110	 -1.111037	  0.585600
  1.416831	 -1.097862	  0.580855
  1.402551	 -1.084687	  0.576109
  1.388272	 -1.071512	  0.571364
  1.373993	 -1.058337	  0.566618
  1.358831	 -1.045981	  0.562438
  1.339742	 -1.040019	  0.562219
  1.320653	 -1.034057	  0.562001
  1.301563	 -1.028095	  0.561782
  1.282474	 -1.022133	  0.561563
  1.263384	 -1.016171	  0.561344
  1.244295	 -1.010209	  0.561125
  1.225205	 -1.004247	  0.560906
  1.206004	 -0.998651	  0.560996
  1.186398	 -0.997823	  0.564858
  1.166792	 -0.996995	  0.568721
  1.147186	 -0.996167	  0.572583
  1.127581	 -0.995339	  0.576446
  1.107975	 -0.994511	  0.580309
  1.088292	 -0.994900	  0.583836
  1.068784	 -0.998475	  0.586418
  1.049276	 -1.002050	  0.588999
  1.029768	 -1.005624	  0.591580
  1.010260	 -1.009199	  0.594162
  0.990841	 -1.013567	  0.596110
  0.971659	 -1.019148	  0.597064
  0.952477	 -1.024729	  0.598017
  0.939090	 -1.013914	  0.587828
  0.926015	 -1.002848	  0.577504
  0.912941	 -0.991781	  0.567179
  0.899866	 -0.980714	  0.556855
  0.886792	 -0.969647	  0.546531
  0.874099	 -0.958876	  0.535446
  0.862856	 -0.949243	  0.522001
  0.851612	 -0.939609	  0.508556
  0.841825	 -0.928956	  0.494745
  0.833712	 -0.917296	  0.480666
  0.825600	 -0.905635	  0.466587
  0.817487	 -0.893975	  0.452508
  0.808629	 -0.882919	  0.438391
  0.799639	 -0.871974	  0.424270
  0.790650	 -0.861028	  0.410150
  0.781660	 -0.850083	  0.396029
  0.772671	 -0.839138	  0.381908
  0.758893	 -0.828115	  0.372492
  0.743281	 -0.817522	  0.365855
  0.727669	 -0.806929	  0.359219
  0.712056	 -0.796336	  0.352582
  0.696098	 -0.784326	  0.353617
  0.680233	 -0.772276	  0.355377
  0.664181	 -0.760441	  0.356894
  0.647440	 -0.749512	  0.357437
  0.630699	 -0.738583	  0.357980
  0.614548	 -0.727216	  0.361128
  0.598795	 -0.715708	  0.365534
  0.582855	 -0.704547	  0.370154
  0.566243	 -0.694842	  0.375619
  0.549632	 -0.685137	  0.381085
  0.532911	 -0.675763	  0.386791
  0.516017	 -0.666979	  0.392910
  0.499124	 -0.658195	  0.399029
  0.482882	 -0.648066	  0.404826
  0.466757	 -0.637720	  0.410567
  0.451861	 -0.626096	  0.417124
  0.437368	 -0.614104	  0.423916
  0.422404	 -0.602177	  0.429733
  0.406196	 -0.590720	  0.432187
  0.389988	 -0.579262	  0.434640
  0.374040	 -0.567361	  0.436644
  0.358322	 -0.555101	  0.438271
  0.342653	 -0.542796	  0.440029
  0.327172	 -0.530335	  0.442273
  0.311690	 -0.517874	  0.444517
  0.295715	 -0.506407	  0.448163
  0.279578	 -0.495362	  0.452361
  0.263599	 -0.484204	  0.456851
  0.248007	 -0.472793	  0.462017
  0.232428	 -0.461370	  0.467193
  0.217520	 -0.449297	  0.472850
  0.202612	 -0.437223	  0.478507
  0.188037	 -0.424832	  0.484339
  0.173644	 -0.412273	  0.490265
  0.159290	 -0.399668	  0.496187
  0.145125	 -0.386840	  0.502087
  0.130960	 -0.374013	  0.507987
  0.116729	 -0.361169	  0.513689
  0.102463	 -0.348318	  0.519284
  0.088179	 -0.335472	  0.524849
  0.073348	 -0.322843	  0.529383
  0.058517	 -0.310215	  0.533917
  0.043479	 -0.297708	  0.538092
  0.028063	 -0.285451	  0.541575
  0.012648	 -0.273194	  0.545059
 -0.003089	 -0.261212	  0.548021
 -0.018932	 -0.249327	  0.550803
 -0.034837	 -0.237491	  0.553439
 -0.050976	 -0.225858	  0.555492
 -0.067115	 -0.214225	  0.557545
 -0.083361	 -0.202702	  0.559361
 -0.099654	 -0.191231	  0.561071
 -0.114712	 -0.178915	  0.565714
 -0.128579	 -0.166185	  0.572472
 -0.142707	 -0.154227	  0.580049
 -0.157233	 -0.144051	  0.589292
 -0.171760	 -0.133875	  0.598535
 -0.185755	 -0.122552	  0.607249
 -0.199607	 -0.110952	  0.615825
 -0.213528	 -0.098705	  0.623325
 -0.227460	 -0.085829	  0.629655
 -0.241393	 -0.072952	  0.635984
 -0.255339	 -0.059099	  0.639675
 -0.269278	 -0.045204	  0.643226
 -0.283334	 -0.031354	  0.646483
 -0.297819	 -0.017720	  0.648558
 -0.312303	 -0.004085	  0.650632
 -0.327084	  0.009246	  0.652588
 -0.342366	  0.022029	  0.654331
 -0.357648	  0.034812	  0.656074
 -0.373275	  0.047197	  0.657632
 -0.389104	  0.059336	  0.659079
 -0.404933	  0.071474	  0.660525
 -0.421136	  0.083121	  0.661876
 -0.437355	  0.094745	  0.663223
 -0.453637	  0.106305	  0.664350
 -0.470043	  0.117725	  0.665005
 -0.486450	  0.129144	  0.665660
 -0.502750	  0.140720	  0.666183
 -0.519023	  0.152337	  0.666672
 -0.535185	  0.164089	  0.667516
 -0.551151	  0.176050	  0.668934
 -0.567116	  0.188012	  0.670355
 -0.582873	  0.200121	  0.672612
 -0.598630	  0.212230	  0.674868
 -0.614337	  0.224334	  0.677476
 -0.630005	  0.236430	  0.680334
 -0.645681	  0.248508	  0.683231
 -0.661423	  0.260393	  0.686538
 -0.677166	  0.272277	  0.689845
 -0.693008	  0.283960	  0.693386
 -0.708940	  0.295450	  0.697148
 -0.724872	  0.306941	  0.700909
 -0.740993	  0.318045	  0.705009
 -0.757151	  0.329069	  0.709177
 -0.773364	  0.340026	  0.713311
 -0.789878	  0.350602	  0.717241
 -0.806392	  0.361178	  0.721171
 -0.823065	  0.371685	  0.724576
 -0.839830	  0.382146	  0.727658
 -0.856629	  0.392568	  0.730685
 -0.873875	  0.402439	  0.732957
 -0.891120	  0.412310	  0.735228
 -0.908320	  0.422236	  0.737603
 -0.925473	  0.432218	  0.740083
 -0.942598	  0.442231	  0.742622
 -0.959293	  0.452700	  0.746044
 -0.975988	  0.463168	  0.749465
 -0.992348	  0.474031	  0.753251
 -1.008522	  0.485101	  0.757231
 -1.024578	  0.496288	  0.761361
 -1.040268	  0.507818	  0.765933
 -1.055957	  0.519347	  0.770505
 -1.071167	  0.531149	  0.775926
 -1.086292	  0.542993	  0.781489
 -1.101131	  0.554997	  0.787464
 -1.115705	  0.567138	  0.793806
 -1.130261	  0.579274	  0.800196
 -1.144753	  0.591391	  0.806765
 -1.159244	  0.603509	  0.813334
 -1.174000	  0.615189	  0.820106
 -1.188899	  0.626620	  0.826987
 -1.203799	  0.638049	  0.833870
 -1.218774	  0.649359	  0.840785
 -1.233749	  0.660670	  0.847700
 -1.248808	  0.671956	  0.854471
 -1.263947	  0.683217	  0.861103
 -1.279084	  0.694482	  0.867736
 -1.294132	  0.705843	  0.874407
 -1.309179	  0.717204	  0.881078
 -1.324122	  0.728766	  0.887638
 -1.338995	  0.740459	  0.894125
 -1.353838	  0.752180	  0.900628
 -1.368521	  0.764053	  0.907218
 -1.383204	  0.775927	  0.913808
 -1.397853	  0.787715	  0.920622
 -1.412482	  0.799452	  0.927568
 -1.427116	  0.811192	  0.934497
 -1.441805	  0.822963	  0.941257
 -1.456493	  0.834734	  0.948018
 -1.471218	  0.846573	  0.954575
 -1.485977	  0.858473	  0.960944
 -1.500747	  0.870378	  0.967278
 -1.515716	  0.882356	  0.972976
 -1.530684	  0.894334	  0.978674
 -1.545783	  0.906370	  0.983886
 -1.560954	  0.918435	  0.988812
 -1.576171	  0.930463	  0.993689
 -1.591562	  0.942344	  0.998373
 -1.606953	  0.954226	  1.003057
 -1.622443	  0.965985	  1.007725
 -1.637986	  0.977677	  1.012385
 -1.653531	  0.989390	  1.016984
 -1.669083	  1.001205	  1.021291
 -1.684635	  1.013020	  1.025597
 -1.700033	  1.025235	  1.029296
 -1.715338	  1.037663	  1.032658
 -1.730642	  1.050092	  1.036020
 -1.746228	  1.062370	  1.038540
 -1.761814	  1.074648	  1.041055
 -1.777484	  1.086837	  1.043479
 -1.793354	  1.098808	  1.045678
 -1.809223	  1.110780	  1.047877
 -1.825241	  1.122465	  1.050501
 -1.841306	  1.134052	  1.053270
 -1.857356	  1.145663	  1.056022
 -1.873371	  1.157331	  1.058739
 -1.889385	  1.169000	  1.061456
 -1.905400	  1.180668	  1.064172
 -1.921700	  1.192496	  1.066873
 -1.938046	  1.203843	  1.068888
