  1.837054	  0.154913	 -1.714449
  1.872586	  0.171223	 -1.725947
  1.854803	  0.162866	 -1.721876
  1.837441	  0.155066	 -1.716224
  1.819784	  0.147494	 -1.711563
  1.800972	  0.138780	 -1.709065
  1.783291	  0.127967	 -1.704010
  1.767521	  0.118851	 -1.693723
  1.752813	  0.114819	 -1.683201
  1.733937	  0.110292	 -1.675134
  1.715861	  0.104495	 -1.667902
  1.698268	  0.098470	 -1.660522
  1.680665	  0.092487	 -1.653162
  1.663033	  0.087224	 -1.645310
  1.645407	  0.081955	 -1.637463
  1.627736	  0.077308	 -1.629331
  1.610035	  0.073624	 -1.620783
  1.592333	  0.069947	 -1.612234
  1.574670	  0.067363	 -1.603207
  1.557053	  0.065306	 -1.593955
  1.539532	  0.063435	 -1.584827
  1.521863	  0.059846	 -1.578093
  1.503328	  0.053466	 -1.574012
  1.483570	  0.050076	 -1.565822
  1.463207	  0.056335	 -1.548278
  1.448195	  0.059925	 -1.533980
  1.436267	  0.059754	 -1.526196
  1.416232	  0.056671	 -1.521721
  1.395409	  0.056429	 -1.516084
  1.377822	  0.057441	 -1.505122
  1.364508	  0.054246	 -1.490331
  1.351213	  0.049016	 -1.472731
  1.336345	  0.053500	 -1.456833
  1.320149	  0.063359	 -1.450774
  1.300397	  0.072022	 -1.449227
  1.282969	  0.082987	 -1.440348
  1.274929	  0.087664	 -1.421075
  1.269681	  0.087828	 -1.396294
  1.263698	  0.091927	 -1.374677
  1.256003	  0.105332	 -1.362306
  1.248038	  0.118258	 -1.350023
  1.237327	  0.127689	 -1.337803
  1.222680	  0.132312	 -1.324356
  1.208048	  0.133651	 -1.309256
  1.195879	  0.135552	 -1.294111
  1.188950	  0.139516	 -1.276057
  1.186963	  0.144424	 -1.252705
  1.183042	  0.152254	 -1.232133
  1.177751	  0.160218	 -1.217776
  1.168060	  0.167899	 -1.202739
  1.156749	  0.173865	 -1.188419
  1.143372	  0.179152	 -1.172266
  1.127711	  0.182370	 -1.159919
  1.114379	  0.181420	 -1.140675
  1.105818	  0.187750	 -1.121409
  1.100328	  0.197484	 -1.106782
  1.091310	  0.204756	 -1.090618
  1.082250	  0.209040	 -1.073068
  1.072562	  0.212787	 -1.056898
  1.060165	  0.214136	 -1.041563
  1.048241	  0.213564	 -1.026759
  1.036937	  0.214176	 -1.011603
  1.024837	  0.211661	 -0.996010
  1.012469	  0.204639	 -0.982187
  0.999835	  0.196662	 -0.968867
  0.987207	  0.188658	 -0.955576
  0.974584	  0.180845	 -0.942096
  0.962040	  0.174374	 -0.927866
  0.948946	  0.167674	 -0.914965
  0.935452	  0.157687	 -0.904871
  0.923354	  0.146242	 -0.891545
  0.914876	  0.140610	 -0.871388
  0.906734	  0.142903	 -0.848463
  0.894407	  0.143253	 -0.834414
  0.879121	  0.141303	 -0.822544
  0.864986	  0.138784	 -0.807001
  0.854934	  0.136616	 -0.789596
  0.844575	  0.133034	 -0.774019
  0.831125	  0.128935	 -0.759382
  0.816776	  0.130269	 -0.740551
  0.809317	  0.133171	 -0.720358
  0.805685	  0.129791	 -0.702950
  0.799304	  0.121135	 -0.684848
  0.792244	  0.112692	 -0.667121
  0.785252	  0.105734	 -0.649791
  0.777070	  0.100763	 -0.632882
  0.768852	  0.093961	 -0.616056
  0.760672	  0.085021	 -0.600615
  0.751737	  0.073164	 -0.587623
  0.742245	  0.061902	 -0.576889
  0.732900	  0.050449	 -0.570217
  0.724905	  0.042649	 -0.564900
  0.708100	  0.026610	 -0.564653
  0.699278	  0.012723	 -0.575324
  0.693019	  0.001557	 -0.585398
  0.680307	 -0.011416	 -0.598433
  0.671591	 -0.022108	 -0.615407
  0.667300	 -0.029736	 -0.627938
  0.657973	 -0.036524	 -0.644572
  0.647472	 -0.043496	 -0.668264
  0.644294	 -0.046334	 -0.680073
  0.637790	 -0.052430	 -0.699343
  0.628439	 -0.063010	 -0.721166
  0.622733	 -0.071638	 -0.732796
  0.612095	 -0.083230	 -0.748370
  0.600770	 -0.094970	 -0.767749
  0.591287	 -0.103302	 -0.785022
  0.582267	 -0.108169	 -0.796481
  0.561755	 -0.114047	 -0.806315
  0.544010	 -0.122095	 -0.811704
  0.532249	 -0.135453	 -0.824767
  0.517982	 -0.143916	 -0.838617
  0.504731	 -0.152589	 -0.846822
  0.494162	 -0.169364	 -0.852849
  0.482719	 -0.190973	 -0.862769
  0.465848	 -0.203300	 -0.867540
  0.440966	 -0.197627	 -0.864332
  0.407309	 -0.184722	 -0.864957
  0.389784	 -0.189127	 -0.875184
  0.374109	 -0.197785	 -0.877317
  0.359280	 -0.219890	 -0.883573
  0.348286	 -0.236856	 -0.883975
  0.330272	 -0.246523	 -0.885942
  0.310641	 -0.253828	 -0.881789
  0.296246	 -0.259869	 -0.873465
  0.272003	 -0.270515	 -0.859225
  0.258372	 -0.271170	 -0.853683
  0.233396	 -0.267977	 -0.855708
  0.208882	 -0.266928	 -0.856860
  0.191045	 -0.266160	 -0.855804
  0.169906	 -0.271489	 -0.852302
  0.150018	 -0.281112	 -0.849121
  0.134861	 -0.289813	 -0.843460
  0.117622	 -0.297318	 -0.834918
  0.099258	 -0.300850	 -0.825923
  0.084683	 -0.304797	 -0.816454
  0.065987	 -0.318957	 -0.801749
  0.056088	 -0.332773	 -0.786386
  0.043510	 -0.342524	 -0.774010
  0.032810	 -0.347740	 -0.767021
  0.012126	 -0.353382	 -0.753549
 -0.007672	 -0.358449	 -0.745334
 -0.023206	 -0.366122	 -0.740030
 -0.041976	 -0.377962	 -0.735693
 -0.056396	 -0.384779	 -0.730108
 -0.073380	 -0.388242	 -0.726950
 -0.099933	 -0.396122	 -0.714352
 -0.110496	 -0.402212	 -0.702098
 -0.121577	 -0.406944	 -0.695279
 -0.140468	 -0.414144	 -0.684400
 -0.156741	 -0.418421	 -0.678259
 -0.179929	 -0.422510	 -0.674106
 -0.198221	 -0.427836	 -0.669462
 -0.209995	 -0.438200	 -0.661344
 -0.227048	 -0.451498	 -0.648273
 -0.243278	 -0.456120	 -0.639742
 -0.265947	 -0.461744	 -0.631881
 -0.287296	 -0.466450	 -0.625392
 -0.303461	 -0.470436	 -0.620770
 -0.322120	 -0.478315	 -0.606205
 -0.330342	 -0.479539	 -0.599506
 -0.344872	 -0.483329	 -0.588706
 -0.366797	 -0.482900	 -0.577828
 -0.383905	 -0.481646	 -0.565668
 -0.401793	 -0.482951	 -0.546118
 -0.410707	 -0.484958	 -0.531791
 -0.425270	 -0.486876	 -0.516345
 -0.442650	 -0.490633	 -0.505625
 -0.461794	 -0.494996	 -0.494084
 -0.480513	 -0.501612	 -0.489032
 -0.494861	 -0.506750	 -0.483392
 -0.512379	 -0.516572	 -0.477638
 -0.530643	 -0.520700	 -0.468727
 -0.554551	 -0.522138	 -0.461012
 -0.570017	 -0.525599	 -0.456658
 -0.583392	 -0.530018	 -0.449916
 -0.599962	 -0.535063	 -0.436858
 -0.626568	 -0.539123	 -0.429493
 -0.642793	 -0.546524	 -0.429754
 -0.661676	 -0.556527	 -0.430981
 -0.681696	 -0.565348	 -0.430752
 -0.700600	 -0.567332	 -0.428020
 -0.722846	 -0.567437	 -0.424462
 -0.740220	 -0.570637	 -0.423441
 -0.759197	 -0.581466	 -0.426634
 -0.780793	 -0.590995	 -0.428259
 -0.797023	 -0.592707	 -0.425655
 -0.817193	 -0.585335	 -0.414331
 -0.842304	 -0.582021	 -0.402598
 -0.859815	 -0.587677	 -0.400106
 -0.873396	 -0.597512	 -0.400332
 -0.892236	 -0.607156	 -0.396918
 -0.912587	 -0.613700	 -0.393081
 -0.931556	 -0.619358	 -0.389700
 -0.949685	 -0.626159	 -0.384405
 -0.967204	 -0.633701	 -0.378237
 -0.984558	 -0.641225	 -0.371695
 -1.001902	 -0.648465	 -0.364959
 -1.019259	 -0.655378	 -0.358081
 -1.036676	 -0.662306	 -0.351221
 -1.054082	 -0.669174	 -0.344322
 -1.071191	 -0.676443	 -0.336877
 -1.087805	 -0.684163	 -0.328991
 -1.105370	 -0.690431	 -0.323498
 -1.127202	 -0.694923	 -0.321590
 -1.147866	 -0.700218	 -0.315786
 -1.162180	 -0.706283	 -0.306347
 -1.179009	 -0.711225	 -0.298054
 -1.200555	 -0.718969	 -0.285451
 -1.208460	 -0.726128	 -0.270418
 -1.214203	 -0.734680	 -0.251590
 -1.229601	 -0.744841	 -0.232055
 -1.247936	 -0.748752	 -0.225971
 -1.268756	 -0.750889	 -0.222586
 -1.284796	 -0.757343	 -0.210864
 -1.292205	 -0.766884	 -0.193632
 -1.303131	 -0.776083	 -0.178423
 -1.315892	 -0.785720	 -0.166270
 -1.328998	 -0.795317	 -0.154541
 -1.344965	 -0.803219	 -0.145176
 -1.361429	 -0.810833	 -0.136285
 -1.379959	 -0.815792	 -0.129641
 -1.399361	 -0.819562	 -0.124272
 -1.418611	 -0.823490	 -0.119667
 -1.438134	 -0.826752	 -0.115860
 -1.457289	 -0.830130	 -0.111963
 -1.476651	 -0.832032	 -0.110097
 -1.496332	 -0.835349	 -0.107006
 -1.516054	 -0.836742	 -0.106006
 -1.535843	 -0.839944	 -0.103355
 -1.554507	 -0.845469	 -0.098427
 -1.572997	 -0.851167	 -0.093281
 -1.591299	 -0.857068	 -0.087794
 -1.609435	 -0.863252	 -0.082100
 -1.627693	 -0.869600	 -0.077256
 -1.646446	 -0.876350	 -0.074543
 -1.665544	 -0.882431	 -0.071835
 -1.684696	 -0.887734	 -0.068240
 -1.703088	 -0.893083	 -0.061859
 -1.721032	 -0.899062	 -0.055176
 -1.738039	 -0.906395	 -0.047078
 -1.755022	 -0.913931	 -0.039666
 -1.771479	 -0.920329	 -0.032896
 -1.786838	 -0.924835	 -0.020543
 -1.804460	 -0.929058	 -0.009580
 -1.828918	 -0.941296	 -0.006293
 -1.844108	 -0.953342	 -0.008990
 -1.856693	 -0.966337	 -0.010160
 -1.878875	 -0.979431	 -0.002959
 -1.897389	 -0.983573	  0.007889
 -1.906684	 -0.981372	  0.021419
 -1.923665	 -0.982164	  0.037359
 -1.944341	 -0.987781	  0.048467
 -1.958752	 -0.999212	  0.052104
 -1.976301	 -1.012890	  0.056745
 -1.993977	 -1.017272	  0.066652
 -2.008480	 -1.014803	  0.078692
 -2.029648	 -1.014233	  0.093480
 -2.048646	 -1.020344	  0.102610
 -2.059901	 -1.030113	  0.106009
 -2.076385	 -1.040953	  0.113283
 -2.094617	 -1.047999	  0.122575
 -2.111632	 -1.053901	  0.131386
 -2.128608	 -1.060110	  0.139946
 -2.145585	 -1.066345	  0.148485
 -2.162642	 -1.072942	  0.156577
 -2.179813	 -1.080212	  0.163808
 -2.196986	 -1.087493	  0.171025
 -2.214165	 -1.094777	  0.178244
 -2.231578	 -1.102206	  0.185568
 -2.249919	 -1.111552	  0.193507
 -2.266515	 -1.120085	  0.200703
