 -2.445582	  0.150301	  0.538052
 -2.464242	  0.140243	  0.542958
 -2.433351	  0.156892	  0.534838
 -2.377462	  0.173752	  0.535034
 -2.334243	  0.191245	  0.539691
 -2.292021	  0.211013	  0.536751
 -2.249978	  0.229732	  0.529918
 -2.210241	  0.251334	  0.522764
 -2.168625	  0.279598	  0.518280
 -2.122680	  0.305920	  0.514894
 -2.077085	  0.329628	  0.511772
 -2.031655	  0.352206	  0.509145
 -1.988071	  0.374741	  0.506467
 -1.947323	  0.398009	  0.502274
 -1.909147	  0.421359	  0.496141
 -1.873638	  0.445196	  0.487799
 -1.843399	  0.473407	  0.477363
 -1.803716	  0.518402	  0.461045
 -1.745727	  0.536994	  0.442654
 -1.705306	  0.558435	  0.431532
 -1.667961	  0.591235	  0.440650
 -1.634278	  0.616100	  0.426150
 -1.592378	  0.645099	  0.400529
 -1.546220	  0.678601	  0.390321
 -1.502225	  0.707779	  0.385017
 -1.461566	  0.733209	  0.381211
 -1.420409	  0.758054	  0.377307
 -1.377494	  0.780733	  0.371749
 -1.331430	  0.801963	  0.363211
 -1.283408	  0.821509	  0.353873
 -1.233826	  0.838745	  0.345600
 -1.181661	  0.855135	  0.339664
 -1.127165	  0.871941	  0.337501
 -1.074442	  0.889335	  0.339992
 -1.023479	  0.908598	  0.348582
 -0.977440	  0.928621	  0.361934
 -0.935132	  0.950352	  0.376702
 -0.895808	  0.974161	  0.389840
 -0.855872	  0.999491	  0.400840
 -0.814170	  1.026848	  0.408978
 -0.770391	  1.055989	  0.413569
 -0.727265	  1.085041	  0.414612
 -0.688003	  1.112199	  0.414039
 -0.648350	  1.139944	  0.413624
 -0.609049	  1.168182	  0.414229
 -0.570805	  1.196435	  0.415758
 -0.533384	  1.224664	  0.417561
 -0.496521	  1.253125	  0.418515
 -0.457296	  1.283347	  0.417457
 -0.414527	  1.311998	  0.412449
 -0.366442	  1.335710	  0.399830
 -0.314146	  1.359677	  0.384511
 -0.272218	  1.381143	  0.377050
 -0.225480	  1.406566	  0.372524
 -0.186921	  1.432806	  0.378446
 -0.142721	  1.458347	  0.391363
 -0.087975	  1.479390	  0.415501
 -0.014013	  1.500204	  0.491842
  0.075857	  1.488360	  0.556496
  0.157849	  1.475749	  0.576487
  0.198949	  1.475934	  0.578164
  0.243868	  1.485343	  0.575496
  0.284584	  1.501938	  0.571495
  0.306928	  1.515553	  0.568487
  0.331256	  1.536136	  0.563595
  0.360898	  1.570758	  0.555621
  0.391378	  1.620498	  0.545583
  0.414761	  1.671108	  0.534908
  0.423782	  1.690658	  0.524935
  0.445466	  1.731954	  0.477739
  0.473947	  1.781118	  0.377717
  0.498880	  1.842242	  0.286737
  0.560868	  1.899048	  0.265828
  0.613770	  1.929656	  0.271320
  0.656459	  1.954391	  0.279515
  0.695733	  1.979010	  0.289059
  0.734200	  2.006713	  0.294534
  0.774295	  2.037290	  0.293009
  0.813512	  2.067606	  0.284516
  0.851182	  2.097328	  0.272189
  0.888287	  2.127255	  0.258246
  0.926936	  2.158268	  0.242876
  0.969294	  2.189311	  0.226190
  1.014543	  2.217808	  0.210060
  1.062238	  2.242964	  0.196159
  1.111201	  2.265404	  0.184811
  1.153838	  2.283901	  0.177599
