 -0.024175	 -0.590128	  2.433393
 -0.028116	 -0.616385	  2.463725
 -0.025231	 -0.602709	  2.449420
 -0.021751	 -0.589053	  2.435234
 -0.017933	 -0.575438	  2.421129
 -0.012176	 -0.561572	  2.407972
 -0.006081	 -0.547657	  2.394947
  0.002115	 -0.533755	  2.383152
  0.011994	 -0.519969	  2.372556
  0.021929	 -0.506189	  2.361995
  0.032785	 -0.492671	  2.352144
  0.047394	 -0.480366	  2.346429
  0.062177	 -0.468004	  2.341064
  0.076948	 -0.455625	  2.335719
  0.091741	 -0.443246	  2.330455
  0.107330	 -0.431191	  2.327778
  0.123931	 -0.420352	  2.330074
  0.139506	 -0.409607	  2.333489
  0.153398	 -0.399802	  2.339100
  0.164490	 -0.388375	  2.326340
  0.172729	 -0.377973	  2.314304
  0.174285	 -0.368287	  2.301369
  0.175770	 -0.358859	  2.280410
  0.177490	 -0.350657	  2.256551
  0.180278	 -0.345205	  2.245416
  0.186442	 -0.334137	  2.226988
  0.192381	 -0.327765	  2.205321
  0.200859	 -0.327892	  2.188361
  0.211072	 -0.329534	  2.169324
  0.218676	 -0.326073	  2.149822
  0.224430	 -0.319075	  2.133905
  0.229302	 -0.315540	  2.114445
  0.238880	 -0.313715	  2.089641
  0.245757	 -0.309697	  2.076777
  0.247578	 -0.304720	  2.061847
  0.246830	 -0.302657	  2.041981
  0.247528	 -0.303781	  2.020855
  0.249080	 -0.305092	  2.002159
  0.246328	 -0.310021	  1.981577
  0.240393	 -0.319646	  1.966021
  0.233431	 -0.333363	  1.964110
  0.228965	 -0.358219	  1.936758
  0.244413	 -0.333608	  1.906098
  0.252704	 -0.319690	  1.908496
  0.262011	 -0.315401	  1.897153
  0.269733	 -0.315415	  1.876711
  0.274701	 -0.313440	  1.860092
  0.276276	 -0.311393	  1.838795
  0.271459	 -0.309990	  1.821660
  0.270048	 -0.312578	  1.808077
  0.270754	 -0.317670	  1.793349
  0.276138	 -0.321738	  1.779715
  0.268759	 -0.326778	  1.760239
  0.256909	 -0.332514	  1.744418
  0.242369	 -0.333903	  1.731801
  0.225271	 -0.336365	  1.719002
  0.211372	 -0.341865	  1.703059
  0.203715	 -0.344952	  1.687393
  0.198413	 -0.346529	  1.670277
  0.188247	 -0.349439	  1.651314
  0.175801	 -0.361875	  1.629479
  0.164178	 -0.358993	  1.618917
  0.155089	 -0.362299	  1.604480
  0.141053	 -0.361267	  1.588237
  0.127175	 -0.355528	  1.574195
  0.109367	 -0.350962	  1.560691
  0.092938	 -0.352370	  1.548771
  0.080000	 -0.347038	  1.544099
  0.061798	 -0.341796	  1.528704
  0.049524	 -0.334852	  1.516303
  0.037700	 -0.328155	  1.503527
  0.027605	 -0.321642	  1.491011
  0.018020	 -0.309863	  1.475796
  0.004390	 -0.301860	  1.461300
 -0.010106	 -0.296055	  1.452845
 -0.028157	 -0.288889	  1.445743
 -0.048896	 -0.275016	  1.434635
 -0.057937	 -0.269288	  1.424805
 -0.070110	 -0.259653	  1.411823
 -0.080792	 -0.245876	  1.401900
 -0.092252	 -0.230633	  1.394396
 -0.110137	 -0.217836	  1.390467
 -0.128986	 -0.211196	  1.386774
 -0.148760	 -0.208369	  1.384664
 -0.166221	 -0.198092	  1.372790
 -0.182641	 -0.180566	  1.361136
 -0.186428	 -0.163568	  1.354396
 -0.190890	 -0.146702	  1.348900
 -0.204355	 -0.130696	  1.340356
 -0.223867	 -0.112998	  1.331534
 -0.234882	 -0.098835	  1.319893
 -0.245835	 -0.087953	  1.312939
 -0.253732	 -0.075744	  1.299155
 -0.261462	 -0.058376	  1.282642
 -0.267822	 -0.047422	  1.271390
 -0.267726	 -0.035505	  1.253704
 -0.268822	 -0.012699	  1.227777
 -0.264905	 -0.006832	  1.217575
 -0.261903	  0.004648	  1.200742
 -0.256617	  0.020449	  1.179992
 -0.250648	  0.028841	  1.168778
 -0.240832	  0.039745	  1.156854
 -0.221663	  0.057742	  1.140327
 -0.212669	  0.063343	  1.131885
 -0.204139	  0.068852	  1.116815
 -0.188101	  0.072996	  1.094255
 -0.178959	  0.077357	  1.073998
 -0.171392	  0.079736	  1.054665
 -0.158544	  0.080616	  1.037299
 -0.142587	  0.080315	  1.028807
 -0.119261	  0.086303	  1.021335
 -0.094846	  0.091212	  1.016692
 -0.076193	  0.095530	  1.009519
 -0.061496	  0.099191	  1.002279
 -0.044289	  0.100316	  0.990170
 -0.031086	  0.098376	  0.978961
 -0.015512	  0.097637	  0.966909
  0.000094	  0.105269	  0.953210
  0.014458	  0.114377	  0.941748
  0.028079	  0.123259	  0.931309
  0.039672	  0.125362	  0.918375
  0.054639	  0.121718	  0.904113
  0.070209	  0.123243	  0.890059
  0.080289	  0.134125	  0.875318
  0.088839	  0.149135	  0.861753
  0.099870	  0.157430	  0.854832
  0.107281	  0.167309	  0.843951
  0.118155	  0.177198	  0.828281
  0.127177	  0.186090	  0.813833
  0.130423	  0.195196	  0.802516
  0.134261	  0.204816	  0.785057
  0.134224	  0.217025	  0.765363
  0.134169	  0.223807	  0.753141
  0.133972	  0.241519	  0.737123
  0.140513	  0.257001	  0.725848
  0.141859	  0.265860	  0.719469
  0.140744	  0.275344	  0.701860
  0.140412	  0.286962	  0.676613
  0.143736	  0.298347	  0.662722
  0.145403	  0.313969	  0.645429
  0.147515	  0.324889	  0.628666
  0.148769	  0.333217	  0.610215
  0.153069	  0.343436	  0.590033
  0.156090	  0.357707	  0.573687
  0.162726	  0.375087	  0.562413
  0.169708	  0.387232	  0.552886
  0.176785	  0.397185	  0.537343
  0.183201	  0.405239	  0.518361
  0.188908	  0.416354	  0.500908
  0.191909	  0.430647	  0.488730
  0.193717	  0.446223	  0.476687
  0.198754	  0.457976	  0.459776
  0.204100	  0.467173	  0.443559
  0.206239	  0.477821	  0.428338
  0.211900	  0.487295	  0.411570
  0.216381	  0.497441	  0.396250
  0.222540	  0.505492	  0.379756
  0.231216	  0.514954	  0.363030
  0.234801	  0.529164	  0.346434
  0.232614	  0.540748	  0.329313
  0.229367	  0.553251	  0.312680
  0.228097	  0.562811	  0.302446
  0.232309	  0.576326	  0.286791
  0.239141	  0.590760	  0.268389
  0.241695	  0.603323	  0.251712
  0.238854	  0.611563	  0.242421
  0.228370	  0.626851	  0.225952
  0.228766	  0.649429	  0.210633
  0.233036	  0.660203	  0.203270
  0.234882	  0.673411	  0.190019
  0.229010	  0.676405	  0.171369
  0.209330	  0.673869	  0.150980
  0.198955	  0.682189	  0.136795
  0.189295	  0.679766	  0.129497
  0.174480	  0.693900	  0.115679
  0.165470	  0.683924	  0.110344
  0.155714	  0.702834	  0.087821
  0.162228	  0.722120	  0.070108
  0.152862	  0.721738	  0.057911
  0.145839	  0.728295	  0.037537
  0.135874	  0.729202	  0.018210
  0.123139	  0.730956	  0.001811
  0.106345	  0.734950	 -0.013554
  0.092610	  0.739054	 -0.024788
  0.077250	  0.740866	 -0.036462
  0.063874	  0.738369	 -0.056875
  0.057736	  0.737195	 -0.071714
  0.048253	  0.730487	 -0.092155
  0.039168	  0.724998	 -0.115191
  0.026995	  0.731126	 -0.132636
  0.016185	  0.742336	 -0.144031
  0.002440	  0.751988	 -0.156802
 -0.011121	  0.756985	 -0.175094
 -0.020969	  0.758450	 -0.197553
 -0.021836	  0.758171	 -0.218830
 -0.019398	  0.762579	 -0.241506
 -0.017795	  0.771615	 -0.257548
 -0.017284	  0.785540	 -0.273733
 -0.026302	  0.793819	 -0.295507
 -0.027997	  0.802566	 -0.311407
 -0.029983	  0.811232	 -0.331302
 -0.032594	  0.820935	 -0.350516
 -0.030306	  0.833379	 -0.364191
 -0.022443	  0.845285	 -0.381041
 -0.016724	  0.854769	 -0.398013
 -0.013256	  0.865033	 -0.409463
 -0.001667	  0.878982	 -0.422690
  0.002269	  0.887187	 -0.443105
  0.009174	  0.904685	 -0.456014
  0.012835	  0.917015	 -0.475484
  0.016720	  0.929357	 -0.487484
  0.028513	  0.943517	 -0.497437
  0.040734	  0.958284	 -0.505076
  0.053179	  0.974847	 -0.510817
  0.062749	  0.991214	 -0.513665
  0.068677	  1.011241	 -0.518708
  0.077650	  1.028545	 -0.523751
  0.085020	  1.045654	 -0.528817
  0.089046	  1.063311	 -0.532607
  0.099167	  1.075344	 -0.539186
  0.103501	  1.093750	 -0.542922
  0.107528	  1.113320	 -0.546491
  0.115851	  1.131225	 -0.551475
  0.118927	  1.150291	 -0.556125
  0.128104	  1.168265	 -0.561757
  0.131908	  1.187888	 -0.564700
  0.141228	  1.206835	 -0.566084
  0.143890	  1.230122	 -0.567005
  0.153984	  1.250898	 -0.567043
  0.160894	  1.267260	 -0.565630
  0.172965	  1.284327	 -0.559932
  0.183114	  1.305580	 -0.556483
  0.195334	  1.318075	 -0.549607
  0.203217	  1.324640	 -0.530403
  0.205092	  1.351621	 -0.537982
  0.219492	  1.363537	 -0.511724
  0.237745	  1.397598	 -0.511156
  0.236576	  1.398107	 -0.488373
  0.220501	  1.385595	 -0.538355
  0.204221	  1.430241	 -0.518268
  0.198045	  1.478125	 -0.421672
  0.250819	  1.552770	 -0.463684
  0.348483	  1.509048	 -0.513496
  0.342705	  1.524424	 -0.511428
  0.260974	  1.559377	 -0.469596
  0.207288	  1.607229	 -0.530490
  0.198524	  1.607886	 -0.545387
  0.255534	  1.681204	 -0.591963
  0.354946	  1.677717	 -0.547367
  0.391615	  1.619401	 -0.530069
  0.409591	  1.646341	 -0.513356
  0.464862	  1.646761	 -0.538645
  0.448668	  1.660123	 -0.561127
  0.425455	  1.618847	 -0.578493
  0.398690	  1.651253	 -0.584328
  0.424331	  1.667787	 -0.614437
  0.391414	  1.652672	 -0.648797
  0.408894	  1.644627	 -0.660082
  0.424023	  1.652321	 -0.677973
  0.412066	  1.647646	 -0.695574
  0.397327	  1.648145	 -0.705796
  0.393583	  1.652357	 -0.710768
  0.376489	  1.644753	 -0.719275
  0.362062	  1.646947	 -0.734167
  0.350184	  1.639128	 -0.738339
  0.344135	  1.638204	 -0.749157
  0.339666	  1.649521	 -0.763823
  0.336549	  1.664752	 -0.778981
  0.327403	  1.676901	 -0.799508
  0.317003	  1.677606	 -0.822656
  0.311931	  1.685853	 -0.841487
  0.308246	  1.691951	 -0.849722
  0.304056	  1.702637	 -0.867618
  0.300154	  1.720693	 -0.881954
  0.297296	  1.728992	 -0.897298
  0.300099	  1.742504	 -0.908542
  0.307556	  1.762896	 -0.927414
  0.311132	  1.769638	 -0.943075
  0.306678	  1.780952	 -0.954951
  0.301222	  1.795133	 -0.974709
  0.301120	  1.805390	 -0.992428
  0.302522	  1.816313	 -1.005797
  0.304910	  1.825932	 -1.025792
  0.307197	  1.837025	 -1.038918
  0.313406	  1.845691	 -1.053001
  0.318221	  1.865076	 -1.070116
  0.322204	  1.877064	 -1.083036
  0.328204	  1.889723	 -1.097533
  0.333094	  1.902046	 -1.112178
  0.338126	  1.914233	 -1.129228
  0.338569	  1.930153	 -1.142487
  0.333521	  1.948407	 -1.163017
  0.329180	  1.962452	 -1.176121
  0.326194	  1.970414	 -1.194215
  0.323945	  1.978120	 -1.212247
  0.325173	  1.982184	 -1.233194
  0.327961	  1.982323	 -1.255101
  0.336485	  1.971610	 -1.286218
  0.340411	  1.984519	 -1.300981
