  1.337541	 -1.135683	  1.717027
  1.341759	 -1.131622	  1.721743
  1.331946	 -1.142960	  1.711034
  1.321806	 -1.158817	  1.699415
  1.311643	 -1.172091	  1.681947
  1.301940	 -1.175582	  1.670981
  1.286910	 -1.184523	  1.658032
  1.272964	 -1.194149	  1.646625
  1.260413	 -1.204061	  1.633944
  1.247731	 -1.212541	  1.620888
  1.234876	 -1.220834	  1.608825
  1.220983	 -1.226290	  1.595689
  1.206678	 -1.235024	  1.579733
  1.194910	 -1.245265	  1.570115
  1.181295	 -1.259801	  1.565822
  1.166474	 -1.277920	  1.557012
  1.155429	 -1.286036	  1.543066
  1.142326	 -1.288164	  1.529613
  1.125855	 -1.294138	  1.513912
  1.112580	 -1.308087	  1.504750
  1.100432	 -1.320400	  1.500254
  1.084913	 -1.332518	  1.492185
  1.070857	 -1.345103	  1.483605
  1.058092	 -1.358353	  1.476669
  1.046299	 -1.369616	  1.466771
  1.035721	 -1.380634	  1.454756
  1.020067	 -1.396125	  1.441724
  1.007401	 -1.407463	  1.436851
  0.992546	 -1.420099	  1.433873
  0.976867	 -1.434604	  1.426973
  0.968970	 -1.445298	  1.414653
  0.958815	 -1.458567	  1.400280
  0.946276	 -1.472147	  1.391609
  0.932761	 -1.485521	  1.388803
  0.917006	 -1.501396	  1.383225
  0.908558	 -1.513091	  1.372152
  0.899636	 -1.526950	  1.359187
  0.888140	 -1.541751	  1.349864
  0.876610	 -1.555954	  1.346272
  0.861502	 -1.573558	  1.341366
  0.850979	 -1.587686	  1.332261
  0.844890	 -1.600810	  1.321559
  0.834358	 -1.617328	  1.310040
  0.822231	 -1.632852	  1.302336
  0.814383	 -1.645615	  1.299031
  0.803705	 -1.664295	  1.293437
  0.793710	 -1.680904	  1.286865
  0.784392	 -1.697323	  1.280268
  0.775000	 -1.713734	  1.273740
  0.765883	 -1.730296	  1.267200
  0.757050	 -1.746986	  1.260607
  0.748239	 -1.763661	  1.253933
  0.739694	 -1.780313	  1.246870
  0.731146	 -1.796913	  1.239740
  0.722526	 -1.813096	  1.233642
  0.711546	 -1.830340	  1.229783
  0.701120	 -1.847198	  1.225366
  0.695804	 -1.863840	  1.213523
  0.689878	 -1.880807	  1.199547
  0.677202	 -1.895662	  1.192852
  0.664932	 -1.910915	  1.186880
  0.660166	 -1.923807	  1.176918
  0.656068	 -1.938068	  1.165790
  0.647862	 -1.955422	  1.151973
  0.641279	 -1.969885	  1.138149
  0.632553	 -1.985156	  1.125107
  0.622058	 -1.999888	  1.112770
  0.611331	 -2.009227	  1.109343
  0.597119	 -2.022900	  1.100406
  0.584860	 -2.036023	  1.089509
  0.573716	 -2.048727	  1.078021
  0.562739	 -2.061088	  1.066750
  0.551519	 -2.073222	  1.055482
  0.540281	 -2.085269	  1.044167
  0.529479	 -2.097714	  1.033425
  0.521145	 -2.112277	  1.023878
  0.509685	 -2.130103	  1.014440
  0.497012	 -2.144680	  1.006833
  0.482698	 -2.152976	  0.995895
  0.470556	 -2.161174	  0.982681
  0.459084	 -2.170758	  0.969561
  0.446575	 -2.181918	  0.958098
  0.435608	 -2.194912	  0.947311
  0.423160	 -2.207750	  0.936568
  0.409664	 -2.218291	  0.926900
  0.395345	 -2.228159	  0.917398
  0.382049	 -2.238714	  0.907168
  0.370026	 -2.250154	  0.894866
  0.357227	 -2.262148	  0.884283
  0.343246	 -2.273946	  0.876189
  0.324863	 -2.288083	  0.867763
  0.311502	 -2.299585	  0.858319
