 -0.388115	  0.952174	  2.289877
 -0.378741	  0.961854	  2.276267
 -0.378676	  0.961921	  2.276173
 -0.373402	  0.977989	  2.263170
 -0.368497	  0.993726	  2.247409
 -0.368737	  1.006895	  2.230422
 -0.372349	  1.018264	  2.211196
 -0.371763	  1.027334	  2.190065
 -0.366418	  1.030628	  2.174708
 -0.352519	  1.029157	  2.153558
 -0.336313	  1.032553	  2.132842
 -0.327227	  1.040723	  2.119103
 -0.319620	  1.051220	  2.105377
 -0.311411	  1.062991	  2.089294
 -0.302711	  1.071487	  2.071831
 -0.296252	  1.075507	  2.057616
 -0.288104	  1.077919	  2.036946
 -0.278928	  1.081251	  2.019778
 -0.267254	  1.087168	  2.004208
 -0.256612	  1.096649	  1.988869
 -0.248140	  1.105994	  1.972878
 -0.241871	  1.113262	  1.953783
 -0.237901	  1.119573	  1.933786
 -0.234834	  1.127758	  1.915365
 -0.229941	  1.135279	  1.899320
 -0.224112	  1.143860	  1.883418
 -0.217774	  1.153125	  1.866335
 -0.212247	  1.160362	  1.847724
 -0.208455	  1.167155	  1.829202
 -0.203092	  1.175812	  1.811303
 -0.198496	  1.188065	  1.796401
 -0.188421	  1.199915	  1.784651
 -0.173678	  1.208601	  1.774064
 -0.162676	  1.215754	  1.761584
 -0.148425	  1.223479	  1.749979
 -0.129019	  1.233213	  1.736754
 -0.118004	  1.238625	  1.727889
 -0.102796	  1.245099	  1.714926
 -0.079388	  1.256374	  1.703569
 -0.065594	  1.264676	  1.700660
 -0.051835	  1.274733	  1.696413
 -0.037249	  1.287750	  1.688908
 -0.023972	  1.298384	  1.678214
 -0.010545	  1.309396	  1.662193
 -0.000416	  1.317014	  1.649416
  0.009807	  1.324228	  1.636340
  0.030675	  1.333259	  1.620343
  0.045531	  1.340048	  1.613454
  0.060589	  1.349976	  1.610843
  0.076526	  1.369277	  1.600015
  0.083936	  1.382654	  1.581903
  0.090104	  1.391104	  1.563408
  0.094870	  1.395618	  1.547419
  0.103689	  1.404788	  1.527499
  0.108089	  1.416934	  1.507383
  0.110159	  1.424406	  1.491029
  0.113491	  1.433429	  1.471876
  0.112034	  1.444590	  1.448032
  0.107013	  1.450727	  1.427918
  0.101219	  1.451168	  1.413852
  0.096235	  1.451904	  1.393076
  0.091840	  1.454364	  1.372195
  0.089809	  1.458302	  1.352551
  0.087429	  1.462922	  1.333160
  0.083693	  1.466480	  1.314353
  0.075228	  1.466584	  1.295518
  0.069230	  1.463576	  1.272507
  0.068697	  1.466920	  1.252311
  0.070816	  1.478197	  1.236464
  0.079116	  1.494265	  1.216446
  0.087617	  1.500674	  1.197765
  0.093945	  1.504103	  1.180992
  0.099962	  1.506862	  1.161114
  0.103489	  1.510680	  1.137998
  0.104810	  1.514905	  1.121467
  0.106159	  1.523678	  1.100253
  0.108297	  1.532221	  1.084353
  0.110942	  1.538611	  1.068636
  0.114694	  1.545958	  1.050639
  0.115751	  1.553938	  1.032781
  0.118799	  1.567941	  1.012905
  0.122046	  1.581538	  0.996337
  0.125468	  1.598458	  0.981891
  0.126745	  1.608356	  0.973107
  0.128869	  1.624053	  0.961635
  0.134114	  1.641923	  0.945455
  0.137920	  1.655694	  0.932773
  0.144004	  1.670582	  0.921774
  0.148833	  1.683539	  0.910102
  0.154035	  1.696979	  0.897267
  0.161550	  1.709203	  0.883038
  0.171940	  1.720641	  0.869889
  0.183183	  1.736299	  0.854698
  0.191888	  1.746134	  0.845033
  0.203403	  1.760491	  0.835240
  0.213543	  1.780686	  0.823245
  0.219853	  1.790846	  0.819035
  0.230949	  1.803090	  0.807202
  0.238086	  1.813950	  0.799407
  0.248271	  1.825539	  0.786333
  0.269297	  1.846844	  0.766066
  0.275010	  1.858660	  0.754309
  0.280362	  1.872846	  0.750904
  0.288081	  1.887102	  0.745453
  0.297421	  1.907533	  0.735175
  0.304871	  1.918237	  0.727727
  0.316619	  1.934588	  0.719379
  0.331695	  1.947109	  0.711366
  0.343938	  1.957766	  0.701375
  0.355627	  1.971039	  0.688319
  0.365680	  1.994312	  0.676357
  0.367935	  2.008112	  0.672750
  0.375675	  2.028520	  0.668662
  0.390542	  2.042499	  0.671818
  0.403702	  2.059785	  0.668565
  0.414546	  2.076512	  0.665306
  0.424968	  2.093418	  0.662760
  0.435340	  2.110313	  0.660114
  0.445331	  2.127477	  0.657799
  0.453775	  2.145575	  0.656861
  0.462142	  2.163719	  0.655985
  0.470468	  2.181884	  0.655167
  0.478351	  2.200263	  0.655023
  0.486246	  2.218638	  0.654920
  0.494225	  2.236978	  0.654827
  0.502661	  2.255072	  0.653757
  0.511898	  2.272632	  0.651259
  0.521274	  2.290132	  0.648783
  0.530329	  2.307765	  0.646082
  0.539192	  2.325319	  0.642906
  0.549396	  2.339077	  0.632699
  0.562261	  2.355788	  0.619780
  0.570228	  2.366095	  0.611816
