 -1.586088	 -0.992855	  1.786047
 -1.603188	 -0.965033	  1.809161
 -1.593868	 -0.979627	  1.799154
 -1.584573	 -0.994166	  1.789083
 -1.574459	 -1.008858	  1.780067
 -1.563941	 -1.023715	  1.771559
 -1.553738	 -1.038780	  1.763051
 -1.544339	 -1.053644	  1.754059
 -1.534293	 -1.068842	  1.745655
 -1.523661	 -1.083806	  1.738068
 -1.512438	 -1.098951	  1.731350
 -1.501732	 -1.114900	  1.723874
 -1.492117	 -1.129912	  1.715972
 -1.482606	 -1.145505	  1.708202
 -1.472671	 -1.161387	  1.700531
 -1.463074	 -1.176749	  1.693914
 -1.453102	 -1.194529	  1.685508
 -1.443989	 -1.210125	  1.677919
 -1.435590	 -1.223849	  1.667817
 -1.426848	 -1.239248	  1.656973
 -1.420285	 -1.254396	  1.646828
 -1.414394	 -1.270750	  1.634210
 -1.407167	 -1.287476	  1.623758
 -1.398482	 -1.298145	  1.612355
 -1.390019	 -1.311829	  1.598850
 -1.383877	 -1.326005	  1.585730
 -1.379285	 -1.338831	  1.572572
 -1.372397	 -1.352442	  1.556952
 -1.363455	 -1.367213	  1.545374
 -1.357329	 -1.380898	  1.532698
 -1.353615	 -1.390726	  1.518071
 -1.348026	 -1.402706	  1.501565
 -1.341657	 -1.414007	  1.485967
 -1.335115	 -1.424760	  1.470424
 -1.328572	 -1.435513	  1.454882
 -1.321990	 -1.445674	  1.438962
 -1.315362	 -1.454862	  1.422479
 -1.308737	 -1.464052	  1.405999
 -1.302082	 -1.473055	  1.389425
 -1.295261	 -1.480372	  1.372144
 -1.288817	 -1.487695	  1.354837
 -1.282968	 -1.494374	  1.337588
 -1.276291	 -1.500517	  1.318238
 -1.270803	 -1.508641	  1.301290
 -1.263396	 -1.518533	  1.285970
 -1.250790	 -1.526865	  1.270341
 -1.239910	 -1.533939	  1.255688
 -1.232488	 -1.549452	  1.243813
 -1.227635	 -1.562041	  1.228373
 -1.219946	 -1.568501	  1.212928
 -1.211171	 -1.581015	  1.199686
 -1.202850	 -1.593575	  1.184499
 -1.198222	 -1.608159	  1.170726
 -1.188345	 -1.623365	  1.164957
 -1.174862	 -1.636846	  1.155488
 -1.165974	 -1.651067	  1.139177
 -1.169464	 -1.668957	  1.123529
 -1.169418	 -1.686610	  1.113555
 -1.159818	 -1.696765	  1.107217
 -1.147315	 -1.713670	  1.095404
 -1.141893	 -1.729963	  1.084333
 -1.138408	 -1.750810	  1.074883
 -1.132030	 -1.767782	  1.063703
 -1.122131	 -1.777172	  1.058839
 -1.110265	 -1.792554	  1.047168
 -1.101123	 -1.806734	  1.035987
 -1.090519	 -1.820600	  1.025160
 -1.079008	 -1.833291	  1.015569
 -1.065920	 -1.845046	  1.006505
 -1.055076	 -1.860406	  0.994234
 -1.050284	 -1.871471	  0.979000
 -1.042413	 -1.880316	  0.962187
 -1.026924	 -1.894262	  0.950564
 -1.014006	 -1.904387	  0.944573
 -1.003863	 -1.915635	  0.931901
 -0.991229	 -1.926995	  0.918551
 -0.977854	 -1.938521	  0.908156
 -0.968287	 -1.953976	  0.901838
 -0.958709	 -1.971751	  0.895126
 -0.944271	 -1.987816	  0.890214
 -0.933515	 -2.001544	  0.883948
 -0.924206	 -2.017599	  0.874935
 -0.916751	 -2.034943	  0.868794
 -0.908247	 -2.053026	  0.863590
 -0.902116	 -2.071036	  0.859429
 -0.895291	 -2.089064	  0.853331
 -0.887599	 -2.106286	  0.846217
 -0.879652	 -2.122743	  0.838093
 -0.871705	 -2.139199	  0.829968
 -0.863755	 -2.155655	  0.821843
 -0.854861	 -2.170733	  0.812172
 -0.845880	 -2.185669	  0.802359
 -0.836899	 -2.200604	  0.792548
 -0.827411	 -2.214824	  0.782166
 -0.817590	 -2.228535	  0.771416
 -0.807770	 -2.242246	  0.760665
 -0.797582	 -2.255435	  0.749608
 -0.787007	 -2.268034	  0.738231
 -0.776433	 -2.280634	  0.726861
 -0.765602	 -2.292912	  0.715436
 -0.754373	 -2.304856	  0.703806
 -0.743165	 -2.316557	  0.692083
 -0.731871	 -2.327731	  0.680111
 -0.720474	 -2.339466	  0.668469
 -0.709167	 -2.350704	  0.656329
 -0.697969	 -2.362179	  0.644672
 -0.686577	 -2.374126	  0.632962
 -0.675929	 -2.386231	  0.621044
 -0.666051	 -2.397482	  0.608164
 -0.655858	 -2.409406	  0.595579
 -0.646406	 -2.421209	  0.582447
 -0.637150	 -2.432927	  0.569142
 -0.627894	 -2.444643	  0.555835
 -0.618861	 -2.455927	  0.542012
 -0.609880	 -2.467114	  0.528077
 -0.600902	 -2.478295	  0.514134
 -0.592084	 -2.489334	  0.499979
 -0.583266	 -2.500372	  0.485822
 -0.574430	 -2.511430	  0.471641
 -0.565285	 -2.522954	  0.456633
 -0.556620	 -2.533894	  0.442307
