 -0.178765	 -0.848796	 -2.329019
 -0.173492	 -0.858059	 -2.348902
 -0.178247	 -0.849832	 -2.331309
 -0.183445	 -0.840733	 -2.314273
 -0.188757	 -0.831442	 -2.297379
 -0.194161	 -0.821712	 -2.280774
 -0.199834	 -0.811606	 -2.264477
 -0.205768	 -0.800926	 -2.248652
 -0.212009	 -0.789520	 -2.233480
 -0.218505	 -0.777940	 -2.218517
 -0.225118	 -0.765922	 -2.203968
 -0.231750	 -0.753905	 -2.189422
 -0.238572	 -0.742951	 -2.174142
 -0.245509	 -0.732941	 -2.158277
 -0.252454	 -0.722934	 -2.142415
 -0.259582	 -0.713571	 -2.126245
 -0.267109	 -0.705778	 -2.109433
 -0.274642	 -0.697992	 -2.092622
 -0.282194	 -0.690473	 -2.075697
 -0.289806	 -0.683924	 -2.058402
 -0.297644	 -0.677364	 -2.041220
 -0.305695	 -0.670949	 -2.024065
 -0.313520	 -0.665151	 -2.006769
 -0.324114	 -0.659573	 -1.990694
 -0.335196	 -0.655361	 -1.973102
 -0.342025	 -0.651394	 -1.954457
 -0.344897	 -0.646150	 -1.935540
 -0.347437	 -0.642796	 -1.915737
 -0.351583	 -0.642989	 -1.896083
 -0.357720	 -0.642322	 -1.876169
 -0.368845	 -0.639924	 -1.857032
 -0.384926	 -0.633131	 -1.843159
 -0.400386	 -0.617324	 -1.827828
 -0.406420	 -0.604480	 -1.815640
 -0.409098	 -0.597970	 -1.797435
 -0.410954	 -0.596732	 -1.777208
 -0.416554	 -0.596303	 -1.756291
 -0.425176	 -0.592849	 -1.738015
 -0.434909	 -0.587353	 -1.721351
 -0.444079	 -0.581249	 -1.705801
 -0.457182	 -0.570002	 -1.686700
 -0.468003	 -0.557671	 -1.672047
 -0.472495	 -0.544092	 -1.655333
 -0.466978	 -0.537299	 -1.637784
 -0.456791	 -0.526736	 -1.617103
 -0.457693	 -0.517804	 -1.604650
 -0.466609	 -0.499817	 -1.580866
 -0.467708	 -0.496327	 -1.572252
 -0.469653	 -0.483914	 -1.559681
 -0.469376	 -0.466764	 -1.544681
 -0.467930	 -0.454839	 -1.530530
 -0.463669	 -0.445053	 -1.524213
 -0.459949	 -0.427874	 -1.511759
 -0.460277	 -0.411436	 -1.495777
 -0.457279	 -0.396690	 -1.488109
 -0.458122	 -0.379415	 -1.479697
 -0.455752	 -0.352432	 -1.473776
 -0.450469	 -0.336288	 -1.469578
 -0.440091	 -0.319504	 -1.464558
 -0.422791	 -0.302335	 -1.453049
 -0.412107	 -0.294082	 -1.448614
 -0.404313	 -0.277465	 -1.438962
 -0.398827	 -0.258008	 -1.428594
 -0.399249	 -0.242193	 -1.419035
 -0.406996	 -0.225512	 -1.409609
 -0.410900	 -0.205229	 -1.404613
 -0.402368	 -0.176931	 -1.395435
 -0.392798	 -0.163754	 -1.385612
 -0.389041	 -0.154921	 -1.373314
 -0.390203	 -0.142236	 -1.354979
 -0.391918	 -0.129425	 -1.338566
 -0.394453	 -0.117356	 -1.322604
 -0.397447	 -0.106155	 -1.308171
 -0.401988	 -0.094903	 -1.292822
 -0.408390	 -0.087622	 -1.275824
 -0.414752	 -0.085420	 -1.254054
 -0.415186	 -0.083370	 -1.231980
 -0.416235	 -0.077608	 -1.219192
 -0.423030	 -0.067573	 -1.202003
 -0.429950	 -0.063322	 -1.180997
 -0.433757	 -0.065383	 -1.163227
 -0.443435	 -0.070098	 -1.145563
 -0.458108	 -0.076917	 -1.124856
 -0.461506	 -0.081471	 -1.106945
 -0.467894	 -0.089063	 -1.095139
 -0.469974	 -0.097895	 -1.077717
 -0.475772	 -0.107901	 -1.059253
 -0.484510	 -0.114283	 -1.047289
 -0.499696	 -0.121815	 -1.032488
 -0.512735	 -0.131456	 -1.017294
 -0.519823	 -0.137908	 -1.008075
 -0.529320	 -0.150598	 -0.993746
 -0.542709	 -0.166727	 -0.977753
 -0.553774	 -0.177161	 -0.965130
 -0.558932	 -0.181586	 -0.956337
 -0.565770	 -0.188237	 -0.934153
 -0.576328	 -0.196517	 -0.913018
 -0.585930	 -0.201699	 -0.895407
 -0.596893	 -0.207011	 -0.880255
 -0.609700	 -0.212114	 -0.867103
 -0.621917	 -0.216935	 -0.850974
 -0.632423	 -0.221891	 -0.833376
 -0.641146	 -0.220817	 -0.817295
 -0.648447	 -0.220774	 -0.799978
 -0.653645	 -0.215223	 -0.777278
 -0.658740	 -0.212904	 -0.756571
 -0.663487	 -0.208685	 -0.732912
 -0.665644	 -0.207231	 -0.722690
 -0.672654	 -0.208739	 -0.700913
 -0.685577	 -0.212798	 -0.680728
 -0.695164	 -0.216226	 -0.667849
 -0.704654	 -0.220364	 -0.646478
 -0.714449	 -0.217792	 -0.625986
 -0.721563	 -0.213931	 -0.613452
 -0.728494	 -0.209425	 -0.593137
 -0.730680	 -0.201674	 -0.569095
 -0.732563	 -0.193595	 -0.554089
 -0.738066	 -0.186119	 -0.538852
 -0.745031	 -0.178685	 -0.519413
 -0.749904	 -0.174506	 -0.501841
 -0.757596	 -0.172124	 -0.482477
 -0.765285	 -0.168985	 -0.463960
 -0.770792	 -0.166411	 -0.449042
 -0.779037	 -0.165272	 -0.428024
 -0.785481	 -0.162737	 -0.406041
 -0.789185	 -0.158575	 -0.388277
 -0.794380	 -0.154526	 -0.372594
 -0.803422	 -0.148888	 -0.348659
 -0.809581	 -0.143022	 -0.329908
 -0.808296	 -0.133683	 -0.312095
 -0.808663	 -0.126460	 -0.293534
 -0.810780	 -0.118129	 -0.274963
 -0.812294	 -0.109846	 -0.255837
 -0.812144	 -0.103070	 -0.239832
 -0.815447	 -0.091871	 -0.217931
 -0.818048	 -0.077146	 -0.199160
 -0.819959	 -0.071446	 -0.192608
 -0.823885	 -0.056420	 -0.176044
 -0.830123	 -0.044713	 -0.153429
 -0.832819	 -0.038902	 -0.140768
 -0.839382	 -0.032335	 -0.122819
 -0.848151	 -0.024556	 -0.100628
 -0.852713	 -0.020359	 -0.089655
 -0.864018	 -0.013266	 -0.066949
 -0.871327	 -0.006178	 -0.045046
 -0.877859	 -0.002531	 -0.031734
 -0.881239	  0.004164	 -0.017090
 -0.888792	  0.014460	  0.006158
 -0.893529	  0.021183	  0.019908
 -0.895042	  0.029586	  0.033780
 -0.895584	  0.044529	  0.056837
 -0.895203	  0.055120	  0.077762
 -0.892369	  0.061359	  0.091814
 -0.894634	  0.069527	  0.109670
 -0.906090	  0.084828	  0.130449
 -0.911386	  0.093328	  0.142598
 -0.918756	  0.105071	  0.157278
 -0.929683	  0.109523	  0.178920
 -0.939396	  0.110950	  0.191029
 -0.951308	  0.116315	  0.209091
 -0.955242	  0.120447	  0.228048
 -0.957212	  0.121992	  0.249078
 -0.960372	  0.125659	  0.268793
 -0.968001	  0.136823	  0.286961
 -0.979709	  0.150055	  0.301945
 -0.990613	  0.156723	  0.315920
 -0.999404	  0.157354	  0.332596
 -1.007300	  0.157582	  0.353416
 -1.016401	  0.163849	  0.371721
 -1.024291	  0.175938	  0.387183
 -1.026625	  0.188918	  0.401063
 -1.027509	  0.203198	  0.416800
 -1.034086	  0.217713	  0.433217
 -1.044535	  0.224584	  0.449623
 -1.052535	  0.226227	  0.466952
 -1.059707	  0.230991	  0.486251
 -1.066243	  0.238611	  0.503343
 -1.072842	  0.243518	  0.520711
 -1.081529	  0.245553	  0.541136
 -1.090522	  0.252267	  0.559302
 -1.095467	  0.258853	  0.572831
 -1.100807	  0.260433	  0.592809
 -1.110459	  0.259106	  0.615585
 -1.118711	  0.264762	  0.631189
 -1.123156	  0.273725	  0.644829
 -1.126634	  0.278547	  0.663891
 -1.134489	  0.285843	  0.691830
 -1.136257	  0.291877	  0.705171
 -1.137250	  0.298187	  0.719958
 -1.139559	  0.306692	  0.744403
 -1.146016	  0.309936	  0.763405
 -1.152730	  0.311043	  0.778911
 -1.159312	  0.315357	  0.796768
 -1.164777	  0.321358	  0.813298
 -1.174604	  0.324912	  0.843090
 -1.177276	  0.328601	  0.857636
 -1.178536	  0.333112	  0.870251
 -1.178725	  0.345018	  0.892788
 -1.183301	  0.348250	  0.911611
 -1.191631	  0.350006	  0.933696
 -1.197777	  0.355166	  0.950194
 -1.202877	  0.361165	  0.963987
 -1.209600	  0.366755	  0.983644
 -1.215199	  0.369299	  1.007111
 -1.218097	  0.372149	  1.024560
 -1.220531	  0.382793	  1.041344
 -1.223583	  0.396010	  1.058901
 -1.227285	  0.409248	  1.074661
 -1.231279	  0.417954	  1.086561
 -1.237469	  0.428766	  1.104487
 -1.247643	  0.439628	  1.129279
 -1.252215	  0.444254	  1.140758
 -1.257685	  0.450749	  1.161197
 -1.263265	  0.458212	  1.179300
 -1.264395	  0.465228	  1.194018
 -1.266946	  0.474184	  1.217894
 -1.269945	  0.480512	  1.235383
 -1.270603	  0.488745	  1.253717
 -1.271194	  0.495563	  1.271630
 -1.271187	  0.505446	  1.288566
 -1.271545	  0.515172	  1.306111
 -1.270379	  0.527503	  1.324068
 -1.272076	  0.540624	  1.340753
 -1.279314	  0.553038	  1.354991
 -1.293172	  0.565639	  1.372682
 -1.298452	  0.571772	  1.384632
 -1.298321	  0.580279	  1.404437
 -1.299845	  0.587832	  1.421308
 -1.305716	  0.597677	  1.439594
 -1.309535	  0.610721	  1.459432
 -1.306043	  0.618960	  1.474203
 -1.301459	  0.624597	  1.495244
 -1.302479	  0.632642	  1.517076
 -1.311549	  0.640357	  1.534317
 -1.323023	  0.639565	  1.550854
 -1.334614	  0.643269	  1.566689
 -1.344433	  0.657489	  1.585580
 -1.350427	  0.662663	  1.604429
 -1.353937	  0.661436	  1.621152
 -1.359199	  0.662645	  1.644113
 -1.365574	  0.665988	  1.666665
 -1.368167	  0.666884	  1.677578
 -1.373785	  0.666967	  1.701149
 -1.380160	  0.671645	  1.721912
 -1.385707	  0.678880	  1.736533
 -1.391788	  0.684748	  1.756279
 -1.397439	  0.690887	  1.775146
 -1.403093	  0.699456	  1.791417
 -1.408701	  0.705568	  1.810115
 -1.414876	  0.714001	  1.829124
 -1.420752	  0.727004	  1.842111
 -1.426630	  0.740639	  1.857731
 -1.430668	  0.742592	  1.876533
 -1.436285	  0.748882	  1.899829
 -1.441132	  0.756870	  1.917513
