 0.0 0.0 0.0 0
 -0.8382818408825008 -0.03709437275420813 -0.5450069382646586 1000
 0.6297883481747487 -0.7654836235517896 -0.13068457666206618 1000
 0.5718231946921546 0.808667159488837 -0.13936520073646022 1000
 -0.7769299790217972 -0.5372449953837384 0.32673172884235835 1000
 -0.6083437466156595 0.4283330083706046 0.6672883334015437 1000
 0.2501107769521168 0.2525855647023988 -0.9344887007109174 1000
