 -2.805737	  0.662997	  0.932295
 -2.777957	  0.656433	  0.923065
 -2.740650	  0.646398	  0.896048
 -2.708936	  0.640762	  0.859070
 -2.669650	  0.626950	  0.828152
 -2.636772	  0.609997	  0.790322
 -2.604944	  0.594917	  0.754281
 -2.574173	  0.581102	  0.717821
 -2.544098	  0.569122	  0.680038
 -2.515074	  0.561534	  0.641535
 -2.485408	  0.557841	  0.603863
 -2.452402	  0.556328	  0.566998
 -2.417553	  0.553892	  0.530771
 -2.381233	  0.549161	  0.494757
 -2.345304	  0.541254	  0.459798
 -2.311586	  0.527851	  0.424169
 -2.282564	  0.507783	  0.387902
 -2.254493	  0.485057	  0.351082
 -2.226664	  0.463058	  0.315177
 -2.197776	  0.441836	  0.279318
 -2.167384	  0.422027	  0.243798
 -2.136570	  0.404391	  0.210059
 -2.105333	  0.389096	  0.176372
 -2.079102	  0.377058	  0.140577
 -2.076325	  0.362149	  0.109227
 -2.123694	  0.322368	  0.060166
 -2.205519	  0.259966	 -0.065064
 -2.217397	  0.210673	 -0.198108
 -2.201339	  0.181676	 -0.274730
 -2.183661	  0.167096	 -0.303217
 -2.146316	  0.148343	 -0.323081
 -2.050649	  0.123033	 -0.323366
 -1.885458	  0.152489	 -0.303578
 -1.775191	  0.209775	 -0.303016
 -1.731562	  0.230850	 -0.313613
 -1.700887	  0.239839	 -0.328350
 -1.666938	  0.243181	 -0.351457
 -1.631117	  0.240368	 -0.381691
 -1.597662	  0.233224	 -0.414360
 -1.565094	  0.223888	 -0.447494
 -1.531750	  0.213909	 -0.482063
 -1.497950	  0.203128	 -0.517659
 -1.463695	  0.191266	 -0.553665
 -1.430000	  0.177838	 -0.589500
 -1.394966	  0.162039	 -0.627252
 -1.362135	  0.146198	 -0.662671
 -1.330066	  0.129746	 -0.696936
 -1.299191	  0.113333	 -0.730125
 -1.269133	  0.097460	 -0.763337
 -1.239349	  0.082877	 -0.797562
 -1.209078	  0.070948	 -0.833110
 -1.175716	  0.062126	 -0.872439
 -1.142315	  0.057067	 -0.912224
 -1.112276	  0.054550	 -0.948713
 -1.080563	  0.053993	 -0.990435
 -1.036495	  0.067893	 -1.051305
 -0.976125	  0.133172	 -1.097331
 -0.904134	  0.171532	 -1.146132
 -0.853405	  0.190123	 -1.180387
 -0.819998	  0.202897	 -1.204406
 -0.803952	  0.213139	 -1.217610
 -0.794903	  0.218580	 -1.229065
 -0.781364	  0.223843	 -1.255926
 -0.774485	  0.222948	 -1.283973
 -0.776287	  0.213612	 -1.320180
 -0.792519	  0.203113	 -1.388946
 -0.800126	  0.172553	 -1.513228
 -0.817800	  0.049297	 -1.665254
 -0.765768	 -0.051603	 -1.717036
 -0.707858	 -0.095967	 -1.713708
 -0.630531	 -0.113964	 -1.661553
 -0.546006	 -0.107759	 -1.598304
 -0.488833	 -0.136293	 -1.620160
 -0.449199	 -0.154967	 -1.658087
 -0.415974	 -0.169258	 -1.693034
 -0.383571	 -0.182072	 -1.727176
 -0.350676	 -0.194438	 -1.762568
 -0.316460	 -0.205976	 -1.799945
 -0.283572	 -0.217752	 -1.836796
 -0.252762	 -0.231330	 -1.873157
 -0.224212	 -0.246822	 -1.909070
 -0.196791	 -0.264463	 -1.945484
 -0.168652	 -0.283947	 -1.982586
 -0.139397	 -0.304275	 -2.018187
 -0.109306	 -0.323361	 -2.051633
 -0.078640	 -0.340031	 -2.085012
 -0.047532	 -0.354814	 -2.120540
 -0.013019	 -0.365791	 -2.158260
  0.023731	 -0.372658	 -2.195171
  0.059292	 -0.377388	 -2.229665
  0.093763	 -0.382539	 -2.262892
  0.127487	 -0.390185	 -2.295610
  0.163189	 -0.400102	 -2.331168
  0.197379	 -0.410715	 -2.367309
  0.229079	 -0.421690	 -2.402524
  0.260064	 -0.433809	 -2.439247
  0.291580	 -0.446881	 -2.476961
  0.320687	 -0.459579	 -2.514283
  0.348418	 -0.471245	 -2.550920
  0.376977	 -0.483489	 -2.587840
  0.407066	 -0.498025	 -2.624180
  0.439739	 -0.511380	 -2.661623
  0.473512	 -0.521886	 -2.699476
  0.509302	 -0.532322	 -2.734840
  0.549349	 -0.536545	 -2.765161
  0.589029	 -0.545723	 -2.794488
  0.621396	 -0.557537	 -2.831613
  0.645535	 -0.577489	 -2.872245
  0.651990	 -0.583264	 -2.900967
