 -0.237523	  2.971809	  0.541139
 -0.235171	  2.942386	  0.535781
 -0.239103	  2.897285	  0.529870
 -0.258305	  2.854171	  0.514775
 -0.267999	  2.807337	  0.499672
 -0.280017	  2.761681	  0.487400
 -0.297107	  2.716941	  0.479204
 -0.309957	  2.672008	  0.460695
 -0.320707	  2.622315	  0.452141
 -0.332503	  2.575336	  0.436265
 -0.334847	  2.525088	  0.431874
 -0.338757	  2.476300	  0.420972
 -0.343908	  2.427930	  0.409713
 -0.349146	  2.380250	  0.398258
 -0.355538	  2.331056	  0.384264
 -0.363998	  2.281617	  0.367114
 -0.374629	  2.234316	  0.348794
 -0.388088	  2.189889	  0.329441
 -0.404569	  2.148037	  0.308757
 -0.422718	  2.108390	  0.288090
 -0.442698	  2.067831	  0.266549
 -0.464995	  2.026360	  0.245193
 -0.489979	  1.985155	  0.225164
 -0.515824	  1.944985	  0.208351
 -0.541487	  1.903248	  0.193914
 -0.566316	  1.856096	  0.180069
 -0.587269	  1.807989	  0.167546
 -0.604513	  1.760342	  0.156042
 -0.619318	  1.711143	  0.144577
 -0.631430	  1.663569	  0.133211
 -0.641492	  1.617967	  0.121131
 -0.650323	  1.570226	  0.106784
 -0.656516	  1.523733	  0.092656
 -0.660313	  1.478649	  0.079432
 -0.660786	  1.431641	  0.070459
 -0.670253	  1.378857	  0.067837
 -0.680703	  1.329576	  0.052816
 -0.692400	  1.283484	  0.037778
 -0.699118	  1.235492	  0.019478
 -0.702853	  1.187411	  0.006491
 -0.707089	  1.140362	 -0.002796
 -0.711117	  1.092988	 -0.012885
 -0.716705	  1.044091	 -0.023050
 -0.724123	  0.994734	 -0.034453
 -0.733123	  0.945141	 -0.046757
 -0.743569	  0.898917	 -0.057350
 -0.755099	  0.850964	 -0.067800
 -0.768110	  0.801023	 -0.078594
 -0.781182	  0.753296	 -0.086855
 -0.795275	  0.706332	 -0.094943
 -0.811303	  0.660371	 -0.103675
 -0.829729	  0.613997	 -0.113351
 -0.848341	  0.568273	 -0.124652
 -0.865244	  0.522818	 -0.139252
 -0.881156	  0.477066	 -0.155459
 -0.896041	  0.431634	 -0.171768
 -0.909718	  0.387581	 -0.187463
 -0.923147	  0.342732	 -0.201801
 -0.937608	  0.296822	 -0.213103
 -0.953437	  0.249694	 -0.220829
 -0.968620	  0.202100	 -0.225167
 -0.982639	  0.154354	 -0.227057
 -0.995120	  0.107005	 -0.227146
 -1.006455	  0.060433	 -0.225932
 -1.017164	  0.015790	 -0.223346
 -1.027702	 -0.026157	 -0.218872
 -1.041506	 -0.077276	 -0.210389
 -1.065775	 -0.158001	 -0.190148
 -1.089555	 -0.231690	 -0.156934
 -1.103934	 -0.283688	 -0.126824
 -1.114311	 -0.347517	 -0.092336
 -1.113303	 -0.412324	 -0.063978
 -1.108531	 -0.434848	 -0.060215
 -1.096740	 -0.463513	 -0.066396
 -1.054297	 -0.527407	 -0.097234
 -0.972271	 -0.616958	 -0.143007
 -0.888118	 -0.719943	 -0.194922
 -0.846865	 -0.787247	 -0.256954
 -0.835541	 -0.829356	 -0.321239
 -0.842643	 -0.853406	 -0.374874
 -0.864112	 -0.871477	 -0.430701
 -0.898069	 -0.882802	 -0.478732
 -0.968288	 -0.894985	 -0.535789
 -1.063012	 -0.909201	 -0.561691
 -1.186085	 -0.938751	 -0.542525
 -1.243745	 -0.984994	 -0.546861
 -1.270275	 -1.024976	 -0.556962
 -1.289085	 -1.066048	 -0.569043
 -1.305658	 -1.110791	 -0.582830
 -1.320908	 -1.158125	 -0.596815
 -1.336003	 -1.203125	 -0.610087
 -1.352008	 -1.246969	 -0.623095
 -1.370060	 -1.292297	 -0.637238
 -1.388567	 -1.336869	 -0.651951
 -1.406786	 -1.381289	 -0.666396
 -1.423739	 -1.425125	 -0.680108
 -1.438392	 -1.471166	 -0.694191
 -1.450828	 -1.517427	 -0.707452
 -1.463846	 -1.565127	 -0.720459
 -1.478035	 -1.612808	 -0.731916
 -1.492372	 -1.658513	 -0.742001
 -1.501186	 -1.704220	 -0.756051
 -1.507137	 -1.749179	 -0.776939
 -1.520933	 -1.794115	 -0.795275
 -1.534542	 -1.839241	 -0.811643
 -1.546245	 -1.887052	 -0.826956
 -1.562532	 -1.933949	 -0.838481
 -1.577352	 -1.981808	 -0.845688
 -1.587928	 -2.027932	 -0.856106
 -1.599013	 -2.073075	 -0.867707
 -1.616397	 -2.119549	 -0.876815
 -1.625745	 -2.170245	 -0.880662
 -1.636905	 -2.218326	 -0.894486
 -1.650199	 -2.267159	 -0.909355
 -1.670586	 -2.314762	 -0.922507
 -1.687292	 -2.337910	 -0.931732
