 -2.685267	 -1.293666	 -0.544673
 -2.658680	 -1.280857	 -0.539280
 -2.625904	 -1.231104	 -0.518248
 -2.605221	 -1.190593	 -0.502276
 -2.580689	 -1.154655	 -0.495620
 -2.561792	 -1.109109	 -0.482361
 -2.533839	 -1.071905	 -0.465263
 -2.514126	 -1.031644	 -0.448861
 -2.488253	 -0.986273	 -0.434644
 -2.462477	 -0.950321	 -0.419599
 -2.441293	 -0.908756	 -0.402216
 -2.417767	 -0.868589	 -0.384587
 -2.391351	 -0.825514	 -0.369276
 -2.367820	 -0.779004	 -0.355431
 -2.348018	 -0.740378	 -0.342621
 -2.327659	 -0.702676	 -0.328576
 -2.302167	 -0.657341	 -0.312747
 -2.276703	 -0.613510	 -0.297716
 -2.250919	 -0.571496	 -0.283182
 -2.229908	 -0.535243	 -0.267809
 -2.208657	 -0.497238	 -0.253651
 -2.184329	 -0.452411	 -0.241018
 -2.160681	 -0.410205	 -0.226222
 -2.134003	 -0.369289	 -0.208788
 -2.113636	 -0.333707	 -0.196697
 -2.088980	 -0.290918	 -0.183159
 -2.064335	 -0.243973	 -0.165668
 -2.045052	 -0.209636	 -0.153430
 -2.014044	 -0.165520	 -0.137488
 -1.991562	 -0.125781	 -0.125708
 -1.965909	 -0.080748	 -0.107347
 -1.942556	 -0.042433	 -0.096921
 -1.921352	 -0.003188	 -0.081721
 -1.901226	  0.038578	 -0.062125
 -1.874439	  0.080650	 -0.049637
 -1.849035	  0.118985	 -0.038448
 -1.828445	  0.161092	 -0.023729
 -1.862651	  0.177825	 -0.037540
 -1.883064	  0.259761	 -0.084735
 -1.871323	  0.344973	 -0.094448
 -1.880463	  0.380608	 -0.101290
 -1.900892	  0.429116	 -0.136078
 -1.932815	  0.476059	 -0.161168
 -1.904218	  0.631178	 -0.150830
 -1.852599	  0.722794	 -0.140119
 -1.820927	  0.819860	 -0.061833
 -1.686022	  0.862472	  0.004865
 -1.641078	  0.847509	  0.082422
 -1.600026	  0.840871	  0.094354
 -1.557665	  0.813067	  0.104331
 -1.523018	  0.824383	  0.148866
 -1.490473	  0.784214	  0.183140
 -1.454865	  0.820415	  0.215170
 -1.432249	  0.861757	  0.229581
 -1.404114	  0.907229	  0.245855
 -1.379158	  0.946836	  0.261671
 -1.355520	  0.985229	  0.278459
 -1.331348	  1.032090	  0.293244
 -1.309266	  1.072562	  0.304791
 -1.287554	  1.111774	  0.317305
 -1.264407	  1.151561	  0.331294
 -1.239495	  1.197829	  0.346770
 -1.217151	  1.235409	  0.361466
 -1.193231	  1.275197	  0.377667
 -1.168467	  1.318440	  0.394075
 -1.146258	  1.361412	  0.408116
 -1.122153	  1.405847	  0.422755
 -1.099394	  1.444972	  0.436704
 -1.077369	  1.480221	  0.446139
 -1.053607	  1.521823	  0.461530
 -1.027202	  1.561995	  0.474988
 -1.002977	  1.608278	  0.489803
 -0.978293	  1.650608	  0.507493
 -0.957784	  1.691049	  0.520095
 -0.936032	  1.729006	  0.536083
 -0.911109	  1.775334	  0.552338
 -0.891374	  1.810396	  0.563942
 -0.868722	  1.852146	  0.577065
 -0.840097	  1.896850	  0.592174
 -0.818209	  1.936794	  0.607756
 -0.795340	  1.978340	  0.623867
 -0.767951	  2.022621	  0.639345
 -0.746752	  2.057857	  0.652822
 -0.722064	  2.103322	  0.668590
 -0.699502	  2.142918	  0.680131
 -0.674456	  2.183705	  0.694108
 -0.651874	  2.224563	  0.711052
 -0.627530	  2.266812	  0.724688
 -0.603136	  2.305575	  0.740153
 -0.579029	  2.344483	  0.754318
 -0.554289	  2.389377	  0.767779
 -0.532039	  2.433347	  0.780992
 -0.510938	  2.474722	  0.797625
 -0.486716	  2.513466	  0.815726
 -0.463839	  2.554483	  0.831242
 -0.441590	  2.597395	  0.842471
 -0.414772	  2.638466	  0.856955
 -0.393268	  2.680630	  0.873919
 -0.363794	  2.715521	  0.882411
 -0.342139	  2.755850	  0.899829
 -0.323700	  2.799315	  0.915556
 -0.302744	  2.837476	  0.925785
 -0.305772	  2.865850	  0.935043
