  0.894987	  1.851583	  2.225205
  0.886125	  1.833251	  2.203174
  0.853128	  1.832089	  2.169574
  0.821092	  1.832821	  2.135408
  0.786021	  1.826352	  2.100622
  0.752083	  1.828978	  2.062578
  0.720277	  1.823913	  2.025156
  0.688471	  1.817951	  1.988493
  0.656042	  1.819526	  1.951483
  0.621760	  1.821881	  1.914384
  0.586741	  1.824370	  1.878442
  0.549919	  1.828328	  1.844649
  0.511616	  1.833349	  1.812271
  0.473480	  1.837442	  1.780225
  0.435398	  1.840061	  1.746756
  0.399247	  1.840247	  1.713031
  0.363790	  1.837859	  1.678273
  0.330599	  1.830169	  1.642107
  0.300540	  1.820853	  1.602174
  0.270778	  1.812795	  1.562609
  0.237998	  1.805064	  1.525229
  0.203150	  1.796533	  1.489531
  0.166139	  1.786472	  1.456048
  0.127280	  1.776294	  1.424291
  0.089284	  1.768287	  1.393755
  0.053638	  1.765245	  1.363261
  0.017857	  1.767409	  1.331386
 -0.020427	  1.773424	  1.297434
 -0.057698	  1.779925	  1.262908
 -0.092989	  1.784943	  1.227636
 -0.126501	  1.789465	  1.194012
 -0.159210	  1.795808	  1.164196
 -0.189195	  1.804646	  1.140902
 -0.216188	  1.816828	  1.124588
 -0.267718	  1.846006	  1.105123
 -0.385911	  1.909196	  1.095045
 -0.502017	  1.977447	  1.101199
 -0.572400	  2.031528	  1.102305
 -0.640390	  2.079856	  1.091409
 -0.700910	  2.110743	  1.058785
 -0.771716	  2.094004	  1.049775
 -0.791061	  2.117605	  1.010156
 -0.804582	  2.087501	  0.961817
 -0.820784	  2.025614	  0.917877
 -0.801396	  1.963396	  0.868180
 -0.744806	  1.878921	  0.783458
 -0.725765	  1.790047	  0.678187
 -0.749863	  1.753383	  0.602787
 -0.773014	  1.741465	  0.558816
 -0.798302	  1.736749	  0.519428
 -0.825391	  1.736779	  0.480044
 -0.852366	  1.740885	  0.441677
 -0.876813	  1.748746	  0.408223
 -0.902442	  1.761814	  0.377080
 -0.946513	  1.788938	  0.334847
 -1.036217	  1.841435	  0.294343
 -1.132629	  1.874469	  0.311428
 -1.195213	  1.883576	  0.324405
 -1.228513	  1.949900	  0.312885
 -1.286809	  1.955865	  0.325193
 -1.360144	  1.953026	  0.339606
 -1.392188	  1.987474	  0.280314
 -1.408382	  1.972077	  0.205018
 -1.436484	  1.962031	  0.159922
 -1.463023	  1.949588	  0.123941
 -1.477805	  1.927804	  0.082125
 -1.487263	  1.889347	  0.030484
 -1.494709	  1.837508	 -0.023102
 -1.498057	  1.786553	 -0.071001
 -1.499916	  1.723503	 -0.129364
 -1.510737	  1.646642	 -0.202555
 -1.543898	  1.615027	 -0.259556
 -1.581303	  1.612421	 -0.299520
 -1.615216	  1.610767	 -0.336794
 -1.645093	  1.608514	 -0.374609
 -1.673450	  1.607864	 -0.412741
 -1.703154	  1.608746	 -0.453409
 -1.734107	  1.603670	 -0.493859
 -1.767510	  1.598546	 -0.531028
 -1.803125	  1.595938	 -0.566130
 -1.839252	  1.593822	 -0.602322
 -1.873657	  1.592143	 -0.638590
 -1.906707	  1.590466	 -0.674510
 -1.940762	  1.588402	 -0.712387
 -1.973418	  1.586003	 -0.749546
 -2.005388	  1.583179	 -0.786534
 -2.038120	  1.579326	 -0.824404
 -2.070302	  1.574374	 -0.860752
 -2.102879	  1.568929	 -0.896719
 -2.135900	  1.563365	 -0.932551
 -2.169171	  1.558088	 -0.967727
 -2.203270	  1.553489	 -1.002374
 -2.239923	  1.549747	 -1.038178
 -2.280594	  1.547685	 -1.070447
 -2.320254	  1.544653	 -1.109263
 -2.343457	  1.560100	 -1.120356
