  0.205122	  0.743160	  2.930280
  0.203091	  0.735802	  2.901267
  0.162343	  0.735452	  2.877587
  0.120250	  0.717957	  2.859915
  0.081955	  0.712309	  2.837250
  0.039737	  0.704369	  2.807647
 -0.001088	  0.698617	  2.787317
 -0.046844	  0.683050	  2.756238
 -0.086795	  0.679700	  2.740416
 -0.130089	  0.666473	  2.712164
 -0.180251	  0.655493	  2.684712
 -0.221349	  0.652962	  2.667198
 -0.264638	  0.639646	  2.642447
 -0.305747	  0.634575	  2.618685
 -0.349093	  0.619011	  2.592012
 -0.392663	  0.617973	  2.562139
 -0.426597	  0.604900	  2.542342
 -0.471101	  0.600064	  2.516785
 -0.514813	  0.588663	  2.495102
 -0.558428	  0.580663	  2.472295
 -0.600276	  0.566027	  2.441099
 -0.639205	  0.560067	  2.417961
 -0.689007	  0.550267	  2.399702
 -0.726389	  0.537334	  2.367504
 -0.772146	  0.532694	  2.351866
 -0.817633	  0.525145	  2.318547
 -0.861202	  0.517288	  2.301020
 -0.902132	  0.503665	  2.272830
 -0.945158	  0.495705	  2.253762
 -0.987193	  0.484259	  2.224385
 -1.030043	  0.474241	  2.197779
 -1.072568	  0.473099	  2.172630
 -1.108684	  0.458403	  2.148273
 -1.153451	  0.454182	  2.131813
 -1.199259	  0.438001	  2.109426
 -1.235471	  0.432428	  2.081652
 -1.287112	  0.421350	  2.058491
 -1.327004	  0.413379	  2.030776
 -1.369476	  0.409288	  2.004435
 -1.408878	  0.394329	  1.979670
 -1.449770	  0.391749	  1.961897
 -1.498397	  0.382284	  1.938381
 -1.541828	  0.365270	  1.913346
 -1.585335	  0.364561	  1.888057
 -1.619286	  0.346415	  1.866429
 -1.668549	  0.344257	  1.835430
 -1.703984	  0.335473	  1.812830
 -1.752509	  0.326851	  1.792641
 -1.795299	  0.310793	  1.768858
 -1.836120	  0.303575	  1.740601
 -1.876321	  0.300786	  1.712833
 -1.925625	  0.284249	  1.690064
 -1.960442	  0.282977	  1.669508
 -2.011673	  0.271667	  1.642515
 -2.051176	  0.262053	  1.614214
 -2.093708	  0.251288	  1.591549
 -2.133254	  0.245732	  1.568726
 -2.172451	  0.233976	  1.545234
 -2.220521	  0.220563	  1.522232
 -2.264179	  0.218820	  1.498928
 -2.304312	  0.208410	  1.477183
 -2.351620	  0.200429	  1.453226
 -2.392080	  0.188551	  1.420190
 -2.433817	  0.181597	  1.400657
 -2.476475	  0.173446	  1.371234
 -2.516804	  0.158109	  1.348871
 -2.564440	  0.148195	  1.326468
 -2.602158	  0.137499	  1.306724
 -2.646736	  0.131164	  1.283818
 -2.692917	  0.125764	  1.257025
 -2.736192	  0.110082	  1.225209
 -2.763554	  0.111182	  1.237461
