  2.484780	 -0.727231	 -0.200798
  2.508737	 -0.721093	 -0.198683
  2.489894	 -0.729570	 -0.197431
  2.468808	 -0.729507	 -0.200614
  2.451028	 -0.735086	 -0.204475
  2.433353	 -0.743526	 -0.206732
  2.411768	 -0.749368	 -0.208070
  2.392099	 -0.751097	 -0.211537
  2.375823	 -0.758409	 -0.215421
  2.357575	 -0.767853	 -0.218675
  2.338394	 -0.774495	 -0.222558
  2.318532	 -0.777688	 -0.224895
  2.302067	 -0.788396	 -0.224409
  2.287877	 -0.801594	 -0.222680
  2.277693	 -0.816079	 -0.215330
  2.265927	 -0.829062	 -0.208566
  2.257263	 -0.845019	 -0.200053
  2.248072	 -0.861024	 -0.190942
  2.239110	 -0.875519	 -0.180273
  2.232492	 -0.890962	 -0.169058
  2.227804	 -0.907920	 -0.160394
  2.220630	 -0.925680	 -0.154222
  2.213422	 -0.943144	 -0.148542
  2.204025	 -0.960485	 -0.140843
  2.194358	 -0.974664	 -0.129145
  2.181640	 -0.986936	 -0.121644
  2.168088	 -1.003851	 -0.117917
  2.155004	 -1.020860	 -0.114680
  2.147430	 -1.035140	 -0.111069
  2.134397	 -1.050319	 -0.110494
  2.120540	 -1.068919	 -0.107850
  2.108690	 -1.084343	 -0.107763
  2.096078	 -1.096517	 -0.109828
  2.081273	 -1.112371	 -0.112808
  2.069692	 -1.129293	 -0.112440
  2.055166	 -1.138975	 -0.112648
  2.033254	 -1.147141	 -0.121443
  2.018239	 -1.160194	 -0.122258
  2.005451	 -1.181929	 -0.121233
  1.991515	 -1.187772	 -0.128808
  1.972152	 -1.197402	 -0.134794
  1.957723	 -1.203308	 -0.143177
  1.941946	 -1.213148	 -0.155179
  1.930497	 -1.229002	 -0.162748
  1.915357	 -1.238330	 -0.170110
  1.899457	 -1.246248	 -0.180953
  1.886746	 -1.253917	 -0.194045
  1.874822	 -1.263090	 -0.211313
  1.862110	 -1.268469	 -0.225211
  1.848074	 -1.274207	 -0.234062
  1.832629	 -1.281042	 -0.246491
  1.815495	 -1.282069	 -0.262733
  1.802170	 -1.282725	 -0.274706
  1.789475	 -1.288564	 -0.287278
  1.776298	 -1.290666	 -0.305919
  1.763376	 -1.291978	 -0.322004
  1.754446	 -1.293231	 -0.334821
  1.739695	 -1.294096	 -0.352293
  1.731160	 -1.300236	 -0.370521
  1.723651	 -1.305682	 -0.387704
  1.715247	 -1.308335	 -0.405892
  1.705957	 -1.309444	 -0.424019
  1.697263	 -1.310637	 -0.442117
  1.688384	 -1.312360	 -0.460048
  1.677998	 -1.313842	 -0.477296
  1.666416	 -1.312263	 -0.493750
  1.655290	 -1.309325	 -0.510176
  1.643252	 -1.306491	 -0.526221
  1.632243	 -1.303771	 -0.542738
  1.620700	 -1.303688	 -0.559014
  1.609453	 -1.303608	 -0.575732
  1.596248	 -1.302691	 -0.591157
  1.581624	 -1.300744	 -0.604717
  1.566860	 -1.297829	 -0.617804
  1.552479	 -1.294706	 -0.631421
  1.538689	 -1.291957	 -0.645738
  1.524115	 -1.288831	 -0.659075
  1.508294	 -1.285559	 -0.670859
  1.492958	 -1.281580	 -0.682885
  1.478247	 -1.276538	 -0.695441
  1.463712	 -1.272093	 -0.707045
  1.443774	 -1.270785	 -0.717303
  1.425198	 -1.274140	 -0.726547
  1.406155	 -1.277176	 -0.734223
  1.388828	 -1.272796	 -0.742100
  1.373144	 -1.265033	 -0.752216
  1.354422	 -1.262310	 -0.759398
  1.334861	 -1.262376	 -0.763825
  1.315148	 -1.259858	 -0.767841
  1.295668	 -1.258322	 -0.772427
  1.277140	 -1.257456	 -0.777090
  1.258211	 -1.253301	 -0.781512
  1.234875	 -1.256113	 -0.786158
  1.216243	 -1.264465	 -0.788943
  1.200813	 -1.267594	 -0.790280
  1.179264	 -1.272743	 -0.791167
  1.160239	 -1.274698	 -0.792341
  1.139844	 -1.277614	 -0.793512
  1.120265	 -1.279953	 -0.795267
  1.100753	 -1.284632	 -0.795340
  1.081939	 -1.290523	 -0.793473
  1.062750	 -1.296628	 -0.790653
  1.043689	 -1.303240	 -0.790114
  1.025362	 -1.310443	 -0.790754
  1.005369	 -1.316266	 -0.792130
  0.983606	 -1.317691	 -0.789778
  0.967559	 -1.323574	 -0.783697
  0.950317	 -1.332380	 -0.777951
  0.931898	 -1.339709	 -0.770515
  0.912574	 -1.343773	 -0.768253
  0.893502	 -1.349209	 -0.764860
  0.875918	 -1.356715	 -0.761956
  0.857315	 -1.363978	 -0.758065
  0.838792	 -1.370265	 -0.753191
  0.820547	 -1.376706	 -0.748607
  0.802399	 -1.383160	 -0.742934
  0.784400	 -1.389528	 -0.736974
  0.766644	 -1.395749	 -0.730194
  0.748889	 -1.401970	 -0.723405
  0.731136	 -1.408189	 -0.716614
  0.713449	 -1.414218	 -0.709485
  0.695925	 -1.419843	 -0.701658
  0.678402	 -1.425465	 -0.693825
  0.660900	 -1.431122	 -0.686039
  0.643402	 -1.437327	 -0.678508
  0.626051	 -1.443769	 -0.670552
  0.608854	 -1.448912	 -0.662290
  0.590810	 -1.454083	 -0.654773
  0.573983	 -1.461642	 -0.648016
  0.556713	 -1.467817	 -0.639043
  0.536785	 -1.469021	 -0.629845
  0.518080	 -1.468190	 -0.620878
  0.503311	 -1.473852	 -0.607670
  0.487428	 -1.480007	 -0.597136
  0.470438	 -1.484273	 -0.590837
  0.452874	 -1.488171	 -0.583116
  0.433978	 -1.491623	 -0.572355
  0.416186	 -1.491551	 -0.563752
  0.397868	 -1.495303	 -0.558254
  0.378882	 -1.499450	 -0.551773
  0.360759	 -1.503874	 -0.545701
  0.341576	 -1.509210	 -0.542435
  0.320260	 -1.512081	 -0.540303
  0.304290	 -1.517802	 -0.535992
  0.286115	 -1.526970	 -0.535114
  0.270311	 -1.540255	 -0.533816
  0.253434	 -1.550135	 -0.533397
  0.238318	 -1.562664	 -0.535127
  0.225002	 -1.576950	 -0.538401
  0.213216	 -1.593380	 -0.541112
  0.203180	 -1.611012	 -0.541553
  0.192940	 -1.628162	 -0.537378
  0.184212	 -1.645768	 -0.533453
  0.173633	 -1.662173	 -0.534002
  0.162382	 -1.679155	 -0.534289
  0.149089	 -1.694322	 -0.536763
  0.139090	 -1.711203	 -0.539008
  0.132155	 -1.730452	 -0.539393
  0.123501	 -1.748375	 -0.539729
  0.114334	 -1.766061	 -0.542529
  0.107096	 -1.784646	 -0.544302
  0.101611	 -1.803586	 -0.547557
  0.094200	 -1.821490	 -0.551949
  0.085652	 -1.838845	 -0.557664
  0.077626	 -1.856835	 -0.562295
  0.072096	 -1.875661	 -0.566201
  0.066466	 -1.894642	 -0.571010
  0.059272	 -1.912886	 -0.576700
  0.049814	 -1.928010	 -0.585025
  0.038937	 -1.943719	 -0.593490
  0.028671	 -1.957383	 -0.603298
  0.018854	 -1.972181	 -0.612761
  0.009106	 -1.987215	 -0.621776
 -0.000993	 -2.001107	 -0.632510
 -0.011505	 -2.014675	 -0.642949
 -0.022859	 -2.028551	 -0.650758
 -0.033921	 -2.043555	 -0.658688
 -0.045456	 -2.058276	 -0.667057
 -0.058217	 -2.069277	 -0.679997
 -0.069768	 -2.076805	 -0.694477
 -0.082519	 -2.085471	 -0.707814
 -0.094899	 -2.096462	 -0.717824
 -0.107884	 -2.104042	 -0.731740
 -0.121616	 -2.111278	 -0.745551
 -0.134643	 -2.120119	 -0.755307
 -0.148561	 -2.125724	 -0.769475
 -0.163192	 -2.130185	 -0.783306
 -0.177532	 -2.137937	 -0.792829
 -0.193400	 -2.141503	 -0.805124
 -0.210667	 -2.146067	 -0.815953
 -0.229492	 -2.151945	 -0.823824
 -0.242737	 -2.153775	 -0.838003
 -0.255477	 -2.153550	 -0.854453
 -0.269553	 -2.150260	 -0.869605
 -0.286542	 -2.148644	 -0.880481
 -0.304256	 -2.148712	 -0.888647
 -0.323314	 -2.147423	 -0.897745
 -0.339829	 -2.141364	 -0.907640
 -0.356483	 -2.139388	 -0.915989
 -0.375187	 -2.136122	 -0.923143
 -0.392016	 -2.130766	 -0.932940
 -0.407791	 -2.125740	 -0.943255
 -0.425548	 -2.120663	 -0.952257
 -0.443322	 -2.115606	 -0.960106
 -0.461873	 -2.109792	 -0.964789
 -0.480638	 -2.103681	 -0.968029
 -0.499404	 -2.097566	 -0.971257
 -0.518171	 -2.091452	 -0.974484
 -0.536938	 -2.085337	 -0.977712
 -0.555707	 -2.079220	 -0.980908
 -0.574652	 -2.072820	 -0.980767
 -0.593568	 -2.066381	 -0.979931
 -0.612485	 -2.059943	 -0.979089
 -0.631402	 -2.053505	 -0.978248
 -0.650317	 -2.047068	 -0.977391
 -0.669160	 -2.040835	 -0.974921
 -0.687728	 -2.034866	 -0.971884
 -0.706573	 -2.029497	 -0.966455
 -0.723762	 -2.025925	 -0.958464
 -0.744338	 -2.021599	 -0.953952
 -0.763924	 -2.017473	 -0.947202
 -0.783270	 -2.011498	 -0.943229
 -0.800927	 -2.005103	 -0.950104
 -0.823770	 -1.997246	 -0.955117
 -0.844124	 -1.990330	 -0.954321
 -0.858738	 -1.990565	 -0.948167
 -0.880066	 -1.988019	 -0.940124
 -0.898134	 -1.986129	 -0.932611
 -0.916915	 -1.985482	 -0.928658
 -0.938389	 -1.982898	 -0.926397
 -0.956972	 -1.979968	 -0.925027
 -0.978294	 -1.976737	 -0.922849
 -0.997972	 -1.973378	 -0.914923
 -1.015048	 -1.971923	 -0.907496
 -1.033947	 -1.971010	 -0.901940
 -1.054381	 -1.968197	 -0.896491
 -1.073386	 -1.965777	 -0.889130
 -1.090107	 -1.966113	 -0.882968
 -1.109581	 -1.965926	 -0.877040
 -1.129322	 -1.964665	 -0.870947
 -1.148380	 -1.963365	 -0.865018
 -1.167437	 -1.962066	 -0.859089
 -1.186491	 -1.960764	 -0.853154
 -1.205327	 -1.959188	 -0.846619
 -1.224093	 -1.957528	 -0.839903
 -1.242858	 -1.955868	 -0.833185
 -1.261619	 -1.954205	 -0.826459
 -1.280013	 -1.952297	 -0.818846
 -1.297677	 -1.949982	 -0.809756
 -1.315333	 -1.947663	 -0.800653
 -1.332990	 -1.945350	 -0.791549
 -1.350655	 -1.943841	 -0.782296
 -1.368259	 -1.943876	 -0.772803
 -1.385993	 -1.944361	 -0.763596
 -1.404348	 -1.950722	 -0.758894
 -1.422709	 -1.957136	 -0.754232
 -1.441070	 -1.963550	 -0.749571
 -1.459504	 -1.969996	 -0.744901
 -1.479270	 -1.977312	 -0.740659
 -1.497659	 -1.984207	 -0.736877
