 -1.522037	 -2.613645	  0.182109
 -1.506968	 -2.587767	  0.180306
 -1.486599	 -2.543561	  0.197175
 -1.468656	 -2.497907	  0.214009
 -1.447185	 -2.455579	  0.232647
 -1.427056	 -2.411050	  0.247396
 -1.407391	 -2.370794	  0.270855
 -1.381818	 -2.329600	  0.286564
 -1.363696	 -2.284048	  0.301724
 -1.350655	 -2.237708	  0.316345
 -1.337858	 -2.189296	  0.325958
 -1.321724	 -2.144590	  0.339642
 -1.309579	 -2.101377	  0.354818
 -1.295829	 -2.057407	  0.369975
 -1.276954	 -2.012313	  0.387293
 -1.252753	 -1.970449	  0.406821
 -1.226769	 -1.932176	  0.427609
 -1.200822	 -1.893576	  0.448960
 -1.176198	 -1.856941	  0.470208
 -1.153588	 -1.820391	  0.491432
 -1.135435	 -1.778808	  0.511921
 -1.120312	 -1.732380	  0.525791
 -1.108156	 -1.687941	  0.546142
 -1.090247	 -1.645623	  0.565865
 -1.067198	 -1.604007	  0.581325
 -1.042278	 -1.563179	  0.596697
 -1.018191	 -1.521768	  0.612053
 -0.995812	 -1.475595	  0.624872
 -0.976999	 -1.428179	  0.634924
 -0.959581	 -1.382662	  0.642800
 -0.940823	 -1.339578	  0.649610
 -0.915390	 -1.299743	  0.657187
 -0.877338	 -1.261069	  0.665777
 -0.799322	 -1.212670	  0.674585
 -0.677600	 -1.162056	  0.673507
 -0.591507	 -1.133235	  0.667548
 -0.532692	 -1.113307	  0.664556
 -0.491503	 -1.096586	  0.665752
 -0.459561	 -1.079732	  0.670674
 -0.433615	 -1.060549	  0.679133
 -0.402875	 -1.026564	  0.696233
 -0.380298	 -0.981103	  0.718258
 -0.372344	 -0.925858	  0.741574
 -0.377653	 -0.871889	  0.759391
 -0.391946	 -0.824409	  0.772319
 -0.415908	 -0.785237	  0.782761
 -0.473764	 -0.729904	  0.797630
 -0.559192	 -0.656724	  0.848559
 -0.588353	 -0.581167	  0.912366
 -0.577501	 -0.524562	  0.949082
 -0.555814	 -0.480555	  0.971108
 -0.528352	 -0.442105	  0.989138
 -0.498597	 -0.405225	  1.005260
 -0.468677	 -0.369939	  1.019996
 -0.438828	 -0.333374	  1.036406
 -0.412362	 -0.293981	  1.053866
 -0.393574	 -0.247149	  1.068177
 -0.379155	 -0.200547	  1.081423
 -0.363815	 -0.154625	  1.094983
 -0.345850	 -0.108222	  1.109509
 -0.328448	 -0.063493	  1.123954
 -0.311504	 -0.020798	  1.138136
 -0.295698	  0.023594	  1.152540
 -0.282380	  0.068395	  1.166685
 -0.271040	  0.114618	  1.182089
 -0.261164	  0.160664	  1.199165
 -0.251808	  0.207361	  1.218264
 -0.241637	  0.254264	  1.239563
 -0.231098	  0.297251	  1.261604
 -0.220970	  0.337620	  1.282760
 -0.210609	  0.378939	  1.303374
 -0.198893	  0.423864	  1.324224
 -0.185108	  0.471731	  1.343436
 -0.164155	  0.519904	  1.358797
 -0.135547	  0.564566	  1.372339
 -0.103804	  0.602156	  1.385929
 -0.071420	  0.638662	  1.400112
 -0.041126	  0.675869	  1.415646
 -0.012349	  0.714120	  1.432469
  0.013793	  0.753287	  1.449595
  0.037525	  0.792736	  1.466738
  0.059693	  0.832140	  1.482885
  0.081895	  0.872220	  1.498798
  0.104398	  0.912964	  1.515751
  0.127163	  0.954315	  1.534561
  0.148003	  0.992467	  1.553889
  0.169125	  1.031682	  1.575774
  0.190611	  1.071702	  1.598380
  0.210861	  1.113482	  1.619457
  0.227693	  1.158007	  1.637146
  0.242724	  1.204309	  1.651936
  0.258328	  1.250138	  1.665420
  0.274244	  1.293940	  1.678469
  0.290972	  1.336757	  1.692678
  0.308425	  1.378585	  1.710478
  0.325627	  1.418127	  1.733380
  0.340894	  1.459270	  1.759089
  0.353452	  1.505070	  1.784125
  0.366307	  1.553378	  1.804133
  0.379847	  1.598541	  1.820383
  0.395249	  1.643983	  1.836106
  0.413191	  1.689935	  1.847735
  0.433162	  1.735567	  1.856289
  0.454727	  1.781087	  1.866160
  0.476860	  1.824216	  1.876537
  0.499016	  1.867762	  1.887172
  0.521213	  1.912324	  1.898065
  0.543357	  1.954328	  1.909668
  0.565251	  1.994099	  1.923154
  0.587070	  2.032705	  1.939499
  0.609527	  2.072746	  1.958893
  0.631350	  2.113682	  1.975782
  0.649086	  2.152777	  1.986011
  0.655576	  2.174305	  2.005871
