  0.996015	  1.729545	  1.451166
  0.999439	  1.745856	  1.467576
  0.996512	  1.731908	  1.453544
  0.993174	  1.718041	  1.439525
  0.989477	  1.704248	  1.425521
  0.985780	  1.690455	  1.411518
  0.981407	  1.676764	  1.397611
  0.976937	  1.663088	  1.383718
  0.972321	  1.649474	  1.369813
  0.967032	  1.636157	  1.355860
  0.961742	  1.622841	  1.341907
  0.956111	  1.609741	  1.327883
  0.949893	  1.597029	  1.313749
  0.943675	  1.584318	  1.299615
  0.937052	  1.571996	  1.285322
  0.929954	  1.560151	  1.270855
  0.922855	  1.548305	  1.256388
  0.915172	  1.536901	  1.241864
  0.907041	  1.525852	  1.227311
  0.898911	  1.514803	  1.212758
  0.889802	  1.504070	  1.198550
  0.880545	  1.493390	  1.184400
  0.870726	  1.482828	  1.170543
  0.859955	  1.472497	  1.157228
  0.849185	  1.462167	  1.143913
  0.836269	  1.452251	  1.132300
  0.823352	  1.442336	  1.120689
  0.808809	  1.432716	  1.110891
  0.793700	  1.423249	  1.101830
  0.778157	  1.413911	  1.093392
  0.761503	  1.405017	  1.086794
  0.744849	  1.396122	  1.080197
  0.728081	  1.387292	  1.073805
  0.711013	  1.378646	  1.067979
  0.693946	  1.369999	  1.062153
  0.676878	  1.361353	  1.056328
  0.659667	  1.353238	  1.050171
  0.642392	  1.345382	  1.043857
  0.625117	  1.337526	  1.037543
  0.607957	  1.329481	  1.031153
  0.591076	  1.321000	  1.024588
  0.574341	  1.312230	  1.018029
  0.558774	  1.301468	  1.011560
  0.545520	  1.287963	  1.005084
  0.534935	  1.272481	  0.998137
  0.525297	  1.256600	  0.990727
  0.517326	  1.240160	  0.982591
  0.509356	  1.223720	  0.974454
  0.502884	  1.207187	  0.965247
  0.497621	  1.190679	  0.955259
  0.492357	  1.174171	  0.945270
  0.487093	  1.157662	  0.935281
  0.484406	  1.141573	  0.923710
  0.482086	  1.125572	  0.911937
  0.479767	  1.109572	  0.900164
  0.477447	  1.093571	  0.888391
  0.477188	  1.078263	  0.875523
  0.477396	  1.063143	  0.862433
  0.477604	  1.048022	  0.849344
  0.477812	  1.032902	  0.836254
  0.479981	  1.018354	  0.822703
  0.482477	  1.003916	  0.809089
  0.484973	  0.989479	  0.795475
  0.487565	  0.975073	  0.781847
  0.491448	  0.961119	  0.768055
  0.495331	  0.947165	  0.754264
  0.499213	  0.933211	  0.740472
  0.503375	  0.919321	  0.726697
  0.507925	  0.905525	  0.712950
  0.512475	  0.891730	  0.699202
  0.517026	  0.877935	  0.685455
  0.521497	  0.864041	  0.671781
  0.525949	  0.850123	  0.658127
  0.530400	  0.836204	  0.644472
  0.534709	  0.822253	  0.630803
  0.538287	  0.808156	  0.617076
  0.541865	  0.794058	  0.603348
  0.545443	  0.779961	  0.589620
  0.548526	  0.765733	  0.575906
  0.551173	  0.751400	  0.562211
  0.553819	  0.737067	  0.548515
  0.556433	  0.722707	  0.534842
  0.558740	  0.708111	  0.521365
  0.561048	  0.693514	  0.507889
  0.563234	  0.678858	  0.494457
  0.564814	  0.663914	  0.481260
  0.566393	  0.648969	  0.468062
  0.566814	  0.633533	  0.455352
  0.566176	  0.617588	  0.443296
  0.563635	  0.600963	  0.432472
  0.560015	  0.584345	  0.421949
  0.555933	  0.567759	  0.411546
  0.551738	  0.551245	  0.401072
  0.546800	  0.535233	  0.390152
  0.541861	  0.519222	  0.379232
  0.536922	  0.503211	  0.368312
  0.531928	  0.487339	  0.357215
  0.526611	  0.472366	  0.345069
  0.521294	  0.457392	  0.332923
  0.515977	  0.442418	  0.320778
  0.510660	  0.427444	  0.308632
  0.505292	  0.413042	  0.295836
  0.499848	  0.399977	  0.281705
  0.494404	  0.386913	  0.267574
  0.488960	  0.373848	  0.253443
  0.483516	  0.360783	  0.239312
  0.478178	  0.348363	  0.224573
  0.473322	  0.338517	  0.207855
  0.468466	  0.328671	  0.191138
  0.463610	  0.318826	  0.174420
  0.458754	  0.308980	  0.157703
  0.454218	  0.300750	  0.140048
  0.450258	  0.295168	  0.121255
  0.446298	  0.289587	  0.102463
  0.442338	  0.284005	  0.083670
  0.438477	  0.279135	  0.064660
  0.435155	  0.277719	  0.044989
  0.431833	  0.276304	  0.025318
  0.428511	  0.274888	  0.005646
  0.425554	  0.275324	 -0.014129
  0.423017	  0.277730	 -0.033821
  0.420480	  0.280137	 -0.053513
  0.417943	  0.282543	 -0.073205
  0.415775	  0.288258	 -0.092248
  0.413624	  0.294115	 -0.111250
  0.411474	  0.299973	 -0.130252
  0.409432	  0.306672	 -0.148985
  0.407663	  0.315306	 -0.166939
  0.405893	  0.323939	 -0.184893
  0.404124	  0.332572	 -0.202847
  0.402421	  0.341634	 -0.220594
  0.400958	  0.352169	 -0.237532
  0.399496	  0.362704	 -0.254469
  0.398034	  0.373238	 -0.271407
  0.396571	  0.383773	 -0.288344
  0.395499	  0.394654	 -0.305091
  0.394934	  0.405973	 -0.321570
  0.394370	  0.417292	 -0.338049
  0.393806	  0.428611	 -0.354528
  0.393241	  0.439930	 -0.371008
  0.392677	  0.451249	 -0.387487
  0.393044	  0.462888	 -0.403747
  0.393645	  0.474603	 -0.419946
  0.394247	  0.486318	 -0.436145
  0.394849	  0.498032	 -0.452344
  0.395451	  0.509747	 -0.468542
  0.396053	  0.521462	 -0.484741
  0.396439	  0.532713	 -0.501272
  0.396694	  0.543678	 -0.517997
  0.396949	  0.554642	 -0.534722
  0.397204	  0.565606	 -0.551446
  0.397459	  0.576570	 -0.568171
  0.396786	  0.585882	 -0.585858
  0.394878	  0.592806	 -0.604525
  0.392970	  0.599729	 -0.623191
  0.390908	  0.605960	 -0.642083
  0.387777	  0.606688	 -0.661823
  0.384647	  0.607415	 -0.681563
  0.381386	  0.604288	 -0.701046
  0.378120	  0.600754	 -0.720459
  0.374873	  0.594669	 -0.739232
  0.371645	  0.588281	 -0.757907
  0.368509	  0.580558	 -0.776087
  0.365452	  0.572474	 -0.794124
  0.362592	  0.563514	 -0.811774
  0.359766	  0.554329	 -0.829314
  0.357039	  0.544506	 -0.846521
  0.354301	  0.534586	 -0.863670
  0.351490	  0.524008	 -0.880409
  0.348678	  0.513430	 -0.897148
  0.345541	  0.502185	 -0.913388
  0.342404	  0.490940	 -0.929627
  0.338802	  0.478984	 -0.945250
  0.335130	  0.466931	 -0.960782
  0.330893	  0.454129	 -0.975552
  0.326405	  0.441003	 -0.989959
  0.321394	  0.427216	 -1.003553
  0.315997	  0.412820	 -1.016345
  0.310224	  0.397848	 -1.028283
  0.304307	  0.382576	 -1.039762
  0.297970	  0.366444	 -1.049741
  0.291634	  0.350311	 -1.059721
  0.285443	  0.333659	 -1.068907
  0.279566	  0.316137	 -1.076551
  0.273688	  0.298614	 -1.084194
  0.267810	  0.281092	 -1.091837
  0.263710	  0.262194	 -1.096941
  0.259630	  0.243284	 -1.102018
  0.255549	  0.224374	 -1.107094
  0.252246	  0.205168	 -1.111588
  0.250518	  0.185517	 -1.114885
  0.248790	  0.165867	 -1.118182
  0.247062	  0.146216	 -1.121479
  0.246275	  0.126527	 -1.124902
  0.246753	  0.106856	 -1.128481
  0.247230	  0.087184	 -1.132061
  0.247708	  0.067513	 -1.135640
  0.248271	  0.047952	 -1.139769
  0.249087	  0.028809	 -1.145503
  0.249902	  0.009666	 -1.151236
  0.250717	 -0.009477	 -1.156970
  0.251513	 -0.028600	 -1.162775
  0.251508	 -0.046661	 -1.171366
  0.251503	 -0.064722	 -1.179957
  0.251498	 -0.082783	 -1.188548
  0.251494	 -0.100843	 -1.197139
  0.250255	 -0.117437	 -1.208235
  0.248859	 -0.133810	 -1.219635
  0.247463	 -0.150184	 -1.231035
  0.246067	 -0.166557	 -1.242435
  0.243308	 -0.181308	 -1.255656
  0.240146	 -0.195509	 -1.269380
  0.236984	 -0.209709	 -1.283104
  0.233822	 -0.223910	 -1.296828
  0.229629	 -0.236704	 -1.311617
  0.224544	 -0.248118	 -1.327233
  0.219460	 -0.259533	 -1.342849
  0.214375	 -0.270947	 -1.358465
  0.209152	 -0.282167	 -1.374176
  0.202173	 -0.290629	 -1.390900
  0.195194	 -0.299091	 -1.407624
  0.188215	 -0.307553	 -1.424348
  0.181237	 -0.316015	 -1.441072
  0.173211	 -0.322631	 -1.458154
  0.164529	 -0.327954	 -1.475368
  0.155848	 -0.333276	 -1.492581
  0.147166	 -0.338598	 -1.509795
  0.138290	 -0.343307	 -1.527087
  0.128590	 -0.344907	 -1.544504
  0.118890	 -0.346506	 -1.561921
  0.109190	 -0.348105	 -1.579338
  0.099490	 -0.349704	 -1.596755
  0.089670	 -0.347695	 -1.614063
  0.079873	 -0.344736	 -1.631246
  0.070076	 -0.341777	 -1.648429
  0.060279	 -0.338818	 -1.665612
  0.050743	 -0.334882	 -1.682746
  0.042544	 -0.327039	 -1.699216
  0.034344	 -0.319196	 -1.715686
  0.026145	 -0.311353	 -1.732156
  0.017945	 -0.303511	 -1.748626
  0.010298	 -0.294852	 -1.764952
  0.004614	 -0.283647	 -1.780513
 -0.001070	 -0.272442	 -1.796074
 -0.006753	 -0.261237	 -1.811635
 -0.012437	 -0.250032	 -1.827196
 -0.017904	 -0.238709	 -1.842749
 -0.021641	 -0.226521	 -1.858160
 -0.025378	 -0.214333	 -1.873570
 -0.029115	 -0.202144	 -1.888981
 -0.032852	 -0.189956	 -1.904391
 -0.036216	 -0.177932	 -1.920015
 -0.038411	 -0.166460	 -1.936250
 -0.040607	 -0.154987	 -1.952484
 -0.042802	 -0.143515	 -1.968719
 -0.044637	 -0.132457	 -1.985282
 -0.045015	 -0.123162	 -2.002987
 -0.045394	 -0.113868	 -2.020692
 -0.044986	 -0.108763	 -2.040026
 -0.043797	 -0.108214	 -2.059983
 -0.042608	 -0.107665	 -2.079940
 -0.041356	 -0.110524	 -2.099695
 -0.040302	 -0.115143	 -2.119126
 -0.039347	 -0.120440	 -2.138388
 -0.038819	 -0.126688	 -2.157380
 -0.038313	 -0.132984	 -2.176356
 -0.038459	 -0.139638	 -2.195216
 -0.038749	 -0.146371	 -2.214046
 -0.039474	 -0.153354	 -2.232774
 -0.040572	 -0.160548	 -2.251403
 -0.041770	 -0.167850	 -2.269984
 -0.043275	 -0.175486	 -2.288407
 -0.044782	 -0.183125	 -2.306829
 -0.046767	 -0.191461	 -2.324900
 -0.048753	 -0.199798	 -2.342971
 -0.051620	 -0.208692	 -2.360654
 -0.054628	 -0.217673	 -2.378269
 -0.057635	 -0.226655	 -2.395884
 -0.060643	 -0.235636	 -2.413499
 -0.068609	 -0.257251	 -2.454870
 -0.072040	 -0.266407	 -2.472318
