 -0.216060	  1.666681	 -1.724224
 -0.208401	  1.690450	 -1.740379
 -0.218273	  1.676801	 -1.728666
 -0.225214	  1.660279	 -1.719327
 -0.231349	  1.642989	 -1.711798
 -0.239940	  1.626194	 -1.705447
 -0.248633	  1.608240	 -1.699614
 -0.256828	  1.590771	 -1.691305
 -0.261094	  1.570689	 -1.681615
 -0.257687	  1.548952	 -1.674654
 -0.248728	  1.527615	 -1.669177
 -0.240640	  1.513413	 -1.662866
 -0.232088	  1.498486	 -1.652398
 -0.223653	  1.477745	 -1.641966
 -0.220810	  1.457977	 -1.637950
 -0.218728	  1.442227	 -1.636157
 -0.215596	  1.422880	 -1.631173
 -0.209530	  1.406457	 -1.621227
 -0.200824	  1.392124	 -1.611384
 -0.191926	  1.375644	 -1.604847
 -0.182963	  1.357265	 -1.601282
 -0.171390	  1.339776	 -1.597150
 -0.155644	  1.324362	 -1.589033
 -0.143305	  1.308579	 -1.582152
 -0.137980	  1.298740	 -1.577057
 -0.132938	  1.278779	 -1.568137
 -0.128400	  1.257601	 -1.557840
 -0.120030	  1.240931	 -1.547137
 -0.111458	  1.230091	 -1.539612
 -0.099065	  1.220611	 -1.526159
 -0.080464	  1.206600	 -1.512103
 -0.073802	  1.200115	 -1.505336
 -0.061124	  1.190954	 -1.491879
 -0.048142	  1.182912	 -1.477728
 -0.038165	  1.177702	 -1.464007
 -0.027776	  1.170274	 -1.447192
 -0.012534	  1.161490	 -1.428086
 -0.003547	  1.156033	 -1.420178
  0.012396	  1.147351	 -1.405493
  0.028923	  1.136071	 -1.390375
  0.036914	  1.130682	 -1.378690
  0.044548	  1.122415	 -1.367097
  0.054872	  1.113590	 -1.349555
  0.063892	  1.104475	 -1.334051
  0.072422	  1.095896	 -1.321964
  0.083413	  1.085799	 -1.310895
  0.096022	  1.075396	 -1.298001
  0.108418	  1.065718	 -1.284585
  0.121186	  1.056113	 -1.272152
  0.134606	  1.045985	 -1.261452
  0.146709	  1.037706	 -1.251860
  0.160945	  1.027728	 -1.240804
  0.173523	  1.019908	 -1.229741
  0.185382	  1.014671	 -1.220026
  0.199252	  1.011769	 -1.208195
  0.212718	  1.007735	 -1.195479
  0.224939	  1.003567	 -1.183328
  0.238706	  0.998880	 -1.170415
  0.251227	  0.992168	 -1.153270
  0.266224	  0.981790	 -1.135346
  0.282627	  0.973731	 -1.123274
  0.295268	  0.968640	 -1.116677
  0.309906	  0.959048	 -1.107962
  0.327639	  0.949030	 -1.098138
  0.348239	  0.939175	 -1.088307
  0.359782	  0.932901	 -1.078919
  0.370650	  0.923123	 -1.064189
  0.384932	  0.913402	 -1.047562
  0.394332	  0.911211	 -1.035531
  0.405015	  0.905655	 -1.016619
  0.416180	  0.894334	 -1.000340
  0.425770	  0.887273	 -0.984647
  0.435650	  0.877622	 -0.966178
  0.439256	  0.870338	 -0.956144
  0.446216	  0.858147	 -0.940746
  0.454436	  0.846878	 -0.921226
  0.460914	  0.835890	 -0.906405
  0.468244	  0.822884	 -0.888424
  0.477061	  0.813076	 -0.870672
  0.483696	  0.810206	 -0.859716
  0.494339	  0.802210	 -0.842166
  0.503879	  0.790457	 -0.824600
  0.508546	  0.778547	 -0.807724
  0.508585	  0.762659	 -0.793440
  0.508037	  0.748237	 -0.778769
  0.508979	  0.738565	 -0.765120
  0.515135	  0.726997	 -0.748454
  0.522238	  0.715100	 -0.733425
  0.527166	  0.706533	 -0.717808
  0.529823	  0.693315	 -0.697549
  0.530166	  0.677740	 -0.684371
  0.530617	  0.665777	 -0.669960
  0.532019	  0.653817	 -0.653455
  0.534593	  0.638609	 -0.636840
  0.535821	  0.627678	 -0.627847
  0.542375	  0.612843	 -0.614977
  0.554059	  0.594668	 -0.595893
  0.562899	  0.582428	 -0.580182
  0.567870	  0.578175	 -0.570967
  0.576284	  0.574456	 -0.555226
  0.584812	  0.561412	 -0.531225
  0.591669	  0.553610	 -0.513791
  0.595549	  0.543914	 -0.491398
  0.596230	  0.536601	 -0.478748
  0.597696	  0.526801	 -0.463032
  0.599899	  0.515576	 -0.440774
  0.601617	  0.505054	 -0.426804
  0.600844	  0.489539	 -0.411497
  0.598975	  0.471574	 -0.394528
  0.597155	  0.461501	 -0.382993
  0.596828	  0.450728	 -0.365050
  0.596850	  0.443848	 -0.348016
  0.598383	  0.441717	 -0.329707
  0.602742	  0.442787	 -0.306854
  0.608365	  0.442247	 -0.286394
  0.612879	  0.438516	 -0.268885
  0.615136	  0.436332	 -0.262505
  0.622786	  0.431637	 -0.253601
  0.633927	  0.433960	 -0.243788
  0.646441	  0.446528	 -0.231977
  0.658428	  0.462786	 -0.222812
  0.674459	  0.476427	 -0.215774
  0.688933	  0.490423	 -0.211770
  0.702735	  0.508161	 -0.211362
  0.715190	  0.526376	 -0.212733
  0.726528	  0.542614	 -0.220329
  0.736828	  0.557329	 -0.232547
  0.746391	  0.569005	 -0.243787
  0.761592	  0.578461	 -0.255971
  0.777131	  0.587071	 -0.267459
  0.792078	  0.597573	 -0.278747
  0.803420	  0.609250	 -0.287184
  0.809885	  0.614892	 -0.298772
  0.823735	  0.628365	 -0.316170
  0.841257	  0.642506	 -0.328660
  0.853404	  0.653201	 -0.337311
  0.863687	  0.664351	 -0.345266
  0.879033	  0.681883	 -0.355511
  0.892578	  0.704981	 -0.362979
  0.897150	  0.723211	 -0.363451
  0.905049	  0.745654	 -0.364445
  0.920393	  0.769442	 -0.355694
  0.925829	  0.780214	 -0.351959
  0.937558	  0.797185	 -0.349399
  0.947064	  0.813772	 -0.349019
  0.956888	  0.828815	 -0.351738
  0.976920	  0.855282	 -0.355286
  0.988936	  0.868287	 -0.350109
  0.996389	  0.872405	 -0.347594
  1.009123	  0.880822	 -0.345326
  1.026971	  0.894983	 -0.340324
  1.045918	  0.909274	 -0.339962
  1.057994	  0.926668	 -0.338968
  1.072390	  0.938640	 -0.337648
  1.087367	  0.949576	 -0.335996
  1.101685	  0.956090	 -0.337032
  1.116866	  0.960991	 -0.337514
  1.137089	  0.963720	 -0.340143
  1.162605	  0.957276	 -0.341689
  1.182894	  0.952906	 -0.344407
  1.199830	  0.953815	 -0.348163
  1.214409	  0.954988	 -0.351838
  1.228550	  0.959409	 -0.360434
  1.246803	  0.967090	 -0.374951
  1.259300	  0.970853	 -0.383062
  1.277277	  0.966451	 -0.395310
  1.299429	  0.957657	 -0.406066
  1.319723	  0.955516	 -0.414522
  1.339119	  0.960675	 -0.422060
  1.357725	  0.965993	 -0.428707
  1.375700	  0.969469	 -0.436056
  1.391473	  0.974698	 -0.443691
  1.407734	  0.980349	 -0.452501
  1.422901	  0.988817	 -0.464483
  1.439303	  0.998101	 -0.474248
  1.455938	  1.005644	 -0.482126
  1.473863	  1.010935	 -0.490922
  1.493663	  1.011521	 -0.499193
  1.517545	  1.010215	 -0.502594
  1.538050	  1.012688	 -0.503461
  1.554943	  1.022086	 -0.506542
  1.570229	  1.032936	 -0.512779
  1.588562	  1.040861	 -0.518299
  1.609170	  1.046741	 -0.518760
  1.630362	  1.052371	 -0.517684
  1.644681	  1.062569	 -0.516773
  1.659509	  1.077087	 -0.520359
  1.677315	  1.087589	 -0.522193
  1.700971	  1.092621	 -0.516266
  1.720416	  1.102751	 -0.502557
  1.730956	  1.111618	 -0.491880
  1.738551	  1.118750	 -0.485761
  1.754299	  1.130422	 -0.481879
  1.769173	  1.143047	 -0.476673
  1.785445	  1.151762	 -0.465484
  1.800901	  1.160091	 -0.443791
  1.809411	  1.167674	 -0.431902
  1.814036	  1.171528	 -0.420107
  1.822735	  1.181380	 -0.406548
  1.834987	  1.188805	 -0.389264
  1.846577	  1.194952	 -0.375811
  1.857529	  1.207454	 -0.360191
  1.862802	  1.217779	 -0.347691
  1.866595	  1.226126	 -0.335677
  1.876157	  1.234872	 -0.315766
  1.881578	  1.245733	 -0.293693
  1.878576	  1.255249	 -0.275959
  1.876477	  1.262085	 -0.263323
  1.874320	  1.269882	 -0.242729
  1.880601	  1.277761	 -0.220908
  1.883417	  1.281213	 -0.206561
  1.889116	  1.281590	 -0.190476
  1.900195	  1.281332	 -0.171751
  1.911475	  1.284289	 -0.152089
  1.914490	  1.290870	 -0.129920
  1.912141	  1.295906	 -0.111786
  1.908153	  1.296851	 -0.093808
  1.908590	  1.294396	 -0.073060
  1.909538	  1.289321	 -0.052728
  1.910487	  1.283608	 -0.033033
  1.910857	  1.279020	 -0.013518
  1.909599	  1.274803	  0.005072
  1.910016	  1.269608	  0.023375
  1.911397	  1.262591	  0.041073
  1.915944	  1.250545	  0.057137
  1.921469	  1.236702	  0.076251
  1.923904	  1.233361	  0.094531
  1.925332	  1.234137	  0.109946
  1.925731	  1.238088	  0.134796
  1.925168	  1.234698	  0.160116
  1.925495	  1.230096	  0.177086
  1.930624	  1.222722	  0.195834
  1.935608	  1.210579	  0.213473
  1.940587	  1.197174	  0.229911
  1.943085	  1.184001	  0.246209
  1.945487	  1.173399	  0.258957
  1.947063	  1.160480	  0.272835
  1.949146	  1.145062	  0.296650
  1.951183	  1.139324	  0.307510
  1.956489	  1.130326	  0.321424
  1.962341	  1.112590	  0.344013
  1.965019	  1.105426	  0.355733
  1.966350	  1.096289	  0.369152
  1.973874	  1.082368	  0.383009
  1.980100	  1.067672	  0.396500
  1.984950	  1.048923	  0.408987
  1.992093	  1.030254	  0.417147
  2.006734	  1.015645	  0.427367
  2.020257	  1.007631	  0.435855
  2.034260	  1.001345	  0.442565
  2.048473	  0.994000	  0.448568
  2.071031	  0.974195	  0.455157
  2.089296	  0.953971	  0.461344
  2.100307	  0.943946	  0.466706
  2.110895	  0.938691	  0.470830
  2.130613	  0.932765	  0.476614
  2.143616	  0.925554	  0.483250
  2.158249	  0.918826	  0.493391
  2.177751	  0.905038	  0.510074
  2.190851	  0.892472	  0.522576
  2.204469	  0.875410	  0.533750
  2.217493	  0.858624	  0.540452
  2.228286	  0.848968	  0.544027
  2.246624	  0.833269	  0.553979
  2.259771	  0.822032	  0.565472
  2.268020	  0.813785	  0.573213
  2.284380	  0.812481	  0.586517
  2.301471	  0.810691	  0.601369
  2.317908	  0.806031	  0.614385
  2.332497	  0.798988	  0.626540
  2.347616	  0.793521	  0.639564
  2.364843	  0.789352	  0.653020
  2.386531	  0.804476	  0.663750
  2.401763	  0.798763	  0.675384
