  1.501883	 -2.500079	  0.821493
  1.487013	 -2.475326	  0.813360
  1.485118	 -2.428272	  0.840025
  1.471237	 -2.386236	  0.862489
  1.457279	 -2.343322	  0.883814
  1.449161	 -2.300192	  0.911803
  1.445687	 -2.254988	  0.935414
  1.441361	 -2.210770	  0.957825
  1.437730	 -2.166724	  0.979441
  1.434995	 -2.121888	  1.000089
  1.432423	 -2.076659	  1.019777
  1.426945	 -2.030241	  1.039017
  1.418179	 -1.984581	  1.057338
  1.408134	 -1.940092	  1.075044
  1.397861	 -1.895648	  1.092518
  1.388774	 -1.848809	  1.109608
  1.382010	 -1.802515	  1.126992
  1.378167	 -1.758862	  1.147335
  1.376755	 -1.712606	  1.170548
  1.373285	 -1.666566	  1.192819
  1.365838	 -1.622974	  1.215215
  1.356435	 -1.581531	  1.236637
  1.343437	 -1.539814	  1.258135
  1.327235	 -1.497683	  1.279648
  1.312505	 -1.454825	  1.301385
  1.300058	 -1.410068	  1.321687
  1.289407	 -1.365416	  1.340902
  1.279618	 -1.320790	  1.360078
  1.269777	 -1.274554	  1.381083
  1.259855	 -1.228349	  1.404659
  1.250026	 -1.184385	  1.429879
  1.240332	 -1.144712	  1.454616
  1.229512	 -1.106800	  1.477181
  1.216431	 -1.065768	  1.495470
  1.202909	 -1.019495	  1.514331
  1.192967	 -0.972058	  1.538859
  1.186984	 -0.928259	  1.566657
  1.183649	 -0.887777	  1.596464
  1.182143	 -0.848792	  1.628609
  1.181765	 -0.811347	  1.661765
  1.180252	 -0.772914	  1.694729
  1.175903	 -0.731005	  1.724672
  1.168474	 -0.688284	  1.748517
  1.158274	 -0.646715	  1.768102
  1.147766	 -0.603899	  1.787788
  1.139553	 -0.559189	  1.809274
  1.136001	 -0.515101	  1.830880
  1.132986	 -0.471929	  1.855378
  1.124362	 -0.424705	  1.876898
  1.116552	 -0.376929	  1.896265
  1.109871	 -0.331775	  1.916336
  1.103079	 -0.288975	  1.936546
  1.094731	 -0.245730	  1.957882
  1.083272	 -0.200361	  1.980708
  1.071696	 -0.155616	  2.000743
  1.061372	 -0.111639	  2.016482
  1.049593	 -0.069380	  2.036999
  1.036376	 -0.024496	  2.058806
  1.024863	  0.017044	  2.085041
  1.014305	  0.056674	  2.111568
  1.005640	  0.098966	  2.134732
  0.990084	  0.142282	  2.153613
  0.978337	  0.189296	  2.169178
  0.969432	  0.235199	  2.188417
  0.967692	  0.283002	  2.207076
  0.962799	  0.329546	  2.225636
  0.956556	  0.375403	  2.244275
  0.949901	  0.418711	  2.265488
  0.939811	  0.456835	  2.293899
  0.934577	  0.499131	  2.317862
  0.926650	  0.542752	  2.342272
  0.926345	  0.586230	  2.365232
  0.912427	  0.627302	  2.387528
  0.906958	  0.672671	  2.406121
  0.899748	  0.712672	  2.434576
  0.885178	  0.750237	  2.467229
  0.876396	  0.793845	  2.494779
  0.867676	  0.838783	  2.519326
  0.860156	  0.883096	  2.540445
  0.853017	  0.924372	  2.561003
  0.844451	  0.967693	  2.583327
  0.835099	  1.014695	  2.606118
  0.828974	  1.061423	  2.625901
  0.824018	  1.106369	  2.639983
  0.811246	  1.149923	  2.649445
  0.819358	  1.161422	  2.675939
