 -2.442390	 -0.888723	  1.557499
 -2.418208	 -0.879924	  1.542078
 -2.376890	 -0.860078	  1.518864
 -2.344597	 -0.847708	  1.482140
 -2.311184	 -0.832346	  1.448686
 -2.276169	 -0.816890	  1.416498
 -2.241791	 -0.802341	  1.383643
 -2.213305	 -0.789905	  1.344644
 -2.183266	 -0.766550	  1.311570
 -2.147896	 -0.754284	  1.277247
 -2.113663	 -0.734901	  1.246137
 -2.076976	 -0.723124	  1.216171
 -2.042780	 -0.714415	  1.182443
 -2.002939	 -0.700080	  1.154377
 -1.963611	 -0.690351	  1.123530
 -1.925348	 -0.680440	  1.093013
 -1.888420	 -0.665750	  1.062385
 -1.855888	 -0.644867	  1.029797
 -1.829587	 -0.632555	  0.994587
 -1.826819	 -0.682621	  0.941369
 -1.787490	 -0.769942	  0.855333
 -1.702205	 -0.835502	  0.778042
 -1.628384	 -0.865923	  0.732728
 -1.575632	 -0.878296	  0.704786
 -1.535141	 -0.881682	  0.685715
 -1.505754	 -0.877463	  0.673921
 -1.479670	 -0.865141	  0.665105
 -1.442568	 -0.825013	  0.654559
 -1.406475	 -0.722662	  0.637741
 -1.389084	 -0.593456	  0.600669
 -1.373417	 -0.514777	  0.563212
 -1.357705	 -0.474561	  0.537715
 -1.338974	 -0.444404	  0.513736
 -1.314063	 -0.417200	  0.487482
 -1.284315	 -0.394038	  0.460934
 -1.250061	 -0.373333	  0.433852
 -1.211788	 -0.354101	  0.406103
 -1.173800	 -0.336905	  0.380341
 -1.135901	 -0.320087	  0.356371
 -1.097867	 -0.302227	  0.334516
 -1.056345	 -0.283171	  0.311847
 -1.013758	 -0.268573	  0.284441
 -0.972938	 -0.258652	  0.253757
 -0.934864	 -0.251451	  0.219887
 -0.899241	 -0.245192	  0.182799
 -0.864431	 -0.237962	  0.144821
 -0.830523	 -0.229566	  0.107589
 -0.797540	 -0.220098	  0.070548
 -0.765728	 -0.209671	  0.033076
 -0.735653	 -0.198218	 -0.004767
 -0.704803	 -0.184401	 -0.041554
 -0.672901	 -0.168788	 -0.075441
 -0.639814	 -0.152466	 -0.107420
 -0.605842	 -0.134798	 -0.139481
 -0.572758	 -0.117172	 -0.171212
 -0.540803	 -0.100435	 -0.203202
 -0.510236	 -0.084782	 -0.237165
 -0.479838	 -0.069170	 -0.273960
 -0.450105	 -0.053404	 -0.311878
 -0.420728	 -0.037263	 -0.349955
 -0.391082	 -0.019718	 -0.387057
 -0.360604	 -0.000649	 -0.423195
 -0.328877	  0.019466	 -0.458522
 -0.296737	  0.038866	 -0.492316
 -0.263370	  0.056923	 -0.524429
 -0.229065	  0.072706	 -0.554576
 -0.192490	  0.086459	 -0.583929
 -0.154086	  0.098263	 -0.612671
 -0.114945	  0.108350	 -0.640516
 -0.074445	  0.117720	 -0.668664
 -0.033271	  0.127976	 -0.697921
  0.006053	  0.139100	 -0.727419
  0.044438	  0.150637	 -0.757500
  0.082143	  0.162084	 -0.787600
  0.119233	  0.172968	 -0.817316
  0.155396	  0.183279	 -0.846506
  0.192337	  0.193374	 -0.875641
  0.231219	  0.203129	 -0.905094
  0.269356	  0.212172	 -0.933023
  0.307818	  0.220761	 -0.959160
  0.348308	  0.229328	 -0.984179
  0.389542	  0.237783	 -1.006755
  0.426272	  0.244577	 -1.025501
  0.453080	  0.248083	 -1.037963
  0.469734	  0.248537	 -1.044282
  0.492466	  0.246529	 -1.050741
  0.544753	  0.238377	 -1.063756
  0.609101	  0.227091	 -1.082539
  0.660015	  0.217966	 -1.101115
  0.710002	  0.210929	 -1.120968
  0.777678	  0.213439	 -1.154927
  0.867532	  0.226568	 -1.213247
  0.952330	  0.225160	 -1.279418
  1.025189	  0.208381	 -1.342506
  1.077495	  0.192979	 -1.388869
  1.118069	  0.198154	 -1.429591
  1.156659	  0.222661	 -1.473928
  1.186950	  0.266611	 -1.517106
  1.199234	  0.326364	 -1.558225
  1.190268	  0.387199	 -1.594686
  1.167282	  0.452631	 -1.638070
  1.146166	  0.504437	 -1.682974
  1.139899	  0.545856	 -1.728221
  1.150957	  0.584407	 -1.770981
  1.169457	  0.615470	 -1.804485
  1.191269	  0.640731	 -1.832839
  1.217302	  0.664312	 -1.861789
  1.246177	  0.686927	 -1.892184
  1.276540	  0.708593	 -1.924755
  1.307011	  0.728395	 -1.959688
  1.336292	  0.745430	 -1.995463
  1.365502	  0.760906	 -2.031539
  1.395114	  0.776332	 -2.067348
  1.425186	  0.792163	 -2.102779
  1.457808	  0.808804	 -2.137938
  1.493253	  0.824529	 -2.171274
  1.529618	  0.839216	 -2.202555
  1.565495	  0.853162	 -2.232604
  1.600669	  0.866521	 -2.262215
  1.635864	  0.879105	 -2.292903
  1.672529	  0.888029	 -2.326812
  1.689254	  0.896909	 -2.350080
