 0.0 0.0 0.0 0
 -0.0798543492690185 0.6902993151788488 -0.2603344561427555 1000
 -0.90799996937981 0.3752549845787146 0.2540660260343915 1000
 -0.17475684197284974 -0.6220944051640009 -0.6036933327623248 1000
 0.5454588689167128 -0.36876479766813414 0.3343265084152014 1000
 -0.37666445679655264 -0.4075453530034215 0.42265147261157215 1000
 0.8837656268716281 -0.26791466751167714 -0.345189443729075 1000
