 -0.551549	  1.852173	  1.485714
 -0.569303	  1.895194	  1.494019
 -0.559939	  1.877988	  1.490208
 -0.550468	  1.862457	  1.488023
 -0.538703	  1.849435	  1.482871
 -0.524284	  1.827436	  1.475913
 -0.516790	  1.810395	  1.469026
 -0.510663	  1.794805	  1.458988
 -0.503167	  1.774727	  1.449365
 -0.493171	  1.754853	  1.451851
 -0.482696	  1.740092	  1.460155
 -0.468674	  1.726535	  1.472423
 -0.456381	  1.712750	  1.478326
 -0.443626	  1.700327	  1.483369
 -0.426204	  1.683649	  1.491760
 -0.415183	  1.670637	  1.493077
 -0.403693	  1.656525	  1.490246
 -0.388990	  1.636828	  1.489855
 -0.375020	  1.623527	  1.493603
 -0.360958	  1.615569	  1.497015
 -0.340530	  1.606881	  1.497159
 -0.324452	  1.591538	  1.502109
 -0.310241	  1.576447	  1.511252
 -0.297397	  1.567820	  1.518222
 -0.279355	  1.558747	  1.523528
 -0.261951	  1.549224	  1.528150
 -0.245575	  1.538169	  1.530082
 -0.230211	  1.525427	  1.529195
 -0.213441	  1.511397	  1.530048
 -0.197261	  1.501223	  1.534413
 -0.182127	  1.493652	  1.537435
 -0.162795	  1.481580	  1.538164
 -0.146399	  1.466106	  1.544105
 -0.130999	  1.453035	  1.550957
 -0.125242	  1.441785	  1.553707
 -0.113106	  1.423569	  1.556415
 -0.097962	  1.399802	  1.561866
 -0.092298	  1.386362	  1.564055
 -0.089859	  1.373517	  1.566148
 -0.081038	  1.351725	  1.566337
 -0.067575	  1.334910	  1.569531
 -0.052985	  1.315166	  1.573303
 -0.045979	  1.300298	  1.572495
 -0.040737	  1.282222	  1.568265
 -0.035948	  1.259830	  1.563268
 -0.033492	  1.241088	  1.556684
 -0.033063	  1.224868	  1.550495
 -0.030118	  1.202250	  1.540591
 -0.026731	  1.189097	  1.530862
 -0.021721	  1.174841	  1.520245
 -0.017866	  1.158444	  1.505854
 -0.015238	  1.145544	  1.493994
 -0.015524	  1.128652	  1.474616
 -0.017547	  1.117304	  1.459330
 -0.019611	  1.108047	  1.445508
 -0.019046	  1.099968	  1.431049
 -0.020542	  1.089705	  1.412288
 -0.025531	  1.078499	  1.395384
 -0.028019	  1.067808	  1.379836
 -0.022433	  1.057897	  1.362763
 -0.017850	  1.040216	  1.345547
 -0.020300	  1.019459	  1.330875
 -0.023558	  1.012124	  1.323889
 -0.027284	  1.001188	  1.306746
 -0.032346	  0.983984	  1.290133
 -0.034369	  0.969974	  1.279541
 -0.033572	  0.953684	  1.267431
 -0.039062	  0.934080	  1.253476
 -0.047664	  0.923955	  1.244811
 -0.057630	  0.909458	  1.232749
 -0.061780	  0.893205	  1.222493
 -0.061490	  0.875712	  1.212867
 -0.064805	  0.854374	  1.201428
 -0.071506	  0.842339	  1.194522
 -0.081281	  0.825835	  1.184925
 -0.085350	  0.805720	  1.175433
 -0.082255	  0.787918	  1.168399
 -0.079482	  0.769188	  1.161049
 -0.081161	  0.748500	  1.153215
 -0.082028	  0.731018	  1.148999
 -0.073742	  0.711878	  1.143410
 -0.065608	  0.692211	  1.133743
 -0.059832	  0.676962	  1.124467
 -0.055624	  0.663653	  1.116961
 -0.048720	  0.640620	  1.107755
 -0.040815	  0.623927	  1.102748
 -0.030543	  0.606890	  1.098344
 -0.019293	  0.590672	  1.089983
 -0.011121	  0.575737	  1.078214
 -0.007856	  0.559958	  1.065119
 -0.008266	  0.545463	  1.052816
 -0.007286	  0.529388	  1.038186
 -0.005086	  0.511115	  1.025900
 -0.006018	  0.496490	  1.018573
 -0.008869	  0.481171	  1.006375
 -0.007815	  0.463972	  0.989630
 -0.008744	  0.449613	  0.980695
 -0.013384	  0.436253	  0.970899
 -0.020185	  0.423728	  0.954488
 -0.020253	  0.408210	  0.935472
 -0.018760	  0.394944	  0.924262
 -0.020848	  0.377981	  0.912343
 -0.030940	  0.362913	  0.903729
 -0.041295	  0.347465	  0.891539
 -0.045734	  0.333896	  0.879065
 -0.050518	  0.316881	  0.865876
 -0.056244	  0.301519	  0.853289
 -0.058208	  0.289821	  0.837416
 -0.057392	  0.278834	  0.822060
 -0.060056	  0.262892	  0.808654
 -0.063652	  0.247401	  0.796448
 -0.066904	  0.231404	  0.785309
 -0.070065	  0.213806	  0.775744
 -0.072093	  0.197964	  0.763859
 -0.073887	  0.184564	  0.750064
 -0.073793	  0.170274	  0.736898
 -0.068082	  0.150335	  0.730702
 -0.066225	  0.125662	  0.724376
 -0.066642	  0.110647	  0.716412
 -0.065571	  0.095406	  0.705771
 -0.062535	  0.077650	  0.695942
 -0.057801	  0.061200	  0.687462
 -0.053523	  0.043474	  0.677484
 -0.048630	  0.020938	  0.670251
 -0.040461	  0.005036	  0.669487
 -0.029644	 -0.010221	  0.668411
 -0.020087	 -0.028837	  0.664265
 -0.009992	 -0.046184	  0.664157
  0.002315	 -0.061356	  0.667468
  0.011405	 -0.080020	  0.668599
  0.016589	 -0.102684	  0.669176
  0.023356	 -0.117414	  0.672439
  0.038989	 -0.132668	  0.680431
  0.053968	 -0.140644	  0.690640
  0.066245	 -0.154858	  0.700546
  0.077843	 -0.167490	  0.711113
  0.090554	 -0.177534	  0.722957
  0.103209	 -0.187136	  0.735168
  0.115690	 -0.196280	  0.747811
  0.129204	 -0.204200	  0.760103
  0.142082	 -0.211175	  0.772848
  0.154016	 -0.216462	  0.788480
  0.170733	 -0.218756	  0.801557
  0.188256	 -0.225841	  0.809761
  0.204008	 -0.242238	  0.821137
  0.215045	 -0.251326	  0.830501
  0.229744	 -0.258136	  0.837386
  0.253076	 -0.261596	  0.844767
  0.273465	 -0.265535	  0.851438
  0.285835	 -0.272256	  0.853781
  0.306021	 -0.292925	  0.856299
  0.321982	 -0.312496	  0.861899
  0.330113	 -0.326994	  0.860861
  0.342255	 -0.344023	  0.863894
  0.358772	 -0.358063	  0.863816
  0.370676	 -0.364577	  0.867399
  0.391873	 -0.380613	  0.870442
  0.413028	 -0.396865	  0.877004
  0.426654	 -0.405917	  0.873904
  0.441296	 -0.415365	  0.872219
  0.450636	 -0.431023	  0.863721
  0.462044	 -0.447331	  0.853519
  0.471133	 -0.464581	  0.844704
  0.478571	 -0.482120	  0.836775
  0.485770	 -0.500098	  0.827670
  0.491224	 -0.513867	  0.819047
  0.502887	 -0.530016	  0.808906
  0.511953	 -0.545964	  0.800396
  0.516419	 -0.560494	  0.793949
  0.524057	 -0.580946	  0.783313
  0.533055	 -0.596749	  0.773123
  0.540555	 -0.608693	  0.765470
  0.547399	 -0.627696	  0.756161
  0.547048	 -0.647857	  0.751749
  0.547559	 -0.667934	  0.752295
  0.556564	 -0.690807	  0.753200
  0.569444	 -0.709228	  0.749579
  0.576711	 -0.726379	  0.738779
  0.574102	 -0.740397	  0.729930
  0.568909	 -0.761072	  0.726454
  0.569125	 -0.783452	  0.725730
  0.585642	 -0.805435	  0.723625
  0.599339	 -0.819532	  0.718000
  0.605511	 -0.834427	  0.712974
  0.603571	 -0.854540	  0.711194
  0.602975	 -0.877534	  0.712412
  0.611032	 -0.898196	  0.714427
  0.626664	 -0.915861	  0.711820
  0.639529	 -0.930185	  0.704368
  0.647293	 -0.946507	  0.696365
  0.651035	 -0.964736	  0.689570
  0.655091	 -0.984975	  0.684634
  0.657091	 -1.004295	  0.679231
  0.660357	 -1.023539	  0.674024
  0.665000	 -1.042546	  0.669414
  0.670933	 -1.061314	  0.665592
  0.677037	 -1.079930	  0.661591
  0.683177	 -1.098564	  0.657719
  0.690444	 -1.116837	  0.654076
  0.697783	 -1.135120	  0.650529
  0.705705	 -1.153100	  0.646639
  0.714177	 -1.170681	  0.642271
  0.722681	 -1.188216	  0.637735
  0.731398	 -1.205407	  0.632293
  0.740097	 -1.222510	  0.626681
  0.748894	 -1.239555	  0.620999
  0.757751	 -1.256567	  0.615320
  0.766597	 -1.273620	  0.609772
  0.775439	 -1.291321	  0.606897
  0.784274	 -1.309058	  0.604194
  0.792993	 -1.326878	  0.601930
  0.799805	 -1.345351	  0.605233
  0.806562	 -1.363844	  0.608750
  0.813262	 -1.382309	  0.612396
  0.817216	 -1.399685	  0.621425
  0.820194	 -1.416344	  0.632074
  0.823314	 -1.432817	  0.642929
  0.826581	 -1.449043	  0.654174
  0.828645	 -1.464861	  0.665865
  0.831541	 -1.478480	  0.679031
  0.837501	 -1.490045	  0.696250
  0.841128	 -1.508318	  0.708310
  0.838752	 -1.532262	  0.710690
  0.837878	 -1.552207	  0.714917
  0.840634	 -1.569302	  0.722624
  0.842714	 -1.586698	  0.727262
  0.844615	 -1.609759	  0.731598
  0.848347	 -1.625522	  0.738132
  0.851596	 -1.642722	  0.742285
  0.853028	 -1.665410	  0.743506
  0.855756	 -1.682679	  0.747158
  0.858944	 -1.702382	  0.749821
  0.860897	 -1.720689	  0.744364
  0.862490	 -1.732557	  0.734523
  0.863646	 -1.745106	  0.722911
  0.866171	 -1.759475	  0.710333
  0.870845	 -1.773478	  0.700431
  0.878186	 -1.787620	  0.686475
  0.885169	 -1.797124	  0.669783
  0.893075	 -1.802957	  0.652020
  0.902008	 -1.806860	  0.634291
  0.913133	 -1.809263	  0.618726
  0.924509	 -1.813477	  0.603527
  0.934529	 -1.820489	  0.585623
  0.944143	 -1.823279	  0.565790
  0.955202	 -1.821646	  0.550281
  0.969665	 -1.821189	  0.539158
  0.987871	 -1.821772	  0.528307
  1.005269	 -1.819466	  0.509103
  1.014063	 -1.822458	  0.492008
  1.022748	 -1.830820	  0.477539
  1.036088	 -1.841999	  0.467714
  1.050115	 -1.850537	  0.455777
  1.061357	 -1.858598	  0.433335
  1.065601	 -1.868427	  0.416723
  1.071542	 -1.881768	  0.404486
  1.083568	 -1.896758	  0.398273
  1.096720	 -1.913217	  0.393476
  1.106988	 -1.929848	  0.387418
  1.115213	 -1.946333	  0.379101
  1.121884	 -1.964091	  0.372771
  1.128309	 -1.981968	  0.366501
  1.134705	 -1.999865	  0.360285
  1.141237	 -2.018139	  0.355461
  1.147766	 -2.036434	  0.350698
  1.154502	 -2.054780	  0.346457
  1.161587	 -2.073183	  0.343136
  1.168679	 -2.091594	  0.339857
  1.175782	 -2.110140	  0.337511
  1.182887	 -2.128735	  0.335555
  1.190017	 -2.147414	  0.333597
  1.197230	 -2.166567	  0.331573
  1.203746	 -2.185383	  0.329702
