  2.660651	  1.437727	 -0.186485
  2.634308	  1.423492	 -0.184638
  2.602383	  1.409792	 -0.211171
  2.569689	  1.398781	 -0.241723
  2.528816	  1.383512	 -0.265038
  2.495143	  1.365858	 -0.296565
  2.460471	  1.351063	 -0.329257
  2.424539	  1.329336	 -0.357081
  2.384632	  1.311763	 -0.384116
  2.347430	  1.295403	 -0.414351
  2.311979	  1.285015	 -0.448235
  2.278486	  1.269358	 -0.481083
  2.244839	  1.253995	 -0.513091
  2.212651	  1.242480	 -0.548646
  2.178450	  1.227360	 -0.580220
  2.144604	  1.209843	 -0.611083
  2.108836	  1.189444	 -0.641733
  2.072167	  1.166297	 -0.669516
  2.035674	  1.141730	 -0.694590
  1.999608	  1.118315	 -0.718755
  1.962732	  1.095753	 -0.743077
  1.926162	  1.075250	 -0.766819
  1.888157	  1.056426	 -0.791801
  1.846841	  1.038868	 -0.820635
  1.809451	  1.024929	 -0.849211
  1.773453	  1.012756	 -0.878725
  1.735475	  0.999493	 -0.908636
  1.698999	  0.986052	 -0.936625
  1.662468	  0.971638	 -0.965270
  1.624990	  0.956825	 -0.995580
  1.589422	  0.940211	 -1.025355
  1.553883	  0.924786	 -1.055359
  1.517228	  0.914319	 -1.086352
  1.479938	  0.901877	 -1.118361
  1.442342	  0.888657	 -1.151158
  1.411871	  0.875814	 -1.189288
  1.379150	  0.857319	 -1.217670
  1.340138	  0.850096	 -1.248159
  1.300657	  0.834693	 -1.277058
  1.261998	  0.817833	 -1.303692
  1.223463	  0.803197	 -1.330434
  1.185136	  0.792300	 -1.359812
  1.149934	  0.782413	 -1.395780
  1.130645	  0.778394	 -1.437359
  1.132203	  0.784594	 -1.504745
  1.176275	  0.802103	 -1.633581
  1.197982	  0.795942	 -1.732857
  1.197443	  0.779994	 -1.814091
  1.183355	  0.746405	 -1.917108
  1.165792	  0.715106	 -1.985151
  1.149870	  0.696749	 -2.024123
  1.121154	  0.677559	 -2.067098
  1.076579	  0.655475	 -2.102143
  1.006178	  0.629400	 -2.120775
  0.945091	  0.609289	 -2.121144
  0.911085	  0.594690	 -2.120605
  0.887185	  0.582927	 -2.131037
  0.866353	  0.576971	 -2.154438
  0.831252	  0.581447	 -2.199764
  0.805056	  0.568423	 -2.269534
  0.801419	  0.565223	 -2.347156
  0.779247	  0.554863	 -2.374560
  0.747814	  0.528464	 -2.383971
  0.724110	  0.503745	 -2.380814
  0.645896	  0.432053	 -2.353249
  0.538543	  0.382851	 -2.312558
  0.381338	  0.369912	 -2.194806
  0.277432	  0.357394	 -2.169742
  0.227730	  0.343319	 -2.183922
  0.189712	  0.327481	 -2.207841
  0.153239	  0.312014	 -2.237215
  0.116242	  0.298296	 -2.268590
  0.080558	  0.287934	 -2.299659
  0.044244	  0.278617	 -2.332760
  0.004034	  0.263466	 -2.365588
 -0.032073	  0.243609	 -2.395150
 -0.064305	  0.223636	 -2.424661
 -0.098615	  0.202696	 -2.454050
 -0.133824	  0.181999	 -2.482867
 -0.168960	  0.163551	 -2.509840
 -0.205462	  0.148198	 -2.535611
 -0.245310	  0.135940	 -2.560825
 -0.286409	  0.122829	 -2.586236
 -0.327521	  0.109049	 -2.612829
 -0.369492	  0.094010	 -2.641595
 -0.406557	  0.076348	 -2.669900
 -0.441324	  0.058509	 -2.699076
 -0.473700	  0.040115	 -2.730540
 -0.503808	  0.019024	 -2.762194
 -0.537162	  0.000979	 -2.791275
 -0.571103	 -0.018995	 -2.826756
 -0.607947	 -0.038287	 -2.856878
 -0.646573	 -0.055186	 -2.884687
 -0.686927	 -0.071756	 -2.919415
 -0.693796	 -0.072473	 -2.948609
