 -2.508109	 -0.288893	  1.675360
 -2.483276	 -0.286033	  1.658772
 -2.465898	 -0.292500	  1.612840
 -2.444975	 -0.303840	  1.569826
 -2.434424	 -0.310930	  1.522539
 -2.420697	 -0.324695	  1.476489
 -2.401714	 -0.340983	  1.431882
 -2.381193	 -0.354776	  1.387337
 -2.365834	 -0.372484	  1.342477
 -2.351676	 -0.386639	  1.296487
 -2.335749	 -0.398602	  1.250686
 -2.320010	 -0.409764	  1.204873
 -2.310036	 -0.419288	  1.157386
 -2.301772	 -0.424913	  1.108635
 -2.290847	 -0.429745	  1.061010
 -2.278325	 -0.434532	  1.014158
 -2.263165	 -0.441645	  0.967574
 -2.243889	 -0.453861	  0.921665
 -2.224457	 -0.467144	  0.875796
 -2.206447	 -0.479790	  0.830649
 -2.190010	 -0.490627	  0.785677
 -2.175157	 -0.498545	  0.739380
 -2.164157	 -0.506209	  0.692920
 -2.154096	 -0.512130	  0.645289
 -2.143067	 -0.519545	  0.596535
 -2.137618	 -0.532916	  0.549989
 -2.144455	 -0.548068	  0.506500
 -2.165914	 -0.569587	  0.451300
 -2.206385	 -0.607789	  0.375321
 -2.255242	 -0.653658	  0.308042
 -2.295775	 -0.691860	  0.260616
 -2.333821	 -0.729045	  0.218709
 -2.371523	 -0.766666	  0.170897
 -2.397758	 -0.795794	  0.114982
 -2.399228	 -0.811701	  0.057840
 -2.379520	 -0.823021	 -0.002926
 -2.350816	 -0.829004	 -0.068288
 -2.328679	 -0.832795	 -0.122265
 -2.319959	 -0.837352	 -0.150021
 -2.312844	 -0.847920	 -0.178003
 -2.306252	 -0.865230	 -0.212928
 -2.295263	 -0.890896	 -0.261170
 -2.282302	 -0.917714	 -0.320222
 -2.270147	 -0.936574	 -0.377850
 -2.256944	 -0.949881	 -0.433707
 -2.240739	 -0.956461	 -0.482264
 -2.217566	 -0.957141	 -0.523877
 -2.186678	 -0.953646	 -0.559714
 -2.135458	 -0.943633	 -0.592977
 -2.046679	 -0.926489	 -0.622140
 -1.926793	 -0.912638	 -0.650986
 -1.822579	 -0.907008	 -0.686827
 -1.770681	 -0.910633	 -0.719170
 -1.752527	 -0.918754	 -0.740583
 -1.743214	 -0.935773	 -0.768424
 -1.745629	 -0.978639	 -0.822407
 -1.764584	 -1.040371	 -0.890002
 -1.791670	 -1.094336	 -0.941795
 -1.813295	 -1.142453	 -0.986995
 -1.827978	 -1.189593	 -1.033559
 -1.831404	 -1.187899	 -1.088378
 -1.861839	 -1.178893	 -1.144424
 -1.855531	 -1.239383	 -1.184600
 -1.791023	 -1.287530	 -1.215327
 -1.810582	 -1.289647	 -1.276765
 -1.828166	 -1.286272	 -1.320729
 -1.752665	 -1.271688	 -1.346436
 -1.690479	 -1.254151	 -1.396843
 -1.698878	 -1.265957	 -1.457835
 -1.666737	 -1.242711	 -1.500278
 -1.604561	 -1.219460	 -1.529972
 -1.534856	 -1.156465	 -1.558566
 -1.477295	 -1.110121	 -1.614844
 -1.445298	 -1.102267	 -1.670125
 -1.427706	 -1.107335	 -1.717799
 -1.412393	 -1.117111	 -1.765232
 -1.396200	 -1.128577	 -1.811617
 -1.378678	 -1.140681	 -1.856154
 -1.359852	 -1.152953	 -1.900189
 -1.340519	 -1.163805	 -1.945613
 -1.320165	 -1.173556	 -1.991437
 -1.299008	 -1.182812	 -2.036450
 -1.277451	 -1.191254	 -2.079893
 -1.257218	 -1.200084	 -2.124834
 -1.240760	 -1.214324	 -2.170113
 -1.225428	 -1.230593	 -2.214341
 -1.211451	 -1.244104	 -2.260055
 -1.191559	 -1.260173	 -2.303292
 -1.172825	 -1.273622	 -2.348310
 -1.163798	 -1.285245	 -2.397282
 -1.152670	 -1.299180	 -2.446116
 -1.164196	 -1.312171	 -2.470578
