  1.052731	 -1.756946	  1.260779
  1.065799	 -1.778120	  1.262872
  1.058267	 -1.758730	  1.256928
  1.045976	 -1.744484	  1.258629
  1.036179	 -1.726814	  1.254399
  1.025962	 -1.708545	  1.248540
  1.013257	 -1.694157	  1.250324
  1.001069	 -1.678036	  1.251933
  0.989221	 -1.659592	  1.250858
  0.981462	 -1.642237	  1.243999
  0.971582	 -1.627908	  1.240832
  0.957071	 -1.611926	  1.238398
  0.946020	 -1.596750	  1.232629
  0.935342	 -1.580272	  1.226588
  0.923404	 -1.564777	  1.223095
  0.912781	 -1.548879	  1.217625
  0.902008	 -1.532332	  1.210356
  0.889570	 -1.517710	  1.207858
  0.878124	 -1.502132	  1.205360
  0.866436	 -1.484987	  1.199098
  0.854428	 -1.471292	  1.196640
  0.842392	 -1.454928	  1.194965
  0.828414	 -1.438477	  1.193499
  0.817679	 -1.422495	  1.186412
  0.809221	 -1.406592	  1.178979
  0.797822	 -1.390714	  1.176531
  0.785070	 -1.374439	  1.175647
  0.773192	 -1.358508	  1.174577
  0.761841	 -1.341966	  1.172147
  0.750632	 -1.325589	  1.169665
  0.739478	 -1.309122	  1.167560
  0.728382	 -1.292571	  1.165841
  0.717281	 -1.276024	  1.164123
  0.705367	 -1.260064	  1.162303
  0.693442	 -1.244145	  1.160222
  0.682205	 -1.228295	  1.155486
  0.670944	 -1.212467	  1.150741
  0.656578	 -1.198803	  1.148140
  0.641802	 -1.185518	  1.145862
  0.627028	 -1.172231	  1.143592
  0.613099	 -1.157919	  1.142522
  0.599646	 -1.143126	  1.142076
  0.586199	 -1.128329	  1.141633
  0.573779	 -1.112658	  1.141235
  0.562516	 -1.096135	  1.140887
  0.551259	 -1.079607	  1.140542
  0.540394	 -1.062862	  1.140579
  0.529820	 -1.046404	  1.141817
  0.518530	 -1.029831	  1.144765
  0.506922	 -1.013120	  1.146438
  0.496038	 -0.996064	  1.143617
  0.485085	 -0.980844	  1.144098
  0.471862	 -0.962992	  1.148151
  0.460790	 -0.947222	  1.147666
  0.449641	 -0.933057	  1.145583
  0.435621	 -0.914564	  1.143929
  0.424653	 -0.899951	  1.145575
  0.412066	 -0.885347	  1.144807
  0.399937	 -0.868554	  1.142026
  0.388260	 -0.852588	  1.141849
  0.372481	 -0.837823	  1.143838
  0.357814	 -0.823734	  1.140203
  0.344412	 -0.811121	  1.131129
  0.333144	 -0.799000	  1.122527
  0.319713	 -0.784554	  1.116388
  0.308175	 -0.768576	  1.111490
  0.295925	 -0.752865	  1.104946
  0.285307	 -0.737478	  1.095646
  0.276902	 -0.721032	  1.090389
  0.267411	 -0.703953	  1.086450
  0.258705	 -0.686821	  1.079003
  0.250057	 -0.670591	  1.071246
  0.239046	 -0.656030	  1.063279
  0.227219	 -0.640764	  1.059585
  0.214991	 -0.624137	  1.056355
  0.203804	 -0.608048	  1.049582
  0.196261	 -0.590457	  1.041185
  0.188714	 -0.573528	  1.038703
  0.177631	 -0.556071	  1.035808
  0.167373	 -0.539170	  1.034671
  0.157766	 -0.522236	  1.032107
  0.147914	 -0.504894	  1.028695
  0.139136	 -0.486004	  1.027781
  0.131973	 -0.466749	  1.027300
  0.123898	 -0.450197	  1.022291
  0.115212	 -0.431892	  1.018616
  0.106357	 -0.413710	  1.017600
  0.097404	 -0.397084	  1.013468
  0.087464	 -0.378720	  1.007893
  0.078586	 -0.361951	  1.007291
  0.068691	 -0.345875	  1.006816
  0.056363	 -0.325813	  1.003796
  0.046636	 -0.311144	  1.002193
  0.034481	 -0.295410	  1.003286
  0.022489	 -0.278783	  1.002949
  0.011300	 -0.262715	  0.999265
 -0.000277	 -0.246253	  0.992196
 -0.011378	 -0.228288	  0.986587
 -0.020421	 -0.215419	  0.978261
 -0.033362	 -0.201194	  0.972492
 -0.045983	 -0.185691	  0.968269
 -0.057799	 -0.171632	  0.963324
 -0.072531	 -0.155132	  0.955842
 -0.083221	 -0.139265	  0.951672
 -0.093731	 -0.124822	  0.952883
 -0.105948	 -0.106876	  0.951052
 -0.117443	 -0.090861	  0.946102
 -0.130753	 -0.078105	  0.940398
 -0.144914	 -0.064678	  0.937155
 -0.157606	 -0.049589	  0.936967
 -0.169575	 -0.032037	  0.937160
 -0.181837	 -0.014970	  0.934044
 -0.194483	 -0.001261	  0.929446
 -0.207912	  0.012918	  0.927497
 -0.219612	  0.029611	  0.927659
 -0.231702	  0.045449	  0.925776
 -0.245416	  0.059683	  0.923830
 -0.257804	  0.075324	  0.923875
 -0.270261	  0.090540	  0.925210
 -0.285460	  0.104353	  0.925871
 -0.300206	  0.118862	  0.927264
 -0.309100	  0.137439	  0.926417
 -0.316291	  0.157247	  0.924564
 -0.326895	  0.173050	  0.924979
 -0.340465	  0.186720	  0.926188
 -0.355044	  0.202162	  0.923732
 -0.367363	  0.221476	  0.923606
 -0.378431	  0.234942	  0.928164
 -0.392857	  0.247873	  0.932214
 -0.405186	  0.265326	  0.930659
 -0.414774	  0.283007	  0.929620
 -0.429197	  0.297715	  0.930528
 -0.442797	  0.310283	  0.932276
 -0.457463	  0.326756	  0.937885
 -0.467790	  0.344596	  0.942455
 -0.478527	  0.356755	  0.936943
 -0.493953	  0.372370	  0.929965
 -0.508034	  0.387863	  0.930384
 -0.519905	  0.405206	  0.933782
 -0.530601	  0.418302	  0.930306
 -0.546462	  0.434074	  0.923779
 -0.563401	  0.438638	  0.914956
 -0.582811	  0.443617	  0.907234
 -0.602713	  0.443078	  0.901177
 -0.621780	  0.444441	  0.895983
 -0.642283	  0.442233	  0.892849
 -0.662999	  0.441373	  0.892232
 -0.682852	  0.435890	  0.893553
 -0.701886	  0.431286	  0.892515
 -0.720915	  0.428123	  0.889937
 -0.741015	  0.426111	  0.888199
 -0.761843	  0.424447	  0.888081
 -0.781145	  0.418315	  0.885100
 -0.798532	  0.410015	  0.880804
 -0.817731	  0.404278	  0.879331
 -0.839197	  0.401443	  0.879758
 -0.857298	  0.396061	  0.875459
 -0.875771	  0.393190	  0.871174
 -0.897216	  0.389036	  0.867613
 -0.916701	  0.386332	  0.868117
 -0.934625	  0.384060	  0.864983
 -0.954717	  0.380454	  0.857132
 -0.973075	  0.379532	  0.851683
 -0.994234	  0.381189	  0.851822
 -1.015267	  0.376588	  0.850231
 -1.034372	  0.369998	  0.846037
 -1.052041	  0.370079	  0.842138
 -1.071824	  0.373341	  0.837391
 -1.090953	  0.376027	  0.831181
 -1.110712	  0.374528	  0.823885
 -1.130977	  0.369868	  0.819783
 -1.150191	  0.370524	  0.818709
 -1.169883	  0.374017	  0.815655
 -1.188770	  0.378520	  0.810755
 -1.208095	  0.381052	  0.804227
 -1.228612	  0.381223	  0.800118
 -1.248135	  0.384806	  0.800370
 -1.266209	  0.392620	  0.799506
 -1.284252	  0.401735	  0.796839
 -1.302436	  0.409253	  0.792264
 -1.322805	  0.414925	  0.790372
 -1.340995	  0.422019	  0.792393
 -1.357600	  0.433467	  0.794058
 -1.371863	  0.447431	  0.795187
 -1.386154	  0.461535	  0.795363
 -1.399665	  0.476711	  0.797699
 -1.412381	  0.490014	  0.803106
 -1.427036	  0.502214	  0.810694
 -1.441034	  0.516434	  0.813864
 -1.452726	  0.532721	  0.818991
 -1.460466	  0.550870	  0.817805
 -1.472203	  0.565925	  0.819868
 -1.480120	  0.583566	  0.824689
 -1.489257	  0.602966	  0.827691
 -1.497243	  0.621622	  0.826019
 -1.495163	  0.642974	  0.820724
 -1.503030	  0.663574	  0.825725
 -1.513601	  0.679197	  0.835209
 -1.520758	  0.695837	  0.845925
 -1.524461	  0.714888	  0.850424
 -1.523192	  0.736613	  0.845888
 -1.525002	  0.757965	  0.841654
 -1.531336	  0.776706	  0.841920
 -1.530328	  0.798166	  0.844915
 -1.529668	  0.815196	  0.851723
 -1.532087	  0.834787	  0.857986
 -1.526588	  0.855684	  0.864750
 -1.524705	  0.874477	  0.870210
 -1.524776	  0.893924	  0.871292
 -1.528635	  0.913385	  0.870909
 -1.528370	  0.933990	  0.873116
 -1.519486	  0.953577	  0.871453
 -1.512103	  0.973483	  0.869444
 -1.507610	  0.992018	  0.871656
 -1.504357	  1.010825	  0.875547
 -1.498510	  1.031679	  0.875413
 -1.490311	  1.050639	  0.877494
 -1.485744	  1.068443	  0.879125
 -1.484038	  1.087717	  0.877269
 -1.480685	  1.110975	  0.880176
 -1.470433	  1.126606	  0.882654
 -1.460602	  1.143136	  0.879538
 -1.454640	  1.161440	  0.878347
 -1.447232	  1.183676	  0.884094
 -1.437786	  1.200924	  0.883294
 -1.423260	  1.217365	  0.883551
 -1.415249	  1.236090	  0.888864
 -1.411315	  1.252432	  0.888709
 -1.406798	  1.273989	  0.886360
 -1.403379	  1.294086	  0.886894
 -1.397830	  1.313923	  0.885453
 -1.392169	  1.332408	  0.885239
 -1.387041	  1.351055	  0.889066
 -1.381629	  1.372447	  0.891348
 -1.380060	  1.393166	  0.889594
 -1.384626	  1.410587	  0.883463
 -1.387565	  1.431231	  0.877706
 -1.386450	  1.450601	  0.877717
 -1.387279	  1.471123	  0.877720
 -1.394869	  1.493894	  0.877084
 -1.396713	  1.505671	  0.878721
 -1.404425	  1.525217	  0.879961
 -1.417116	  1.547722	  0.879272
 -1.426661	  1.564307	  0.877026
 -1.437050	  1.576582	  0.873088
 -1.452512	  1.593384	  0.870585
 -1.464616	  1.609848	  0.868467
 -1.477768	  1.624882	  0.859899
 -1.487857	  1.633982	  0.853452
 -1.502459	  1.648551	  0.847160
 -1.519728	  1.663370	  0.839161
 -1.535122	  1.673476	  0.837131
 -1.549576	  1.686194	  0.831716
