 -0.007050	  2.931509	  0.766229
 -0.006980	  2.902484	  0.758643
  0.008859	  2.869215	  0.733890
  0.023745	  2.830999	  0.707642
  0.037151	  2.795446	  0.672933
  0.046015	  2.753264	  0.645982
  0.063433	  2.716659	  0.618064
  0.078208	  2.677639	  0.591253
  0.088214	  2.642575	  0.557126
  0.103345	  2.602309	  0.532920
  0.116980	  2.562533	  0.508163
  0.130410	  2.520957	  0.483332
  0.147754	  2.481715	  0.454156
  0.165797	  2.444615	  0.423730
  0.183225	  2.409186	  0.392518
  0.199313	  2.374439	  0.361163
  0.213911	  2.340522	  0.329652
  0.228545	  2.306648	  0.296930
  0.246098	  2.276019	  0.262075
  0.278531	  2.265160	  0.217154
  0.346521	  2.322717	  0.155872
  0.463715	  2.388974	  0.092194
  0.620744	  2.438461	  0.040554
  0.808683	  2.429971	  0.020939
  0.943589	  2.371944	  0.008115
  1.004675	  2.318226	 -0.013987
  1.036987	  2.250182	 -0.045757
  1.029961	  2.160614	 -0.087735
  1.010121	  2.110150	 -0.111043
  1.002859	  2.096240	 -0.120503
  0.991973	  2.078589	 -0.139298
  0.954916	  2.028755	 -0.194498
  0.881721	  1.946189	 -0.263860
  0.815293	  1.856713	 -0.303694
  0.787446	  1.791056	 -0.311082
  0.781933	  1.753747	 -0.306214
  0.789308	  1.651785	 -0.267112
  0.832451	  1.517580	 -0.169101
  0.878093	  1.429998	 -0.094252
  0.862675	  1.305607	 -0.080523
  0.723442	  1.207429	 -0.149663
  0.649205	  1.086807	 -0.197819
  0.614040	  0.956550	 -0.216953
  0.607768	  0.892208	 -0.223601
  0.609096	  0.857290	 -0.233344
  0.614875	  0.822301	 -0.251983
  0.629114	  0.777198	 -0.288952
  0.651260	  0.738227	 -0.339570
  0.678907	  0.721963	 -0.410812
  0.701024	  0.767977	 -0.485192
  0.699753	  0.818284	 -0.533299
  0.703229	  0.850534	 -0.595689
  0.713931	  0.857902	 -0.669184
  0.722278	  0.846442	 -0.708141
  0.729881	  0.832071	 -0.728244
  0.742240	  0.806298	 -0.751484
  0.757663	  0.771340	 -0.781180
  0.772635	  0.735888	 -0.815248
  0.786920	  0.700765	 -0.853937
  0.799771	  0.667921	 -0.895560
  0.810721	  0.638983	 -0.936790
  0.820280	  0.612374	 -0.976991
  0.828653	  0.587064	 -1.017214
  0.835665	  0.562472	 -1.058345
  0.842970	  0.534634	 -1.101316
  0.856285	  0.499320	 -1.136963
  0.878086	  0.457838	 -1.158980
  0.894016	  0.422379	 -1.190130
  0.910453	  0.386323	 -1.223014
  0.919757	  0.357171	 -1.263045
  0.927804	  0.330103	 -1.301212
  0.935192	  0.308391	 -1.336579
  0.947501	  0.287668	 -1.374035
  0.960645	  0.277518	 -1.446738
  0.976717	  0.291338	 -1.560930
  1.016186	  0.278022	 -1.639117
  1.050075	  0.258630	 -1.689345
  1.082727	  0.234925	 -1.732893
  1.110938	  0.207616	 -1.770745
  1.137390	  0.173242	 -1.806049
  1.160824	  0.125933	 -1.836956
  1.175136	  0.056453	 -1.850144
  1.178489	 -0.039572	 -1.814598
  1.163209	 -0.145142	 -1.740450
  1.147081	 -0.222852	 -1.704083
  1.144945	 -0.275259	 -1.706806
  1.150308	 -0.319438	 -1.723301
  1.159020	 -0.360907	 -1.746678
  1.168985	 -0.401958	 -1.774620
  1.179015	 -0.442346	 -1.805960
  1.187934	 -0.479590	 -1.838459
  1.195298	 -0.515670	 -1.870947
  1.201832	 -0.553344	 -1.902017
  1.208475	 -0.594315	 -1.931434
  1.216496	 -0.636145	 -1.959131
  1.226917	 -0.677018	 -1.984650
  1.241730	 -0.716739	 -2.007660
  1.261260	 -0.756614	 -2.030210
  1.283663	 -0.797275	 -2.054331
  1.306221	 -0.836087	 -2.079932
  1.327044	 -0.871831	 -2.106305
  1.344857	 -0.908027	 -2.135549
  1.358385	 -0.947335	 -2.169441
  1.366333	 -0.985899	 -2.204510
  1.370645	 -1.021847	 -2.238496
  1.373608	 -1.058617	 -2.272605
  1.381195	 -1.093195	 -2.307602
  1.391704	 -1.125794	 -2.347516
  1.404716	 -1.165453	 -2.380860
  1.418763	 -1.177107	 -2.404668
