 -2.277367	 -0.499118	  0.927557
 -2.271793	 -0.502251	  0.914713
 -2.269611	 -0.503478	  0.909686
 -2.262564	 -0.507884	  0.892040
 -2.254856	 -0.511671	  0.871971
 -2.247086	 -0.514823	  0.853582
 -2.237794	 -0.522610	  0.839504
 -2.229371	 -0.529635	  0.822196
 -2.222058	 -0.534859	  0.804113
 -2.215011	 -0.539156	  0.785780
 -2.209482	 -0.542109	  0.766789
 -2.203971	 -0.545054	  0.747790
 -2.199858	 -0.547860	  0.728420
 -2.196546	 -0.550580	  0.708885
 -2.193325	 -0.553148	  0.689314
 -2.190401	 -0.555197	  0.669635
 -2.187480	 -0.557246	  0.649956
 -2.184969	 -0.559561	  0.630249
 -2.182582	 -0.561954	  0.610537
 -2.181692	 -0.566657	  0.591119
 -2.181607	 -0.572544	  0.572005
 -2.183777	 -0.579315	  0.553314
 -2.186798	 -0.586450	  0.535049
 -2.191419	 -0.595159	  0.518626
 -2.196997	 -0.604838	  0.500020
 -2.201164	 -0.612140	  0.482225
 -2.205302	 -0.619468	  0.464389
 -2.212129	 -0.630179	  0.449197
 -2.218294	 -0.640075	  0.432647
 -2.224350	 -0.649058	  0.416324
 -2.232752	 -0.660700	  0.401771
 -2.240703	 -0.671249	  0.386752
 -2.247825	 -0.680194	  0.370774
 -2.257672	 -0.691961	  0.357668
 -2.266698	 -0.702358	  0.343393
 -2.276143	 -0.712620	  0.328057
 -2.286636	 -0.724242	  0.315992
 -2.297801	 -0.735469	  0.305450
 -2.309156	 -0.747233	  0.290106
 -2.319482	 -0.759477	  0.279923
 -2.330599	 -0.771049	  0.267939
 -2.341596	 -0.782046	  0.257595
 -2.356911	 -0.798488	  0.239557
 -2.363118	 -0.805201	  0.231582
