  0.754389	  1.341236	 -1.920584
  0.758880	  1.346591	 -1.926157
  0.763371	  1.351946	 -1.931730
  0.753322	  1.339965	 -1.919261
  0.743272	  1.327982	 -1.906794
  0.732196	  1.315815	 -1.895424
  0.721045	  1.303636	 -1.884141
  0.709618	  1.291326	 -1.873285
  0.696973	  1.278498	 -1.864595
  0.684322	  1.265666	 -1.855917
  0.671577	  1.252561	 -1.847807
  0.659455	  1.238978	 -1.842239
  0.647732	  1.223932	 -1.837193
  0.636479	  1.208161	 -1.831424
  0.620176	  1.193002	 -1.824678
  0.607339	  1.182199	 -1.821641
  0.591278	  1.167325	 -1.817658
  0.572947	  1.154469	 -1.818320
  0.563302	  1.141821	 -1.820223
  0.548568	  1.127803	 -1.818567
  0.539660	  1.117176	 -1.806052
  0.540046	  1.112131	 -1.783149
  0.542691	  1.106592	 -1.763607
  0.542346	  1.106160	 -1.744154
  0.541898	  1.103575	 -1.725540
  0.543765	  1.097750	 -1.704378
  0.542044	  1.097094	 -1.684145
  0.538828	  1.097548	 -1.664954
  0.538583	  1.094092	 -1.645604
  0.539901	  1.088839	 -1.626011
  0.540038	  1.084861	 -1.606071
  0.539184	  1.081050	 -1.586595
  0.534675	  1.075590	 -1.568111
  0.525146	  1.068676	 -1.552745
  0.512072	  1.061582	 -1.536725
  0.501762	  1.052969	 -1.524032
  0.485333	  1.039767	 -1.517260
  0.472878	  1.033150	 -1.506593
  0.460639	  1.021989	 -1.498112
  0.443648	  1.014017	 -1.490106
  0.428593	  1.002869	 -1.483356
  0.411156	  0.995394	 -1.477189
  0.393616	  0.989636	 -1.469896
  0.377606	  0.978783	 -1.463960
  0.363118	  0.966740	 -1.457119
  0.347372	  0.956993	 -1.449764
  0.330739	  0.943500	 -1.447883
  0.318739	  0.927879	 -1.447698
  0.308962	  0.911318	 -1.444134
  0.298588	  0.892784	 -1.442840
  0.285929	  0.877526	 -1.442719
  0.272642	  0.863583	 -1.439728
  0.258894	  0.849011	 -1.437181
  0.247098	  0.831063	 -1.439773
  0.240524	  0.814664	 -1.438352
  0.229820	  0.794553	 -1.435217
  0.219380	  0.774346	 -1.437262
  0.209470	  0.757983	 -1.435823
  0.199040	  0.747073	 -1.429502
  0.184296	  0.728842	 -1.427437
  0.170215	  0.712692	 -1.429381
  0.159721	  0.699633	 -1.426330
  0.145927	  0.682262	 -1.422689
  0.136609	  0.666396	 -1.416823
  0.127526	  0.649358	 -1.412952
  0.117423	  0.631866	 -1.408970
  0.108678	  0.615185	 -1.405053
  0.097601	  0.596835	 -1.401629
  0.085764	  0.579985	 -1.397841
  0.077978	  0.564913	 -1.390195
  0.069697	  0.548461	 -1.384427
  0.059590	  0.530617	 -1.379704
  0.050039	  0.513538	 -1.375383
  0.040713	  0.496334	 -1.371375
  0.032094	  0.479036	 -1.366821
  0.022934	  0.461676	 -1.362349
  0.013351	  0.444417	 -1.358239
  0.003912	  0.427354	 -1.354688
 -0.005921	  0.410741	 -1.350630
 -0.017211	  0.393936	 -1.345173
 -0.026499	  0.377788	 -1.338976
 -0.035376	  0.361344	 -1.331812
 -0.042926	  0.344203	 -1.324881
 -0.050486	  0.326843	 -1.318665
 -0.058539	  0.309415	 -1.312320
 -0.068236	  0.293326	 -1.305769
 -0.077397	  0.277181	 -1.298869
 -0.086981	  0.261398	 -1.291800
 -0.095699	  0.244723	 -1.283864
 -0.105461	  0.229447	 -1.276642
 -0.114249	  0.213386	 -1.267938
 -0.123631	  0.197917	 -1.259965
 -0.132369	  0.181612	 -1.252670
 -0.140228	  0.165156	 -1.246012
 -0.148197	  0.146974	 -1.236472
 -0.152502	  0.131952	 -1.225625
 -0.159828	  0.118966	 -1.208678
 -0.164638	  0.104163	 -1.197861
 -0.177676	  0.088234	 -1.192037
 -0.194540	  0.074733	 -1.185363
 -0.204182	  0.061823	 -1.173111
 -0.206624	  0.047983	 -1.159124
 -0.213014	  0.029382	 -1.147580
 -0.217837	  0.012792	 -1.137570
 -0.218443	 -0.000054	 -1.122988
 -0.225043	 -0.014416	 -1.108765
 -0.238105	 -0.026421	 -1.102978
 -0.252372	 -0.043166	 -1.091922
 -0.261703	 -0.058467	 -1.083050
 -0.268547	 -0.068122	 -1.065776
 -0.272725	 -0.081463	 -1.050584
 -0.277152	 -0.094912	 -1.035457
 -0.279519	 -0.106991	 -1.019239
 -0.282672	 -0.120909	 -1.007532
 -0.285648	 -0.137353	 -0.992473
 -0.292423	 -0.146935	 -0.976423
 -0.304441	 -0.156284	 -0.963491
 -0.322411	 -0.167184	 -0.955562
 -0.336752	 -0.177653	 -0.942314
 -0.339062	 -0.190340	 -0.921887
 -0.340777	 -0.202343	 -0.908848
 -0.349851	 -0.214490	 -0.897330
 -0.363225	 -0.227405	 -0.886419
 -0.372348	 -0.239534	 -0.869791
 -0.377762	 -0.246479	 -0.854857
 -0.392036	 -0.255993	 -0.836281
 -0.406716	 -0.267853	 -0.824719
 -0.406470	 -0.277032	 -0.813092
 -0.413325	 -0.289373	 -0.797113
 -0.422529	 -0.304234	 -0.779635
 -0.428356	 -0.312185	 -0.768736
 -0.439486	 -0.325672	 -0.758608
 -0.450750	 -0.342031	 -0.739670
 -0.451825	 -0.351494	 -0.725228
 -0.453493	 -0.360042	 -0.705613
 -0.462670	 -0.367466	 -0.688792
 -0.471410	 -0.375547	 -0.673516
 -0.480877	 -0.386246	 -0.659709
 -0.487549	 -0.395958	 -0.642006
 -0.496625	 -0.407384	 -0.628104
 -0.508305	 -0.420699	 -0.618141
 -0.520106	 -0.434293	 -0.607323
 -0.529721	 -0.443280	 -0.591668
 -0.541885	 -0.451437	 -0.577308
 -0.549705	 -0.462244	 -0.564289
 -0.556899	 -0.474652	 -0.548915
 -0.566043	 -0.486575	 -0.535991
 -0.574968	 -0.498673	 -0.522204
 -0.580620	 -0.511468	 -0.506512
 -0.587563	 -0.523131	 -0.492042
 -0.602961	 -0.531039	 -0.481697
 -0.618469	 -0.539230	 -0.469600
 -0.631182	 -0.550449	 -0.455746
 -0.637570	 -0.563782	 -0.441458
 -0.643129	 -0.574247	 -0.425879
 -0.653265	 -0.583271	 -0.412896
 -0.664778	 -0.592892	 -0.398095
 -0.672212	 -0.603684	 -0.382397
 -0.680183	 -0.616822	 -0.371161
 -0.691301	 -0.627835	 -0.356872
 -0.698673	 -0.634778	 -0.339187
 -0.702997	 -0.644931	 -0.318543
 -0.709065	 -0.654514	 -0.304030
 -0.713176	 -0.667985	 -0.288385
 -0.716482	 -0.683153	 -0.277243
 -0.727692	 -0.696777	 -0.265220
 -0.735776	 -0.711942	 -0.255251
 -0.736848	 -0.725407	 -0.237977
 -0.740313	 -0.734936	 -0.220205
 -0.751285	 -0.746219	 -0.208296
 -0.758066	 -0.762335	 -0.195171
 -0.765498	 -0.778059	 -0.183868
 -0.776536	 -0.789374	 -0.172100
 -0.782663	 -0.801837	 -0.156397
 -0.781764	 -0.815190	 -0.142908
 -0.783149	 -0.831100	 -0.127016
 -0.785337	 -0.845901	 -0.112624
 -0.791469	 -0.857434	 -0.100205
 -0.795878	 -0.871664	 -0.084893
 -0.802303	 -0.884218	 -0.071122
 -0.815112	 -0.893278	 -0.055157
 -0.825590	 -0.904351	 -0.038949
 -0.823909	 -0.915996	 -0.025490
 -0.825227	 -0.931436	 -0.010810
 -0.826612	 -0.946017	  0.002963
 -0.829295	 -0.961135	  0.016332
 -0.832021	 -0.976682	  0.027944
 -0.835976	 -0.992195	  0.041828
 -0.837488	 -1.005868	  0.056596
 -0.839060	 -1.016454	  0.075464
 -0.843508	 -1.026325	  0.091230
 -0.846181	 -1.040373	  0.104638
 -0.850810	 -1.056263	  0.118322
 -0.858488	 -1.070167	  0.131467
 -0.867242	 -1.083613	  0.142667
 -0.873159	 -1.098968	  0.153734
 -0.877183	 -1.115387	  0.164837
 -0.881506	 -1.132196	  0.176860
 -0.884600	 -1.149058	  0.186605
 -0.890257	 -1.162863	  0.201462
 -0.893900	 -1.177954	  0.215371
 -0.896112	 -1.189418	  0.230983
 -0.903969	 -1.200018	  0.243713
 -0.910194	 -1.213772	  0.259071
 -0.915360	 -1.227241	  0.273551
 -0.919978	 -1.242628	  0.285444
 -0.924589	 -1.259233	  0.295664
 -0.928484	 -1.277372	  0.305402
 -0.928614	 -1.292919	  0.318048
 -0.928657	 -1.305929	  0.333488
 -0.929233	 -1.319475	  0.350098
 -0.941694	 -1.334257	  0.362304
 -0.954482	 -1.348769	  0.369332
 -0.966318	 -1.363444	  0.380362
 -0.969512	 -1.375918	  0.393651
 -0.978343	 -1.388434	  0.407027
 -0.990281	 -1.401569	  0.423517
 -0.993974	 -1.413554	  0.431272
 -1.005019	 -1.425405	  0.445036
 -1.016983	 -1.437960	  0.460581
 -1.025397	 -1.444952	  0.470508
 -1.041687	 -1.455082	  0.485584
 -1.057251	 -1.464482	  0.498182
 -1.063417	 -1.481680	  0.507513
 -1.070796	 -1.488116	  0.527181
 -1.085985	 -1.491889	  0.540787
 -1.098799	 -1.498272	  0.549751
 -1.112591	 -1.505288	  0.567128
 -1.127621	 -1.509359	  0.581081
 -1.139087	 -1.512361	  0.595012
 -1.152264	 -1.517673	  0.610306
 -1.165411	 -1.520976	  0.625570
 -1.177227	 -1.526189	  0.637094
 -1.191248	 -1.531770	  0.652248
 -1.205607	 -1.537907	  0.665584
 -1.219075	 -1.545229	  0.678828
 -1.230692	 -1.550966	  0.693981
 -1.241006	 -1.556773	  0.709707
 -1.251908	 -1.563194	  0.724958
 -1.262900	 -1.571282	  0.739863
 -1.273034	 -1.580481	  0.754390
 -1.282426	 -1.591144	  0.768405
 -1.291282	 -1.601814	  0.782828
 -1.300623	 -1.612554	  0.796875
 -1.309101	 -1.623892	  0.810971
 -1.317574	 -1.635541	  0.824811
 -1.326696	 -1.647247	  0.838224
 -1.335289	 -1.659225	  0.852005
 -1.342484	 -1.671002	  0.866203
 -1.350050	 -1.682875	  0.880530
 -1.358270	 -1.694951	  0.894219
 -1.366101	 -1.707004	  0.908110
 -1.373964	 -1.719080	  0.922004
 -1.382161	 -1.731331	  0.935502
 -1.389937	 -1.743590	  0.949287
 -1.397666	 -1.756037	  0.962900
 -1.405617	 -1.768598	  0.976290
 -1.413351	 -1.781301	  0.989667
 -1.421207	 -1.794132	  1.002850
 -1.421646	 -1.794891	  1.003638
 -1.428668	 -1.807014	  1.016225
