  2.620102	  0.992078	 -1.154014
  2.594160	  0.982255	 -1.142589
  2.562670	  0.948408	 -1.139718
  2.536385	  0.911122	 -1.153086
  2.502173	  0.877097	 -1.159909
  2.469564	  0.841195	 -1.172972
  2.440012	  0.800321	 -1.181543
  2.408651	  0.760621	 -1.187805
  2.377577	  0.721995	 -1.194318
  2.347098	  0.683798	 -1.201384
  2.316933	  0.645619	 -1.208345
  2.286603	  0.606952	 -1.214129
  2.256254	  0.567372	 -1.217850
  2.226795	  0.526692	 -1.217910
  2.196448	  0.486933	 -1.216106
  2.163249	  0.448772	 -1.214931
  2.126728	  0.412369	 -1.212822
  2.090479	  0.374657	 -1.215789
  2.059319	  0.335164	 -1.224787
  2.033683	  0.293482	 -1.234787
  2.007604	  0.253341	 -1.245280
  1.981682	  0.213588	 -1.253790
  1.956091	  0.172563	 -1.264032
  1.929875	  0.130817	 -1.276581
  1.900873	  0.089584	 -1.290641
  1.868612	  0.051674	 -1.307582
  1.833524	  0.017553	 -1.325563
  1.796790	 -0.014557	 -1.341797
  1.760016	 -0.047702	 -1.354351
  1.724970	 -0.083431	 -1.363318
  1.690896	 -0.120927	 -1.369707
  1.657749	 -0.158812	 -1.373909
  1.625001	 -0.196715	 -1.375678
  1.592139	 -0.234721	 -1.376577
  1.558016	 -0.272506	 -1.378186
  1.523275	 -0.309346	 -1.380375
  1.491152	 -0.347173	 -1.384975
  1.467282	 -0.390106	 -1.395913
  1.469005	 -0.451091	 -1.421064
  1.510507	 -0.519287	 -1.473262
  1.514330	 -0.596219	 -1.517812
  1.491941	 -0.641538	 -1.535028
  1.471073	 -0.657416	 -1.537605
  1.433678	 -0.667689	 -1.532786
  1.357811	 -0.673631	 -1.514261
  1.262969	 -0.683977	 -1.484868
  1.184210	 -0.712455	 -1.460489
  1.132631	 -0.749505	 -1.452509
  1.097251	 -0.789241	 -1.453333
  1.068553	 -0.830727	 -1.459682
  1.042631	 -0.872676	 -1.470525
  1.016724	 -0.914289	 -1.484803
  0.988658	 -0.955031	 -1.500824
  0.958164	 -0.993845	 -1.516896
  0.924855	 -1.030110	 -1.532583
  0.888946	 -1.063555	 -1.547456
  0.851532	 -1.095051	 -1.561128
  0.812824	 -1.124876	 -1.572776
  0.772123	 -1.154765	 -1.581984
  0.731509	 -1.185024	 -1.588545
  0.692338	 -1.214503	 -1.592821
  0.652986	 -1.243403	 -1.596080
  0.613017	 -1.273171	 -1.600189
  0.575850	 -1.308646	 -1.603970
  0.544782	 -1.350402	 -1.608628
  0.515946	 -1.394657	 -1.613437
  0.487387	 -1.438908	 -1.617760
  0.460563	 -1.482701	 -1.620417
  0.434544	 -1.524661	 -1.623797
  0.408258	 -1.564833	 -1.628098
  0.380652	 -1.604287	 -1.633343
  0.351370	 -1.644024	 -1.639179
  0.321252	 -1.683995	 -1.644087
  0.289279	 -1.722276	 -1.644316
  0.254184	 -1.759489	 -1.644281
  0.218439	 -1.795404	 -1.649378
  0.190565	 -1.834347	 -1.664429
  0.153230	 -1.867389	 -1.662753
  0.126313	 -1.908476	 -1.674074
  0.093991	 -1.947887	 -1.677442
  0.062519	 -1.985537	 -1.692171
  0.026745	 -2.021505	 -1.691001
 -0.003390	 -2.061184	 -1.699883
 -0.037266	 -2.097248	 -1.712569
 -0.070080	 -2.136779	 -1.712884
 -0.098572	 -2.177188	 -1.725802
 -0.133251	 -2.213731	 -1.731959
 -0.168682	 -2.249097	 -1.738019
 -0.199001	 -2.288262	 -1.745178
 -0.229777	 -2.327222	 -1.752919
 -0.263006	 -2.365527	 -1.761860
 -0.298713	 -2.403710	 -1.770014
 -0.301700	 -2.427747	 -1.787714
