 -1.551321	  0.120967	  1.906903
 -1.561130	  0.120965	  1.914265
 -1.570939	  0.120963	  1.921627
 -1.556103	  0.122036	  1.908111
 -1.540732	  0.121567	  1.894885
 -1.525259	  0.120805	  1.882007
 -1.510531	  0.121216	  1.869753
 -1.495577	  0.123487	  1.856530
 -1.480494	  0.125603	  1.843047
 -1.465712	  0.126204	  1.829210
 -1.451717	  0.126017	  1.815442
 -1.438376	  0.127070	  1.801400
 -1.424525	  0.129996	  1.786684
 -1.409725	  0.133023	  1.773063
 -1.394461	  0.134037	  1.759827
 -1.379364	  0.133595	  1.746541
 -1.364245	  0.131782	  1.733755
 -1.348070	  0.126893	  1.722725
 -1.331698	  0.121038	  1.712754
 -1.316827	  0.115185	  1.703755
 -1.299895	  0.103271	  1.698814
 -1.280481	  0.091867	  1.691692
 -1.265186	  0.086812	  1.680655
 -1.254550	  0.090212	  1.662575
 -1.238404	  0.091482	  1.640564
 -1.219269	  0.079381	  1.630984
 -1.209116	  0.070420	  1.628365
 -1.190509	  0.052358	  1.625884
 -1.171890	  0.041383	  1.614732
 -1.161680	  0.035717	  1.602233
 -1.146921	  0.025498	  1.579170
 -1.131271	  0.024599	  1.559573
 -1.118818	  0.031233	  1.546915
 -1.102795	  0.046642	  1.537229
 -1.082875	  0.056755	  1.517498
 -1.072823	  0.055047	  1.500593
 -1.067856	  0.050250	  1.486755
 -1.054979	  0.040973	  1.471432
 -1.036759	  0.037548	  1.457866
 -1.020434	  0.036245	  1.440104
 -1.002455	  0.039874	  1.422750
 -0.988961	  0.044909	  1.413125
 -0.977933	  0.050471	  1.405867
 -0.960653	  0.056408	  1.393185
 -0.945242	  0.063439	  1.378316
 -0.936109	  0.070551	  1.364011
 -0.926076	  0.077344	  1.347590
 -0.908027	  0.084941	  1.333299
 -0.883296	  0.089963	  1.320462
 -0.874617	  0.090012	  1.313964
 -0.861329	  0.088618	  1.304408
 -0.843895	  0.088297	  1.289321
 -0.822667	  0.090437	  1.270046
 -0.812267	  0.091792	  1.263253
 -0.796348	  0.093715	  1.250727
 -0.781686	  0.095444	  1.240155
 -0.767574	  0.095997	  1.224548
 -0.747972	  0.100167	  1.205931
 -0.739676	  0.104957	  1.199762
 -0.721189	  0.112788	  1.189835
 -0.699486	  0.121056	  1.175908
 -0.686396	  0.122514	  1.164834
 -0.673659	  0.126003	  1.153953
 -0.656459	  0.129659	  1.136021
 -0.645027	  0.128228	  1.120515
 -0.633087	  0.126396	  1.103271
 -0.620643	  0.120765	  1.086819
 -0.606199	  0.106993	  1.066055
 -0.597628	  0.097606	  1.051884
 -0.592533	  0.094619	  1.041380
 -0.580568	  0.093621	  1.025986
 -0.562530	  0.098717	  1.013928
 -0.538707	  0.104022	  0.997286
 -0.519496	  0.099638	  0.981147
 -0.509144	  0.095251	  0.971808
 -0.498439	  0.091663	  0.963337
 -0.481196	  0.083859	  0.947934
 -0.467828	  0.078642	  0.930296
 -0.456694	  0.074659	  0.917193
 -0.443571	  0.070887	  0.906141
 -0.425974	  0.064032	  0.891547
 -0.406586	  0.058074	  0.880540
 -0.391779	  0.053493	  0.873905
 -0.376254	  0.043538	  0.863832
 -0.362071	  0.033968	  0.852125
 -0.346742	  0.027897	  0.840201
 -0.330740	  0.023874	  0.829372
 -0.314299	  0.020868	  0.818110
 -0.297968	  0.020543	  0.806520
 -0.281757	  0.020269	  0.794811
 -0.265944	  0.019962	  0.783171
 -0.250600	  0.016053	  0.774548
 -0.232805	  0.014384	  0.759045
 -0.216130	  0.019240	  0.743706
 -0.202414	  0.022077	  0.734912
 -0.184114	  0.023582	  0.727902
 -0.161632	  0.025119	  0.715272
 -0.148960	  0.026343	  0.701966
 -0.139137	  0.027684	  0.687354
 -0.125529	  0.027007	  0.670209
 -0.110844	  0.025033	  0.659435
 -0.091670	  0.024185	  0.650612
 -0.070208	  0.024150	  0.635585
 -0.058967	  0.023400	  0.623202
 -0.049562	  0.023919	  0.608331
 -0.034369	  0.023513	  0.592067
 -0.016810	  0.023874	  0.577616
 -0.005221	  0.022053	  0.566258
  0.005971	  0.015605	  0.549339
  0.016714	  0.006504	  0.533469
  0.032925	  0.001951	  0.520550
  0.048861	 -0.000432	  0.508613
  0.063538	 -0.002443	  0.495161
  0.078211	 -0.004078	  0.481654
  0.092158	 -0.003612	  0.470309
  0.107620	 -0.000551	  0.457785
  0.126223	 -0.006517	  0.442455
  0.142922	 -0.016569	  0.430596
  0.157801	 -0.023869	  0.418866
  0.170136	 -0.026286	  0.406920
  0.184860	 -0.023035	  0.393626
  0.200808	 -0.022512	  0.383669
  0.224888	 -0.024637	  0.372474
  0.241380	 -0.026906	  0.362358
  0.251951	 -0.028862	  0.353639
  0.267899	 -0.030817	  0.341477
  0.289610	 -0.031175	  0.330426
  0.308328	 -0.028971	  0.318432
  0.322740	 -0.025138	  0.305657
  0.335350	 -0.021275	  0.289365
  0.347196	 -0.018823	  0.275169
  0.361938	 -0.019574	  0.263651
  0.384633	 -0.021007	  0.250708
  0.401283	 -0.018376	  0.236181
  0.413137	 -0.014355	  0.221291
  0.420886	 -0.011154	  0.210639
  0.430246	 -0.006609	  0.192301
  0.440330	 -0.002848	  0.169871
  0.452302	  0.004195	  0.151310
  0.467440	  0.012842	  0.142224
  0.484684	  0.017571	  0.137035
  0.503789	  0.019336	  0.124929
  0.519027	  0.020671	  0.110808
  0.533883	  0.021037	  0.097692
  0.548808	  0.021931	  0.084277
  0.564402	  0.022897	  0.071684
  0.580682	  0.023756	  0.059901
  0.597155	  0.024265	  0.048145
  0.614251	  0.023878	  0.037139
  0.631800	  0.022503	  0.027152
  0.649503	  0.020614	  0.018336
  0.667357	  0.019586	  0.009559
  0.684903	  0.019519	 -0.000099
  0.702154	  0.018359	 -0.010327
  0.719097	  0.015953	 -0.020660
  0.736008	  0.012754	 -0.030509
  0.752886	  0.010803	 -0.041131
  0.770103	  0.008691	 -0.050972
  0.786995	  0.007425	 -0.061261
  0.802464	  0.008190	 -0.073653
  0.816688	  0.010323	 -0.087493
  0.830870	  0.009839	 -0.101330
  0.846288	  0.009747	 -0.114330
  0.862093	  0.010414	 -0.126257
  0.878212	  0.011448	 -0.138487
  0.893698	  0.010613	 -0.151468
  0.908549	  0.009147	 -0.164686
  0.923950	  0.009106	 -0.177395
  0.940284	  0.009885	 -0.189260
  0.956415	  0.009775	 -0.201335
  0.972313	  0.008591	 -0.213580
  0.988023	  0.006539	 -0.225905
  1.003513	  0.004118	 -0.238439
  1.018595	  0.001299	 -0.251491
  1.033569	 -0.001181	 -0.264647
  1.048153	 -0.004249	 -0.278396
  1.062203	 -0.008428	 -0.292340
  1.074930	 -0.014214	 -0.305438
  1.087291	 -0.015075	 -0.317760
  1.101362	 -0.014946	 -0.341267
  1.114332	 -0.025855	 -0.361009
  1.127559	 -0.041696	 -0.369376
  1.139524	 -0.056715	 -0.370272
  1.157685	 -0.073600	 -0.370971
  1.169340	 -0.088198	 -0.379832
  1.172659	 -0.102832	 -0.393279
  1.173132	 -0.118744	 -0.415542
  1.180375	 -0.135159	 -0.433349
  1.187476	 -0.145184	 -0.441217
  1.196045	 -0.154755	 -0.448073
  1.196602	 -0.170434	 -0.456318
  1.184553	 -0.189229	 -0.475581
  1.183193	 -0.203792	 -0.491529
  1.180777	 -0.218392	 -0.507363
  1.173020	 -0.233198	 -0.521450
  1.167805	 -0.247433	 -0.534807
  1.167369	 -0.261067	 -0.542782
  1.165094	 -0.272427	 -0.558365
  1.161886	 -0.283245	 -0.580276
  1.167272	 -0.297501	 -0.608681
  1.166126	 -0.307265	 -0.628049
  1.153790	 -0.311846	 -0.643185
  1.137632	 -0.312188	 -0.649031
  1.119725	 -0.321604	 -0.658213
  1.111683	 -0.331759	 -0.676031
  1.103851	 -0.339819	 -0.692870
  1.095666	 -0.347117	 -0.709768
  1.088430	 -0.352581	 -0.726974
  1.093770	 -0.364644	 -0.740155
  1.101681	 -0.380058	 -0.750429
  1.109520	 -0.395515	 -0.760410
  1.117116	 -0.411124	 -0.770351
  1.124833	 -0.426669	 -0.780296
  1.133207	 -0.441157	 -0.790420
  1.141298	 -0.451010	 -0.802104
  1.155987	 -0.461554	 -0.813828
  1.179221	 -0.467210	 -0.828071
  1.189464	 -0.471348	 -0.836843
  1.201684	 -0.471028	 -0.848602
  1.217357	 -0.470969	 -0.862936
  1.228540	 -0.470534	 -0.874944
  1.241220	 -0.467349	 -0.888529
  1.258597	 -0.462064	 -0.903170
  1.272196	 -0.456020	 -0.912247
  1.284857	 -0.450642	 -0.922329
  1.301784	 -0.441620	 -0.937489
  1.321314	 -0.432391	 -0.946880
  1.334784	 -0.427229	 -0.949147
  1.355415	 -0.418823	 -0.949346
  1.373137	 -0.410509	 -0.952788
  1.393812	 -0.404737	 -0.960049
  1.408698	 -0.400616	 -0.966253
  1.427787	 -0.388912	 -0.970238
  1.442553	 -0.376153	 -0.963772
  1.458029	 -0.366690	 -0.952432
  1.473008	 -0.359368	 -0.941119
  1.489296	 -0.354450	 -0.930253
  1.504099	 -0.348825	 -0.917600
  1.518232	 -0.341275	 -0.905137
  1.531984	 -0.331777	 -0.894598
  1.546390	 -0.321907	 -0.885349
  1.561260	 -0.311615	 -0.876642
  1.575366	 -0.303797	 -0.865265
  1.587966	 -0.296606	 -0.855647
  1.602911	 -0.285203	 -0.847794
  1.623938	 -0.272582	 -0.833867
  1.639815	 -0.266848	 -0.829280
  1.659243	 -0.258610	 -0.826244
  1.676983	 -0.242223	 -0.824776
  1.687918	 -0.226193	 -0.823859
  1.696690	 -0.213567	 -0.822861
  1.709094	 -0.198088	 -0.822164
  1.722627	 -0.180756	 -0.821093
  1.733590	 -0.167546	 -0.821884
  1.746712	 -0.153816	 -0.824730
  1.759840	 -0.140038	 -0.827426
  1.770955	 -0.129355	 -0.836096
  1.781583	 -0.122267	 -0.846138
  1.795136	 -0.117587	 -0.858085
  1.812257	 -0.114609	 -0.871778
  1.826749	 -0.113827	 -0.884580
  1.841053	 -0.113984	 -0.900060
  1.850727	 -0.110613	 -0.911529
  1.861774	 -0.103546	 -0.924103
  1.876574	 -0.097859	 -0.943451
  1.886541	 -0.094458	 -0.957209
  1.899696	 -0.089506	 -0.973222
  1.911464	 -0.090342	 -0.989514
  1.920898	 -0.097059	 -1.003710
  1.934384	 -0.105480	 -1.024752
  1.946944	 -0.104889	 -1.039910
  1.961267	 -0.097558	 -1.054311
  1.976857	 -0.089090	 -1.066953
  1.990608	 -0.093188	 -1.084410
  1.999800	 -0.105066	 -1.100277
  2.009089	 -0.118043	 -1.111471
  2.023463	 -0.124878	 -1.126194
  2.037075	 -0.130247	 -1.140029
  2.051222	 -0.135427	 -1.153200
  2.065776	 -0.140626	 -1.165894
  2.080371	 -0.145778	 -1.178558
  2.095791	 -0.149751	 -1.190655
  2.111286	 -0.153613	 -1.202699
  2.126816	 -0.157482	 -1.214770
  2.142848	 -0.161460	 -1.227310
  2.159795	 -0.165391	 -1.241751
  2.174105	 -0.168381	 -1.255400
  2.188415	 -0.171371	 -1.269049
