 -2.506399	 -0.242090	 -1.685306
 -2.481583	 -0.239693	 -1.668620
 -2.450224	 -0.253786	 -1.629405
 -2.418928	 -0.276524	 -1.598263
 -2.386361	 -0.295563	 -1.564590
 -2.352131	 -0.317357	 -1.529383
 -2.322928	 -0.337153	 -1.497348
 -2.292287	 -0.357916	 -1.462852
 -2.262979	 -0.379996	 -1.429403
 -2.235274	 -0.402083	 -1.397935
 -2.206733	 -0.425220	 -1.365019
 -2.176530	 -0.449676	 -1.327665
 -2.150101	 -0.471598	 -1.291760
 -2.123550	 -0.493901	 -1.255729
 -2.096126	 -0.515878	 -1.220786
 -2.069343	 -0.537093	 -1.188422
 -2.037935	 -0.561365	 -1.152439
 -2.007507	 -0.583283	 -1.119082
 -1.976993	 -0.603697	 -1.086822
 -1.945555	 -0.622827	 -1.054516
 -1.913393	 -0.640849	 -1.021812
 -1.881668	 -0.658725	 -0.989209
 -1.851184	 -0.677030	 -0.957529
 -1.820175	 -0.697452	 -0.926119
 -1.787227	 -0.719048	 -0.892650
 -1.756597	 -0.737014	 -0.858960
 -1.725376	 -0.754620	 -0.823166
 -1.694098	 -0.773770	 -0.784848
 -1.666273	 -0.792307	 -0.748508
 -1.640078	 -0.811887	 -0.712408
 -1.614435	 -0.835850	 -0.675460
 -1.593499	 -0.868727	 -0.647811
 -1.575593	 -0.924270	 -0.643200
 -1.548131	 -1.094088	 -0.719569
 -1.486278	 -1.281466	 -0.790185
 -1.447155	 -1.320470	 -0.771134
 -1.433891	 -1.301203	 -0.728467
 -1.417097	 -1.193076	 -0.569709
 -1.379781	 -1.077778	 -0.420999
 -1.356051	 -1.054880	 -0.375619
 -1.328484	 -1.060892	 -0.339509
 -1.297652	 -1.082225	 -0.305026
 -1.267810	 -1.107313	 -0.269403
 -1.243485	 -1.128931	 -0.236620
 -1.215299	 -1.152131	 -0.197439
 -1.187888	 -1.172213	 -0.161566
 -1.159360	 -1.191448	 -0.129183
 -1.127648	 -1.211395	 -0.100944
 -1.095234	 -1.233671	 -0.073000
 -1.069183	 -1.257665	 -0.036055
 -1.069236	 -1.270078	  0.005601
 -1.108270	 -1.256392	  0.080736
 -1.208484	 -1.158850	  0.277520
 -1.251424	 -1.058600	  0.441709
 -1.253389	 -1.070004	  0.479248
 -1.239210	 -1.135922	  0.499347
 -1.209458	 -1.314466	  0.538939
 -1.181626	 -1.403368	  0.562669
 -1.153114	 -1.459137	  0.576816
 -1.119396	 -1.502450	  0.590705
 -1.070917	 -1.540244	  0.603707
 -1.015441	 -1.559071	  0.598088
 -0.948101	 -1.564594	  0.568643
 -0.787213	 -1.573945	  0.506155
 -0.674430	 -1.598888	  0.507637
 -0.621175	 -1.615988	  0.526057
 -0.578990	 -1.631370	  0.548725
 -0.539769	 -1.646209	  0.575266
 -0.501389	 -1.661194	  0.604816
 -0.464543	 -1.676272	  0.637810
 -0.428666	 -1.691113	  0.671946
 -0.396018	 -1.704499	  0.704459
 -0.361917	 -1.719087	  0.740356
 -0.329804	 -1.734425	  0.778048
 -0.301261	 -1.750067	  0.814765
 -0.274935	 -1.765744	  0.852462
 -0.249057	 -1.782585	  0.894609
 -0.226491	 -1.800881	  0.934361
 -0.205340	 -1.821555	  0.973216
 -0.182998	 -1.846541	  1.013897
 -0.160361	 -1.873349	  1.050959
 -0.136565	 -1.900018	  1.084999
 -0.108267	 -1.928570	  1.120417
 -0.079815	 -1.955370	  1.152578
 -0.051586	 -1.980167	  1.182951
 -0.022219	 -2.003940	  1.213921
  0.009618	 -2.027129	  1.246785
  0.041039	 -2.047619	  1.278028
  0.071077	 -2.066440	  1.308093
  0.100825	 -2.084965	  1.340069
  0.130673	 -2.103822	  1.373862
  0.159167	 -2.123838	  1.408456
  0.188346	 -2.146618	  1.446000
  0.217231	 -2.168946	  1.481919
  0.245012	 -2.194657	  1.516057
  0.273485	 -2.214797	  1.550131
  0.299635	 -2.241326	  1.582807
  0.330546	 -2.263337	  1.617686
  0.364266	 -2.282671	  1.649836
  0.396118	 -2.301327	  1.682601
  0.423950	 -2.319417	  1.715186
  0.459127	 -2.343951	  1.748866
  0.481397	 -2.369231	  1.776233
  0.486211	 -2.392923	  1.793995
