  1.411656	 -1.673300	  1.123903
  1.412126	 -1.692885	  1.114353
  1.412596	 -1.712470	  1.104803
  1.412164	 -1.694498	  1.113567
  1.411599	 -1.676419	  1.122102
  1.410922	 -1.658256	  1.130448
  1.410244	 -1.640094	  1.138795
  1.407733	 -1.622304	  1.147581
  1.404979	 -1.604576	  1.156421
  1.401925	 -1.586904	  1.165272
  1.397674	 -1.569497	  1.174154
  1.393422	 -1.552071	  1.183003
  1.388202	 -1.534832	  1.191700
  1.382564	 -1.517603	  1.200021
  1.377407	 -1.499794	  1.207572
  1.371348	 -1.482104	  1.214803
  1.367491	 -1.467084	  1.224965
  1.363870	 -1.454093	  1.241567
  1.352740	 -1.438087	  1.253522
  1.341481	 -1.415238	  1.259927
  1.337098	 -1.400939	  1.260749
  1.331895	 -1.379339	  1.261431
  1.327940	 -1.359315	  1.268407
  1.324363	 -1.344904	  1.277459
  1.318311	 -1.327774	  1.291250
  1.314013	 -1.309220	  1.299562
  1.311353	 -1.292504	  1.302942
  1.308301	 -1.270454	  1.305104
  1.304114	 -1.249038	  1.312756
  1.300239	 -1.235040	  1.322756
  1.295440	 -1.219862	  1.337120
  1.291572	 -1.203013	  1.348663
  1.287494	 -1.188826	  1.357924
  1.281949	 -1.174724	  1.368566
  1.273211	 -1.149105	  1.383912
  1.270869	 -1.137383	  1.387660
  1.266592	 -1.120505	  1.392633
  1.260940	 -1.099805	  1.402093
  1.255028	 -1.084751	  1.412653
  1.247667	 -1.071969	  1.425109
  1.237372	 -1.053479	  1.436350
  1.229854	 -1.034831	  1.443458
  1.226284	 -1.023395	  1.445801
  1.225108	 -1.001489	  1.450296
  1.218355	 -0.981629	  1.458530
  1.209381	 -0.964944	  1.467680
  1.201692	 -0.947944	  1.477916
  1.195206	 -0.932355	  1.488368
  1.190494	 -0.916709	  1.502485
  1.193985	 -0.902020	  1.524213
  1.206702	 -0.881588	  1.543867
  1.212082	 -0.869743	  1.549281
  1.217319	 -0.852002	  1.555705
  1.217677	 -0.838483	  1.563568
  1.211764	 -0.819178	  1.575190
  1.210654	 -0.802392	  1.591184
  1.210451	 -0.789247	  1.606875
  1.208082	 -0.779034	  1.622559
  1.204046	 -0.770110	  1.641613
  1.200403	 -0.757790	  1.660534
  1.198352	 -0.743535	  1.672784
  1.198886	 -0.723828	  1.681092
  1.206036	 -0.701068	  1.684348
  1.210094	 -0.679895	  1.692298
  1.212571	 -0.662302	  1.705536
  1.210854	 -0.648025	  1.716421
  1.201403	 -0.633626	  1.723490
  1.187033	 -0.616313	  1.728287
  1.182661	 -0.597743	  1.731864
  1.186519	 -0.571162	  1.740174
  1.190413	 -0.552184	  1.752291
  1.192263	 -0.541621	  1.765094
  1.188287	 -0.528886	  1.777310
  1.179032	 -0.510858	  1.787223
  1.174067	 -0.493056	  1.795356
  1.170826	 -0.480465	  1.810454
  1.169168	 -0.466294	  1.829612
  1.169102	 -0.445372	  1.842568
  1.168126	 -0.428869	  1.848359
  1.165591	 -0.412107	  1.856758
  1.163756	 -0.390218	  1.868110
  1.162676	 -0.373198	  1.873802
  1.160342	 -0.360870	  1.880834
  1.154825	 -0.340935	  1.889033
  1.151814	 -0.317946	  1.897237
  1.150751	 -0.295372	  1.903567
  1.151513	 -0.276335	  1.907420
  1.151792	 -0.251678	  1.908936
  1.152846	 -0.241169	  1.911819
  1.149026	 -0.221531	  1.922446
  1.145739	 -0.204418	  1.937471
  1.136838	 -0.186880	  1.944774
  1.125358	 -0.170449	  1.947040
  1.117372	 -0.151424	  1.953579
  1.110699	 -0.133565	  1.959889
  1.104115	 -0.115374	  1.965245
  1.098765	 -0.097056	  1.971399
  1.093431	 -0.079022	  1.978210
  1.087708	 -0.061415	  1.985775
  1.081988	 -0.043811	  1.993350
  1.076503	 -0.026381	  2.001479
  1.071090	 -0.009006	  2.009769
  1.065450	  0.008009	  2.018493
  1.060181	  0.023525	  2.030014
  1.055081	  0.039235	  2.041362
  1.050701	  0.055581	  2.051998
  1.046533	  0.071547	  2.063145
  1.041869	  0.086639	  2.075633
  1.037362	  0.102710	  2.087116
  1.032666	  0.119425	  2.097574
  1.026479	  0.137062	  2.105594
  1.020533	  0.155396	  2.110789
  1.014881	  0.174126	  2.115754
  1.009990	  0.193038	  2.120536
  1.005062	  0.211616	  2.126111
  1.001802	  0.230214	  2.132703
  0.998590	  0.248811	  2.139323
  0.997492	  0.267625	  2.146016
  0.997343	  0.286419	  2.152837
  0.997299	  0.305056	  2.160100
  0.996100	  0.323410	  2.168039
  0.994600	  0.341945	  2.175520
  0.992334	  0.360659	  2.182145
  0.989829	  0.379287	  2.188954
  0.987633	  0.397756	  2.196363
  0.984924	  0.415333	  2.205512
  0.982074	  0.432669	  2.215074
  0.979220	  0.450048	  2.224660
  0.976266	  0.467467	  2.234532
  0.972465	  0.482849	  2.246736
  0.968664	  0.498231	  2.258940
