 -1.015977	  2.285634	  0.420858
 -1.024268	  2.310567	  0.397286
 -1.019591	  2.296407	  0.410611
 -1.016010	  2.280496	  0.422165
 -1.014065	  2.262623	  0.430911
 -1.012091	  2.244730	  0.439614
 -1.007575	  2.227608	  0.448898
 -1.001349	  2.211216	  0.458510
 -0.996629	  2.194712	  0.468768
 -0.993421	  2.178216	  0.479594
 -0.989271	  2.162512	  0.490789
 -0.982707	  2.146981	  0.501291
 -0.975959	  2.129328	  0.509625
 -0.972535	  2.109777	  0.520841
 -0.975848	  2.094726	  0.534771
 -0.979273	  2.083905	  0.547891
 -0.979936	  2.071984	  0.570630
 -0.977132	  2.057599	  0.589891
 -0.975679	  2.047485	  0.600510
 -0.977530	  2.037493	  0.615236
 -0.978893	  2.033017	  0.637673
 -0.971189	  2.029277	  0.665965
 -0.969139	  2.026016	  0.681353
 -0.971611	  2.016708	  0.700525
 -0.978299	  1.997652	  0.717984
 -0.975678	  1.981362	  0.728795
 -0.966322	  1.964815	  0.740708
 -0.957740	  1.954584	  0.752033
 -0.955162	  1.940552	  0.768847
 -0.955162	  1.925816	  0.782922
 -0.955352	  1.911401	  0.796805
 -0.956415	  1.896663	  0.810283
 -0.957373	  1.881976	  0.823851
 -0.957244	  1.867860	  0.838015
 -0.956992	  1.854007	  0.852444
 -0.956456	  1.840087	  0.866800
 -0.954823	  1.825889	  0.880804
 -0.953474	  1.811528	  0.894622
 -0.952334	  1.796442	  0.908004
 -0.950860	  1.781951	  0.920571
 -0.952595	  1.765704	  0.933762
 -0.951053	  1.745687	  0.946732
 -0.945283	  1.729447	  0.957754
 -0.934782	  1.720081	  0.967545
 -0.931705	  1.705529	  0.983051
 -0.932096	  1.690304	  0.997366
 -0.932187	  1.680624	  1.009467
 -0.937322	  1.672285	  1.026760
 -0.937868	  1.662942	  1.039520
 -0.936152	  1.658017	  1.050694
 -0.932768	  1.656621	  1.066702
 -0.937457	  1.658151	  1.088624
 -0.938831	  1.655231	  1.109813
 -0.936279	  1.653606	  1.128655
 -0.937774	  1.653890	  1.149199
 -0.944873	  1.651574	  1.168054
 -0.952798	  1.649136	  1.186322
 -0.960712	  1.646708	  1.204529
 -0.968625	  1.644280	  1.222734
 -0.976706	  1.641927	  1.240796
 -0.992900	  1.642495	  1.251748
 -1.012472	  1.642423	  1.259765
 -1.030372	  1.642411	  1.270947
 -1.043274	  1.643905	  1.285893
 -1.056333	  1.646711	  1.298231
 -1.078497	  1.646604	  1.304744
 -1.099189	  1.644985	  1.315890
 -1.110572	  1.645066	  1.332688
 -1.118911	  1.647797	  1.350606
 -1.130523	  1.648932	  1.366689
 -1.146215	  1.647955	  1.380505
 -1.161388	  1.646920	  1.393537
 -1.176541	  1.645885	  1.406549
 -1.191693	  1.644851	  1.419562
 -1.206846	  1.643816	  1.432575
 -1.221998	  1.642782	  1.445587
 -1.237151	  1.641747	  1.458600
 -1.252303	  1.640713	  1.471613
 -1.267458	  1.639678	  1.484627
 -1.282681	  1.638636	  1.497702
 -1.298250	  1.637507	  1.511131
 -1.313090	  1.635856	  1.524436
