 -0.680332	  0.649905	 -2.190834
 -0.664627	  0.655505	 -2.219884
 -0.648922	  0.661105	 -2.248934
 -0.664687	  0.663234	 -2.234349
 -0.671819	  0.657646	 -2.216768
 -0.680951	  0.652659	 -2.200672
 -0.694003	  0.648417	 -2.183584
 -0.705682	  0.646124	 -2.167835
 -0.716503	  0.649521	 -2.150482
 -0.729290	  0.652780	 -2.136589
 -0.745115	  0.650752	 -2.119602
 -0.755153	  0.646112	 -2.105426
 -0.767304	  0.642333	 -2.090169
 -0.784425	  0.639166	 -2.075159
 -0.795107	  0.639035	 -2.062599
 -0.807347	  0.638014	 -2.045160
 -0.819795	  0.635110	 -2.026574
 -0.832515	  0.634879	 -2.012447
 -0.844405	  0.637935	 -1.999427
 -0.859171	  0.638343	 -1.983548
 -0.871197	  0.636498	 -1.967830
 -0.881585	  0.635572	 -1.951047
 -0.893952	  0.634761	 -1.934664
 -0.910174	  0.630350	 -1.921577
 -0.923628	  0.627067	 -1.906866
 -0.935337	  0.627996	 -1.891132
 -0.946942	  0.628253	 -1.873831
 -0.956256	  0.628946	 -1.855188
 -0.966114	  0.631563	 -1.837754
 -0.976110	  0.633907	 -1.822830
 -0.987473	  0.633118	 -1.805710
 -0.999657	  0.632054	 -1.790946
 -1.015394	  0.638366	 -1.771209
 -1.025018	  0.645945	 -1.756091
 -1.029960	  0.648211	 -1.739230
 -1.039534	  0.643860	 -1.721138
 -1.050710	  0.644754	 -1.703571
 -1.057534	  0.644837	 -1.683395
 -1.061395	  0.651047	 -1.665681
 -1.070636	  0.655372	 -1.647007
 -1.080786	  0.655840	 -1.629125
 -1.090697	  0.659703	 -1.611215
 -1.093389	  0.658059	 -1.589538
 -1.098033	  0.652931	 -1.571832
 -1.100239	  0.647031	 -1.551499
 -1.099867	  0.638219	 -1.532946
 -1.099116	  0.629533	 -1.513871
 -1.094802	  0.619091	 -1.497841
 -1.088283	  0.609449	 -1.481165
 -1.079413	  0.599112	 -1.462452
 -1.074350	  0.591178	 -1.446479
 -1.073713	  0.580434	 -1.430240
 -1.068010	  0.567731	 -1.412820
 -1.055691	  0.556344	 -1.399500
 -1.040271	  0.543973	 -1.393356
 -1.024033	  0.530589	 -1.384272
 -1.012130	  0.517179	 -1.370371
 -1.005280	  0.507569	 -1.357095
 -0.998955	  0.498165	 -1.341628
 -0.992173	  0.489732	 -1.322726
 -0.986602	  0.481297	 -1.304856
 -0.974968	  0.478204	 -1.284486
 -0.963969	  0.473998	 -1.267786
 -0.954104	  0.467568	 -1.254023
 -0.944325	  0.455633	 -1.239833
 -0.933692	  0.438249	 -1.228768
 -0.918381	  0.429678	 -1.218904
 -0.906360	  0.427893	 -1.201292
 -0.894555	  0.424998	 -1.183343
 -0.882116	  0.412893	 -1.172104
 -0.870032	  0.408506	 -1.159508
 -0.857535	  0.402620	 -1.142077
 -0.847948	  0.390589	 -1.127645
 -0.836973	  0.382465	 -1.114197
 -0.825878	  0.378792	 -1.096262
 -0.815540	  0.376991	 -1.079747
 -0.804729	  0.369515	 -1.065743
 -0.793997	  0.358241	 -1.049480
 -0.782249	  0.354054	 -1.035022
 -0.770233	  0.348314	 -1.020010
 -0.757500	  0.340858	 -1.002273
 -0.752284	  0.338194	 -0.983127
 -0.746490	  0.340493	 -0.963204
 -0.734066	  0.339107	 -0.944822
 -0.726754	  0.334634	 -0.929319
 -0.718937	  0.329425	 -0.910741
 -0.709992	  0.323955	 -0.894175
 -0.698475	  0.314937	 -0.880848
 -0.681743	  0.311046	 -0.865115
 -0.669421	  0.310881	 -0.844167
 -0.670927	  0.307811	 -0.829006
 -0.664615	  0.302883	 -0.808868
 -0.657054	  0.297793	 -0.787120
 -0.647734	  0.298793	 -0.771015
 -0.637487	  0.298019	 -0.754489
 -0.628742	  0.294673	 -0.736333
 -0.622055	  0.292160	 -0.716977
 -0.617347	  0.289055	 -0.697699
 -0.611833	  0.285646	 -0.679130
 -0.606075	  0.284701	 -0.659769
 -0.599515	  0.283888	 -0.640604
 -0.592395	  0.279805	 -0.622042
 -0.587447	  0.279327	 -0.602762
 -0.588319	  0.279191	 -0.581460
 -0.588579	  0.277357	 -0.560850
 -0.584958	  0.272570	 -0.543657
 -0.581820	  0.271156	 -0.524204
 -0.577845	  0.269598	 -0.503678
 -0.574527	  0.268540	 -0.481479
 -0.572943	  0.265077	 -0.464883
 -0.573924	  0.262513	 -0.445265
 -0.573829	  0.259418	 -0.422745
 -0.569154	  0.255600	 -0.404483
 -0.564333	  0.253107	 -0.385125
 -0.563351	  0.248259	 -0.365760
 -0.562861	  0.244971	 -0.346256
 -0.559255	  0.244202	 -0.325944
 -0.558077	  0.239448	 -0.306370
 -0.558724	  0.235270	 -0.287807
 -0.556867	  0.232922	 -0.266588
 -0.555604	  0.228003	 -0.246305
 -0.556520	  0.224761	 -0.228997
 -0.556957	  0.219574	 -0.208104
 -0.555534	  0.212232	 -0.186942
 -0.553399	  0.211433	 -0.170425
 -0.552363	  0.209194	 -0.150049
 -0.551263	  0.204343	 -0.130714
 -0.550351	  0.198944	 -0.110883
 -0.550493	  0.196210	 -0.090224
 -0.547592	  0.194043	 -0.072131
 -0.544614	  0.190373	 -0.052485
 -0.545385	  0.186581	 -0.029466
 -0.546506	  0.184462	 -0.011064
 -0.544053	  0.178736	  0.006400
 -0.543162	  0.170105	  0.026018
 -0.546651	  0.165164	  0.046691
 -0.546151	  0.162676	  0.064141
 -0.546595	  0.157420	  0.083704
 -0.546827	  0.147537	  0.102888
 -0.547256	  0.139778	  0.121905
 -0.552883	  0.132311	  0.138828
 -0.558097	  0.125321	  0.157719
 -0.559868	  0.119675	  0.176657
 -0.562835	  0.112843	  0.194830
 -0.568499	  0.105248	  0.214109
 -0.569314	  0.100140	  0.232804
 -0.568960	  0.092875	  0.250717
 -0.569341	  0.085888	  0.271676
 -0.575607	  0.078508	  0.288593
 -0.581690	  0.069466	  0.305320
 -0.583780	  0.060545	  0.323701
 -0.581747	  0.052762	  0.341703
 -0.581088	  0.044020	  0.360160
 -0.581665	  0.035430	  0.378352
 -0.582145	  0.027147	  0.396550
 -0.582624	  0.018867	  0.414750
 -0.583239	  0.011226	  0.432821
 -0.584380	  0.002442	  0.448613
 -0.587460	 -0.009242	  0.470106
 -0.591996	 -0.018841	  0.489170
 -0.591479	 -0.021392	  0.508887
 -0.588324	 -0.023072	  0.524485
 -0.588367	 -0.030931	  0.544614
 -0.591649	 -0.041179	  0.562974
 -0.592837	 -0.046922	  0.583121
 -0.592369	 -0.050574	  0.601729
 -0.591914	 -0.055326	  0.620958
 -0.593216	 -0.061868	  0.640355
 -0.594953	 -0.068649	  0.659156
 -0.596947	 -0.075327	  0.677902
 -0.599151	 -0.081789	  0.696592
 -0.602542	 -0.087104	  0.715615
 -0.607760	 -0.091570	  0.734556
 -0.611608	 -0.098416	  0.753768
 -0.613131	 -0.104100	  0.771864
 -0.616416	 -0.107662	  0.790965
 -0.620017	 -0.113703	  0.811328
 -0.624010	 -0.119032	  0.829477
 -0.624913	 -0.122742	  0.848040
 -0.628408	 -0.126435	  0.868751
 -0.632885	 -0.132056	  0.887386
 -0.630487	 -0.138884	  0.906144
 -0.628927	 -0.144782	  0.925726
 -0.631124	 -0.151000	  0.945500
 -0.633547	 -0.149126	  0.965623
 -0.635564	 -0.146725	  0.987521
 -0.642009	 -0.149976	  1.007046
 -0.649456	 -0.157180	  1.024233
 -0.647027	 -0.159289	  1.042077
 -0.643875	 -0.159579	  1.064101
 -0.651323	 -0.163651	  1.086418
 -0.656885	 -0.168254	  1.102335
 -0.656989	 -0.170209	  1.121917
 -0.657097	 -0.173174	  1.143047
 -0.663343	 -0.179133	  1.162460
 -0.665715	 -0.181530	  1.180219
 -0.664012	 -0.185235	  1.201080
 -0.665316	 -0.190985	  1.221087
 -0.670728	 -0.193567	  1.239500
 -0.672561	 -0.196703	  1.259439
 -0.671141	 -0.200125	  1.280300
 -0.671429	 -0.200422	  1.298662
 -0.672839	 -0.202538	  1.319395
 -0.674189	 -0.210309	  1.338697
 -0.674888	 -0.216935	  1.356992
 -0.675429	 -0.220720	  1.377051
 -0.676469	 -0.222282	  1.396436
 -0.676786	 -0.226632	  1.416536
 -0.676976	 -0.231380	  1.435988
 -0.676856	 -0.236464	  1.455331
 -0.676584	 -0.241715	  1.474627
 -0.676135	 -0.247059	  1.493894
 -0.675360	 -0.252706	  1.512804
 -0.674331	 -0.259625	  1.531569
 -0.672521	 -0.265849	  1.550218
 -0.670738	 -0.269825	  1.571453
 -0.669473	 -0.274805	  1.589420
 -0.668461	 -0.281929	  1.608452
 -0.667868	 -0.285866	  1.630008
 -0.664320	 -0.289004	  1.646747
 -0.660845	 -0.295452	  1.666228
 -0.658242	 -0.300857	  1.685646
 -0.656365	 -0.306491	  1.704405
 -0.654792	 -0.313560	  1.723018
 -0.653991	 -0.317452	  1.744554
 -0.650415	 -0.320708	  1.762893
 -0.646301	 -0.327298	  1.780743
 -0.643108	 -0.331947	  1.800948
 -0.641268	 -0.335124	  1.820698
 -0.639590	 -0.340353	  1.839710
 -0.638200	 -0.347436	  1.857547
 -0.636574	 -0.352685	  1.877477
 -0.634918	 -0.356762	  1.897013
 -0.633264	 -0.360830	  1.916524
 -0.631935	 -0.364222	  1.936190
 -0.630689	 -0.367439	  1.955890
 -0.629509	 -0.370628	  1.975599
 -0.629028	 -0.373524	  1.995382
 -0.628549	 -0.376419	  2.015166
 -0.628347	 -0.379248	  2.034964
 -0.628592	 -0.381969	  2.054776
 -0.628837	 -0.384691	  2.074589
 -0.629443	 -0.387309	  2.094407
 -0.630187	 -0.389888	  2.114227
 -0.630916	 -0.392447	  2.134049
 -0.631558	 -0.394891	  2.153888
 -0.632199	 -0.397336	  2.173728
 -0.632689	 -0.399939	  2.193552
 -0.633097	 -0.402625	  2.213367
 -0.633472	 -0.405352	  2.233176
 -0.633713	 -0.408262	  2.252946
 -0.634019	 -0.411993	  2.272160
 -0.634720	 -0.417083	  2.292057
 -0.636360	 -0.422252	  2.310494
 -0.639636	 -0.423829	  2.332708
 -0.642001	 -0.422097	  2.353203
 -0.635998	 -0.426422	  2.379847
 -0.634754	 -0.427318	  2.385370
