 -1.289847	  0.829545	 -2.125916
 -1.295640	  0.827671	 -2.128581
 -1.278208	  0.833311	 -2.120563
 -1.260775	  0.838955	 -2.112546
 -1.243399	  0.845001	 -2.104711
 -1.226514	  0.852033	 -2.097448
 -1.210380	  0.862553	 -2.091311
 -1.194173	  0.870905	 -2.083755
 -1.178506	  0.878063	 -2.075420
 -1.163282	  0.888826	 -2.066114
 -1.140095	  0.895679	 -2.056304
 -1.124273	  0.894155	 -2.052006
 -1.103749	  0.896324	 -2.045589
 -1.086937	  0.902971	 -2.038661
 -1.074253	  0.910681	 -2.031375
 -1.049120	  0.923871	 -2.018503
 -1.038037	  0.927057	 -2.014733
 -1.019229	  0.932135	 -2.009116
 -1.000436	  0.939214	 -2.001782
 -0.986613	  0.944928	 -1.994507
 -0.966037	  0.955332	 -1.982232
 -0.951406	  0.965741	 -1.975680
 -0.937451	  0.975663	 -1.972126
 -0.919017	  0.985309	 -1.966005
 -0.901744	  0.991259	 -1.957125
 -0.886181	  0.994971	 -1.948507
 -0.864239	  1.003111	 -1.940513
 -0.848360	  1.007290	 -1.936587
 -0.829899	  1.013849	 -1.930410
 -0.812830	  1.022816	 -1.925332
 -0.796822	  1.033586	 -1.922274
 -0.776491	  1.048033	 -1.920345
 -0.761416	  1.056341	 -1.918472
 -0.749375	  1.061909	 -1.912287
 -0.731902	  1.072880	 -1.906161
 -0.706950	  1.083366	 -1.897892
 -0.692315	  1.088753	 -1.896353
 -0.675553	  1.099020	 -1.896535
 -0.658047	  1.110133	 -1.896820
 -0.644165	  1.120721	 -1.899377
 -0.624573	  1.138947	 -1.903246
 -0.606701	  1.149643	 -1.903431
 -0.592934	  1.153485	 -1.900364
 -0.573820	  1.160594	 -1.895706
 -0.547651	  1.166323	 -1.888144
 -0.531698	  1.168225	 -1.883716
 -0.513894	  1.171067	 -1.878029
 -0.493695	  1.178504	 -1.876606
 -0.475918	  1.186996	 -1.879005
 -0.457522	  1.195441	 -1.880705
 -0.438217	  1.202045	 -1.879122
 -0.419663	  1.204443	 -1.876169
 -0.398091	  1.205431	 -1.875710
 -0.376993	  1.206059	 -1.877550
 -0.356822	  1.210473	 -1.871832
 -0.342295	  1.211444	 -1.859678
 -0.323891	  1.208486	 -1.845781
 -0.304572	  1.211387	 -1.835859
 -0.288350	  1.214380	 -1.828860
 -0.269681	  1.212476	 -1.821287
 -0.250209	  1.207928	 -1.813683
 -0.231663	  1.202953	 -1.808782
 -0.214241	  1.194489	 -1.804006
 -0.196084	  1.184518	 -1.799194
 -0.178005	  1.177378	 -1.793095
 -0.160068	  1.172482	 -1.784126
 -0.147367	  1.165583	 -1.769031
 -0.135759	  1.154790	 -1.755346
 -0.120774	  1.145307	 -1.743183
 -0.107535	  1.142650	 -1.729730
 -0.094074	  1.141741	 -1.713424
 -0.079042	  1.139370	 -1.698653
 -0.063761	  1.134201	 -1.687232
 -0.050720	  1.125013	 -1.675994
 -0.038618	  1.112912	 -1.664447
 -0.022994	  1.102917	 -1.652412
 -0.010582	  1.099009	 -1.639439
 -0.001661	  1.095860	 -1.621616
  0.007544	  1.088591	 -1.604869
  0.020980	  1.077446	 -1.590130
  0.032216	  1.069861	 -1.578538
  0.044080	  1.066944	 -1.561536
  0.058884	  1.064637	 -1.544971
  0.072733	  1.056972	 -1.531482
  0.081486	  1.048920	 -1.520500
  0.089255	  1.041144	 -1.502492
  0.098170	  1.036029	 -1.484595
  0.111296	  1.028449	 -1.468491
  0.124509	  1.018281	 -1.455313
  0.133009	  1.007742	 -1.442551
  0.139475	  0.996827	 -1.428316
  0.146307	  0.985202	 -1.414048
  0.156596	  0.972549	 -1.399505
  0.169643	  0.964548	 -1.388039
  0.188211	  0.960313	 -1.376234
  0.204290	  0.955119	 -1.366981
  0.218802	  0.946662	 -1.357693
  0.230435	  0.936795	 -1.348601
  0.242443	  0.924413	 -1.337843
  0.257217	  0.920363	 -1.329764
  0.280012	  0.920153	 -1.314141
  0.293847	  0.922054	 -1.299863
  0.308346	  0.920565	 -1.286078
  0.324032	  0.928360	 -1.277004
  0.340057	  0.931974	 -1.272027
  0.362425	  0.938856	 -1.268439
  0.376174	  0.939185	 -1.264993
  0.396599	  0.943422	 -1.257554
  0.415963	  0.947865	 -1.252374
  0.434360	  0.955312	 -1.249756
  0.452411	  0.967937	 -1.245477
  0.465189	  0.980600	 -1.228424
  0.473267	  0.993139	 -1.207104
  0.479003	  1.006421	 -1.191755
  0.489026	  1.024690	 -1.186220
  0.503680	  1.041157	 -1.190611
  0.520107	  1.056238	 -1.195199
  0.532313	  1.072168	 -1.197242
  0.543475	  1.089324	 -1.201064
  0.559444	  1.104947	 -1.209827
  0.569757	  1.116436	 -1.213362
  0.583192	  1.134859	 -1.214355
  0.594908	  1.148273	 -1.211219
  0.608793	  1.162760	 -1.211437
  0.622155	  1.178159	 -1.215511
  0.635890	  1.192900	 -1.222265
  0.658556	  1.204620	 -1.223226
  0.676669	  1.213734	 -1.218935
  0.690045	  1.225384	 -1.216948
  0.701810	  1.241242	 -1.213677
  0.718627	  1.256952	 -1.207011
  0.727413	  1.269459	 -1.201725
  0.738576	  1.285549	 -1.199334
  0.757442	  1.301728	 -1.193535
  0.772904	  1.307118	 -1.192002
  0.788982	  1.316365	 -1.193085
  0.809023	  1.323071	 -1.194235
  0.831181	  1.332485	 -1.187739
  0.845912	  1.341610	 -1.184494
  0.861290	  1.349750	 -1.191824
  0.884649	  1.355698	 -1.198634
  0.905471	  1.358164	 -1.192545
  0.924016	  1.361296	 -1.184739
  0.940819	  1.366013	 -1.184139
  0.961773	  1.370906	 -1.184775
  0.980363	  1.373018	 -1.175779
  1.001454	  1.374020	 -1.165109
  1.020088	  1.376018	 -1.164355
  1.038355	  1.377959	 -1.161768
  1.058786	  1.378766	 -1.153600
  1.078190	  1.380167	 -1.152437
  1.096273	  1.381452	 -1.150355
  1.116813	  1.382989	 -1.145208
  1.139036	  1.384856	 -1.145258
  1.156771	  1.386727	 -1.141150
  1.176955	  1.388587	 -1.131809
  1.199400	  1.389461	 -1.124373
  1.209736	  1.390537	 -1.121760
  1.229356	  1.396008	 -1.116694
  1.249127	  1.406012	 -1.113508
  1.271032	  1.413002	 -1.105132
  1.287779	  1.411155	 -1.093814
  1.305036	  1.413602	 -1.086057
  1.323097	  1.420598	 -1.081614
  1.341968	  1.424920	 -1.074384
  1.360316	  1.429191	 -1.067035
  1.378097	  1.435958	 -1.062277
  1.396995	  1.440549	 -1.055764
  1.415999	  1.443964	 -1.047815
  1.432287	  1.453098	 -1.046109
  1.449987	  1.458403	 -1.042887
  1.473695	  1.463107	 -1.032360
  1.487625	  1.470207	 -1.027540
  1.504297	  1.474397	 -1.023069
  1.526859	  1.476329	 -1.012222
  1.543942	  1.483655	 -1.004057
  1.557705	  1.488305	 -1.000668
  1.578058	  1.486756	 -0.992396
  1.597774	  1.489953	 -0.982106
  1.613865	  1.501077	 -0.975301
  1.630884	  1.506947	 -0.968538
  1.650305	  1.506767	 -0.965146
  1.673536	  1.509211	 -0.967551
  1.698092	  1.515115	 -0.957026
  1.710927	  1.518123	 -0.942668
  1.720917	  1.522641	 -0.928552
  1.736446	  1.534600	 -0.915455
  1.751707	  1.541674	 -0.902004
  1.767662	  1.542549	 -0.889573
  1.783346	  1.542299	 -0.882791
  1.802951	  1.545327	 -0.873340
  1.820259	  1.549618	 -0.864140
  1.837795	  1.555175	 -0.855693
  1.855553	  1.560487	 -0.848404
  1.873448	  1.563618	 -0.841987
  1.894623	  1.566471	 -0.834852
  1.912186	  1.571070	 -0.826627
  1.925830	  1.572573	 -0.811202
  1.943918	  1.576398	 -0.803573
