  1.337541	 -1.293186	  1.852647
  1.341759	 -1.289125	  1.857363
  1.330539	 -1.299928	  1.844817
  1.319318	 -1.310731	  1.832270
  1.307834	 -1.321152	  1.819642
  1.296293	 -1.331490	  1.806995
  1.284583	 -1.341742	  1.794436
  1.272620	 -1.351985	  1.782386
  1.260417	 -1.364294	  1.772966
  1.247522	 -1.378107	  1.763304
  1.234921	 -1.388009	  1.752866
  1.220084	 -1.396520	  1.740235
  1.206812	 -1.408358	  1.727590
  1.196066	 -1.416062	  1.712462
  1.183241	 -1.420400	  1.701029
  1.168078	 -1.429125	  1.688757
  1.154521	 -1.440017	  1.680098
  1.140153	 -1.453589	  1.674320
  1.126601	 -1.471111	  1.665470
  1.116944	 -1.479272	  1.655022
  1.101880	 -1.490928	  1.646034
  1.087375	 -1.499297	  1.636355
  1.073180	 -1.509069	  1.624569
  1.059244	 -1.518680	  1.613625
  1.046108	 -1.530751	  1.604296
  1.033277	 -1.542916	  1.596655
  1.017992	 -1.557070	  1.591606
  1.003317	 -1.570497	  1.587063
  0.993180	 -1.583298	  1.575207
  0.985134	 -1.595317	  1.561435
  0.970504	 -1.611112	  1.546633
  0.961846	 -1.619955	  1.541777
  0.948611	 -1.635700	  1.533922
  0.937115	 -1.649941	  1.525491
  0.927955	 -1.663754	  1.515450
  0.916016	 -1.679355	  1.503660
  0.901942	 -1.692940	  1.500389
  0.890365	 -1.707608	  1.500758
  0.876854	 -1.725794	  1.496384
  0.869362	 -1.739524	  1.484081
  0.862092	 -1.754981	  1.473068
  0.853385	 -1.771639	  1.464670
  0.843676	 -1.787982	  1.457969
  0.834320	 -1.804388	  1.451385
  0.825034	 -1.820812	  1.444771
  0.816207	 -1.837469	  1.438076
  0.807361	 -1.854114	  1.431391
  0.798625	 -1.870766	  1.424579
  0.790159	 -1.887428	  1.417460
  0.781691	 -1.904091	  1.410342
  0.773327	 -1.920694	  1.402968
  0.765106	 -1.937207	  1.395240
  0.756884	 -1.953721	  1.387515
  0.748600	 -1.970071	  1.379512
  0.740239	 -1.986225	  1.371195
  0.731879	 -2.002382	  1.362869
  0.723360	 -2.018192	  1.354047
  0.714610	 -2.033606	  1.345100
  0.705548	 -2.049768	  1.337229
  0.695489	 -2.065688	  1.330722
  0.684227	 -2.081606	  1.322285
  0.674362	 -2.096060	  1.312325
  0.665851	 -2.109546	  1.299741
  0.658439	 -2.121119	  1.286372
  0.648624	 -2.135042	  1.274686
  0.638433	 -2.148437	  1.263799
  0.627971	 -2.161400	  1.252726
  0.617494	 -2.174391	  1.241704
  0.606683	 -2.186954	  1.230508
  0.595739	 -2.199332	  1.219240
  0.584770	 -2.211688	  1.207970
  0.573557	 -2.223811	  1.196687
  0.562344	 -2.235934	  1.185404
  0.550917	 -2.248083	  1.174368
  0.539390	 -2.260243	  1.163447
  0.527762	 -2.272350	  1.152574
  0.515923	 -2.284342	  1.141802
  0.504084	 -2.296334	  1.131031
  0.491903	 -2.308077	  1.120366
  0.479660	 -2.319773	  1.109721
  0.467256	 -2.331501	  1.099300
  0.454677	 -2.343262	  1.089130
  0.442044	 -2.355010	  1.079012
  0.429156	 -2.366696	  1.069145
  0.416268	 -2.378383	  1.059280
  0.403078	 -2.389945	  1.049670
  0.389830	 -2.401482	  1.040112
  0.376579	 -2.413022	  1.030553
  0.363057	 -2.424792	  1.020803
  0.345827	 -2.439641	  1.008600
  0.332465	 -2.451142	  0.999156
