  2.926781	  0.773782	  0.126937
  2.897803	  0.766121	  0.125681
  2.865962	  0.789028	  0.100926
  2.833403	  0.794064	  0.063494
  2.793806	  0.796229	  0.032509
  2.751485	  0.802518	  0.003677
  2.716253	  0.817062	 -0.029062
  2.683479	  0.827862	 -0.061462
  2.645571	  0.841445	 -0.093084
  2.612611	  0.860227	 -0.126234
  2.580912	  0.886766	 -0.156981
  2.541913	  0.893645	 -0.185009
  2.510125	  0.910945	 -0.218922
  2.470938	  0.920380	 -0.248491
  2.430260	  0.940014	 -0.272171
  2.391381	  0.950313	 -0.302044
  2.356796	  0.967335	 -0.331487
  2.321097	  0.983395	 -0.363057
  2.283959	  0.998802	 -0.397375
  2.249463	  1.011181	 -0.429627
  2.214526	  1.019774	 -0.460721
  2.178887	  1.025397	 -0.494520
  2.144667	  1.031314	 -0.530596
  2.110940	  1.039007	 -0.566531
  2.076738	  1.047805	 -0.601017
  2.040989	  1.057387	 -0.633257
  2.002065	  1.068225	 -0.662927
  1.962284	  1.080497	 -0.689110
  1.921663	  1.095053	 -0.715615
  1.883046	  1.111047	 -0.743090
  1.845164	  1.126842	 -0.773208
  1.809398	  1.141091	 -0.806703
  1.776073	  1.153506	 -0.841331
  1.744477	  1.164088	 -0.874953
  1.711636	  1.173696	 -0.909517
  1.678545	  1.182022	 -0.943467
  1.641873	  1.191720	 -0.979525
  1.606779	  1.203764	 -1.014529
  1.573385	  1.218936	 -1.047522
  1.540268	  1.235032	 -1.079447
  1.505289	  1.252483	 -1.112390
  1.470906	  1.270157	 -1.144640
  1.438491	  1.287012	 -1.175110
  1.404274	  1.304438	 -1.206990
  1.369431	  1.321921	 -1.240167
  1.335282	  1.337396	 -1.273115
  1.302011	  1.350721	 -1.305199
  1.267516	  1.362653	 -1.338813
  1.230726	  1.373662	 -1.374754
  1.195256	  1.384005	 -1.409290
  1.162667	  1.394472	 -1.441183
  1.130148	  1.406226	 -1.475165
  1.095691	  1.418738	 -1.510702
  1.060280	  1.430998	 -1.544870
  1.023969	  1.442000	 -1.577824
  0.986572	  1.452226	 -1.610202
  0.948698	  1.461971	 -1.641393
  0.911808	  1.471542	 -1.670420
  0.875563	  1.481799	 -1.698013
  0.838090	  1.494405	 -1.725413
  0.799946	  1.509560	 -1.751585
  0.759150	  1.526721	 -1.778214
  0.719936	  1.542349	 -1.807072
  0.685489	  1.556749	 -1.836874
  0.649883	  1.572963	 -1.867685
  0.612918	  1.577493	 -1.904364
  0.578782	  1.585058	 -1.938601
  0.542497	  1.598228	 -1.973183
  0.502486	  1.612606	 -1.998326
  0.474604	  1.625558	 -2.035388
  0.440367	  1.638022	 -2.070346
  0.403966	  1.649609	 -2.105531
  0.368894	  1.661686	 -2.138874
  0.332178	  1.673721	 -2.170882
  0.294562	  1.685409	 -2.201091
  0.259121	  1.694826	 -2.228178
  0.220699	  1.702426	 -2.256418
  0.182138	  1.716553	 -2.289283
  0.148345	  1.732075	 -2.320593
  0.115615	  1.750183	 -2.353346
  0.078529	  1.765699	 -2.387308
  0.037281	  1.769019	 -2.422639
  0.037654	  1.786709	 -2.446866
