  2.853854	 -0.143259	 -1.007914
  2.825598	 -0.141841	 -0.997935
  2.786718	 -0.119358	 -0.970293
  2.745563	 -0.106857	 -0.950215
  2.708896	 -0.090832	 -0.920247
  2.662351	 -0.081607	 -0.900637
  2.617606	 -0.063618	 -0.875923
  2.584184	 -0.052982	 -0.855202
  2.535465	 -0.040991	 -0.828145
  2.498739	 -0.029998	 -0.807468
  2.454025	 -0.012025	 -0.784742
  2.412512	 -0.001357	 -0.766270
  2.373659	  0.015284	 -0.740068
  2.323772	  0.030549	 -0.717067
  2.286885	  0.039349	 -0.692417
  2.242361	  0.054646	 -0.669736
  2.199146	  0.071847	 -0.651911
  2.158650	  0.079996	 -0.622856
  2.118540	  0.093043	 -0.607617
  2.080402	  0.110716	 -0.577647
  2.031665	  0.126546	 -0.554768
  1.990707	  0.139002	 -0.538868
  1.950389	  0.157285	 -0.508822
  1.906763	  0.169272	 -0.485321
  1.880876	  0.193274	 -0.459423
  1.854634	  0.230897	 -0.424884
  1.807125	  0.245870	 -0.393335
  1.774127	  0.275916	 -0.376177
  1.731668	  0.269559	 -0.344070
  1.672797	  0.278191	 -0.341332
  1.625032	  0.283683	 -0.328951
  1.574938	  0.287073	 -0.307169
  1.544162	  0.303765	 -0.279834
  1.498066	  0.308833	 -0.260597
  1.448216	  0.314265	 -0.237058
  1.412540	  0.336133	 -0.213516
  1.365874	  0.346375	 -0.190487
  1.324352	  0.360511	 -0.172621
  1.277653	  0.370709	 -0.142366
  1.241591	  0.389588	 -0.124518
  1.199127	  0.402971	 -0.101399
  1.160883	  0.415546	 -0.081866
  1.104018	  0.415377	 -0.075955
  1.048864	  0.423096	 -0.059053
  1.010436	  0.443495	 -0.044171
  0.967862	  0.448247	 -0.010563
  0.917857	  0.465177	  0.003269
  0.879772	  0.483032	  0.029761
  0.844283	  0.487758	  0.053615
  0.795418	  0.506236	  0.079355
  0.762460	  0.519662	  0.105439
  0.734024	  0.546312	  0.151889
  0.696888	  0.563813	  0.178495
  0.658207	  0.584743	  0.195692
  0.616348	  0.597083	  0.217393
  0.568199	  0.609446	  0.247648
  0.529276	  0.620591	  0.270135
  0.484824	  0.636283	  0.291987
  0.444025	  0.653419	  0.309347
  0.399969	  0.664891	  0.333755
  0.365407	  0.678796	  0.354000
  0.320208	  0.690285	  0.380975
  0.275200	  0.700448	  0.407251
  0.240780	  0.718414	  0.429999
  0.196708	  0.729165	  0.447971
  0.148481	  0.743976	  0.469327
  0.111870	  0.757114	  0.495712
  0.064404	  0.773196	  0.516704
  0.022565	  0.791521	  0.543525
 -0.019022	  0.799577	  0.568330
 -0.060247	  0.814297	  0.585586
 -0.095371	  0.826248	  0.609972
 -0.141296	  0.845673	  0.637579
 -0.178363	  0.861489	  0.653411
 -0.220532	  0.872313	  0.675446
 -0.267324	  0.884202	  0.702947
 -0.304606	  0.898578	  0.727765
 -0.348944	  0.915405	  0.752186
 -0.398660	  0.920830	  0.767706
 -0.454259	  0.926493	  0.774129
 -0.493001	  0.950804	  0.797240
 -0.544513	  0.945733	  0.801345
 -0.578446	  0.973295	  0.836329
 -0.609602	  0.992673	  0.855402
 -0.679459	  0.979822	  0.871787
 -0.708155	  1.001581	  0.880548
 -0.751797	  1.046671	  0.894164
 -0.781336	  1.063973	  0.941586
 -0.846357	  1.068453	  0.936924
 -0.890550	  1.054665	  0.987952
 -0.925955	  1.081796	  0.989292
 -0.942434	  1.124364	  1.047021
 -0.983415	  1.109151	  1.084541
 -1.024062	  1.134729	  1.100957
 -1.058908	  1.147900	  1.130459
 -1.104631	  1.164476	  1.156726
 -1.142513	  1.171613	  1.179954
 -1.182004	  1.187979	  1.207261
 -1.224212	  1.201548	  1.232992
 -1.271834	  1.213411	  1.252309
 -1.314321	  1.228737	  1.272187
 -1.349847	  1.241610	  1.293372
 -1.394407	  1.258900	  1.324853
 -1.442659	  1.268010	  1.344870
 -1.480089	  1.280559	  1.365662
 -1.525206	  1.296585	  1.387847
 -1.559748	  1.310391	  1.409633
 -1.608727	  1.330058	  1.435546
 -1.642496	  1.343910	  1.459002
 -1.689712	  1.356151	  1.482877
 -1.729530	  1.367325	  1.508493
 -1.771468	  1.380209	  1.527365
 -1.811616	  1.392888	  1.548284
 -1.851540	  1.405664	  1.573679
 -1.902713	  1.419074	  1.595751
 -1.944305	  1.432552	  1.621870
 -1.979193	  1.455032	  1.646031
 -2.028672	  1.459494	  1.659629
 -2.048959	  1.474089	  1.676225
