 -2.339037	 -0.962844	 -0.101096
 -2.347255	 -0.958687	 -0.073182
 -2.341422	 -0.961638	 -0.092996
 -2.333438	 -0.967035	 -0.120366
 -2.328034	 -0.973403	 -0.140715
 -2.319345	 -0.986857	 -0.174051
 -2.304903	 -1.007262	 -0.225104
 -2.288385	 -1.027927	 -0.286960
 -2.270732	 -1.045253	 -0.351942
 -2.253083	 -1.056979	 -0.415011
 -2.232892	 -1.061523	 -0.475095
 -2.205381	 -1.058679	 -0.527435
 -2.166763	 -1.050190	 -0.571298
 -2.111750	 -1.038818	 -0.608381
 -2.033823	 -1.029748	 -0.641110
 -1.943017	 -1.028617	 -0.672002
 -1.868871	 -1.034392	 -0.703199
 -1.833587	 -1.040787	 -0.725166
 -1.826776	 -1.048608	 -0.737611
 -1.818764	 -1.073838	 -0.771536
 -1.816282	 -1.113531	 -0.822925
 -1.824523	 -1.155771	 -0.872938
 -1.845728	 -1.198457	 -0.918958
 -1.877461	 -1.248066	 -0.981711
 -1.895356	 -1.265534	 -1.053417
 -1.911081	 -1.283778	 -1.110944
 -1.905376	 -1.310152	 -1.132547
