 -2.155184	 -0.425260	  1.007023
 -2.156388	 -0.424574	  1.009598
 -2.148154	 -0.429267	  0.991986
 -2.139921	 -0.433959	  0.974374
 -2.131699	 -0.438988	  0.956849
 -2.123488	 -0.444270	  0.939394
 -2.115277	 -0.449552	  0.921939
 -2.107483	 -0.454664	  0.904244
 -2.099719	 -0.459764	  0.886532
 -2.092113	 -0.464686	  0.868701
 -2.085030	 -0.469022	  0.850507
 -2.077948	 -0.473359	  0.832313
 -2.071536	 -0.477096	  0.813741
 -2.066021	 -0.480041	  0.794743
 -2.060506	 -0.482985	  0.775745
 -2.055946	 -0.485837	  0.756482
 -2.052636	 -0.488558	  0.736946
 -2.049326	 -0.491278	  0.717411
 -2.046248	 -0.493594	  0.697785
 -2.043325	 -0.495642	  0.678106
 -2.040408	 -0.497694	  0.658427
 -2.038015	 -0.500085	  0.638715
 -2.035623	 -0.502475	  0.619003
 -2.033412	 -0.505151	  0.599306
 -2.033320	 -0.511034	  0.580191
 -2.033227	 -0.516916	  0.561076
 -2.033134	 -0.522798	  0.541961
 -2.035546	 -0.529657	  0.523329
 -2.038499	 -0.536713	  0.504850
 -2.041452	 -0.543769	  0.486370
 -2.045209	 -0.551405	  0.468271
 -2.049797	 -0.559626	  0.450626
 -2.054385	 -0.567847	  0.432980
 -2.058973	 -0.576068	  0.415334
 -2.064533	 -0.585273	  0.398472
 -2.070671	 -0.595053	  0.382142
 -2.076810	 -0.604834	  0.365812
 -2.082949	 -0.614614	  0.349482
 -2.089087	 -0.624394	  0.333152
 -2.097136	 -0.634875	  0.318140
 -2.105608	 -0.645497	  0.303463
 -2.114079	 -0.656118	  0.288786
 -2.122550	 -0.666739	  0.274108
 -2.131021	 -0.677360	  0.259431
 -2.140928	 -0.688550	  0.246139
 -2.151332	 -0.699917	  0.233390
 -2.161736	 -0.711284	  0.220641
 -2.172140	 -0.722651	  0.207891
 -2.182780	 -0.734135	  0.195445
 -2.194188	 -0.745981	  0.184064
 -2.205595	 -0.757828	  0.172683
 -2.217003	 -0.769674	  0.161302
 -2.227486	 -0.780876	  0.148472
 -2.237595	 -0.791808	  0.135119
 -2.247704	 -0.802741	  0.121766
 -2.257812	 -0.813673	  0.108413
 -2.265258	 -0.822649	  0.093992
 -2.273086	 -0.832200	  0.078261
