  0.577310	  1.232355	 -2.182248
  0.581801	  1.237710	 -2.187821
  0.571752	  1.225729	 -2.175352
  0.560084	  1.213161	 -2.165061
  0.547336	  1.200046	 -2.156968
  0.534369	  1.186113	 -2.150828
  0.537724	  1.180106	 -2.132048
  0.543021	  1.175748	 -2.113262
  0.548319	  1.171390	 -2.094475
  0.553616	  1.167033	 -2.075688
  0.558914	  1.162675	 -2.056901
  0.564212	  1.158317	 -2.038114
  0.569509	  1.153959	 -2.019327
  0.574807	  1.149601	 -2.000540
  0.580104	  1.145243	 -1.981754
  0.585402	  1.140886	 -1.962967
  0.590699	  1.136528	 -1.944180
  0.595997	  1.132170	 -1.925393
  0.601294	  1.127812	 -1.906606
  0.606592	  1.123454	 -1.887819
  0.611889	  1.119097	 -1.869033
  0.617187	  1.114739	 -1.850246
  0.622484	  1.110381	 -1.831459
  0.627782	  1.106023	 -1.812672
  0.633080	  1.101665	 -1.793885
  0.638377	  1.097307	 -1.775098
  0.643675	  1.092950	 -1.756311
  0.648972	  1.088592	 -1.737525
  0.654270	  1.084234	 -1.718738
  0.659567	  1.079876	 -1.699951
  0.664865	  1.075518	 -1.681164
  0.670162	  1.071161	 -1.662377
  0.675460	  1.066803	 -1.643590
  0.676436	  1.063286	 -1.623926
  0.676221	  1.060031	 -1.604194
  0.676006	  1.056775	 -1.584462
  0.675791	  1.053520	 -1.564730
  0.672626	  1.052536	 -1.545007
  0.669343	  1.051646	 -1.525298
  0.666060	  1.050755	 -1.505589
  0.662777	  1.049865	 -1.485881
  0.652420	  1.045985	 -1.469217
  0.639506	  1.040999	 -1.454783
  0.626591	  1.036012	 -1.440348
  0.613676	  1.031025	 -1.425914
  0.600761	  1.026038	 -1.411480
  0.587087	  1.019873	 -1.398252
  0.571548	  1.009408	 -1.391248
  0.556010	  0.998943	 -1.384244
  0.540472	  0.988479	 -1.377240
  0.524934	  0.978014	 -1.370236
  0.509396	  0.967550	 -1.363232
  0.493861	  0.957069	 -1.356243
  0.478813	  0.945039	 -1.350877
  0.463764	  0.933008	 -1.345510
  0.448715	  0.920977	 -1.340143
  0.434380	  0.907684	 -1.335925
  0.420389	  0.893884	 -1.332211
  0.406699	  0.879672	 -1.328952
  0.394472	  0.863897	 -1.327667
  0.382245	  0.848122	 -1.326383
  0.370060	  0.832317	 -1.325074
  0.358666	  0.815974	 -1.323313
  0.347271	  0.799632	 -1.321552
  0.335877	  0.783290	 -1.319791
  0.324482	  0.766948	 -1.318030
  0.313476	  0.750426	 -1.315602
  0.302515	  0.733886	 -1.313098
  0.291553	  0.717346	 -1.310595
  0.280592	  0.700805	 -1.308091
  0.269942	  0.684125	 -1.305202
  0.259437	  0.667385	 -1.302137
  0.248932	  0.650644	 -1.299072
  0.238427	  0.633904	 -1.296006
  0.228013	  0.617168	 -1.292621
  0.217705	  0.600443	 -1.288877
  0.207397	  0.583718	 -1.285132
  0.197089	  0.566993	 -1.281388
  0.186903	  0.550211	 -1.277562
  0.176817	  0.533385	 -1.273670
  0.166731	  0.516559	 -1.269777
  0.156653	  0.499730	 -1.265876
  0.146806	  0.482821	 -1.261739
  0.136958	  0.465912	 -1.257603
  0.127111	  0.449003	 -1.253466
  0.117409	  0.432110	 -1.248937
  0.107785	  0.415229	 -1.244203
  0.098161	  0.398348	 -1.239470
  0.088631	  0.381507	 -1.234415
  0.079231	  0.364726	 -1.228935
  0.069831	  0.347945	 -1.223454
  0.060527	  0.331211	 -1.217673
  0.051425	  0.314583	 -1.211296
  0.042322	  0.297955	 -1.204919
  0.033296	  0.281367	 -1.198335
  0.024597	  0.264966	 -1.190897
  0.015898	  0.248565	 -1.183459
  0.007198	  0.232163	 -1.176021
 -0.001114	  0.216065	 -1.167550
 -0.009405	  0.199986	 -1.159022
 -0.017695	  0.183907	 -1.150494
 -0.025715	  0.168070	 -1.141282
 -0.033572	  0.152386	 -1.131675
 -0.041428	  0.136702	 -1.122068
 -0.049164	  0.121127	 -1.112191
 -0.056580	  0.105850	 -1.101625
 -0.063995	  0.090574	 -1.091059
 -0.071408	  0.075303	 -1.080483
 -0.078623	  0.060523	 -1.069103
 -0.085838	  0.045743	 -1.057724
 -0.093052	  0.030962	 -1.046344
 -0.100238	  0.016659	 -1.034353
 -0.107418	  0.002420	 -1.022283
 -0.114598	 -0.011818	 -1.010212
 -0.121919	 -0.025530	 -0.997626
 -0.129264	 -0.039143	 -0.984948
 -0.136608	 -0.052756	 -0.972269
 -0.144137	 -0.065786	 -0.959096
 -0.151689	 -0.078736	 -0.945857
 -0.159241	 -0.091686	 -0.932619
 -0.166951	 -0.104044	 -0.918913
 -0.174669	 -0.116366	 -0.905180
 -0.182395	 -0.128659	 -0.891424
 -0.190244	 -0.140405	 -0.877269
 -0.198094	 -0.152152	 -0.863113
 -0.205973	 -0.163774	 -0.848870
 -0.213941	 -0.175002	 -0.834363
 -0.221909	 -0.186230	 -0.819856
 -0.229899	 -0.197264	 -0.805213
 -0.237913	 -0.208073	 -0.790417
 -0.245928	 -0.218883	 -0.775621
 -0.253967	 -0.229524	 -0.760717
 -0.262014	 -0.240118	 -0.745783
 -0.270058	 -0.250716	 -0.730851
 -0.278090	 -0.261330	 -0.715924
 -0.286123	 -0.271945	 -0.700997
 -0.294150	 -0.282690	 -0.686161
 -0.302174	 -0.293464	 -0.671344
 -0.310230	 -0.304313	 -0.656600
 -0.318316	 -0.315238	 -0.641928
 -0.326429	 -0.326168	 -0.627275
 -0.334683	 -0.337127	 -0.612722
 -0.342937	 -0.348085	 -0.598170
 -0.351372	 -0.359035	 -0.583714
 -0.359847	 -0.369982	 -0.569280
 -0.368468	 -0.380972	 -0.554966
 -0.377194	 -0.391992	 -0.540739
 -0.386199	 -0.403056	 -0.526721
 -0.395463	 -0.414159	 -0.512904
 -0.404985	 -0.425252	 -0.499256
 -0.414738	 -0.436335	 -0.485764
 -0.424610	 -0.447380	 -0.472327
 -0.434689	 -0.458358	 -0.458989
 -0.444769	 -0.469335	 -0.445651
 -0.454899	 -0.480183	 -0.432245
 -0.465031	 -0.491026	 -0.418838
 -0.475095	 -0.501845	 -0.405360
 -0.484971	 -0.512596	 -0.391689
 -0.494846	 -0.523346	 -0.378018
 -0.504547	 -0.534096	 -0.364221
 -0.513908	 -0.544840	 -0.350187
 -0.523269	 -0.555583	 -0.336154
 -0.532367	 -0.566458	 -0.322048
 -0.541066	 -0.577526	 -0.307841
 -0.549764	 -0.588594	 -0.293635
 -0.558057	 -0.599914	 -0.279383
 -0.565973	 -0.611459	 -0.265099
 -0.573888	 -0.623004	 -0.250814
 -0.581213	 -0.634917	 -0.236516
 -0.588214	 -0.647024	 -0.222219
 -0.595216	 -0.659130	 -0.207921
 -0.601570	 -0.671528	 -0.193572
 -0.607693	 -0.684025	 -0.179208
 -0.613816	 -0.696523	 -0.164844
 -0.619404	 -0.709147	 -0.150373
 -0.624866	 -0.721801	 -0.135880
 -0.630328	 -0.734454	 -0.121386
 -0.635417	 -0.747141	 -0.106787
 -0.640492	 -0.759829	 -0.092183
 -0.645508	 -0.772529	 -0.077570
 -0.650356	 -0.785265	 -0.062932
 -0.655205	 -0.798001	 -0.048293
 -0.659949	 -0.810796	 -0.033672
 -0.664644	 -0.823621	 -0.019061
 -0.669314	 -0.836470	 -0.004464
 -0.673863	 -0.849449	  0.010057
 -0.678411	 -0.862428	  0.024578
 -0.682868	 -0.875561	  0.038989
 -0.687291	 -0.888752	  0.053357
 -0.691686	 -0.902042	  0.067642
 -0.696033	 -0.915496	  0.081787
 -0.700383	 -0.928978	  0.095905
 -0.704768	 -0.942694	  0.109784
 -0.709153	 -0.956410	  0.123664
 -0.713581	 -0.970340	  0.137315
 -0.718017	 -0.984315	  0.150918
 -0.722462	 -0.998346	  0.164458
 -0.726922	 -1.012477	  0.177891
 -0.731383	 -1.026608	  0.191323
 -0.735951	 -1.040776	  0.204680
 -0.740576	 -1.054964	  0.217996
 -0.745200	 -1.069151	  0.231312
 -0.749973	 -1.083404	  0.244506
 -0.754783	 -1.097673	  0.257669
 -0.759592	 -1.111941	  0.270833
 -0.764308	 -1.126308	  0.283924
 -0.768988	 -1.140711	  0.296987
 -0.773668	 -1.155114	  0.310050
 -0.778112	 -1.169796	  0.322884
 -0.782370	 -1.184688	  0.335535
 -0.786629	 -1.199581	  0.348187
 -0.790893	 -1.214551	  0.360746
 -0.795162	 -1.229581	  0.373231
 -0.799431	 -1.244610	  0.385717
 -0.804044	 -1.259643	  0.398076
 -0.808725	 -1.274675	  0.410409
 -0.813480	 -1.289828	  0.422566
 -0.818335	 -1.305141	  0.434479
 -0.823534	 -1.320287	  0.446462
 -0.829926	 -1.334797	  0.458652
 -0.836540	 -1.349188	  0.470865
 -0.844179	 -1.362989	  0.483161
 -0.852109	 -1.376582	  0.495503
 -0.861055	 -1.389402	  0.507977
 -0.870588	 -1.401668	  0.520574
 -0.881200	 -1.412815	  0.533346
 -0.891739	 -1.424113	  0.546046
 -0.902219	 -1.435531	  0.558688
 -0.913198	 -1.446431	  0.571362
 -0.924444	 -1.456785	  0.584259
 -0.935980	 -1.466423	  0.597451
 -0.948362	 -1.474399	  0.610981
 -0.960900	 -1.482011	  0.624577
 -0.973711	 -1.488475	  0.638509
 -0.986521	 -1.494939	  0.652442
 -0.998993	 -1.501697	  0.666541
 -1.011342	 -1.508559	  0.680697
 -1.023808	 -1.515120	  0.694895
 -1.037094	 -1.519160	  0.709288
 -1.050380	 -1.523199	  0.723681
 -1.063658	 -1.527248	  0.738079
 -1.076697	 -1.531568	  0.752616
 -1.089737	 -1.535887	  0.767152
 -1.102776	 -1.540206	  0.781689
 -1.114520	 -1.547106	  0.796334
 -1.125567	 -1.555172	  0.810925
 -1.136615	 -1.563239	  0.825515
 -1.147427	 -1.571663	  0.840080
 -1.156548	 -1.582356	  0.854309
 -1.165670	 -1.593048	  0.868539
 -1.174791	 -1.603740	  0.882768
 -1.183317	 -1.615194	  0.896772
 -1.191663	 -1.626870	  0.910702
 -1.200008	 -1.638545	  0.924632
 -1.208165	 -1.650407	  0.938515
 -1.216253	 -1.662339	  0.952380
 -1.224340	 -1.674270	  0.966245
 -1.232322	 -1.686315	  0.980073
 -1.240297	 -1.698367	  0.993898
 -1.248254	 -1.710491	  1.007671
 -1.256183	 -1.722729	  1.021359
 -1.264113	 -1.734967	  1.035047
 -1.271938	 -1.747498	  1.048528
 -1.279761	 -1.760036	  1.062004
 -1.287503	 -1.772769	  1.075343
 -1.295195	 -1.785619	  1.088599
 -1.302889	 -1.798542	  1.101782
 -1.310587	 -1.811640	  1.114789
 -1.318285	 -1.824737	  1.127796
 -1.325984	 -1.837835	  1.140803
 -1.333682	 -1.850933	  1.153810
 -1.351363	 -1.881167	  1.183443
 -1.359072	 -1.894359	  1.196348
