 -1.679613	 -0.114987	  1.781481
 -1.692501	 -0.112261	  1.783575
 -1.705389	 -0.109535	  1.785669
 -1.686064	 -0.113621	  1.782533
 -1.666712	 -0.117660	  1.779563
 -1.647091	 -0.120806	  1.779023
 -1.627168	 -0.122851	  1.780360
 -1.607410	 -0.125222	  1.781629
 -1.588408	 -0.125751	  1.784308
 -1.567452	 -0.124298	  1.790499
 -1.546777	 -0.127707	  1.792131
 -1.527681	 -0.133713	  1.789801
 -1.509244	 -0.139586	  1.785735
 -1.488748	 -0.142387	  1.785100
 -1.468905	 -0.145222	  1.783916
 -1.449060	 -0.147523	  1.782889
 -1.429209	 -0.149148	  1.781572
 -1.409123	 -0.149139	  1.781531
 -1.388855	 -0.149110	  1.780371
 -1.369496	 -0.152003	  1.776741
 -1.349718	 -0.153747	  1.774055
 -1.329733	 -0.153812	  1.772652
 -1.309771	 -0.153668	  1.771419
 -1.289808	 -0.153421	  1.770251
 -1.269843	 -0.152554	  1.769480
 -1.249878	 -0.151646	  1.768730
 -1.229993	 -0.150437	  1.767650
 -1.210162	 -0.148730	  1.765472
 -1.190411	 -0.146914	  1.763440
 -1.172849	 -0.144338	  1.760466
 -1.155743	 -0.136810	  1.749710
 -1.130565	 -0.124997	  1.742586
 -1.110951	 -0.120218	  1.745332
 -1.095518	 -0.119296	  1.746806
 -1.074205	 -0.116509	  1.743442
 -1.052420	 -0.111854	  1.744497
 -1.035945	 -0.109394	  1.747540
 -1.016124	 -0.101856	  1.749124
 -0.996503	 -0.100803	  1.756651
 -0.970624	 -0.109914	  1.764338
 -0.951700	 -0.113919	  1.767515
 -0.934903	 -0.117425	  1.770548
 -0.913496	 -0.121103	  1.775184
 -0.894548	 -0.120272	  1.778274
 -0.873302	 -0.119559	  1.782624
 -0.851222	 -0.122525	  1.786606
 -0.836424	 -0.130689	  1.787516
 -0.818960	 -0.146437	  1.787186
 -0.798024	 -0.157864	  1.789455
 -0.778943	 -0.161465	  1.792936
 -0.759390	 -0.161487	  1.797400
 -0.739485	 -0.159840	  1.801748
 -0.718159	 -0.157408	  1.806054
 -0.696613	 -0.155900	  1.810003
 -0.678928	 -0.154322	  1.811009
 -0.660777	 -0.154893	  1.808234
 -0.636276	 -0.162433	  1.800433
 -0.619087	 -0.170376	  1.793407
 -0.601739	 -0.176871	  1.788816
 -0.575089	 -0.181819	  1.786870
 -0.559548	 -0.182091	  1.786979
 -0.539264	 -0.180872	  1.792763
 -0.515940	 -0.180207	  1.799153
 -0.493487	 -0.177566	  1.805006
 -0.475597	 -0.171564	  1.807988
 -0.456668	 -0.162288	  1.809697
 -0.435931	 -0.161452	  1.806034
 -0.419769	 -0.157981	  1.799709
 -0.406820	 -0.148711	  1.790131
 -0.397301	 -0.134824	  1.779707
 -0.378823	 -0.123855	  1.776585
 -0.361227	 -0.108334	  1.778782
 -0.348126	 -0.097173	  1.776901
 -0.341438	 -0.085635	  1.774709
 -0.339908	 -0.067101	  1.769536
 -0.335100	 -0.044046	  1.758587
 -0.326752	 -0.027741	  1.748550
 -0.314252	 -0.016345	  1.741916
 -0.300612	  0.002813	  1.737490
 -0.291344	  0.021478	  1.734194
 -0.285203	  0.034187	  1.731927
 -0.274337	  0.047130	  1.729647
 -0.260493	  0.062086	  1.725438
 -0.247260	  0.077261	  1.715922
 -0.238558	  0.088770	  1.706908
 -0.226128	  0.097854	  1.700598
 -0.209225	  0.102042	  1.696411
 -0.189785	  0.096890	  1.689474
 -0.165302	  0.096598	  1.672834
 -0.159588	  0.097354	  1.667153
 -0.152563	  0.097400	  1.658565
 -0.132584	  0.096531	  1.643693
 -0.114951	  0.087051	  1.637288
 -0.105578	  0.078610	  1.634417
 -0.095460	  0.069692	  1.631171
 -0.083997	  0.053840	  1.627729
 -0.069474	  0.038050	  1.624872
 -0.062601	  0.023574	  1.624493
 -0.050396	  0.003099	  1.617873
 -0.045421	 -0.012095	  1.612448
 -0.042602	 -0.024629	  1.607453
 -0.042451	 -0.045073	  1.604493
 -0.039590	 -0.064938	  1.600673
 -0.033471	 -0.085532	  1.597311
 -0.028211	 -0.105443	  1.595109
 -0.026417	 -0.125167	  1.594534
 -0.018245	 -0.150920	  1.589159
 -0.008097	 -0.164354	  1.586345
  0.005847	 -0.176940	  1.580151
  0.014767	 -0.188038	  1.573700
  0.021812	 -0.202070	  1.567771
  0.035715	 -0.227238	  1.559597
  0.041341	 -0.244987	  1.556979
  0.046371	 -0.260308	  1.552664
  0.050873	 -0.276284	  1.549658
  0.054083	 -0.297440	  1.545012
  0.061726	 -0.315348	  1.537226
  0.071804	 -0.333736	  1.527791
  0.082436	 -0.356326	  1.516425
  0.091475	 -0.369477	  1.511197
  0.097376	 -0.383745	  1.503600
  0.105063	 -0.396330	  1.493686
  0.112141	 -0.414248	  1.475678
  0.121107	 -0.429672	  1.463059
  0.130516	 -0.441342	  1.457221
  0.146351	 -0.455670	  1.451118
  0.166827	 -0.473797	  1.447439
  0.176593	 -0.485065	  1.445921
  0.191192	 -0.494519	  1.449074
  0.214930	 -0.504641	  1.458850
  0.231290	 -0.516999	  1.464734
  0.244060	 -0.524048	  1.467476
  0.262229	 -0.539342	  1.471188
  0.277727	 -0.551734	  1.474636
  0.291051	 -0.560640	  1.477684
  0.312165	 -0.571458	  1.481655
  0.333393	 -0.579267	  1.485147
  0.349330	 -0.584060	  1.487726
  0.369880	 -0.588981	  1.493136
  0.389999	 -0.595319	  1.501117
  0.406623	 -0.604787	  1.509700
  0.415577	 -0.613207	  1.513727
  0.434499	 -0.621599	  1.519645
  0.453640	 -0.626092	  1.531692
  0.470054	 -0.627925	  1.544540
  0.487907	 -0.628445	  1.554418
  0.505716	 -0.628292	  1.563727
  0.522908	 -0.627772	  1.573935
  0.539319	 -0.624020	  1.584963
  0.555560	 -0.619028	  1.595491
  0.572164	 -0.614549	  1.605652
  0.588453	 -0.609570	  1.616166
  0.604524	 -0.604364	  1.626831
  0.618630	 -0.596953	  1.638805
  0.629190	 -0.586608	  1.652197
  0.639415	 -0.576003	  1.665719
  0.649612	 -0.565383	  1.679256
  0.659776	 -0.554752	  1.692808
  0.669565	 -0.543922	  1.706449
  0.676140	 -0.531400	  1.720572
  0.682238	 -0.518690	  1.734755
  0.688323	 -0.505981	  1.748941
  0.694764	 -0.493537	  1.763149
  0.703817	 -0.483714	  1.777952
  0.713724	 -0.475181	  1.793051
  0.723730	 -0.466909	  1.808254
  0.735032	 -0.459759	  1.822888
  0.748238	 -0.455727	  1.837075
  0.761803	 -0.452418	  1.851288
  0.775673	 -0.450510	  1.865091
  0.788647	 -0.454679	  1.879150
  0.801751	 -0.459617	  1.893321
  0.814813	 -0.464725	  1.907243
  0.828455	 -0.471107	  1.919757
  0.841138	 -0.480281	  1.931725
  0.854310	 -0.490135	  1.943185
  0.865973	 -0.498700	  1.956726
  0.877897	 -0.506125	  1.967405
  0.894145	 -0.508309	  1.968641
  0.912115	 -0.505775	  1.963514
  0.925521	 -0.498354	  1.953363
  0.936614	 -0.493649	  1.937329
  0.945828	 -0.496886	  1.916015
  0.941248	 -0.492108	  1.885838
  0.935713	 -0.474896	  1.865160
  0.936718	 -0.455204	  1.853873
  0.947995	 -0.443194	  1.845643
  0.966183	 -0.436897	  1.832854
  0.982772	 -0.425799	  1.821683
  0.985851	 -0.407308	  1.802969
  0.986490	 -0.390078	  1.787932
  0.989061	 -0.374785	  1.779656
  1.003743	 -0.357094	  1.771006
  1.020184	 -0.347630	  1.759051
  1.036337	 -0.345673	  1.745090
  1.056517	 -0.339423	  1.736532
  1.075684	 -0.330756	  1.728248
  1.090490	 -0.325255	  1.719082
  1.104836	 -0.323632	  1.708898
  1.122957	 -0.326033	  1.697874
  1.142582	 -0.332217	  1.693727
  1.163046	 -0.334637	  1.692533
  1.183125	 -0.336876	  1.693405
  1.203034	 -0.339220	  1.694400
  1.222590	 -0.342851	  1.696397
  1.241979	 -0.347170	  1.698439
  1.261475	 -0.351166	  1.700777
  1.280832	 -0.354460	  1.704602
  1.300204	 -0.357634	  1.708337
  1.319767	 -0.360125	  1.711276
  1.339638	 -0.360635	  1.711957
  1.359582	 -0.361424	  1.712172
  1.379064	 -0.365723	  1.711316
  1.398474	 -0.370339	  1.710057
  1.417824	 -0.374966	  1.708230
  1.437207	 -0.379512	  1.706364
  1.456850	 -0.383170	  1.705638
  1.476681	 -0.385561	  1.706558
  1.496525	 -0.387843	  1.707526
  1.516351	 -0.390194	  1.707706
  1.536182	 -0.392572	  1.707098
  1.556033	 -0.394809	  1.706266
  1.575945	 -0.395631	  1.704884
  1.595875	 -0.396307	  1.703348
  1.615808	 -0.396843	  1.701839
  1.635757	 -0.396280	  1.700506
  1.655705	 -0.395590	  1.699262
  1.675669	 -0.395028	  1.698180
  1.695659	 -0.394750	  1.697416
  1.715646	 -0.394441	  1.696915
  1.735623	 -0.395273	  1.697042
  1.755590	 -0.396394	  1.697324
  1.775548	 -0.397626	  1.697742
  1.795423	 -0.399755	  1.698420
  1.815298	 -0.401884	  1.699098
