 -0.877485	 -2.900001	  0.030211
 -0.868797	 -2.871288	  0.029912
 -0.843736	 -2.839038	  0.063534
 -0.817968	 -2.808638	  0.097690
 -0.786958	 -2.776365	  0.123897
 -0.754673	 -2.749001	  0.153947
 -0.730930	 -2.723044	  0.190271
 -0.708308	 -2.698367	  0.227478
 -0.684596	 -2.673979	  0.263199
 -0.660581	 -2.649476	  0.298487
 -0.636577	 -2.624573	  0.333654
 -0.612489	 -2.598468	  0.368908
 -0.588253	 -2.570516	  0.404012
 -0.564864	 -2.540204	  0.438008
 -0.543811	 -2.507849	  0.469856
 -0.522508	 -2.474586	  0.500622
 -0.500823	 -2.443269	  0.530285
 -0.476657	 -2.415029	  0.559929
 -0.450296	 -2.388034	  0.589976
 -0.425800	 -2.361816	  0.622082
 -0.400532	 -2.336176	  0.656666
 -0.374588	 -2.311936	  0.691807
 -0.348053	 -2.287312	  0.727757
 -0.321910	 -2.260400	  0.764287
 -0.297830	 -2.231310	  0.799860
 -0.275822	 -2.200472	  0.834396
 -0.255746	 -2.168497	  0.867886
 -0.237054	 -2.134998	  0.900716
 -0.219797	 -2.100569	  0.931714
 -0.203137	 -2.064613	  0.961787
 -0.186964	 -2.027898	  0.990299
 -0.169792	 -1.989145	  1.018125
 -0.151036	 -1.949420	  1.044088
 -0.130753	 -1.910104	  1.068554
 -0.108310	 -1.872290	  1.093262
 -0.085090	 -1.837241	  1.118584
 -0.060824	 -1.802789	  1.147418
 -0.037442	 -1.771417	  1.178644
 -0.015004	 -1.742121	  1.212884
  0.006712	 -1.714744	  1.249544
  0.028748	 -1.688187	  1.286839
  0.051959	 -1.661427	  1.323376
  0.075835	 -1.635334	  1.358090
  0.100260	 -1.609484	  1.391366
  0.125561	 -1.583256	  1.423904
  0.151628	 -1.556518	  1.455705
  0.178274	 -1.529169	  1.486606
  0.205942	 -1.500271	  1.517525
  0.233418	 -1.470151	  1.547471
  0.260123	 -1.440474	  1.575984
  0.287342	 -1.410889	  1.604050
  0.316506	 -1.381134	  1.631687
  0.346910	 -1.352069	  1.657294
  0.374592	 -1.321121	  1.684004
  0.396954	 -1.286449	  1.712177
  0.417084	 -1.249877	  1.743639
  0.437398	 -1.215872	  1.776702
  0.456422	 -1.183896	  1.810530
  0.475563	 -1.154450	  1.845859
  0.496616	 -1.127654	  1.883437
  0.515876	 -1.100096	  1.922338
  0.533936	 -1.071886	  1.960029
  0.552228	 -1.045890	  1.997719
  0.571194	 -1.021548	  2.036632
  0.591189	 -0.998534	  2.076354
  0.614525	 -0.974267	  2.112869
  0.640607	 -0.949287	  2.146881
  0.667291	 -0.922264	  2.178640
  0.691791	 -0.891641	  2.208130
  0.715612	 -0.860600	  2.238188
  0.745700	 -0.833312	  2.268476
  0.774596	 -0.803505	  2.296645
  0.801968	 -0.774908	  2.327057
  0.827635	 -0.745071	  2.358814
  0.852281	 -0.713192	  2.391283
  0.876023	 -0.680751	  2.423291
  0.898991	 -0.648852	  2.454050
  0.921551	 -0.617906	  2.483485
  0.944235	 -0.587336	  2.512251
  0.967499	 -0.556455	  2.541074
  0.991303	 -0.525190	  2.570302
  1.015339	 -0.493969	  2.600174
  1.040313	 -0.463723	  2.629800
  1.059703	 -0.430749	  2.663055
  1.083276	 -0.409818	  2.701522
  1.105946	 -0.375936	  2.726426
  1.127324	 -0.349392	  2.758091
  1.138598	 -0.352886	  2.785672
