 -0.882942	  1.996796	 -1.162977
 -0.883478	  1.997296	 -1.163360
 -0.870519	  1.985206	 -1.154092
 -0.857565	  1.973105	 -1.144832
 -0.844924	  1.960445	 -1.135898
 -0.832701	  1.947101	 -1.127368
 -0.820480	  1.933807	 -1.118857
 -0.807775	  1.921574	 -1.109636
 -0.794803	  1.909311	 -1.100576
 -0.784306	  1.899241	 -1.088568
 -0.778842	  1.888681	 -1.071244
 -0.776493	  1.875761	 -1.053531
 -0.773117	  1.860661	 -1.035727
 -0.758984	  1.850783	 -1.026027
 -0.741933	  1.839181	 -1.018622
 -0.724441	  1.821332	 -1.006812
 -0.719626	  1.813549	 -1.000334
 -0.702062	  1.797649	 -0.990717
 -0.691431	  1.785007	 -0.981736
 -0.683533	  1.777610	 -0.975021
 -0.681047	  1.764027	 -0.958121
 -0.675201	  1.753743	 -0.946131
 -0.669968	  1.738683	 -0.929498
 -0.654336	  1.716839	 -0.918053
 -0.639736	  1.703303	 -0.911109
 -0.626796	  1.690315	 -0.901258
 -0.610095	  1.679249	 -0.891034
 -0.593832	  1.672583	 -0.884002
 -0.576861	  1.664252	 -0.877837
 -0.560795	  1.653660	 -0.868495
 -0.547159	  1.643332	 -0.857899
 -0.535114	  1.632869	 -0.847039
 -0.520726	  1.623362	 -0.836320
 -0.504687	  1.614855	 -0.827516
 -0.488624	  1.606857	 -0.819753
 -0.474763	  1.599265	 -0.810826
 -0.460621	  1.590641	 -0.801229
 -0.436153	  1.577737	 -0.786485
 -0.426084	  1.572005	 -0.775238
 -0.417071	  1.568220	 -0.765540
 -0.401803	  1.558831	 -0.744442
 -0.385181	  1.551252	 -0.733367
 -0.367034	  1.541925	 -0.732388
 -0.354318	  1.532747	 -0.731084
 -0.321411	  1.513771	 -0.740553
 -0.306543	  1.507887	 -0.742541
 -0.295933	  1.502985	 -0.737543
 -0.274233	  1.495021	 -0.730153
 -0.250118	  1.488340	 -0.726021
 -0.235088	  1.486382	 -0.726019
 -0.214872	  1.482957	 -0.726875
 -0.192326	  1.486975	 -0.720511
 -0.174025	  1.493663	 -0.711193
 -0.155650	  1.497645	 -0.703384
 -0.136566	  1.499413	 -0.697380
 -0.125742	  1.503905	 -0.687479
 -0.119369	  1.510155	 -0.669403
 -0.099161	  1.516332	 -0.656195
 -0.069103	  1.515266	 -0.641145
 -0.058163	  1.514002	 -0.632236
 -0.049173	  1.512691	 -0.621003
 -0.042472	  1.508302	 -0.605204
 -0.037369	  1.498567	 -0.587124
 -0.030549	  1.482632	 -0.570036
 -0.025748	  1.467448	 -0.557763
 -0.021068	  1.452466	 -0.547415
 -0.017795	  1.434304	 -0.536054
 -0.012626	  1.416634	 -0.526501
 -0.012051	  1.406442	 -0.520902
 -0.010850	  1.393540	 -0.512900
 -0.010822	  1.373563	 -0.502517
 -0.006901	  1.354423	 -0.493211
 -0.000195	  1.337977	 -0.482481
  0.005030	  1.319180	 -0.473377
  0.013235	  1.304063	 -0.462711
  0.020676	  1.287975	 -0.452551
  0.030681	  1.274686	 -0.441671
  0.036547	  1.262507	 -0.434019
  0.042614	  1.252086	 -0.424751
  0.051074	  1.236462	 -0.414010
  0.063948	  1.223645	 -0.403774
  0.079884	  1.213950	 -0.395474
  0.091836	  1.203629	 -0.385679
  0.102117	  1.192846	 -0.372032
  0.110567	  1.182106	 -0.356354
  0.120298	  1.173036	 -0.342889
  0.131536	  1.163293	 -0.331240
  0.148463	  1.152533	 -0.317607
  0.160946	  1.142251	 -0.305805
  0.171977	  1.132917	 -0.299345
  0.186632	  1.123564	 -0.290199
  0.206776	  1.110011	 -0.278167
  0.213753	  1.102051	 -0.270310
  0.225797	  1.093803	 -0.258019
  0.244344	  1.080573	 -0.244932
  0.254834	  1.068211	 -0.234685
  0.265876	  1.053632	 -0.224408
  0.276864	  1.042854	 -0.216051
  0.288854	  1.037450	 -0.208330
  0.301939	  1.026081	 -0.190672
  0.315512	  1.008440	 -0.173746
  0.320038	  1.004166	 -0.163468
  0.328853	  0.994174	 -0.145034
  0.335098	  0.984232	 -0.128503
  0.339871	  0.974510	 -0.116507
  0.348568	  0.965230	 -0.100622
  0.357484	  0.951162	 -0.089722
  0.366055	  0.940463	 -0.070886
  0.372499	  0.934091	 -0.056540
  0.380733	  0.926551	 -0.042246
  0.393128	  0.915878	 -0.017475
  0.403611	  0.898920	 -0.009377
  0.413486	  0.893408	  0.010841
  0.424519	  0.877829	  0.019576
  0.438308	  0.873136	  0.034942
  0.447593	  0.856725	  0.036724
  0.462675	  0.849059	  0.054751
  0.473079	  0.834766	  0.061295
  0.483869	  0.826220	  0.073476
  0.499064	  0.810395	  0.088458
  0.511851	  0.798984	  0.099527
  0.520221	  0.791379	  0.106035
  0.533981	  0.779248	  0.112998
  0.551605	  0.763418	  0.130308
  0.559350	  0.759061	  0.141150
  0.572740	  0.749735	  0.154130
  0.587074	  0.741192	  0.173269
  0.594036	  0.731930	  0.183993
  0.601834	  0.727260	  0.193311
  0.610648	  0.713296	  0.215277
  0.614815	  0.698184	  0.234653
  0.618914	  0.692774	  0.243498
  0.629341	  0.678429	  0.259383
  0.630447	  0.665508	  0.274885
  0.633627	  0.655700	  0.282287
  0.627488	  0.641557	  0.299893
  0.630443	  0.632889	  0.310186
  0.635248	  0.615497	  0.327117
  0.638336	  0.598147	  0.347129
  0.634603	  0.586822	  0.361934
  0.631340	  0.577642	  0.371474
  0.627021	  0.563943	  0.391902
  0.619778	  0.559351	  0.408985
  0.612885	  0.554484	  0.420654
  0.593666	  0.540856	  0.443813
  0.577813	  0.526552	  0.457965
  0.567176	  0.518495	  0.462647
  0.557364	  0.510236	  0.467976
  0.546241	  0.498167	  0.483765
  0.535728	  0.485689	  0.497517
  0.525850	  0.469248	  0.507341
  0.516840	  0.454078	  0.515179
  0.509461	  0.434750	  0.522390
  0.501521	  0.419294	  0.527166
  0.495472	  0.402613	  0.535659
  0.497467	  0.382577	  0.549287
  0.507720	  0.362811	  0.564154
  0.514417	  0.352341	  0.576397
  0.516447	  0.345775	  0.588210
  0.528378	  0.336079	  0.603133
  0.535165	  0.321618	  0.616068
  0.540667	  0.311537	  0.621951
  0.552869	  0.295385	  0.627244
  0.564396	  0.284836	  0.634214
  0.586528	  0.275932	  0.639440
  0.608545	  0.261945	  0.644599
  0.619752	  0.251761	  0.649608
  0.635628	  0.242925	  0.654534
  0.658474	  0.233825	  0.659579
  0.674615	  0.230109	  0.663358
  0.696607	  0.226281	  0.667502
  0.713309	  0.226054	  0.671106
  0.732016	  0.226621	  0.671178
  0.757160	  0.227628	  0.670311
  0.776515	  0.226631	  0.666433
  0.793245	  0.226780	  0.664235
  0.810570	  0.229043	  0.660363
  0.827758	  0.228280	  0.657869
  0.851395	  0.226262	  0.660492
  0.873309	  0.225453	  0.665646
  0.893789	  0.233337	  0.668403
  0.912627	  0.242966	  0.666207
  0.927704	  0.251593	  0.662984
  0.942577	  0.258631	  0.660125
  0.958346	  0.265037	  0.660752
  0.976839	  0.271974	  0.662049
  0.994419	  0.279563	  0.665065
  1.009556	  0.285233	  0.668644
  1.023509	  0.292217	  0.672240
  1.041273	  0.291664	  0.680486
  1.053732	  0.294443	  0.686990
  1.070004	  0.290299	  0.697006
  1.085859	  0.283759	  0.708485
  1.099454	  0.280396	  0.720773
  1.113846	  0.270795	  0.732037
  1.126936	  0.264361	  0.745637
  1.139837	  0.258276	  0.759738
  1.152697	  0.250049	  0.772609
  1.166665	  0.242764	  0.785394
  1.178776	  0.235621	  0.797157
  1.193200	  0.222355	  0.809691
  1.203421	  0.213082	  0.821219
  1.215221	  0.204103	  0.832112
  1.230614	  0.193502	  0.845432
  1.243121	  0.184393	  0.857663
  1.255448	  0.177849	  0.869686
  1.270404	  0.168055	  0.885330
  1.282171	  0.158612	  0.901057
  1.295546	  0.145689	  0.913071
  1.308684	  0.136594	  0.918398
  1.322596	  0.129107	  0.927545
  1.337262	  0.119059	  0.937580
  1.355350	  0.107605	  0.946224
  1.374986	  0.098782	  0.954104
  1.391431	  0.092074	  0.963935
  1.406075	  0.083460	  0.972600
  1.420747	  0.071809	  0.981150
  1.432047	  0.062845	  0.988886
  1.445897	  0.052990	  1.001276
  1.458402	  0.042580	  1.013142
  1.473093	  0.027976	  1.021489
  1.484571	  0.011292	  1.028628
  1.491743	 -0.005393	  1.034508
  1.496959	 -0.023031	  1.042175
  1.505737	 -0.040951	  1.049732
  1.516996	 -0.052845	  1.059409
  1.532058	 -0.064674	  1.075762
  1.543849	 -0.074284	  1.089883
  1.558083	 -0.087443	  1.105954
  1.563415	 -0.094325	  1.110736
  1.577517	 -0.113414	  1.121875
  1.583362	 -0.123138	  1.129183
  1.593380	 -0.135461	  1.141002
  1.608059	 -0.153108	  1.159452
  1.617405	 -0.163577	  1.170831
  1.622725	 -0.170095	  1.180345
  1.631371	 -0.179857	  1.198808
  1.640101	 -0.190038	  1.216096
  1.645873	 -0.200250	  1.231126
  1.663802	 -0.217442	  1.255513
  1.669161	 -0.223140	  1.262728
  1.674326	 -0.227327	  1.268218
  1.686773	 -0.240548	  1.287124
  1.701157	 -0.252142	  1.307099
  1.706119	 -0.255442	  1.314029
  1.720884	 -0.263498	  1.332849
  1.734871	 -0.271407	  1.353263
  1.745642	 -0.279228	  1.367501
  1.753582	 -0.285519	  1.375289
  1.767171	 -0.294410	  1.389464
  1.777375	 -0.307173	  1.404686
  1.785701	 -0.321292	  1.416057
  1.795007	 -0.334444	  1.427712
  1.812598	 -0.347522	  1.443894
  1.828639	 -0.351766	  1.453582
  1.844556	 -0.354678	  1.462208
  1.865536	 -0.361546	  1.476676
  1.876835	 -0.370440	  1.488340
  1.884662	 -0.381595	  1.497329
  1.892969	 -0.394807	  1.510013
  1.909220	 -0.409237	  1.522849
  1.925124	 -0.419132	  1.532458
  1.942794	 -0.429727	  1.530545
  1.956836	 -0.440505	  1.539854
