  0.910847	  1.921450	  1.323885
  0.895555	  1.927248	  1.316699
  0.892846	  1.928275	  1.315426
  0.875299	  1.933720	  1.307561
  0.854691	  1.937498	  1.300066
  0.839056	  1.946106	  1.296433
  0.823276	  1.954053	  1.289895
  0.800958	  1.960138	  1.280113
  0.782792	  1.966343	  1.274550
  0.770247	  1.968293	  1.267656
  0.750378	  1.972424	  1.258162
  0.732342	  1.976594	  1.248829
  0.715032	  1.980460	  1.239161
  0.699298	  1.981386	  1.226907
  0.683982	  1.980947	  1.213970
  0.669671	  1.981174	  1.199312
  0.657178	  1.983556	  1.183393
  0.645553	  1.987101	  1.167459
  0.632145	  1.990527	  1.153095
  0.617196	  1.992466	  1.140063
  0.601496	  1.995772	  1.127568
  0.587967	  2.002205	  1.113697
  0.576332	  2.005170	  1.098796
  0.561239	  2.008877	  1.086504
  0.543752	  2.016018	  1.076003
  0.531167	  2.025078	  1.063953
  0.517979	  2.031258	  1.051221
  0.502966	  2.037770	  1.038955
  0.487787	  2.048593	  1.028152
  0.474521	  2.058665	  1.016608
  0.460586	  2.063026	  1.006245
  0.443392	  2.069633	  0.996356
  0.424946	  2.078092	  0.989120
  0.411465	  2.086616	  0.978352
  0.396849	  2.093149	  0.965348
  0.379025	  2.097684	  0.957662
  0.361774	  2.105742	  0.949818
  0.345452	  2.116205	  0.940059
  0.331423	  2.122546	  0.929455
  0.317188	  2.127092	  0.916613
  0.301010	  2.132206	  0.903723
  0.284168	  2.134415	  0.893983
  0.267254	  2.138853	  0.883849
  0.250925	  2.144263	  0.873265
  0.234962	  2.149871	  0.862582
  0.219275	  2.156017	  0.851910
  0.204582	  2.162297	  0.840767
  0.190866	  2.169700	  0.829303
  0.173750	  2.180061	  0.818730
  0.157652	  2.186222	  0.810240
  0.141916	  2.190534	  0.799875
  0.124107	  2.196587	  0.789591
  0.110396	  2.206495	  0.780630
  0.097152	  2.217065	  0.770307
  0.080333	  2.227648	  0.760579
  0.064386	  2.232970	  0.751769
  0.048139	  2.237528	  0.740698
  0.032327	  2.244815	  0.730452
  0.018844	  2.253089	  0.719059
  0.005287	  2.260676	  0.706697
 -0.014111	  2.269320	  0.696930
 -0.026969	  2.273866	  0.687528
 -0.041477	  2.279590	  0.673726
 -0.055251	  2.284788	  0.659671
 -0.069946	  2.289605	  0.646499
 -0.084703	  2.293263	  0.633498
 -0.099456	  2.296920	  0.620498
 -0.114401	  2.300186	  0.607615
 -0.129411	  2.303317	  0.594774
 -0.144421	  2.306447	  0.581933
 -0.160506	  2.309826	  0.570537
 -0.176704	  2.313231	  0.559311
 -0.192971	  2.316661	  0.548192
 -0.209890	  2.320326	  0.538177
 -0.226519	  2.323928	  0.528347
 -0.243406	  2.328269	  0.518612
 -0.259516	  2.332923	  0.509782
 -0.280678	  2.339148	  0.498466
 -0.293238	  2.342856	  0.490330
 -0.310856	  2.349419	  0.480949
 -0.327994	  2.355606	  0.472151
 -0.344755	  2.362097	  0.464788
 -0.363472	  2.368714	  0.457903
 -0.379595	  2.373979	  0.449086
 -0.396340	  2.380269	  0.440825
 -0.414955	  2.386872	  0.433592
 -0.432378	  2.394479	  0.427952
 -0.450044	  2.402321	  0.419522
 -0.467661	  2.410141	  0.408140
 -0.496397	  2.418701	  0.391758
 -0.499155	  2.419276	  0.390317
