 0.0 0.0 0.0 0
 0.405284350234892 -0.2545965341442378 0.01429163646765563 1000
 0.43652579787702944 -0.8970517825739017 -0.46895890819330105 1000
 0.4173226770779739 0.8562083719188862 0.5332260682821747 1000
 -0.6379538481854575 -0.17262826187991903 0.00587011485071165 1000
 -0.8298537464393303 -0.2909339425745438 -0.26313477680729047 1000
 -0.719365925308197 0.6475921948009435 0.373794403979203 1000
 -0.3118372563147707 0.041763348121878624 0.1660386586392689 1000
 -0.663771490152775 -0.7466894047049912 -0.4387116438919939 1000
 0.0 0.0 0.0 0
 -0.3016863319981866 -0.42092147987857664 -0.10321074446733723 1000
 -0.17923812865818758 0.9673980904747111 0.4975254942123499 1000
 -0.8643147962825546 0.4402352972622567 0.25382697252232844 1000
 0.21109021698560176 0.6302042805804019 0.2328115564249263 1000
 -0.5140042519632978 0.029402691133545433 -0.13832596106926237 1000
 0.8171549962126464 0.5725417019754845 0.350821964234426 1000
 -0.19805500955664634 -0.938403954983821 -0.5681122795433426 1000
 -0.19329867439231174 0.5738313154207979 0.18116246445499254 1000
 0.0 0.0 0.0 0
 0.49917090398372144 -0.8303356628878069 -0.4805980099964354 1000
 0.4635197847826976 -0.433360963100698 -0.3480114387359734 1000
 0.7178553273123691 -0.6896983512417953 -0.34080848664524377 1000
 -0.23681164857243234 0.21783977502853705 -0.04028700474335943 1000
 -0.2668817942899564 0.8491452597317859 0.5316940165115523 1000
 0.24578435253701725 -0.7243036188704055 -0.2866353336773451 1000
 -0.28230052766696445 -0.9499808544933432 -0.5099150435331544 1000
 0.7728716031939683 0.056702327323782054 -0.04619153398279627 1000
 0.0 0.0 0.0 0
