  0.283390	 -2.097988	  1.192174
  0.316566	 -2.119131	  1.202188
  0.349742	 -2.140274	  1.212202
  0.335656	 -2.127628	  1.208583
  0.322500	 -2.112298	  1.206734
  0.307900	 -2.098603	  1.200430
  0.289778	 -2.091722	  1.189720
  0.270480	 -2.083923	  1.183672
  0.253950	 -2.074499	  1.177197
  0.243072	 -2.057006	  1.167820
  0.241109	 -2.036699	  1.159354
  0.239364	 -2.017723	  1.148504
  0.228155	 -2.001762	  1.138149
  0.208726	 -1.991339	  1.134487
  0.186874	 -1.981895	  1.131086
  0.162466	 -1.976465	  1.134469
  0.141637	 -1.968850	  1.141042
  0.119192	 -1.960001	  1.143037
  0.103463	 -1.951253	  1.137626
  0.089191	 -1.940514	  1.129630
  0.078027	 -1.927789	  1.119245
  0.067917	 -1.916826	  1.106481
  0.056868	 -1.905951	  1.094048
  0.038711	 -1.892736	  1.086208
  0.015576	 -1.879572	  1.085643
 -0.000855	 -1.871016	  1.085792
 -0.020331	 -1.859610	  1.082919
 -0.036865	 -1.846908	  1.079013
 -0.047237	 -1.837808	  1.080822
 -0.062118	 -1.823815	  1.088013
 -0.078001	 -1.811255	  1.093526
 -0.091809	 -1.799757	  1.096688
 -0.118763	 -1.779345	  1.098531
 -0.129087	 -1.771359	  1.099277
 -0.151051	 -1.761041	  1.099677
 -0.168641	 -1.753858	  1.096474
 -0.183472	 -1.751182	  1.090738
 -0.202777	 -1.747371	  1.082834
 -0.225251	 -1.743723	  1.082770
 -0.244449	 -1.736039	  1.081032
 -0.261422	 -1.728904	  1.080660
 -0.275871	 -1.727570	  1.085505
 -0.304228	 -1.718463	  1.089205
 -0.323102	 -1.705149	  1.086392
 -0.336674	 -1.697394	  1.085726
 -0.351705	 -1.689172	  1.083524
 -0.378561	 -1.673729	  1.077119
 -0.397356	 -1.664784	  1.072159
 -0.406072	 -1.659893	  1.070192
 -0.432515	 -1.649743	  1.061994
 -0.450233	 -1.645275	  1.053901
 -0.462463	 -1.643714	  1.047403
 -0.486346	 -1.645741	  1.033588
 -0.507250	 -1.645583	  1.026002
 -0.521329	 -1.642282	  1.023071
 -0.540404	 -1.635876	  1.020026
 -0.558275	 -1.626247	  1.015954
 -0.578328	 -1.614378	  1.009278
 -0.594651	 -1.607685	  1.002891
 -0.604446	 -1.601734	  1.000057
 -0.625435	 -1.592742	  0.989702
 -0.649327	 -1.582352	  0.986333
 -0.659829	 -1.579952	  0.984998
 -0.681617	 -1.569581	  0.982134
 -0.702461	 -1.558319	  0.979497
 -0.721088	 -1.547322	  0.977285
 -0.732613	 -1.540018	  0.975616
 -0.746562	 -1.527485	  0.968161
 -0.757668	 -1.516828	  0.962848
 -0.776175	 -1.501816	  0.960132
 -0.794757	 -1.491325	  0.957700
 -0.810052	 -1.481720	  0.952277
 -0.829661	 -1.467996	  0.941542
 -0.846780	 -1.457229	  0.935308
 -0.855801	 -1.450510	  0.933698
 -0.874353	 -1.441079	  0.938262
 -0.895907	 -1.433265	  0.939064
 -0.913129	 -1.421886	  0.937963
 -0.930230	 -1.411691	  0.934792
 -0.946805	 -1.400971	  0.932468
 -0.964166	 -1.391909	  0.929732
 -0.981172	 -1.381325	  0.929036
 -0.998446	 -1.371113	  0.928958
 -1.016119	 -1.361810	  0.928802
 -1.033184	 -1.351235	  0.930166
 -1.051036	 -1.341023	  0.931234
 -1.069286	 -1.331619	  0.931575
 -1.087664	 -1.323006	  0.930662
 -1.106204	 -1.314608	  0.928152
 -1.124638	 -1.306665	  0.923506
 -1.142713	 -1.298911	  0.918687
 -1.161314	 -1.293963	  0.912654
 -1.179667	 -1.287543	  0.906828
 -1.196487	 -1.280828	  0.900218
 -1.209912	 -1.268206	  0.894925
 -1.228329	 -1.258301	  0.887729
 -1.248675	 -1.252141	  0.879265
 -1.259070	 -1.244822	  0.876499
 -1.272728	 -1.227465	  0.870009
 -1.296746	 -1.212556	  0.861730
 -1.306820	 -1.208049	  0.859922
 -1.326456	 -1.197732	  0.856216
 -1.337512	 -1.185707	  0.850788
 -1.353383	 -1.167386	  0.837608
 -1.368387	 -1.151797	  0.816876
 -1.375111	 -1.148563	  0.806876
 -1.383931	 -1.141105	  0.791848
 -1.406769	 -1.132087	  0.764698
 -1.414466	 -1.126888	  0.757726
 -1.421361	 -1.121766	  0.753323
 -1.433518	 -1.110046	  0.745909
 -1.448929	 -1.092358	  0.740228
 -1.466437	 -1.070572	  0.737789
 -1.479355	 -1.053433	  0.732943
 -1.490624	 -1.039204	  0.725308
 -1.503264	 -1.027884	  0.719295
 -1.514973	 -1.018996	  0.710304
 -1.538662	 -1.009614	  0.699082
 -1.564001	 -1.004829	  0.696115
 -1.579348	 -1.002785	  0.695757
 -1.593553	 -0.999108	  0.694398
 -1.615413	 -0.995150	  0.689553
 -1.643695	 -0.992935	  0.682582
 -1.659669	 -0.992330	  0.677100
 -1.676228	 -0.983891	  0.667802
 -1.693699	 -0.972050	  0.660370
 -1.707772	 -0.960216	  0.653545
 -1.723151	 -0.949665	  0.648675
 -1.735059	 -0.941293	  0.648233
 -1.755838	 -0.929206	  0.651510
 -1.776918	 -0.922961	  0.650172
 -1.796929	 -0.915031	  0.647385
 -1.814883	 -0.906353	  0.646154
 -1.832249	 -0.896123	  0.644395
 -1.848000	 -0.885843	  0.640932
 -1.863926	 -0.876983	  0.635036
 -1.885988	 -0.873342	  0.628948
 -1.906222	 -0.875795	  0.622072
 -1.922937	 -0.873804	  0.612077
 -1.937315	 -0.865345	  0.602373
 -1.952644	 -0.846186	  0.598713
 -1.969613	 -0.839558	  0.596630
 -1.995480	 -0.833596	  0.586499
 -2.009803	 -0.826515	  0.579627
 -2.021005	 -0.821277	  0.573882
 -2.041399	 -0.814674	  0.571017
 -2.062063	 -0.801624	  0.577759
 -2.083023	 -0.778561	  0.579654
 -2.090034	 -0.767495	  0.577064
 -2.101778	 -0.755638	  0.572634
 -2.120364	 -0.746427	  0.567808
 -2.137971	 -0.737112	  0.561709
 -2.151412	 -0.727360	  0.555447
 -2.161670	 -0.710951	  0.548740
 -2.181789	 -0.689425	  0.549727
 -2.199601	 -0.673304	  0.552439
 -2.207734	 -0.669345	  0.551979
 -2.227195	 -0.654803	  0.550526
 -2.243878	 -0.646496	  0.543608
 -2.258547	 -0.629983	  0.535810
 -2.273213	 -0.612932	  0.531931
 -2.285888	 -0.601353	  0.530653
 -2.301047	 -0.595822	  0.533924
 -2.322955	 -0.587822	  0.538115
 -2.340176	 -0.575403	  0.536872
 -2.355888	 -0.563137	  0.534530
 -2.371421	 -0.550794	  0.531637
 -2.382649	 -0.541633	  0.528788
 -2.386729	 -0.538304	  0.527753
