  0.256883	 -3.018797	 -0.042131
  0.254339	 -2.988908	 -0.041714
  0.270416	 -2.938254	 -0.043452
  0.289742	 -2.892465	 -0.052122
  0.304438	 -2.845108	 -0.056262
  0.314484	 -2.796594	 -0.063312
  0.330670	 -2.749964	 -0.072796
  0.344373	 -2.703041	 -0.084065
  0.361212	 -2.656996	 -0.090615
  0.374782	 -2.610788	 -0.100155
  0.392552	 -2.564765	 -0.107685
  0.407159	 -2.517580	 -0.114342
  0.424893	 -2.470065	 -0.113263
  0.445371	 -2.424027	 -0.116892
  0.466805	 -2.379117	 -0.123868
  0.488206	 -2.334806	 -0.133909
  0.508495	 -2.290996	 -0.147058
  0.526762	 -2.247715	 -0.163728
  0.543648	 -2.203620	 -0.182791
  0.559509	 -2.158504	 -0.202094
  0.573049	 -2.112580	 -0.219258
  0.585537	 -2.065885	 -0.233128
  0.597585	 -2.018135	 -0.244781
  0.610113	 -1.968817	 -0.254104
  0.622423	 -1.920951	 -0.261353
  0.634406	 -1.874892	 -0.268048
  0.646517	 -1.829385	 -0.275096
  0.659351	 -1.783610	 -0.283153
  0.675648	 -1.737259	 -0.292051
  0.696467	 -1.691656	 -0.299361
  0.718011	 -1.645513	 -0.304628
  0.741339	 -1.598922	 -0.305494
  0.764401	 -1.553299	 -0.304084
  0.785298	 -1.507507	 -0.304048
  0.804289	 -1.461775	 -0.308053
  0.821033	 -1.416780	 -0.318225
  0.833740	 -1.376381	 -0.335411
  0.841905	 -1.342493	 -0.359338
  0.846581	 -1.306856	 -0.401516
  0.840720	 -1.262817	 -0.492069
  0.807321	 -1.210735	 -0.615968
  0.777136	 -1.141238	 -0.682344
  0.775264	 -1.094330	 -0.693090
  0.783357	 -1.065675	 -0.685978
  0.805308	 -1.030775	 -0.658700
  0.848724	 -0.977372	 -0.589982
  0.897563	 -0.904807	 -0.492639
  0.930550	 -0.839090	 -0.422908
  0.951847	 -0.786886	 -0.391127
  0.970286	 -0.736548	 -0.385372
  0.991077	 -0.688959	 -0.398226
  1.009644	 -0.645874	 -0.415420
  1.026856	 -0.603919	 -0.432289
  1.043452	 -0.560608	 -0.448320
  1.057761	 -0.512381	 -0.453592
  1.064867	 -0.462484	 -0.450413
  1.078916	 -0.414536	 -0.448520
  1.100231	 -0.368464	 -0.451009
  1.118550	 -0.321681	 -0.456495
  1.134898	 -0.274264	 -0.464274
  1.150011	 -0.226526	 -0.473437
  1.164079	 -0.178351	 -0.483161
  1.176857	 -0.130128	 -0.493317
  1.187659	 -0.083026	 -0.503388
  1.196799	 -0.029851	 -0.514288
  1.191321	  0.040063	 -0.529136
  1.123429	  0.105500	 -0.545861
  1.083014	  0.144591	 -0.561550
  1.083899	  0.146915	 -0.562078
  1.136957	  0.164266	 -0.554020
  1.228660	  0.213783	 -0.549279
  1.278741	  0.283496	 -0.559274
  1.299662	  0.340322	 -0.575461
  1.312226	  0.388548	 -0.590760
  1.322966	  0.435519	 -0.606314
  1.333464	  0.482659	 -0.622093
  1.344595	  0.530818	 -0.637810
  1.357203	  0.579275	 -0.652516
  1.372050	  0.624497	 -0.664025
  1.390326	  0.670204	 -0.671654
  1.409413	  0.715816	 -0.674987
  1.427572	  0.761224	 -0.675996
  1.444907	  0.808321	 -0.676913
  1.461201	  0.854551	 -0.679916
  1.477731	  0.901835	 -0.686820
  1.497231	  0.946749	 -0.693648
  1.521269	  0.989149	 -0.699073
  1.541699	  1.034701	 -0.703511
  1.559623	  1.081698	 -0.705650
  1.575599	  1.128510	 -0.703313
  1.595206	  1.174580	 -0.705057
  1.612527	  1.222103	 -0.710924
  1.626339	  1.269873	 -0.720074
  1.639281	  1.317640	 -0.730961
  1.652103	  1.364907	 -0.742576
  1.664221	  1.412147	 -0.753997
  1.675251	  1.459908	 -0.765077
  1.685301	  1.508359	 -0.775201
  1.694501	  1.556779	 -0.784019
  1.703020	  1.604295	 -0.791436
  1.711068	  1.651803	 -0.797287
  1.719578	  1.699968	 -0.800945
  1.731530	  1.750179	 -0.803740
  1.747131	  1.797321	 -0.807056
  1.766266	  1.842964	 -0.810290
  1.790442	  1.888456	 -0.815355
  1.815212	  1.933161	 -0.824963
  1.837417	  1.975930	 -0.836725
  1.858652	  2.017687	 -0.847327
  1.880629	  2.061872	 -0.852752
  1.893249	  2.110216	 -0.861851
  1.891566	  2.153981	 -0.884501
  1.910482	  2.175521	 -0.893346
