 -2.475316	  0.066992	 -0.504836
 -2.499941	  0.054486	 -0.498112
 -2.482621	  0.063289	 -0.502858
 -2.465480	  0.072176	 -0.508075
 -2.448339	  0.081062	 -0.513293
 -2.431331	  0.090182	 -0.518542
 -2.414413	  0.099456	 -0.523811
 -2.397495	  0.108731	 -0.529081
 -2.380239	  0.117829	 -0.533489
 -2.362968	  0.126919	 -0.537859
 -2.345713	  0.136101	 -0.542095
 -2.328500	  0.145506	 -0.546002
 -2.311287	  0.154911	 -0.549908
 -2.294438	  0.165062	 -0.553523
 -2.277782	  0.175577	 -0.556992
 -2.261126	  0.186091	 -0.560460
 -2.244470	  0.196970	 -0.562515
 -2.227823	  0.207901	 -0.564354
 -2.211175	  0.218831	 -0.566193
 -2.193993	  0.229026	 -0.567113
 -2.176792	  0.239191	 -0.567998
 -2.159549	  0.249182	 -0.569693
 -2.142296	  0.259030	 -0.572001
 -2.125123	  0.268937	 -0.574642
 -2.108083	  0.278926	 -0.577777
 -2.091042	  0.288915	 -0.580913
 -2.074011	  0.298867	 -0.584215
 -2.056980	  0.308816	 -0.587528
 -2.039776	  0.318514	 -0.590686
 -2.022304	  0.327801	 -0.593595
 -2.004832	  0.337088	 -0.596504
 -1.987185	  0.346038	 -0.599421
 -1.969515	  0.354940	 -0.602340
 -1.951833	  0.363857	 -0.605139
 -1.934125	  0.372815	 -0.607624
 -1.916417	  0.381773	 -0.610109
 -1.898652	  0.390723	 -0.612185
 -1.880848	  0.399664	 -0.613946
 -1.863045	  0.408604	 -0.615708
 -1.845017	  0.417136	 -0.617196
 -1.826985	  0.425659	 -0.618678
 -1.808758	  0.433779	 -0.620036
 -1.790189	  0.441123	 -0.621155
 -1.771620	  0.448468	 -0.622274
 -1.752948	  0.455611	 -0.622836
 -1.734229	  0.462649	 -0.623118
 -1.715537	  0.469756	 -0.623411
 -1.697874	  0.479113	 -0.624094
 -1.680211	  0.488471	 -0.624778
 -1.662653	  0.497566	 -0.627775
 -1.645113	  0.506634	 -0.630958
 -1.627089	  0.514115	 -0.635336
 -1.609034	  0.521463	 -0.639809
 -1.591749	  0.530613	 -0.643997
 -1.574858	  0.540526	 -0.648046
 -1.557944	  0.550425	 -0.652038
 -1.540924	  0.560254	 -0.655742
 -1.523904	  0.570082	 -0.659447
 -1.506539	  0.579369	 -0.662940
 -1.488689	  0.587816	 -0.666105
 -1.470838	  0.596262	 -0.669271
 -1.452862	  0.604560	 -0.672095
 -1.434790	  0.612739	 -0.674650
 -1.416719	  0.620918	 -0.677204
 -1.398818	  0.629668	 -0.678932
 -1.380953	  0.638523	 -0.680506
 -1.363248	  0.647716	 -0.681920
 -1.345926	  0.657658	 -0.682971
 -1.328604	  0.667601	 -0.684022
 -1.311409	  0.677752	 -0.685145
 -1.294238	  0.687944	 -0.686283
 -1.276930	  0.697859	 -0.687732
 -1.259434	  0.707362	 -0.689635
 -1.241931	  0.716839	 -0.691587
 -1.224294	  0.725801	 -0.694521
 -1.206656	  0.734763	 -0.697455
 -1.189198	  0.743710	 -0.701347
 -1.171790	  0.752649	 -0.705477
 -1.154664	  0.761966	 -0.709936
 -1.137697	  0.771487	 -0.714573
 -1.120828	  0.781209	 -0.719145
 -1.104128	  0.791269	 -0.723606
 -1.087428	  0.801330	 -0.728067
 -1.070416	  0.811144	 -0.731843
 -1.053330	  0.820895	 -0.735451
 -1.036241	  0.830663	 -0.738992
 -1.019122	  0.840575	 -0.741938
 -1.002003	  0.850488	 -0.744884
 -0.984854	  0.860404	 -0.747639
 -0.967676	  0.870324	 -0.750188
 -0.950497	  0.880244	 -0.752736
 -0.933021	  0.889511	 -0.755687
 -0.915519	  0.898717	 -0.758675
 -0.897892	  0.907566	 -0.761989
 -0.880112	  0.915921	 -0.765743
 -0.862331	  0.924267	 -0.769506
 -0.844501	  0.932348	 -0.773601
 -0.826670	  0.940429	 -0.777697
 -0.808864	  0.948637	 -0.781640
 -0.791076	  0.956940	 -0.785467
 -0.773336	  0.965330	 -0.789328
 -0.756062	  0.974511	 -0.793491
 -0.738789	  0.983692	 -0.797654
 -0.721929	  0.993495	 -0.802088
 -0.705288	  1.003605	 -0.806657
 -0.688830	  1.014025	 -0.811189
 -0.672909	  1.025294	 -0.815610
 -0.656988	  1.036563	 -0.820030
 -0.642055	  1.049341	 -0.823736
 -0.627143	  1.062148	 -0.827424
 -0.613503	  1.076567	 -0.829886
 -0.600373	  1.091525	 -0.831843
 -0.588166	  1.107331	 -0.832936
 -0.576894	  1.123838	 -0.833606
 -0.566360	  1.140835	 -0.833952
 -0.555826	  1.157833	 -0.834297
 -0.547708	  1.176028	 -0.836037
 -0.539709	  1.194270	 -0.837842
 -0.532108	  1.212651	 -0.839930
 -0.527893	  1.231717	 -0.844258
 -0.523678	  1.250783	 -0.848585
 -0.519463	  1.269849	 -0.852912
 -0.515248	  1.288915	 -0.857239
 -0.511164	  1.308257	 -0.860267
 -0.507488	  1.327914	 -0.859960
 -0.503813	  1.347571	 -0.859652
 -0.500137	  1.367228	 -0.859344
 -0.496462	  1.386885	 -0.859037
 -0.490120	  1.405812	 -0.857794
 -0.483219	  1.424529	 -0.856352
 -0.476318	  1.443245	 -0.854911
 -0.469117	  1.461829	 -0.853245
 -0.458476	  1.478193	 -0.848885
 -0.447836	  1.494556	 -0.844525
 -0.437195	  1.510920	 -0.840165
 -0.426554	  1.527284	 -0.835805
 -0.415914	  1.543648	 -0.831446
 -0.405142	  1.559901	 -0.826997
 -0.390491	  1.571429	 -0.819755
 -0.375839	  1.582957	 -0.812513
 -0.361188	  1.594485	 -0.805271
 -0.346537	  1.606012	 -0.798030
 -0.331885	  1.617540	 -0.790788
 -0.317234	  1.629068	 -0.783546
 -0.301972	  1.638379	 -0.774581
 -0.286433	  1.645585	 -0.764255
 -0.270894	  1.652791	 -0.753929
 -0.255355	  1.659997	 -0.743603
 -0.239817	  1.667203	 -0.733277
 -0.221953	  1.676037	 -0.731592
 -0.204057	  1.684957	 -0.731179
 -0.186160	  1.693876	 -0.730766
 -0.169411	  1.699456	 -0.740164
 -0.152727	  1.704959	 -0.749722
 -0.136043	  1.710462	 -0.759280
 -0.119456	  1.714356	 -0.769755
 -0.103116	  1.716565	 -0.781074
 -0.086777	  1.718774	 -0.792393
 -0.070437	  1.720983	 -0.803713
 -0.054189	  1.720350	 -0.815358
 -0.037942	  1.719708	 -0.827004
 -0.021527	  1.718831	 -0.838397
 -0.004392	  1.716836	 -0.848515
  0.012744	  1.714841	 -0.858633
  0.029880	  1.712846	 -0.868751
  0.044822	  1.709405	 -0.881592
  0.058438	  1.705272	 -0.895647
  0.072054	  1.701140	 -0.909702
  0.085670	  1.697008	 -0.923756
  0.099286	  1.692876	 -0.937811
  0.112902	  1.688744	 -0.951865
  0.124422	  1.684687	 -0.967703
  0.131470	  1.680972	 -0.986048
  0.138518	  1.677258	 -1.004393
  0.145565	  1.673544	 -1.022737
  0.152613	  1.669830	 -1.041082
  0.159661	  1.666116	 -1.059427
  0.166709	  1.662402	 -1.077772
  0.173757	  1.658687	 -1.096117
  0.177598	  1.652848	 -1.114856
  0.180264	  1.646304	 -1.133566
  0.182930	  1.639761	 -1.152276
  0.185596	  1.633217	 -1.170986
  0.188262	  1.626673	 -1.189697
  0.185522	  1.618200	 -1.207604
  0.182356	  1.609601	 -1.225382
  0.179190	  1.601002	 -1.243159
  0.175788	  1.592616	 -1.260995
  0.170818	  1.585724	 -1.279100
  0.165848	  1.578832	 -1.297205
  0.163012	  1.573117	 -1.316160
  0.169337	  1.573211	 -1.335134
  0.175662	  1.573305	 -1.354107
  0.181987	  1.573399	 -1.373080
  0.188313	  1.573493	 -1.392053
  0.204908	  1.579221	 -1.401633
  0.222734	  1.585946	 -1.407716
  0.240560	  1.592672	 -1.413799
  0.258386	  1.599398	 -1.419882
  0.276212	  1.606124	 -1.425964
  0.294038	  1.612849	 -1.432047
  0.312938	  1.619328	 -1.432961
  0.331120	  1.624708	 -1.426601
  0.349303	  1.630088	 -1.420241
  0.367485	  1.635467	 -1.413881
  0.385668	  1.640847	 -1.407521
  0.403851	  1.646227	 -1.401161
  0.422033	  1.651607	 -1.394801
  0.439913	  1.656807	 -1.387502
  0.452394	  1.659545	 -1.372115
  0.464874	  1.662283	 -1.356729
  0.477355	  1.665021	 -1.341343
  0.489836	  1.667760	 -1.325957
  0.502317	  1.670498	 -1.310571
  0.514797	  1.673236	 -1.295185
  0.527278	  1.675974	 -1.279799
  0.539759	  1.678712	 -1.264413
  0.552240	  1.681451	 -1.249026
  0.561449	  1.681728	 -1.231275
  0.570531	  1.681916	 -1.213457
  0.579612	  1.682105	 -1.195639
  0.588694	  1.682293	 -1.177821
  0.597776	  1.682481	 -1.160003
  0.606858	  1.682669	 -1.142184
  0.615940	  1.682858	 -1.124366
  0.625119	  1.682830	 -1.106597
  0.634625	  1.682051	 -1.089018
  0.650808	  1.684812	 -1.077595
  0.668902	  1.691796	 -1.082478
  0.686322	  1.700177	 -1.087607
  0.703676	  1.708682	 -1.092756
  0.720808	  1.717949	 -1.097298
  0.737757	  1.727739	 -1.101402
  0.754676	  1.737613	 -1.105438
  0.771280	  1.748234	 -1.108830
  0.787883	  1.758854	 -1.112222
  0.804275	  1.769809	 -1.115585
  0.820571	  1.780909	 -1.118935
  0.836868	  1.791995	 -1.122330
  0.853164	  1.803044	 -1.125843
  0.869460	  1.814094	 -1.129357
  0.885858	  1.824904	 -1.133132
  0.902279	  1.835658	 -1.136969
  0.918754	  1.846271	 -1.140957
  0.935359	  1.856528	 -1.145325
  0.951965	  1.866784	 -1.149694
  0.968897	  1.876443	 -1.154165
  0.985953	  1.885864	 -1.158676
  1.003008	  1.895285	 -1.163186
  1.020782	  1.903782	 -1.166635
  1.038746	  1.911998	 -1.169767
  1.056709	  1.920213	 -1.172900
  1.075069	  1.927789	 -1.175252
  1.093527	  1.935186	 -1.177390
  1.111985	  1.942584	 -1.179528
  1.130759	  1.949288	 -1.181141
  1.149559	  1.955929	 -1.182708
  1.168359	  1.962570	 -1.184275
  1.186798	  1.970620	 -1.186431
  1.205002	  1.978619	 -1.188580
