 0.0 0.0 0.0 0
 0.05561105077733949 -0.0840200375847939 0.9947185754351276 1000
 -0.42898608477314976 -0.7488781500058798 0.5054289816727717 1000
 -0.6687303435440544 0.5771746611633114 -0.46873354705468606 1000
 -0.007564436966021035 -0.6999715900905539 -0.71371741772181 1000
 -0.16543254928830145 0.7226513320415674 -0.6711535770108967 1000
 0.6480755256135086 0.7530190573032356 0.11402373629609276 1000
 0.835096472921856 -0.5432210302952614 -0.08185837256157999 1000
 0.6844333161452247 -0.07389614522430282 0.725934153674725 1000
 0.0 0.0 0.0 0
 0.30055555191873745 -0.20352296903034506 -0.9322096123125401 1000
 -0.9433951814522724 0.10992620976432865 -0.3147169522276844 1000
 0.47086774358832184 -0.815749400955524 -0.3354302951266418 1000
 0.3774681982696863 -0.3661873213860987 0.8510432450534525 1000
 -0.3227165822521658 0.654181353016587 0.6846880785473548 1000
 0.875815714202454 -0.42963190343038615 0.22128095785862084 1000
 0.6228254759728334 0.7484924167614262 -0.2284612188750047 1000
 -0.4282743945187844 -0.05016414554473822 -0.9017796856779015 1000
 0.0 0.0 0.0 0
 0.8920062874638212 0.17055342125960382 -0.4180745311803328 1000
 -0.6151828341433693 0.7878433933178791 0.0013668140697981612 1000
 0.2467637112857992 0.9543161846205281 0.16615140855188865 1000
 -0.8797984500551895 -0.47373620346724843 -0.032166703358038125 1000
 0.14939702516940762 -0.9706403338612187 0.1888037900899059 1000
 -0.5745459140243208 0.6619373949438156 0.480835603770096 1000
 -0.5899913565306462 -0.22152588314183597 -0.7768806100794108 1000
 0.36887491586592047 -0.9225398566347514 -0.10868536868062073 1000
 0.0 0.0 0.0 0
 -0.80007507649733 0.018989517308749482 0.599775183047925 1000
 -0.5193760511460229 0.48216660636525477 -0.7060261193484113 1000
 -0.2785331417503494 -0.8882042810596585 0.3644001153319999 1000
 -0.06214017537598077 -0.18734093785247138 -0.9798326242827388 1000
 -0.7673944432695285 -0.5844518559713583 -0.2621827539917238 1000
 -0.13634199209107134 -0.5262142423415641 -0.8390598502785911 1000
 -0.755794262283874 -0.4027858946547356 -0.5161274611624137 1000
 -0.7679090284863456 0.2935014659073996 0.5694678335774238 1000
 0.0 0.0 0.0 0
 0.3300908073999431 0.6123821359825318 -0.7184748975430705 1000
 -0.7609722418537623 -0.6450700256056875 0.06299134220777203 1000
 0.1690876917071072 -0.5743499820215553 -0.8006325316054808 1000
 0.449322975098663 0.3734833357129476 0.8116705378373764 1000
 0.006466438559864646 0.7995299689223502 -0.6001999783133762 1000
 -0.12612654448644098 0.11472481765050054 0.9854487865896275 1000
 -0.7968527772034388 0.596894459625247 -0.09182404658830448 1000
 0.9055414845826495 0.08430087610446543 0.4175320131293772 1000
 0.0 0.0 0.0 0
 -0.09257551564959596 0.7965296463404548 0.5973837095225826 1000
 0.06274938222880014 0.9642737676630401 -0.2556122376312004 1000
 0.28566761774229543 0.25525114294208756 -0.9233969169323664 1000
 0.7046061758246358 -0.6053833383676047 -0.3710177227797569 1000
 -0.5405128535090213 0.32240808111630037 0.7767656560523517 1000
 0.5336956259735423 -0.831921997857528 -0.1502490209533761 1000
 0.38268648074322653 -0.8070666588853183 0.4494312690190273 1000
 -0.6051801106113517 -0.370676256006809 0.7048681770041876 1000
 0.0 0.0 0.0 0
