 -0.689005	 -2.142107	  0.948160
 -0.710100	 -2.168440	  0.953313
 -0.696732	 -2.154709	  0.952931
 -0.684402	 -2.138668	  0.949897
 -0.675427	 -2.120544	  0.943411
 -0.662777	 -2.104721	  0.941413
 -0.648989	 -2.085484	  0.940836
 -0.640039	 -2.074238	  0.941013
 -0.628595	 -2.056405	  0.938803
 -0.617413	 -2.039275	  0.936658
 -0.606899	 -2.021804	  0.936486
 -0.598865	 -2.003473	  0.939404
 -0.590971	 -1.985715	  0.943851
 -0.580399	 -1.965933	  0.944947
 -0.570471	 -1.951425	  0.943686
 -0.557558	 -1.937006	  0.938812
 -0.543387	 -1.920191	  0.936794
 -0.533161	 -1.902977	  0.939351
 -0.524332	 -1.886780	  0.941759
 -0.513151	 -1.866507	  0.946083
 -0.502162	 -1.847909	  0.950799
 -0.494557	 -1.828890	  0.952942
 -0.487698	 -1.816350	  0.952959
 -0.474346	 -1.799849	  0.956325
 -0.463865	 -1.779471	  0.955105
 -0.455051	 -1.759882	  0.948926
 -0.447791	 -1.748420	  0.947134
 -0.437487	 -1.726686	  0.947262
 -0.426375	 -1.700516	  0.947330
 -0.424853	 -1.691824	  0.946740
 -0.419419	 -1.672264	  0.948873
 -0.411898	 -1.645400	  0.944402
 -0.409619	 -1.631097	  0.941936
 -0.400219	 -1.607769	  0.938101
 -0.392744	 -1.592673	  0.937403
 -0.393644	 -1.576391	  0.942232
 -0.396592	 -1.550761	  0.947887
 -0.392607	 -1.531952	  0.950647
 -0.385626	 -1.514381	  0.952448
 -0.381889	 -1.493618	  0.954396
 -0.383119	 -1.475374	  0.956104
 -0.385640	 -1.451459	  0.958981
 -0.383286	 -1.430470	  0.959724
 -0.380169	 -1.410009	  0.957696
 -0.386079	 -1.393613	  0.961961
 -0.397484	 -1.377165	  0.975590
 -0.408501	 -1.358654	  0.986051
 -0.412850	 -1.341147	  0.986873
 -0.411260	 -1.320552	  0.982450
 -0.415101	 -1.294152	  0.977966
 -0.424922	 -1.275824	  0.980526
 -0.429865	 -1.263818	  0.987509
 -0.432453	 -1.244246	  0.996842
 -0.436995	 -1.225335	  1.003871
 -0.434283	 -1.212920	  1.001719
 -0.436614	 -1.195035	  0.996163
 -0.431104	 -1.180239	  0.988430
 -0.420027	 -1.165717	  0.980708
 -0.410536	 -1.152490	  0.971269
 -0.397110	 -1.137458	  0.960191
 -0.381051	 -1.128772	  0.956359
 -0.361937	 -1.123439	  0.955251
 -0.340241	 -1.115682	  0.950462
 -0.327684	 -1.107936	  0.941052
 -0.313038	 -1.098708	  0.927917
 -0.293995	 -1.089808	  0.917762
 -0.280364	 -1.089138	  0.913068
 -0.258912	 -1.097133	  0.906796
 -0.236741	 -1.100614	  0.900785
 -0.218768	 -1.095785	  0.893086
 -0.202801	 -1.091152	  0.883419
 -0.187196	 -1.086325	  0.871731
 -0.168440	 -1.079814	  0.860405
 -0.147061	 -1.074634	  0.854386
 -0.130964	 -1.070774	  0.849118
 -0.115684	 -1.069753	  0.842361
 -0.095447	 -1.068558	  0.830992
 -0.077814	 -1.055028	  0.819557
 -0.067021	 -1.038170	  0.810147
 -0.049880	 -1.027100	  0.802595
 -0.032239	 -1.023448	  0.796389
 -0.015737	 -1.019448	  0.788797
  0.006739	 -1.008154	  0.780034
  0.021970	 -0.996926	  0.774546
  0.032134	 -0.986999	  0.769005
  0.039639	 -0.969539	  0.754086
  0.050269	 -0.949499	  0.737693
  0.060371	 -0.939089	  0.730936
  0.072510	 -0.928699	  0.724849
  0.088287	 -0.911408	  0.714023
  0.100331	 -0.900194	  0.708191
  0.114052	 -0.891240	  0.704728
  0.131978	 -0.874084	  0.696189
  0.139761	 -0.859130	  0.686194
  0.146751	 -0.843408	  0.675517
  0.151303	 -0.827939	  0.668598
  0.161066	 -0.809510	  0.660208
  0.169774	 -0.792802	  0.653095
  0.178455	 -0.776149	  0.646204
  0.186791	 -0.759251	  0.639477
  0.194560	 -0.741860	  0.633352
  0.202324	 -0.724452	  0.627324
  0.209744	 -0.706860	  0.621376
  0.216661	 -0.689100	  0.615362
  0.223468	 -0.671337	  0.609153
  0.230453	 -0.653754	  0.602736
  0.238484	 -0.637325	  0.595387
  0.247084	 -0.623171	  0.586410
  0.254855	 -0.606138	  0.577037
  0.268437	 -0.590620	  0.570964
  0.282695	 -0.571611	  0.568092
  0.288552	 -0.555967	  0.567584
  0.296512	 -0.537163	  0.563978
  0.306811	 -0.520841	  0.559103
  0.315326	 -0.504483	  0.555730
  0.328604	 -0.482864	  0.552247
  0.341545	 -0.471662	  0.546479
  0.354963	 -0.462920	  0.538854
  0.372367	 -0.448037	  0.531323
  0.382390	 -0.431461	  0.530703
  0.390978	 -0.412355	  0.530328
  0.402388	 -0.396360	  0.527587
  0.414240	 -0.382817	  0.523947
  0.428747	 -0.364885	  0.522028
  0.445977	 -0.347835	  0.520779
  0.454125	 -0.340730	  0.520227
  0.467249	 -0.324136	  0.516975
  0.485074	 -0.310663	  0.517211
  0.503182	 -0.298593	  0.520555
  0.512021	 -0.279266	  0.518029
  0.514449	 -0.257177	  0.511486
  0.522702	 -0.236272	  0.510119
  0.537011	 -0.223563	  0.513712
  0.554210	 -0.214035	  0.517799
  0.572485	 -0.197852	  0.523508
  0.581524	 -0.183330	  0.526338
  0.594227	 -0.166340	  0.529163
  0.606855	 -0.150679	  0.529381
  0.616721	 -0.132664	  0.528969
  0.626296	 -0.111511	  0.525905
  0.637365	 -0.093742	  0.524622
  0.648043	 -0.079383	  0.519092
  0.657815	 -0.068496	  0.509383
  0.672345	 -0.052209	  0.501087
  0.687597	 -0.034552	  0.504043
  0.700073	 -0.017867	  0.505059
  0.711290	 -0.002765	  0.496777
  0.720362	  0.008478	  0.486121
  0.732744	  0.024610	  0.477958
  0.743813	  0.039797	  0.470916
  0.754532	  0.056136	  0.466420
  0.765210	  0.072471	  0.462032
  0.775859	  0.088828	  0.457676
  0.785643	  0.105981	  0.454531
  0.794685	  0.123689	  0.452378
  0.803701	  0.141413	  0.450242
  0.812681	  0.159147	  0.448084
  0.820675	  0.177460	  0.447069
  0.828228	  0.196009	  0.446718
  0.835560	  0.214643	  0.446437
  0.842490	  0.233409	  0.446380
  0.848402	  0.252497	  0.447419
  0.854360	  0.271515	  0.448521
  0.862107	  0.289735	  0.450668
  0.871800	  0.308096	  0.454495
  0.878214	  0.327396	  0.457855
  0.879296	  0.347171	  0.459278
  0.883271	  0.366097	  0.460631
  0.892345	  0.385065	  0.462274
  0.897427	  0.405945	  0.463417
  0.897732	  0.425832	  0.466031
  0.895776	  0.444943	  0.471541
  0.896725	  0.464666	  0.476518
  0.897885	  0.484045	  0.481811
  0.898473	  0.503106	  0.487788
  0.898175	  0.521967	  0.494417
  0.897635	  0.540845	  0.501239
  0.897300	  0.559761	  0.507871
  0.897095	  0.578587	  0.514425
  0.897301	  0.596925	  0.521043
  0.896142	  0.614390	  0.529615
  0.895288	  0.632364	  0.538249
  0.892896	  0.649813	  0.548022
  0.890271	  0.667014	  0.557892
  0.887644	  0.684213	  0.567755
  0.884986	  0.701389	  0.577641
  0.881270	  0.717951	  0.588025
  0.876936	  0.731006	  0.601544
  0.875802	  0.744012	  0.619730
  0.873289	  0.759520	  0.635121
  0.866883	  0.773447	  0.644777
  0.859572	  0.787075	  0.656655
  0.850003	  0.807272	  0.670404
  0.838083	  0.820771	  0.672664
  0.821744	  0.835588	  0.675448
  0.810144	  0.853180	  0.684431
  0.806657	  0.868304	  0.697387
  0.807444	  0.886627	  0.711850
  0.807010	  0.905752	  0.722346
  0.800139	  0.922891	  0.726359
  0.785903	  0.938320	  0.729905
  0.775001	  0.955192	  0.733099
  0.781212	  0.961425	  0.734143
  0.793313	  0.972925	  0.738988
  0.800343	  0.965147	  0.734589
  0.808804	  0.981714	  0.733798
  0.826209	  0.999475	  0.723272
  0.845740	  1.015586	  0.713675
  0.866472	  1.022975	  0.711401
  0.880488	  1.019802	  0.710711
  0.902099	  1.017444	  0.705896
  0.923137	  1.016751	  0.704528
  0.943182	  1.016812	  0.702934
  0.962840	  1.018728	  0.698943
  0.983013	  1.018556	  0.697395
  1.002138	  1.020475	  0.693597
  1.021160	  1.022347	  0.691875
  1.037439	  1.026282	  0.688405
  1.055044	  1.031599	  0.684909
  1.074014	  1.037903	  0.682309
  1.091966	  1.045035	  0.678488
  1.109884	  1.053026	  0.673711
  1.128851	  1.059291	  0.670997
  1.145772	  1.066981	  0.666553
  1.160307	  1.075820	  0.661575
  1.175474	  1.083670	  0.657540
  1.190519	  1.094987	  0.651342
  1.205174	  1.106915	  0.644370
  1.221833	  1.117154	  0.639675
  1.235550	  1.129083	  0.632368
  1.247407	  1.141431	  0.624295
  1.260574	  1.151731	  0.618616
  1.272772	  1.164133	  0.610904
  1.283741	  1.178036	  0.601980
  1.294844	  1.187067	  0.589924
  1.300595	  1.192768	  0.577674
  1.311012	  1.195148	  0.563084
  1.314924	  1.193244	  0.543690
  1.322707	  1.190473	  0.525071
  1.327037	  1.188758	  0.505591
  1.335708	  1.185748	  0.487098
  1.346167	  1.183210	  0.467924
  1.360688	  1.180044	  0.448111
  1.373794	  1.178033	  0.431921
  1.389822	  1.175246	  0.419835
  1.404356	  1.172781	  0.406667
  1.419091	  1.168323	  0.395026
  1.434129	  1.160545	  0.385674
  1.458077	  1.158096	  0.377484
  1.478604	  1.163210	  0.368600
  1.494266	  1.167864	  0.355271
  1.503594	  1.169177	  0.341827
  1.513909	  1.171870	  0.329918
  1.530357	  1.176435	  0.318647
  1.542375	  1.182691	  0.306394
  1.546634	  1.192879	  0.297135
  1.547288	  1.211637	  0.291532
  1.550763	  1.222963	  0.279405
  1.550561	  1.236839	  0.257929
  1.533597	  1.252203	  0.239078
  1.518132	  1.265613	  0.236226
  1.508037	  1.277226	  0.236204
  1.502215	  1.298957	  0.238158
  1.501379	  1.321331	  0.233789
  1.498334	  1.337629	  0.228885
  1.497439	  1.355929	  0.221145
  1.492873	  1.372631	  0.211049
  1.493461	  1.390524	  0.202513
  1.492982	  1.409925	  0.199239
  1.493574	  1.431435	  0.196468
  1.491368	  1.447017	  0.188393
  1.494699	  1.462622	  0.175690
  1.497368	  1.478670	  0.165193
  1.495292	  1.499324	  0.154942
  1.504475	  1.513852	  0.151663
  1.514064	  1.532026	  0.143040
  1.525888	  1.548550	  0.132545
  1.533399	  1.558253	  0.124831
  1.537580	  1.573595	  0.115238
  1.548303	  1.593978	  0.111179
  1.561695	  1.611707	  0.110454
  1.575623	  1.627173	  0.107416
  1.587938	  1.642096	  0.100893
  1.596667	  1.658363	  0.093914
  1.606116	  1.675399	  0.086364
  1.614272	  1.693589	  0.082421
  1.622957	  1.709661	  0.079351
  1.631116	  1.726190	  0.074682
  1.640047	  1.743609	  0.068763
  1.651562	  1.761979	  0.067527
  1.662288	  1.781299	  0.078291
  1.671093	  1.798602	  0.073488
