 -2.210047	 -0.141167	  1.178105
 -2.200291	 -0.134663	  1.179230
 -2.193482	 -0.130124	  1.180016
 -2.176920	 -0.119076	  1.181920
 -2.160853	 -0.107192	  1.182689
 -2.144838	 -0.095228	  1.183341
 -2.128501	 -0.083696	  1.183303
 -2.111291	 -0.073792	  1.180923
 -2.094072	 -0.063908	  1.178516
 -2.076293	 -0.055807	  1.174248
 -2.058347	 -0.048621	  1.169122
 -2.039813	 -0.041677	  1.166256
 -2.020933	 -0.035092	  1.165825
 -2.002026	 -0.028594	  1.166328
 -1.983138	 -0.022214	  1.167925
 -1.964258	 -0.015813	  1.169520
 -1.945948	 -0.007878	  1.170847
 -1.927643	  0.000071	  1.172172
 -1.909562	  0.008499	  1.173600
 -1.892212	  0.018294	  1.175327
 -1.874867	  0.028100	  1.177057
 -1.857898	  0.038515	  1.178958
 -1.841360	  0.049566	  1.181040
 -1.824827	  0.060625	  1.183128
 -1.808740	  0.072187	  1.185869
 -1.792710	  0.083810	  1.188689
 -1.776843	  0.095592	  1.191761
 -1.761158	  0.107542	  1.195103
 -1.745480	  0.119502	  1.198440
 -1.731014	  0.133187	  1.200285
 -1.716983	  0.147373	  1.201653
 -1.702950	  0.161558	  1.203002
 -1.688572	  0.175336	  1.201169
 -1.674160	  0.188807	  1.197878
 -1.659734	  0.202254	  1.194570
 -1.643266	  0.212567	  1.189841
 -1.626686	  0.222662	  1.185025
 -1.609791	  0.232446	  1.180688
 -1.592682	  0.241995	  1.176677
 -1.576130	  0.250865	  1.172365
 -1.557131	  0.259148	  1.167157
 -1.538429	  0.265877	  1.162193
 -1.521961	  0.277851	  1.159541
 -1.507031	  0.290791	  1.155472
 -1.491078	  0.302975	  1.154305
 -1.474095	  0.313569	  1.155817
 -1.457604	  0.325481	  1.157232
 -1.442653	  0.338426	  1.159011
 -1.427108	  0.351145	  1.158732
 -1.412426	  0.364516	  1.158588
 -1.395182	  0.377756	  1.158784
 -1.378956	  0.387428	  1.159220
 -1.359055	  0.393711	  1.162925
 -1.339610	  0.400013	  1.164077
 -1.322762	  0.410318	  1.163592
 -1.304228	  0.418149	  1.162770
 -1.285035	  0.425784	  1.168027
 -1.269137	  0.433378	  1.175442
 -1.250475	  0.439812	  1.183783
 -1.230350	  0.446332	  1.185749
 -1.213581	  0.454559	  1.185033
 -1.195948	  0.467786	  1.180972
 -1.173937	  0.472634	  1.180958
 -1.155833	  0.475461	  1.190008
 -1.139820	  0.484362	  1.193665
 -1.122579	  0.495270	  1.195101
 -1.104593	  0.505233	  1.196873
 -1.086729	  0.511615	  1.199820
 -1.067346	  0.518669	  1.207676
 -1.048923	  0.524703	  1.213733
 -1.032516	  0.529475	  1.219941
 -1.015090	  0.529717	  1.229174
 -0.995442	  0.531457	  1.239064
 -0.977420	  0.529625	  1.243170
 -0.959278	  0.525584	  1.250081
 -0.942669	  0.522377	  1.259313
 -0.920835	  0.516003	  1.266991
 -0.902872	  0.506848	  1.268724
 -0.886758	  0.501013	  1.271043
 -0.868109	  0.493279	  1.277666
 -0.851090	  0.486681	  1.283737
 -0.832944	  0.479546	  1.288763
 -0.815365	  0.473405	  1.295569
 -0.797807	  0.465526	  1.302190
 -0.780056	  0.457367	  1.306861
 -0.761981	  0.450022	  1.310850
 -0.743950	  0.442178	  1.314913
 -0.726022	  0.434299	  1.318974
 -0.707480	  0.427348	  1.321772
 -0.688318	  0.421804	  1.322683
 -0.669090	  0.416441	  1.322645
 -0.649867	  0.411498	  1.322125
 -0.630076	  0.407619	  1.322026
 -0.611008	  0.405358	  1.319698
 -0.591903	  0.401725	  1.315561
 -0.572151	  0.392419	  1.312525
 -0.554175	  0.385492	  1.311144
 -0.534367	  0.382478	  1.309199
 -0.515181	  0.381682	  1.307907
 -0.494773	  0.380053	  1.305548
 -0.474815	  0.377639	  1.304085
 -0.455043	  0.375645	  1.302275
 -0.435956	  0.379937	  1.298114
 -0.416609	  0.384679	  1.295079
 -0.398622	  0.393184	  1.291028
 -0.383386	  0.404181	  1.285154
 -0.368315	  0.415381	  1.279181
 -0.352684	  0.428775	  1.272731
 -0.339116	  0.440535	  1.263000
 -0.327680	  0.450389	  1.252132
 -0.314834	  0.462519	  1.240822
 -0.300919	  0.472574	  1.227490
 -0.284770	  0.478491	  1.219187
 -0.268891	  0.486328	  1.209382
 -0.253308	  0.494081	  1.200277
 -0.237009	  0.500774	  1.190011
 -0.221211	  0.506956	  1.179252
 -0.206232	  0.513213	  1.168059
 -0.192111	  0.518533	  1.154947
 -0.178981	  0.524175	  1.140312
 -0.165971	  0.533152	  1.126275
 -0.152338	  0.541327	  1.118455
 -0.134420	  0.546702	  1.105579
 -0.124452	  0.556940	  1.089492
 -0.119763	  0.567822	  1.074579
 -0.114963	  0.582909	  1.065602
 -0.107949	  0.601874	  1.053293
 -0.105168	  0.613341	  1.039633
 -0.099609	  0.626997	  1.026990
 -0.089994	  0.642646	  1.019275
 -0.083385	  0.659197	  1.009147
 -0.080326	  0.676053	  0.996630
 -0.072462	  0.693440	  0.989098
 -0.061513	  0.710865	  0.986570
 -0.053781	  0.728682	  0.989165
 -0.048820	  0.748320	  0.994532
 -0.041644	  0.767232	  0.998892
 -0.028697	  0.782870	  1.000263
 -0.015883	  0.799277	  1.002300
 -0.009593	  0.817608	  1.006349
 -0.005478	  0.835939	  1.011439
 -0.000919	  0.855103	  1.017837
  0.005903	  0.873361	  1.022190
  0.015376	  0.894546	  1.021180
  0.016349	  0.915207	  1.024610
  0.015127	  0.929648	  1.032156
  0.016550	  0.949337	  1.040928
  0.015419	  0.969270	  1.048510
  0.013753	  0.987220	  1.053353
  0.016595	  1.006184	  1.060262
  0.021310	  1.025426	  1.065440
  0.019057	  1.045124	  1.072884
  0.016860	  1.063084	  1.083073
  0.018509	  1.077831	  1.094747
  0.019798	  1.095905	  1.104523
  0.024801	  1.118336	  1.108985
  0.025644	  1.135108	  1.113959
  0.026579	  1.152578	  1.121537
  0.032002	  1.173315	  1.130387
  0.044149	  1.190987	  1.136220
  0.058748	  1.204507	  1.139933
  0.071277	  1.216365	  1.142925
  0.088509	  1.230644	  1.144691
  0.103182	  1.244912	  1.147584
  0.115356	  1.256980	  1.147571
  0.133601	  1.268835	  1.146071
  0.148734	  1.281326	  1.145612
  0.162347	  1.295400	  1.143675
  0.178746	  1.308622	  1.142070
  0.195748	  1.317296	  1.139088
  0.214062	  1.326094	  1.135147
  0.233004	  1.335956	  1.133877
  0.246162	  1.348409	  1.133209
  0.262749	  1.361019	  1.131780
  0.279842	  1.371540	  1.131156
  0.295916	  1.381680	  1.129617
  0.313807	  1.394202	  1.129013
  0.330498	  1.403370	  1.129194
  0.347175	  1.411131	  1.127548
  0.366751	  1.423838	  1.128678
  0.380291	  1.439240	  1.128788
  0.391130	  1.455607	  1.131613
  0.407219	  1.468617	  1.133360
  0.423008	  1.478352	  1.132126
  0.437185	  1.494791	  1.131701
  0.450083	  1.507689	  1.133828
  0.465520	  1.521726	  1.134227
  0.480369	  1.535126	  1.135883
  0.494520	  1.549161	  1.138373
  0.507907	  1.563452	  1.141164
  0.520971	  1.578938	  1.141937
  0.534546	  1.593572	  1.142888
  0.548447	  1.607822	  1.144343
  0.564821	  1.619248	  1.143499
  0.581633	  1.630327	  1.142540
  0.598447	  1.641124	  1.140224
  0.614672	  1.651992	  1.137286
  0.632690	  1.662058	  1.132104
  0.649262	  1.670945	  1.125794
  0.667071	  1.678252	  1.119804
  0.685067	  1.685171	  1.117836
  0.702819	  1.693079	  1.117006
  0.723521	  1.701911	  1.114101
  0.741113	  1.709195	  1.107163
  0.755487	  1.720317	  1.107033
  0.774505	  1.732207	  1.107852
  0.793502	  1.740143	  1.109879
  0.807198	  1.752910	  1.113017
  0.821588	  1.768120	  1.113843
  0.838607	  1.781361	  1.113622
  0.858022	  1.787215	  1.110950
  0.876131	  1.793062	  1.112447
  0.896425	  1.800527	  1.115288
  0.911527	  1.812083	  1.117215
  0.926786	  1.825655	  1.117592
  0.943973	  1.837404	  1.119957
  0.964559	  1.843644	  1.115545
  0.982107	  1.849166	  1.113368
  1.001678	  1.858869	  1.116799
  1.017883	  1.870055	  1.117390
  1.032840	  1.879468	  1.114778
  1.050788	  1.891164	  1.113903
  1.067647	  1.901518	  1.115389
  1.085724	  1.911315	  1.115533
  1.122084	  1.931049	  1.115695
  1.139484	  1.940909	  1.115491
