 -1.543199	 -2.020130	 -1.648790
 -1.527920	 -2.000129	 -1.632466
 -1.498707	 -1.958757	 -1.612598
 -1.472317	 -1.912818	 -1.603949
 -1.439992	 -1.873205	 -1.594695
 -1.412477	 -1.837135	 -1.574484
 -1.396047	 -1.792632	 -1.562564
 -1.375357	 -1.748732	 -1.550827
 -1.351740	 -1.706965	 -1.535439
 -1.326309	 -1.666438	 -1.519150
 -1.299778	 -1.627052	 -1.502557
 -1.272499	 -1.586450	 -1.487416
 -1.244451	 -1.545423	 -1.474190
 -1.215670	 -1.504175	 -1.462455
 -1.187649	 -1.464154	 -1.451369
 -1.159693	 -1.424699	 -1.440110
 -1.132118	 -1.385926	 -1.428759
 -1.104345	 -1.347191	 -1.417222
 -1.076571	 -1.308017	 -1.405976
 -1.048837	 -1.267772	 -1.395240
 -1.021425	 -1.227615	 -1.386244
 -0.994975	 -1.188601	 -1.379720
 -0.966363	 -1.146598	 -1.376723
 -0.927934	 -1.087124	 -1.382371
 -0.882628	 -1.009442	 -1.419156
 -0.847333	 -0.950272	 -1.489968
 -0.824661	 -0.915028	 -1.548576
 -0.805241	 -0.880707	 -1.588597
 -0.781130	 -0.835782	 -1.622562
 -0.747183	 -0.781716	 -1.656258
 -0.712131	 -0.725819	 -1.674262
 -0.674593	 -0.682643	 -1.671778
 -0.640740	 -0.656374	 -1.654387
 -0.606728	 -0.641170	 -1.622902
 -0.559167	 -0.633672	 -1.566846
 -0.488620	 -0.635516	 -1.485913
 -0.409070	 -0.634326	 -1.401953
 -0.346180	 -0.622080	 -1.335406
 -0.311396	 -0.599170	 -1.289389
 -0.295333	 -0.578294	 -1.263356
 -0.288645	 -0.549023	 -1.239999
 -0.288531	 -0.491381	 -1.209314
 -0.294176	 -0.406232	 -1.173855
 -0.300142	 -0.330320	 -1.145867
 -0.301601	 -0.279649	 -1.127787
 -0.298237	 -0.237298	 -1.113836
 -0.290195	 -0.193359	 -1.100841
 -0.275616	 -0.146640	 -1.087903
 -0.255691	 -0.101156	 -1.075384
 -0.233287	 -0.058992	 -1.063847
 -0.208946	 -0.017829	 -1.052465
 -0.183569	  0.023748	 -1.041361
 -0.158514	  0.065621	 -1.030960
 -0.133463	  0.107648	 -1.020165
 -0.108132	  0.148374	 -1.007854
 -0.080945	  0.188222	 -0.994651
 -0.052533	  0.227141	 -0.979466
 -0.022644	  0.264580	 -0.962515
  0.008556	  0.300829	 -0.943321
  0.040750	  0.336272	 -0.923385
  0.071618	  0.370904	 -0.903912
  0.101535	  0.406036	 -0.884533
  0.129847	  0.441669	 -0.865724
  0.157404	  0.479458	 -0.847077
  0.184485	  0.518224	 -0.829058
  0.211238	  0.557402	 -0.811931
  0.237176	  0.596488	 -0.795891
  0.263314	  0.635106	 -0.780405
  0.292129	  0.673912	 -0.765209
  0.322136	  0.708752	 -0.751318
  0.355730	  0.738991	 -0.738357
  0.393154	  0.762963	 -0.727263
  0.442864	  0.783486	 -0.717785
  0.525282	  0.799352	 -0.717503
  0.627304	  0.801469	 -0.747944
  0.714900	  0.795780	 -0.809524
  0.777504	  0.795457	 -0.876768
  0.830840	  0.803271	 -0.950394
  0.880360	  0.821930	 -1.030105
  0.924502	  0.854415	 -1.101411
  0.966855	  0.901814	 -1.152518
  1.003663	  0.956814	 -1.179619
  1.039685	  1.022681	 -1.188462
  1.071917	  1.126622	 -1.179023
  1.084912	  1.276629	 -1.151778
  1.090305	  1.436118	 -1.131561
  1.089696	  1.568589	 -1.093304
  1.075343	  1.662296	 -1.014077
  1.036612	  1.724956	 -0.933887
  0.980610	  1.758007	 -0.874293
  0.929298	  1.773412	 -0.828957
  0.892334	  1.779153	 -0.777902
  0.867184	  1.797105	 -0.705348
  0.863163	  1.827769	 -0.638643
  0.901616	  1.830325	 -0.589927
  0.969936	  1.817121	 -0.543026
  1.035974	  1.830012	 -0.500726
  1.082260	  1.858016	 -0.473886
  1.116781	  1.889816	 -0.455349
  1.147655	  1.924911	 -0.438847
  1.176896	  1.962190	 -0.423018
  1.204304	  2.000181	 -0.407100
  1.230429	  2.038491	 -0.390521
  1.255993	  2.076690	 -0.372819
  1.281858	  2.113944	 -0.354656
  1.310635	  2.149543	 -0.337589
  1.340598	  2.186866	 -0.322612
  1.365664	  2.227580	 -0.308880
  1.393975	  2.266279	 -0.296641
  1.423631	  2.304709	 -0.283881
  1.452704	  2.344962	 -0.270967
  1.479228	  2.386603	 -0.257267
  1.502622	  2.427568	 -0.241222
  1.524768	  2.469108	 -0.230411
  1.543823	  2.509722	 -0.215865
  1.566329	  2.550036	 -0.209596
  1.581992	  2.575536	 -0.211692
