  0.744674	  2.323104	 -0.002804
  0.757697	  2.357902	  0.013126
  0.758257	  2.346248	 -0.003572
  0.752833	  2.325887	 -0.012684
  0.741837	  2.304701	 -0.015973
  0.732090	  2.291206	 -0.017257
  0.716616	  2.273528	 -0.021710
  0.703439	  2.261523	 -0.028129
  0.690010	  2.245510	 -0.034252
  0.675979	  2.228951	 -0.040499
  0.669835	  2.218584	 -0.041663
  0.660386	  2.199251	 -0.043225
  0.645430	  2.172461	 -0.048388
  0.631066	  2.157643	 -0.058074
  0.626872	  2.133654	 -0.057280
  0.625078	  2.123378	 -0.058753
  0.620715	  2.099102	 -0.062717
  0.617066	  2.078777	 -0.067709
  0.612191	  2.059954	 -0.076196
  0.608724	  2.043944	 -0.087351
  0.599143	  2.027830	 -0.093367
  0.584767	  2.012188	 -0.088704
  0.577346	  1.994516	 -0.080673
  0.571397	  1.973971	 -0.077939
  0.562229	  1.955398	 -0.078604
  0.555018	  1.936960	 -0.081923
  0.546610	  1.920354	 -0.084632
  0.534577	  1.906012	 -0.081275
  0.513577	  1.892479	 -0.075217
  0.493854	  1.875376	 -0.079615
  0.487438	  1.860070	 -0.090179
  0.481779	  1.847994	 -0.095660
  0.468877	  1.832352	 -0.100159
  0.455944	  1.818403	 -0.104433
  0.435719	  1.810422	 -0.105918
  0.416436	  1.799285	 -0.112234
  0.405188	  1.782921	 -0.120320
  0.396811	  1.764202	 -0.122265
  0.388286	  1.747170	 -0.122684
  0.377668	  1.731022	 -0.126592
  0.365736	  1.714369	 -0.127143
  0.353775	  1.701286	 -0.125499
  0.338211	  1.687901	 -0.120822
  0.325401	  1.673577	 -0.115978
  0.311147	  1.659302	 -0.112830
  0.298404	  1.644089	 -0.111139
  0.283803	  1.629175	 -0.109039
  0.270692	  1.614214	 -0.107544
  0.255939	  1.601265	 -0.107186
  0.243601	  1.590826	 -0.105284
  0.231203	  1.583020	 -0.102785
  0.218930	  1.574209	 -0.098202
  0.200566	  1.566486	 -0.089908
  0.183983	  1.554995	 -0.066197
  0.180034	  1.540899	 -0.045275
  0.177517	  1.527579	 -0.034626
  0.168349	  1.515836	 -0.027583
  0.153969	  1.506231	 -0.014138
  0.147288	  1.497179	  0.004826
  0.145509	  1.485179	  0.022741
  0.145315	  1.474658	  0.035669
  0.148770	  1.470017	  0.059191
  0.144787	  1.454620	  0.080784
  0.131319	  1.429756	  0.089501
  0.122687	  1.411695	  0.096944
  0.113597	  1.392649	  0.105747
  0.103928	  1.373526	  0.110830
  0.093541	  1.356560	  0.114813
  0.081253	  1.336002	  0.124221
  0.076567	  1.324641	  0.130147
  0.072137	  1.312255	  0.138118
  0.065352	  1.295827	  0.155043
  0.058121	  1.281685	  0.164927
  0.051729	  1.263341	  0.171728
  0.045822	  1.244427	  0.176624
  0.041349	  1.231076	  0.179642
  0.034018	  1.214790	  0.177479
  0.026210	  1.194756	  0.169782
  0.024202	  1.183258	  0.166054
  0.023534	  1.175390	  0.163167
  0.022729	  1.156975	  0.159303
  0.020559	  1.133730	  0.150622
  0.017545	  1.121054	  0.146811
  0.014126	  1.108547	  0.135272
  0.007731	  1.097038	  0.129989
  0.004551	  1.076477	  0.116713
 -0.002245	  1.052851	  0.095385
 -0.006791	  1.043038	  0.086724
 -0.012180	  1.024761	  0.074446
 -0.014269	  1.005955	  0.061229
 -0.014031	  0.995439	  0.053193
 -0.009374	  0.981556	  0.041655
 -0.001689	  0.967447	  0.019849
  0.003792	  0.954502	 -0.001511
  0.004889	  0.947548	 -0.011041
  0.007983	  0.938593	 -0.027073
  0.013304	  0.930268	 -0.042604
  0.019528	  0.918226	 -0.062930
  0.023507	  0.905029	 -0.079800
  0.034668	  0.891065	 -0.097287
  0.040675	  0.880935	 -0.110290
  0.052285	  0.875818	 -0.125219
  0.058974	  0.870332	 -0.138826
  0.068975	  0.859852	 -0.158464
  0.081726	  0.848110	 -0.173802
  0.089654	  0.842542	 -0.182469
  0.103124	  0.836477	 -0.201776
  0.112180	  0.832995	 -0.216912
  0.121808	  0.828463	 -0.235675
  0.133846	  0.820703	 -0.259634
  0.139359	  0.818630	 -0.268157
  0.151180	  0.813742	 -0.288138
  0.166664	  0.805977	 -0.307328
  0.174363	  0.804290	 -0.316277
  0.190428	  0.799878	 -0.335469
  0.200261	  0.796472	 -0.351802
  0.202480	  0.794306	 -0.360714
  0.200545	  0.780311	 -0.385805
  0.198476	  0.764907	 -0.402454
  0.197664	  0.756784	 -0.411411
  0.194511	  0.743412	 -0.422000
  0.189678	  0.728250	 -0.437972
  0.189125	  0.711004	 -0.447237
  0.190309	  0.691229	 -0.450896
  0.188513	  0.671298	 -0.453576
  0.185338	  0.654547	 -0.455123
  0.179341	  0.628830	 -0.460932
  0.166295	  0.606357	 -0.466145
  0.158033	  0.594063	 -0.468867
  0.148328	  0.578202	 -0.473746
  0.135981	  0.554710	 -0.481452
  0.131108	  0.542856	 -0.483472
  0.120322	  0.518495	 -0.484778
  0.114380	  0.505728	 -0.484591
  0.106326	  0.488408	 -0.485072
  0.095341	  0.465420	 -0.487739
  0.088014	  0.449289	 -0.493022
  0.080072	  0.430870	 -0.500284
  0.070211	  0.410635	 -0.509357
  0.064620	  0.397270	 -0.516678
  0.058845	  0.384789	 -0.522137
  0.049952	  0.361222	 -0.528009
  0.044151	  0.336871	 -0.529973
  0.040734	  0.323838	 -0.531394
  0.036354	  0.306747	 -0.533837
  0.031891	  0.286186	 -0.541113
  0.024921	  0.269350	 -0.547167
  0.011691	  0.247119	 -0.554291
  0.000264	  0.225041	 -0.558339
 -0.004722	  0.215267	 -0.559491
 -0.008890	  0.204777	 -0.560948
 -0.014653	  0.171861	 -0.577320
 -0.021551	  0.160285	 -0.584362
 -0.025789	  0.148511	 -0.590660
 -0.039146	  0.128020	 -0.598065
 -0.046889	  0.112492	 -0.603481
 -0.057262	  0.095867	 -0.610874
 -0.064511	  0.077365	 -0.622755
 -0.067281	  0.065647	 -0.628815
 -0.071850	  0.047553	 -0.638509
 -0.076538	  0.023394	 -0.658091
 -0.079167	  0.013075	 -0.667769
 -0.083935	 -0.000462	 -0.679378
 -0.093701	 -0.018371	 -0.690959
 -0.106405	 -0.038497	 -0.692136
 -0.113252	 -0.054085	 -0.691075
 -0.118545	 -0.065101	 -0.690858
 -0.129213	 -0.085836	 -0.696946
 -0.139621	 -0.124461	 -0.701589
 -0.146554	 -0.137627	 -0.704815
 -0.148138	 -0.154214	 -0.706264
 -0.155161	 -0.170558	 -0.712987
 -0.162099	 -0.186521	 -0.717395
 -0.178476	 -0.203361	 -0.727509
 -0.188336	 -0.217400	 -0.735639
 -0.192382	 -0.232752	 -0.743290
 -0.198467	 -0.252282	 -0.752855
 -0.202577	 -0.269512	 -0.761319
 -0.207204	 -0.287891	 -0.767592
 -0.211486	 -0.303150	 -0.774091
 -0.216036	 -0.323158	 -0.784257
 -0.220242	 -0.343315	 -0.792217
 -0.222435	 -0.356723	 -0.797495
 -0.226391	 -0.374166	 -0.808265
 -0.230468	 -0.393529	 -0.815671
 -0.231236	 -0.410762	 -0.827054
 -0.235512	 -0.428787	 -0.823889
 -0.233740	 -0.443787	 -0.835034
 -0.236057	 -0.469355	 -0.841154
 -0.235620	 -0.494950	 -0.842026
 -0.239298	 -0.498612	 -0.853671
 -0.245735	 -0.518631	 -0.864135
 -0.251919	 -0.553684	 -0.875427
 -0.267261	 -0.571216	 -0.891880
 -0.277404	 -0.577600	 -0.897067
 -0.285223	 -0.598642	 -0.890404
 -0.287705	 -0.611775	 -0.894784
 -0.283162	 -0.635128	 -0.901907
 -0.276628	 -0.657747	 -0.910703
 -0.273042	 -0.669690	 -0.915614
 -0.269359	 -0.689538	 -0.920807
 -0.262616	 -0.715294	 -0.925330
 -0.259904	 -0.735594	 -0.930272
 -0.259307	 -0.748807	 -0.934303
 -0.256312	 -0.768464	 -0.942245
 -0.245518	 -0.785937	 -0.946470
 -0.241253	 -0.801669	 -0.942567
 -0.242783	 -0.811763	 -0.937613
 -0.243700	 -0.825180	 -0.929985
 -0.239476	 -0.831392	 -0.927567
 -0.244917	 -0.835942	 -0.923613
 -0.250055	 -0.853170	 -0.915589
 -0.256331	 -0.869067	 -0.907736
 -0.264849	 -0.884878	 -0.893020
 -0.276113	 -0.898482	 -0.873896
 -0.283450	 -0.903241	 -0.867310
 -0.295012	 -0.914079	 -0.855173
 -0.313072	 -0.930737	 -0.836761
 -0.319483	 -0.937481	 -0.828896
 -0.328068	 -0.950957	 -0.821530
 -0.345694	 -0.969287	 -0.805373
 -0.356461	 -0.976487	 -0.798647
 -0.362195	 -0.985590	 -0.795441
 -0.381274	 -1.015231	 -0.776574
 -0.396405	 -1.030333	 -0.762908
 -0.400492	 -1.036267	 -0.761961
 -0.412434	 -1.051588	 -0.755135
 -0.429854	 -1.075505	 -0.757596
 -0.436978	 -1.085904	 -0.759417
 -0.450294	 -1.101938	 -0.763867
 -0.464713	 -1.118230	 -0.766403
 -0.478149	 -1.130828	 -0.768931
 -0.496657	 -1.147796	 -0.771389
 -0.505126	 -1.156628	 -0.775115
 -0.521419	 -1.166945	 -0.783580
 -0.545254	 -1.184768	 -0.793304
 -0.560175	 -1.195590	 -0.795973
 -0.570000	 -1.204035	 -0.796915
 -0.586916	 -1.213524	 -0.806042
 -0.604704	 -1.221474	 -0.815216
 -0.620784	 -1.227766	 -0.825409
 -0.634972	 -1.233005	 -0.837872
 -0.652931	 -1.242820	 -0.849343
 -0.671198	 -1.250435	 -0.865390
 -0.685068	 -1.257420	 -0.876359
 -0.697066	 -1.262079	 -0.890946
 -0.707809	 -1.266271	 -0.907007
 -0.720012	 -1.266487	 -0.923688
 -0.735807	 -1.264032	 -0.938559
 -0.749064	 -1.268031	 -0.952884
 -0.762598	 -1.270836	 -0.961505
 -0.773056	 -1.274990	 -0.971865
 -0.792595	 -1.276660	 -0.981826
 -0.810140	 -1.283667	 -0.993962
 -0.823785	 -1.285928	 -1.008145
 -0.839431	 -1.288379	 -1.027683
 -0.849320	 -1.287107	 -1.034099
 -0.852136	 -1.293815	 -1.040153
 -0.857264	 -1.303331	 -1.047509
 -0.864051	 -1.318454	 -1.061566
 -0.873609	 -1.329601	 -1.075783
 -0.880542	 -1.347005	 -1.093711
 -0.883551	 -1.361431	 -1.105004
 -0.888185	 -1.377490	 -1.121285
 -0.886648	 -1.398025	 -1.138702
 -0.858720	 -1.418566	 -1.148815
 -0.844543	 -1.427426	 -1.150513
 -0.830717	 -1.435193	 -1.151913
 -0.809495	 -1.453887	 -1.155810
 -0.790233	 -1.467396	 -1.162864
 -0.782309	 -1.471080	 -1.168660
 -0.767416	 -1.479748	 -1.174850
 -0.754842	 -1.504255	 -1.184814
 -0.748147	 -1.521763	 -1.193392
 -0.743796	 -1.535164	 -1.200124
 -0.741236	 -1.555066	 -1.209526
 -0.740462	 -1.573683	 -1.218087
 -0.739738	 -1.587240	 -1.224497
 -0.740331	 -1.604816	 -1.231312
 -0.739869	 -1.624595	 -1.240687
 -0.740749	 -1.637303	 -1.247192
 -0.743160	 -1.654108	 -1.254043
 -0.747436	 -1.675899	 -1.263707
 -0.755067	 -1.693250	 -1.271729
 -0.759627	 -1.704057	 -1.275293
 -0.766213	 -1.719167	 -1.280092
 -0.771380	 -1.739432	 -1.288500
 -0.780231	 -1.755970	 -1.295323
 -0.788082	 -1.772217	 -1.300451
 -0.795735	 -1.790285	 -1.305975
 -0.803416	 -1.807753	 -1.313063
 -0.812537	 -1.824040	 -1.318406
 -0.819363	 -1.842619	 -1.322747
 -0.826322	 -1.861592	 -1.329805
 -0.835567	 -1.878625	 -1.338733
 -0.844867	 -1.897649	 -1.347590
 -0.842995	 -1.919753	 -1.372672
 -0.851430	 -1.936940	 -1.378457
