 -1.924213	  1.593015	  0.323835
 -1.934718	  1.606420	  0.331729
 -1.923525	  1.592138	  0.323318
 -1.912136	  1.578016	  0.314900
 -1.900411	  1.564175	  0.306476
 -1.888687	  1.550334	  0.298052
 -1.876561	  1.536740	  0.289797
 -1.864257	  1.523259	  0.281619
 -1.851935	  1.509781	  0.273463
 -1.839200	  1.496382	  0.265827
 -1.826466	  1.482984	  0.258192
 -1.813758	  1.469541	  0.250588
 -1.801083	  1.456046	  0.243024
 -1.788374	  1.442691	  0.235268
 -1.775537	  1.430194	  0.226507
 -1.762863	  1.416917	  0.218651
 -1.749361	  1.405035	  0.209006
 -1.735351	  1.395882	  0.198737
 -1.720573	  1.387867	  0.186460
 -1.708528	  1.378011	  0.175528
 -1.693638	  1.364637	  0.165446
 -1.677995	  1.356372	  0.157012
 -1.662654	  1.352831	  0.147056
 -1.644138	  1.347453	  0.136097
 -1.628092	  1.338107	  0.128976
 -1.613289	  1.329573	  0.119921
 -1.598026	  1.321817	  0.109407
 -1.580080	  1.314181	  0.100539
 -1.565643	  1.302473	  0.093670
 -1.552337	  1.291766	  0.085168
 -1.536178	  1.282560	  0.075772
 -1.520319	  1.271603	  0.068123
 -1.506316	  1.259528	  0.062242
 -1.490812	  1.248407	  0.055961
 -1.475938	  1.236384	  0.048132
 -1.462803	  1.224091	  0.041773
 -1.451653	  1.207201	  0.034284
 -1.441818	  1.191796	  0.027705
 -1.425841	  1.180327	  0.016824
 -1.411606	  1.169781	  0.010706
 -1.398355	  1.155915	  0.007553
 -1.387712	  1.137176	  0.003792
 -1.375482	  1.124249	 -0.004459
 -1.359247	  1.114393	 -0.010887
 -1.344867	  1.099400	 -0.015498
 -1.335193	  1.082586	 -0.024303
 -1.325178	  1.067007	 -0.031851
 -1.315488	  1.052111	 -0.032989
 -1.304488	  1.034487	 -0.036817
 -1.292535	  1.019080	 -0.043267
 -1.280808	  1.005109	 -0.049876
 -1.270960	  0.985472	 -0.059257
 -1.265717	  0.970204	 -0.062714
 -1.255018	  0.952612	 -0.067903
 -1.244403	  0.937186	 -0.072171
 -1.232898	  0.920891	 -0.078103
 -1.221980	  0.905213	 -0.084055
 -1.210431	  0.889981	 -0.089938
 -1.197818	  0.875563	 -0.095687
 -1.185207	  0.861145	 -0.101437
 -1.171424	  0.848091	 -0.107486
 -1.156901	  0.836685	 -0.114216
 -1.140793	  0.827698	 -0.121155
 -1.122977	  0.816479	 -0.126790
 -1.109540	  0.804805	 -0.132894
 -1.098746	  0.789285	 -0.143759
 -1.085578	  0.776896	 -0.154241
 -1.068733	  0.766905	 -0.160048
 -1.051694	  0.758796	 -0.162737
 -1.035965	  0.748805	 -0.168952
 -1.019105	  0.735104	 -0.174869
 -1.003092	  0.723373	 -0.176826
 -0.987577	  0.715871	 -0.183444
 -0.969399	  0.707474	 -0.189627
 -0.951450	  0.697422	 -0.192635
 -0.938075	  0.684160	 -0.197331
 -0.923905	  0.671810	 -0.204133
 -0.908910	  0.659561	 -0.206722
 -0.890295	  0.645565	 -0.202842
 -0.874538	  0.635574	 -0.205811
 -0.862104	  0.623329	 -0.214860
 -0.849153	  0.608890	 -0.217984
 -0.829770	  0.594714	 -0.217156
 -0.815792	  0.583658	 -0.221024
 -0.803829	  0.567930	 -0.227459
 -0.789785	  0.556290	 -0.230878
 -0.770828	  0.546893	 -0.240654
 -0.758219	  0.531718	 -0.248819
 -0.752402	  0.516253	 -0.255861
 -0.742900	  0.502245	 -0.266564
 -0.727929	  0.486995	 -0.276731
 -0.719551	  0.472417	 -0.282897
 -0.710106	  0.459395	 -0.294103
 -0.695669	  0.445745	 -0.304899
 -0.686768	  0.430400	 -0.310575
 -0.677599	  0.416743	 -0.321203
 -0.663217	  0.403546	 -0.331144
 -0.652655	  0.386753	 -0.335665
 -0.643551	  0.371284	 -0.342581
 -0.630424	  0.360031	 -0.351969
 -0.617321	  0.344590	 -0.361490
 -0.606666	  0.329591	 -0.370313
 -0.595513	  0.321908	 -0.382305
 -0.581449	  0.309676	 -0.392615
 -0.571028	  0.295262	 -0.401503
 -0.557199	  0.283307	 -0.409321
 -0.541960	  0.272418	 -0.416135
 -0.530071	  0.255987	 -0.423825
 -0.521233	  0.238276	 -0.429513
 -0.509795	  0.224866	 -0.436836
 -0.499384	  0.208226	 -0.444595
 -0.488728	  0.192054	 -0.452311
 -0.474334	  0.183286	 -0.457200
 -0.461667	  0.168664	 -0.465449
 -0.449870	  0.152588	 -0.476379
 -0.434336	  0.141255	 -0.478959
 -0.422416	  0.124303	 -0.481119
 -0.414009	  0.107808	 -0.488642
 -0.401565	  0.093865	 -0.497126
 -0.388396	  0.081431	 -0.506593
 -0.377681	  0.065364	 -0.514044
 -0.364531	  0.053693	 -0.518088
 -0.351240	  0.035143	 -0.519383
 -0.339291	  0.018706	 -0.525129
 -0.323891	  0.013890	 -0.537197
 -0.307620	 -0.001100	 -0.544031
 -0.298493	 -0.012523	 -0.553560
 -0.286236	 -0.023109	 -0.565191
 -0.270223	 -0.026906	 -0.576853
 -0.248113	 -0.037930	 -0.585265
 -0.232765	 -0.049977	 -0.588536
 -0.223666	 -0.065539	 -0.594860
 -0.214295	 -0.081879	 -0.606072
 -0.200959	 -0.095894	 -0.615310
 -0.182059	 -0.100092	 -0.620143
 -0.165794	 -0.108198	 -0.628076
 -0.151467	 -0.119343	 -0.635979
 -0.136354	 -0.131315	 -0.638477
 -0.113885	 -0.143208	 -0.644988
 -0.099490	 -0.154792	 -0.646589
 -0.088626	 -0.164002	 -0.662009
 -0.075353	 -0.175059	 -0.673376
 -0.061837	 -0.182273	 -0.685411
 -0.046853	 -0.191115	 -0.696608
 -0.031057	 -0.200983	 -0.703862
 -0.009030	 -0.208452	 -0.705421
  0.010042	 -0.216859	 -0.705705
  0.025373	 -0.226671	 -0.711882
  0.035779	 -0.244166	 -0.726143
  0.046991	 -0.258809	 -0.736848
  0.056548	 -0.277559	 -0.740904
  0.066385	 -0.293148	 -0.745432
  0.077640	 -0.308955	 -0.746733
  0.091756	 -0.325614	 -0.749639
  0.107848	 -0.336921	 -0.752437
  0.124188	 -0.349159	 -0.753460
  0.135191	 -0.364256	 -0.758103
  0.145508	 -0.381059	 -0.772922
  0.157131	 -0.394609	 -0.785446
  0.167845	 -0.406875	 -0.789685
  0.183396	 -0.419002	 -0.791634
  0.198193	 -0.432792	 -0.797675
  0.209975	 -0.451629	 -0.803587
  0.221100	 -0.465522	 -0.809281
  0.234791	 -0.475930	 -0.816885
  0.249686	 -0.488424	 -0.822984
  0.264995	 -0.499164	 -0.829299
  0.279888	 -0.510879	 -0.840219
  0.288687	 -0.526466	 -0.849929
  0.297670	 -0.539722	 -0.857795
  0.310717	 -0.554440	 -0.870138
  0.324270	 -0.567268	 -0.878027
  0.334715	 -0.578842	 -0.887345
  0.348608	 -0.588838	 -0.901210
  0.357761	 -0.597881	 -0.914065
  0.368891	 -0.609064	 -0.925939
  0.383859	 -0.622499	 -0.937121
  0.395990	 -0.633097	 -0.950115
  0.404111	 -0.646463	 -0.959502
  0.416689	 -0.659922	 -0.968824
  0.431195	 -0.674876	 -0.974019
  0.443006	 -0.690173	 -0.978788
  0.453997	 -0.705803	 -0.984937
  0.464207	 -0.721484	 -0.992308
  0.473933	 -0.737233	 -0.999775
  0.484529	 -0.752845	 -1.007107
  0.494948	 -0.768393	 -1.014060
  0.507857	 -0.784199	 -1.017496
  0.524343	 -0.797929	 -1.016910
  0.540380	 -0.810523	 -1.018802
  0.551876	 -0.824263	 -1.023972
  0.562251	 -0.840897	 -1.029106
  0.572408	 -0.859247	 -1.038807
  0.582842	 -0.874313	 -1.047866
  0.596122	 -0.885364	 -1.053569
  0.610808	 -0.897616	 -1.059709
  0.629589	 -0.908335	 -1.065551
  0.645992	 -0.918558	 -1.070180
  0.659022	 -0.932273	 -1.076581
  0.670257	 -0.946589	 -1.083702
  0.683495	 -0.960286	 -1.091023
  0.697340	 -0.973071	 -1.097704
  0.711105	 -0.985787	 -1.104821
  0.724654	 -0.998651	 -1.112053
  0.736696	 -1.011861	 -1.120546
  0.748496	 -1.025637	 -1.129712
  0.759466	 -1.039224	 -1.138951
  0.774789	 -1.051205	 -1.147221
  0.793183	 -1.059299	 -1.153758
  0.809549	 -1.068417	 -1.161501
  0.820336	 -1.080038	 -1.171412
  0.833311	 -1.092666	 -1.181374
  0.845514	 -1.105045	 -1.191732
  0.858648	 -1.116678	 -1.201970
  0.871985	 -1.127423	 -1.212251
  0.886712	 -1.137330	 -1.221697
  0.903342	 -1.148206	 -1.228062
  0.920000	 -1.158928	 -1.233613
  0.933105	 -1.172617	 -1.238012
  0.947794	 -1.186321	 -1.243272
  0.958876	 -1.199950	 -1.250156
  0.972619	 -1.214095	 -1.255814
  0.986090	 -1.227709	 -1.261293
  0.999736	 -1.241647	 -1.266706
  1.012633	 -1.255768	 -1.272562
  1.025587	 -1.269939	 -1.278164
  1.038821	 -1.284330	 -1.282379
  1.052194	 -1.297965	 -1.288316
  1.065395	 -1.309186	 -1.298306
  1.078343	 -1.321293	 -1.307567
  1.090691	 -1.334959	 -1.315364
  1.103040	 -1.348623	 -1.323161
  1.115417	 -1.362293	 -1.330903
  1.128974	 -1.376086	 -1.335998
  1.142530	 -1.389879	 -1.341094
  1.156436	 -1.402263	 -1.348391
  1.170443	 -1.413570	 -1.357110
  1.184132	 -1.425621	 -1.365318
  1.197482	 -1.438374	 -1.373008
  1.210831	 -1.451126	 -1.380701
  1.223496	 -1.465259	 -1.387013
  1.235347	 -1.480616	 -1.391884
  1.247385	 -1.495489	 -1.397702
  1.259801	 -1.508513	 -1.406433
  1.272227	 -1.521534	 -1.415152
  1.286087	 -1.534223	 -1.422002
  1.299946	 -1.546911	 -1.428852
  1.313806	 -1.559600	 -1.435702
  1.327665	 -1.572288	 -1.442551
  1.341706	 -1.585156	 -1.449468
  1.360501	 -1.603820	 -1.456463
  1.374201	 -1.617529	 -1.461399
