  1.504111	  1.946993	 -0.083830
  1.506517	  1.949923	 -0.085791
  1.498633	  1.935952	 -0.073361
  1.488077	  1.922267	 -0.062992
  1.476531	  1.908666	 -0.054560
  1.466281	  1.895401	 -0.044032
  1.453471	  1.882237	 -0.032547
  1.443744	  1.870529	 -0.023899
  1.433131	  1.856386	 -0.011939
  1.423651	  1.842549	 -0.000789
  1.415330	  1.828999	  0.009753
  1.406262	  1.814544	  0.020940
  1.397039	  1.801237	  0.030309
  1.386834	  1.784301	  0.041585
  1.376799	  1.770587	  0.053646
  1.370595	  1.757763	  0.063198
  1.364672	  1.739968	  0.076076
  1.352544	  1.726475	  0.082734
  1.344618	  1.710959	  0.090076
  1.336569	  1.693359	  0.100126
  1.324004	  1.680674	  0.110128
  1.317453	  1.664510	  0.116671
  1.310317	  1.646555	  0.121737
  1.302278	  1.628638	  0.130289
  1.299186	  1.612116	  0.140006
  1.303853	  1.593992	  0.147062
  1.307508	  1.576055	  0.152164
  1.309992	  1.554446	  0.155638
  1.311577	  1.534434	  0.158171
  1.316023	  1.517279	  0.167463
  1.320352	  1.500448	  0.176684
  1.326409	  1.482115	  0.179981
  1.333105	  1.463456	  0.182636
  1.340318	  1.445060	  0.183324
  1.347964	  1.425156	  0.181954
  1.353137	  1.404612	  0.178107
  1.352941	  1.385775	  0.173958
  1.354507	  1.366138	  0.176358
  1.354791	  1.344657	  0.179693
  1.357686	  1.324041	  0.178470
  1.347707	  1.309167	  0.174616
  1.341518	  1.294257	  0.160485
  1.329740	  1.281839	  0.166707
  1.315188	  1.265502	  0.163928
  1.299457	  1.254589	  0.157429
  1.281991	  1.249983	  0.142860
  1.270799	  1.241521	  0.129231
  1.258152	  1.228493	  0.122383
  1.240312	  1.218400	  0.120236
  1.222091	  1.208252	  0.115331
  1.208714	  1.195936	  0.106754
  1.195910	  1.181656	  0.096335
  1.182890	  1.171129	  0.086434
  1.161044	  1.170202	  0.083029
  1.145413	  1.161085	  0.078539
  1.127811	  1.153950	  0.069768
  1.108533	  1.152015	  0.059859
  1.089724	  1.153539	  0.053648
  1.071404	  1.148553	  0.049445
  1.051603	  1.145256	  0.042644
  1.034402	  1.141966	  0.037308
  1.015068	  1.132778	  0.044034
  0.999026	  1.125551	  0.041935
  0.979361	  1.118590	  0.034976
  0.962997	  1.107420	  0.039479
  0.945785	  1.097686	  0.047463
  0.929350	  1.090884	  0.055809
  0.911241	  1.086593	  0.062639
  0.893374	  1.080789	  0.067589
  0.874263	  1.072828	  0.074007
  0.858025	  1.065954	  0.083392
  0.849112	  1.063083	  0.107717
  0.838580	  1.057302	  0.110942
  0.820118	  1.054627	  0.114951
  0.808307	  1.053942	  0.135208
  0.797154	  1.047222	  0.146486
  0.785964	  1.040234	  0.164016
  0.772162	  1.033442	  0.176879
  0.760830	  1.027943	  0.192731
  0.747117	  1.022692	  0.206709
  0.735713	  1.017766	  0.222543
  0.733354	  1.014384	  0.239704
  0.724276	  1.012666	  0.256478
  0.723482	  1.014617	  0.277091
  0.718669	  1.016028	  0.296305
  0.716921	  1.014705	  0.316402
  0.714768	  1.008070	  0.334499
  0.709224	  1.002222	  0.354829
  0.705004	  1.002706	  0.375175
  0.710606	  0.998482	  0.395540
  0.706581	  0.996649	  0.415832
  0.709152	  0.989944	  0.431747
  0.715021	  0.982098	  0.450934
  0.720664	  0.973717	  0.468548
  0.723918	  0.965620	  0.487402
  0.727703	  0.964448	  0.506981
  0.724359	  0.956377	  0.527174
  0.722467	  0.954052	  0.535499
  0.717319	  0.947319	  0.554565
  0.703762	  0.936118	  0.566298
  0.683642	  0.933204	  0.571233
  0.663804	  0.926822	  0.574609
  0.647658	  0.913868	  0.580246
  0.635943	  0.903567	  0.589654
  0.618680	  0.893686	  0.601903
  0.603627	  0.880259	  0.609743
  0.591984	  0.870855	  0.611405
  0.574819	  0.858404	  0.618445
  0.564136	  0.845315	  0.628349
  0.550807	  0.829792	  0.639231
  0.535556	  0.817791	  0.646233
  0.521703	  0.808174	  0.648748
  0.506652	  0.795283	  0.653280
  0.490046	  0.780247	  0.660140
  0.477679	  0.770606	  0.667748
  0.465748	  0.754057	  0.678654
  0.450614	  0.743466	  0.683709
  0.437304	  0.731593	  0.687696
  0.425577	  0.715674	  0.694089
  0.408996	  0.702329	  0.699632
  0.393357	  0.695068	  0.707434
  0.382288	  0.680114	  0.716888
  0.370393	  0.660547	  0.722533
  0.360619	  0.645222	  0.729951
  0.350017	  0.635659	  0.741775
  0.340714	  0.619270	  0.750590
  0.332548	  0.601581	  0.757124
  0.319561	  0.586935	  0.764125
  0.306805	  0.571567	  0.771699
  0.296933	  0.558661	  0.778128
  0.281462	  0.543534	  0.783833
  0.268673	  0.531111	  0.795270
  0.260999	  0.519971	  0.807537
  0.248338	  0.504574	  0.816757
  0.238000	  0.491732	  0.830519
  0.231721	  0.481106	  0.842221
  0.224648	  0.466127	  0.854880
  0.217861	  0.451303	  0.869023
  0.208530	  0.438512	  0.882674
  0.201191	  0.424322	  0.892182
  0.194047	  0.410823	  0.904344
  0.186867	  0.395800	  0.918001
  0.176163	  0.381713	  0.928480
  0.166565	  0.366944	  0.938829
  0.161508	  0.351639	  0.947794
  0.154695	  0.335917	  0.957779
  0.143777	  0.320538	  0.962751
  0.134896	  0.302230	  0.972266
  0.122514	  0.287521	  0.978498
  0.103841	  0.280255	  0.978009
  0.084589	  0.267198	  0.985901
  0.072089	  0.255915	  0.993833
  0.065941	  0.239664	  1.000016
  0.056555	  0.217654	  1.008077
  0.049432	  0.199679	  1.014380
  0.035564	  0.190099	  1.015878
  0.027283	  0.173334	  1.028806
  0.016065	  0.160005	  1.036236
  0.001202	  0.146638	  1.039824
 -0.013705	  0.130403	  1.043112
 -0.023330	  0.116925	  1.050488
 -0.036057	  0.105358	  1.058841
 -0.051386	  0.095690	  1.064474
 -0.066723	  0.082179	  1.074526
 -0.079107	  0.074462	  1.087728
 -0.092736	  0.055331	  1.093671
 -0.103746	  0.037408	  1.096835
 -0.112058	  0.017447	  1.093361
 -0.122349	  0.003030	  1.099466
 -0.134437	 -0.012093	  1.110191
 -0.150339	 -0.021169	  1.116349
 -0.166392	 -0.032499	  1.126002
 -0.180108	 -0.043975	  1.129084
 -0.192559	 -0.061271	  1.127983
 -0.205548	 -0.078211	  1.126769
 -0.221878	 -0.093208	  1.132198
 -0.235460	 -0.103431	  1.139402
 -0.252151	 -0.118150	  1.148247
 -0.265698	 -0.133340	  1.152672
 -0.270432	 -0.142935	  1.164673
 -0.286549	 -0.155723	  1.175699
 -0.294818	 -0.169092	  1.187058
 -0.302084	 -0.186710	  1.196085
 -0.311708	 -0.201653	  1.206363
 -0.327473	 -0.211327	  1.216117
 -0.342594	 -0.221622	  1.226307
 -0.352631	 -0.235625	  1.234304
 -0.364383	 -0.249531	  1.243186
 -0.378050	 -0.260984	  1.255199
 -0.384717	 -0.274460	  1.267973
 -0.394179	 -0.288713	  1.276720
 -0.401870	 -0.305793	  1.289765
 -0.408151	 -0.318033	  1.303193
 -0.416809	 -0.331020	  1.314370
 -0.424643	 -0.344969	  1.327118
 -0.433519	 -0.356565	  1.341696
 -0.446046	 -0.364534	  1.352916
 -0.460209	 -0.373344	  1.365723
 -0.474707	 -0.383330	  1.379052
 -0.488315	 -0.396286	  1.387538
 -0.496961	 -0.409418	  1.391812
 -0.508798	 -0.424738	  1.400039
 -0.525574	 -0.439650	  1.412964
 -0.538020	 -0.448899	  1.419057
 -0.547454	 -0.463232	  1.426596
 -0.560992	 -0.479375	  1.436279
 -0.577543	 -0.489708	  1.443206
 -0.589500	 -0.503455	  1.451197
 -0.596649	 -0.517004	  1.459448
 -0.608946	 -0.532079	  1.467656
 -0.621944	 -0.545676	  1.477841
 -0.634288	 -0.557923	  1.488072
 -0.646252	 -0.571187	  1.496444
 -0.655708	 -0.586972	  1.503756
 -0.667332	 -0.601481	  1.511692
 -0.680386	 -0.615160	  1.517828
 -0.691446	 -0.632654	  1.524654
 -0.699759	 -0.650505	  1.529514
 -0.708330	 -0.666218	  1.537227
 -0.721228	 -0.678598	  1.544754
 -0.733445	 -0.693308	  1.555336
 -0.741444	 -0.709993	  1.566543
 -0.746057	 -0.729381	  1.571154
 -0.754864	 -0.747786	  1.570921
 -0.767127	 -0.761317	  1.579481
 -0.777150	 -0.776093	  1.588721
 -0.786802	 -0.791546	  1.595130
 -0.795518	 -0.812426	  1.598747
 -0.803031	 -0.833799	  1.600756
 -0.815048	 -0.843598	  1.610726
 -0.828381	 -0.854878	  1.619923
 -0.843421	 -0.865406	  1.629614
 -0.856819	 -0.878086	  1.638263
 -0.870365	 -0.889940	  1.646261
 -0.882206	 -0.903464	  1.655233
 -0.894527	 -0.916438	  1.664110
 -0.904745	 -0.928541	  1.679110
 -0.918292	 -0.938773	  1.688972
 -0.932208	 -0.950709	  1.694671
 -0.945912	 -0.964981	  1.702513
 -0.957639	 -0.976790	  1.715487
 -0.971091	 -0.984005	  1.729219
 -0.984504	 -0.992493	  1.736319
 -1.000708	 -1.000975	  1.746457
 -1.015716	 -1.009828	  1.756693
 -1.030440	 -1.020737	  1.765211
 -1.045474	 -1.031476	  1.773816
 -1.060319	 -1.042470	  1.781570
 -1.074126	 -1.054821	  1.789455
 -1.088306	 -1.066950	  1.797539
 -1.100711	 -1.080497	  1.805646
 -1.113431	 -1.093802	  1.813816
 -1.124826	 -1.108607	  1.822023
 -1.136637	 -1.122751	  1.830197
 -1.146119	 -1.138570	  1.837983
 -1.156867	 -1.154105	  1.845760
 -1.165643	 -1.170954	  1.853204
 -1.174184	 -1.188156	  1.860259
 -1.179198	 -1.204255	  1.865572
 -1.188784	 -1.220672	  1.871786
