 0.0 0.0 0.0 0
 -0.6418071259460671 -0.595151667243978 0.441971172410207 1000
 -0.4789038839698777 -0.1757073211318536 -0.7409305424506493 1000
 -0.307500377268532 -0.8974471564006518 -0.5122977952551641 1000
 0.26217715323425506 -0.7196899837487335 0.29831823200779206 1000
 -0.17989436266253575 0.6683598930807731 0.9574993594701116 1000
 0.10013131462436355 0.9588562569790956 0.03940646132914187 1000
 0.4378835964214853 0.5963711491653256 0.7148722486133835 1000
 -0.28770236447312764 -0.6275119525762545 0.5602857754772951 1000
 0.0 0.0 0.0 0
 0.8361414126108482 0.09439572656274153 0.3101165108463452 1000
 0.9080620619872065 0.3090267765135503 -0.4193552301963334 1000
 -0.5164977787176404 0.8088143010087941 0.14757963616108719 1000
 0.565278380184859 0.8222498672075809 0.04814346046297524 1000
 -0.5780285283577711 0.4727665159982747 0.951315686400577 1000
 -0.5989691858137189 -0.24414171608869437 0.8119272562651025 1000
 0.8519656298956599 -0.48344753054853684 -0.207846726588883 1000
 0.44179280884835315 -0.7658653118101805 -0.8214697844161262 1000
 0.0 0.0 0.0 0
 0.7904133382873193 0.6002773708575035 -0.13644641036940303 1000
 0.2286741083539326 -0.9556817616010984 -0.2074135393009212 1000
 -0.9606212406987072 -0.19877154585807277 0.017822990532770533 1000
 -0.5178998372231921 0.6167422995491654 -0.21351636385621559 1000
 0.27745187750144684 -0.39340563727800004 -1.0409975417447608 1000
 -0.9114582328822888 0.20149704634131155 -0.017638497581883128 1000
 -0.22532359291148485 0.8755597178499557 -0.05202005288169742 1000
 0.5119047268174497 0.4992063117828489 -0.6413598679056267 1000
 0.0 0.0 0.0 0
 0.8990613569576476 -0.27164784394391617 -0.6680084552228013 1000
 -0.4086923020587677 0.9105449146275024 0.46742687865218074 1000
 -0.40086489173883577 0.04917358913241493 -0.7402865442971355 1000
 -0.6880798403704149 -0.71733036125345 -0.15022360306526028 1000
 0.3821287909460996 -0.4890495508735665 0.47580307920403775 1000
 0.2755940187530291 0.35299507008272035 0.8887623495305272 1000
 -0.6906389941522615 0.6205106724895125 0.04793835825388293 1000
 -0.786422914193298 -0.5113818526666133 0.37979288273979694 1000
 0.0 0.0 0.0 0
 0.01760420450177269 -0.9990557888920117 -0.29266474332997555 1000
 -0.06902303135558527 0.49646048756237043 1.005844914213882 1000
 0.745497867140282 -0.3327339927905122 -0.8688913597920773 1000
 -0.7610439344908762 0.6342916649677889 0.5495796228095469 1000
 -0.460552056864169 -0.09484483562946006 0.9358181376081809 1000
 0.6109743237783045 -0.34917434410720366 0.3880346213212087 1000
 0.9945606165639718 0.08287849462704733 -0.3122576250972273 1000
 -0.4617611677360359 -0.8752399351120443 -0.29834021063008975 1000
 0.0 0.0 0.0 0
 0.9378142693268647 -0.0003638150050424005 0.06707322947524808 1000
 0.141252234590532 -0.17280726750482212 -1.022976907127739 1000
 -0.4311729104398459 -0.43212718470489464 -0.7751157092272026 1000
 0.8724195137573844 0.4887830935759877 -0.06533415013941474 1000
 0.037060148225930026 -0.922448342224567 0.04807349017340101 1000
 -0.8227168639983752 0.15434799508694116 -0.2376957840536394 1000
 0.24719189397974994 -0.7705009609620554 -0.8830967708812848 1000
 0.8352682871982527 -0.5480510227029223 -0.3849887693833995 1000
 0.0 0.0 0.0 0
 0.47469497843272523 0.6831858590611705 -0.4329876020211436 1000
 0.752306840184814 0.26985756218296514 0.4492149601856743 1000
 0.1161787834793048 0.9918954253113034 0.35096439361392795 1000
 0.24205343165608995 -0.434003652541316 0.6124494867163771 1000
 0.5679918982957385 -0.031941720316705946 -0.9507469743293617 1000
 -0.2367016378681663 0.9712866393981753 0.38057521493729085 1000
