 -0.161381	 -2.591950	  1.560977
 -0.159784	 -2.566288	  1.545522
 -0.141232	 -2.518979	  1.530591
 -0.139380	 -2.469456	  1.516813
 -0.127433	 -2.422195	  1.503143
 -0.115077	 -2.377582	  1.484297
 -0.106904	 -2.330587	  1.471737
 -0.096298	 -2.283874	  1.459550
 -0.089992	 -2.235352	  1.446956
 -0.079012	 -2.189209	  1.431196
 -0.072233	 -2.143866	  1.414874
 -0.066482	 -2.096947	  1.399466
 -0.059057	 -2.050029	  1.384110
 -0.049702	 -2.003467	  1.368313
 -0.038904	 -1.957900	  1.350747
 -0.028438	 -1.913050	  1.331489
 -0.019815	 -1.867975	  1.311857
 -0.013304	 -1.821824	  1.292374
 -0.007707	 -1.774598	  1.273191
 -0.001519	 -1.727861	  1.255786
  0.005546	 -1.681095	  1.241750
  0.013069	 -1.632874	  1.234165
  0.022607	 -1.572884	  1.237845
  0.043751	 -1.483853	  1.272232
  0.087244	 -1.400940	  1.349735
  0.133314	 -1.346154	  1.416739
  0.168855	 -1.297002	  1.451374
  0.198351	 -1.247883	  1.469565
  0.223135	 -1.205831	  1.470713
  0.233089	 -1.177234	  1.437707
  0.255801	 -1.131604	  1.422099
  0.229864	 -1.070780	  1.429197
  0.230118	 -1.030740	  1.374930
  0.226740	 -1.019187	  1.296645
  0.219169	 -1.007159	  1.192258
  0.217687	 -0.980872	  1.078248
  0.220962	 -0.947344	  1.002198
  0.224724	 -0.912254	  0.960631
  0.231224	 -0.871414	  0.933055
  0.236628	 -0.826416	  0.911156
  0.239462	 -0.779541	  0.892075
  0.242040	 -0.732561	  0.874734
  0.245051	 -0.685170	  0.857111
  0.249550	 -0.637750	  0.838679
  0.255974	 -0.590662	  0.820267
  0.265167	 -0.544476	  0.803138
  0.275277	 -0.500067	  0.786762
  0.285826	 -0.454958	  0.770001
  0.296623	 -0.409755	  0.752795
  0.307404	 -0.364998	  0.735028
  0.318201	 -0.319975	  0.717133
  0.329165	 -0.274235	  0.699671
  0.341111	 -0.227261	  0.682976
  0.354095	 -0.179644	  0.668180
  0.367307	 -0.132834	  0.656169
  0.379813	 -0.085735	  0.645192
  0.391170	 -0.038714	  0.633350
  0.401332	  0.007527	  0.620084
  0.410289	  0.053360	  0.605723
  0.417641	  0.098484	  0.590528
  0.422725	  0.143351	  0.574206
  0.425107	  0.188668	  0.557092
  0.425101	  0.236221	  0.540156
  0.425164	  0.284590	  0.525041
  0.427453	  0.333316	  0.512517
  0.434456	  0.383291	  0.502192
  0.446650	  0.433908	  0.492297
  0.463575	  0.484388	  0.481439
  0.483040	  0.531698	  0.470883
  0.503521	  0.575570	  0.460037
  0.523674	  0.618484	  0.447695
  0.540991	  0.662311	  0.433190
  0.553104	  0.707651	  0.416729
  0.561993	  0.752998	  0.399443
  0.569104	  0.798060	  0.380657
  0.575230	  0.842630	  0.359611
  0.581502	  0.886985	  0.335928
  0.588643	  0.934433	  0.303790
  0.597941	  0.982793	  0.252868
  0.613559	  1.014086	  0.188172
  0.634543	  1.030068	  0.120880
  0.654494	  1.047692	  0.054553
  0.698388	  1.073468	  0.017884
  0.739548	  1.093516	 -0.017494
  0.756042	  1.119963	 -0.039364
  0.763687	  1.129930	 -0.051318
  0.773960	  1.135677	 -0.061813
  0.807477	  1.151099	 -0.080897
  0.908716	  1.300361	 -0.055584
  0.947374	  1.399548	 -0.069862
  0.945122	  1.477608	 -0.074653
  0.937083	  1.511062	 -0.084366
  0.930293	  1.549468	 -0.105367
  0.920156	  1.579717	 -0.109131
  0.904467	  1.632213	 -0.090242
  0.891860	  1.685045	 -0.076039
  0.877406	  1.753362	 -0.071317
  0.867345	  1.822250	 -0.073915
  0.862330	  1.879405	 -0.082329
  0.859841	  1.926114	 -0.092863
  0.859012	  1.970766	 -0.105734
  0.860313	  2.015923	 -0.120364
  0.863849	  2.061651	 -0.137209
  0.869990	  2.106988	 -0.154810
  0.878421	  2.150949	 -0.172650
  0.888579	  2.195976	 -0.191195
  0.899022	  2.241869	 -0.209692
  0.908058	  2.288542	 -0.226656
  0.915467	  2.335343	 -0.240202
  0.921669	  2.382786	 -0.251889
  0.928005	  2.431267	 -0.262573
  0.934850	  2.481350	 -0.271265
  0.942600	  2.531090	 -0.278236
  0.951639	  2.578691	 -0.291453
  0.961473	  2.623244	 -0.313117
  0.969749	  2.669824	 -0.330114
  0.985921	  2.715175	 -0.342638
  0.996215	  2.756861	 -0.365130
  1.009753	  2.798577	 -0.385181
  1.019850	  2.826563	 -0.389033
