 -2.772100	 -0.442106	  1.140571
 -2.744654	 -0.437729	  1.129278
 -2.699507	 -0.408882	  1.136444
 -2.654314	 -0.383168	  1.132352
 -2.614272	 -0.352719	  1.127939
 -2.573922	 -0.321354	  1.130952
 -2.535000	 -0.288641	  1.130736
 -2.493461	 -0.263714	  1.126857
 -2.452830	 -0.236191	  1.125277
 -2.409967	 -0.207637	  1.126578
 -2.371582	 -0.184057	  1.127670
 -2.330217	 -0.158093	  1.128412
 -2.285367	 -0.136757	  1.132635
 -2.237237	 -0.115874	  1.129840
 -2.193505	 -0.085571	  1.134993
 -2.153907	 -0.055998	  1.136475
 -2.112913	 -0.032303	  1.130992
 -2.068312	 -0.011413	  1.121621
 -2.024179	  0.011726	  1.121939
 -1.981296	  0.030975	  1.126096
 -1.934904	  0.053912	  1.127480
 -1.889540	  0.080939	  1.129639
 -1.848409	  0.109373	  1.132035
 -1.808892	  0.137081	  1.133934
 -1.767137	  0.163783	  1.138222
 -1.726828	  0.194907	  1.143880
 -1.690567	  0.229532	  1.143905
 -1.648252	  0.254835	  1.134872
 -1.607461	  0.277036	  1.126488
 -1.564705	  0.300943	  1.121637
 -1.520425	  0.327748	  1.119377
 -1.479949	  0.356388	  1.117656
 -1.439823	  0.386079	  1.115048
 -1.396475	  0.414303	  1.114965
 -1.353341	  0.439514	  1.118555
 -1.310536	  0.463099	  1.123055
 -1.265543	  0.486477	  1.126450
 -1.221648	  0.509825	  1.129254
 -1.180346	  0.534188	  1.131692
 -1.137202	  0.559118	  1.135047
 -1.094378	  0.580861	  1.140515
 -1.056264	  0.594639	  1.147905
 -1.016413	  0.599321	  1.159612
 -0.914699	  0.575583	  1.198907
 -0.839579	  0.536541	  1.230836
 -0.788845	  0.507938	  1.255967
 -0.683354	  0.469914	  1.300077
 -0.626016	  0.463253	  1.301060
 -0.516091	  0.415369	  1.278121
 -0.450698	  0.392093	  1.271457
 -0.433544	  0.397443	  1.263145
 -0.382120	  0.442074	  1.244411
 -0.314483	  0.480764	  1.199803
 -0.263716	  0.495074	  1.167171
 -0.227454	  0.505832	  1.139064
 -0.154365	  0.536574	  1.107095
 -0.133199	  0.547302	  1.092319
 -0.112851	  0.580020	  1.049321
 -0.082254	  0.693521	  0.959520
 -0.021316	  0.849469	  0.981416
 -0.007910	  0.889331	  0.989621
 -0.003828	  0.925968	  0.999678
 -0.003783	  0.984184	  1.016236
 -0.008014	  1.065887	  1.044129
 -0.005782	  1.118963	  1.065574
 -0.009911	  1.174715	  1.092202
  0.000811	  1.247373	  1.124762
  0.034751	  1.297840	  1.136334
  0.073951	  1.332957	  1.138478
  0.117355	  1.361997	  1.136346
  0.159604	  1.387473	  1.132583
  0.199718	  1.410885	  1.129326
  0.242552	  1.436567	  1.127716
  0.284480	  1.464232	  1.127142
  0.324717	  1.493590	  1.126772
  0.366308	  1.525817	  1.127212
  0.404518	  1.556948	  1.128493
  0.443052	  1.589514	  1.130680
  0.478089	  1.620315	  1.132341
  0.518595	  1.650681	  1.134500
  0.561140	  1.677840	  1.131953
  0.607394	  1.702122	  1.126007
  0.649685	  1.724680	  1.122082
  0.691426	  1.747867	  1.120027
  0.735154	  1.773419	  1.118528
  0.778520	  1.800161	  1.117294
  0.821944	  1.827571	  1.117417
  0.861897	  1.853036	  1.119034
  0.902203	  1.878687	  1.120634
  0.945193	  1.905624	  1.120785
  0.988235	  1.931600	  1.119482
  1.029307	  1.955623	  1.118372
  1.073616	  1.981422	  1.118072
  1.115834	  2.008344	  1.118553
  1.153151	  2.035142	  1.115118
  1.195054	  2.058808	  1.115146
  1.237066	  2.086276	  1.115217
  1.278274	  2.116665	  1.110903
  1.321981	  2.142100	  1.114742
  1.362717	  2.171226	  1.116258
  1.402169	  2.202620	  1.115863
  1.443838	  2.226365	  1.116824
  1.489240	  2.251578	  1.122378
  1.529947	  2.279787	  1.125539
  1.564392	  2.304010	  1.115444
  1.580036	  2.327050	  1.126599
