 -0.231830	 -0.958183	 -2.317729
 -0.236524	 -0.950058	 -2.300314
 -0.236576	 -0.949969	 -2.300123
 -0.241581	 -0.941016	 -2.282954
 -0.246706	 -0.931724	 -2.266004
 -0.251951	 -0.922231	 -2.249199
 -0.257501	 -0.912112	 -2.232865
 -0.263088	 -0.901960	 -2.216566
 -0.269358	 -0.890773	 -2.201224
 -0.275853	 -0.879219	 -2.186284
 -0.282709	 -0.866925	 -2.172110
 -0.289993	 -0.853828	 -2.158781
 -0.297384	 -0.840999	 -2.144995
 -0.304758	 -0.829671	 -2.129782
 -0.311560	 -0.819091	 -2.114087
 -0.318429	 -0.809122	 -2.097870
 -0.325848	 -0.800045	 -2.081189
 -0.333588	 -0.791864	 -2.064481
 -0.340739	 -0.785749	 -2.048838
 -0.349815	 -0.773566	 -2.035746
 -0.361033	 -0.760121	 -2.017685
 -0.370299	 -0.752659	 -1.997736
 -0.375387	 -0.748600	 -1.983746
 -0.383038	 -0.742473	 -1.963807
 -0.390852	 -0.735819	 -1.944671
 -0.395496	 -0.728482	 -1.929027
 -0.400000	 -0.718249	 -1.917158
 -0.407482	 -0.709444	 -1.898919
 -0.414231	 -0.707952	 -1.874868
 -0.419391	 -0.710476	 -1.858820
 -0.430186	 -0.714028	 -1.832363
 -0.439678	 -0.717901	 -1.810016
 -0.444652	 -0.721643	 -1.791587
 -0.447772	 -0.723694	 -1.771026
 -0.451650	 -0.723223	 -1.751300
 -0.457782	 -0.718552	 -1.733639
 -0.465610	 -0.706115	 -1.717817
 -0.473947	 -0.686523	 -1.703149
 -0.480916	 -0.670700	 -1.691114
 -0.489001	 -0.661399	 -1.677592
 -0.497356	 -0.651883	 -1.657885
 -0.503712	 -0.642295	 -1.633874
 -0.506991	 -0.634835	 -1.624117
 -0.509135	 -0.629709	 -1.616015
 -0.514049	 -0.620834	 -1.593916
 -0.519539	 -0.610622	 -1.572096
 -0.524174	 -0.598453	 -1.551688
 -0.523835	 -0.586326	 -1.536002
 -0.524324	 -0.577739	 -1.526108
 -0.525060	 -0.558984	 -1.503075
 -0.524004	 -0.546865	 -1.481626
 -0.521350	 -0.544268	 -1.476871
 -0.524493	 -0.537532	 -1.465099
 -0.529525	 -0.527265	 -1.453089
 -0.534823	 -0.510950	 -1.436743
 -0.534790	 -0.493425	 -1.426973
 -0.533062	 -0.475207	 -1.417729
 -0.529962	 -0.459994	 -1.411307
 -0.529395	 -0.440078	 -1.400955
 -0.529789	 -0.424929	 -1.391357
 -0.526988	 -0.405653	 -1.383606
 -0.518060	 -0.381162	 -1.374128
 -0.507866	 -0.364951	 -1.366334
 -0.501605	 -0.353539	 -1.361396
 -0.493369	 -0.338022	 -1.353297
 -0.488656	 -0.319706	 -1.344560
 -0.484760	 -0.301820	 -1.337287
 -0.481875	 -0.282811	 -1.326963
 -0.474608	 -0.261606	 -1.316875
 -0.473280	 -0.255342	 -1.313046
 -0.470387	 -0.230326	 -1.299921
 -0.468553	 -0.219765	 -1.289196
 -0.468870	 -0.211691	 -1.278542
 -0.472771	 -0.201800	 -1.260041
 -0.477903	 -0.193868	 -1.241728
 -0.480484	 -0.183678	 -1.225849
 -0.485325	 -0.177461	 -1.211152
 -0.490348	 -0.175167	 -1.191484
 -0.490995	 -0.177785	 -1.171129
 -0.498346	 -0.184196	 -1.146781
 -0.503660	 -0.190359	 -1.132847
 -0.511363	 -0.199523	 -1.119363
 -0.519368	 -0.210422	 -1.099951
 -0.532572	 -0.222096	 -1.087363
 -0.540433	 -0.226324	 -1.081603
 -0.560032	 -0.234022	 -1.071316
 -0.574247	 -0.239749	 -1.056492
 -0.583310	 -0.250831	 -1.045529
 -0.594441	 -0.263180	 -1.034337
 -0.609068	 -0.268053	 -1.021270
 -0.619711	 -0.270588	 -1.003626
 -0.627327	 -0.275549	 -0.977227
 -0.635577	 -0.283116	 -0.952438
 -0.641907	 -0.294745	 -0.933534
 -0.645379	 -0.300551	 -0.923738
 -0.651389	 -0.310917	 -0.907213
 -0.656885	 -0.313187	 -0.886959
 -0.665176	 -0.311992	 -0.870987
 -0.677614	 -0.311104	 -0.848066
 -0.685492	 -0.311887	 -0.837493
 -0.698001	 -0.319289	 -0.814862
 -0.705512	 -0.322769	 -0.804218
 -0.715935	 -0.326694	 -0.786110
 -0.715356	 -0.329772	 -0.769313
 -0.724825	 -0.333331	 -0.735700
 -0.731097	 -0.333875	 -0.725245
 -0.737648	 -0.335052	 -0.711737
 -0.748325	 -0.328213	 -0.686209
 -0.754981	 -0.325715	 -0.668663
 -0.760683	 -0.325670	 -0.653614
 -0.771751	 -0.330891	 -0.631535
 -0.781268	 -0.330911	 -0.615913
 -0.789729	 -0.320156	 -0.600118
 -0.794661	 -0.307508	 -0.581772
 -0.799146	 -0.296913	 -0.565895
 -0.809267	 -0.295387	 -0.548177
 -0.821609	 -0.295940	 -0.527732
 -0.828226	 -0.289871	 -0.508561
 -0.830597	 -0.285094	 -0.493979
 -0.839396	 -0.283434	 -0.474851
 -0.846855	 -0.276891	 -0.455881
 -0.850073	 -0.273094	 -0.441336
 -0.859775	 -0.271055	 -0.419937
 -0.867335	 -0.263422	 -0.400319
 -0.868495	 -0.252219	 -0.381963
 -0.861003	 -0.243480	 -0.365827
 -0.861384	 -0.236444	 -0.346294
 -0.869553	 -0.228846	 -0.327595
 -0.871261	 -0.216393	 -0.300861
 -0.867604	 -0.209530	 -0.286744
 -0.864784	 -0.204124	 -0.273756
 -0.860999	 -0.194187	 -0.250974
 -0.861607	 -0.186018	 -0.232869
 -0.864880	 -0.180116	 -0.216878
 -0.871448	 -0.171498	 -0.194721
 -0.876026	 -0.163709	 -0.179620
 -0.878493	 -0.156595	 -0.164756
 -0.884084	 -0.145220	 -0.139860
 -0.888380	 -0.135769	 -0.122146
 -0.890895	 -0.129226	 -0.109880
 -0.896588	 -0.119061	 -0.088409
 -0.902549	 -0.108758	 -0.069758
 -0.905997	 -0.101960	 -0.058706
 -0.912920	 -0.090470	 -0.040826
 -0.924387	 -0.077639	 -0.022513
 -0.930408	 -0.074129	 -0.014437
 -0.940407	 -0.064347	  0.008597
 -0.944415	 -0.055424	  0.028456
 -0.947722	 -0.048751	  0.044802
 -0.952299	 -0.039781	  0.064642
 -0.957216	 -0.033010	  0.083319
 -0.961870	 -0.027198	  0.101007
 -0.967070	 -0.023501	  0.113335
 -0.974588	 -0.015416	  0.134431
 -0.980780	 -0.009870	  0.153890
 -0.988083	 -0.003612	  0.174589
 -0.992971	  0.000475	  0.189720
 -0.997378	  0.005744	  0.204740
 -1.008246	  0.012753	  0.224742
 -1.017166	  0.017241	  0.242979
 -1.026238	  0.021477	  0.259441
 -1.034845	  0.025655	  0.277126
 -1.042452	  0.030548	  0.295266
 -1.050442	  0.036444	  0.312950
 -1.057035	  0.041630	  0.329880
 -1.061437	  0.042452	  0.350372
 -1.070061	  0.042144	  0.370379
 -1.087505	  0.044369	  0.389694
 -1.101409	  0.054914	  0.406245
 -1.102796	  0.075110	  0.421203
 -1.100807	  0.094927	  0.431360
 -1.103726	  0.112188	  0.445285
 -1.111281	  0.121304	  0.460683
 -1.121677	  0.124355	  0.477475
 -1.135440	  0.121800	  0.495703
 -1.145399	  0.120881	  0.515434
 -1.148417	  0.124764	  0.533478
 -1.151092	  0.131782	  0.552377
 -1.162687	  0.136431	  0.571914
 -1.174521	  0.142304	  0.589819
 -1.180985	  0.153819	  0.603987
 -1.181183	  0.168847	  0.616674
 -1.182345	  0.178811	  0.637351
 -1.186946	  0.182391	  0.656653
 -1.189679	  0.181818	  0.672592
 -1.198378	  0.181231	  0.697011
 -1.206264	  0.190745	  0.725372
 -1.206846	  0.196568	  0.736253
 -1.207615	  0.202410	  0.746217
 -1.210234	  0.211432	  0.770933
 -1.216743	  0.215619	  0.794218
 -1.221878	  0.217196	  0.808680
 -1.230907	  0.217445	  0.828657
 -1.238724	  0.218150	  0.845878
 -1.246006	  0.222038	  0.864902
 -1.251452	  0.229772	  0.887890
 -1.254314	  0.234842	  0.901331
 -1.257192	  0.244036	  0.921866
 -1.261768	  0.250943	  0.940903
 -1.267703	  0.253921	  0.956441
 -1.276219	  0.254778	  0.978405
 -1.283123	  0.256023	  0.999965
 -1.289954	  0.256989	  1.013605
 -1.301476	  0.260472	  1.042234
 -1.301266	  0.273806	  1.064324
 -1.300562	  0.278997	  1.073304
 -1.295770	  0.287201	  1.087439
 -1.292807	  0.294986	  1.117946
 -1.295097	  0.303364	  1.138278
 -1.296431	  0.307131	  1.150087
 -1.300310	  0.318520	  1.167439
 -1.300836	  0.332349	  1.185581
 -1.301718	  0.339687	  1.197260
 -1.305344	  0.354648	  1.225640
 -1.311679	  0.365857	  1.242979
 -1.314048	  0.371160	  1.248939
 -1.321339	  0.384842	  1.268184
 -1.323875	  0.391689	  1.282834
 -1.327080	  0.401737	  1.302471
 -1.332452	  0.417227	  1.322837
 -1.336027	  0.428122	  1.333787
 -1.338831	  0.437507	  1.344840
 -1.348271	  0.456298	  1.371775
 -1.352597	  0.464045	  1.384261
 -1.355008	  0.469003	  1.395780
 -1.357647	  0.476945	  1.416213
 -1.360879	  0.489396	  1.438906
 -1.364339	  0.499721	  1.453312
 -1.368669	  0.510598	  1.470856
 -1.372264	  0.519169	  1.482596
 -1.378081	  0.531359	  1.501535
 -1.383737	  0.540839	  1.519207
 -1.388822	  0.548710	  1.537337
 -1.391484	  0.555139	  1.555538
 -1.392323	  0.562441	  1.576800
 -1.393916	  0.566241	  1.596216
 -1.402460	  0.569601	  1.618034
 -1.413296	  0.572194	  1.635903
 -1.421655	  0.574685	  1.648730
 -1.432828	  0.576351	  1.671096
 -1.438296	  0.577517	  1.688438
 -1.442251	  0.579084	  1.703782
 -1.450404	  0.581313	  1.736912
 -1.451883	  0.579767	  1.747936
 -1.454874	  0.579252	  1.765184
 -1.461757	  0.579454	  1.793860
 -1.466079	  0.578447	  1.807838
 -1.471175	  0.580108	  1.824159
 -1.481340	  0.592748	  1.854900
 -1.487443	  0.608282	  1.868389
 -1.491710	  0.619322	  1.874820
 -1.499070	  0.638672	  1.896018
 -1.502466	  0.646370	  1.909265
