 -1.635447	  1.405704	  1.266904
 -1.648413	  1.415621	  1.272376
 -1.630463	  1.403961	  1.268807
 -1.611267	  1.394159	  1.266186
 -1.597670	  1.386135	  1.264467
 -1.577877	  1.376686	  1.262389
 -1.560193	  1.363660	  1.255208
 -1.550103	  1.351946	  1.247653
 -1.533989	  1.339513	  1.241422
 -1.517777	  1.326842	  1.231937
 -1.506988	  1.316611	  1.220185
 -1.491775	  1.308220	  1.208624
 -1.475731	  1.300491	  1.197353
 -1.463045	  1.292348	  1.184481
 -1.447287	  1.284644	  1.174274
 -1.433198	  1.274687	  1.165691
 -1.421821	  1.260499	  1.152830
 -1.409001	  1.248413	  1.143858
 -1.393648	  1.232338	  1.138374
 -1.380454	  1.218387	  1.136431
 -1.366702	  1.206674	  1.132267
 -1.353355	  1.193649	  1.118947
 -1.346069	  1.181614	  1.110030
 -1.338469	  1.164859	  1.102363
 -1.322347	  1.144236	  1.091464
 -1.315162	  1.135867	  1.085830
 -1.304061	  1.122549	  1.074837
 -1.293884	  1.107582	  1.062547
 -1.285303	  1.093920	  1.051146
 -1.279353	  1.082417	  1.044573
 -1.272657	  1.061789	  1.037172
 -1.262315	  1.041479	  1.021328
 -1.259261	  1.032116	  1.009714
 -1.257931	  1.019760	  0.996820
 -1.257100	  1.002225	  0.982483
 -1.253619	  0.987396	  0.969173
 -1.247799	  0.974627	  0.958132
 -1.240777	  0.956817	  0.945518
 -1.228958	  0.945754	  0.926691
 -1.219892	  0.941290	  0.907870
 -1.215386	  0.933380	  0.894700
 -1.214517	  0.913802	  0.882579
 -1.213924	  0.892217	  0.872769
 -1.207172	  0.877939	  0.863867
 -1.195694	  0.863648	  0.857680
 -1.185164	  0.844632	  0.852343
 -1.174285	  0.830233	  0.845257
 -1.161589	  0.817958	  0.838442
 -1.152608	  0.802111	  0.829850
 -1.143153	  0.788025	  0.818943
 -1.134763	  0.774645	  0.807414
 -1.126047	  0.758817	  0.798944
 -1.106727	  0.744022	  0.792665
 -1.088900	  0.736060	  0.786620
 -1.075698	  0.729844	  0.780249
 -1.059117	  0.718946	  0.773927
 -1.041530	  0.708822	  0.771024
 -1.027824	  0.695878	  0.767213
 -1.010374	  0.683697	  0.762349
 -0.990469	  0.680858	  0.757922
 -0.973345	  0.674893	  0.749133
 -0.953694	  0.663498	  0.743936
 -0.939657	  0.650811	  0.747361
 -0.924678	  0.638119	  0.753394
 -0.906089	  0.628475	  0.752852
 -0.885770	  0.626585	  0.751743
 -0.865536	  0.623991	  0.754771
 -0.852053	  0.615268	  0.759486
 -0.835440	  0.601994	  0.766069
 -0.818392	  0.587138	  0.772927
 -0.803432	  0.584284	  0.782664
 -0.784988	  0.585652	  0.793164
 -0.767225	  0.584435	  0.803107
 -0.749886	  0.580058	  0.809747
 -0.729253	  0.574414	  0.816738
 -0.710681	  0.570918	  0.828195
 -0.699041	  0.570419	  0.840620
 -0.682083	  0.569315	  0.853426
 -0.665209	  0.562531	  0.862988
 -0.647301	  0.554793	  0.869927
 -0.628395	  0.549226	  0.875986
 -0.609170	  0.545015	  0.881557
 -0.589897	  0.540781	  0.885570
 -0.570479	  0.536044	  0.887587
 -0.551451	  0.530110	  0.888005
 -0.532839	  0.523476	  0.888361
 -0.514335	  0.514756	  0.884541
 -0.496844	  0.508392	  0.878758
 -0.478725	  0.503166	  0.875280
 -0.460174	  0.498801	  0.874029
 -0.441437	  0.492908	  0.873558
 -0.422757	  0.487422	  0.871141
 -0.404708	  0.483722	  0.862687
 -0.386186	  0.470384	  0.847059
 -0.373640	  0.457238	  0.840509
 -0.362844	  0.443068	  0.842675
 -0.346767	  0.426298	  0.841846
 -0.331623	  0.410946	  0.836001
 -0.319273	  0.402977	  0.830328
 -0.301005	  0.390486	  0.826132
 -0.285529	  0.378108	  0.818242
 -0.272765	  0.368543	  0.806598
 -0.259133	  0.357846	  0.798406
 -0.244076	  0.345270	  0.792270
 -0.227759	  0.335263	  0.788187
 -0.210138	  0.327026	  0.780244
 -0.195974	  0.315480	  0.775279
 -0.182145	  0.305445	  0.766563
 -0.161539	  0.295470	  0.759526
 -0.147310	  0.285737	  0.757551
 -0.134294	  0.274094	  0.751085
 -0.113616	  0.264287	  0.741242
 -0.096019	  0.257105	  0.736804
 -0.084216	  0.246500	  0.732490
 -0.066746	  0.232740	  0.727396
 -0.045864	  0.224737	  0.721520
 -0.033417	  0.220836	  0.711761
 -0.017624	  0.211196	  0.703289
  0.004295	  0.201404	  0.699037
  0.021579	  0.198981	  0.691795
  0.036583	  0.195246	  0.680264
  0.051430	  0.187758	  0.667886
  0.067532	  0.180501	  0.657504
  0.084454	  0.174801	  0.648297
  0.099429	  0.168503	  0.637400
  0.112146	  0.160177	  0.623592
  0.127242	  0.150183	  0.612878
  0.150739	  0.141458	  0.609317
  0.168050	  0.141343	  0.606903
  0.185673	  0.140669	  0.596923
  0.205399	  0.135626	  0.585428
  0.223661	  0.126054	  0.580488
  0.234096	  0.112688	  0.573593
  0.245954	  0.097076	  0.562512
  0.260694	  0.086634	  0.552593
  0.278158	  0.078470	  0.549048
  0.297871	  0.066833	  0.553117
  0.321507	  0.054730	  0.555041
  0.333291	  0.050334	  0.552577
  0.348607	  0.043129	  0.544609
  0.370855	  0.029788	  0.537027
  0.386105	  0.017635	  0.531984
  0.397969	  0.006525	  0.526985
  0.414740	 -0.004826	  0.517885
  0.428281	 -0.013891	  0.506890
  0.441927	 -0.025994	  0.491047
  0.454001	 -0.043572	  0.478129
  0.467540	 -0.061512	  0.477296
  0.478928	 -0.071469	  0.481774
  0.496521	 -0.084667	  0.483511
  0.510786	 -0.098455	  0.483626
  0.527883	 -0.111861	  0.484498
  0.549066	 -0.125974	  0.483861
  0.559780	 -0.134853	  0.483102
  0.574283	 -0.149109	  0.478462
  0.592804	 -0.160868	  0.478832
  0.608353	 -0.169683	  0.483075
  0.623024	 -0.183166	  0.483520
  0.639010	 -0.195957	  0.481530
  0.659756	 -0.204685	  0.482797
  0.679672	 -0.214106	  0.484594
  0.692969	 -0.228287	  0.480547
  0.703613	 -0.241251	  0.471167
  0.717980	 -0.253386	  0.461313
  0.733130	 -0.264959	  0.453596
  0.747995	 -0.276461	  0.446679
  0.762848	 -0.287952	  0.439772
  0.777280	 -0.299783	  0.432855
  0.791373	 -0.312534	  0.428225
  0.806893	 -0.324623	  0.424221
  0.823764	 -0.334907	  0.414287
  0.838117	 -0.342202	  0.399712
  0.849981	 -0.354044	  0.385958
  0.859570	 -0.369203	  0.379886
  0.872680	 -0.382797	  0.375027
  0.888414	 -0.390050	  0.363602
  0.908617	 -0.400469	  0.350957
  0.921842	 -0.411244	  0.346654
  0.936496	 -0.424047	  0.345093
  0.951681	 -0.435068	  0.341734
  0.968926	 -0.445143	  0.332246
  0.982824	 -0.458771	  0.322831
  0.994466	 -0.473388	  0.321441
  1.010481	 -0.485670	  0.320262
  1.029346	 -0.493475	  0.314050
  1.045641	 -0.500862	  0.303942
  1.057998	 -0.513515	  0.292335
  1.069463	 -0.527463	  0.285480
  1.083014	 -0.543521	  0.278989
  1.097369	 -0.555805	  0.269846
  1.112197	 -0.562230	  0.257134
  1.127879	 -0.566690	  0.243309
  1.145243	 -0.567677	  0.233581
  1.162902	 -0.569623	  0.224553
  1.179753	 -0.574092	  0.213199
  1.195190	 -0.578947	  0.201328
  1.210488	 -0.582836	  0.189048
  1.225094	 -0.582164	  0.175407
  1.239695	 -0.581466	  0.161757
  1.254297	 -0.580769	  0.148107
  1.268898	 -0.580071	  0.134458
  1.283499	 -0.579375	  0.120807
  1.298093	 -0.578641	  0.107160
  1.310923	 -0.571509	  0.093586
  1.323372	 -0.563594	  0.080108
  1.335647	 -0.555897	  0.066335
  1.347393	 -0.548731	  0.052493
  1.357613	 -0.548168	  0.041748
  1.367401	 -0.561332	  0.043983
  1.380499	 -0.576418	  0.046913
  1.391137	 -0.592790	  0.050230
  1.405478	 -0.608056	  0.052608
  1.420781	 -0.622112	  0.054373
  1.434492	 -0.636809	  0.056938
  1.452684	 -0.649027	  0.059874
  1.470683	 -0.659027	  0.061133
  1.490065	 -0.667517	  0.060867
  1.507922	 -0.676546	  0.058926
  1.525300	 -0.686222	  0.055279
  1.540237	 -0.697636	  0.050817
  1.552095	 -0.713434	  0.047055
  1.563138	 -0.728637	  0.043643
  1.572438	 -0.745600	  0.041114
  1.581213	 -0.762695	  0.040877
  1.592252	 -0.780195	  0.043394
  1.605591	 -0.795721	  0.045129
  1.617168	 -0.811170	  0.043861
  1.626176	 -0.828153	  0.039564
  1.634146	 -0.845667	  0.035442
  1.645933	 -0.863783	  0.030932
  1.660178	 -0.882598	  0.026922
  1.668646	 -0.894762	  0.025097
  1.679807	 -0.913803	  0.024974
  1.692908	 -0.933356	  0.023814
  1.702955	 -0.945953	  0.019935
  1.714604	 -0.960616	  0.014862
  1.727652	 -0.978981	  0.013027
  1.740778	 -0.995535	  0.010691
  1.753166	 -1.007763	  0.004137
  1.765658	 -1.022362	 -0.004997
  1.777201	 -1.034616	 -0.016556
  1.789701	 -1.049546	 -0.024665
  1.802597	 -1.062811	 -0.030088
  1.816521	 -1.075553	 -0.036901
  1.831509	 -1.088695	 -0.040225
  1.845338	 -1.105392	 -0.044001
  1.856346	 -1.120869	 -0.055093
  1.868416	 -1.131565	 -0.066012
  1.883157	 -1.142966	 -0.072331
  1.898155	 -1.154537	 -0.079533
  1.913473	 -1.166596	 -0.087123
  1.929321	 -1.178000	 -0.093523
  1.944994	 -1.186519	 -0.102648
  1.958768	 -1.196834	 -0.108893
  1.975515	 -1.211259	 -0.111567
  1.995207	 -1.222314	 -0.117390
  2.008797	 -1.228209	 -0.130834
  2.018066	 -1.235698	 -0.145216
  2.034238	 -1.247646	 -0.158664
  2.047656	 -1.257400	 -0.164646
  2.061638	 -1.271950	 -0.175059
  2.074072	 -1.284411	 -0.185514
  2.085343	 -1.292299	 -0.191217
  2.106104	 -1.303202	 -0.196324
  2.127869	 -1.306530	 -0.204992
  2.142397	 -1.317999	 -0.212568
