 -1.074833	 -2.249664	  0.415220
 -1.075391	 -2.250247	  0.415827
 -1.078213	 -2.249240	  0.390480
 -1.068542	 -2.235761	  0.372336
 -1.056808	 -2.228394	  0.361221
 -1.038742	 -2.222067	  0.354095
 -1.015407	 -2.207317	  0.340213
 -1.005806	 -2.194649	  0.329263
 -0.999912	 -2.185985	  0.320362
 -0.991890	 -2.166403	  0.306946
 -0.976578	 -2.152859	  0.294831
 -0.960332	 -2.142849	  0.289059
 -0.942814	 -2.142401	  0.286605
 -0.922451	 -2.143334	  0.284840
 -0.908871	 -2.145310	  0.278857
 -0.889831	 -2.151522	  0.270123
 -0.863134	 -2.161150	  0.257400
 -0.852338	 -2.165467	  0.253632
 -0.836301	 -2.172324	  0.250321
 -0.814635	 -2.180370	  0.245496
 -0.798853	 -2.188569	  0.246415
 -0.784722	 -2.196624	  0.252991
 -0.766001	 -2.206950	  0.259110
 -0.747426	 -2.216800	  0.262600
 -0.720546	 -2.227987	  0.261569
 -0.707815	 -2.233096	  0.258109
 -0.688669	 -2.239271	  0.254547
 -0.671901	 -2.242050	  0.253154
 -0.646834	 -2.244993	  0.252450
 -0.629341	 -2.246930	  0.253891
 -0.613932	 -2.248777	  0.254953
 -0.590608	 -2.249866	  0.251950
 -0.562793	 -2.254843	  0.243760
 -0.553824	 -2.261143	  0.240284
 -0.537851	 -2.272706	  0.238468
 -0.505623	 -2.287811	  0.237212
 -0.487349	 -2.293689	  0.236482
 -0.476345	 -2.296890	  0.233290
 -0.456186	 -2.307313	  0.229999
 -0.433788	 -2.312368	  0.216842
 -0.422481	 -2.311912	  0.209021
 -0.405265	 -2.308031	  0.196698
 -0.386386	 -2.303565	  0.186170
 -0.367266	 -2.306453	  0.180154
 -0.343543	 -2.316404	  0.175879
 -0.320223	 -2.323668	  0.168728
 -0.303075	 -2.319638	  0.149352
 -0.296821	 -2.307188	  0.135463
 -0.286445	 -2.292323	  0.124621
 -0.273958	 -2.280702	  0.110613
 -0.264634	 -2.268323	  0.098128
 -0.252149	 -2.254880	  0.089802
 -0.237639	 -2.243777	  0.079364
 -0.234497	 -2.232726	  0.059500
 -0.240345	 -2.217981	  0.036578
 -0.241094	 -2.200831	  0.022169
 -0.241420	 -2.189441	  0.012871
 -0.241512	 -2.174155	  0.000777
 -0.240325	 -2.152213	 -0.013790
 -0.240506	 -2.140744	 -0.022056
 -0.241560	 -2.125706	 -0.032450
 -0.242177	 -2.101822	 -0.047507
 -0.243003	 -2.090389	 -0.054565
 -0.245043	 -2.074999	 -0.063115
 -0.248054	 -2.046351	 -0.075725
 -0.248136	 -2.034771	 -0.079936
 -0.248723	 -2.015864	 -0.086190
 -0.251900	 -2.002899	 -0.097710
 -0.259371	 -1.984794	 -0.109917
 -0.265357	 -1.972369	 -0.121103
 -0.276176	 -1.959096	 -0.133183
 -0.288762	 -1.931303	 -0.134809
 -0.287896	 -1.912087	 -0.143198
 -0.279624	 -1.903882	 -0.152158
 -0.268683	 -1.897571	 -0.161859
 -0.264051	 -1.894458	 -0.171982
 -0.261149	 -1.896669	 -0.178804
 -0.258454	 -1.881994	 -0.194855
 -0.245993	 -1.862479	 -0.214598
 -0.239793	 -1.855801	 -0.224299
 -0.230849	 -1.846775	 -0.239998
 -0.218690	 -1.839001	 -0.262278
 -0.214317	 -1.834577	 -0.275654
 -0.211203	 -1.828811	 -0.291410
 -0.210409	 -1.822109	 -0.303279
 -0.212077	 -1.811665	 -0.312586
 -0.209851	 -1.804125	 -0.320859
 -0.212259	 -1.785663	 -0.334522
 -0.215938	 -1.770885	 -0.345623
 -0.219694	 -1.754942	 -0.357732
 -0.221514	 -1.740289	 -0.368337
 -0.222488	 -1.725016	 -0.380435
 -0.225133	 -1.707577	 -0.397406
 -0.233636	 -1.690342	 -0.413053
 -0.239324	 -1.681664	 -0.419269
 -0.248676	 -1.669624	 -0.422626
 -0.257404	 -1.645474	 -0.425092
 -0.272239	 -1.625257	 -0.442418
 -0.281305	 -1.613877	 -0.453413
 -0.285914	 -1.598933	 -0.467984
 -0.281099	 -1.585270	 -0.480773
 -0.279838	 -1.567704	 -0.492962
 -0.280234	 -1.550468	 -0.505849
 -0.277893	 -1.534412	 -0.518199
 -0.275124	 -1.518215	 -0.529926
 -0.273169	 -1.501849	 -0.541533
 -0.271860	 -1.485511	 -0.553218
 -0.270356	 -1.469648	 -0.564673
 -0.269140	 -1.453657	 -0.575461
 -0.265492	 -1.437969	 -0.587095
 -0.258159	 -1.423157	 -0.599075
 -0.249998	 -1.409263	 -0.610996
 -0.241474	 -1.395643	 -0.622953
 -0.232584	 -1.382277	 -0.634994
 -0.223350	 -1.369224	 -0.647284
 -0.210082	 -1.358787	 -0.657402
 -0.191032	 -1.348125	 -0.663516
 -0.174725	 -1.337018	 -0.673703
 -0.162481	 -1.329855	 -0.687763
 -0.151315	 -1.326691	 -0.701813
 -0.133784	 -1.317923	 -0.712065
 -0.121059	 -1.305464	 -0.722478
 -0.109354	 -1.298382	 -0.736384
 -0.091471	 -1.290377	 -0.751662
 -0.078303	 -1.287401	 -0.768141
 -0.066408	 -1.288623	 -0.786485
 -0.052633	 -1.290305	 -0.811498
 -0.049348	 -1.289034	 -0.819193
 -0.041402	 -1.285512	 -0.839684
 -0.028382	 -1.280254	 -0.857083
 -0.015138	 -1.278459	 -0.869826
  0.003905	 -1.276908	 -0.888245
  0.015028	 -1.269242	 -0.902179
  0.020504	 -1.262703	 -0.912094
  0.026656	 -1.248034	 -0.930094
  0.039522	 -1.239706	 -0.948346
  0.050093	 -1.235253	 -0.961970
  0.062064	 -1.230244	 -0.977688
  0.074841	 -1.220924	 -0.991975
  0.087040	 -1.211105	 -1.005210
  0.103084	 -1.203305	 -1.013522
  0.125252	 -1.194980	 -1.017029
  0.144881	 -1.187914	 -1.021919
  0.164052	 -1.183020	 -1.030304
  0.183609	 -1.177536	 -1.038941
  0.198073	 -1.171132	 -1.047359
  0.210002	 -1.163430	 -1.057451
  0.219112	 -1.152265	 -1.071352
  0.230013	 -1.139464	 -1.084230
  0.240772	 -1.126427	 -1.096763
  0.253186	 -1.114923	 -1.108816
  0.266593	 -1.106416	 -1.121728
  0.280087	 -1.099727	 -1.134671
  0.295688	 -1.093376	 -1.150220
  0.309467	 -1.085979	 -1.164431
  0.325211	 -1.075873	 -1.179192
  0.331533	 -1.070210	 -1.187599
  0.338538	 -1.059794	 -1.194420
  0.347366	 -1.043154	 -1.210343
  0.355687	 -1.030334	 -1.227201
  0.361880	 -1.023439	 -1.244646
  0.368159	 -1.018079	 -1.263717
  0.375878	 -1.015558	 -1.282058
  0.385376	 -1.013371	 -1.299632
  0.397369	 -1.007550	 -1.318513
  0.408875	 -1.002184	 -1.334302
  0.420241	 -0.997845	 -1.351511
  0.433312	 -0.988450	 -1.368017
  0.446227	 -0.978284	 -1.382390
  0.452690	 -0.973579	 -1.392182
  0.458628	 -0.963842	 -1.408926
  0.461667	 -0.954326	 -1.428235
  0.465315	 -0.942323	 -1.446306
  0.469612	 -0.930120	 -1.461334
  0.477583	 -0.919613	 -1.478153
  0.487596	 -0.911082	 -1.493786
  0.499455	 -0.902681	 -1.507440
  0.510872	 -0.893753	 -1.521630
  0.523206	 -0.885995	 -1.535328
  0.534721	 -0.877754	 -1.549575
  0.546744	 -0.869835	 -1.563686
  0.559100	 -0.862416	 -1.577616
  0.571492	 -0.854973	 -1.591500
  0.584090	 -0.847829	 -1.605516
  0.597202	 -0.841046	 -1.619253
  0.611037	 -0.834252	 -1.632057
  0.625986	 -0.827936	 -1.643516
  0.640298	 -0.818473	 -1.651405
  0.654831	 -0.800794	 -1.659085
  0.669797	 -0.790001	 -1.671293
  0.688933	 -0.795039	 -1.689005
  0.704904	 -0.798933	 -1.703276
  0.719633	 -0.796557	 -1.712679
  0.735168	 -0.792442	 -1.724241
  0.750145	 -0.789635	 -1.737862
  0.767430	 -0.786555	 -1.750648
  0.782887	 -0.783383	 -1.759182
  0.797181	 -0.780499	 -1.770691
  0.816207	 -0.776023	 -1.787075
  0.831425	 -0.767426	 -1.795632
  0.839862	 -0.758622	 -1.800109
  0.853582	 -0.740653	 -1.808013
  0.872418	 -0.722770	 -1.816685
  0.890168	 -0.714200	 -1.825794
  0.908025	 -0.710479	 -1.836878
  0.922500	 -0.707992	 -1.846525
  0.940625	 -0.705315	 -1.859774
  0.956619	 -0.701248	 -1.873065
  0.967728	 -0.696555	 -1.884551
  0.978374	 -0.690132	 -1.899480
  0.989290	 -0.681821	 -1.914857
  1.005135	 -0.665094	 -1.929562
  1.012866	 -0.657288	 -1.934621
  1.024320	 -0.644141	 -1.946547
  1.042073	 -0.635787	 -1.958498
  1.059816	 -0.631481	 -1.968905
  1.077267	 -0.626375	 -1.981404
  1.090282	 -0.621277	 -1.996336
  1.096843	 -0.614652	 -2.012427
  1.103075	 -0.603980	 -2.028510
  1.112992	 -0.589153	 -2.043215
  1.128546	 -0.578430	 -2.051532
  1.144590	 -0.569984	 -2.060854
  1.164273	 -0.564172	 -2.068674
  1.176031	 -0.555359	 -2.082242
