 -0.406772	  0.888151	  2.308456
 -0.403114	  0.891604	  2.300552
 -0.399782	  0.894749	  2.293353
 -0.388125	  0.899749	  2.280552
 -0.372042	  0.903477	  2.270129
 -0.357365	  0.909274	  2.257669
 -0.345312	  0.922646	  2.227292
 -0.339136	  0.932240	  2.210822
 -0.336580	  0.937429	  2.204041
 -0.333420	  0.949357	  2.190918
 -0.324109	  0.966699	  2.166726
 -0.318649	  0.974223	  2.153923
 -0.313533	  0.984159	  2.140418
 -0.308084	  1.000249	  2.121562
 -0.303760	  1.007315	  2.110032
 -0.294642	  1.017227	  2.087904
 -0.287157	  1.022699	  2.070403
 -0.281461	  1.027113	  2.057495
 -0.268484	  1.031974	  2.031563
 -0.262474	  1.036337	  2.018997
 -0.254996	  1.044946	  2.002321
 -0.249203	  1.054275	  1.988396
 -0.240248	  1.061468	  1.968888
 -0.232029	  1.067497	  1.951047
 -0.224223	  1.073932	  1.933337
 -0.216852	  1.080441	  1.915628
 -0.210835	  1.088384	  1.897630
 -0.207631	  1.097398	  1.879813
 -0.205148	  1.105419	  1.861859
 -0.201923	  1.112007	  1.843461
 -0.196549	  1.118192	  1.824972
 -0.189313	  1.126198	  1.808211
 -0.180873	  1.134791	  1.792128
 -0.171476	  1.144376	  1.777637
 -0.158329	  1.154092	  1.766483
 -0.149162	  1.163174	  1.753301
 -0.137351	  1.172077	  1.740821
 -0.117449	  1.183124	  1.726551
 -0.105685	  1.191061	  1.715805
 -0.094212	  1.198803	  1.705645
 -0.075694	  1.210392	  1.692880
 -0.064191	  1.216047	  1.687423
 -0.043548	  1.224156	  1.681644
 -0.025033	  1.233832	  1.673124
 -0.012549	  1.242064	  1.665154
  0.001801	  1.252881	  1.651799
  0.013453	  1.262609	  1.638205
  0.024321	  1.271852	  1.627118
  0.044130	  1.284895	  1.612532
  0.054794	  1.291285	  1.605278
  0.065622	  1.296932	  1.599956
  0.083473	  1.309338	  1.589549
  0.097302	  1.315768	  1.572401
  0.102221	  1.318771	  1.551337
  0.103527	  1.324876	  1.525510
  0.108814	  1.333919	  1.505983
  0.110159	  1.338791	  1.495451
  0.113327	  1.347757	  1.475462
  0.117853	  1.356421	  1.456408
  0.119525	  1.362871	  1.441830
  0.123097	  1.374494	  1.423627
  0.125690	  1.385918	  1.407801
  0.127984	  1.401006	  1.390714
  0.128364	  1.414868	  1.369902
  0.123212	  1.416944	  1.350757
  0.117715	  1.414630	  1.333738
  0.112029	  1.414681	  1.312293
  0.106510	  1.417938	  1.295441
  0.100002	  1.431741	  1.275936
  0.095223	  1.439519	  1.255519
  0.092747	  1.440791	  1.237161
  0.088852	  1.443502	  1.217329
  0.088904	  1.446392	  1.196444
  0.095634	  1.444555	  1.175142
  0.104017	  1.443579	  1.153099
  0.114642	  1.449455	  1.129717
  0.118938	  1.457068	  1.116231
  0.122868	  1.465811	  1.100891
  0.126758	  1.476771	  1.074028
  0.128715	  1.481601	  1.060372
  0.131787	  1.486732	  1.048892
  0.135657	  1.496473	  1.027204
  0.137915	  1.508320	  1.007964
  0.143257	  1.517087	  0.994122
  0.150122	  1.530905	  0.977416
  0.156294	  1.546792	  0.960093
  0.159710	  1.555540	  0.948795
  0.164533	  1.566855	  0.934213
  0.169149	  1.589970	  0.915023
  0.166324	  1.605390	  0.901713
  0.166554	  1.615768	  0.894857
  0.166594	  1.632714	  0.880446
  0.169278	  1.645778	  0.864686
  0.179325	  1.659288	  0.847363
  0.186730	  1.666887	  0.837359
  0.204419	  1.675219	  0.824411
  0.220965	  1.685545	  0.811826
  0.229493	  1.702824	  0.800550
  0.243337	  1.729572	  0.793666
  0.250417	  1.740691	  0.790822
  0.258329	  1.751635	  0.783742
  0.268362	  1.764231	  0.776539
  0.277491	  1.780874	  0.765268
  0.284787	  1.799623	  0.750119
  0.296331	  1.816288	  0.735396
  0.305305	  1.829044	  0.722950
  0.309891	  1.835368	  0.716096
  0.322965	  1.852932	  0.698646
  0.330464	  1.866580	  0.687244
  0.337967	  1.876926	  0.683491
  0.354254	  1.890900	  0.675073
  0.370489	  1.901583	  0.666795
  0.385820	  1.919837	  0.664292
  0.395311	  1.939797	  0.662489
  0.400336	  1.956213	  0.659193
  0.406454	  1.974333	  0.649043
  0.415284	  1.991829	  0.642037
  0.426326	  2.008141	  0.637105
  0.437685	  2.024208	  0.633768
  0.448766	  2.040606	  0.630553
  0.459248	  2.057529	  0.628138
  0.469625	  2.074423	  0.625486
  0.479968	  2.091333	  0.622826
  0.489276	  2.108948	  0.621116
  0.497666	  2.127081	  0.620229
  0.506030	  2.145227	  0.619354
  0.514316	  2.163414	  0.618609
  0.522190	  2.181798	  0.618456
  0.530049	  2.200188	  0.618332
  0.537935	  2.218565	  0.618168
  0.546574	  2.236524	  0.616526
  0.555684	  2.254133	  0.613899
  0.564808	  2.271727	  0.611247
  0.573973	  2.289152	  0.608187
  0.584391	  2.302811	  0.598089
  0.594820	  2.316306	  0.587664
  0.605103	  2.329524	  0.576959
  0.611005	  2.334629	  0.558696
  0.614691	  2.336265	  0.539163
  0.613537	  2.333843	  0.519406
  0.607809	  2.328329	  0.501109
  0.601632	  2.323206	  0.482746
  0.595059	  2.317904	  0.464490
  0.588920	  2.311429	  0.446700
  0.583105	  2.307252	  0.429128
  0.578426	  2.305501	  0.408916
  0.573594	  2.302008	  0.388541
  0.567259	  2.294737	  0.369298
  0.558112	  2.284799	  0.353746
  0.547748	  2.273972	  0.338625
  0.539304	  2.264424	  0.324905
  0.530219	  2.256313	  0.309540
  0.520120	  2.249395	  0.295478
  0.509427	  2.242608	  0.282135
  0.495832	  2.230076	  0.263517
  0.484490	  2.215949	  0.246601
  0.476339	  2.205297	  0.235078
  0.465968	  2.192196	  0.215210
  0.459665	  2.184714	  0.186555
  0.459080	  2.183011	  0.166479
  0.458519	  2.182310	  0.151311
  0.456858	  2.182061	  0.131739
  0.451083	  2.183415	  0.109184
  0.447302	  2.187571	  0.085002
  0.448455	  2.190724	  0.063269
  0.453404	  2.194385	  0.037395
  0.454685	  2.196119	  0.017747
  0.453525	  2.195724	  0.006668
  0.450291	  2.197735	 -0.014625
  0.447571	  2.202015	 -0.045046
  0.446900	  2.205643	 -0.059698
  0.447761	  2.211557	 -0.078306
  0.452233	  2.218173	 -0.104020
  0.460568	  2.222644	 -0.125804
  0.467980	  2.225245	 -0.139860
  0.476698	  2.232486	 -0.157828
  0.483332	  2.239199	 -0.177103
  0.489929	  2.245481	 -0.195395
  0.497157	  2.251229	 -0.213838
  0.504441	  2.256928	 -0.231682
  0.511797	  2.263488	 -0.249310
  0.519213	  2.269162	 -0.267443
  0.527304	  2.275887	 -0.284258
  0.535262	  2.281844	 -0.302263
  0.544050	  2.288207	 -0.319048
  0.553271	  2.294227	 -0.335709
  0.562955	  2.300325	 -0.352851
  0.573148	  2.306117	 -0.369175
  0.583783	  2.312325	 -0.385083
  0.594586	  2.318258	 -0.401353
  0.605748	  2.324171	 -0.416594
  0.617164	  2.329892	 -0.431837
  0.628574	  2.335634	 -0.447605
  0.640126	  2.341333	 -0.462806
  0.651912	  2.347351	 -0.477515
  0.669029	  2.356285	 -0.500321
  0.675237	  2.359796	 -0.508492
