 0.0 -0.0 0.0 0.0
 0.48813 0.50901 -0.70897 1000.0
 0.68598 0.49255 -0.53556 1000.0
 0.70029 0.71384 0.0042243 1000.0
 0.0 -0.0 0.0 0.0
 0.70007 0.71407 -0.0037703 1000.0
 -0.23728 0.69136 -0.68244 1000.0
 0.48813 0.50901 -0.70897 1000.0
 0.53236 0.66295 -0.5264 1000.0
 -0.71339 0.69962 0.040048 1000.0
 0.71885 0.46588 0.51595 1000.0
 0.72382 0.28373 0.62895 1000.0
 -0.71101 0.69753 0.088978 1000.0
 0.70039 0.71371 0.0082212 1000.0
 0.72882 -0.010697 0.68463 1000.0
 0.6661 0.17992 -0.72384 1000.0
 0.6836 0.31637 -0.65773 1000.0
 0.050423 0.68834 0.72363 1000.0
 0.70039 0.71371 0.0082212 1000.0
