 -0.034274	 -2.038514	  1.441103
 -0.037385	 -2.061035	  1.447860
 -0.033569	 -2.043088	  1.439750
 -0.030493	 -2.025029	  1.432838
 -0.028500	 -2.010093	  1.423392
 -0.020332	 -1.993953	  1.414886
 -0.013030	 -1.965141	  1.414981
 -0.011359	 -1.945750	  1.412093
 -0.009268	 -1.930369	  1.407871
 -0.007278	 -1.911886	  1.400392
 -0.005757	 -1.892220	  1.392237
 -0.004739	 -1.872775	  1.384761
 -0.003348	 -1.855347	  1.377730
 -0.003364	 -1.838272	  1.369628
 -0.005214	 -1.821946	  1.362026
 -0.005533	 -1.801558	  1.354594
 -0.002906	 -1.780869	  1.346157
  0.000584	 -1.762965	  1.335728
  0.003661	 -1.745927	  1.325335
  0.007109	 -1.726982	  1.313907
  0.008522	 -1.711720	  1.309006
  0.008175	 -1.696465	  1.303564
  0.010196	 -1.665101	  1.298567
  0.013850	 -1.647630	  1.296717
  0.017767	 -1.636790	  1.296348
  0.025080	 -1.610902	  1.293200
  0.029146	 -1.594294	  1.292214
  0.031954	 -1.574239	  1.290607
  0.036689	 -1.552591	  1.289731
  0.043424	 -1.530452	  1.288780
  0.049551	 -1.514268	  1.289876
  0.054860	 -1.494086	  1.298268
  0.060568	 -1.474693	  1.311311
  0.066612	 -1.459591	  1.324227
  0.073559	 -1.446000	  1.336941
  0.081536	 -1.431891	  1.349822
  0.090432	 -1.419077	  1.363409
  0.100326	 -1.406442	  1.376310
  0.110362	 -1.394973	  1.389452
  0.120410	 -1.383317	  1.402041
  0.130885	 -1.372053	  1.414706
  0.142172	 -1.360837	  1.426304
  0.154275	 -1.350608	  1.438368
  0.166376	 -1.339496	  1.449831
  0.178325	 -1.329089	  1.461610
  0.189776	 -1.317653	  1.472325
  0.200614	 -1.302788	  1.479886
  0.210945	 -1.286619	  1.485701
  0.221457	 -1.270623	  1.490684
  0.232343	 -1.254964	  1.493891
  0.243713	 -1.238959	  1.497268
  0.254816	 -1.222683	  1.500315
  0.263229	 -1.206105	  1.493808
  0.270582	 -1.189645	  1.485121
  0.277674	 -1.172765	  1.477134
  0.283149	 -1.153949	  1.473238
  0.288479	 -1.135047	  1.469527
  0.290120	 -1.115405	  1.466458
  0.284449	 -1.096329	  1.464943
  0.278561	 -1.077275	  1.463474
  0.272674	 -1.058232	  1.462030
  0.266971	 -1.039449	  1.460025
  0.264357	 -1.029621	  1.443111
  0.261984	 -1.020269	  1.425609
  0.259359	 -1.010900	  1.408165
  0.255776	 -1.002204	  1.390662
  0.251896	 -0.996411	  1.371858
  0.249512	 -0.992767	  1.352480
  0.247106	 -0.989467	  1.333397
  0.243888	 -0.988095	  1.312848
  0.243441	 -0.984642	  1.292681
  0.244449	 -0.979481	  1.273692
  0.244079	 -0.975596	  1.254564
  0.243148	 -0.963572	  1.237444
  0.240719	 -0.950157	  1.217661
  0.242593	 -0.947145	  1.200012
  0.247893	 -0.950712	  1.178370
  0.252543	 -0.953166	  1.154743
  0.254111	 -0.947575	  1.135830
  0.253567	 -0.939096	  1.120719
  0.253319	 -0.927756	  1.100937
  0.255635	 -0.922001	  1.083838
  0.259063	 -0.917514	  1.066020
  0.259358	 -0.903085	  1.040243
  0.257400	 -0.891350	  1.030920
  0.254520	 -0.874045	  1.019477
  0.257085	 -0.862519	  1.008132
  0.261892	 -0.852680	  0.988099
  0.264882	 -0.839189	  0.972532
  0.266723	 -0.822999	  0.960547
  0.269247	 -0.806310	  0.949441
  0.271147	 -0.788493	  0.940066
  0.272680	 -0.770169	  0.931872
  0.272964	 -0.751726	  0.923977
  0.271369	 -0.733177	  0.916544
  0.269475	 -0.714642	  0.909225
  0.271564	 -0.698116	  0.899723
  0.277627	 -0.681646	  0.888626
  0.281372	 -0.662528	  0.879766
  0.283381	 -0.639614	  0.871922
  0.285216	 -0.619980	  0.866741
  0.285410	 -0.606828	  0.862524
  0.283622	 -0.590272	  0.851606
  0.282709	 -0.571559	  0.838948
  0.283752	 -0.552113	  0.829880
  0.284942	 -0.533276	  0.822225
  0.286257	 -0.513782	  0.814989
  0.288604	 -0.497838	  0.810041
  0.291955	 -0.480886	  0.804323
  0.296755	 -0.461015	  0.797373
  0.299207	 -0.439644	  0.789998
  0.302107	 -0.421329	  0.780981
  0.304802	 -0.404749	  0.773517
  0.307729	 -0.387480	  0.766983
  0.309962	 -0.364641	  0.762127
  0.313367	 -0.345763	  0.753285
  0.316375	 -0.331286	  0.745152
  0.319116	 -0.317137	  0.739550
  0.331746	 -0.289163	  0.735082
  0.343575	 -0.267778	  0.730718
  0.349297	 -0.256352	  0.729316
  0.353777	 -0.236547	  0.726912
  0.357457	 -0.218507	  0.726176
  0.360568	 -0.198870	  0.719667
  0.362016	 -0.177364	  0.710758
  0.366214	 -0.158281	  0.702745
  0.372274	 -0.142611	  0.698807
  0.377990	 -0.122485	  0.695966
  0.382926	 -0.101960	  0.694387
  0.387586	 -0.084159	  0.692920
  0.392109	 -0.064671	  0.689525
  0.397977	 -0.046484	  0.686401
  0.405960	 -0.025795	  0.682702
  0.411439	 -0.005790	  0.679240
  0.413485	  0.007448	  0.676268
  0.416149	  0.026224	  0.672702
  0.417024	  0.059966	  0.667671
  0.417036	  0.071409	  0.662594
  0.417751	  0.084988	  0.654045
  0.413529	  0.103338	  0.633626
  0.414877	  0.122123	  0.619014
  0.416575	  0.132839	  0.611736
  0.421340	  0.150737	  0.604612
  0.428370	  0.178012	  0.596344
  0.433110	  0.195136	  0.594118
  0.436174	  0.210369	  0.595898
  0.433177	  0.232615	  0.599079
  0.429068	  0.253760	  0.596906
  0.422207	  0.272150	  0.591451
  0.413283	  0.290692	  0.585143
  0.405919	  0.310382	  0.578499
  0.402314	  0.332507	  0.572745
  0.403814	  0.353528	  0.568345
  0.409377	  0.374501	  0.562593
  0.415503	  0.395119	  0.555929
  0.422398	  0.414331	  0.548805
  0.427328	  0.433836	  0.541575
  0.430800	  0.451707	  0.537058
  0.433547	  0.473035	  0.534107
  0.439486	  0.496094	  0.535368
  0.451257	  0.516556	  0.539601
  0.459914	  0.531849	  0.541938
  0.475528	  0.548270	  0.544552
  0.493057	  0.565262	  0.544647
  0.505246	  0.580819	  0.540888
  0.512312	  0.598400	  0.531709
  0.520144	  0.618852	  0.519378
  0.531347	  0.633547	  0.512407
  0.541584	  0.644158	  0.508469
  0.560597	  0.655881	  0.506199
  0.578538	  0.679697	  0.495530
  0.582172	  0.691859	  0.489702
  0.587660	  0.705320	  0.483113
  0.598148	  0.728496	  0.473968
  0.603613	  0.745215	  0.467848
  0.609745	  0.760377	  0.461070
  0.614860	  0.782243	  0.452465
  0.618234	  0.799951	  0.445529
  0.622360	  0.811165	  0.437285
  0.627523	  0.830227	  0.419698
  0.632102	  0.847942	  0.399985
  0.631660	  0.856986	  0.392177
  0.633526	  0.875860	  0.379314
  0.631362	  0.893771	  0.364119
  0.625911	  0.906506	  0.355744
  0.623263	  0.929110	  0.346259
  0.625522	  0.947312	  0.332801
  0.629324	  0.957382	  0.322603
  0.634746	  0.966318	  0.315688
  0.646526	  0.978810	  0.301388
  0.658346	  0.995984	  0.284192
  0.661523	  1.009751	  0.271657
  0.663177	  1.021612	  0.257227
  0.667560	  1.036459	  0.237830
  0.668788	  1.048586	  0.219409
  0.668533	  1.055367	  0.207949
  0.669342	  1.064202	  0.189303
  0.674700	  1.074554	  0.172492
  0.679918	  1.085839	  0.159297
  0.684556	  1.101047	  0.147456
  0.691331	  1.118752	  0.133367
  0.702068	  1.131789	  0.118338
  0.712561	  1.142072	  0.104578
  0.722137	  1.150844	  0.088245
  0.731581	  1.157208	  0.074654
  0.745661	  1.163325	  0.061610
  0.757285	  1.172554	  0.054947
  0.768188	  1.184135	  0.047906
  0.779573	  1.196321	  0.039428
  0.792670	  1.202999	  0.031735
  0.806547	  1.205303	  0.026544
  0.816273	  1.208361	  0.022784
  0.831958	  1.220213	  0.018468
  0.845847	  1.235505	  0.007340
  0.857854	  1.249033	 -0.001447
  0.869092	  1.260602	 -0.004313
  0.881051	  1.275986	 -0.003654
  0.891652	  1.293450	 -0.001286
  0.901475	  1.310757	  0.001261
  0.911616	  1.326200	  0.003786
  0.920242	  1.345137	  0.005266
  0.927813	  1.363275	  0.006291
  0.933113	  1.382525	  0.005904
  0.934599	  1.402496	  0.004602
  0.935115	  1.422177	  0.002760
  0.932408	  1.440077	 -0.000642
  0.927983	  1.457818	 -0.007925
  0.924201	  1.482605	 -0.020150
  0.922408	  1.503456	 -0.021296
  0.922471	  1.521643	 -0.019433
  0.922204	  1.539056	 -0.017582
  0.919299	  1.558543	 -0.020400
  0.916718	  1.572464	 -0.021375
  0.913458	  1.592479	 -0.022109
  0.908786	  1.610676	 -0.024046
  0.902534	  1.627804	 -0.024948
  0.895383	  1.645842	 -0.024612
  0.886632	  1.664882	 -0.023835
  0.878382	  1.683767	 -0.022711
  0.874132	  1.701768	 -0.020731
  0.869627	  1.719801	 -0.017836
  0.862855	  1.740997	 -0.015585
  0.857207	  1.760778	 -0.018828
  0.855728	  1.778304	 -0.025424
  0.854725	  1.796765	 -0.031959
  0.856051	  1.820122	 -0.040425
  0.857306	  1.845849	 -0.045514
  0.857595	  1.854945	 -0.045657
  0.858293	  1.877785	 -0.045742
  0.859217	  1.898301	 -0.047493
  0.860243	  1.917422	 -0.050376
  0.860369	  1.940942	 -0.053656
  0.862166	  1.961191	 -0.056588
  0.863811	  1.975329	 -0.059073
  0.865079	  1.998384	 -0.063740
  0.867973	  2.020625	 -0.070009
  0.873036	  2.037108	 -0.074283
  0.878670	  2.057006	 -0.075010
  0.882780	  2.080112	 -0.077347
  0.883930	  2.091446	 -0.080996
  0.890229	  2.113538	 -0.090726
  0.899715	  2.130534	 -0.108040
  0.904906	  2.145524	 -0.126120
  0.908787	  2.161438	 -0.142738
  0.909334	  2.177455	 -0.151448
  0.910184	  2.193697	 -0.159663
  0.912353	  2.207975	 -0.165643
  0.917943	  2.229529	 -0.169708
  0.925572	  2.250093	 -0.172763
  0.926747	  2.269247	 -0.180337
  0.927327	  2.288655	 -0.185410
  0.931371	  2.309844	 -0.189072
  0.918832	  2.333943	 -0.184652
  0.920856	  2.353065	 -0.190151
