  0.763381	 -1.854085	 -2.271677
  0.755823	 -1.835728	 -2.249186
  0.774554	 -1.784014	 -2.250848
  0.797332	 -1.738121	 -2.248542
  0.821612	 -1.691978	 -2.245961
  0.844719	 -1.647338	 -2.243260
  0.866133	 -1.604540	 -2.240455
  0.888802	 -1.558445	 -2.236330
  0.910360	 -1.513737	 -2.229488
  0.930461	 -1.469485	 -2.222072
  0.949904	 -1.424729	 -2.215137
  0.968997	 -1.381720	 -2.208105
  0.989768	 -1.336221	 -2.199602
  1.011537	 -1.291186	 -2.191119
  1.030933	 -1.246465	 -2.183680
  1.048643	 -1.198658	 -2.175458
  1.068982	 -1.151558	 -2.173467
  1.090250	 -1.107992	 -2.173183
  1.111321	 -1.062785	 -2.167554
  1.129034	 -1.015621	 -2.164381
  1.146559	 -0.969317	 -2.162363
  1.163344	 -0.923561	 -2.161876
  1.180046	 -0.875858	 -2.163704
  1.197342	 -0.827386	 -2.166181
  1.214727	 -0.780898	 -2.168524
  1.231773	 -0.735860	 -2.170869
  1.249500	 -0.690535	 -2.172362
  1.268509	 -0.643838	 -2.171980
  1.288514	 -0.597619	 -2.169458
  1.308893	 -0.552736	 -2.164562
  1.330012	 -0.506777	 -2.157459
  1.351550	 -0.461563	 -2.148751
  1.374104	 -0.417086	 -2.142518
  1.397860	 -0.374046	 -2.137032
  1.421786	 -0.332238	 -2.130490
  1.445680	 -0.291214	 -2.124084
  1.470525	 -0.246563	 -2.118427
  1.493795	 -0.201811	 -2.112395
  1.516394	 -0.157060	 -2.106142
  1.537662	 -0.111999	 -2.099714
  1.556990	 -0.067605	 -2.093218
  1.576394	 -0.019452	 -2.087035
  1.593941	  0.027265	 -2.083252
  1.612917	  0.071757	 -2.078819
  1.631732	  0.116146	 -2.071116
  1.650944	  0.159901	 -2.064065
  1.677618	  0.203276	 -2.054062
  1.699582	  0.247830	 -2.047274
  1.720540	  0.292654	 -2.039491
  1.739847	  0.339152	 -2.035073
  1.756519	  0.385053	 -2.033185
  1.772560	  0.433788	 -2.031482
  1.790170	  0.480425	 -2.032003
  1.808391	  0.525193	 -2.032623
  1.830138	  0.570464	 -2.031478
  1.848464	  0.618830	 -2.030108
  1.870665	  0.663340	 -2.028670
  1.883836	  0.711118	 -2.020685
  1.905983	  0.754244	 -2.019697
  1.928103	  0.798360	 -2.022425
  1.945959	  0.846014	 -2.014004
  1.964018	  0.893341	 -2.011495
  1.984330	  0.937324	 -2.008838
  2.004141	  0.975954	 -2.007719
  2.024182	  0.985713	 -2.027796
