  1.328135	  0.122163	  1.983337
  1.313696	  0.128026	  2.002741
  1.299257	  0.133889	  2.022145
  1.310650	  0.127550	  2.006967
  1.321176	  0.124953	  1.991346
  1.332196	  0.121433	  1.974038
  1.343779	  0.118321	  1.957601
  1.355711	  0.115895	  1.941734
  1.367644	  0.113477	  1.925868
  1.380549	  0.112984	  1.910597
  1.393531	  0.112666	  1.895387
  1.406584	  0.112221	  1.880241
  1.420587	  0.110000	  1.866134
  1.434589	  0.107776	  1.852027
  1.448591	  0.105550	  1.837921
  1.463209	  0.101902	  1.824768
  1.477865	  0.098157	  1.811684
  1.492547	  0.094390	  1.798637
  1.507357	  0.090519	  1.785765
  1.522168	  0.086648	  1.772894
  1.537151	  0.082747	  1.760233
  1.552207	  0.078833	  1.747664
  1.567291	  0.074889	  1.735137
  1.582561	  0.070730	  1.722909
  1.597832	  0.066571	  1.710682
  1.613102	  0.062257	  1.698507
  1.628370	  0.057813	  1.686378
  1.643639	  0.053368	  1.674249
  1.658743	  0.048471	  1.662088
  1.673841	  0.043561	  1.649925
  1.688820	  0.038457	  1.637695
  1.703644	  0.033106	  1.625382
  1.718468	  0.027755	  1.613068
  1.733142	  0.021880	  1.600815
  1.747802	  0.015954	  1.588568
  1.762461	  0.010025	  1.576323
  1.777461	  0.001630	  1.566099
  1.792470	 -0.006935	  1.556030
  1.807476	 -0.015504	  1.545962
  1.821739	 -0.026065	  1.536742
  1.835888	 -0.036936	  1.527704
  1.849233	 -0.048306	  1.518299
  1.862257	 -0.060616	  1.510045
  1.875535	 -0.074141	  1.500161
  1.888032	 -0.085207	  1.489903
  1.899475	 -0.093262	  1.474868
  1.910839	 -0.100352	  1.458776
  1.921130	 -0.119908	  1.445535
  1.931976	 -0.131066	  1.432971
  1.942822	 -0.142224	  1.420407
