 -0.463776	  0.966692	  2.265710
 -0.459324	  0.972463	  2.256842
 -0.456032	  0.976730	  2.250285
 -0.448503	  0.987013	  2.234980
 -0.441108	  0.998436	  2.220579
 -0.433522	  1.010109	  2.205460
 -0.427251	  1.021480	  2.190163
 -0.420633	  1.027375	  2.170834
 -0.412938	  1.033779	  2.153720
 -0.404714	  1.044686	  2.139617
 -0.396934	  1.055827	  2.124102
 -0.386693	  1.063797	  2.108813
 -0.376339	  1.070051	  2.092756
 -0.367818	  1.076910	  2.075607
 -0.361422	  1.084411	  2.058101
 -0.355508	  1.092255	  2.040781
 -0.347838	  1.101360	  2.024906
 -0.340290	  1.110837	  2.008142
 -0.333979	  1.118581	  1.991132
 -0.326551	  1.124242	  1.974118
 -0.318421	  1.131324	  1.955605
 -0.310524	  1.141022	  1.939161
 -0.307046	  1.151295	  1.921624
 -0.305436	  1.158058	  1.904215
 -0.302125	  1.163925	  1.884902
 -0.298830	  1.169653	  1.864729
 -0.293087	  1.173245	  1.845570
 -0.285830	  1.178289	  1.827742
 -0.278001	  1.185968	  1.811548
 -0.268926	  1.195301	  1.795363
 -0.259327	  1.204767	  1.780329
 -0.249336	  1.213659	  1.765301
 -0.237287	  1.222922	  1.752615
 -0.225035	  1.232059	  1.741679
 -0.207882	  1.241320	  1.732328
 -0.192705	  1.249137	  1.721077
 -0.182536	  1.255393	  1.707163
 -0.167157	  1.266172	  1.693246
 -0.153049	  1.278310	  1.687399
 -0.139525	  1.288288	  1.679954
 -0.121017	  1.297519	  1.670410
 -0.107790	  1.304982	  1.660104
 -0.094896	  1.315246	  1.648996
 -0.081579	  1.325542	  1.636609
 -0.069212	  1.335006	  1.624835
 -0.053563	  1.342326	  1.612420
 -0.039380	  1.349327	  1.602879
 -0.027672	  1.358027	  1.590568
 -0.010588	  1.369696	  1.577809
 -0.000089	  1.376614	  1.568136
  0.016332	  1.385401	  1.558506
  0.030505	  1.395612	  1.542621
  0.032788	  1.404985	  1.523288
  0.037064	  1.411405	  1.506008
  0.038063	  1.415792	  1.487029
  0.036439	  1.420583	  1.464600
  0.033745	  1.428863	  1.445960
  0.035118	  1.438990	  1.431097
  0.034194	  1.447708	  1.411358
  0.030985	  1.450564	  1.392245
  0.028175	  1.454010	  1.372421
  0.026145	  1.458457	  1.352752
  0.024241	  1.463598	  1.333482
  0.022345	  1.468744	  1.314248
  0.021132	  1.473866	  1.294953
  0.020408	  1.478902	  1.275647
  0.019142	  1.482729	  1.256564
  0.018772	  1.484654	  1.237625
  0.020722	  1.489116	  1.214306
  0.021041	  1.492833	  1.196436
  0.018037	  1.501856	  1.180074
  0.016329	  1.509580	  1.155148
  0.018441	  1.516818	  1.139520
  0.022491	  1.524695	  1.123325
  0.025751	  1.529641	  1.102802
  0.025621	  1.537069	  1.084271
  0.024731	  1.550253	  1.067457
  0.030396	  1.562762	  1.051380
  0.037811	  1.565344	  1.032605
  0.040766	  1.573531	  1.013070
  0.040937	  1.589082	  0.999780
  0.044045	  1.602275	  0.985101
  0.051263	  1.614432	  0.969264
  0.056705	  1.625432	  0.953564
  0.063174	  1.638078	  0.941534
  0.070887	  1.653592	  0.929681
  0.079587	  1.670067	  0.916971
  0.084227	  1.681327	  0.903168
  0.086778	  1.691307	  0.887441
  0.096886	  1.704600	  0.873164
  0.106757	  1.718454	  0.862479
  0.112047	  1.734095	  0.852197
  0.121213	  1.748492	  0.839414
  0.128572	  1.757455	  0.824039
  0.140577	  1.771301	  0.811404
  0.153863	  1.787146	  0.806392
  0.157151	  1.801900	  0.797475
  0.162902	  1.819607	  0.783942
  0.171126	  1.831313	  0.769473
  0.181821	  1.844380	  0.760406
  0.188159	  1.862979	  0.755233
  0.199228	  1.882783	  0.743948
  0.212247	  1.893673	  0.730556
  0.222394	  1.901524	  0.727622
  0.236006	  1.919248	  0.724104
  0.249191	  1.934919	  0.719560
  0.258805	  1.951501	  0.707318
  0.269287	  1.964309	  0.699406
  0.280408	  1.977203	  0.690559
  0.291454	  1.994810	  0.682532
  0.299078	  2.011333	  0.675256
  0.308824	  2.026855	  0.667036
  0.320027	  2.038946	  0.659163
  0.331776	  2.055338	  0.653313
  0.342761	  2.071670	  0.648441
  0.353579	  2.087800	  0.643665
  0.364183	  2.104345	  0.639955
  0.374551	  2.121235	  0.637263
  0.384916	  2.138127	  0.634578
  0.394671	  2.155457	  0.632461
  0.403076	  2.173577	  0.631563
  0.411705	  2.191599	  0.630571
  0.420307	  2.209651	  0.629755
  0.428671	  2.227822	  0.629363
  0.437187	  2.245905	  0.628862
  0.445992	  2.263616	  0.627998
  0.455031	  2.281151	  0.625637
  0.464807	  2.298313	  0.622506
  0.474055	  2.316220	  0.620309
  0.482539	  2.333947	  0.618193
  0.490539	  2.351534	  0.614380
  0.505726	  2.374079	  0.598321
  0.509861	  2.379585	  0.594070
