  0.864370	  2.348139	  0.097248
  0.867194	  2.342731	  0.097907
  0.873573	  2.330516	  0.099397
  0.883670	  2.313302	  0.100708
  0.894064	  2.296248	  0.101743
  0.905833	  2.280129	  0.101547
  0.918570	  2.264924	  0.099851
  0.932513	  2.250494	  0.098006
  0.947315	  2.237517	  0.095948
  0.962027	  2.224382	  0.095183
  0.978103	  2.213929	  0.092628
  0.995830	  2.203148	  0.086323
  1.010293	  2.192313	  0.079075
  1.023828	  2.179661	  0.072630
  1.041029	  2.167849	  0.069566
  1.058481	  2.158201	  0.067676
  1.073080	  2.145458	  0.064281
  1.088386	  2.134480	  0.055519
  1.104171	  2.126454	  0.046086
  1.122405	  2.120543	  0.036809
  1.140074	  2.113481	  0.031916
  1.156835	  2.104468	  0.024997
  1.171203	  2.095194	  0.015656
  1.186018	  2.086295	  0.004602
  1.201960	  2.079593	 -0.005802
  1.218463	  2.070325	 -0.014251
  1.235217	  2.061771	 -0.021768
  1.249619	  2.050168	 -0.029044
  1.263315	  2.038409	 -0.037484
  1.276700	  2.026530	 -0.046385
  1.289998	  2.014072	 -0.055217
  1.304134	  2.002408	 -0.063677
  1.317709	  1.990265	 -0.071613
  1.332275	  1.979316	 -0.080368
  1.347103	  1.969184	 -0.089812
  1.361326	  1.958490	 -0.099059
  1.372948	  1.946593	 -0.109886
  1.384463	  1.933274	 -0.119654
  1.395152	  1.919068	 -0.128911
  1.405399	  1.903839	 -0.137141
  1.415633	  1.888789	 -0.144895
  1.426513	  1.873167	 -0.151937
  1.436982	  1.857624	 -0.158700
  1.449363	  1.842764	 -0.164259
  1.465224	  1.830635	 -0.170829
  1.477276	  1.816466	 -0.177651
  1.489086	  1.800947	 -0.183293
  1.497889	  1.783831	 -0.186769
  1.509573	  1.767152	 -0.189443
  1.519349	  1.750220	 -0.193932
  1.529835	  1.734106	 -0.199351
  1.538946	  1.716934	 -0.205433
  1.546579	  1.699150	 -0.209632
  1.556206	  1.681248	 -0.211043
  1.567565	  1.664355	 -0.211346
  1.577692	  1.647358	 -0.210595
  1.587921	  1.630217	 -0.210623
  1.597843	  1.612818	 -0.210352
  1.608679	  1.596520	 -0.208235
  1.620884	  1.580946	 -0.204198
  1.635387	  1.566524	 -0.199857
  1.650619	  1.552869	 -0.198135
  1.661540	  1.537503	 -0.199136
  1.672554	  1.520202	 -0.198249
  1.684907	  1.503665	 -0.197283
  1.698691	  1.489505	 -0.194828
  1.709931	  1.474256	 -0.191043
  1.720697	  1.457828	 -0.185771
  1.735842	  1.441611	 -0.183232
  1.751433	  1.429502	 -0.180397
  1.763641	  1.418562	 -0.171053
  1.778421	  1.405944	 -0.161411
  1.791678	  1.390449	 -0.156156
  1.802775	  1.375930	 -0.151109
  1.810511	  1.358648	 -0.145759
  1.821216	  1.338945	 -0.140609
  1.828847	  1.323731	 -0.134096
  1.837530	  1.310180	 -0.122472
  1.848112	  1.296240	 -0.111174
  1.858000	  1.283616	 -0.099672
  1.864763	  1.274075	 -0.084148
  1.870256	  1.266055	 -0.066468
  1.874899	  1.258709	 -0.047604
  1.881018	  1.250376	 -0.031014
  1.888800	  1.238428	 -0.015818
  1.894425	  1.227329	 -0.000082
  1.898622	  1.219528	  0.017894
  1.903105	  1.211951	  0.036382
  1.905392	  1.206772	  0.055332
  1.908078	  1.201064	  0.074463
  1.911431	  1.196148	  0.092836
  1.916802	  1.192589	  0.111752
  1.920872	  1.189592	  0.133730
  1.923769	  1.187225	  0.152679
  1.930440	  1.180132	  0.169318
  1.937477	  1.172519	  0.187630
  1.943062	  1.167125	  0.205368
  1.950684	  1.162481	  0.222483
  1.957790	  1.156553	  0.242395
  1.963604	  1.146795	  0.258853
  1.972157	  1.137203	  0.273391
  1.980243	  1.129630	  0.290311
  1.989357	  1.125684	  0.308716
  2.000564	  1.119951	  0.323905
  2.009358	  1.114088	  0.342624
  2.015141	  1.108368	  0.360144
  2.023459	  1.103191	  0.378662
  2.030199	  1.091052	  0.393540
  2.038365	  1.079216	  0.408150
  2.046539	  1.069543	  0.423633
  2.050242	  1.056088	  0.440490
  2.053351	  1.045309	  0.457171
  2.054217	  1.031606	  0.472851
  2.053477	  1.014257	  0.483159
  2.054008	  0.998210	  0.496277
  2.057162	  0.980190	  0.506097
  2.066842	  0.962649	  0.514014
  2.073959	  0.946999	  0.528080
  2.069033	  0.928258	  0.536111
  2.065229	  0.913126	  0.547473
  2.070271	  0.897632	  0.560618
  2.073655	  0.882867	  0.571971
  2.069224	  0.856107	  0.578498
  2.061007	  0.837959	  0.585163
  2.065593	  0.826229	  0.590127
  2.064736	  0.801808	  0.592627
  2.058516	  0.781311	  0.599830
  2.066596	  0.772625	  0.617080
  2.069569	  0.750122	  0.618335
  2.068146	  0.723751	  0.609934
  2.066743	  0.704518	  0.611907
  2.061821	  0.690484	  0.630436
  2.057707	  0.672081	  0.640721
  2.051833	  0.652540	  0.642660
  2.045905	  0.634290	  0.644919
  2.039316	  0.615499	  0.647386
  2.037702	  0.595010	  0.646239
  2.031771	  0.576356	  0.643295
  2.023904	  0.558769	  0.643569
  2.014693	  0.540413	  0.643871
  2.005880	  0.520276	  0.648751
  2.001242	  0.501927	  0.650439
  1.996327	  0.483117	  0.649083
  1.991239	  0.463575	  0.649498
  1.980820	  0.445723	  0.650172
  1.972249	  0.426928	  0.652117
  1.958717	  0.412359	  0.647393
  1.949478	  0.396415	  0.641605
  1.942450	  0.377744	  0.640859
  1.936365	  0.355908	  0.641699
  1.927602	  0.337064	  0.638500
  1.917850	  0.320185	  0.635599
  1.899545	  0.309009	  0.631432
  1.883922	  0.294936	  0.627545
  1.871066	  0.282307	  0.623798
  1.855266	  0.270600	  0.620160
  1.839471	  0.257555	  0.617033
  1.825030	  0.243964	  0.614513
  1.810613	  0.230111	  0.611810
  1.807593	  0.215394	  0.608223
  1.808150	  0.201016	  0.601042
  1.821709	  0.187408	  0.595173
  1.834384	  0.170510	  0.593004
  1.847445	  0.158496	  0.584821
  1.856326	  0.136662	  0.575697
  1.863753	  0.121852	  0.576559
  1.868785	  0.099722	  0.578322
  1.873550	  0.076910	  0.576732
  1.875959	  0.060198	  0.571879
  1.881723	  0.042377	  0.565090
  1.890459	  0.023352	  0.556247
  1.897972	  0.004390	  0.549139
  1.907348	 -0.011020	  0.551008
  1.916510	 -0.033024	  0.552937
  1.927062	 -0.045827	  0.548444
  1.940911	 -0.060915	  0.539013
  1.952125	 -0.075178	  0.532207
  1.961035	 -0.095002	  0.528723
  1.969874	 -0.111282	  0.528398
  1.981525	 -0.128152	  0.526694
  1.992288	 -0.145797	  0.523682
  1.999682	 -0.164277	  0.518240
  2.005630	 -0.181740	  0.510123
  2.013094	 -0.199179	  0.503893
  2.022676	 -0.216015	  0.499677
  2.032880	 -0.233166	  0.496234
  2.041125	 -0.249360	  0.493600
  2.034824	 -0.264637	  0.486803
  2.024240	 -0.279480	  0.478716
  2.014429	 -0.294803	  0.470403
  2.003758	 -0.309652	  0.462263
  1.994159	 -0.325126	  0.454138
  1.984654	 -0.341276	  0.446997
  1.977547	 -0.358590	  0.439589
  1.970831	 -0.376080	  0.430921
  1.964189	 -0.393108	  0.423264
  1.957363	 -0.410133	  0.415441
  1.950552	 -0.426601	  0.405741
  1.944944	 -0.443500	  0.397429
  1.939277	 -0.460436	  0.388491
  1.934563	 -0.476414	  0.378303
  1.929723	 -0.493605	  0.368768
  1.924845	 -0.510277	  0.358821
  1.919913	 -0.527199	  0.348949
  1.917658	 -0.545573	  0.340587
  1.916262	 -0.564263	  0.333267
  1.915233	 -0.582894	  0.326033
  1.914058	 -0.601500	  0.318798
  1.912875	 -0.619772	  0.311708
  1.909674	 -0.637833	  0.305609
  1.911059	 -0.660336	  0.299903
  1.915635	 -0.678613	  0.293794
  1.924183	 -0.695975	  0.286985
  1.928702	 -0.715802	  0.283342
  1.926414	 -0.734172	  0.280201
  1.924433	 -0.754504	  0.275161
  1.923471	 -0.776225	  0.272816
  1.931381	 -0.795947	  0.272887
  1.940996	 -0.812707	  0.270836
  1.946973	 -0.831344	  0.268748
  1.951331	 -0.850603	  0.267353
  1.957688	 -0.870677	  0.267715
  1.964588	 -0.889885	  0.268866
  1.967520	 -0.909577	  0.271192
  1.970457	 -0.929193	  0.271769
  1.978935	 -0.947146	  0.272555
  1.988419	 -0.965497	  0.274528
  1.994867	 -0.983986	  0.276701
  2.000159	 -1.003727	  0.278591
  2.008982	 -1.021319	  0.281513
  2.018537	 -1.038631	  0.283818
  2.025659	 -1.057047	  0.285038
  2.033924	 -1.076817	  0.288759
  2.044113	 -1.092802	  0.293779
  2.068072	 -1.125305	  0.296593
  2.077803	 -1.142618	  0.298946
