 -0.132350	  1.801073	  1.750509
 -0.128048	  1.804191	  1.757059
 -0.135690	  1.797966	  1.744376
 -0.146448	  1.785864	  1.723502
 -0.157565	  1.777858	  1.706471
 -0.163096	  1.773214	  1.697237
 -0.170605	  1.760853	  1.677292
 -0.180234	  1.751430	  1.660937
 -0.188003	  1.743801	  1.650896
 -0.199885	  1.727273	  1.636289
 -0.214012	  1.712926	  1.622783
 -0.226840	  1.706716	  1.605290
 -0.234089	  1.703806	  1.593615
 -0.240648	  1.700909	  1.571998
 -0.244135	  1.698720	  1.550989
 -0.252264	  1.695383	  1.530841
 -0.262520	  1.689646	  1.517058
 -0.274850	  1.682780	  1.504842
 -0.291698	  1.672931	  1.489641
 -0.302417	  1.671482	  1.476178
 -0.313692	  1.670632	  1.452881
 -0.319486	  1.669132	  1.434346
 -0.327563	  1.666598	  1.419911
 -0.341368	  1.665261	  1.402608
 -0.353565	  1.661605	  1.388045
 -0.367155	  1.654764	  1.370137
 -0.378717	  1.649001	  1.357580
 -0.394013	  1.642654	  1.347749
 -0.411445	  1.637039	  1.335803
 -0.427761	  1.634692	  1.323688
 -0.442706	  1.631949	  1.312429
 -0.459450	  1.626889	  1.296648
 -0.475467	  1.627499	  1.279601
 -0.487260	  1.630443	  1.269148
 -0.503651	  1.629850	  1.261916
 -0.524569	  1.630027	  1.253218
 -0.542787	  1.631289	  1.243751
 -0.560473	  1.630949	  1.234302
 -0.579221	  1.629863	  1.227629
 -0.598080	  1.628656	  1.221027
 -0.617179	  1.628193	  1.215145
 -0.636861	  1.630363	  1.212322
 -0.656549	  1.632581	  1.209590
 -0.676220	  1.634684	  1.206783
 -0.695114	  1.632245	  1.200762
 -0.713580	  1.628648	  1.193979
 -0.732016	  1.624984	  1.187155
 -0.749026	  1.618886	  1.178665
 -0.761301	  1.607965	  1.167466
 -0.772746	  1.595963	  1.156484
 -0.783417	  1.583270	  1.145309
 -0.790863	  1.570187	  1.132758
 -0.796801	  1.557464	  1.119452
 -0.801610	  1.544390	  1.106073
 -0.803164	  1.529652	  1.093245
 -0.804133	  1.515256	  1.080171
 -0.806150	  1.502183	  1.065779
 -0.805972	  1.488121	  1.051243
 -0.804039	  1.473605	  1.037444
 -0.800713	  1.461633	  1.021708
 -0.797843	  1.450059	  1.005693
 -0.794956	  1.438420	  0.989680
 -0.792081	  1.426740	  0.973707
 -0.792328	  1.416013	  0.956826
 -0.793104	  1.405465	  0.939850
 -0.793889	  1.394903	  0.922887
 -0.794610	  1.384166	  0.906044
 -0.795208	  1.373038	  0.889420
 -0.795762	  1.361873	  0.872845
 -0.796210	  1.350822	  0.856181
 -0.796492	  1.339685	  0.839578
 -0.796632	  1.328673	  0.823003
 -0.793210	  1.317632	  0.807896
 -0.785822	  1.305914	  0.793444
 -0.777420	  1.290641	  0.783121
 -0.770860	  1.272858	  0.775040
 -0.774585	  1.254497	  0.763069
 -0.783246	  1.236653	  0.737209
 -0.786316	  1.231690	  0.729426
 -0.784149	  1.216070	  0.716665
 -0.782209	  1.194629	  0.699403
 -0.780065	  1.186435	  0.686879
 -0.775967	  1.176055	  0.665476
 -0.773738	  1.165896	  0.648838
 -0.773945	  1.154350	  0.635795
 -0.776085	  1.139434	  0.615725
 -0.777505	  1.127909	  0.599494
 -0.778234	  1.119716	  0.586394
 -0.779047	  1.109263	  0.569287
 -0.778150	  1.099206	  0.551796
 -0.774571	  1.085298	  0.532276
 -0.772948	  1.075693	  0.518830
 -0.771581	  1.062821	  0.507594
 -0.770292	  1.034256	  0.488674
 -0.771466	  1.025837	  0.482938
 -0.773538	  1.010873	  0.478115
 -0.772344	  0.984417	  0.459465
 -0.774189	  0.971734	  0.447101
 -0.777642	  0.964423	  0.435098
 -0.785083	  0.943437	  0.416879
 -0.788142	  0.931755	  0.401682
 -0.789419	  0.919704	  0.388227
 -0.791158	  0.901755	  0.375601
 -0.790547	  0.889509	  0.368548
 -0.794827	  0.867459	  0.360986
 -0.799577	  0.841335	  0.356130
 -0.800591	  0.830276	  0.351008
 -0.805011	  0.811334	  0.352316
 -0.814621	  0.794536	  0.353701
 -0.829195	  0.776501	  0.360931
 -0.839058	  0.760481	  0.367033
 -0.849436	  0.746177	  0.370638
 -0.864167	  0.728366	  0.376085
 -0.873622	  0.716567	  0.380573
 -0.885505	  0.699151	  0.382649
 -0.900233	  0.678512	  0.378104
 -0.910684	  0.661611	  0.371740
 -0.917188	  0.649710	  0.368891
 -0.925578	  0.632157	  0.369776
 -0.945534	  0.611282	  0.377887
 -0.957665	  0.599571	  0.380651
 -0.970753	  0.589717	  0.381192
 -0.987606	  0.571897	  0.378285
 -0.999200	  0.560017	  0.371561
 -1.011988	  0.544582	  0.369073
 -1.024184	  0.529621	  0.366086
 -1.034867	  0.516129	  0.360368
 -1.045309	  0.498339	  0.356281
 -1.062389	  0.480250	  0.351545
 -1.074376	  0.471155	  0.348913
 -1.090367	  0.464485	  0.342376
 -1.107100	  0.456821	  0.328115
 -1.122336	  0.452137	  0.315219
 -1.134483	  0.444748	  0.306473
 -1.151848	  0.436085	  0.286396
 -1.162586	  0.433635	  0.274281
 -1.175014	  0.433269	  0.262256
 -1.191808	  0.428106	  0.254435
 -1.207642	  0.414764	  0.241946
 -1.216408	  0.404434	  0.227717
 -1.224846	  0.396791	  0.209754
 -1.233909	  0.394153	  0.191352
 -1.242764	  0.396153	  0.172984
 -1.250422	  0.400489	  0.154503
 -1.257332	  0.406268	  0.135030
 -1.264983	  0.411341	  0.117975
 -1.275965	  0.416086	  0.100920
 -1.289267	  0.415780	  0.084194
 -1.298983	  0.409994	  0.069611
 -1.305742	  0.407977	  0.049738
 -1.311575	  0.409826	  0.030059
 -1.317468	  0.412755	  0.011183
 -1.321667	  0.417903	 -0.007611
 -1.325697	  0.423887	 -0.026268
 -1.329507	  0.429988	 -0.044923
 -1.332531	  0.436922	 -0.063249
 -1.335518	  0.444454	 -0.081543
 -1.338541	  0.451597	 -0.099973
 -1.340447	  0.459566	 -0.117923
 -1.343105	  0.465294	 -0.136126
 -1.350692	  0.470104	 -0.155077
 -1.361815	  0.479259	 -0.173743
 -1.362610	  0.492448	 -0.192267
 -1.354050	  0.500928	 -0.207693
 -1.351957	  0.506870	 -0.225884
 -1.357512	  0.516959	 -0.246327
 -1.356727	  0.525785	 -0.262571
 -1.353562	  0.535031	 -0.281034
 -1.355901	  0.543439	 -0.298885
 -1.358904	  0.550639	 -0.315989
 -1.361463	  0.561106	 -0.336377
 -1.367932	  0.569642	 -0.354364
 -1.377155	  0.573993	 -0.367555
 -1.389655	  0.579898	 -0.385517
 -1.396564	  0.586181	 -0.401270
 -1.401146	  0.588766	 -0.419602
 -1.410133	  0.595559	 -0.445236
 -1.417057	  0.601155	 -0.454806
 -1.430483	  0.609723	 -0.468620
 -1.443888	  0.615911	 -0.485811
 -1.453607	  0.614639	 -0.502016
 -1.465029	  0.611922	 -0.519281
 -1.476941	  0.611956	 -0.534898
 -1.488308	  0.609630	 -0.550077
 -1.500020	  0.604994	 -0.567754
 -1.511952	  0.603591	 -0.583897
 -1.523529	  0.602514	 -0.597101
 -1.535130	  0.597236	 -0.614046
 -1.546254	  0.594579	 -0.633397
 -1.559037	  0.597841	 -0.651080
 -1.571472	  0.598617	 -0.662178
 -1.584779	  0.590506	 -0.675473
 -1.595524	  0.580361	 -0.691389
 -1.606098	  0.573666	 -0.707386
 -1.615685	  0.568182	 -0.724095
 -1.625660	  0.562022	 -0.739651
 -1.638857	  0.557372	 -0.754172
 -1.649645	  0.549831	 -0.771791
 -1.656529	  0.540798	 -0.789505
 -1.659404	  0.537428	 -0.806531
 -1.662556	  0.534408	 -0.827348
 -1.670592	  0.523143	 -0.848196
 -1.681233	  0.514757	 -0.858222
 -1.698282	  0.506338	 -0.870608
 -1.710653	  0.495136	 -0.888511
 -1.712552	  0.489145	 -0.906342
 -1.714901	  0.484688	 -0.925289
 -1.720335	  0.478379	 -0.943091
 -1.725965	  0.470702	 -0.959593
 -1.736104	  0.459754	 -0.978614
 -1.746723	  0.450881	 -0.997542
 -1.753975	  0.447518	 -1.008154
 -1.762091	  0.440891	 -1.028986
 -1.764059	  0.432370	 -1.048279
 -1.764723	  0.425714	 -1.064773
 -1.771642	  0.417363	 -1.083474
 -1.774439	  0.411803	 -1.102554
 -1.769663	  0.406770	 -1.124877
 -1.767385	  0.398471	 -1.145627
 -1.774636	  0.388484	 -1.162537
 -1.782801	  0.383830	 -1.174111
 -1.790179	  0.377200	 -1.194633
 -1.795355	  0.369653	 -1.213282
 -1.800423	  0.362106	 -1.231117
 -1.806026	  0.354620	 -1.248774
 -1.809935	  0.346708	 -1.266465
 -1.811125	  0.337301	 -1.284438
 -1.813852	  0.325288	 -1.301795
 -1.822490	  0.311175	 -1.316143
 -1.840585	  0.304289	 -1.333587
 -1.852353	  0.306373	 -1.348936
 -1.859594	  0.304195	 -1.366587
 -1.867781	  0.295047	 -1.383393
 -1.880531	  0.287273	 -1.400442
 -1.891346	  0.286618	 -1.415978
 -1.899839	  0.283006	 -1.432251
 -1.911974	  0.274738	 -1.448860
 -1.925453	  0.271936	 -1.464518
 -1.934497	  0.272292	 -1.479259
 -1.946092	  0.264286	 -1.496296
 -1.961488	  0.257910	 -1.513055
 -1.970329	  0.258065	 -1.524697
 -1.981291	  0.256045	 -1.544402
 -1.992252	  0.249602	 -1.559840
