 -0.287212	 -2.004252	  1.388226
 -0.282868	 -2.042349	  1.364066
 -0.278524	 -2.080446	  1.339906
 -0.281124	 -2.063523	  1.350207
 -0.283759	 -2.046594	  1.360462
 -0.285443	 -2.029480	  1.370695
 -0.288158	 -2.012111	  1.380475
 -0.292341	 -1.994650	  1.389579
 -0.297886	 -1.977039	  1.397650
 -0.304498	 -1.959916	  1.405059
 -0.312190	 -1.942849	  1.412434
 -0.321068	 -1.926791	  1.420962
 -0.330248	 -1.912206	  1.431237
 -0.339793	 -1.897330	  1.440339
 -0.350374	 -1.882909	  1.448309
 -0.363486	 -1.869543	  1.456813
 -0.376579	 -1.856207	  1.464634
 -0.388928	 -1.846229	  1.475143
 -0.404944	 -1.835206	  1.485582
 -0.413566	 -1.814290	  1.494110
 -0.419657	 -1.794313	  1.501823
 -0.424611	 -1.779667	  1.507642
 -0.430276	 -1.759939	  1.518227
 -0.434015	 -1.743423	  1.528750
 -0.434035	 -1.727953	  1.537819
 -0.434014	 -1.707611	  1.548726
 -0.437591	 -1.690437	  1.560226
 -0.442029	 -1.680088	  1.568969
 -0.454692	 -1.658238	  1.587603
 -0.462407	 -1.642326	  1.598336
 -0.467037	 -1.632321	  1.603402
 -0.473701	 -1.611288	  1.614443
 -0.477316	 -1.592676	  1.627026
 -0.478502	 -1.580393	  1.635454
 -0.471650	 -1.563229	  1.642972
 -0.470920	 -1.542045	  1.654657
 -0.471212	 -1.526036	  1.663852
 -0.472380	 -1.506962	  1.671441
 -0.481395	 -1.490355	  1.681485
 -0.489899	 -1.475219	  1.692745
 -0.494177	 -1.458963	  1.704086
 -0.496835	 -1.442452	  1.714046
 -0.503195	 -1.426489	  1.724617
 -0.510148	 -1.412015	  1.737306
 -0.514715	 -1.396950	  1.750405
 -0.517637	 -1.381173	  1.762765
 -0.518459	 -1.364520	  1.773460
 -0.523138	 -1.348311	  1.783790
 -0.529317	 -1.332735	  1.795518
 -0.532581	 -1.316807	  1.806077
 -0.535191	 -1.298459	  1.814514
 -0.538389	 -1.280659	  1.823723
 -0.544788	 -1.264780	  1.836875
 -0.549993	 -1.251659	  1.852342
 -0.552075	 -1.238501	  1.869817
 -0.552175	 -1.225451	  1.885506
 -0.551775	 -1.208838	  1.897795
 -0.554269	 -1.192502	  1.905252
 -0.555780	 -1.171263	  1.913175
 -0.558620	 -1.151294	  1.920476
 -0.562336	 -1.135380	  1.925838
 -0.567210	 -1.117480	  1.935014
 -0.569223	 -1.099187	  1.944269
 -0.571882	 -1.080489	  1.951682
 -0.575105	 -1.061816	  1.958111
 -0.580219	 -1.044207	  1.966377
 -0.586109	 -1.026888	  1.974709
 -0.591079	 -1.008945	  1.982116
 -0.595783	 -0.990950	  1.989171
 -0.603248	 -0.973509	  1.994938
 -0.611378	 -0.956208	  2.001004
 -0.617342	 -0.938482	  2.008174
 -0.621199	 -0.920546	  2.016152
 -0.623678	 -0.902324	  2.024011
 -0.625322	 -0.883962	  2.031766
 -0.627226	 -0.865740	  2.039789
 -0.629858	 -0.847950	  2.048541
 -0.632489	 -0.830158	  2.057287
 -0.635779	 -0.812894	  2.066833
 -0.639732	 -0.796237	  2.077174
 -0.643688	 -0.779578	  2.087512
 -0.649365	 -0.763602	  2.098119
 -0.655855	 -0.748006	  2.108828
 -0.662344	 -0.732424	  2.119554
 -0.670353	 -0.718079	  2.130937
 -0.678774	 -0.704404	  2.142846
 -0.686890	 -0.691036	  2.155339
 -0.693553	 -0.677095	  2.167376
 -0.695508	 -0.664934	  2.181494
 -0.692987	 -0.648862	  2.196019
 -0.697077	 -0.626031	  2.206800
 -0.706369	 -0.608759	  2.216713
 -0.717698	 -0.595820	  2.224280
 -0.729007	 -0.582513	  2.233413
 -0.739019	 -0.568054	  2.243970
 -0.748588	 -0.555061	  2.253749
 -0.758477	 -0.537233	  2.266213
 -0.760795	 -0.522151	  2.275982
 -0.759045	 -0.506655	  2.284819
 -0.758400	 -0.483232	  2.297092
 -0.764186	 -0.466489	  2.305924
 -0.775046	 -0.454227	  2.312965
 -0.787367	 -0.435390	  2.325603
 -0.792552	 -0.418413	  2.334817
 -0.797737	 -0.401436	  2.344031
