 -1.145454	  1.332919	 -1.612622
 -1.159797	  1.332851	 -1.618596
 -1.141335	  1.332940	 -1.610905
 -1.122872	  1.333031	 -1.603217
 -1.104035	  1.334051	 -1.596591
 -1.084705	  1.338698	 -1.594465
 -1.065381	  1.343370	 -1.592286
 -1.046053	  1.348042	 -1.590096
 -1.026706	  1.352712	 -1.587980
 -1.007665	  1.358912	 -1.588777
 -0.989469	  1.366464	 -1.592351
 -0.971296	  1.373975	 -1.595985
 -0.953124	  1.381452	 -1.599733
 -0.934953	  1.388945	 -1.603521
 -0.918674	  1.395970	 -1.612409
 -0.904438	  1.403313	 -1.623594
 -0.889263	  1.409258	 -1.632387
 -0.865151	  1.415050	 -1.638657
 -0.847258	  1.421530	 -1.646513
 -0.836794	  1.428164	 -1.657146
 -0.823147	  1.434679	 -1.668655
 -0.801741	  1.444072	 -1.681735
 -0.789780	  1.448971	 -1.687943
 -0.775032	  1.455495	 -1.699879
 -0.751912	  1.461453	 -1.706918
 -0.735787	  1.467113	 -1.717308
