 -0.102825	  2.303278	  1.028370
 -0.103502	  2.316706	  1.044988
 -0.102474	  2.296319	  1.019756
 -0.100286	  2.257436	  0.976365
 -0.100219	  2.218276	  0.938187
 -0.099983	  2.183684	  0.904636
 -0.099148	  2.151696	  0.872418
 -0.096832	  2.122861	  0.841429
 -0.092929	  2.097538	  0.811340
 -0.089182	  2.082540	  0.788318
 -0.075067	  2.074145	  0.733874
 -0.065247	  2.068467	  0.691473
 -0.057722	  2.060313	  0.641831
 -0.054053	  2.045088	  0.590658
 -0.054736	  2.024282	  0.548694
 -0.058990	  1.994779	  0.507613
 -0.082221	  1.923632	  0.427969
 -0.215637	  1.787164	  0.269082
 -0.182114	  1.632837	  0.218330
 -0.172117	  1.516264	  0.189134
 -0.175263	  1.469831	  0.172945
 -0.030965	  1.446666	  0.111090
  0.115577	  1.414582	  0.030588
  0.181850	  1.338883	 -0.052916
  0.219318	  1.309296	 -0.101997
  0.245194	  1.292951	 -0.138162
  0.260027	  1.269357	 -0.180898
  0.260738	  1.239842	 -0.223951
  0.250544	  1.206400	 -0.262028
  0.236434	  1.178054	 -0.291894
  0.220550	  1.154202	 -0.329527
  0.187943	  1.120429	 -0.390962
  0.104156	  1.048650	 -0.459902
 -0.002049	  0.932130	 -0.487795
 -0.063227	  0.806059	 -0.481952
 -0.086851	  0.732251	 -0.482629
 -0.098752	  0.697841	 -0.488993
 -0.108284	  0.679161	 -0.505333
 -0.111841	  0.690408	 -0.549655
 -0.108467	  0.719872	 -0.624636
 -0.084937	  0.760829	 -0.745924
 -0.058747	  0.776087	 -0.884585
 -0.034470	  0.752479	 -1.007783
  0.007383	  0.704900	 -1.107331
  0.068496	  0.663713	 -1.175250
  0.132279	  0.636405	 -1.219106
  0.190751	  0.617087	 -1.249174
  0.255085	  0.598008	 -1.276172
  0.343182	  0.569748	 -1.304367
  0.450329	  0.508965	 -1.329413
  0.522361	  0.407279	 -1.345256
  0.561465	  0.313576	 -1.356524
  0.577022	  0.221820	 -1.362028
  0.576638	  0.149608	 -1.369146
  0.565999	  0.088157	 -1.385410
  0.549128	  0.053400	 -1.409385
  0.535824	  0.042499	 -1.429499
  0.513238	  0.037693	 -1.465910
  0.483370	  0.041612	 -1.515629
  0.444478	  0.054166	 -1.580598
  0.397908	  0.069249	 -1.647583
  0.332607	  0.070389	 -1.712317
  0.252689	  0.075438	 -1.774865
  0.161540	  0.110129	 -1.852663
  0.083846	  0.105924	 -1.926805
  0.051420	  0.078340	 -1.978951
  0.043013	  0.050136	 -2.015770
  0.042162	  0.023656	 -2.048272
  0.045048	 -0.006347	 -2.084501
  0.049741	 -0.040580	 -2.122954
  0.054772	 -0.077878	 -2.161068
  0.059338	 -0.116938	 -2.197566
  0.062993	 -0.156933	 -2.232627
  0.065002	 -0.194085	 -2.265039
  0.065392	 -0.228044	 -2.299111
  0.064567	 -0.259019	 -2.335375
  0.063209	 -0.286627	 -2.372017
  0.061922	 -0.311172	 -2.408967
  0.061918	 -0.330901	 -2.444992
  0.066369	 -0.351556	 -2.486096
  0.074502	 -0.373132	 -2.525585
