 -0.372015	  2.111448	  2.141096
 -0.368332	  2.090543	  2.119897
 -0.378855	  2.049602	  2.111463
 -0.398256	  2.005762	  2.086356
 -0.415374	  1.966834	  2.072225
 -0.433894	  1.925958	  2.052608
 -0.450831	  1.881619	  2.038569
 -0.467355	  1.837893	  2.017239
 -0.480957	  1.790414	  2.004543
 -0.502910	  1.751682	  1.984436
 -0.514454	  1.705338	  1.963699
 -0.535063	  1.665160	  1.949687
 -0.546463	  1.622500	  1.926447
 -0.563447	  1.580225	  1.911126
 -0.579763	  1.535730	  1.896608
 -0.599102	  1.492972	  1.875522
 -0.615894	  1.449803	  1.859801
 -0.632973	  1.406605	  1.841042
 -0.648887	  1.364018	  1.823149
 -0.663073	  1.323215	  1.800776
 -0.683528	  1.279505	  1.783127
 -0.701777	  1.233274	  1.766065
 -0.719913	  1.192036	  1.755062
 -0.735876	  1.148409	  1.733212
 -0.747951	  1.100580	  1.714464
 -0.763171	  1.059820	  1.696096
 -0.782617	  1.015166	  1.676115
 -0.799396	  0.978358	  1.659947
 -0.818595	  0.935179	  1.641658
 -0.838055	  0.891700	  1.622065
 -0.856418	  0.850820	  1.606793
 -0.875459	  0.812091	  1.589076
 -0.896860	  0.766232	  1.570872
 -0.916133	  0.720998	  1.552576
 -0.932809	  0.681765	  1.538021
 -0.950195	  0.634895	  1.517444
 -0.962646	  0.591215	  1.499314
 -0.974518	  0.548675	  1.479891
 -0.989432	  0.502854	  1.461281
 -1.004589	  0.457082	  1.442945
 -1.018204	  0.417086	  1.427162
 -1.032842	  0.370912	  1.407864
 -1.048855	  0.325727	  1.390084
 -1.065303	  0.285683	  1.372069
 -1.083868	  0.240627	  1.352908
 -1.101543	  0.203740	  1.337893
 -1.117639	  0.162666	  1.320347
 -1.136772	  0.112959	  1.302929
 -1.153640	  0.069298	  1.287299
 -1.172982	  0.029565	  1.274130
 -1.189073	 -0.016732	  1.258079
 -1.210505	 -0.061049	  1.239024
 -1.222290	 -0.102754	  1.218405
 -1.236008	 -0.147326	  1.196141
 -1.258681	 -0.187383	  1.177436
 -1.275940	 -0.227505	  1.164258
 -1.292077	 -0.271763	  1.141398
 -1.310402	 -0.315914	  1.122512
 -1.325554	 -0.360355	  1.108822
 -1.346748	 -0.398834	  1.094545
 -1.359310	 -0.444573	  1.070113
 -1.376598	 -0.488494	  1.050657
 -1.396095	 -0.528726	  1.035466
 -1.407549	 -0.570516	  1.017336
 -1.425108	 -0.614113	  0.999919
 -1.444125	 -0.658796	  0.984351
 -1.460633	 -0.699194	  0.970990
 -1.479119	 -0.747061	  0.952036
 -1.494545	 -0.789622	  0.933961
 -1.512298	 -0.834909	  0.914514
 -1.529340	 -0.875810	  0.896914
 -1.546513	 -0.918801	  0.878687
 -1.565440	 -0.964531	  0.860471
 -1.581098	 -1.000816	  0.847343
 -1.598763	 -1.044077	  0.830922
 -1.616441	 -1.088937	  0.815172
 -1.634507	 -1.133271	  0.798575
 -1.650928	 -1.175034	  0.782159
 -1.666017	 -1.217240	  0.764701
 -1.682544	 -1.261939	  0.745954
 -1.699093	 -1.306800	  0.723852
 -1.715723	 -1.353191	  0.701059
 -1.731664	 -1.390062	  0.683731
 -1.750207	 -1.437679	  0.664049
 -1.764501	 -1.478309	  0.647163
 -1.781262	 -1.523191	  0.632484
 -1.794445	 -1.563046	  0.616385
 -1.814651	 -1.612932	  0.596346
 -1.828233	 -1.648303	  0.581092
 -1.845292	 -1.698023	  0.560010
 -1.861074	 -1.741770	  0.540718
 -1.876230	 -1.782648	  0.524442
 -1.896926	 -1.824414	  0.507961
 -1.911549	 -1.865082	  0.488144
 -1.929241	 -1.906110	  0.468965
 -1.946518	 -1.952355	  0.451670
 -1.964418	 -1.994208	  0.431661
 -1.980188	 -2.037682	  0.418945
 -2.001958	 -2.075639	  0.401231
 -2.015907	 -2.121810	  0.375885
 -2.039939	 -2.170605	  0.356542
 -2.060338	 -2.192311	  0.360107
