 -0.875356	  0.264630	 -2.888706
 -0.866689	  0.262010	 -2.860105
 -0.852803	  0.281798	 -2.810756
 -0.848453	  0.308798	 -2.767271
 -0.845821	  0.325602	 -2.718217
 -0.839839	  0.345035	 -2.671856
 -0.839988	  0.371494	 -2.629073
 -0.837437	  0.395105	 -2.585821
 -0.839777	  0.413743	 -2.541248
 -0.843187	  0.433219	 -2.497820
 -0.847063	  0.454074	 -2.452506
 -0.848296	  0.476307	 -2.404355
 -0.846808	  0.496849	 -2.357784
 -0.842812	  0.514818	 -2.312405
 -0.837645	  0.532105	 -2.265713
 -0.831859	  0.548728	 -2.218846
 -0.825318	  0.564932	 -2.171336
 -0.817881	  0.580910	 -2.123213
 -0.809262	  0.597074	 -2.074339
 -0.799091	  0.612617	 -2.028942
 -0.786684	  0.629280	 -1.983575
 -0.773629	  0.648025	 -1.938690
 -0.760707	  0.668322	 -1.895133
 -0.747570	  0.689360	 -1.852024
 -0.733732	  0.710805	 -1.808033
 -0.719883	  0.731100	 -1.764267
 -0.706227	  0.751587	 -1.718374
 -0.694878	  0.771531	 -1.674200
 -0.684732	  0.791112	 -1.632636
 -0.674243	  0.809199	 -1.595078
 -0.660608	  0.826961	 -1.556475
 -0.632800	  0.854720	 -1.496321
 -0.569040	  0.894732	 -1.433458
 -0.490570	  0.956510	 -1.368530
 -0.396632	  1.016637	 -1.281109
 -0.331983	  1.013698	 -1.234700
 -0.256724	  0.951310	 -1.196570
 -0.167712	  0.871301	 -1.155383
 -0.118110	  0.779475	 -1.057362
 -0.096494	  0.694532	 -1.020049
 -0.098969	  0.659296	 -1.002370
 -0.115395	  0.641557	 -0.984130
 -0.161511	  0.624620	 -0.960005
 -0.196302	  0.633715	 -0.947748
 -0.290345	  0.721987	 -0.899403
 -0.374489	  0.852694	 -0.813249
 -0.471983	  0.992495	 -0.728045
 -0.603293	  1.122937	 -0.694780
 -0.678047	  1.195256	 -0.695835
 -0.738808	  1.250974	 -0.693368
 -0.809864	  1.317300	 -0.666193
 -0.856535	  1.370228	 -0.640926
 -0.892950	  1.427192	 -0.609174
 -0.917260	  1.497056	 -0.566457
 -0.919359	  1.541660	 -0.538944
 -0.910683	  1.577967	 -0.515233
 -0.883646	  1.625106	 -0.480639
 -0.838863	  1.670274	 -0.437094
 -0.779494	  1.706236	 -0.387125
 -0.732046	  1.722145	 -0.351019
 -0.702113	  1.724509	 -0.320096
 -0.690847	  1.717081	 -0.295874
 -0.687306	  1.695376	 -0.250766
 -0.679538	  1.674197	 -0.168707
 -0.642545	  1.663985	 -0.084898
 -0.612187	  1.666835	 -0.015668
 -0.582788	  1.677592	  0.060009
 -0.563160	  1.687484	  0.115413
 -0.547548	  1.697043	  0.161855
 -0.533666	  1.707841	  0.206078
 -0.521912	  1.719629	  0.248229
 -0.511361	  1.733266	  0.292581
 -0.503356	  1.748679	  0.337789
 -0.498460	  1.765671	  0.381877
 -0.496117	  1.787651	  0.431596
 -0.498593	  1.823897	  0.502302
 -0.505755	  1.871227	  0.571184
 -0.506844	  1.878401	  0.580018
 -0.505816	  1.883143	  0.590993
 -0.492409	  1.897491	  0.651838
 -0.478185	  1.907391	  0.703400
 -0.463258	  1.919924	  0.747798
 -0.452681	  1.941834	  0.791648
 -0.446923	  1.970231	  0.833547
 -0.443772	  2.001915	  0.874765
 -0.441068	  2.032024	  0.915763
 -0.437597	  2.057912	  0.955696
 -0.433160	  2.082132	  1.000398
 -0.428415	  2.103294	  1.048515
 -0.424288	  2.120231	  1.094640
 -0.420756	  2.135556	  1.140710
 -0.417791	  2.150076	  1.186953
 -0.414884	  2.165193	  1.235580
 -0.408544	  2.178678	  1.286453
 -0.396758	  2.187582	  1.336392
 -0.396828	  2.209284	  1.382790
 -0.393872	  2.226108	  1.429739
 -0.383712	  2.248943	  1.471975
 -0.379425	  2.268469	  1.515644
 -0.373477	  2.290129	  1.558394
 -0.372665	  2.310958	  1.604305
 -0.360889	  2.332919	  1.648255
 -0.359840	  2.353372	  1.693184
 -0.356449	  2.376154	  1.736012
 -0.354276	  2.388081	  1.780886
 -0.357819	  2.411962	  1.798695
