  1.908242	  2.339482	 -0.257562
  1.889348	  2.316319	 -0.255012
  1.868994	  2.284312	 -0.227155
  1.838469	  2.254760	 -0.206465
  1.810484	  2.219176	 -0.187077
  1.780224	  2.180789	 -0.171178
  1.749385	  2.148535	 -0.146302
  1.721048	  2.115447	 -0.123673
  1.691640	  2.081417	 -0.106485
  1.663199	  2.046965	 -0.084890
  1.637309	  2.007752	 -0.066249
  1.611614	  1.971721	 -0.042658
  1.583265	  1.939597	 -0.016354
  1.555092	  1.905283	  0.006612
  1.528805	  1.872570	  0.032855
  1.503924	  1.840083	  0.059584
  1.481267	  1.805156	  0.085985
  1.457929	  1.769088	  0.111644
  1.433719	  1.732979	  0.135572
  1.411462	  1.697753	  0.156969
  1.394184	  1.662898	  0.175647
  1.385696	  1.621538	  0.196116
  1.399106	  1.557708	  0.219488
  1.424744	  1.480828	  0.229738
  1.444542	  1.401512	  0.228778
  1.451726	  1.328495	  0.222918
  1.447356	  1.283380	  0.219387
  1.437777	  1.255834	  0.219796
  1.413714	  1.220433	  0.224083
  1.363934	  1.178436	  0.222646
  1.292822	  1.135996	  0.178330
  1.187861	  1.058912	  0.121511
  1.038848	  1.027637	  0.077857
  0.893839	  0.967979	  0.123239
  0.802828	  0.934098	  0.246448
  0.790208	  0.918180	  0.378246
  0.808334	  0.888284	  0.477514
  0.834056	  0.897379	  0.544425
  0.831383	  0.902476	  0.563849
  0.830382	  0.902416	  0.565285
  0.817009	  0.898069	  0.572926
  0.784278	  0.880501	  0.585101
  0.745234	  0.856118	  0.601753
  0.709038	  0.831109	  0.619113
  0.675388	  0.804862	  0.636650
  0.642243	  0.777233	  0.654224
  0.609251	  0.748775	  0.671155
  0.574790	  0.718857	  0.687237
  0.537567	  0.684950	  0.703753
  0.502716	  0.650716	  0.720059
  0.470719	  0.616506	  0.737657
  0.439963	  0.581626	  0.757308
  0.410324	  0.546184	  0.778056
  0.382455	  0.511441	  0.799999
  0.356562	  0.477587	  0.824141
  0.332515	  0.442883	  0.851385
  0.312562	  0.409030	  0.879874
  0.294698	  0.375002	  0.908048
  0.277470	  0.339947	  0.935360
  0.259086	  0.301210	  0.963823
  0.231738	  0.261665	  0.986474
  0.194118	  0.226038	  0.998312
  0.161186	  0.189525	  1.012993
  0.130629	  0.155059	  1.025911
  0.108640	  0.116288	  1.046450
  0.086181	  0.076504	  1.069425
  0.051151	  0.040749	  1.084889
  0.012565	  0.008543	  1.096688
 -0.024958	 -0.022987	  1.108869
 -0.060363	 -0.057071	  1.122970
 -0.093890	 -0.093432	  1.138273
 -0.125724	 -0.130394	  1.154167
 -0.156251	 -0.167292	  1.170703
 -0.185243	 -0.202472	  1.188709
 -0.212990	 -0.235696	  1.209400
 -0.240836	 -0.268092	  1.232775
 -0.270050	 -0.301631	  1.258755
 -0.296877	 -0.333538	  1.285669
 -0.318738	 -0.364987	  1.315301
 -0.338985	 -0.397728	  1.347299
 -0.363470	 -0.429525	  1.378717
 -0.395994	 -0.459536	  1.406118
 -0.429945	 -0.489820	  1.427777
 -0.461675	 -0.521741	  1.448553
 -0.492352	 -0.554975	  1.469509
 -0.522346	 -0.588699	  1.491736
 -0.551881	 -0.622640	  1.513547
 -0.579576	 -0.657525	  1.533512
 -0.605235	 -0.694200	  1.551674
 -0.629506	 -0.734357	  1.568579
 -0.653363	 -0.776787	  1.584038
 -0.677432	 -0.817695	  1.598338
 -0.703117	 -0.858459	  1.617253
 -0.730093	 -0.894716	  1.638379
 -0.759842	 -0.928980	  1.660581
 -0.790958	 -0.959692	  1.682631
 -0.824205	 -0.987871	  1.704669
 -0.858611	 -1.017564	  1.726895
 -0.891642	 -1.047639	  1.750433
 -0.924669	 -1.071089	  1.781191
 -0.963922	 -1.094066	  1.804598
 -1.000041	 -1.123478	  1.823815
 -1.031963	 -1.156038	  1.844120
 -1.059011	 -1.194131	  1.864708
 -1.081898	 -1.236107	  1.882824
 -1.105672	 -1.276824	  1.898234
 -1.129134	 -1.317136	  1.912832
 -1.151251	 -1.358770	  1.928221
 -1.176783	 -1.398760	  1.946249
 -1.206137	 -1.435826	  1.965679
 -1.237942	 -1.470631	  1.984494
 -1.269940	 -1.503159	  2.002446
 -1.301190	 -1.535520	  2.021757
 -1.332873	 -1.567759	  2.044806
 -1.370336	 -1.595964	  2.069050
 -1.404829	 -1.630562	  2.089910
 -1.418877	 -1.646868	  2.110809
