  1.025692	  1.910718	  1.264899
  1.029116	  1.927029	  1.281309
  1.024821	  1.906568	  1.260722
  1.014885	  1.869495	  1.223085
  1.002993	  1.833113	  1.186126
  0.989234	  1.798473	  1.149831
  0.973548	  1.766406	  1.114175
  0.955888	  1.736936	  1.078184
  0.934915	  1.708435	  1.040643
  0.909809	  1.679467	  1.002264
  0.878617	  1.649551	  0.963705
  0.837289	  1.617826	  0.926556
  0.784069	  1.584480	  0.894638
  0.723546	  1.552154	  0.870660
  0.664678	  1.522331	  0.850567
  0.610193	  1.497554	  0.830653
  0.563799	  1.474246	  0.812611
  0.529103	  1.450259	  0.798191
  0.503796	  1.424619	  0.785901
  0.482794	  1.393899	  0.772115
  0.463357	  1.353806	  0.752273
  0.448029	  1.305733	  0.723185
  0.440506	  1.253839	  0.685002
  0.441213	  1.202486	  0.640545
  0.450038	  1.151440	  0.592410
  0.463921	  1.101542	  0.543093
  0.480632	  1.050880	  0.492608
  0.496908	  0.999992	  0.442685
  0.509894	  0.948828	  0.392863
  0.519274	  0.898032	  0.344328
  0.526512	  0.852249	  0.302058
  0.530440	  0.815080	  0.269234
  0.531119	  0.787453	  0.246544
  0.529594	  0.765657	  0.230721
  0.525489	  0.739864	  0.214075
  0.516198	  0.702112	  0.190395
  0.500535	  0.651333	  0.155762
  0.482514	  0.600582	  0.114597
  0.466964	  0.563264	  0.074233
  0.457640	  0.544360	  0.042135
  0.450299	  0.541232	 -0.001333
  0.444946	  0.555814	 -0.048635
  0.440830	  0.575897	 -0.090401
  0.435418	  0.614886	 -0.153087
  0.432558	  0.672251	 -0.236603
  0.436339	  0.745826	 -0.338340
  0.438159	  0.824143	 -0.457808
  0.424562	  0.873476	 -0.590812
  0.406228	  0.877739	 -0.706423
  0.392346	  0.862723	 -0.788908
  0.381646	  0.842663	 -0.850773
  0.372448	  0.820005	 -0.904109
  0.364406	  0.794809	 -0.953745
  0.356883	  0.767707	 -1.001215
  0.349267	  0.739051	 -1.046562
  0.340963	  0.709286	 -1.089545
  0.331566	  0.678181	 -1.130040
  0.320284	  0.644093	 -1.169368
  0.305243	  0.602711	 -1.210171
  0.284028	  0.547693	 -1.254042
  0.255014	  0.473826	 -1.299738
  0.223496	  0.379865	 -1.340724
  0.201003	  0.275624	 -1.368706
  0.192795	  0.182288	 -1.384366
  0.194474	  0.113071	 -1.396961
  0.196467	  0.066285	 -1.410975
  0.196458	  0.032282	 -1.427149
  0.193998	  0.003431	 -1.447236
  0.188177	 -0.022712	 -1.472502
  0.177481	 -0.046723	 -1.505352
  0.161708	 -0.065849	 -1.543150
  0.143512	 -0.077004	 -1.579228
  0.128025	 -0.079557	 -1.607036
  0.103061	 -0.055680	 -1.657179
  0.085139	 -0.020348	 -1.706247
  0.068466	  0.034032	 -1.775002
  0.057940	  0.089033	 -1.852834
  0.056175	  0.132409	 -1.935464
  0.059862	  0.153841	 -2.018512
  0.064277	  0.155880	 -2.092614
  0.068306	  0.145664	 -2.155851
  0.071054	  0.130433	 -2.211244
  0.072468	  0.112835	 -2.264282
  0.071651	  0.093875	 -2.317311
  0.068591	  0.073835	 -2.369208
  0.064413	  0.052630	 -2.420367
  0.058734	  0.028793	 -2.472043
  0.044422	 -0.013943	 -2.555859
  0.042696	 -0.018550	 -2.564638
