  1.925200	  0.026638	 -1.624028
  1.960732	  0.042948	 -1.635526
  1.943319	  0.035053	 -1.629657
  1.925927	  0.027247	 -1.623608
  1.908538	  0.019449	 -1.617542
  1.891192	  0.011937	 -1.611007
  1.873851	  0.004468	 -1.604413
  1.856466	 -0.002876	 -1.597795
  1.838951	 -0.009836	 -1.591098
  1.821425	 -0.016801	 -1.584436
  1.803887	 -0.023407	 -1.577433
  1.786353	 -0.029673	 -1.570169
  1.768983	 -0.036383	 -1.564156
  1.750093	 -0.043260	 -1.559988
  1.730907	 -0.048055	 -1.557368
  1.708903	 -0.048282	 -1.548989
  1.690963	 -0.046626	 -1.538923
  1.674914	 -0.049348	 -1.527786
  1.659234	 -0.055714	 -1.520422
  1.641312	 -0.061685	 -1.513369
  1.624711	 -0.065321	 -1.503065
  1.609387	 -0.068971	 -1.485375
  1.594696	 -0.067962	 -1.469335
  1.575902	 -0.062960	 -1.461361
  1.556198	 -0.063850	 -1.461170
  1.534248	 -0.064321	 -1.458513
  1.514625	 -0.061875	 -1.446513
  1.502516	 -0.061835	 -1.431633
  1.484693	 -0.062707	 -1.420349
  1.468035	 -0.070258	 -1.414054
  1.450218	 -0.072859	 -1.404685
  1.434155	 -0.072850	 -1.393255
  1.416990	 -0.072276	 -1.382867
  1.399574	 -0.069809	 -1.374273
  1.382769	 -0.071180	 -1.364472
  1.365877	 -0.070834	 -1.352929
  1.351774	 -0.066487	 -1.339646
  1.338185	 -0.059352	 -1.326631
  1.324684	 -0.052254	 -1.313695
  1.311229	 -0.045076	 -1.300758
  1.300941	 -0.035376	 -1.286617
  1.290672	 -0.025654	 -1.272474
  1.280398	 -0.015936	 -1.258332
  1.270929	 -0.006818	 -1.243258
  1.261897	  0.001912	 -1.227699
  1.252827	  0.010203	 -1.211915
  1.243746	  0.015912	 -1.195030
  1.234785	  0.021589	 -1.178080
  1.226032	  0.026619	 -1.160857
  1.216660	  0.030735	 -1.143593
  1.208059	  0.035068	 -1.126048
  1.200251	  0.039898	 -1.108317
  1.191962	  0.044471	 -1.090673
  1.183654	  0.049015	 -1.073059
  1.175337	  0.053549	 -1.055443
  1.166796	  0.058024	 -1.037921
  1.157648	  0.062374	 -1.020676
  1.148467	  0.066699	 -1.003446
  1.136879	  0.065653	 -0.987192
  1.124319	  0.061042	 -0.972329
  1.111715	  0.053064	 -0.959010
  1.099111	  0.045064	 -0.945701
  1.086508	  0.037068	 -0.932388
  1.073932	  0.029877	 -0.918599
  1.061410	  0.023481	 -0.904377
  1.048888	  0.017089	 -0.890152
  1.036366	  0.010698	 -0.875927
  1.023845	  0.004307	 -0.861702
  1.011323	 -0.002084	 -0.847477
  0.998810	 -0.008452	 -0.833237
  0.987676	 -0.011469	 -0.816903
  0.977046	 -0.013453	 -0.800079
  0.966415	 -0.015423	 -0.783254
  0.955786	 -0.017399	 -0.766427
  0.945152	 -0.019358	 -0.749602
  0.934548	 -0.021320	 -0.732759
  0.924660	 -0.023795	 -0.715557
  0.916006	 -0.027201	 -0.697843
  0.907346	 -0.030632	 -0.680140
  0.898616	 -0.034126	 -0.662491
  0.890172	 -0.039092	 -0.645076
  0.882690	 -0.046983	 -0.628423
  0.874183	 -0.054358	 -0.612882
  0.861564	 -0.066291	 -0.617832
  0.848009	 -0.081827	 -0.625397
  0.838426	 -0.097383	 -0.631835
  0.818323	 -0.108584	 -0.642843
  0.799885	 -0.114193	 -0.651191
  0.780345	 -0.118936	 -0.653498
  0.764809	 -0.125069	 -0.656995
  0.750293	 -0.135310	 -0.666179
  0.734534	 -0.148256	 -0.673134
  0.717241	 -0.162444	 -0.674206
  0.698094	 -0.174327	 -0.678147
  0.686299	 -0.180486	 -0.684202
  0.669715	 -0.187709	 -0.697946
  0.653203	 -0.194749	 -0.710033
  0.639604	 -0.202294	 -0.718847
  0.622872	 -0.211772	 -0.728113
  0.601513	 -0.222517	 -0.728614
  0.582616	 -0.233556	 -0.726094
  0.566420	 -0.242367	 -0.729443
  0.550700	 -0.249288	 -0.740825
  0.536129	 -0.255794	 -0.753691
  0.520923	 -0.263870	 -0.764378
  0.506855	 -0.273525	 -0.771988
  0.485053	 -0.285301	 -0.779878
  0.468325	 -0.294422	 -0.783653
  0.453078	 -0.302044	 -0.786021
  0.436211	 -0.308152	 -0.789448
  0.418868	 -0.318591	 -0.793971
  0.400587	 -0.332281	 -0.788911
  0.382433	 -0.343745	 -0.783780
  0.366428	 -0.349120	 -0.784286
  0.345872	 -0.352721	 -0.784301
  0.325147	 -0.358923	 -0.783804
  0.303243	 -0.365827	 -0.786457
  0.282431	 -0.368539	 -0.784108
  0.268892	 -0.371099	 -0.774948
  0.255154	 -0.380415	 -0.757201
  0.240981	 -0.390076	 -0.739831
  0.222340	 -0.395696	 -0.731124
  0.204475	 -0.399371	 -0.729294
  0.185010	 -0.407010	 -0.728086
  0.167173	 -0.418753	 -0.722101
  0.152967	 -0.426604	 -0.714138
  0.134241	 -0.432529	 -0.706585
  0.118175	 -0.441145	 -0.698585
  0.106222	 -0.452815	 -0.689204
  0.091311	 -0.466998	 -0.683098
  0.069194	 -0.478368	 -0.680827
  0.051465	 -0.481431	 -0.675196
  0.036720	 -0.483405	 -0.664578
  0.021607	 -0.490421	 -0.651009
  0.006459	 -0.503187	 -0.636475
 -0.009812	 -0.514492	 -0.625902
 -0.022026	 -0.520559	 -0.620251
 -0.039150	 -0.528801	 -0.613877
 -0.060212	 -0.541480	 -0.607420
 -0.073851	 -0.547652	 -0.602353
 -0.095986	 -0.548952	 -0.589586
 -0.117613	 -0.541699	 -0.578081
 -0.136685	 -0.541215	 -0.565424
 -0.146690	 -0.541800	 -0.557029
 -0.161990	 -0.552466	 -0.546540
 -0.179162	 -0.560560	 -0.538748
 -0.199178	 -0.566573	 -0.528722
 -0.218961	 -0.568091	 -0.517995
 -0.231413	 -0.570738	 -0.508940
 -0.247468	 -0.576331	 -0.498635
 -0.264764	 -0.583401	 -0.489956
 -0.283096	 -0.590667	 -0.482109
 -0.303132	 -0.593188	 -0.472967
 -0.319193	 -0.595925	 -0.461944
 -0.332681	 -0.598454	 -0.451567
 -0.350506	 -0.605043	 -0.443161
 -0.368441	 -0.609269	 -0.436446
 -0.389592	 -0.610931	 -0.424981
 -0.409052	 -0.616279	 -0.415270
 -0.418779	 -0.619550	 -0.405861
 -0.432991	 -0.635176	 -0.396035
 -0.451762	 -0.646558	 -0.389409
 -0.469152	 -0.652256	 -0.384121
 -0.493463	 -0.647970	 -0.381177
 -0.513288	 -0.641454	 -0.375232
 -0.530337	 -0.641718	 -0.365151
 -0.546365	 -0.648600	 -0.352557
 -0.564595	 -0.654096	 -0.345376
 -0.586543	 -0.657937	 -0.341201
 -0.605505	 -0.664047	 -0.340237
 -0.621314	 -0.672242	 -0.340409
 -0.642553	 -0.678597	 -0.338038
 -0.661447	 -0.679673	 -0.330913
 -0.679993	 -0.681191	 -0.321993
 -0.701312	 -0.684980	 -0.318844
 -0.719354	 -0.689763	 -0.318931
 -0.738265	 -0.692355	 -0.320378
 -0.757442	 -0.694568	 -0.318358
 -0.777696	 -0.693763	 -0.316421
 -0.805068	 -0.700761	 -0.311317
 -0.817082	 -0.704146	 -0.311284
 -0.836199	 -0.716144	 -0.305760
 -0.850904	 -0.723855	 -0.300154
 -0.869614	 -0.731031	 -0.292909
 -0.887400	 -0.736249	 -0.288111
 -0.905078	 -0.741848	 -0.283119
 -0.923247	 -0.750650	 -0.274385
 -0.939731	 -0.757258	 -0.268736
 -0.956575	 -0.763288	 -0.262635
 -0.973350	 -0.770867	 -0.254792
 -0.991050	 -0.777910	 -0.250189
 -1.012441	 -0.783686	 -0.249069
 -1.032867	 -0.790284	 -0.240256
 -1.043807	 -0.797313	 -0.227851
 -1.055632	 -0.806550	 -0.213420
 -1.074006	 -0.814524	 -0.199203
 -1.088448	 -0.819163	 -0.192170
 -1.104910	 -0.825244	 -0.181946
 -1.121782	 -0.830110	 -0.171616
 -1.139783	 -0.834046	 -0.164169
 -1.157031	 -0.840570	 -0.154614
 -1.167876	 -0.847645	 -0.140782
 -1.177301	 -0.857986	 -0.124396
 -1.189770	 -0.867746	 -0.109948
 -1.203998	 -0.873419	 -0.099875
 -1.218560	 -0.879462	 -0.092843
 -1.236712	 -0.888791	 -0.082864
 -1.251170	 -0.899400	 -0.070955
 -1.266084	 -0.908517	 -0.061545
 -1.281986	 -0.915807	 -0.053556
 -1.298904	 -0.922519	 -0.046392
 -1.319336	 -0.926411	 -0.042844
 -1.337647	 -0.935663	 -0.033299
 -1.356816	 -0.939300	 -0.028546
 -1.375837	 -0.942006	 -0.025897
 -1.394508	 -0.946953	 -0.024039
 -1.414341	 -0.952370	 -0.021911
 -1.431239	 -0.959449	 -0.020012
 -1.452379	 -0.962738	 -0.014362
 -1.470561	 -0.964403	 -0.003629
 -1.490251	 -0.962692	  0.004117
 -1.506738	 -0.964946	  0.007009
 -1.525059	 -0.973290	  0.010052
 -1.542923	 -0.982318	  0.015202
 -1.560383	 -0.989308	  0.022712
 -1.579384	 -0.992047	  0.031323
 -1.599648	 -0.994059	  0.036570
 -1.618768	 -0.999920	  0.038431
 -1.634312	 -1.010072	  0.040312
 -1.650898	 -1.021733	  0.043814
 -1.673365	 -1.027877	  0.046266
 -1.693799	 -1.029449	  0.050323
 -1.709901	 -1.031686	  0.056131
 -1.728317	 -1.037330	  0.066070
 -1.746661	 -1.045453	  0.077777
 -1.761547	 -1.054814	  0.083543
 -1.775486	 -1.064486	  0.086375
 -1.795062	 -1.074670	  0.092832
 -1.813296	 -1.080000	  0.101080
 -1.829344	 -1.086862	  0.110119
 -1.844716	 -1.094645	  0.120488
 -1.861438	 -1.101474	  0.131803
 -1.875394	 -1.109555	  0.141703
 -1.890614	 -1.121069	  0.151843
 -1.906669	 -1.126479	  0.159774
 -1.922140	 -1.130562	  0.165769
 -1.943405	 -1.143953	  0.178893
 -1.963014	 -1.148611	  0.189384
 -1.973530	 -1.149176	  0.194379
 -1.995702	 -1.146031	  0.200586
 -2.016936	 -1.152177	  0.209626
 -2.031790	 -1.161851	  0.219327
 -2.043650	 -1.168259	  0.228320
 -2.061767	 -1.176700	  0.238133
 -2.078702	 -1.184269	  0.245997
 -2.095815	 -1.190521	  0.253896
 -2.113608	 -1.198004	  0.261150
 -2.131332	 -1.203570	  0.267837
 -2.152209	 -1.203416	  0.274184
 -2.168805	 -1.211949	  0.281380
