  1.144627	 -1.391640	  1.736799
  1.141030	 -1.394229	  1.733256
  1.133540	 -1.399620	  1.725878
  1.118688	 -1.408349	  1.715716
  1.104182	 -1.418444	  1.705529
  1.090428	 -1.428889	  1.696669
  1.075710	 -1.441856	  1.688758
  1.062910	 -1.456375	  1.678492
  1.051703	 -1.465133	  1.670180
  1.037122	 -1.477391	  1.661753
  1.023096	 -1.488782	  1.651859
  1.009718	 -1.498209	  1.640964
  0.996428	 -1.509955	  1.631044
  0.983608	 -1.522258	  1.621754
  0.971107	 -1.534900	  1.612594
  0.958726	 -1.547676	  1.603594
  0.945802	 -1.560856	  1.595728
  0.932824	 -1.574357	  1.588910
  0.920995	 -1.588032	  1.580365
  0.908750	 -1.602483	  1.573080
  0.894558	 -1.617311	  1.565573
  0.885466	 -1.628588	  1.555547
  0.874373	 -1.643456	  1.547266
  0.863459	 -1.658663	  1.538554
  0.854138	 -1.673167	  1.528641
  0.844358	 -1.688186	  1.519628
  0.834107	 -1.703875	  1.512279
  0.823868	 -1.719463	  1.505057
  0.813906	 -1.735429	  1.498284
  0.804002	 -1.751468	  1.491602
  0.794328	 -1.767670	  1.484976
  0.784914	 -1.784051	  1.478416
  0.775501	 -1.800433	  1.471855
  0.766570	 -1.817040	  1.465190
  0.757721	 -1.833685	  1.458507
  0.748892	 -1.850330	  1.451802
  0.740426	 -1.866993	  1.444684
  0.731959	 -1.883656	  1.437566
  0.723518	 -1.900305	  1.430385
  0.715297	 -1.916818	  1.422656
  0.704274	 -1.938937	  1.412275
  0.698843	 -1.949808	  1.407133
