  1.278290	 -2.726709	 -0.334564
  1.265634	 -2.699712	 -0.331251
  1.296025	 -2.657281	 -0.322191
  1.327010	 -2.615297	 -0.323805
  1.354409	 -2.572566	 -0.319991
  1.380154	 -2.529190	 -0.318346
  1.403330	 -2.484875	 -0.316035
  1.425184	 -2.439942	 -0.312922
  1.446014	 -2.394594	 -0.309380
  1.465784	 -2.348748	 -0.305563
  1.484246	 -2.302327	 -0.301649
  1.501157	 -2.255773	 -0.297831
  1.517172	 -2.209107	 -0.293832
  1.534712	 -2.162323	 -0.289614
  1.555827	 -2.115934	 -0.285969
  1.580193	 -2.070850	 -0.283394
  1.606643	 -2.027187	 -0.282000
  1.634220	 -1.984904	 -0.282315
  1.662653	 -1.943497	 -0.284487
  1.690726	 -1.902142	 -0.288908
  1.717978	 -1.860391	 -0.294950
  1.744113	 -1.818216	 -0.301389
  1.768942	 -1.775104	 -0.306587
  1.792957	 -1.731374	 -0.309934
  1.815983	 -1.687394	 -0.311887
  1.837962	 -1.642898	 -0.313494
  1.859178	 -1.597451	 -0.315548
  1.880243	 -1.552022	 -0.318561
  1.901158	 -1.506952	 -0.322566
  1.922266	 -1.462074	 -0.326931
  1.944487	 -1.417852	 -0.330876
  1.967995	 -1.374141	 -0.334034
  1.992638	 -1.330507	 -0.336880
  2.017660	 -1.287949	 -0.339435
  2.043075	 -1.246017	 -0.341356
  2.069058	 -1.204209	 -0.342352
  2.095578	 -1.161942	 -0.341881
  2.122429	 -1.118210	 -0.339754
  2.147382	 -1.073807	 -0.335971
  2.169373	 -1.029840	 -0.331079
  2.189587	 -0.985352	 -0.326139
  2.208141	 -0.939788	 -0.321673
  2.225441	 -0.892857	 -0.318927
  2.244374	 -0.845966	 -0.316996
  2.264715	 -0.799909	 -0.315458
  2.285366	 -0.754069	 -0.314187
  2.305858	 -0.708210	 -0.312586
  2.326045	 -0.662340	 -0.310324
  2.346167	 -0.616365	 -0.307264
  2.366330	 -0.570577	 -0.303423
  2.386862	 -0.525256	 -0.298895
  2.407950	 -0.480257	 -0.294141
  2.429722	 -0.435263	 -0.289496
  2.451988	 -0.390420	 -0.285203
  2.474422	 -0.346311	 -0.281388
  2.496997	 -0.302438	 -0.278103
  2.519793	 -0.258604	 -0.275442
  2.542994	 -0.214647	 -0.273609
  2.566773	 -0.170265	 -0.273104
  2.590473	 -0.126543	 -0.274604
  2.613638	 -0.083123	 -0.274190
  2.636952	 -0.040093	 -0.268018
  2.659912	  0.003270	 -0.261668
  2.686582	  0.044984	 -0.259172
  2.713170	  0.086751	 -0.256069
  2.737653	  0.130001	 -0.254095
  2.760405	  0.174397	 -0.255693
  2.783259	  0.218295	 -0.256739
  2.806455	  0.261822	 -0.256007
  2.826690	  0.307591	 -0.257416
  2.851494	  0.351356	 -0.266124
  2.879886	  0.393822	 -0.265910
  2.904626	  0.436897	 -0.259465
  2.920759	  0.481852	 -0.263884
  2.942068	  0.522914	 -0.266079
  2.971488	  0.528143	 -0.268740
