 -2.413584	  0.463429	 -0.502155
 -2.405654	  0.459664	 -0.501533
 -2.395565	  0.454874	 -0.500742
 -2.377276	  0.446885	 -0.499452
 -2.358780	  0.439398	 -0.498191
 -2.340246	  0.431964	 -0.497053
 -2.321505	  0.425137	 -0.495401
 -2.302621	  0.418889	 -0.493223
 -2.283753	  0.412629	 -0.490878
 -2.264830	  0.406955	 -0.487839
 -2.245602	  0.402669	 -0.484477
 -2.226282	  0.398505	 -0.481458
 -2.206938	  0.395855	 -0.478232
 -2.187483	  0.397491	 -0.473762
 -2.168273	  0.401872	 -0.470423
 -2.148846	  0.407749	 -0.469511
 -2.127559	  0.408048	 -0.472213
 -2.105378	  0.398383	 -0.472011
 -2.080893	  0.389694	 -0.463243
 -2.067981	  0.387806	 -0.455396
 -2.051601	  0.390844	 -0.445509
 -2.031526	  0.401330	 -0.440880
 -2.011876	  0.406934	 -0.438100
 -1.991272	  0.408852	 -0.433057
 -1.971179	  0.408794	 -0.428210
 -1.954063	  0.405465	 -0.427423
 -1.932940	  0.402016	 -0.427739
 -1.912014	  0.400545	 -0.423877
 -1.892579	  0.399812	 -0.416999
 -1.874615	  0.400522	 -0.411512
 -1.855467	  0.401964	 -0.409628
 -1.834262	  0.398868	 -0.407121
 -1.812980	  0.388205	 -0.396280
 -1.796788	  0.378880	 -0.381960
 -1.784867	  0.375469	 -0.371291
 -1.767771	  0.380849	 -0.363462
 -1.749313	  0.388527	 -0.361207
 -1.727217	  0.393391	 -0.363657
 -1.703303	  0.394933	 -0.366732
 -1.677038	  0.391854	 -0.357501
 -1.656400	  0.382950	 -0.349163
 -1.641196	  0.375889	 -0.347083
 -1.624974	  0.370495	 -0.346302
 -1.604363	  0.364277	 -0.345359
 -1.584073	  0.355816	 -0.345308
 -1.567861	  0.349270	 -0.340950
 -1.553522	  0.339094	 -0.330009
 -1.532756	  0.324683	 -0.316943
 -1.513705	  0.312430	 -0.316310
 -1.498304	  0.298042	 -0.319722
 -1.483831	  0.283488	 -0.318218
 -1.468720	  0.268615	 -0.315342
 -1.456881	  0.257018	 -0.309746
 -1.443449	  0.244901	 -0.299524
 -1.430775	  0.231850	 -0.286389
 -1.419604	  0.224040	 -0.278097
 -1.404153	  0.215128	 -0.269629
 -1.386745	  0.208008	 -0.267420
 -1.369601	  0.200741	 -0.266705
 -1.350797	  0.192801	 -0.265706
 -1.326322	  0.178311	 -0.261574
 -1.314500	  0.169951	 -0.257717
 -1.299086	  0.161553	 -0.252748
 -1.279281	  0.152113	 -0.249378
 -1.259502	  0.145962	 -0.246684
 -1.239124	  0.144360	 -0.243163
 -1.215868	  0.143839	 -0.240019
 -1.201172	  0.142022	 -0.236168
 -1.180493	  0.139110	 -0.227505
 -1.159130	  0.134064	 -0.220153
 -1.147105	  0.130770	 -0.215802
 -1.121022	  0.126726	 -0.210563
 -1.099908	  0.122058	 -0.205593
 -1.087392	  0.118943	 -0.201658
 -1.066996	  0.113484	 -0.193873
 -1.047661	  0.107749	 -0.187337
 -1.029139	  0.099955	 -0.186486
 -1.008937	  0.091469	 -0.185089
 -0.994820	  0.086579	 -0.183551
 -0.976224	  0.079007	 -0.182707
 -0.952791	  0.071562	 -0.181380
 -0.934308	  0.068018	 -0.180048
 -0.912996	  0.065711	 -0.175318
 -0.889144	  0.063275	 -0.162531
 -0.878855	  0.061172	 -0.155910
 -0.862639	  0.055176	 -0.148213
 -0.839709	  0.044296	 -0.145120
 -0.821596	  0.038543	 -0.145462
 -0.800570	  0.034849	 -0.145096
 -0.783896	  0.033301	 -0.145601
 -0.763980	  0.032542	 -0.146847
 -0.740066	  0.029809	 -0.148441
 -0.718819	  0.026562	 -0.147907
 -0.704970	  0.023141	 -0.144777
 -0.681918	  0.016026	 -0.136891
 -0.663374	  0.007697	 -0.129976
 -0.649034	  0.002326	 -0.123458
 -0.627594	 -0.001865	 -0.116022
 -0.602204	 -0.016861	 -0.116301
 -0.591608	 -0.021832	 -0.117432
 -0.572620	 -0.038640	 -0.124013
 -0.561401	 -0.046428	 -0.125929
 -0.543247	 -0.054211	 -0.125813
 -0.520384	 -0.066705	 -0.120661
 -0.502533	 -0.073701	 -0.111793
 -0.484335	 -0.078454	 -0.102481
 -0.459594	 -0.080821	 -0.092363
 -0.444553	 -0.082369	 -0.089450
 -0.428916	 -0.082411	 -0.088334
 -0.405378	 -0.082605	 -0.083882
 -0.386620	 -0.081715	 -0.075081
 -0.366873	 -0.086268	 -0.066639
 -0.350032	 -0.092351	 -0.064342
 -0.329323	 -0.100343	 -0.065660
 -0.311310	 -0.108110	 -0.059402
 -0.296279	 -0.115536	 -0.050844
 -0.282059	 -0.126733	 -0.044265
 -0.268745	 -0.138271	 -0.042877
 -0.245082	 -0.151406	 -0.044932
 -0.216782	 -0.158790	 -0.039873
 -0.204481	 -0.161233	 -0.035142
 -0.188885	 -0.163129	 -0.030031
 -0.168935	 -0.165290	 -0.023903
 -0.150148	 -0.167311	 -0.020887
 -0.125895	 -0.168386	 -0.017147
 -0.105288	 -0.171289	 -0.010577
 -0.092270	 -0.173296	 -0.005669
 -0.071476	 -0.176150	  0.002167
 -0.049972	 -0.181950	  0.009460
 -0.035348	 -0.190162	  0.011244
 -0.020665	 -0.205288	  0.005662
  0.003163	 -0.223266	 -0.002195
  0.017338	 -0.230134	 -0.003339
  0.031292	 -0.234487	 -0.000745
  0.062362	 -0.241731	  0.006758
  0.086681	 -0.245655	  0.009137
  0.097760	 -0.246836	  0.009969
  0.111093	 -0.246395	  0.010644
  0.136341	 -0.254982	  0.018024
  0.151962	 -0.262500	  0.019788
  0.172758	 -0.268866	  0.022791
  0.199031	 -0.270250	  0.032970
  0.212211	 -0.270690	  0.038485
  0.233042	 -0.269931	  0.047162
  0.252248	 -0.272897	  0.052980
  0.267082	 -0.277661	  0.056842
  0.289922	 -0.288415	  0.062247
  0.310751	 -0.294635	  0.068172
  0.322590	 -0.296995	  0.071281
  0.344189	 -0.295112	  0.071829
  0.366337	 -0.296923	  0.072741
  0.384968	 -0.304470	  0.074971
  0.403153	 -0.312599	  0.076650
  0.420199	 -0.323114	  0.077510
  0.437320	 -0.333639	  0.078363
  0.454535	 -0.343852	  0.080306
  0.471361	 -0.354014	  0.083753
  0.488122	 -0.364196	  0.087185
  0.505735	 -0.373361	  0.090267
  0.523498	 -0.382023	  0.093712
  0.540985	 -0.390817	  0.097852
  0.558586	 -0.399067	  0.102641
  0.576348	 -0.406742	  0.107735
  0.594294	 -0.414276	  0.112396
  0.612306	 -0.421258	  0.117586
  0.630424	 -0.427526	  0.123284
  0.648574	 -0.433783	  0.128899
  0.666749	 -0.439526	  0.134971
  0.684835	 -0.444466	  0.141901
  0.702716	 -0.449946	  0.149022
  0.720496	 -0.455579	  0.156510
  0.738296	 -0.459779	  0.164919
  0.755534	 -0.462043	  0.173522
  0.771140	 -0.461728	  0.187923
  0.786561	 -0.462916	  0.202920
  0.801355	 -0.470856	  0.207735
  0.824984	 -0.481554	  0.202300
  0.850270	 -0.489213	  0.200914
  0.866042	 -0.492319	  0.208747
  0.881924	 -0.493740	  0.219707
  0.911125	 -0.497778	  0.229859
  0.926228	 -0.500184	  0.231968
  0.942397	 -0.499382	  0.233901
  0.962002	 -0.493929	  0.235435
  0.981848	 -0.488028	  0.237046
  1.008446	 -0.488911	  0.237610
  1.030373	 -0.492161	  0.239572
  1.046201	 -0.497185	  0.242677
  1.059972	 -0.502772	  0.248584
  1.080049	 -0.510819	  0.256112
  1.097989	 -0.517837	  0.260128
  1.115445	 -0.526163	  0.264711
  1.131642	 -0.537038	  0.274616
  1.147471	 -0.547695	  0.282464
  1.166043	 -0.557728	  0.284690
  1.185022	 -0.560491	  0.282076
  1.206814	 -0.562798	  0.281887
  1.227131	 -0.567564	  0.283058
  1.246489	 -0.572645	  0.284447
  1.266285	 -0.575198	  0.283518
  1.285761	 -0.573998	  0.279238
  1.304006	 -0.572206	  0.271337
  1.318022	 -0.569607	  0.257354
  1.331919	 -0.567119	  0.243217
  1.344713	 -0.570395	  0.228227
  1.356732	 -0.575983	  0.213255
  1.368723	 -0.581627	  0.198282
  1.380522	 -0.587812	  0.183758
  1.392497	 -0.596678	  0.171251
  1.407127	 -0.607674	  0.163428
  1.422169	 -0.617913	  0.158668
  1.436829	 -0.629533	  0.154952
  1.448524	 -0.643037	  0.155128
  1.460431	 -0.654341	  0.156584
  1.476108	 -0.664471	  0.155953
  1.494607	 -0.671346	  0.154934
  1.512350	 -0.676951	  0.154479
  1.528939	 -0.683155	  0.153786
  1.544951	 -0.694859	  0.153995
  1.560155	 -0.708319	  0.155691
  1.575972	 -0.721149	  0.161498
  1.592860	 -0.731917	  0.167232
  1.610681	 -0.743855	  0.169234
  1.626058	 -0.756426	  0.164732
  1.636185	 -0.770350	  0.157968
  1.643530	 -0.785715	  0.153985
  1.652517	 -0.806881	  0.154241
  1.664201	 -0.824806	  0.158283
  1.676294	 -0.835275	  0.160662
  1.685828	 -0.843580	  0.162527
  1.699979	 -0.851052	  0.165796
  1.717456	 -0.858384	  0.174754
  1.732438	 -0.863243	  0.181832
  1.748204	 -0.868507	  0.185406
  1.760578	 -0.871519	  0.197342
  1.767585	 -0.880040	  0.213981
  1.761787	 -0.894699	  0.238474
  1.748094	 -0.895157	  0.263948
  1.739252	 -0.893035	  0.276829
  1.736294	 -0.887451	  0.297847
  1.745353	 -0.880477	  0.315475
  1.748492	 -0.876354	  0.336873
  1.750046	 -0.869372	  0.357288
  1.753293	 -0.860923	  0.376043
  1.757866	 -0.851667	  0.393623
  1.763787	 -0.840326	  0.409109
  1.769148	 -0.828130	  0.423782
  1.774018	 -0.816206	  0.439365
  1.778391	 -0.805336	  0.455693
  1.782500	 -0.795332	  0.472526
  1.791219	 -0.787721	  0.488806
  1.805221	 -0.784115	  0.502574
  1.819100	 -0.780125	  0.515707
  1.828193	 -0.772190	  0.530015
  1.838570	 -0.773348	  0.548386
  1.859014	 -0.789066	  0.561932
  1.878721	 -0.795635	  0.570464
  1.893016	 -0.797082	  0.575584
  1.910928	 -0.801232	  0.581532
  1.930914	 -0.807634	  0.588450
  1.947582	 -0.810666	  0.594497
  1.964877	 -0.817858	  0.601746
  1.983156	 -0.825853	  0.608075
  2.005221	 -0.832157	  0.614383
  2.025149	 -0.837225	  0.620860
  2.039391	 -0.840833	  0.624967
  2.050141	 -0.845087	  0.629127
  2.065852	 -0.857812	  0.641998
  2.082836	 -0.867059	  0.655593
  2.100781	 -0.871619	  0.668404
  2.120958	 -0.874194	  0.676484
  2.141969	 -0.879705	  0.678775
  2.160820	 -0.887773	  0.676523
  2.179488	 -0.895296	  0.676564
  2.198863	 -0.899516	  0.680682
  2.226647	 -0.904916	  0.687874
  2.237013	 -0.907131	  0.690609
