 -0.490611	  2.456208	 -0.130024
 -0.488568	  2.448773	 -0.121712
 -0.487007	  2.443092	 -0.115362
 -0.483402	  2.429974	 -0.100702
 -0.479716	  2.416204	 -0.086674
 -0.476180	  2.402136	 -0.073102
 -0.474609	  2.387548	 -0.059763
 -0.473414	  2.371558	 -0.046568
 -0.468949	  2.356934	 -0.034135
 -0.463351	  2.342882	 -0.022876
 -0.457398	  2.324887	 -0.008132
 -0.452379	  2.312187	  0.001970
 -0.448534	  2.295793	  0.013040
 -0.445397	  2.279248	  0.024424
 -0.439556	  2.263891	  0.034204
 -0.432841	  2.246101	  0.045390
 -0.431710	  2.230338	  0.056054
 -0.430892	  2.210933	  0.064031
 -0.426052	  2.190640	  0.071426
 -0.419633	  2.178507	  0.080227
 -0.414718	  2.159376	  0.087512
 -0.409168	  2.139638	  0.095975
 -0.406507	  2.125010	  0.104139
 -0.406852	  2.105512	  0.111363
 -0.400484	  2.085623	  0.119674
 -0.390623	  2.068066	  0.124081
 -0.381974	  2.052195	  0.134974
 -0.379719	  2.037539	  0.144522
 -0.375243	  2.017880	  0.150652
 -0.369982	  1.999744	  0.161371
 -0.367940	  1.984468	  0.172208
 -0.364854	  1.963819	  0.177019
 -0.357033	  1.941985	  0.176605
 -0.354396	  1.924551	  0.185106
 -0.353430	  1.908260	  0.196798
 -0.354482	  1.893170	  0.206929
 -0.353721	  1.870746	  0.215904
 -0.351075	  1.851762	  0.227163
 -0.350788	  1.838196	  0.240234
 -0.351822	  1.822631	  0.247664
 -0.353174	  1.803296	  0.255056
 -0.354480	  1.784856	  0.264104
 -0.354234	  1.766091	  0.274456
 -0.355137	  1.748641	  0.283018
 -0.352029	  1.730162	  0.290494
 -0.351932	  1.713533	  0.301623
 -0.356828	  1.696897	  0.312490
 -0.359663	  1.681615	  0.326511
 -0.350989	  1.666149	  0.339344
 -0.346095	  1.645707	  0.341906
 -0.348432	  1.623364	  0.342742
 -0.350581	  1.609877	  0.359346
 -0.353592	  1.592525	  0.371500
 -0.356254	  1.573521	  0.378220
 -0.354837	  1.554641	  0.380207
 -0.356540	  1.533368	  0.386881
 -0.361821	  1.515587	  0.391248
 -0.358988	  1.496661	  0.403167
 -0.358824	  1.476129	  0.406238
 -0.349200	  1.460693	  0.404766
 -0.345739	  1.447342	  0.401566
 -0.332120	  1.433857	  0.404600
 -0.313763	  1.428513	  0.419331
 -0.310324	  1.409158	  0.421544
 -0.298552	  1.395662	  0.433958
 -0.284717	  1.381727	  0.445375
 -0.270501	  1.371279	  0.454559
 -0.254518	  1.366577	  0.459768
 -0.238079	  1.363740	  0.474396
 -0.223130	  1.355677	  0.485502
 -0.207693	  1.352551	  0.495715
 -0.190654	  1.352706	  0.506411
 -0.175233	  1.353472	  0.520296
 -0.163320	  1.352686	  0.535517
 -0.149640	  1.350603	  0.549885
 -0.134073	  1.349427	  0.562914
 -0.117015	  1.346154	  0.574137
 -0.100814	  1.342849	  0.586040
 -0.086882	  1.340765	  0.600130
 -0.076014	  1.339120	  0.616860
 -0.064087	  1.337574	  0.633828
 -0.050954	  1.335568	  0.648219
 -0.036849	  1.337051	  0.661108
 -0.020882	  1.336718	  0.675403
 -0.004611	  1.328201	  0.690785
  0.007087	  1.324875	  0.704479
  0.016988	  1.322248	  0.719908
  0.029101	  1.317037	  0.736732
  0.043109	  1.310778	  0.749607
  0.057142	  1.305968	  0.762795
  0.067977	  1.299519	  0.780264
  0.076825	  1.292029	  0.795583
  0.089666	  1.285457	  0.810728
  0.102018	  1.279789	  0.825391
  0.112602	  1.274342	  0.839514
  0.125997	  1.263871	  0.853549
  0.136787	  1.251306	  0.867329
  0.143853	  1.245388	  0.883437
  0.152920	  1.238614	  0.901086
  0.158829	  1.233001	  0.919087
  0.165386	  1.224361	  0.936227
  0.172103	  1.216104	  0.953788
  0.179471	  1.206530	  0.969673
  0.187797	  1.198990	  0.986571
  0.194412	  1.192132	  1.003878
  0.200119	  1.184423	  1.021460
  0.206090	  1.177388	  1.038952
  0.209700	  1.170317	  1.058869
  0.212316	  1.160436	  1.076407
  0.210638	  1.151939	  1.095352
  0.208026	  1.148162	  1.114152
  0.205874	  1.144327	  1.134651
  0.204188	  1.136773	  1.153387
  0.205884	  1.128557	  1.171108
  0.208650	  1.120535	  1.190195
  0.207755	  1.111180	  1.208692
  0.201273	  1.106843	  1.226502
  0.195428	  1.102517	  1.245965
  0.189847	  1.095591	  1.264617
  0.188953	  1.087424	  1.282631
  0.190039	  1.080343	  1.301671
  0.187156	  1.071577	  1.320617
  0.181233	  1.063509	  1.337590
  0.176045	  1.057856	  1.355341
  0.171719	  1.052475	  1.374363
  0.166788	  1.045559	  1.392622
  0.160599	  1.039045	  1.410327
  0.155144	  1.031897	  1.427707
  0.154983	  1.022041	  1.447829
  0.155842	  1.013641	  1.465656
  0.152489	  1.005651	  1.483807
  0.146250	  0.997956	  1.500993
  0.141486	  0.992364	  1.518361
  0.134365	  0.989070	  1.539378
  0.131860	  0.980037	  1.557925
  0.133557	  0.971961	  1.573864
  0.129784	  0.968151	  1.596437
  0.124144	  0.965466	  1.616215
  0.119942	  0.964373	  1.631949
  0.122871	  0.961154	  1.655960
  0.125219	  0.950671	  1.673151
  0.122329	  0.939234	  1.690501
  0.121346	  0.932395	  1.707600
  0.122886	  0.928853	  1.729719
  0.121098	  0.927520	  1.748324
  0.119214	  0.923421	  1.767653
  0.118594	  0.919528	  1.787710
  0.119589	  0.916469	  1.807556
  0.119614	  0.913282	  1.827177
  0.121031	  0.909323	  1.846815
  0.123220	  0.904683	  1.866123
  0.125544	  0.900171	  1.885456
  0.127850	  0.895604	  1.904779
  0.131683	  0.891076	  1.923218
  0.136458	  0.885107	  1.942487
  0.141138	  0.877752	  1.960957
  0.142778	  0.868778	  1.980481
  0.144131	  0.867122	  1.998524
  0.149221	  0.864655	  2.017975
  0.152426	  0.861079	  2.038804
  0.154278	  0.852960	  2.057271
  0.160913	  0.848007	  2.073909
  0.166151	  0.845485	  2.094034
  0.169666	  0.838522	  2.113821
  0.176868	  0.831353	  2.130216
  0.184240	  0.826632	  2.147875
  0.190284	  0.822510	  2.167713
  0.196777	  0.815156	  2.184784
  0.205540	  0.808130	  2.200977
  0.214047	  0.803931	  2.218981
  0.221599	  0.798909	  2.237266
  0.230094	  0.789482	  2.252643
  0.239510	  0.779180	  2.268522
  0.247780	  0.773068	  2.285063
  0.256954	  0.769816	  2.301950
  0.267604	  0.765847	  2.318990
  0.278910	  0.760222	  2.334817
  0.289427	  0.753475	  2.350528
  0.300436	  0.746256	  2.367032
  0.310696	  0.739541	  2.381440
