 -0.007939	 -2.223827	 -1.151583
 -0.010840	 -2.242149	 -1.172961
 -0.008794	 -2.229203	 -1.157859
 -0.006273	 -2.215899	 -1.143240
 -0.004744	 -2.201524	 -1.129548
 -0.007367	 -2.188415	 -1.114491
 -0.012180	 -2.176611	 -1.099146
 -0.011482	 -2.162835	 -1.083346
 -0.003412	 -2.146314	 -1.073693
  0.010478	 -2.126605	 -1.056445
  0.012657	 -2.117553	 -1.040302
  0.005883	 -2.107976	 -1.018641
  0.000719	 -2.102142	 -1.001873
  0.001213	 -2.093995	 -0.987044
  0.006231	 -2.078090	 -0.969157
  0.005471	 -2.067783	 -0.950113
  0.003676	 -2.060606	 -0.929998
  0.001934	 -2.057348	 -0.916343
  0.002066	 -2.045223	 -0.899058
  0.005130	 -2.031593	 -0.874663
  0.008788	 -2.026935	 -0.854487
  0.011473	 -2.026220	 -0.835841
  0.009287	 -2.019951	 -0.820369
  0.000563	 -2.010036	 -0.800931
 -0.002499	 -2.008429	 -0.781003
 -0.001563	 -2.009879	 -0.757186
 -0.003795	 -2.006129	 -0.735317
 -0.010207	 -1.992037	 -0.721663
 -0.013819	 -1.976930	 -0.707600
 -0.015060	 -1.962460	 -0.692692
 -0.015744	 -1.950023	 -0.677138
 -0.013553	 -1.935983	 -0.663553
 -0.010602	 -1.920118	 -0.649795
 -0.009694	 -1.905226	 -0.637979
 -0.016894	 -1.890292	 -0.619142
 -0.024682	 -1.882125	 -0.597599
 -0.024776	 -1.878627	 -0.581329
 -0.019321	 -1.868778	 -0.563504
 -0.011531	 -1.856584	 -0.548997
 -0.006092	 -1.845516	 -0.530580
 -0.007100	 -1.834403	 -0.513199
 -0.012803	 -1.819863	 -0.499945
 -0.018050	 -1.803921	 -0.487113
 -0.021097	 -1.790884	 -0.471813
 -0.019935	 -1.781254	 -0.457448
 -0.016448	 -1.769828	 -0.440675
 -0.016193	 -1.755349	 -0.413617
 -0.018236	 -1.747417	 -0.401232
 -0.022878	 -1.738324	 -0.387841
 -0.029680	 -1.725378	 -0.372082
 -0.034530	 -1.711960	 -0.359008
 -0.035264	 -1.696566	 -0.344328
 -0.035011	 -1.680764	 -0.330138
 -0.034555	 -1.667264	 -0.312729
 -0.037249	 -1.659342	 -0.297588
 -0.043695	 -1.650783	 -0.282703
 -0.053695	 -1.638317	 -0.264007
 -0.055128	 -1.630560	 -0.247285
 -0.050065	 -1.623540	 -0.229293
 -0.047843	 -1.614259	 -0.206194
 -0.052395	 -1.605769	 -0.190617
 -0.058428	 -1.596809	 -0.177684
 -0.065990	 -1.586950	 -0.157724
 -0.070155	 -1.574878	 -0.133259
 -0.070006	 -1.566436	 -0.121140
 -0.067681	 -1.556526	 -0.107570
 -0.066468	 -1.545002	 -0.087891
 -0.061968	 -1.534827	 -0.072004
 -0.056528	 -1.522581	 -0.053385
 -0.058278	 -1.515121	 -0.035970
 -0.065569	 -1.510979	 -0.019109
 -0.071968	 -1.501599	  0.005987
 -0.071082	 -1.493517	  0.020441
 -0.068165	 -1.483531	  0.035764
 -0.068072	 -1.471763	  0.056633
 -0.066403	 -1.463030	  0.072649
 -0.058992	 -1.454753	  0.086715
 -0.046507	 -1.443392	  0.104275
 -0.043861	 -1.426070	  0.124999
 -0.048010	 -1.414883	  0.138395
 -0.051304	 -1.407478	  0.153502
 -0.052059	 -1.398497	  0.173068
 -0.058469	 -1.387057	  0.188360
 -0.064175	 -1.366536	  0.203824
 -0.063239	 -1.351881	  0.218121
 -0.061232	 -1.342391	  0.229596
 -0.061601	 -1.329005	  0.246707
 -0.061925	 -1.316882	  0.265024
 -0.061696	 -1.310889	  0.283524
 -0.061434	 -1.301045	  0.300435
 -0.060564	 -1.284069	  0.317944
 -0.059709	 -1.276517	  0.331939
 -0.059390	 -1.273385	  0.352927
 -0.059743	 -1.268243	  0.373132
 -0.059042	 -1.258937	  0.391693
 -0.058294	 -1.244693	  0.405734
 -0.057568	 -1.229760	  0.419018
 -0.056845	 -1.214823	  0.432300
 -0.056035	 -1.200255	  0.445978
 -0.055130	 -1.186118	  0.460096
 -0.054227	 -1.171979	  0.474212
 -0.053233	 -1.157841	  0.488318
 -0.052087	 -1.143860	  0.502552
 -0.050810	 -1.130126	  0.517038
 -0.049641	 -1.117602	  0.531895
 -0.048376	 -1.110411	  0.550070
 -0.046117	 -1.106239	  0.569732
 -0.042822	 -1.098443	  0.590226
 -0.037337	 -1.089232	  0.607413
 -0.031452	 -1.071589	  0.624229
 -0.030864	 -1.054584	  0.636977
 -0.036866	 -1.038916	  0.649689
 -0.042247	 -1.022973	  0.662010
 -0.046317	 -1.006324	  0.674939
 -0.052006	 -0.993984	  0.688526
 -0.061671	 -0.985476	  0.702581
 -0.076402	 -0.975394	  0.715557
 -0.090598	 -0.952272	  0.732946
 -0.087100	 -0.940369	  0.746911
 -0.081181	 -0.930953	  0.760931
 -0.072210	 -0.922772	  0.783179
 -0.074425	 -0.912147	  0.801103
 -0.079611	 -0.898832	  0.814226
 -0.082244	 -0.883265	  0.830240
 -0.079971	 -0.871753	  0.844658
 -0.073054	 -0.861344	  0.863590
 -0.070891	 -0.849549	  0.881329
 -0.072071	 -0.839852	  0.894040
 -0.076797	 -0.825148	  0.911388
 -0.077419	 -0.814404	  0.926507
 -0.074822	 -0.805705	  0.943969
 -0.073353	 -0.792249	  0.963359
 -0.073127	 -0.781600	  0.974265
 -0.076086	 -0.765040	  0.989302
 -0.075098	 -0.749697	  1.009435
 -0.072788	 -0.744016	  1.022696
 -0.071256	 -0.737803	  1.042631
 -0.073813	 -0.729235	  1.062540
 -0.078811	 -0.721889	  1.080478
 -0.083268	 -0.716050	  1.099210
 -0.088589	 -0.710471	  1.117762
 -0.096894	 -0.702645	  1.136295
 -0.103973	 -0.692219	  1.152305
 -0.106886	 -0.678906	  1.167872
 -0.105972	 -0.666873	  1.183709
 -0.103382	 -0.656733	  1.201585
 -0.101060	 -0.645994	  1.218838
 -0.103389	 -0.629860	  1.235195
 -0.112572	 -0.617179	  1.248512
 -0.121702	 -0.609678	  1.264906
 -0.128367	 -0.606144	  1.283430
 -0.136652	 -0.599516	  1.302561
 -0.144344	 -0.588598	  1.319145
 -0.146729	 -0.575550	  1.334250
 -0.143695	 -0.562472	  1.349779
 -0.141414	 -0.547674	  1.365665
 -0.145238	 -0.531453	  1.377396
 -0.155203	 -0.513601	  1.388170
 -0.161980	 -0.499126	  1.402906
 -0.162316	 -0.490557	  1.420772
 -0.163868	 -0.485733	  1.439434
 -0.165322	 -0.477095	  1.460818
 -0.165876	 -0.467000	  1.477923
 -0.166835	 -0.460545	  1.492801
 -0.163258	 -0.446401	  1.521610
 -0.161346	 -0.440899	  1.532821
 -0.158637	 -0.434889	  1.551886
 -0.156418	 -0.429740	  1.570250
 -0.152390	 -0.419974	  1.587554
 -0.147579	 -0.405378	  1.606050
 -0.147049	 -0.396318	  1.621393
 -0.146949	 -0.387430	  1.636067
 -0.141710	 -0.371825	  1.654863
 -0.140449	 -0.362327	  1.670241
 -0.140427	 -0.352868	  1.680788
 -0.134956	 -0.333063	  1.691403
 -0.128204	 -0.314261	  1.707258
 -0.127243	 -0.304813	  1.724060
 -0.128678	 -0.297304	  1.735999
 -0.126267	 -0.283459	  1.752610
 -0.115346	 -0.267168	  1.769128
 -0.107636	 -0.247287	  1.782967
 -0.107678	 -0.235963	  1.789748
 -0.110207	 -0.221780	  1.803420
 -0.115515	 -0.217704	  1.823850
 -0.116404	 -0.215390	  1.844683
 -0.114552	 -0.208957	  1.865393
 -0.113519	 -0.200689	  1.884404
 -0.113920	 -0.192307	  1.903013
 -0.120121	 -0.183342	  1.920675
 -0.130543	 -0.172606	  1.936404
 -0.142264	 -0.161422	  1.950529
 -0.152152	 -0.148711	  1.964419
 -0.158319	 -0.134303	  1.977869
 -0.159975	 -0.117863	  1.991454
 -0.162079	 -0.105929	  2.005206
 -0.169251	 -0.096301	  2.021282
 -0.178870	 -0.087207	  2.037548
 -0.187465	 -0.074198	  2.051442
 -0.188361	 -0.053769	  2.065060
 -0.182746	 -0.038869	  2.078564
 -0.176372	 -0.028354	  2.096942
 -0.172220	 -0.020526	  2.115841
 -0.170721	 -0.008795	  2.134165
 -0.171686	  0.007710	  2.147676
 -0.177481	  0.024271	  2.156379
 -0.183562	  0.039241	  2.169109
 -0.189703	  0.050972	  2.184610
 -0.193815	  0.061390	  2.201610
 -0.193936	  0.071221	  2.219223
 -0.193188	  0.080840	  2.236807
 -0.192833	  0.088698	  2.255196
 -0.193180	  0.096473	  2.273619
 -0.194465	  0.104119	  2.292055
 -0.195750	  0.111767	  2.310490
 -0.197747	  0.121129	  2.328051
 -0.199771	  0.130556	  2.345573
 -0.201794	  0.139984	  2.363094
 -0.203687	  0.151378	  2.379423
 -0.205556	  0.163086	  2.395529
 -0.207424	  0.174794	  2.411636
 -0.209061	  0.187330	  2.427134
 -0.210567	  0.200308	  2.442277
 -0.212074	  0.213285	  2.457420
 -0.212799	  0.226779	  2.472164
 -0.212834	  0.240700	  2.486524
 -0.212869	  0.254621	  2.500884
 -0.212904	  0.268580	  2.515283
 -0.212868	  0.284643	  2.531831
 -0.211829	  0.317773	  2.565706
 -0.211205	  0.331775	  2.579973
