 -1.681609	  0.035541	  2.520283
 -1.664959	  0.035189	  2.495330
 -1.649478	  0.058092	  2.452957
 -1.631839	  0.082586	  2.416363
 -1.622454	  0.098562	  2.368468
 -1.615434	  0.114261	  2.323589
 -1.595222	  0.134617	  2.281061
 -1.583284	  0.154740	  2.236251
 -1.573367	  0.171803	  2.189051
 -1.564426	  0.192214	  2.145557
 -1.549324	  0.214472	  2.102659
 -1.538868	  0.236764	  2.057353
 -1.529348	  0.256703	  2.011476
 -1.516830	  0.273341	  1.970502
 -1.504757	  0.289650	  1.925406
 -1.495623	  0.306893	  1.879193
 -1.482783	  0.327005	  1.834510
 -1.467288	  0.343567	  1.789357
 -1.458836	  0.366928	  1.745068
 -1.447958	  0.382030	  1.703222
 -1.436335	  0.404484	  1.657707
 -1.425955	  0.419596	  1.618387
 -1.411209	  0.441520	  1.568319
 -1.399522	  0.462752	  1.527452
 -1.388803	  0.485403	  1.483410
 -1.376147	  0.508066	  1.438546
 -1.366146	  0.527892	  1.398796
 -1.353894	  0.548254	  1.354976
 -1.342701	  0.569755	  1.311147
 -1.333539	  0.586663	  1.268680
 -1.322480	  0.605214	  1.223367
 -1.311956	  0.622786	  1.178220
 -1.298977	  0.639167	  1.132722
 -1.286247	  0.657351	  1.086969
 -1.272069	  0.676926	  1.039669
 -1.259376	  0.697171	  0.995473
 -1.248832	  0.715162	  0.959400
 -1.235569	  0.737086	  0.914752
 -1.220486	  0.757926	  0.867132
 -1.208817	  0.773964	  0.826560
 -1.197417	  0.794054	  0.780928
 -1.188553	  0.813226	  0.736380
 -1.177523	  0.833372	  0.689186
 -1.169006	  0.851241	  0.645252
 -1.159273	  0.868116	  0.602383
 -1.148328	  0.886496	  0.558157
 -1.136548	  0.904314	  0.513920
 -1.122438	  0.923598	  0.463998
 -1.111064	  0.938559	  0.424670
 -1.097760	  0.957100	  0.376896
 -1.086572	  0.975762	  0.332354
 -1.075372	  0.995281	  0.288986
 -1.063985	  1.016711	  0.244655
 -1.050485	  1.035098	  0.202892
 -1.034097	  1.041238	  0.161873
 -1.002227	  1.019032	  0.109571
 -0.890991	  0.846751	 -0.017065
 -0.850194	  0.836209	 -0.052078
 -0.848266	  0.844351	 -0.054812
 -0.857952	  0.949077	  0.022625
 -0.636590	  1.108824	  0.001894
 -0.746854	  1.197058	  0.026638
 -0.711477	  1.259747	 -0.062192
 -0.724683	  1.375305	 -0.193232
 -0.733737	  1.400015	 -0.224259
 -0.737574	  1.432801	 -0.254854
 -0.750407	  1.505962	 -0.322929
 -0.770641	  1.575700	 -0.362351
 -0.748752	  1.665755	 -0.446795
 -0.799979	  1.684086	 -0.396131
 -0.847957	  1.466506	 -0.489374
 -0.833678	  1.400648	 -0.587597
 -0.818120	  1.410513	 -0.632408
 -0.805215	  1.426864	 -0.677683
 -0.793454	  1.446694	 -0.722177
 -0.767196	  1.491773	 -0.747323
 -0.633289	  1.726617	 -0.673264
 -0.575806	  1.814613	 -0.668558
 -0.536534	  1.884394	 -0.696825
 -0.546876	  1.883220	 -0.748826
 -0.547287	  1.906055	 -0.799254
 -0.548697	  1.840325	 -0.885668
 -0.672211	  1.659199	 -1.038790
 -0.690970	  1.620320	 -1.121227
 -0.682423	  1.636044	 -1.161401
 -0.666707	  1.655290	 -1.209272
 -0.656930	  1.681946	 -1.248586
 -0.644855	  1.700591	 -1.295951
 -0.638571	  1.715885	 -1.340855
 -0.628287	  1.735831	 -1.381778
 -0.614594	  1.754635	 -1.431543
 -0.602634	  1.773364	 -1.469374
 -0.586052	  1.799059	 -1.518649
 -0.573706	  1.817123	 -1.558684
 -0.563560	  1.833839	 -1.601407
 -0.550035	  1.854972	 -1.647724
 -0.539560	  1.873378	 -1.690310
 -0.527360	  1.891677	 -1.735427
 -0.515266	  1.909397	 -1.780362
 -0.506189	  1.932073	 -1.828365
 -0.496079	  1.951279	 -1.870644
 -0.479457	  1.968939	 -1.917781
 -0.472217	  1.983490	 -1.956574
 -0.462150	  2.002170	 -2.000982
 -0.447332	  2.026279	 -2.049351
 -0.435190	  2.041829	 -2.093454
 -0.426983	  2.058510	 -2.140145
 -0.431253	  2.079095	 -2.161547
