  2.366129	 -0.139256	 -0.713130
  2.387198	 -0.141209	 -0.726853
  2.370503	 -0.139654	 -0.715952
  2.354226	 -0.137936	 -0.704457
  2.338098	 -0.136165	 -0.692765
  2.321967	 -0.134351	 -0.681084
  2.305651	 -0.131227	 -0.669950
  2.289316	 -0.127934	 -0.658890
  2.272968	 -0.124601	 -0.647863
  2.256254	 -0.119857	 -0.637964
  2.239423	 -0.114517	 -0.628574
  2.222585	 -0.109145	 -0.619214
  2.205709	 -0.102925	 -0.610472
  2.188834	 -0.095936	 -0.602324
  2.171961	 -0.088907	 -0.594207
  2.155171	 -0.081188	 -0.586561
  2.138525	 -0.072623	 -0.579526
  2.121874	 -0.064036	 -0.572525
  2.105308	 -0.054947	 -0.565967
  2.088874	 -0.045331	 -0.559846
  2.072407	 -0.035770	 -0.553748
  2.055700	 -0.026298	 -0.548145
  2.038987	 -0.016793	 -0.542652
  2.021969	 -0.008125	 -0.536987
  2.004193	 -0.000185	 -0.531348
  1.987669	  0.010164	 -0.526149
  1.972884	  0.022140	 -0.520413
  1.957687	  0.033888	 -0.514212
  1.942339	  0.045186	 -0.508093
  1.927213	  0.056703	 -0.501922
  1.915465	  0.071732	 -0.495854
  1.904171	  0.087105	 -0.489823
  1.892972	  0.102538	 -0.483790
  1.881888	  0.118051	 -0.477761
  1.872737	  0.134880	 -0.472125
  1.870986	  0.154421	 -0.468391
  1.869540	  0.174030	 -0.464729
  1.868237	  0.193646	 -0.461075
  1.866921	  0.213260	 -0.457400
  1.865519	  0.232870	 -0.453728
  1.864339	  0.252459	 -0.450124
  1.870733	  0.271297	 -0.448691
  1.879689	  0.289163	 -0.448115
  1.888719	  0.307000	 -0.447562
  1.897739	  0.324837	 -0.446975
  1.906760	  0.342659	 -0.446180
  1.915897	  0.360445	 -0.445221
  1.925068	  0.378238	 -0.444381
  1.934365	  0.395915	 -0.444434
  1.947726	  0.410241	 -0.448123
  1.962147	  0.423268	 -0.450693
  1.978951	  0.436210	 -0.452003
  1.994296	  0.449583	 -0.454533
  2.004590	  0.464897	 -0.460828
  2.016079	  0.480581	 -0.466561
  2.028191	  0.494924	 -0.473310
  2.026483	  0.499808	 -0.492253
  2.024262	  0.504366	 -0.511595
  2.022056	  0.508965	 -0.530933
  2.019466	  0.513346	 -0.550112
  2.005159	  0.512396	 -0.563836
  1.990118	  0.511030	 -0.576947
  1.975057	  0.509447	 -0.589981
  1.958840	  0.504216	 -0.600391
  1.942394	  0.496094	 -0.608316
  1.925853	  0.488083	 -0.616297
  1.908296	  0.481151	 -0.622875
  1.888632	  0.477234	 -0.623986
  1.868941	  0.473470	 -0.624903
  1.849571	  0.469254	 -0.625327
  1.831012	  0.466358	 -0.619829
  1.816052	  0.465303	 -0.607666
  1.799363	  0.462882	 -0.596597
  1.781618	  0.457461	 -0.585862
  1.765284	  0.450066	 -0.573249
  1.750183	  0.444386	 -0.560250
  1.737757	  0.442223	 -0.540461
  1.724664	  0.440084	 -0.523896
  1.717110	  0.442985	 -0.505791
  1.707574	  0.443124	 -0.486844
  1.699742	  0.447895	 -0.466796
  1.692284	  0.456561	 -0.447940
  1.682335	  0.465848	 -0.435067
  1.668132	  0.467700	 -0.420080
  1.647150	  0.470055	 -0.411595
  1.626766	  0.473023	 -0.406263
  1.608454	  0.474634	 -0.397575
  1.596273	  0.476396	 -0.385739
  1.577428	  0.475684	 -0.373412
  1.558772	  0.466194	 -0.359295
  1.551074	  0.459020	 -0.348958
  1.542892	  0.457696	 -0.338749
  1.530304	  0.452950	 -0.320890
  1.513286	  0.450661	 -0.313499
  1.495055	  0.446956	 -0.300718
  1.479415	  0.447945	 -0.286220
  1.465473	  0.448842	 -0.271816
  1.444922	  0.447310	 -0.258680
  1.424847	  0.447373	 -0.252311
  1.404797	  0.454020	 -0.242785
  1.395785	  0.461354	 -0.233890
  1.377519	  0.468128	 -0.222054
  1.358689	  0.471261	 -0.211791
  1.344933	  0.472880	 -0.208671
  1.320364	  0.472440	 -0.210803
  1.294885	  0.473616	 -0.209727
  1.281121	  0.477649	 -0.201476
  1.267133	  0.481055	 -0.191503
  1.245359	  0.482571	 -0.187657
  1.226359	  0.483685	 -0.186498
  1.210259	  0.483167	 -0.183905
  1.188647	  0.479661	 -0.186605
  1.168435	  0.479184	 -0.187846
  1.148911	  0.479676	 -0.185042
  1.132433	  0.472763	 -0.183885
  1.112193	  0.465285	 -0.186597
  1.093270	  0.459202	 -0.190235
  1.074949	  0.452103	 -0.193754
  1.057863	  0.444886	 -0.197632
  1.038527	  0.441340	 -0.203135
  1.018057	  0.436704	 -0.209225
  1.000294	  0.420953	 -0.214226
  0.989801	  0.403889	 -0.216070
  0.973877	  0.389080	 -0.217235
  0.955874	  0.384295	 -0.217675
  0.934776	  0.382465	 -0.218715
  0.913867	  0.374930	 -0.220079
  0.898292	  0.364581	 -0.222208
  0.879435	  0.354439	 -0.227402
  0.861695	  0.353734	 -0.229853
  0.847506	  0.357038	 -0.228535
  0.837075	  0.361948	 -0.223537
  0.818767	  0.370234	 -0.211353
  0.809794	  0.379050	 -0.200977
  0.800104	  0.386752	 -0.194356
  0.795249	  0.400302	 -0.181596
  0.791652	  0.414624	 -0.164410
  0.790224	  0.419789	 -0.148580
  0.788237	  0.427877	 -0.129045
  0.784590	  0.445827	 -0.113259
  0.785952	  0.459534	 -0.101028
  0.785934	  0.467480	 -0.081809
  0.781913	  0.475395	 -0.063859
  0.778527	  0.487259	 -0.047521
  0.783819	  0.498387	 -0.028827
  0.787178	  0.508334	 -0.010899
  0.788353	  0.514880	  0.003152
  0.790125	  0.522977	  0.025707
  0.785010	  0.533607	  0.043535
  0.779948	  0.544503	  0.055168
  0.770195	  0.558489	  0.071495
  0.765900	  0.567402	  0.088263
  0.762954	  0.574678	  0.105701
  0.755820	  0.586051	  0.123037
  0.749037	  0.596193	  0.136624
  0.745916	  0.605463	  0.152670
  0.739115	  0.617386	  0.169484
  0.722720	  0.625803	  0.185552
  0.705035	  0.628235	  0.196143
  0.691360	  0.632580	  0.205716
  0.679500	  0.640852	  0.215333
  0.658457	  0.650732	  0.230623
  0.648309	  0.656186	  0.242115
  0.630515	  0.662749	  0.258946
  0.619101	  0.664549	  0.268368
  0.599649	  0.663582	  0.274782
  0.578802	  0.660914	  0.277373
  0.557629	  0.662845	  0.284471
  0.538627	  0.668783	  0.298315
  0.529782	  0.674816	  0.311136
  0.516069	  0.680871	  0.332114
  0.502464	  0.682478	  0.349008
  0.490014	  0.685221	  0.360498
  0.475175	  0.690852	  0.373049
  0.451743	  0.699077	  0.383895
  0.436487	  0.702311	  0.384607
  0.414893	  0.706151	  0.386635
  0.396395	  0.711011	  0.396916
  0.379842	  0.717838	  0.406909
  0.363554	  0.730054	  0.414973
  0.350958	  0.739621	  0.427516
  0.339007	  0.739480	  0.442339
  0.319812	  0.732866	  0.456941
  0.294707	  0.734325	  0.467370
  0.277020	  0.748271	  0.474049
  0.269503	  0.760054	  0.478127
  0.252692	  0.771331	  0.486800
  0.235606	  0.780096	  0.492940
  0.220958	  0.792679	  0.502893
  0.205501	  0.803149	  0.514583
  0.187375	  0.810984	  0.523749
  0.175497	  0.817108	  0.528669
  0.157807	  0.823902	  0.538822
  0.139478	  0.831185	  0.546627
  0.121931	  0.839132	  0.558044
  0.108238	  0.846196	  0.563619
  0.091199	  0.857891	  0.570225
  0.071834	  0.872765	  0.573396
  0.059965	  0.883526	  0.578330
  0.045597	  0.891816	  0.594451
  0.027343	  0.894106	  0.605668
  0.003424	  0.891442	  0.610122
 -0.018696	  0.890290	  0.614459
 -0.034467	  0.893573	  0.621378
 -0.050387	  0.900685	  0.629832
 -0.065338	  0.910631	  0.642824
 -0.079264	  0.915614	  0.658688
 -0.093882	  0.918941	  0.671431
 -0.113656	  0.920256	  0.681612
 -0.129197	  0.922304	  0.688521
 -0.143632	  0.929764	  0.696724
 -0.163683	  0.940219	  0.714039
 -0.172840	  0.946827	  0.723157
 -0.188895	  0.951279	  0.734890
 -0.209048	  0.954865	  0.744676
 -0.227475	  0.952758	  0.753671
 -0.245691	  0.946846	  0.764982
 -0.264815	  0.947029	  0.774106
 -0.278260	  0.955903	  0.778923
 -0.295047	  0.967247	  0.788494
 -0.316378	  0.973342	  0.797970
 -0.332778	  0.975104	  0.802791
 -0.353781	  0.974377	  0.804331
 -0.369754	  0.975394	  0.805641
 -0.389938	  0.977602	  0.812699
 -0.410090	  0.980799	  0.811373
 -0.430252	  0.985119	  0.808842
 -0.450598	  0.986848	  0.804419
 -0.470633	  0.984795	  0.800921
 -0.489184	  0.982121	  0.790034
 -0.506926	  0.979892	  0.777816
 -0.521433	  0.980290	  0.765828
 -0.537207	  0.985067	  0.753479
 -0.551904	  0.990382	  0.736000
 -0.562473	  0.993967	  0.717085
 -0.575435	  0.991329	  0.700519
 -0.592452	  0.987662	  0.693890
 -0.613450	  0.987558	  0.690196
 -0.634398	  0.989133	  0.689102
 -0.656615	  0.986159	  0.682076
 -0.674129	  0.981138	  0.671618
 -0.688557	  0.983415	  0.657969
 -0.705493	  0.988194	  0.647977
 -0.723407	  0.992330	  0.640439
 -0.742424	  0.993640	  0.633573
 -0.761441	  0.994467	  0.627161
 -0.780742	  0.998342	  0.622708
 -0.797938	  1.009414	  0.618468
 -0.811872	  1.015736	  0.608012
 -0.826468	  1.024645	  0.600143
 -0.843473	  1.034191	  0.595659
 -0.859438	  1.046638	  0.595739
 -0.877732	  1.053638	  0.595152
 -0.895071	  1.060724	  0.593922
 -0.917126	  1.070628	  0.595383
 -0.934784	  1.081559	  0.599303
 -0.947527	  1.092767	  0.607329
 -0.962120	  1.104097	  0.617911
 -0.979801	  1.111933	  0.624095
 -0.997319	  1.117154	  0.629106
 -1.020018	  1.127422	  0.638003
 -1.030983	  1.132457	  0.644538
 -1.047104	  1.138836	  0.654901
 -1.066135	  1.142567	  0.662441
 -1.085910	  1.144896	  0.669750
 -1.101981	  1.142278	  0.679106
 -1.116643	  1.140518	  0.693032
 -1.131953	  1.146205	  0.706959
 -1.143601	  1.156204	  0.722431
 -1.145109	  1.161378	  0.735659
 -1.145226	  1.160696	  0.756373
 -1.150976	  1.156512	  0.777930
 -1.158353	  1.160254	  0.794954
 -1.165116	  1.171907	  0.811822
 -1.173834	  1.182592	  0.831777
 -1.178738	  1.188208	  0.850621
 -1.177451	  1.191005	  0.867759
 -1.172989	  1.197564	  0.885975
 -1.170525	  1.210581	  0.907659
 -1.170153	  1.218376	  0.925085
 -1.168719	  1.223550	  0.942624
 -1.167251	  1.227713	  0.963364
 -1.167360	  1.233360	  0.980955
 -1.167731	  1.239297	  1.000781
 -1.167188	  1.243362	  1.020476
 -1.167231	  1.248575	  1.039493
 -1.164926	  1.257078	  1.058795
 -1.159489	  1.267546	  1.077432
 -1.156584	  1.273416	  1.093554
 -1.158196	  1.275201	  1.115211
 -1.155899	  1.273128	  1.137319
 -1.149657	  1.275133	  1.155273
 -1.148376	  1.285195	  1.175687
 -1.157124	  1.292695	  1.192391
 -1.168362	  1.295832	  1.209401
 -1.178548	  1.303640	  1.228085
 -1.182005	  1.311211	  1.245182
 -1.186099	  1.315052	  1.262685
 -1.195340	  1.323551	  1.282200
 -1.207399	  1.332141	  1.297086
 -1.221910	  1.334492	  1.306501
 -1.236407	  1.340327	  1.319530
 -1.254062	  1.349900	  1.333336
 -1.269936	  1.351926	  1.337779
 -1.290581	  1.353306	  1.342728
 -1.313097	  1.358067	  1.347487
 -1.325703	  1.365114	  1.355820
 -1.344486	  1.371375	  1.363422
 -1.363368	  1.376379	  1.368612
 -1.379677	  1.382443	  1.375402
 -1.401047	  1.391342	  1.383363
 -1.417849	  1.393607	  1.384102
 -1.438085	  1.395656	  1.385968
 -1.459559	  1.400305	  1.389552
 -1.474320	  1.408955	  1.398056
 -1.490069	  1.418434	  1.407836
 -1.508269	  1.424802	  1.413705
 -1.524198	  1.431585	  1.421610
 -1.543401	  1.439508	  1.429059
 -1.559554	  1.447569	  1.437667
