 -0.123497	 -2.012275	  1.487480
 -0.126608	 -2.034796	  1.494237
 -0.116080	 -2.023133	  1.478661
 -0.108385	 -2.000330	  1.479691
 -0.105941	 -1.974076	  1.480777
 -0.104814	 -1.957032	  1.477490
 -0.103941	 -1.941252	  1.471379
 -0.101167	 -1.921062	  1.463925
 -0.097998	 -1.899936	  1.456653
 -0.095486	 -1.883597	  1.448836
 -0.092921	 -1.867838	  1.440733
 -0.089426	 -1.848800	  1.432772
 -0.086927	 -1.827705	  1.425031
 -0.084979	 -1.809739	  1.415944
 -0.082747	 -1.795704	  1.409123
 -0.079145	 -1.776604	  1.401945
 -0.080875	 -1.756075	  1.394642
 -0.085775	 -1.737030	  1.388709
 -0.091824	 -1.718132	  1.384219
 -0.098164	 -1.697265	  1.377832
 -0.101576	 -1.677413	  1.367314
 -0.103693	 -1.661640	  1.361265
 -0.103248	 -1.638312	  1.357434
 -0.098451	 -1.615442	  1.354562
 -0.093204	 -1.601289	  1.348855
 -0.086211	 -1.583405	  1.344634
 -0.077444	 -1.563361	  1.345916
 -0.066750	 -1.544230	  1.348068
 -0.057494	 -1.526556	  1.352082
 -0.051788	 -1.508075	  1.357437
 -0.046429	 -1.489593	  1.363696
 -0.039417	 -1.473137	  1.373569
 -0.031775	 -1.458232	  1.384857
 -0.022734	 -1.444191	  1.395941
 -0.014125	 -1.429912	  1.407049
 -0.004655	 -1.416138	  1.418138
  0.005390	 -1.403978	  1.430817
  0.015562	 -1.392305	  1.443543
  0.026266	 -1.381042	  1.456106
  0.036512	 -1.369446	  1.468797
  0.047011	 -1.357950	  1.481413
  0.058553	 -1.345982	  1.492662
  0.070169	 -1.333896	  1.503589
  0.082599	 -1.322434	  1.514291
  0.095672	 -1.311419	  1.524806
  0.108846	 -1.299310	  1.534074
  0.121431	 -1.285485	  1.541691
  0.132626	 -1.270722	  1.549075
  0.143173	 -1.255566	  1.556164
  0.154485	 -1.239475	  1.560688
  0.165462	 -1.222716	  1.562853
  0.175256	 -1.205392	  1.565099
  0.184524	 -1.187871	  1.567383
  0.193926	 -1.170270	  1.567475
  0.201197	 -1.153716	  1.559022
  0.208182	 -1.137173	  1.550304
  0.209756	 -1.118124	  1.544182
  0.206936	 -1.098244	  1.541527
  0.203211	 -1.078372	  1.538997
  0.198840	 -1.058991	  1.536793
  0.192410	 -1.040626	  1.534884
  0.185248	 -1.024808	  1.529898
  0.180772	 -1.013486	  1.518295
  0.177836	 -1.002647	  1.504280
  0.176936	 -0.991935	  1.487361
  0.176392	 -0.981206	  1.470407
  0.173475	 -0.971095	  1.453343
  0.171740	 -0.961769	  1.435760
  0.169421	 -0.952622	  1.418234
  0.167691	 -0.945283	  1.400133
  0.165058	 -0.940975	  1.381216
  0.164436	 -0.937754	  1.361527
  0.162024	 -0.934459	  1.341954
  0.160057	 -0.931348	  1.322395
  0.159518	 -0.928167	  1.302816
  0.159698	 -0.924583	  1.283157
  0.159508	 -0.919610	  1.263793
  0.159681	 -0.913360	  1.244728
  0.160269	 -0.906852	  1.225764
  0.159883	 -0.901943	  1.206534
  0.159872	 -0.897119	  1.188783
  0.160864	 -0.887163	  1.171973
  0.158558	 -0.873900	  1.153076
  0.156813	 -0.866370	  1.133178
  0.159506	 -0.864647	  1.113749
  0.164231	 -0.863232	  1.095348
  0.166135	 -0.855085	  1.076902
  0.169065	 -0.846981	  1.059229
  0.171988	 -0.837312	  1.042612
  0.175276	 -0.825079	  1.027412
  0.178672	 -0.809142	  1.016760
  0.183851	 -0.790122	  1.010739
  0.184430	 -0.769648	  1.004585
  0.183953	 -0.750829	  0.997424
  0.183992	 -0.733163	  0.989186
  0.185474	 -0.715400	  0.979931
  0.187536	 -0.697763	  0.970844
  0.189121	 -0.680130	  0.961741
  0.189428	 -0.663416	  0.951794
  0.189621	 -0.646694	  0.943699
  0.190986	 -0.626022	  0.937796
  0.194422	 -0.606444	  0.932505
  0.198205	 -0.587490	  0.927045
  0.198074	 -0.571051	  0.920268
  0.192765	 -0.555127	  0.913037
  0.182460	 -0.536831	  0.900368
  0.169728	 -0.514653	  0.882203
  0.166668	 -0.500062	  0.874165
  0.168104	 -0.482010	  0.867991
  0.174740	 -0.465618	  0.865924
  0.186538	 -0.438174	  0.860047
  0.193805	 -0.414996	  0.851623
  0.197562	 -0.403056	  0.844669
  0.198884	 -0.389169	  0.841580
  0.201007	 -0.368249	  0.841083
  0.199764	 -0.340956	  0.836081
  0.200010	 -0.324287	  0.829208
  0.204126	 -0.308826	  0.823453
  0.207914	 -0.284796	  0.810541
  0.212981	 -0.270494	  0.802957
  0.218584	 -0.253283	  0.795568
  0.227836	 -0.229428	  0.790143
  0.233246	 -0.216205	  0.786249
  0.239359	 -0.198776	  0.781871
  0.251271	 -0.178988	  0.771654
  0.256471	 -0.170337	  0.765136
  0.261806	 -0.152366	  0.752780
  0.264651	 -0.132731	  0.741930
  0.270906	 -0.112023	  0.734446
  0.276856	 -0.095231	  0.729623
  0.282669	 -0.077779	  0.728893
  0.288530	 -0.060183	  0.727232
  0.295274	 -0.036802	  0.723176
  0.298816	 -0.013796	  0.721316
  0.301253	 -0.000824	  0.717595
  0.306681	  0.019309	  0.709538
  0.310939	  0.038456	  0.695416
  0.313881	  0.051261	  0.685387
  0.319943	  0.067367	  0.677872
  0.331308	  0.087252	  0.673073
  0.341491	  0.107538	  0.665464
  0.345924	  0.127048	  0.656914
  0.346673	  0.144442	  0.650542
  0.348143	  0.160759	  0.647649
  0.342473	  0.183017	  0.645104
  0.338840	  0.199538	  0.640343
  0.336265	  0.219748	  0.634026
  0.339038	  0.243082	  0.625953
  0.344008	  0.263033	  0.623870
  0.347265	  0.278395	  0.623517
  0.346092	  0.301056	  0.625596
  0.342838	  0.322009	  0.623576
  0.342403	  0.341658	  0.619021
  0.342275	  0.360278	  0.612447
  0.343982	  0.378999	  0.606381
  0.347219	  0.398312	  0.602458
  0.352141	  0.414874	  0.597082
  0.359582	  0.431693	  0.586577
  0.368122	  0.452922	  0.579182
  0.374319	  0.470718	  0.577657
  0.376019	  0.488775	  0.578953
  0.379502	  0.509472	  0.579645
  0.385571	  0.527081	  0.575774
  0.393637	  0.544871	  0.568590
  0.403712	  0.563073	  0.565843
  0.411243	  0.581036	  0.566564
  0.419807	  0.598673	  0.566539
  0.429220	  0.615677	  0.562725
  0.435769	  0.632320	  0.560905
  0.445629	  0.650257	  0.557589
  0.460377	  0.673507	  0.548837
  0.466202	  0.686786	  0.544442
  0.471432	  0.701731	  0.537708
  0.478768	  0.721077	  0.528449
  0.485190	  0.739194	  0.521564
  0.491754	  0.757393	  0.516532
  0.497133	  0.776975	  0.510878
  0.500182	  0.794668	  0.506249
  0.502164	  0.812901	  0.501988
  0.504803	  0.835454	  0.495477
  0.509808	  0.853016	  0.487303
  0.515381	  0.867351	  0.476996
  0.518771	  0.882667	  0.466895
  0.520494	  0.899279	  0.454678
  0.523945	  0.924896	  0.436455
  0.527539	  0.936160	  0.430246
  0.532648	  0.949806	  0.423863
  0.536833	  0.970622	  0.414496
  0.537396	  0.988809	  0.404269
  0.539022	  1.004828	  0.393501
  0.541575	  1.021561	  0.382660
  0.544279	  1.044713	  0.368336
  0.545283	  1.055392	  0.359129
  0.548455	  1.069251	  0.337914
  0.554768	  1.076869	  0.312382
  0.556799	  1.083425	  0.296387
  0.563038	  1.092442	  0.283118
  0.566610	  1.105673	  0.270153
  0.571516	  1.118972	  0.251450
  0.573273	  1.126605	  0.231169
  0.580270	  1.130340	  0.215568
  0.597156	  1.138742	  0.195121
  0.607564	  1.146299	  0.180621
  0.614560	  1.152223	  0.170128
  0.621686	  1.161120	  0.151747
  0.625237	  1.165609	  0.133403
  0.631868	  1.172624	  0.117052
  0.639375	  1.179280	  0.100358
  0.646926	  1.185989	  0.084331
  0.657083	  1.194177	  0.069052
  0.668165	  1.199763	  0.054460
  0.679194	  1.205786	  0.041996
  0.688161	  1.215070	  0.033741
  0.696334	  1.235283	  0.023021
  0.706686	  1.253174	  0.008807
  0.722311	  1.261233	 -0.003129
  0.730430	  1.264269	 -0.010376
  0.744805	  1.271759	 -0.016253
  0.761628	  1.283355	 -0.017708
  0.777998	  1.297577	 -0.014623
  0.789240	  1.313192	 -0.011372
  0.799006	  1.330437	 -0.008909
  0.807922	  1.346817	 -0.009966
  0.815406	  1.367153	 -0.008812
  0.822323	  1.388943	 -0.008861
  0.827952	  1.407341	 -0.009361
  0.828882	  1.427911	 -0.011400
  0.828017	  1.447849	 -0.015558
  0.823483	  1.466513	 -0.021200
  0.819183	  1.485700	 -0.026871
  0.812722	  1.504095	 -0.031712
  0.804983	  1.519481	 -0.029953
  0.796877	  1.536740	 -0.027157
  0.791156	  1.557763	 -0.025142
  0.790746	  1.575128	 -0.027585
  0.789226	  1.596436	 -0.029935
  0.783469	  1.614414	 -0.031735
  0.773965	  1.634238	 -0.031837
  0.765766	  1.652970	 -0.031498
  0.758214	  1.671830	 -0.030568
  0.752871	  1.691930	 -0.029365
  0.749411	  1.712278	 -0.029111
  0.746772	  1.731835	 -0.028969
  0.743938	  1.751433	 -0.028171
  0.743614	  1.770882	 -0.023892
  0.746463	  1.789216	 -0.018839
  0.753542	  1.810277	 -0.018754
  0.759658	  1.832328	 -0.024902
  0.760646	  1.852979	 -0.027779
  0.756778	  1.873883	 -0.030312
  0.755545	  1.894017	 -0.038484
  0.758514	  1.913409	 -0.047394
  0.763373	  1.932650	 -0.055149
  0.768903	  1.947012	 -0.060080
  0.774728	  1.963513	 -0.063940
  0.778857	  1.984788	 -0.069376
  0.778130	  2.000191	 -0.076147
  0.772729	  2.015701	 -0.086952
  0.768550	  2.037969	 -0.100745
  0.768958	  2.055791	 -0.106797
  0.767989	  2.073385	 -0.110333
  0.769344	  2.093673	 -0.114331
  0.773639	  2.112144	 -0.119495
  0.779970	  2.134834	 -0.124787
  0.796912	  2.173928	 -0.123343
  0.801662	  2.184199	 -0.122101
  0.804806	  2.196950	 -0.124893
  0.809846	  2.215258	 -0.125162
  0.814641	  2.237139	 -0.130091
  0.815488	  2.253251	 -0.142720
  0.815056	  2.264844	 -0.150666
  0.814731	  2.283900	 -0.161173
  0.819670	  2.310362	 -0.177214
  0.822247	  2.328039	 -0.188019
  0.821958	  2.341414	 -0.192405
  0.810029	  2.380870	 -0.201164
  0.812054	  2.399993	 -0.206663
