  0.815437	  1.228326	  1.965878
  0.831408	  1.241644	  1.974019
  0.817089	  1.229732	  1.966737
  0.801610	  1.218948	  1.960099
  0.785873	  1.208440	  1.953623
  0.770369	  1.197545	  1.947228
  0.755631	  1.185491	  1.941107
  0.740901	  1.173424	  1.934991
  0.726398	  1.161063	  1.928924
  0.713097	  1.147301	  1.923122
  0.699814	  1.133519	  1.917325
  0.686685	  1.119645	  1.911398
  0.673903	  1.105571	  1.905189
  0.661121	  1.091499	  1.898975
  0.648140	  1.077638	  1.892702
  0.635108	  1.063830	  1.886417
  0.621686	  1.050364	  1.880211
  0.607883	  1.037252	  1.874085
  0.593746	  1.024524	  1.867912
  0.578976	  1.012582	  1.861653
  0.564168	  1.000684	  1.855397
  0.549219	  0.988966	  1.849157
  0.534165	  0.977173	  1.843300
  0.519341	  0.965082	  1.837251
  0.504755	  0.952923	  1.830699
  0.490456	  0.940697	  1.823439
  0.477479	  0.928107	  1.814312
  0.465337	  0.915809	  1.804308
  0.453065	  0.903325	  1.795306
  0.440135	  0.889601	  1.788358
  0.426020	  0.878373	  1.781049
  0.409424	  0.868341	  1.773113
  0.396710	  0.853071	  1.767432
  0.388294	  0.827744	  1.756155
  0.383298	  0.813663	  1.744151
  0.376239	  0.803561	  1.733471
  0.362477	  0.792778	  1.724002
  0.352561	  0.778749	  1.711002
  0.345751	  0.768470	  1.695450
  0.335064	  0.756448	  1.683666
  0.319539	  0.745235	  1.674635
  0.303956	  0.729749	  1.666839
  0.292284	  0.715726	  1.657548
  0.280428	  0.701485	  1.644617
  0.272147	  0.693891	  1.634687
  0.261583	  0.683300	  1.621691
  0.252884	  0.676568	  1.611421
  0.236389	  0.662858	  1.595863
  0.222098	  0.647792	  1.585352
  0.212032	  0.633856	  1.577105
  0.202031	  0.625886	  1.572247
  0.183165	  0.606598	  1.562449
  0.177009	  0.598962	  1.557263
  0.163289	  0.585162	  1.550194
  0.150280	  0.567031	  1.542246
  0.141518	  0.555055	  1.535995
  0.126281	  0.537683	  1.528432
  0.113836	  0.524111	  1.519770
  0.100701	  0.514500	  1.513345
  0.090317	  0.503234	  1.505146
  0.074653	  0.485064	  1.493788
  0.061209	  0.471083	  1.486267
  0.052208	  0.460587	  1.484750
  0.038038	  0.440743	  1.480280
  0.025564	  0.423537	  1.478699
  0.017706	  0.410429	  1.477051
  0.002601	  0.395121	  1.472822
 -0.019860	  0.378185	  1.468373
 -0.031851	  0.370079	  1.466702
 -0.043956	  0.363667	  1.464556
 -0.061613	  0.354275	  1.456583
 -0.088684	  0.339304	  1.442865
 -0.102322	  0.330198	  1.435357
 -0.114018	  0.321953	  1.430196
 -0.129692	  0.310877	  1.425320
 -0.143611	  0.300569	  1.421307
 -0.158248	  0.283194	  1.413721
 -0.171767	  0.266526	  1.405340
 -0.180875	  0.258704	  1.399773
 -0.199069	  0.247841	  1.389591
 -0.217333	  0.236380	  1.381919
 -0.227396	  0.227091	  1.378091
 -0.241128	  0.210481	  1.371829
 -0.255711	  0.194562	  1.367746
 -0.269329	  0.180390	  1.365876
 -0.283939	  0.167085	  1.359551
 -0.297599	  0.155561	  1.349959
 -0.309528	  0.145386	  1.341377
 -0.324528	  0.135668	  1.331927
 -0.348028	  0.121537	  1.316809
 -0.356047	  0.118401	  1.312107
 -0.371210	  0.107083	  1.305494
 -0.385273	  0.093767	  1.298737
 -0.396842	  0.077785	  1.290396
 -0.407807	  0.060394	  1.281478
 -0.421520	  0.045280	  1.273943
 -0.430919	  0.038182	  1.269938
 -0.448801	  0.024784	  1.261752
 -0.460655	  0.010101	  1.251277
 -0.469818	 -0.004467	  1.243138
 -0.479949	 -0.022755	  1.237451
 -0.488568	 -0.036948	  1.234794
 -0.501859	 -0.057610	  1.229415
 -0.514764	 -0.073066	  1.220648
 -0.524243	 -0.083579	  1.208552
 -0.534285	 -0.095525	  1.187664
 -0.542097	 -0.102934	  1.176265
 -0.553405	 -0.108521	  1.162351
 -0.574511	 -0.118351	  1.141413
 -0.585175	 -0.125774	  1.129297
 -0.592218	 -0.131266	  1.122656
 -0.606877	 -0.140875	  1.108888
 -0.621476	 -0.149637	  1.092577
 -0.630847	 -0.155956	  1.080738
 -0.649335	 -0.166055	  1.064981
 -0.665403	 -0.171874	  1.054341
 -0.677365	 -0.176669	  1.049337
 -0.696323	 -0.183136	  1.041418
 -0.717569	 -0.187892	  1.026981
 -0.730689	 -0.190600	  1.011239
 -0.741182	 -0.192795	  0.995632
 -0.750621	 -0.194858	  0.981194
 -0.766395	 -0.192802	  0.964586
 -0.782662	 -0.189304	  0.953483
 -0.799093	 -0.187033	  0.942368
 -0.816636	 -0.182748	  0.928306
 -0.829750	 -0.176905	  0.916697
 -0.842136	 -0.166011	  0.906608
 -0.859385	 -0.153988	  0.893216
 -0.876567	 -0.150073	  0.878888
 -0.887295	 -0.148389	  0.871427
 -0.904537	 -0.144747	  0.858440
 -0.923590	 -0.141829	  0.846215
 -0.940065	 -0.140699	  0.837574
 -0.958348	 -0.137956	  0.828204
 -0.976994	 -0.134985	  0.818354
 -0.993201	 -0.136652	  0.807696
 -1.005795	 -0.144905	  0.797383
 -1.019267	 -0.157348	  0.784434
 -1.035394	 -0.163649	  0.772684
 -1.054075	 -0.162764	  0.764689
 -1.081602	 -0.152851	  0.759207
 -1.102493	 -0.149546	  0.751056
 -1.117749	 -0.153105	  0.742323
 -1.130928	 -0.160147	  0.734622
 -1.147421	 -0.174410	  0.725608
 -1.166789	 -0.186008	  0.717589
 -1.188663	 -0.191413	  0.711549
 -1.201176	 -0.193813	  0.708502
 -1.218667	 -0.197425	  0.703021
 -1.240612	 -0.206977	  0.697213
 -1.260032	 -0.215037	  0.693021
 -1.277906	 -0.222966	  0.685989
 -1.291376	 -0.227765	  0.678305
 -1.308868	 -0.234393	  0.667710
 -1.327405	 -0.246898	  0.656883
 -1.340957	 -0.257205	  0.649932
 -1.353192	 -0.270925	  0.643568
 -1.365474	 -0.287766	  0.636688
 -1.377720	 -0.300647	  0.632264
 -1.394303	 -0.309781	  0.626675
 -1.411462	 -0.317533	  0.616011
 -1.423229	 -0.332674	  0.598416
 -1.433228	 -0.344985	  0.581347
 -1.443482	 -0.356922	  0.567074
 -1.453232	 -0.371471	  0.557547
 -1.458799	 -0.389341	  0.547719
 -1.462086	 -0.408482	  0.537567
 -1.465439	 -0.423653	  0.528721
 -1.470562	 -0.440644	  0.517820
 -1.476207	 -0.457860	  0.507753
 -1.484691	 -0.476500	  0.498798
 -1.498762	 -0.494283	  0.485766
 -1.507101	 -0.506498	  0.478110
 -1.511879	 -0.515456	  0.471715
 -1.516244	 -0.537252	  0.462205
 -1.518445	 -0.564315	  0.456561
 -1.520281	 -0.581591	  0.453756
 -1.522772	 -0.601223	  0.448278
 -1.525191	 -0.614963	  0.443793
 -1.532125	 -0.635177	  0.437121
 -1.537247	 -0.655182	  0.434286
 -1.536932	 -0.683286	  0.435957
 -1.534043	 -0.701756	  0.434858
 -1.531367	 -0.717277	  0.431891
 -1.529594	 -0.737444	  0.423977
 -1.526308	 -0.760208	  0.419219
 -1.524957	 -0.781532	  0.421175
 -1.526195	 -0.800139	  0.425155
 -1.532552	 -0.819461	  0.426854
 -1.540316	 -0.838334	  0.425279
 -1.547107	 -0.856745	  0.421252
 -1.549209	 -0.876220	  0.416330
 -1.547902	 -0.896870	  0.413442
 -1.547227	 -0.920715	  0.412533
 -1.552956	 -0.941979	  0.415143
 -1.565438	 -0.959684	  0.422012
 -1.578168	 -0.973754	  0.426714
 -1.588184	 -0.989147	  0.429981
 -1.596482	 -1.005331	  0.433472
 -1.612139	 -1.035051	  0.431091
 -1.618711	 -1.044384	  0.428005
 -1.629679	 -1.055840	  0.422001
 -1.646465	 -1.077395	  0.415729
 -1.654164	 -1.093455	  0.412054
 -1.659434	 -1.108613	  0.409050
 -1.667109	 -1.133518	  0.406846
 -1.672687	 -1.148246	  0.404809
 -1.689335	 -1.168327	  0.399374
 -1.701140	 -1.178209	  0.396994
 -1.713508	 -1.189218	  0.394460
 -1.726683	 -1.208479	  0.391882
 -1.746056	 -1.224699	  0.389438
 -1.761252	 -1.230085	  0.385737
 -1.779904	 -1.234098	  0.378043
 -1.801855	 -1.242969	  0.368342
 -1.814223	 -1.257673	  0.363072
 -1.824902	 -1.274004	  0.354921
 -1.835618	 -1.291323	  0.344558
 -1.847954	 -1.304461	  0.335152
 -1.858135	 -1.314072	  0.329359
 -1.873003	 -1.327481	  0.321636
 -1.884661	 -1.342843	  0.316506
 -1.894481	 -1.358867	  0.308743
 -1.904082	 -1.374807	  0.298033
 -1.918653	 -1.390270	  0.288193
 -1.928615	 -1.400636	  0.283635
 -1.941252	 -1.416152	  0.277612
 -1.954726	 -1.436449	  0.265922
 -1.970335	 -1.447020	  0.253186
 -1.982834	 -1.451892	  0.244034
 -2.003429	 -1.471459	  0.237069
 -2.016064	 -1.484437	  0.228588
