 -0.986817	  2.255056	  0.378259
 -0.995108	  2.279989	  0.354687
 -0.990476	  2.265777	  0.367956
 -0.987687	  2.248841	  0.378180
 -0.985709	  2.230957	  0.386906
 -0.982642	  2.213360	  0.395877
 -0.976449	  2.196943	  0.405454
 -0.970354	  2.180567	  0.415164
 -0.967081	  2.164039	  0.425921
 -0.963887	  2.147561	  0.436788
 -0.959679	  2.132234	  0.448903
 -0.954436	  2.117702	  0.461610
 -0.949084	  2.103125	  0.474275
 -0.944532	  2.089407	  0.487765
 -0.943208	  2.077177	  0.500091
 -0.949824	  2.066007	  0.515192
 -0.948250	  2.049455	  0.540836
 -0.940662	  2.035464	  0.555779
 -0.937310	  2.030242	  0.563494
 -0.938878	  2.017980	  0.577581
 -0.945890	  2.006696	  0.598002
 -0.941366	  1.991382	  0.618673
 -0.939706	  1.981503	  0.630013
 -0.940650	  1.968465	  0.642732
 -0.939723	  1.950492	  0.662935
 -0.937726	  1.941702	  0.675859
 -0.937865	  1.932647	  0.693509
 -0.941126	  1.922697	  0.715484
 -0.937660	  1.912872	  0.734755
 -0.928590	  1.902268	  0.744580
 -0.925619	  1.884986	  0.756466
 -0.929563	  1.868642	  0.769725
 -0.933333	  1.853259	  0.782508
 -0.935037	  1.839288	  0.796601
 -0.937056	  1.823881	  0.810744
 -0.935957	  1.809289	  0.823749
 -0.935868	  1.796275	  0.839335
 -0.938473	  1.780358	  0.853790
 -0.937251	  1.765476	  0.866098
 -0.937122	  1.750807	  0.879830
 -0.936865	  1.729126	  0.894932
 -0.933213	  1.713591	  0.907515
 -0.926716	  1.701942	  0.918937
 -0.914164	  1.691187	  0.932147
 -0.910311	  1.677989	  0.947401
 -0.912589	  1.666050	  0.958579
 -0.914750	  1.655939	  0.971771
 -0.914940	  1.634566	  0.988519
 -0.915735	  1.619434	  1.001777
 -0.914893	  1.614453	  1.009708
 -0.906163	  1.604117	  1.019647
 -0.900206	  1.590250	  1.032445
 -0.895521	  1.582294	  1.059357
 -0.897743	  1.576058	  1.080262
 -0.899858	  1.577153	  1.095913
 -0.903658	  1.584760	  1.117621
 -0.906720	  1.593422	  1.136903
 -0.910220	  1.596719	  1.156664
 -0.915167	  1.595257	  1.175544
 -0.922618	  1.592879	  1.194112
 -0.930529	  1.590450	  1.212331
 -0.938443	  1.588022	  1.230536
 -0.946411	  1.585652	  1.248601
 -0.958956	  1.585375	  1.260949
 -0.981200	  1.586294	  1.265372
 -1.003146	  1.585387	  1.273874
 -1.019810	  1.584663	  1.287415
 -1.029490	  1.585824	  1.300224
 -1.038939	  1.591069	  1.317687
 -1.055661	  1.592081	  1.341029
 -1.071799	  1.590873	  1.358918
 -1.080668	  1.590312	  1.367277
 -1.094302	  1.591340	  1.376360
 -1.112129	  1.591889	  1.390558
 -1.128024	  1.590843	  1.404187
 -1.143207	  1.589815	  1.417234
 -1.158353	  1.588794	  1.430257
 -1.173503	  1.587760	  1.443273
 -1.188655	  1.586722	  1.456285
 -1.203813	  1.585687	  1.469292
 -1.218964	  1.584664	  1.482308
 -1.234121	  1.583618	  1.495314
 -1.249297	  1.582568	  1.508336
 -1.264869	  1.581483	  1.521712
 -1.281732	  1.580014	  1.536468
 -1.296573	  1.578362	  1.549773
