 -1.199830	 -0.784479	 -2.669438
 -1.187950	 -0.776712	 -2.643008
 -1.199900	 -0.761523	 -2.596132
 -1.219561	 -0.748279	 -2.551358
 -1.242834	 -0.740789	 -2.507284
 -1.262481	 -0.734997	 -2.460686
 -1.285459	 -0.725190	 -2.416549
 -1.309929	 -0.715849	 -2.373922
 -1.335291	 -0.704820	 -2.332415
 -1.360436	 -0.693375	 -2.290683
 -1.385196	 -0.682421	 -2.248644
 -1.410033	 -0.671632	 -2.205526
 -1.434667	 -0.660667	 -2.161009
 -1.457994	 -0.649998	 -2.116754
 -1.479717	 -0.639616	 -2.073546
 -1.500467	 -0.629139	 -2.030700
 -1.520547	 -0.618776	 -1.987167
 -1.539476	 -0.608959	 -1.942400
 -1.557301	 -0.598916	 -1.896350
 -1.573591	 -0.587394	 -1.850955
 -1.589472	 -0.574529	 -1.806269
 -1.606102	 -0.560749	 -1.762260
 -1.624350	 -0.546562	 -1.717184
 -1.644173	 -0.533420	 -1.671914
 -1.664291	 -0.521484	 -1.628050
 -1.684524	 -0.509958	 -1.584818
 -1.705166	 -0.498306	 -1.541164
 -1.726511	 -0.486392	 -1.496455
 -1.747881	 -0.475647	 -1.452656
 -1.765342	 -0.470462	 -1.406510
 -1.785473	 -0.463725	 -1.360212
 -1.806373	 -0.452902	 -1.314800
 -1.825497	 -0.439395	 -1.270392
 -1.847220	 -0.426970	 -1.227195
 -1.870863	 -0.415890	 -1.185757
 -1.896147	 -0.405366	 -1.145612
 -1.923207	 -0.395126	 -1.105387
 -1.951243	 -0.385320	 -1.064943
 -1.979976	 -0.375998	 -1.023733
 -2.008309	 -0.367348	 -0.982445
 -2.035962	 -0.359154	 -0.940534
 -2.062489	 -0.350438	 -0.897545
 -2.086164	 -0.339799	 -0.854900
 -2.107076	 -0.327797	 -0.811561
 -2.123905	 -0.314936	 -0.766230
 -2.137585	 -0.300590	 -0.718751
 -2.150883	 -0.285187	 -0.671521
 -2.166230	 -0.271310	 -0.626393
 -2.183892	 -0.259473	 -0.583330
 -2.204306	 -0.248833	 -0.540348
 -2.225863	 -0.238302	 -0.496983
 -2.248341	 -0.227635	 -0.453857
 -2.272744	 -0.217418	 -0.412566
 -2.298578	 -0.208124	 -0.371022
 -2.322921	 -0.200712	 -0.326775
 -2.343732	 -0.192980	 -0.279768
 -2.361351	 -0.183683	 -0.231527
 -2.377776	 -0.173284	 -0.184516
 -2.394594	 -0.162513	 -0.138719
 -2.412546	 -0.151984	 -0.093008
 -2.431199	 -0.141912	 -0.046661
 -2.449375	 -0.132650	 -0.002022
 -2.467466	 -0.123469	  0.041065
 -2.486632	 -0.113711	  0.083872
 -2.506953	 -0.104135	  0.127428
 -2.529339	 -0.095601	  0.172587
 -2.552871	 -0.085885	  0.217963
 -2.574286	 -0.073424	  0.261725
 -2.596438	 -0.059719	  0.302045
 -2.617922	 -0.042394	  0.342815
 -2.639774	 -0.032137	  0.387002
 -2.661385	 -0.021825	  0.431330
 -2.682502	 -0.009595	  0.475749
 -2.703319	  0.004426	  0.520555
 -2.723573	  0.019065	  0.564706
 -2.743302	  0.033567	  0.607702
 -2.762825	  0.046544	  0.651354
 -2.782686	  0.056996	  0.696219
 -2.803595	  0.065214	  0.739716
 -2.825089	  0.072667	  0.782352
 -2.840640	  0.080167	  0.827992
 -2.870209	  0.085390	  0.868682
 -2.898911	  0.086244	  0.877369
