 -2.508109	 -0.288893	  1.675360
 -2.483276	 -0.286033	  1.658772
 -2.465876	 -0.292468	  1.612901
 -2.444970	 -0.303839	  1.569874
 -2.434382	 -0.310961	  1.522376
 -2.420626	 -0.324754	  1.476331
 -2.401718	 -0.340965	  1.431910
 -2.380807	 -0.355344	  1.387856
 -2.364593	 -0.374134	  1.343548
 -2.349864	 -0.388951	  1.297766
 -2.333844	 -0.401349	  1.252008
 -2.318535	 -0.412640	  1.205950
 -2.309175	 -0.421591	  1.158021
 -2.301720	 -0.426468	  1.108914
 -2.291645	 -0.430207	  1.060877
 -2.279740	 -0.433635	  1.013545
 -2.264328	 -0.440061	  0.966509
 -2.244431	 -0.452216	  0.920854
 -2.224529	 -0.465576	  0.875399
 -2.206018	 -0.478312	  0.830429
 -2.189188	 -0.489016	  0.785556
 -2.174712	 -0.496564	  0.739458
 -2.164801	 -0.503834	  0.692498
 -2.155572	 -0.509415	  0.644565
 -2.146245	 -0.516214	  0.595664
 -2.142979	 -0.529793	  0.549336
 -2.150520	 -0.545650	  0.504380
 -2.170362	 -0.569360	  0.447190
 -2.204817	 -0.608915	  0.374616
 -2.248658	 -0.654536	  0.308476
 -2.290113	 -0.695296	  0.259361
 -2.329250	 -0.733729	  0.218202
 -2.367098	 -0.772160	  0.171976
 -2.392489	 -0.802127	  0.118240
 -2.394067	 -0.819023	  0.059741
 -2.376784	 -0.829351	 -0.002075
 -2.352515	 -0.836375	 -0.066061
 -2.333532	 -0.841612	 -0.118302
 -2.323864	 -0.847473	 -0.148987
 -2.316930	 -0.856887	 -0.176389
 -2.308622	 -0.873285	 -0.212069
 -2.296691	 -0.896285	 -0.261009
 -2.282816	 -0.919972	 -0.318553
 -2.268958	 -0.938899	 -0.376846
 -2.255087	 -0.951025	 -0.431660
 -2.239782	 -0.956948	 -0.481049
 -2.217300	 -0.956759	 -0.523326
 -2.184473	 -0.951173	 -0.560012
 -2.131123	 -0.940034	 -0.594416
 -2.043034	 -0.925501	 -0.625900
 -1.929952	 -0.916419	 -0.656780
 -1.833936	 -0.915352	 -0.692498
 -1.783498	 -0.920797	 -0.724049
 -1.765627	 -0.928859	 -0.744027
 -1.754910	 -0.945055	 -0.770309
 -1.751819	 -0.985035	 -0.821955
 -1.762097	 -1.040776	 -0.886982
 -1.783774	 -1.095039	 -0.942834
 -1.807346	 -1.142833	 -0.988695
 -1.824939	 -1.184572	 -1.034519
 -1.831900	 -1.188790	 -1.089761
 -1.859698	 -1.183650	 -1.144378
 -1.851079	 -1.239515	 -1.184508
 -1.796846	 -1.284044	 -1.215846
 -1.809512	 -1.290139	 -1.273992
 -1.819753	 -1.286268	 -1.320459
 -1.752672	 -1.272752	 -1.346275
 -1.693732	 -1.256901	 -1.395222
 -1.694772	 -1.265700	 -1.456036
 -1.662259	 -1.243777	 -1.499007
 -1.601601	 -1.214688	 -1.528066
 -1.536713	 -1.156616	 -1.558893
 -1.484731	 -1.112720	 -1.614886
 -1.453563	 -1.103575	 -1.671843
 -1.435715	 -1.107468	 -1.720611
 -1.420432	 -1.116498	 -1.768101
 -1.404121	 -1.127937	 -1.814644
 -1.385965	 -1.140379	 -1.859299
 -1.366440	 -1.152773	 -1.903253
 -1.346430	 -1.163466	 -1.948400
 -1.325254	 -1.172944	 -1.993827
 -1.303189	 -1.181724	 -2.038514
 -1.280450	 -1.189777	 -2.081609
 -1.259024	 -1.198278	 -2.126020
 -1.241832	 -1.212493	 -2.171001
 -1.225867	 -1.229677	 -2.214746
 -1.211430	 -1.244106	 -2.260135
 -1.191541	 -1.260183	 -2.303338
 -1.172837	 -1.273636	 -2.348400
 -1.163717	 -1.285276	 -2.397405
 -1.152670	 -1.299180	 -2.446116
 -1.164196	 -1.312171	 -2.470578
