  1.910509	  0.018080	 -1.681569
  1.946041	  0.034390	 -1.693067
  1.928626	  0.026485	 -1.687219
  1.911234	  0.018683	 -1.681163
  1.893843	  0.010884	 -1.675101
  1.876492	  0.003339	 -1.668622
  1.859153	 -0.004133	 -1.662024
  1.841801	 -0.011562	 -1.655412
  1.824310	 -0.018505	 -1.648641
  1.806818	 -0.025446	 -1.641868
  1.789302	 -0.032192	 -1.634964
  1.771736	 -0.038474	 -1.627754
  1.754170	 -0.044754	 -1.620543
  1.736573	 -0.050624	 -1.613068
  1.718948	 -0.055898	 -1.605222
  1.701336	 -0.061140	 -1.597361
  1.683814	 -0.065043	 -1.588854
  1.666293	 -0.066673	 -1.579624
  1.647904	 -0.068510	 -1.570991
  1.629308	 -0.070787	 -1.563176
  1.611332	 -0.071753	 -1.555537
  1.594439	 -0.074983	 -1.545975
  1.577284	 -0.075805	 -1.536343
  1.559449	 -0.076597	 -1.527096
  1.540743	 -0.076541	 -1.517685
  1.522232	 -0.075370	 -1.509508
  1.505861	 -0.079751	 -1.499759
  1.489130	 -0.082896	 -1.489184
  1.472453	 -0.084690	 -1.478608
  1.454553	 -0.085650	 -1.468930
  1.435337	 -0.086525	 -1.461701
  1.416798	 -0.088109	 -1.455175
  1.399350	 -0.091091	 -1.446403
  1.382404	 -0.092357	 -1.435576
  1.367004	 -0.090769	 -1.423304
  1.350390	 -0.087852	 -1.411956
  1.333826	 -0.084778	 -1.401152
  1.318281	 -0.080116	 -1.389466
  1.304755	 -0.072949	 -1.376596
  1.291234	 -0.065775	 -1.363723
  1.277713	 -0.058601	 -1.350850
  1.264259	 -0.051366	 -1.337943
  1.253980	 -0.041651	 -1.323803
  1.243712	 -0.031929	 -1.309660
  1.233443	 -0.022208	 -1.295516
  1.223469	 -0.012699	 -1.281022
  1.214532	 -0.003954	 -1.265412
  1.205597	  0.004783	 -1.249797
  1.196598	  0.011884	 -1.233409
  1.187600	  0.017646	 -1.216503
  1.178600	  0.023400	 -1.199594
  1.169945	  0.027975	 -1.182155
  1.161334	  0.032398	 -1.164654
  1.152724	  0.036821	 -1.147152
  1.144180	  0.041264	 -1.129623
  1.135813	  0.045760	 -1.112023
  1.127446	  0.050256	 -1.094422
  1.119079	  0.054751	 -1.076822
  1.110283	  0.059169	 -1.059412
  1.101130	  0.063511	 -1.042168
  1.090895	  0.065393	 -1.025105
  1.078302	  0.057438	 -1.011779
  1.065698	  0.049438	 -0.998469
  1.053094	  0.041437	 -0.985160
  1.040491	  0.033439	 -0.971849
  1.027929	  0.026493	 -0.957922
  1.015407	  0.020100	 -0.943698
  1.002885	  0.013709	 -0.929473
  0.990363	  0.007318	 -0.915248
  0.977841	  0.000927	 -0.901023
  0.965319	 -0.005465	 -0.886798
  0.952800	 -0.011847	 -0.872567
  0.941338	 -0.015574	 -0.856609
  0.930710	 -0.017561	 -0.839784
  0.920085	 -0.019542	 -0.822955
  0.909490	 -0.021581	 -0.806154
  0.899254	 -0.024622	 -0.789459
  0.889411	 -0.028628	 -0.772390
  0.880099	 -0.032089	 -0.754502
  0.873341	 -0.035536	 -0.736460
  0.866255	 -0.036992	 -0.717569
  0.858313	 -0.037232	 -0.698567
  0.847391	 -0.039097	 -0.682508
  0.839583	 -0.044847	 -0.666139
  0.828154	 -0.056165	 -0.658581
  0.812910	 -0.067815	 -0.663739
  0.795624	 -0.077694	 -0.659909
  0.776650	 -0.083134	 -0.660028
  0.757376	 -0.090383	 -0.662820
  0.743967	 -0.099323	 -0.672645
  0.730230	 -0.108175	 -0.684731
  0.712414	 -0.118527	 -0.694854
  0.693600	 -0.122762	 -0.702641
  0.677069	 -0.129437	 -0.707865
  0.661777	 -0.141879	 -0.714262
  0.645603	 -0.151101	 -0.722298
  0.631060	 -0.164240	 -0.725589
  0.615288	 -0.175207	 -0.733658
  0.599634	 -0.183314	 -0.743877
  0.581904	 -0.191862	 -0.746916
  0.561134	 -0.199387	 -0.750072
  0.543954	 -0.206629	 -0.758259
  0.532053	 -0.217070	 -0.764723
  0.515355	 -0.227211	 -0.773423
  0.499672	 -0.237433	 -0.781059
  0.482446	 -0.244105	 -0.790362
  0.464659	 -0.251171	 -0.798647
  0.449851	 -0.263360	 -0.802458
  0.432007	 -0.272792	 -0.804240
  0.415538	 -0.282634	 -0.808098
  0.396321	 -0.290062	 -0.808871
  0.377303	 -0.294883	 -0.810146
  0.358126	 -0.305190	 -0.805494
  0.341870	 -0.314614	 -0.805452
  0.322116	 -0.319774	 -0.800084
  0.300559	 -0.321262	 -0.797931
  0.282277	 -0.326514	 -0.795186
  0.266643	 -0.336173	 -0.786789
  0.249623	 -0.344939	 -0.777706
  0.231370	 -0.348480	 -0.768617
  0.211086	 -0.350741	 -0.762309
  0.194425	 -0.363044	 -0.757155
  0.179715	 -0.372194	 -0.748924
  0.161477	 -0.378707	 -0.741983
  0.143595	 -0.385847	 -0.733853
  0.127735	 -0.392383	 -0.724000
  0.113735	 -0.402842	 -0.714139
  0.098509	 -0.415310	 -0.708370
  0.081419	 -0.424754	 -0.702854
  0.062406	 -0.431314	 -0.694350
  0.045819	 -0.438144	 -0.687994
  0.031076	 -0.447654	 -0.677617
  0.017210	 -0.454235	 -0.668646
 -0.001280	 -0.459314	 -0.662212
 -0.021128	 -0.465888	 -0.653784
 -0.035716	 -0.474468	 -0.645120
 -0.049065	 -0.485546	 -0.634066
 -0.062755	 -0.494374	 -0.624583
 -0.085883	 -0.505486	 -0.622442
 -0.106583	 -0.504872	 -0.618865
 -0.127829	 -0.505059	 -0.614303
 -0.140672	 -0.509885	 -0.596251
 -0.151745	 -0.517950	 -0.580991
 -0.165533	 -0.525523	 -0.568091
 -0.183849	 -0.528832	 -0.556243
 -0.203047	 -0.526592	 -0.549895
 -0.222304	 -0.527871	 -0.543604
 -0.238421	 -0.534772	 -0.532489
 -0.250996	 -0.543437	 -0.519512
 -0.271150	 -0.545519	 -0.510748
 -0.289786	 -0.546288	 -0.505235
 -0.308060	 -0.548667	 -0.497522
 -0.324587	 -0.555315	 -0.485855
 -0.338196	 -0.561926	 -0.472357
 -0.355834	 -0.568560	 -0.463591
 -0.374998	 -0.570714	 -0.456124
 -0.393011	 -0.574868	 -0.449699
 -0.406900	 -0.581225	 -0.437178
 -0.421835	 -0.588236	 -0.424935
 -0.439561	 -0.596018	 -0.421250
 -0.459211	 -0.602465	 -0.413185
 -0.479520	 -0.602744	 -0.406658
 -0.494243	 -0.602954	 -0.392897
 -0.510701	 -0.606196	 -0.380611
 -0.527675	 -0.610853	 -0.376838
 -0.548005	 -0.613816	 -0.372448
 -0.568630	 -0.615598	 -0.369697
 -0.587425	 -0.619943	 -0.365615
 -0.606143	 -0.628978	 -0.359060
 -0.624619	 -0.636445	 -0.359389
 -0.644228	 -0.638611	 -0.358657
 -0.662757	 -0.641782	 -0.352355
 -0.679895	 -0.645335	 -0.345397
 -0.703220	 -0.649013	 -0.340847
 -0.720525	 -0.651604	 -0.340016
 -0.739209	 -0.657872	 -0.338896
 -0.759423	 -0.662709	 -0.336793
 -0.780542	 -0.661628	 -0.333969
 -0.800093	 -0.661893	 -0.335941
 -0.821725	 -0.670525	 -0.331727
 -0.836949	 -0.678710	 -0.326048
 -0.857537	 -0.683746	 -0.323041
 -0.873733	 -0.689609	 -0.315215
 -0.893925	 -0.697811	 -0.308485
 -0.911683	 -0.703008	 -0.306389
 -0.929733	 -0.708214	 -0.300219
 -0.951002	 -0.713105	 -0.296625
 -0.967024	 -0.722443	 -0.289004
 -0.982659	 -0.729015	 -0.280110
 -1.002888	 -0.736742	 -0.273357
 -1.019989	 -0.744963	 -0.268081
 -1.036024	 -0.752694	 -0.261149
 -1.050418	 -0.761295	 -0.248284
 -1.066261	 -0.767292	 -0.237674
 -1.083959	 -0.773821	 -0.231016
 -1.102200	 -0.778481	 -0.221729
 -1.114700	 -0.786671	 -0.210175
 -1.130028	 -0.791377	 -0.197905
 -1.148755	 -0.798540	 -0.186187
 -1.161947	 -0.803164	 -0.177684
 -1.176682	 -0.810358	 -0.164025
 -1.190355	 -0.816552	 -0.150268
 -1.205519	 -0.825270	 -0.137805
 -1.220934	 -0.834738	 -0.127326
 -1.236847	 -0.840300	 -0.115147
 -1.247091	 -0.849618	 -0.104367
 -1.260641	 -0.858682	 -0.094075
 -1.275417	 -0.866625	 -0.084433
 -1.291364	 -0.875449	 -0.075541
 -1.307292	 -0.884139	 -0.066454
 -1.324476	 -0.890616	 -0.059060
 -1.341017	 -0.894226	 -0.054496
 -1.357064	 -0.900335	 -0.048725
 -1.376481	 -0.904029	 -0.045207
 -1.396404	 -0.905394	 -0.044284
 -1.416405	 -0.909509	 -0.041973
 -1.435844	 -0.913041	 -0.041385
 -1.456507	 -0.915935	 -0.037574
 -1.475850	 -0.919697	 -0.030452
 -1.494639	 -0.923059	 -0.024342
 -1.512577	 -0.929632	 -0.017973
 -1.530527	 -0.936973	 -0.013869
 -1.549231	 -0.944808	 -0.009435
 -1.569708	 -0.947733	 -0.007134
 -1.587981	 -0.950350	  0.001202
 -1.605549	 -0.956058	  0.008115
 -1.622768	 -0.964756	  0.013514
 -1.639844	 -0.974369	  0.018352
 -1.659189	 -0.982179	  0.022021
 -1.679474	 -0.985569	  0.025070
 -1.698156	 -0.990222	  0.030355
 -1.712261	 -1.001625	  0.039671
 -1.730223	 -1.009554	  0.046398
 -1.749480	 -1.012463	  0.054939
 -1.767714	 -1.015397	  0.064576
 -1.784906	 -1.021518	  0.070259
 -1.799922	 -1.032429	  0.075535
 -1.817632	 -1.044583	  0.084025
 -1.834258	 -1.050906	  0.094645
 -1.851236	 -1.054161	  0.101797
 -1.867378	 -1.061064	  0.112140
 -1.884572	 -1.065784	  0.120249
 -1.900199	 -1.077810	  0.127893
 -1.919395	 -1.085335	  0.134766
 -1.935449	 -1.089827	  0.143653
 -1.950925	 -1.091133	  0.151638
 -1.973176	 -1.088919	  0.160568
 -1.991770	 -1.096970	  0.172433
 -2.002014	 -1.107069	  0.179529
 -2.020515	 -1.114503	  0.187691
 -2.038620	 -1.121676	  0.196208
 -2.052321	 -1.131069	  0.206461
 -2.069465	 -1.137457	  0.215478
 -2.086206	 -1.145112	  0.224133
 -2.103891	 -1.150825	  0.231424
 -2.120656	 -1.158459	  0.239308
 -2.137816	 -1.166810	  0.246636
 -2.153310	 -1.176279	  0.254311
 -2.169062	 -1.186127	  0.264985
 -2.185658	 -1.194661	  0.272181
