 -0.903589	  2.884440	 -0.210793
 -0.894643	  2.855881	 -0.208706
 -0.895630	  2.814497	 -0.199272
 -0.892445	  2.760075	 -0.196511
 -0.896826	  2.709559	 -0.190341
 -0.904186	  2.665036	 -0.187419
 -0.907360	  2.613936	 -0.180085
 -0.910355	  2.568814	 -0.178228
 -0.911007	  2.516348	 -0.174503
 -0.911381	  2.464854	 -0.168612
 -0.912672	  2.418229	 -0.164930
 -0.915873	  2.367028	 -0.162256
 -0.919078	  2.316597	 -0.158636
 -0.920330	  2.266631	 -0.153386
 -0.922061	  2.221651	 -0.150387
 -0.924260	  2.169456	 -0.147001
 -0.926302	  2.124232	 -0.145227
 -0.927221	  2.073162	 -0.141429
 -0.927440	  2.023009	 -0.136746
 -0.928927	  1.976663	 -0.133319
 -0.927677	  1.924398	 -0.129099
 -0.875040	  1.906189	 -0.143648
 -0.716338	  1.838795	 -0.154701
 -0.705915	  1.832614	 -0.164724
 -0.634408	  1.783477	 -0.163715
 -0.626984	  1.729536	 -0.173188
 -0.664697	  1.714510	 -0.077154
 -0.636299	  1.612495	 -0.021092
 -0.626311	  1.571397	  0.023145
 -0.625102	  1.583854	  0.066702
 -0.657372	  1.499868	  0.130993
 -0.703127	  1.358271	  0.104069
 -0.719109	  1.314247	  0.109792
 -0.717924	  1.269193	  0.093046
 -0.643358	  1.171866	  0.077834
 -0.826777	  1.134136	  0.374052
 -0.865121	  1.131765	  0.415769
 -0.903660	  1.126744	  0.406416
 -0.989116	  1.096494	  0.344657
 -0.999013	  0.981399	  0.082136
 -0.976128	  0.928880	 -0.039468
 -0.973600	  0.885159	 -0.051030
 -0.973498	  0.834334	 -0.045880
 -0.975179	  0.788883	 -0.039043
 -0.977500	  0.734662	 -0.032215
 -0.978075	  0.689907	 -0.027287
 -0.980076	  0.636162	 -0.021621
 -0.981140	  0.591411	 -0.017625
 -0.980909	  0.543525	 -0.014625
 -0.981388	  0.492230	 -0.012108
 -0.982375	  0.437686	 -0.009164
 -0.985563	  0.391401	 -0.004908
 -0.989553	  0.342110	  0.001661
 -0.993993	  0.293659	  0.008242
 -0.997005	  0.245473	  0.012624
 -1.000161	  0.191617	  0.015607
 -1.002992	  0.145736	  0.016595
 -1.006279	  0.098793	  0.018241
 -1.009589	  0.048495	  0.020227
 -1.011850	 -0.003628	  0.022796
 -1.013027	 -0.055287	  0.025831
 -1.013953	 -0.103163	  0.029906
 -1.015707	 -0.149550	  0.035259
 -1.016068	 -0.204163	  0.040625
 -1.014956	 -0.251932	  0.044420
 -1.013604	 -0.295098	  0.046188
 -1.013926	 -0.344045	  0.048990
 -1.016918	 -0.392993	  0.052504
 -1.020363	 -0.442748	  0.057818
 -1.023665	 -0.492939	  0.063948
 -1.025257	 -0.544527	  0.068318
 -1.026216	 -0.594016	  0.071948
 -1.028189	 -0.644462	  0.074571
 -1.030804	 -0.695454	  0.078470
 -1.035013	 -0.747660	  0.081864
 -1.038781	 -0.794244	  0.085436
 -1.041983	 -0.842305	  0.088234
 -1.043940	 -0.890559	  0.091062
 -1.046497	 -0.942772	  0.093203
 -1.048962	 -0.992478	  0.095074
 -1.051424	 -1.042469	  0.097786
 -1.052202	 -1.085741	  0.101026
 -1.052410	 -1.137767	  0.105131
 -1.051990	 -1.189686	  0.109897
 -1.053026	 -1.235082	  0.114720
 -1.056901	 -1.290538	  0.121747
 -1.071342	 -1.330292	  0.138948
 -1.181885	 -1.362144	  0.265287
 -1.322288	 -1.409506	  0.421766
 -1.329259	 -1.441783	  0.460436
 -1.333009	 -1.487670	  0.470221
 -1.357533	 -1.549031	  0.474099
 -1.407991	 -1.600405	  0.541958
 -1.440326	 -1.650871	  0.534939
 -1.348500	 -1.703647	  0.532227
 -1.283316	 -1.744376	  0.529415
 -1.427962	 -1.781846	  0.494228
 -1.281051	 -1.856751	  0.395410
 -1.142993	 -1.929368	  0.242249
 -1.090142	 -1.977230	  0.176373
 -1.089548	 -2.026569	  0.178334
 -1.092969	 -2.080754	  0.181115
 -1.091161	 -2.127252	  0.182300
 -1.094958	 -2.174071	  0.187348
 -1.100397	 -2.227795	  0.196065
 -1.093740	 -2.274102	  0.202602
 -1.099240	 -2.325652	  0.201075
 -1.098809	 -2.375054	  0.212108
 -1.100126	 -2.425474	  0.209878
 -1.101977	 -2.470193	  0.218492
 -1.105257	 -2.518730	  0.222882
 -1.106297	 -2.567361	  0.226059
 -1.114112	 -2.622697	  0.224028
 -1.111154	 -2.668302	  0.230706
 -1.110193	 -2.718772	  0.234952
 -1.120467	 -2.772948	  0.235183
 -1.131671	 -2.800678	  0.237535
