 -1.467707	  1.759525	 -0.991392
 -1.474960	  1.776951	 -1.020814
 -1.471060	  1.767080	 -1.003863
 -1.467502	  1.757345	 -0.986759
 -1.463955	  1.747636	 -0.969638
 -1.459410	  1.738458	 -0.952460
 -1.454700	  1.729373	 -0.935276
 -1.449746	  1.720487	 -0.918058
 -1.444006	  1.712269	 -0.900752
 -1.438300	  1.704061	 -0.883441
 -1.433173	  1.695595	 -0.866100
 -1.428404	  1.686916	 -0.848769
 -1.425809	  1.678374	 -0.832730
 -1.429303	  1.666497	 -0.816380
 -1.425929	  1.652114	 -0.796308
 -1.410230	  1.644275	 -0.778319
 -1.399263	  1.637410	 -0.763497
 -1.396446	  1.630265	 -0.751401
 -1.399274	  1.616446	 -0.733495
 -1.391874	  1.607200	 -0.715269
 -1.381621	  1.597597	 -0.697250
 -1.376206	  1.587911	 -0.682906
 -1.370717	  1.577400	 -0.668180
 -1.364740	  1.564348	 -0.651146
 -1.362410	  1.548946	 -0.636091
 -1.362622	  1.533428	 -0.622933
 -1.361661	  1.525209	 -0.612681
 -1.358172	  1.510551	 -0.598365
 -1.361387	  1.491798	 -0.587671
 -1.370092	  1.479855	 -0.570785
 -1.376443	  1.469681	 -0.546336
 -1.377414	  1.462606	 -0.532295
 -1.377533	  1.453379	 -0.518485
 -1.384150	  1.441355	 -0.502062
 -1.395027	  1.433319	 -0.488825
 -1.408252	  1.424500	 -0.475207
 -1.420665	  1.415356	 -0.460909
 -1.430917	  1.409398	 -0.449547
 -1.441394	  1.402375	 -0.434620
 -1.455669	  1.392968	 -0.413779
 -1.461868	  1.389292	 -0.403543
 -1.468330	  1.381683	 -0.383492
 -1.477853	  1.376202	 -0.356872
 -1.484128	  1.375063	 -0.342763
 -1.492194	  1.376065	 -0.326974
 -1.506519	  1.374331	 -0.309306
 -1.527831	  1.367961	 -0.298314
 -1.548158	  1.363316	 -0.288729
 -1.564741	  1.362671	 -0.274697
 -1.574943	  1.362804	 -0.260423
 -1.583161	  1.357489	 -0.241127
 -1.585056	  1.346793	 -0.224436
 -1.591979	  1.339832	 -0.205068
 -1.597299	  1.330853	 -0.187413
 -1.600437	  1.319459	 -0.170856
 -1.602618	  1.306698	 -0.155455
 -1.604077	  1.294256	 -0.139862
 -1.604787	  1.281188	 -0.124944
 -1.603423	  1.266521	 -0.112291
 -1.596379	  1.252152	 -0.100579
 -1.583941	  1.234896	 -0.089514
 -1.580608	  1.217148	 -0.079454
 -1.586891	  1.199728	 -0.068813
 -1.592534	  1.181878	 -0.056083
 -1.588889	  1.166656	 -0.043836
 -1.578523	  1.158040	 -0.035658
 -1.558322	  1.137542	 -0.024042
 -1.551208	  1.116825	 -0.017801
 -1.548260	  1.104895	 -0.014718
 -1.541157	  1.086701	 -0.009705
 -1.526813	  1.071766	 -0.002165
 -1.512668	  1.060069	  0.008279
 -1.499400	  1.048268	  0.018648
 -1.486173	  1.035970	  0.026003
 -1.471779	  1.023969	  0.028311
 -1.457250	  1.010979	  0.034195
 -1.438782	  0.996348	  0.052846
 -1.425062	  0.989360	  0.062256
 -1.409117	  0.984056	  0.071828
 -1.392165	  0.981226	  0.081101
 -1.371286	  0.979000	  0.090306
 -1.354229	  0.975465	  0.099793
 -1.340012	  0.972946	  0.108902
 -1.322749	  0.973425	  0.123671
 -1.305236	  0.975769	  0.137402
 -1.286241	  0.978839	  0.153676
 -1.272843	  0.979838	  0.163024
 -1.263807	  0.979091	  0.174645
 -1.246632	  0.975880	  0.192383
 -1.234505	  0.971452	  0.212952
 -1.228636	  0.970823	  0.227627
 -1.222936	  0.972839	  0.241250
 -1.205623	  0.976908	  0.261075
 -1.193920	  0.978069	  0.280377
 -1.186490	  0.979398	  0.291862
 -1.180544	  0.980951	  0.314503
 -1.174708	  0.984960	  0.337567
 -1.168992	  0.987418	  0.347561
 -1.159243	  0.987648	  0.370523
 -1.150240	  0.989106	  0.386793
 -1.138376	  0.984468	  0.407869
 -1.130251	  0.983624	  0.422896
 -1.123864	  0.982880	  0.436849
 -1.109042	  0.980230	  0.460111
 -1.099224	  0.976497	  0.475255
 -1.093215	  0.970016	  0.487044
 -1.084509	  0.961943	  0.504693
 -1.070905	  0.946594	  0.524848
 -1.060700	  0.937121	  0.541995
 -1.052036	  0.934147	  0.551202
 -1.041208	  0.922371	  0.568877
 -1.037330	  0.907783	  0.584659
 -1.035599	  0.893915	  0.598626
 -1.039842	  0.868139	  0.615880
 -1.039490	  0.856103	  0.626411
 -1.037986	  0.844750	  0.632958
 -1.034541	  0.823921	  0.651104
 -1.036257	  0.811894	  0.662262
 -1.035821	  0.801636	  0.672191
 -1.037810	  0.782978	  0.691327
 -1.040889	  0.764360	  0.710395
 -1.042425	  0.754594	  0.717962
 -1.048020	  0.739409	  0.728311
 -1.050950	  0.719666	  0.739503
 -1.052981	  0.702117	  0.751743
 -1.059053	  0.685899	  0.763760
 -1.067515	  0.672953	  0.776344
 -1.077825	  0.655594	  0.786519
 -1.079831	  0.637128	  0.793415
 -1.072983	  0.623779	  0.807309
 -1.063372	  0.611401	  0.820802
 -1.057234	  0.598381	  0.832076
 -1.051820	  0.579740	  0.857623
 -1.049376	  0.572450	  0.869757
 -1.048076	  0.568008	  0.881779
 -1.041310	  0.559770	  0.903545
 -1.035027	  0.549225	  0.922126
 -1.031134	  0.538303	  0.935797
 -1.024231	  0.523819	  0.952666
 -1.015527	  0.514686	  0.967592
 -1.008517	  0.509546	  0.980377
 -0.995934	  0.503601	  1.003258
 -0.989261	  0.500116	  1.016574
 -0.980353	  0.493787	  1.032660
 -0.970704	  0.485423	  1.051105
 -0.962572	  0.483716	  1.070723
 -0.954234	  0.484133	  1.087343
 -0.940589	  0.490928	  1.108049
 -0.932059	  0.502315	  1.122794
 -0.927578	  0.512871	  1.137200
 -0.918978	  0.523193	  1.161584
 -0.909885	  0.527389	  1.176116
 -0.901835	  0.530799	  1.186044
 -0.887148	  0.538374	  1.202010
 -0.872473	  0.549581	  1.215741
 -0.861774	  0.557688	  1.228405
 -0.854432	  0.564701	  1.244855
 -0.844880	  0.571607	  1.262342
 -0.835623	  0.576569	  1.278719
 -0.828532	  0.580191	  1.296092
 -0.821807	  0.584784	  1.319218
 -0.816037	  0.594313	  1.338304
 -0.807752	  0.603153	  1.354170
 -0.797079	  0.604342	  1.363541
 -0.782551	  0.595259	  1.378000
 -0.774138	  0.583728	  1.394044
 -0.764448	  0.578282	  1.412533
 -0.755811	  0.578842	  1.436630
 -0.751445	  0.576780	  1.456125
 -0.750485	  0.575229	  1.469442
 -0.750127	  0.571882	  1.494451
 -0.746036	  0.567177	  1.512000
 -0.740298	  0.561233	  1.528717
 -0.731985	  0.554614	  1.549531
 -0.726711	  0.550513	  1.564573
 -0.718888	  0.547913	  1.584580
 -0.710282	  0.544026	  1.607231
 -0.705429	  0.543031	  1.622936
 -0.700227	  0.534236	  1.641796
 -0.698471	  0.524927	  1.658384
 -0.693552	  0.517287	  1.677043
 -0.688184	  0.506717	  1.694530
 -0.682685	  0.501412	  1.710197
 -0.676141	  0.493491	  1.733842
 -0.670386	  0.488453	  1.746826
 -0.662705	  0.481676	  1.759782
 -0.653442	  0.468342	  1.779346
 -0.647020	  0.460935	  1.798835
 -0.639701	  0.458208	  1.816055
 -0.633058	  0.452505	  1.839776
 -0.631299	  0.445186	  1.862363
 -0.634378	  0.442037	  1.875786
 -0.639072	  0.435153	  1.896527
 -0.644212	  0.428395	  1.914369
 -0.644917	  0.420991	  1.933975
 -0.643425	  0.415024	  1.953701
 -0.643300	  0.409074	  1.972610
 -0.642199	  0.402283	  1.991561
 -0.640866	  0.394150	  2.009745
 -0.639693	  0.385811	  2.028014
 -0.638374	  0.377844	  2.046317
 -0.637424	  0.367142	  2.063181
 -0.636527	  0.356022	  2.079780
 -0.634788	  0.344889	  2.096301
 -0.631192	  0.333806	  2.112554
 -0.627545	  0.322732	  2.128804
 -0.622813	  0.311906	  2.144937
 -0.616332	  0.301560	  2.160779
 -0.609843	  0.291271	  2.176649
 -0.604805	  0.283122	  2.194196
 -0.600614	  0.276219	  2.212494
 -0.596502	  0.269666	  2.230932
 -0.593064	  0.265249	  2.250126
 -0.589599	  0.260885	  2.269331
 -0.584169	  0.254337	  2.287418
 -0.576729	  0.245547	  2.303765
 -0.570162	  0.237023	  2.320606
 -0.567474	  0.230113	  2.339162
 -0.564888	  0.223261	  2.357770
 -0.560678	  0.218702	  2.376776
 -0.555446	  0.215697	  2.395846
 -0.550193	  0.212700	  2.414949
 -0.544703	  0.209528	  2.434854
 -0.538101	  0.205068	  2.457860
 -0.532479	  0.200635	  2.476534
