 -0.811188	  2.228775	  0.697016
 -0.811303	  2.229160	  0.697337
 -0.804807	  2.218028	  0.683532
 -0.803311	  2.209214	  0.664598
 -0.794514	  2.195685	  0.644424
 -0.790857	  2.182094	  0.630780
 -0.792231	  2.167770	  0.616939
 -0.794677	  2.152549	  0.604686
 -0.793377	  2.134518	  0.595451
 -0.790290	  2.114903	  0.591503
 -0.785061	  2.091643	  0.591227
 -0.778124	  2.067380	  0.582323
 -0.775161	  2.047678	  0.564448
 -0.774683	  2.040134	  0.554279
 -0.774637	  2.028139	  0.541546
 -0.778085	  2.012741	  0.522373
 -0.782907	  1.995637	  0.505111
 -0.783659	  1.977878	  0.490979
 -0.781204	  1.967280	  0.481074
 -0.771731	  1.952155	  0.466469
 -0.755906	  1.934613	  0.451423
 -0.744872	  1.924721	  0.441345
 -0.733373	  1.917608	  0.433196
 -0.714581	  1.905279	  0.423304
 -0.696051	  1.887296	  0.411089
 -0.691338	  1.879903	  0.403711
 -0.684545	  1.865847	  0.390596
 -0.681478	  1.844856	  0.373179
 -0.680473	  1.825076	  0.363579
 -0.677010	  1.810224	  0.358512
 -0.667773	  1.780242	  0.348430
 -0.666631	  1.760580	  0.344828
 -0.667764	  1.742844	  0.337211
 -0.662444	  1.726938	  0.331662
 -0.650613	  1.709463	  0.329112
 -0.636372	  1.688981	  0.330039
 -0.624778	  1.674330	  0.337460
 -0.627079	  1.650673	  0.341396
 -0.602304	  1.640043	  0.345435
 -0.612244	  1.618601	  0.344479
 -0.597554	  1.605020	  0.344856
 -0.593293	  1.577484	  0.344204
 -0.581535	  1.563814	  0.336789
 -0.590116	  1.539482	  0.337753
 -0.583939	  1.523761	  0.328890
 -0.578195	  1.511424	  0.326266
 -0.571588	  1.485450	  0.323803
 -0.568530	  1.465506	  0.325219
 -0.566830	  1.452922	  0.322522
 -0.565790	  1.428953	  0.319462
 -0.565354	  1.409088	  0.317203
 -0.560743	  1.391325	  0.312195
 -0.558960	  1.370567	  0.308984
 -0.560832	  1.351075	  0.296202
 -0.548867	  1.334285	  0.299979
 -0.549517	  1.311492	  0.285705
 -0.539379	  1.295624	  0.291855
 -0.544784	  1.276333	  0.279875
 -0.536461	  1.251245	  0.276075
 -0.543461	  1.232532	  0.267699
 -0.543450	  1.217390	  0.262292
 -0.540830	  1.201436	  0.263611
 -0.536132	  1.177915	  0.261873
 -0.532887	  1.154582	  0.263171
 -0.530591	  1.137441	  0.262142
 -0.529618	  1.119265	  0.257196
 -0.530304	  1.102135	  0.247271
 -0.530253	  1.084277	  0.237096
 -0.529851	  1.061615	  0.225707
 -0.531470	  1.049062	  0.214346
 -0.531248	  1.030132	  0.203383
 -0.532256	  1.016116	  0.192846
 -0.534588	  0.997409	  0.180375
 -0.534389	  0.977364	  0.172650
 -0.534337	  0.965495	  0.159672
 -0.534630	  0.951440	  0.138144
 -0.535587	  0.944012	  0.125741
 -0.535501	  0.936329	  0.108199
 -0.530523	  0.916843	  0.093200
 -0.526262	  0.899311	  0.083129
 -0.519225	  0.880722	  0.075520
 -0.513308	  0.867293	  0.064954
 -0.512838	  0.854631	  0.046864
 -0.511416	  0.844513	  0.029804
 -0.512098	  0.832158	  0.014595
 -0.514542	  0.819182	 -0.003397
 -0.513974	  0.810421	 -0.023615
 -0.508200	  0.806268	 -0.041164
 -0.502233	  0.800191	 -0.056585
 -0.493688	  0.786752	 -0.080175
 -0.487673	  0.782759	 -0.097092
 -0.482870	  0.781595	 -0.113054
 -0.477940	  0.777971	 -0.135156
 -0.477009	  0.770119	 -0.148260
 -0.476203	  0.757438	 -0.164299
 -0.469918	  0.747893	 -0.196647
 -0.464042	  0.746885	 -0.209694
 -0.453850	  0.745025	 -0.223482
 -0.437729	  0.743515	 -0.243619
 -0.428394	  0.743099	 -0.263933
 -0.424476	  0.742344	 -0.280069
 -0.422057	  0.741257	 -0.298894
 -0.420183	  0.740701	 -0.320891
 -0.417911	  0.741234	 -0.339930
 -0.415662	  0.740784	 -0.358634
 -0.413346	  0.738903	 -0.380277
 -0.411096	  0.738204	 -0.400242
 -0.409335	  0.736270	 -0.417105
 -0.403658	  0.733080	 -0.438307
 -0.394649	  0.727519	 -0.457403
 -0.390356	  0.724289	 -0.466651
 -0.383317	  0.708009	 -0.484268
 -0.380794	  0.693314	 -0.498988
 -0.378988	  0.684726	 -0.506254
 -0.372414	  0.663560	 -0.526159
 -0.373771	  0.644325	 -0.542049
 -0.367431	  0.645475	 -0.546463
 -0.368615	  0.630880	 -0.564786
 -0.365176	  0.613560	 -0.585202
 -0.366044	  0.602248	 -0.595184
 -0.371146	  0.579875	 -0.608023
 -0.372837	  0.564531	 -0.614004
 -0.374649	  0.549249	 -0.617468
 -0.368897	  0.530453	 -0.622522
 -0.360192	  0.514968	 -0.634507
 -0.346942	  0.492353	 -0.653307
 -0.340953	  0.475800	 -0.664708
 -0.338507	  0.465269	 -0.671420
 -0.337135	  0.448480	 -0.680726
 -0.339621	  0.422591	 -0.689569
 -0.340147	  0.405724	 -0.694824
 -0.338669	  0.389363	 -0.702120
 -0.335227	  0.370559	 -0.711958
 -0.328910	  0.353943	 -0.723117
 -0.318063	  0.337069	 -0.737539
 -0.310090	  0.327224	 -0.748263
 -0.296341	  0.312877	 -0.763887
 -0.286109	  0.297847	 -0.775987
 -0.281846	  0.287241	 -0.782243
 -0.277444	  0.271405	 -0.791006
 -0.271199	  0.242463	 -0.802311
 -0.268760	  0.227635	 -0.805471
 -0.265538	  0.208455	 -0.809752
 -0.260651	  0.195002	 -0.814880
 -0.248232	  0.175927	 -0.825315
 -0.237907	  0.156651	 -0.833855
 -0.231516	  0.143649	 -0.837246
 -0.223442	  0.126383	 -0.841134
 -0.218224	  0.111763	 -0.849424
 -0.214003	  0.098658	 -0.859271
 -0.201539	  0.071368	 -0.876318
 -0.187665	  0.053837	 -0.894444
 -0.181345	  0.044065	 -0.898721
 -0.178232	  0.040575	 -0.902074
 -0.174038	  0.025180	 -0.916405
 -0.169246	  0.011332	 -0.926129
 -0.165787	 -0.009155	 -0.939340
 -0.164196	 -0.024022	 -0.954000
 -0.161159	 -0.037610	 -0.977216
 -0.159761	 -0.048607	 -0.994505
 -0.159937	 -0.059175	 -1.012137
 -0.160645	 -0.062710	 -1.024608
 -0.160138	 -0.070140	 -1.048092
 -0.159316	 -0.075373	 -1.068538
 -0.158184	 -0.077452	 -1.083391
 -0.156367	 -0.083539	 -1.106051
 -0.153825	 -0.092590	 -1.123908
 -0.151678	 -0.101103	 -1.139063
 -0.149636	 -0.112930	 -1.155018
 -0.148664	 -0.127736	 -1.176359
 -0.144724	 -0.139133	 -1.192564
 -0.141943	 -0.149577	 -1.211023
 -0.141353	 -0.160175	 -1.223834
 -0.140158	 -0.170301	 -1.233386
 -0.137797	 -0.189775	 -1.250685
 -0.130865	 -0.204259	 -1.263032
 -0.124991	 -0.216086	 -1.274542
 -0.122180	 -0.226585	 -1.291140
 -0.121391	 -0.236452	 -1.309762
 -0.123848	 -0.247215	 -1.328851
 -0.126540	 -0.257678	 -1.346974
 -0.123495	 -0.270206	 -1.364378
 -0.112631	 -0.285222	 -1.376496
 -0.100180	 -0.305305	 -1.381157
 -0.090365	 -0.328118	 -1.383669
 -0.085273	 -0.346593	 -1.389431
 -0.082316	 -0.361106	 -1.397002
 -0.077932	 -0.376786	 -1.408636
 -0.074086	 -0.391849	 -1.421408
 -0.070579	 -0.409903	 -1.437803
 -0.067634	 -0.422343	 -1.452398
 -0.063225	 -0.431878	 -1.471799
 -0.055269	 -0.440260	 -1.490720
 -0.046721	 -0.451170	 -1.505451
 -0.039806	 -0.464411	 -1.519263
 -0.035938	 -0.476514	 -1.529750
 -0.031581	 -0.494124	 -1.539183
 -0.023776	 -0.517782	 -1.552818
 -0.017244	 -0.529120	 -1.557776
 -0.003642	 -0.546746	 -1.560599
  0.010601	 -0.568566	 -1.569046
  0.016802	 -0.584209	 -1.580605
  0.020411	 -0.598848	 -1.592643
  0.022092	 -0.608572	 -1.603732
  0.023792	 -0.617913	 -1.618886
  0.031187	 -0.639352	 -1.643327
  0.036132	 -0.649574	 -1.648861
  0.043884	 -0.663727	 -1.656958
  0.051274	 -0.682248	 -1.666298
  0.054229	 -0.702191	 -1.680394
  0.057270	 -0.720031	 -1.689697
  0.059030	 -0.737512	 -1.697966
  0.059598	 -0.758065	 -1.706466
  0.061117	 -0.776737	 -1.713848
  0.062205	 -0.789427	 -1.718192
  0.064121	 -0.806719	 -1.725241
  0.062526	 -0.832193	 -1.744951
  0.061690	 -0.845150	 -1.756811
  0.060306	 -0.859321	 -1.767844
  0.057320	 -0.875091	 -1.778332
  0.058223	 -0.891283	 -1.791674
  0.060658	 -0.905559	 -1.802434
  0.062816	 -0.926285	 -1.813781
  0.067139	 -0.943039	 -1.824581
  0.070693	 -0.956564	 -1.833748
  0.077358	 -0.970440	 -1.845666
  0.089426	 -0.990300	 -1.864781
  0.095569	 -0.998942	 -1.873912
  0.106652	 -1.011919	 -1.890270
  0.114107	 -1.022239	 -1.903573
  0.119838	 -1.038029	 -1.915043
  0.125412	 -1.062107	 -1.926095
  0.126223	 -1.082238	 -1.929470
  0.125031	 -1.096757	 -1.931225
  0.126492	 -1.116099	 -1.941778
  0.131553	 -1.133187	 -1.954238
  0.136416	 -1.148655	 -1.966048
  0.140887	 -1.163910	 -1.978186
  0.145354	 -1.179156	 -1.990335
  0.149718	 -1.193870	 -2.003159
  0.154072	 -1.208536	 -2.016041
  0.158500	 -1.223119	 -2.028992
  0.163320	 -1.237232	 -2.042318
  0.168144	 -1.251337	 -2.055651
  0.172963	 -1.265113	 -2.069325
  0.177752	 -1.278008	 -2.083842
  0.182543	 -1.290897	 -2.098372
  0.187366	 -1.303867	 -2.112999
  0.192450	 -1.317017	 -2.128221
  0.197994	 -1.328377	 -2.143720
