 -2.088274	  1.132832	 -0.882668
 -2.091874	  1.132092	 -0.884594
 -2.074521	  1.135659	 -0.875313
 -2.057161	  1.139209	 -0.866038
 -2.039447	  1.141861	 -0.857141
 -2.021574	  1.144027	 -0.848473
 -2.004338	  1.146489	 -0.840150
 -1.987551	  1.150581	 -0.832743
 -1.968895	  1.158055	 -0.826785
 -1.942794	  1.158401	 -0.814689
 -1.930408	  1.152809	 -0.805510
 -1.917568	  1.146837	 -0.794724
 -1.896923	  1.144088	 -0.782143
 -1.879323	  1.147351	 -0.775812
 -1.860985	  1.151994	 -0.768771
 -1.842391	  1.152995	 -0.759255
 -1.826161	  1.156306	 -0.752018
 -1.806280	  1.162891	 -0.744605
 -1.787685	  1.163101	 -0.734718
 -1.773857	  1.161675	 -0.725920
 -1.750020	  1.164374	 -0.714495
 -1.734606	  1.163958	 -0.705768
 -1.721376	  1.162715	 -0.696101
 -1.702296	  1.162925	 -0.682817
 -1.684807	  1.169447	 -0.676448
 -1.668293	  1.176163	 -0.672826
 -1.641065	  1.179438	 -0.665849
 -1.621620	  1.184920	 -0.658694
 -1.609908	  1.188045	 -0.654798
 -1.595980	  1.201825	 -0.645678
 -1.586301	  1.215764	 -0.636447
 -1.576084	  1.232402	 -0.631087
 -1.569872	  1.250828	 -0.626945
 -1.563779	  1.267018	 -0.619993
 -1.554944	  1.280899	 -0.612579
 -1.544580	  1.298937	 -0.607138
 -1.530903	  1.312563	 -0.604561
 -1.519427	  1.329911	 -0.602080
 -1.512927	  1.348997	 -0.599241
 -1.507539	  1.368060	 -0.596348
 -1.502313	  1.387174	 -0.593417
 -1.497480	  1.406371	 -0.590523
 -1.492961	  1.425627	 -0.587390
 -1.488358	  1.444837	 -0.584109
 -1.483223	  1.463757	 -0.580509
 -1.476845	  1.482442	 -0.577843
 -1.471160	  1.501584	 -0.576749
 -1.463128	  1.516348	 -0.573266
 -1.457738	  1.520236	 -0.562234
 -1.445906	  1.526759	 -0.543263
 -1.428741	  1.529048	 -0.533869
 -1.407543	  1.529013	 -0.528571
 -1.380472	  1.526053	 -0.521359
 -1.370295	  1.525373	 -0.520057
 -1.350609	  1.526022	 -0.514052
 -1.325287	  1.524970	 -0.506627
 -1.309937	  1.520448	 -0.501199
 -1.293455	  1.513232	 -0.489544
 -1.279190	  1.509339	 -0.478158
 -1.262357	  1.504913	 -0.468739
 -1.239002	  1.500656	 -0.458132
 -1.222906	  1.501939	 -0.448517
 -1.208791	  1.503536	 -0.438987
 -1.193776	  1.502137	 -0.427664
 -1.173947	  1.499825	 -0.418099
 -1.156350	  1.497826	 -0.408762
 -1.138636	  1.495841	 -0.401057
 -1.119636	  1.493787	 -0.396509
 -1.101457	  1.491837	 -0.397115
 -1.083207	  1.490216	 -0.394436
 -1.064260	  1.488638	 -0.395119
 -1.042675	  1.486676	 -0.392759
 -1.023309	  1.484835	 -0.391286
 -1.003418	  1.482588	 -0.386506
 -0.985824	  1.481517	 -0.379026
 -0.964641	  1.479584	 -0.365630
 -0.945566	  1.476553	 -0.358228
 -0.929828	  1.473345	 -0.356806
 -0.908912	  1.469885	 -0.358657
 -0.890138	  1.466808	 -0.352829
 -0.871796	  1.464121	 -0.340937
 -0.854670	  1.463416	 -0.328897
 -0.831503	  1.463503	 -0.320111
 -0.810430	  1.463290	 -0.319110
 -0.793379	  1.461160	 -0.320158
 -0.772129	  1.457808	 -0.315665
 -0.753506	  1.450911	 -0.304787
 -0.741540	  1.443296	 -0.290909
 -0.728914	  1.438789	 -0.276592
 -0.712572	  1.434404	 -0.261885
 -0.698216	  1.425578	 -0.250957
 -0.686132	  1.416499	 -0.238431
 -0.675674	  1.410308	 -0.225519
 -0.659912	  1.406852	 -0.209280
 -0.644399	  1.402074	 -0.198133
 -0.628423	  1.393344	 -0.184138
 -0.612664	  1.398549	 -0.183565
 -0.601059	  1.390588	 -0.173696
 -0.575778	  1.388159	 -0.160631
 -0.567470	  1.373188	 -0.145139
 -0.545389	  1.380110	 -0.134670
 -0.523265	  1.379498	 -0.120036
 -0.507979	  1.372044	 -0.104794
 -0.489469	  1.377513	 -0.095328
 -0.470477	  1.385041	 -0.090242
 -0.451624	  1.391985	 -0.085147
 -0.432314	  1.398697	 -0.083177
 -0.412824	  1.404629	 -0.081651
 -0.393140	  1.410393	 -0.081009
 -0.374521	  1.415221	 -0.081460
 -0.354245	  1.420250	 -0.081418
 -0.334795	  1.425129	 -0.079934
 -0.313582	  1.430378	 -0.080016
 -0.298077	  1.433790	 -0.082086
 -0.283560	  1.436419	 -0.081393
 -0.259209	  1.442897	 -0.082155
 -0.241631	  1.448084	 -0.084634
 -0.222788	  1.455262	 -0.082390
 -0.203162	  1.462732	 -0.077395
 -0.186165	  1.472479	 -0.067440
 -0.170766	  1.480275	 -0.058038
 -0.153088	  1.486690	 -0.054091
 -0.133509	  1.496792	 -0.049904
 -0.110758	  1.509169	 -0.032541
 -0.103642	  1.513730	 -0.023385
 -0.091618	  1.517299	 -0.007882
 -0.074717	  1.521321	  0.005974
 -0.059678	  1.522212	  0.020095
 -0.042911	  1.518852	  0.032077
 -0.024605	  1.513552	  0.039990
 -0.004599	  1.512126	  0.047800
  0.015065	  1.511387	  0.053721
  0.034481	  1.510281	  0.060127
  0.050931	  1.511563	  0.064670
  0.074120	  1.509341	  0.070912
  0.089920	  1.510161	  0.074847
  0.108672	  1.512307	  0.080458
  0.130111	  1.512239	  0.085708
  0.149766	  1.514042	  0.090671
  0.164839	  1.518287	  0.094767
  0.184314	  1.523791	  0.099733
  0.205506	  1.524128	  0.105023
  0.220121	  1.530552	  0.109226
  0.240650	  1.535845	  0.114858
  0.258425	  1.541409	  0.120117
  0.274454	  1.550379	  0.125413
  0.290356	  1.558828	  0.132111
  0.307638	  1.566659	  0.142057
  0.324025	  1.574381	  0.153273
  0.338940	  1.582307	  0.163857
  0.354344	  1.588461	  0.174388
  0.374156	  1.593270	  0.188970
  0.383114	  1.593713	  0.201494
  0.395671	  1.593594	  0.218184
  0.421718	  1.602499	  0.223893
  0.432568	  1.599749	  0.234103
  0.449555	  1.598729	  0.252650
  0.471085	  1.601164	  0.257720
  0.487349	  1.594123	  0.269392
  0.504665	  1.590002	  0.276799
  0.524632	  1.583852	  0.286397
  0.535264	  1.579726	  0.291977
  0.556010	  1.578452	  0.293297
  0.575897	  1.571276	  0.302675
  0.588400	  1.565568	  0.310111
  0.606390	  1.559429	  0.321567
  0.621436	  1.554724	  0.332299
  0.636369	  1.551319	  0.344663
  0.651472	  1.550060	  0.360932
  0.658202	  1.546524	  0.377868
  0.662359	  1.540964	  0.395771
  0.668161	  1.540030	  0.405658
  0.671501	  1.533325	  0.426164
  0.680074	  1.531161	  0.439281
  0.686690	  1.525715	  0.456422
  0.691010	  1.517534	  0.476097
  0.696990	  1.510404	  0.493233
  0.702692	  1.502492	  0.511534
  0.709679	  1.497035	  0.528887
  0.717654	  1.488993	  0.545859
  0.724680	  1.479311	  0.564872
  0.732554	  1.472369	  0.581106
  0.743115	  1.464206	  0.599391
  0.750991	  1.454685	  0.614100
  0.758849	  1.447706	  0.628692
  0.770207	  1.440376	  0.647367
  0.773195	  1.433727	  0.660871
  0.780828	  1.426771	  0.676004
  0.789723	  1.418506	  0.692909
  0.796519	  1.411278	  0.706985
  0.797475	  1.401667	  0.725387
  0.798866	  1.391925	  0.744852
  0.820356	  1.401993	  0.758522
  0.822581	  1.405873	  0.753435
  0.837258	  1.416014	  0.748627
  0.851362	  1.427831	  0.745319
  0.859948	  1.434760	  0.743954
  0.875182	  1.446826	  0.737002
  0.892154	  1.457217	  0.728532
  0.908238	  1.466527	  0.719901
  0.924125	  1.475732	  0.711209
  0.940047	  1.485067	  0.702081
  0.955379	  1.493643	  0.693122
  0.971681	  1.502222	  0.683944
  0.989550	  1.506737	  0.678771
  1.007744	  1.514014	  0.670657
  1.024220	  1.517814	  0.664792
  1.041303	  1.524129	  0.655070
  1.058607	  1.528265	  0.647980
  1.076755	  1.530489	  0.642749
  1.096654	  1.532716	  0.637025
  1.115904	  1.534744	  0.631222
  1.135327	  1.536372	  0.625164
  1.154029	  1.538062	  0.619958
  1.173702	  1.539996	  0.614015
  1.194523	  1.542293	  0.611833
  1.214973	  1.543020	  0.613964
  1.234302	  1.543272	  0.610710
  1.257235	  1.539457	  0.617189
  1.283715	  1.541234	  0.626799
  1.297172	  1.544194	  0.630671
  1.313638	  1.547061	  0.633743
  1.335662	  1.548846	  0.639039
  1.354124	  1.554103	  0.643155
  1.377738	  1.561532	  0.647802
  1.396272	  1.560197	  0.657012
  1.410761	  1.553867	  0.665973
  1.430494	  1.548211	  0.677286
  1.448405	  1.550287	  0.685445
  1.465397	  1.558607	  0.690051
  1.487630	  1.566935	  0.699045
  1.506087	  1.567086	  0.713731
  1.517481	  1.563958	  0.724363
  1.533153	  1.559317	  0.732087
  1.554977	  1.556311	  0.737158
  1.574176	  1.555038	  0.742385
  1.593625	  1.554608	  0.746771
  1.612358	  1.555513	  0.753482
  1.631219	  1.556368	  0.760181
  1.650352	  1.556588	  0.765950
  1.669084	  1.557243	  0.773590
  1.688192	  1.558500	  0.779388
  1.707202	  1.559990	  0.786703
  1.726147	  1.561328	  0.793114
  1.744346	  1.562187	  0.801366
  1.763493	  1.563124	  0.807539
  1.782439	  1.564943	  0.814498
  1.800999	  1.567514	  0.823688
  1.818870	  1.570523	  0.833927
  1.832006	  1.572912	  0.851428
  1.851190	  1.576271	  0.855975
