  2.094084	 -0.406085	  2.151931
  2.073350	 -0.402064	  2.130625
  2.062984	 -0.445566	  2.112148
  2.039749	 -0.484788	  2.094291
  2.010551	 -0.520128	  2.076365
  1.978973	 -0.553913	  2.058412
  1.947310	 -0.587455	  2.039744
  1.915901	 -0.620885	  2.020473
  1.884816	 -0.654109	  2.000859
  1.853900	 -0.687170	  1.981510
  1.822451	 -0.720379	  1.963587
  1.789587	 -0.753874	  1.947241
  1.756094	 -0.787799	  1.930957
  1.722957	 -0.822105	  1.913003
  1.690830	 -0.856461	  1.893202
  1.660275	 -0.890515	  1.871437
  1.631234	 -0.924740	  1.848356
  1.603418	 -0.959134	  1.824291
  1.576616	 -0.993199	  1.799118
  1.550409	 -1.027242	  1.773409
  1.524558	 -1.061086	  1.746609
  1.497957	 -1.093766	  1.718623
  1.470555	 -1.124841	  1.689795
  1.442570	 -1.154301	  1.660757
  1.414274	 -1.182776	  1.631745
  1.385914	 -1.210286	  1.602797
  1.356969	 -1.237468	  1.574369
  1.327281	 -1.264649	  1.546993
  1.296626	 -1.291769	  1.520536
  1.264275	 -1.318926	  1.495036
  1.229929	 -1.347110	  1.470954
  1.195511	 -1.376246	  1.447937
  1.162128	 -1.406494	  1.425044
  1.129800	 -1.437349	  1.401780
  1.098459	 -1.469022	  1.378451
  1.067793	 -1.501309	  1.355142
  1.037769	 -1.534326	  1.332303
  1.008410	 -1.568136	  1.310207
  0.979873	 -1.602981	  1.288687
  0.952698	 -1.638722	  1.268078
  0.926101	 -1.676122	  1.248495
  0.900020	 -1.714514	  1.229805
  0.874841	 -1.753832	  1.211718
  0.850449	 -1.793812	  1.193269
  0.826548	 -1.833989	  1.173971
  0.802772	 -1.873775	  1.153329
  0.778665	 -1.912435	  1.131589
  0.753919	 -1.949621	  1.108570
  0.728701	 -1.984708	  1.084494
  0.702909	 -2.018517	  1.059662
  0.676421	 -2.051344	  1.034212
  0.649303	 -2.083562	  1.008279
  0.620982	 -2.115267	  0.981869
  0.591690	 -2.146439	  0.955295
  0.561811	 -2.177879	  0.928464
  0.530534	 -2.208205	  0.901865
  0.498141	 -2.237561	  0.875935
  0.466008	 -2.267137	  0.851232
  0.434010	 -2.296788	  0.827544
  0.402302	 -2.326454	  0.804517
  0.370686	 -2.356181	  0.781929
  0.339081	 -2.386052	  0.759499
  0.307402	 -2.416176	  0.737313
  0.275421	 -2.446944	  0.715336
  0.243150	 -2.477827	  0.692970
  0.210608	 -2.508238	  0.670275
  0.177130	 -2.538319	  0.647523
  0.143583	 -2.568083	  0.624262
  0.110327	 -2.598010	  0.601049
  0.078066	 -2.628674	  0.578961
  0.046930	 -2.659666	  0.555976
  0.020131	 -2.696135	  0.536016
 -0.000361	 -2.732374	  0.509285
 -0.027864	 -2.767809	  0.488268
 -0.056804	 -2.802875	  0.467592
 -0.081893	 -2.835087	  0.437986
 -0.117361	 -2.866349	  0.418748
 -0.145369	 -2.904701	  0.397991
 -0.174081	 -2.938183	  0.369292
 -0.206750	 -2.972830	  0.345744
 -0.208817	 -3.002558	  0.349201
