  0.983726	  1.549130	 -2.411095
  0.973986	  1.533792	 -2.387223
  0.960310	  1.516221	 -2.341765
  0.948573	  1.489732	 -2.300121
  0.934454	  1.458430	 -2.262880
  0.916060	  1.428046	 -2.227159
  0.897530	  1.397197	 -2.192082
  0.877743	  1.364327	 -2.159492
  0.858369	  1.329525	 -2.128964
  0.837769	  1.296327	 -2.097663
  0.815896	  1.264720	 -2.065765
  0.793298	  1.234477	 -2.034177
  0.769863	  1.205685	 -2.003943
  0.745241	  1.177773	 -1.977718
  0.718983	  1.150152	 -1.959160
  0.694154	  1.123631	 -1.948395
  0.674837	  1.101223	 -1.941442
  0.660359	  1.087679	 -1.941066
  0.658269	  1.088873	 -1.945037
  0.675312	  1.108057	 -1.953446
  0.723044	  1.135206	 -1.955804
  0.803041	  1.158537	 -1.944860
  0.899178	  1.158962	 -1.897494
  0.980122	  1.137398	 -1.806937
  1.019795	  1.105680	 -1.681747
  1.017248	  1.077224	 -1.534296
  0.983409	  1.062224	 -1.375808
  0.917595	  1.051045	 -1.232966
  0.821014	  1.016863	 -1.129387
  0.723798	  0.963075	 -1.074782
  0.645387	  0.911267	 -1.043628
  0.583987	  0.868063	 -1.017475
  0.537838	  0.821257	 -1.009039
  0.497978	  0.770952	 -1.005546
  0.460149	  0.714853	 -1.003753
  0.420784	  0.656224	 -0.995550
  0.380726	  0.595906	 -0.983030
  0.343892	  0.535608	 -0.971058
  0.310497	  0.479921	 -0.958596
  0.281138	  0.430048	 -0.946221
  0.256330	  0.386150	 -0.934341
  0.234862	  0.346849	 -0.922019
  0.214899	  0.309843	 -0.907749
  0.195573	  0.273032	 -0.890670
  0.176689	  0.236125	 -0.870532
  0.158494	  0.198904	 -0.847414
  0.140786	  0.161933	 -0.821366
  0.123152	  0.125493	 -0.792631
  0.105335	  0.089890	 -0.761560
  0.087246	  0.055606	 -0.728770
  0.068486	  0.022930	 -0.694465
  0.049373	 -0.007876	 -0.659195
  0.030148	 -0.036628	 -0.623432
  0.010557	 -0.064319	 -0.586874
 -0.009188	 -0.090932	 -0.549799
 -0.029025	 -0.117041	 -0.512616
 -0.048844	 -0.143302	 -0.475630
 -0.068488	 -0.170053	 -0.439252
 -0.088853	 -0.197845	 -0.402523
 -0.109518	 -0.225906	 -0.366056
 -0.130301	 -0.253544	 -0.330638
 -0.152087	 -0.281521	 -0.295353
 -0.175176	 -0.309941	 -0.260844
 -0.199713	 -0.338193	 -0.226953
 -0.224660	 -0.365837	 -0.193773
 -0.249925	 -0.393213	 -0.160129
 -0.274563	 -0.420082	 -0.125792
 -0.297764	 -0.446808	 -0.090786
 -0.319549	 -0.474542	 -0.055223
 -0.339407	 -0.503541	 -0.019542
 -0.357025	 -0.533937	  0.016044
 -0.372587	 -0.565167	  0.051876
 -0.386544	 -0.596675	  0.087864
 -0.399632	 -0.628189	  0.124133
 -0.412203	 -0.659871	  0.160448
 -0.424326	 -0.691742	  0.196734
 -0.436052	 -0.723758	  0.232923
 -0.447263	 -0.756088	  0.268670
 -0.458126	 -0.789109	  0.303886
 -0.469185	 -0.823290	  0.338882
 -0.480673	 -0.860086	  0.375016
 -0.492678	 -0.900647	  0.413733
 -0.505891	 -0.944425	  0.454852
 -0.520512	 -0.990772	  0.497905
 -0.535259	 -1.038619	  0.540482
 -0.550039	 -1.084273	  0.581935
 -0.562200	 -1.129213	  0.618424
 -0.570372	 -1.174384	  0.649605
 -0.586094	 -1.213611	  0.682647
 -0.601129	 -1.252812	  0.712619
 -0.622600	 -1.283789	  0.743613
 -0.644769	 -1.312293	  0.772605
 -0.663376	 -1.338455	  0.796297
 -0.680725	 -1.360961	  0.817076
 -0.694922	 -1.377217	  0.834284
 -0.711524	 -1.389715	  0.851830
 -0.731101	 -1.400633	  0.872860
 -0.756894	 -1.414412	  0.900492
 -0.787176	 -1.426536	  0.933551
 -0.826443	 -1.438551	  0.976479
 -0.868750	 -1.448993	  1.022126
 -0.902733	 -1.478854	  1.069566
 -0.931096	 -1.512990	  1.114973
 -0.956205	 -1.546586	  1.156894
 -0.978589	 -1.578143	  1.195154
 -0.999326	 -1.608199	  1.231085
 -1.019301	 -1.638244	  1.265713
 -1.038674	 -1.668965	  1.299459
 -1.057906	 -1.700872	  1.332905
 -1.076783	 -1.732787	  1.365320
 -1.095672	 -1.765360	  1.397282
 -1.114169	 -1.798541	  1.429083
 -1.131854	 -1.831909	  1.461427
 -1.149673	 -1.864885	  1.495328
 -1.167584	 -1.896422	  1.530587
 -1.185746	 -1.927086	  1.566856
 -1.204424	 -1.957326	  1.603086
 -1.223546	 -1.987097	  1.639297
 -1.243411	 -2.016489	  1.675366
 -1.266100	 -2.045658	  1.710056
 -1.299090	 -2.069682	  1.740340
 -1.312080	 -2.090379	  1.757743
