  1.312707	 -1.242828	  1.831496
  1.316925	 -1.238767	  1.836212
  1.305705	 -1.249570	  1.823666
  1.294485	 -1.260372	  1.811119
  1.282986	 -1.270773	  1.798486
  1.271445	 -1.281112	  1.785840
  1.259686	 -1.291337	  1.773303
  1.247698	 -1.301440	  1.760885
  1.235591	 -1.311501	  1.748547
  1.223141	 -1.321431	  1.736449
  1.210646	 -1.331347	  1.724384
  1.197687	 -1.341101	  1.712683
  1.184722	 -1.350854	  1.700987
  1.171146	 -1.360471	  1.689888
  1.157552	 -1.370099	  1.678820
  1.143507	 -1.380017	  1.668603
  1.129462	 -1.389934	  1.658387
  1.115399	 -1.400498	  1.648866
  1.101336	 -1.411065	  1.639349
  1.087526	 -1.422080	  1.629970
  1.073829	 -1.433285	  1.620651
  1.060214	 -1.444591	  1.611335
  1.046994	 -1.456368	  1.602031
  1.033775	 -1.468144	  1.592728
  1.020824	 -1.480240	  1.583456
  1.008049	 -1.492538	  1.574206
  0.995305	 -1.504876	  1.564966
  0.982930	 -1.517671	  1.555848
  0.970555	 -1.530466	  1.546730
  0.958401	 -1.543581	  1.537770
  0.946389	 -1.556894	  1.528911
  0.934454	 -1.570330	  1.520134
  0.922801	 -1.584195	  1.511652
  0.911148	 -1.598061	  1.503169
  0.899892	 -1.612394	  1.494933
  0.888718	 -1.626822	  1.486747
  0.877788	 -1.641520	  1.478716
  0.867204	 -1.656583	  1.470902
  0.856658	 -1.671709	  1.463155
  0.846419	 -1.687297	  1.455933
  0.836179	 -1.702886	  1.448712
  0.826223	 -1.718857	  1.441945
  0.816319	 -1.734897	  1.435264
  0.806626	 -1.751086	  1.428634
  0.797212	 -1.767467	  1.422073
  0.787799	 -1.783849	  1.415513
  0.778850	 -1.800448	  1.408851
  0.770001	 -1.817092	  1.402168
  0.761178	 -1.833738	  1.395456
  0.752711	 -1.850401	  1.388338
  0.744244	 -1.867064	  1.381220
  0.735827	 -1.883698	  1.373977
  0.727606	 -1.900211	  1.366248
  0.719385	 -1.916724	  1.358519
  0.711128	 -1.933118	  1.350577
  0.702793	 -1.949223	  1.342141
  0.694459	 -1.965327	  1.333705
  0.685938	 -1.981164	  1.324953
  0.677146	 -1.996581	  1.315733
  0.668354	 -2.011998	  1.306513
  0.659259	 -2.026986	  1.296886
  0.649882	 -2.041542	  1.286877
  0.640504	 -2.056098	  1.276868
  0.630742	 -2.070114	  1.266464
  0.620816	 -2.083888	  1.255892
  0.610891	 -2.097661	  1.245320
  0.600422	 -2.110673	  1.234316
  0.589942	 -2.123669	  1.223304
  0.579298	 -2.136453	  1.212200
  0.568353	 -2.148832	  1.200932
  0.557408	 -2.161210	  1.189664
  0.546244	 -2.173381	  1.178383
  0.535031	 -2.185504	  1.167100
  0.523681	 -2.197644	  1.155973
  0.512154	 -2.209804	  1.145053
  0.500598	 -2.221949	  1.134146
  0.488759	 -2.233941	  1.123374
  0.476921	 -2.245933	  1.112602
  0.464813	 -2.257729	  1.101914
  0.452570	 -2.269426	  1.091270
  0.440218	 -2.281144	  1.080775
  0.427638	 -2.292904	  1.070604
  0.415052	 -2.304663	  1.060440
  0.402164	 -2.316349	  1.050574
  0.389277	 -2.328036	  1.040709
  0.376133	 -2.339618	  1.031059
  0.362884	 -2.351155	  1.021501
  0.349635	 -2.362692	  1.011943
  0.336386	 -2.374230	  1.002385
  0.319301	 -2.388967	  0.990265
  0.305939	 -2.400468	  0.980821
