 -1.820462	 -1.618477	  0.231601
 -1.833056	 -1.620159	  0.241065
 -1.806931	 -1.616670	  0.221432
 -1.769068	 -1.607336	  0.193231
 -1.729502	 -1.597441	  0.162276
 -1.690127	 -1.589003	  0.129883
 -1.650221	 -1.582175	  0.096006
 -1.611316	 -1.577282	  0.061559
 -1.574060	 -1.572130	  0.029159
 -1.538290	 -1.566483	 -0.001220
 -1.502293	 -1.560707	 -0.029434
 -1.463252	 -1.555162	 -0.056465
 -1.421632	 -1.549938	 -0.082660
 -1.380325	 -1.545145	 -0.105961
 -1.333428	 -1.540920	 -0.130449
 -1.266315	 -1.548616	 -0.167312
 -1.290163	 -1.537435	 -0.249737
 -1.355626	 -1.518193	 -0.356537
 -1.380464	 -1.502222	 -0.505271
 -1.353413	 -1.492120	 -0.586284
 -1.338765	 -1.492575	 -0.597720
 -1.290072	 -1.505915	 -0.596338
 -1.164746	 -1.530520	 -0.552729
 -1.029051	 -1.551866	 -0.505898
 -0.961307	 -1.575403	 -0.523324
 -0.943920	 -1.616100	 -0.618067
 -0.979457	 -1.665592	 -0.748958
 -0.984447	 -1.702407	 -0.827339
 -0.972785	 -1.715389	 -0.857348
 -0.943769	 -1.725292	 -0.890518
 -0.895252	 -1.737991	 -0.927312
 -0.857106	 -1.746944	 -0.949683
 -0.832847	 -1.750543	 -0.959962
 -0.797301	 -1.752229	 -0.969872
 -0.742609	 -1.750001	 -0.978520
 -0.680414	 -1.737734	 -0.981172
 -0.600565	 -1.700185	 -0.973308
 -0.512544	 -1.628376	 -0.948749
 -0.446429	 -1.563826	 -0.921600
 -0.390489	 -1.525930	 -0.918052
 -0.334146	 -1.512308	 -0.944513
 -0.287378	 -1.512733	 -0.976527
 -0.245569	 -1.515815	 -1.004814
 -0.205943	 -1.517585	 -1.028187
 -0.166598	 -1.516968	 -1.049197
 -0.127291	 -1.512860	 -1.068088
 -0.078818	 -1.503146	 -1.085236
 -0.029665	 -1.497579	 -1.112248
  0.014949	 -1.492129	 -1.142371
  0.054268	 -1.489748	 -1.174572
  0.094925	 -1.488823	 -1.203641
  0.134804	 -1.488456	 -1.233249
  0.171867	 -1.482088	 -1.264045
  0.211769	 -1.476296	 -1.295087
  0.249210	 -1.474850	 -1.321362
  0.292038	 -1.471041	 -1.342535
  0.338611	 -1.467912	 -1.376740
  0.379771	 -1.470812	 -1.412622
  0.417817	 -1.473269	 -1.445190
  0.455793	 -1.475103	 -1.476913
  0.493188	 -1.476616	 -1.508517
  0.530233	 -1.477554	 -1.541480
  0.565204	 -1.477236	 -1.574577
  0.598807	 -1.475407	 -1.608092
  0.633303	 -1.472219	 -1.642438
  0.668255	 -1.468557	 -1.674049
  0.705562	 -1.465120	 -1.704764
  0.743230	 -1.462810	 -1.734168
  0.785681	 -1.460096	 -1.759134
  0.831806	 -1.455825	 -1.791454
  0.866323	 -1.450315	 -1.816540
