 -1.759718	  1.553591	 -0.841921
 -1.793835	  1.569469	 -0.832694
 -1.779090	  1.563788	 -0.847632
 -1.762331	  1.556694	 -0.857051
 -1.745045	  1.550710	 -0.865859
 -1.725702	  1.545931	 -0.872979
 -1.705873	  1.541234	 -0.875645
 -1.683500	  1.534311	 -0.873213
 -1.664248	  1.524456	 -0.869306
 -1.647224	  1.515789	 -0.869966
 -1.630469	  1.505394	 -0.876792
 -1.615459	  1.495934	 -0.887333
 -1.600887	  1.485821	 -0.897727
 -1.585949	  1.476063	 -0.906736
 -1.570563	  1.466112	 -0.914887
 -1.554963	  1.456226	 -0.922848
 -1.539572	  1.445955	 -0.930552
 -1.523819	  1.435523	 -0.937615
 -1.507632	  1.424785	 -0.943884
 -1.491929	  1.413937	 -0.950677
 -1.477230	  1.402441	 -0.959595
 -1.465115	  1.391015	 -0.970458
 -1.453479	  1.377898	 -0.981578
 -1.443326	  1.363838	 -0.992285
 -1.434904	  1.349454	 -1.004111
 -1.428797	  1.334776	 -1.017187
 -1.423873	  1.320222	 -1.030353
 -1.420349	  1.304214	 -1.041369
 -1.416251	  1.285612	 -1.050460
 -1.410140	  1.267468	 -1.057737
 -1.401409	  1.252076	 -1.065134
 -1.388773	  1.238615	 -1.074496
 -1.376461	  1.223496	 -1.085238
 -1.368239	  1.204151	 -1.093277
 -1.366330	  1.181606	 -1.100156
 -1.369492	  1.166397	 -1.107269
 -1.376345	  1.148944	 -1.119493
 -1.381657	  1.134224	 -1.131001
 -1.382891	  1.115491	 -1.141143
 -1.385583	  1.097252	 -1.149503
 -1.389341	  1.079156	 -1.157600
 -1.393038	  1.061050	 -1.165441
 -1.396914	  1.042652	 -1.172322
 -1.400840	  1.024435	 -1.178983
 -1.405868	  1.007857	 -1.185707
 -1.416749	  0.989349	 -1.194099
 -1.427692	  0.969335	 -1.198771
 -1.431657	  0.949755	 -1.195718
 -1.433065	  0.930066	 -1.187890
 -1.435849	  0.909295	 -1.184527
 -1.439832	  0.888972	 -1.191267
 -1.446476	  0.873302	 -1.198629
 -1.456063	  0.850034	 -1.205466
 -1.459827	  0.829031	 -1.208438
 -1.460102	  0.815918	 -1.210036
 -1.458919	  0.793500	 -1.211861
 -1.459591	  0.768795	 -1.211570
 -1.456536	  0.751504	 -1.209962
 -1.451540	  0.731393	 -1.207301
 -1.445093	  0.711523	 -1.206601
 -1.437251	  0.695593	 -1.209471
 -1.431971	  0.674749	 -1.212550
 -1.432287	  0.651890	 -1.211847
 -1.433640	  0.629546	 -1.211550
 -1.434141	  0.613572	 -1.213163
 -1.434437	  0.593793	 -1.213758
 -1.429199	  0.570331	 -1.213708
 -1.425251	  0.558794	 -1.213905
 -1.417984	  0.536120	 -1.210830
 -1.408765	  0.512121	 -1.210717
 -1.403143	  0.502465	 -1.213622
 -1.393081	  0.485276	 -1.220466
 -1.373448	  0.473603	 -1.226058
 -1.369007	  0.469921	 -1.227616
 -1.353215	  0.465980	 -1.227581
 -1.335749	  0.468866	 -1.222129
 -1.321613	  0.472442	 -1.217039
 -1.297613	  0.477016	 -1.217234
 -1.281226	  0.485932	 -1.219688
 -1.265391	  0.497041	 -1.222458
 -1.250270	  0.509981	 -1.220850
 -1.234903	  0.521025	 -1.215667
 -1.217844	  0.533860	 -1.205191
 -1.203529	  0.545192	 -1.197280
 -1.188493	  0.558241	 -1.191537
 -1.178819	  0.567490	 -1.186646
 -1.163437	  0.582941	 -1.181343
 -1.147792	  0.596415	 -1.178128
 -1.131634	  0.614993	 -1.171677
 -1.122596	  0.628062	 -1.166243
 -1.116482	  0.639621	 -1.158959
 -1.103411	  0.653608	 -1.149087
 -1.087693	  0.671909	 -1.137253
 -1.077731	  0.682306	 -1.130403
 -1.065875	  0.693504	 -1.121939
 -1.048733	  0.708312	 -1.110154
 -1.035043	  0.724318	 -1.098029
 -1.029141	  0.733324	 -1.091470
 -1.020818	  0.746290	 -1.082027
 -1.007263	  0.763911	 -1.069835
 -0.988138	  0.776179	 -1.063728
 -0.970999	  0.780211	 -1.059868
 -0.953573	  0.788640	 -1.050279
 -0.937095	  0.796974	 -1.040512
 -0.920227	  0.803778	 -1.031062
 -0.904386	  0.808499	 -1.020814
 -0.888988	  0.816792	 -1.010639
 -0.873351	  0.824621	 -1.001029
 -0.858299	  0.832017	 -0.992203
 -0.841673	  0.840876	 -0.987839
 -0.818642	  0.847464	 -0.982066
 -0.796710	  0.847962	 -0.969114
 -0.781307	  0.851018	 -0.953148
 -0.774569	  0.855298	 -0.943986
 -0.764412	  0.871355	 -0.932563
 -0.750500	  0.886735	 -0.919626
 -0.732029	  0.891123	 -0.909634
 -0.710408	  0.887088	 -0.899169
 -0.693411	  0.886124	 -0.890963
 -0.674493	  0.888709	 -0.886322
 -0.655989	  0.892028	 -0.883314
 -0.636891	  0.894089	 -0.879934
 -0.613796	  0.893328	 -0.870329
 -0.592915	  0.893760	 -0.857487
 -0.582221	  0.896776	 -0.850848
 -0.562010	  0.901018	 -0.842455
 -0.551313	  0.906504	 -0.836447
 -0.525974	  0.906512	 -0.825977
 -0.504619	  0.910780	 -0.809181
 -0.498224	  0.911561	 -0.807809
 -0.481500	  0.914100	 -0.794067
 -0.455629	  0.916405	 -0.781457
 -0.443900	  0.917574	 -0.772026
 -0.427369	  0.916565	 -0.760411
 -0.409862	  0.914827	 -0.748437
 -0.390236	  0.911099	 -0.742688
 -0.368898	  0.902806	 -0.742316
 -0.350424	  0.891829	 -0.737753
 -0.338722	  0.886718	 -0.733320
 -0.320903	  0.882212	 -0.729333
 -0.297145	  0.874670	 -0.726554
 -0.272679	  0.869150	 -0.727308
 -0.257935	  0.867561	 -0.728357
 -0.242378	  0.866743	 -0.730133
 -0.218260	  0.854588	 -0.720357
 -0.204232	  0.843651	 -0.711747
 -0.194411	  0.831874	 -0.701346
 -0.178783	  0.814899	 -0.693190
 -0.162761	  0.803841	 -0.690120
 -0.146582	  0.795985	 -0.687598
 -0.128907	  0.788982	 -0.684972
 -0.111728	  0.780220	 -0.685693
 -0.083538	  0.765786	 -0.686997
 -0.063046	  0.756249	 -0.687302
 -0.047435	  0.751993	 -0.686134
 -0.032515	  0.736184	 -0.684193
 -0.015141	  0.715272	 -0.679505
 -0.009637	  0.701766	 -0.678083
  0.002989	  0.687162	 -0.673470
  0.016738	  0.666391	 -0.675951
  0.026363	  0.649083	 -0.678643
  0.035806	  0.635477	 -0.681921
  0.044012	  0.615241	 -0.686041
  0.049850	  0.595843	 -0.690072
  0.056307	  0.572067	 -0.698152
  0.060648	  0.552946	 -0.701780
  0.064890	  0.536682	 -0.704289
  0.073113	  0.515920	 -0.708258
  0.089225	  0.494764	 -0.712096
  0.096087	  0.487369	 -0.715470
  0.107649	  0.470302	 -0.720235
  0.119700	  0.453682	 -0.728397
  0.127801	  0.437443	 -0.736430
  0.132214	  0.420192	 -0.742222
  0.136162	  0.398343	 -0.747475
  0.143839	  0.377547	 -0.750330
  0.155926	  0.360299	 -0.751054
  0.164269	  0.349206	 -0.749988
  0.176661	  0.329788	 -0.751235
  0.186536	  0.309729	 -0.753680
  0.194066	  0.295191	 -0.757791
  0.200648	  0.274034	 -0.768602
  0.204065	  0.251938	 -0.776209
  0.206828	  0.236671	 -0.779201
  0.211709	  0.217802	 -0.782242
  0.216585	  0.197249	 -0.787003
  0.219904	  0.179065	 -0.790116
  0.222614	  0.157870	 -0.794620
  0.222605	  0.136650	 -0.804150
  0.222310	  0.121896	 -0.812629
  0.222180	  0.103452	 -0.821687
  0.222084	  0.085972	 -0.827086
  0.222381	  0.065695	 -0.828490
  0.219749	  0.037950	 -0.832288
  0.216433	  0.022058	 -0.837728
  0.216662	  0.008843	 -0.843836
  0.216444	 -0.010760	 -0.849312
  0.223351	 -0.041685	 -0.853214
  0.226225	 -0.052287	 -0.855228
  0.236305	 -0.070489	 -0.859026
  0.242774	 -0.091415	 -0.863249
  0.244906	 -0.104835	 -0.868503
  0.251681	 -0.128602	 -0.885499
  0.257769	 -0.141664	 -0.893769
  0.260778	 -0.161082	 -0.907982
  0.254560	 -0.181222	 -0.921788
  0.247869	 -0.196975	 -0.934440
  0.248437	 -0.208834	 -0.942661
  0.255350	 -0.220690	 -0.951679
  0.268444	 -0.233937	 -0.966257
  0.277518	 -0.244325	 -0.974144
  0.288498	 -0.256517	 -0.987205
  0.297379	 -0.264142	 -1.002308
  0.304924	 -0.268127	 -1.016275
  0.317947	 -0.273252	 -1.040223
  0.325173	 -0.277711	 -1.054230
  0.332400	 -0.282423	 -1.064841
  0.338295	 -0.285822	 -1.085743
  0.345210	 -0.287690	 -1.106913
  0.350153	 -0.286929	 -1.126196
  0.353882	 -0.285161	 -1.145676
  0.357524	 -0.282720	 -1.165144
  0.361635	 -0.281561	 -1.184686
  0.364917	 -0.281424	 -1.204365
  0.366980	 -0.281750	 -1.224684
  0.368185	 -0.281004	 -1.245059
  0.368944	 -0.279150	 -1.265092
  0.371997	 -0.274786	 -1.284885
  0.379290	 -0.261773	 -1.303051
  0.393097	 -0.244681	 -1.317039
  0.408843	 -0.238798	 -1.329332
  0.422382	 -0.237619	 -1.336064
  0.437844	 -0.239780	 -1.352860
  0.448054	 -0.236734	 -1.369269
  0.462123	 -0.228078	 -1.383220
  0.469904	 -0.218035	 -1.396830
  0.483655	 -0.211224	 -1.409370
  0.500320	 -0.207113	 -1.418586
  0.518967	 -0.206090	 -1.425819
  0.537020	 -0.202268	 -1.433270
  0.554687	 -0.198263	 -1.440764
  0.573923	 -0.198046	 -1.447039
  0.593089	 -0.199765	 -1.452609
  0.611968	 -0.201224	 -1.458620
  0.630820	 -0.204326	 -1.464968
  0.649231	 -0.209009	 -1.471726
  0.667596	 -0.213885	 -1.478461
  0.686051	 -0.217648	 -1.485729
  0.703091	 -0.221830	 -1.495244
  0.717770	 -0.228381	 -1.506937
  0.731686	 -0.236636	 -1.519457
  0.745883	 -0.244052	 -1.532385
  0.760631	 -0.250412	 -1.544075
  0.776737	 -0.258384	 -1.551839
  0.795181	 -0.268521	 -1.554409
  0.814469	 -0.276073	 -1.549839
  0.837649	 -0.279227	 -1.543496
  0.857560	 -0.277142	 -1.542990
  0.878506	 -0.277579	 -1.547500
  0.897992	 -0.282255	 -1.556481
  0.913395	 -0.289201	 -1.567842
  0.932385	 -0.295841	 -1.573814
  0.951547	 -0.302339	 -1.575111
  0.970509	 -0.308721	 -1.576028
  0.989319	 -0.315255	 -1.577608
  1.006877	 -0.322550	 -1.580636
  1.020685	 -0.335108	 -1.584803
  1.038849	 -0.348427	 -1.590767
  1.061721	 -0.351253	 -1.598775
  1.083244	 -0.352117	 -1.608328
  1.095635	 -0.351595	 -1.613700
  1.113979	 -0.357315	 -1.624714
  1.134119	 -0.365766	 -1.630615
  1.150812	 -0.374469	 -1.631641
  1.165299	 -0.386895	 -1.636257
  1.178439	 -0.401762	 -1.645048
  1.196980	 -0.409096	 -1.654856
  1.218293	 -0.411968	 -1.661678
  1.239428	 -0.417634	 -1.662565
  1.254853	 -0.428718	 -1.659667
  1.270040	 -0.443884	 -1.660196
  1.284804	 -0.458269	 -1.663786
  1.301969	 -0.468144	 -1.668512
  1.318460	 -0.478309	 -1.673429
  1.333755	 -0.488537	 -1.676927
  1.347897	 -0.502389	 -1.675938
  1.368831	 -0.514986	 -1.681679
  1.385786	 -0.523797	 -1.690845
  1.397077	 -0.532439	 -1.699589
  1.409585	 -0.546355	 -1.711911
  1.426957	 -0.559331	 -1.719663
  1.441253	 -0.565957	 -1.721260
  1.462440	 -0.575304	 -1.721909
  1.479562	 -0.586219	 -1.727880
  1.490607	 -0.597513	 -1.734211
  1.504357	 -0.613132	 -1.743068
  1.520987	 -0.625483	 -1.750563
  1.537029	 -0.634329	 -1.753398
  1.557004	 -0.647648	 -1.751563
  1.572468	 -0.658948	 -1.757322
