  0.123106	  2.418120	  0.302460
  0.135428	  2.449064	  0.290630
  0.147750	  2.480008	  0.278800
  0.149908	  2.456478	  0.290565
  0.139417	  2.437510	  0.297799
  0.134826	  2.428214	  0.301762
  0.128322	  2.413182	  0.308495
  0.118610	  2.385767	  0.319683
  0.115013	  2.373591	  0.325054
  0.109078	  2.361522	  0.330818
  0.097119	  2.340802	  0.338767
  0.086042	  2.323810	  0.345980
  0.072782	  2.307296	  0.351162
  0.065935	  2.293721	  0.355439
  0.062966	  2.279010	  0.371684
  0.067102	  2.261716	  0.398478
  0.071792	  2.248576	  0.415941
  0.072233	  2.239660	  0.423043
  0.077757	  2.230444	  0.436341
  0.077483	  2.217619	  0.453253
  0.079411	  2.210835	  0.469547
  0.082624	  2.207019	  0.480182
  0.081910	  2.213320	  0.496471
  0.074066	  2.222648	  0.520790
  0.072528	  2.223164	  0.546627
  0.073170	  2.222173	  0.563731
  0.076241	  2.219981	  0.580242
  0.082015	  2.217173	  0.602548
  0.087664	  2.213592	  0.622293
  0.089953	  2.212649	  0.642419
  0.090856	  2.212392	  0.662547
  0.090250	  2.212504	  0.682539
  0.090317	  2.213464	  0.700250
  0.091906	  2.211126	  0.719754
  0.079604	  2.204168	  0.746562
  0.072974	  2.204841	  0.765368
  0.069164	  2.205607	  0.781077
  0.066045	  2.208292	  0.799126
  0.062678	  2.211787	  0.821292
  0.059609	  2.214646	  0.839661
  0.056321	  2.217379	  0.859573
  0.053668	  2.220809	  0.879293
  0.050344	  2.226530	  0.898049
  0.044875	  2.236444	  0.919152
  0.039096	  2.237804	  0.940435
  0.035577	  2.232297	  0.958420
  0.032787	  2.225626	  0.974094
  0.023513	  2.222489	  0.996433
  0.017967	  2.217882	  1.017210
  0.015785	  2.215127	  1.033724
  0.011038	  2.214977	  1.054281
  0.005562	  2.212331	  1.075719
  0.002494	  2.210084	  1.092534
 -0.000349	  2.210836	  1.110357
 -0.008897	  2.209199	  1.134163
 -0.013847	  2.204785	  1.153518
 -0.017247	  2.203021	  1.167852
 -0.019353	  2.204651	  1.178617
 -0.021717	  2.206481	  1.190696
