 -0.615155	 -1.197585	 -2.072920
 -0.616130	 -1.205059	 -2.104455
 -0.615464	 -1.200233	 -2.085078
 -0.614209	 -1.194674	 -2.066692
 -0.611765	 -1.185826	 -2.050932
 -0.607277	 -1.166587	 -2.044452
 -0.601457	 -1.151181	 -2.043891
 -0.599148	 -1.141510	 -2.026020
 -0.595783	 -1.128307	 -2.010057
 -0.594152	 -1.111425	 -1.995404
 -0.590991	 -1.093212	 -1.986566
 -0.583234	 -1.076047	 -1.983696
 -0.574854	 -1.057918	 -1.981422
 -0.565264	 -1.040621	 -1.981127
 -0.552493	 -1.024611	 -1.982923
 -0.537876	 -1.010485	 -1.985663
 -0.524094	 -0.996710	 -1.988426
 -0.516502	 -0.979643	 -1.991253
 -0.507211	 -0.961110	 -1.992931
 -0.496855	 -0.942745	 -1.995104
 -0.485203	 -0.924155	 -1.997458
 -0.472749	 -0.910130	 -1.997433
 -0.457840	 -0.891522	 -1.998648
 -0.440441	 -0.878535	 -1.997019
 -0.422339	 -0.872008	 -1.991750
 -0.405263	 -0.866961	 -1.985551
 -0.386255	 -0.858657	 -1.976808
 -0.367966	 -0.848569	 -1.968131
 -0.351774	 -0.841621	 -1.960419
 -0.333770	 -0.837713	 -1.950960
 -0.317440	 -0.830681	 -1.942630
 -0.302858	 -0.824526	 -1.934652
 -0.280181	 -0.819382	 -1.924843
 -0.263180	 -0.813129	 -1.920647
 -0.248040	 -0.809193	 -1.913816
 -0.228166	 -0.807527	 -1.900370
 -0.210037	 -0.802944	 -1.891115
 -0.198355	 -0.797209	 -1.886669
 -0.180338	 -0.790565	 -1.874917
 -0.160749	 -0.786707	 -1.864802
 -0.145653	 -0.783798	 -1.860031
 -0.126823	 -0.781063	 -1.847741
 -0.108122	 -0.779256	 -1.836690
 -0.093980	 -0.779112	 -1.831485
 -0.073301	 -0.777311	 -1.823661
 -0.055206	 -0.769847	 -1.807090
 -0.043086	 -0.759031	 -1.793356
 -0.032293	 -0.753564	 -1.782449
 -0.012741	 -0.760103	 -1.769972
  0.003535	 -0.773219	 -1.755431
  0.015407	 -0.784105	 -1.734716
  0.021810	 -0.786699	 -1.717414
  0.034514	 -0.781039	 -1.703032
  0.055142	 -0.770426	 -1.692296
  0.072885	 -0.764549	 -1.680458
  0.083895	 -0.765072	 -1.668729
  0.093567	 -0.767630	 -1.650008
  0.102235	 -0.766358	 -1.627517
  0.113305	 -0.761462	 -1.611355
  0.125978	 -0.754174	 -1.600218
  0.142439	 -0.747625	 -1.587881
  0.157571	 -0.749619	 -1.573181
  0.168641	 -0.751376	 -1.555868
  0.175502	 -0.748628	 -1.538144
  0.184228	 -0.745088	 -1.519381
  0.194905	 -0.742185	 -1.502410
  0.203315	 -0.739526	 -1.484778
  0.210444	 -0.737109	 -1.466325
  0.217692	 -0.734728	 -1.447828
  0.224742	 -0.732496	 -1.429244
  0.231553	 -0.730339	 -1.410548
  0.238932	 -0.727788	 -1.392133
  0.245950	 -0.725325	 -1.373599
  0.252402	 -0.723241	 -1.355329
  0.255599	 -0.725001	 -1.336595
  0.256933	 -0.729161	 -1.316711
  0.261449	 -0.730784	 -1.295603
  0.263469	 -0.731582	 -1.278384
  0.263351	 -0.736424	 -1.258675
  0.268505	 -0.738672	 -1.235103
  0.273161	 -0.733931	 -1.218605
  0.277928	 -0.728908	 -1.197609
  0.280549	 -0.731171	 -1.177065
  0.280555	 -0.735878	 -1.159073
  0.278118	 -0.742930	 -1.139315
  0.276851	 -0.749492	 -1.119890
  0.274918	 -0.758822	 -1.102341
  0.273384	 -0.767184	 -1.082767
  0.276004	 -0.767446	 -1.063140
  0.276165	 -0.769093	 -1.042748
  0.272602	 -0.774567	 -1.024691
  0.267313	 -0.781398	 -1.005929
  0.263098	 -0.788154	 -0.987700
  0.259106	 -0.797100	 -0.970495
  0.255230	 -0.806329	 -0.952705
  0.248077	 -0.815114	 -0.935653
  0.237081	 -0.821465	 -0.918932
  0.228553	 -0.822675	 -0.900615
  0.223491	 -0.822775	 -0.880811
  0.220169	 -0.822417	 -0.859780
  0.213110	 -0.822113	 -0.839842
  0.200977	 -0.826281	 -0.823525
  0.186442	 -0.834640	 -0.812726
  0.170176	 -0.843369	 -0.800071
  0.156360	 -0.841518	 -0.782933
  0.147734	 -0.833695	 -0.765406
  0.141144	 -0.823362	 -0.749538
  0.131516	 -0.812609	 -0.735388
  0.117479	 -0.804333	 -0.720738
  0.110671	 -0.791823	 -0.704959
  0.106733	 -0.778793	 -0.691427
  0.101075	 -0.766251	 -0.676217
  0.092657	 -0.756146	 -0.659511
  0.088823	 -0.741352	 -0.647336
  0.084317	 -0.726499	 -0.634378
  0.080143	 -0.715377	 -0.619976
  0.075901	 -0.706029	 -0.600448
  0.073353	 -0.698028	 -0.580919
  0.068070	 -0.689330	 -0.564951
  0.057880	 -0.678923	 -0.551945
  0.049023	 -0.666399	 -0.532682
  0.048554	 -0.659402	 -0.515645
  0.048108	 -0.654423	 -0.497476
  0.045593	 -0.647539	 -0.478361
  0.044357	 -0.640500	 -0.463262
  0.045220	 -0.631509	 -0.440668
  0.039115	 -0.623651	 -0.420139
  0.033254	 -0.616966	 -0.406616
  0.026391	 -0.605000	 -0.385672
  0.023310	 -0.593394	 -0.365713
  0.021620	 -0.589655	 -0.346973
  0.020595	 -0.588275	 -0.331862
  0.021661	 -0.588996	 -0.309324
  0.022618	 -0.587868	 -0.287783
  0.023526	 -0.586673	 -0.269282
  0.022718	 -0.582256	 -0.248165
  0.022436	 -0.578489	 -0.229205
  0.022428	 -0.577604	 -0.208729
  0.021889	 -0.575801	 -0.188701
  0.021470	 -0.574559	 -0.168726
  0.020738	 -0.574218	 -0.148727
  0.020249	 -0.574142	 -0.128728
  0.019519	 -0.573960	 -0.108736
  0.018764	 -0.575188	 -0.088779
  0.017581	 -0.576527	 -0.068855
  0.016563	 -0.578003	 -0.048937
  0.015241	 -0.579701	 -0.029057
  0.013586	 -0.582423	 -0.009314
  0.011714	 -0.585043	  0.010419
  0.009640	 -0.587570	  0.030146
  0.007462	 -0.590632	  0.049775
  0.004781	 -0.594058	  0.069277
  0.001715	 -0.597279	  0.088781
 -0.000980	 -0.600726	  0.108286
 -0.004478	 -0.604189	  0.127642
 -0.007975	 -0.607930	  0.146967
 -0.011886	 -0.611432	  0.166271
 -0.015498	 -0.615117	  0.185575
 -0.019622	 -0.618933	  0.204736
 -0.024154	 -0.622578	  0.223877
 -0.028564	 -0.626297	  0.243030
 -0.032832	 -0.630155	  0.262174
 -0.037470	 -0.633876	  0.281264
 -0.042202	 -0.637542	  0.300355
 -0.046391	 -0.641368	  0.319535
 -0.050909	 -0.644787	  0.338729
 -0.054902	 -0.648374	  0.358005
 -0.058768	 -0.651474	  0.377372
 -0.062017	 -0.655233	  0.396781
 -0.064774	 -0.659175	  0.416306
 -0.066285	 -0.662330	  0.436257
 -0.067187	 -0.665240	  0.456076
 -0.067334	 -0.667443	  0.476180
 -0.066678	 -0.669256	  0.496219
 -0.065627	 -0.669202	  0.516508
 -0.064441	 -0.667918	  0.536735
 -0.062984	 -0.666471	  0.556712
 -0.063157	 -0.664406	  0.576490
 -0.065263	 -0.664043	  0.596285
 -0.067606	 -0.665091	  0.616138
 -0.067862	 -0.665603	  0.636719
 -0.063878	 -0.664800	  0.657391
 -0.059572	 -0.661248	  0.677251
 -0.058298	 -0.658269	  0.696242
 -0.061369	 -0.652961	  0.715353
 -0.062081	 -0.647870	  0.734862
 -0.058423	 -0.640009	  0.753601
 -0.054743	 -0.627238	  0.775098
 -0.052918	 -0.621765	  0.793742
 -0.050538	 -0.624881	  0.814200
 -0.051710	 -0.630104	  0.832269
 -0.054853	 -0.628405	  0.854009
 -0.056306	 -0.622720	  0.873925
 -0.055160	 -0.618351	  0.892034
 -0.054493	 -0.612967	  0.911797
 -0.054416	 -0.610165	  0.932692
 -0.053581	 -0.611782	  0.953178
 -0.047800	 -0.614568	  0.973763
 -0.042147	 -0.612274	  0.992862
 -0.038731	 -0.606321	  1.011920
 -0.037612	 -0.599392	  1.030211
 -0.036855	 -0.592938	  1.049521
 -0.034612	 -0.587751	  1.069127
 -0.028584	 -0.585287	  1.088891
 -0.021413	 -0.585050	  1.108952
 -0.018442	 -0.583671	  1.128662
 -0.020853	 -0.580717	  1.146953
 -0.024255	 -0.579147	  1.167561
 -0.025782	 -0.576168	  1.188789
 -0.021324	 -0.571931	  1.208595
 -0.013515	 -0.570127	  1.227217
 -0.008657	 -0.570736	  1.247129
 -0.009650	 -0.571018	  1.266747
 -0.009784	 -0.569637	  1.286912
 -0.005746	 -0.566957	  1.306633
  0.001705	 -0.568022	  1.327341
  0.006676	 -0.573926	  1.347047
  0.001449	 -0.580657	  1.362882
 -0.007153	 -0.584397	  1.387456
 -0.010127	 -0.584632	  1.409172
 -0.007769	 -0.586016	  1.424330
 -0.005349	 -0.591332	  1.443766
 -0.005328	 -0.594700	  1.468054
 -0.003561	 -0.594825	  1.484377
  0.000998	 -0.596845	  1.502967
  0.005407	 -0.597854	  1.528110
  0.005142	 -0.597558	  1.543782
  0.004157	 -0.598987	  1.564497
  0.006191	 -0.603892	  1.586786
  0.004753	 -0.610982	  1.604373
 -0.000085	 -0.618241	  1.623178
 -0.001732	 -0.624281	  1.645001
  0.000730	 -0.630227	  1.658161
  0.002292	 -0.639632	  1.677720
  0.002037	 -0.647586	  1.697383
  0.001767	 -0.654766	  1.716170
  0.001090	 -0.662168	  1.734726
  0.000284	 -0.669506	  1.753318
 -0.000613	 -0.676761	  1.771936
 -0.001407	 -0.684323	  1.790286
 -0.002431	 -0.689244	  1.809120
 -0.004210	 -0.693745	  1.830504
 -0.007338	 -0.699777	  1.849690
 -0.009686	 -0.709496	  1.866668
 -0.010588	 -0.718668	  1.883581
 -0.013480	 -0.727298	  1.902876
 -0.016515	 -0.737055	  1.919872
 -0.017898	 -0.747201	  1.936039
 -0.021134	 -0.754098	  1.955607
 -0.024026	 -0.765057	  1.972259
 -0.026381	 -0.776178	  1.988376
 -0.028808	 -0.785815	  2.005868
 -0.031572	 -0.792649	  2.024257
 -0.032406	 -0.790530	  2.043700
 -0.030456	 -0.779472	  2.059927
 -0.029881	 -0.766885	  2.075422
 -0.028008	 -0.753765	  2.090445
 -0.027173	 -0.740262	  2.104838
 -0.026541	 -0.726225	  2.118915
 -0.026604	 -0.712115	  2.132942
 -0.026233	 -0.697623	  2.146346
 -0.028007	 -0.682946	  2.159694
 -0.028769	 -0.668033	  2.172861
 -0.032009	 -0.652930	  2.185449
 -0.035030	 -0.637995	  2.197604
 -0.040625	 -0.622357	  2.208240
 -0.045821	 -0.604721	  2.221106
 -0.048723	 -0.590834	  2.232562
 -0.055280	 -0.573196	  2.244439
 -0.041420	 -0.548997	  2.275182
 -0.043566	 -0.533889	  2.288110
