 0.0 0.0 0.0 0
 -0.5146152200459575 -0.7948504319868532 0.322009263946494 1000
 -0.5813021878845234 0.8023223471767804 -0.13567836077063894 1000
 0.6302567502779008 0.32804361320233183 -0.7035750255419091 1000
 0.13282259743137667 0.07675699334621855 -0.9885527409218138 1000
 0.4384254876717255 0.8869121463052694 0.1463589303595425 1000
 -0.9290038633905009 0.36195896930464955 -0.08403883831561777 1000
 0.22464638401727996 0.6634884531631027 -0.7135244036942209 1000
 0.4437792965147682 -0.03730729354338452 0.8951290978586968 1000
 0.0 0.0 0.0 0
 0.3915050346200369 -0.6881695738083482 0.6115524879776056 1000
 0.17220395440608213 0.977315881078926 -0.12394138404031929 1000
 -0.34022781342655367 -0.33255532516664177 0.8798499819141299 1000
 0.78326175721084 -0.6158294911544501 -0.08864004464934212 1000
 0.8495023545668068 0.15367014524839684 -0.5042630623442365 1000
 0.3429320380726023 -0.9092261312484966 0.23679835201762303 1000
 0.9005959347076401 -0.31869548839016965 -0.29487310502625136 1000
 0.5031131435468346 0.019986325232157015 -0.8641340819537996 1000
 0.0 0.0 0.0 0
 -0.9582426127935508 -0.2848695337029338 -0.01124472296063777 1000
 -0.35511312234314674 0.5452167379749633 0.7590127660136166 1000
 -0.7580775741350522 -0.48135012936858107 0.43889229265317947 1000
 0.9909444081973199 -0.11013094864800607 0.0725489766458005 1000
 0.6425529145743246 0.752447358599931 0.14407541257281553 1000
 0.14552402843633028 -0.8788288120928107 -0.4532589504722445 1000
 0.34740902077399977 -0.5250543529088506 0.7768853832942914 1000
 -0.6973252317615872 -0.05422664213429315 0.714848230347874 1000
 0.0 0.0 0.0 0
 -0.38298634729434977 -0.537361784266934 -0.7504996806099175 1000
 -0.22093387002140175 0.16698340705451584 -0.9603826148186104 1000
 -0.4110950334248216 -0.5334187397539997 0.7393269382165776 1000
 0.09824379946429534 -0.9873758383769544 0.12022524550286784 1000
 -0.9464384793519455 -0.15870659512726978 0.28131907412240176 1000
 -0.4919865265336693 0.6754905624323793 0.5497488133448969 1000
 -0.34843095664519763 -0.1825868517246911 -0.9191136545762865 1000
 -0.006060340310453251 0.6008538029895277 -0.7991007318907565 1000
 0.0 0.0 0.0 0
 0.6657721454581456 0.6289859518773541 0.4028400708382869 1000
 -0.8929268465438859 0.43277390640067775 0.12143060841438777 1000
 -0.25321813505372515 -0.9360309999392689 -0.24241399141263528 1000
 -0.8823201509470758 -0.07605337563293112 -0.46430166410165385 1000
 -0.610824268409433 0.2052629197096426 0.7647756840501356 1000
 0.3963396962418424 -0.9181800173002055 0.008619803566085688 1000
 0.9103750182789584 -0.08352066286724134 -0.4041579208277402 1000
 -0.05815990578340395 -0.28999638014720164 -0.954987185705015 1000
 0.0 0.0 0.0 0
 0.768047021043226 -0.6300625064407863 0.1167861783096774 1000
 0.7610414974778167 0.3164489745147302 -0.5665826379666936 1000
 -0.996907355995952 -0.08252362147677553 -0.009464431283355492 1000
 -0.37233992030938234 0.2988659003819478 -0.878350816777038 1000
 -0.09411676944922942 -0.817716601286931 0.5676659173212623 1000
 0.7946401970418498 -0.2505921785611451 0.5520792672155589 1000
 0.1551095091070007 0.5520738841397115 0.8191779212329133 1000
 0.2368463090162843 0.9700147593365552 0.04554330438831697 1000
 0.0 0.0 0.0 0
 0.21818999300149863 0.5015620202940826 -0.8368092176550899 1000
 0.5067823262898581 -0.5510429910755785 -0.6634276869009306 1000
 -0.5989561958386833 0.6509936178491849 -0.4664319725169807 1000
 0.8509883752144899 0.2500162443958703 0.461431102969865 1000
 -0.3588225197509015 0.12504318549597154 0.9247035206381736 1000
 -0.21519449428249268 0.6522100779783142 -0.7271185211600807 1000
 0.8219054234018861 0.5347753459125542 -0.19707055687411462 1000
 0.3195935198957673 -0.8076751335846943 -0.49499581880009785 1000
 0.0 0.0 0.0 0
 0.4255782057335783 0.6811881190990372 0.5944198324441263 1000
 -0.3418659201744698 -0.8957220101148933 0.2828352404121476 1000
 0.28911334814142853 0.00345091002649614 0.957267759378974 1000
 -0.8252323971774063 -0.007958223831171896 0.5655900965560514 1000
