 -1.780704	 -1.659810	 -0.365833
 -1.769494	 -1.699037	 -0.367900
 -1.758284	 -1.738264	 -0.369967
 -1.761340	 -1.718327	 -0.373134
 -1.767133	 -1.700408	 -0.373095
 -1.772829	 -1.677737	 -0.371596
 -1.778006	 -1.660443	 -0.368408
 -1.786199	 -1.642692	 -0.365521
 -1.793504	 -1.623457	 -0.363839
 -1.798889	 -1.604860	 -0.363481
 -1.807145	 -1.586402	 -0.362550
 -1.815369	 -1.566746	 -0.359313
 -1.819624	 -1.550050	 -0.355088
 -1.828157	 -1.531272	 -0.351247
 -1.837336	 -1.513708	 -0.345874
 -1.845646	 -1.497309	 -0.339013
 -1.855160	 -1.480937	 -0.332744
 -1.864750	 -1.464035	 -0.327630
 -1.873581	 -1.446467	 -0.322839
 -1.881884	 -1.429370	 -0.318854
 -1.891931	 -1.411854	 -0.314512
 -1.899697	 -1.393793	 -0.309734
 -1.906338	 -1.376027	 -0.301123
 -1.916416	 -1.361119	 -0.293579
 -1.928156	 -1.345947	 -0.287995
 -1.937033	 -1.328651	 -0.281309
 -1.943262	 -1.310781	 -0.275898
 -1.950008	 -1.292497	 -0.272418
 -1.957303	 -1.273712	 -0.267282
 -1.964252	 -1.256963	 -0.257776
 -1.971036	 -1.239045	 -0.254416
 -1.976119	 -1.219848	 -0.251412
 -1.981671	 -1.200279	 -0.245380
 -1.989664	 -1.183235	 -0.240231
 -1.997981	 -1.165407	 -0.237847
 -2.003084	 -1.146338	 -0.233933
 -2.009067	 -1.127348	 -0.228565
 -2.017468	 -1.110180	 -0.225066
 -2.024510	 -1.091661	 -0.221118
 -2.029021	 -1.072770	 -0.215613
 -2.036400	 -1.054826	 -0.210759
 -2.044563	 -1.036910	 -0.206979
 -2.050128	 -1.018386	 -0.202660
 -2.056815	 -0.999648	 -0.199621
 -2.066047	 -0.982504	 -0.197734
 -2.072597	 -0.962076	 -0.188432
 -2.072353	 -0.944166	 -0.176865
 -2.072301	 -0.924031	 -0.170682
 -2.079447	 -0.907969	 -0.168839
 -2.088376	 -0.888582	 -0.164608
 -2.097728	 -0.872345	 -0.161283
 -2.106352	 -0.854306	 -0.157944
 -2.114868	 -0.835403	 -0.152145
 -2.120518	 -0.816199	 -0.145630
 -2.121102	 -0.796831	 -0.142387
 -2.125155	 -0.777500	 -0.139555
 -2.132001	 -0.759125	 -0.135064
 -2.137064	 -0.739931	 -0.132113
 -2.139982	 -0.719282	 -0.130614
 -2.146241	 -0.699974	 -0.127036
 -2.158220	 -0.685603	 -0.122387
 -2.169043	 -0.667940	 -0.119163
 -2.176871	 -0.649667	 -0.118012
 -2.185290	 -0.631472	 -0.116531
 -2.195385	 -0.614228	 -0.114605
 -2.205372	 -0.597080	 -0.112900
 -2.215265	 -0.580443	 -0.111786
 -2.226796	 -0.562615	 -0.109768
 -2.238307	 -0.546671	 -0.107399
 -2.248885	 -0.531190	 -0.105178
 -2.261122	 -0.513711	 -0.103920
 -2.273757	 -0.498058	 -0.101120
 -2.286311	 -0.483999	 -0.094701
 -2.297234	 -0.468550	 -0.092218
 -2.308609	 -0.450484	 -0.093137
 -2.318769	 -0.433694	 -0.093944
 -2.330378	 -0.416864	 -0.090946
 -2.340988	 -0.401841	 -0.085220
 -2.352093	 -0.384877	 -0.081461
 -2.361982	 -0.368442	 -0.077410
 -2.373280	 -0.352685	 -0.072623
 -2.383763	 -0.334472	 -0.067473
 -2.392491	 -0.316661	 -0.064480
 -2.395700	 -0.297415	 -0.059813
 -2.399837	 -0.279951	 -0.052083
 -2.402889	 -0.260421	 -0.044407
 -2.408156	 -0.240830	 -0.040835
 -2.416545	 -0.225005	 -0.035515
 -2.424094	 -0.206076	 -0.030369
 -2.428096	 -0.187082	 -0.025530
 -2.430308	 -0.168673	 -0.019199
 -2.431391	 -0.148578	 -0.013870
 -2.435610	 -0.128122	 -0.013047
 -2.442415	 -0.110706	 -0.009701
 -2.449238	 -0.091207	 -0.006058
 -2.453452	 -0.072758	 -0.001627
 -2.457135	 -0.054449	  0.003728
 -2.460668	 -0.032336	  0.007068
 -2.467376	 -0.014822	  0.007225
 -2.475699	  0.003105	  0.009635
 -2.482319	  0.022724	  0.011047
 -2.487737	  0.041915	  0.011770
 -2.494771	  0.060115	  0.013921
 -2.498995	  0.069255	  0.015031
 -2.508048	  0.088841	  0.017409
