  1.394428	  2.630468	  0.563121
  1.380622	  2.604424	  0.557546
  1.360763	  2.567963	  0.552688
  1.344313	  2.525558	  0.531496
  1.323238	  2.484996	  0.517822
  1.302557	  2.440629	  0.508302
  1.279470	  2.395723	  0.492021
  1.254770	  2.353692	  0.482625
  1.236340	  2.308750	  0.466058
  1.213332	  2.264900	  0.452975
  1.192168	  2.224559	  0.441151
  1.172876	  2.183413	  0.426332
  1.154792	  2.140528	  0.411823
  1.133023	  2.093509	  0.394761
  1.114224	  2.050243	  0.381807
  1.092174	  2.011638	  0.368334
  1.068614	  1.983988	  0.348417
  1.022371	  1.979298	  0.276349
  0.985358	  1.969226	  0.210585
  0.933752	  1.943779	  0.155926
  0.903098	  1.938411	  0.141743
  0.950039	  1.944195	  0.056147
  0.977691	  1.851973	  0.040953
  1.013310	  1.748328	 -0.014643
  1.018814	  1.685962	 -0.019365
  1.041870	  1.646448	 -0.043727
  1.086683	  1.561614	 -0.055209
  1.088979	  1.473924	 -0.065367
  1.100227	  1.423027	 -0.066259
  1.085667	  1.357578	 -0.041411
  1.036992	  1.293541	 -0.052051
  1.021562	  1.192139	 -0.051612
  0.985312	  1.138999	 -0.054987
  0.958347	  1.099523	 -0.075429
  0.913627	  1.072986	 -0.080384
  0.882866	  1.029142	 -0.083149
  0.812549	  0.980396	 -0.050558
  0.782378	  0.945294	  0.002199
  0.749128	  0.961726	  0.022886
  0.641239	  0.949551	  0.032750
  0.578949	  0.922403	  0.015767
  0.546655	  0.895801	 -0.000160
  0.520364	  0.853282	 -0.014840
  0.498093	  0.810475	 -0.029723
  0.474769	  0.766999	 -0.044059
  0.454194	  0.727275	 -0.056394
  0.432606	  0.683737	 -0.068606
  0.411622	  0.640832	 -0.080940
  0.390552	  0.599001	 -0.095370
  0.368668	  0.557099	 -0.109663
  0.346258	  0.514757	 -0.123579
  0.326676	  0.472980	 -0.135616
  0.303834	  0.427663	 -0.147913
  0.282506	  0.384366	 -0.161441
  0.263212	  0.343977	 -0.173414
  0.242282	  0.299328	 -0.187002
  0.216519	  0.255870	 -0.202438
  0.197564	  0.209770	 -0.213673
  0.173315	  0.171020	 -0.229706
  0.153463	  0.127632	 -0.243235
  0.131682	  0.085359	 -0.256184
  0.111363	  0.042496	 -0.270394
  0.086063	 -0.000549	 -0.283919
  0.070535	 -0.040824	 -0.300188
  0.049334	 -0.085864	 -0.309280
  0.026382	 -0.127371	 -0.328867
  0.006707	 -0.172553	 -0.341725
 -0.015538	 -0.216998	 -0.353166
 -0.035830	 -0.255591	 -0.368376
 -0.056227	 -0.295502	 -0.382941
 -0.079019	 -0.342067	 -0.394944
 -0.103305	 -0.387402	 -0.405263
 -0.124262	 -0.432544	 -0.421936
 -0.144327	 -0.474961	 -0.436378
 -0.164100	 -0.517806	 -0.449230
 -0.184387	 -0.557820	 -0.462922
 -0.203960	 -0.600969	 -0.478572
 -0.225852	 -0.644075	 -0.493561
 -0.246568	 -0.687513	 -0.508043
 -0.266587	 -0.728262	 -0.521927
 -0.286559	 -0.770931	 -0.537438
 -0.310032	 -0.816929	 -0.552945
 -0.329698	 -0.855611	 -0.568939
 -0.350634	 -0.897506	 -0.585857
 -0.365371	 -0.924912	 -0.613491
 -0.333004	 -1.008423	 -0.697460
 -0.392215	 -1.058245	 -0.772398
 -0.423011	 -1.081278	 -0.781114
 -0.453268	 -1.092575	 -0.785490
 -0.481730	 -1.101379	 -0.802533
 -0.518224	 -1.178008	 -0.870932
 -0.563010	 -1.216500	 -0.851689
 -0.605396	 -1.227023	 -0.902663
 -0.627963	 -1.288364	 -0.910486
 -0.654516	 -1.311022	 -0.937942
 -0.694792	 -1.321044	 -0.953007
 -0.739548	 -1.364915	 -1.001417
 -0.743172	 -1.407058	 -1.026035
 -0.747706	 -1.462169	 -1.023473
 -0.698137	 -1.520604	 -1.027265
 -0.779341	 -1.557102	 -0.998636
 -0.741512	 -1.613019	 -1.003758
 -0.760711	 -1.700130	 -0.874540
 -0.782736	 -1.753392	 -0.868700
 -0.801523	 -1.793367	 -0.878358
 -0.821048	 -1.835202	 -0.890183
 -0.841244	 -1.878208	 -0.903068
 -0.861171	 -1.920872	 -0.917140
 -0.882639	 -1.964694	 -0.931140
 -0.906142	 -2.011957	 -0.944981
 -0.926132	 -2.052487	 -0.956924
 -0.945973	 -2.093809	 -0.972532
 -0.969794	 -2.135609	 -0.988259
 -0.994224	 -2.179290	 -1.002602
 -1.017069	 -2.221156	 -1.016267
 -1.037442	 -2.263473	 -1.031325
 -1.059463	 -2.308833	 -1.047501
 -1.081084	 -2.353792	 -1.061543
 -1.102087	 -2.396617	 -1.072836
 -1.122236	 -2.438313	 -1.088518
 -1.142657	 -2.483506	 -1.099555
 -1.166438	 -2.527335	 -1.118927
 -1.178102	 -2.552609	 -1.130117
