  0.172367	  2.183818	 -1.217696
  0.199413	  2.201316	 -1.252673
  0.188142	  2.193536	 -1.238098
  0.176891	  2.185675	 -1.223551
  0.165528	  2.177622	 -1.209211
  0.154093	  2.168215	 -1.195893
  0.143749	  2.157687	 -1.182598
  0.133038	  2.147505	 -1.168155
  0.122926	  2.137131	 -1.155127
  0.112300	  2.125256	 -1.144697
  0.100289	  2.112653	 -1.131810
  0.093187	  2.100506	 -1.117375
  0.086677	  2.095607	 -1.095714
  0.072313	  2.093727	 -1.081615
  0.056996	  2.087417	 -1.068620
  0.047056	  2.077682	 -1.053714
  0.041629	  2.069952	 -1.035267
  0.034963	  2.061756	 -1.019870
  0.029018	  2.050304	 -1.004896
  0.025125	  2.041755	 -0.982270
  0.018831	  2.039521	 -0.962364
  0.006966	  2.035032	 -0.951391
 -0.002151	  2.025543	 -0.935788
 -0.011868	  2.020671	 -0.911983
 -0.022262	  2.021250	 -0.896565
 -0.036853	  2.016765	 -0.884072
 -0.049181	  2.012163	 -0.870316
 -0.066187	  2.010013	 -0.858169
 -0.083974	  2.007364	 -0.849069
 -0.098268	  2.004734	 -0.840426
 -0.115661	  2.002583	 -0.828807
 -0.137402	  2.002012	 -0.821275
 -0.156301	  2.001262	 -0.818644
 -0.176205	  1.997326	 -0.821503
 -0.197380	  1.994380	 -0.823725
 -0.215811	  1.994405	 -0.819759
 -0.235517	  1.992586	 -0.815408
 -0.256661	  1.991663	 -0.812585
 -0.275629	  1.988783	 -0.814680
 -0.295499	  1.984717	 -0.816696
 -0.315518	  1.981944	 -0.815890
 -0.334488	  1.979192	 -0.812757
 -0.354161	  1.975366	 -0.809243
 -0.375387	  1.975064	 -0.808665
 -0.393961	  1.971464	 -0.807379
 -0.413356	  1.967173	 -0.804096
 -0.433116	  1.964422	 -0.800363
 -0.451016	  1.962921	 -0.792481
 -0.465172	  1.966586	 -0.780258
 -0.480425	  1.972188	 -0.773396
 -0.494386	  1.984423	 -0.762334
 -0.501214	  1.996919	 -0.746204
 -0.501554	  2.007786	 -0.730765
 -0.501139	  2.020948	 -0.714031
 -0.497614	  2.032943	 -0.697949
 -0.495135	  2.044795	 -0.681862
 -0.492948	  2.056564	 -0.665804
 -0.489894	  2.068321	 -0.649835
 -0.481479	  2.075301	 -0.632788
 -0.472121	  2.081199	 -0.616082
 -0.462229	  2.087030	 -0.599732
 -0.452754	  2.092901	 -0.583106
 -0.443080	  2.098760	 -0.566620
 -0.433535	  2.104535	 -0.550038
 -0.423531	  2.106584	 -0.532812
 -0.413447	  2.107581	 -0.515590
 -0.403635	  2.108578	 -0.498196
 -0.393749	  2.109573	 -0.480821
 -0.383945	  2.110571	 -0.463427
 -0.373747	  2.111545	 -0.446249
 -0.364125	  2.112534	 -0.428831
 -0.356200	  2.112884	 -0.410821
 -0.351530	  2.111411	 -0.391845
 -0.346384	  2.109750	 -0.372659
 -0.341183	  2.107529	 -0.353002
 -0.337215	  2.105141	 -0.333526
 -0.334741	  2.103924	 -0.313868
 -0.332011	  2.103454	 -0.294218
 -0.328036	  2.103155	 -0.274905
 -0.325379	  2.102168	 -0.255303
 -0.327508	  2.099091	 -0.233892
 -0.333050	  2.094996	 -0.214949
 -0.337433	  2.087157	 -0.196794
 -0.338133	  2.084781	 -0.178445
 -0.341995	  2.083764	 -0.158316
 -0.351102	  2.077324	 -0.138823
 -0.351682	  2.071370	 -0.122439
 -0.358682	  2.066469	 -0.103848
 -0.367016	  2.060705	 -0.085910
 -0.373655	  2.051383	 -0.070943
 -0.381176	  2.041286	 -0.053048
 -0.393787	  2.035315	 -0.038580
 -0.405596	  2.030672	 -0.024808
 -0.411577	  2.020115	 -0.007182
 -0.423885	  2.011321	  0.008450
 -0.437713	  2.005493	  0.016305
 -0.452585	  1.994792	  0.026279
 -0.468131	  1.983825	  0.034317
 -0.483178	  1.974530	  0.043430
 -0.499937	  1.964482	  0.047911
 -0.516035	  1.953109	  0.051084
 -0.529369	  1.940522	  0.060829
 -0.542259	  1.926776	  0.067533
 -0.554626	  1.911939	  0.071808
 -0.571765	  1.902531	  0.080258
 -0.589091	  1.892737	  0.085690
 -0.605881	  1.881529	  0.087757
 -0.619006	  1.866988	  0.089951
 -0.632511	  1.848839	  0.099399
 -0.638720	  1.834564	  0.112507
 -0.650115	  1.818952	  0.117489
 -0.654175	  1.797493	  0.122248
 -0.665500	  1.780064	  0.123972
 -0.665473	  1.762701	  0.136006
 -0.669770	  1.749584	  0.154045
 -0.675199	  1.735045	  0.170401
 -0.682429	  1.721821	  0.175306
 -0.689479	  1.705022	  0.187087
 -0.693474	  1.691054	  0.199101
 -0.699783	  1.675201	  0.210625
 -0.707141	  1.658989	  0.222545
 -0.709767	  1.643283	  0.235525
 -0.709682	  1.627079	  0.244938
 -0.714405	  1.610643	  0.255221
 -0.720331	  1.597910	  0.267865
 -0.735198	  1.588846	  0.278733
 -0.743392	  1.573582	  0.298218
 -0.748938	  1.564293	  0.310205
 -0.753758	  1.552174	  0.325125
 -0.770453	  1.545977	  0.339458
 -0.778777	  1.533377	  0.346541
 -0.787999	  1.520256	  0.358386
 -0.797135	  1.507340	  0.369675
 -0.805918	  1.503902	  0.391507
 -0.817320	  1.501900	  0.408546
 -0.826635	  1.493661	  0.423177
 -0.837771	  1.482437	  0.435686
 -0.848919	  1.475567	  0.448923
 -0.858765	  1.466917	  0.465260
 -0.866288	  1.455539	  0.483802
 -0.877260	  1.451601	  0.498372
 -0.894986	  1.447598	  0.510879
 -0.908914	  1.438965	  0.522398
 -0.917727	  1.435123	  0.538886
 -0.931935	  1.432937	  0.551437
 -0.949100	  1.419766	  0.565692
 -0.958631	  1.404677	  0.575621
 -0.973723	  1.402218	  0.586964
 -0.991997	  1.404081	  0.597247
 -1.007964	  1.395072	  0.612210
 -1.023067	  1.388998	  0.622648
 -1.043857	  1.388903	  0.625248
 -1.067027	  1.387782	  0.624435
 -1.082690	  1.380757	  0.631411
 -1.100546	  1.373522	  0.642849
 -1.118082	  1.372963	  0.652818
 -1.136133	  1.371304	  0.662423
 -1.152784	  1.362120	  0.665433
 -1.172472	  1.354810	  0.668991
 -1.190929	  1.351498	  0.675244
 -1.209008	  1.351932	  0.684123
 -1.230339	  1.351584	  0.689113
 -1.249176	  1.350049	  0.690143
 -1.268357	  1.349621	  0.696356
 -1.287414	  1.347156	  0.703627
 -1.306655	  1.343772	  0.710097
 -1.325667	  1.343340	  0.715183
 -1.344547	  1.344097	  0.722095
 -1.363920	  1.343554	  0.728069
 -1.383505	  1.342957	  0.734881
 -1.400573	  1.344348	  0.746247
 -1.414974	  1.342457	  0.761219
 -1.432286	  1.336448	  0.770808
 -1.451038	  1.327565	  0.778734
 -1.464680	  1.319580	  0.789827
 -1.479030	  1.313081	  0.804038
 -1.489097	  1.308305	  0.820275
 -1.499894	  1.302530	  0.836842
 -1.509915	  1.295349	  0.853675
 -1.516979	  1.289342	  0.871500
 -1.525353	  1.282618	  0.888395
 -1.533620	  1.274211	  0.905434
 -1.536525	  1.264113	  0.925134
 -1.538198	  1.255658	  0.942221
 -1.540687	  1.249683	  0.961729
 -1.542500	  1.242042	  0.980743
 -1.540271	  1.232905	  0.999067
 -1.538560	  1.223774	  1.016615
 -1.533625	  1.213241	  1.037395
 -1.528178	  1.203034	  1.052493
 -1.521102	  1.187882	  1.064163
 -1.513788	  1.174071	  1.079169
 -1.507302	  1.164583	  1.095536
 -1.509129	  1.153366	  1.112008
 -1.498511	  1.142020	  1.129941
 -1.486210	  1.133649	  1.143861
 -1.478722	  1.122594	  1.154565
 -1.469265	  1.111212	  1.168864
 -1.456914	  1.097281	  1.183329
 -1.442139	  1.089668	  1.193551
 -1.430839	  1.083858	  1.207009
 -1.417441	  1.075003	  1.221287
 -1.401821	  1.065810	  1.229463
 -1.386121	  1.058309	  1.240428
 -1.372969	  1.053609	  1.254355
 -1.360876	  1.045942	  1.268490
 -1.348438	  1.037849	  1.281867
 -1.340034	  1.031066	  1.298242
 -1.333784	  1.024684	  1.315228
 -1.330158	  1.016064	  1.332370
 -1.330717	  1.006119	  1.348855
 -1.332043	  0.996225	  1.365690
 -1.337638	  0.986500	  1.382039
 -1.343193	  0.976782	  1.398218
 -1.350916	  0.967859	  1.414420
 -1.358316	  0.959663	  1.431172
 -1.366530	  0.951797	  1.447571
 -1.374425	  0.944737	  1.464544
 -1.382732	  0.937455	  1.481355
 -1.390571	  0.931482	  1.498855
 -1.397920	  0.926052	  1.516651
 -1.405540	  0.920899	  1.534473
 -1.413011	  0.916743	  1.552650
 -1.421110	  0.912861	  1.570491
 -1.429650	  0.909774	  1.588248
 -1.438059	  0.906725	  1.606213
 -1.447047	  0.903829	  1.623787
 -1.456528	  0.901048	  1.641393
 -1.465478	  0.897662	  1.658756
 -1.475252	  0.893774	  1.675684
 -1.484619	  0.888821	  1.692198
 -1.494504	  0.883517	  1.709005
 -1.504412	  0.878156	  1.725675
 -1.514314	  0.872347	  1.742092
 -1.524569	  0.866569	  1.758252
 -1.534365	  0.859939	  1.774393
 -1.544330	  0.852976	  1.790298
 -1.553623	  0.846041	  1.806388
 -1.561259	  0.839362	  1.819912
 -1.571203	  0.831464	  1.835362
