 -0.414922	 -1.557534	 -1.775857
 -0.420139	 -1.591279	 -1.809589
 -0.425356	 -1.625024	 -1.843321
 -0.423202	 -1.608948	 -1.831624
 -0.423315	 -1.590923	 -1.823028
 -0.426227	 -1.571550	 -1.819098
 -0.432836	 -1.553673	 -1.824860
 -0.439407	 -1.537045	 -1.831168
 -0.447486	 -1.520494	 -1.839348
 -0.456304	 -1.501096	 -1.849516
 -0.463329	 -1.485619	 -1.857338
 -0.469094	 -1.471018	 -1.864596
 -0.473047	 -1.451423	 -1.873747
 -0.479813	 -1.434405	 -1.881119
 -0.487783	 -1.417800	 -1.887512
 -0.491977	 -1.399163	 -1.894602
 -0.496078	 -1.381072	 -1.900804
 -0.502387	 -1.362161	 -1.906746
 -0.504536	 -1.342597	 -1.914218
 -0.501059	 -1.325111	 -1.919208
 -0.497955	 -1.305019	 -1.924880
 -0.498162	 -1.285590	 -1.930498
 -0.499475	 -1.266618	 -1.933223
 -0.500393	 -1.246125	 -1.936731
 -0.496573	 -1.226751	 -1.944232
 -0.491282	 -1.208056	 -1.947698
 -0.486018	 -1.188923	 -1.948420
 -0.481177	 -1.169237	 -1.949412
 -0.476076	 -1.149938	 -1.950406
 -0.470668	 -1.130761	 -1.951235
 -0.463914	 -1.111973	 -1.951248
 -0.455827	 -1.093815	 -1.949963
 -0.447153	 -1.075980	 -1.947360
 -0.437576	 -1.059159	 -1.943223
 -0.428040	 -1.042368	 -1.937728
 -0.417825	 -1.027396	 -1.929788
 -0.408907	 -1.011920	 -1.923569
 -0.397803	 -0.997255	 -1.915990
 -0.385815	 -0.983440	 -1.907601
 -0.372416	 -0.971874	 -1.899114
 -0.358304	 -0.961527	 -1.889804
 -0.343259	 -0.953783	 -1.879105
 -0.328995	 -0.945291	 -1.867294
 -0.315960	 -0.938515	 -1.854265
 -0.305136	 -0.929779	 -1.840041
 -0.292838	 -0.922096	 -1.824997
 -0.278732	 -0.915110	 -1.812258
 -0.264714	 -0.907944	 -1.801151
 -0.250255	 -0.900539	 -1.790391
 -0.234183	 -0.894610	 -1.778298
 -0.219241	 -0.889316	 -1.767232
 -0.204690	 -0.883141	 -1.755533
 -0.189304	 -0.876987	 -1.742132
 -0.173566	 -0.870819	 -1.731187
 -0.161168	 -0.863712	 -1.717450
 -0.150005	 -0.857960	 -1.702475
 -0.136457	 -0.854068	 -1.689105
 -0.121153	 -0.853225	 -1.672995
 -0.107678	 -0.850904	 -1.656431
 -0.095754	 -0.845012	 -1.642787
 -0.084590	 -0.834284	 -1.630801
 -0.071399	 -0.830261	 -1.614604
 -0.061436	 -0.828738	 -1.595658
 -0.053606	 -0.825694	 -1.577905
 -0.044995	 -0.819212	 -1.562492
 -0.036250	 -0.812741	 -1.544703
 -0.027132	 -0.805474	 -1.528401
 -0.016085	 -0.796562	 -1.511098
 -0.006845	 -0.786248	 -1.496688
  0.001238	 -0.778110	 -1.483794
  0.010646	 -0.769516	 -1.466337
  0.019964	 -0.764328	 -1.449510
  0.028622	 -0.757272	 -1.432347
  0.037229	 -0.752647	 -1.415434
  0.044345	 -0.745948	 -1.397740
  0.051275	 -0.740733	 -1.379860
  0.058152	 -0.735505	 -1.361899
  0.064701	 -0.729693	 -1.343833
  0.070182	 -0.723345	 -1.325704
  0.075542	 -0.716477	 -1.307691
  0.080255	 -0.708489	 -1.290342
  0.083866	 -0.697933	 -1.274168
  0.087994	 -0.687487	 -1.255083
  0.091585	 -0.681431	 -1.236698
  0.092525	 -0.677621	 -1.218391
  0.092361	 -0.668312	 -1.201176
  0.095756	 -0.655416	 -1.181369
  0.097816	 -0.649355	 -1.164081
  0.095304	 -0.642104	 -1.147024
  0.094369	 -0.631844	 -1.128108
  0.096711	 -0.622899	 -1.109826
  0.092781	 -0.615503	 -1.093137
  0.088229	 -0.607584	 -1.075220
  0.088303	 -0.598119	 -1.054935
  0.087505	 -0.586711	 -1.038379
  0.084524	 -0.573757	 -1.025179
  0.081362	 -0.561972	 -1.008550
  0.076516	 -0.554054	 -0.991414
  0.068449	 -0.546232	 -0.973708
  0.064583	 -0.533914	 -0.957005
  0.063813	 -0.520461	 -0.942423
  0.063484	 -0.508115	 -0.926041
  0.059285	 -0.497664	 -0.909463
  0.054206	 -0.487105	 -0.894302
  0.049018	 -0.475751	 -0.877936
  0.044165	 -0.466874	 -0.860519
  0.040526	 -0.455891	 -0.842714
  0.035124	 -0.440847	 -0.830038
  0.027335	 -0.429043	 -0.818143
  0.019873	 -0.413920	 -0.804190
  0.018231	 -0.398424	 -0.789705
  0.015467	 -0.387499	 -0.775152
  0.008387	 -0.372670	 -0.759821
  0.002892	 -0.356291	 -0.747628
 -0.004195	 -0.344311	 -0.737587
 -0.013133	 -0.333845	 -0.723611
 -0.023233	 -0.321949	 -0.708990
 -0.031577	 -0.310622	 -0.696632
 -0.039962	 -0.293378	 -0.680146
 -0.040410	 -0.279318	 -0.665570
 -0.042432	 -0.268634	 -0.654852
 -0.050439	 -0.254204	 -0.642587
 -0.055616	 -0.237795	 -0.628169
 -0.053363	 -0.222561	 -0.613604
 -0.053366	 -0.209750	 -0.597956
 -0.059112	 -0.198501	 -0.585892
 -0.063924	 -0.182244	 -0.572409
 -0.060927	 -0.166038	 -0.557949
 -0.060918	 -0.154263	 -0.544470
 -0.064113	 -0.139197	 -0.531493
 -0.065181	 -0.123883	 -0.516704
 -0.059269	 -0.107998	 -0.503932
 -0.057035	 -0.092343	 -0.494118
 -0.055491	 -0.078912	 -0.480011
 -0.049423	 -0.066613	 -0.459400
 -0.041487	 -0.057497	 -0.441258
 -0.045842	 -0.041797	 -0.430698
 -0.047359	 -0.023892	 -0.421328
 -0.045492	 -0.008157	 -0.409234
 -0.041571	  0.008820	 -0.396554
 -0.037779	  0.026038	 -0.388000
 -0.035363	  0.039606	 -0.373066
 -0.036294	  0.051050	 -0.352077
 -0.036360	  0.068239	 -0.343143
 -0.035005	  0.082916	 -0.333274
 -0.036801	  0.100134	 -0.317809
 -0.034185	  0.117240	 -0.309377
 -0.029559	  0.132629	 -0.299388
 -0.028776	  0.151587	 -0.283503
 -0.031953	  0.163169	 -0.267181
 -0.029799	  0.173181	 -0.253932
 -0.027261	  0.191303	 -0.241520
 -0.021254	  0.207663	 -0.232769
 -0.016542	  0.225388	 -0.219247
 -0.015225	  0.240951	 -0.206046
 -0.011713	  0.251281	 -0.193211
 -0.008918	  0.266032	 -0.177935
 -0.008904	  0.280373	 -0.163291
 -0.010311	  0.294591	 -0.149084
 -0.009952	  0.311192	 -0.135970
 -0.010479	  0.327473	 -0.124206
 -0.004479	  0.344098	 -0.113351
  0.002425	  0.359277	 -0.101949
  0.010363	  0.373282	 -0.089509
  0.016236	  0.387321	 -0.076319
  0.020814	  0.401697	 -0.063037
  0.024576	  0.415399	 -0.049260
  0.028738	  0.427715	 -0.033998
  0.033345	  0.441389	 -0.017958
  0.037833	  0.453694	 -0.003685
  0.043045	  0.468456	  0.007815
  0.048510	  0.481108	  0.022579
  0.054517	  0.493376	  0.038751
  0.062039	  0.511789	  0.052437
  0.065515	  0.531024	  0.062211
  0.065548	  0.546047	  0.060871
  0.070385	  0.566339	  0.071166
  0.074167	  0.584133	  0.082578
  0.075388	  0.601936	  0.093580
  0.074495	  0.617215	  0.107523
  0.080100	  0.629072	  0.122081
  0.091552	  0.643213	  0.135758
  0.095428	  0.659225	  0.146182
  0.093651	  0.677855	  0.156127
  0.097573	  0.693854	  0.165897
  0.104992	  0.707165	  0.177164
  0.111555	  0.726484	  0.191759
  0.113493	  0.741861	  0.199979
  0.116539	  0.759798	  0.206196
  0.122456	  0.779107	  0.216678
  0.128754	  0.792232	  0.231430
  0.136390	  0.802432	  0.247017
  0.142232	  0.817219	  0.258021
  0.141884	  0.836802	  0.269126
  0.144649	  0.855123	  0.274857
  0.153102	  0.869063	  0.285972
  0.159631	  0.883303	  0.302976
  0.164450	  0.898961	  0.316088
  0.169759	  0.914696	  0.320400
  0.177288	  0.931576	  0.331970
  0.181129	  0.947194	  0.346226
  0.185778	  0.960810	  0.359083
  0.194480	  0.974589	  0.369556
  0.203450	  0.990786	  0.378309
  0.210136	  1.007657	  0.386153
  0.218804	  1.025291	  0.396086
  0.227067	  1.037660	  0.405466
  0.238451	  1.051452	  0.417099
  0.249719	  1.065405	  0.429231
  0.253748	  1.080411	  0.440397
  0.259655	  1.097738	  0.450490
  0.269315	  1.113018	  0.462180
  0.275081	  1.125226	  0.470288
  0.279838	  1.142907	  0.481824
  0.289862	  1.160254	  0.491188
  0.300356	  1.176726	  0.494935
  0.313353	  1.191032	  0.503605
  0.319003	  1.205522	  0.515543
  0.323083	  1.221776	  0.525727
  0.332435	  1.237908	  0.539751
  0.339997	  1.251297	  0.548767
  0.348697	  1.267957	  0.556920
  0.358817	  1.281699	  0.566732
  0.366743	  1.295435	  0.577126
  0.371291	  1.305259	  0.589082
  0.381445	  1.323213	  0.608288
  0.393430	  1.341569	  0.623609
  0.394493	  1.351262	  0.625445
  0.398119	  1.369262	  0.637292
  0.398117	  1.383442	  0.656070
  0.401122	  1.396978	  0.672862
  0.408530	  1.410378	  0.680166
  0.419367	  1.426757	  0.690963
  0.430003	  1.440302	  0.706530
  0.427636	  1.452844	  0.723817
  0.422541	  1.467330	  0.739247
  0.417823	  1.485470	  0.748697
  0.419766	  1.503218	  0.756983
  0.426575	  1.521233	  0.765627
  0.428433	  1.537474	  0.778354
  0.423070	  1.554273	  0.790136
  0.415405	  1.572389	  0.801213
  0.416153	  1.587723	  0.808515
  0.418896	  1.605112	  0.819085
  0.421156	  1.622750	  0.833459
  0.419983	  1.638468	  0.843413
  0.420222	  1.655559	  0.853111
  0.420389	  1.672876	  0.864218
  0.417448	  1.690418	  0.872553
  0.413765	  1.708897	  0.880946
  0.415117	  1.724718	  0.892470
  0.418130	  1.742209	  0.903546
  0.417586	  1.760906	  0.915477
  0.411228	  1.777777	  0.925530
  0.410158	  1.792122	  0.933619
  0.410156	  1.810807	  0.946199
  0.408636	  1.825758	  0.957602
  0.405995	  1.840797	  0.969693
  0.401157	  1.856899	  0.981932
  0.397054	  1.874063	  0.990112
  0.395277	  1.892671	  1.001762
  0.393165	  1.910722	  1.012056
  0.391063	  1.926917	  1.020543
  0.390537	  1.942370	  1.032371
  0.388902	  1.958601	  1.044649
  0.386349	  1.974608	  1.054797
  0.387224	  1.992629	  1.069594
  0.384446	  2.003344	  1.084505
  0.380007	  2.018606	  1.098863
  0.378120	  2.035784	  1.109761
  0.383020	  2.052304	  1.117359
  0.387006	  2.070758	  1.128723
  0.388122	  2.086430	  1.141534
  0.389514	  2.101183	  1.153455
  0.392959	  2.117501	  1.164933
  0.395855	  2.133779	  1.176790
  0.398584	  2.150246	  1.189033
  0.400165	  2.158876	  1.195459
  0.403821	  2.178839	  1.210325
