  0.857375	  1.137513	  2.032167
  0.873346	  1.150831	  2.040308
  0.854040	  1.134731	  2.030466
  0.814827	  1.108559	  2.014326
  0.777657	  1.078122	  1.998893
  0.744093	  1.043304	  1.984249
  0.712120	  1.008082	  1.968703
  0.679755	  0.973770	  1.953085
  0.645637	  0.941318	  1.937927
  0.608821	  0.911588	  1.922313
  0.571063	  0.881941	  1.906115
  0.535140	  0.850720	  1.887263
  0.503249	  0.818219	  1.863470
  0.473581	  0.785759	  1.837506
  0.444893	  0.754028	  1.810832
  0.416581	  0.723068	  1.783546
  0.388401	  0.691858	  1.755317
  0.360713	  0.659411	  1.727334
  0.332938	  0.626072	  1.700590
  0.304872	  0.592446	  1.675217
  0.276028	  0.558769	  1.650921
  0.245699	  0.525554	  1.628213
  0.213584	  0.492390	  1.608410
  0.180017	  0.459792	  1.591991
  0.145283	  0.427204	  1.578039
  0.109122	  0.395345	  1.566515
  0.074721	  0.362576	  1.554867
  0.043226	  0.326115	  1.540222
  0.009343	  0.292492	  1.525912
 -0.026137	  0.259674	  1.509657
 -0.063138	  0.229379	  1.492230
 -0.101201	  0.201004	  1.474489
 -0.139570	  0.173500	  1.457179
 -0.178107	  0.145703	  1.440135
 -0.215850	  0.117057	  1.423801
 -0.252519	  0.087271	  1.407990
 -0.288395	  0.056011	  1.391787
 -0.322492	  0.023108	  1.374431
 -0.354698	 -0.011783	  1.356181
 -0.385294	 -0.048049	  1.337751
 -0.414200	 -0.083739	  1.318823
 -0.442444	 -0.118424	  1.298085
 -0.470493	 -0.151311	  1.274555
 -0.499767	 -0.181877	  1.248255
 -0.530868	 -0.209755	  1.219909
 -0.562793	 -0.234092	  1.190023
 -0.594781	 -0.255227	  1.159724
 -0.626783	 -0.273022	  1.129824
 -0.659446	 -0.286949	  1.100074
 -0.694063	 -0.297384	  1.068480
 -0.732772	 -0.304195	  1.032199
 -0.777319	 -0.305545	  0.989373
 -0.827330	 -0.298309	  0.943157
 -0.879785	 -0.282656	  0.900382
 -0.929224	 -0.266879	  0.863975
 -0.976710	 -0.259075	  0.833346
 -1.026141	 -0.261297	  0.806574
 -1.083256	 -0.273741	  0.780815
 -1.149160	 -0.295424	  0.754778
 -1.218902	 -0.327647	  0.724529
 -1.282784	 -0.369590	  0.688000
 -1.334340	 -0.418582	  0.647119
 -1.371479	 -0.469767	  0.608113
 -1.396179	 -0.519087	  0.575659
 -1.411985	 -0.564302	  0.551784
 -1.422507	 -0.608277	  0.534750
 -1.430419	 -0.657751	  0.522109
 -1.437575	 -0.717742	  0.513365
 -1.445208	 -0.788083	  0.508113
 -1.456852	 -0.862302	  0.505289
 -1.474146	 -0.930335	  0.503622
 -1.493743	 -0.986358	  0.502923
 -1.512603	 -1.031358	  0.501732
 -1.530722	 -1.070121	  0.499304
 -1.549535	 -1.107210	  0.495690
 -1.570319	 -1.144189	  0.491681
 -1.594032	 -1.181144	  0.487042
 -1.620629	 -1.217379	  0.481041
 -1.650190	 -1.252241	  0.473115
 -1.682007	 -1.285887	  0.462890
 -1.715322	 -1.318684	  0.449924
 -1.749536	 -1.350830	  0.434186
 -1.783546	 -1.381886	  0.416932
 -1.817667	 -1.413303	  0.398271
 -1.850517	 -1.445238	  0.378980
 -1.881883	 -1.477574	  0.359193
 -1.942659	 -1.540953	  0.318652
 -1.944064	 -1.542396	  0.317709
