  1.358421	 -1.948642	  0.513444
  1.370157	 -1.969644	  0.504146
  1.381893	 -1.990646	  0.494848
  1.373597	 -1.974552	  0.500422
  1.364155	 -1.958593	  0.509613
  1.354909	 -1.940782	  0.517111
  1.344252	 -1.924739	  0.521253
  1.331404	 -1.910190	  0.524753
  1.320156	 -1.894108	  0.529704
  1.309305	 -1.878169	  0.535286
  1.296677	 -1.863629	  0.538983
  1.283169	 -1.847758	  0.541216
  1.272860	 -1.829891	  0.542319
  1.264294	 -1.813807	  0.549344
  1.252115	 -1.798970	  0.555880
  1.239781	 -1.784090	  0.561548
  1.228015	 -1.768143	  0.565334
  1.215925	 -1.752415	  0.567815
  1.203436	 -1.737404	  0.570917
  1.189501	 -1.723579	  0.574939
  1.175823	 -1.709318	  0.579650
  1.163912	 -1.693701	  0.584363
  1.152178	 -1.678429	  0.588381
  1.139375	 -1.663113	  0.591322
  1.125579	 -1.649461	  0.594821
  1.111739	 -1.634751	  0.599152
  1.097417	 -1.621999	  0.604902
  1.082994	 -1.609985	  0.611983
  1.069249	 -1.596954	  0.619329
  1.054834	 -1.586657	  0.628120
  1.041262	 -1.574370	  0.636608
  1.027102	 -1.563658	  0.645174
  1.012873	 -1.552564	  0.653547
  0.999393	 -1.540394	  0.662397
  0.985747	 -1.528815	  0.671167
  0.973029	 -1.516386	  0.679801
  0.961953	 -1.502117	  0.688519
  0.952660	 -1.487981	  0.697535
  0.941121	 -1.473027	  0.711826
  0.929817	 -1.462620	  0.721018
  0.917246	 -1.450150	  0.728256
  0.903410	 -1.436100	  0.739406
  0.895960	 -1.422573	  0.751752
  0.889241	 -1.408330	  0.761443
  0.877808	 -1.393951	  0.771095
  0.866884	 -1.379996	  0.778933
  0.858033	 -1.362956	  0.787889
  0.849664	 -1.346956	  0.799620
  0.836089	 -1.335811	  0.806293
  0.823040	 -1.320830	  0.810466
  0.809095	 -1.305750	  0.814411
  0.795542	 -1.292207	  0.820888
  0.783395	 -1.279111	  0.829369
  0.771904	 -1.265328	  0.837235
  0.758748	 -1.251798	  0.845185
  0.746355	 -1.237963	  0.851700
  0.732802	 -1.224627	  0.859134
  0.719670	 -1.210735	  0.864553
  0.706849	 -1.196440	  0.869505
  0.693945	 -1.182099	  0.875320
  0.681551	 -1.167550	  0.881183
  0.668856	 -1.152867	  0.886374
  0.656403	 -1.138610	  0.893026
  0.642970	 -1.125016	  0.899577
  0.629100	 -1.111835	  0.906031
  0.614365	 -1.098345	  0.909556
  0.599851	 -1.084740	  0.913885
  0.586071	 -1.070492	  0.915906
  0.572806	 -1.055773	  0.917588
  0.559368	 -1.040804	  0.920018
  0.546433	 -1.025812	  0.922227
  0.532759	 -1.011376	  0.925279
  0.518955	 -0.997256	  0.928490
  0.505028	 -0.983266	  0.931634
  0.491140	 -0.969326	  0.933906
  0.477522	 -0.954600	  0.934595
  0.463644	 -0.938970	  0.937294
  0.450807	 -0.924569	  0.940114
  0.437904	 -0.910133	  0.945480
  0.425199	 -0.894348	  0.949494
  0.413884	 -0.880684	  0.957088
  0.402146	 -0.865601	  0.963533
  0.389487	 -0.849711	  0.968513
  0.378133	 -0.834578	  0.975018
  0.366380	 -0.821997	  0.985144
  0.352586	 -0.809798	  0.993417
  0.338626	 -0.796762	  1.001033
  0.328529	 -0.782498	  1.011158
  0.318696	 -0.768139	  1.022939
  0.305384	 -0.756371	  1.028238
  0.291134	 -0.742440	  1.032764
  0.274827	 -0.728495	  1.038585
  0.258748	 -0.718328	  1.047703
  0.246835	 -0.706957	  1.055548
  0.235683	 -0.693124	  1.065154
  0.224832	 -0.678312	  1.074716
  0.214879	 -0.662835	  1.081657
  0.203075	 -0.647500	  1.086415
  0.189400	 -0.632513	  1.092377
  0.175653	 -0.620276	  1.101918
  0.167098	 -0.606281	  1.112265
  0.156461	 -0.590198	  1.119045
  0.146674	 -0.573350	  1.123380
  0.137829	 -0.555836	  1.128478
  0.129389	 -0.538849	  1.135766
  0.120496	 -0.522677	  1.143526
  0.109839	 -0.507160	  1.150419
  0.099108	 -0.491044	  1.155405
  0.088472	 -0.474733	  1.158913
  0.077279	 -0.458204	  1.163361
  0.065764	 -0.442458	  1.168224
  0.056059	 -0.426160	  1.174199
  0.047645	 -0.409038	  1.179861
  0.038309	 -0.391932	  1.184978
  0.028277	 -0.375123	  1.188761
  0.017486	 -0.359064	  1.193111
  0.007965	 -0.343922	  1.198272
 -0.003452	 -0.326282	  1.208619
 -0.013636	 -0.312668	  1.220144
 -0.027301	 -0.297755	  1.222770
 -0.041462	 -0.282700	  1.227603
 -0.046657	 -0.266641	  1.229777
 -0.052406	 -0.248407	  1.236953
 -0.065456	 -0.229059	  1.247715
 -0.076733	 -0.214599	  1.250398
 -0.088570	 -0.200492	  1.250670
 -0.101787	 -0.183522	  1.253770
 -0.117268	 -0.171317	  1.259103
 -0.126918	 -0.155922	  1.268567
 -0.138873	 -0.143539	  1.281368
 -0.152674	 -0.129933	  1.287654
 -0.160640	 -0.115778	  1.302335
 -0.174282	 -0.105365	  1.316732
 -0.192844	 -0.095020	  1.327146
 -0.211015	 -0.090896	  1.321729
 -0.227325	 -0.080419	  1.323870
 -0.244922	 -0.068550	  1.334928
 -0.258274	 -0.054671	  1.338243
 -0.272813	 -0.042541	  1.342402
 -0.288205	 -0.030487	  1.352412
 -0.301455	 -0.019544	  1.362061
 -0.315038	 -0.008242	  1.368195
 -0.330156	  0.004508	  1.376723
 -0.344638	  0.017677	  1.381281
 -0.357034	  0.030092	  1.386979
 -0.373382	  0.041632	  1.396463
 -0.390679	  0.051588	  1.401466
 -0.401266	  0.068505	  1.408964
 -0.409793	  0.086999	  1.413249
 -0.421027	  0.103129	  1.413519
 -0.433966	  0.118265	  1.415710
 -0.448990	  0.131780	  1.421033
 -0.463285	  0.144505	  1.430345
 -0.478033	  0.158503	  1.434523
 -0.485066	  0.174426	  1.436534
 -0.494771	  0.194051	  1.443473
 -0.504913	  0.208644	  1.453993
 -0.514399	  0.222727	  1.461948
 -0.526889	  0.239852	  1.466313
 -0.541857	  0.255347	  1.468585
 -0.553795	  0.265980	  1.472513
 -0.565408	  0.280960	  1.479916
 -0.575540	  0.299956	  1.491283
 -0.582721	  0.315111	  1.497164
 -0.592442	  0.333269	  1.501062
 -0.603400	  0.351316	  1.505808
 -0.612369	  0.364076	  1.512571
 -0.622839	  0.381121	  1.518487
 -0.630524	  0.398908	  1.524717
 -0.639246	  0.414642	  1.535311
 -0.650110	  0.428302	  1.547373
 -0.663692	  0.443262	  1.548058
 -0.676101	  0.459604	  1.549498
 -0.683843	  0.478397	  1.553417
 -0.693011	  0.495714	  1.562766
 -0.704544	  0.508827	  1.575240
 -0.716371	  0.521356	  1.579428
 -0.732514	  0.534517	  1.583955
 -0.743830	  0.549258	  1.591608
 -0.754817	  0.562684	  1.598353
 -0.770911	  0.576279	  1.606396
 -0.781826	  0.588053	  1.616759
 -0.794858	  0.600491	  1.621964
 -0.805868	  0.618498	  1.627469
 -0.821563	  0.632047	  1.633309
 -0.838664	  0.639852	  1.637270
 -0.853115	  0.651192	  1.644588
 -0.865893	  0.665711	  1.655084
 -0.876776	  0.679958	  1.664010
 -0.890389	  0.692252	  1.669869
 -0.908555	  0.703981	  1.672990
 -0.926283	  0.716065	  1.675199
 -0.937270	  0.731116	  1.675465
 -0.948304	  0.748317	  1.676823
 -0.965778	  0.760611	  1.683528
 -0.982517	  0.771207	  1.687684
 -0.993490	  0.786755	  1.692623
 -1.006211	  0.802487	  1.698181
 -1.020561	  0.811666	  1.703516
 -1.035924	  0.824328	  1.709459
 -1.051277	  0.836620	  1.717129
 -1.064280	  0.849626	  1.723474
 -1.076017	  0.865276	  1.735334
 -1.087293	  0.877826	  1.743714
 -1.099847	  0.890129	  1.750666
 -1.112837	  0.903633	  1.760257
 -1.125364	  0.914427	  1.771669
 -1.138407	  0.924039	  1.782440
 -1.151565	  0.936148	  1.792683
 -1.163912	  0.948614	  1.802398
 -1.176148	  0.961384	  1.811734
 -1.187966	  0.975683	  1.819212
 -1.199784	  0.989981	  1.826688
 -1.211558	  1.004554	  1.833509
 -1.223545	  1.018697	  1.839580
 -1.236077	  1.034437	  1.846358
 -1.246861	  1.050542	  1.851555
 -1.256629	  1.068747	  1.854575
 -1.266510	  1.083927	  1.856863
 -1.270098	  1.089338	  1.857470
 -1.278141	  1.101471	  1.858830
