  2.425645	 -0.050197	 -1.815111
  2.401629	 -0.049700	 -1.797139
  2.395774	 -0.034946	 -1.743785
  2.389221	 -0.022179	 -1.697895
  2.379885	 -0.021184	 -1.646087
  2.368092	 -0.009642	 -1.598558
  2.351865	 -0.003347	 -1.551900
  2.339568	  0.005922	 -1.508160
  2.327886	  0.017131	 -1.459321
  2.311387	  0.022890	 -1.410898
  2.295524	  0.031938	 -1.367478
  2.283554	  0.045561	 -1.322090
  2.271449	  0.054978	 -1.269222
  2.262974	  0.058439	 -1.219531
  2.252815	  0.066017	 -1.175497
  2.239358	  0.078459	 -1.129829
  2.224106	  0.082982	 -1.078359
  2.210284	  0.083739	 -1.030181
  2.197657	  0.086767	 -0.982965
  2.181601	  0.094488	 -0.938368
  2.164973	  0.102663	 -0.893205
  2.149836	  0.110164	 -0.845977
  2.136578	  0.117843	 -0.797074
  2.125336	  0.125719	 -0.748724
  2.115881	  0.133317	 -0.700589
  2.107880	  0.139683	 -0.654269
  2.100022	  0.146024	 -0.606705
  2.092201	  0.152933	 -0.557714
  2.083611	  0.161575	 -0.505616
  2.075005	  0.169877	 -0.458312
  2.066264	  0.178353	 -0.411551
  2.055832	  0.187952	 -0.360186
  2.048627	  0.190195	 -0.315268
  2.073070	  0.151261	 -0.280868
  2.156979	 -0.005430	 -0.200203
  2.174106	 -0.084513	 -0.115410
  2.179263	 -0.123705	 -0.055682
  2.225924	 -0.164830	  0.048659
  2.212048	 -0.121386	  0.106778
  2.195244	 -0.102617	  0.140060
  2.223357	 -0.074157	  0.161681
  2.186341	 -0.102094	  0.218644
  2.108876	 -0.059176	  0.290952
  2.057625	 -0.018094	  0.310554
  2.019221	  0.028206	  0.321646
  1.930493	  0.193503	  0.348372
  1.890185	  0.276229	  0.374651
  1.870078	  0.307995	  0.402284
  1.851009	  0.331424	  0.443545
  1.835867	  0.344233	  0.487062
  1.822085	  0.352530	  0.533762
  1.808079	  0.359605	  0.585565
  1.795865	  0.365489	  0.633406
  1.783928	  0.371263	  0.682825
  1.773115	  0.376711	  0.729845
  1.762924	  0.381505	  0.774723
  1.751442	  0.386999	  0.823505
  1.739478	  0.393656	  0.869788
  1.725640	  0.402170	  0.919813
  1.713064	  0.411325	  0.966662
  1.696883	  0.417293	  1.011914
  1.687914	  0.426587	  1.062230
  1.672960	  0.430412	  1.109265
  1.662143	  0.434519	  1.157777
  1.656147	  0.449765	  1.206536
  1.646435	  0.457664	  1.254722
  1.628837	  0.464858	  1.301404
  1.619160	  0.472157	  1.346861
  1.608584	  0.481457	  1.393668
  1.599351	  0.484664	  1.441596
  1.583553	  0.492275	  1.486605
  1.574500	  0.500647	  1.533288
  1.569713	  0.506938	  1.584327
  1.562788	  0.510141	  1.634469
  1.550346	  0.516561	  1.684931
  1.536029	  0.523476	  1.730379
  1.521849	  0.531349	  1.777674
  1.507559	  0.539116	  1.821729
  1.490581	  0.548241	  1.869245
  1.471496	  0.559430	  1.918662
  1.456638	  0.568737	  1.961703
  1.441185	  0.578124	  2.010388
  1.427387	  0.586649	  2.055421
  1.416700	  0.594128	  2.102446
  1.405508	  0.603887	  2.152709
  1.396533	  0.609726	  2.199668
  1.388264	  0.618540	  2.249473
  1.374981	  0.627856	  2.299563
  1.362051	  0.631876	  2.345842
  1.348493	  0.636188	  2.393839
  1.342299	  0.646308	  2.438621
  1.326813	  0.653613	  2.484907
  1.315468	  0.666318	  2.532748
  1.308367	  0.668000	  2.579649
  1.286892	  0.674945	  2.624568
  1.299761	  0.681694	  2.650814
