 -1.941273	  0.791904	  1.226767
 -1.979411	  0.806587	  1.218701
 -1.961383	  0.798969	  1.222602
 -1.943202	  0.791882	  1.226523
 -1.924412	  0.786349	  1.231108
 -1.905646	  0.777857	  1.236626
 -1.889755	  0.767001	  1.240558
 -1.873541	  0.755327	  1.243377
 -1.857806	  0.743501	  1.244988
 -1.840840	  0.732728	  1.248108
 -1.824549	  0.721486	  1.250981
 -1.808301	  0.710173	  1.253818
 -1.792263	  0.698574	  1.256687
 -1.776528	  0.686578	  1.259601
 -1.760792	  0.674582	  1.262516
 -1.745256	  0.662581	  1.266337
 -1.729768	  0.650582	  1.270354
 -1.714357	  0.638530	  1.274507
 -1.699259	  0.626276	  1.279184
 -1.684162	  0.614020	  1.283862
 -1.669634	  0.601145	  1.288677
 -1.655444	  0.587927	  1.293566
 -1.641294	  0.574671	  1.298473
 -1.627406	  0.561188	  1.303500
 -1.614012	  0.547541	  1.308920
 -1.600881	  0.533710	  1.315166
 -1.587529	  0.519308	  1.320255
 -1.573741	  0.504962	  1.323893
 -1.556628	  0.493657	  1.328861
 -1.539755	  0.483534	  1.333784
 -1.524361	  0.475237	  1.341794
 -1.508519	  0.465384	  1.350069
 -1.494765	  0.454457	  1.358369
 -1.478729	  0.441627	  1.364356
 -1.463307	  0.429002	  1.367973
 -1.445964	  0.420690	  1.374537
 -1.430560	  0.413925	  1.382462
 -1.415929	  0.404951	  1.389411
 -1.392546	  0.394930	  1.400236
 -1.377884	  0.390540	  1.403591
 -1.361450	  0.380448	  1.406019
 -1.344333	  0.369543	  1.411098
 -1.327992	  0.361006	  1.417583
 -1.310703	  0.351408	  1.422607
 -1.292246	  0.341291	  1.428429
 -1.278932	  0.330616	  1.435522
 -1.263408	  0.321355	  1.443338
 -1.244211	  0.313618	  1.453034
 -1.226140	  0.307370	  1.453743
 -1.208618	  0.298329	  1.453265
 -1.189863	  0.286703	  1.455680
 -1.172915	  0.277308	  1.460162
 -1.155823	  0.270469	  1.462177
 -1.138237	  0.259520	  1.466000
 -1.122379	  0.248656	  1.471865
 -1.103270	  0.240871	  1.475278
 -1.083587	  0.231730	  1.475519
 -1.072843	  0.219401	  1.482102
 -1.057085	  0.206712	  1.489839
 -1.037979	  0.197688	  1.495040
 -1.020766	  0.191692	  1.494936
 -1.003219	  0.182135	  1.496802
 -0.983027	  0.171855	  1.500662
 -0.966702	  0.162097	  1.505998
 -0.951514	  0.152825	  1.506358
 -0.933034	  0.143172	  1.509291
 -0.915112	  0.134862	  1.512341
 -0.897733	  0.126901	  1.513929
 -0.878676	  0.116994	  1.516050
 -0.861208	  0.109059	  1.522476
 -0.842341	  0.106264	  1.526772
 -0.821573	  0.103965	  1.531039
 -0.803795	  0.095288	  1.534254
 -0.787103	  0.086541	  1.537403
 -0.767774	  0.075038	  1.535959
 -0.752210	  0.064316	  1.534118
 -0.732508	  0.053140	  1.533654
 -0.715073	  0.045472	  1.537269
 -0.698248	  0.039436	  1.541944
 -0.678859	  0.033746	  1.548200
 -0.658268	  0.027117	  1.550521
 -0.644384	  0.014073	  1.550441
 -0.629231	 -0.001634	  1.552832
 -0.609390	 -0.007691	  1.557781
 -0.590555	 -0.012512	  1.559986
 -0.571248	 -0.021651	  1.560906
 -0.555923	 -0.034983	  1.562624
 -0.539650	 -0.044974	  1.564352
 -0.522161	 -0.055287	  1.561533
 -0.505615	 -0.066863	  1.560745
 -0.487725	 -0.076876	  1.561574
 -0.467834	 -0.083387	  1.560290
 -0.449005	 -0.089453	  1.554065
 -0.434139	 -0.098586	  1.544899
 -0.419586	 -0.109682	  1.536523
 -0.405645	 -0.120270	  1.530843
 -0.384334	 -0.130900	  1.526571
 -0.365877	 -0.138611	  1.520817
 -0.352740	 -0.147693	  1.514029
 -0.337880	 -0.157273	  1.506118
 -0.318964	 -0.165270	  1.500639
 -0.302015	 -0.173146	  1.497285
 -0.284596	 -0.180309	  1.486165
 -0.269441	 -0.188869	  1.478448
 -0.251715	 -0.198181	  1.474109
 -0.233668	 -0.205880	  1.471158
 -0.214849	 -0.211087	  1.464173
 -0.198700	 -0.217869	  1.455359
 -0.182074	 -0.224491	  1.446004
 -0.164147	 -0.227759	  1.435869
 -0.144745	 -0.229252	  1.429454
 -0.127997	 -0.235588	  1.426374
 -0.111172	 -0.243017	  1.424165
 -0.084914	 -0.248340	  1.419248
 -0.069053	 -0.248475	  1.414993
 -0.051133	 -0.249650	  1.403940
 -0.030231	 -0.249517	  1.402709
 -0.008521	 -0.250717	  1.395388
  0.010870	 -0.252576	  1.382856
  0.022717	 -0.261597	  1.379494
  0.045551	 -0.268873	  1.378046
  0.065160	 -0.276152	  1.383423
  0.082945	 -0.284240	  1.388848
  0.100829	 -0.292884	  1.393934
  0.119594	 -0.301526	  1.402839
  0.137008	 -0.306205	  1.412420
  0.153331	 -0.309640	  1.418301
  0.172729	 -0.315442	  1.423733
  0.191650	 -0.318004	  1.434887
  0.203832	 -0.322643	  1.449405
  0.218091	 -0.330166	  1.460564
  0.233483	 -0.336347	  1.472628
  0.245588	 -0.342714	  1.491642
  0.256444	 -0.346881	  1.506372
  0.263848	 -0.353847	  1.524678
  0.270685	 -0.359549	  1.544156
  0.279901	 -0.366448	  1.559072
  0.290181	 -0.376017	  1.572827
  0.298702	 -0.385296	  1.589361
  0.305588	 -0.392213	  1.608405
  0.313803	 -0.402199	  1.623468
  0.320030	 -0.419172	  1.635687
  0.325916	 -0.434178	  1.648979
  0.330186	 -0.442911	  1.664625
  0.334813	 -0.451748	  1.681349
  0.340678	 -0.462787	  1.698395
  0.346775	 -0.474815	  1.713419
  0.356021	 -0.484437	  1.728112
  0.366252	 -0.491956	  1.743238
  0.376388	 -0.499261	  1.758304
  0.386529	 -0.511660	  1.772652
  0.395984	 -0.525935	  1.785424
  0.408672	 -0.538368	  1.793011
  0.423378	 -0.548577	  1.800255
  0.437891	 -0.560804	  1.809749
  0.453042	 -0.574357	  1.815671
  0.469171	 -0.582361	  1.817835
  0.488250	 -0.589495	  1.820948
  0.507133	 -0.599573	  1.823064
  0.522128	 -0.609623	  1.828319
  0.539244	 -0.619759	  1.834515
  0.556685	 -0.629209	  1.837990
  0.574767	 -0.635682	  1.840081
  0.594712	 -0.642749	  1.842903
  0.613366	 -0.653337	  1.844257
  0.626863	 -0.662018	  1.850600
  0.644852	 -0.670582	  1.857104
  0.663432	 -0.680476	  1.860429
  0.681171	 -0.690420	  1.862601
  0.697256	 -0.697405	  1.866726
  0.715438	 -0.704725	  1.872048
  0.734134	 -0.712244	  1.877149
  0.752008	 -0.719455	  1.882526
  0.768944	 -0.727932	  1.887763
  0.785469	 -0.741332	  1.891964
  0.801782	 -0.752294	  1.893608
  0.820590	 -0.758338	  1.896884
  0.839770	 -0.765248	  1.899662
  0.856630	 -0.775905	  1.901760
  0.872910	 -0.787358	  1.905964
  0.887379	 -0.798818	  1.913388
  0.903711	 -0.807011	  1.921588
  0.920435	 -0.814568	  1.930978
  0.937086	 -0.824479	  1.938397
  0.954071	 -0.834846	  1.941314
  0.971698	 -0.844152	  1.944580
  0.988007	 -0.853303	  1.949233
  1.004780	 -0.864657	  1.953563
  1.020550	 -0.877666	  1.956514
  1.035100	 -0.889017	  1.963443
  1.052006	 -0.896718	  1.971521
  1.069576	 -0.905349	  1.977664
  1.085828	 -0.916763	  1.981818
  1.099779	 -0.929948	  1.985800
  1.116724	 -0.942704	  1.990543
  1.132877	 -0.953440	  1.995422
