 -0.294430	 -1.846826	  2.383998
 -0.291515	 -1.828540	  2.360394
 -0.292437	 -1.818053	  2.316884
 -0.296567	 -1.810842	  2.269642
 -0.304630	 -1.797756	  2.221980
 -0.312064	 -1.795130	  2.173563
 -0.324398	 -1.778451	  2.129000
 -0.337031	 -1.766419	  2.079535
 -0.347243	 -1.756488	  2.027466
 -0.355537	 -1.748607	  1.978700
 -0.362507	 -1.741955	  1.931176
 -0.368288	 -1.736110	  1.883126
 -0.372622	 -1.730922	  1.833662
 -0.375617	 -1.726207	  1.783811
 -0.377262	 -1.721537	  1.733491
 -0.378141	 -1.716586	  1.683511
 -0.378736	 -1.711275	  1.635300
 -0.379604	 -1.705345	  1.588029
 -0.381715	 -1.698490	  1.538252
 -0.386132	 -1.691770	  1.487264
 -0.390204	 -1.686001	  1.436271
 -0.391787	 -1.681514	  1.388107
 -0.391720	 -1.675303	  1.341475
 -0.390719	 -1.663025	  1.295542
 -0.391734	 -1.645167	  1.248601
 -0.394564	 -1.629877	  1.199513
 -0.398181	 -1.616170	  1.150031
 -0.400038	 -1.603090	  1.101246
 -0.401074	 -1.590513	  1.052876
 -0.401964	 -1.577704	  1.006138
 -0.402551	 -1.563804	  0.959072
 -0.403507	 -1.551148	  0.909105
 -0.406697	 -1.542964	  0.856984
 -0.412290	 -1.540995	  0.804818
 -0.420323	 -1.544723	  0.752756
 -0.429246	 -1.553692	  0.702126
 -0.438311	 -1.566206	  0.654391
 -0.446823	 -1.581228	  0.609735
 -0.454132	 -1.597031	  0.571123
 -0.460389	 -1.613228	  0.538314
 -0.466854	 -1.636273	  0.500244
 -0.472501	 -1.680374	  0.444115
 -0.464454	 -1.745825	  0.386650
 -0.444372	 -1.806041	  0.347915
 -0.430277	 -1.830989	  0.328619
 -0.406929	 -1.855732	  0.299953
 -0.366616	 -1.884060	  0.248241
 -0.324038	 -1.898647	  0.178340
 -0.297750	 -1.891208	  0.061806
 -0.329764	 -1.874191	 -0.076116
 -0.396871	 -1.867971	 -0.177607
 -0.501657	 -1.863919	 -0.254674
 -0.671666	 -1.887198	 -0.307998
 -0.893255	 -1.978715	 -0.335396
 -1.076933	 -1.919522	 -0.425868
 -1.152924	 -1.762607	 -0.425168
 -1.116351	 -1.540613	 -0.370753
 -1.040673	 -1.395563	 -0.343051
 -1.036805	 -1.333882	 -0.363991
 -1.048915	 -1.289997	 -0.411816
 -1.063995	 -1.245436	 -0.488666
 -1.075435	 -1.231934	 -0.587215
 -1.053993	 -1.247439	 -0.676581
 -1.019698	 -1.260527	 -0.722317
 -0.984893	 -1.273548	 -0.748865
 -0.932466	 -1.291986	 -0.777860
 -0.858566	 -1.310837	 -0.824417
 -0.809341	 -1.318022	 -0.881354
 -0.801047	 -1.319312	 -0.904540
 -0.805641	 -1.319764	 -0.917005
 -0.816206	 -1.320181	 -0.931194
 -0.915650	 -1.320582	 -0.990115
 -1.031851	 -1.325018	 -1.052042
 -1.110856	 -1.327091	 -1.101611
 -1.140868	 -1.321253	 -1.144904
 -1.141559	 -1.313117	 -1.176152
 -1.120477	 -1.299133	 -1.213039
 -1.076919	 -1.284501	 -1.250483
 -1.016153	 -1.271382	 -1.284808
 -0.909827	 -1.251560	 -1.346099
 -0.799689	 -1.243366	 -1.436290
 -0.750321	 -1.244247	 -1.516503
 -0.746452	 -1.241425	 -1.580185
 -0.756547	 -1.236088	 -1.632298
 -0.769289	 -1.228630	 -1.681559
 -0.782273	 -1.219356	 -1.729648
 -0.794903	 -1.208703	 -1.777826
 -0.806489	 -1.197613	 -1.824127
 -0.817563	 -1.186019	 -1.871341
 -0.826315	 -1.174969	 -1.919245
 -0.829741	 -1.166209	 -1.967888
 -0.830716	 -1.158432	 -2.017601
 -0.831793	 -1.150628	 -2.067282
 -0.833718	 -1.143495	 -2.115925
 -0.839893	 -1.137847	 -2.163111
 -0.839055	 -1.130105	 -2.210714
 -0.851382	 -1.119594	 -2.258668
 -0.849158	 -1.114921	 -2.310785
 -0.863219	 -1.106894	 -2.359749
 -0.864023	 -1.100057	 -2.409926
 -0.872875	 -1.090106	 -2.457994
 -0.873787	 -1.081408	 -2.507496
 -0.885168	 -1.074526	 -2.555160
 -0.890999	 -1.069827	 -2.603959
 -0.899122	 -1.066451	 -2.655986
 -0.908114	 -1.077115	 -2.682546
