 -0.294430	 -1.846826	  2.383998
 -0.291515	 -1.828540	  2.360394
 -0.292432	 -1.817980	  2.316652
 -0.296584	 -1.810812	  2.269488
 -0.304616	 -1.797773	  2.222061
 -0.312171	 -1.795132	  2.173629
 -0.325677	 -1.777875	  2.129508
 -0.338963	 -1.764785	  2.080373
 -0.349562	 -1.754603	  2.028443
 -0.358059	 -1.746732	  1.979629
 -0.365102	 -1.740184	  1.931628
 -0.370696	 -1.734582	  1.883297
 -0.374726	 -1.729690	  1.833707
 -0.377396	 -1.725310	  1.783988
 -0.378770	 -1.720908	  1.733533
 -0.379279	 -1.716187	  1.683573
 -0.379480	 -1.711015	  1.635311
 -0.379917	 -1.705195	  1.587883
 -0.381659	 -1.698485	  1.538076
 -0.385639	 -1.691997	  1.487160
 -0.388984	 -1.686482	  1.436248
 -0.389899	 -1.682130	  1.388235
 -0.389029	 -1.675921	  1.341564
 -0.387351	 -1.663045	  1.295684
 -0.387941	 -1.644220	  1.248678
 -0.390435	 -1.628141	  1.199800
 -0.393282	 -1.613626	  1.150518
 -0.394366	 -1.599900	  1.101866
 -0.395050	 -1.586785	  1.053615
 -0.395303	 -1.573550	  1.006961
 -0.395200	 -1.559336	  0.960054
 -0.395720	 -1.546480	  0.909695
 -0.399027	 -1.538915	  0.856911
 -0.405364	 -1.538438	  0.804143
 -0.414342	 -1.544132	  0.751911
 -0.423953	 -1.554762	  0.701394
 -0.433709	 -1.568117	  0.654139
 -0.442912	 -1.583599	  0.609998
 -0.450476	 -1.599388	  0.571630
 -0.456776	 -1.615836	  0.538325
 -0.463146	 -1.639139	  0.499001
 -0.467770	 -1.681212	  0.443395
 -0.459510	 -1.742440	  0.386238
 -0.440028	 -1.799506	  0.346732
 -0.425130	 -1.825608	  0.325456
 -0.402204	 -1.849794	  0.296323
 -0.364483	 -1.875930	  0.245525
 -0.324481	 -1.889616	  0.174643
 -0.304598	 -1.882938	  0.061184
 -0.337900	 -1.869199	 -0.069995
 -0.404713	 -1.862112	 -0.170826
 -0.509061	 -1.855044	 -0.249537
 -0.672121	 -1.891949	 -0.319197
 -0.890557	 -1.972548	 -0.338912
 -1.062580	 -1.902467	 -0.408628
 -1.137290	 -1.759183	 -0.406629
 -1.112647	 -1.549384	 -0.364189
 -1.043530	 -1.403983	 -0.346280
 -1.035907	 -1.337799	 -0.370502
 -1.044962	 -1.292035	 -0.416651
 -1.060988	 -1.248623	 -0.491223
 -1.072327	 -1.234128	 -0.586393
 -1.053348	 -1.249161	 -0.672648
 -1.019114	 -1.263196	 -0.719384
 -0.983504	 -1.276721	 -0.747247
 -0.931196	 -1.294712	 -0.778704
 -0.862836	 -1.311907	 -0.827457
 -0.818392	 -1.318199	 -0.882530
 -0.814721	 -1.319229	 -0.903241
 -0.817100	 -1.319409	 -0.912177
 -0.827932	 -1.319604	 -0.928102
 -0.919357	 -1.317814	 -0.986045
 -1.029383	 -1.320729	 -1.050371
 -1.105914	 -1.322414	 -1.102260
 -1.133465	 -1.317449	 -1.144794
 -1.132863	 -1.309068	 -1.173545
 -1.112955	 -1.296309	 -1.207088
 -1.070604	 -1.282216	 -1.241862
 -1.007971	 -1.269066	 -1.278147
 -0.904866	 -1.249439	 -1.341241
 -0.799803	 -1.241611	 -1.431131
 -0.748587	 -1.245049	 -1.512985
 -0.744749	 -1.242633	 -1.579478
 -0.755604	 -1.236929	 -1.632503
 -0.768324	 -1.229856	 -1.682089
 -0.781650	 -1.220793	 -1.730275
 -0.794861	 -1.210250	 -1.778183
 -0.807084	 -1.199032	 -1.824485
 -0.818654	 -1.187160	 -1.871359
 -0.828011	 -1.175598	 -1.919086
 -0.831835	 -1.166388	 -1.967857
 -0.832799	 -1.158521	 -2.017579
 -0.833517	 -1.150816	 -2.067232
 -0.835038	 -1.143698	 -2.115718
 -0.840480	 -1.137921	 -2.163029
 -0.839269	 -1.130118	 -2.210807
 -0.851345	 -1.119593	 -2.258806
 -0.849214	 -1.114915	 -2.310712
 -0.863176	 -1.106906	 -2.359691
 -0.864027	 -1.100063	 -2.409866
 -0.872872	 -1.090100	 -2.458030
 -0.873786	 -1.081418	 -2.507436
 -0.885166	 -1.074527	 -2.555141
 -0.891036	 -1.069801	 -2.604221
 -0.899122	 -1.066451	 -2.655986
 -0.908114	 -1.077115	 -2.682546
