 -2.463415	 -1.417048	  1.050932
 -2.439025	 -1.403018	  1.040527
 -2.390356	 -1.396519	  1.026288
 -2.343048	 -1.387656	  1.009352
 -2.300101	 -1.380177	  0.983074
 -2.252251	 -1.376467	  0.966588
 -2.205896	 -1.369457	  0.947915
 -2.161538	 -1.354935	  0.929771
 -2.114033	 -1.347734	  0.916455
 -2.067812	 -1.341142	  0.900534
 -2.020924	 -1.337613	  0.884682
 -1.973714	 -1.337294	  0.868838
 -1.926339	 -1.337978	  0.852377
 -1.879551	 -1.339157	  0.834515
 -1.833258	 -1.340539	  0.815440
 -1.787311	 -1.341873	  0.795473
 -1.741433	 -1.342581	  0.774396
 -1.696213	 -1.342815	  0.752451
 -1.651544	 -1.342055	  0.729991
 -1.606915	 -1.339350	  0.707827
 -1.562549	 -1.334211	  0.686362
 -1.518027	 -1.326343	  0.665401
 -1.473365	 -1.315576	  0.644882
 -1.429173	 -1.301721	  0.624770
 -1.385878	 -1.284681	  0.604813
 -1.343995	 -1.264746	  0.585386
 -1.303065	 -1.243164	  0.565665
 -1.262979	 -1.221916	  0.544718
 -1.223628	 -1.202301	  0.522711
 -1.185078	 -1.185245	  0.497755
 -1.146350	 -1.168306	  0.472943
 -1.105242	 -1.147692	  0.451731
 -1.061797	 -1.123694	  0.431820
 -1.013306	 -1.095321	  0.412685
 -0.960968	 -1.061384	  0.401895
 -0.904280	 -1.023270	  0.395096
 -0.846051	 -0.981637	  0.398375
 -0.785439	 -0.944114	  0.402450
 -0.731734	 -0.913347	  0.412384
 -0.678832	 -0.891066	  0.415746
 -0.628291	 -0.876049	  0.412909
 -0.580309	 -0.866511	  0.406219
 -0.533770	 -0.861511	  0.396087
 -0.488522	 -0.861217	  0.383482
 -0.445646	 -0.865527	  0.368989
 -0.404476	 -0.873893	  0.352532
 -0.365419	 -0.886033	  0.334234
 -0.327573	 -0.901680	  0.313239
 -0.288093	 -0.921163	  0.288134
 -0.244968	 -0.943560	  0.258443
 -0.196722	 -0.966471	  0.224521
 -0.144600	 -0.985993	  0.187586
 -0.091672	 -1.000422	  0.150005
 -0.040885	 -1.009880	  0.113923
  0.005974	 -1.015754	  0.080677
  0.049017	 -1.019786	  0.050370
  0.088140	 -1.022545	  0.022935
  0.125566	 -1.023909	 -0.003054
  0.162700	 -1.023689	 -0.028029
  0.200588	 -1.021089	 -0.051331
  0.240276	 -1.013616	 -0.071734
  0.279448	 -0.998635	 -0.092355
  0.310404	 -0.978137	 -0.121420
  0.332764	 -0.957421	 -0.159263
  0.352372	 -0.938564	 -0.205270
  0.375145	 -0.922745	 -0.259645
  0.404219	 -0.911705	 -0.320835
  0.439289	 -0.905155	 -0.385724
  0.478188	 -0.902008	 -0.448663
  0.519418	 -0.900897	 -0.505328
  0.562097	 -0.900240	 -0.554308
  0.604748	 -0.899153	 -0.595373
  0.647144	 -0.897159	 -0.630055
  0.690458	 -0.895038	 -0.659485
  0.735072	 -0.892427	 -0.684669
  0.780914	 -0.891020	 -0.706209
  0.828296	 -0.892096	 -0.724468
  0.877846	 -0.896783	 -0.739546
  0.930796	 -0.907666	 -0.751788
  0.987008	 -0.924719	 -0.762778
  1.044806	 -0.948848	 -0.775283
  1.102349	 -0.977793	 -0.790548
  1.157248	 -1.008247	 -0.807100
  1.208594	 -1.035991	 -0.823965
  1.255876	 -1.059140	 -0.841381
  1.300494	 -1.076546	 -0.858479
  1.343379	 -1.088242	 -0.874505
  1.386835	 -1.094313	 -0.888895
  1.431855	 -1.095366	 -0.900862
  1.477820	 -1.092471	 -0.908566
  1.524681	 -1.086585	 -0.911140
  1.571788	 -1.077506	 -0.908945
  1.619854	 -1.064206	 -0.901323
  1.670103	 -1.044817	 -0.886129
  1.723349	 -1.015160	 -0.861406
  1.778117	 -0.974703	 -0.833043
  1.836495	 -0.926728	 -0.812824
  1.895809	 -0.878960	 -0.808672
  1.952406	 -0.838792	 -0.818664
  2.005103	 -0.809304	 -0.835579
  2.053672	 -0.788364	 -0.856002
  2.099235	 -0.773341	 -0.878412
  2.143102	 -0.762248	 -0.902264
  2.185926	 -0.753972	 -0.927092
  2.228351	 -0.747682	 -0.952357
  2.270775	 -0.742908	 -0.977552
  2.314198	 -0.738957	 -1.001874
  2.357792	 -0.734898	 -1.024991
  2.401348	 -0.730486	 -1.047466
  2.444844	 -0.725888	 -1.069812
  2.488206	 -0.721275	 -1.092537
  2.532767	 -0.716217	 -1.113316
  2.578677	 -0.710984	 -1.131521
  2.627245	 -0.708690	 -1.142533
  2.668994	 -0.713666	 -1.169253
  2.695684	 -0.720802	 -1.180946
