  2.172988	  0.094999	 -1.123582
  2.178119	  0.093878	 -1.137607
  2.171305	  0.095306	 -1.118858
  2.164479	  0.096456	 -1.100112
  2.158218	  0.094841	 -1.081192
  2.152256	  0.093323	 -1.062119
  2.145448	  0.091254	 -1.043407
  2.137820	  0.089117	 -1.025091
  2.130334	  0.087977	 -1.006601
  2.122731	  0.088349	 -0.988120
  2.115434	  0.088435	 -0.969497
  2.108257	  0.089537	 -0.950835
  2.100991	  0.090922	 -0.932524
  2.093772	  0.088873	 -0.913757
  2.086490	  0.087541	 -0.894594
  2.079705	  0.088690	 -0.876999
  2.072520	  0.090036	 -0.856516
  2.064124	  0.093440	 -0.833220
  2.060339	  0.096491	 -0.820979
  2.055324	  0.096923	 -0.800140
  2.050063	  0.102797	 -0.778395
  2.046768	  0.112447	 -0.762379
  2.044766	  0.120102	 -0.744505
  2.041494	  0.126438	 -0.725292
  2.038627	  0.138860	 -0.708662
  2.038068	  0.147171	 -0.686437
  2.038569	  0.146503	 -0.664584
  2.036344	  0.144321	 -0.646372
  2.033423	  0.145242	 -0.629269
  2.034283	  0.148617	 -0.602890
  2.033188	  0.148459	 -0.588255
  2.028518	  0.148019	 -0.567837
  2.024642	  0.148910	 -0.546262
  2.025585	  0.153796	 -0.527586
  2.029363	  0.162313	 -0.507951
  2.031300	  0.166597	 -0.486773
  2.024795	  0.165516	 -0.468521
  2.014094	  0.163733	 -0.448537
  2.009273	  0.162971	 -0.424999
  2.010817	  0.164296	 -0.409221
  2.011717	  0.171304	 -0.388942
  2.011633	  0.179957	 -0.371103
  2.012100	  0.182379	 -0.350219
  2.015480	  0.180592	 -0.330564
  2.018886	  0.178625	 -0.310952
  2.022625	  0.176190	 -0.291760
  2.033428	  0.162580	 -0.283014
  2.044457	  0.149869	 -0.278100
  2.059705	  0.136470	 -0.274640
  2.078929	  0.114670	 -0.268778
  2.085707	  0.099416	 -0.261661
  2.090560	  0.086548	 -0.254586
  2.099633	  0.071926	 -0.247223
  2.113635	  0.054027	 -0.240832
  2.123080	  0.037158	 -0.233538
  2.126874	  0.020875	 -0.223712
  2.133427	  0.004228	 -0.214457
  2.140596	 -0.011946	 -0.205112
  2.148722	 -0.028728	 -0.196347
  2.157304	 -0.043401	 -0.178817
  2.160759	 -0.052464	 -0.160383
  2.161102	 -0.060561	 -0.144377
  2.160722	 -0.069742	 -0.126208
  2.166664	 -0.081479	 -0.103620
  2.171443	 -0.088228	 -0.093729
  2.175158	 -0.098047	 -0.076246
  2.175547	 -0.105509	 -0.056479
  2.172428	 -0.110355	 -0.038624
  2.168091	 -0.114720	 -0.017738
  2.168796	 -0.118414	  0.003255
  2.174048	 -0.121748	  0.018537
  2.184218	 -0.126769	  0.041775
  2.188606	 -0.129537	  0.066177
  2.183495	 -0.127846	  0.081236
  2.175633	 -0.123605	  0.095640
  2.170519	 -0.113985	  0.116047
  2.168074	 -0.105193	  0.134580
  2.167148	 -0.098967	  0.154422
  2.163640	 -0.093308	  0.174540
  2.157582	 -0.086791	  0.195985
  2.148707	 -0.075964	  0.207972
  2.141887	 -0.069862	  0.218443
  2.131890	 -0.059062	  0.231170
  2.118638	 -0.050981	  0.243365
  2.102814	 -0.043371	  0.254669
  2.087584	 -0.034939	  0.262550
  2.071712	 -0.024751	  0.268927
  2.057395	 -0.009142	  0.275978
  2.046036	  0.005816	  0.281975
  2.036399	  0.019739	  0.286951
  2.020301	  0.032472	  0.293448
  2.006251	  0.045206	  0.300359
  1.991917	  0.051682	  0.307777
  1.980604	  0.061198	  0.315323
  1.961853	  0.073395	  0.323629
  1.950129	  0.087716	  0.325267
  1.940673	  0.104746	  0.321446
  1.930751	  0.127368	  0.315494
  1.922354	  0.146677	  0.314232
  1.913394	  0.163357	  0.315940
  1.902934	  0.179175	  0.319478
  1.892818	  0.198170	  0.323407
  1.885900	  0.214493	  0.326888
  1.877892	  0.232813	  0.331092
  1.870058	  0.255477	  0.334821
  1.864249	  0.274096	  0.340398
  1.856360	  0.287508	  0.343081
  1.839084	  0.306514	  0.348133
  1.832166	  0.322511	  0.363565
  1.838124	  0.332259	  0.389317
  1.836331	  0.342741	  0.416197
  1.832025	  0.349907	  0.428835
  1.826574	  0.357972	  0.443020
  1.814275	  0.369279	  0.461201
  1.805460	  0.375146	  0.474139
  1.787078	  0.383468	  0.484896
  1.769751	  0.390390	  0.499730
  1.759317	  0.397169	  0.517011
  1.752839	  0.403407	  0.535752
  1.750671	  0.405740	  0.555875
  1.750744	  0.405793	  0.577449
  1.749620	  0.409617	  0.600241
  1.745264	  0.412021	  0.611673
  1.735270	  0.415298	  0.627503
  1.726088	  0.413339	  0.658260
  1.726365	  0.413537	  0.679422
  1.726260	  0.413408	  0.696649
  1.723731	  0.416561	  0.710895
  1.712733	  0.423293	  0.734931
  1.706838	  0.425305	  0.755224
  1.704362	  0.428088	  0.769977
  1.700177	  0.433038	  0.789455
  1.696302	  0.437945	  0.816355
  1.697043	  0.440568	  0.829940
  1.700787	  0.442999	  0.846761
  1.703965	  0.437892	  0.872546
  1.697232	  0.437332	  0.893177
  1.688374	  0.440141	  0.911099
  1.678001	  0.442996	  0.926603
  1.670803	  0.446207	  0.946294
  1.663459	  0.448630	  0.964799
  1.656121	  0.450950	  0.983245
  1.650392	  0.453721	  1.002178
  1.646276	  0.456847	  1.021465
  1.642171	  0.460076	  1.040800
  1.636617	  0.462105	  1.059936
  1.630676	  0.463882	  1.078960
  1.625198	  0.465545	  1.098100
  1.621461	  0.467684	  1.117601
  1.617838	  0.470017	  1.137078
  1.615687	  0.474814	  1.156246
  1.614417	  0.481094	  1.175153
  1.612913	  0.487159	  1.194182
  1.609892	  0.491135	  1.213597
  1.606764	  0.494959	  1.232984
  1.601804	  0.498279	  1.252081
  1.596130	  0.501667	  1.270962
  1.590925	  0.504903	  1.289995
  1.586960	  0.508061	  1.309341
  1.583062	  0.511397	  1.328678
  1.579126	  0.514393	  1.348042
  1.575296	  0.517590	  1.367423
  1.571443	  0.520403	  1.386867
  1.567448	  0.522347	  1.406401
  1.563141	  0.524080	  1.425855
  1.557398	  0.526478	  1.444838
  1.551595	  0.529153	  1.463796
  1.547004	  0.531759	  1.483070
  1.543594	  0.534470	  1.502574
  1.540347	  0.537346	  1.522108
  1.539233	  0.539195	  1.542003
  1.538825	  0.540764	  1.561956
  1.537721	  0.541922	  1.581888
  1.535668	  0.543251	  1.601393
  1.536317	  0.547185	  1.620853
  1.534304	  0.554522	  1.641026
  1.530230	  0.562073	  1.659427
  1.519936	  0.562993	  1.681065
  1.510507	  0.559269	  1.699222
  1.504766	  0.558190	  1.716190
  1.500639	  0.561485	  1.734452
  1.491776	  0.567239	  1.755049
  1.483009	  0.568002	  1.773519
  1.476873	  0.568426	  1.789295
  1.471228	  0.572581	  1.807239
  1.459403	  0.579434	  1.828246
  1.450763	  0.580076	  1.843986
  1.445068	  0.581557	  1.860031
  1.437313	  0.589790	  1.879377
  1.425059	  0.595162	  1.898773
  1.417076	  0.594738	  1.913344
  1.403512	  0.597433	  1.941732
  1.394981	  0.602114	  1.959205
