  1.306966	  2.033281	  0.553424
  1.310987	  2.041920	  0.557711
  1.297321	  2.028845	  0.556773
  1.285963	  2.005950	  0.552463
  1.280894	  1.986907	  0.543408
  1.278298	  1.972811	  0.531832
  1.272534	  1.958779	  0.518587
  1.264525	  1.942376	  0.506394
  1.257387	  1.927184	  0.494828
  1.251907	  1.914337	  0.482895
  1.246788	  1.899820	  0.469523
  1.240400	  1.883610	  0.457223
  1.232262	  1.870392	  0.444962
  1.226008	  1.858947	  0.430650
  1.220537	  1.844986	  0.416330
  1.215113	  1.829463	  0.402713
  1.211623	  1.819686	  0.387333
  1.210961	  1.811608	  0.368991
  1.211684	  1.798686	  0.346887
  1.212715	  1.784667	  0.329307
  1.212088	  1.773215	  0.315664
  1.212980	  1.766673	  0.305501
  1.218472	  1.759531	  0.281362
  1.221782	  1.752566	  0.260260
  1.226278	  1.746842	  0.246669
  1.230810	  1.735460	  0.232116
  1.237844	  1.724822	  0.215606
  1.244391	  1.717063	  0.195611
  1.246835	  1.706211	  0.178411
  1.248902	  1.693146	  0.163023
  1.251264	  1.681074	  0.150786
  1.256071	  1.668898	  0.138758
  1.264471	  1.656950	  0.130460
  1.276889	  1.639757	  0.124397
  1.280445	  1.631209	  0.120295
  1.285481	  1.619194	  0.115155
  1.287786	  1.602857	  0.113181
  1.282193	  1.570238	  0.113873
  1.280974	  1.548924	  0.114592
  1.281923	  1.539351	  0.115739
  1.281460	  1.529701	  0.116967
  1.289781	  1.504589	  0.122263
  1.297491	  1.480921	  0.127699
  1.298796	  1.463321	  0.130562
  1.299327	  1.444748	  0.133175
  1.294580	  1.425639	  0.136233
  1.290654	  1.409195	  0.140630
  1.285455	  1.390083	  0.147354
  1.277943	  1.375971	  0.152743
  1.272574	  1.362394	  0.158725
  1.259370	  1.337489	  0.171524
  1.254684	  1.315591	  0.178687
  1.254464	  1.299380	  0.181039
  1.253228	  1.285806	  0.180511
  1.246231	  1.256370	  0.177224
  1.238644	  1.231238	  0.178047
  1.233420	  1.220977	  0.179821
  1.230741	  1.210279	  0.184157
  1.222766	  1.200205	  0.187590
  1.203275	  1.181150	  0.193919
  1.187754	  1.159544	  0.197350
  1.178885	  1.144074	  0.201151
  1.167458	  1.129043	  0.202372
  1.151532	  1.117047	  0.200478
  1.134690	  1.109701	  0.201074
  1.122939	  1.101321	  0.201258
  1.108620	  1.089033	  0.200588
  1.088463	  1.057510	  0.201144
  1.072399	  1.034896	  0.201217
  1.063788	  1.024785	  0.201462
  1.057166	  1.019620	  0.201464
  1.040133	  1.006658	  0.199699
  1.019789	  0.998274	  0.197047
  1.002447	  0.989811	  0.195560
  0.985220	  0.976455	  0.192479
  0.968372	  0.960198	  0.186368
  0.945697	  0.947096	  0.179378
  0.931520	  0.941568	  0.177256
  0.922523	  0.937275	  0.177386
  0.901831	  0.924476	  0.178734
  0.888125	  0.911835	  0.182750
  0.871097	  0.896296	  0.188782
  0.858057	  0.885888	  0.192356
  0.842797	  0.874289	  0.193547
  0.822674	  0.856901	  0.189045
  0.805903	  0.845752	  0.182625
  0.785998	  0.835353	  0.175062
  0.766822	  0.825765	  0.167791
  0.755151	  0.818199	  0.164454
  0.739680	  0.803531	  0.159631
  0.721280	  0.789455	  0.156346
  0.706129	  0.784765	  0.157066
  0.696816	  0.780655	  0.158872
  0.678139	  0.766464	  0.161847
  0.647926	  0.753040	  0.154976
  0.632463	  0.746291	  0.151057
  0.620224	  0.742392	  0.154127
  0.603665	  0.730874	  0.153963
  0.575937	  0.711747	  0.155817
  0.559220	  0.699224	  0.154143
  0.546759	  0.693826	  0.157411
  0.526206	  0.678916	  0.148807
  0.509807	  0.672161	  0.150369
  0.493512	  0.664470	  0.153781
  0.474378	  0.645385	  0.150470
  0.464737	  0.628499	  0.143076
  0.460828	  0.620269	  0.140775
  0.450480	  0.602724	  0.133988
  0.438527	  0.579794	  0.132311
  0.420947	  0.562558	  0.127860
  0.408909	  0.554009	  0.124736
  0.392387	  0.544848	  0.120915
  0.378357	  0.531286	  0.115833
  0.366027	  0.516079	  0.111923
  0.355656	  0.502868	  0.109810
  0.343497	  0.485451	  0.108469
  0.332380	  0.466976	  0.106861
  0.323487	  0.450519	  0.103477
  0.312607	  0.434586	  0.098565
  0.300353	  0.417718	  0.095051
  0.290728	  0.402388	  0.094312
  0.280097	  0.386367	  0.092628
  0.267606	  0.365624	  0.088399
  0.259224	  0.352477	  0.085993
  0.249139	  0.335675	  0.085193
  0.234157	  0.316657	  0.085060
  0.222678	  0.298881	  0.082546
  0.216962	  0.284907	  0.078446
  0.208291	  0.263860	  0.073718
  0.197691	  0.246239	  0.070049
  0.188433	  0.231448	  0.066594
  0.181009	  0.215095	  0.060581
  0.174392	  0.195360	  0.054680
  0.166557	  0.176927	  0.049391
  0.156140	  0.160011	  0.044990
  0.144486	  0.145047	  0.041886
  0.132256	  0.131704	  0.039801
  0.120326	  0.115006	  0.036334
  0.108038	  0.091535	  0.028847
  0.098172	  0.075602	  0.024780
  0.091323	  0.063666	  0.020928
  0.081548	  0.042076	  0.011827
  0.075121	  0.026194	  0.004067
  0.067998	  0.011510	 -0.003250
  0.062140	 -0.012586	 -0.014640
  0.061157	 -0.024757	 -0.020047
  0.059178	 -0.047735	 -0.029592
  0.055212	 -0.071658	 -0.037031
  0.050470	 -0.087213	 -0.041473
  0.044377	 -0.099881	 -0.043209
  0.033717	 -0.121125	 -0.044577
  0.027567	 -0.139806	 -0.046810
  0.020954	 -0.159374	 -0.051169
  0.016245	 -0.182266	 -0.057969
  0.015753	 -0.197234	 -0.062480
  0.011064	 -0.214780	 -0.065773
  0.001050	 -0.235919	 -0.071611
 -0.011134	 -0.251360	 -0.074377
 -0.025688	 -0.266161	 -0.074785
 -0.037986	 -0.282842	 -0.076471
 -0.046970	 -0.301058	 -0.080935
 -0.055685	 -0.318604	 -0.085071
 -0.064310	 -0.336349	 -0.088793
 -0.072013	 -0.353692	 -0.093326
 -0.083684	 -0.370169	 -0.094320
 -0.095398	 -0.387811	 -0.095480
 -0.102371	 -0.405929	 -0.102631
 -0.109024	 -0.422604	 -0.111519
 -0.118004	 -0.439515	 -0.117641
 -0.127506	 -0.456466	 -0.122462
 -0.136986	 -0.473170	 -0.127710
 -0.145762	 -0.487783	 -0.133015
 -0.154640	 -0.504339	 -0.139023
 -0.167589	 -0.524835	 -0.140305
 -0.179446	 -0.540360	 -0.147501
 -0.187269	 -0.552071	 -0.153224
 -0.195290	 -0.574133	 -0.159543
 -0.197618	 -0.604840	 -0.165944
 -0.198341	 -0.616679	 -0.173256
 -0.202402	 -0.629143	 -0.182226
 -0.209456	 -0.643163	 -0.194559
 -0.218535	 -0.658082	 -0.207167
 -0.224340	 -0.682353	 -0.221364
 -0.228228	 -0.698036	 -0.225117
 -0.233654	 -0.710739	 -0.229538
 -0.246245	 -0.729025	 -0.236168
 -0.257805	 -0.746570	 -0.245080
 -0.262456	 -0.761185	 -0.251558
 -0.264959	 -0.781730	 -0.256470
 -0.270558	 -0.804510	 -0.264070
 -0.276522	 -0.816705	 -0.270793
 -0.287032	 -0.830975	 -0.280918
 -0.300263	 -0.848407	 -0.295345
 -0.307515	 -0.864050	 -0.304785
 -0.316318	 -0.885226	 -0.314066
 -0.322281	 -0.896895	 -0.320755
 -0.326681	 -0.912893	 -0.327161
 -0.330856	 -0.933357	 -0.339260
 -0.334205	 -0.949770	 -0.353575
 -0.334528	 -0.960857	 -0.365050
 -0.333421	 -0.975245	 -0.376257
 -0.333428	 -0.993038	 -0.388195
 -0.331210	 -1.014748	 -0.399802
 -0.325306	 -1.037402	 -0.407342
 -0.318969	 -1.058906	 -0.413322
 -0.320086	 -1.081535	 -0.421536
 -0.332660	 -1.101263	 -0.433276
 -0.350579	 -1.110417	 -0.446336
 -0.364923	 -1.115110	 -0.462980
 -0.371252	 -1.122583	 -0.482596
 -0.374987	 -1.132689	 -0.499785
 -0.379491	 -1.145276	 -0.514651
 -0.384058	 -1.158178	 -0.529384
 -0.388873	 -1.170845	 -0.543778
 -0.393812	 -1.181911	 -0.557326
 -0.406846	 -1.192293	 -0.562993
 -0.422309	 -1.202070	 -0.568924
 -0.437577	 -1.210288	 -0.580278
 -0.451898	 -1.216181	 -0.592922
 -0.468207	 -1.222457	 -0.608205
 -0.483096	 -1.228507	 -0.620599
 -0.500796	 -1.236868	 -0.634301
 -0.516846	 -1.242815	 -0.645445
 -0.532042	 -1.252535	 -0.651566
 -0.546594	 -1.259070	 -0.660157
 -0.562819	 -1.266810	 -0.669305
 -0.581443	 -1.280082	 -0.674671
 -0.598722	 -1.290062	 -0.681327
 -0.611390	 -1.298479	 -0.685908
 -0.629076	 -1.314344	 -0.686373
 -0.641027	 -1.325535	 -0.687412
 -0.659990	 -1.341128	 -0.689530
 -0.672296	 -1.351398	 -0.690501
 -0.690065	 -1.365727	 -0.693097
 -0.708512	 -1.380091	 -0.696324
 -0.722435	 -1.391805	 -0.700918
 -0.740802	 -1.402322	 -0.710211
 -0.755572	 -1.409249	 -0.721946
 -0.766157	 -1.415440	 -0.728334
 -0.767099	 -1.426099	 -0.717617
 -0.777280	 -1.463782	 -0.702906
 -0.791925	 -1.456878	 -0.717193
 -0.803693	 -1.452223	 -0.725143
 -0.815474	 -1.465246	 -0.724355
 -0.819665	 -1.488631	 -0.722119
 -0.825023	 -1.508169	 -0.714207
 -0.828664	 -1.529001	 -0.715178
 -0.827199	 -1.548470	 -0.716375
 -0.824092	 -1.568349	 -0.725018
 -0.828789	 -1.590631	 -0.738510
 -0.840258	 -1.612783	 -0.741954
 -0.848040	 -1.630424	 -0.740109
 -0.853450	 -1.647661	 -0.735997
 -0.857062	 -1.667407	 -0.733699
 -0.858693	 -1.685810	 -0.730986
 -0.861945	 -1.705910	 -0.736833
 -0.868830	 -1.724160	 -0.745504
 -0.873240	 -1.739424	 -0.753083
 -0.873619	 -1.763595	 -0.763179
 -0.881838	 -1.790994	 -0.762600
 -0.887320	 -1.805100	 -0.761334
 -0.896911	 -1.826521	 -0.760244
 -0.906146	 -1.845877	 -0.761887
 -0.913553	 -1.858190	 -0.760779
 -0.926525	 -1.881892	 -0.761069
 -0.937334	 -1.900728	 -0.756790
 -0.943811	 -1.914501	 -0.757003
 -0.951161	 -1.933824	 -0.758003
 -0.958553	 -1.950697	 -0.758110
 -0.965537	 -1.967670	 -0.764931
 -0.978191	 -1.989850	 -0.771231
 -0.987326	 -2.001516	 -0.768707
 -1.000619	 -2.018190	 -0.763238
 -1.012653	 -2.042693	 -0.768156
 -1.017301	 -2.055745	 -0.775423
 -1.021246	 -2.069871	 -0.792276
 -1.025841	 -2.088552	 -0.807383
 -1.021234	 -2.104163	 -0.844133
 -1.031477	 -2.120436	 -0.849636
