  0.065394	 -0.635173	  2.406036
  0.061453	 -0.661430	  2.436368
  0.072690	 -0.638554	  2.434318
  0.077732	 -0.622268	  2.418704
  0.080216	 -0.613041	  2.405212
  0.085719	 -0.601285	  2.390677
  0.091023	 -0.589743	  2.375096
  0.097571	 -0.578853	  2.360741
  0.108096	 -0.565319	  2.349402
  0.122649	 -0.552920	  2.343479
  0.137421	 -0.540539	  2.338110
  0.152216	 -0.528168	  2.332827
  0.167606	 -0.516005	  2.329155
  0.184258	 -0.505238	  2.331074
  0.200517	 -0.495379	  2.332656
  0.218033	 -0.487619	  2.331463
  0.237899	 -0.482051	  2.336590
  0.262405	 -0.468567	  2.347708
  0.271440	 -0.458946	  2.349043
  0.277160	 -0.450964	  2.344569
  0.282589	 -0.444107	  2.342510
  0.297559	 -0.428635	  2.318577
  0.303500	 -0.415631	  2.303103
  0.305418	 -0.406430	  2.296279
  0.309110	 -0.392474	  2.279125
  0.316697	 -0.386833	  2.257604
  0.325360	 -0.384299	  2.242179
  0.335387	 -0.385143	  2.221763
  0.343451	 -0.374235	  2.199653
  0.348152	 -0.367749	  2.191011
  0.357832	 -0.359614	  2.173791
  0.365136	 -0.352499	  2.155967
  0.371472	 -0.344556	  2.137305
  0.378112	 -0.337266	  2.120132
  0.384621	 -0.330811	  2.102878
  0.391054	 -0.330062	  2.084365
  0.399172	 -0.332081	  2.063929
  0.406455	 -0.334515	  2.044845
  0.414123	 -0.338481	  2.026244
  0.419715	 -0.340521	  2.006801
  0.422773	 -0.353024	  1.990319
  0.425968	 -0.355998	  1.972547
  0.428334	 -0.355833	  1.952952
  0.432145	 -0.348560	  1.938074
  0.433353	 -0.347129	  1.919071
  0.433198	 -0.346122	  1.899002
  0.433120	 -0.343469	  1.878778
  0.435530	 -0.338559	  1.856141
  0.442503	 -0.335156	  1.833769
  0.446242	 -0.345447	  1.811148
  0.440819	 -0.356414	  1.796210
  0.434366	 -0.361279	  1.774856
  0.424122	 -0.367722	  1.748094
  0.415303	 -0.378527	  1.729976
  0.400109	 -0.388893	  1.717026
  0.383479	 -0.392557	  1.709251
  0.368096	 -0.394703	  1.695634
  0.355921	 -0.399556	  1.679936
  0.344896	 -0.402944	  1.664361
  0.330115	 -0.405097	  1.650807
  0.312492	 -0.410044	  1.638140
  0.300656	 -0.414330	  1.626711
  0.289415	 -0.422557	  1.612084
  0.275825	 -0.429436	  1.583252
  0.268841	 -0.430193	  1.571161
  0.260249	 -0.430215	  1.560025
  0.247147	 -0.430137	  1.542485
  0.230883	 -0.427674	  1.523632
  0.217362	 -0.424692	  1.512111
  0.205033	 -0.422948	  1.499495
  0.193446	 -0.417289	  1.482405
  0.179120	 -0.409199	  1.462407
  0.166527	 -0.412568	  1.451467
  0.147540	 -0.408591	  1.437678
  0.139214	 -0.411272	  1.427537
  0.120235	 -0.411713	  1.416896
  0.102472	 -0.406085	  1.407258
  0.087650	 -0.400206	  1.395981
  0.073995	 -0.390776	  1.382672
  0.061111	 -0.379434	  1.365174
  0.051735	 -0.372052	  1.356258
  0.039113	 -0.359594	  1.345561
  0.021304	 -0.351280	  1.336964
  0.006708	 -0.343339	  1.329588
 -0.014414	 -0.338173	  1.315744
 -0.034836	 -0.334715	  1.304195
 -0.050892	 -0.330102	  1.291764
 -0.064669	 -0.320905	  1.284109
 -0.079956	 -0.303377	  1.279107
 -0.090789	 -0.281175	  1.275544
 -0.096674	 -0.269226	  1.271492
 -0.108193	 -0.251436	  1.262959
 -0.126376	 -0.236505	  1.254098
 -0.135566	 -0.227399	  1.248874
 -0.152770	 -0.215968	  1.237927
 -0.167057	 -0.207522	  1.227477
 -0.180235	 -0.196701	  1.220211
 -0.190930	 -0.179718	  1.210306
 -0.194205	 -0.161824	  1.200398
 -0.200333	 -0.141051	  1.191105
 -0.206952	 -0.122827	  1.179903
 -0.207362	 -0.109239	  1.163922
 -0.201853	 -0.104752	  1.150451
 -0.202043	 -0.092126	  1.137403
 -0.208307	 -0.083922	  1.119862
 -0.212100	 -0.078406	  1.108859
 -0.215520	 -0.079017	  1.088884
 -0.208155	 -0.069305	  1.069066
 -0.188641	 -0.066375	  1.057733
 -0.169204	 -0.062881	  1.053795
 -0.144197	 -0.060173	  1.050330
 -0.128021	 -0.058348	  1.045173
 -0.113396	 -0.055538	  1.032198
 -0.097179	 -0.054426	  1.018415
 -0.082284	 -0.052442	  1.007572
 -0.066680	 -0.051448	  0.993793
 -0.046715	 -0.046916	  0.979688
 -0.034019	 -0.040869	  0.973813
 -0.015010	 -0.034701	  0.963603
  0.002707	 -0.026428	  0.950374
  0.014445	 -0.021498	  0.940076
  0.029260	 -0.017343	  0.926915
  0.045560	 -0.013514	  0.913023
  0.061705	 -0.010596	  0.901269
  0.078230	 -0.005267	  0.890714
  0.093885	  0.001592	  0.881724
  0.111108	  0.010520	  0.867263
  0.121245	  0.013853	  0.851673
  0.125874	  0.016017	  0.831498
  0.135612	  0.020877	  0.806992
  0.149772	  0.031593	  0.794747
  0.164390	  0.043326	  0.783401
  0.174884	  0.055948	  0.769031
  0.178645	  0.068515	  0.754435
  0.182266	  0.078878	  0.739182
  0.185157	  0.090370	  0.720735
  0.188638	  0.103751	  0.705553
  0.190804	  0.124764	  0.686901
  0.195670	  0.133088	  0.678303
  0.196450	  0.145083	  0.661149
  0.198676	  0.154635	  0.646928
  0.198680	  0.174406	  0.628671
  0.198826	  0.190639	  0.612390
  0.199336	  0.197928	  0.602708
  0.201503	  0.209370	  0.585395
  0.202710	  0.222656	  0.566633
  0.203995	  0.233087	  0.555775
  0.206693	  0.244625	  0.543319
  0.210375	  0.256414	  0.525240
  0.216069	  0.268754	  0.511505
  0.223979	  0.280557	  0.498374
  0.229898	  0.290728	  0.482002
  0.236952	  0.302595	  0.466868
  0.247383	  0.318575	  0.454153
  0.255216	  0.330986	  0.442588
  0.259781	  0.340206	  0.426296
  0.262399	  0.353316	  0.408800
  0.261863	  0.366980	  0.385021
  0.261104	  0.369930	  0.371652
  0.266455	  0.374275	  0.351239
  0.271670	  0.383771	  0.334682
  0.268167	  0.398431	  0.317150
  0.265301	  0.414528	  0.299869
  0.268047	  0.429678	  0.282759
  0.271452	  0.436076	  0.273195
  0.276668	  0.445899	  0.256023
  0.287017	  0.461236	  0.235845
  0.297017	  0.473770	  0.219524
  0.298569	  0.484877	  0.205801
  0.296626	  0.495690	  0.191641
  0.295433	  0.508248	  0.176722
  0.297634	  0.527342	  0.157280
  0.295920	  0.537859	  0.149136
  0.294774	  0.552368	  0.132811
  0.287296	  0.563537	  0.117904
  0.278867	  0.573025	  0.103307
  0.262253	  0.574854	  0.073397
  0.254248	  0.585354	  0.061459
  0.258120	  0.577425	  0.048623
  0.239572	  0.599807	  0.043412
  0.226330	  0.604664	  0.018486
  0.215882	  0.618238	  0.000363
  0.220951	  0.636966	 -0.004634
  0.212201	  0.630598	 -0.016037
  0.194083	  0.634215	 -0.024588
  0.177965	  0.632975	 -0.043840
  0.162877	  0.632039	 -0.062934
  0.156562	  0.627422	 -0.071489
  0.143540	  0.629249	 -0.088876
  0.130357	  0.632188	 -0.111296
  0.122598	  0.635973	 -0.128950
  0.115100	  0.637092	 -0.143550
  0.107973	  0.639257	 -0.160821
  0.098501	  0.643335	 -0.184913
  0.092555	  0.646593	 -0.200561
  0.088816	  0.651166	 -0.218523
  0.077142	  0.651397	 -0.233469
  0.067295	  0.653431	 -0.250436
  0.063134	  0.658363	 -0.264596
  0.051755	  0.661962	 -0.288176
  0.047388	  0.672044	 -0.308120
  0.043104	  0.681430	 -0.319878
  0.042047	  0.687993	 -0.323090
  0.051189	  0.708780	 -0.355294
  0.048391	  0.720502	 -0.369195
  0.060268	  0.729245	 -0.390420
  0.048519	  0.731950	 -0.401175
  0.058246	  0.738637	 -0.415437
  0.063363	  0.748872	 -0.440246
  0.067994	  0.757246	 -0.458789
  0.076309	  0.765122	 -0.472676
  0.080438	  0.780680	 -0.489789
  0.080560	  0.794546	 -0.502313
  0.082846	  0.806537	 -0.509076
  0.090270	  0.822877	 -0.521775
  0.096538	  0.842909	 -0.533718
  0.103311	  0.859133	 -0.546846
  0.111021	  0.869978	 -0.557078
  0.123945	  0.885673	 -0.566584
  0.136803	  0.899031	 -0.571026
  0.151589	  0.913345	 -0.577521
  0.162484	  0.929086	 -0.583610
  0.172521	  0.944927	 -0.591416
  0.180871	  0.961523	 -0.599321
  0.190692	  0.977726	 -0.607017
  0.197219	  0.997089	 -0.613596
  0.205108	  1.016087	 -0.619702
  0.211200	  1.034919	 -0.624107
  0.215918	  1.053925	 -0.628549
  0.221972	  1.072458	 -0.632291
  0.226749	  1.091581	 -0.636663
  0.232829	  1.109908	 -0.640521
  0.235771	  1.128916	 -0.645212
  0.241590	  1.146393	 -0.649267
  0.248784	  1.162446	 -0.651853
  0.257507	  1.182078	 -0.654830
  0.266410	  1.196453	 -0.654331
  0.281507	  1.212190	 -0.652546
  0.293892	  1.228295	 -0.649015
  0.302065	  1.241314	 -0.654399
  0.307603	  1.226099	 -0.619472
  0.333619	  1.275765	 -0.657609
  0.326539	  1.297866	 -0.657695
  0.352148	  1.251694	 -0.587299
  0.336643	  1.339568	 -0.689608
  0.306398	  1.237368	 -0.646040
  0.267789	  1.312591	 -0.833021
  0.343959	  1.353206	 -0.774118
  0.372522	  1.390831	 -0.772507
  0.430432	  1.484722	 -0.843169
  0.365211	  1.444272	 -0.830308
  0.290343	  1.346916	 -0.878480
  0.359855	  1.384222	 -0.826029
  0.431322	  1.447161	 -0.796838
  0.469014	  1.530583	 -0.937213
  0.487376	  1.539289	 -0.760300
  0.507195	  1.389389	 -0.700054
  0.510996	  1.514159	 -0.695642
  0.502561	  1.475308	 -0.735362
  0.486266	  1.481954	 -0.807250
  0.459050	  1.477987	 -0.785517
  0.484729	  1.484781	 -0.775254
  0.491046	  1.501778	 -0.786347
  0.476963	  1.498273	 -0.801674
  0.464896	  1.501401	 -0.805308
  0.450612	  1.499688	 -0.814812
  0.435744	  1.494525	 -0.822948
  0.413916	  1.498802	 -0.837690
  0.399988	  1.494470	 -0.841112
  0.388012	  1.505699	 -0.851857
  0.374902	  1.514171	 -0.868410
  0.365043	  1.518647	 -0.888115
  0.361920	  1.524458	 -0.907600
  0.361485	  1.534794	 -0.922499
  0.363431	  1.551346	 -0.936408
  0.358625	  1.569085	 -0.958213
  0.351499	  1.581957	 -0.963645
  0.349396	  1.591554	 -0.978111
  0.344476	  1.601823	 -0.998737
  0.345460	  1.614438	 -1.010855
  0.346179	  1.624488	 -1.028425
  0.351230	  1.638699	 -1.042414
  0.355078	  1.653135	 -1.055338
  0.359371	  1.663010	 -1.068605
  0.362810	  1.680073	 -1.085681
  0.366830	  1.694625	 -1.101611
  0.368964	  1.703846	 -1.110571
  0.371488	  1.717856	 -1.124591
  0.373379	  1.732261	 -1.147095
  0.370282	  1.742192	 -1.163063
  0.368451	  1.748386	 -1.187145
  0.366955	  1.759473	 -1.207406
  0.368072	  1.765858	 -1.219544
  0.365521	  1.776922	 -1.236368
  0.359273	  1.793224	 -1.252116
  0.363270	  1.812225	 -1.264155
  0.369686	  1.824859	 -1.271479
  0.375861	  1.836574	 -1.286859
  0.379856	  1.849390	 -1.305794
  0.378268	  1.866436	 -1.319922
  0.371565	  1.884856	 -1.329625
  0.359362	  1.909414	 -1.333309
  0.363288	  1.922324	 -1.348071
