 0.0 0.0 0.0 0
 -0.9264345741003798 0.06998485038003466 -0.310782907277316 1000
 0.3728857348472494 -0.402260373436965 -0.8763407921572267 1000
 -0.8176942255368688 -0.4805052723926271 -0.29061539839945943 1000
 0.07940322311693798 0.2713279257804835 0.966349645587957 1000
 0.9008983268334596 -0.4237644374270186 0.01595517879047649 1000
 0.7323209669115603 0.5437973090060753 -0.4307794142102444 1000
 -0.17038662804823632 -0.5192298455634632 0.8251522010766714 1000
 -0.38389299420697576 -0.16422719459527318 -0.892340679819518 1000
 0.0 0.0 0.0 0
 -0.5813865550535864 0.5769906528864769 0.6342260809909089 1000
 0.5234243886055934 0.7779309679120656 -0.34420933399830167 1000
 -0.865638038958928 -0.23688005773596932 0.4838376274096863 1000
 -0.020061484228788482 -0.8528521088505787 0.48557119121344605 1000
 0.8602530221769055 0.5058678779999113 -0.09009401748732916 1000
 -0.019321002138381428 0.34860908974567595 -0.9205129286303692 1000
 -0.46805716303570327 -0.05935485935892927 0.9068653808759448 1000
 0.3985597241835378 -0.8997617563299727 0.11160509191586834 1000
 0.0 0.0 0.0 0
 -0.23138919368929767 -0.8881397717661835 -0.4215407631112612 1000
 0.7763753377183169 -0.5587623679785736 0.21812006551062313 1000
 -0.9436671388868859 0.0224027236115779 0.3891781990682075 1000
 -0.26254772151390104 0.4191417104748858 -0.834525722111076 1000
 -0.16886598626588842 0.8916964620279682 0.471185138879418 1000
 -0.8994346724292087 -0.41837008544155074 -0.08796696876973048 1000
 -0.365531828255628 -0.7034394297892739 -0.6185933010504081 1000
 -0.5715314645944344 0.6966165382684467 -0.3676620576575449 1000
 0.0 0.0 0.0 0
 0.6742683178385102 0.5821351591771468 0.4410469395824127 1000
 0.42200763123673757 -0.6221813054865407 0.606128597257004 1000
 -0.6000328675773606 0.7970466712358627 0.010255990662967687 1000
 -0.7420735565627977 -0.022672365976359146 -0.626159730691651 1000
 0.14370159669085683 0.9831560970071123 -0.07955777243351224 1000
 0.9253733083113267 -0.24204949379039867 -0.3576803285171389 1000
