  2.159915	  0.798643	 -1.085967
  2.177017	  0.786386	 -1.079440
  2.161491	  0.797515	 -1.085363
  2.145983	  0.809072	 -1.090456
  2.130492	  0.820799	 -1.095202
  2.115254	  0.832927	 -1.099751
  2.100414	  0.845644	 -1.104000
  2.085570	  0.858354	 -1.108254
  2.069476	  0.869209	 -1.113061
  2.053200	  0.879752	 -1.117954
  2.036861	  0.890150	 -1.122927
  2.019764	  0.898357	 -1.129277
  2.002656	  0.906537	 -1.135635
  1.985410	  0.914308	 -1.142130
  1.967895	  0.921168	 -1.148919
  1.950529	  0.928160	 -1.155693
  1.934865	  0.935743	 -1.160758
  1.921531	  0.945994	 -1.165695
  1.897206	  0.952354	 -1.181721
  1.879588	  0.957433	 -1.189144
  1.866030	  0.962767	 -1.194207
  1.846578	  0.971658	 -1.200470
  1.829293	  0.979473	 -1.204729
  1.815342	  0.986025	 -1.208217
  1.793759	  0.997629	 -1.221360
  1.782122	  1.003459	 -1.231638
  1.769414	  1.009413	 -1.243389
  1.748650	  1.017349	 -1.257223
  1.732296	  1.021273	 -1.264509
  1.712845	  1.022891	 -1.269620
  1.686845	  1.026149	 -1.279188
  1.670830	  1.033089	 -1.288079
  1.660186	  1.038171	 -1.294281
  1.640565	  1.050607	 -1.297157
  1.620959	  1.066154	 -1.304083
  1.607808	  1.078501	 -1.308687
  1.594307	  1.086614	 -1.311600
  1.575037	  1.096259	 -1.313775
  1.554160	  1.111711	 -1.317381
  1.536285	  1.129699	 -1.320910
  1.527580	  1.137255	 -1.322218
  1.515131	  1.153318	 -1.325540
  1.500586	  1.171176	 -1.333715
  1.491033	  1.187953	 -1.343390
  1.484453	  1.202604	 -1.350561
  1.471352	  1.219821	 -1.357850
  1.460103	  1.235708	 -1.364554
  1.453029	  1.251586	 -1.370636
  1.444734	  1.267854	 -1.380186
  1.436321	  1.284393	 -1.389822
  1.427560	  1.301654	 -1.397262
  1.417012	  1.317287	 -1.404648
  1.401771	  1.329882	 -1.412556
  1.380900	  1.341624	 -1.411788
  1.358792	  1.357773	 -1.403330
  1.347819	  1.373462	 -1.401930
  1.339212	  1.388576	 -1.404892
  1.328792	  1.401604	 -1.409731
  1.312396	  1.413019	 -1.411440
  1.292093	  1.430354	 -1.411738
  1.282140	  1.443784	 -1.414799
  1.272400	  1.456799	 -1.418246
  1.255020	  1.468987	 -1.420234
  1.236530	  1.483267	 -1.417902
  1.223913	  1.503881	 -1.415663
  1.218638	  1.521760	 -1.415442
  1.210187	  1.537282	 -1.421378
  1.191760	  1.550125	 -1.430386
  1.172555	  1.557811	 -1.433893
  1.154421	  1.567861	 -1.435797
  1.137624	  1.579270	 -1.437928
  1.120517	  1.589639	 -1.440263
  1.102444	  1.598387	 -1.443270
  1.085618	  1.605720	 -1.445681
  1.069445	  1.619072	 -1.442731
  1.051510	  1.631926	 -1.443675
  1.038984	  1.642496	 -1.451514
  1.027208	  1.656838	 -1.462759
  1.006282	  1.668456	 -1.476727
  0.986143	  1.671006	 -1.485439
  0.969004	  1.675806	 -1.492741
  0.952040	  1.681302	 -1.498068
  0.934733	  1.685512	 -1.499708
  0.909601	  1.693186	 -1.501048
  0.893949	  1.699033	 -1.503302
  0.877778	  1.705218	 -1.505944
  0.854641	  1.713671	 -1.510487
  0.831878	  1.726061	 -1.517153
  0.822727	  1.735327	 -1.523198
  0.813914	  1.745858	 -1.529259
  0.796731	  1.760673	 -1.538130
  0.776717	  1.768288	 -1.539328
  0.757683	  1.774024	 -1.541043
  0.740688	  1.781009	 -1.549876
  0.722809	  1.790128	 -1.557761
  0.704798	  1.794771	 -1.564702
  0.687519	  1.798272	 -1.571474
  0.670138	  1.807705	 -1.578312
  0.654248	  1.818283	 -1.584732
  0.640772	  1.830971	 -1.592321
  0.627306	  1.843662	 -1.599914
  0.613791	  1.856401	 -1.607535
  0.599331	  1.870142	 -1.615744
  0.581800	  1.888279	 -1.626325
  0.569216	  1.901732	 -1.634114
