  0.995592	 -2.109669	  0.864985
  0.993671	 -2.113500	  0.865351
  1.002598	 -2.095683	  0.863661
  1.011035	 -2.077561	  0.863345
  1.017577	 -2.059123	  0.867468
  1.024164	 -2.040668	  0.871471
  1.031088	 -2.022167	  0.874594
  1.038016	 -2.003666	  0.877708
  1.045145	 -1.985226	  0.880739
  1.052419	 -1.966835	  0.883713
  1.059687	 -1.948438	  0.886666
  1.066486	 -1.929710	  0.888392
  1.073267	 -1.910970	  0.890072
  1.079747	 -1.892091	  0.891331
  1.085273	 -1.872871	  0.891282
  1.090777	 -1.853644	  0.891213
  1.095253	 -1.834165	  0.890482
  1.098978	 -1.814552	  0.889281
  1.102685	 -1.794924	  0.888286
  1.106346	 -1.775263	  0.888043
  1.110014	 -1.755605	  0.887827
  1.114373	 -1.736140	  0.889273
  1.118762	 -1.716686	  0.890780
  1.123516	 -1.697279	  0.891626
  1.128954	 -1.678037	  0.891190
  1.134402	 -1.658799	  0.890731
  1.140269	 -1.639739	  0.889247
  1.146807	 -1.621114	  0.886028
  1.153355	 -1.602494	  0.882801
  1.160470	 -1.583956	  0.880415
  1.167805	 -1.565462	  0.878364
  1.174999	 -1.546910	  0.876361
  1.181898	 -1.528235	  0.874449
  1.188773	 -1.509552	  0.872539
  1.194030	 -1.490346	  0.870680
  1.199181	 -1.471110	  0.868826
  1.202559	 -1.451483	  0.867001
  1.205272	 -1.431751	  0.865191
  1.208056	 -1.412046	  0.863203
  1.211073	 -1.392438	  0.860672
  1.214099	 -1.372832	  0.858132
  1.217423	 -1.353708	  0.855533
  1.220930	 -1.334126	  0.853024
  1.225964	 -1.313764	  0.852086
  1.231743	 -1.295228	  0.850272
  1.239136	 -1.277660	  0.845467
  1.247621	 -1.257544	  0.842293
  1.253085	 -1.239949	  0.844590
  1.258935	 -1.220839	  0.848699
  1.266299	 -1.201396	  0.849109
  1.274218	 -1.184279	  0.845331
  1.283114	 -1.164144	  0.841858
  1.289272	 -1.146457	  0.843079
  1.294357	 -1.128013	  0.845795
  1.300271	 -1.107000	  0.848942
  1.307841	 -1.088607	  0.845954
  1.314799	 -1.070202	  0.842404
  1.319864	 -1.052492	  0.838532
  1.325256	 -1.032479	  0.835323
  1.328299	 -1.013426	  0.829993
  1.328322	 -0.995279	  0.821596
  1.328314	 -0.977141	  0.813169
  1.328274	 -0.959025	  0.804709
  1.325443	 -0.943271	  0.792739
  1.320135	 -0.930675	  0.778146
  1.314800	 -0.918108	  0.763530
  1.309464	 -0.905542	  0.748915
  1.304129	 -0.892975	  0.734299
  1.298767	 -0.880421	  0.719686
  1.290455	 -0.869567	  0.705094
  1.280453	 -0.859907	  0.690719
  1.270437	 -0.850254	  0.676348
  1.260421	 -0.840602	  0.661978
  1.250419	 -0.830949	  0.647609
  1.241245	 -0.821126	  0.633063
  1.229705	 -0.810743	  0.619545
  1.217596	 -0.801575	  0.605776
  1.203964	 -0.793921	  0.592397
  1.188538	 -0.784014	  0.585251
  1.174616	 -0.772438	  0.577796
  1.157301	 -0.761943	  0.567548
  1.142839	 -0.755887	  0.555043
  1.132887	 -0.747090	  0.542121
  1.118779	 -0.736845	  0.531469
  1.104417	 -0.727354	  0.521437
  1.089766	 -0.717007	  0.513487
  1.074133	 -0.706542	  0.504498
  1.056033	 -0.699584	  0.494390
  1.043186	 -0.688994	  0.488588
  1.029765	 -0.673426	  0.485359
  1.017435	 -0.656969	  0.482967
  1.002502	 -0.642810	  0.481184
  0.988842	 -0.629289	  0.482461
  0.978995	 -0.611703	  0.486074
  0.972163	 -0.594828	  0.493351
  0.967273	 -0.576146	  0.499990
  0.964492	 -0.558459	  0.508468
  0.961766	 -0.540063	  0.516322
  0.958959	 -0.521768	  0.523892
  0.958583	 -0.502982	  0.530847
  0.958862	 -0.484214	  0.537751
  0.959146	 -0.465446	  0.544656
  0.959430	 -0.446678	  0.551560
  0.959760	 -0.427924	  0.558483
  0.964188	 -0.410352	  0.566914
  0.969747	 -0.393108	  0.575158
  0.975050	 -0.375361	  0.582210
  0.981499	 -0.357994	  0.590649
  0.990463	 -0.344531	  0.605535
  0.996677	 -0.334038	  0.621597
  1.007527	 -0.329059	  0.639044
  1.019360	 -0.322074	  0.652312
  1.030179	 -0.313212	  0.666620
  1.039293	 -0.307681	  0.685379
  1.051217	 -0.305103	  0.699598
  1.062733	 -0.298019	  0.714116
  1.073753	 -0.291780	  0.731054
  1.084413	 -0.290272	  0.750651
  1.092820	 -0.286077	  0.765230
  1.102280	 -0.279405	  0.780604
  1.112714	 -0.273196	  0.798013
  1.122590	 -0.268091	  0.814841
  1.133302	 -0.261989	  0.830571
  1.146901	 -0.251963	  0.841252
  1.160529	 -0.241897	  0.851880
  1.174156	 -0.231831	  0.862508
  1.187784	 -0.221765	  0.873136
  1.201434	 -0.211680	  0.883677
  1.217336	 -0.199735	  0.885509
  1.233098	 -0.187805	  0.882504
  1.248857	 -0.175876	  0.879452
  1.264617	 -0.163946	  0.876400
  1.280376	 -0.152014	  0.873354
  1.296017	 -0.139777	  0.871002
  1.311068	 -0.126610	  0.871082
  1.326114	 -0.113434	  0.871191
  1.341160	 -0.100258	  0.871299
  1.356214	 -0.087092	  0.871414
  1.372040	 -0.074885	  0.872122
  1.388192	 -0.063145	  0.873040
  1.406877	 -0.056335	  0.871137
  1.426182	 -0.051878	  0.868381
  1.445835	 -0.049803	  0.865403
  1.465501	 -0.047648	  0.862463
  1.485278	 -0.046832	  0.859599
  1.505088	 -0.046797	  0.856847
  1.524897	 -0.046768	  0.854095
  1.544704	 -0.046704	  0.851347
  1.564320	 -0.043460	  0.849202
  1.583930	 -0.040163	  0.847064
  1.603540	 -0.036866	  0.844925
  1.623131	 -0.033509	  0.842796
  1.640769	 -0.024133	  0.842244
  1.655580	 -0.010721	  0.842968
  1.670362	  0.002730	  0.843699
  1.685117	  0.016206	  0.844436
  1.697032	  0.032216	  0.845661
  1.706819	  0.049590	  0.847184
  1.716572	  0.066983	  0.848711
  1.724752	  0.085156	  0.850375
  1.731833	  0.103779	  0.852127
  1.738893	  0.122409	  0.853871
  1.744916	  0.141440	  0.855104
  1.750763	  0.160532	  0.856249
  1.756543	  0.179653	  0.857242
  1.761869	  0.198720	  0.856953
  1.768328	  0.217738	  0.857859
  1.774452	  0.237197	  0.859695
  1.778118	  0.258062	  0.860794
  1.781138	  0.276907	  0.857835
  1.787957	  0.293867	  0.849724
  1.794663	  0.312914	  0.841774
  1.794295	  0.336321	  0.837854
  1.794422	  0.357040	  0.838489
  1.800567	  0.369806	  0.838451
  1.807065	  0.390573	  0.834597
  1.814354	  0.410326	  0.832039
  1.817838	  0.432645	  0.833029
  1.817506	  0.451988	  0.831050
  1.825683	  0.469579	  0.830260
  1.831929	  0.489128	  0.829559
  1.834353	  0.507842	  0.827323
  1.838149	  0.527539	  0.825738
  1.843609	  0.547383	  0.825661
  1.849143	  0.566599	  0.825888
  1.855467	  0.585554	  0.826085
  1.861901	  0.604478	  0.826675
  1.868064	  0.623493	  0.827042
  1.874156	  0.642524	  0.827537
  1.879985	  0.661655	  0.828255
  1.884725	  0.681086	  0.828938
  1.889401	  0.700499	  0.829370
  1.893155	  0.720075	  0.830488
  1.895935	  0.739684	  0.832495
  1.898475	  0.759596	  0.834252
  1.900408	  0.779834	  0.834755
  1.901196	  0.799601	  0.835262
  1.904214	  0.819823	  0.833663
  1.907024	  0.839435	  0.831896
  1.911955	  0.858810	  0.829342
  1.918105	  0.877889	  0.826784
  1.923745	  0.896709	  0.824483
  1.926456	  0.916203	  0.820704
  1.925988	  0.936284	  0.814912
  1.928791	  0.955921	  0.810584
  1.934093	  0.973489	  0.808188
  1.943142	  0.995226	  0.804786
  1.951058	  1.011890	  0.800376
  1.956753	  1.029099	  0.794280
  1.962066	  1.048048	  0.787676
  1.962942	  1.066898	  0.783026
  1.963633	  1.087083	  0.778286
  1.970279	  1.107009	  0.774262
  1.976203	  1.125167	  0.769766
  1.979576	  1.142321	  0.761025
  1.986862	  1.160910	  0.756062
  1.996078	  1.179104	  0.754590
  2.004469	  1.197795	  0.754340
  2.011467	  1.217225	  0.753130
  2.018949	  1.235041	  0.750612
  2.027107	  1.251852	  0.747356
  2.036100	  1.270283	  0.745071
  2.044748	  1.288493	  0.743301
  2.053265	  1.307220	  0.742102
  2.061463	  1.325442	  0.741247
