  1.669035	  0.563322	 -1.813958
  1.677154	  0.566739	 -1.813714
  1.644179	  0.552862	 -1.814703
  1.598225	  0.535341	 -1.824934
  1.548871	  0.510910	 -1.825082
  1.505700	  0.490252	 -1.829608
  1.462513	  0.468876	 -1.836930
  1.419001	  0.446841	 -1.846300
  1.375232	  0.423411	 -1.857664
  1.333726	  0.400407	 -1.869437
  1.291072	  0.380002	 -1.880132
  1.245454	  0.361827	 -1.889907
  1.198192	  0.346044	 -1.897585
  1.147860	  0.331232	 -1.903140
  1.095139	  0.317425	 -1.905512
  1.045602	  0.304567	 -1.906279
  0.998157	  0.291614	 -1.908050
  0.952746	  0.278907	 -1.910929
  0.906630	  0.264490	 -1.914924
  0.860538	  0.247813	 -1.920135
  0.813006	  0.229386	 -1.927534
  0.764869	  0.210377	 -1.936239
  0.717900	  0.191195	 -1.944390
  0.670371	  0.171261	 -1.951584
  0.624792	  0.152091	 -1.956904
  0.577579	  0.132334	 -1.959879
  0.525369	  0.110062	 -1.957751
  0.475822	  0.086889	 -1.948865
  0.432079	  0.066761	 -1.940188
  0.392505	  0.048435	 -1.939335
  0.351850	  0.028944	 -1.946170
  0.308663	  0.006949	 -1.958158
  0.262668	 -0.018396	 -1.970902
  0.216355	 -0.044672	 -1.980790
  0.170508	 -0.071663	 -1.987034
  0.124379	 -0.097207	 -1.989644
  0.080743	 -0.119500	 -1.989924
  0.037522	 -0.138906	 -1.989308
 -0.005831	 -0.156751	 -1.990028
 -0.046799	 -0.172812	 -1.993490
 -0.085413	 -0.187209	 -2.000454
 -0.125863	 -0.200993	 -2.012095
 -0.173119	 -0.216178	 -2.027320
 -0.224927	 -0.234262	 -2.042154
 -0.278068	 -0.256285	 -2.052177
 -0.328680	 -0.279375	 -2.056255
 -0.380212	 -0.302761	 -2.056072
 -0.430700	 -0.324450	 -2.050361
 -0.474773	 -0.343896	 -2.043642
 -0.517135	 -0.367228	 -2.043604
 -0.558390	 -0.390981	 -2.045520
 -0.604131	 -0.412112	 -2.045122
 -0.647468	 -0.431871	 -2.042533
 -0.688481	 -0.454671	 -2.049904
 -0.738698	 -0.471480	 -2.050461
 -0.781198	 -0.490699	 -2.050831
 -0.823953	 -0.516027	 -2.064618
 -0.866718	 -0.548837	 -2.067719
 -0.905213	 -0.574089	 -2.075070
 -0.947844	 -0.599344	 -2.084293
 -0.991978	 -0.623316	 -2.093754
 -1.037000	 -0.645939	 -2.102480
 -1.081813	 -0.667327	 -2.109499
 -1.127434	 -0.689648	 -2.114458
 -1.206251	 -0.732412	 -2.113424
 -1.221088	 -0.740696	 -2.112350
