  2.166057	  0.374311	 -1.103571
  2.186243	  0.394214	 -1.105270
  2.166045	  0.374299	 -1.103570
  2.123061	  0.330051	 -1.106437
  2.090648	  0.288229	 -1.116022
  2.065902	  0.246537	 -1.126223
  2.040693	  0.206170	 -1.136766
  2.015554	  0.166694	 -1.145613
  1.988682	  0.122676	 -1.156575
  1.959847	  0.076223	 -1.170637
  1.925776	  0.028098	 -1.187481
  1.887345	 -0.016717	 -1.208608
  1.849485	 -0.052719	 -1.228766
  1.816081	 -0.081209	 -1.243809
  1.786858	 -0.107573	 -1.254021
  1.758520	 -0.136489	 -1.261381
  1.729032	 -0.168946	 -1.266849
  1.699461	 -0.202756	 -1.270417
  1.668923	 -0.238205	 -1.271983
  1.635614	 -0.276597	 -1.272805
  1.599907	 -0.315861	 -1.274265
  1.564074	 -0.354076	 -1.276278
  1.531209	 -0.393809	 -1.280863
  1.508208	 -0.437070	 -1.291773
  1.509879	 -0.502029	 -1.318530
  1.549361	 -0.574216	 -1.373478
  1.548970	 -0.649155	 -1.416214
  1.524645	 -0.695441	 -1.433682
  1.499448	 -0.714426	 -1.436740
  1.458894	 -0.725924	 -1.431619
  1.388791	 -0.733350	 -1.415430
  1.308934	 -0.745091	 -1.392222
  1.241398	 -0.772212	 -1.372197
  1.193723	 -0.807358	 -1.364831
  1.159481	 -0.845552	 -1.365397
  1.129424	 -0.888618	 -1.371658
  1.100601	 -0.935052	 -1.383566
  1.071518	 -0.982149	 -1.400052
  1.040252	 -1.027767	 -1.418643
  1.006253	 -1.070709	 -1.437262
  0.969215	 -1.110368	 -1.455299
  0.930627	 -1.146017	 -1.471959
  0.891813	 -1.178295	 -1.486643
  0.853192	 -1.207517	 -1.498654
  0.814768	 -1.234982	 -1.507736
  0.777243	 -1.262108	 -1.513992
  0.739800	 -1.289444	 -1.517970
  0.700273	 -1.317577	 -1.520725
  0.663808	 -1.343691	 -1.523770
  0.635844	 -1.369628	 -1.526446
  0.610950	 -1.403746	 -1.529886
  0.584042	 -1.445449	 -1.534143
  0.557342	 -1.487611	 -1.537588
  0.531132	 -1.531071	 -1.540153
  0.504014	 -1.575516	 -1.543880
  0.476212	 -1.619018	 -1.548428
  0.447068	 -1.661670	 -1.553804
  0.417340	 -1.702692	 -1.559428
  0.388323	 -1.741392	 -1.563894
  0.355893	 -1.780429	 -1.563692
  0.315123	 -1.823505	 -1.562949
  0.275615	 -1.863214	 -1.568556
  0.221040	 -1.925370	 -1.581926
  0.212019	 -1.933368	 -1.581534
