  2.441657	 -0.561152	 -0.066002
  2.435343	 -0.561120	 -0.065180
  2.409132	 -0.560987	 -0.061767
  2.391053	 -0.561949	 -0.065732
  2.376230	 -0.566031	 -0.067648
  2.358089	 -0.574667	 -0.068420
  2.332291	 -0.580219	 -0.070535
  2.314225	 -0.583904	 -0.075527
  2.299234	 -0.589861	 -0.078092
  2.281953	 -0.598067	 -0.079298
  2.255516	 -0.602707	 -0.082602
  2.233998	 -0.604897	 -0.091144
  2.219827	 -0.609533	 -0.099826
  2.207469	 -0.619832	 -0.107309
  2.191443	 -0.633968	 -0.110741
  2.173749	 -0.643660	 -0.110522
  2.157787	 -0.654159	 -0.107152
  2.146491	 -0.668820	 -0.099773
  2.137712	 -0.685468	 -0.093742
  2.130588	 -0.704606	 -0.091291
  2.121574	 -0.723867	 -0.090941
  2.110012	 -0.741749	 -0.087943
  2.095287	 -0.758936	 -0.079856
  2.083413	 -0.773316	 -0.069808
  2.074308	 -0.787231	 -0.058693
  2.067966	 -0.799775	 -0.051352
  2.062327	 -0.817025	 -0.041596
  2.054609	 -0.834446	 -0.031112
  2.046613	 -0.849807	 -0.020643
  2.042911	 -0.863985	 -0.008396
  2.039131	 -0.881624	  0.007879
  2.031096	 -0.899629	  0.019554
  2.019097	 -0.916453	  0.023880
  2.006891	 -0.929128	  0.020584
  1.995618	 -0.943285	  0.020745
  1.979578	 -0.958569	  0.015485
  1.959437	 -0.973263	  0.004172
  1.944957	 -0.985759	 -0.001181
  1.932736	 -0.995501	 -0.005349
  1.917640	 -1.009788	 -0.004931
  1.902481	 -1.023233	 -0.006461
  1.891014	 -1.032380	 -0.008171
  1.870426	 -1.051354	 -0.008905
  1.856943	 -1.065265	 -0.008498
  1.838856	 -1.082377	 -0.007492
  1.825752	 -1.094577	 -0.007084
  1.807804	 -1.108361	 -0.008172
  1.789741	 -1.115677	 -0.020632
  1.777140	 -1.119991	 -0.034214
  1.763177	 -1.128935	 -0.047334
  1.748918	 -1.136206	 -0.058843
  1.731419	 -1.146042	 -0.067947
  1.715307	 -1.156159	 -0.076694
  1.699174	 -1.163633	 -0.088135
  1.682926	 -1.166394	 -0.102058
  1.669822	 -1.166572	 -0.118588
  1.664195	 -1.168218	 -0.140992
  1.659933	 -1.176833	 -0.166128
  1.649173	 -1.191179	 -0.181473
  1.636631	 -1.203153	 -0.188036
  1.616440	 -1.213740	 -0.195836
  1.597340	 -1.220557	 -0.211450
  1.586650	 -1.224097	 -0.228766
  1.577836	 -1.227560	 -0.245491
  1.568643	 -1.226019	 -0.264678
  1.557906	 -1.221678	 -0.285331
  1.549357	 -1.216367	 -0.304819
  1.542991	 -1.213412	 -0.322427
  1.536159	 -1.212675	 -0.339409
  1.524504	 -1.213478	 -0.355919
  1.508603	 -1.212013	 -0.369106
  1.489779	 -1.205971	 -0.383248
  1.477330	 -1.200074	 -0.401279
  1.469158	 -1.195900	 -0.417689
  1.460771	 -1.192885	 -0.431621
  1.447469	 -1.188817	 -0.444162
  1.429731	 -1.184299	 -0.462617
  1.418561	 -1.184993	 -0.479927
  1.412516	 -1.186192	 -0.491842
  1.399214	 -1.188021	 -0.511156
  1.381260	 -1.187016	 -0.528339
  1.367187	 -1.185774	 -0.538043
  1.351669	 -1.183492	 -0.546165
  1.332602	 -1.181118	 -0.555921
  1.311947	 -1.179848	 -0.563957
  1.293701	 -1.178589	 -0.567702
  1.276780	 -1.176470	 -0.571033
  1.257872	 -1.175374	 -0.575883
  1.237895	 -1.175047	 -0.583838
  1.212220	 -1.173164	 -0.590793
  1.199119	 -1.172997	 -0.591803
  1.179917	 -1.172199	 -0.591442
  1.158412	 -1.172498	 -0.591923
  1.137447	 -1.171857	 -0.594907
  1.117584	 -1.170512	 -0.598878
  1.096108	 -1.170215	 -0.603273
  1.077601	 -1.173381	 -0.605435
  1.056920	 -1.179714	 -0.605731
  1.037199	 -1.188203	 -0.604537
  1.019842	 -1.196844	 -0.601839
  1.001596	 -1.207687	 -0.598999
  0.985944	 -1.216765	 -0.595290
  0.968148	 -1.216779	 -0.587523
  0.942715	 -1.224631	 -0.581727
  0.925583	 -1.235220	 -0.580645
  0.912408	 -1.242943	 -0.579285
  0.889545	 -1.255981	 -0.575868
  0.872233	 -1.262393	 -0.571356
  0.858054	 -1.266621	 -0.566675
  0.837853	 -1.268014	 -0.558470
  0.818821	 -1.267281	 -0.551569
  0.800248	 -1.270275	 -0.545284
  0.780451	 -1.281769	 -0.541408
  0.758925	 -1.301912	 -0.536748
  0.747316	 -1.307764	 -0.532603
  0.728633	 -1.313826	 -0.526720
  0.711826	 -1.317744	 -0.519753
  0.691917	 -1.322033	 -0.514209
  0.676295	 -1.325455	 -0.507381
  0.658243	 -1.332762	 -0.496241
  0.641962	 -1.339132	 -0.484029
  0.624058	 -1.342444	 -0.471614
  0.607260	 -1.341474	 -0.460928
  0.591297	 -1.343155	 -0.446868
  0.575688	 -1.347718	 -0.433607
  0.557650	 -1.353849	 -0.420466
  0.546869	 -1.358225	 -0.414400
  0.527152	 -1.364671	 -0.407319
  0.508022	 -1.371352	 -0.400600
  0.490007	 -1.379437	 -0.395760
  0.468181	 -1.387310	 -0.392422
  0.448881	 -1.390769	 -0.389315
  0.433753	 -1.391081	 -0.384276
  0.415588	 -1.388771	 -0.369112
  0.389382	 -1.389191	 -0.356110
  0.375634	 -1.391671	 -0.352366
  0.356414	 -1.395190	 -0.350686
  0.342051	 -1.399324	 -0.346834
  0.319880	 -1.406945	 -0.342160
  0.300047	 -1.412731	 -0.340231
  0.280754	 -1.418290	 -0.339027
  0.261689	 -1.424272	 -0.339918
  0.242708	 -1.430658	 -0.340393
  0.224432	 -1.438768	 -0.341094
  0.206444	 -1.447423	 -0.341936
  0.189697	 -1.458213	 -0.343256
  0.173935	 -1.469925	 -0.344725
  0.162515	 -1.484063	 -0.346122
  0.158464	 -1.502523	 -0.346513
  0.146396	 -1.526303	 -0.343544
  0.125673	 -1.538710	 -0.344882
  0.112444	 -1.546869	 -0.345273
  0.094781	 -1.556559	 -0.346427
  0.076942	 -1.577120	 -0.347057
  0.069529	 -1.589615	 -0.346269
  0.062154	 -1.606234	 -0.343482
  0.056016	 -1.627248	 -0.341549
  0.050167	 -1.649887	 -0.342897
  0.044420	 -1.667243	 -0.342748
  0.034874	 -1.688089	 -0.338565
  0.025702	 -1.706281	 -0.336630
  0.018653	 -1.721438	 -0.337640
  0.008071	 -1.742643	 -0.341078
  0.001224	 -1.757013	 -0.344112
 -0.006017	 -1.774147	 -0.352124
 -0.012589	 -1.793268	 -0.363079
 -0.016883	 -1.810704	 -0.369882
 -0.019418	 -1.829413	 -0.377471
 -0.020625	 -1.851824	 -0.385939
 -0.029167	 -1.871891	 -0.392840
 -0.041243	 -1.884303	 -0.393831
 -0.052802	 -1.900664	 -0.394190
 -0.062961	 -1.918766	 -0.398409
 -0.070621	 -1.936393	 -0.397316
 -0.084700	 -1.957408	 -0.402120
 -0.100199	 -1.971961	 -0.411828
 -0.112154	 -1.981780	 -0.416848
 -0.124076	 -1.994126	 -0.420633
 -0.138281	 -2.012491	 -0.430706
 -0.145897	 -2.026631	 -0.444127
 -0.148140	 -2.037521	 -0.461596
 -0.153995	 -2.051411	 -0.480817
 -0.164903	 -2.065785	 -0.493136
 -0.175246	 -2.075621	 -0.500747
 -0.190289	 -2.089112	 -0.509639
 -0.201864	 -2.099407	 -0.519865
 -0.210215	 -2.107556	 -0.528999
 -0.232317	 -2.125445	 -0.550162
 -0.245855	 -2.134482	 -0.558589
 -0.254609	 -2.140497	 -0.563314
 -0.264874	 -2.148728	 -0.570468
 -0.281920	 -2.160589	 -0.585990
 -0.297044	 -2.166611	 -0.599776
 -0.311516	 -2.171707	 -0.612895
 -0.326199	 -2.175523	 -0.626350
 -0.341199	 -2.177060	 -0.640040
 -0.356216	 -2.176895	 -0.653451
 -0.371416	 -2.177365	 -0.666508
 -0.386996	 -2.178823	 -0.679024
 -0.403294	 -2.178441	 -0.690600
 -0.419916	 -2.176775	 -0.701596
 -0.436548	 -2.175058	 -0.712567
 -0.453226	 -2.173218	 -0.723424
 -0.470738	 -2.169019	 -0.732087
 -0.488439	 -2.164022	 -0.739935
 -0.506150	 -2.158985	 -0.747738
 -0.523930	 -2.153889	 -0.755280
 -0.542646	 -2.147823	 -0.758731
 -0.561411	 -2.141708	 -0.761961
 -0.580188	 -2.135594	 -0.765103
 -0.599112	 -2.129299	 -0.766459
 -0.618028	 -2.122860	 -0.765721
 -0.636944	 -2.116422	 -0.764877
 -0.655860	 -2.110026	 -0.763780
 -0.674691	 -2.103794	 -0.761238
 -0.693523	 -2.097593	 -0.758615
 -0.712371	 -2.091485	 -0.755913
 -0.731540	 -2.086817	 -0.752783
 -0.750948	 -2.082785	 -0.750008
 -0.770372	 -2.078856	 -0.747196
 -0.789664	 -2.075382	 -0.743681
 -0.809107	 -2.072371	 -0.740199
 -0.828664	 -2.069780	 -0.736636
 -0.848048	 -2.067103	 -0.732228
 -0.866916	 -2.063450	 -0.726809
 -0.885611	 -2.059598	 -0.720788
 -0.904616	 -2.056804	 -0.714914
 -0.923835	 -2.054394	 -0.709772
 -0.943167	 -2.052039	 -0.705426
 -0.962427	 -2.050006	 -0.700796
 -0.981742	 -2.048112	 -0.695715
 -1.001062	 -2.046223	 -0.691094
 -1.020250	 -2.044643	 -0.685652
 -1.039365	 -2.043141	 -0.679914
 -1.058443	 -2.041660	 -0.674094
 -1.077506	 -2.040306	 -0.668198
 -1.096563	 -2.039005	 -0.662271
 -1.115616	 -2.037701	 -0.656332
 -1.134597	 -2.036304	 -0.650188
 -1.153373	 -2.034657	 -0.643499
 -1.172137	 -2.032996	 -0.636780
 -1.190871	 -2.031314	 -0.629992
 -1.208969	 -2.029231	 -0.621750
 -1.226643	 -2.026926	 -0.612679
 -1.244300	 -2.024673	 -0.603565
 -1.261953	 -2.023701	 -0.594223
 -1.279575	 -2.023784	 -0.584779
 -1.297539	 -2.025636	 -0.576244
 -1.315696	 -2.029488	 -0.568909
 -1.336559	 -2.036318	 -0.563046
 -1.352344	 -2.041912	 -0.559087
