  2.137192	 -0.684918	 -1.010441
  2.146613	 -0.686001	 -1.002696
  2.156034	 -0.687084	 -0.994951
  2.143286	 -0.685990	 -1.011550
  2.127325	 -0.683526	 -1.022566
  2.110626	 -0.680541	 -1.033347
  2.094370	 -0.676883	 -1.045512
  2.079301	 -0.677614	 -1.058143
  2.063330	 -0.679297	 -1.071106
  2.048315	 -0.679367	 -1.085785
  2.033629	 -0.675942	 -1.098709
  2.019356	 -0.672758	 -1.109253
  2.003254	 -0.670296	 -1.122670
  1.987839	 -0.668959	 -1.135265
  1.973432	 -0.666511	 -1.149929
  1.958325	 -0.664679	 -1.164271
  1.941963	 -0.665656	 -1.172922
  1.925201	 -0.665057	 -1.184551
  1.910069	 -0.662711	 -1.196551
  1.894210	 -0.658561	 -1.210344
  1.881224	 -0.653405	 -1.225109
  1.867084	 -0.652515	 -1.239934
  1.851480	 -0.651342	 -1.251046
  1.834373	 -0.648587	 -1.261349
  1.816660	 -0.645831	 -1.270740
  1.799265	 -0.643226	 -1.280657
  1.782060	 -0.640649	 -1.290524
  1.764416	 -0.638572	 -1.299709
  1.745865	 -0.637739	 -1.307139
  1.727316	 -0.636904	 -1.314573
  1.708768	 -0.636069	 -1.322007
  1.689811	 -0.636095	 -1.328380
  1.670732	 -0.636423	 -1.334371
  1.651672	 -0.636779	 -1.340323
  1.632498	 -0.638133	 -1.345255
  1.612648	 -0.640343	 -1.348808
  1.592946	 -0.640898	 -1.354626
  1.574650	 -0.641856	 -1.360672
  1.555954	 -0.642788	 -1.368767
  1.537820	 -0.642838	 -1.377648
  1.520081	 -0.640942	 -1.388723
  1.502817	 -0.641695	 -1.396252
  1.482497	 -0.641770	 -1.403885
  1.464642	 -0.636841	 -1.413760
  1.451333	 -0.635058	 -1.426468
  1.435019	 -0.636059	 -1.438488
  1.418331	 -0.637589	 -1.449110
  1.402502	 -0.637149	 -1.466153
  1.390832	 -0.635054	 -1.480249
  1.375095	 -0.633563	 -1.492424
  1.359880	 -0.632487	 -1.504614
  1.344539	 -0.630734	 -1.517365
  1.328803	 -0.628771	 -1.530501
  1.314421	 -0.624654	 -1.545179
  1.302900	 -0.626793	 -1.561044
  1.288622	 -0.629717	 -1.574595
  1.274326	 -0.632151	 -1.589812
  1.260758	 -0.630126	 -1.604028
  1.245819	 -0.625996	 -1.616551
  1.230374	 -0.621701	 -1.631798
  1.218268	 -0.622911	 -1.647592
  1.204978	 -0.626025	 -1.660686
  1.189569	 -0.628056	 -1.673055
  1.173544	 -0.628572	 -1.686402
  1.157920	 -0.628831	 -1.698888
  1.141793	 -0.629991	 -1.709788
  1.123689	 -0.632574	 -1.718345
  1.104391	 -0.635398	 -1.728929
  1.088359	 -0.638852	 -1.739365
  1.076586	 -0.634396	 -1.756000
  1.061243	 -0.628346	 -1.768168
  1.039961	 -0.625070	 -1.778457
  1.023894	 -0.626928	 -1.787604
  1.009611	 -0.631439	 -1.798213
  0.991303	 -0.633187	 -1.808963
  0.974577	 -0.634396	 -1.819082
  0.957583	 -0.637125	 -1.829693
  0.938533	 -0.638658	 -1.838308
  0.921696	 -0.638151	 -1.847044
  0.903362	 -0.637857	 -1.856449
  0.885811	 -0.639608	 -1.865521
  0.868804	 -0.644036	 -1.875783
  0.849783	 -0.648688	 -1.885411
  0.831203	 -0.647650	 -1.892681
  0.815735	 -0.645914	 -1.900352
  0.796847	 -0.645898	 -1.910388
  0.779218	 -0.645181	 -1.920400
  0.762080	 -0.643727	 -1.930605
  0.745345	 -0.641074	 -1.941165
  0.728512	 -0.638059	 -1.951742
  0.712674	 -0.633350	 -1.962588
  0.697456	 -0.625911	 -1.973671
  0.682274	 -0.617929	 -1.986043
  0.666795	 -0.613767	 -1.998226
  0.649816	 -0.615427	 -2.008603
  0.631768	 -0.614610	 -2.019453
  0.617562	 -0.609933	 -2.032363
  0.603492	 -0.604572	 -2.044961
  0.587448	 -0.600300	 -2.056965
  0.571569	 -0.596688	 -2.068575
  0.555484	 -0.593452	 -2.080023
  0.539403	 -0.590219	 -2.091467
  0.523160	 -0.587612	 -2.102840
  0.506871	 -0.585190	 -2.114190
  0.490583	 -0.582767	 -2.125540
  0.473880	 -0.581141	 -2.136419
  0.457101	 -0.579672	 -2.147203
  0.440356	 -0.578209	 -2.157979
  0.424300	 -0.577444	 -2.167652
  0.406259	 -0.576839	 -2.178914
  0.386987	 -0.575910	 -2.188377
  0.366810	 -0.573245	 -2.196916
  0.353247	 -0.573354	 -2.203406
  0.333686	 -0.573429	 -2.213501
  0.314896	 -0.573671	 -2.221769
  0.298324	 -0.574153	 -2.229792
  0.279380	 -0.574135	 -2.238812
  0.262576	 -0.573199	 -2.248033
  0.245573	 -0.571455	 -2.258362
  0.225943	 -0.570640	 -2.267475
  0.208656	 -0.572704	 -2.274116
  0.189782	 -0.573172	 -2.283223
  0.171691	 -0.569810	 -2.294785
  0.156992	 -0.566463	 -2.305305
  0.141496	 -0.563910	 -2.316589
  0.124170	 -0.562782	 -2.328604
  0.107721	 -0.560589	 -2.340016
  0.091765	 -0.558151	 -2.351503
  0.075836	 -0.556577	 -2.363757
  0.060299	 -0.554000	 -2.375908
  0.044457	 -0.552176	 -2.388116
  0.028071	 -0.550540	 -2.400831
  0.012555	 -0.549026	 -2.413359
 -0.002961	 -0.547512	 -2.425887
