  1.627267	  1.415416	 -1.293621
  1.636749	  1.432538	 -1.272948
  1.631395	  1.420184	 -1.286418
  1.625004	  1.406567	 -1.303147
  1.619774	  1.393471	 -1.315616
  1.617792	  1.378413	 -1.327319
  1.614911	  1.362871	 -1.340866
  1.610758	  1.350797	 -1.355957
  1.605292	  1.340984	 -1.374374
  1.600496	  1.326736	 -1.389676
  1.599693	  1.311285	 -1.398656
  1.598864	  1.294899	 -1.411265
  1.598385	  1.279313	 -1.424446
  1.597741	  1.264377	 -1.438406
  1.596324	  1.249402	 -1.451711
  1.593301	  1.233522	 -1.463059
  1.591148	  1.217669	 -1.475254
  1.588542	  1.202519	 -1.488156
  1.585606	  1.187247	 -1.500689
  1.581731	  1.173027	 -1.514221
  1.577648	  1.159064	 -1.527946
  1.571806	  1.146006	 -1.541924
  1.565405	  1.133272	 -1.555956
  1.558046	  1.119879	 -1.568858
  1.549254	  1.105615	 -1.579778
  1.540459	  1.091353	 -1.590699
  1.530752	  1.077115	 -1.600848
  1.520863	  1.062889	 -1.610841
  1.512170	  1.048762	 -1.622015
  1.505914	  1.035100	 -1.635214
  1.499654	  1.021439	 -1.648412
  1.491877	  1.008852	 -1.661869
  1.484059	  0.996295	 -1.675331
  1.476595	  0.983848	 -1.689091
  1.469379	  0.971480	 -1.703054
  1.462140	  0.959151	 -1.717039
  1.454736	  0.947123	 -1.731199
  1.447332	  0.935094	 -1.745359
  1.440899	  0.922013	 -1.759052
  1.436486	  0.907074	 -1.771596
  1.432074	  0.892136	 -1.784141
  1.427931	  0.876679	 -1.796138
  1.424174	  0.860548	 -1.807349
  1.420443	  0.844503	 -1.818504
  1.418362	  0.830282	 -1.831108
  1.416839	  0.815872	 -1.845301
  1.414112	  0.799285	 -1.861570
  1.411422	  0.785299	 -1.873549
  1.408784	  0.772004	 -1.884843
  1.407433	  0.755422	 -1.899141
  1.399964	  0.742464	 -1.913246
  1.393132	  0.731040	 -1.926452
  1.387970	  0.716822	 -1.941634
  1.380515	  0.704473	 -1.956513
  1.372893	  0.693851	 -1.968733
  1.365683	  0.682176	 -1.984282
  1.355627	  0.670494	 -1.998757
  1.345349	  0.662033	 -2.011725
  1.334204	  0.653948	 -2.027382
  1.324517	  0.644425	 -2.044564
  1.310703	  0.619799	 -2.062003
  1.301281	  0.609305	 -2.076184
