  1.254266	  1.511679	  2.307064
  1.241848	  1.496711	  2.284222
  1.215717	  1.464419	  2.264525
  1.180381	  1.436018	  2.252510
  1.149978	  1.407547	  2.228376
  1.119108	  1.377160	  2.204985
  1.084921	  1.345431	  2.186949
  1.048739	  1.320122	  2.161946
  1.014932	  1.290259	  2.138046
  0.985822	  1.256619	  2.113556
  0.951142	  1.227352	  2.092117
  0.918895	  1.195922	  2.071533
  0.889274	  1.163860	  2.048983
  0.853994	  1.134491	  2.031040
  0.814937	  1.108235	  2.014749
  0.777908	  1.077718	  1.999158
  0.744414	  1.042897	  1.984393
  0.712483	  1.007708	  1.968692
  0.680133	  0.973466	  1.952915
  0.646030	  0.941064	  1.937607
  0.609252	  0.911341	  1.921882
  0.571529	  0.881697	  1.905621
  0.535514	  0.850529	  1.886839
  0.503564	  0.818120	  1.863113
  0.473794	  0.785734	  1.837223
  0.444980	  0.754076	  1.810661
  0.416507	  0.723211	  1.783431
  0.388212	  0.692031	  1.755311
  0.360424	  0.659548	  1.727492
  0.332532	  0.626212	  1.700873
  0.304403	  0.592598	  1.675599
  0.275560	  0.558897	  1.651292
  0.245363	  0.525663	  1.628565
  0.213470	  0.492349	  1.608680
  0.179974	  0.459775	  1.592250
  0.144549	  0.427836	  1.578666
  0.109536	  0.394929	  1.566421
  0.075842	  0.361682	  1.554488
  0.041944	  0.327004	  1.541069
  0.009030	  0.292722	  1.526044
 -0.025883	  0.259551	  1.509270
 -0.063020	  0.229471	  1.491743
 -0.101247	  0.201373	  1.473981
 -0.139654	  0.174015	  1.456552
 -0.178152	  0.146241	  1.439381
 -0.215858	  0.117583	  1.422993
 -0.252480	  0.087772	  1.407139
 -0.288321	  0.056437	  1.390961
 -0.322402	  0.023435	  1.373604
 -0.354563	 -0.011521	  1.355412
 -0.385167	 -0.047796	  1.336994
 -0.414072	 -0.083501	  1.318162
 -0.442295	 -0.118247	  1.297594
 -0.470315	 -0.151248	  1.274241
 -0.499520	 -0.181967	  1.248097
 -0.530660	 -0.210057	  1.219893
 -0.562665	 -0.234509	  1.190135
 -0.594755	 -0.255759	  1.159898
 -0.626822	 -0.273617	  1.130103
 -0.659514	 -0.287490	  1.100542
 -0.694141	 -0.297762	  1.069210
 -0.732871	 -0.304309	  1.033126
 -0.777446	 -0.305275	  0.990244
 -0.827563	 -0.297392	  0.943684
 -0.880101	 -0.280914	  0.900788
 -0.929345	 -0.264478	  0.864225
 -0.976606	 -0.256144	  0.833435
 -1.025883	 -0.258017	  0.806272
 -1.083077	 -0.270407	  0.779919
 -1.149305	 -0.292167	  0.753394
 -1.219520	 -0.324712	  0.722967
 -1.283920	 -0.367046	  0.686323
 -1.335804	 -0.416507	  0.645156
 -1.373210	 -0.468158	  0.606063
 -1.397909	 -0.517987	  0.573704
 -1.413679	 -0.563398	  0.550057
 -1.423975	 -0.607360	  0.533376
 -1.431501	 -0.656760	  0.521179
 -1.437986	 -0.716984	  0.512931
 -1.445257	 -0.787910	  0.508379
 -1.456580	 -0.862805	  0.506197
 -1.473821	 -0.931272	  0.505105
 -1.493544	 -0.987157	  0.504902
 -1.512381	 -1.031882	  0.503863
 -1.530414	 -1.070445	  0.501513
 -1.549237	 -1.107480	  0.497964
 -1.570059	 -1.144473	  0.493977
 -1.593769	 -1.181544	  0.489363
 -1.620377	 -1.217917	  0.483220
 -1.649984	 -1.252901	  0.475097
 -1.681882	 -1.286540	  0.464616
 -1.715277	 -1.319324	  0.451382
 -1.749620	 -1.351442	  0.435474
 -1.783705	 -1.382396	  0.418058
 -1.817842	 -1.413751	  0.399235
 -1.850649	 -1.445644	  0.379848
 -1.881967	 -1.477951	  0.359980
 -1.912675	 -1.510448	  0.339507
 -1.944089	 -1.542698	  0.318311
 -1.976938	 -1.574481	  0.296950
 -2.010709	 -1.605601	  0.276131
 -2.044974	 -1.636011	  0.255585
 -2.078127	 -1.666175	  0.235509
 -2.110676	 -1.697372	  0.215732
 -2.143608	 -1.731106	  0.197992
 -2.175889	 -1.766364	  0.183633
 -2.208294	 -1.802251	  0.168629
 -2.244463	 -1.836930	  0.156556
 -2.282471	 -1.867167	  0.134981
 -2.315834	 -1.903710	  0.113141
 -2.338993	 -1.922747	  0.114273
