 -3.014270	 -0.182956	 -0.248195
 -2.984426	 -0.181144	 -0.245737
 -2.934234	 -0.160271	 -0.253888
 -2.888323	 -0.137255	 -0.256769
 -2.845681	 -0.114859	 -0.269327
 -2.803934	 -0.092862	 -0.285434
 -2.761584	 -0.077917	 -0.304070
 -2.719519	 -0.054164	 -0.318393
 -2.675006	 -0.034729	 -0.330120
 -2.627586	 -0.019839	 -0.340183
 -2.580731	 -0.000007	 -0.350854
 -2.537091	  0.022985	 -0.362121
 -2.494533	  0.046158	 -0.373400
 -2.451772	  0.067873	 -0.385009
 -2.408479	  0.090434	 -0.398254
 -2.365942	  0.113721	 -0.411331
 -2.323547	  0.135974	 -0.422028
 -2.280364	  0.159386	 -0.431781
 -2.238446	  0.185503	 -0.440530
 -2.196504	  0.212620	 -0.445541
 -2.154561	  0.237199	 -0.448123
 -2.111314	  0.261796	 -0.454081
 -2.066625	  0.287965	 -0.462593
 -2.024074	  0.313109	 -0.471261
 -1.981933	  0.335764	 -0.478450
 -1.937030	  0.358150	 -0.485739
 -1.891931	  0.380690	 -0.492020
 -1.848687	  0.402111	 -0.496285
 -1.803268	  0.423311	 -0.500110
 -1.757196	  0.441432	 -0.503148
 -1.708389	  0.459596	 -0.503981
 -1.662957	  0.483657	 -0.506220
 -1.618313	  0.506789	 -0.514655
 -1.575338	  0.523880	 -0.525444
 -1.533787	  0.547987	 -0.535023
 -1.489431	  0.573909	 -0.544415
 -1.442366	  0.596308	 -0.552797
 -1.397646	  0.616678	 -0.559350
 -1.355933	  0.637325	 -0.563274
 -1.313769	  0.661425	 -0.565921
 -1.270074	  0.687398	 -0.569002
 -1.224396	  0.712110	 -0.574230
 -1.178894	  0.735087	 -0.581914
 -1.136645	  0.756567	 -0.591871
 -1.096848	  0.778817	 -0.602774
 -1.056474	  0.803105	 -0.613662
 -1.014310	  0.827148	 -0.622751
 -0.972212	  0.851515	 -0.630040
 -0.928223	  0.876896	 -0.636534
 -0.881777	  0.901308	 -0.644480
 -0.836561	  0.922574	 -0.653996
 -0.792682	  0.942637	 -0.663943
 -0.748133	  0.963238	 -0.673482
 -0.703256	  0.986749	 -0.684243
 -0.661872	  1.011761	 -0.695595
 -0.626558	  1.036750	 -0.705475
 -0.599954	  1.059637	 -0.712115
 -0.581611	  1.079027	 -0.715625
 -0.562665	  1.104050	 -0.717379
 -0.532775	  1.153329	 -0.717910
 -0.504408	  1.220233	 -0.720759
 -0.486073	  1.311261	 -0.739058
 -0.475915	  1.380133	 -0.745545
 -0.456002	  1.432695	 -0.737415
 -0.403893	  1.512777	 -0.718466
 -0.328565	  1.571658	 -0.682099
 -0.244655	  1.608434	 -0.624689
 -0.142437	  1.658792	 -0.625221
 -0.060397	  1.685058	 -0.669741
 -0.002463	  1.691366	 -0.710716
  0.036640	  1.689631	 -0.737772
  0.102402	  1.683294	 -0.775572
  0.218283	  1.650135	 -0.890490
  0.284244	  1.614567	 -1.062787
  0.298000	  1.575870	 -1.172072
  0.279957	  1.533991	 -1.258272
  0.267862	  1.518941	 -1.298771
  0.276991	  1.519830	 -1.325649
  0.328944	  1.540247	 -1.342229
  0.408063	  1.562936	 -1.314015
  0.496922	  1.581533	 -1.203581
  0.560942	  1.582848	 -1.076990
  0.593675	  1.580296	 -1.018256
  0.631042	  1.587033	 -0.999766
  0.676325	  1.601574	 -1.004683
  0.721094	  1.619004	 -1.016858
  0.766339	  1.641100	 -1.030122
  0.810227	  1.666345	 -1.040554
  0.851753	  1.692897	 -1.048965
  0.892463	  1.720326	 -1.057294
  0.932770	  1.747279	 -1.065881
  0.974097	  1.773970	 -1.075381
  1.015107	  1.798972	 -1.085952
  1.058956	  1.823063	 -1.097483
  1.103972	  1.843691	 -1.105392
  1.150723	  1.862595	 -1.110932
  1.197377	  1.878452	 -1.114700
  1.241040	  1.898018	 -1.120141
  1.285887	  1.919916	 -1.129472
  1.329171	  1.936432	 -1.146105
  1.371902	  1.959542	 -1.153445
  1.415026	  1.984724	 -1.161388
  1.461880	  2.004485	 -1.166298
  1.508647	  2.023892	 -1.175854
  1.553411	  2.043720	 -1.189511
  1.594776	  2.070069	 -1.201522
  1.641665	  2.086258	 -1.206324
  1.683323	  2.108631	 -1.216128
  1.722320	  2.127031	 -1.228557
  1.739543	  2.148301	 -1.240843
