 -1.192094	 -1.259217	 -1.723064
 -1.185743	 -1.288169	 -1.744758
 -1.185690	 -1.277948	 -1.729402
 -1.189968	 -1.256171	 -1.714388
 -1.193877	 -1.240502	 -1.708837
 -1.196109	 -1.223747	 -1.702594
 -1.194716	 -1.204417	 -1.692590
 -1.196357	 -1.185520	 -1.681438
 -1.201929	 -1.170262	 -1.670529
 -1.208505	 -1.153785	 -1.657247
 -1.211153	 -1.135752	 -1.648927
 -1.210104	 -1.118377	 -1.647449
 -1.205220	 -1.098130	 -1.643387
 -1.197944	 -1.075887	 -1.640960
 -1.191323	 -1.058883	 -1.638832
 -1.184603	 -1.041237	 -1.637007
 -1.178719	 -1.022019	 -1.632641
 -1.172131	 -0.997689	 -1.623117
 -1.169748	 -0.986118	 -1.618768
 -1.164380	 -0.968812	 -1.612739
 -1.158005	 -0.947966	 -1.612938
 -1.149607	 -0.926312	 -1.616264
 -1.144273	 -0.911312	 -1.617519
 -1.138346	 -0.892611	 -1.613862
 -1.132229	 -0.872417	 -1.606889
 -1.121092	 -0.849448	 -1.602733
 -1.114842	 -0.837252	 -1.602572
 -1.108122	 -0.819477	 -1.601713
 -1.102541	 -0.796794	 -1.602183
 -1.095703	 -0.778043	 -1.602607
 -1.089850	 -0.760998	 -1.603231
 -1.083331	 -0.741251	 -1.602976
 -1.074790	 -0.722024	 -1.602963
 -1.059316	 -0.704141	 -1.601936
 -1.047476	 -0.691204	 -1.602679
 -1.040456	 -0.670304	 -1.606318
 -1.042297	 -0.650024	 -1.608316
 -1.042299	 -0.629019	 -1.606826
 -1.038841	 -0.608823	 -1.605473
 -1.035577	 -0.589315	 -1.604196
 -1.033398	 -0.569618	 -1.601444
 -1.032913	 -0.550259	 -1.596608
 -1.036135	 -0.532007	 -1.589220
 -1.046921	 -0.519759	 -1.577755
 -1.057997	 -0.507800	 -1.566172
 -1.070050	 -0.496800	 -1.554624
 -1.085008	 -0.489439	 -1.543590
 -1.100011	 -0.482140	 -1.532562
 -1.115014	 -0.474841	 -1.521534
 -1.130018	 -0.467542	 -1.510506
 -1.145013	 -0.460217	 -1.499486
 -1.159493	 -0.451261	 -1.488995
 -1.173740	 -0.441685	 -1.478734
 -1.187985	 -0.432100	 -1.468475
 -1.202229	 -0.422516	 -1.458217
 -1.216473	 -0.412931	 -1.447958
 -1.230711	 -0.403337	 -1.437700
 -1.244502	 -0.393119	 -1.427440
 -1.256620	 -0.380875	 -1.417284
 -1.268709	 -0.368598	 -1.407129
 -1.280798	 -0.356321	 -1.396975
 -1.292816	 -0.344062	 -1.386746
 -1.300482	 -0.332973	 -1.372002
 -1.305385	 -0.323136	 -1.355396
 -1.306691	 -0.315852	 -1.337600
 -1.303669	 -0.315630	 -1.319062
 -1.302383	 -0.311328	 -1.295080
 -1.307678	 -0.297414	 -1.274610
 -1.307439	 -0.284040	 -1.259179
 -1.301930	 -0.273539	 -1.248763
 -1.294271	 -0.259720	 -1.232694
 -1.292178	 -0.245237	 -1.218923
 -1.288116	 -0.229228	 -1.210677
 -1.284930	 -0.211354	 -1.201223
 -1.284094	 -0.195944	 -1.192295
 -1.282564	 -0.181699	 -1.183625
 -1.282295	 -0.161843	 -1.172261
 -1.281895	 -0.144021	 -1.164015
 -1.280241	 -0.124682	 -1.155413
 -1.278444	 -0.102739	 -1.145504
 -1.284961	 -0.088258	 -1.133818
 -1.295507	 -0.077255	 -1.123776
 -1.301100	 -0.067271	 -1.109174
 -1.303781	 -0.065451	 -1.090545
 -1.305250	 -0.061286	 -1.071902
 -1.295461	 -0.060679	 -1.040677
 -1.291950	 -0.065946	 -1.028616
 -1.286536	 -0.074986	 -1.014202
 -1.283575	 -0.083370	 -0.988847
 -1.281806	 -0.084203	 -0.967691
 -1.281706	 -0.078945	 -0.948658
 -1.278866	 -0.074534	 -0.931000
 -1.275707	 -0.068361	 -0.912710
 -1.276000	 -0.062962	 -0.893062
 -1.287412	 -0.054915	 -0.861031
 -1.289168	 -0.056119	 -0.850645
 -1.290293	 -0.059913	 -0.835135
 -1.289395	 -0.064364	 -0.814239
 -1.285627	 -0.069823	 -0.788447
 -1.281347	 -0.065283	 -0.761752
 -1.277484	 -0.063485	 -0.747372
 -1.274465	 -0.056175	 -0.731919
 -1.267399	 -0.054448	 -0.713495
 -1.259414	 -0.047128	 -0.681661
 -1.257390	 -0.038944	 -0.658926
 -1.259229	 -0.028363	 -0.646660
 -1.260142	 -0.019092	 -0.627996
 -1.263781	 -0.003993	 -0.611000
 -1.266009	  0.015438	 -0.593858
 -1.267858	  0.026207	 -0.580188
 -1.267190	  0.046514	 -0.566024
 -1.266108	  0.057328	 -0.554392
 -1.267366	  0.079253	 -0.534773
 -1.268188	  0.087483	 -0.524144
 -1.265965	  0.099803	 -0.512437
 -1.269029	  0.112559	 -0.494048
 -1.269708	  0.130651	 -0.478729
 -1.269014	  0.143301	 -0.468252
 -1.271107	  0.156579	 -0.456570
 -1.270309	  0.173886	 -0.439432
 -1.273681	  0.187615	 -0.423933
 -1.278550	  0.197885	 -0.413058
 -1.287702	  0.215218	 -0.396183
 -1.290789	  0.226209	 -0.387101
 -1.292178	  0.242100	 -0.373939
 -1.291316	  0.270960	 -0.360017
 -1.291518	  0.282053	 -0.356387
 -1.293498	  0.306063	 -0.344788
 -1.296245	  0.315770	 -0.337935
 -1.302449	  0.331898	 -0.326346
 -1.309153	  0.348403	 -0.315164
 -1.313868	  0.365072	 -0.307060
 -1.322387	  0.389561	 -0.290297
 -1.327091	  0.398060	 -0.283763
 -1.334380	  0.412777	 -0.274203
 -1.330325	  0.431498	 -0.260077
 -1.323891	  0.445435	 -0.242453
 -1.321494	  0.458422	 -0.224023
 -1.319495	  0.468678	 -0.209986
 -1.317944	  0.480815	 -0.194757
 -1.319802	  0.495956	 -0.176428
 -1.325901	  0.504692	 -0.163953
 -1.338959	  0.515356	 -0.148946
 -1.350570	  0.536669	 -0.128138
 -1.354198	  0.544274	 -0.120817
 -1.361832	  0.554764	 -0.108182
 -1.368118	  0.575219	 -0.087436
 -1.363181	  0.592956	 -0.073532
 -1.355277	  0.600089	 -0.062928
 -1.354476	  0.608431	 -0.043206
 -1.363290	  0.627395	 -0.030244
 -1.363772	  0.651425	 -0.022651
 -1.356745	  0.671345	 -0.014223
 -1.351907	  0.679801	 -0.001021
 -1.350605	  0.690632	  0.018517
 -1.346507	  0.700433	  0.036427
 -1.345505	  0.713371	  0.052433
 -1.346613	  0.726511	  0.067597
 -1.347714	  0.739852	  0.082425
 -1.349305	  0.753340	  0.097119
 -1.351031	  0.766756	  0.111836
 -1.352064	  0.780100	  0.126282
 -1.348236	  0.791678	  0.142011
 -1.341887	  0.802100	  0.159525
 -1.341841	  0.816850	  0.178836
 -1.351783	  0.831765	  0.193767
 -1.360637	  0.846916	  0.203836
 -1.364567	  0.863506	  0.209072
 -1.366861	  0.882080	  0.217507
 -1.372171	  0.903649	  0.231577
 -1.374086	  0.920066	  0.242727
 -1.375757	  0.932141	  0.253136
 -1.378241	  0.945782	  0.269410
 -1.380444	  0.955531	  0.282257
 -1.383573	  0.971647	  0.301804
 -1.386066	  0.990396	  0.317164
 -1.387153	  1.000045	  0.322963
 -1.390971	  1.018830	  0.332700
 -1.398137	  1.036757	  0.342561
 -1.403615	  1.054226	  0.354917
 -1.405016	  1.069052	  0.369332
 -1.406519	  1.080629	  0.384751
 -1.409309	  1.091811	  0.404610
 -1.408249	  1.108822	  0.426121
 -1.404102	  1.122422	  0.437570
 -1.400591	  1.134895	  0.446406
 -1.397062	  1.153550	  0.457180
 -1.394188	  1.166857	  0.464481
 -1.392934	  1.192285	  0.477905
 -1.396244	  1.206994	  0.485378
 -1.399303	  1.220548	  0.494268
 -1.403800	  1.238783	  0.505408
 -1.400046	  1.256998	  0.525963
 -1.398628	  1.269096	  0.542970
 -1.397509	  1.278559	  0.557614
 -1.398265	  1.288089	  0.569871
 -1.406587	  1.305551	  0.582930
 -1.413336	  1.326234	  0.595927
 -1.414076	  1.339359	  0.604570
 -1.413980	  1.354123	  0.613652
 -1.417375	  1.372534	  0.638933
 -1.421917	  1.382891	  0.642895
 -1.424675	  1.404647	  0.651796
 -1.427066	  1.428374	  0.659795
 -1.426796	  1.435226	  0.662144
 -1.421717	  1.462500	  0.680572
 -1.420336	  1.479478	  0.699704
 -1.422078	  1.487632	  0.709593
 -1.425434	  1.496407	  0.719058
 -1.436455	  1.518668	  0.729732
 -1.440594	  1.541608	  0.742708
 -1.439701	  1.557696	  0.754189
 -1.438441	  1.569900	  0.762826
 -1.436771	  1.587344	  0.774240
 -1.432032	  1.606531	  0.785362
 -1.428989	  1.625607	  0.793809
 -1.425564	  1.643936	  0.802750
 -1.421638	  1.666229	  0.817550
 -1.419043	  1.675764	  0.830902
 -1.412239	  1.684525	  0.853022
 -1.404797	  1.691361	  0.869416
 -1.397958	  1.699133	  0.884649
 -1.391958	  1.714601	  0.901156
 -1.389248	  1.724754	  0.914954
 -1.388471	  1.733227	  0.932642
 -1.384024	  1.750347	  0.955644
 -1.379715	  1.762772	  0.965583
 -1.373949	  1.783348	  0.982585
 -1.371804	  1.796519	  0.997481
