 -2.805737	  0.662997	  0.932295
 -2.777957	  0.656433	  0.923065
 -2.741310	  0.646581	  0.896473
 -2.709965	  0.641118	  0.859259
 -2.670942	  0.629021	  0.825484
 -2.639679	  0.613269	  0.785104
 -2.607414	  0.599173	  0.749379
 -2.576337	  0.587077	  0.714775
 -2.544934	  0.575478	  0.677887
 -2.514515	  0.564990	  0.640657
 -2.485483	  0.556918	  0.605545
 -2.451591	  0.549461	  0.568134
 -2.418769	  0.542002	  0.532987
 -2.383594	  0.532844	  0.495257
 -2.349530	  0.523436	  0.459690
 -2.316173	  0.512494	  0.424824
 -2.286088	  0.498877	  0.390918
 -2.254422	  0.480381	  0.352682
 -2.226175	  0.463434	  0.318082
 -2.195218	  0.445468	  0.280819
 -2.163820	  0.428348	  0.244708
 -2.132005	  0.413480	  0.210113
 -2.100061	  0.401934	  0.177221
 -2.064916	  0.392201	  0.140430
 -2.042679	  0.381348	  0.102255
 -2.069079	  0.353564	  0.063321
 -2.212947	  0.258792	 -0.093935
 -2.244981	  0.205220	 -0.215896
 -2.238819	  0.176377	 -0.305427
 -2.223233	  0.162312	 -0.329689
 -2.162695	  0.143370	 -0.352862
 -2.097862	  0.130392	 -0.349438
 -1.875503	  0.205948	 -0.270296
 -1.763274	  0.258987	 -0.259629
 -1.719946	  0.267215	 -0.273006
 -1.682110	  0.264558	 -0.297256
 -1.647721	  0.255976	 -0.328880
 -1.612362	  0.243648	 -0.367285
 -1.583354	  0.232524	 -0.400820
 -1.552155	  0.221626	 -0.436611
 -1.519633	  0.211527	 -0.471960
 -1.485727	  0.201881	 -0.507411
 -1.452416	  0.191970	 -0.542736
 -1.419318	  0.180759	 -0.579292
 -1.384049	  0.167040	 -0.618910
 -1.353341	  0.153757	 -0.654208
 -1.320688	  0.138545	 -0.691482
 -1.290967	  0.124539	 -0.725990
 -1.261923	  0.109431	 -0.760508
 -1.232396	  0.095862	 -0.795623
 -1.202491	  0.082988	 -0.830555
 -1.167616	  0.071247	 -0.869536
 -1.133055	  0.062180	 -0.906439
 -1.101605	  0.058645	 -0.939735
 -1.070923	  0.063694	 -0.972766
 -1.029829	  0.085056	 -1.014358
 -0.958026	  0.140609	 -1.067867
 -0.885846	  0.196323	 -1.111538
 -0.845878	  0.224938	 -1.136258
 -0.809754	  0.249753	 -1.171113
 -0.788037	  0.257624	 -1.195571
 -0.774014	  0.254705	 -1.214422
 -0.774605	  0.224425	 -1.255660
 -0.784586	  0.225446	 -1.279690
 -0.794503	  0.224717	 -1.301812
 -0.814919	  0.208946	 -1.370843
 -0.780207	  0.202811	 -1.484281
 -0.783768	  0.070745	 -1.668612
 -0.722109	 -0.023703	 -1.710205
 -0.653098	 -0.072762	 -1.695052
 -0.592405	 -0.106272	 -1.640909
 -0.517089	 -0.092354	 -1.562502
 -0.482721	 -0.151421	 -1.615153
 -0.450874	 -0.173604	 -1.654805
 -0.418816	 -0.185895	 -1.690369
 -0.386841	 -0.194935	 -1.723417
 -0.350090	 -0.203647	 -1.759655
 -0.314723	 -0.213597	 -1.796288
 -0.282027	 -0.225364	 -1.832976
 -0.250875	 -0.237777	 -1.868763
 -0.221513	 -0.250802	 -1.904293
 -0.192268	 -0.265423	 -1.940737
 -0.162398	 -0.280916	 -1.978188
 -0.130908	 -0.297711	 -2.014475
 -0.100108	 -0.313684	 -2.048225
 -0.069723	 -0.328700	 -2.081389
 -0.038756	 -0.342259	 -2.116902
 -0.003916	 -0.353538	 -2.153657
  0.032200	 -0.362762	 -2.189910
  0.065773	 -0.370208	 -2.224535
  0.098949	 -0.377480	 -2.259639
  0.130393	 -0.386770	 -2.292870
  0.165401	 -0.398818	 -2.330022
  0.199609	 -0.410545	 -2.367518
  0.229475	 -0.420558	 -2.401389
  0.260966	 -0.431863	 -2.437605
  0.294219	 -0.445246	 -2.475446
  0.324970	 -0.458686	 -2.511710
  0.353087	 -0.470543	 -2.545902
  0.383299	 -0.482207	 -2.582804
  0.414360	 -0.494574	 -2.617800
  0.449320	 -0.507726	 -2.654635
  0.481405	 -0.518839	 -2.694834
  0.513869	 -0.530782	 -2.731256
  0.550123	 -0.536220	 -2.764633
  0.588885	 -0.545663	 -2.794288
  0.621313	 -0.557355	 -2.831375
  0.645535	 -0.577489	 -2.872245
  0.651990	 -0.583264	 -2.900967
