 -0.184675	 -1.824847	  1.754589
 -0.162838	 -1.846066	  1.771590
 -0.178610	 -1.835998	  1.762210
 -0.190615	 -1.823506	  1.753109
 -0.201969	 -1.809819	  1.743910
 -0.214611	 -1.796846	  1.734529
 -0.225661	 -1.785133	  1.723376
 -0.237074	 -1.773012	  1.712247
 -0.247826	 -1.760631	  1.701429
 -0.260838	 -1.748078	  1.691925
 -0.277299	 -1.737046	  1.684321
 -0.289194	 -1.723246	  1.675309
 -0.297349	 -1.708214	  1.666037
 -0.308305	 -1.692523	  1.658734
 -0.320143	 -1.678816	  1.651941
 -0.330725	 -1.663679	  1.644233
 -0.345394	 -1.647885	  1.639024
 -0.359325	 -1.637152	  1.634652
 -0.375357	 -1.628543	  1.629388
 -0.396786	 -1.617448	  1.623242
 -0.409678	 -1.606855	  1.616742
 -0.419955	 -1.590623	  1.608809
 -0.436603	 -1.577655	  1.602217
 -0.455148	 -1.571495	  1.596933
 -0.471923	 -1.567101	  1.592221
 -0.492341	 -1.559914	  1.585141
 -0.507914	 -1.551780	  1.576495
 -0.522885	 -1.541774	  1.569472
 -0.539946	 -1.532834	  1.562379
 -0.556457	 -1.524612	  1.556619
 -0.573405	 -1.514992	  1.550230
 -0.591237	 -1.507305	  1.541528
 -0.607202	 -1.499245	  1.535510
 -0.622865	 -1.487987	  1.529855
 -0.637698	 -1.476219	  1.523632
 -0.652893	 -1.464493	  1.516814
 -0.667805	 -1.453017	  1.510033
 -0.681887	 -1.440959	  1.502529
 -0.695346	 -1.428496	  1.494556
 -0.708796	 -1.416027	  1.486581
 -0.721403	 -1.402722	  1.478579
 -0.733770	 -1.389195	  1.470574
 -0.746000	 -1.375536	  1.462582
 -0.757834	 -1.361509	  1.454634
 -0.769665	 -1.347480	  1.446683
 -0.781292	 -1.333542	  1.438284
 -0.792820	 -1.319655	  1.429666
 -0.804348	 -1.305778	  1.421036
 -0.816081	 -1.293219	  1.410809
 -0.827835	 -1.280770	  1.400473
 -0.840967	 -1.268854	  1.391225
 -0.854849	 -1.257339	  1.382694
 -0.874600	 -1.259448	  1.384383
 -0.893696	 -1.264417	  1.387975
 -0.912707	 -1.269483	  1.391489
 -0.931706	 -1.274717	  1.394858
 -0.950721	 -1.279844	  1.398307
 -0.969776	 -1.284742	  1.401627
 -0.989316	 -1.287381	  1.404591
 -1.008924	 -1.289980	  1.407579
 -1.028482	 -1.292988	  1.410223
 -1.048122	 -1.296417	  1.412670
 -1.067728	 -1.298681	  1.415986
 -1.087442	 -1.299300	  1.418757
 -1.107427	 -1.297947	  1.418188
 -1.127442	 -1.296383	  1.417922
 -1.147173	 -1.293758	  1.418132
 -1.166899	 -1.291928	  1.417549
 -1.186572	 -1.288159	  1.414496
 -1.204587	 -1.281653	  1.409939
 -1.223463	 -1.275582	  1.406697
 -1.241162	 -1.269151	  1.402775
 -1.262143	 -1.263541	  1.394696
 -1.278695	 -1.263151	  1.391017
 -1.298616	 -1.261294	  1.384984
 -1.318563	 -1.256078	  1.377786
 -1.334732	 -1.247268	  1.371692
 -1.349927	 -1.234038	  1.362970
 -1.364909	 -1.227571	  1.355124
 -1.385701	 -1.225786	  1.349111
 -1.407579	 -1.220758	  1.342573
 -1.418026	 -1.204950	  1.334721
 -1.429082	 -1.192111	  1.321280
 -1.448190	 -1.182323	  1.315898
 -1.463777	 -1.173317	  1.315965
 -1.477018	 -1.159134	  1.311035
 -1.489663	 -1.144086	  1.300694
 -1.500486	 -1.127718	  1.296869
 -1.515858	 -1.117375	  1.291748
 -1.528889	 -1.103645	  1.281946
 -1.533895	 -1.082468	  1.275345
 -1.541739	 -1.065482	  1.270977
 -1.549934	 -1.046353	  1.267568
 -1.556474	 -1.029167	  1.266338
 -1.559477	 -1.009778	  1.268995
 -1.560616	 -0.986303	  1.269691
 -1.570122	 -0.967916	  1.268930
 -1.576276	 -0.949086	  1.267325
 -1.583183	 -0.930238	  1.260515
 -1.585898	 -0.911318	  1.252824
 -1.585401	 -0.892930	  1.242365
 -1.588502	 -0.878914	  1.231839
 -1.590517	 -0.860827	  1.223160
 -1.587172	 -0.845260	  1.210707
 -1.583247	 -0.828596	  1.195923
 -1.581862	 -0.814284	  1.181777
 -1.578518	 -0.801682	  1.170239
 -1.575051	 -0.788446	  1.154824
 -1.574346	 -0.776521	  1.139921
 -1.572640	 -0.762437	  1.124790
 -1.571538	 -0.744285	  1.108180
 -1.563304	 -0.736490	  1.096096
 -1.559918	 -0.726887	  1.078819
 -1.561325	 -0.712727	  1.062742
 -1.560530	 -0.696144	  1.051610
 -1.568780	 -0.679473	  1.039319
 -1.572530	 -0.667350	  1.024499
 -1.569946	 -0.655875	  1.011049
 -1.573519	 -0.637034	  0.997735
 -1.582948	 -0.625880	  0.986885
 -1.587936	 -0.613533	  0.972863
 -1.598189	 -0.599170	  0.961754
 -1.607717	 -0.580674	  0.955080
 -1.618067	 -0.566458	  0.945892
 -1.629640	 -0.556583	  0.934759
 -1.643427	 -0.547643	  0.921930
 -1.658333	 -0.545770	  0.907523
 -1.672822	 -0.543725	  0.893829
 -1.687310	 -0.541650	  0.880202
 -1.701816	 -0.539794	  0.866553
 -1.715912	 -0.537389	  0.852731
 -1.729299	 -0.533952	  0.838127
 -1.743882	 -0.532060	  0.823693
 -1.756567	 -0.537329	  0.808360
 -1.767148	 -0.545699	  0.793902
 -1.776836	 -0.553055	  0.778040
 -1.787662	 -0.559869	  0.762059
 -1.799051	 -0.566678	  0.747155
 -1.809562	 -0.575057	  0.732560
 -1.819511	 -0.582717	  0.716785
 -1.829353	 -0.590649	  0.701207
 -1.839519	 -0.600300	  0.686961
 -1.848519	 -0.608709	  0.671321
 -1.858153	 -0.617053	  0.655560
 -1.864362	 -0.628022	  0.639976
 -1.867714	 -0.641535	  0.625946
 -1.870554	 -0.657766	  0.613009
 -1.872665	 -0.670338	  0.598243
 -1.878707	 -0.682215	  0.582223
 -1.882177	 -0.694179	  0.568226
 -1.895646	 -0.697921	  0.553728
 -1.905308	 -0.685798	  0.556896
 -1.920133	 -0.704161	  0.536689
 -1.934844	 -0.694062	  0.530110
 -1.947352	 -0.679603	  0.523188
 -1.957902	 -0.665314	  0.513665
 -1.970720	 -0.652395	  0.505033
 -1.984736	 -0.639994	  0.499955
 -1.999142	 -0.626624	  0.492402
 -2.013994	 -0.615443	  0.485026
 -2.026579	 -0.601830	  0.473883
 -2.037870	 -0.590138	  0.465081
 -2.049649	 -0.577900	  0.457007
 -2.065024	 -0.562005	  0.449989
 -2.073815	 -0.549723	  0.441113
 -2.088614	 -0.538043	  0.433312
 -2.103951	 -0.524227	  0.424721
 -2.112952	 -0.511132	  0.415788
 -2.126137	 -0.498755	  0.406618
 -2.141843	 -0.486007	  0.400064
 -2.150985	 -0.472522	  0.389840
 -2.163903	 -0.459637	  0.381418
 -2.177996	 -0.446773	  0.372845
 -2.189440	 -0.431930	  0.364695
 -2.198386	 -0.417703	  0.353934
 -2.211094	 -0.406381	  0.345733
 -2.226312	 -0.393867	  0.338642
 -2.239245	 -0.381519	  0.329524
 -2.252387	 -0.368170	  0.322310
 -2.265034	 -0.358687	  0.308625
 -2.279121	 -0.346646	  0.299762
 -2.291880	 -0.337914	  0.286734
 -2.304944	 -0.330295	  0.274096
 -2.317901	 -0.322605	  0.261268
 -2.331442	 -0.314391	  0.249104
 -2.344202	 -0.306636	  0.235488
 -2.359671	 -0.296994	  0.227858
 -2.372115	 -0.288547	  0.216320
 -2.385841	 -0.278391	  0.206289
 -2.401028	 -0.267708	  0.198874
 -2.415615	 -0.256643	  0.190735
 -2.430326	 -0.245749	  0.183438
 -2.448443	 -0.234959	  0.176793
 -2.464803	 -0.225094	  0.170445
 -2.476937	 -0.210912	  0.164615
 -2.486086	 -0.198390	  0.150969
 -2.498298	 -0.186559	  0.138893
 -2.512846	 -0.174590	  0.132641
 -2.525114	 -0.160599	  0.126434
 -2.538177	 -0.147004	  0.121187
 -2.552336	 -0.134584	  0.108816
 -2.567233	 -0.124403	  0.101292
 -2.581361	 -0.112277	  0.096316
 -2.595164	 -0.098479	  0.091252
 -2.612119	 -0.087821	  0.081089
 -2.627703	 -0.080025	  0.069847
 -2.633817	 -0.063430	  0.052638
 -2.647423	 -0.051564	  0.044031
