  2.169414	  0.595354	  2.029802
  2.147935	  0.589460	  2.009705
  2.114300	  0.615904	  1.990985
  2.072144	  0.637088	  1.977367
  2.029700	  0.656681	  1.959527
  1.985789	  0.672422	  1.942005
  1.940976	  0.687292	  1.928700
  1.896324	  0.704822	  1.919238
  1.850394	  0.724747	  1.905749
  1.809353	  0.749702	  1.888207
  1.767641	  0.770874	  1.872631
  1.726523	  0.793421	  1.856927
  1.684365	  0.816660	  1.841238
  1.645633	  0.841562	  1.821676
  1.608134	  0.867124	  1.803508
  1.567365	  0.887006	  1.780920
  1.526245	  0.903495	  1.757867
  1.483655	  0.918087	  1.737289
  1.440438	  0.933744	  1.721473
  1.396854	  0.950723	  1.703862
  1.353831	  0.970008	  1.686145
  1.312732	  0.994344	  1.670607
  1.273647	  1.021083	  1.655642
  1.235601	  1.048476	  1.639525
  1.197333	  1.075849	  1.621268
  1.158807	  1.101810	  1.601153
  1.121160	  1.124865	  1.580888
  1.081176	  1.146516	  1.560451
  1.040349	  1.164101	  1.540431
  0.997132	  1.174642	  1.519042
  0.956821	  1.187268	  1.491534
  0.914795	  1.213129	  1.476549
  0.869380	  1.233191	  1.459597
  0.827100	  1.253157	  1.441634
  0.787542	  1.273295	  1.422005
  0.748820	  1.296315	  1.402665
  0.703823	  1.307047	  1.384367
  0.665310	  1.332055	  1.366643
  0.622041	  1.349214	  1.352739
  0.585313	  1.373004	  1.330851
  0.547449	  1.399275	  1.309774
  0.507872	  1.422606	  1.292377
  0.464312	  1.443376	  1.279399
  0.421262	  1.462460	  1.264420
  0.377063	  1.481926	  1.250678
  0.332496	  1.500482	  1.237465
  0.287521	  1.517498	  1.223746
  0.242441	  1.533716	  1.209438
  0.197716	  1.549495	  1.194135
  0.153466	  1.566158	  1.177217
  0.111467	  1.584079	  1.156320
  0.072169	  1.603161	  1.130702
  0.034773	  1.624314	  1.101246
  0.000369	  1.646297	  1.071536
 -0.031491	  1.668155	  1.042514
 -0.062342	  1.690060	  1.012836
 -0.095168	  1.714063	  0.980404
 -0.129151	  1.738320	  0.951915
 -0.171306	  1.766178	  0.929811
 -0.213624	  1.803822	  0.925613
 -0.263966	  1.825093	  0.917162
 -0.313741	  1.835796	  0.908128
 -0.363034	  1.839051	  0.891947
 -0.409365	  1.843086	  0.877851
 -0.459047	  1.855277	  0.867421
 -0.505723	  1.876811	  0.861999
 -0.549101	  1.903133	  0.857013
 -0.590947	  1.930820	  0.849438
 -0.629925	  1.957472	  0.838206
 -0.669277	  1.982059	  0.824484
 -0.710342	  2.005042	  0.807636
 -0.753732	  2.026323	  0.789358
 -0.797388	  2.047131	  0.769890
 -0.839408	  2.067002	  0.751121
 -0.880765	  2.087943	  0.731969
 -0.918651	  2.110712	  0.714269
 -0.955750	  2.138111	  0.694762
 -0.987009	  2.164191	  0.667109
 -1.025491	  2.185509	  0.650205
 -1.061263	  2.215115	  0.628048
 -1.102649	  2.239631	  0.601792
 -1.144847	  2.256520	  0.575095
 -1.184805	  2.271530	  0.547762
 -1.225153	  2.287191	  0.521686
 -1.267253	  2.303817	  0.501326
 -1.308714	  2.320378	  0.484552
 -1.351522	  2.336879	  0.469097
 -1.397657	  2.353656	  0.455157
 -1.443929	  2.376695	  0.447662
 -1.488056	  2.401594	  0.440269
 -1.526480	  2.423833	  0.420740
 -1.565630	  2.447558	  0.402354
 -1.610615	  2.465907	  0.383050
 -1.656080	  2.475389	  0.360349
 -1.672641	  2.500142	  0.363952
