 -0.853846	 -2.311475	  0.180040
 -0.857859	 -2.339552	  0.201437
 -0.862431	 -2.328771	  0.183770
 -0.855909	 -2.311975	  0.173113
 -0.851617	 -2.290991	  0.159784
 -0.847266	 -2.277411	  0.154099
 -0.840888	 -2.260569	  0.143664
 -0.835325	 -2.244742	  0.131605
 -0.832544	 -2.232508	  0.117682
 -0.828744	 -2.217616	  0.099327
 -0.825951	 -2.200111	  0.087821
 -0.820820	 -2.186637	  0.079280
 -0.813524	 -2.174133	  0.063772
 -0.803446	 -2.160952	  0.051121
 -0.792874	 -2.148797	  0.039804
 -0.778734	 -2.142102	  0.027530
 -0.762488	 -2.138869	  0.015204
 -0.740527	 -2.130590	  0.003509
 -0.732606	 -2.119158	 -0.005787
 -0.721914	 -2.114117	 -0.019741
 -0.704054	 -2.114975	 -0.032521
 -0.686247	 -2.111771	 -0.043048
 -0.673689	 -2.105691	 -0.055866
 -0.657844	 -2.102573	 -0.069254
 -0.641390	 -2.105140	 -0.080406
 -0.626738	 -2.109396	 -0.091757
 -0.614807	 -2.117041	 -0.106268
 -0.597209	 -2.120842	 -0.118904
 -0.581805	 -2.117563	 -0.132508
 -0.571606	 -2.115774	 -0.150581
 -0.569976	 -2.116571	 -0.171730
 -0.571981	 -2.123241	 -0.189589
 -0.572514	 -2.130930	 -0.208837
 -0.576486	 -2.133482	 -0.229051
 -0.579511	 -2.131228	 -0.248406
 -0.582708	 -2.126876	 -0.265651
 -0.587707	 -2.121780	 -0.287871
 -0.597176	 -2.115919	 -0.304294
 -0.604433	 -2.112075	 -0.318046
 -0.612584	 -2.105545	 -0.336576
 -0.622677	 -2.099498	 -0.354170
 -0.634832	 -2.093066	 -0.369836
 -0.644117	 -2.084468	 -0.385593
 -0.649700	 -2.074539	 -0.399641
 -0.657006	 -2.060479	 -0.412663
 -0.665530	 -2.046640	 -0.425495
 -0.673905	 -2.033135	 -0.437809
 -0.684074	 -2.020490	 -0.449183
 -0.693559	 -2.005207	 -0.459357
 -0.700289	 -1.987821	 -0.469943
 -0.709274	 -1.979034	 -0.483316
 -0.721359	 -1.971586	 -0.496442
 -0.732685	 -1.956147	 -0.511484
 -0.738447	 -1.938883	 -0.519785
 -0.747232	 -1.925305	 -0.524579
 -0.759325	 -1.911028	 -0.535101
 -0.768840	 -1.895345	 -0.545496
 -0.776009	 -1.876944	 -0.549381
 -0.783376	 -1.856315	 -0.552151
 -0.792822	 -1.840112	 -0.560031
 -0.806085	 -1.832159	 -0.570151
 -0.824047	 -1.820891	 -0.577794
 -0.837078	 -1.807850	 -0.587699
 -0.844369	 -1.785389	 -0.598461
 -0.849241	 -1.768154	 -0.599683
 -0.859690	 -1.753487	 -0.600212
 -0.874221	 -1.737987	 -0.604349
 -0.887493	 -1.723301	 -0.610479
 -0.899080	 -1.707800	 -0.616014
 -0.911215	 -1.692514	 -0.620331
 -0.924194	 -1.677998	 -0.623111
 -0.938492	 -1.665325	 -0.624616
 -0.954397	 -1.652888	 -0.625267
 -0.965002	 -1.632453	 -0.628218
 -0.971465	 -1.614158	 -0.631952
 -0.987885	 -1.599898	 -0.634271
 -1.010597	 -1.584289	 -0.638372
 -1.018834	 -1.580054	 -0.639818
 -1.030057	 -1.560651	 -0.643992
 -1.039528	 -1.544298	 -0.638837
 -1.051487	 -1.527126	 -0.633266
 -1.061877	 -1.509835	 -0.629590
 -1.073715	 -1.494390	 -0.624913
 -1.086506	 -1.478723	 -0.620636
 -1.095960	 -1.460545	 -0.616472
 -1.103682	 -1.445246	 -0.599034
 -1.114775	 -1.432108	 -0.584666
 -1.124769	 -1.431274	 -0.567623
 -1.134642	 -1.425743	 -0.549929
 -1.143113	 -1.416026	 -0.533714
 -1.152839	 -1.406875	 -0.518261
 -1.160645	 -1.396318	 -0.502821
 -1.166880	 -1.387927	 -0.486721
 -1.174033	 -1.381844	 -0.467901
 -1.182295	 -1.374683	 -0.450391
 -1.183399	 -1.366792	 -0.433163
 -1.185282	 -1.362980	 -0.416103
 -1.189672	 -1.350086	 -0.392712
 -1.193842	 -1.336081	 -0.375715
 -1.193995	 -1.328329	 -0.363175
 -1.191749	 -1.321091	 -0.342535
 -1.193277	 -1.319656	 -0.323430
 -1.195653	 -1.317326	 -0.303025
 -1.196706	 -1.311828	 -0.280049
 -1.192116	 -1.300503	 -0.263046
 -1.185979	 -1.281606	 -0.249544
 -1.172252	 -1.262005	 -0.246649
 -1.163128	 -1.248880	 -0.235763
 -1.147057	 -1.243762	 -0.229680
 -1.127204	 -1.234149	 -0.225964
 -1.110920	 -1.225016	 -0.222071
 -1.092712	 -1.216927	 -0.222290
 -1.073586	 -1.201858	 -0.223903
 -1.062821	 -1.189518	 -0.220693
 -1.048805	 -1.179271	 -0.217373
 -1.030331	 -1.167303	 -0.216273
 -1.013170	 -1.157487	 -0.220824
 -0.996182	 -1.148319	 -0.226112
 -0.979208	 -1.139160	 -0.231401
 -0.962419	 -1.130002	 -0.237016
 -0.949137	 -1.120888	 -0.248750
 -0.936046	 -1.111778	 -0.260808
 -0.923178	 -1.102887	 -0.272708
 -0.911660	 -1.094864	 -0.284610
 -0.898789	 -1.084021	 -0.299881
 -0.884547	 -1.073516	 -0.312993
 -0.875710	 -1.061356	 -0.324410
 -0.870287	 -1.051634	 -0.335791
 -0.859562	 -1.036482	 -0.352386
 -0.850684	 -1.024591	 -0.363679
 -0.844106	 -1.014496	 -0.375669
 -0.836589	 -0.997791	 -0.391499
 -0.825892	 -0.986116	 -0.403332
 -0.816591	 -0.976861	 -0.413573
 -0.809111	 -0.962007	 -0.427022
 -0.796491	 -0.947451	 -0.439755
 -0.781207	 -0.936965	 -0.449403
 -0.769288	 -0.925689	 -0.461299
 -0.762766	 -0.914744	 -0.475784
 -0.758693	 -0.902332	 -0.487627
 -0.751194	 -0.885005	 -0.499070
 -0.744931	 -0.866300	 -0.506904
 -0.739263	 -0.847220	 -0.516505
 -0.733999	 -0.831399	 -0.529381
 -0.722193	 -0.819440	 -0.546166
 -0.709888	 -0.808953	 -0.558803
 -0.691512	 -0.799541	 -0.565221
 -0.672706	 -0.790431	 -0.563906
 -0.655017	 -0.778401	 -0.562990
 -0.641307	 -0.761500	 -0.569002
 -0.631216	 -0.745746	 -0.582147
 -0.619613	 -0.735443	 -0.590276
 -0.605493	 -0.721844	 -0.594958
 -0.594665	 -0.705268	 -0.601595
 -0.583119	 -0.691553	 -0.611242
 -0.570552	 -0.682040	 -0.621003
 -0.559310	 -0.669358	 -0.631624
 -0.551148	 -0.653627	 -0.640569
 -0.540766	 -0.636491	 -0.653241
 -0.536379	 -0.627092	 -0.665550
 -0.531205	 -0.612297	 -0.682741
 -0.527345	 -0.598312	 -0.694425
 -0.522512	 -0.584410	 -0.702496
 -0.522458	 -0.565533	 -0.715639
 -0.525737	 -0.546015	 -0.724986
 -0.523884	 -0.527336	 -0.728778
 -0.520921	 -0.508178	 -0.733632
 -0.522048	 -0.491173	 -0.739943
 -0.529340	 -0.473339	 -0.745735
 -0.537197	 -0.456029	 -0.752528
 -0.543367	 -0.439394	 -0.762359
 -0.551816	 -0.424873	 -0.770733
 -0.567150	 -0.408475	 -0.774343
 -0.576177	 -0.391310	 -0.773898
 -0.583173	 -0.369930	 -0.773136
 -0.595576	 -0.351498	 -0.775333
 -0.606815	 -0.337843	 -0.781021
 -0.614851	 -0.324182	 -0.790301
 -0.622064	 -0.305612	 -0.799663
 -0.628862	 -0.289097	 -0.808205
 -0.636573	 -0.271149	 -0.818389
 -0.647301	 -0.253623	 -0.827703
 -0.656367	 -0.239740	 -0.832665
 -0.666035	 -0.221691	 -0.835259
 -0.677474	 -0.201208	 -0.835291
 -0.688336	 -0.188978	 -0.836077
 -0.699574	 -0.175012	 -0.840848
 -0.704259	 -0.152642	 -0.851715
 -0.711025	 -0.138051	 -0.857153
 -0.722437	 -0.120965	 -0.859778
 -0.733316	 -0.104566	 -0.863910
 -0.739982	 -0.085963	 -0.870872
 -0.743458	 -0.066577	 -0.874118
 -0.748200	 -0.047737	 -0.875288
 -0.752601	 -0.027278	 -0.881421
 -0.753265	 -0.009878	 -0.890188
 -0.750938	  0.009388	 -0.906324
 -0.752527	  0.020318	 -0.915444
 -0.760459	  0.035570	 -0.925525
 -0.770032	  0.053556	 -0.940310
 -0.774006	  0.068168	 -0.950447
 -0.779194	  0.080151	 -0.961570
 -0.785273	  0.093514	 -0.975172
 -0.789331	  0.113469	 -0.987843
 -0.786541	  0.133664	 -0.997775
 -0.786903	  0.149992	 -1.005270
 -0.790422	  0.166569	 -1.015320
 -0.798635	  0.183189	 -1.021057
 -0.805001	  0.201871	 -1.029421
 -0.807845	  0.219283	 -1.037590
 -0.810715	  0.236468	 -1.045179
 -0.813633	  0.258766	 -1.052985
 -0.819177	  0.277579	 -1.059435
 -0.826953	  0.292165	 -1.069832
 -0.835694	  0.303547	 -1.077083
 -0.847251	  0.318389	 -1.085242
 -0.854470	  0.341029	 -1.092353
 -0.861285	  0.356082	 -1.103390
 -0.867669	  0.367317	 -1.114655
 -0.882222	  0.381369	 -1.129329
 -0.892421	  0.394966	 -1.136123
 -0.903210	  0.411046	 -1.143035
 -0.912964	  0.431097	 -1.150578
 -0.917436	  0.447441	 -1.154368
 -0.917498	  0.469248	 -1.156993
 -0.922949	  0.492526	 -1.160952
 -0.925520	  0.507451	 -1.163895
 -0.934757	  0.524352	 -1.172348
 -0.943298	  0.544305	 -1.178147
 -0.943834	  0.558264	 -1.186746
 -0.945132	  0.576784	 -1.195892
 -0.942691	  0.592687	 -1.209795
 -0.943564	  0.603357	 -1.217315
 -0.937872	  0.620980	 -1.232362
 -0.937602	  0.637968	 -1.246162
 -0.933138	  0.644501	 -1.258049
 -0.933659	  0.658758	 -1.273958
 -0.919897	  0.667610	 -1.292787
 -0.910801	  0.674534	 -1.307951
 -0.900797	  0.675620	 -1.322852
 -0.892055	  0.675668	 -1.342246
 -0.879428	  0.682066	 -1.360920
 -0.868520	  0.690014	 -1.375357
 -0.861754	  0.698974	 -1.387797
 -0.854537	  0.705011	 -1.406141
 -0.847035	  0.707149	 -1.425504
 -0.840926	  0.706936	 -1.445505
 -0.828906	  0.706112	 -1.464906
 -0.814581	  0.707070	 -1.481461
 -0.805097	  0.707944	 -1.496221
 -0.801056	  0.707673	 -1.514358
 -0.793397	  0.707191	 -1.534662
 -0.784455	  0.703754	 -1.553122
 -0.779163	  0.696598	 -1.570829
 -0.775766	  0.687175	 -1.590890
 -0.769132	  0.681570	 -1.608430
 -0.755856	  0.682907	 -1.627619
 -0.744184	  0.683111	 -1.642850
 -0.734651	  0.677261	 -1.658167
 -0.720239	  0.666192	 -1.675746
 -0.705787	  0.662600	 -1.690136
 -0.696675	  0.663797	 -1.702690
 -0.686711	  0.662980	 -1.720740
 -0.672019	  0.665467	 -1.739772
 -0.665107	  0.674767	 -1.755907
 -0.658372	  0.677561	 -1.772880
 -0.650452	  0.682779	 -1.791276
 -0.643289	  0.691516	 -1.809084
 -0.639880	  0.700917	 -1.825781
 -0.634911	  0.709212	 -1.842986
 -0.628646	  0.718261	 -1.859266
 -0.626196	  0.732857	 -1.875646
 -0.628371	  0.751656	 -1.888149
 -0.627920	  0.764557	 -1.901512
 -0.626045	  0.771774	 -1.917933
 -0.622444	  0.786120	 -1.933513
 -0.615432	  0.800609	 -1.946482
 -0.611750	  0.811395	 -1.960985
 -0.611407	  0.825327	 -1.975975
 -0.609901	  0.840643	 -1.988078
 -0.612749	  0.857465	 -1.997556
 -0.616550	  0.877311	 -2.010112
 -0.613577	  0.895258	 -2.013253
 -0.606876	  0.914830	 -2.014840
 -0.605197	  0.936279	 -2.018246
 -0.610881	  0.953859	 -2.022379
 -0.620557	  0.972601	 -2.024714
 -0.625375	  0.994541	 -2.030955
 -0.625546	  1.014229	 -2.031732
 -0.629515	  1.030675	 -2.028012
 -0.636265	  1.051342	 -2.026464
 -0.636504	  1.072182	 -2.024160
 -0.636922	  1.092609	 -2.019850
 -0.639061	  1.110336	 -2.009213
 -0.643380	  1.126291	 -1.997217
 -0.648322	  1.142212	 -1.985972
 -0.653442	  1.158729	 -1.975846
 -0.658558	  1.175444	 -1.966400
 -0.664041	  1.193153	 -1.958189
 -0.669316	  1.209755	 -1.948082
 -0.674033	  1.224973	 -1.936247
 -0.678643	  1.236105	 -1.920028
 -0.683848	  1.248456	 -1.904903
 -0.688862	  1.260103	 -1.889252
 -0.693117	  1.270209	 -1.873137
 -0.698689	  1.283581	 -1.858669
 -0.703768	  1.295184	 -1.842352
 -0.706808	  1.304158	 -1.825690
 -0.709029	  1.315730	 -1.808551
 -0.711392	  1.326892	 -1.791322
 -0.717233	  1.333828	 -1.773637
 -0.723598	  1.341336	 -1.756154
 -0.728550	  1.349878	 -1.738720
 -0.731790	  1.357245	 -1.720534
 -0.734273	  1.366306	 -1.701922
 -0.737076	  1.376043	 -1.685874
 -0.741717	  1.389541	 -1.671576
 -0.743800	  1.409970	 -1.657945
 -0.747046	  1.422370	 -1.646162
 -0.749103	  1.436239	 -1.637189
 -0.750574	  1.458974	 -1.628453
 -0.755254	  1.477558	 -1.627115
 -0.758789	  1.493788	 -1.631704
 -0.762610	  1.515723	 -1.636396
 -0.763376	  1.534775	 -1.639753
 -0.760724	  1.552536	 -1.641031
 -0.759896	  1.572429	 -1.646915
 -0.763062	  1.589688	 -1.655013
 -0.764970	  1.607833	 -1.664791
 -0.767646	  1.626620	 -1.672750
 -0.771021	  1.644578	 -1.679010
 -0.773417	  1.666510	 -1.688842
 -0.777270	  1.706423	 -1.708930
 -0.778734	  1.724148	 -1.718078
