  0.659886	  2.407670	 -0.072795
  0.653862	  2.423516	 -0.076569
  0.661184	  2.406248	 -0.071438
  0.669461	  2.390945	 -0.063942
  0.677194	  2.376738	 -0.056121
  0.684627	  2.350581	 -0.048681
  0.688992	  2.331846	 -0.044729
  0.695287	  2.313529	 -0.042673
  0.704914	  2.297411	 -0.044842
  0.715051	  2.280028	 -0.047061
  0.726007	  2.260538	 -0.045291
  0.737256	  2.245184	 -0.038866
  0.748590	  2.235439	 -0.034317
  0.768366	  2.216814	 -0.029343
  0.782000	  2.203255	 -0.029160
  0.792845	  2.195601	 -0.028653
  0.805755	  2.179600	 -0.031764
  0.822394	  2.161984	 -0.036045
  0.836399	  2.144574	 -0.038471
  0.843461	  2.127936	 -0.042445
  0.849377	  2.112432	 -0.047300
  0.860070	  2.096897	 -0.045786
  0.876968	  2.081628	 -0.046779
  0.892236	  2.069097	 -0.053728
  0.907462	  2.061221	 -0.063853
  0.927169	  2.052051	 -0.073418
  0.941322	  2.044283	 -0.081064
  0.954851	  2.035960	 -0.088661
  0.973471	  2.022026	 -0.097019
  0.986583	  2.013631	 -0.104535
  1.001201	  2.006231	 -0.113644
  1.020079	  1.996122	 -0.120888
  1.035605	  1.985734	 -0.129504
  1.053126	  1.974147	 -0.136342
  1.062616	  1.966688	 -0.139751
  1.075664	  1.954937	 -0.154945
  1.086489	  1.942696	 -0.170217
  1.100263	  1.929726	 -0.177709
  1.115828	  1.914832	 -0.183644
  1.130790	  1.908090	 -0.188893
  1.153447	  1.901695	 -0.198923
  1.172236	  1.897239	 -0.205597
  1.185813	  1.889256	 -0.212999
  1.195151	  1.874206	 -0.220066
  1.205551	  1.856153	 -0.227494
  1.217772	  1.836394	 -0.237821
  1.226702	  1.824655	 -0.248194
  1.232501	  1.813762	 -0.257682
  1.245311	  1.800776	 -0.270545
  1.261747	  1.787686	 -0.277196
  1.280738	  1.776896	 -0.281379
  1.299826	  1.764402	 -0.283601
  1.314566	  1.752037	 -0.287812
  1.328021	  1.735744	 -0.293331
  1.337426	  1.719637	 -0.298197
  1.345519	  1.701959	 -0.303064
  1.352479	  1.682626	 -0.307674
  1.357562	  1.664145	 -0.310643
  1.360588	  1.642728	 -0.315412
  1.364617	  1.621525	 -0.320730
  1.372084	  1.603368	 -0.323112
  1.385283	  1.586188	 -0.322214
  1.402335	  1.572478	 -0.322953
  1.416880	  1.557404	 -0.326114
  1.430012	  1.541679	 -0.328691
  1.439616	  1.529202	 -0.331220
  1.452775	  1.511587	 -0.331780
  1.465855	  1.494979	 -0.329741
  1.477117	  1.478618	 -0.327908
  1.487640	  1.462655	 -0.326053
  1.496458	  1.444719	 -0.323307
  1.504972	  1.428337	 -0.319136
  1.517588	  1.408111	 -0.314451
  1.534646	  1.392011	 -0.310013
  1.544502	  1.384575	 -0.305797
  1.561165	  1.373946	 -0.299736
  1.577474	  1.356742	 -0.291898
  1.587939	  1.341007	 -0.289961
  1.597219	  1.327107	 -0.290070
  1.606499	  1.307973	 -0.287941
  1.615459	  1.290910	 -0.278872
  1.629943	  1.279840	 -0.272302
  1.650849	  1.267462	 -0.270605
  1.667151	  1.254959	 -0.274084
  1.681641	  1.231696	 -0.276756
  1.687911	  1.213368	 -0.267482
  1.690501	  1.196825	 -0.256699
  1.696643	  1.184665	 -0.244798
  1.704745	  1.171136	 -0.228180
  1.712709	  1.155467	 -0.218161
  1.718723	  1.145466	 -0.203809
  1.729937	  1.137321	 -0.190519
  1.744437	  1.128832	 -0.173609
  1.757189	  1.114664	 -0.163703
  1.766008	  1.097876	 -0.154844
  1.771701	  1.085647	 -0.147957
  1.780179	  1.077086	 -0.128580
  1.788523	  1.071082	 -0.109678
  1.796047	  1.063026	 -0.092602
  1.800579	  1.053175	 -0.075634
  1.802468	  1.042933	 -0.058912
  1.802701	  1.033520	 -0.040576
  1.803303	  1.025886	 -0.021632
  1.804146	  1.019721	 -0.002164
  1.805113	  1.014428	  0.017442
  1.806304	  1.009635	  0.036885
  1.808750	  1.005715	  0.056193
  1.814085	  1.002896	  0.076651
  1.821630	  1.000549	  0.095944
  1.830390	  0.996395	  0.113830
  1.837670	  0.990442	  0.131598
  1.843630	  0.982614	  0.149038
  1.849308	  0.974737	  0.166746
  1.855269	  0.967292	  0.184488
  1.861598	  0.959472	  0.202636
  1.867922	  0.952081	  0.219673
  1.873979	  0.944376	  0.236836
  1.881225	  0.936749	  0.254617
  1.886963	  0.926735	  0.271719
  1.895427	  0.916063	  0.286315
  1.904547	  0.908813	  0.295700
  1.920165	  0.897689	  0.310126
  1.931403	  0.888509	  0.324521
  1.942202	  0.871589	  0.334506
  1.942493	  0.855994	  0.342539
  1.943941	  0.830887	  0.356935
  1.943949	  0.825967	  0.360014
  1.946289	  0.804040	  0.375379
  1.947043	  0.797526	  0.391024
  1.948444	  0.778837	  0.410624
  1.944375	  0.761432	  0.421995
  1.941386	  0.753214	  0.427678
  1.943971	  0.732155	  0.437091
  1.943700	  0.713058	  0.445304
  1.938694	  0.693831	  0.452467
  1.929649	  0.675084	  0.453884
  1.920429	  0.653407	  0.453243
  1.917256	  0.638391	  0.457036
  1.914599	  0.621005	  0.466479
  1.910792	  0.598117	  0.472138
  1.902167	  0.579452	  0.466003
  1.892717	  0.563089	  0.456725
  1.886214	  0.546537	  0.452750
  1.884360	  0.527479	  0.453088
  1.883549	  0.506924	  0.455687
  1.872648	  0.479965	  0.460647
  1.865027	  0.466731	  0.462172
  1.852378	  0.452952	  0.464005
  1.841858	  0.436629	  0.462740
  1.830074	  0.420274	  0.456942
  1.817935	  0.409929	  0.447343
  1.794274	  0.396473	  0.434636
  1.775837	  0.384339	  0.431566
  1.766614	  0.380088	  0.430229
  1.751950	  0.361179	  0.429951
  1.735106	  0.339504	  0.430627
  1.728069	  0.331275	  0.430969
  1.712148	  0.318150	  0.425871
  1.697009	  0.305393	  0.421497
  1.686945	  0.287327	  0.418845
  1.682129	  0.257293	  0.418272
  1.680998	  0.247534	  0.420429
  1.680260	  0.236178	  0.424595
  1.687959	  0.219395	  0.430051
  1.695189	  0.199529	  0.435459
  1.703935	  0.177816	  0.442010
  1.717473	  0.162282	  0.447265
  1.733492	  0.150018	  0.451839
  1.749983	  0.139882	  0.453366
  1.769488	  0.125396	  0.457346
  1.785265	  0.121924	  0.465914
  1.812870	  0.125617	  0.479457
  1.836690	  0.137662	  0.489161
  1.857440	  0.148616	  0.495310
  1.876240	  0.148270	  0.501563
  1.890804	  0.140396	  0.508648
  1.905921	  0.129637	  0.512213
  1.926513	  0.109990	  0.517692
  1.941700	  0.100247	  0.526135
  1.952935	  0.099312	  0.536273
  1.972710	  0.102351	  0.546410
  1.993757	  0.098561	  0.550258
  2.012959	  0.094650	  0.554041
  2.032625	  0.090869	  0.560704
  2.055115	  0.081501	  0.566714
  2.071259	  0.074358	  0.566282
  2.086089	  0.073382	  0.565580
  2.107942	  0.071098	  0.560924
  2.126552	  0.064188	  0.560081
  2.143306	  0.048624	  0.557463
  2.158481	  0.033066	  0.551577
  2.176425	  0.025762	  0.542862
  2.191036	  0.021579	  0.537747
  2.208452	  0.011147	  0.531315
  2.227861	  0.009368	  0.521804
  2.249158	  0.014004	  0.510875
  2.267606	  0.006257	  0.501254
  2.280138	 -0.012191	  0.493923
  2.289730	 -0.024961	  0.488878
  2.303731	 -0.036752	  0.481491
  2.318438	 -0.049748	  0.473370
  2.331969	 -0.062469	  0.465829
  2.345356	 -0.075303	  0.458395
  2.356332	 -0.091051	  0.452886
  2.365612	 -0.108249	  0.448665
  2.374815	 -0.125510	  0.444503
  2.384017	 -0.142773	  0.440340
  2.393218	 -0.160035	  0.436179
  2.402180	 -0.177399	  0.432151
  2.405853	 -0.196921	  0.431080
  2.403314	 -0.216567	  0.433371
  2.400490	 -0.236213	  0.435815
  2.397663	 -0.255861	  0.438261
  2.394739	 -0.275490	  0.440684
  2.389553	 -0.294668	  0.442599
  2.379476	 -0.311890	  0.443264
  2.369170	 -0.329018	  0.443868
  2.358783	 -0.346086	  0.444347
  2.346736	 -0.361881	  0.442151
  2.334448	 -0.377436	  0.439509
  2.322147	 -0.392860	  0.436283
  2.309945	 -0.407585	  0.430455
  2.297793	 -0.422287	  0.424452
  2.286599	 -0.437222	  0.417279
  2.276320	 -0.452293	  0.409088
  2.266206	 -0.467402	  0.400773
  2.257967	 -0.483383	  0.392038
  2.250632	 -0.499709	  0.383122
  2.243450	 -0.516080	  0.374162
  2.238109	 -0.533235	  0.365393
  2.233992	 -0.550815	  0.356796
  2.229984	 -0.568435	  0.348229
  2.227206	 -0.586523	  0.340178
  2.226177	 -0.605122	  0.332912
  2.225259	 -0.623755	  0.325705
  2.225042	 -0.642589	  0.319009
  2.226949	 -0.661831	  0.313934
  2.228958	 -0.681092	  0.308940
  2.231099	 -0.700378	  0.304144
  2.234970	 -0.719870	  0.302007
  2.238923	 -0.739372	  0.299997
  2.242945	 -0.758862	  0.298088
  2.248406	 -0.778092	  0.298306
  2.254047	 -0.797273	  0.298785
  2.260044	 -0.816335	  0.299536
  2.267348	 -0.834866	  0.301296
  2.274747	 -0.853356	  0.303122
  2.282885	 -0.871486	  0.305363
  2.291396	 -0.889418	  0.307812
  2.300160	 -0.907222	  0.310298
  2.309443	 -0.924756	  0.312844
  2.318801	 -0.942357	  0.315402
  2.328478	 -0.960231	  0.317946
  2.338210	 -0.977545	  0.320298
