  0.519427	  0.240026	  2.355034
  0.524158	  0.246336	  2.359315
  0.513614	  0.232272	  2.349775
  0.503065	  0.218207	  2.340240
  0.491758	  0.203995	  2.331864
  0.480269	  0.189757	  2.323786
  0.468762	  0.175517	  2.315739
  0.456102	  0.161027	  2.310285
  0.443433	  0.146538	  2.304849
  0.430550	  0.132063	  2.299906
  0.416489	  0.117919	  2.298448
  0.402414	  0.103783	  2.297014
  0.388105	  0.089839	  2.296199
  0.372775	  0.077838	  2.300273
  0.358281	  0.064505	  2.304729
  0.344151	  0.050550	  2.308862
  0.327813	  0.039491	  2.312816
  0.311999	  0.030786	  2.321712
  0.297244	  0.024333	  2.333373
  0.282929	  0.016361	  2.345145
  0.268834	  0.008114	  2.356703
  0.254745	 -0.000131	  2.368258
  0.240656	 -0.008376	  2.379813
  0.226566	 -0.016621	  2.391368
  0.212477	 -0.024866	  2.402922
  0.198387	 -0.033110	  2.414477
  0.184594	 -0.041122	  2.425669
  0.180080	 -0.044980	  2.431788
  0.169894	 -0.054087	  2.446393
