 -1.658802	  2.334220	 -0.990301
 -1.642378	  2.311109	 -0.980496
 -1.639082	  2.309640	 -0.928997
 -1.634281	  2.301981	 -0.878337
 -1.637525	  2.295297	 -0.827512
 -1.633472	  2.286436	 -0.777468
 -1.629983	  2.283876	 -0.727482
 -1.638369	  2.278197	 -0.679080
 -1.629792	  2.268724	 -0.631157
 -1.627986	  2.258941	 -0.581717
 -1.626887	  2.251990	 -0.531013
 -1.625283	  2.246026	 -0.480134
 -1.623925	  2.240627	 -0.429658
 -1.622332	  2.237403	 -0.379545
 -1.620308	  2.237726	 -0.329554
 -1.618318	  2.240478	 -0.279508
 -1.617228	  2.242153	 -0.229159
 -1.617079	  2.241361	 -0.178776
 -1.617620	  2.237905	 -0.128875
 -1.618223	  2.232744	 -0.079319
 -1.618382	  2.226640	 -0.029922
 -1.617985	  2.220513	  0.020185
 -1.616855	  2.213076	  0.070163
 -1.615203	  2.203343	  0.119506
 -1.614242	  2.193896	  0.168903
 -1.614583	  2.183429	  0.217909
 -1.616309	  2.169744	  0.266471
 -1.618625	  2.154448	  0.315207
 -1.620268	  2.138437	  0.364139
 -1.620978	  2.124677	  0.413489
 -1.625287	  2.116070	  0.462324
 -1.620579	  2.115313	  0.511143
 -1.614887	  2.107742	  0.560204
 -1.613864	  2.104210	  0.610395
 -1.614172	  2.100258	  0.660656
 -1.615817	  2.097622	  0.710564
 -1.619049	  2.096221	  0.760051
 -1.622027	  2.093262	  0.809678
 -1.624674	  2.088298	  0.859311
 -1.627260	  2.081552	  0.908834
 -1.629691	  2.073384	  0.958219
 -1.631515	  2.064024	  1.007659
 -1.632388	  2.053995	  1.056840
 -1.632242	  2.043654	  1.105201
 -1.631547	  2.033136	  1.153287
 -1.630658	  2.022157	  1.202325
 -1.629361	  2.010536	  1.251776
 -1.627342	  1.999975	  1.301973
 -1.624415	  1.992882	  1.352221
 -1.620234	  1.984560	  1.401479
 -1.609429	  1.984345	  1.450588
 -1.609613	  1.981460	  1.500197
 -1.609463	  1.972962	  1.548588
 -1.613635	  1.962076	  1.595756
 -1.629772	  1.981697	  1.611714
