 -2.152055	  0.302955	  2.111345
 -2.130747	  0.299955	  2.090441
 -2.103030	  0.276282	  2.066738
 -2.086272	  0.239620	  2.027111
 -2.060150	  0.205214	  1.995366
 -2.039538	  0.176022	  1.970447
 -2.021990	  0.146566	  1.930925
 -2.001636	  0.112753	  1.898334
 -1.985265	  0.079606	  1.870427
 -1.967421	  0.043568	  1.839771
 -1.948184	  0.013307	  1.806084
 -1.925722	 -0.022430	  1.775317
 -1.906369	 -0.056677	  1.746666
 -1.878181	 -0.088376	  1.708939
 -1.860874	 -0.116462	  1.681611
 -1.837388	 -0.150600	  1.650940
 -1.822628	 -0.182900	  1.618127
 -1.798513	 -0.212926	  1.587312
 -1.782478	 -0.245223	  1.554524
 -1.760899	 -0.283463	  1.516095
 -1.743587	 -0.317928	  1.486490
 -1.719932	 -0.342170	  1.460039
 -1.705180	 -0.377216	  1.423394
 -1.676537	 -0.412641	  1.395501
 -1.661473	 -0.443701	  1.357914
 -1.637406	 -0.477052	  1.332025
 -1.623737	 -0.510116	  1.297496
 -1.599548	 -0.539216	  1.264996
 -1.582574	 -0.577171	  1.230971
 -1.558604	 -0.606592	  1.195545
 -1.538267	 -0.643712	  1.165568
 -1.521832	 -0.675987	  1.140259
 -1.500619	 -0.703328	  1.103478
 -1.479329	 -0.741947	  1.071188
 -1.499690	 -0.785784	  1.032773
 -1.623596	 -0.892545	  0.959637
 -1.671789	 -0.913910	  0.905981
 -1.618582	 -0.939164	  0.903510
 -1.609122	 -0.974830	  0.831559
 -1.693813	 -1.065640	  0.778536
 -1.582741	 -1.070918	  0.784312
 -1.539261	 -1.113257	  0.773782
 -1.573432	 -1.124888	  0.696307
 -1.471931	 -1.113241	  0.661342
 -1.499594	 -1.212131	  0.660675
 -1.348891	 -1.140439	  0.680207
 -1.215410	 -1.155192	  0.661690
 -1.189911	 -1.191350	  0.623636
 -1.172111	 -1.222898	  0.594148
 -1.152363	 -1.252779	  0.559602
 -1.130118	 -1.289300	  0.524979
 -1.112409	 -1.320426	  0.494682
 -1.092387	 -1.354052	  0.462786
 -1.074250	 -1.388742	  0.429586
 -1.056729	 -1.419891	  0.401075
 -1.035917	 -1.456165	  0.365575
 -1.017049	 -1.486435	  0.338764
 -0.990897	 -1.523627	  0.350087
 -0.936402	 -1.627597	  0.390504
 -0.882786	 -1.717695	  0.446001
 -0.848211	 -1.692369	  0.351415
 -0.823724	 -1.775295	  0.356725
 -0.748963	 -1.835172	  0.386344
 -0.724247	 -1.904772	  0.383608
 -0.735874	 -1.981369	  0.365624
 -0.773640	 -1.991383	  0.302670
 -0.704136	 -1.960492	  0.255112
 -0.623512	 -1.938692	  0.159897
 -0.730544	 -2.121429	  0.161978
 -0.612821	 -1.991157	  0.030471
 -0.675385	 -2.058025	 -0.001337
 -0.673491	 -2.030856	 -0.059262
 -0.694409	 -2.007994	 -0.172926
 -0.672928	 -2.039308	 -0.211310
 -0.649692	 -2.076745	 -0.241335
 -0.625984	 -2.107190	 -0.277468
 -0.606000	 -2.134503	 -0.308642
 -0.591307	 -2.169547	 -0.338580
 -0.565754	 -2.207262	 -0.368828
 -0.545650	 -2.236924	 -0.398136
 -0.523133	 -2.268538	 -0.434478
 -0.505184	 -2.301831	 -0.465925
 -0.484603	 -2.335413	 -0.497146
 -0.465248	 -2.364612	 -0.533677
 -0.449767	 -2.396061	 -0.566442
 -0.420600	 -2.436733	 -0.597436
 -0.401726	 -2.465251	 -0.621177
 -0.387524	 -2.492628	 -0.661302
 -0.359647	 -2.531927	 -0.685704
 -0.347854	 -2.566639	 -0.719833
 -0.322106	 -2.592443	 -0.752244
 -0.306195	 -2.624889	 -0.787756
 -0.281037	 -2.663121	 -0.820736
 -0.262133	 -2.689319	 -0.846920
 -0.244439	 -2.727939	 -0.885981
 -0.221529	 -2.762527	 -0.913904
 -0.198785	 -2.792776	 -0.947271
 -0.186989	 -2.828368	 -0.982532
 -0.188858	 -2.856652	 -0.992357
