  2.176437	  1.053190	 -0.356935
  2.179096	  1.052616	 -0.354467
  2.181755	  1.052042	 -0.351999
  2.167187	  1.055258	 -0.365274
  2.152096	  1.057410	 -0.378088
  2.136660	  1.058235	 -0.390951
  2.122018	  1.059683	 -0.404769
  2.109609	  1.062128	 -0.420707
  2.098022	  1.065108	 -0.437338
  2.086950	  1.068102	 -0.453935
  2.076583	  1.070637	 -0.470900
  2.064906	  1.073840	 -0.487419
  2.054858	  1.075274	 -0.503994
  2.041313	  1.077662	 -0.516054
  2.011734	  1.086115	 -0.526818
  1.991565	  1.089253	 -0.531728
  1.979900	  1.090241	 -0.535266
  1.964437	  1.095028	 -0.547385
  1.949904	  1.102280	 -0.563277
  1.933347	  1.106842	 -0.573063
  1.915323	  1.110669	 -0.580172
  1.893846	  1.107976	 -0.586626
  1.874075	  1.103745	 -0.598141
  1.862221	  1.107103	 -0.613959
  1.849101	  1.114090	 -0.630560
  1.834707	  1.118821	 -0.642895
  1.816071	  1.123858	 -0.650159
  1.792525	  1.132121	 -0.656745
  1.777746	  1.142230	 -0.660754
  1.764584	  1.157686	 -0.672333
  1.756310	  1.168352	 -0.691576
  1.748269	  1.174767	 -0.709405
  1.735810	  1.179799	 -0.724416
  1.723110	  1.183943	 -0.739625
  1.711497	  1.187952	 -0.755341
  1.698978	  1.191984	 -0.770128
  1.688417	  1.195063	 -0.785150
  1.685044	  1.195437	 -0.803409
  1.680947	  1.195367	 -0.826473
  1.670354	  1.195129	 -0.848118
  1.656179	  1.195180	 -0.862578
  1.630700	  1.203516	 -0.885648
  1.622021	  1.207865	 -0.893910
  1.610867	  1.214608	 -0.903274
  1.593673	  1.222603	 -0.914920
  1.577881	  1.229798	 -0.921705
  1.552426	  1.238216	 -0.937202
  1.539464	  1.240186	 -0.946863
  1.529772	  1.242427	 -0.954674
  1.511671	  1.250307	 -0.971124
  1.497845	  1.259281	 -0.979739
  1.484943	  1.267735	 -0.985443
  1.462960	  1.278589	 -0.996253
  1.450027	  1.282778	 -1.006560
  1.433509	  1.284850	 -1.022404
  1.418876	  1.290942	 -1.044411
  1.414412	  1.295562	 -1.053808
  1.408362	  1.305502	 -1.080902
  1.398382	  1.312228	 -1.096165
  1.383180	  1.319195	 -1.110735
  1.368300	  1.326648	 -1.124330
  1.358226	  1.332561	 -1.132433
  1.342024	  1.335419	 -1.140739
  1.315344	  1.341395	 -1.164473
  1.306595	  1.348009	 -1.174953
  1.298840	  1.358835	 -1.181383
  1.286827	  1.372148	 -1.183813
  1.266697	  1.379116	 -1.200275
  1.253201	  1.381881	 -1.215375
  1.244387	  1.385795	 -1.227644
  1.229055	  1.393745	 -1.244570
  1.211450	  1.401161	 -1.257687
  1.196937	  1.404976	 -1.270679
  1.185534	  1.409088	 -1.283626
  1.174750	  1.415546	 -1.298658
  1.166271	  1.422785	 -1.312935
  1.153122	  1.430665	 -1.330599
  1.136334	  1.433841	 -1.346216
  1.123821	  1.435148	 -1.355845
  1.105348	  1.435608	 -1.366564
  1.088168	  1.437436	 -1.381266
  1.074321	  1.441496	 -1.395612
  1.064809	  1.449924	 -1.407626
  1.056630	  1.462363	 -1.424122
  1.046141	  1.466678	 -1.445459
  1.033201	  1.465256	 -1.461096
  1.022820	  1.461346	 -1.473545
  1.004927	  1.456406	 -1.489613
  0.982974	  1.458275	 -1.507078
  0.972596	  1.461009	 -1.512501
  0.949930	  1.465796	 -1.525182
  0.933920	  1.468691	 -1.538824
  0.929197	  1.470654	 -1.544187
  0.907375	  1.480953	 -1.562588
  0.886958	  1.488835	 -1.575578
  0.879362	  1.491303	 -1.580377
  0.859771	  1.500301	 -1.593588
  0.844038	  1.506151	 -1.608125
  0.833012	  1.509489	 -1.621505
  0.810226	  1.519411	 -1.636996
  0.802655	  1.523020	 -1.641169
  0.783496	  1.531409	 -1.647323
  0.765907	  1.539639	 -1.655829
  0.749420	  1.546619	 -1.663652
  0.731115	  1.554374	 -1.673645
  0.718789	  1.557128	 -1.686834
  0.708382	  1.554650	 -1.705775
  0.686637	  1.557774	 -1.727886
  0.670942	  1.565429	 -1.733554
  0.657907	  1.573612	 -1.734820
  0.642499	  1.588029	 -1.744787
  0.623033	  1.597868	 -1.760837
  0.608324	  1.604028	 -1.772907
  0.593615	  1.610188	 -1.784977
