 -2.461010	  0.150646	  0.480071
 -2.479670	  0.140588	  0.484977
 -2.462517	  0.149832	  0.480468
 -2.445365	  0.159076	  0.475959
 -2.426447	  0.165522	  0.475197
 -2.407300	  0.171298	  0.475264
 -2.388152	  0.177074	  0.475331
 -2.369243	  0.183537	  0.476164
 -2.350796	  0.191004	  0.478152
 -2.332376	  0.198665	  0.479561
 -2.314298	  0.207129	  0.478302
 -2.296211	  0.215507	  0.476675
 -2.278138	  0.223553	  0.473738
 -2.260093	  0.231659	  0.470793
 -2.242738	  0.241095	  0.467668
 -2.225382	  0.250530	  0.464543
 -2.208610	  0.261202	  0.462352
 -2.192130	  0.272394	  0.460577
 -2.175619	  0.283542	  0.458819
 -2.158300	  0.293464	  0.457543
 -2.140982	  0.303386	  0.456267
 -2.123534	  0.313081	  0.455011
 -2.105822	  0.322291	  0.453798
 -2.088111	  0.331501	  0.452585
 -2.070273	  0.340481	  0.451500
 -2.052387	  0.349370	  0.450466
 -2.034525	  0.358307	  0.449422
 -2.016785	  0.367479	  0.448332
 -1.999046	  0.376651	  0.447242
 -1.981645	  0.386374	  0.445615
 -1.964346	  0.396252	  0.443835
 -1.947260	  0.406390	  0.441534
 -1.930356	  0.416729	  0.438819
 -1.913724	  0.427355	  0.435584
 -1.897426	  0.438296	  0.431755
 -1.882124	  0.450410	  0.427384
 -1.867944	  0.463638	  0.422490
 -1.854499	  0.477542	  0.417402
 -1.841733	  0.492016	  0.412153
 -1.828968	  0.506491	  0.406904
 -1.813243	  0.517468	  0.401231
 -1.795011	  0.523314	  0.395448
 -1.776779	  0.529159	  0.389666
 -1.758688	  0.535575	  0.384051
 -1.741519	  0.544682	  0.379327
 -1.724351	  0.553789	  0.374603
 -1.707300	  0.563643	  0.371117
 -1.692519	  0.576624	  0.374727
 -1.677739	  0.589605	  0.378336
 -1.662290	  0.601424	  0.373683
 -1.647348	  0.612062	  0.365710
 -1.632655	  0.622231	  0.356726
 -1.617962	  0.632400	  0.347742
 -1.602493	  0.643375	  0.341398
 -1.586560	  0.654940	  0.337874
 -1.570628	  0.666504	  0.334350
 -1.554658	  0.678041	  0.330904
 -1.538074	  0.689039	  0.328905
 -1.521490	  0.700038	  0.326906
 -1.504826	  0.710933	  0.325008
 -1.487923	  0.721506	  0.323426
 -1.471019	  0.732078	  0.321843
 -1.453984	  0.742432	  0.320231
 -1.436918	  0.752734	  0.318612
 -1.419622	  0.762593	  0.316703
 -1.402054	  0.771878	  0.314429
 -1.384441	  0.781045	  0.312031
 -1.366530	  0.789300	  0.308712
 -1.348618	  0.797555	  0.305392
 -1.330500	  0.805284	  0.301929
 -1.312269	  0.812704	  0.298383
 -1.294038	  0.820125	  0.294838
 -1.275386	  0.826633	  0.291714
 -1.256725	  0.833120	  0.288601
 -1.237995	  0.839498	  0.285687
 -1.219026	  0.845458	  0.283529
 -1.200057	  0.851418	  0.281370
 -1.181042	  0.857361	  0.279605
 -1.161944	  0.863250	  0.278847
 -1.142846	  0.869140	  0.278089
 -1.123761	  0.875106	  0.277661
 -1.104787	  0.881366	  0.278558
 -1.085814	  0.887626	  0.279454
 -1.066890	  0.893988	  0.280648
 -1.048410	  0.900974	  0.283763
 -1.029930	  0.907959	  0.286878
 -1.011487	  0.914987	  0.290109
 -0.993762	  0.922696	  0.295249
 -0.976038	  0.930404	  0.300389
 -0.958484	  0.938367	  0.305726
 -0.941494	  0.947093	  0.311657
 -0.924503	  0.955819	  0.317588
 -0.907898	  0.965448	  0.323205
 -0.891449	  0.975408	  0.328700
 -0.874993	  0.985583	  0.333769
 -0.858543	  0.996017	  0.338300
 -0.842076	  1.006529	  0.342582
 -0.825572	  1.017356	  0.345803
 -0.809067	  1.028184	  0.349024
 -0.792486	  1.039200	  0.350949
 -0.775900	  1.050240	  0.352688
 -0.759306	  1.061346	  0.353827
 -0.742722	  1.072518	  0.354228
 -0.726138	  1.083689	  0.354629
 -0.709690	  1.095065	  0.354391
 -0.693243	  1.106442	  0.354151
 -0.676835	  1.117877	  0.353956
 -0.660449	  1.129342	  0.353785
 -0.644090	  1.140848	  0.353695
 -0.627849	  1.152517	  0.353945
 -0.611608	  1.164186	  0.354195
 -0.595482	  1.176004	  0.354725
 -0.579404	  1.187882	  0.355368
 -0.563362	  1.199807	  0.356048
 -0.547407	  1.211842	  0.356816
 -0.531452	  1.223877	  0.357585
 -0.515621	  1.236091	  0.358007
 -0.499793	  1.248311	  0.358416
 -0.483955	  1.260522	  0.358219
 -0.468115	  1.272726	  0.357792
 -0.451957	  1.284462	  0.356717
 -0.435419	  1.295541	  0.354781
 -0.418681	  1.306222	  0.352383
 -0.401220	  1.314832	  0.347801
 -0.383760	  1.323442	  0.343219
 -0.366223	  1.331677	  0.338255
 -0.348653	  1.339730	  0.333109
 -0.331084	  1.347782	  0.327963
 -0.313480	  1.356404	  0.323993
 -0.295897	  1.365406	  0.320864
 -0.278314	  1.374408	  0.317736
 -0.260799	  1.383898	  0.315946
 -0.243293	  1.393420	  0.314250
 -0.225787	  1.402941	  0.312555
 -0.209133	  1.413867	  0.314364
 -0.192730	  1.425029	  0.316883
 -0.176328	  1.436192	  0.319403
 -0.159544	  1.445924	  0.324261
 -0.142757	  1.455625	  0.329167
 -0.125969	  1.465326	  0.334073
 -0.108710	  1.472093	  0.341579
 -0.091447	  1.478729	  0.349190
 -0.074183	  1.485365	  0.356802
 -0.056920	  1.492001	  0.364414
 -0.043162	  1.495911	  0.378394
 -0.029505	  1.499754	  0.392490
 -0.015848	  1.503598	  0.406587
 -0.002191	  1.507441	  0.420683
  0.011466	  1.511285	  0.434780
  0.025504	  1.514443	  0.448671
  0.041647	  1.512316	  0.460284
  0.057791	  1.510188	  0.471897
  0.073934	  1.508061	  0.483511
  0.090077	  1.505933	  0.495124
  0.107221	  1.503567	  0.505148
  0.126439	  1.500611	  0.509833
  0.145656	  1.497655	  0.514519
  0.164873	  1.494699	  0.519204
  0.184831	  1.494426	  0.520485
  0.204751	  1.496209	  0.520470
  0.224293	  1.500303	  0.519309
  0.243372	  1.506113	  0.517820
  0.261817	  1.513631	  0.516008
  0.279527	  1.522689	  0.513936
  0.295665	  1.534204	  0.511291
  0.310522	  1.547232	  0.508207
  0.323335	  1.562197	  0.504760
  0.336139	  1.577169	  0.501313
  0.346437	  1.593976	  0.497921
  0.356736	  1.610782	  0.494530
  0.366569	  1.627846	  0.491049
  0.374808	  1.645677	  0.487288
  0.383047	  1.663509	  0.483526
  0.390051	  1.677222	  0.470763
  0.396587	  1.689669	  0.456538
  0.403111	  1.702083	  0.442279
  0.408062	  1.710631	  0.424888
  0.413014	  1.719179	  0.407498
  0.417966	  1.727727	  0.390108
  0.422918	  1.736275	  0.372718
  0.427869	  1.744823	  0.355328
  0.432565	  1.754595	  0.338522
  0.437001	  1.765471	  0.322334
  0.441438	  1.776346	  0.306147
  0.445874	  1.787222	  0.289959
  0.450310	  1.798097	  0.273771
  0.454746	  1.808973	  0.257583
  0.459182	  1.819849	  0.241396
  0.469899	  1.832939	  0.230728
  0.484208	  1.846052	  0.225901
  0.498517	  1.859165	  0.221074
  0.512826	  1.872278	  0.216247
  0.527135	  1.885391	  0.211420
  0.541444	  1.898503	  0.206594
  0.557326	  1.910493	  0.204585
  0.574568	  1.920469	  0.206375
  0.591809	  1.930445	  0.208165
  0.609051	  1.940421	  0.209955
  0.626188	  1.950346	  0.212752
  0.643259	  1.960237	  0.216029
  0.660325	  1.970135	  0.219315
  0.676923	  1.980538	  0.223349
  0.693520	  1.990942	  0.227382
  0.709780	  2.002264	  0.230115
  0.725902	  2.013875	  0.232410
  0.741887	  2.025893	  0.232536
  0.757783	  2.038016	  0.231931
  0.773510	  2.050119	  0.229449
  0.789106	  2.062176	  0.226072
  0.804519	  2.074213	  0.221881
  0.819726	  2.086212	  0.216904
  0.834878	  2.098223	  0.211792
  0.849820	  2.110274	  0.206176
  0.864761	  2.122325	  0.200561
  0.879668	  2.134299	  0.194697
  0.894567	  2.146254	  0.188772
  0.909581	  2.158049	  0.182816
  0.924955	  2.169316	  0.176759
  0.940329	  2.180583	  0.170702
  0.956080	  2.191385	  0.164767
  0.972282	  2.201589	  0.158991
  0.988484	  2.211793	  0.153215
  1.005197	  2.221381	  0.147853
  1.022328	  2.230416	  0.142860
  1.039458	  2.239451	  0.137868
  1.056991	  2.247968	  0.133389
  1.074782	  2.256121	  0.129265
  1.092573	  2.264275	  0.125142
  1.110201	  2.272063	  0.121800
  1.128332	  2.279929	  0.118734
