 -3.026702	  0.139941	 -0.019721
 -2.996735	  0.138555	 -0.019526
 -2.943468	  0.133145	 -0.026948
 -2.900845	  0.117125	 -0.049302
 -2.859673	  0.109224	 -0.068582
 -2.813920	  0.091718	 -0.082605
 -2.770064	  0.077756	 -0.095780
 -2.722771	  0.067434	 -0.113985
 -2.675094	  0.053796	 -0.131613
 -2.632159	  0.042045	 -0.150334
 -2.586978	  0.029115	 -0.166281
 -2.539744	  0.015583	 -0.181765
 -2.494865	  0.003291	 -0.197288
 -2.449260	 -0.009527	 -0.213606
 -2.407352	 -0.022217	 -0.228457
 -2.361235	 -0.036512	 -0.244725
 -2.314450	 -0.049473	 -0.260489
 -2.269699	 -0.058487	 -0.274056
 -2.222354	 -0.065817	 -0.288575
 -2.173957	 -0.074271	 -0.305861
 -2.129960	 -0.083973	 -0.323242
 -2.088628	 -0.093957	 -0.339665
 -2.040389	 -0.106507	 -0.358165
 -1.992119	 -0.122581	 -0.374453
 -1.948401	 -0.139804	 -0.388461
 -1.914537	 -0.156539	 -0.410697
 -1.913858	 -0.172836	 -0.469314
 -1.987845	 -0.256843	 -0.723151
 -1.959786	 -0.306171	 -0.826612
 -1.903560	 -0.335469	 -0.880671
 -1.865387	 -0.346071	 -0.890585
 -1.821583	 -0.353090	 -0.879972
 -1.674511	 -0.328540	 -0.757143
 -1.581773	 -0.225663	 -0.676063
 -1.564733	 -0.190087	 -0.699945
 -1.549226	 -0.152226	 -0.774908
 -1.537410	 -0.145468	 -0.801037
 -1.505076	 -0.147527	 -0.842147
 -1.391948	 -0.131173	 -0.929670
 -1.298205	 -0.102138	 -0.994393
 -1.274820	 -0.101668	 -1.008711
 -1.241336	 -0.107557	 -1.018807
 -1.189544	 -0.126934	 -1.017045
 -1.141926	 -0.183286	 -0.952922
 -1.105563	 -0.200568	 -0.944436
 -1.076081	 -0.205099	 -0.945043
 -0.998063	 -0.222034	 -0.916282
 -0.930938	 -0.270730	 -0.901883
 -0.917703	 -0.290040	 -0.900095
 -0.874003	 -0.327819	 -0.866717
 -0.786729	 -0.267319	 -0.740417
 -0.631839	 -0.181041	 -0.681484
 -0.556265	 -0.156829	 -0.668976
 -0.480777	 -0.143689	 -0.682527
 -0.414774	 -0.139047	 -0.713129
 -0.393552	 -0.142045	 -0.716210
 -0.344722	 -0.164455	 -0.719949
 -0.314729	 -0.241424	 -0.766852
 -0.318292	 -0.312512	 -0.810097
 -0.317530	 -0.445074	 -0.871440
 -0.298382	 -0.573944	 -0.956806
 -0.276975	 -0.606373	 -0.985322
 -0.245336	 -0.628557	 -1.007440
 -0.201775	 -0.643166	 -1.026919
 -0.154947	 -0.652258	 -1.043787
 -0.106068	 -0.661167	 -1.060344
 -0.058541	 -0.671332	 -1.076278
 -0.012741	 -0.682677	 -1.091580
  0.035251	 -0.696608	 -1.108256
  0.074167	 -0.709209	 -1.122432
  0.119190	 -0.723878	 -1.138888
  0.166608	 -0.738837	 -1.155979
  0.212105	 -0.752673	 -1.173263
  0.255450	 -0.765551	 -1.189958
  0.298988	 -0.778651	 -1.206465
  0.344325	 -0.793108	 -1.224837
  0.386787	 -0.807782	 -1.241314
  0.428477	 -0.821735	 -1.259421
  0.475259	 -0.839000	 -1.279743
  0.517560	 -0.851110	 -1.293319
  0.564006	 -0.860653	 -1.308175
  0.610313	 -0.870511	 -1.323805
  0.656730	 -0.881077	 -1.339411
  0.705762	 -0.892363	 -1.354564
  0.751218	 -0.903145	 -1.368095
  0.800457	 -0.915589	 -1.382876
  0.844861	 -0.928369	 -1.396350
  0.888606	 -0.942545	 -1.409259
  0.936769	 -0.959598	 -1.424377
  0.981408	 -0.976507	 -1.440379
  1.020518	 -0.991839	 -1.455834
  1.064159	 -1.008991	 -1.473970
  1.107759	 -1.023445	 -1.493553
  1.154861	 -1.035232	 -1.514338
  1.195725	 -1.045750	 -1.532161
  1.244013	 -1.058544	 -1.551507
  1.286455	 -1.068902	 -1.567714
  1.328681	 -1.082649	 -1.585985
  1.378694	 -1.098028	 -1.605063
  1.421384	 -1.108334	 -1.617501
  1.465623	 -1.112957	 -1.634573
  1.511557	 -1.131548	 -1.649098
  1.562193	 -1.142777	 -1.662883
  1.606970	 -1.149519	 -1.683765
  1.652997	 -1.168339	 -1.698711
  1.698964	 -1.172235	 -1.712398
  1.740192	 -1.191994	 -1.728759
  1.784721	 -1.204835	 -1.748199
  1.827502	 -1.215860	 -1.762121
  1.877757	 -1.231620	 -1.776167
  1.920655	 -1.239626	 -1.795327
  1.963335	 -1.256516	 -1.811821
  2.004973	 -1.271065	 -1.834252
  2.025022	 -1.283776	 -1.852594
