 0.0 0.0 0.0 0.0
 -0.10711023956537 0.10593769699335 -0.98858714103698 1000.0
 -0.17023140192031 0.8832106590271 0.43698981404304 1000.0
 0.90232646465301 0.35681438446044 -0.24184753000736 1000.0
 -0.59945720434188 0.43735519051551 0.67035192251205 1000.0
 -0.65526658296585 -0.17099420726299 -0.73578977584838 1000.0
 0.66043245792388 0.64743822813034 0.38033214211463 1000.0
 -0.04258396849036 -0.57469964027404 -0.81725579500198 1000.0
 0.0 0.0 0.0 0.0
 -0.54682636260986 -0.83464866876602 -0.06589473038911 1000.0
 0.81502765417099 -0.36911478638649 0.44663685560226 1000.0
 -0.72697913646698 -0.67441207170486 0.12910915911197 1000.0
 0.41057980060577 0.81611800193786 0.40666371583938 1000.0
 0.27402040362358 0.95015126466751 -0.14874562621116 1000.0
