 -1.522037	 -2.613645	  0.182109
 -1.506968	 -2.587767	  0.180306
 -1.486633	 -2.543684	  0.197146
 -1.468584	 -2.497680	  0.214081
 -1.447216	 -2.455666	  0.232636
 -1.426997	 -2.410912	  0.247412
 -1.407457	 -2.370875	  0.270848
 -1.381824	 -2.329723	  0.286531
 -1.363592	 -2.283799	  0.301807
 -1.350262	 -2.238085	  0.316763
 -1.335046	 -2.190659	  0.328571
 -1.317104	 -2.146367	  0.342324
 -1.303618	 -2.103152	  0.355535
 -1.289776	 -2.060712	  0.370166
 -1.271324	 -2.014990	  0.387285
 -1.248561	 -1.972868	  0.407446
 -1.223804	 -1.935175	  0.427368
 -1.197996	 -1.895325	  0.448315
 -1.174343	 -1.857226	  0.468657
 -1.152541	 -1.819909	  0.488986
 -1.133576	 -1.777629	  0.509287
 -1.118965	 -1.731205	  0.523074
 -1.105894	 -1.686625	  0.541894
 -1.089501	 -1.643905	  0.562123
 -1.067998	 -1.602388	  0.579952
 -1.044579	 -1.562534	  0.595594
 -1.020827	 -1.520343	  0.609267
 -0.999173	 -1.473367	  0.621610
 -0.979987	 -1.426496	  0.632647
 -0.962374	 -1.381592	  0.642497
 -0.942816	 -1.337860	  0.651682
 -0.917122	 -1.299169	  0.659639
 -0.881255	 -1.265304	  0.665724
 -0.806417	 -1.222541	  0.670016
 -0.665075	 -1.170949	  0.659416
 -0.586167	 -1.148514	  0.649627
 -0.525167	 -1.130147	  0.645166
 -0.481317	 -1.112830	  0.646751
 -0.444975	 -1.091774	  0.652272
 -0.420796	 -1.071066	  0.660427
 -0.388575	 -1.028438	  0.681562
 -0.368146	 -0.979848	  0.706661
 -0.358648	 -0.921915	  0.734413
 -0.363647	 -0.866830	  0.754151
 -0.379997	 -0.815617	  0.767919
 -0.402010	 -0.780044	  0.774453
 -0.459936	 -0.727399	  0.795917
 -0.555609	 -0.653355	  0.859431
 -0.586061	 -0.579657	  0.923243
 -0.575719	 -0.525526	  0.954663
 -0.555104	 -0.482102	  0.974498
 -0.529339	 -0.442957	  0.991937
 -0.501076	 -0.404530	  1.008619
 -0.473005	 -0.368682	  1.023536
 -0.443881	 -0.331520	  1.040205
 -0.418787	 -0.291322	  1.057598
 -0.401573	 -0.245188	  1.071874
 -0.386708	 -0.199235	  1.085440
 -0.369881	 -0.153678	  1.099276
 -0.350952	 -0.107540	  1.114337
 -0.333318	 -0.063191	  1.129170
 -0.316932	 -0.020846	  1.143516
 -0.300735	  0.023482	  1.158301
 -0.286175	  0.067377	  1.172765
 -0.272381	  0.112560	  1.187728
 -0.259120	  0.158052	  1.204332
 -0.246486	  0.203280	  1.222879
 -0.232849	  0.249864	  1.244422
 -0.219803	  0.292102	  1.266078
 -0.208408	  0.331648	  1.286364
 -0.197483	  0.373220	  1.306431
 -0.185615	  0.418551	  1.327057
 -0.170141	  0.465968	  1.345728
 -0.149783	  0.512590	  1.359868
 -0.123421	  0.558022	  1.372931
 -0.095726	  0.596146	  1.386280
 -0.066156	  0.634167	  1.401116
 -0.038465	  0.673057	  1.416871
 -0.012056	  0.713236	  1.433799
  0.012495	  0.753266	  1.451125
  0.035147	  0.793625	  1.468403
  0.056005	  0.832606	  1.484477
  0.077872	  0.873370	  1.500456
  0.099933	  0.914448	  1.516927
  0.122583	  0.956991	  1.535202
  0.142823	  0.995308	  1.553536
  0.164086	  1.035262	  1.574935
  0.185865	  1.075542	  1.597529
  0.205976	  1.116641	  1.618229
  0.223563	  1.159395	  1.635647
  0.239925	  1.205263	  1.651094
  0.255289	  1.251056	  1.664208
  0.271323	  1.295176	  1.676634
  0.288482	  1.338222	  1.690272
  0.307412	  1.381283	  1.707481
  0.325666	  1.421015	  1.728705
  0.342450	  1.462253	  1.751886
  0.357660	  1.508575	  1.775054
  0.372273	  1.556091	  1.793352
  0.386709	  1.599872	  1.809594
  0.402641	  1.644747	  1.825471
  0.420380	  1.689270	  1.838407
  0.439892	  1.733735	  1.849190
  0.461427	  1.779665	  1.860059
  0.482703	  1.822597	  1.871395
  0.504242	  1.865603	  1.883099
  0.526322	  1.910527	  1.895498
  0.548277	  1.952439	  1.908541
  0.569631	  1.991736	  1.923298
  0.590168	  2.030459	  1.940336
  0.610439	  2.072556	  1.959349
  0.631805	  2.114693	  1.976081
  0.649086	  2.152777	  1.986011
  0.655576	  2.174305	  2.005871
