  0.918128	 -1.156181	  2.041714
  0.902095	 -1.161349	  2.052499
  0.922414	 -1.159826	  2.048284
  0.941354	 -1.156947	  2.039188
  0.959769	 -1.151743	  2.030128
  0.972545	 -1.143362	  2.019585
  0.989992	 -1.140897	  2.008824
  1.009617	 -1.135479	  1.996173
  1.019831	 -1.126854	  1.987228
  1.034350	 -1.113598	  1.979106
  1.055547	 -1.103364	  1.969532
  1.070701	 -1.101623	  1.958058
  1.082426	 -1.098354	  1.947341
  1.098183	 -1.086586	  1.938335
  1.113818	 -1.074699	  1.931116
  1.130745	 -1.064574	  1.925099
  1.148207	 -1.055973	  1.918906
  1.164205	 -1.049263	  1.910456
  1.181749	 -1.040056	  1.905431
  1.200488	 -1.031898	  1.899575
  1.217530	 -1.027105	  1.890208
  1.233299	 -1.023777	  1.879063
  1.251123	 -1.017844	  1.870761
  1.268676	 -1.012553	  1.862719
  1.286222	 -1.007283	  1.854717
  1.303784	 -1.001948	  1.846752
  1.321262	 -0.996748	  1.838538
  1.338718	 -0.991587	  1.830279
  1.355552	 -0.986747	  1.821388
  1.371028	 -0.985264	  1.812782
  1.390640	 -0.982330	  1.800598
  1.409047	 -0.974381	  1.790536
  1.425159	 -0.966557	  1.780728
  1.438112	 -0.963423	  1.772787
  1.457787	 -0.962400	  1.762448
  1.474815	 -0.958226	  1.749976
  1.485829	 -0.951409	  1.735997
  1.500879	 -0.944640	  1.721649
  1.516280	 -0.938264	  1.714027
  1.533728	 -0.933230	  1.703859
  1.550986	 -0.926480	  1.694277
  1.566547	 -0.919580	  1.686361
  1.583190	 -0.917172	  1.677743
  1.601258	 -0.916477	  1.669377
  1.621268	 -0.911972	  1.654992
  1.635775	 -0.907246	  1.643876
  1.651964	 -0.902299	  1.636119
  1.671545	 -0.895500	  1.627532
  1.685756	 -0.892314	  1.617520
  1.700359	 -0.893583	  1.606699
  1.722858	 -0.891716	  1.592049
  1.737289	 -0.884293	  1.584472
  1.751440	 -0.878256	  1.578678
  1.770916	 -0.875586	  1.568592
  1.789471	 -0.870106	  1.561361
  1.806805	 -0.861178	  1.556095
  1.820380	 -0.855704	  1.539744
  1.838632	 -0.851996	  1.532456
