  1.090791	 -1.694302	  1.359016
  1.103859	 -1.715476	  1.361109
  1.116927	 -1.736650	  1.363202
  1.105802	 -1.719730	  1.365552
  1.096980	 -1.701433	  1.359991
  1.085988	 -1.686961	  1.356897
  1.074704	 -1.670262	  1.354314
  1.064517	 -1.649307	  1.352312
  1.054730	 -1.635776	  1.351353
  1.042769	 -1.620139	  1.350136
  1.028189	 -1.603027	  1.346992
  1.018665	 -1.587468	  1.341714
  1.008466	 -1.571034	  1.338408
  0.996153	 -1.554564	  1.335372
  0.986474	 -1.538677	  1.329299
  0.975651	 -1.522260	  1.323221
  0.963709	 -1.506991	  1.320277
  0.953495	 -1.491312	  1.314200
  0.941690	 -1.474238	  1.307442
  0.929698	 -1.460396	  1.306066
  0.918448	 -1.444737	  1.302793
  0.904617	 -1.426177	  1.297119
  0.894541	 -1.413533	  1.294281
  0.881838	 -1.397292	  1.293043
  0.868146	 -1.380490	  1.290477
  0.859065	 -1.365445	  1.284631
  0.847342	 -1.348625	  1.281145
  0.834518	 -1.333160	  1.279828
  0.823259	 -1.317630	  1.277144
  0.813051	 -1.300728	  1.273053
  0.802219	 -1.283918	  1.269937
  0.790997	 -1.267434	  1.267636
  0.779901	 -1.250883	  1.265916
  0.768803	 -1.234334	  1.264199
  0.757091	 -1.218222	  1.262405
  0.745118	 -1.202307	  1.260573
  0.733417	 -1.186377	  1.257522
  0.722179	 -1.170529	  1.252775
  0.710921	 -1.154697	  1.248031
  0.696720	 -1.140888	  1.245298
  0.681945	 -1.127602	  1.243019
  0.667179	 -1.114306	  1.240758
  0.653643	 -1.099596	  1.240205
  0.640195	 -1.084799	  1.239762
  0.627644	 -1.069234	  1.239357
  0.616380	 -1.052710	  1.239009
  0.605124	 -1.036182	  1.238665
  0.594450	 -1.019270	  1.238872
  0.583818	 -1.002332	  1.239121
  0.572946	 -0.985580	  1.239657
  0.561459	 -0.969228	  1.241206
  0.550046	 -0.952867	  1.242242
  0.538386	 -0.937062	  1.243818
  0.525905	 -0.920646	  1.246573
  0.513860	 -0.905492	  1.247828
  0.500190	 -0.892010	  1.248426
  0.484791	 -0.876049	  1.250646
  0.472924	 -0.859978	  1.250847
  0.461459	 -0.843931	  1.248591
  0.450748	 -0.828946	  1.243565
  0.437897	 -0.813070	  1.238658
  0.426115	 -0.798857	  1.233329
  0.414371	 -0.782576	  1.228805
  0.401683	 -0.765177	  1.226255
  0.387459	 -0.749392	  1.228174
  0.375117	 -0.736830	  1.224540
  0.362155	 -0.722081	  1.218587
  0.349428	 -0.708109	  1.212181
  0.337383	 -0.693710	  1.203746
  0.325190	 -0.679991	  1.195622
  0.315222	 -0.664375	  1.185169
  0.306913	 -0.648404	  1.177840
  0.297620	 -0.631618	  1.173185
  0.288694	 -0.613229	  1.169237
  0.281183	 -0.595924	  1.162114
  0.271076	 -0.580191	  1.155170
  0.259542	 -0.564430	  1.151920
  0.247958	 -0.548088	  1.150005
  0.236374	 -0.531486	  1.146771
  0.226543	 -0.514544	  1.141835
  0.218053	 -0.497037	  1.137389
  0.210341	 -0.478781	  1.135040
  0.201994	 -0.460588	  1.134349
  0.193618	 -0.442568	  1.134738
  0.185998	 -0.423972	  1.136003
  0.176934	 -0.403163	  1.132234
  0.168846	 -0.386213	  1.126874
  0.158081	 -0.372647	  1.122210
  0.146729	 -0.354557	  1.120782
  0.136043	 -0.337442	  1.118201
  0.125659	 -0.322555	  1.114050
  0.113489	 -0.304623	  1.111838
  0.103330	 -0.286896	  1.110312
  0.095966	 -0.270469	  1.103371
  0.086001	 -0.253167	  1.098319
  0.075965	 -0.237046	  1.095736
  0.064468	 -0.219786	  1.092403
  0.053204	 -0.204962	  1.088681
  0.040915	 -0.189123	  1.084874
  0.029090	 -0.174117	  1.079742
  0.017239	 -0.159672	  1.072635
  0.004020	 -0.144321	  1.065219
 -0.008098	 -0.130806	  1.058265
 -0.020098	 -0.116699	  1.051763
 -0.033145	 -0.101253	  1.046597
 -0.045273	 -0.085974	  1.045232
 -0.057349	 -0.070381	  1.042702
 -0.069751	 -0.053938	  1.041884
 -0.081654	 -0.038716	  1.042001
 -0.094357	 -0.021406	  1.042405
 -0.109128	 -0.006289	  1.035021
 -0.122004	  0.006766	  1.028988
 -0.135500	  0.022545	  1.025101
 -0.144595	  0.037140	  1.024182
 -0.157348	  0.053689	  1.023838
 -0.169773	  0.069752	  1.024946
 -0.182899	  0.085341	  1.025305
 -0.196299	  0.099859	  1.024569
 -0.208697	  0.115376	  1.021886
 -0.220243	  0.132634	  1.018363
 -0.230793	  0.151947	  1.019491
 -0.242635	  0.165166	  1.023968
 -0.256788	  0.178764	  1.025129
 -0.271881	  0.194044	  1.028006
 -0.282953	  0.211365	  1.030758
 -0.293077	  0.226571	  1.028695
 -0.307117	  0.241528	  1.029968
 -0.320214	  0.257613	  1.033628
 -0.331257	  0.273477	  1.035515
 -0.342638	  0.288941	  1.036037
 -0.356617	  0.305261	  1.038580
 -0.369865	  0.321170	  1.042877
 -0.379355	  0.337176	  1.037676
 -0.390404	  0.353332	  1.035740
 -0.404540	  0.368931	  1.037581
 -0.417287	  0.384183	  1.037045
 -0.427934	  0.402723	  1.034957
 -0.439112	  0.418693	  1.036801
 -0.452211	  0.431336	  1.037323
 -0.466925	  0.446550	  1.035760
 -0.480482	  0.461067	  1.032329
 -0.493172	  0.476355	  1.028865
 -0.506204	  0.490470	  1.023308
 -0.519401	  0.504019	  1.016809
 -0.534195	  0.515167	  1.009280
 -0.550590	  0.522694	  1.000651
 -0.567002	  0.530191	  0.992023
 -0.584636	  0.535648	  0.984345
 -0.604076	  0.535474	  0.979677
 -0.623527	  0.535266	  0.975026
 -0.642977	  0.535059	  0.970375
 -0.662435	  0.534797	  0.965773
 -0.682114	  0.531691	  0.964057
 -0.701794	  0.528555	  0.962366
 -0.721474	  0.525420	  0.960675
 -0.741154	  0.522285	  0.958984
 -0.760831	  0.519120	  0.957299
 -0.780272	  0.515254	  0.955702
 -0.799530	  0.511753	  0.952928
 -0.819416	  0.509054	  0.950187
 -0.840567	  0.507603	  0.951150
 -0.860620	  0.504204	  0.954828
 -0.877761	  0.496058	  0.952868
 -0.896390	  0.488781	  0.950393
 -0.918751	  0.484442	  0.946076
 -0.936767	  0.482847	  0.941124
 -0.955370	  0.481204	  0.935891
 -0.976562	  0.478221	  0.934876
 -0.995557	  0.475301	  0.935181
 -1.015534	  0.475172	  0.927857
 -1.036518	  0.477241	  0.925068
 -1.054708	  0.473048	  0.923509
 -1.073520	  0.466948	  0.917872
 -1.094243	  0.463356	  0.909073
 -1.111518	  0.470756	  0.906263
 -1.131231	  0.476272	  0.905311
 -1.153757	  0.481466	  0.900251
 -1.170808	  0.478287	  0.890002
 -1.191026	  0.470937	  0.881957
 -1.209097	  0.470221	  0.881369
 -1.229731	  0.476860	  0.879650
 -1.248204	  0.485971	  0.877950
 -1.266862	  0.493909	  0.875119
 -1.285741	  0.501499	  0.873908
 -1.303249	  0.510860	  0.875013
 -1.318567	  0.523575	  0.877303
 -1.331990	  0.538261	  0.879675
 -1.344063	  0.553290	  0.881380
 -1.355382	  0.569708	  0.884582
 -1.363663	  0.586823	  0.888687
 -1.373694	  0.603228	  0.894733
 -1.382374	  0.618660	  0.903151
 -1.393448	  0.636087	  0.909655
 -1.397892	  0.654072	  0.917663
 -1.401695	  0.672798	  0.922379
 -1.404109	  0.693587	  0.921613
 -1.407413	  0.712645	  0.921308
 -1.417201	  0.729942	  0.921777
 -1.426405	  0.747162	  0.925840
 -1.433126	  0.771808	  0.927052
 -1.430125	  0.792287	  0.922459
 -1.419864	  0.812432	  0.920506
 -1.416242	  0.830634	  0.922965
 -1.419649	  0.850333	  0.925844
 -1.424290	  0.869170	  0.931468
 -1.423768	  0.889362	  0.932853
 -1.421393	  0.910194	  0.937974
 -1.415865	  0.928637	  0.942022
 -1.412439	  0.947801	  0.942448
 -1.408716	  0.967633	  0.942905
 -1.404058	  0.987830	  0.945243
 -1.396789	  1.005696	  0.943796
 -1.392541	  1.025585	  0.943888
 -1.388751	  1.046108	  0.944378
 -1.379431	  1.064407	  0.941504
 -1.368396	  1.080658	  0.941235
 -1.365102	  1.100155	  0.945065
 -1.364483	  1.119958	  0.948718
 -1.350863	  1.141006	  0.947153
 -1.340461	  1.156521	  0.948464
 -1.338107	  1.175242	  0.951784
 -1.332115	  1.194706	  0.953342
 -1.321211	  1.213941	  0.952961
 -1.319986	  1.232112	  0.952648
 -1.318871	  1.253857	  0.948591
 -1.311787	  1.274295	  0.947627
 -1.301937	  1.288907	  0.953723
 -1.292342	  1.307818	  0.957238
 -1.287512	  1.328272	  0.954739
 -1.285134	  1.346901	  0.953755
 -1.280872	  1.367630	  0.953554
 -1.276331	  1.387758	  0.955066
 -1.279132	  1.405772	  0.953637
 -1.284629	  1.427531	  0.948640
 -1.278234	  1.448317	  0.945107
 -1.276030	  1.465316	  0.947202
 -1.276624	  1.488106	  0.948224
 -1.284012	  1.506179	  0.947390
 -1.289952	  1.525121	  0.946486
 -1.294238	  1.545511	  0.945826
 -1.303846	  1.562509	  0.942692
 -1.312321	  1.580784	  0.940414
 -1.320164	  1.599178	  0.938845
 -1.331370	  1.615322	  0.935430
 -1.342580	  1.631552	  0.932236
 -1.352373	  1.649043	  0.930260
 -1.365079	  1.664942	  0.926325
 -1.380555	  1.676727	  0.922634
 -1.395971	  1.689291	  0.920813
 -1.411510	  1.703440	  0.917446
 -1.421668	  1.717595	  0.911001
 -1.436375	  1.730229	  0.907713
 -1.454353	  1.743027	  0.903946
 -1.466872	  1.755803	  0.897995
 -1.478953	  1.772522	  0.889220
 -1.493407	  1.785241	  0.883804
 -1.507861	  1.797960	  0.878388
