 0.0 0.0 0.0 0
 -0.9931346486121942 0.11643688648191937 0.02142477986654806 1000
 -0.5189558767751462 0.4019628090473397 0.754436676006218 1000
 -0.4848529477932491 0.824096924302702 -0.2929571271893271 1000
 -0.14121045501384832 -0.470710956714683 -0.8705749839178298 1000
 0.7555890244961508 0.21530603569528833 -0.6185325674967602 1000
 0.048142552283216775 0.8875121026187495 -0.4583061884427309 1000
 0.28844343650691906 -0.026891338547848406 -0.9575214043806979 1000
 0.48317144118384553 0.8643296960987148 0.14046542231534784 1000
 0.0 0.0 0.0 0
 0.27547439284178304 -0.7934099425524094 -0.542486425588174 1000
 0.38563155851586595 0.5755494204116042 -0.7209931800929125 1000
 0.9422002737860822 0.30585559271424995 -0.13447676558739263 1000
 0.852496797504568 -0.2538776742937019 -0.4575153950848828 1000
 0.26990655075502634 0.9468480776625613 -0.1754741339520926 1000
 0.1568280476013358 0.7611096613428529 0.6290906507778676 1000
 -0.4054060751042256 0.8880575270845107 0.2148225846067644 1000
 0.10524971487835814 0.6896886972441473 -0.7162764818222747 1000
 0.0 0.0 0.0 0
 -0.6765889811162585 0.5362325931312794 0.5053394470014854 1000
 0.7275110578981695 0.3820020043743097 0.5697755078010076 1000
 0.4618767822786973 0.7890338118669443 0.40412062768757107 1000
 -0.586569998599033 0.1364295305370746 -0.7987675631502344 1000
 0.4854584572302991 -0.8737283017793485 0.028929932135309505 1000
 -0.30703546847602664 -0.5784397572772959 -0.7548659936032951 1000
 -0.3513026423791029 0.7588845707033675 -0.5489896736786819 1000
 -0.7654043594434446 0.45369712842712084 -0.45585862084856354 1000
 0.0 0.0 0.0 0
 -0.4780806049308176 0.04029205218698595 0.8777268856082423 1000
 -0.8041182843091779 -0.05858180114643509 -0.5914481865845086 1000
 -0.4301747644901435 0.5081401345851679 -0.7462722530146869 1000
 -0.8966800281557425 -0.43141218016135835 -0.09492343185452362 1000
 0.6859755926382393 -0.6677494023513018 0.2899348581390238 1000
 -0.1435830119464451 -0.11273890055994736 0.9832867633508147 1000
 -0.2925019273567407 -0.8223837768622032 -0.48719251435797944 1000
 -0.6230223027419064 0.7780988740434958 0.07806633396296106 1000
 0.0 0.0 0.0 0
 -0.6502156801093516 -0.7587577688419962 0.032097002381051704 1000
 0.8770239154199921 -0.2510174439113677 0.41141742140263066 1000
 0.6771514640692321 -0.2513917779897672 0.6908755811779999 1000
 0.9517962488711802 -0.3031260301002114 0.04260880789738157 1000
