 -0.237523	  2.971809	  0.541139
 -0.235171	  2.942386	  0.535781
 -0.239110	  2.897215	  0.529861
 -0.258307	  2.854162	  0.514773
 -0.267993	  2.807361	  0.499678
 -0.280014	  2.761684	  0.487399
 -0.297117	  2.716914	  0.479198
 -0.309962	  2.671985	  0.460693
 -0.320705	  2.622326	  0.452140
 -0.332482	  2.575343	  0.436286
 -0.334602	  2.525097	  0.431976
 -0.338136	  2.476236	  0.421185
 -0.343045	  2.427777	  0.410005
 -0.348062	  2.379971	  0.398566
 -0.354272	  2.330729	  0.384559
 -0.362654	  2.281284	  0.367342
 -0.373299	  2.233985	  0.348798
 -0.386873	  2.189656	  0.329204
 -0.403564	  2.147836	  0.308366
 -0.421962	  2.108257	  0.287566
 -0.442199	  2.067804	  0.266028
 -0.464851	  2.026524	  0.244670
 -0.490102	  1.985557	  0.224585
 -0.516138	  1.945449	  0.207709
 -0.541951	  1.903713	  0.193222
 -0.566990	  1.856620	  0.179334
 -0.588112	  1.808490	  0.166764
 -0.605459	  1.760786	  0.155137
 -0.620255	  1.711599	  0.143612
 -0.632317	  1.663997	  0.132114
 -0.642203	  1.618381	  0.119965
 -0.650717	  1.570601	  0.105676
 -0.656740	  1.524131	  0.091644
 -0.660621	  1.478854	  0.078701
 -0.660456	  1.431559	  0.070967
 -0.668593	  1.378670	  0.065692
 -0.678693	  1.329493	  0.052312
 -0.692164	  1.283558	  0.037381
 -0.698727	  1.235527	  0.019371
 -0.702378	  1.187544	  0.005805
 -0.706201	  1.140495	 -0.003918
 -0.709980	  1.093120	 -0.014074
 -0.715439	  1.044185	 -0.024195
 -0.722880	  0.994743	 -0.035505
 -0.731905	  0.945159	 -0.047712
 -0.742382	  0.898832	 -0.058239
 -0.753915	  0.850831	 -0.068588
 -0.766965	  0.800919	 -0.079204
 -0.780074	  0.753109	 -0.087264
 -0.794258	  0.706075	 -0.095195
 -0.810450	  0.660036	 -0.103838
 -0.828980	  0.613697	 -0.113477
 -0.847640	  0.568022	 -0.124796
 -0.864549	  0.522646	 -0.139445
 -0.880510	  0.476926	 -0.155703
 -0.895454	  0.431560	 -0.172048
 -0.909203	  0.387537	 -0.187783
 -0.922715	  0.342729	 -0.202114
 -0.937291	  0.296751	 -0.213262
 -0.953212	  0.249640	 -0.220657
 -0.968460	  0.202061	 -0.224712
 -0.982510	  0.154259	 -0.226318
 -0.994992	  0.106962	 -0.226174
 -1.006285	  0.060426	 -0.224862
 -1.016942	  0.015831	 -0.222233
 -1.027469	 -0.026283	 -0.217777
 -1.041315	 -0.077795	 -0.209525
 -1.065364	 -0.158083	 -0.190139
 -1.089074	 -0.232015	 -0.158305
 -1.103546	 -0.284992	 -0.128465
 -1.113673	 -0.348635	 -0.094494
 -1.112434	 -0.412291	 -0.066787
 -1.107744	 -0.434732	 -0.063115
 -1.095915	 -0.463114	 -0.069152
 -1.053599	 -0.526653	 -0.099789
 -0.972140	 -0.615920	 -0.145388
 -0.889728	 -0.718493	 -0.197070
 -0.849486	 -0.785792	 -0.258666
 -0.838612	 -0.827713	 -0.321876
 -0.845556	 -0.851902	 -0.374815
 -0.866556	 -0.870028	 -0.429737
 -0.900440	 -0.881635	 -0.477609
 -0.969465	 -0.893970	 -0.534145
 -1.063449	 -0.909056	 -0.560862
 -1.184575	 -0.939403	 -0.542591
 -1.242312	 -0.985657	 -0.546851
 -1.269072	 -1.025632	 -0.556945
 -1.288044	 -1.066555	 -0.569019
 -1.304780	 -1.111161	 -0.582826
 -1.320171	 -1.158329	 -0.596853
 -1.335369	 -1.203327	 -0.610166
 -1.351466	 -1.247193	 -0.623222
 -1.369638	 -1.292417	 -0.637396
 -1.388362	 -1.336890	 -0.652161
 -1.406646	 -1.381228	 -0.666673
 -1.423644	 -1.425065	 -0.680434
 -1.438336	 -1.471091	 -0.694525
 -1.450889	 -1.517332	 -0.707797
 -1.463972	 -1.565005	 -0.720781
 -1.478145	 -1.612689	 -0.732182
 -1.492424	 -1.658390	 -0.742313
 -1.501121	 -1.704091	 -0.756413
 -1.506989	 -1.749041	 -0.777318
 -1.520772	 -1.793934	 -0.795853
 -1.534374	 -1.839106	 -0.812294
 -1.546112	 -1.886895	 -0.827588
 -1.562453	 -1.933857	 -0.839020
 -1.577350	 -1.981688	 -0.846138
 -1.587921	 -2.027830	 -0.856505
 -1.599005	 -2.073043	 -0.868062
 -1.616346	 -2.119543	 -0.877112
 -1.625718	 -2.170220	 -0.880820
 -1.636911	 -2.218348	 -0.894496
 -1.650209	 -2.267168	 -0.909356
 -1.670586	 -2.314762	 -0.922507
 -1.687292	 -2.337910	 -0.931732
