 -0.621321	  0.684125	  2.240682
 -0.643460	  0.648300	  2.260044
 -0.640751	  0.652683	  2.257675
 -0.615209	  0.695702	  2.239220
 -0.590534	  0.739715	  2.223429
 -0.567308	  0.784056	  2.209728
 -0.545394	  0.827051	  2.197072
 -0.523732	  0.868382	  2.184983
 -0.501698	  0.908807	  2.171702
 -0.479393	  0.947927	  2.156162
 -0.456792	  0.985618	  2.138253
 -0.433851	  1.021768	  2.118070
 -0.410606	  1.056301	  2.095637
 -0.387177	  1.088583	  2.071478
 -0.362928	  1.118752	  2.046197
 -0.337384	  1.147727	  2.019995
 -0.310253	  1.176918	  1.991663
 -0.282243	  1.209770	  1.960626
 -0.254173	  1.246670	  1.932433
 -0.226021	  1.287358	  1.909491
 -0.199902	  1.330106	  1.889341
 -0.176516	  1.370463	  1.870452
 -0.153805	  1.407772	  1.851525
 -0.130470	  1.443815	  1.830837
 -0.106943	  1.479312	  1.807941
 -0.083151	  1.515697	  1.782437
 -0.060071	  1.552308	  1.754927
 -0.038155	  1.588345	  1.726369
 -0.017134	  1.623936	  1.697154
  0.003323	  1.659417	  1.668214
  0.023591	  1.695368	  1.639941
  0.044117	  1.731206	  1.612444
  0.065160	  1.766764	  1.586277
  0.086374	  1.801176	  1.562071
  0.108457	  1.834650	  1.539181
  0.133892	  1.871534	  1.515203
  0.169697	  1.930622	  1.482670
  0.181528	  1.951583	  1.471641
