 -1.911568	 -0.684996	 -1.097123
 -1.912046	 -0.686566	 -1.121685
 -1.912524	 -0.688136	 -1.146247
 -1.912512	 -0.687948	 -1.129465
 -1.913233	 -0.689895	 -1.105287
 -1.912808	 -0.688376	 -1.086109
 -1.910560	 -0.682592	 -1.067846
 -1.909814	 -0.677032	 -1.046547
 -1.911421	 -0.677628	 -1.026047
 -1.912289	 -0.683807	 -1.008065
 -1.914749	 -0.693959	 -0.989094
 -1.916161	 -0.698991	 -0.960496
 -1.915123	 -0.698353	 -0.950565
 -1.913132	 -0.698780	 -0.930231
 -1.910274	 -0.701045	 -0.907903
 -1.908831	 -0.703472	 -0.885849
 -1.905710	 -0.707025	 -0.867911
 -1.901167	 -0.707908	 -0.851052
 -1.897671	 -0.706280	 -0.829332
 -1.896750	 -0.706644	 -0.809069
 -1.892002	 -0.710860	 -0.790074
 -1.886593	 -0.717661	 -0.773009
 -1.880150	 -0.723222	 -0.754636
 -1.871905	 -0.721778	 -0.734304
 -1.862190	 -0.720772	 -0.713366
 -1.853933	 -0.720850	 -0.696471
 -1.845499	 -0.721122	 -0.678088
 -1.840008	 -0.725087	 -0.656877
 -1.837411	 -0.733598	 -0.637644
 -1.836763	 -0.742568	 -0.619321
 -1.838594	 -0.749302	 -0.601994
 -1.840602	 -0.754767	 -0.580223
 -1.837603	 -0.759086	 -0.556173
 -1.833961	 -0.761602	 -0.544117
 -1.830121	 -0.770059	 -0.523347
 -1.831385	 -0.781979	 -0.505700
 -1.833891	 -0.791337	 -0.487541
 -1.835399	 -0.800752	 -0.470111
 -1.831283	 -0.810361	 -0.453914
 -1.825562	 -0.822273	 -0.436573
 -1.825952	 -0.829924	 -0.415864
 -1.831748	 -0.832361	 -0.396667
 -1.840179	 -0.840392	 -0.376865
 -1.843386	 -0.857716	 -0.365704
 -1.843207	 -0.875334	 -0.353125
 -1.846004	 -0.890096	 -0.339323
 -1.850500	 -0.903079	 -0.324759
 -1.853885	 -0.915967	 -0.309834
 -1.857546	 -0.929047	 -0.295058
 -1.860408	 -0.941142	 -0.281241
 -1.854740	 -0.953929	 -0.265170
 -1.853880	 -0.969668	 -0.247048
 -1.868178	 -0.986619	 -0.233679
 -1.879186	 -0.999672	 -0.222329
 -1.884330	 -1.010486	 -0.211714
 -1.888138	 -1.024661	 -0.197114
 -1.894230	 -1.039155	 -0.184196
 -1.898004	 -1.053372	 -0.172928
 -1.901760	 -1.067933	 -0.159830
 -1.906714	 -1.082044	 -0.146502
 -1.907793	 -1.097806	 -0.133462
 -1.906048	 -1.111052	 -0.120963
 -1.894313	 -1.118737	 -0.107555
 -1.878103	 -1.124015	 -0.093317
 -1.868497	 -1.124983	 -0.087125
 -1.862374	 -1.129728	 -0.068999
 -1.854551	 -1.141715	 -0.051000
 -1.844497	 -1.149389	 -0.034683
 -1.837466	 -1.151834	 -0.025209
 -1.832731	 -1.138417	 -0.011893
 -1.830449	 -1.122349	  0.000197
 -1.824376	 -1.109210	  0.016706
 -1.816875	 -1.098534	  0.044235
 -1.815163	 -1.092245	  0.058385
 -1.814736	 -1.087016	  0.072043
 -1.816707	 -1.068659	  0.097976
 -1.818647	 -1.061721	  0.110590
 -1.818784	 -1.056313	  0.122121
 -1.817466	 -1.048496	  0.143274
 -1.817597	 -1.041589	  0.162046
 -1.815439	 -1.031782	  0.187924
 -1.808651	 -1.023464	  0.204829
 -1.801313	 -1.017849	  0.215875
 -1.791524	 -1.002041	  0.228074
 -1.787149	 -0.981343	  0.242480
 -1.782982	 -0.966159	  0.256622
 -1.780518	 -0.956992	  0.271480
 -1.779830	 -0.946406	  0.289405
 -1.781469	 -0.932537	  0.309042
 -1.781968	 -0.921561	  0.325235
 -1.772420	 -0.922808	  0.344105
 -1.760901	 -0.922145	  0.367054
 -1.751654	 -0.916846	  0.386198
 -1.744841	 -0.911132	  0.400035
 -1.734690	 -0.903905	  0.428874
 -1.735467	 -0.904543	  0.450296
 -1.736912	 -0.904711	  0.464233
 -1.737659	 -0.897823	  0.484769
 -1.734895	 -0.884846	  0.504056
 -1.728945	 -0.872053	  0.516834
 -1.718356	 -0.855824	  0.528720
 -1.717799	 -0.863595	  0.550893
 -1.720913	 -0.874766	  0.584269
 -1.718833	 -0.873831	  0.601294
 -1.716664	 -0.872635	  0.614482
 -1.712056	 -0.867030	  0.634520
 -1.712595	 -0.865034	  0.654259
 -1.711504	 -0.864518	  0.676341
 -1.706106	 -0.861830	  0.694638
 -1.697858	 -0.861132	  0.712938
 -1.688048	 -0.861157	  0.733662
 -1.681401	 -0.861373	  0.752019
 -1.674323	 -0.861302	  0.771677
 -1.666860	 -0.861885	  0.791658
 -1.662120	 -0.866146	  0.811924
 -1.657215	 -0.872186	  0.826729
 -1.652226	 -0.879084	  0.846400
 -1.644319	 -0.890456	  0.870922
 -1.639544	 -0.895420	  0.881822
 -1.636266	 -0.900437	  0.903777
 -1.634702	 -0.905300	  0.929442
 -1.630401	 -0.906805	  0.940847
 -1.620425	 -0.907808	  0.961364
 -1.608102	 -0.905964	  0.975335
 -1.593127	 -0.903529	  0.992691
 -1.583458	 -0.909038	  1.013877
 -1.574062	 -0.918273	  1.032291
 -1.566183	 -0.926720	  1.047031
 -1.558870	 -0.934524	  1.063451
 -1.554824	 -0.937502	  1.084273
 -1.551862	 -0.938115	  1.106082
 -1.548381	 -0.936748	  1.120706
 -1.543942	 -0.935938	  1.132047
 -1.530238	 -0.933332	  1.152550
 -1.518578	 -0.940851	  1.177668
 -1.516564	 -0.950544	  1.197368
 -1.518152	 -0.960332	  1.223010
 -1.515823	 -0.962220	  1.242021
 -1.516216	 -0.959017	  1.248488
 -1.513963	 -0.948831	  1.266840
 -1.506491	 -0.937380	  1.299591
 -1.503309	 -0.944699	  1.324973
 -1.503490	 -0.945862	  1.334997
 -1.502859	 -0.942855	  1.358741
 -1.503277	 -0.938614	  1.381720
 -1.502809	 -0.938250	  1.389236
 -1.497595	 -0.934228	  1.408754
 -1.485942	 -0.924105	  1.429352
 -1.473038	 -0.917027	  1.453628
 -1.467986	 -0.916677	  1.472366
 -1.461700	 -0.918656	  1.485424
 -1.447278	 -0.925555	  1.509541
 -1.440406	 -0.935532	  1.529558
 -1.436436	 -0.939701	  1.541020
 -1.424232	 -0.940263	  1.563394
 -1.414745	 -0.938690	  1.577729
 -1.407340	 -0.940693	  1.592771
 -1.393400	 -0.947861	  1.615855
 -1.386137	 -0.954604	  1.634034
 -1.400028	 -0.962519	  1.672019
 -1.392907	 -0.964249	  1.690628
 -1.385786	 -0.965979	  1.709237
