  2.187230	 -1.248207	 -0.181431
  2.214223	 -1.255705	 -0.171505
  2.195049	 -1.248733	 -0.172439
  2.182370	 -1.239292	 -0.181766
  2.160306	 -1.229643	 -0.194683
  2.143810	 -1.225061	 -0.204415
  2.129992	 -1.222752	 -0.212718
  2.111757	 -1.218076	 -0.223637
  2.089436	 -1.213543	 -0.232136
  2.072028	 -1.213189	 -0.234238
  2.051011	 -1.214947	 -0.235477
  2.028995	 -1.219600	 -0.235773
  2.007673	 -1.222755	 -0.237090
  1.986275	 -1.221917	 -0.245552
  1.968103	 -1.219890	 -0.259217
  1.958542	 -1.219247	 -0.267409
  1.936803	 -1.214293	 -0.276722
  1.917101	 -1.208022	 -0.281035
  1.899767	 -1.204938	 -0.283735
  1.881878	 -1.199234	 -0.291205
  1.864194	 -1.192846	 -0.294600
  1.837742	 -1.187024	 -0.298844
  1.819242	 -1.184757	 -0.307694
  1.807071	 -1.186290	 -0.317267
  1.788836	 -1.185031	 -0.325576
  1.769360	 -1.177322	 -0.332561
  1.754221	 -1.168801	 -0.342477
  1.739613	 -1.163023	 -0.353540
  1.723532	 -1.157772	 -0.362969
  1.701993	 -1.142898	 -0.368949
  1.686279	 -1.133182	 -0.371811
  1.671963	 -1.129340	 -0.377550
  1.652990	 -1.121504	 -0.385137
  1.633946	 -1.109362	 -0.388119
  1.619132	 -1.100812	 -0.391970
  1.603227	 -1.092352	 -0.398390
  1.582618	 -1.082452	 -0.402266
  1.565808	 -1.073615	 -0.403974
  1.551539	 -1.062812	 -0.408559
  1.533823	 -1.051896	 -0.413859
  1.514783	 -1.045370	 -0.415611
  1.498533	 -1.036077	 -0.418562
  1.481317	 -1.022257	 -0.424284
  1.463804	 -1.015302	 -0.427049
  1.446681	 -1.009447	 -0.430754
  1.427665	 -0.997981	 -0.437884
  1.411590	 -0.989167	 -0.442503
  1.395665	 -0.982917	 -0.446761
  1.377489	 -0.970961	 -0.451874
  1.358082	 -0.958415	 -0.452147
  1.337742	 -0.954429	 -0.452268
  1.320271	 -0.955664	 -0.456041
  1.299536	 -0.954699	 -0.464350
  1.280771	 -0.951311	 -0.471606
  1.262543	 -0.948075	 -0.479328
  1.244192	 -0.945226	 -0.486935
  1.225890	 -0.943352	 -0.494551
  1.207334	 -0.941918	 -0.502498
  1.189442	 -0.940526	 -0.511593
  1.173022	 -0.933417	 -0.524285
  1.158727	 -0.921667	 -0.535024
  1.142180	 -0.909373	 -0.537373
  1.123284	 -0.899647	 -0.536949
  1.101275	 -0.894671	 -0.539548
  1.082994	 -0.890030	 -0.547432
  1.067528	 -0.884978	 -0.564403
  1.057576	 -0.878447	 -0.578794
  1.041677	 -0.870475	 -0.588630
  1.023866	 -0.864200	 -0.593246
  1.006154	 -0.853521	 -0.603259
  0.992701	 -0.845173	 -0.617376
  0.978422	 -0.842840	 -0.630024
  0.962256	 -0.838332	 -0.639658
  0.944568	 -0.828901	 -0.648698
  0.927742	 -0.821436	 -0.657676
  0.910481	 -0.820978	 -0.667000
  0.892946	 -0.823008	 -0.678148
  0.876274	 -0.822083	 -0.691539
  0.858336	 -0.816909	 -0.700793
  0.840049	 -0.812941	 -0.704831
  0.821158	 -0.812184	 -0.711015
  0.805124	 -0.812583	 -0.723662
  0.786862	 -0.809157	 -0.736481
  0.766656	 -0.805404	 -0.743238
  0.748448	 -0.803985	 -0.745120
  0.729482	 -0.804047	 -0.752392
  0.710928	 -0.798580	 -0.760800
  0.689577	 -0.790360	 -0.756636
  0.667419	 -0.784829	 -0.751330
  0.650384	 -0.781960	 -0.755869
  0.630994	 -0.777129	 -0.764282
  0.612293	 -0.775805	 -0.768552
  0.593033	 -0.775350	 -0.769046
  0.574210	 -0.769428	 -0.770072
  0.553355	 -0.761130	 -0.777457
  0.533030	 -0.758995	 -0.787245
  0.514728	 -0.760718	 -0.788010
  0.494785	 -0.759646	 -0.783878
  0.475666	 -0.755472	 -0.783313
  0.454332	 -0.750911	 -0.787274
  0.436259	 -0.747118	 -0.785751
  0.416250	 -0.741849	 -0.782940
  0.395530	 -0.739991	 -0.787811
  0.377184	 -0.740947	 -0.795784
  0.357300	 -0.741083	 -0.796332
  0.334481	 -0.739771	 -0.796923
  0.313414	 -0.738247	 -0.804180
  0.302398	 -0.735596	 -0.814407
  0.286241	 -0.730800	 -0.827815
  0.265282	 -0.728235	 -0.839943
  0.249027	 -0.722852	 -0.844582
  0.231902	 -0.715558	 -0.852560
  0.214455	 -0.711290	 -0.862835
  0.196447	 -0.708122	 -0.871660
  0.178863	 -0.700601	 -0.876899
  0.158806	 -0.690650	 -0.879969
  0.140803	 -0.688214	 -0.886276
  0.124788	 -0.685889	 -0.896818
  0.111199	 -0.678581	 -0.909399
  0.092456	 -0.671465	 -0.918983
  0.074039	 -0.666071	 -0.924756
  0.057778	 -0.656337	 -0.931541
  0.038860	 -0.645804	 -0.938677
  0.022899	 -0.642772	 -0.938309
  0.001218	 -0.637858	 -0.938588
 -0.018474	 -0.631766	 -0.942176
 -0.033855	 -0.622264	 -0.951165
 -0.050727	 -0.610438	 -0.962038
 -0.067563	 -0.604576	 -0.966636
 -0.086306	 -0.599279	 -0.968111
 -0.105910	 -0.594109	 -0.973672
 -0.127545	 -0.587700	 -0.983418
 -0.139299	 -0.586147	 -0.988503
 -0.161255	 -0.585342	 -0.993541
 -0.185998	 -0.589326	 -0.995123
 -0.203843	 -0.587839	 -0.997955
 -0.222284	 -0.583722	 -1.001875
 -0.239652	 -0.573220	 -1.006315
 -0.262145	 -0.568693	 -1.013595
 -0.279856	 -0.567961	 -1.016139
 -0.304035	 -0.566129	 -1.018566
 -0.320205	 -0.560544	 -1.019283
 -0.333494	 -0.549384	 -1.023642
 -0.353672	 -0.537644	 -1.043828
 -0.367807	 -0.533236	 -1.053073
 -0.389268	 -0.525204	 -1.051310
 -0.409270	 -0.521902	 -1.041141
 -0.431307	 -0.523921	 -1.036038
 -0.454534	 -0.524668	 -1.034241
 -0.477350	 -0.517309	 -1.036994
 -0.495507	 -0.507143	 -1.042860
 -0.503532	 -0.493036	 -1.048527
 -0.521230	 -0.481929	 -1.049190
 -0.539475	 -0.472651	 -1.052368
 -0.554539	 -0.462934	 -1.056262
 -0.573131	 -0.453915	 -1.057107
 -0.591736	 -0.445856	 -1.058771
 -0.610060	 -0.440028	 -1.057090
 -0.629272	 -0.435624	 -1.052889
 -0.648401	 -0.431572	 -1.048573
 -0.667559	 -0.427668	 -1.044375
 -0.686640	 -0.424448	 -1.039391
 -0.704899	 -0.426020	 -1.031390
 -0.723157	 -0.427698	 -1.023409
 -0.742151	 -0.429706	 -1.017608
 -0.761926	 -0.432400	 -1.017575
 -0.781551	 -0.435016	 -1.017691
 -0.796831	 -0.439241	 -1.024671
 -0.816678	 -0.447431	 -1.036077
 -0.833894	 -0.458088	 -1.042324
 -0.850527	 -0.468942	 -1.047102
 -0.862658	 -0.475850	 -1.053418
 -0.882539	 -0.480399	 -1.063915
 -0.900169	 -0.477671	 -1.070899
 -0.918593	 -0.476401	 -1.075283
 -0.939796	 -0.466193	 -1.076850
 -0.958395	 -0.460361	 -1.081217
 -0.976769	 -0.453421	 -1.087728
 -0.990006	 -0.441520	 -1.092280
 -1.005066	 -0.427489	 -1.095054
 -1.019859	 -0.414037	 -1.097116
 -1.034911	 -0.401015	 -1.099257
 -1.050291	 -0.389416	 -1.103382
 -1.064185	 -0.376690	 -1.108740
 -1.080584	 -0.367826	 -1.117114
 -1.095763	 -0.358824	 -1.127357
 -1.108485	 -0.350340	 -1.140979
 -1.117915	 -0.340624	 -1.156164
 -1.127449	 -0.330893	 -1.169298
 -1.139060	 -0.320868	 -1.182002
 -1.152419	 -0.311715	 -1.191733
 -1.166305	 -0.302078	 -1.202452
 -1.179390	 -0.293124	 -1.215971
 -1.189260	 -0.285951	 -1.231152
 -1.195505	 -0.279364	 -1.248290
 -1.204336	 -0.266538	 -1.267235
 -1.215487	 -0.254823	 -1.279865
 -1.233689	 -0.248392	 -1.288430
 -1.246423	 -0.243235	 -1.300574
 -1.255147	 -0.233636	 -1.317282
 -1.265395	 -0.224632	 -1.332482
 -1.281511	 -0.219136	 -1.344218
 -1.297786	 -0.211198	 -1.355795
 -1.307448	 -0.201593	 -1.369052
 -1.320760	 -0.194266	 -1.382076
 -1.337334	 -0.188433	 -1.393214
 -1.348994	 -0.178790	 -1.405643
 -1.362131	 -0.169914	 -1.418279
 -1.378778	 -0.164680	 -1.428143
 -1.392162	 -0.155917	 -1.439849
 -1.406317	 -0.142764	 -1.453022
 -1.423177	 -0.136532	 -1.461042
 -1.442412	 -0.135390	 -1.468437
 -1.459781	 -0.134044	 -1.475035
 -1.478454	 -0.128327	 -1.483714
 -1.496146	 -0.122386	 -1.490997
 -1.513861	 -0.116436	 -1.498124
 -1.531577	 -0.110476	 -1.505237
 -1.549460	 -0.103818	 -1.511228
 -1.567343	 -0.097159	 -1.517216
 -1.585419	 -0.090953	 -1.523107
 -1.603879	 -0.085745	 -1.528775
 -1.622340	 -0.080539	 -1.534442
 -1.640691	 -0.075012	 -1.540157
 -1.659011	 -0.069394	 -1.545885
 -1.677303	 -0.063809	 -1.551737
 -1.695544	 -0.058282	 -1.557794
 -1.713787	 -0.052762	 -1.563850
 -1.732791	 -0.049241	 -1.568991
 -1.751973	 -0.046325	 -1.573845
 -1.771156	 -0.043410	 -1.578695
 -1.790699	 -0.040662	 -1.581935
 -1.810369	 -0.038001	 -1.584388
 -1.830039	 -0.035340	 -1.586841
 -1.849553	 -0.032634	 -1.590290
 -1.869049	 -0.029924	 -1.593835
 -1.888514	 -0.026670	 -1.597077
 -1.907927	 -0.022845	 -1.599996
 -1.927258	 -0.019028	 -1.603419
 -1.946256	 -0.015254	 -1.608399
 -1.965256	 -0.011477	 -1.613387
 -1.983948	 -0.006942	 -1.619046
 -2.002287	 -0.001849	 -1.625188
