 -2.320933	  0.846645	 -0.202043
 -2.341263	  0.876328	 -0.233839
 -2.333519	  0.863778	 -0.220329
 -2.325772	  0.851230	 -0.206818
 -2.318384	  0.838729	 -0.193065
 -2.311336	  0.826284	 -0.179086
 -2.304300	  0.813855	 -0.165086
 -2.297563	  0.802297	 -0.150219
 -2.290850	  0.790815	 -0.135284
 -2.284010	  0.779535	 -0.120315
 -2.276476	  0.768742	 -0.105544
 -2.268071	  0.757937	 -0.091792
 -2.258728	  0.745971	 -0.076184
 -2.252011	  0.732882	 -0.062203
 -2.249213	  0.721401	 -0.045730
 -2.243797	  0.713464	 -0.028258
 -2.235762	  0.707266	 -0.011303
 -2.228047	  0.698674	  0.006358
 -2.223321	  0.687910	  0.023433
 -2.219897	  0.673906	  0.038394
 -2.212489	  0.659267	  0.048843
 -2.203263	  0.644704	  0.060530
 -2.193514	  0.631392	  0.072145
 -2.184612	  0.618108	  0.084813
 -2.177528	  0.606984	  0.099843
 -2.169374	  0.596065	  0.114557
 -2.160546	  0.585834	  0.129472
 -2.150876	  0.576195	  0.143918
 -2.141156	  0.565482	  0.157856
 -2.130478	  0.555777	  0.170199
 -2.116317	  0.546122	  0.182581
 -2.104122	  0.533332	  0.195687
 -2.096630	  0.520010	  0.206327
 -2.088343	  0.505182	  0.218687
 -2.076232	  0.494357	  0.231917
 -2.064854	  0.487278	  0.246074
 -2.055778	  0.481286	  0.264590
 -2.045915	  0.471028	  0.279530
 -2.037436	  0.456762	  0.290965
 -2.031012	  0.444424	  0.306175
 -2.026439	  0.435161	  0.322080
 -2.020730	  0.424029	  0.338548
 -2.015955	  0.412964	  0.354992
 -2.010333	  0.401161	  0.370852
 -2.006877	  0.389707	  0.387612
 -2.008151	  0.381273	  0.405435
 -2.011738	  0.375376	  0.424382
 -2.012575	  0.368871	  0.446689
 -2.014477	  0.364939	  0.463399
 -2.020888	  0.359803	  0.480286
 -2.031617	  0.356188	  0.502778
 -2.037886	  0.356836	  0.517016
 -2.046834	  0.355166	  0.534481
 -2.062105	  0.357034	  0.552381
 -2.070890	  0.354896	  0.568036
 -2.080145	  0.349864	  0.583220
 -2.092841	  0.345048	  0.600530
 -2.103969	  0.343430	  0.618938
 -2.115896	  0.346002	  0.633432
 -2.130193	  0.345759	  0.648399
 -2.145014	  0.344252	  0.660376
 -2.159723	  0.343005	  0.674963
 -2.173246	  0.341959	  0.689786
 -2.186661	  0.340933	  0.704584
 -2.199979	  0.339933	  0.719447
 -2.208248	  0.340133	  0.737634
 -2.216004	  0.340448	  0.756067
 -2.223753	  0.340766	  0.774502
 -2.231503	  0.341083	  0.792937
 -2.239252	  0.341401	  0.811372
 -2.247001	  0.341719	  0.829807
 -2.254667	  0.341948	  0.848255
 -2.257767	  0.336935	  0.867334
 -2.257649	  0.328781	  0.885586
 -2.257470	  0.320577	  0.903825
 -2.257179	  0.312291	  0.921985
 -2.250550	  0.299402	  0.935708
 -2.242116	  0.285542	  0.947398
 -2.233610	  0.271661	  0.959004
 -2.222649	  0.257457	  0.967786
 -2.208428	  0.243825	  0.971135
 -2.194149	  0.230204	  0.974387
 -2.179828	  0.216637	  0.977529
 -2.163142	  0.206070	  0.974544
 -2.146162	  0.196575	  0.969912
 -2.129177	  0.187099	  0.965251
 -2.112192	  0.177623	  0.960591
 -2.095196	  0.168171	  0.955927
 -2.077534	  0.160183	  0.951065
 -2.058448	  0.157516	  0.945766
 -2.039338	  0.154945	  0.940459
 -2.020227	  0.152373	  0.935152
 -2.001116	  0.149801	  0.929845
 -1.982005	  0.147229	  0.924538
 -1.962905	  0.144613	  0.919272
 -1.943728	  0.141448	  0.914586
 -1.924327	  0.138271	  0.910270
 -1.905277	  0.136510	  0.904614
 -1.886176	  0.141440	  0.901686
 -1.867241	  0.147819	  0.900211
 -1.848261	  0.154035	  0.899067
 -1.829286	  0.160250	  0.897924
 -1.810311	  0.166465	  0.896780
 -1.791335	  0.172680	  0.895637
 -1.772360	  0.178895	  0.894493
 -1.753385	  0.185111	  0.893350
 -1.734409	  0.191326	  0.892206
 -1.715434	  0.197540	  0.891062
 -1.696597	  0.203867	  0.890132
 -1.685351	  0.216170	  0.900986
 -1.675222	  0.228760	  0.912771
 -1.665109	  0.241351	  0.924569
 -1.654996	  0.253943	  0.936366
 -1.644883	  0.266534	  0.948164
 -1.634773	  0.279129	  0.959953
 -1.624535	  0.292013	  0.970895
 -1.613509	  0.304955	  0.980251
 -1.601368	  0.317783	  0.992881
 -1.590245	  0.327100	  1.006121
 -1.584399	  0.338343	  1.023424
 -1.577577	  0.351603	  1.035381
 -1.570096	  0.363292	  1.049590
 -1.562198	  0.373202	  1.065637
 -1.556411	  0.384872	  1.080703
 -1.550564	  0.398270	  1.094797
 -1.544040	  0.408582	  1.110788
 -1.535626	  0.414278	  1.127352
 -1.526256	  0.419678	  1.143243
 -1.517793	  0.421477	  1.164751
 -1.515055	  0.422859	  1.181075
 -1.509022	  0.424331	  1.200195
 -1.504314	  0.412877	  1.217926
 -1.496859	  0.399307	  1.230711
 -1.496337	  0.383301	  1.240002
 -1.496653	  0.366850	  1.249613
 -1.494522	  0.348309	  1.256519
 -1.492351	  0.328079	  1.260360
 -1.490886	  0.308628	  1.261123
 -1.489190	  0.288665	  1.260143
 -1.486676	  0.268203	  1.258701
 -1.481977	  0.248864	  1.255112
 -1.475943	  0.231191	  1.246932
 -1.472269	  0.214341	  1.236527
 -1.470225	  0.196694	  1.227814
 -1.466574	  0.178706	  1.219382
 -1.462247	  0.161108	  1.210839
 -1.457898	  0.143554	  1.202300
 -1.453575	  0.125968	  1.193836
 -1.450410	  0.106730	  1.189417
 -1.447332	  0.087407	  1.185279
 -1.444256	  0.068082	  1.181144
 -1.441179	  0.048758	  1.177009
 -1.438102	  0.029433	  1.172874
 -1.435026	  0.010109	  1.168739
 -1.431949	 -0.009216	  1.164604
 -1.428876	 -0.028544	  1.160489
 -1.426010	 -0.048092	  1.157624
 -1.424811	 -0.067168	  1.163394
 -1.423642	 -0.086234	  1.169319
 -1.422473	 -0.105300	  1.175244
 -1.421304	 -0.124367	  1.181170
 -1.420136	 -0.143433	  1.187095
 -1.418947	 -0.162445	  1.193112
 -1.416083	 -0.178759	  1.204312
 -1.412777	 -0.194464	  1.216318
 -1.408585	 -0.210219	  1.227838
 -1.403310	 -0.224490	  1.240819
 -1.397084	 -0.237109	  1.255035
 -1.390778	 -0.249630	  1.269294
 -1.382842	 -0.260029	  1.284418
 -1.374856	 -0.270363	  1.299564
 -1.365927	 -0.279192	  1.315128
 -1.356571	 -0.287369	  1.330793
 -1.344988	 -0.296914	  1.344000
 -1.332477	 -0.307017	  1.355888
 -1.320441	 -0.317240	  1.368146
 -1.312051	 -0.327969	  1.382780
 -1.303727	 -0.338701	  1.397462
 -1.295433	 -0.348990	  1.412462
 -1.287496	 -0.355689	  1.429544
 -1.279552	 -0.362349	  1.446646
 -1.270656	 -0.370494	  1.462596
 -1.261216	 -0.379529	  1.477736
 -1.251957	 -0.388783	  1.492849
 -1.245050	 -0.400365	  1.507612
 -1.238173	 -0.411977	  1.522372
 -1.230428	 -0.422901	  1.537225
 -1.221707	 -0.432994	  1.552127
 -1.213033	 -0.443235	  1.566951
 -1.205309	 -0.455685	  1.580559
 -1.197592	 -0.468173	  1.594142
 -1.189313	 -0.480513	  1.607528
 -1.180696	 -0.492750	  1.620793
 -1.171380	 -0.504295	  1.634205
 -1.160910	 -0.514568	  1.647798
 -1.150438	 -0.524836	  1.661396
 -1.141102	 -0.536016	  1.675099
 -1.131962	 -0.547342	  1.688817
 -1.122940	 -0.558529	  1.702724
 -1.114715	 -0.568731	  1.717831
 -1.106509	 -0.578910	  1.732965
 -1.098540	 -0.588796	  1.748417
 -1.090909	 -0.598263	  1.764295
 -1.083284	 -0.607736	  1.780173
 -1.075732	 -0.617943	  1.795626
 -1.068170	 -0.628303	  1.810969
 -1.059132	 -0.639600	  1.824772
 -1.049065	 -0.651511	  1.837291
 -1.039306	 -0.663881	  1.849606
 -1.030737	 -0.677721	  1.861222
 -1.022191	 -0.691587	  1.872829
 -1.013774	 -0.705255	  1.884759
 -1.005426	 -0.718806	  1.896869
 -0.996821	 -0.731970	  1.909222
 -0.987206	 -0.743439	  1.922485
 -0.977587	 -0.754886	  1.935768
 -0.968805	 -0.766754	  1.949259
 -0.960547	 -0.778863	  1.962866
 -0.951860	 -0.790437	  1.976666
 -0.941468	 -0.799613	  1.991075
 -0.931089	 -0.808833	  2.005450
 -0.923217	 -0.822674	  2.017527
 -0.915927	 -0.837322	  2.029027
 -0.908598	 -0.851581	  2.040982
 -0.901179	 -0.864735	  2.054092
 -0.893758	 -0.877870	  2.067222
 -0.886337	 -0.891004	  2.080353
 -0.878670	 -0.904517	  2.093890
 -0.867343	 -0.922836	  2.113176
 -0.858984	 -0.934893	  2.126768
