 -1.322171	 -1.603250	  1.193742
 -1.351274	 -1.598222	  1.212060
 -1.339394	 -1.600275	  1.204582
 -1.299507	 -1.607376	  1.178920
 -1.259099	 -1.614423	  1.152552
 -1.217725	 -1.621411	  1.125454
 -1.175462	 -1.628246	  1.097967
 -1.133755	 -1.634645	  1.071205
 -1.092378	 -1.641004	  1.044618
 -1.050818	 -1.648776	  1.017732
 -1.010575	 -1.658881	  0.991386
 -0.973183	 -1.671283	  0.965992
 -0.938776	 -1.685841	  0.941274
 -0.906071	 -1.702889	  0.916239
 -0.875424	 -1.721686	  0.891200
 -0.847127	 -1.741216	  0.866448
 -0.821705	 -1.760410	  0.842428
 -0.798912	 -1.779059	  0.819087
 -0.778334	 -1.797196	  0.796071
 -0.758487	 -1.815727	  0.771809
 -0.736231	 -1.836951	  0.742319
 -0.707886	 -1.862666	  0.703932
 -0.673069	 -1.892118	  0.657797
 -0.632834	 -1.923075	  0.606860
 -0.588177	 -1.954081	  0.554281
 -0.542298	 -1.983057	  0.505177
 -0.498006	 -2.007531	  0.461359
 -0.454875	 -2.028230	  0.421657
 -0.413383	 -2.046128	  0.386032
 -0.373968	 -2.060846	  0.353908
 -0.335634	 -2.071196	  0.324352
 -0.296723	 -2.075762	  0.295850
 -0.251038	 -2.073647	  0.264326
 -0.195105	 -2.062471	  0.229523
 -0.128613	 -2.039796	  0.194481
 -0.056169	 -2.005116	  0.164664
  0.012503	 -1.965844	  0.143415
  0.069827	 -1.931177	  0.128095
  0.116683	 -1.905469	  0.114299
  0.158483	 -1.886965	  0.099374
  0.201054	 -1.873702	  0.082182
  0.244844	 -1.865862	  0.063220
  0.288662	 -1.863342	  0.043090
  0.331949	 -1.865514	  0.021878
  0.374030	 -1.870666	  0.000069
  0.414382	 -1.877037	 -0.022115
  0.452353	 -1.883731	 -0.044194
  0.484478	 -1.889673	 -0.064410
  0.512522	 -1.895154	 -0.084937
  0.541932	 -1.900791	 -0.109185
  0.572985	 -1.906516	 -0.136870
  0.605331	 -1.912098	 -0.167216
  0.639692	 -1.917438	 -0.200182
  0.675261	 -1.922315	 -0.233916
  0.709221	 -1.926236	 -0.265936
  0.740373	 -1.929271	 -0.295994
  0.770862	 -1.931806	 -0.327105
  0.807379	 -1.934626	 -0.365372
  0.853575	 -1.938825	 -0.410816
  0.904563	 -1.944438	 -0.454343
  0.954337	 -1.950770	 -0.492889
  1.002965	 -1.958505	 -0.527963
  1.050181	 -1.967329	 -0.560328
  1.095246	 -1.976974	 -0.589957
  1.134682	 -1.986422	 -0.615627
  1.185548	 -2.001274	 -0.651471
  1.211455	 -2.009806	 -0.670122
