  1.460025	 -2.223564	  1.450858
  1.445570	 -2.201549	  1.436493
  1.407386	 -2.168247	  1.437781
  1.372361	 -2.132012	  1.435885
  1.337497	 -2.096195	  1.432639
  1.303009	 -2.059348	  1.429174
  1.270589	 -2.020881	  1.426218
  1.240455	 -1.981116	  1.424442
  1.211557	 -1.940164	  1.424120
  1.183644	 -1.898153	  1.423782
  1.156884	 -1.855299	  1.422812
  1.131100	 -1.811788	  1.420821
  1.104817	 -1.768188	  1.417666
  1.078301	 -1.725326	  1.413404
  1.051490	 -1.683039	  1.408082
  1.024302	 -1.641371	  1.401767
  0.996869	 -1.600514	  1.394246
  0.969240	 -1.560432	  1.385405
  0.941394	 -1.521176	  1.375037
  0.912586	 -1.481997	  1.363263
  0.883278	 -1.442417	  1.352308
  0.853949	 -1.402604	  1.342852
  0.825153	 -1.363012	  1.334694
  0.796292	 -1.322522	  1.327471
  0.768473	 -1.281874	  1.321342
  0.740971	 -1.240882	  1.317155
  0.711230	 -1.201526	  1.312639
  0.683216	 -1.161902	  1.300845
  0.646390	 -1.128455	  1.295180
  0.612215	 -1.090794	  1.293895
  0.583463	 -1.048656	  1.292829
  0.556316	 -1.005480	  1.293284
  0.527450	 -0.964033	  1.295204
  0.497602	 -0.923917	  1.297433
  0.466677	 -0.884432	  1.299244
  0.435124	 -0.845398	  1.298016
  0.403222	 -0.807061	  1.291944
  0.371171	 -0.769898	  1.281093
  0.339706	 -0.733022	  1.267086
  0.310191	 -0.696040	  1.250555
  0.282018	 -0.658801	  1.232589
  0.255883	 -0.618567	  1.216774
  0.231339	 -0.574989	  1.205307
  0.206754	 -0.530200	  1.196172
  0.182274	 -0.485304	  1.188551
  0.158460	 -0.441100	  1.181503
  0.135249	 -0.397597	  1.174068
  0.112487	 -0.354588	  1.166947
  0.088700	 -0.311207	  1.160247
  0.062856	 -0.268408	  1.153305
  0.034928	 -0.227457	  1.145057
  0.005374	 -0.188496	  1.135351
 -0.024814	 -0.150537	  1.124033
 -0.055833	 -0.112165	  1.111326
 -0.088245	 -0.073375	  1.099790
 -0.120879	 -0.034282	  1.091719
 -0.152501	  0.004688	  1.085636
 -0.183755	  0.043852	  1.080966
 -0.214687	  0.082593	  1.078358
 -0.245993	  0.121945	  1.078027
 -0.277318	  0.161757	  1.079656
 -0.308438	  0.201672	  1.081620
 -0.339210	  0.241573	  1.083652
 -0.369725	  0.281518	  1.086172
 -0.400841	  0.320894	  1.089002
 -0.431843	  0.358803	  1.091010
 -0.463880	  0.397345	  1.091568
 -0.495537	  0.436587	  1.088439
 -0.525747	  0.473433	  1.080208
 -0.557293	  0.506275	  1.064650
 -0.601003	  0.526485	  1.041403
 -0.670202	  0.525432	  1.024411
 -0.763067	  0.510512	  1.016517
 -0.869903	  0.488657	  1.008322
 -0.979491	  0.472440	  0.996255
 -1.079352	  0.461930	  0.975954
 -1.164925	  0.458654	  0.954910
 -1.238410	  0.467607	  0.940577
 -1.297369	  0.488709	  0.934556
 -1.342601	  0.522339	  0.936416
 -1.380108	  0.574166	  0.945709
 -1.411920	  0.647456	  0.959148
 -1.431431	  0.738877	  0.975780
 -1.435444	  0.836438	  0.990641
 -1.424567	  0.928358	  0.999371
 -1.400969	  1.008742	  1.002369
 -1.376389	  1.076695	  1.004218
 -1.354158	  1.136195	  1.006297
 -1.332615	  1.194288	  1.009053
 -1.311678	  1.255018	  1.011715
 -1.294306	  1.316322	  1.013180
 -1.283301	  1.374626	  1.013518
 -1.279711	  1.426927	  1.011858
 -1.282508	  1.474252	  1.008751
 -1.291472	  1.521217	  1.005599
 -1.307934	  1.568906	  1.001775
 -1.331547	  1.614335	  0.995692
 -1.360708	  1.656158	  0.987343
 -1.393525	  1.694301	  0.977574
 -1.428557	  1.729489	  0.967271
 -1.465202	  1.762551	  0.955618
 -1.501688	  1.794903	  0.941878
 -1.535835	  1.828837	  0.927757
 -1.568658	  1.864132	  0.913981
 -1.601110	  1.900195	  0.901046
 -1.633708	  1.936770	  0.889287
 -1.666289	  1.973748	  0.879196
 -1.697661	  2.011348	  0.871519
 -1.726252	  2.051481	  0.866940
 -1.753273	  2.093139	  0.863614
 -1.779732	  2.135050	  0.859725
 -1.806015	  2.177954	  0.854070
 -1.829235	  2.222439	  0.845379
 -1.847527	  2.244664	  0.853832
