  1.427318	  0.639821	  1.934242
  1.437089	  0.642322	  1.947609
  1.423968	  0.638508	  1.932865
  1.413593	  0.634055	  1.916527
  1.404563	  0.629008	  1.900106
  1.394340	  0.621577	  1.883149
  1.380715	  0.615193	  1.867462
  1.370909	  0.613843	  1.853156
  1.363278	  0.608869	  1.835344
  1.353392	  0.606464	  1.815339
  1.342869	  0.604656	  1.798973
  1.336522	  0.598267	  1.780493
  1.328635	  0.593089	  1.762592
  1.319870	  0.591784	  1.746808
  1.313154	  0.588034	  1.727088
  1.304698	  0.588103	  1.708144
  1.288445	  0.590144	  1.692452
  1.278186	  0.585922	  1.676836
  1.273160	  0.579535	  1.657936
  1.265197	  0.576451	  1.638676
  1.254479	  0.579451	  1.623255
  1.242450	  0.582061	  1.605125
  1.230343	  0.584028	  1.589708
  1.220420	  0.584464	  1.573247
  1.209199	  0.585282	  1.556116
  1.198095	  0.585137	  1.539892
  1.187092	  0.582845	  1.523872
  1.172596	  0.582133	  1.506458
  1.163812	  0.583718	  1.491859
  1.153020	  0.584624	  1.473454
  1.141086	  0.583602	  1.456924
  1.129335	  0.579071	  1.442043
  1.116547	  0.574736	  1.425551
  1.105240	  0.574669	  1.409718
  1.094375	  0.573463	  1.392629
  1.085455	  0.570182	  1.376219
  1.074955	  0.566970	  1.358536
  1.066403	  0.563588	  1.341296
  1.058735	  0.559122	  1.322450
  1.052190	  0.552532	  1.304327
  1.042967	  0.546635	  1.287742
  1.034069	  0.542779	  1.270660
  1.026429	  0.539971	  1.252989
  1.017725	  0.535538	  1.234680
  1.007877	  0.531046	  1.217477
  0.996070	  0.529334	  1.201731
  0.984802	  0.527820	  1.184936
  0.974496	  0.526227	  1.167664
  0.965007	  0.524120	  1.150262
  0.956416	  0.524095	  1.132148
  0.947672	  0.525203	  1.114019
  0.938594	  0.527323	  1.096058
  0.928481	  0.530185	  1.079135
  0.917943	  0.531537	  1.062362
  0.907537	  0.532083	  1.045345
  0.898163	  0.532720	  1.027586
  0.889023	  0.533508	  1.010090
  0.880198	  0.533025	  0.992199
  0.871535	  0.532000	  0.974145
  0.863254	  0.529986	  0.956039
  0.855059	  0.527471	  0.937972
  0.846896	  0.524992	  0.919872
  0.838223	  0.522003	  0.902105
  0.829610	  0.519121	  0.884283
  0.820414	  0.516646	  0.866696
  0.811181	  0.514329	  0.849430
  0.803131	  0.511633	  0.831855
  0.793376	  0.509688	  0.812370
  0.783637	  0.510629	  0.794598
  0.771273	  0.509573	  0.779713
  0.758774	  0.506539	  0.764958
  0.746011	  0.506097	  0.747758
  0.738102	  0.506962	  0.730330
  0.731325	  0.506579	  0.711186
  0.720842	  0.506540	  0.693324
  0.709518	  0.503976	  0.678069
  0.699267	  0.501158	  0.661377
  0.688929	  0.503740	  0.641001
  0.683186	  0.502679	  0.623382
  0.673678	  0.499281	  0.605142
  0.664633	  0.494810	  0.587172
  0.658828	  0.491209	  0.568568
  0.654380	  0.483639	  0.550310
  0.646747	  0.475354	  0.533642
  0.642230	  0.462129	  0.518195
  0.637489	  0.450973	  0.499334
  0.623860	  0.443062	  0.483407
  0.610705	  0.439386	  0.469925
  0.601322	  0.441357	  0.452021
  0.585706	  0.437680	  0.438331
  0.574458	  0.424210	  0.423575
  0.563942	  0.408444	  0.410039
  0.559112	  0.402730	  0.396441
  0.546661	  0.395350	  0.381735
  0.532263	  0.389077	  0.368169
  0.517783	  0.386086	  0.352288
  0.504349	  0.385551	  0.336521
  0.488906	  0.386238	  0.323570
  0.473757	  0.384266	  0.311312
  0.461036	  0.380725	  0.296620
  0.450521	  0.380183	  0.279236
  0.436485	  0.383292	  0.263536
  0.422658	  0.382757	  0.249966
  0.410787	  0.378232	  0.234443
  0.400711	  0.373293	  0.217769
  0.390199	  0.369730	  0.200501
  0.379584	  0.368248	  0.183684
  0.364317	  0.369977	  0.168413
  0.352918	  0.366840	  0.153127
  0.343634	  0.362231	  0.136493
  0.333683	  0.358017	  0.119578
  0.323191	  0.354069	  0.103339
  0.311495	  0.352127	  0.084873
  0.300765	  0.353032	  0.067409
  0.296150	  0.353279	  0.048999
  0.290214	  0.349786	  0.030690
  0.285750	  0.348249	  0.009716
  0.278860	  0.352195	 -0.009551
  0.270789	  0.353504	 -0.027211
  0.261557	  0.357670	 -0.045447
  0.251986	  0.360004	 -0.062690
  0.235714	  0.359115	 -0.076286
  0.225647	  0.358887	 -0.094435
  0.217546	  0.359346	 -0.111164
  0.209913	  0.361919	 -0.131772
  0.200318	  0.361933	 -0.150667
  0.182041	  0.359585	 -0.160486
  0.166598	  0.361639	 -0.176517
  0.160671	  0.365286	 -0.192304
  0.149816	  0.369527	 -0.209776
  0.137695	  0.374806	 -0.227280
  0.124938	  0.373755	 -0.242103
  0.110781	  0.372148	 -0.255574
  0.095864	  0.375638	 -0.272105
  0.087414	  0.380793	 -0.290646
  0.080614	  0.379990	 -0.306487
  0.069271	  0.376882	 -0.324221
  0.057193	  0.374313	 -0.339932
  0.044574	  0.375220	 -0.358368
  0.034910	  0.376975	 -0.376022
  0.025660	  0.371099	 -0.391453
  0.012465	  0.364648	 -0.404787
  0.000461	  0.357930	 -0.424567
 -0.006819	  0.356167	 -0.442935
 -0.015910	  0.359926	 -0.459056
 -0.027570	  0.362687	 -0.476446
 -0.039201	  0.361179	 -0.492067
 -0.052604	  0.359053	 -0.505927
 -0.067419	  0.355124	 -0.523307
 -0.078168	  0.353944	 -0.538952
 -0.087909	  0.353709	 -0.555061
 -0.097000	  0.351805	 -0.570826
 -0.105468	  0.349779	 -0.592134
 -0.111042	  0.347106	 -0.616892
 -0.125181	  0.343659	 -0.629041
 -0.143896	  0.340678	 -0.638867
 -0.156735	  0.336210	 -0.650234
 -0.167934	  0.335386	 -0.667565
 -0.179071	  0.328072	 -0.685751
 -0.189915	  0.317830	 -0.703402
 -0.199176	  0.312734	 -0.718545
 -0.205954	  0.309268	 -0.733601
 -0.215156	  0.304669	 -0.753442
 -0.232727	  0.301645	 -0.766164
 -0.249191	  0.294134	 -0.777171
 -0.262397	  0.292504	 -0.791858
 -0.272072	  0.291286	 -0.809295
 -0.281985	  0.286104	 -0.825804
 -0.294799	  0.278656	 -0.841488
 -0.305841	  0.267335	 -0.855464
 -0.316090	  0.257266	 -0.867691
 -0.328299	  0.246252	 -0.878725
 -0.339820	  0.238378	 -0.890281
 -0.352181	  0.222954	 -0.900708
 -0.363906	  0.207035	 -0.908152
 -0.373896	  0.193662	 -0.915393
 -0.381701	  0.178035	 -0.922332
 -0.392922	  0.160241	 -0.929981
 -0.401799	  0.143924	 -0.935755
 -0.407129	  0.128567	 -0.941475
 -0.412406	  0.107323	 -0.946079
 -0.420740	  0.088764	 -0.950129
 -0.424480	  0.072662	 -0.955864
 -0.426786	  0.052424	 -0.959254
 -0.431513	  0.031725	 -0.964876
 -0.435905	  0.015215	 -0.975120
 -0.442185	 -0.002933	 -0.980539
 -0.447542	 -0.022204	 -0.983222
 -0.453663	 -0.039937	 -0.988727
 -0.460109	 -0.058264	 -0.996271
 -0.467388	 -0.075962	 -0.999048
 -0.474438	 -0.094561	 -1.002345
 -0.480426	 -0.113271	 -1.009637
 -0.486728	 -0.132833	 -1.015806
 -0.494243	 -0.148844	 -1.019322
 -0.500575	 -0.165529	 -1.026176
 -0.507128	 -0.184888	 -1.036315
 -0.516563	 -0.200512	 -1.042998
 -0.525241	 -0.218678	 -1.044382
 -0.527740	 -0.237876	 -1.051799
 -0.533723	 -0.254708	 -1.063853
 -0.541898	 -0.267343	 -1.072659
 -0.545683	 -0.286220	 -1.079868
 -0.546297	 -0.306579	 -1.089258
 -0.552850	 -0.320649	 -1.101157
 -0.560559	 -0.335581	 -1.113943
 -0.563503	 -0.352066	 -1.123942
 -0.563691	 -0.369586	 -1.132945
 -0.563368	 -0.385667	 -1.145534
 -0.564463	 -0.401802	 -1.158465
 -0.563941	 -0.417466	 -1.171253
 -0.561389	 -0.430097	 -1.185122
 -0.559126	 -0.440637	 -1.202768
 -0.557822	 -0.451766	 -1.221522
 -0.553090	 -0.461978	 -1.237034
 -0.552476	 -0.464218	 -1.255767
 -0.555351	 -0.459367	 -1.275699
 -0.548471	 -0.457795	 -1.298918
 -0.537163	 -0.459139	 -1.316898
 -0.536093	 -0.462424	 -1.335860
 -0.537615	 -0.464934	 -1.356894
 -0.547381	 -0.460749	 -1.373789
 -0.550061	 -0.457494	 -1.393570
 -0.551954	 -0.454557	 -1.413242
 -0.558442	 -0.450961	 -1.431649
 -0.566311	 -0.442444	 -1.450666
 -0.570995	 -0.435416	 -1.466936
 -0.577651	 -0.429831	 -1.485064
 -0.583136	 -0.425315	 -1.503675
 -0.589500	 -0.420221	 -1.522313
 -0.596514	 -0.415093	 -1.540384
 -0.603525	 -0.409975	 -1.558402
 -0.610583	 -0.404806	 -1.576386
 -0.618790	 -0.398379	 -1.593454
 -0.627007	 -0.391939	 -1.610513
 -0.635224	 -0.385500	 -1.627573
 -0.643441	 -0.379061	 -1.644632
 -0.651658	 -0.372622	 -1.661691
 -0.659875	 -0.366182	 -1.678750
 -0.668092	 -0.359743	 -1.695809
 -0.676309	 -0.353304	 -1.712869
 -0.684525	 -0.346797	 -1.729878
 -0.692585	 -0.332075	 -1.740704
 -0.699777	 -0.314640	 -1.747343
 -0.706962	 -0.297183	 -1.753947
 -0.714147	 -0.279726	 -1.760552
 -0.721333	 -0.262268	 -1.767156
 -0.728518	 -0.244811	 -1.773761
 -0.735703	 -0.227354	 -1.780365
 -0.742948	 -0.209973	 -1.786967
 -0.751250	 -0.192625	 -1.791538
 -0.759880	 -0.176289	 -1.783508
 -0.767855	 -0.160389	 -1.774305
 -0.773122	 -0.142202	 -1.764959
 -0.778874	 -0.125551	 -1.756588
 -0.785136	 -0.107058	 -1.752536
 -0.792356	 -0.087886	 -1.749091
 -0.797208	 -0.068342	 -1.747148
 -0.797008	 -0.047513	 -1.742205
 -0.797060	 -0.029218	 -1.735729
 -0.800026	 -0.010993	 -1.729258
 -0.800976	  0.008222	 -1.727822
 -0.800793	  0.027725	 -1.727762
 -0.796110	  0.047084	 -1.733069
 -0.793420	  0.065260	 -1.737009
 -0.794242	  0.084184	 -1.740594
 -0.794028	  0.101327	 -1.754625
 -0.790690	  0.114265	 -1.768863
 -0.783408	  0.127122	 -1.782057
 -0.777133	  0.139378	 -1.794342
 -0.776429	  0.147845	 -1.813139
 -0.779272	  0.148721	 -1.833095
 -0.782934	  0.147713	 -1.851866
 -0.793828	  0.148074	 -1.870076
 -0.805883	  0.148971	 -1.887337
 -0.814894	  0.145694	 -1.904035
 -0.824177	  0.141379	 -1.920394
 -0.836476	  0.140201	 -1.937957
 -0.845585	  0.136312	 -1.954624
 -0.854633	  0.131859	 -1.971151
 -0.866849	  0.131158	 -1.988657
 -0.875683	  0.127522	 -2.006456
 -0.883432	  0.123148	 -2.022632
 -0.895403	  0.122897	 -2.040404
 -0.903448	  0.119323	 -2.058157
 -0.912033	  0.115645	 -2.074854
 -0.923836	  0.115143	 -2.093215
 -0.932626	  0.112722	 -2.111322
 -0.940389	  0.109433	 -2.126655
 -0.952275	  0.109080	 -2.146428
 -0.961092	  0.107104	 -2.163831
 -0.969089	  0.104443	 -2.179387
 -0.979632	  0.103912	 -2.198249
 -0.988033	  0.102217	 -2.216094
 -0.995523	  0.100549	 -2.233042
 -1.005077	  0.098977	 -2.253258
 -1.013176	  0.098038	 -2.270918
 -1.025487	  0.096520	 -2.298451
 -1.033523	  0.095429	 -2.316734
