 -0.130454	 -2.899672	  0.869360
 -0.129162	 -2.870962	  0.860752
 -0.138025	 -2.826785	  0.889943
 -0.152116	 -2.785145	  0.916327
 -0.156066	 -2.742405	  0.939356
 -0.167472	 -2.703699	  0.966261
 -0.174258	 -2.658468	  0.986520
 -0.183691	 -2.616630	  1.016255
 -0.198369	 -2.577633	  1.044231
 -0.211584	 -2.539637	  1.070204
 -0.223392	 -2.499866	  1.097225
 -0.235904	 -2.459401	  1.124190
 -0.248672	 -2.418051	  1.150758
 -0.260196	 -2.375441	  1.175039
 -0.269078	 -2.333685	  1.197943
 -0.277161	 -2.289079	  1.221472
 -0.298764	 -2.245618	  1.237991
 -0.322978	 -2.206089	  1.259100
 -0.328004	 -2.164328	  1.284606
 -0.334312	 -2.123637	  1.312708
 -0.340413	 -2.081181	  1.339414
 -0.346542	 -2.037938	  1.365213
 -0.356979	 -1.995353	  1.388441
 -0.373574	 -1.955600	  1.409401
 -0.395003	 -1.916916	  1.431510
 -0.418867	 -1.877408	  1.453650
 -0.443587	 -1.836546	  1.475916
 -0.466263	 -1.795649	  1.497420
 -0.482150	 -1.752296	  1.520915
 -0.491560	 -1.710945	  1.545188
 -0.498624	 -1.669763	  1.570893
 -0.505531	 -1.628242	  1.596558
 -0.513321	 -1.585717	  1.622866
 -0.522554	 -1.545183	  1.647989
 -0.532573	 -1.505015	  1.674043
 -0.544315	 -1.466623	  1.698738
 -0.557910	 -1.427306	  1.724574
 -0.567295	 -1.387503	  1.754760
 -0.573558	 -1.348013	  1.784920
 -0.580146	 -1.309262	  1.812114
 -0.587376	 -1.268030	  1.839518
 -0.595312	 -1.225011	  1.866378
 -0.604484	 -1.181284	  1.891613
 -0.614462	 -1.139533	  1.913949
 -0.625501	 -1.097422	  1.935330
 -0.637712	 -1.053007	  1.956973
 -0.651157	 -1.008025	  1.978744
 -0.672553	 -0.965321	  1.997415
 -0.681826	 -0.922362	  2.017232
 -0.686231	 -0.877515	  2.036758
 -0.694275	 -0.831532	  2.060106
 -0.704215	 -0.789971	  2.085852
 -0.718638	 -0.751383	  2.110809
 -0.738264	 -0.714907	  2.138661
 -0.755387	 -0.678217	  2.166786
 -0.771171	 -0.639557	  2.194740
 -0.786547	 -0.602169	  2.222004
 -0.802478	 -0.563671	  2.249492
 -0.817767	 -0.522345	  2.275656
 -0.831774	 -0.479982	  2.300193
 -0.844326	 -0.438133	  2.323225
 -0.855999	 -0.396003	  2.345856
 -0.866831	 -0.354651	  2.367936
 -0.877540	 -0.312140	  2.390899
 -0.888014	 -0.269952	  2.414220
 -0.898775	 -0.226801	  2.438842
 -0.909060	 -0.184699	  2.463750
 -0.918146	 -0.144910	  2.487743
 -0.924978	 -0.103995	  2.511229
 -0.930497	 -0.061584	  2.539801
 -0.938863	 -0.020062	  2.569048
 -0.949291	  0.022488	  2.597601
 -0.959705	  0.062897	  2.625121
 -0.970024	  0.101665	  2.651852
 -0.981286	  0.140962	  2.678553
 -0.993579	  0.180003	  2.703844
 -1.007203	  0.220151	  2.728110
 -1.022396	  0.262547	  2.751649
 -1.038226	  0.303377	  2.771688
 -1.055563	  0.344378	  2.786968
 -1.066118	  0.347821	  2.814838
