 0.0 0.0 0.0 0
 0.7583609140190245 0.41260346282307103 -0.5044810269520953 1000
 0.8803527739618959 -0.4682658731693996 -0.06987177829778614 1000
 0.44565959562934226 0.03631618207025748 -0.8948958932430808 1000
 -0.8949945151682592 0.1359176748558406 -0.42618799077462843 1000
 0.8245791534984533 0.5651717286621191 -0.004810066199811169 1000
 0.4409042411812386 -0.8906177175708534 0.10758499550253343 1000
 0.9553562153887584 -0.003705316368837641 -0.2963203880070955 1000
 -0.46970705137011626 0.4583822109408696 0.7550880972351183 1000
 0.0 0.0 0.0 0
 0.015382175421769118 0.9799881724445134 -0.19886822407855204 1000
 -0.5508370751499847 -0.3392557946088449 0.7628682864456561 1000
 -0.2902810163178174 0.14331540935962397 -0.9456953129869994 1000
 -0.8781741216612967 0.3262414765888589 0.35080295180846366 1000
 0.47835833607021533 0.5915967926418061 0.6488671183286014 1000
 -0.205606048543489 -0.8722053207503756 0.44318509818930885 1000
 0.4556961578413654 -0.8523480838469817 -0.25456778211509107 1000
 -0.8759109373066717 -0.16092481296240593 0.45507607548580586 1000
 0.0 0.0 0.0 0
 0.006087082176117198 -0.6605466220732383 -0.7498847294739479 1000
 0.09331614790814326 0.045973330150794085 -0.9940867917110819 1000
 0.02820645669549649 -0.3196601682002193 -0.9468546734673136 1000
 0.1535944620954898 0.5272600722793785 -0.8354816319905195 1000
 0.3556551512012443 0.7894766727673326 0.5013900643014801 1000
 -0.6388879011857661 -0.30540123497736127 -0.7059754495680071 1000
 0.3768752222766383 0.7793792129871171 -0.5007106042391323 1000
 0.7865412753378862 -0.4305440496523517 0.4432816751218183 1000
 0.0 0.0 0.0 0
 -0.8224190019462507 0.5630954236725138 -0.07899068981092347 1000
 -0.4026180814319389 -0.9149589957756479 -0.0165141319264201 1000
 0.8269734614665524 0.026599865660784733 0.5628963858267853 1000
 -0.1255101493358094 -0.7766088341311612 0.6171619894024111 1000
 -0.6701339301101199 0.10427368467236964 0.7345158367251262 1000
 0.059179416761210496 0.7991433085541574 0.5969395019806598 1000
