  0.966686	  2.304232	 -0.135335
  0.967834	  2.300985	 -0.136988
  0.972882	  2.286707	 -0.144259
  0.976446	  2.271018	 -0.154692
  0.973627	  2.252311	 -0.161142
  0.972520	  2.233238	 -0.167037
  0.971104	  2.214019	 -0.176087
  0.969148	  2.196389	 -0.187711
  0.957916	  2.184588	 -0.197895
  0.947272	  2.170114	 -0.205385
  0.934106	  2.157618	 -0.217920
  0.922510	  2.147486	 -0.229771
  0.913889	  2.134314	 -0.241586
  0.900701	  2.121915	 -0.251257
  0.890434	  2.112701	 -0.265141
  0.879913	  2.099734	 -0.275537
  0.871584	  2.085972	 -0.288688
  0.863981	  2.073506	 -0.304294
  0.856789	  2.059672	 -0.313270
  0.845980	  2.045742	 -0.325669
  0.832147	  2.032322	 -0.335228
  0.821574	  2.021050	 -0.348371
  0.810736	  2.006802	 -0.357523
  0.799147	  1.991278	 -0.362264
  0.788343	  1.974194	 -0.366450
  0.778669	  1.957059	 -0.372268
  0.767876	  1.942396	 -0.379849
  0.755871	  1.927808	 -0.384949
  0.743568	  1.911014	 -0.389575
  0.734450	  1.893037	 -0.390119
  0.726312	  1.874401	 -0.390628
  0.718455	  1.856233	 -0.391972
  0.712171	  1.836817	 -0.394254
  0.708087	  1.817136	 -0.395216
  0.702545	  1.797522	 -0.397038
  0.697016	  1.778973	 -0.395295
  0.692956	  1.759908	 -0.390972
  0.695213	  1.740216	 -0.383246
  0.698615	  1.718967	 -0.380668
  0.696566	  1.701415	 -0.376593
  0.693301	  1.682628	 -0.369617
  0.692698	  1.662095	 -0.363646
  0.695477	  1.642261	 -0.358211
  0.699751	  1.625878	 -0.349470
  0.701298	  1.608713	 -0.340210
  0.702333	  1.591279	 -0.329668
  0.705409	  1.575165	 -0.317016
  0.712505	  1.559176	 -0.302730
  0.721966	  1.545149	 -0.292022
  0.726996	  1.528926	 -0.284369
  0.731923	  1.511520	 -0.275003
  0.736672	  1.496072	 -0.263584
  0.741586	  1.480879	 -0.250512
  0.744817	  1.466932	 -0.237157
  0.749339	  1.451343	 -0.224868
  0.755867	  1.436371	 -0.213246
  0.763376	  1.421868	 -0.201701
  0.770885	  1.407357	 -0.190166
  0.778245	  1.392799	 -0.178777
  0.774580	  1.373388	 -0.177612
  0.764860	  1.357066	 -0.183637
  0.754811	  1.341211	 -0.190338
  0.744678	  1.325408	 -0.197420
  0.734853	  1.309281	 -0.204527
  0.725315	  1.293664	 -0.212246
  0.716007	  1.276751	 -0.218641
  0.706964	  1.260696	 -0.226121
  0.697416	  1.243995	 -0.231854
  0.687685	  1.227528	 -0.237427
  0.677952	  1.211925	 -0.245178
  0.667794	  1.195701	 -0.251957
  0.658228	  1.179030	 -0.257173
  0.648799	  1.162781	 -0.263229
  0.638796	  1.148495	 -0.269215
  0.627660	  1.130635	 -0.276467
  0.623748	  1.113463	 -0.281058
  0.611760	  1.088845	 -0.287256
  0.608981	  1.074244	 -0.291737
  0.604312	  1.057224	 -0.292354
  0.596189	  1.035920	 -0.299478
  0.592469	  1.017485	 -0.301190
  0.590098	  0.997305	 -0.297503
  0.588924	  0.976472	 -0.300898
  0.582201	  0.958706	 -0.307644
  0.581972	  0.938407	 -0.308019
  0.580725	  0.919150	 -0.311817
  0.580055	  0.902717	 -0.323113
  0.583684	  0.885052	 -0.324718
  0.589900	  0.869098	 -0.330752
  0.586161	  0.849024	 -0.339442
  0.587428	  0.839111	 -0.358549
  0.589336	  0.825589	 -0.370015
  0.595777	  0.817880	 -0.386693
  0.604453	  0.809181	 -0.394951
  0.611786	  0.811168	 -0.414031
  0.616791	  0.821089	 -0.433209
  0.617825	  0.832339	 -0.450399
  0.621816	  0.846687	 -0.461795
  0.622754	  0.862724	 -0.474061
  0.622868	  0.877835	 -0.487671
  0.623700	  0.887996	 -0.504864
  0.624726	  0.897271	 -0.522559
  0.625775	  0.906432	 -0.540103
  0.627793	  0.915765	 -0.556424
  0.630786	  0.924652	 -0.574273
  0.633467	  0.930881	 -0.597140
  0.632073	  0.937230	 -0.615666
  0.633286	  0.940780	 -0.634626
  0.636831	  0.939584	 -0.653110
  0.639930	  0.939126	 -0.674367
  0.644538	  0.934653	 -0.692695
  0.649717	  0.929570	 -0.711790
  0.653334	  0.922296	 -0.730416
  0.657336	  0.917761	 -0.748899
  0.662443	  0.910152	 -0.766265
  0.668068	  0.900073	 -0.782521
  0.674104	  0.888729	 -0.797259
  0.682651	  0.877769	 -0.812054
  0.689482	  0.863609	 -0.825303
  0.693636	  0.845936	 -0.834868
  0.701538	  0.831804	 -0.845137
  0.709789	  0.818521	 -0.857275
  0.716606	  0.804269	 -0.873538
  0.717280	  0.791937	 -0.888669
  0.718884	  0.776916	 -0.903335
  0.723379	  0.764559	 -0.918547
  0.729461	  0.752369	 -0.931371
  0.733477	  0.737276	 -0.944075
  0.739980	  0.724585	 -0.955712
  0.751186	  0.712877	 -0.978114
  0.759954	  0.708579	 -0.998386
  0.761326	  0.695328	 -1.008278
  0.761014	  0.681384	 -1.021810
  0.766248	  0.671831	 -1.040166
  0.768137	  0.664632	 -1.060577
  0.767959	  0.653836	 -1.080227
  0.772834	  0.644712	 -1.092557
  0.777400	  0.633628	 -1.109847
  0.778197	  0.621831	 -1.126582
  0.779350	  0.611057	 -1.144205
  0.785833	  0.601932	 -1.161825
  0.790529	  0.592238	 -1.178132
  0.794693	  0.577865	 -1.191621
  0.798469	  0.562390	 -1.203287
  0.803494	  0.548006	 -1.217036
  0.810647	  0.532907	 -1.228026
  0.818913	  0.517066	 -1.237069
  0.827094	  0.501222	 -1.246134
  0.834239	  0.486263	 -1.257359
  0.840981	  0.471862	 -1.269595
  0.847400	  0.457786	 -1.282285
  0.853684	  0.443868	 -1.295273
  0.858123	  0.431568	 -1.310553
  0.862073	  0.419917	 -1.326340
  0.865229	  0.408815	 -1.342742
  0.868477	  0.397669	 -1.359101
  0.872010	  0.387419	 -1.375778
  0.875598	  0.378036	 -1.393163
  0.880477	  0.369812	 -1.410656
  0.884612	  0.365055	 -1.429599
  0.888206	  0.362209	 -1.449057
  0.891493	  0.361557	 -1.468733
  0.894408	  0.363552	 -1.488402
  0.897248	  0.365690	 -1.508082
  0.900070	  0.367868	 -1.527763
  0.902924	  0.370038	 -1.547440
  0.905831	  0.372045	 -1.567129
  0.909694	  0.373297	 -1.586712
  0.918495	  0.370402	 -1.604437
  0.927406	  0.367333	 -1.622030
  0.936464	  0.365308	 -1.639262
  0.945942	  0.364217	 -1.656169
  0.957273	  0.359361	 -1.674331
  0.966803	  0.351786	 -1.690672
  0.973788	  0.348663	 -1.707658
  0.982996	  0.345422	 -1.726363
  0.992456	  0.341407	 -1.743399
  1.005848	  0.333227	 -1.757019
  1.019033	  0.323426	 -1.770515
  1.030243	  0.314178	 -1.782963
  1.038675	  0.308422	 -1.799951
  1.047572	  0.298151	 -1.818309
  1.058077	  0.284757	 -1.829445
  1.072517	  0.273350	 -1.836078
  1.083703	  0.261720	 -1.848787
  1.093053	  0.252808	 -1.864261
  1.099899	  0.242164	 -1.879904
  1.107760	  0.228054	 -1.891809
  1.117028	  0.213670	 -1.901869
  1.125206	  0.195088	 -1.911081
  1.130960	  0.182635	 -1.921899
  1.139034	  0.167015	 -1.932889
  1.145380	  0.150322	 -1.940161
  1.149663	  0.130542	 -1.944225
  1.153683	  0.111320	 -1.947986
  1.157702	  0.092085	 -1.951711
  1.161715	  0.072842	 -1.955416
  1.165676	  0.053560	 -1.958915
  1.167734	  0.033886	 -1.955988
  1.168483	  0.015067	 -1.949238
  1.169198	 -0.003694	 -1.942353
  1.169894	 -0.022463	 -1.935477
  1.170590	 -0.041207	 -1.928547
  1.171300	 -0.059968	 -1.921643
  1.171971	 -0.078711	 -1.914678
  1.171378	 -0.096622	 -1.905757
  1.169073	 -0.112981	 -1.894463
  1.166725	 -0.129240	 -1.883054
  1.164373	 -0.145506	 -1.871657
  1.162278	 -0.161167	 -1.860553
  1.160723	 -0.176786	 -1.848772
  1.158539	 -0.194322	 -1.836113
  1.154077	 -0.212991	 -1.825504
  1.150894	 -0.229005	 -1.821899
  1.151927	 -0.247636	 -1.821194
  1.151941	 -0.266219	 -1.824816
  1.149460	 -0.285169	 -1.831875
  1.154553	 -0.301634	 -1.840536
  1.161695	 -0.318080	 -1.849723
  1.166201	 -0.336607	 -1.859985
  1.166841	 -0.353993	 -1.871019
  1.169483	 -0.366825	 -1.885329
  1.174801	 -0.380870	 -1.898087
  1.179297	 -0.397555	 -1.909170
  1.181488	 -0.414223	 -1.921343
  1.183444	 -0.427018	 -1.936783
  1.187303	 -0.440224	 -1.950262
  1.191485	 -0.456633	 -1.961401
  1.193936	 -0.473477	 -1.973090
  1.195039	 -0.487289	 -1.988095
  1.197080	 -0.500475	 -2.003428
  1.200728	 -0.516135	 -2.013860
  1.204611	 -0.533606	 -2.024410
  1.208376	 -0.550551	 -2.035351
  1.210673	 -0.565432	 -2.046730
  1.214030	 -0.579936	 -2.061416
  1.218782	 -0.596914	 -2.072823
  1.228744	 -0.624840	 -2.085608
  1.231287	 -0.630972	 -2.088776
