 -1.574442	 -1.857621	  0.168760
 -1.578836	 -1.887193	  0.182274
 -1.576386	 -1.869018	  0.174325
 -1.575479	 -1.849959	  0.168377
 -1.574693	 -1.830849	  0.162531
 -1.574309	 -1.811908	  0.156127
 -1.574485	 -1.793247	  0.148940
 -1.574519	 -1.774647	  0.141632
 -1.573023	 -1.756774	  0.132825
 -1.570649	 -1.739683	  0.123910
 -1.564010	 -1.724398	  0.114859
 -1.556291	 -1.704449	  0.106008
 -1.552207	 -1.684889	  0.099959
 -1.553531	 -1.667249	  0.089141
 -1.551331	 -1.654230	  0.076423
 -1.544353	 -1.637685	  0.066737
 -1.538651	 -1.618971	  0.058379
 -1.536167	 -1.603449	  0.047241
 -1.531946	 -1.587712	  0.035002
 -1.525435	 -1.571380	  0.025634
 -1.519791	 -1.554991	  0.015490
 -1.515872	 -1.541208	  0.002480
 -1.511969	 -1.524659	 -0.010799
 -1.508355	 -1.503355	 -0.017370
 -1.504563	 -1.482768	 -0.019969
 -1.496727	 -1.467279	 -0.025599
 -1.486916	 -1.452222	 -0.034600
 -1.479687	 -1.436298	 -0.042484
 -1.474991	 -1.418022	 -0.050402
 -1.466818	 -1.396690	 -0.059090
 -1.459471	 -1.381989	 -0.063554
 -1.455615	 -1.361867	 -0.067320
 -1.455878	 -1.342726	 -0.073999
 -1.452838	 -1.325600	 -0.084003
 -1.446084	 -1.305786	 -0.091478
 -1.437966	 -1.289242	 -0.096750
 -1.429792	 -1.274575	 -0.104382
 -1.422919	 -1.254437	 -0.112993
 -1.419944	 -1.234571	 -0.115888
 -1.415674	 -1.218154	 -0.118738
 -1.402695	 -1.198304	 -0.128581
 -1.392690	 -1.189618	 -0.137834
 -1.381011	 -1.177094	 -0.149802
 -1.373485	 -1.161216	 -0.161179
 -1.364677	 -1.142983	 -0.169171
 -1.353612	 -1.128875	 -0.175048
 -1.337891	 -1.118088	 -0.180939
 -1.320768	 -1.108992	 -0.187135
 -1.304771	 -1.099495	 -0.194581
 -1.289220	 -1.088832	 -0.201410
 -1.273422	 -1.078525	 -0.207267
 -1.256893	 -1.067720	 -0.210702
 -1.240186	 -1.054915	 -0.212539
 -1.224201	 -1.042484	 -0.214179
 -1.209122	 -1.029571	 -0.217808
 -1.194095	 -1.016543	 -0.221953
 -1.178491	 -1.006826	 -0.229214
 -1.161052	 -0.997116	 -0.233983
 -1.144924	 -0.984916	 -0.230346
 -1.129038	 -0.972361	 -0.222808
 -1.118175	 -0.963106	 -0.219388
 -1.103676	 -0.950336	 -0.214835
 -1.090771	 -0.934746	 -0.206103
 -1.088100	 -0.918528	 -0.198696
 -1.083517	 -0.901225	 -0.190113
 -1.080977	 -0.882471	 -0.178080
 -1.082405	 -0.864861	 -0.170322
 -1.083015	 -0.848317	 -0.161187
 -1.081311	 -0.829504	 -0.147937
 -1.084920	 -0.809564	 -0.141981
 -1.092536	 -0.789789	 -0.140556
 -1.095969	 -0.774610	 -0.134644
 -1.097207	 -0.755240	 -0.123690
 -1.099030	 -0.737203	 -0.114847
 -1.102232	 -0.719067	 -0.106998
 -1.105679	 -0.700935	 -0.099265
 -1.107910	 -0.682789	 -0.091186
 -1.110474	 -0.664775	 -0.083090
 -1.114910	 -0.647474	 -0.075699
 -1.122279	 -0.628956	 -0.069836
 -1.132735	 -0.612225	 -0.064443
 -1.144575	 -0.595614	 -0.059859
 -1.149713	 -0.582985	 -0.051640
 -1.154344	 -0.563467	 -0.049781
 -1.159831	 -0.543828	 -0.050983
 -1.164881	 -0.523436	 -0.051987
 -1.170263	 -0.504492	 -0.051379
 -1.176740	 -0.485467	 -0.050714
 -1.180440	 -0.465817	 -0.052237
 -1.186234	 -0.446956	 -0.053652
 -1.189411	 -0.427564	 -0.057058
 -1.192842	 -0.408233	 -0.061002
 -1.197457	 -0.389228	 -0.065420
 -1.202754	 -0.370591	 -0.070889
 -1.204264	 -0.351600	 -0.077959
 -1.204019	 -0.332740	 -0.085838
 -1.201495	 -0.313623	 -0.094506
 -1.197164	 -0.297288	 -0.103219
 -1.190987	 -0.277594	 -0.110251
 -1.185601	 -0.259088	 -0.113462
 -1.177856	 -0.238598	 -0.115538
 -1.168975	 -0.221096	 -0.119442
 -1.160340	 -0.205687	 -0.126097
 -1.155010	 -0.190676	 -0.137745
 -1.153365	 -0.175997	 -0.150874
 -1.151110	 -0.162050	 -0.158339
 -1.148639	 -0.143655	 -0.166614
 -1.150663	 -0.126649	 -0.177566
 -1.157422	 -0.112208	 -0.191450
 -1.164968	 -0.097495	 -0.204152
 -1.171700	 -0.082755	 -0.217419
 -1.173045	 -0.069160	 -0.230850
 -1.178137	 -0.057341	 -0.248340
 -1.175205	 -0.045818	 -0.265387
 -1.173851	 -0.038715	 -0.278176
 -1.176633	 -0.031502	 -0.294713
 -1.181671	 -0.026151	 -0.312270
 -1.198450	 -0.022949	 -0.329161
 -1.210870	 -0.013772	 -0.340195
 -1.221603	 -0.004024	 -0.354131
 -1.231870	 -0.002779	 -0.372581
 -1.243425	  0.000428	 -0.388726
 -1.254033	  0.006076	 -0.400829
 -1.261403	  0.017197	 -0.413006
 -1.269851	  0.021813	 -0.429237
 -1.284551	  0.023420	 -0.448284
 -1.302702	  0.019790	 -0.456934
 -1.321625	  0.016167	 -0.465862
 -1.333473	  0.010212	 -0.467900
 -1.345559	  0.003669	 -0.476271
 -1.361082	 -0.006251	 -0.487047
 -1.375638	 -0.007999	 -0.503275
 -1.390654	 -0.007016	 -0.525015
 -1.399886	 -0.007915	 -0.539420
 -1.413865	 -0.013669	 -0.552479
 -1.428884	 -0.020434	 -0.563504
 -1.443202	 -0.030626	 -0.572997
 -1.457926	 -0.041050	 -0.582378
 -1.472442	 -0.051388	 -0.591584
 -1.486814	 -0.062083	 -0.600464
 -1.501130	 -0.072933	 -0.608688
 -1.515866	 -0.084694	 -0.612755
 -1.530331	 -0.097040	 -0.614267
 -1.545588	 -0.107758	 -0.622257
 -1.563662	 -0.123236	 -0.629709
 -1.576049	 -0.140952	 -0.622046
 -1.592128	 -0.159318	 -0.612238
 -1.596223	 -0.166991	 -0.593127
 -1.593819	 -0.171994	 -0.572669
 -1.589440	 -0.178074	 -0.552476
 -1.575402	 -0.174809	 -0.538467
 -1.561182	 -0.171320	 -0.524893
 -1.547395	 -0.169202	 -0.510513
 -1.531260	 -0.163470	 -0.503066
 -1.506687	 -0.148177	 -0.497619
 -1.491384	 -0.136187	 -0.495364
 -1.479643	 -0.123774	 -0.496441
 -1.466544	 -0.109880	 -0.497698
 -1.450123	 -0.097119	 -0.491435
 -1.434949	 -0.085375	 -0.485198
 -1.423016	 -0.071195	 -0.483265
 -1.413596	 -0.059257	 -0.476272
 -1.402512	 -0.043028	 -0.471404
 -1.389854	 -0.028057	 -0.470082
 -1.373370	 -0.014111	 -0.478498
 -1.360862	 -0.001233	 -0.491263
 -1.351957	  0.012161	 -0.493685
 -1.341864	  0.032282	 -0.493000
 -1.332828	  0.059359	 -0.496242
 -1.334664	  0.077068	 -0.495961
 -1.322792	  0.095829	 -0.501064
 -1.318207	  0.108773	 -0.502418
 -1.306104	  0.127662	 -0.510303
 -1.298947	  0.146322	 -0.521877
 -1.293478	  0.163627	 -0.531225
 -1.292677	  0.180232	 -0.537431
 -1.290464	  0.197792	 -0.544834
 -1.289928	  0.219043	 -0.554323
 -1.284850	  0.239618	 -0.558831
 -1.285121	  0.252050	 -0.570392
 -1.279316	  0.271441	 -0.584700
 -1.276497	  0.291324	 -0.593007
 -1.272542	  0.304294	 -0.603428
 -1.270598	  0.323405	 -0.605963
 -1.268604	  0.341309	 -0.610920
 -1.266106	  0.366182	 -0.617604
 -1.262577	  0.385117	 -0.625764
 -1.258792	  0.397810	 -0.633815
 -1.252571	  0.412887	 -0.648902
 -1.247507	  0.431547	 -0.660702
 -1.245118	  0.445860	 -0.665461
 -1.243552	  0.469575	 -0.672659
 -1.238813	  0.486249	 -0.683152
 -1.231687	  0.498732	 -0.692480
 -1.226478	  0.518285	 -0.702026
 -1.224553	  0.537482	 -0.709662
 -1.220082	  0.552881	 -0.714188
 -1.205088	  0.571272	 -0.726136
 -1.192176	  0.586797	 -0.740173
 -1.187017	  0.598791	 -0.749032
 -1.185405	  0.615679	 -0.752265
 -1.179253	  0.638985	 -0.756207
 -1.173473	  0.657893	 -0.761922
 -1.171602	  0.674215	 -0.769644
 -1.169759	  0.692272	 -0.780100
 -1.164422	  0.710285	 -0.791091
 -1.156792	  0.727277	 -0.797346
 -1.152507	  0.746256	 -0.799863
 -1.149357	  0.766568	 -0.802252
 -1.143303	  0.786896	 -0.807704
 -1.140954	  0.804263	 -0.816136
 -1.143886	  0.820915	 -0.824538
 -1.150772	  0.839516	 -0.829282
 -1.153361	  0.859925	 -0.833422
 -1.151153	  0.883322	 -0.834382
 -1.153318	  0.900235	 -0.833608
 -1.160408	  0.918446	 -0.835446
 -1.172271	  0.935481	 -0.835275
 -1.183237	  0.952878	 -0.832668
 -1.191503	  0.971305	 -0.829901
 -1.198651	  0.990229	 -0.830424
 -1.210621	  1.004542	 -0.833766
 -1.222705	  1.019951	 -0.837056
 -1.236230	  1.034928	 -0.839380
 -1.249730	  1.051019	 -0.838828
 -1.263427	  1.065644	 -0.834745
 -1.278797	  1.076862	 -0.829372
 -1.296174	  1.087125	 -0.825844
 -1.313952	  1.096391	 -0.823359
 -1.331089	  1.107724	 -0.819319
 -1.347406	  1.118337	 -0.815475
 -1.362503	  1.130512	 -0.813766
 -1.380151	  1.139863	 -0.814939
 -1.398965	  1.144929	 -0.817478
 -1.418648	  1.149216	 -0.820960
 -1.439179	  1.154865	 -0.823955
 -1.459046	  1.160970	 -0.823798
 -1.476433	  1.165674	 -0.820554
 -1.494647	  1.169769	 -0.816371
 -1.514785	  1.175263	 -0.815813
 -1.536200	  1.180668	 -0.818246
 -1.555451	  1.186329	 -0.819807
 -1.573340	  1.191967	 -0.821250
 -1.592591	  1.197132	 -0.821579
 -1.611917	  1.197811	 -0.821125
 -1.635780	  1.194302	 -0.823668
 -1.654610	  1.194812	 -0.828804
 -1.673679	  1.202349	 -0.834145
 -1.688969	  1.213169	 -0.837259
 -1.708739	  1.222426	 -0.841088
 -1.728373	  1.226244	 -0.845237
 -1.745823	  1.227807	 -0.846559
 -1.765959	  1.235309	 -0.851137
 -1.780856	  1.248314	 -0.862401
 -1.790286	  1.256372	 -0.869147
 -1.806984	  1.266467	 -0.877083
 -1.823045	  1.273630	 -0.884402
 -1.840158	  1.283057	 -0.891969
 -1.855236	  1.294220	 -0.897714
 -1.870155	  1.305893	 -0.903499
 -1.884003	  1.320620	 -0.916808
 -1.892978	  1.333659	 -0.928510
 -1.909618	  1.348035	 -0.936075
 -1.918783	  1.363040	 -0.945606
