  0.372993	 -0.260700	  2.459520
  0.376298	 -0.260469	  2.463650
  0.365078	 -0.258881	  2.447729
  0.355065	 -0.253603	  2.430249
  0.343135	 -0.250753	  2.414319
  0.330306	 -0.245046	  2.400763
  0.318151	 -0.239165	  2.383022
  0.304965	 -0.238974	  2.367556
  0.287747	 -0.248044	  2.355615
  0.269307	 -0.259195	  2.339813
  0.257832	 -0.257460	  2.324632
  0.250626	 -0.250605	  2.309869
  0.242753	 -0.237474	  2.292225
  0.227537	 -0.231231	  2.274444
  0.213008	 -0.232101	  2.260364
  0.198126	 -0.235446	  2.251187
  0.182955	 -0.235448	  2.244112
  0.170360	 -0.220166	  2.244378
  0.160628	 -0.201943	  2.245571
  0.154092	 -0.182224	  2.247834
  0.150158	 -0.162857	  2.250944
  0.148458	 -0.143789	  2.256231
  0.146840	 -0.124853	  2.258992
  0.145780	 -0.105612	  2.261028
  0.145842	 -0.085590	  2.261876
  0.144052	 -0.065808	  2.262081
  0.142098	 -0.048645	  2.259407
  0.142287	 -0.033835	  2.254484
  0.144275	 -0.016696	  2.245176
  0.147002	 -0.000116	  2.233973
  0.148712	  0.015042	  2.221345
  0.148863	  0.028536	  2.206405
  0.147744	  0.039302	  2.192862
  0.146885	  0.049123	  2.182151
  0.144382	  0.061946	  2.168614
  0.140088	  0.074139	  2.153369
  0.135203	  0.084816	  2.137013
  0.130467	  0.095041	  2.120220
  0.125175	  0.105016	  2.103463
  0.118808	  0.113543	  2.087273
  0.112143	  0.121745	  2.070131
  0.105476	  0.129220	  2.053569
  0.097341	  0.134718	  2.040000
  0.079621	  0.139938	  2.027674
  0.063930	  0.147310	  2.016530
  0.053331	  0.152627	  2.004966
  0.043596	  0.156629	  1.991398
  0.032200	  0.165466	  1.973156
  0.021381	  0.178530	  1.960672
  0.009702	  0.189272	  1.951066
 -0.006011	  0.199679	  1.939900
 -0.022096	  0.204699	  1.927680
 -0.037926	  0.208543	  1.915583
 -0.051316	  0.212946	  1.904291
 -0.063000	  0.214814	  1.894481
 -0.074518	  0.216162	  1.886232
 -0.088051	  0.201695	  1.881131
 -0.101779	  0.185751	  1.870529
 -0.122214	  0.182072	  1.857326
 -0.141648	  0.185396	  1.844780
 -0.155916	  0.186533	  1.831787
 -0.171544	  0.183412	  1.818598
 -0.185646	  0.179332	  1.808754
 -0.202428	  0.173816	  1.798290
 -0.216685	  0.165244	  1.787723
 -0.229942	  0.155945	  1.778283
 -0.237798	  0.144646	  1.769996
 -0.250426	  0.127466	  1.755371
 -0.258643	  0.118978	  1.745076
 -0.265454	  0.109433	  1.734887
 -0.276265	  0.092948	  1.720357
 -0.286193	  0.078694	  1.703564
 -0.292203	  0.068606	  1.693756
 -0.300425	  0.053419	  1.688069
 -0.307783	  0.031991	  1.687449
 -0.310124	  0.008643	  1.686194
 -0.315032	 -0.008219	  1.676019
 -0.321708	 -0.022515	  1.663503
 -0.330214	 -0.037633	  1.654240
 -0.337943	 -0.053240	  1.644463
 -0.344998	 -0.071582	  1.634029
 -0.349128	 -0.091995	  1.622212
 -0.349750	 -0.103093	  1.616010
 -0.348285	 -0.118969	  1.608356
 -0.345619	 -0.139500	  1.601844
 -0.347451	 -0.165873	  1.596189
 -0.350314	 -0.178064	  1.591672
 -0.355786	 -0.193831	  1.589092
 -0.362928	 -0.212174	  1.586185
 -0.369989	 -0.232446	  1.588403
 -0.373409	 -0.254402	  1.591346
 -0.376096	 -0.273392	  1.590281
 -0.379231	 -0.289588	  1.582307
 -0.385776	 -0.310516	  1.567740
 -0.391144	 -0.330775	  1.559961
 -0.396071	 -0.340860	  1.555278
 -0.404456	 -0.355728	  1.550048
 -0.424333	 -0.357379	  1.539813
 -0.443117	 -0.351412	  1.529485
 -0.457705	 -0.353138	  1.514372
 -0.470797	 -0.357015	  1.502875
 -0.487174	 -0.360339	  1.489264
 -0.499823	 -0.365759	  1.473197
 -0.510480	 -0.370518	  1.461207
 -0.524671	 -0.371607	  1.452315
 -0.551416	 -0.373628	  1.436663
 -0.568350	 -0.379258	  1.422655
 -0.577805	 -0.385282	  1.416441
 -0.587846	 -0.393474	  1.408382
 -0.602880	 -0.405255	  1.387157
 -0.620159	 -0.407241	  1.372297
 -0.638590	 -0.406705	  1.366580
 -0.661190	 -0.404605	  1.362616
 -0.686000	 -0.402602	  1.355152
 -0.704655	 -0.401592	  1.346050
 -0.717253	 -0.401978	  1.336849
 -0.728735	 -0.404695	  1.319434
 -0.741943	 -0.407915	  1.296874
 -0.754309	 -0.408865	  1.282215
 -0.766202	 -0.410754	  1.268161
 -0.780431	 -0.408935	  1.251331
 -0.791290	 -0.401613	  1.244523
 -0.809725	 -0.395018	  1.237082
 -0.828989	 -0.386789	  1.228591
 -0.841277	 -0.372773	  1.219740
 -0.851932	 -0.356478	  1.210447
 -0.861133	 -0.343378	  1.203897
 -0.872662	 -0.328778	  1.198066
 -0.885069	 -0.313613	  1.192583
 -0.897248	 -0.295780	  1.187229
 -0.907321	 -0.277900	  1.178121
 -0.913747	 -0.255859	  1.165442
 -0.916327	 -0.245481	  1.157203
 -0.919407	 -0.229445	  1.145720
 -0.926797	 -0.212173	  1.132630
 -0.936051	 -0.198670	  1.120566
 -0.943223	 -0.187714	  1.107773
 -0.950406	 -0.174603	  1.093832
 -0.958353	 -0.161457	  1.079049
 -0.964169	 -0.146920	  1.067391
 -0.970295	 -0.129958	  1.056319
 -0.982995	 -0.117645	  1.043254
 -0.998419	 -0.107698	  1.031376
 -1.012092	 -0.099325	  1.017008
 -1.021804	 -0.097794	  1.000219
 -1.029836	 -0.098904	  0.979850
 -1.038571	 -0.099453	  0.961172
 -1.047315	 -0.100200	  0.943597
 -1.055675	 -0.104063	  0.925589
 -1.063446	 -0.110311	  0.905576
 -1.070064	 -0.120217	  0.887171
 -1.079672	 -0.133979	  0.871121
 -1.091420	 -0.146473	  0.855878
 -1.105433	 -0.156783	  0.844254
 -1.116612	 -0.160029	  0.835322
 -1.131747	 -0.163528	  0.826965
 -1.147946	 -0.172073	  0.818716
 -1.162169	 -0.184836	  0.813252
 -1.174370	 -0.198443	  0.805513
 -1.185127	 -0.214886	  0.794052
 -1.192827	 -0.224952	  0.786455
 -1.202192	 -0.239908	  0.775645
 -1.212899	 -0.256825	  0.767758
 -1.219568	 -0.276825	  0.762735
 -1.221204	 -0.299146	  0.758016
 -1.220777	 -0.314243	  0.756610
 -1.223556	 -0.337511	  0.757512
 -1.229630	 -0.359563	  0.756620
 -1.234964	 -0.375296	  0.753988
 -1.242892	 -0.390741	  0.750612
 -1.258009	 -0.407366	  0.745804
 -1.271871	 -0.424502	  0.743202
 -1.281274	 -0.443266	  0.739085
 -1.287849	 -0.460053	  0.732396
 -1.296559	 -0.475899	  0.722668
 -1.308783	 -0.496442	  0.711224
 -1.312779	 -0.509849	  0.701697
 -1.315568	 -0.526009	  0.695016
 -1.321254	 -0.543268	  0.672702
 -1.326430	 -0.554737	  0.657861
 -1.329619	 -0.564367	  0.642341
 -1.336605	 -0.575700	  0.622341
 -1.343161	 -0.586578	  0.604421
 -1.350672	 -0.595708	  0.586476
 -1.359761	 -0.604125	  0.569067
 -1.369721	 -0.610796	  0.554299
 -1.382874	 -0.615161	  0.539392
 -1.396788	 -0.619460	  0.525186
 -1.408892	 -0.625448	  0.511182
 -1.416880	 -0.633024	  0.497687
 -1.423550	 -0.640023	  0.478483
 -1.431177	 -0.650876	  0.458540
 -1.440807	 -0.657180	  0.439065
 -1.446254	 -0.660796	  0.427766
 -1.454178	 -0.667474	  0.413179
 -1.462351	 -0.672951	  0.397034
 -1.472526	 -0.682410	  0.380451
 -1.478545	 -0.694399	  0.368321
 -1.481804	 -0.710965	  0.356294
 -1.484612	 -0.727503	  0.345048
 -1.485373	 -0.743780	  0.333457
 -1.483198	 -0.757560	  0.319927
 -1.478629	 -0.773679	  0.306343
 -1.482962	 -0.790679	  0.289210
 -1.495627	 -0.804928	  0.278085
 -1.506251	 -0.819875	  0.271816
 -1.514286	 -0.837932	  0.265074
 -1.523790	 -0.854943	  0.257555
 -1.534304	 -0.870521	  0.253372
 -1.547393	 -0.886509	  0.249317
 -1.560774	 -0.901440	  0.247561
 -1.578275	 -0.911552	  0.245499
 -1.596912	 -0.917108	  0.241224
 -1.618060	 -0.920445	  0.233326
 -1.636556	 -0.923856	  0.224734
 -1.651337	 -0.931650	  0.217656
 -1.666285	 -0.939216	  0.213989
 -1.686493	 -0.942433	  0.206629
 -1.703537	 -0.945956	  0.196581
 -1.717968	 -0.953794	  0.189832
 -1.738731	 -0.955781	  0.186900
 -1.762931	 -0.953857	  0.174832
 -1.777699	 -0.956723	  0.160628
 -1.788079	 -0.959744	  0.151861
 -1.804865	 -0.949528	  0.144214
 -1.822595	 -0.941945	  0.121972
 -1.835585	 -0.957732	  0.096033
 -1.841279	 -0.975701	  0.074771
 -1.847007	 -0.977243	  0.063399
 -1.856741	 -0.971682	  0.051160
 -1.867189	 -0.958486	  0.045145
 -1.881786	 -0.935550	  0.039917
 -1.893659	 -0.927695	  0.022915
 -1.898217	 -0.927061	  0.006353
 -1.902496	 -0.911964	 -0.008930
 -1.908713	 -0.894878	 -0.019596
 -1.913016	 -0.877879	 -0.029017
 -1.916290	 -0.859992	 -0.037969
 -1.919240	 -0.842184	 -0.047045
 -1.923964	 -0.825300	 -0.055251
 -1.928824	 -0.807592	 -0.062780
 -1.929966	 -0.789335	 -0.074899
 -1.930899	 -0.775614	 -0.093620
 -1.941451	 -0.764172	 -0.110016
 -1.960159	 -0.755633	 -0.121385
 -1.975241	 -0.748301	 -0.133792
 -1.986879	 -0.740645	 -0.149605
 -1.995805	 -0.735059	 -0.161487
 -2.007671	 -0.726255	 -0.176827
 -2.017990	 -0.717160	 -0.192181
 -2.026991	 -0.713141	 -0.203638
 -2.039012	 -0.709041	 -0.220122
 -2.051332	 -0.702961	 -0.236142
 -2.060228	 -0.700730	 -0.246981
 -2.071148	 -0.699024	 -0.265370
 -2.081394	 -0.696012	 -0.284853
 -2.089544	 -0.693248	 -0.299820
 -2.096684	 -0.691884	 -0.314723
 -2.116018	 -0.699301	 -0.326027
 -2.132118	 -0.712921	 -0.333791
 -2.147400	 -0.724093	 -0.348067
 -2.160787	 -0.725225	 -0.364671
 -2.175743	 -0.719754	 -0.383923
 -2.185804	 -0.717118	 -0.401388
 -2.196448	 -0.718254	 -0.417477
 -2.205274	 -0.719859	 -0.428561
 -2.218954	 -0.725622	 -0.442034
 -2.233493	 -0.736199	 -0.455173
 -2.250352	 -0.747058	 -0.472409
 -2.264701	 -0.747893	 -0.491610
 -2.272009	 -0.741125	 -0.506304
 -2.285173	 -0.734547	 -0.524946
 -2.299649	 -0.733148	 -0.550255
 -2.311663	 -0.736052	 -0.565979
