 -1.988531	 -1.522132	 -0.078563
 -1.979014	 -1.526037	 -0.068673
 -1.975162	 -1.527617	 -0.064670
 -1.962510	 -1.532172	 -0.049879
 -1.951666	 -1.533793	 -0.033159
 -1.940858	 -1.535347	 -0.016403
 -1.930066	 -1.536861	  0.000368
 -1.920899	 -1.536235	  0.018124
 -1.913064	 -1.534011	  0.036390
 -1.905598	 -1.531421	  0.054630
 -1.899854	 -1.526132	  0.072851
 -1.895305	 -1.519416	  0.091053
 -1.891518	 -1.513979	  0.107938
 -1.892520	 -1.505482	  0.125049
 -1.894835	 -1.498800	  0.144915
 -1.890074	 -1.492721	  0.167964
 -1.887701	 -1.485461	  0.181265
 -1.885844	 -1.475841	  0.199491
 -1.879787	 -1.463070	  0.222588
 -1.874725	 -1.455025	  0.235599
 -1.869953	 -1.448642	  0.249783
 -1.867379	 -1.439185	  0.272295
 -1.864730	 -1.433222	  0.287854
 -1.862717	 -1.424065	  0.304233
 -1.858154	 -1.412373	  0.323849
 -1.851368	 -1.405077	  0.340019
 -1.849696	 -1.395618	  0.356309
 -1.847512	 -1.380977	  0.376600
 -1.845631	 -1.372838	  0.386659
 -1.845789	 -1.358275	  0.401699
 -1.844202	 -1.340832	  0.420186
 -1.839791	 -1.328838	  0.439347
 -1.836496	 -1.322276	  0.450744
 -1.833199	 -1.315835	  0.468908
 -1.830060	 -1.305279	  0.487812
 -1.826183	 -1.293202	  0.504640
 -1.820954	 -1.282800	  0.518958
 -1.814748	 -1.272833	  0.536205
 -1.810087	 -1.267479	  0.553840
 -1.807547	 -1.264796	  0.573774
 -1.802769	 -1.262209	  0.606867
 -1.800134	 -1.261990	  0.619632
 -1.800268	 -1.261115	  0.629379
 -1.799608	 -1.260615	  0.655690
 -1.795274	 -1.258551	  0.676618
 -1.791307	 -1.256756	  0.689569
 -1.779137	 -1.260202	  0.712619
 -1.770319	 -1.262473	  0.731230
 -1.765666	 -1.264286	  0.746821
 -1.761932	 -1.265228	  0.767388
 -1.758971	 -1.264150	  0.789096
 -1.754514	 -1.264160	  0.810755
 -1.746794	 -1.266800	  0.825128
 -1.735236	 -1.270687	  0.843228
 -1.720593	 -1.275515	  0.862658
 -1.712520	 -1.280813	  0.875248
 -1.703825	 -1.290533	  0.893251
 -1.695872	 -1.302611	  0.912919
 -1.691521	 -1.306428	  0.925426
 -1.685667	 -1.309684	  0.946591
 -1.679494	 -1.305652	  0.968188
 -1.673714	 -1.300447	  0.987409
 -1.664947	 -1.293592	  1.009611
 -1.657183	 -1.294147	  1.030393
 -1.652709	 -1.306585	  1.043707
 -1.649942	 -1.319900	  1.060807
 -1.645702	 -1.324133	  1.081458
 -1.641276	 -1.326668	  1.100894
 -1.637092	 -1.328959	  1.120319
 -1.633291	 -1.330934	  1.139854
 -1.629508	 -1.332877	  1.159398
 -1.625913	 -1.334675	  1.178974
 -1.622446	 -1.336789	  1.198594
 -1.619012	 -1.338803	  1.218254
 -1.615621	 -1.340292	  1.237929
 -1.612216	 -1.341613	  1.257662
 -1.609168	 -1.342835	  1.277516
 -1.606842	 -1.343342	  1.297529
 -1.604685	 -1.341978	  1.317478
 -1.602400	 -1.340504	  1.337395
 -1.599338	 -1.339536	  1.357325
 -1.592987	 -1.338186	  1.386236
 -1.590998	 -1.337966	  1.396399
