  0.844568	 -2.357276	  0.098998
  0.844538	 -2.374851	  0.104424
  0.844568	 -2.355744	  0.098524
  0.843578	 -2.336886	  0.092248
  0.839636	 -2.318464	  0.085936
  0.834644	 -2.299882	  0.080218
  0.836812	 -2.279498	  0.077382
  0.841268	 -2.258351	  0.071307
  0.838429	 -2.244300	  0.058933
  0.827385	 -2.229755	  0.043130
  0.820865	 -2.209990	  0.032340
  0.817987	 -2.195411	  0.024581
  0.814837	 -2.178744	  0.014047
  0.815287	 -2.154402	  0.004654
  0.818558	 -2.138896	  0.002958
  0.823644	 -2.116944	  0.001025
  0.824400	 -2.094034	 -0.007495
  0.822523	 -2.080422	 -0.015770
  0.820011	 -2.063177	 -0.027096
  0.817524	 -2.045668	 -0.038001
  0.813620	 -2.030189	 -0.048474
  0.810266	 -2.011297	 -0.059617
  0.809559	 -1.995554	 -0.068106
  0.807899	 -1.978328	 -0.078509
  0.808762	 -1.952832	 -0.087685
  0.811613	 -1.940553	 -0.089445
  0.817798	 -1.918173	 -0.091773
  0.817867	 -1.896028	 -0.099279
  0.814379	 -1.881423	 -0.107096
  0.809478	 -1.862747	 -0.117648
  0.806457	 -1.845954	 -0.126265
  0.801979	 -1.828406	 -0.136835
  0.798515	 -1.803350	 -0.146272
  0.798842	 -1.786969	 -0.149282
  0.799391	 -1.773547	 -0.152303
  0.799676	 -1.749506	 -0.155744
  0.801735	 -1.728342	 -0.155209
  0.801837	 -1.708252	 -0.156602
  0.801962	 -1.688019	 -0.157559
  0.801423	 -1.667555	 -0.156512
  0.798091	 -1.646192	 -0.156426
  0.791946	 -1.625839	 -0.158489
  0.786378	 -1.607925	 -0.160876
  0.784437	 -1.589957	 -0.163877
  0.784355	 -1.569590	 -0.166292
  0.779427	 -1.547888	 -0.167353
  0.772543	 -1.529176	 -0.170153
  0.769459	 -1.511071	 -0.173968
  0.771259	 -1.492848	 -0.177501
  0.775209	 -1.472489	 -0.178877
  0.771887	 -1.452065	 -0.179486
  0.763217	 -1.428285	 -0.182036
  0.754260	 -1.410517	 -0.191356
  0.746395	 -1.397174	 -0.201824
  0.737986	 -1.382043	 -0.214320
  0.731731	 -1.361171	 -0.221014
  0.724632	 -1.340552	 -0.225885
  0.719215	 -1.325863	 -0.228532
  0.715913	 -1.310957	 -0.233583
  0.707843	 -1.287222	 -0.246747
  0.698471	 -1.270330	 -0.255888
  0.694558	 -1.260497	 -0.260463
  0.688024	 -1.241976	 -0.267720
  0.680229	 -1.215975	 -0.280070
  0.678682	 -1.210219	 -0.284314
  0.674718	 -1.195728	 -0.296278
  0.672439	 -1.168699	 -0.312464
  0.672431	 -1.156310	 -0.318365
  0.672524	 -1.140705	 -0.324721
  0.677188	 -1.117760	 -0.330203
  0.683583	 -1.096230	 -0.331236
  0.689521	 -1.075584	 -0.327877
  0.692605	 -1.060719	 -0.324797
  0.695274	 -1.040889	 -0.323297
  0.691935	 -1.019737	 -0.325617
  0.683309	 -0.998235	 -0.330874
  0.679221	 -0.979470	 -0.335838
  0.674777	 -0.953719	 -0.345256
  0.672337	 -0.937559	 -0.352361
  0.668500	 -0.927241	 -0.360381
  0.663120	 -0.906057	 -0.372198
  0.655008	 -0.886245	 -0.381244
  0.650812	 -0.874007	 -0.388247
  0.642561	 -0.853835	 -0.396724
  0.637006	 -0.832399	 -0.401753
  0.632890	 -0.818999	 -0.404689
  0.631105	 -0.796635	 -0.409056
  0.628722	 -0.773922	 -0.416834
  0.625236	 -0.760450	 -0.423199
  0.618555	 -0.740468	 -0.429997
  0.610369	 -0.721347	 -0.434517
  0.601594	 -0.699401	 -0.445369
  0.596753	 -0.688918	 -0.449486
  0.587069	 -0.669452	 -0.462319
  0.579595	 -0.659513	 -0.471378
  0.576613	 -0.645752	 -0.483162
  0.568131	 -0.631525	 -0.509840
  0.563297	 -0.620464	 -0.529366
  0.558687	 -0.608906	 -0.539697
  0.554072	 -0.589904	 -0.544816
  0.549749	 -0.566375	 -0.546484
  0.547404	 -0.545092	 -0.548147
  0.543513	 -0.524812	 -0.551870
  0.536242	 -0.511378	 -0.560661
  0.525211	 -0.492389	 -0.577818
  0.522477	 -0.475072	 -0.591173
  0.523636	 -0.459027	 -0.599370
  0.526545	 -0.440858	 -0.606556
  0.534426	 -0.414023	 -0.613890
  0.539810	 -0.398782	 -0.615973
  0.543685	 -0.383058	 -0.619628
  0.541435	 -0.355487	 -0.628595
  0.540593	 -0.341919	 -0.632673
  0.541492	 -0.329107	 -0.638712
  0.544695	 -0.309706	 -0.649085
  0.543930	 -0.282094	 -0.662718
  0.541568	 -0.269784	 -0.669598
  0.532060	 -0.253488	 -0.677518
  0.522274	 -0.235478	 -0.684165
  0.510395	 -0.217219	 -0.689180
  0.503212	 -0.195186	 -0.699488
  0.500188	 -0.176933	 -0.709515
  0.499558	 -0.164614	 -0.718685
  0.499684	 -0.140390	 -0.733852
  0.500733	 -0.125538	 -0.742293
  0.503236	 -0.113502	 -0.749701
  0.510306	 -0.096702	 -0.762448
  0.512482	 -0.079121	 -0.774317
  0.514076	 -0.061423	 -0.787102
  0.514559	 -0.046168	 -0.798068
  0.515980	 -0.029937	 -0.808490
  0.517244	 -0.011944	 -0.819523
  0.516516	  0.009126	 -0.826008
  0.512596	  0.031856	 -0.826930
  0.505526	  0.059467	 -0.822783
  0.500015	  0.078837	 -0.821583
  0.495924	  0.091658	 -0.822416
  0.488865	  0.106656	 -0.828901
  0.477464	  0.123530	 -0.839012
  0.467187	  0.141480	 -0.846066
  0.459054	  0.163353	 -0.852745
  0.457119	  0.187797	 -0.855618
  0.453543	  0.200554	 -0.858347
  0.451271	  0.220436	 -0.859907
  0.451288	  0.244064	 -0.861866
  0.453318	  0.268688	 -0.862950
  0.455276	  0.287539	 -0.864176
  0.457901	  0.304246	 -0.866333
  0.461470	  0.321779	 -0.870876
  0.465585	  0.342201	 -0.877800
  0.468587	  0.362598	 -0.883931
  0.468759	  0.380904	 -0.890345
  0.467239	  0.396566	 -0.896778
  0.462679	  0.425844	 -0.902908
  0.461192	  0.445721	 -0.907963
  0.459329	  0.456184	 -0.912421
  0.453925	  0.472945	 -0.922413
  0.447199	  0.494673	 -0.936163
  0.443244	  0.510211	 -0.944988
  0.438803	  0.523490	 -0.950196
  0.434873	  0.553384	 -0.961738
  0.433444	  0.564565	 -0.965651
  0.428995	  0.578747	 -0.969770
  0.418561	  0.598980	 -0.974101
  0.408596	  0.616967	 -0.978608
  0.400812	  0.634552	 -0.982784
  0.393849	  0.650893	 -0.985307
  0.384353	  0.671602	 -0.986701
  0.376959	  0.694878	 -0.991036
  0.373153	  0.712052	 -0.997979
  0.370178	  0.725605	 -0.998623
  0.362139	  0.747180	 -1.000374
  0.358331	  0.766885	 -1.005430
  0.349751	  0.786693	 -1.007055
  0.342669	  0.800614	 -1.007888
  0.333606	  0.822246	 -1.014122
  0.326740	  0.836590	 -1.016996
  0.322078	  0.860133	 -1.024967
  0.316077	  0.881684	 -1.029469
  0.313604	  0.893550	 -1.032870
  0.306274	  0.910441	 -1.035783
  0.301773	  0.933353	 -1.042714
  0.299417	  0.956964	 -1.049355
  0.295930	  0.978765	 -1.052950
  0.295466	  0.993055	 -1.055478
  0.295945	  1.013086	 -1.064621
  0.300861	  1.033415	 -1.077266
  0.307354	  1.051642	 -1.090864
  0.309440	  1.059287	 -1.096708
  0.310750	  1.079949	 -1.102319
  0.314852	  1.103004	 -1.113461
  0.309802	  1.121788	 -1.130107
  0.302143	  1.137286	 -1.138073
  0.293632	  1.155853	 -1.134591
  0.290972	  1.177168	 -1.130178
  0.288509	  1.197904	 -1.132900
  0.284615	  1.216944	 -1.138215
  0.279328	  1.235768	 -1.142386
  0.270296	  1.253580	 -1.143501
  0.261250	  1.271382	 -1.144625
  0.252212	  1.289188	 -1.145740
  0.243170	  1.306993	 -1.146859
  0.234127	  1.324797	 -1.147977
  0.225078	  1.342597	 -1.149105
  0.216026	  1.360399	 -1.150248
  0.208893	  1.378988	 -1.148375
  0.202365	  1.397654	 -1.145326
  0.195941	  1.416368	 -1.142332
  0.190029	  1.435060	 -1.139275
  0.186760	  1.451401	 -1.134047
  0.198521	  1.464880	 -1.123627
  0.206205	  1.482661	 -1.116384
  0.203950	  1.497109	 -1.127385
  0.195173	  1.528424	 -1.131376
  0.190075	  1.540616	 -1.137035
  0.188988	  1.548100	 -1.146557
  0.175887	  1.562744	 -1.152556
  0.171626	  1.582217	 -1.164707
  0.170879	  1.590416	 -1.170192
  0.170465	  1.612763	 -1.179297
  0.166646	  1.637756	 -1.195982
  0.165982	  1.647196	 -1.201172
  0.164618	  1.659395	 -1.208092
  0.166038	  1.680467	 -1.218380
  0.166870	  1.697929	 -1.228291
  0.168035	  1.715493	 -1.237361
  0.166903	  1.734115	 -1.245721
  0.165909	  1.751908	 -1.252941
  0.163647	  1.769731	 -1.260002
  0.160349	  1.786534	 -1.267152
  0.156600	  1.803795	 -1.273375
  0.152476	  1.822060	 -1.280691
  0.148386	  1.839445	 -1.288209
  0.143723	  1.857178	 -1.295730
  0.139010	  1.873002	 -1.302746
  0.133324	  1.891442	 -1.310642
  0.129957	  1.911229	 -1.318965
  0.125796	  1.929263	 -1.326965
  0.122462	  1.947166	 -1.334588
  0.121440	  1.966176	 -1.341530
  0.118198	  1.985434	 -1.349140
  0.116427	  2.005298	 -1.356142
  0.117315	  2.024547	 -1.362089
  0.119863	  2.045425	 -1.367489
  0.127911	  2.067787	 -1.370072
  0.125583	  2.087112	 -1.374667
