 -0.266497	  1.347452	 -2.029181
 -0.312259	  1.333475	 -2.061102
 -0.358021	  1.319498	 -2.093023
 -0.342108	  1.324351	 -2.081923
 -0.326061	  1.328362	 -2.070689
 -0.309779	  1.327877	 -2.059094
 -0.293495	  1.327344	 -2.047495
 -0.277211	  1.326811	 -2.035896
 -0.260927	  1.326278	 -2.024296
 -0.244643	  1.325745	 -2.012697
 -0.228373	  1.325197	 -2.001081
 -0.213661	  1.323002	 -1.987716
 -0.200153	  1.319736	 -1.973335
 -0.186655	  1.316459	 -1.958945
 -0.173157	  1.313183	 -1.944555
 -0.159660	  1.309906	 -1.930164
 -0.146162	  1.306630	 -1.915774
 -0.132676	  1.303349	 -1.901375
 -0.121057	  1.299606	 -1.885540
 -0.113401	  1.295140	 -1.867615
 -0.105776	  1.290666	 -1.849675
 -0.098152	  1.286192	 -1.831735
 -0.090527	  1.281719	 -1.813794
 -0.082852	  1.277243	 -1.795904
 -0.074363	  1.272741	 -1.778309
 -0.067519	  1.266924	 -1.760120
 -0.062722	  1.261250	 -1.741325
 -0.059016	  1.256513	 -1.721233
 -0.057541	  1.249708	 -1.701977
 -0.055617	  1.241911	 -1.684728
 -0.058513	  1.228492	 -1.667046
 -0.063462	  1.217580	 -1.650325
 -0.063604	  1.209492	 -1.632834
 -0.066257	  1.198029	 -1.615869
 -0.071457	  1.184122	 -1.601192
 -0.078519	  1.174164	 -1.585288
 -0.082040	  1.166513	 -1.567814
 -0.089223	  1.156154	 -1.550091
 -0.096825	  1.144197	 -1.537341
 -0.103257	  1.134889	 -1.521815
 -0.112527	  1.126545	 -1.504542
 -0.121531	  1.113553	 -1.492593
 -0.131101	  1.098868	 -1.482657
 -0.145115	  1.088861	 -1.470079
 -0.157515	  1.082289	 -1.458975
 -0.171758	  1.074056	 -1.446434
 -0.188622	  1.064541	 -1.436440
 -0.202170	  1.057206	 -1.428104
 -0.218280	  1.051460	 -1.416705
 -0.234355	  1.044673	 -1.406164
 -0.249956	  1.044651	 -1.391844
 -0.264044	  1.044212	 -1.378990
 -0.277506	  1.036297	 -1.367401
 -0.294449	  1.025618	 -1.354570
 -0.310155	  1.026549	 -1.339067
 -0.318636	  1.030153	 -1.320198
 -0.328976	  1.032624	 -1.309275
 -0.340064	  1.029436	 -1.290187
 -0.345180	  1.021261	 -1.272493
 -0.350971	  1.011964	 -1.254577
 -0.359734	  1.004689	 -1.237560
 -0.365527	  1.007434	 -1.218440
 -0.367970	  0.998535	 -1.200531
 -0.374748	  0.986618	 -1.181556
 -0.377296	  0.978131	 -1.167858
 -0.379914	  0.969174	 -1.149045
 -0.384587	  0.960084	 -1.129753
 -0.390742	  0.949060	 -1.115034
 -0.394660	  0.936613	 -1.102071
 -0.399410	  0.923653	 -1.085908
 -0.407119	  0.913674	 -1.069676
 -0.416008	  0.904563	 -1.054314
 -0.426349	  0.895813	 -1.039474
 -0.438154	  0.887931	 -1.025459
 -0.451184	  0.881061	 -1.011171
 -0.460465	  0.871742	 -0.996075
 -0.469188	  0.856169	 -0.984761
 -0.475095	  0.838569	 -0.974701
 -0.479948	  0.825629	 -0.958224
 -0.484652	  0.817821	 -0.940764
 -0.490412	  0.810114	 -0.923823
 -0.498919	  0.797032	 -0.910058
 -0.508190	  0.782342	 -0.898852
 -0.518843	  0.771753	 -0.883178
 -0.525863	  0.765660	 -0.866943
 -0.533506	  0.757967	 -0.849138
 -0.542497	  0.746904	 -0.832521
 -0.550696	  0.737088	 -0.820195
 -0.559141	  0.727127	 -0.804195
 -0.566519	  0.718255	 -0.788292
 -0.577359	  0.712639	 -0.770140
 -0.588864	  0.706440	 -0.753158
 -0.594140	  0.698010	 -0.739849
 -0.602735	  0.685281	 -0.724488
 -0.613856	  0.677640	 -0.707023
 -0.623735	  0.673818	 -0.691541
 -0.634361	  0.672762	 -0.672604
 -0.647595	  0.668201	 -0.658012
 -0.660280	  0.662079	 -0.643252
 -0.669592	  0.658201	 -0.628457
 -0.682019	  0.655395	 -0.612040
 -0.695423	  0.652507	 -0.596409
 -0.707026	  0.646497	 -0.581771
 -0.720756	  0.643503	 -0.567688
 -0.734957	  0.641920	 -0.552976
 -0.747422	  0.637838	 -0.538435
 -0.761126	  0.635681	 -0.523693
 -0.775647	  0.635606	 -0.510073
 -0.789473	  0.633820	 -0.495934
 -0.803371	  0.632354	 -0.480013
 -0.817908	  0.635775	 -0.467209
 -0.833967	  0.639023	 -0.456486
 -0.850606	  0.643521	 -0.443304
 -0.863758	  0.643609	 -0.429514
 -0.879383	  0.643612	 -0.417382
 -0.895741	  0.645719	 -0.405135
 -0.910793	  0.645598	 -0.392477
 -0.925787	  0.643286	 -0.378570
 -0.940516	  0.644461	 -0.364635
 -0.955704	  0.646350	 -0.353523
 -0.971150	  0.645401	 -0.339430
 -0.981686	  0.644520	 -0.320626
 -0.992892	  0.643179	 -0.305784
 -1.010680	  0.642733	 -0.293622
 -1.025817	  0.640528	 -0.280778
 -1.035736	  0.636002	 -0.264997
 -1.046605	  0.631099	 -0.247948
 -1.059853	  0.629628	 -0.231209
 -1.071146	  0.632391	 -0.215257
 -1.080130	  0.633291	 -0.197480
 -1.087848	  0.632078	 -0.179053
 -1.097111	  0.629779	 -0.160689
 -1.109336	  0.627476	 -0.144365
 -1.118601	  0.628772	 -0.126031
 -1.123604	  0.628439	 -0.106642
 -1.127623	  0.627454	 -0.086864
 -1.129284	  0.627560	 -0.066776
 -1.132510	  0.627418	 -0.046254
 -1.139858	  0.629855	 -0.027142
 -1.147134	  0.635453	 -0.007097
 -1.149548	  0.637614	  0.013412
 -1.146864	  0.636145	  0.031774
 -1.145884	  0.635997	  0.053186
 -1.143372	  0.634443	  0.072411
 -1.141001	  0.634251	  0.092759
 -1.136644	  0.634506	  0.112259
 -1.132986	  0.634222	  0.131509
 -1.130002	  0.632487	  0.152140
 -1.125852	  0.632379	  0.173243
 -1.122071	  0.636775	  0.191304
 -1.116693	  0.639807	  0.208706
 -1.111327	  0.642983	  0.231839
 -1.108570	  0.645604	  0.248650
 -1.104338	  0.650050	  0.266763
 -1.100694	  0.657820	  0.286812
 -1.098946	  0.660250	  0.306133
 -1.097376	  0.662121	  0.325984
 -1.094452	  0.665402	  0.344750
 -1.093908	  0.667799	  0.365069
 -1.096472	  0.670469	  0.385963
 -1.097325	  0.679276	  0.404212
 -1.102644	  0.685345	  0.421619
 -1.113706	  0.693774	  0.439441
 -1.122806	  0.703181	  0.454613
 -1.131301	  0.712121	  0.469794
 -1.140359	  0.721716	  0.484565
 -1.155302	  0.729867	  0.496297
 -1.167973	  0.740308	  0.507406
 -1.181254	  0.750079	  0.519388
 -1.199048	  0.761008	  0.527172
 -1.209257	  0.772400	  0.537085
 -1.220413	  0.785338	  0.546543
 -1.237622	  0.796055	  0.552837
 -1.252503	  0.804050	  0.562378
 -1.268420	  0.815336	  0.570634
 -1.285496	  0.823146	  0.573888
 -1.300808	  0.829160	  0.580087
 -1.321106	  0.836517	  0.585959
 -1.337006	  0.844940	  0.592030
 -1.352388	  0.854574	  0.601056
 -1.369219	  0.858974	  0.606868
 -1.389382	  0.864817	  0.610508
 -1.409359	  0.866978	  0.611732
 -1.428585	  0.869108	  0.611405
 -1.450519	  0.864928	  0.610667
 -1.469497	  0.858587	  0.612108
 -1.487231	  0.855310	  0.614261
 -1.508102	  0.846240	  0.618379
 -1.522798	  0.832506	  0.622267
 -1.537190	  0.824540	  0.626628
 -1.555814	  0.811991	  0.632813
 -1.569085	  0.798124	  0.641517
 -1.579492	  0.786670	  0.647060
 -1.591056	  0.771009	  0.655673
 -1.604926	  0.756117	  0.658383
 -1.620325	  0.739898	  0.656098
 -1.632516	  0.722187	  0.659823
 -1.637980	  0.709898	  0.668667
 -1.646833	  0.692710	  0.678320
 -1.655200	  0.676095	  0.687762
 -1.663010	  0.660385	  0.697500
 -1.670789	  0.644773	  0.707205
 -1.678770	  0.630157	  0.717341
 -1.686991	  0.617978	  0.729682
 -1.693947	  0.602820	  0.744550
 -1.699217	  0.588425	  0.756825
 -1.708541	  0.576933	  0.768972
 -1.719418	  0.567219	  0.782398
 -1.729798	  0.558050	  0.797713
 -1.736693	  0.548906	  0.814571
 -1.742787	  0.543938	  0.832340
 -1.749964	  0.541542	  0.850642
 -1.757664	  0.537043	  0.870129
 -1.764474	  0.530643	  0.888400
 -1.772852	  0.530004	  0.906926
 -1.781782	  0.532465	  0.924752
 -1.792406	  0.536067	  0.942375
 -1.802089	  0.541106	  0.960643
 -1.809549	  0.545990	  0.979487
 -1.816544	  0.544428	  0.995809
 -1.828295	  0.538061	  1.013581
 -1.842189	  0.532682	  1.029872
 -1.854384	  0.533192	  1.046080
 -1.863968	  0.535706	  1.060604
 -1.875725	  0.535786	  1.078131
 -1.887712	  0.538086	  1.094927
 -1.900740	  0.541590	  1.110088
 -1.910486	  0.538007	  1.126359
 -1.921317	  0.531072	  1.145620
 -1.932882	  0.527439	  1.163001
 -1.948343	  0.533225	  1.174459
 -1.963896	  0.536940	  1.185863
 -1.979085	  0.536840	  1.200141
 -1.992818	  0.535527	  1.214965
 -2.006188	  0.534059	  1.229765
 -2.019229	  0.532212	  1.244817
 -2.032260	  0.530360	  1.259875
 -2.044719	  0.528392	  1.275396
 -2.057029	  0.526399	  1.291008
 -2.067283	  0.524780	  1.304203
 -2.069028	  0.524505	  1.306448
