 -2.020861	 -0.352813	  2.229920
 -2.000853	 -0.349319	  2.207842
 -1.976037	 -0.375121	  2.178740
 -1.952806	 -0.409768	  2.152853
 -1.929230	 -0.443040	  2.125384
 -1.902817	 -0.477062	  2.090989
 -1.883320	 -0.506760	  2.064189
 -1.861276	 -0.538726	  2.033560
 -1.837943	 -0.571291	  2.000965
 -1.816474	 -0.602564	  1.970176
 -1.796010	 -0.633244	  1.940161
 -1.774156	 -0.668007	  1.907292
 -1.753166	 -0.699280	  1.877751
 -1.731337	 -0.730618	  1.847883
 -1.707504	 -0.763727	  1.815402
 -1.686353	 -0.794670	  1.784896
 -1.663866	 -0.828039	  1.751882
 -1.642050	 -0.861122	  1.720985
 -1.620377	 -0.896503	  1.691017
 -1.600595	 -0.928255	  1.663782
 -1.576726	 -0.963841	  1.633381
 -1.556104	 -0.995415	  1.605993
 -1.532761	 -1.028764	  1.577006
 -1.509774	 -1.061885	  1.547555
 -1.487225	 -1.093658	  1.519992
 -1.463868	 -1.129828	  1.488901
 -1.444024	 -1.163269	  1.460053
 -1.423894	 -1.196833	  1.429857
 -1.404713	 -1.227619	  1.400995
 -1.382813	 -1.260681	  1.368995
 -1.359804	 -1.293480	  1.334320
 -1.337787	 -1.324784	  1.299649
 -1.317185	 -1.354306	  1.267355
 -1.296008	 -1.384050	  1.236651
 -1.273289	 -1.415280	  1.205731
 -1.250519	 -1.448212	  1.173160
 -1.230530	 -1.477587	  1.143895
 -1.208143	 -1.511197	  1.110120
 -1.186939	 -1.544297	  1.079963
 -1.164604	 -1.578743	  1.049020
 -1.142671	 -1.612929	  1.020496
 -1.121409	 -1.645958	  0.992576
 -1.101175	 -1.676813	  0.964148
 -1.079299	 -1.711700	  0.932404
 -1.055119	 -1.744284	  0.900125
 -1.034008	 -1.774616	  0.869860
 -1.011199	 -1.807104	  0.839407
 -0.987236	 -1.839181	  0.809579
 -0.965286	 -1.867927	  0.783624
 -0.938922	 -1.900734	  0.753358
 -0.913132	 -1.936741	  0.729046
 -0.890619	 -1.974846	  0.697759
 -0.871217	 -2.008145	  0.668847
 -0.849686	 -2.040163	  0.641051
 -0.827350	 -2.071967	  0.615666
 -0.803168	 -2.108052	  0.586820
 -0.780069	 -2.143028	  0.555431
 -0.758214	 -2.174291	  0.526536
 -0.734962	 -2.207252	  0.495581
 -0.711558	 -2.239514	  0.462931
 -0.690572	 -2.268187	  0.433881
 -0.666973	 -2.301210	  0.400599
 -0.645756	 -2.330537	  0.368944
 -0.623847	 -2.362736	  0.334984
 -0.603420	 -2.392518	  0.303938
 -0.579958	 -2.425841	  0.269731
 -0.558598	 -2.455920	  0.240917
 -0.537087	 -2.488085	  0.210472
 -0.515776	 -2.522593	  0.177640
 -0.494383	 -2.556197	  0.148389
 -0.469840	 -2.587338	  0.121338
 -0.454729	 -2.616851	  0.084094
 -0.431566	 -2.647159	  0.054362
 -0.407177	 -2.685733	  0.031081
 -0.387219	 -2.714991	 -0.006394
 -0.365537	 -2.751242	 -0.037785
 -0.340215	 -2.779829	 -0.065063
 -0.322744	 -2.810705	 -0.099302
 -0.303337	 -2.845144	 -0.125952
 -0.280223	 -2.878065	 -0.153023
 -0.253989	 -2.911652	 -0.187909
 -0.232247	 -2.948199	 -0.218440
 -0.216403	 -2.981600	 -0.251463
 -0.218567	 -3.011416	 -0.253977
