 0.0 0.0 0.0 0
 -0.2644046913641399 0.48588280743286605 0.8331098706808068 1000
 -0.7701307438599488 -0.5201438159413851 0.3696688357160453 1000
 0.6963798281652769 0.01956028919303715 -0.7173050466929565 1000
 0.25965689152794263 0.8613249105323812 -0.43673527127818756 1000
 0.9562120414956625 0.22509917435323124 0.18716274577006875 1000
 0.3964979806150215 -0.8487311294422113 -0.3487417687687532 1000
 0.13669193096744608 -0.04526615597946322 -0.9899678232807541 1000
 0.7412422045313549 0.6652991058288176 0.09048808764071116 1000
 0.0 0.0 0.0 0
 -0.05808804739775142 -0.7991860753870519 -0.5980003308167634 1000
 0.411108936478396 -0.14087107871179924 0.9004070088188878 1000
 -0.1419676380551232 -0.9885193092359176 -0.04296236740211318 1000
 0.6635803254553122 -0.46708501696025406 -0.5848228266747644 1000
 -0.7366949111537278 -0.3700482447210862 -0.566736185944611 1000
 -0.9370601678262451 0.24813498489237856 -0.24793803892486635 1000
 0.5242325175071376 0.8306071050380995 -0.1882394874843118 1000
 0.9320550227924469 0.33593026499801226 -0.1370083630503517 1000
 0.0 0.0 0.0 0
 -0.38642319661192887 0.4519353461939345 -0.8034759212202861 1000
 0.46657991739678245 0.6314889072586958 0.6190015675999783 1000
 0.8372649324984355 -0.21052181999131953 -0.5042003531493536 1000
 0.17480622642444205 0.09577939705428079 0.9796571289503105 1000
 -0.4041665746668349 0.6788146903221453 0.6136334379130005 1000
 0.8786556559373083 0.10257864936247946 0.4661371675637424 1000
 -0.0194894851337149 -0.9533502893461279 0.30184662624067415 1000
 0.7327202771312669 0.5815619504312914 0.35231334532094 1000
 0.0 0.0 0.0 0
 0.46053110813638704 -0.22832348161682436 -0.8579216084124722 1000
 0.6058391567372539 0.09752236923821506 0.7896608788980612 1000
 -0.5471198664634955 -0.6846786229094799 0.4809407812316868 1000
 -0.41073081078413975 -0.9080938984281228 -0.08230839999792011 1000
 0.19823797000510995 0.26426330008471377 -0.943820224129887 1000
 -0.8764211704879546 -0.13111439749405643 0.46227799719464746 1000
 0.8783034449576084 -0.46873535323735727 0.09073713242685033 1000
 -0.06540496149763815 0.28943846162091647 0.9543440511398443 1000
 0.0 0.0 0.0 0
 -0.655680661114852 0.2595072952801958 0.7091895616380348 1000
 -0.5680562747912183 -0.40351234519432766 -0.7163629359103512 1000
 -0.16828410427497328 0.8664088596316629 -0.4708769990136825 1000
 -0.15692799082709608 0.172766542602007 -0.971882362970087 1000
 -0.5697149564431364 -0.28925773312761144 0.7693463668796202 1000
 -0.9324315406395436 0.22726097279458718 0.28106560135495995 1000
 0.20743138005500625 0.5040993799453058 -0.8381408221219355 1000
 -0.6634670091264416 0.743276168540348 0.08190888279542506 1000
 0.0 0.0 0.0 0
 -0.5894752050385462 -0.7866491695853579 -0.18094216378564448 1000
 0.08762873757838319 0.8181558138630225 -0.5686433579956374 1000
 0.8062721750187665 -0.44592282361365665 -0.38753066352345783 1000
 0.3195177459583076 0.7790148574207805 0.5388341692352147 1000
 -0.9904779595366691 -0.1318579103050293 0.02699820664539966 1000
 -0.17735504403131047 -0.3104253268881776 -0.9336285689625293 1000
 0.47739232664793163 -0.8628187793341049 0.16779249234122512 1000
 0.44556067449020686 0.8110890000283036 -0.37833889488250966 1000
 0.0 0.0 0.0 0
 -0.3352904780645952 0.9226526614781769 0.189687536718816 1000
 -0.9551119168125564 0.2970981143234605 -0.01476268363436759 1000
 -0.8430166693668111 -0.5265714088607302 0.10756136174349457 1000
 0.8024224360204828 -0.5331562466230004 0.2707538565890223 1000
 -0.5485796344045852 0.022079707135204102 0.8358091117290811 1000
 -0.38517451930599067 -0.6825505671312765 0.6209092630861388 1000
 0.6510506153610763 -0.4927351271921243 0.5765294360819101 1000
 0.3634148458990419 0.5072232885198991 0.7813777481879269 1000
 0.0 0.0 0.0 0
 0.033955843388675216 0.6348781842920715 -0.7721170195053121 1000
 -0.8386614456795725 -0.4845216766123886 -0.2501534017825262 1000
 -0.7080035354223247 -0.18477745733118128 0.6819613516114478 1000
 0.5640565148783632 0.24322960326700663 0.7888780692336742 1000
