 -0.494613	  0.825035	  2.214380
 -0.496877	  0.827046	  2.215675
 -0.463654	  0.797533	  2.196672
 -0.427714	  0.766618	  2.178019
 -0.392442	  0.738401	  2.160763
 -0.357966	  0.711664	  2.143597
 -0.325513	  0.686983	  2.126533
 -0.295616	  0.665820	  2.109301
 -0.265556	  0.647651	  2.089937
 -0.232896	  0.631397	  2.068468
 -0.197370	  0.617861	  2.046138
 -0.157523	  0.605931	  2.022328
 -0.112679	  0.594279	  1.997720
 -0.064472	  0.581723	  1.973853
 -0.014689	  0.568125	  1.951830
  0.035440	  0.553486	  1.932248
  0.086008	  0.538108	  1.915207
  0.135472	  0.522489	  1.901117
  0.182666	  0.507200	  1.889476
  0.228311	  0.491986	  1.880025
  0.272383	  0.477141	  1.872753
  0.316954	  0.463338	  1.866935
  0.366574	  0.451181	  1.862277
  0.420470	  0.443757	  1.859048
  0.473072	  0.445354	  1.856850
  0.526842	  0.456981	  1.853816
  0.581092	  0.471898	  1.849481
  0.627625	  0.484914	  1.845224
  0.664935	  0.496687	  1.841981
  0.696077	  0.508966	  1.838976
  0.726648	  0.524424	  1.834660
  0.759965	  0.544839	  1.827058
  0.796671	  0.570116	  1.812182
  0.840771	  0.601342	  1.780690
  0.896233	  0.630239	  1.720174
  0.962944	  0.634405	  1.621878
  1.038939	  0.591345	  1.508302
  1.116294	  0.526942	  1.403800
  1.184277	  0.454282	  1.313919
  1.237927	  0.386941	  1.237544
  1.275475	  0.329219	  1.175233
  1.281479	  0.261999	  1.133631
  1.258606	  0.193959	  1.125450
  1.231929	  0.134247	  1.123885
  1.205159	  0.064899	  1.117685
  1.193219	 -0.024795	  1.104769
  1.218299	 -0.120558	  1.096442
  1.276945	 -0.193662	  1.103129
  1.349943	 -0.230483	  1.123134
  1.419966	 -0.236099	  1.148546
  1.484066	 -0.222827	  1.174047
  1.546310	 -0.198389	  1.197649
  1.610954	 -0.167009	  1.217550
  1.680912	 -0.133861	  1.230238
  1.755212	 -0.107055	  1.230959
  1.834670	 -0.094819	  1.219168
  1.917879	 -0.099382	  1.204394
  1.982658	 -0.109238	  1.192637
  2.014371	 -0.117908	  1.183472
  2.020165	 -0.144244	  1.154195
  2.022425	 -0.197644	  1.103546
  2.022285	 -0.268302	  1.049949
  2.013972	 -0.340051	  1.007156
  1.996131	 -0.425273	  0.959826
  1.991679	 -0.506013	  0.875818
  2.014915	 -0.566193	  0.782414
  2.058597	 -0.613761	  0.710780
  2.102315	 -0.650353	  0.660671
  2.142529	 -0.678981	  0.620678
  2.182355	 -0.704327	  0.585544
  2.235880	 -0.734999	  0.543877
  2.258553	 -0.747228	  0.526757
