 -2.234888	  0.583372	 -0.952488
 -2.234222	  0.589504	 -0.954325
 -2.238037	  0.570815	 -0.947018
 -2.246289	  0.553515	 -0.945127
 -2.257826	  0.534185	 -0.945261
 -2.261900	  0.511760	 -0.941262
 -2.257769	  0.494182	 -0.934888
 -2.255905	  0.474194	 -0.929230
 -2.254787	  0.452805	 -0.923989
 -2.253074	  0.430909	 -0.915548
 -2.250538	  0.414091	 -0.904483
 -2.246920	  0.398315	 -0.896145
 -2.245765	  0.381406	 -0.892050
 -2.246907	  0.353718	 -0.887932
 -2.251873	  0.334058	 -0.878549
 -2.256395	  0.323765	 -0.872251
 -2.258822	  0.307140	 -0.858026
 -2.264013	  0.290326	 -0.843313
 -2.272008	  0.276552	 -0.830090
 -2.277550	  0.260875	 -0.818378
 -2.281722	  0.244807	 -0.807065
 -2.285008	  0.228535	 -0.796367
 -2.290293	  0.215351	 -0.783493
 -2.298289	  0.199695	 -0.768143
 -2.303430	  0.183765	 -0.757977
 -2.309120	  0.169164	 -0.749300
 -2.316299	  0.143223	 -0.733638
 -2.318641	  0.124605	 -0.729742
 -2.321932	  0.114492	 -0.728555
 -2.330966	  0.086162	 -0.730797
 -2.328574	  0.060853	 -0.730988
 -2.326250	  0.050199	 -0.731175
 -2.320402	  0.027987	 -0.729894
 -2.322511	  0.001706	 -0.725393
 -2.327130	 -0.015186	 -0.722756
 -2.334505	 -0.032445	 -0.719667
 -2.342522	 -0.053832	 -0.715939
 -2.347181	 -0.070203	 -0.714821
 -2.352820	 -0.090353	 -0.714528
 -2.359887	 -0.112843	 -0.713845
 -2.367596	 -0.126440	 -0.710245
 -2.378194	 -0.139815	 -0.704461
 -2.385761	 -0.162793	 -0.703075
 -2.389974	 -0.200580	 -0.706329
 -2.407943	 -0.218433	 -0.684963
 -2.414347	 -0.236936	 -0.680886
