  2.985434	  0.490491	  0.165837
  2.955875	  0.485634	  0.164195
  2.911618	  0.477805	  0.163213
  2.867204	  0.464880	  0.145665
  2.822733	  0.448343	  0.135632
  2.774198	  0.432782	  0.128033
  2.727744	  0.417505	  0.125576
  2.684984	  0.395222	  0.115078
  2.633643	  0.378528	  0.105005
  2.589325	  0.368516	  0.090230
  2.542013	  0.351176	  0.087355
  2.495484	  0.342584	  0.074919
  2.447959	  0.324268	  0.059140
  2.401712	  0.316711	  0.048700
  2.354198	  0.303448	  0.038472
  2.307735	  0.290380	  0.024324
  2.260679	  0.280078	  0.008326
  2.217249	  0.266614	 -0.002934
  2.175125	  0.248462	 -0.017215
  2.154042	  0.210592	 -0.034138
  2.165342	  0.071356	 -0.047273
  2.134741	 -0.151270	 -0.052623
  2.099804	 -0.234688	 -0.054116
  2.059504	 -0.268958	 -0.053524
  2.030415	 -0.270592	 -0.066936
  1.962283	 -0.236417	 -0.086962
  1.921936	 -0.165808	 -0.099667
  1.786795	  0.014355	 -0.123211
  1.705876	  0.073450	 -0.127253
  1.655100	  0.087698	 -0.130229
  1.609505	  0.083626	 -0.137685
  1.562257	  0.066345	 -0.148337
  1.514242	  0.044963	 -0.157148
  1.469476	  0.028752	 -0.164465
  1.424832	  0.015640	 -0.172074
  1.375806	  0.002862	 -0.178612
  1.328034	 -0.010732	 -0.181698
  1.280612	 -0.026198	 -0.186950
  1.235217	 -0.044188	 -0.196567
  1.186933	 -0.060672	 -0.205669
  1.141548	 -0.075821	 -0.215224
  1.093619	 -0.091235	 -0.226221
  1.046700	 -0.106269	 -0.237180
  1.001540	 -0.121242	 -0.247647
  0.954359	 -0.137085	 -0.257985
  0.909287	 -0.151094	 -0.267256
  0.860978	 -0.163772	 -0.276212
  0.810342	 -0.175957	 -0.283818
  0.763880	 -0.188344	 -0.290001
  0.719824	 -0.200556	 -0.295417
  0.669971	 -0.214749	 -0.301639
  0.623191	 -0.229218	 -0.308222
  0.577515	 -0.243682	 -0.314064
  0.530880	 -0.258048	 -0.322527
  0.483789	 -0.273990	 -0.332877
  0.437511	 -0.291028	 -0.344089
  0.389322	 -0.309199	 -0.358109
  0.347719	 -0.325216	 -0.372046
  0.303627	 -0.343001	 -0.385815
  0.258014	 -0.363030	 -0.397613
  0.213243	 -0.380036	 -0.407269
  0.167597	 -0.395845	 -0.418229
  0.118903	 -0.410708	 -0.431055
  0.072005	 -0.423940	 -0.442753
  0.028828	 -0.435795	 -0.451829
 -0.020686	 -0.448409	 -0.459834
 -0.071962	 -0.460327	 -0.468130
 -0.121353	 -0.471357	 -0.475915
 -0.165876	 -0.481307	 -0.482597
 -0.215130	 -0.491057	 -0.489604
 -0.266834	 -0.500733	 -0.496712
 -0.316113	 -0.510282	 -0.504146
 -0.363347	 -0.520949	 -0.512054
 -0.405964	 -0.532931	 -0.519686
 -0.454612	 -0.549672	 -0.530860
 -0.503330	 -0.569414	 -0.545786
 -0.547709	 -0.588652	 -0.561344
 -0.588427	 -0.606175	 -0.576486
 -0.631311	 -0.622912	 -0.592141
 -0.675431	 -0.638090	 -0.607026
 -0.721609	 -0.654707	 -0.620340
 -0.781495	 -0.695309	 -0.629969
 -0.838550	 -0.861715	 -0.598144
 -0.864272	 -1.034580	 -0.576301
 -0.872643	 -1.110705	 -0.607827
 -0.887855	 -1.141541	 -0.673603
 -0.911251	 -1.150083	 -0.746871
 -0.938329	 -1.150360	 -0.804792
 -0.945291	 -1.148283	 -0.811811
 -1.031168	 -1.098546	 -0.822710
 -1.081736	 -1.123606	 -0.843351
 -1.116862	 -1.038304	 -0.818136
 -1.269967	 -0.937205	 -0.610204
 -1.381059	 -1.009609	 -0.525642
 -1.381720	 -1.009670	 -0.525559
 -1.389702	 -1.003825	 -0.530493
 -1.451837	 -0.905119	 -0.677211
 -1.510531	 -0.905669	 -0.773480
 -1.557620	 -0.919399	 -0.801428
 -1.606579	 -0.936721	 -0.816248
 -1.650989	 -0.953330	 -0.825452
 -1.699925	 -0.971081	 -0.833519
 -1.749153	 -0.985679	 -0.838808
 -1.793982	 -0.996584	 -0.844532
 -1.843918	 -1.008888	 -0.852959
 -1.892363	 -1.021967	 -0.862011
 -1.938758	 -1.034886	 -0.870618
 -1.986668	 -1.048755	 -0.879213
 -2.032280	 -1.062708	 -0.887414
 -2.077468	 -1.077909	 -0.896258
 -2.122829	 -1.094496	 -0.905904
 -2.170440	 -1.108674	 -0.915634
 -2.219603	 -1.120568	 -0.928312
 -2.268596	 -1.129658	 -0.938114
 -2.315320	 -1.139842	 -0.946976
 -2.359577	 -1.153799	 -0.956597
 -2.404967	 -1.173804	 -0.965476
 -2.453424	 -1.187604	 -0.982523
 -2.497478	 -1.202251	 -0.993943
 -2.549835	 -1.221160	 -1.003548
 -2.575334	 -1.233371	 -1.013583
