 0.0 0.0 0.0 0
 -0.8962525934948914 0.011896532053674969 -0.13310855662816906 1000
 -0.2670843486506429 0.6985859897203762 0.14588216001958537 1000
 0.1720873344014638 0.38179160181716765 0.010474022462310592 1000
 0.9024062764187706 0.25269263445955786 0.2669653225964361 1000
 0.3667978986365421 -0.1449112724530202 -0.04929494790253115 1000
 -0.2901466350738374 -0.8831010349445175 -0.2623126737993697 1000
 0.3495004653640249 -0.5655911926816258 0.044144486093100566 1000
 -0.5803646781763423 -0.5809491073508701 -0.16592782509851622 1000
 0.0 0.0 0.0 0
 0.9729777654125606 -0.22868902240722466 0.15047384136491807 1000
 0.15561414883279878 0.8190910426867098 0.12599754298796853 1000
 0.639119929366277 -0.13288523586161172 0.18473471830571367 1000
 0.6830788485866495 -0.4210611652734405 -0.002600581612779873 1000
 -0.6321597001637883 -0.18171769480328478 -0.08284382260660983 1000
 -0.895480560764948 0.06887160595624872 -0.2153810019526801 1000
 0.03209065295214944 -0.6372077276242841 -0.031118158450129378 1000
 0.029036220031076213 -0.868753212260393 -0.20810000372642978 1000
 0.0 0.0 0.0 0
 0.8142545975182245 0.38645187852635177 0.1918311715921759 1000
 0.4299546399638019 -0.901923849412345 -0.07711038009978927 1000
 -0.3327953752184437 0.26637686478431266 -0.11312076045333534 1000
 -0.44995806609910177 -0.5880249355830273 -0.27164863743263024 1000
 0.09457982114563027 0.992670316387365 0.21176676177679132 1000
 0.16615104453582327 0.23959868540095772 0.17910796606147047 1000
 -0.7345674919231288 0.29204121750137824 -0.15915482928717584 1000
 0.7376331245105073 0.6052722523380445 0.230929146978338 1000
 0.0 0.0 0.0 0
 0.4519393233728842 0.009252031505587309 0.18733941709303467 1000
 -0.6537968409875381 0.7501505589849792 -0.0034869697577564612 1000
 0.44215698502607303 0.2728612402659169 0.05061405130260549 1000
 -0.07203351589299765 0.6086165388598042 0.18195004808524068 1000
 0.972943915307091 0.09849428183524117 0.194131146753689 1000
 0.3591413404525552 0.9240964544521272 0.2585676133769308 1000
 0.3522701681096062 0.7193733334661595 0.14259462078532897 1000
 0.9472894541904445 0.30114646552391383 0.2597232843620431 1000
 0.0 0.0 0.0 0
 0.7883424279261749 -0.19029840661054936 0.06302278953426288 1000
 0.5368144833973563 0.8358984562981138 0.25278520717510133 1000
 -0.7143558710901496 0.6144017666919801 -0.06582184622962681 1000
 0.5016456992942844 -0.5616724951856937 -0.07211520761070282 1000
 0.3284908379247263 -0.9017751404696728 -0.0719581517392047 1000
 0.07604378846284547 0.9515335196586866 0.22399701355040652 1000
 0.9604994923778648 0.0387823378083092 0.2311516335935277 1000
 -0.8364956658039366 -0.532491353740635 -0.25537352049676115 1000
 0.0 0.0 0.0 0
 0.2931003507473368 -0.3308393659708187 -0.09656879822604227 1000
 -0.974075721676801 0.10330541124968784 -0.15727533528501036 1000
 0.49709635478866177 -0.8560648596591326 -0.07364783476038463 1000
 -0.20096179415887233 0.5043064010729825 -0.03522306462096671 1000
 -0.32124255367399757 -0.8552951853729612 -0.181624438081114 1000
 -0.8368803323687665 -0.20083990637994842 -0.2609442186258445 1000
 -0.07861882789795653 -0.43511663617618596 -0.19143787565517556 1000
 0.8087357795944028 -0.39032186262204793 0.04519668578886421 1000
 0.0 0.0 0.0 0
 0.626838679351607 -0.4303450358173163 0.11550450435303614 1000
 -0.8934666034958069 0.39986094835256664 -0.12827641351462032 1000
 0.7332173222886047 0.008195403288808523 0.07876882004077732 1000
 0.4781107491754995 -0.17891593732773345 0.15423457142712105 1000
 -0.10753157655238263 -0.030278229508408853 0.07714675762246927 1000
 -0.5999429009367429 0.7226861087185701 0.04908714503731898 1000
