  1.880955	 -1.603099	 -0.445544
  1.866808	 -1.605811	 -0.431737
  1.865626	 -1.606038	 -0.430583
  1.852849	 -1.605880	 -0.414451
  1.841752	 -1.609934	 -0.401050
  1.826278	 -1.613057	 -0.386700
  1.812509	 -1.613005	 -0.370851
  1.802619	 -1.615934	 -0.354805
  1.789059	 -1.620086	 -0.340819
  1.773523	 -1.622080	 -0.325766
  1.763742	 -1.624824	 -0.310203
  1.750876	 -1.629052	 -0.294924
  1.736359	 -1.631792	 -0.280746
  1.723742	 -1.633806	 -0.265170
  1.711841	 -1.635310	 -0.249921
  1.698447	 -1.636620	 -0.235165
  1.685110	 -1.638671	 -0.220307
  1.673307	 -1.642692	 -0.205628
  1.659459	 -1.649186	 -0.190650
  1.645419	 -1.656387	 -0.178119
  1.631138	 -1.659227	 -0.164545
  1.619420	 -1.660907	 -0.148663
  1.606813	 -1.666417	 -0.133671
  1.595345	 -1.675210	 -0.119960
  1.585474	 -1.684230	 -0.105456
  1.577765	 -1.694280	 -0.090281
  1.561812	 -1.705328	 -0.077285
  1.553280	 -1.714745	 -0.065701
  1.546054	 -1.725800	 -0.049751
  1.541600	 -1.736657	 -0.032805
  1.537449	 -1.747406	 -0.016307
  1.532200	 -1.758443	 -0.000314
  1.526963	 -1.769418	  0.015563
  1.524777	 -1.779833	  0.032495
  1.522726	 -1.790218	  0.049464
  1.520676	 -1.800603	  0.066433
  1.518628	 -1.810988	  0.083403
  1.518372	 -1.820616	  0.100930
  1.519465	 -1.829610	  0.118760
  1.520560	 -1.838605	  0.136590
  1.521659	 -1.847600	  0.154419
  1.523688	 -1.856557	  0.172186
  1.526155	 -1.865490	  0.189909
  1.528595	 -1.874434	  0.207625
  1.525394	 -1.884600	  0.224543
  1.520973	 -1.894927	  0.241090
  1.515161	 -1.905148	  0.257266
  1.505451	 -1.914754	  0.271873
  1.495723	 -1.924356	  0.286473
  1.486047	 -1.933840	  0.301184
  1.476908	 -1.942135	  0.316922
  1.467771	 -1.950424	  0.332663
  1.458635	 -1.958711	  0.348407
  1.449885	 -1.966030	  0.364832
  1.441889	 -1.971709	  0.382260
  1.433903	 -1.977336	  0.399702
  1.425983	 -1.983215	  0.417052
  1.417199	 -1.988400	  0.434362
  1.407918	 -1.992253	  0.451750
  1.398858	 -1.995617	  0.468785
  1.387625	 -1.999868	  0.486424
  1.375527	 -2.003534	  0.502486
  1.362980	 -2.002769	  0.517262
  1.349446	 -2.001160	  0.532089
  1.334294	 -1.998803	  0.544708
  1.318601	 -1.998011	  0.557567
  1.301240	 -1.995890	  0.567263
  1.283251	 -1.993164	  0.575566
  1.265332	 -1.990423	  0.583970
  1.246625	 -1.986573	  0.590186
  1.227750	 -1.983003	  0.596049
  1.208034	 -1.979640	  0.600227
  1.188399	 -1.975111	  0.601777
  1.169154	 -1.969636	  0.602497
  1.150682	 -1.962608	  0.604100
  1.132582	 -1.956183	  0.607262
  1.111597	 -1.948312	  0.606565
  1.092370	 -1.942314	  0.602427
  1.075192	 -1.932982	  0.595735
  1.059483	 -1.924843	  0.597817
  1.041078	 -1.916160	  0.601172
  1.022673	 -1.903911	  0.601610
  1.005440	 -1.893160	  0.596465
  0.988103	 -1.885691	  0.596320
  0.971090	 -1.876174	  0.599273
  0.954001	 -1.863593	  0.601061
  0.936818	 -1.852991	  0.601074
  0.919084	 -1.847051	  0.605021
  0.901344	 -1.838504	  0.610245
  0.884752	 -1.828289	  0.615984
  0.868243	 -1.818553	  0.621974
  0.851093	 -1.810953	  0.628833
  0.834646	 -1.804659	  0.638290
  0.818565	 -1.799104	  0.648904
  0.803889	 -1.793076	  0.660368
  0.786897	 -1.788626	  0.672291
  0.767931	 -1.787892	  0.680989
  0.749711	 -1.784093	  0.687982
  0.736078	 -1.777019	  0.699080
  0.720426	 -1.770347	  0.711638
  0.702331	 -1.766794	  0.722148
  0.683739	 -1.768524	  0.733165
  0.670954	 -1.766318	  0.745304
  0.656814	 -1.760693	  0.757190
  0.641046	 -1.754164	  0.769222
  0.625332	 -1.750895	  0.782016
  0.608309	 -1.754468	  0.795776
  0.591837	 -1.758679	  0.807391
  0.577934	 -1.754742	  0.820727
  0.565531	 -1.751741	  0.834074
  0.549925	 -1.751942	  0.852369
  0.536686	 -1.748918	  0.864076
  0.522574	 -1.749004	  0.878348
  0.506034	 -1.749397	  0.893149
  0.492711	 -1.748036	  0.902064
  0.475871	 -1.752026	  0.915271
  0.459722	 -1.761198	  0.927288
  0.447878	 -1.765281	  0.943056
  0.435052	 -1.764405	  0.960290
  0.422728	 -1.768920	  0.974894
  0.409215	 -1.775471	  0.986991
  0.397390	 -1.782978	  1.000792
  0.383086	 -1.788256	  1.013901
  0.367805	 -1.796949	  1.028021
  0.359823	 -1.805928	  1.042087
  0.349775	 -1.813228	  1.056829
  0.337831	 -1.824438	  1.073711
  0.326435	 -1.833172	  1.085291
  0.316485	 -1.840769	  1.099655
  0.306526	 -1.849938	  1.115982
  0.293141	 -1.857179	  1.128214
  0.279381	 -1.863287	  1.141860
  0.268017	 -1.869722	  1.157092
  0.255403	 -1.875065	  1.171420
  0.240437	 -1.878874	  1.185152
  0.227781	 -1.884810	  1.200836
  0.219162	 -1.890150	  1.216157
  0.206275	 -1.892604	  1.232248
  0.192485	 -1.893470	  1.246485
  0.178969	 -1.894965	  1.261568
  0.167124	 -1.896840	  1.277574
  0.155563	 -1.897800	  1.294320
  0.141931	 -1.898261	  1.309412
  0.128208	 -1.900109	  1.323128
  0.115225	 -1.900244	  1.339023
  0.101922	 -1.897434	  1.355666
  0.085157	 -1.899794	  1.365285
  0.068869	 -1.904468	  1.375666
  0.048931	 -1.905067	  1.388192
  0.035172	 -1.903647	  1.400508
  0.020633	 -1.906382	  1.412655
  0.003780	 -1.908209	  1.424693
 -0.010694	 -1.909744	  1.437811
 -0.024584	 -1.912641	  1.452317
 -0.040636	 -1.913337	  1.466135
 -0.057542	 -1.916617	  1.474991
 -0.074035	 -1.922848	  1.484141
 -0.092453	 -1.927678	  1.494389
 -0.107358	 -1.930245	  1.506194
 -0.122362	 -1.936165	  1.518872
 -0.134613	 -1.944379	  1.531142
 -0.156925	 -1.955664	  1.549436
 -0.164247	 -1.959070	  1.555087
