 -1.972035	 -0.997626	 -1.100638
 -1.972513	 -0.999196	 -1.125200
 -1.972126	 -0.997921	 -1.105244
 -1.972424	 -0.996769	 -1.085280
 -1.973190	 -0.995705	 -1.065323
 -1.973928	 -0.995088	 -1.045346
 -1.974587	 -0.995627	 -1.025365
 -1.974611	 -0.996667	 -1.005392
 -1.973765	 -0.998385	 -0.985484
 -1.972484	 -1.000248	 -0.965612
 -1.970579	 -1.002318	 -0.945811
 -1.968544	 -1.004432	 -0.926028
 -1.965910	 -1.006520	 -0.906358
 -1.963532	 -1.007631	 -0.886429
 -1.960488	 -1.008981	 -0.867179
 -1.956376	 -1.010554	 -0.848245
 -1.950551	 -1.011634	 -0.828601
 -1.943767	 -1.017411	 -0.807847
 -1.940313	 -1.027260	 -0.786993
 -1.940374	 -1.029555	 -0.774149
 -1.934876	 -1.034648	 -0.752058
 -1.926987	 -1.037695	 -0.734503
 -1.921168	 -1.042094	 -0.715969
 -1.916506	 -1.049539	 -0.696811
 -1.912276	 -1.054483	 -0.678560
 -1.907112	 -1.058425	 -0.660786
 -1.903090	 -1.069547	 -0.640251
 -1.900036	 -1.077247	 -0.622699
 -1.904738	 -1.084325	 -0.605607
 -1.906874	 -1.095105	 -0.589266
 -1.907821	 -1.108209	 -0.571513
 -1.911738	 -1.117018	 -0.555184
 -1.918033	 -1.128862	 -0.541257
 -1.921880	 -1.144340	 -0.526219
 -1.924160	 -1.155726	 -0.508794
 -1.931206	 -1.165895	 -0.495805
 -1.938479	 -1.180127	 -0.483641
 -1.943593	 -1.194931	 -0.468292
 -1.946027	 -1.206731	 -0.452603
 -1.952547	 -1.221243	 -0.440890
 -1.958607	 -1.235339	 -0.428125
 -1.962236	 -1.248993	 -0.413949
 -1.965241	 -1.264022	 -0.401333
 -1.968496	 -1.280414	 -0.389292
 -1.970868	 -1.295398	 -0.375791
 -1.965573	 -1.309611	 -0.363657
 -1.960485	 -1.325521	 -0.352805
 -1.951600	 -1.339238	 -0.339000
 -1.946838	 -1.351668	 -0.326358
 -1.939063	 -1.367371	 -0.316603
 -1.930744	 -1.382800	 -0.305627
 -1.919010	 -1.393317	 -0.291673
 -1.905955	 -1.402939	 -0.280596
 -1.892594	 -1.412726	 -0.269795
 -1.881255	 -1.423662	 -0.256498
 -1.867451	 -1.430592	 -0.243331
 -1.853077	 -1.436828	 -0.231932
 -1.841090	 -1.444990	 -0.217835
 -1.827899	 -1.450517	 -0.202737
 -1.813564	 -1.454883	 -0.190191
 -1.801737	 -1.460356	 -0.174951
 -1.792306	 -1.466024	 -0.156371
 -1.780406	 -1.466470	 -0.142971
 -1.767431	 -1.466840	 -0.126781
 -1.755673	 -1.467928	 -0.110693
 -1.744672	 -1.469472	 -0.093704
 -1.736309	 -1.467864	 -0.075611
 -1.729188	 -1.465459	 -0.057382
 -1.723247	 -1.462240	 -0.037904
 -1.717192	 -1.458604	 -0.019063
 -1.709860	 -1.455068	 -0.001351
 -1.703382	 -1.451103	  0.016303
 -1.698343	 -1.445590	  0.035477
 -1.691457	 -1.441236	  0.053428
 -1.686690	 -1.434578	  0.071660
 -1.684018	 -1.427264	  0.089976
 -1.681338	 -1.419165	  0.108542
 -1.678734	 -1.410156	  0.126164
 -1.674013	 -1.402792	  0.143268
 -1.669334	 -1.395723	  0.161833
 -1.664303	 -1.387348	  0.180507
 -1.659083	 -1.378048	  0.199346
 -1.657656	 -1.369801	  0.213613
 -1.652267	 -1.360963	  0.231517
 -1.646739	 -1.350808	  0.250695
 -1.642712	 -1.342344	  0.265489
 -1.641300	 -1.330650	  0.284695
 -1.639202	 -1.320118	  0.303093
 -1.641837	 -1.308260	  0.315660
 -1.638561	 -1.296539	  0.332006
 -1.635807	 -1.286662	  0.350888
 -1.636243	 -1.275786	  0.368023
 -1.633789	 -1.262739	  0.381587
 -1.629616	 -1.249386	  0.396798
 -1.628633	 -1.238021	  0.414570
 -1.626506	 -1.229644	  0.431210
 -1.619716	 -1.215916	  0.446378
 -1.616483	 -1.202932	  0.461530
 -1.619282	 -1.194248	  0.481872
 -1.614559	 -1.192332	  0.499879
 -1.606261	 -1.186786	  0.521334
 -1.598062	 -1.183791	  0.539819
 -1.597241	 -1.181226	  0.556464
 -1.595640	 -1.176142	  0.575266
 -1.586625	 -1.172149	  0.596184
 -1.579429	 -1.174734	  0.614824
 -1.581122	 -1.166038	  0.634973
 -1.576609	 -1.168057	  0.656299
 -1.570533	 -1.172909	  0.674834
 -1.566021	 -1.177001	  0.691992
 -1.558689	 -1.177567	  0.711805
 -1.548303	 -1.177872	  0.728624
 -1.539978	 -1.188528	  0.746969
 -1.535075	 -1.197580	  0.764728
 -1.534031	 -1.194134	  0.785126
 -1.530179	 -1.197069	  0.806667
 -1.519155	 -1.209890	  0.821271
 -1.509567	 -1.213978	  0.837277
 -1.501282	 -1.213290	  0.857598
 -1.496870	 -1.217547	  0.875048
 -1.492919	 -1.225167	  0.894187
 -1.486286	 -1.230679	  0.912158
 -1.480305	 -1.234734	  0.930727
 -1.474747	 -1.240471	  0.949951
 -1.466165	 -1.244165	  0.969565
 -1.460065	 -1.244842	  0.985512
 -1.455130	 -1.248258	  1.005799
 -1.449378	 -1.249981	  1.025210
 -1.444250	 -1.251067	  1.044530
 -1.439602	 -1.252777	  1.064010
 -1.435331	 -1.255132	  1.083436
 -1.431550	 -1.257014	  1.102984
 -1.427818	 -1.259562	  1.122251
 -1.424797	 -1.263422	  1.141258
 -1.424089	 -1.265320	  1.162128
 -1.423522	 -1.264437	  1.183132
 -1.421022	 -1.262924	  1.201048
 -1.411381	 -1.263327	  1.221970
 -1.404529	 -1.266855	  1.241023
 -1.404050	 -1.268038	  1.260505
 -1.400197	 -1.268431	  1.279169
 -1.394401	 -1.267597	  1.298454
 -1.392132	 -1.263064	  1.320715
 -1.389605	 -1.262540	  1.340207
 -1.387631	 -1.263999	  1.357981
 -1.382755	 -1.263594	  1.378407
 -1.375202	 -1.260377	  1.397126
 -1.368135	 -1.259185	  1.416030
 -1.364418	 -1.260194	  1.435819
 -1.358618	 -1.261360	  1.455146
 -1.350733	 -1.260975	  1.473338
 -1.344737	 -1.262102	  1.492337
 -1.339217	 -1.265238	  1.512112
 -1.330502	 -1.266675	  1.530001
 -1.322608	 -1.266051	  1.547278
 -1.317485	 -1.269290	  1.567840
 -1.309358	 -1.275934	  1.587425
 -1.291300	 -1.273296	  1.624565
 -1.284179	 -1.275026	  1.643174
