 0.0 0.0 0.0 0
 -0.5145679205428221 0.1326341794037928 0.8471670612117294 1000
 -0.3600850710063528 -0.9046735612988565 0.22849614684977443 1000
 0.5880041621370379 0.5032062667593156 -0.6331576094493947 1000
 -0.25167863224823606 0.9158935039685683 -0.31278899510346436 1000
 0.6625956226643559 0.6816304619942413 0.31046409471555847 1000
 0.8121814119916619 -0.4304212811838124 -0.39277840408978115 1000
 0.16766015590276012 0.18337294650725564 -0.9690378912157712 1000
 0.24174686507571855 0.9406333112056949 0.23878531587238017 1000
 0.0 0.0 0.0 0
 0.4146398215639625 -0.6019356591037361 -0.6822201116009082 1000
 0.3932741629203038 -0.023395383533427266 0.9188993899272421 1000
 0.43427209049108517 -0.8855394674469037 -0.16247646910970384 1000
 0.8280737115665296 0.06495347990121142 -0.5573149680935858 1000
 -0.38854074415834505 -0.6248606439673581 -0.677812854517807 1000
 -0.9086184529157234 -0.272457396927656 -0.3182852083909061 1000
 -0.02228512354784551 0.9989384056872115 -0.04227806655405314 1000
 0.5902888641868753 0.80740656569691 -0.0008333585600100446 1000
 0.0 0.0 0.0 0
 -0.5489604891850809 0.2788224217703232 -0.7874277353711946 1000
 0.017175012539352913 0.6845063606602042 0.7285561482548858 1000
 0.8268805758421719 0.3595185653637446 -0.43193160853740803 1000
 0.06299049193244619 0.030383089769673854 0.997280334601137 1000
 -0.7316246323194195 0.24728029921226335 0.6358174667347282 1000
 0.6583336246109026 0.4971644863681403 0.5650365582871377 1000
 0.5062111823075592 -0.8402559662790858 0.19516185600465677 1000
 0.2736643501587281 0.82844946239329 0.487849681472141 1000
 0.0 0.0 0.0 0
 0.5345319310891232 0.1905699813799518 -0.8235342718083912 1000
 0.4252768528688123 0.2959136891121957 0.8553892020653575 1000
 -0.08659783233191454 -0.9343966467228559 0.34472122364092334 1000
 0.16757783280354974 -0.9607387996154276 -0.2213766673937709 1000
 0.04490527814128248 0.4652057860214366 -0.8840232421419875 1000
 -0.6677787930784953 -0.6561500843375352 0.3500636375553352 1000
 0.987388365339619 0.08174277886155921 0.1332116139679453 1000
 -0.24351741863735818 0.062011797299738824 0.9673049177047811 1000
 0.0 0.0 0.0 0
 -0.7094949476785578 -0.24988994890827748 0.6590773343494817 1000
 -0.22556594163026486 -0.5380079053773353 -0.811389856806174 1000
 -0.6086366020467963 0.6906832571989969 -0.39144236468976334 1000
 -0.19802179942171783 0.19942705494141388 -0.9591903964861089 1000
 -0.3341350750116501 -0.6635924611427704 0.6694309502565887 1000
 -0.9086444004452547 -0.3650083752170581 0.2029981269886168 1000
 -0.0842036908990007 0.6521979315874664 -0.7531079580458672 1000
 -0.967145379450201 0.23662016492627785 0.08942993099844958 1000
 0.0 0.0 0.0 0
 -0.04553454375058222 -0.9441145558347516 -0.32498047754653747 1000
 -0.36651625447901703 0.8055285955231465 -0.46604990826860937 1000
 0.9289138486907519 0.1314964606533475 -0.34486191808632216 1000
 -0.18472003056396824 0.7372460627131572 0.6493417846730594 1000
 -0.749261533305803 -0.6551474128563396 -0.09247173695719997 1000
 0.05315130570232948 -0.21532894629882243 -0.9748278738259263 1000
 0.872028116328931 -0.4737691479064338 0.12499503519671334 1000
 -0.07112533259417844 0.9677602079040525 -0.24064780709757627 1000
 0.0 0.0 0.0 0
 -0.7979194029896673 0.5482494076820549 0.24987239405122064 1000
 -0.9577134124517819 -0.2763574669126857 -0.08447230369515454 1000
 -0.4093085257834358 -0.9112983703830453 -0.03906162897519852 1000
 0.9550414852283162 -0.03938590129384717 0.29629295008852735 1000
 -0.49202727632303744 -0.40539889818220204 0.7704316275353638 1000
 0.04250543156471909 -0.864541355497454 0.5005242580755916 1000
 0.7979441228499666 -0.1340433710769978 0.5868207149372892 1000
 -0.003949828664518373 0.5017439399258139 0.8649476386471275 1000
 0.0 0.0 0.0 0
 -0.3029689237161959 0.6551497245617457 -0.6923703269702698 1000
 -0.41864526621499465 -0.8216090413358844 -0.38779598279366556 1000
 -0.5045519263648002 -0.6404341436554174 0.5794432338391061 1000
 0.3094353239287632 0.393137955876418 0.8656450357706746 1000
