 -0.658445	  2.212931	 -0.407377
 -0.660100	  2.217660	 -0.413808
 -0.652167	  2.194989	 -0.382977
 -0.644808	  2.169700	 -0.351248
 -0.638157	  2.145488	 -0.324184
 -0.631666	  2.120922	 -0.300382
 -0.624798	  2.094318	 -0.278098
 -0.616902	  2.064698	 -0.256271
 -0.608154	  2.033218	 -0.235324
 -0.599611	  2.001323	 -0.216471
 -0.591023	  1.967741	 -0.199063
 -0.582251	  1.931840	 -0.182311
 -0.573424	  1.893816	 -0.166006
 -0.564876	  1.854673	 -0.149752
 -0.557588	  1.815977	 -0.133927
 -0.551004	  1.773767	 -0.116630
 -0.545618	  1.726341	 -0.095505
 -0.541331	  1.676296	 -0.070362
 -0.535671	  1.616248	 -0.038636
 -0.532661	  1.550095	  0.001320
 -0.531767	  1.499444	  0.030456
 -0.534785	  1.456609	  0.043169
 -0.542539	  1.408933	  0.050586
 -0.540092	  1.377292	  0.054129
 -0.519421	  1.325648	  0.062325
 -0.470539	  1.270577	  0.071189
 -0.410923	  1.210067	  0.088342
 -0.332662	  1.140732	  0.118931
 -0.248958	  1.092574	  0.166772
 -0.171988	  1.057747	  0.215371
 -0.102249	  1.037065	  0.268382
 -0.040782	  1.024750	  0.321132
  0.011828	  1.019390	  0.373693
  0.053226	  1.016028	  0.418386
  0.089430	  1.011132	  0.457511
  0.125374	  1.003343	  0.496447
  0.161058	  0.992103	  0.537159
  0.195099	  0.977432	  0.579576
  0.227256	  0.959531	  0.624482
  0.257089	  0.938720	  0.672084
  0.284404	  0.915234	  0.723117
  0.308586	  0.889273	  0.778461
  0.328517	  0.861171	  0.839505
  0.342122	  0.832393	  0.906277
  0.347559	  0.804414	  0.976027
  0.344857	  0.778710	  1.043512
  0.337425	  0.754168	  1.107541
  0.326309	  0.729465	  1.171347
  0.313032	  0.706279	  1.233310
  0.299493	  0.684116	  1.289572
  0.287520	  0.662925	  1.340477
  0.277468	  0.643158	  1.388717
  0.269206	  0.624997	  1.435898
  0.262161	  0.608327	  1.484290
  0.256028	  0.592922	  1.535864
  0.250784	  0.579129	  1.590344
  0.247423	  0.567103	  1.645044
  0.247029	  0.555945	  1.698406
  0.250015	  0.544738	  1.750388
  0.256235	  0.532812	  1.801733
  0.264332	  0.519737	  1.851706
  0.273339	  0.506450	  1.897341
  0.283523	  0.493702	  1.938676
  0.295652	  0.481397	  1.977884
  0.310166	  0.469138	  2.016976
  0.326219	  0.457368	  2.054250
  0.344339	  0.445254	  2.089981
  0.364913	  0.432260	  2.125160
  0.388344	  0.417456	  2.159993
  0.414895	  0.398173	  2.196418
  0.440258	  0.373091	  2.230912
  0.475587	  0.321703	  2.277521
  0.494432	  0.288308	  2.301761
