  1.312197	  0.208717	  2.138321
  1.314875	  0.208895	  2.140214
  1.298346	  0.207860	  2.128996
  1.281960	  0.206735	  2.117600
  1.265408	  0.204189	  2.106662
  1.249012	  0.201333	  2.095589
  1.232776	  0.197201	  2.084666
  1.216520	  0.192753	  2.073896
  1.200759	  0.187405	  2.062808
  1.185213	  0.181679	  2.051604
  1.169406	  0.176054	  2.040734
  1.153595	  0.170476	  2.029839
  1.137905	  0.164857	  2.018688
  1.121883	  0.160458	  2.007432
  1.105446	  0.156880	  1.996501
  1.088726	  0.153721	  1.985749
  1.071008	  0.150761	  1.976872
  1.053819	  0.148234	  1.966929
  1.036084	  0.146336	  1.957556
  1.017549	  0.146792	  1.949542
  0.998966	  0.147498	  1.942308
  0.980443	  0.148377	  1.934812
  0.961857	  0.154458	  1.930807
  0.943646	  0.161875	  1.927748
  0.925935	  0.169652	  1.925646
  0.911986	  0.180718	  1.927901
  0.897883	  0.191696	  1.936124
  0.883001	  0.200425	  1.944633
  0.863514	  0.209268	  1.944751
  0.837858	  0.222325	  1.942932
  0.819164	  0.234540	  1.940885
  0.807574	  0.244964	  1.939158
  0.794994	  0.262175	  1.940252
  0.787724	  0.276616	  1.945226
  0.775360	  0.294234	  1.953867
  0.762294	  0.309449	  1.956585
  0.748658	  0.323582	  1.955494
  0.730317	  0.339513	  1.956009
  0.717304	  0.349025	  1.959283
  0.703679	  0.360341	  1.965910
  0.687570	  0.374295	  1.971992
  0.672232	  0.386321	  1.972486
  0.656512	  0.396508	  1.968267
  0.637375	  0.407339	  1.964140
  0.620044	  0.415422	  1.963578
  0.605101	  0.422643	  1.962567
  0.588207	  0.430495	  1.955629
  0.570182	  0.439967	  1.948072
  0.553375	  0.446509	  1.944655
  0.537142	  0.453442	  1.941681
  0.517235	  0.461288	  1.935549
  0.500234	  0.466111	  1.924421
  0.487280	  0.467720	  1.912783
  0.473220	  0.468092	  1.898139
  0.458997	  0.473938	  1.881514
  0.446422	  0.481949	  1.864014
  0.437074	  0.484498	  1.855098
  0.418963	  0.483755	  1.845472
  0.396899	  0.484666	  1.834279
  0.384774	  0.485727	  1.818905
  0.371459	  0.485403	  1.800589
  0.358087	  0.484886	  1.788135
  0.341055	  0.484225	  1.774722
  0.321794	  0.481458	  1.762887
  0.311118	  0.478481	  1.756260
  0.295571	  0.471845	  1.742744
  0.273470	  0.460815	  1.718693
  0.266056	  0.457336	  1.712848
  0.254949	  0.453890	  1.702793
  0.237626	  0.449372	  1.690203
  0.220538	  0.442439	  1.676920
  0.202124	  0.436509	  1.663994
  0.195258	  0.433111	  1.657439
  0.181719	  0.422154	  1.644123
  0.162140	  0.408227	  1.626595
  0.154561	  0.401871	  1.617821
  0.149099	  0.395878	  1.607998
  0.139606	  0.382819	  1.593719
  0.131542	  0.369711	  1.579352
  0.121351	  0.357632	  1.565541
  0.110130	  0.347156	  1.550331
  0.100689	  0.338325	  1.535643
  0.092597	  0.328986	  1.521070
  0.085279	  0.318661	  1.505107
  0.076905	  0.307310	  1.489322
  0.063833	  0.297353	  1.475199
  0.049979	  0.287948	  1.465362
  0.033164	  0.282057	  1.455044
  0.016927	  0.276255	  1.443624
  0.003466	  0.268662	  1.431242
 -0.008188	  0.255543	  1.416419
 -0.013047	  0.244847	  1.403017
 -0.018595	  0.232176	  1.385873
 -0.028468	  0.220362	  1.365939
 -0.041983	  0.214317	  1.351988
 -0.057812	  0.208484	  1.340332
 -0.071354	  0.203910	  1.329942
 -0.087192	  0.199439	  1.315296
 -0.102399	  0.198796	  1.300455
 -0.117074	  0.200986	  1.289980
 -0.133113	  0.202874	  1.282339
 -0.154210	  0.200763	  1.271143
 -0.178976	  0.191307	  1.254821
 -0.186979	  0.186570	  1.246259
 -0.198534	  0.181443	  1.230536
 -0.209404	  0.178674	  1.218600
 -0.225367	  0.173543	  1.201072
 -0.236025	  0.170506	  1.185407
 -0.249333	  0.170945	  1.170881
 -0.265572	  0.171212	  1.154907
 -0.275547	  0.171590	  1.142662
 -0.290452	  0.174383	  1.126569
 -0.305810	  0.178430	  1.110496
 -0.317080	  0.181831	  1.098451
 -0.332540	  0.184673	  1.083878
 -0.349141	  0.188602	  1.073564
 -0.363675	  0.191575	  1.066141
 -0.381705	  0.191111	  1.059309
 -0.413100	  0.190605	  1.049698
 -0.430703	  0.190936	  1.037397
 -0.436859	  0.191744	  1.033209
 -0.459185	  0.189136	  1.018699
 -0.482518	  0.190547	  1.002592
 -0.487056	  0.190446	  0.999410
 -0.502411	  0.193014	  0.986949
 -0.526769	  0.194596	  0.972603
 -0.542169	  0.195427	  0.961439
 -0.554768	  0.195861	  0.949445
 -0.568059	  0.195338	  0.932374
 -0.581277	  0.194525	  0.915824
 -0.595649	  0.197311	  0.903583
 -0.610895	  0.202971	  0.894162
 -0.627594	  0.210570	  0.884734
 -0.649372	  0.214779	  0.871630
 -0.666544	  0.216437	  0.860156
 -0.679721	  0.217451	  0.851613
 -0.700460	  0.216466	  0.839386
 -0.721142	  0.216863	  0.827923
 -0.732039	  0.216748	  0.821693
 -0.749928	  0.218565	  0.810931
 -0.773836	  0.210621	  0.789863
 -0.783717	  0.205102	  0.781742
 -0.794519	  0.199525	  0.771456
 -0.813256	  0.190123	  0.754934
 -0.830857	  0.185651	  0.743422
 -0.844292	  0.184720	  0.733765
 -0.857668	  0.185045	  0.726389
 -0.877673	  0.188078	  0.711310
 -0.898693	  0.190749	  0.696277
 -0.912698	  0.192334	  0.685932
 -0.925470	  0.194207	  0.676569
 -0.940638	  0.194351	  0.666784
 -0.954879	  0.193466	  0.653195
 -0.974030	  0.195896	  0.636571
 -0.994585	  0.190183	  0.626424
 -1.009428	  0.188048	  0.618968
 -1.024884	  0.185446	  0.610796
 -1.043452	  0.182048	  0.598243
 -1.058352	  0.179706	  0.586228
 -1.072198	  0.176731	  0.575057
 -1.087041	  0.173121	  0.559480
 -1.098009	  0.169549	  0.544665
 -1.110511	  0.164286	  0.530832
 -1.121653	  0.160557	  0.513793
 -1.129087	  0.158972	  0.496079
 -1.140628	  0.153448	  0.479513
 -1.154890	  0.146724	  0.462034
 -1.166923	  0.147230	  0.441968
 -1.173783	  0.152620	  0.424007
 -1.175161	  0.155597	  0.406423
 -1.173899	  0.155181	  0.383693
 -1.172881	  0.154126	  0.362762
 -1.176653	  0.151606	  0.342718
 -1.180270	  0.147948	  0.323396
 -1.184545	  0.144674	  0.304204
 -1.189795	  0.141230	  0.288263
 -1.200385	  0.130848	  0.282596
 -1.214759	  0.118409	  0.280520
 -1.228796	  0.105092	  0.283475
 -1.242255	  0.091445	  0.288945
 -1.254656	  0.077841	  0.295135
 -1.267434	  0.065371	  0.303418
 -1.280175	  0.052096	  0.312635
 -1.292922	  0.038751	  0.321099
 -1.305807	  0.025288	  0.326998
 -1.318243	  0.012371	  0.334064
 -1.333551	  0.001157	  0.343698
 -1.350726	 -0.011351	  0.350895
 -1.366445	 -0.027333	  0.351361
 -1.378544	 -0.043570	  0.349490
 -1.391689	 -0.057690	  0.350543
 -1.406000	 -0.073807	  0.350642
 -1.419537	 -0.088620	  0.351648
 -1.431978	 -0.103411	  0.351333
 -1.446810	 -0.117883	  0.351734
 -1.460065	 -0.131820	  0.351259
 -1.475414	 -0.145203	  0.350570
 -1.489710	 -0.157373	  0.349594
 -1.505492	 -0.169671	  0.348214
 -1.521353	 -0.178772	  0.346552
 -1.537539	 -0.184729	  0.343498
 -1.549382	 -0.186724	  0.342162
 -1.563661	 -0.190969	  0.337514
 -1.581272	 -0.190549	  0.330829
 -1.599353	 -0.185263	  0.324279
 -1.616669	 -0.178866	  0.319055
 -1.628946	 -0.173327	  0.318341
 -1.647584	 -0.168056	  0.321643
 -1.664599	 -0.161978	  0.325999
 -1.685289	 -0.156612	  0.331857
 -1.705915	 -0.148313	  0.331013
 -1.723214	 -0.138244	  0.325542
 -1.740546	 -0.127817	  0.322127
 -1.756660	 -0.115683	  0.317318
 -1.771199	 -0.103752	  0.309588
 -1.784673	 -0.091207	  0.302609
 -1.797001	 -0.080000	  0.296694
 -1.809020	 -0.069675	  0.291198
 -1.822823	 -0.055118	  0.283584
 -1.835349	 -0.041467	  0.275403
 -1.847519	 -0.027340	  0.268746
 -1.859220	 -0.015874	  0.263936
 -1.872028	 -0.001742	  0.257294
 -1.886208	  0.014919	  0.251505
 -1.900602	  0.028150	  0.249380
 -1.916377	  0.039675	  0.247186
 -1.933296	  0.052418	  0.243234
 -1.947875	  0.065206	  0.236153
 -1.961757	  0.078496	  0.229957
 -1.976558	  0.091599	  0.220891
 -1.990706	  0.105151	  0.211979
 -2.004849	  0.119304	  0.202720
 -2.017915	  0.131428	  0.192188
 -2.030758	  0.142640	  0.181289
 -2.043398	  0.153877	  0.170989
 -2.056903	  0.164794	  0.158960
 -2.070467	  0.175305	  0.146512
 -2.083512	  0.180858	  0.131466
 -2.097615	  0.180921	  0.115626
 -2.116947	  0.184429	  0.107412
 -2.142657	  0.194184	  0.096970
 -2.154972	  0.203259	  0.084024
 -2.163151	  0.212259	  0.074625
 -2.176284	  0.220287	  0.060354
 -2.189951	  0.227247	  0.046369
 -2.202910	  0.229959	  0.033788
 -2.219174	  0.229589	  0.023115
 -2.240225	  0.234725	  0.015036
 -2.256042	  0.240912	  0.003177
 -2.266009	  0.247990	 -0.009493
 -2.275611	  0.261460	 -0.023421
 -2.294848	  0.272914	 -0.036944
 -2.313503	  0.276117	 -0.044008
 -2.327377	  0.278765	 -0.047251
 -2.346159	  0.284023	 -0.058382
 -2.357934	  0.294652	 -0.076469
 -2.369908	  0.301572	 -0.091770
 -2.384784	  0.307726	 -0.104515
 -2.401010	  0.312755	 -0.116922
 -2.417713	  0.315174	 -0.130130
 -2.433876	  0.317523	 -0.143017
 -2.450060	  0.319664	 -0.154982
 -2.466774	  0.320969	 -0.167606
 -2.483658	  0.322536	 -0.179976
 -2.499536	  0.322308	 -0.193161
 -2.514897	  0.322214	 -0.206000
 -2.532456	  0.321193	 -0.220630
 -2.539100	  0.297227	 -0.242545
 -2.554412	  0.296657	 -0.255398
