 -1.669309	 -0.074950	  1.877756
 -1.682197	 -0.072224	  1.879850
 -1.662866	 -0.076302	  1.876742
 -1.643402	 -0.080182	  1.874364
 -1.623660	 -0.083321	  1.874558
 -1.603903	 -0.086397	  1.874933
 -1.584118	 -0.089001	  1.876240
 -1.564335	 -0.091415	  1.877908
 -1.544540	 -0.093893	  1.879310
 -1.524729	 -0.096550	  1.879981
 -1.504917	 -0.099211	  1.880576
 -1.485088	 -0.101801	  1.880318
 -1.465267	 -0.104354	  1.879534
 -1.445443	 -0.106855	  1.878700
 -1.425575	 -0.108633	  1.877262
 -1.405704	 -0.110326	  1.875756
 -1.385826	 -0.111770	  1.874089
 -1.365951	 -0.112670	  1.872056
 -1.346072	 -0.113512	  1.870026
 -1.326133	 -0.113734	  1.868497
 -1.306173	 -0.113592	  1.867255
 -1.286212	 -0.113352	  1.866054
 -1.266275	 -0.112390	  1.865043
 -1.246445	 -0.111129	  1.863918
 -1.228099	 -0.108594	  1.860896
 -1.208109	 -0.102694	  1.854157
 -1.188154	 -0.099026	  1.851746
 -1.165244	 -0.102042	  1.858355
 -1.145810	 -0.102488	  1.862769
 -1.126881	 -0.099540	  1.862502
 -1.107632	 -0.097899	  1.863011
 -1.086154	 -0.096285	  1.864624
 -1.067450	 -0.092546	  1.863508
 -1.048856	 -0.090492	  1.863334
 -1.025601	 -0.088099	  1.865655
 -1.004618	 -0.080091	  1.864175
 -0.992519	 -0.072939	  1.861004
 -0.970678	 -0.066728	  1.862806
 -0.948173	 -0.065574	  1.867464
 -0.928330	 -0.066963	  1.869594
 -0.910068	 -0.071786	  1.874020
 -0.888608	 -0.078506	  1.877468
 -0.868799	 -0.086077	  1.878002
 -0.852201	 -0.089319	  1.880355
 -0.828870	 -0.089479	  1.884318
 -0.808171	 -0.095103	  1.885579
 -0.795189	 -0.104379	  1.886398
 -0.775178	 -0.116684	  1.887824
 -0.754103	 -0.120564	  1.888713
 -0.735463	 -0.119575	  1.890949
 -0.714654	 -0.121064	  1.892711
 -0.695032	 -0.121734	  1.893960
 -0.674880	 -0.119591	  1.895861
 -0.653910	 -0.119884	  1.897264
 -0.636136	 -0.120677	  1.898639
 -0.615127	 -0.118748	  1.900320
 -0.593536	 -0.120297	  1.900314
 -0.577345	 -0.125135	  1.899447
 -0.552412	 -0.125939	  1.899407
 -0.529015	 -0.125432	  1.898362
 -0.518481	 -0.125137	  1.897702
 -0.496439	 -0.125494	  1.897270
 -0.475814	 -0.129935	  1.894053
 -0.455605	 -0.131965	  1.890759
 -0.435952	 -0.131060	  1.887127
 -0.417063	 -0.126903	  1.882169
 -0.398213	 -0.122387	  1.877246
 -0.379835	 -0.116631	  1.872372
 -0.366827	 -0.103042	  1.867657
 -0.358484	 -0.087807	  1.861081
 -0.356818	 -0.066660	  1.860380
 -0.351254	 -0.047966	  1.863287
 -0.350204	 -0.031848	  1.863747
 -0.350625	 -0.004062	  1.854415
 -0.342152	  0.013551	  1.848276
 -0.329245	  0.027280	  1.844244
 -0.311083	  0.041640	  1.841328
 -0.295988	  0.057801	  1.835557
 -0.286447	  0.071651	  1.831627
 -0.277393	  0.085571	  1.829654
 -0.262948	  0.098202	  1.825679
 -0.246857	  0.110876	  1.815401
 -0.237097	  0.123282	  1.807235
 -0.223512	  0.135175	  1.802035
 -0.205023	  0.140878	  1.795532
 -0.189904	  0.148726	  1.785497
 -0.177868	  0.161246	  1.775701
 -0.164109	  0.169025	  1.768359
 -0.145776	  0.172318	  1.760399
 -0.129775	  0.178874	  1.751537
 -0.108515	  0.187211	  1.738046
 -0.090048	  0.184416	  1.728806
 -0.072626	  0.179683	  1.721117
 -0.059608	  0.171291	  1.715656
 -0.046937	  0.162153	  1.711669
 -0.024037	  0.141404	  1.705681
 -0.011020	  0.135491	  1.697502
  0.003806	  0.129111	  1.687512
  0.018095	  0.118195	  1.677057
  0.026727	  0.097640	  1.672870
  0.032994	  0.077517	  1.669267
  0.041825	  0.061881	  1.665218
  0.053631	  0.044494	  1.662608
  0.065254	  0.023273	  1.663435
  0.070629	  0.003383	  1.661054
  0.074835	 -0.013851	  1.657855
  0.074726	 -0.034322	  1.655051
  0.073068	 -0.055565	  1.651439
  0.071457	 -0.076039	  1.650306
  0.073842	 -0.099979	  1.646520
  0.079993	 -0.118392	  1.646473
  0.086658	 -0.127313	  1.648133
  0.090639	 -0.148840	  1.640662
  0.092881	 -0.167982	  1.633973
  0.101048	 -0.187504	  1.633461
  0.109206	 -0.206687	  1.627486
  0.118790	 -0.225084	  1.616351
  0.126513	 -0.234677	  1.609744
  0.137543	 -0.247826	  1.602615
  0.145069	 -0.271781	  1.590932
  0.148857	 -0.289537	  1.578102
  0.153319	 -0.298545	  1.568733
  0.164871	 -0.307923	  1.552338
  0.178687	 -0.320687	  1.542905
  0.199246	 -0.340557	  1.534493
  0.204685	 -0.346960	  1.532051
  0.218336	 -0.363026	  1.527309
  0.237470	 -0.377398	  1.524608
  0.249991	 -0.389898	  1.525106
  0.258614	 -0.403296	  1.526858
  0.268613	 -0.423967	  1.527132
  0.280944	 -0.440354	  1.531242
  0.290090	 -0.454821	  1.532615
  0.306998	 -0.474878	  1.531447
  0.325747	 -0.486937	  1.532424
  0.340975	 -0.493073	  1.534616
  0.362341	 -0.497467	  1.542300
  0.384049	 -0.498180	  1.552121
  0.399816	 -0.499699	  1.560763
  0.414607	 -0.505420	  1.566507
  0.433900	 -0.511002	  1.575462
  0.448196	 -0.519977	  1.582916
  0.464814	 -0.527246	  1.592398
  0.481459	 -0.531271	  1.603203
  0.499582	 -0.531340	  1.612364
  0.516043	 -0.526454	  1.622670
  0.532277	 -0.521398	  1.633151
  0.548244	 -0.516220	  1.643951
  0.560281	 -0.506714	  1.656836
  0.570788	 -0.495843	  1.669968
  0.581227	 -0.484957	  1.683195
  0.590722	 -0.474105	  1.697130
  0.597141	 -0.461585	  1.711436
  0.602902	 -0.449270	  1.726070
  0.608610	 -0.437002	  1.740756
  0.614654	 -0.424633	  1.755280
  0.623403	 -0.414617	  1.770211
  0.633300	 -0.405873	  1.785226
  0.643135	 -0.397311	  1.800368
  0.652810	 -0.388915	  1.815747
  0.662723	 -0.380563	  1.830999
  0.674915	 -0.375017	  1.845759
  0.688238	 -0.370916	  1.860020
  0.701491	 -0.367090	  1.874544
  0.714518	 -0.363482	  1.889292
  0.727489	 -0.360211	  1.904099
  0.740725	 -0.362800	  1.918790
  0.754641	 -0.366194	  1.932473
  0.770514	 -0.367769	  1.944962
  0.786787	 -0.369758	  1.957007
  0.802826	 -0.373701	  1.968498
  0.818937	 -0.384842	  1.979368
  0.831345	 -0.398957	  1.987984
  0.839997	 -0.415733	  2.001278
  0.846580	 -0.426120	  2.018589
  0.856713	 -0.431584	  2.034051
  0.872912	 -0.434306	  2.042531
  0.886634	 -0.436370	  2.043271
  0.901899	 -0.441350	  2.043536
  0.918702	 -0.443355	  2.036747
  0.934385	 -0.439777	  2.029901
  0.951639	 -0.432086	  2.026841
  0.959549	 -0.419220	  2.014257
  0.965362	 -0.408292	  1.998051
  0.971584	 -0.397424	  1.982956
  0.977552	 -0.384302	  1.969298
  0.983787	 -0.372892	  1.956963
  0.998784	 -0.363477	  1.940971
  1.011150	 -0.357329	  1.923811
  1.017181	 -0.348846	  1.904807
  1.022098	 -0.342020	  1.891770
  1.032642	 -0.328760	  1.875309
  1.043221	 -0.317467	  1.861331
  1.048082	 -0.307663	  1.851958
  1.057311	 -0.292791	  1.833194
  1.063696	 -0.275164	  1.813393
  1.066511	 -0.267645	  1.805548
  1.078210	 -0.258655	  1.787789
  1.099921	 -0.252871	  1.774122
  1.122663	 -0.251613	  1.766367
  1.145086	 -0.251079	  1.759451
  1.167416	 -0.252375	  1.757310
  1.188965	 -0.254199	  1.757034
  1.209280	 -0.256392	  1.757298
  1.229327	 -0.259679	  1.758343
  1.249147	 -0.264218	  1.760775
  1.269001	 -0.268627	  1.764029
  1.289078	 -0.271606	  1.766079
  1.308158	 -0.273248	  1.768222
  1.325927	 -0.275130	  1.770673
  1.344126	 -0.277083	  1.773128
  1.364272	 -0.278362	  1.772398
  1.384822	 -0.281613	  1.772753
  1.404527	 -0.284524	  1.770245
  1.423878	 -0.289614	  1.769236
  1.442533	 -0.294943	  1.768696
  1.462363	 -0.298042	  1.767127
  1.482829	 -0.301935	  1.767290
  1.502522	 -0.303451	  1.766907
  1.521890	 -0.306026	  1.767482
  1.541011	 -0.308660	  1.767642
  1.560345	 -0.309699	  1.765719
  1.579704	 -0.312132	  1.765326
  1.599274	 -0.314267	  1.764920
  1.619063	 -0.314423	  1.763467
  1.638810	 -0.314334	  1.762081
  1.658912	 -0.314284	  1.761286
  1.679239	 -0.314153	  1.760785
  1.699368	 -0.313382	  1.759711
  1.719721	 -0.313598	  1.759212
  1.740876	 -0.314738	  1.760183
  1.761188	 -0.316610	  1.762348
  1.779749	 -0.324554	  1.772755
  1.799624	 -0.326682	  1.773433
