 0.0 0.0 0.0 0
 -0.47443721780592013 0.05782835783653881 -0.8784385051843454 1000
 0.521350746217862 0.7115557243539795 -0.47083102123496706 1000
 -0.6710256142507841 -0.3910732219261721 0.6302938680580994 1000
 -0.17676092298644577 0.47463694725572847 -0.8617524844204062 1000
 0.4892634250023031 -0.735098866784059 0.4684399182475892 1000
 -0.5840405931779039 0.49067902715746026 0.6462179801183272 1000
 0.8879630740166912 -0.4149784831522094 -0.199086508090126 1000
 -0.9899122937417135 -0.08080289922278225 -0.11669850974289507 1000
 0.0 0.0 0.0 0
 -0.8426937728943075 0.515172485882239 -0.15434220069401586 1000
 0.29395193536255015 -0.1688451400003152 -0.9405129336669886 1000
 0.7652143457944406 -0.3445593229758399 0.5451338165449077 1000
 -0.3547700654115631 -0.8617752422956408 0.36227701066195855 1000
 0.5055924969066509 -0.40218418778970005 0.7626697228575667 1000
 0.26105460616946796 0.9246666362420273 0.27557413597534547 1000
 0.12042950040294902 0.7523659352982972 -0.6479430799348153 1000
 0.20700271054701452 0.5545081648478885 0.8050711601735687 1000
 0.0 0.0 0.0 0
 -0.9776520474940485 0.02112590579608238 0.2114572536826052 1000
 -0.4848067805400874 -0.6328228803475965 -0.6043083547750496 1000
