 -2.354462	  0.487797	 -0.774979
 -2.369933	  0.498384	 -0.794126
 -2.358424	  0.490500	 -0.779800
 -2.346524	  0.483680	 -0.765218
 -2.334289	  0.477000	 -0.750884
 -2.321807	  0.470459	 -0.736708
 -2.308999	  0.464764	 -0.722434
 -2.296192	  0.459075	 -0.708165
 -2.282975	  0.453451	 -0.694248
 -2.269449	  0.447880	 -0.680609
 -2.255920	  0.442309	 -0.666975
 -2.241887	  0.436499	 -0.653963
 -2.227764	  0.430646	 -0.641067
 -2.213567	  0.424744	 -0.628276
 -2.198683	  0.418382	 -0.616530
 -2.183798	  0.412013	 -0.604788
 -2.169512	  0.404615	 -0.592907
 -2.155756	  0.396389	 -0.580943
 -2.142101	  0.388003	 -0.569276
 -2.128854	  0.378523	 -0.559088
 -2.114508	  0.368373	 -0.545828
 -2.102964	  0.359617	 -0.532464
 -2.090734	  0.348352	 -0.522392
 -2.077531	  0.335779	 -0.513180
 -2.065321	  0.325165	 -0.501442
 -2.053470	  0.315999	 -0.489533
 -2.039637	  0.303287	 -0.478540
 -2.029005	  0.293429	 -0.465697
 -2.017986	  0.285833	 -0.451931
 -2.006081	  0.277099	 -0.435767
 -1.994711	  0.267866	 -0.423362
 -1.981239	  0.258710	 -0.412162
 -1.968392	  0.253093	 -0.396382
 -1.958733	  0.246831	 -0.381504
 -1.946188	  0.238202	 -0.369341
 -1.931442	  0.228098	 -0.356190
 -1.919635	  0.218457	 -0.341841
 -1.906077	  0.222434	 -0.325701
 -1.891683	  0.227517	 -0.312059
 -1.877609	  0.231032	 -0.295778
 -1.864844	  0.228209	 -0.281653
 -1.849245	  0.223420	 -0.269564
 -1.833445	  0.225160	 -0.256961
 -1.816982	  0.231239	 -0.245680
 -1.800893	  0.233698	 -0.233717
 -1.784074	  0.237164	 -0.224015
 -1.769343	  0.247551	 -0.209259
 -1.760408	  0.253005	 -0.195155
 -1.744135	  0.259565	 -0.182931
 -1.727493	  0.264161	 -0.174632
 -1.710068	  0.268514	 -0.164156
 -1.693762	  0.272936	 -0.153772
 -1.676004	  0.276081	 -0.145243
 -1.658146	  0.278544	 -0.136555
 -1.640649	  0.280653	 -0.126892
 -1.623112	  0.282148	 -0.117378
 -1.604963	  0.281615	 -0.108507
 -1.586988	  0.279920	 -0.099892
 -1.568908	  0.276357	 -0.092616
 -1.551631	  0.270650	 -0.083543
 -1.537137	  0.263255	 -0.073863
 -1.524546	  0.257192	 -0.059242
 -1.514719	  0.252957	 -0.042481
 -1.502497	  0.249498	 -0.029933
 -1.491141	  0.244639	 -0.014007
 -1.478007	  0.238665	  0.001962
 -1.465947	  0.229394	  0.015600
 -1.454218	  0.215093	  0.026282
 -1.449099	  0.193901	  0.031700
 -1.438385	  0.189829	  0.045317
 -1.434033	  0.177147	  0.059828
 -1.428264	  0.159927	  0.071883
 -1.423978	  0.144114	  0.084323
 -1.421946	  0.131000	  0.097124
 -1.423040	  0.114306	  0.110060
 -1.421108	  0.099425	  0.119627
 -1.419975	  0.082303	  0.127503
 -1.415664	  0.067838	  0.145658
 -1.411545	  0.053159	  0.162272
 -1.409064	  0.039015	  0.168364
 -1.405886	  0.019286	  0.178169
 -1.405732	  0.005137	  0.191371
 -1.403542	 -0.009365	  0.205487
 -1.399070	 -0.026526	  0.215944
 -1.389786	 -0.043172	  0.226866
 -1.383968	 -0.055810	  0.239786
 -1.379218	 -0.069385	  0.251748
 -1.370166	 -0.086637	  0.261629
 -1.360423	 -0.099876	  0.272633
 -1.352305	 -0.113914	  0.283462
 -1.341608	 -0.126755	  0.296436
 -1.333379	 -0.133486	  0.313801
 -1.325632	 -0.142793	  0.332404
 -1.312337	 -0.154740	  0.342658
 -1.298932	 -0.166786	  0.349292
 -1.284111	 -0.175517	  0.358950
 -1.268636	 -0.183306	  0.369943
 -1.252376	 -0.189333	  0.379626
 -1.233978	 -0.195427	  0.388945
 -1.220042	 -0.209647	  0.397568
 -1.207092	 -0.221906	  0.402274
 -1.192457	 -0.231198	  0.411605
 -1.173866	 -0.240610	  0.426204
 -1.160091	 -0.247888	  0.434747
 -1.149271	 -0.259118	  0.443462
 -1.133394	 -0.273200	  0.451330
 -1.120656	 -0.280837	  0.464049
 -1.107777	 -0.289474	  0.477643
 -1.095783	 -0.302920	  0.488158
 -1.085598	 -0.313564	  0.499366
 -1.071444	 -0.322972	  0.514149
 -1.058889	 -0.335124	  0.528032
 -1.055031	 -0.348943	  0.538016
 -1.049029	 -0.363084	  0.552933
 -1.042173	 -0.373161	  0.568741
 -1.033373	 -0.384291	  0.583502
 -1.022609	 -0.394803	  0.596829
 -1.011547	 -0.405734	  0.609627
 -1.001686	 -0.415886	  0.624043
 -0.988860	 -0.421602	  0.637586
 -0.970855	 -0.421612	  0.646591
 -0.952856	 -0.420777	  0.655162
 -0.934629	 -0.420402	  0.663501
 -0.916374	 -0.420199	  0.671708
 -0.897561	 -0.415157	  0.676270
 -0.878750	 -0.409614	  0.680270
 -0.860053	 -0.403817	  0.684419
 -0.841457	 -0.397901	  0.688755
 -0.822895	 -0.391987	  0.693262
 -0.804145	 -0.387225	  0.698363
 -0.785358	 -0.383009	  0.703585
 -0.766229	 -0.380033	  0.708529
 -0.746888	 -0.376223	  0.713674
 -0.728736	 -0.371571	  0.718955
 -0.709362	 -0.369581	  0.723696
 -0.689580	 -0.366836	  0.728539
 -0.671915	 -0.363534	  0.734515
 -0.653669	 -0.363812	  0.741102
 -0.631622	 -0.361178	  0.745913
 -0.613705	 -0.356275	  0.747665
 -0.592556	 -0.354003	  0.750443
 -0.574582	 -0.356394	  0.757966
 -0.557767	 -0.353098	  0.766628
 -0.539048	 -0.353511	  0.777063
 -0.521095	 -0.356621	  0.783758
 -0.506361	 -0.359936	  0.796235
 -0.492976	 -0.362947	  0.808394
 -0.478515	 -0.368328	  0.821265
 -0.464720	 -0.374732	  0.833903
 -0.463882	 -0.385489	  0.851014
 -0.464852	 -0.398527	  0.865418
 -0.470179	 -0.410666	  0.883562
 -0.478391	 -0.420133	  0.897759
 -0.487856	 -0.432808	  0.908218
 -0.495811	 -0.448127	  0.919995
 -0.504834	 -0.461065	  0.932456
 -0.517763	 -0.471183	  0.944323
 -0.527307	 -0.483125	  0.957055
 -0.534765	 -0.496690	  0.971245
 -0.541832	 -0.510162	  0.984827
 -0.549957	 -0.522925	  0.998445
 -0.554684	 -0.538104	  1.008869
 -0.560726	 -0.554314	  1.018993
 -0.565630	 -0.567811	  1.034099
 -0.568775	 -0.583054	  1.049751
 -0.569915	 -0.599540	  1.057813
 -0.571012	 -0.621068	  1.064151
 -0.571562	 -0.639749	  1.073740
 -0.574324	 -0.656010	  1.084509
 -0.572869	 -0.668089	  1.101544
 -0.570951	 -0.679191	  1.121202
 -0.562744	 -0.688948	  1.137639
 -0.560125	 -0.699624	  1.150661
 -0.555384	 -0.715577	  1.166691
 -0.549037	 -0.729503	  1.179404
 -0.548162	 -0.748803	  1.186135
 -0.543158	 -0.766287	  1.196041
 -0.534735	 -0.778069	  1.209663
 -0.524796	 -0.787283	  1.226126
 -0.519525	 -0.800587	  1.242557
 -0.508109	 -0.808355	  1.257540
 -0.493972	 -0.816922	  1.269495
 -0.486000	 -0.828027	  1.282074
 -0.479080	 -0.843056	  1.294575
 -0.467957	 -0.855450	  1.306131
 -0.456548	 -0.870115	  1.315446
 -0.446991	 -0.883918	  1.327329
 -0.435249	 -0.893138	  1.339944
 -0.423085	 -0.900490	  1.352516
 -0.413435	 -0.917075	  1.367532
 -0.401604	 -0.930482	  1.378384
 -0.392323	 -0.938446	  1.385931
 -0.379383	 -0.949571	  1.399948
 -0.364106	 -0.958116	  1.413660
 -0.352828	 -0.968816	  1.422737
 -0.340495	 -0.982336	  1.432493
 -0.328510	 -0.995107	  1.442287
 -0.314730	 -1.006395	  1.451971
 -0.302131	 -1.016820	  1.463451
 -0.288979	 -1.026957	  1.474009
 -0.275026	 -1.037059	  1.486126
 -0.260654	 -1.048659	  1.498973
 -0.251467	 -1.055179	  1.509545
 -0.240218	 -1.063627	  1.524640
 -0.228281	 -1.076637	  1.541179
 -0.215032	 -1.084951	  1.548976
 -0.201424	 -1.091824	  1.562464
 -0.189240	 -1.098992	  1.579250
 -0.175403	 -1.106365	  1.591744
 -0.160987	 -1.111701	  1.602715
 -0.147654	 -1.118713	  1.617678
 -0.140069	 -1.125645	  1.634387
 -0.131093	 -1.133686	  1.650587
 -0.120427	 -1.141392	  1.666504
 -0.109238	 -1.148245	  1.682095
 -0.098460	 -1.154702	  1.697508
 -0.088637	 -1.160531	  1.714159
 -0.081215	 -1.165407	  1.731433
 -0.072308	 -1.171874	  1.748352
 -0.062230	 -1.179235	  1.764124
 -0.051623	 -1.186949	  1.779267
 -0.040183	 -1.194828	  1.793655
 -0.028145	 -1.202816	  1.807486
 -0.016117	 -1.210811	  1.821321
 -0.004936	 -1.219176	  1.835638
  0.006033	 -1.227359	  1.850222
  0.015064	 -1.233839	  1.866847
  0.024091	 -1.240309	  1.883480
  0.034294	 -1.246303	  1.899603
  0.044856	 -1.252143	  1.915551
  0.055425	 -1.257989	  1.931491
  0.067069	 -1.265311	  1.946008
  0.079967	 -1.274555	  1.958179
  0.092872	 -1.283808	  1.970338
  0.105815	 -1.293059	  1.982459
  0.119815	 -1.302210	  1.993423
  0.133821	 -1.311361	  2.004382
  0.147885	 -1.320460	  2.015310
  0.162132	 -1.329393	  2.026136
  0.176381	 -1.338324	  2.036962
  0.190821	 -1.347081	  2.047678
  0.205372	 -1.355733	  2.058327
  0.219931	 -1.364375	  2.068974
  0.234605	 -1.372865	  2.079584
  0.249278	 -1.381355	  2.090197
  0.263574	 -1.390000	  2.101191
  0.277652	 -1.398727	  2.112389
  0.291573	 -1.407358	  2.123605
  0.305090	 -1.415760	  2.135717
