  2.217324	  1.038110	 -0.543621
  2.204058	  1.040468	 -0.556375
  2.203760	  1.040521	 -0.556662
  2.188881	  1.041488	 -0.569339
  2.174311	  1.042091	 -0.582711
  2.160428	  1.043287	 -0.596919
  2.146150	  1.044467	 -0.612448
  2.134084	  1.045017	 -0.627673
  2.119721	  1.052868	 -0.643062
  2.105420	  1.058861	 -0.653997
  2.089400	  1.060901	 -0.665387
  2.074174	  1.062255	 -0.678263
  2.058798	  1.066847	 -0.692970
  2.043375	  1.074581	 -0.703511
  2.026123	  1.078567	 -0.710736
  2.009173	  1.080003	 -0.721357
  1.992943	  1.082650	 -0.734253
  1.975872	  1.090779	 -0.744003
  1.956702	  1.095616	 -0.749312
  1.940188	  1.101414	 -0.755547
  1.922113	  1.110031	 -0.766748
  1.909776	  1.123076	 -0.779163
  1.899122	  1.131747	 -0.791987
  1.883381	  1.132673	 -0.806355
  1.867094	  1.131748	 -0.817933
  1.853705	  1.132512	 -0.835349
  1.843689	  1.142051	 -0.854013
  1.832050	  1.152721	 -0.861102
  1.818075	  1.158435	 -0.876587
  1.802922	  1.163521	 -0.892940
  1.788944	  1.165858	 -0.901445
  1.771624	  1.172347	 -0.911983
  1.756612	  1.178038	 -0.925803
  1.744387	  1.178007	 -0.944245
  1.733461	  1.180331	 -0.959569
  1.722156	  1.188334	 -0.974263
  1.709720	  1.194080	 -0.989715
  1.696106	  1.194446	 -1.004269
  1.681609	  1.192990	 -1.018390
  1.666611	  1.192957	 -1.034224
  1.654327	  1.200205	 -1.047948
  1.642021	  1.210930	 -1.060379
  1.628759	  1.218470	 -1.074259
  1.615316	  1.221925	 -1.087386
  1.600921	  1.228832	 -1.101167
  1.587590	  1.236943	 -1.115961
  1.575322	  1.241678	 -1.126368
  1.559664	  1.246750	 -1.140293
  1.545961	  1.253952	 -1.153921
  1.534520	  1.265380	 -1.164618
  1.521745	  1.275323	 -1.177604
  1.509387	  1.282986	 -1.190855
  1.496762	  1.293282	 -1.203933
  1.484724	  1.304000	 -1.218049
  1.470639	  1.305632	 -1.229466
  1.454538	  1.309699	 -1.240412
  1.434989	  1.313155	 -1.255175
  1.420473	  1.318689	 -1.267770
  1.409780	  1.326698	 -1.279187
  1.398234	  1.335697	 -1.292159
  1.385078	  1.343706	 -1.306251
  1.370705	  1.351240	 -1.318547
  1.355184	  1.356248	 -1.330633
  1.342319	  1.357499	 -1.347772
  1.331199	  1.363524	 -1.361706
  1.317895	  1.371428	 -1.374634
  1.305541	  1.378869	 -1.389246
  1.292283	  1.381610	 -1.405384
  1.277785	  1.383712	 -1.418191
  1.262029	  1.387718	 -1.429950
  1.247507	  1.391518	 -1.443508
  1.234217	  1.396045	 -1.457802
  1.220656	  1.400889	 -1.471212
  1.206182	  1.406274	 -1.483774
  1.191654	  1.409001	 -1.500290
  1.181731	  1.411835	 -1.516332
  1.169242	  1.418550	 -1.530079
  1.155995	  1.425347	 -1.543839
  1.143237	  1.430175	 -1.559372
  1.130980	  1.433366	 -1.574192
  1.117147	  1.437543	 -1.588890
  1.102536	  1.443173	 -1.599704
  1.086756	  1.448296	 -1.612115
  1.072903	  1.452832	 -1.624702
  1.059365	  1.458428	 -1.637260
  1.041572	  1.464096	 -1.652879
  1.025504	  1.466297	 -1.664459
  1.011374	  1.468285	 -1.676096
  0.998852	  1.471848	 -1.687838
  0.983020	  1.477400	 -1.700630
  0.966161	  1.481054	 -1.712808
  0.949397	  1.483090	 -1.725647
  0.934835	  1.485252	 -1.735842
  0.920367	  1.488862	 -1.749835
  0.905372	  1.493746	 -1.762387
  0.887090	  1.502268	 -1.769876
  0.868682	  1.510710	 -1.776427
  0.850494	  1.515148	 -1.786614
  0.833342	  1.521259	 -1.800364
  0.821814	  1.526389	 -1.808383
