  1.966637	  1.337104	  1.877602
  1.947166	  1.323865	  1.859012
  1.904297	  1.319553	  1.843361
  1.859807	  1.306749	  1.825571
  1.816106	  1.290398	  1.807502
  1.773922	  1.271412	  1.790124
  1.732040	  1.250136	  1.773255
  1.691512	  1.227931	  1.757412
  1.650829	  1.205501	  1.741950
  1.610035	  1.183326	  1.727548
  1.567767	  1.163165	  1.712355
  1.520720	  1.155754	  1.692171
  1.476889	  1.142134	  1.668360
  1.434289	  1.122782	  1.649679
  1.394313	  1.102376	  1.631489
  1.353780	  1.079740	  1.612300
  1.311867	  1.054181	  1.593268
  1.270766	  1.028228	  1.576718
  1.230658	  1.003802	  1.562607
  1.189580	  0.980689	  1.549063
  1.146318	  0.958706	  1.534919
  1.103085	  0.939814	  1.520984
  1.060247	  0.922960	  1.506428
  1.013516	  0.911607	  1.494147
  0.970254	  0.894812	  1.477215
  0.925315	  0.883849	  1.456284
  0.881981	  0.859648	  1.439526
  0.838504	  0.841442	  1.421989
  0.794906	  0.825398	  1.405346
  0.751177	  0.803189	  1.393219
  0.709429	  0.783514	  1.374154
  0.668099	  0.765617	  1.354672
  0.624472	  0.753544	  1.339345
  0.583155	  0.730526	  1.322793
  0.542049	  0.709953	  1.303171
  0.506581	  0.675566	  1.286093
  0.467135	  0.647431	  1.270255
  0.427333	  0.623457	  1.254647
  0.384897	  0.601486	  1.238542
  0.339910	  0.583117	  1.221545
  0.293044	  0.570633	  1.202754
  0.246463	  0.562909	  1.181479
  0.200434	  0.556660	  1.158265
  0.156181	  0.550217	  1.134729
  0.112128	  0.541483	  1.111483
  0.068629	  0.529577	  1.088754
  0.024889	  0.515840	  1.066222
 -0.019357	  0.501672	  1.044330
 -0.062169	  0.486322	  1.025091
 -0.104813	  0.467809	  1.006335
 -0.144632	  0.449030	  0.988954
 -0.188060	  0.429761	  0.970099
 -0.232819	  0.409318	  0.952434
 -0.275492	  0.387689	  0.938394
 -0.316471	  0.364531	  0.923680
 -0.358967	  0.339838	  0.907471
 -0.401647	  0.316916	  0.892659
 -0.443931	  0.295546	  0.880493
 -0.488179	  0.274219	  0.871235
 -0.531835	  0.253431	  0.864960
 -0.573853	  0.232385	  0.859630
 -0.617878	  0.208418	  0.848979
 -0.662184	  0.182753	  0.832369
 -0.704583	  0.158322	  0.814559
 -0.745678	  0.135436	  0.797464
 -0.785195	  0.114509	  0.781694
 -0.825062	  0.094603	  0.766731
 -0.868064	  0.074874	  0.751692
 -0.913507	  0.056263	  0.736625
 -0.959099	  0.040334	  0.719145
 -1.003084	  0.026366	  0.699233
 -1.044255	  0.013104	  0.675302
 -1.084420	  0.001168	  0.649953
 -1.126564	 -0.009408	  0.624486
 -1.170017	 -0.021275	  0.601005
 -1.207688	 -0.040824	  0.578879
 -1.225471	 -0.077844	  0.559808
 -1.218947	 -0.162504	  0.556346
 -1.215081	 -0.335004	  0.559227
 -1.257192	 -0.454902	  0.546956
 -1.284359	 -0.477093	  0.540617
 -1.293751	 -0.478917	  0.538445
 -1.366241	 -0.463012	  0.521060
 -1.507069	 -0.397040	  0.491755
 -1.604468	 -0.296648	  0.472441
 -1.647321	 -0.251756	  0.446379
 -1.686161	 -0.264392	  0.418583
 -1.724836	 -0.286434	  0.396588
 -1.768390	 -0.310378	  0.377208
 -1.828129	 -0.334163	  0.359471
 -1.938003	 -0.338954	  0.349432
 -2.090057	 -0.279627	  0.395711
 -2.184888	 -0.191521	  0.456265
 -2.197379	 -0.186094	  0.457542
 -2.210242	 -0.259672	  0.405625
 -2.141145	 -0.361157	  0.308888
 -2.136992	 -0.420917	  0.259265
 -2.171647	 -0.446736	  0.235566
 -2.213527	 -0.461876	  0.216008
 -2.258604	 -0.476471	  0.199534
 -2.303877	 -0.492425	  0.184178
 -2.346073	 -0.508229	  0.168060
 -2.388979	 -0.525540	  0.150082
 -2.432832	 -0.545121	  0.131212
 -2.473880	 -0.565670	  0.112433
 -2.513402	 -0.586043	  0.093748
 -2.554725	 -0.607244	  0.078526
 -2.597394	 -0.629878	  0.061541
 -2.636672	 -0.655827	  0.042670
 -2.676715	 -0.680887	  0.025440
 -2.721642	 -0.697774	  0.010929
 -2.763553	 -0.719133	 -0.005690
 -2.805608	 -0.741668	 -0.018491
 -2.847835	 -0.760202	 -0.042180
 -2.895470	 -0.782581	 -0.061829
 -2.924424	 -0.790407	 -0.062447
