 -1.674745	 -1.516805	 -2.018770
 -1.658163	 -1.501787	 -1.998782
 -1.611495	 -1.490655	 -1.969777
 -1.567827	 -1.492105	 -1.942072
 -1.527756	 -1.484741	 -1.912824
 -1.486163	 -1.479462	 -1.886403
 -1.444509	 -1.480716	 -1.861368
 -1.403803	 -1.483982	 -1.832501
 -1.363435	 -1.482565	 -1.803182
 -1.322082	 -1.480144	 -1.775341
 -1.280103	 -1.478936	 -1.747791
 -1.237384	 -1.477159	 -1.720159
 -1.195791	 -1.474393	 -1.693411
 -1.156062	 -1.471465	 -1.668851
 -1.113278	 -1.467797	 -1.643663
 -1.072659	 -1.462935	 -1.620867
 -1.027351	 -1.457870	 -1.594723
 -0.983568	 -1.453123	 -1.566869
 -0.943876	 -1.448950	 -1.538564
 -0.905996	 -1.445494	 -1.510065
 -0.867902	 -1.441752	 -1.480201
 -0.831210	 -1.440629	 -1.447617
 -0.801465	 -1.448069	 -1.415075
 -0.778533	 -1.470072	 -1.377984
 -0.757692	 -1.540196	 -1.291458
 -0.745426	 -1.591412	 -1.230997
 -0.707488	 -1.659925	 -1.128290
 -0.691601	 -1.679206	 -1.089953
 -0.675543	 -1.689229	 -1.068019
 -0.621114	 -1.719935	 -0.979334
 -0.588910	 -1.731965	 -0.920932
 -0.566860	 -1.733530	 -0.898342
 -0.517147	 -1.728865	 -0.879366
 -0.450255	 -1.713211	 -0.873033
 -0.396545	 -1.673587	 -0.858464
 -0.355454	 -1.636317	 -0.846283
 -0.297858	 -1.589633	 -0.835023
 -0.261990	 -1.559726	 -0.835211
 -0.226619	 -1.525266	 -0.844043
 -0.127602	 -1.430425	 -0.881108
 -0.064444	 -1.385139	 -0.886661
 -0.021125	 -1.365216	 -0.872998
  0.019143	 -1.353829	 -0.848923
  0.059028	 -1.345827	 -0.820124
  0.098221	 -1.339678	 -0.791328
  0.137069	 -1.334775	 -0.764734
  0.181003	 -1.330345	 -0.737504
  0.222583	 -1.326782	 -0.712864
  0.267064	 -1.323588	 -0.686924
  0.309982	 -1.321466	 -0.661795
  0.352060	 -1.320910	 -0.636805
  0.393804	 -1.322477	 -0.611677
  0.434287	 -1.325192	 -0.586683
  0.478762	 -1.327632	 -0.557944
  0.521241	 -1.328718	 -0.529406
  0.560112	 -1.328283	 -0.502611
  0.603039	 -1.326231	 -0.473998
  0.645789	 -1.323356	 -0.446290
  0.686332	 -1.321837	 -0.421063
  0.725811	 -1.324606	 -0.399379
  0.758804	 -1.332851	 -0.384473
  0.788280	 -1.347444	 -0.376045
  0.873445	 -1.416409	 -0.366625
  0.959004	 -1.493706	 -0.369614
  1.012062	 -1.520197	 -0.362280
  1.070029	 -1.541835	 -0.355746
  1.141167	 -1.536264	 -0.365821
  1.236811	 -1.482059	 -0.418831
  1.421498	 -1.398417	 -0.506223
  1.474502	 -1.366626	 -0.520897
  1.498862	 -1.355540	 -0.518529
  1.538281	 -1.347462	 -0.505075
  1.581355	 -1.350206	 -0.484730
  1.596299	 -1.358123	 -0.475907
  1.608121	 -1.404639	 -0.449575
  1.594334	 -1.548480	 -0.336302
  1.583895	 -1.711923	 -0.155582
  1.578248	 -1.710906	 -0.033135
  1.594870	 -1.664348	  0.044160
  1.621599	 -1.615826	  0.100293
  1.657415	 -1.549883	  0.163022
  1.689470	 -1.365008	  0.247073
  1.679604	 -1.242468	  0.281980
  1.688790	 -1.204498	  0.302177
  1.721856	 -1.196179	  0.328352
  1.760613	 -1.197361	  0.358012
  1.800987	 -1.198530	  0.389019
  1.845315	 -1.197602	  0.419804
  1.887600	 -1.195655	  0.447173
  1.929098	 -1.192796	  0.473863
  1.967575	 -1.189212	  0.500988
  2.007745	 -1.182916	  0.530330
  2.049444	 -1.172890	  0.559241
  2.087358	 -1.162524	  0.585690
  2.128059	 -1.153104	  0.615112
  2.168657	 -1.146048	  0.643582
  2.207634	 -1.141255	  0.669278
  2.250182	 -1.137583	  0.696303
  2.293896	 -1.136226	  0.722580
  2.334703	 -1.136899	  0.746649
  2.377779	 -1.137030	  0.773645
  2.421083	 -1.134017	  0.801588
  2.457675	 -1.131740	  0.834077
  2.504797	 -1.134010	  0.857353
  2.544897	 -1.126629	  0.886042
  2.583172	 -1.122279	  0.913250
  2.618360	 -1.125898	  0.936239
  2.644544	 -1.137157	  0.945601
