  0.150385	 -2.198838	  1.181025
  0.149934	 -2.198450	  1.180820
  0.135954	 -2.186429	  1.174459
  0.121881	 -2.174035	  1.167646
  0.106917	 -2.163138	  1.161270
  0.090753	 -2.153041	  1.153991
  0.074787	 -2.142018	  1.147322
  0.061707	 -2.126070	  1.141925
  0.049309	 -2.113876	  1.133606
  0.034749	 -2.103440	  1.125752
  0.019657	 -2.091633	  1.119372
  0.006348	 -2.078434	  1.111642
 -0.006416	 -2.064972	  1.103953
 -0.020691	 -2.052145	  1.097236
 -0.038509	 -2.041504	  1.097019
 -0.054698	 -2.028592	  1.098534
 -0.069307	 -2.012965	  1.099038
 -0.083654	 -1.998631	  1.099016
 -0.100447	 -1.992038	  1.100471
 -0.120725	 -1.983443	  1.098028
 -0.137381	 -1.974670	  1.090512
 -0.155302	 -1.964183	  1.086254
 -0.174127	 -1.953986	  1.086646
 -0.188426	 -1.945018	  1.091581
 -0.206914	 -1.933756	  1.093382
 -0.222044	 -1.922208	  1.089567
 -0.239679	 -1.911805	  1.086372
 -0.259465	 -1.900754	  1.083519
 -0.274626	 -1.895966	  1.083826
 -0.294123	 -1.889553	  1.081636
 -0.314077	 -1.881890	  1.080425
 -0.330958	 -1.872441	  1.080241
 -0.348070	 -1.864984	  1.077443
 -0.371674	 -1.859553	  1.074725
 -0.389628	 -1.853705	  1.076577
 -0.407276	 -1.850010	  1.070665
 -0.428210	 -1.846494	  1.063425
 -0.445991	 -1.839011	  1.063764
 -0.463534	 -1.832203	  1.060362
 -0.483583	 -1.826940	  1.054953
 -0.502038	 -1.822444	  1.047654
 -0.518670	 -1.814428	  1.044410
 -0.538278	 -1.807293	  1.042964
 -0.557589	 -1.803178	  1.032791
 -0.574232	 -1.795523	  1.027332
 -0.589922	 -1.787162	  1.023908
 -0.607136	 -1.775909	  1.013416
 -0.625317	 -1.769743	  1.010660
 -0.644850	 -1.762510	  1.011010
 -0.663899	 -1.758827	  1.002882
 -0.682814	 -1.753999	  0.994672
 -0.698524	 -1.746281	  0.991096
 -0.715810	 -1.736270	  0.984483
 -0.732254	 -1.723274	  0.979257
 -0.748824	 -1.716864	  0.977798
 -0.765405	 -1.707581	  0.973599
 -0.784564	 -1.694290	  0.964571
 -0.799542	 -1.683432	  0.963161
 -0.815821	 -1.677899	  0.958344
 -0.834435	 -1.668763	  0.949686
 -0.849807	 -1.655130	  0.948497
 -0.866139	 -1.645824	  0.948597
 -0.882745	 -1.632990	  0.946957
 -0.898532	 -1.620849	  0.938294
 -0.915475	 -1.615039	  0.933618
 -0.934125	 -1.602112	  0.934672
 -0.948628	 -1.593420	  0.931588
 -0.966888	 -1.583630	  0.926610
 -0.982042	 -1.569981	  0.923843
 -0.997527	 -1.557722	  0.925172
 -1.015481	 -1.548578	  0.923810
 -1.033652	 -1.540680	  0.919841
 -1.054010	 -1.534492	  0.912077
 -1.072037	 -1.526785	  0.909083
 -1.089453	 -1.517043	  0.904144
 -1.105645	 -1.505168	  0.904257
 -1.124088	 -1.498350	  0.903242
 -1.143633	 -1.493949	  0.904655
 -1.162628	 -1.487188	  0.905472
 -1.181346	 -1.481711	  0.900226
 -1.196349	 -1.469263	  0.901029
 -1.213566	 -1.457396	  0.901884
 -1.234215	 -1.450125	  0.894856
 -1.248428	 -1.440638	  0.891703
 -1.262859	 -1.429426	  0.889554
 -1.281029	 -1.418683	  0.883836
 -1.298310	 -1.409964	  0.877423
 -1.314382	 -1.401257	  0.869303
 -1.330269	 -1.392683	  0.861122
 -1.346764	 -1.384894	  0.853341
 -1.362391	 -1.377690	  0.845267
 -1.379690	 -1.367662	  0.831918
 -1.392424	 -1.357757	  0.822380
 -1.406236	 -1.347312	  0.815888
 -1.421405	 -1.337654	  0.805481
 -1.435310	 -1.327160	  0.796091
 -1.449136	 -1.314623	  0.788097
 -1.462629	 -1.302081	  0.777757
 -1.475695	 -1.295994	  0.766795
 -1.491974	 -1.287524	  0.755061
 -1.504452	 -1.277614	  0.741861
 -1.513560	 -1.262460	  0.730834
 -1.522114	 -1.250393	  0.718529
 -1.539245	 -1.235003	  0.714254
 -1.554730	 -1.219452	  0.712647
 -1.568897	 -1.209049	  0.705055
 -1.580406	 -1.203554	  0.692288
 -1.599220	 -1.191743	  0.684478
 -1.611706	 -1.178400	  0.675401
 -1.629938	 -1.169222	  0.673019
 -1.645263	 -1.159804	  0.670537
 -1.663249	 -1.151371	  0.671332
 -1.680607	 -1.141808	  0.665430
 -1.697920	 -1.129920	  0.664637
 -1.712390	 -1.114533	  0.659113
 -1.729536	 -1.107057	  0.650734
 -1.747937	 -1.101012	  0.645060
 -1.763214	 -1.093870	  0.642332
 -1.783469	 -1.086195	  0.639144
 -1.804084	 -1.079751	  0.640539
 -1.821507	 -1.069767	  0.640598
 -1.838110	 -1.061827	  0.637536
 -1.858721	 -1.057191	  0.634315
 -1.877748	 -1.049196	  0.632356
 -1.893263	 -1.039390	  0.628438
 -1.912270	 -1.034175	  0.623984
 -1.932514	 -1.027510	  0.620346
 -1.948124	 -1.016510	  0.615789
 -1.965203	 -1.006311	  0.609922
 -1.982044	 -1.001302	  0.603743
 -2.000727	 -0.995007	  0.597043
 -2.018391	 -0.987677	  0.590656
 -2.035375	 -0.979791	  0.583629
 -2.052138	 -0.971739	  0.576268
 -2.068900	 -0.963685	  0.568907
 -2.085471	 -0.954998	  0.561842
 -2.101986	 -0.946139	  0.554858
 -2.118423	 -0.936918	  0.548164
 -2.134541	 -0.926553	  0.542440
 -2.150705	 -0.916434	  0.536698
 -2.167254	 -0.906334	  0.531696
 -2.184057	 -0.896418	  0.526806
 -2.200581	 -0.884860	  0.523768
 -2.215965	 -0.871391	  0.524028
 -2.229240	 -0.854453	  0.524205
 -2.242012	 -0.841692	  0.519084
 -2.258285	 -0.830063	  0.513812
 -2.274862	 -0.818564	  0.509827
 -2.290842	 -0.806538	  0.509081
 -2.317581	 -0.786858	  0.509580
 -2.322704	 -0.783067	  0.509552
