  1.781540	 -1.625864	 -0.212731
  1.774666	 -1.640192	 -0.211384
  1.783286	 -1.622224	 -0.213073
  1.791663	 -1.604149	 -0.214832
  1.799554	 -1.585869	 -0.216731
  1.807445	 -1.567590	 -0.218629
  1.815267	 -1.549315	 -0.220832
  1.823075	 -1.531042	 -0.223094
  1.830963	 -1.512813	 -0.225438
  1.839132	 -1.494748	 -0.228066
  1.847301	 -1.476682	 -0.230695
  1.855853	 -1.458809	 -0.233413
  1.864684	 -1.441081	 -0.236198
  1.873514	 -1.423353	 -0.238982
  1.882913	 -1.405874	 -0.241456
  1.892321	 -1.388398	 -0.243924
  1.901936	 -1.371006	 -0.246173
  1.911763	 -1.353704	 -0.248193
  1.921593	 -1.336404	 -0.250212
  1.931697	 -1.319248	 -0.252109
  1.941801	 -1.302093	 -0.254005
  1.952042	 -1.285004	 -0.255765
  1.962418	 -1.267983	 -0.257387
  1.972810	 -1.250970	 -0.258985
  1.983461	 -1.234085	 -0.260199
  1.994111	 -1.217200	 -0.261413
  2.004921	 -1.200393	 -0.262221
  2.015809	 -1.183627	 -0.262826
  2.026749	 -1.166889	 -0.263218
  2.037796	 -1.150218	 -0.263143
  2.048844	 -1.133546	 -0.263069
  2.059648	 -1.116727	 -0.262443
  2.070441	 -1.099902	 -0.261792
  2.080766	 -1.082808	 -0.260704
  2.090808	 -1.065564	 -0.259356
  2.100492	 -1.048144	 -0.257693
  2.109570	 -1.030457	 -0.255510
  2.118460	 -1.012687	 -0.253235
  2.126492	 -0.994568	 -0.250554
  2.134524	 -0.976448	 -0.247873
  2.141535	 -0.957903	 -0.245246
  2.148483	 -0.939333	 -0.242623
  2.154747	 -0.920468	 -0.240416
  2.160517	 -0.901413	 -0.238508
  2.166287	 -0.882359	 -0.236600
  2.172448	 -0.863353	 -0.235708
  2.178621	 -0.844349	 -0.234849
  2.184971	 -0.825401	 -0.234019
  2.192049	 -0.806709	 -0.233308
  2.199127	 -0.788017	 -0.232598
  2.206391	 -0.769395	 -0.231925
  2.213823	 -0.750838	 -0.231285
  2.221255	 -0.732282	 -0.230646
  2.228709	 -0.713745	 -0.229719
  2.236162	 -0.695209	 -0.228790
  2.243601	 -0.676679	 -0.227650
  2.251027	 -0.658156	 -0.226335
  2.258455	 -0.639637	 -0.224969
  2.265897	 -0.621155	 -0.223227
  2.273338	 -0.602672	 -0.221484
  2.280860	 -0.584251	 -0.219469
  2.288419	 -0.565859	 -0.217326
  2.296028	 -0.547495	 -0.215119
  2.303821	 -0.529238	 -0.212675
  2.311614	 -0.510982	 -0.210231
  2.319625	 -0.492834	 -0.207683
  2.327729	 -0.474735	 -0.205091
  2.335879	 -0.456655	 -0.202501
  2.344290	 -0.438693	 -0.199929
  2.352700	 -0.420730	 -0.197356
  2.361307	 -0.402842	 -0.194922
  2.370076	 -0.385017	 -0.192602
  2.378844	 -0.367192	 -0.190281
  2.387613	 -0.349367	 -0.187961
  2.399066	 -0.326374	 -0.185082
  2.407993	 -0.308608	 -0.182918
