 -2.096869	 -0.330343	 -1.205597
 -2.134851	 -0.357298	 -1.217038
 -2.119181	 -0.345647	 -1.212713
 -2.103464	 -0.334471	 -1.208372
 -2.089923	 -0.322487	 -1.207637
 -2.077198	 -0.303049	 -1.209869
 -2.060102	 -0.282961	 -1.205111
 -2.043801	 -0.272389	 -1.197170
 -2.030188	 -0.269159	 -1.190678
 -2.012413	 -0.261977	 -1.187076
 -1.996240	 -0.250785	 -1.186814
 -1.977871	 -0.232543	 -1.183099
 -1.959188	 -0.218977	 -1.174284
 -1.947888	 -0.214095	 -1.167984
 -1.930551	 -0.205481	 -1.163427
 -1.910392	 -0.196020	 -1.157479
 -1.892348	 -0.193895	 -1.153009
 -1.869538	 -0.196238	 -1.154201
 -1.843625	 -0.193881	 -1.149495
 -1.828459	 -0.182039	 -1.138643
 -1.816208	 -0.168861	 -1.127427
 -1.802642	 -0.157458	 -1.119050
 -1.787040	 -0.146455	 -1.112401
 -1.772578	 -0.136312	 -1.106117
 -1.756711	 -0.125159	 -1.097816
 -1.740908	 -0.115277	 -1.089767
 -1.725561	 -0.105885	 -1.083736
 -1.711445	 -0.094989	 -1.076825
 -1.696878	 -0.081906	 -1.065606
 -1.680959	 -0.073442	 -1.055355
 -1.663017	 -0.068003	 -1.049241
 -1.644815	 -0.060481	 -1.046872
 -1.626158	 -0.050438	 -1.044051
 -1.607873	 -0.040442	 -1.039350
 -1.593045	 -0.030833	 -1.031540
 -1.578906	 -0.021072	 -1.021992
 -1.565004	 -0.010465	 -1.011379
 -1.550584	  0.000467	 -1.002910
 -1.536161	  0.011374	 -0.994623
 -1.521377	  0.021834	 -0.985886
 -1.507915	  0.033315	 -0.976562
 -1.496056	  0.045184	 -0.967653
 -1.482643	  0.057930	 -0.957131
 -1.467499	  0.070020	 -0.948867
 -1.450498	  0.079805	 -0.944887
 -1.428658	  0.088929	 -0.940802
 -1.410595	  0.095532	 -0.936263
 -1.393944	  0.100426	 -0.930971
 -1.376358	  0.106835	 -0.922906
 -1.358174	  0.116949	 -0.910026
 -1.346536	  0.125233	 -0.902842
 -1.331957	  0.135348	 -0.894356
 -1.314427	  0.152586	 -0.883119
 -1.302037	  0.163026	 -0.873748
 -1.296851	  0.169591	 -0.868077
 -1.283795	  0.191183	 -0.849188
 -1.272670	  0.209020	 -0.834320
 -1.265110	  0.214529	 -0.821867
 -1.252743	  0.227130	 -0.810886
 -1.232259	  0.237042	 -0.797172
 -1.218553	  0.242909	 -0.786385
 -1.210776	  0.243897	 -0.780755
 -1.187713	  0.246667	 -0.765970
 -1.170421	  0.252877	 -0.754345
 -1.151269	  0.263152	 -0.739622
 -1.136571	  0.268988	 -0.741884
 -1.130867	  0.278344	 -0.727009
 -1.113822	  0.284752	 -0.715887
 -1.095962	  0.299874	 -0.697255
 -1.080705	  0.312998	 -0.692548
 -1.069712	  0.320860	 -0.686510
 -1.050347	  0.332547	 -0.675329
 -1.037090	  0.338225	 -0.663417
 -1.027179	  0.342030	 -0.649441
 -1.014843	  0.347607	 -0.630641
 -1.007136	  0.352742	 -0.621693
 -0.986664	  0.359396	 -0.604674
 -0.965956	  0.362806	 -0.594513
 -0.945340	  0.371484	 -0.589033
 -0.931002	  0.382095	 -0.584374
 -0.919304	  0.394092	 -0.578021
 -0.904761	  0.406176	 -0.567064
 -0.888707	  0.413550	 -0.558741
 -0.870346	  0.417891	 -0.552963
 -0.849455	  0.424628	 -0.546828
 -0.834543	  0.432126	 -0.539768
 -0.821648	  0.442921	 -0.532338
 -0.802079	  0.457429	 -0.522003
 -0.787305	  0.467476	 -0.516568
 -0.773239	  0.476593	 -0.511580
 -0.753512	  0.487778	 -0.503233
 -0.743506	  0.494550	 -0.498106
 -0.729057	  0.505442	 -0.490159
 -0.706991	  0.520740	 -0.479289
 -0.694510	  0.528090	 -0.474213
 -0.680663	  0.538429	 -0.469119
 -0.663896	  0.549976	 -0.461367
 -0.652196	  0.557548	 -0.454101
 -0.629555	  0.574307	 -0.437229
 -0.618542	  0.579934	 -0.429588
 -0.607077	  0.584240	 -0.421073
 -0.586405	  0.587459	 -0.412282
 -0.564197	  0.590930	 -0.403219
 -0.549662	  0.595964	 -0.397803
 -0.532491	  0.603521	 -0.389973
 -0.510729	  0.609347	 -0.380586
 -0.494939	  0.608904	 -0.377013
 -0.471950	  0.606116	 -0.374378
 -0.450151	  0.605926	 -0.366030
 -0.435766	  0.607138	 -0.357713
 -0.419084	  0.609554	 -0.346599
 -0.401426	  0.611035	 -0.335492
 -0.385912	  0.611653	 -0.325237
 -0.367660	  0.609560	 -0.314605
 -0.353132	  0.605908	 -0.308765
 -0.332108	  0.599668	 -0.306724
 -0.301411	  0.596669	 -0.300492
 -0.288112	  0.597506	 -0.295353
 -0.271875	  0.605847	 -0.287084
 -0.254187	  0.614203	 -0.278292
 -0.238515	  0.621034	 -0.272009
 -0.218610	  0.628149	 -0.268350
 -0.190539	  0.631020	 -0.263570
 -0.175180	  0.630297	 -0.258861
 -0.156240	  0.629190	 -0.254480
 -0.134006	  0.628826	 -0.246255
 -0.114655	  0.627977	 -0.235794
 -0.103972	  0.629393	 -0.230702
 -0.084736	  0.635702	 -0.219515
 -0.067040	  0.641949	 -0.209632
 -0.050682	  0.646499	 -0.200281
 -0.033907	  0.653521	 -0.190832
 -0.019507	  0.661215	 -0.182036
 -0.002760	  0.668109	 -0.171812
  0.015789	  0.671257	 -0.163816
  0.037324	  0.674564	 -0.157602
  0.054235	  0.679540	 -0.151630
  0.075357	  0.683485	 -0.143611
  0.092429	  0.690628	 -0.139282
  0.105765	  0.700809	 -0.142412
  0.123329	  0.716317	 -0.148294
  0.148555	  0.739846	 -0.152067
  0.164242	  0.757126	 -0.150840
  0.169484	  0.757506	 -0.145531
  0.184120	  0.763591	 -0.138768
  0.206954	  0.773881	 -0.126421
  0.223823	  0.784588	 -0.124493
  0.241758	  0.794242	 -0.120772
  0.254766	  0.800090	 -0.117618
  0.276657	  0.806544	 -0.122587
  0.295362	  0.817506	 -0.108027
  0.307755	  0.810871	 -0.133005
  0.327196	  0.825765	 -0.118280
  0.353864	  0.828971	 -0.132475
  0.372724	  0.836499	 -0.119377
  0.386915	  0.834969	 -0.141159
  0.404264	  0.837752	 -0.133719
  0.420537	  0.842002	 -0.140705
  0.447944	  0.844270	 -0.143185
  0.477069	  0.840251	 -0.134089
  0.489472	  0.837657	 -0.130650
  0.507782	  0.839518	 -0.125533
  0.527491	  0.844932	 -0.124980
  0.549318	  0.851801	 -0.129527
  0.567329	  0.857525	 -0.134686
  0.591493	  0.858746	 -0.137017
  0.608499	  0.859251	 -0.141313
  0.623530	  0.862936	 -0.144410
  0.645085	  0.863617	 -0.140948
  0.666454	  0.864069	 -0.138978
  0.686972	  0.866289	 -0.136739
  0.708191	  0.866969	 -0.134004
  0.729176	  0.867104	 -0.135660
  0.747233	  0.863646	 -0.138691
  0.764136	  0.861102	 -0.143126
  0.785875	  0.860808	 -0.149602
  0.804579	  0.863025	 -0.150030
  0.823490	  0.864170	 -0.151801
  0.846592	  0.866126	 -0.154279
  0.867792	  0.865721	 -0.158933
  0.886439	  0.862391	 -0.164079
  0.904440	  0.866149	 -0.166682
  0.925862	  0.867323	 -0.169753
  0.946780	  0.874484	 -0.168246
  0.963241	  0.876954	 -0.163593
  0.982834	  0.879595	 -0.159682
  1.003039	  0.883821	 -0.154271
  1.021618	  0.890143	 -0.148006
  1.040136	  0.896931	 -0.144138
  1.059451	  0.901552	 -0.140480
  1.076310	  0.908488	 -0.136499
  1.087783	  0.918552	 -0.135308
  1.104225	  0.928034	 -0.139450
  1.121804	  0.940734	 -0.137283
  1.141352	  0.953682	 -0.139657
  1.155134	  0.962975	 -0.132733
  1.173528	  0.970244	 -0.134529
  1.191234	  0.976834	 -0.127182
  1.211583	  0.986714	 -0.122864
  1.230656	  0.992266	 -0.117458
  1.247554	  1.001597	 -0.111332
  1.262983	  1.018977	 -0.108178
  1.267726	  1.034467	 -0.107055
  1.277030	  1.051570	 -0.104897
  1.287551	  1.062414	 -0.105029
  1.294508	  1.086689	 -0.103113
  1.303954	  1.103524	 -0.098788
  1.315980	  1.118081	 -0.095590
  1.324204	  1.138170	 -0.093842
  1.337991	  1.147098	 -0.089714
  1.344252	  1.166268	 -0.091260
  1.349759	  1.186021	 -0.092688
  1.356200	  1.205852	 -0.095408
  1.359815	  1.224650	 -0.097246
  1.362423	  1.243370	 -0.097230
  1.367097	  1.262376	 -0.096588
  1.370514	  1.283760	 -0.092806
  1.374875	  1.306320	 -0.084754
  1.383827	  1.321008	 -0.083661
  1.387597	  1.337061	 -0.087143
  1.393696	  1.363056	 -0.085198
  1.397859	  1.387059	 -0.081704
  1.401871	  1.403676	 -0.081939
  1.397824	  1.416705	 -0.078632
  1.398151	  1.438995	 -0.073475
  1.397410	  1.460936	 -0.071557
  1.395237	  1.482363	 -0.072369
  1.394111	  1.499291	 -0.072348
  1.393009	  1.521857	 -0.074589
  1.390748	  1.545828	 -0.075392
  1.387418	  1.561552	 -0.071655
  1.384124	  1.577955	 -0.068089
  1.380168	  1.599437	 -0.058450
  1.374970	  1.616392	 -0.045943
  1.369675	  1.632532	 -0.032948
  1.367675	  1.649461	 -0.022543
  1.368389	  1.668171	 -0.013209
  1.369297	  1.687131	 -0.004070
  1.368236	  1.704624	  0.003729
  1.366850	  1.725549	  0.007378
  1.363896	  1.748247	  0.005950
  1.359017	  1.770053	  0.004834
  1.353119	  1.789425	  0.007803
  1.345999	  1.804912	  0.014241
  1.340781	  1.821937	  0.024588
  1.338076	  1.840789	  0.035490
  1.334547	  1.858157	  0.046697
  1.329081	  1.875016	  0.059998
  1.318290	  1.891132	  0.068695
  1.304557	  1.907170	  0.074556
  1.291025	  1.920151	  0.081011
  1.280321	  1.933944	  0.089264
  1.268025	  1.948679	  0.099193
  1.252078	  1.962263	  0.108661
  1.235837	  1.970966	  0.117248
  1.224658	  1.976141	  0.125451
  1.214685	  1.985504	  0.139774
  1.209429	  1.991585	  0.148811
  1.206538	  1.995578	  0.157580
  1.201032	  2.003465	  0.171592
  1.196718	  2.006349	  0.191529
  1.199248	  2.005529	  0.210601
  1.204129	  2.004839	  0.229210
  1.212099	  2.002234	  0.247793
  1.219828	  1.998061	  0.266470
  1.230121	  1.995255	  0.286417
  1.239072	  1.994125	  0.301229
  1.251282	  1.991798	  0.316488
  1.263002	  1.988277	  0.335013
  1.278049	  1.985281	  0.353864
  1.290508	  1.984729	  0.361303
  1.309979	  1.985153	  0.369690
  1.329811	  1.982828	  0.383143
  1.344961	  1.976363	  0.402374
  1.351570	  1.972113	  0.415385
  1.361777	  1.973580	  0.435841
  1.371914	  1.980157	  0.450609
  1.386082	  1.985719	  0.466455
  1.400012	  1.989729	  0.480873
  1.415207	  1.994662	  0.493539
  1.431327	  2.000133	  0.505554
  1.449283	  2.005425	  0.515292
  1.471485	  2.006671	  0.514563
  1.487532	  2.013306	  0.524487
