 -1.174757	 -1.783198	  1.314234
 -1.165341	 -1.783805	  1.307677
 -1.159467	 -1.784184	  1.303586
 -1.142686	 -1.783401	  1.293375
 -1.122842	 -1.784348	  1.283860
 -1.108140	 -1.786730	  1.270662
 -1.097196	 -1.792788	  1.250828
 -1.088663	 -1.805533	  1.231242
 -1.078996	 -1.815797	  1.213828
 -1.064121	 -1.820874	  1.194853
 -1.047298	 -1.821151	  1.184284
 -1.031327	 -1.823776	  1.176136
 -1.016070	 -1.825719	  1.169294
 -0.993575	 -1.825727	  1.154153
 -0.979411	 -1.824002	  1.144434
 -0.958816	 -1.827139	  1.136383
 -0.933355	 -1.833700	  1.128996
 -0.918765	 -1.838224	  1.124170
 -0.907446	 -1.841212	  1.118635
 -0.888821	 -1.852028	  1.107198
 -0.874852	 -1.858976	  1.095891
 -0.861777	 -1.863321	  1.083864
 -0.840584	 -1.870966	  1.062844
 -0.829475	 -1.877743	  1.051780
 -0.820455	 -1.885767	  1.041935
 -0.808772	 -1.897879	  1.027191
 -0.795652	 -1.910407	  1.013795
 -0.788468	 -1.919901	  1.006376
 -0.778312	 -1.933199	  0.996658
 -0.770456	 -1.949379	  0.984412
 -0.760316	 -1.969107	  0.960821
 -0.757423	 -1.974450	  0.953236
 -0.750374	 -1.985043	  0.937814
 -0.741018	 -1.994081	  0.927040
 -0.718007	 -2.001498	  0.907168
 -0.704155	 -2.007164	  0.894927
 -0.693703	 -2.013538	  0.884894
 -0.682054	 -2.025233	  0.871709
 -0.670860	 -2.037335	  0.858853
 -0.659082	 -2.048353	  0.847837
 -0.647460	 -2.059999	  0.835662
 -0.638691	 -2.071686	  0.822807
 -0.630287	 -2.084545	  0.810716
 -0.621098	 -2.097593	  0.797290
 -0.610646	 -2.109427	  0.782911
 -0.600198	 -2.123660	  0.769368
 -0.589254	 -2.137937	  0.754328
 -0.580563	 -2.147922	  0.741358
 -0.566966	 -2.154344	  0.724400
 -0.545200	 -2.156886	  0.707927
 -0.536016	 -2.155599	  0.700884
 -0.512399	 -2.154503	  0.685443
 -0.493471	 -2.154673	  0.673244
 -0.479085	 -2.157204	  0.655837
 -0.470222	 -2.162379	  0.646309
 -0.460676	 -2.171801	  0.630039
 -0.450090	 -2.180645	  0.611831
 -0.437488	 -2.186072	  0.598183
 -0.422486	 -2.193317	  0.583817
 -0.411400	 -2.202277	  0.574009
 -0.397936	 -2.213672	  0.563243
 -0.384490	 -2.223272	  0.548884
 -0.369462	 -2.231921	  0.534823
 -0.355580	 -2.235379	  0.526817
 -0.334997	 -2.233501	  0.516158
 -0.315433	 -2.235933	  0.503300
 -0.303593	 -2.242310	  0.491180
 -0.294236	 -2.255571	  0.474706
 -0.282848	 -2.267774	  0.461732
 -0.262980	 -2.269177	  0.447154
 -0.246778	 -2.263807	  0.439209
 -0.226336	 -2.259887	  0.432736
 -0.208227	 -2.260371	  0.421813
 -0.191678	 -2.259611	  0.410406
 -0.175223	 -2.258774	  0.399067
 -0.158748	 -2.257991	  0.387745
 -0.142170	 -2.255816	  0.376767
 -0.125453	 -2.252442	  0.366312
 -0.108742	 -2.249057	  0.355858
 -0.092022	 -2.245685	  0.345414
 -0.075155	 -2.241273	  0.335607
 -0.058241	 -2.235600	  0.326564
 -0.041338	 -2.229874	  0.317531
 -0.024500	 -2.224144	  0.308417
 -0.007838	 -2.218450	  0.298789
  0.008776	 -2.210849	  0.290294
  0.025508	 -2.202739	  0.282647
  0.042608	 -2.194275	  0.276506
  0.059890	 -2.186041	  0.270993
  0.077031	 -2.177528	  0.264980
  0.093684	 -2.168235	  0.258833
  0.110219	 -2.158945	  0.252188
  0.126819	 -2.149244	  0.246359
  0.143673	 -2.139233	  0.241903
  0.160668	 -2.129097	  0.239163
  0.177641	 -2.119023	  0.235608
  0.194391	 -2.108926	  0.231381
  0.211660	 -2.100066	  0.227230
  0.230032	 -2.092733	  0.224190
  0.249032	 -2.086999	  0.220787
  0.268003	 -2.082398	  0.215671
  0.286321	 -2.077388	  0.209129
  0.302793	 -2.071146	  0.202854
  0.320168	 -2.063604	  0.199850
  0.340058	 -2.060361	  0.196376
  0.361142	 -2.059546	  0.183736
  0.372366	 -2.061739	  0.171943
  0.386820	 -2.067292	  0.153354
  0.406834	 -2.069847	  0.140888
  0.420157	 -2.070820	  0.134309
  0.441526	 -2.070843	  0.126549
  0.457897	 -2.072362	  0.116884
  0.471530	 -2.075438	  0.105699
  0.491714	 -2.078778	  0.089268
  0.506417	 -2.079234	  0.081446
  0.526109	 -2.079527	  0.074416
  0.543992	 -2.081840	  0.064260
  0.556753	 -2.085197	  0.053987
  0.573338	 -2.090715	  0.038698
  0.588613	 -2.093324	  0.028116
  0.605182	 -2.095310	  0.021125
  0.628868	 -2.099083	  0.006108
  0.640179	 -2.100979	 -0.005974
  0.649190	 -2.102860	 -0.016752
  0.667113	 -2.105145	 -0.034650
  0.679488	 -2.108200	 -0.047947
  0.692202	 -2.116114	 -0.067902
  0.703676	 -2.122292	 -0.084652
  0.718142	 -2.124595	 -0.097446
  0.731697	 -2.122515	 -0.103378
  0.751140	 -2.119496	 -0.116363
  0.765417	 -2.121182	 -0.132224
  0.779438	 -2.122889	 -0.146522
  0.793877	 -2.124463	 -0.160294
  0.808210	 -2.125831	 -0.174176
  0.822513	 -2.127190	 -0.188090
  0.836571	 -2.128408	 -0.202259
  0.850536	 -2.129564	 -0.216528
  0.864393	 -2.130688	 -0.230906
  0.878249	 -2.131763	 -0.245285
  0.892100	 -2.132836	 -0.259675
  0.906277	 -2.134076	 -0.273728
  0.920518	 -2.135370	 -0.287711
  0.934823	 -2.136701	 -0.301623
  0.949945	 -2.138348	 -0.314604
  0.965101	 -2.140015	 -0.327547
  0.980411	 -2.141771	 -0.340295
  0.996143	 -2.143771	 -0.352481
  1.011879	 -2.145775	 -0.364662
  1.027823	 -2.148104	 -0.376509
  1.043909	 -2.150660	 -0.388115
  1.060003	 -2.153235	 -0.399706
  1.076306	 -2.156277	 -0.410885
  1.092611	 -2.159327	 -0.422058
  1.108992	 -2.162617	 -0.433051
  1.125441	 -2.166136	 -0.443869
  1.149988	 -2.171630	 -0.459946
  1.158325	 -2.173626	 -0.465373
