 -2.416461	  0.492862	  0.413330
 -2.416002	  0.492614	  0.412632
 -2.405860	  0.487135	  0.397211
 -2.398830	  0.478478	  0.382236
 -2.387203	  0.472359	  0.367410
 -2.373757	  0.467278	  0.353897
 -2.359954	  0.464320	  0.339631
 -2.346540	  0.455316	  0.324253
 -2.334970	  0.442329	  0.311599
 -2.327295	  0.425417	  0.300853
 -2.318956	  0.418766	  0.288406
 -2.304564	  0.410037	  0.273855
 -2.293020	  0.400908	  0.256924
 -2.285172	  0.393733	  0.244472
 -2.273663	  0.383507	  0.229442
 -2.259813	  0.376052	  0.215966
 -2.246408	  0.369437	  0.202999
 -2.233472	  0.362338	  0.188785
 -2.223835	  0.355359	  0.173653
 -2.212814	  0.347493	  0.158340
 -2.201225	  0.339979	  0.144117
 -2.205552	  0.329488	  0.128303
 -2.216462	  0.320058	  0.115111
 -2.226597	  0.311288	  0.099987
 -2.235069	  0.303828	  0.083281
 -2.243610	  0.296567	  0.066755
 -2.251968	  0.289261	  0.050128
 -2.260626	  0.281985	  0.033623
 -2.268915	  0.274921	  0.017027
 -2.279150	  0.269115	  0.001505
 -2.289638	  0.262608	 -0.015515
 -2.294518	  0.255944	 -0.033710
 -2.296118	  0.247217	 -0.054173
 -2.291520	  0.241408	 -0.074077
 -2.293157	  0.231336	 -0.089666
 -2.295670	  0.221574	 -0.108291
 -2.296722	  0.217525	 -0.126443
 -2.296627	  0.211619	 -0.146976
 -2.297624	  0.203594	 -0.165209
 -2.297387	  0.196178	 -0.182615
 -2.293513	  0.189852	 -0.204134
 -2.289271	  0.181162	 -0.221535
 -2.287642	  0.173732	 -0.236823
 -2.284890	  0.165174	 -0.255568
 -2.274703	  0.155409	 -0.272831
 -2.266424	  0.145662	 -0.285170
 -2.259187	  0.132544	 -0.303045
 -2.251221	  0.124290	 -0.319436
 -2.236121	  0.124172	 -0.329700
 -2.222238	  0.113796	 -0.341949
 -2.208619	  0.105992	 -0.351411
 -2.190887	  0.098628	 -0.358558
 -2.172576	  0.091892	 -0.363747
 -2.155691	  0.083587	 -0.369764
 -2.138179	  0.079366	 -0.376420
 -2.118295	  0.075906	 -0.381319
 -2.098725	  0.072515	 -0.385125
 -2.078411	  0.067725	 -0.385899
 -2.058976	  0.064338	 -0.387070
 -2.039518	  0.064890	 -0.385724
 -2.021757	  0.062218	 -0.382850
 -2.001188	  0.063923	 -0.381488
 -1.981958	  0.063730	 -0.380970
 -1.961385	  0.064659	 -0.381276
 -1.941448	  0.066767	 -0.380784
 -1.921947	  0.068831	 -0.379879
 -1.901696	  0.070734	 -0.377166
 -1.882037	  0.074043	 -0.375700
 -1.862790	  0.082269	 -0.377707
 -1.844042	  0.091605	 -0.382871
 -1.827521	  0.097851	 -0.381635
 -1.809375	  0.106976	 -0.379250
 -1.790166	  0.117211	 -0.380818
 -1.772405	  0.122299	 -0.386275
 -1.751675	  0.126561	 -0.392957
 -1.735806	  0.134021	 -0.402133
 -1.721141	  0.142902	 -0.408085
 -1.704080	  0.145802	 -0.416279
 -1.688203	  0.147226	 -0.426550
 -1.672726	  0.147831	 -0.436639
 -1.656634	  0.144329	 -0.450073
 -1.643307	  0.144547	 -0.462553
 -1.629365	  0.140651	 -0.474300
 -1.612459	  0.136665	 -0.492105
 -1.601822	  0.133081	 -0.503162
 -1.587620	  0.130765	 -0.517311
 -1.569904	  0.131757	 -0.537603
 -1.561383	  0.125121	 -0.547022
 -1.547246	  0.115310	 -0.559768
 -1.533347	  0.110121	 -0.574475
 -1.520317	  0.107836	 -0.587957
 -1.505903	  0.100640	 -0.603463
 -1.495451	  0.094122	 -0.614903
 -1.482165	  0.088509	 -0.630315
 -1.467908	  0.087856	 -0.647955
 -1.454232	  0.083416	 -0.659796
 -1.439377	  0.076814	 -0.673297
 -1.426256	  0.065635	 -0.687335
 -1.416080	  0.058870	 -0.698672
 -1.403234	  0.049103	 -0.715048
 -1.391727	  0.041374	 -0.724444
 -1.374306	  0.029981	 -0.733698
 -1.357409	  0.018916	 -0.751506
 -1.356371	  0.017115	 -0.764344
 -1.343445	  0.018302	 -0.783491
 -1.325960	  0.018197	 -0.798960
 -1.312525	  0.008897	 -0.810999
 -1.299066	 -0.003096	 -0.823039
 -1.282856	 -0.016196	 -0.833607
 -1.269463	 -0.018224	 -0.846492
 -1.255814	 -0.021125	 -0.863601
 -1.246403	 -0.018821	 -0.879653
 -1.235166	 -0.018277	 -0.897020
 -1.220255	 -0.021507	 -0.912371
 -1.204654	 -0.025752	 -0.925431
 -1.196814	 -0.026885	 -0.944328
 -1.188440	 -0.028022	 -0.963483
 -1.175364	 -0.026277	 -0.976804
 -1.161691	 -0.024392	 -0.991987
 -1.150520	 -0.026421	 -1.009368
 -1.139367	 -0.028523	 -1.025507
 -1.126045	 -0.028626	 -1.040420
 -1.113770	 -0.023868	 -1.056070
 -1.103023	 -0.019792	 -1.072534
 -1.091938	 -0.015147	 -1.088532
 -1.081083	 -0.010798	 -1.104785
 -1.069979	 -0.005924	 -1.120935
 -1.057554	  0.003878	 -1.133998
 -1.045367	  0.015793	 -1.144796
 -1.033155	  0.028151	 -1.154704
 -1.021211	  0.040034	 -1.165134
 -1.009450	  0.052402	 -1.174934
 -0.998035	  0.063297	 -1.185233
 -0.980980	  0.076607	 -1.196993
 -0.969054	  0.086831	 -1.205041
 -0.956228	  0.099032	 -1.211656
 -0.941201	  0.111552	 -1.220215
 -0.926412	  0.117130	 -1.231127
 -0.911234	  0.122728	 -1.242038
 -0.893559	  0.128960	 -1.252916
 -0.877467	  0.132267	 -1.266077
 -0.864803	  0.131490	 -1.277206
 -0.849431	  0.133870	 -1.290490
 -0.840936	  0.135093	 -1.307210
 -0.841266	  0.132408	 -1.326784
 -0.844881	  0.129080	 -1.346082
 -0.848649	  0.125481	 -1.365361
 -0.851957	  0.119902	 -1.384215
 -0.855382	  0.113501	 -1.402847
 -0.858587	  0.107245	 -1.421575
 -0.861875	  0.100884	 -1.440248
 -0.865069	  0.094382	 -1.458809
 -0.867415	  0.084950	 -1.476070
 -0.868654	  0.071375	 -1.490546
 -0.869759	  0.057577	 -1.504991
 -0.870825	  0.043773	 -1.519423
 -0.871890	  0.029973	 -1.533860
 -0.872927	  0.016149	 -1.548281
 -0.873793	  0.002228	 -1.562606
 -0.874501	 -0.011797	 -1.576652
 -0.866914	 -0.027628	 -1.585814
 -0.858815	 -0.043913	 -1.594185
 -0.850323	 -0.059971	 -1.602544
 -0.842132	 -0.076281	 -1.610735
 -0.833533	 -0.092373	 -1.618956
 -0.824812	 -0.108368	 -1.627036
 -0.810740	 -0.122209	 -1.630011
 -0.794642	 -0.134107	 -1.630653
 -0.778397	 -0.145741	 -1.631071
 -0.762123	 -0.157346	 -1.631161
 -0.744201	 -0.165613	 -1.627742
 -0.725723	 -0.169554	 -1.621147
 -0.707375	 -0.173506	 -1.614230
 -0.689021	 -0.177303	 -1.607273
 -0.670735	 -0.181085	 -1.600113
 -0.653138	 -0.182444	 -1.590762
 -0.635822	 -0.183881	 -1.580836
 -0.618350	 -0.184924	 -1.571155
 -0.600872	 -0.186142	 -1.561516
 -0.583407	 -0.187460	 -1.552042
 -0.564384	 -0.192761	 -1.553338
 -0.546544	 -0.199602	 -1.558592
 -0.528737	 -0.206548	 -1.564384
 -0.509569	 -0.211493	 -1.568989
 -0.490381	 -0.215844	 -1.575212
 -0.474145	 -0.221906	 -1.584617
 -0.461744	 -0.228185	 -1.598703
 -0.448360	 -0.232689	 -1.612104
 -0.431437	 -0.242432	 -1.624715
 -0.420120	 -0.250607	 -1.636977
 -0.409917	 -0.255052	 -1.652481
 -0.398653	 -0.262192	 -1.667214
 -0.381849	 -0.269256	 -1.679753
 -0.367421	 -0.274701	 -1.690596
 -0.353700	 -0.280337	 -1.708338
 -0.344799	 -0.288899	 -1.722678
 -0.333510	 -0.296070	 -1.736524
 -0.319271	 -0.299295	 -1.751487
 -0.307415	 -0.305680	 -1.765255
 -0.293557	 -0.310610	 -1.781923
 -0.280839	 -0.313331	 -1.795951
 -0.266672	 -0.317224	 -1.808128
 -0.252327	 -0.321600	 -1.822212
 -0.241286	 -0.325889	 -1.838227
 -0.232828	 -0.332654	 -1.853188
 -0.221872	 -0.342594	 -1.871431
 -0.211770	 -0.349326	 -1.888590
 -0.201272	 -0.355230	 -1.901689
 -0.189944	 -0.364308	 -1.912079
 -0.176701	 -0.378578	 -1.924986
 -0.164821	 -0.385347	 -1.938007
 -0.152061	 -0.393684	 -1.951506
 -0.138566	 -0.401114	 -1.965087
 -0.126504	 -0.406972	 -1.979943
 -0.114306	 -0.411353	 -1.995273
 -0.101850	 -0.416838	 -2.010991
 -0.090802	 -0.423162	 -2.026427
 -0.080655	 -0.430307	 -2.042234
 -0.069267	 -0.439696	 -2.056042
 -0.057715	 -0.448002	 -2.070631
 -0.043946	 -0.454621	 -2.082969
 -0.029446	 -0.458898	 -2.096035
 -0.015004	 -0.462743	 -2.109965
 -0.001162	 -0.466128	 -2.124092
  0.012865	 -0.468524	 -2.138275
  0.026930	 -0.470772	 -2.152325
  0.041035	 -0.473059	 -2.166318
  0.055501	 -0.474881	 -2.180044
  0.069991	 -0.476350	 -2.193742
  0.084542	 -0.478206	 -2.207321
  0.099080	 -0.480149	 -2.220881
  0.112851	 -0.482132	 -2.235114
  0.125932	 -0.484736	 -2.250151
  0.139332	 -0.486711	 -2.265218
  0.152313	 -0.488314	 -2.280439
  0.167233	 -0.490935	 -2.294025
  0.180993	 -0.493576	 -2.308215
  0.196059	 -0.498621	 -2.319867
  0.210550	 -0.503542	 -2.333327
  0.224610	 -0.509412	 -2.346098
  0.238091	 -0.515444	 -2.359548
  0.250770	 -0.521156	 -2.374109
  0.263179	 -0.526026	 -2.389091
  0.275551	 -0.530847	 -2.404067
  0.299907	 -0.539893	 -2.434056
  0.312187	 -0.544916	 -2.449021
