  0.780021	  0.176831	 -2.922533
  0.772298	  0.175081	 -2.893597
  0.742008	  0.198249	 -2.856731
  0.705628	  0.218603	 -2.828498
  0.668561	  0.240828	 -2.805832
  0.636939	  0.266823	 -2.777033
  0.605525	  0.289269	 -2.744845
  0.570865	  0.308037	 -2.712817
  0.534939	  0.324001	 -2.680832
  0.498394	  0.337503	 -2.648680
  0.461050	  0.350236	 -2.616241
  0.423251	  0.363254	 -2.584630
  0.386628	  0.376451	 -2.556396
  0.348606	  0.390183	 -2.531794
  0.307046	  0.405615	 -2.505700
  0.268274	  0.424945	 -2.474533
  0.231564	  0.447037	 -2.445111
  0.196646	  0.472377	 -2.418813
  0.161606	  0.494932	 -2.390820
  0.127284	  0.514635	 -2.358691
  0.095558	  0.530605	 -2.323290
  0.065058	  0.545218	 -2.287449
  0.034118	  0.562443	 -2.253053
  0.004290	  0.582751	 -2.218887
 -0.023742	  0.604121	 -2.183053
 -0.051332	  0.624678	 -2.146238
 -0.079121	  0.643224	 -2.108916
 -0.106393	  0.665025	 -2.072252
 -0.133260	  0.689556	 -2.036854
 -0.160947	  0.712952	 -2.000132
 -0.189096	  0.734654	 -1.963890
 -0.216785	  0.755529	 -1.929102
 -0.246132	  0.776585	 -1.894607
 -0.278791	  0.797052	 -1.860457
 -0.316181	  0.815555	 -1.827318
 -0.357968	  0.830763	 -1.795681
 -0.403511	  0.846762	 -1.767282
 -0.447434	  0.863989	 -1.744532
 -0.489188	  0.883387	 -1.724751
 -0.530639	  0.904634	 -1.706066
 -0.572323	  0.927002	 -1.688437
 -0.614401	  0.949940	 -1.671580
 -0.656768	  0.972001	 -1.655903
 -0.707742	  0.998535	 -1.639055
 -0.792182	  1.042927	 -1.623683
 -0.918964	  1.101859	 -1.647605
 -1.030620	  1.142963	 -1.721849
 -1.106348	  1.147851	 -1.788900
 -1.196872	  1.128457	 -1.863796
 -1.312702	  1.088531	 -1.975753
 -1.434876	  1.072624	 -2.053771
 -1.515217	  1.092223	 -2.036735
 -1.584925	  1.106289	 -2.019079
 -1.664503	  1.082647	 -2.003560
 -1.684719	  1.127925	 -1.959304
 -1.672348	  1.220007	 -1.850036
 -1.631283	  1.248347	 -1.719161
 -1.584831	  1.240528	 -1.597042
 -1.536481	  1.223933	 -1.492792
 -1.474125	  1.233466	 -1.391935
 -1.394240	  1.273602	 -1.275587
 -1.356528	  1.301625	 -1.147446
 -1.369434	  1.335354	 -1.066390
 -1.394446	  1.364080	 -1.020592
 -1.421817	  1.387997	 -0.984561
 -1.450483	  1.410799	 -0.950970
 -1.480555	  1.432831	 -0.917401
 -1.511697	  1.454324	 -0.883927
 -1.545454	  1.474797	 -0.851812
 -1.580080	  1.495482	 -0.819265
 -1.615570	  1.514588	 -0.786590
 -1.651311	  1.530404	 -0.756367
 -1.685627	  1.546662	 -0.726706
 -1.720426	  1.564371	 -0.696287
 -1.756354	  1.582823	 -0.665378
 -1.793571	  1.600739	 -0.634583
 -1.831262	  1.616574	 -0.604821
 -1.869937	  1.629258	 -0.576368
 -1.910656	  1.641615	 -0.548038
 -1.951190	  1.654671	 -0.521053
 -1.990882	  1.668822	 -0.495543
 -2.031636	  1.685121	 -0.469794
 -2.072035	  1.704154	 -0.443401
 -2.109225	  1.724705	 -0.416874
 -2.143222	  1.746428	 -0.388425
 -2.174126	  1.768966	 -0.357749
 -2.204286	  1.791627	 -0.326519
 -2.234471	  1.808993	 -0.289311
 -2.271183	  1.830330	 -0.259694
 -2.302368	  1.851501	 -0.226170
 -2.342124	  1.863873	 -0.201074
 -2.365546	  1.882512	 -0.203084
