 -1.762807	 -2.461655	 -0.116889
 -1.745354	 -2.437283	 -0.115732
 -1.717315	 -2.393645	 -0.100499
 -1.695759	 -2.346360	 -0.092397
 -1.670287	 -2.302553	 -0.086295
 -1.645157	 -2.262378	 -0.069970
 -1.618411	 -2.219171	 -0.065638
 -1.590755	 -2.179655	 -0.053414
 -1.571532	 -2.134105	 -0.051194
 -1.544122	 -2.092879	 -0.043600
 -1.514191	 -2.052559	 -0.034969
 -1.488904	 -2.011275	 -0.027066
 -1.457943	 -1.974267	 -0.014666
 -1.430327	 -1.933861	 -0.004954
 -1.404355	 -1.892284	  0.005444
 -1.379362	 -1.852183	  0.017068
 -1.356757	 -1.810280	  0.032287
 -1.343268	 -1.766342	  0.053682
 -1.338941	 -1.715311	  0.088778
 -1.360710	 -1.629047	  0.161494
 -1.448836	 -1.509690	  0.232902
 -1.500706	 -1.416194	  0.250578
 -1.508725	 -1.379710	  0.250364
 -1.504188	 -1.363821	  0.248085
 -1.485310	 -1.345853	  0.240315
 -1.424358	 -1.327416	  0.215198
 -1.286025	 -1.327512	  0.160085
 -1.164892	 -1.304751	  0.140863
 -1.099974	 -1.276432	  0.141951
 -1.056997	 -1.248915	  0.147090
 -1.018744	 -1.215238	  0.154273
 -0.986257	 -1.175466	  0.162293
 -0.959751	 -1.132950	  0.170643
 -0.937872	 -1.090549	  0.178902
 -0.917989	 -1.047369	  0.187231
 -0.898626	 -1.000971	  0.196071
 -0.881684	 -0.953779	  0.205223
 -0.865898	 -0.907291	  0.215258
 -0.851002	 -0.863218	  0.226183
 -0.835164	 -0.817824	  0.239018
 -0.817257	 -0.771639	  0.253348
 -0.798155	 -0.728748	  0.267079
 -0.777719	 -0.687275	  0.280118
 -0.755090	 -0.645123	  0.292785
 -0.729160	 -0.600545	  0.305025
 -0.700927	 -0.556955	  0.315269
 -0.672555	 -0.516166	  0.322628
 -0.644867	 -0.477000	  0.328178
 -0.617020	 -0.437318	  0.333078
 -0.588332	 -0.395573	  0.338012
 -0.559655	 -0.355817	  0.344267
 -0.530051	 -0.317535	  0.352079
 -0.500904	 -0.280098	  0.362705
 -0.472110	 -0.240111	  0.376014
 -0.445164	 -0.197847	  0.387254
 -0.417542	 -0.155062	  0.394466
 -0.390379	 -0.113312	  0.398758
 -0.364401	 -0.072238	  0.402017
 -0.340297	 -0.031313	  0.405013
 -0.317598	  0.011386	  0.412284
 -0.294230	  0.055166	  0.424155
 -0.268963	  0.097345	  0.440484
 -0.255657	  0.144587	  0.457172
 -0.229231	  0.185496	  0.466022
 -0.201677	  0.223379	  0.474770
 -0.176765	  0.263990	  0.485600
 -0.151009	  0.305727	  0.496081
 -0.123943	  0.348347	  0.504014
 -0.096360	  0.390804	  0.510648
 -0.069617	  0.432357	  0.518348
 -0.043267	  0.473448	  0.526878
 -0.017473	  0.513216	  0.535538
  0.010322	  0.554901	  0.545232
  0.036669	  0.595261	  0.555984
  0.062452	  0.635032	  0.567883
  0.087219	  0.676174	  0.581148
  0.110211	  0.718357	  0.593582
  0.130736	  0.761571	  0.605584
  0.150753	  0.806480	  0.617932
  0.170586	  0.851547	  0.630128
  0.189389	  0.894389	  0.641968
  0.208340	  0.936886	  0.653715
  0.227599	  0.979556	  0.665447
  0.249108	  1.023607	  0.677470
  0.272760	  1.067910	  0.687595
  0.298044	  1.109748	  0.695578
  0.325137	  1.149826	  0.702886
  0.354782	  1.189219	  0.709755
  0.386364	  1.227624	  0.716110
  0.419376	  1.265393	  0.722676
  0.451808	  1.301794	  0.730741
  0.484596	  1.338797	  0.740264
  0.516049	  1.377818	  0.749942
  0.544861	  1.420133	  0.759540
  0.570002	  1.465471	  0.768799
  0.591799	  1.511513	  0.777218
  0.611217	  1.557384	  0.784616
  0.628768	  1.603076	  0.790749
  0.645585	  1.649286	  0.795492
  0.661861	  1.695211	  0.798970
  0.679325	  1.741971	  0.802300
  0.697979	  1.787482	  0.806369
  0.718650	  1.833580	  0.812620
  0.740976	  1.878923	  0.821593
  0.764303	  1.922385	  0.832666
  0.787264	  1.963300	  0.844017
  0.811052	  2.004692	  0.855311
  0.835528	  2.045828	  0.866367
  0.861318	  2.088487	  0.877367
  0.885796	  2.131257	  0.887279
  0.908689	  2.173992	  0.895989
  0.931453	  2.216893	  0.904288
  0.956614	  2.258174	  0.913767
  0.983674	  2.297788	  0.920912
  1.010066	  2.340434	  0.932440
  1.030501	  2.385414	  0.944593
  1.059803	  2.422137	  0.963812
  1.084227	  2.467348	  0.964076
  1.107785	  2.508067	  0.979137
  1.129406	  2.547318	  0.992615
  1.150170	  2.587261	  0.991558
  1.161672	  2.613134	  1.001474
