 -0.266189	  3.016574	 -0.101608
 -0.263553	  2.986707	 -0.100602
 -0.271248	  2.951381	 -0.072263
 -0.287099	  2.912197	 -0.053444
 -0.307460	  2.870337	 -0.031331
 -0.320584	  2.827039	 -0.004891
 -0.336145	  2.786858	  0.013371
 -0.351502	  2.743366	  0.039981
 -0.371377	  2.698807	  0.061383
 -0.389908	  2.660224	  0.084630
 -0.401159	  2.619884	  0.105963
 -0.423555	  2.579953	  0.127073
 -0.438418	  2.536863	  0.148337
 -0.459223	  2.497271	  0.171724
 -0.477000	  2.454100	  0.194541
 -0.492182	  2.415834	  0.215072
 -0.509641	  2.373927	  0.238347
 -0.528053	  2.332316	  0.261333
 -0.545449	  2.292441	  0.283737
 -0.562912	  2.254064	  0.306750
 -0.580000	  2.216911	  0.328304
 -0.599229	  2.176556	  0.352176
 -0.618804	  2.136124	  0.375458
 -0.638553	  2.094007	  0.398586
 -0.656690	  2.054417	  0.420573
 -0.674500	  2.012075	  0.443140
 -0.689879	  1.970565	  0.465422
 -0.705055	  1.929284	  0.488301
 -0.718467	  1.889341	  0.511263
 -0.731077	  1.850068	  0.535348
 -0.743877	  1.806686	  0.561272
 -0.756363	  1.762952	  0.586629
 -0.769344	  1.720245	  0.608633
 -0.783965	  1.675768	  0.630424
 -0.799334	  1.634866	  0.650704
 -0.815616	  1.594521	  0.671590
 -0.833190	  1.552709	  0.694465
 -0.854366	  1.511566	  0.715714
 -0.883469	  1.476521	  0.730355
 -0.915228	  1.455655	  0.739081
 -1.026224	  1.420514	  0.746909
 -1.142908	  1.392311	  0.728360
 -1.204302	  1.347945	  0.715269
 -1.263995	  1.321111	  0.714579
 -1.323809	  1.263158	  0.737815
 -1.346366	  1.251960	  0.747288
 -1.385426	  1.237076	  0.754868
 -1.440410	  1.195499	  0.761011
 -1.490342	  1.139614	  0.792058
 -1.464913	  1.063863	  0.845505
 -1.421732	  1.008665	  0.885912
 -1.406008	  0.989678	  0.911799
 -1.394779	  0.946308	  0.950808
 -1.377202	  0.919027	  0.988978
 -1.310047	  0.877522	  1.028423
 -1.196361	  0.796683	  1.105932
 -1.182393	  0.736597	  1.143689
 -1.188800	  0.692781	  1.168353
 -1.202369	  0.650179	  1.190894
 -1.216115	  0.613093	  1.210120
 -1.232942	  0.569336	  1.230479
 -1.249613	  0.523557	  1.250661
 -1.264856	  0.481502	  1.269369
 -1.279753	  0.440406	  1.287811
 -1.297587	  0.396838	  1.308390
 -1.315477	  0.355293	  1.328335
 -1.333859	  0.315928	  1.349180
 -1.353307	  0.273681	  1.374003
 -1.369755	  0.234129	  1.398875
 -1.385959	  0.191611	  1.424689
 -1.400652	  0.152061	  1.447701
 -1.414987	  0.113291	  1.470241
 -1.429212	  0.075574	  1.493485
 -1.446027	  0.034111	  1.518290
 -1.466182	 -0.011740	  1.542842
 -1.482961	 -0.054596	  1.565789
 -1.498696	 -0.092578	  1.584195
 -1.514319	 -0.135229	  1.603074
 -1.532667	 -0.174362	  1.621011
 -1.547289	 -0.218060	  1.645641
 -1.563411	 -0.256602	  1.675562
 -1.574943	 -0.296828	  1.692064
 -1.593498	 -0.341444	  1.709987
 -1.617310	 -0.378471	  1.735673
 -1.631651	 -0.423305	  1.762000
 -1.648206	 -0.466273	  1.784384
 -1.661349	 -0.508289	  1.807392
 -1.678212	 -0.549155	  1.829865
 -1.691462	 -0.586861	  1.849362
 -1.707859	 -0.631039	  1.873939
 -1.724821	 -0.673611	  1.897931
 -1.741524	 -0.712930	  1.919406
 -1.759307	 -0.752488	  1.941612
 -1.775370	 -0.792590	  1.963413
 -1.789628	 -0.833278	  1.984568
 -1.807213	 -0.872958	  2.009747
 -1.826787	 -0.914453	  2.033612
 -1.842126	 -0.955216	  2.048966
 -1.857659	 -0.997282	  2.076264
 -1.881873	 -1.045014	  2.089617
 -1.900692	 -1.055464	  2.110513
