 -0.106546	  1.841413	  1.714358
 -0.102244	  1.844531	  1.720908
 -0.111665	  1.837398	  1.706522
 -0.120809	  1.827605	  1.689075
 -0.131025	  1.820630	  1.673412
 -0.140792	  1.814204	  1.659102
 -0.148350	  1.803850	  1.641097
 -0.157381	  1.796619	  1.625756
 -0.166442	  1.791233	  1.611474
 -0.174388	  1.783714	  1.590263
 -0.183826	  1.782189	  1.570513
 -0.195918	  1.778194	  1.555389
 -0.204017	  1.768192	  1.540858
 -0.210493	  1.754108	  1.526059
 -0.217843	  1.742379	  1.513717
 -0.228463	  1.733105	  1.497891
 -0.238437	  1.725759	  1.482390
 -0.248211	  1.720460	  1.467510
 -0.261968	  1.715616	  1.447125
 -0.270463	  1.710190	  1.432642
 -0.281140	  1.705008	  1.418571
 -0.295690	  1.701412	  1.403661
 -0.309940	  1.696498	  1.389675
 -0.322230	  1.691671	  1.376609
 -0.336092	  1.691264	  1.360089
 -0.349373	  1.689500	  1.344451
 -0.361630	  1.684625	  1.332084
 -0.375771	  1.685068	  1.316508
 -0.389756	  1.683758	  1.302047
 -0.403949	  1.679747	  1.288728
 -0.419021	  1.679289	  1.275464
 -0.434219	  1.678316	  1.262557
 -0.450048	  1.672246	  1.250656
 -0.465269	  1.668879	  1.237866
 -0.481942	  1.669201	  1.225658
 -0.498739	  1.672020	  1.217200
 -0.517348	  1.673106	  1.207852
 -0.534939	  1.673257	  1.198001
 -0.553290	  1.672296	  1.190112
 -0.572083	  1.670740	  1.183446
 -0.590880	  1.669188	  1.176794
 -0.610188	  1.669075	  1.171593
 -0.629875	  1.671279	  1.168845
 -0.649563	  1.673494	  1.166113
 -0.669241	  1.675660	  1.163344
 -0.687887	  1.672518	  1.156862
 -0.706346	  1.668899	  1.150065
 -0.724797	  1.665266	  1.143260
 -0.741917	  1.659293	  1.134847
 -0.754334	  1.648473	  1.123513
 -0.766719	  1.637621	  1.112163
 -0.779080	  1.626756	  1.100803
 -0.788017	  1.614097	  1.088179
 -0.793026	  1.600106	  1.074804
 -0.797919	  1.585987	  1.061488
 -0.802260	  1.572316	  1.048258
 -0.799983	  1.558113	  1.034383
 -0.797892	  1.543129	  1.020916
 -0.798070	  1.528836	  1.007486
 -0.797293	  1.515384	  0.992614
 -0.794304	  1.503532	  0.976643
 -0.791078	  1.491713	  0.960835
 -0.787867	  1.479898	  0.945021
 -0.786969	  1.468758	  0.928438
 -0.787745	  1.458209	  0.911464
 -0.788530	  1.447665	  0.894488
 -0.789173	  1.436760	  0.877853
 -0.789688	  1.424473	  0.862056
 -0.790880	  1.412758	  0.845407
 -0.791212	  1.401542	  0.829166
 -0.790513	  1.391409	  0.811722
 -0.790992	  1.380999	  0.794792
 -0.790143	  1.370757	  0.779429
 -0.787121	  1.357804	  0.764107
 -0.784881	  1.341524	  0.748445
 -0.782715	  1.329014	  0.735374
 -0.776572	  1.317134	  0.721770
 -0.772323	  1.301321	  0.708821
 -0.773654	  1.284679	  0.696654
 -0.774120	  1.269008	  0.684785
 -0.774702	  1.255697	  0.668791
 -0.773167	  1.244656	  0.650780
 -0.770596	  1.233999	  0.635630
 -0.769330	  1.222166	  0.618314
 -0.768296	  1.209991	  0.603134
 -0.768437	  1.196317	  0.588662
 -0.771112	  1.180109	  0.573254
 -0.768694	  1.172137	  0.558025
 -0.768336	  1.161723	  0.539139
 -0.772306	  1.148698	  0.525592
 -0.770489	  1.133893	  0.508250
 -0.766945	  1.121850	  0.492465
 -0.772485	  1.107269	  0.480369
 -0.773206	  1.092414	  0.466641
 -0.768020	  1.081504	  0.451116
 -0.766633	  1.069437	  0.433831
 -0.764720	  1.049410	  0.423376
 -0.763199	  1.032686	  0.414550
 -0.769904	  1.016083	  0.401958
 -0.772889	  1.005688	  0.384345
 -0.775723	  0.992263	  0.369796
 -0.775410	  0.974685	  0.360743
 -0.773926	  0.958727	  0.348528
 -0.779673	  0.942674	  0.332000
 -0.783712	  0.926484	  0.322854
 -0.783840	  0.906765	  0.316368
 -0.787024	  0.889356	  0.311260
 -0.790736	  0.869309	  0.302820
 -0.794930	  0.852082	  0.299244
 -0.800094	  0.832220	  0.294667
 -0.804485	  0.814349	  0.288720
 -0.811169	  0.795232	  0.288974
 -0.821584	  0.777954	  0.294525
 -0.827283	  0.759574	  0.291982
 -0.836137	  0.741318	  0.289256
 -0.848030	  0.726013	  0.290480
 -0.859865	  0.710524	  0.290187
 -0.870206	  0.689686	  0.289569
 -0.884518	  0.677487	  0.293179
 -0.898831	  0.664158	  0.300195
 -0.909910	  0.647740	  0.302295
 -0.918040	  0.630647	  0.305204
 -0.930114	  0.616730	  0.306395
 -0.948034	  0.599219	  0.309563
 -0.958332	  0.582051	  0.313613
 -0.968917	  0.571057	  0.306574
 -0.986675	  0.558047	  0.305038
 -1.000281	  0.542558	  0.303323
 -1.011458	  0.526233	  0.301569
 -1.026161	  0.515467	  0.293886
 -1.041252	  0.504889	  0.287011
 -1.052557	  0.490571	  0.279249
 -1.065307	  0.473996	  0.271888
 -1.079410	  0.461321	  0.263982
 -1.095740	  0.449339	  0.255993
 -1.106776	  0.446991	  0.243685
 -1.121326	  0.442641	  0.228582
 -1.133750	  0.440063	  0.212319
 -1.146197	  0.437147	  0.196310
 -1.158746	  0.436057	  0.180866
 -1.170206	  0.433666	  0.165834
 -1.180442	  0.431825	  0.149326
 -1.190212	  0.432557	  0.131558
 -1.201428	  0.431017	  0.115369
 -1.211531	  0.430230	  0.098893
 -1.221444	  0.429100	  0.081315
 -1.230811	  0.427544	  0.063858
 -1.238895	  0.428106	  0.045147
 -1.245338	  0.430176	  0.026242
 -1.251715	  0.433590	  0.007322
 -1.257549	  0.437335	 -0.011660
 -1.262739	  0.442303	 -0.030581
 -1.266945	  0.448946	 -0.049215
 -1.269985	  0.457084	 -0.067526
 -1.272980	  0.465035	 -0.085780
 -1.274091	  0.473303	 -0.103776
 -1.275113	  0.481774	 -0.122040
 -1.276921	  0.489027	 -0.139914
 -1.279702	  0.496613	 -0.159172
 -1.283610	  0.504717	 -0.177625
 -1.286799	  0.516919	 -0.194999
 -1.286017	  0.526390	 -0.211366
 -1.286096	  0.532107	 -0.229369
 -1.290326	  0.540387	 -0.248961
 -1.292322	  0.549830	 -0.266162
 -1.291080	  0.557323	 -0.283743
 -1.293439	  0.565338	 -0.303130
 -1.297082	  0.573427	 -0.320988
 -1.297396	  0.582333	 -0.338834
 -1.298080	  0.592659	 -0.358015
 -1.305106	  0.599932	 -0.373815
 -1.312091	  0.606962	 -0.391673
 -1.319462	  0.612228	 -0.408885
 -1.328284	  0.616525	 -0.426027
 -1.338419	  0.622669	 -0.446701
 -1.347169	  0.629334	 -0.461459
 -1.358151	  0.636204	 -0.474762
 -1.370944	  0.642867	 -0.491097
 -1.380265	  0.644668	 -0.507829
 -1.391174	  0.644918	 -0.524935
 -1.403137	  0.646043	 -0.541301
 -1.415696	  0.647730	 -0.556033
 -1.428038	  0.645479	 -0.572346
 -1.438938	  0.643181	 -0.590137
 -1.451716	  0.645551	 -0.603600
 -1.465795	  0.642419	 -0.617756
 -1.477466	  0.636095	 -0.634876
 -1.487324	  0.638570	 -0.651889
 -1.499899	  0.637263	 -0.667192
 -1.512898	  0.632383	 -0.681529
 -1.525097	  0.626058	 -0.696741
 -1.536703	  0.620278	 -0.712184
 -1.547483	  0.614947	 -0.728093
 -1.558068	  0.609524	 -0.744173
 -1.568545	  0.603585	 -0.760159
 -1.578071	  0.597050	 -0.776485
 -1.587190	  0.590844	 -0.792981
 -1.594533	  0.585384	 -0.810672
 -1.602263	  0.578289	 -0.828655
 -1.609852	  0.572043	 -0.844994
 -1.619856	  0.565873	 -0.861587
 -1.626650	  0.559169	 -0.879611
 -1.634973	  0.549828	 -0.896036
 -1.645844	  0.543291	 -0.909320
 -1.659860	  0.534321	 -0.924936
 -1.670114	  0.524001	 -0.941889
 -1.672011	  0.520593	 -0.959152
 -1.677576	  0.513397	 -0.976876
 -1.683973	  0.505161	 -0.996480
 -1.686058	  0.501502	 -1.016591
 -1.684250	  0.494899	 -1.036303
 -1.687215	  0.486932	 -1.054436
 -1.697880	  0.481912	 -1.071720
 -1.708411	  0.471930	 -1.087756
 -1.709845	  0.463211	 -1.106317
 -1.711305	  0.457868	 -1.123997
 -1.720478	  0.448951	 -1.140966
 -1.731642	  0.440863	 -1.157498
 -1.730334	  0.435946	 -1.177571
 -1.727426	  0.426969	 -1.197721
 -1.734638	  0.419296	 -1.216075
 -1.742804	  0.414635	 -1.234401
 -1.747412	  0.408183	 -1.248453
 -1.752456	  0.398912	 -1.267650
 -1.758202	  0.390908	 -1.285450
 -1.764119	  0.383440	 -1.303084
 -1.771040	  0.376215	 -1.320400
 -1.778299	  0.369070	 -1.337613
 -1.785935	  0.362337	 -1.354739
 -1.793295	  0.357062	 -1.372433
 -1.800829	  0.353257	 -1.390243
 -1.810226	  0.346992	 -1.407784
 -1.821019	  0.338177	 -1.423348
 -1.831122	  0.330117	 -1.438405
 -1.841823	  0.327187	 -1.454657
 -1.852286	  0.323628	 -1.471325
 -1.863459	  0.317374	 -1.487010
 -1.876473	  0.312636	 -1.502301
 -1.887003	  0.311564	 -1.518287
 -1.897461	  0.305737	 -1.533983
 -1.911444	  0.299214	 -1.549655
 -1.922710	  0.296925	 -1.564456
 -1.932192	  0.291895	 -1.580844
 -1.944563	  0.286635	 -1.596896
 -1.955524	  0.280192	 -1.612333
