  1.071624	 -2.086021	  0.869004
  1.072213	 -2.084355	  0.869380
  1.078149	 -2.067579	  0.873167
  1.085007	 -2.049084	  0.876466
  1.091933	 -2.030582	  0.879582
  1.098970	 -2.012114	  0.882650
  1.106242	 -1.993722	  0.885624
  1.113512	 -1.975327	  0.888588
  1.120454	 -1.956688	  0.890677
  1.127240	 -1.937950	  0.892362
  1.134013	 -1.919207	  0.894029
  1.139809	 -1.900069	  0.894347
  1.145325	 -1.880844	  0.894287
  1.150819	 -1.861615	  0.894213
  1.154764	 -1.842038	  0.893147
  1.158485	 -1.822424	  0.891943
  1.162184	 -1.802788	  0.891098
  1.165847	 -1.783127	  0.890860
  1.169652	 -1.763494	  0.890973
  1.174033	 -1.744038	  0.892470
  1.178424	 -1.724583	  0.893972
  1.183546	 -1.705252	  0.894134
  1.188992	 -1.686013	  0.893688
  1.194450	 -1.666780	  0.893210
  1.200856	 -1.648056	  0.890332
  1.207400	 -1.629435	  0.887104
  1.214251	 -1.610853	  0.884322
  1.221584	 -1.592359	  0.882267
  1.228911	 -1.573863	  0.880221
  1.235814	 -1.555189	  0.878308
  1.242705	 -1.536512	  0.876397
  1.248779	 -1.517550	  0.874510
  1.253954	 -1.498321	  0.872655
  1.259091	 -1.479083	  0.870803
  1.262007	 -1.459382	  0.868987
  1.264716	 -1.439649	  0.867177
  1.267507	 -1.419947	  0.865171
  1.270526	 -1.400339	  0.862639
  1.273139	 -1.381069	  0.860259
  1.275844	 -1.361520	  0.858343
  1.279760	 -1.340603	  0.857764
  1.286453	 -1.320439	  0.856764
  1.292710	 -1.304720	  0.851084
  1.300182	 -1.285295	  0.848970
  1.306934	 -1.266644	  0.848387
  1.314014	 -1.248085	  0.848320
  1.322225	 -1.226962	  0.847712
  1.327769	 -1.211627	  0.848897
  1.335016	 -1.191559	  0.849767
  1.342197	 -1.172125	  0.850215
  1.349055	 -1.155623	  0.847851
  1.357637	 -1.135066	  0.843882
  1.365452	 -1.115450	  0.841755
  1.369945	 -1.098659	  0.843339
  1.374698	 -1.079958	  0.842822
  1.379974	 -1.059620	  0.840106
  1.385204	 -1.040456	  0.837259
  1.388281	 -1.021421	  0.831978
  1.388305	 -1.003275	  0.823583
  1.388297	 -0.985137	  0.815155
  1.388289	 -0.966999	  0.806727
  1.388243	 -0.948895	  0.798255
  1.384469	 -0.934214	  0.785231
  1.379148	 -0.921628	  0.770628
  1.373813	 -0.909062	  0.756012
  1.368478	 -0.896495	  0.741397
  1.363142	 -0.883928	  0.726781
  1.357807	 -0.871362	  0.712166
  1.352403	 -0.858840	  0.697551
  1.342461	 -0.849139	  0.683179
  1.332445	 -0.839486	  0.668808
  1.322429	 -0.829834	  0.654437
  1.312413	 -0.820182	  0.640067
  1.302397	 -0.810529	  0.625696
  1.292368	 -0.800878	  0.611335
  1.280846	 -0.791166	  0.598192
  1.267099	 -0.781547	  0.587309
  1.253332	 -0.771931	  0.576446
  1.239565	 -0.762314	  0.565584
  1.225813	 -0.752702	  0.554709
  1.213166	 -0.743329	  0.542480
  1.201416	 -0.733946	  0.529151
  1.188263	 -0.724967	  0.516721
  1.176293	 -0.715342	  0.504820
  1.162138	 -0.704765	  0.493126
  1.147514	 -0.695225	  0.481625
  1.130946	 -0.687464	  0.472215
  1.114501	 -0.679636	  0.467990
  1.097775	 -0.669526	  0.461388
  1.081774	 -0.659346	  0.454635
  1.067209	 -0.645533	  0.453469
  1.052790	 -0.631717	  0.452371
  1.038373	 -0.617899	  0.451275
  1.024287	 -0.603755	  0.450549
  1.017043	 -0.585895	  0.455796
  1.009908	 -0.567990	  0.461119
  1.006356	 -0.549419	  0.467625
  1.003836	 -0.530777	  0.474418
  1.001325	 -0.512154	  0.481235
  0.999645	 -0.493778	  0.488740
  0.999690	 -0.475150	  0.496750
  1.000165	 -0.456266	  0.503178
  1.000696	 -0.437242	  0.508894
  1.001045	 -0.418340	  0.515701
  1.004927	 -0.400553	  0.523969
  1.010707	 -0.383590	  0.532845
  1.016506	 -0.366635	  0.541726
  1.022336	 -0.349724	  0.550648
  1.031118	 -0.337101	  0.563402
  1.041605	 -0.327240	  0.577101
  1.052984	 -0.317539	  0.590683
  1.063661	 -0.308522	  0.605213
  1.073823	 -0.303083	  0.621428
  1.083068	 -0.297051	  0.637658
  1.094428	 -0.291544	  0.653564
  1.104848	 -0.286252	  0.669805
  1.114476	 -0.280524	  0.686297
  1.124552	 -0.275367	  0.702813
  1.134638	 -0.270499	  0.719509
  1.143920	 -0.265441	  0.736426
  1.153266	 -0.260290	  0.753322
  1.163056	 -0.255291	  0.770050
  1.173237	 -0.249828	  0.786355
  1.186829	 -0.239808	  0.797041
  1.200456	 -0.229741	  0.807669
  1.214096	 -0.219665	  0.818267
  1.228921	 -0.208640	  0.825841
  1.244671	 -0.196720	  0.822898
  1.260431	 -0.184790	  0.819846
  1.276191	 -0.172860	  0.816793
  1.291947	 -0.160923	  0.813760
  1.307332	 -0.148199	  0.812605
  1.322381	 -0.135027	  0.812702
  1.337427	 -0.121851	  0.812811
  1.352472	 -0.108675	  0.812919
  1.367528	 -0.095510	  0.813036
  1.383467	 -0.083458	  0.813820
  1.400669	 -0.073279	  0.813817
  1.419901	 -0.068429	  0.811341
  1.439543	 -0.066294	  0.808249
  1.459190	 -0.064203	  0.805154
  1.478973	 -0.063531	  0.802293
  1.498782	 -0.063497	  0.799541
  1.518592	 -0.063468	  0.796790
  1.538400	 -0.063408	  0.794045
  1.558029	 -0.060256	  0.791877
  1.577639	 -0.056960	  0.789739
  1.597249	 -0.053663	  0.787600
  1.616859	 -0.050365	  0.785461
  1.636422	 -0.046967	  0.783352
  1.651446	 -0.033830	  0.783981
  1.666231	 -0.020381	  0.784711
  1.681023	 -0.007454	  0.785699
  1.695721	  0.004406	  0.787996
  1.708925	  0.022448	  0.790175
  1.717999	  0.041059	  0.792970
  1.726137	  0.056814	  0.792884
  1.735384	  0.073915	  0.794230
  1.743706	  0.094254	  0.796598
  1.749944	  0.110685	  0.796493
  1.756944	  0.128637	  0.798260
  1.763909	  0.151227	  0.800657
  1.769010	  0.169776	  0.800529
  1.775227	  0.187879	  0.800101
  1.781625	  0.204921	  0.800373
  1.788368	  0.226016	  0.800904
  1.792542	  0.246137	  0.800347
  1.795092	  0.265590	  0.796838
  1.800720	  0.282474	  0.791144
  1.808379	  0.300888	  0.785242
  1.811681	  0.321858	  0.781783
  1.812770	  0.345676	  0.782323
  1.814363	  0.359835	  0.781692
  1.819413	  0.379186	  0.777985
  1.827843	  0.399980	  0.775320
  1.834868	  0.420820	  0.777630
  1.833564	  0.438221	  0.774201
  1.842857	  0.456731	  0.771827
  1.853083	  0.476962	  0.769531
  1.851053	  0.496341	  0.766140
  1.854280	  0.516574	  0.767266
  1.859476	  0.534054	  0.768439
  1.867235	  0.553609	  0.769201
  1.874014	  0.572516	  0.769473
  1.879558	  0.591763	  0.769406
  1.886644	  0.610420	  0.770351
  1.891506	  0.629593	  0.771250
  1.895530	  0.649678	  0.772431
  1.899768	  0.669153	  0.773962
  1.903581	  0.688644	  0.774833
  1.907373	  0.709019	  0.773455
  1.912536	  0.728501	  0.772134
  1.916697	  0.747348	  0.772355
  1.921259	  0.767276	  0.774337
  1.924195	  0.786442	  0.776945
  1.927076	  0.806536	  0.779321
  1.929293	  0.826457	  0.781580
  1.930489	  0.847599	  0.778959
  1.930978	  0.867620	  0.773034
  1.932967	  0.886005	  0.763748
  1.935700	  0.904962	  0.758534
  1.938702	  0.924593	  0.756719
  1.944279	  0.943244	  0.756700
  1.948138	  0.963974	  0.754006
  1.950868	  0.985331	  0.746583
  1.957350	  1.000618	  0.738735
  1.968377	  1.018252	  0.736845
  1.974361	  1.037524	  0.733597
  1.973896	  1.057133	  0.728284
  1.973829	  1.078088	  0.721030
  1.981221	  1.094828	  0.715305
  1.989920	  1.112624	  0.710246
  1.999907	  1.129855	  0.706932
  2.007672	  1.148281	  0.702395
  2.013954	  1.166883	  0.698712
  2.020766	  1.185540	  0.696004
  2.028313	  1.203930	  0.694046
  2.037940	  1.222009	  0.693695
  2.051408	  1.250732	  0.690937
  2.054538	  1.258096	  0.690021
