 -2.237203	 -0.585430	  1.011349
 -2.238407	 -0.584744	  1.013924
 -2.231044	 -0.591321	  1.001910
 -2.217152	 -0.603052	  0.984307
 -2.206789	 -0.607400	  0.963263
 -2.202864	 -0.606916	  0.946584
 -2.198081	 -0.608653	  0.925591
 -2.191792	 -0.613519	  0.909264
 -2.184433	 -0.619281	  0.892413
 -2.172422	 -0.626548	  0.866463
 -2.167378	 -0.630619	  0.857579
 -2.158409	 -0.638770	  0.838974
 -2.147550	 -0.645818	  0.817631
 -2.141319	 -0.647670	  0.804709
 -2.139854	 -0.641583	  0.782786
 -2.139878	 -0.633807	  0.758523
 -2.135800	 -0.632942	  0.739041
 -2.134995	 -0.635934	  0.720178
 -2.131477	 -0.633625	  0.698100
 -2.126074	 -0.638456	  0.676267
 -2.124090	 -0.652555	  0.661778
 -2.123034	 -0.669000	  0.643644
 -2.121617	 -0.676505	  0.625084
 -2.122345	 -0.674754	  0.608848
 -2.121719	 -0.667860	  0.584489
 -2.117497	 -0.671634	  0.556030
 -2.116648	 -0.677126	  0.543837
 -2.121174	 -0.685748	  0.527787
 -2.135314	 -0.699403	  0.512476
 -2.143656	 -0.714245	  0.490500
 -2.147314	 -0.722006	  0.480370
 -2.153274	 -0.736478	  0.466400
 -2.163027	 -0.752571	  0.450413
 -2.169915	 -0.761729	  0.440288
 -2.177847	 -0.772885	  0.424443
 -2.188021	 -0.784920	  0.407998
 -2.195439	 -0.792233	  0.394645
 -2.204455	 -0.802148	  0.379589
 -2.213659	 -0.812622	  0.364500
 -2.221836	 -0.822212	  0.348315
 -2.232053	 -0.833185	  0.334256
 -2.241804	 -0.842306	  0.322402
 -2.252817	 -0.853794	  0.303730
 -2.266255	 -0.869068	  0.288666
 -2.274295	 -0.878486	  0.284008
 -2.285364	 -0.888551	  0.279159
 -2.298948	 -0.901254	  0.264245
 -2.309540	 -0.912646	  0.250325
 -2.319595	 -0.923532	  0.237015
 -2.328518	 -0.933621	  0.223013
 -2.336346	 -0.943173	  0.207281
