  0.399038	 -0.760189	  2.348874
  0.368327	 -0.742457	  2.405217
  0.377553	 -0.747784	  2.388291
  0.386779	 -0.753111	  2.371364
  0.396006	 -0.758439	  2.354438
  0.405232	 -0.763766	  2.337512
  0.414425	 -0.769116	  2.320577
  0.422648	 -0.775158	  2.303378
  0.430412	 -0.781514	  2.286077
  0.438161	 -0.787880	  2.268773
  0.445909	 -0.794246	  2.251468
  0.453635	 -0.800680	  2.234186
  0.459617	 -0.809396	  2.217282
  0.460165	 -0.823502	  2.203189
  0.460024	 -0.837867	  2.189433
  0.454045	 -0.853794	  2.179064
  0.447268	 -0.869723	  2.168986
  0.440933	 -0.885830	  2.158707
  0.436109	 -0.900280	  2.145486
  0.431859	 -0.913863	  2.131271
  0.429063	 -0.927483	  2.116917
  0.425866	 -0.940487	  2.102464
  0.420207	 -0.950229	  2.086326
  0.412868	 -0.959237	  2.070185
  0.404364	 -0.967910	  2.055368
  0.391020	 -0.972309	  2.043324
  0.375780	 -0.974963	  2.030898
  0.360428	 -0.977932	  2.018579
  0.344041	 -0.981304	  2.007763
  0.327011	 -0.983972	  1.997579
  0.310057	 -0.986950	  1.987004
  0.293742	 -0.990898	  1.975770
  0.278073	 -0.996573	  1.964601
  0.262631	 -1.002961	  1.953810
  0.246693	 -1.008310	  1.943060
  0.229242	 -1.002925	  1.935120
  0.212016	 -0.995710	  1.927985
  0.194785	 -0.988452	  1.920885
  0.177557	 -0.981191	  1.913780
  0.160336	 -0.973929	  1.906673
  0.143660	 -0.967212	  1.899060
  0.128241	 -0.963159	  1.888341
  0.115554	 -0.959623	  1.875685
  0.099815	 -0.949298	  1.867296
  0.074420	 -0.937001	  1.861079
  0.055235	 -0.932503	  1.855423
  0.039224	 -0.929812	  1.850987
  0.020076	 -0.926361	  1.846265
  0.000421	 -0.923928	  1.838921
 -0.016289	 -0.922780	  1.830110
 -0.029180	 -0.921928	  1.824746
 -0.051238	 -0.916660	  1.818456
 -0.074438	 -0.916539	  1.807331
 -0.088987	 -0.920324	  1.798872
 -0.102247	 -0.927980	  1.790911
 -0.122806	 -0.941825	  1.777776
 -0.131814	 -0.952739	  1.768408
 -0.138589	 -0.965498	  1.758845
 -0.150660	 -0.984616	  1.744038
 -0.159958	 -0.993806	  1.734559
 -0.169281	 -1.001942	  1.723870
 -0.176244	 -1.013846	  1.708009
 -0.182662	 -1.027521	  1.696694
 -0.191051	 -1.043744	  1.686778
 -0.208688	 -1.067606	  1.675052
 -0.222983	 -1.080161	  1.666659
 -0.231025	 -1.087768	  1.659450
 -0.241030	 -1.097691	  1.649522
 -0.248691	 -1.113669	  1.636412
 -0.253558	 -1.130155	  1.625855
 -0.262198	 -1.147046	  1.616882
 -0.270578	 -1.162807	  1.606233
 -0.277787	 -1.176454	  1.596098
 -0.285319	 -1.195971	  1.579953
 -0.297141	 -1.211081	  1.569524
 -0.310015	 -1.220396	  1.566849
 -0.323742	 -1.235106	  1.562859
 -0.336374	 -1.251059	  1.556627
 -0.348038	 -1.266058	  1.550095
 -0.359300	 -1.281048	  1.543652
 -0.372339	 -1.294961	  1.536958
 -0.385592	 -1.308336	  1.530136
 -0.398704	 -1.321562	  1.522846
 -0.411177	 -1.334349	  1.513867
 -0.423387	 -1.346874	  1.504755
 -0.432899	 -1.355973	  1.493307
 -0.441527	 -1.362830	  1.477062
 -0.452860	 -1.385588	  1.456769
 -0.464695	 -1.405250	  1.450856
 -0.468777	 -1.411918	  1.449604
 -0.479197	 -1.427981	  1.444030
 -0.495998	 -1.451858	  1.431232
 -0.501167	 -1.459109	  1.427759
 -0.511845	 -1.475263	  1.421357
 -0.526731	 -1.496136	  1.410385
 -0.533926	 -1.506446	  1.405201
 -0.542398	 -1.521572	  1.396144
 -0.552832	 -1.540021	  1.383527
 -0.559736	 -1.554821	  1.368657
 -0.562969	 -1.563567	  1.357281
 -0.572258	 -1.577943	  1.343914
 -0.586941	 -1.595384	  1.343126
 -0.595024	 -1.615968	  1.342061
 -0.602879	 -1.634825	  1.337106
 -0.609333	 -1.648211	  1.328366
 -0.619687	 -1.663137	  1.316094
 -0.637062	 -1.680733	  1.302281
 -0.644916	 -1.691088	  1.298030
 -0.656456	 -1.708332	  1.293016
 -0.671847	 -1.725600	  1.282005
 -0.680235	 -1.732420	  1.274960
 -0.694786	 -1.745634	  1.263689
 -0.706792	 -1.758152	  1.256616
 -0.719308	 -1.769428	  1.250895
 -0.737122	 -1.782321	  1.240896
 -0.748377	 -1.792324	  1.231625
 -0.759325	 -1.805968	  1.221100
 -0.771024	 -1.822022	  1.208482
 -0.781403	 -1.836477	  1.197730
 -0.793283	 -1.850715	  1.189974
 -0.802668	 -1.861060	  1.182069
 -0.822406	 -1.877770	  1.168865
 -0.832329	 -1.883865	  1.163904
 -0.844263	 -1.893189	  1.157216
 -0.862568	 -1.916938	  1.142718
 -0.868454	 -1.930895	  1.133462
 -0.872600	 -1.940329	  1.125928
 -0.883974	 -1.956016	  1.108478
 -0.892943	 -1.966757	  1.096404
 -0.903165	 -1.981709	  1.087732
 -0.907171	 -1.998032	  1.082243
 -0.914190	 -2.017296	  1.071879
 -0.923484	 -2.031092	  1.059379
 -0.932129	 -2.044381	  1.046992
 -0.940990	 -2.058292	  1.035601
 -0.950152	 -2.072378	  1.024736
 -0.959386	 -2.086385	  1.013843
 -0.968662	 -2.100450	  1.002905
 -0.978495	 -2.115400	  0.991206
 -0.990050	 -2.133139	  0.977965
 -0.999345	 -2.147420	  0.967493
