  0.386219	 -2.327183	  0.734371
  0.385713	 -2.329209	  0.735049
  0.390322	 -2.310753	  0.728874
  0.394931	 -2.292297	  0.722698
  0.399819	 -2.273899	  0.716564
  0.404937	 -2.255552	  0.710466
  0.410056	 -2.237206	  0.704367
  0.415960	 -2.219143	  0.698132
  0.421969	 -2.201120	  0.691881
  0.428217	 -2.183145	  0.685727
  0.435070	 -2.165307	  0.679824
  0.441922	 -2.147469	  0.673921
  0.449442	 -2.129457	  0.669561
  0.456972	 -2.111442	  0.665228
  0.464912	 -2.093247	  0.662803
  0.472896	 -2.075041	  0.660610
  0.480288	 -2.056499	  0.659357
  0.487466	 -2.037855	  0.658434
  0.494242	 -2.019047	  0.657839
  0.500625	 -2.000095	  0.657561
  0.506966	 -1.981130	  0.657228
  0.512508	 -1.961964	  0.655826
  0.518050	 -1.942799	  0.654425
  0.523287	 -1.923599	  0.652440
  0.527909	 -1.904392	  0.649316
  0.532530	 -1.885186	  0.646193
  0.536365	 -1.866019	  0.641958
  0.539471	 -1.846966	  0.636733
  0.542578	 -1.827912	  0.631508
  0.545106	 -1.809022	  0.625441
  0.547511	 -1.790174	  0.619199
  0.549880	 -1.771347	  0.612880
  0.552139	 -1.752586	  0.606329
  0.554398	 -1.733825	  0.599778
  0.556437	 -1.715132	  0.592964
  0.558373	 -1.696473	  0.586029
  0.560299	 -1.677843	  0.579015
  0.562104	 -1.659587	  0.571050
  0.563910	 -1.641330	  0.563084
  0.565797	 -1.623224	  0.554802
  0.567910	 -1.605562	  0.545658
  0.570023	 -1.587901	  0.536515
  0.574954	 -1.570046	  0.528973
  0.582481	 -1.552450	  0.523164
  0.590009	 -1.534855	  0.517355
  0.598888	 -1.517455	  0.513065
  0.607912	 -1.500089	  0.508945
  0.616301	 -1.482513	  0.504392
  0.623848	 -1.464709	  0.499290
  0.630129	 -1.446260	  0.494797
  0.628105	 -1.426365	  0.494481
  0.626082	 -1.406470	  0.494166
  0.624058	 -1.386575	  0.493850
  0.624372	 -1.366625	  0.492478
  0.632637	 -1.349058	  0.487672
  0.640902	 -1.331491	  0.482866
  0.649167	 -1.313925	  0.478059
  0.644186	 -1.295063	  0.482468
  0.631739	 -1.282429	  0.491712
  0.619292	 -1.269795	  0.500957
  0.606846	 -1.257161	  0.510201
  0.594399	 -1.244528	  0.519446
  0.581952	 -1.231894	  0.528691
  0.570087	 -1.219097	  0.538462
  0.558789	 -1.206167	  0.548716
  0.547490	 -1.193236	  0.558970
  0.536191	 -1.180306	  0.569224
  0.524893	 -1.167375	  0.579477
  0.513594	 -1.154444	  0.589731
  0.502296	 -1.141514	  0.599985
  0.490997	 -1.128583	  0.610239
  0.480822	 -1.114641	  0.620343
  0.478176	 -1.096550	  0.628449
  0.475529	 -1.078458	  0.636554
  0.472882	 -1.060367	  0.644660
  0.470236	 -1.042276	  0.652765
  0.467589	 -1.024184	  0.660871
  0.464942	 -1.006093	  0.668976
  0.462295	 -0.988002	  0.677082
  0.460785	 -0.969575	  0.684708
  0.464818	 -0.950604	  0.689591
  0.468850	 -0.931633	  0.694474
  0.472882	 -0.912662	  0.699358
  0.476914	 -0.893691	  0.704241
  0.480946	 -0.874720	  0.709124
  0.486625	 -0.856147	  0.713899
  0.493702	 -0.838029	  0.718550
  0.500778	 -0.819910	  0.723202
  0.507855	 -0.801791	  0.727854
  0.514932	 -0.783673	  0.732505
  0.523464	 -0.765589	  0.732084
  0.532045	 -0.747535	  0.731442
  0.540626	 -0.729481	  0.730801
  0.549334	 -0.711544	  0.729235
  0.558269	 -0.696529	  0.719502
  0.567204	 -0.681514	  0.709770
  0.576138	 -0.666499	  0.700038
  0.585399	 -0.651754	  0.690198
  0.595370	 -0.637637	  0.680134
  0.605341	 -0.623520	  0.670069
  0.615312	 -0.609402	  0.660005
  0.625691	 -0.596543	  0.648740
  0.636086	 -0.583742	  0.637423
  0.646481	 -0.570940	  0.626107
  0.656876	 -0.558139	  0.614790
  0.667550	 -0.548194	  0.601109
  0.678187	 -0.540682	  0.585930
  0.688825	 -0.533170	  0.570750
  0.699462	 -0.525659	  0.555570
  0.710099	 -0.518147	  0.540391
  0.720251	 -0.513380	  0.523831
  0.729667	 -0.511489	  0.506288
  0.739083	 -0.509599	  0.488745
  0.748499	 -0.507708	  0.471201
  0.757915	 -0.505818	  0.453658
  0.767331	 -0.503927	  0.436115
  0.776928	 -0.503649	  0.418570
  0.786614	 -0.504487	  0.401092
  0.796300	 -0.505326	  0.383614
  0.805986	 -0.506164	  0.366136
  0.815672	 -0.507003	  0.348659
  0.825358	 -0.507841	  0.331181
  0.835044	 -0.508680	  0.313703
  0.841607	 -0.490317	  0.309260
  0.847824	 -0.471675	  0.305541
  0.853570	 -0.452891	  0.301780
  0.858514	 -0.433894	  0.297953
  0.863436	 -0.414889	  0.294135
  0.867999	 -0.395766	  0.290462
  0.872562	 -0.376643	  0.286789
  0.877061	 -0.357446	  0.283433
  0.881535	 -0.338222	  0.280206
  0.885977	 -0.318964	  0.277142
  0.890370	 -0.299656	  0.274329
  0.894756	 -0.280345	  0.271530
  0.899067	 -0.260994	  0.268895
  0.903379	 -0.241642	  0.266259
  0.907738	 -0.222328	  0.263444
  0.912132	 -0.203040	  0.260497
  0.916526	 -0.183752	  0.257551
  0.921120	 -0.164622	  0.253957
  0.925805	 -0.145572	  0.250062
  0.930489	 -0.126523	  0.246168
  0.935451	 -0.107606	  0.241981
  0.940481	 -0.088723	  0.237722
  0.945664	 -0.069867	  0.233528
  0.951374	 -0.051114	  0.229564
  0.957084	 -0.032360	  0.225601
  0.962924	 -0.013716	  0.221324
  0.968840	  0.004860	  0.216859
  0.974755	  0.023436	  0.212394
  0.979963	  0.042007	  0.207103
  0.985159	  0.060577	  0.201798
  0.989754	  0.079225	  0.196216
  0.993608	  0.097939	  0.190305
  0.996594	  0.116876	  0.184609
  0.998243	  0.136078	  0.179265
  1.000702	  0.155322	  0.174401
  1.004978	  0.174499	  0.170667
  1.009254	  0.193676	  0.166933
  1.016241	  0.212373	  0.165663
  1.023926	  0.230828	  0.165074
  1.031952	  0.249147	  0.164949
  1.040360	  0.267289	  0.165359
  1.048762	  0.285434	  0.165753
  1.056744	  0.303764	  0.165182
  1.064726	  0.322093	  0.164611
  1.072694	  0.340426	  0.163976
  1.080043	  0.358745	  0.160752
  1.087391	  0.377065	  0.157528
  1.094740	  0.395384	  0.154304
  1.102088	  0.413704	  0.151080
  1.109820	  0.430496	  0.143448
  1.117584	  0.446644	  0.134562
  1.125348	  0.462793	  0.125677
  1.133113	  0.478941	  0.116792
  1.140711	  0.494641	  0.107005
  1.148089	  0.509762	  0.096193
  1.155171	  0.525707	  0.086416
  1.161094	  0.543776	  0.080216
  1.167017	  0.561845	  0.074017
  1.172720	  0.580168	  0.068382
  1.177754	  0.599113	  0.064414
  1.183019	  0.617947	  0.060221
  1.188812	  0.636502	  0.055516
  1.194936	  0.655260	  0.052259
  1.201640	  0.674103	  0.052078
  1.208344	  0.692945	  0.051897
  1.215281	  0.711602	  0.049950
  1.222563	  0.729077	  0.043502
  1.229845	  0.746553	  0.037053
  1.237127	  0.764028	  0.030605
  1.244317	  0.781465	  0.023953
  1.250960	  0.798633	  0.016134
  1.257604	  0.815801	  0.008316
  1.264165	  0.832910	  0.000300
  1.270544	  0.849883	 -0.008140
  1.276923	  0.866855	 -0.016579
  1.283302	  0.883748	 -0.025178
  1.289681	  0.900600	 -0.033858
  1.296016	  0.917454	 -0.042564
  1.302085	  0.934325	 -0.051426
  1.308155	  0.951195	 -0.060289
  1.313633	  0.968252	 -0.069180
  1.318898	  0.985371	 -0.078081
  1.323486	  1.002745	 -0.086861
  1.327434	  1.020338	 -0.095517
  1.330835	  1.038114	 -0.104027
  1.333380	  1.056146	 -0.112295
  1.335803	  1.074246	 -0.120452
  1.337704	  1.092614	 -0.128133
  1.339605	  1.110983	 -0.135813
  1.341482	  1.129629	 -0.142798
  1.343359	  1.148281	 -0.149767
  1.345493	  1.167106	 -0.156176
  1.347717	  1.185986	 -0.162391
  1.350258	  1.204952	 -0.168205
  1.353176	  1.224006	 -0.173536
  1.356152	  1.243066	 -0.178816
  1.360080	  1.262172	 -0.183237
  1.364008	  1.281277	 -0.187657
  1.368675	  1.300326	 -0.191580
  1.373799	  1.319319	 -0.195186
  1.379177	  1.338270	 -0.198638
  1.385408	  1.357049	 -0.201562
  1.391639	  1.375827	 -0.204486
  1.398279	  1.394566	 -0.206664
  1.405002	  1.413293	 -0.208691
  1.411672	  1.432080	 -0.210297
  1.418287	  1.450917	 -0.211486
  1.424837	  1.469784	 -0.212546
  1.431166	  1.488746	 -0.213171
  1.437473	  1.507715	 -0.213781
  1.443359	  1.526827	 -0.214106
  1.449245	  1.545938	 -0.214431
  1.454719	  1.565173	 -0.214715
  1.460096	  1.584434	 -0.214990
  1.465407	  1.603711	 -0.215432
  1.470528	  1.623023	 -0.216346
  1.475650	  1.642334	 -0.217261
  1.480577	  1.661675	 -0.218540
  1.485340	  1.681035	 -0.220124
  1.490102	  1.700395	 -0.221708
  1.494403	  1.719818	 -0.223777
  1.498703	  1.739240	 -0.225847
  1.502972	  1.758631	 -0.228245
  1.507197	  1.777971	 -0.231099
  1.511422	  1.797310	 -0.233952
  1.515781	  1.816587	 -0.237014
  1.521462	  1.835060	 -0.242162
  1.527143	  1.853532	 -0.247309
  1.532824	  1.872005	 -0.252456
  1.538506	  1.890477	 -0.257603
  1.544187	  1.908949	 -0.262751
  1.555903	  1.945483	 -0.273754
  1.561892	  1.963681	 -0.279497
