 -1.684770	 -0.120926	  1.842441
 -1.697658	 -0.118200	  1.844535
 -1.678333	 -0.122287	  1.841396
 -1.658997	 -0.126349	  1.838361
 -1.639257	 -0.129506	  1.838483
 -1.619502	 -0.132606	  1.838811
 -1.599735	 -0.135562	  1.839460
 -1.579957	 -0.137990	  1.841179
 -1.560173	 -0.140401	  1.842863
 -1.540363	 -0.142973	  1.843865
 -1.520548	 -0.145625	  1.844443
 -1.500726	 -0.148265	  1.844765
 -1.480904	 -0.150809	  1.844000
 -1.461081	 -0.153339	  1.843188
 -1.441227	 -0.155444	  1.842021
 -1.421357	 -0.157157	  1.840528
 -1.401486	 -0.158841	  1.839014
 -1.381608	 -0.159881	  1.837074
 -1.361732	 -0.160754	  1.835025
 -1.341848	 -0.161541	  1.833040
 -1.321888	 -0.161417	  1.831788
 -1.301927	 -0.161261	  1.830560
 -1.281960	 -0.160867	  1.829477
 -1.261998	 -0.159927	  1.828708
 -1.242044	 -0.158953	  1.827878
 -1.222450	 -0.157482	  1.826856
 -1.204326	 -0.154854	  1.823110
 -1.183401	 -0.148961	  1.817647
 -1.161309	 -0.145420	  1.817781
 -1.142580	 -0.146644	  1.822389
 -1.123157	 -0.145288	  1.823622
 -1.103194	 -0.140958	  1.822065
 -1.083689	 -0.139451	  1.823590
 -1.063139	 -0.137484	  1.824930
 -1.043954	 -0.133172	  1.823644
 -1.024537	 -0.131437	  1.825104
 -1.004538	 -0.127443	  1.828289
 -0.984215	 -0.121845	  1.826563
 -0.963600	 -0.121488	  1.822499
 -0.944228	 -0.126979	  1.824045
 -0.925306	 -0.127371	  1.828398
 -0.905229	 -0.130244	  1.832455
 -0.886053	 -0.133741	  1.835630
 -0.867136	 -0.133962	  1.840621
 -0.844304	 -0.135527	  1.843901
 -0.827303	 -0.143167	  1.844785
 -0.809819	 -0.153217	  1.847348
 -0.788015	 -0.161772	  1.847994
 -0.770508	 -0.160701	  1.849806
 -0.750842	 -0.163455	  1.852847
 -0.730261	 -0.168078	  1.854152
 -0.710673	 -0.166477	  1.856085
 -0.689852	 -0.165424	  1.858226
 -0.670662	 -0.168678	  1.858703
 -0.650986	 -0.168078	  1.860613
 -0.629308	 -0.166116	  1.864006
 -0.610516	 -0.169877	  1.865221
 -0.592514	 -0.172216	  1.864869
 -0.566963	 -0.171803	  1.864238
 -0.550565	 -0.174827	  1.863809
 -0.533621	 -0.178029	  1.862997
 -0.507629	 -0.183097	  1.857614
 -0.490040	 -0.180150	  1.856773
 -0.470203	 -0.174341	  1.856283
 -0.452233	 -0.174370	  1.853336
 -0.432447	 -0.175714	  1.848230
 -0.412996	 -0.171919	  1.842856
 -0.394182	 -0.167384	  1.837743
 -0.375470	 -0.162707	  1.832667
 -0.358964	 -0.152260	  1.829039
 -0.343637	 -0.139283	  1.827451
 -0.329190	 -0.125837	  1.825247
 -0.320585	 -0.108075	  1.821542
 -0.321614	 -0.086903	  1.815711
 -0.320006	 -0.066286	  1.808371
 -0.312309	 -0.049656	  1.804282
 -0.302460	 -0.034253	  1.801113
 -0.294941	 -0.014787	  1.798554
 -0.285526	  0.007414	  1.793338
 -0.279298	  0.020006	  1.790141
 -0.268128	  0.036836	  1.788039
 -0.260303	  0.055498	  1.786897
 -0.250187	  0.074574	  1.778146
 -0.236765	  0.085886	  1.767831
 -0.221245	  0.095449	  1.764155
 -0.201932	  0.102808	  1.760304
 -0.182013	  0.106288	  1.750208
 -0.170097	  0.110725	  1.740309
 -0.153415	  0.112527	  1.731818
 -0.133308	  0.111666	  1.717725
 -0.119217	  0.115096	  1.707667
 -0.106811	  0.115676	  1.705798
 -0.085512	  0.109337	  1.704748
 -0.066573	  0.100910	  1.696414
 -0.052690	  0.090686	  1.684538
 -0.040452	  0.079548	  1.676555
 -0.033630	  0.062286	  1.671125
 -0.035311	  0.037226	  1.664368
 -0.030811	  0.021346	  1.658475
 -0.022083	  0.006103	  1.655043
 -0.014248	 -0.010742	  1.654291
 -0.005118	 -0.036591	  1.654715
 -0.000551	 -0.053738	  1.655962
  0.004386	 -0.074041	  1.656006
  0.007195	 -0.090346	  1.654726
  0.006107	 -0.110345	  1.648735
  0.008260	 -0.129708	  1.642913
  0.016423	 -0.149495	  1.642434
  0.030613	 -0.168710	  1.646855
  0.042586	 -0.185032	  1.646634
  0.046245	 -0.202904	  1.641119
  0.048754	 -0.221569	  1.625143
  0.056692	 -0.235529	  1.602824
  0.066244	 -0.249161	  1.592953
  0.073590	 -0.263381	  1.594189
  0.084519	 -0.280086	  1.594182
  0.095644	 -0.298835	  1.582998
  0.097679	 -0.315445	  1.571088
  0.097165	 -0.333906	  1.564486
  0.102040	 -0.358304	  1.561146
  0.110347	 -0.379587	  1.557306
  0.119302	 -0.391542	  1.551662
  0.136328	 -0.405500	  1.538687
  0.149275	 -0.413687	  1.534574
  0.165917	 -0.424433	  1.525820
  0.183509	 -0.440446	  1.522652
  0.190488	 -0.452073	  1.516977
  0.204712	 -0.468619	  1.521985
  0.218073	 -0.484684	  1.520617
  0.234353	 -0.497655	  1.519417
  0.248598	 -0.507440	  1.519797
  0.265319	 -0.519359	  1.525272
  0.281531	 -0.530888	  1.527282
  0.300256	 -0.542473	  1.526821
  0.318602	 -0.551742	  1.530717
  0.335101	 -0.555737	  1.541460
  0.352525	 -0.555531	  1.557281
  0.369634	 -0.560093	  1.571264
  0.384010	 -0.570583	  1.575668
  0.403432	 -0.579987	  1.578565
  0.422686	 -0.584105	  1.579422
  0.442029	 -0.588493	  1.583261
  0.461025	 -0.592046	  1.590468
  0.478888	 -0.593769	  1.600362
  0.494531	 -0.594736	  1.612472
  0.510605	 -0.592232	  1.624767
  0.526594	 -0.587060	  1.636039
  0.542874	 -0.582080	  1.646585
  0.559091	 -0.577028	  1.657137
  0.573622	 -0.570001	  1.668906
  0.584010	 -0.559514	  1.682380
  0.594238	 -0.548915	  1.695917
  0.604406	 -0.538226	  1.709383
  0.614731	 -0.526910	  1.722298
  0.621446	 -0.514035	  1.736244
  0.627114	 -0.502098	  1.751115
  0.633144	 -0.489578	  1.765564
  0.639638	 -0.476848	  1.779529
  0.648939	 -0.466527	  1.793901
  0.659391	 -0.457473	  1.808343
  0.669677	 -0.448521	  1.822986
  0.680120	 -0.439697	  1.837613
  0.692461	 -0.433301	  1.851896
  0.706203	 -0.429504	  1.865891
  0.719378	 -0.426258	  1.880664
  0.733266	 -0.423900	  1.894691
  0.747040	 -0.427050	  1.908915
  0.760399	 -0.431531	  1.922770
  0.774245	 -0.434504	  1.936769
  0.788618	 -0.437063	  1.950004
  0.802959	 -0.443939	  1.962889
  0.816651	 -0.455914	  1.973733
  0.826470	 -0.470999	  1.985037
  0.834019	 -0.481864	  2.000744
  0.844156	 -0.490037	  2.015916
  0.857835	 -0.495208	  2.029053
  0.873831	 -0.495360	  2.029153
  0.888230	 -0.501733	  2.032405
  0.905676	 -0.501607	  2.023716
  0.924665	 -0.499524	  2.017336
  0.943336	 -0.495910	  2.016063
  0.960848	 -0.489346	  2.007965
  0.967160	 -0.478338	  1.992496
  0.972947	 -0.467321	  1.976841
  0.978700	 -0.456328	  1.961197
  0.984098	 -0.445123	  1.946443
  0.990409	 -0.433932	  1.931554
  1.000541	 -0.424125	  1.917640
  1.012815	 -0.416517	  1.903093
  1.019623	 -0.405489	  1.880671
  1.020242	 -0.395458	  1.866875
  1.028317	 -0.380974	  1.855000
  1.043053	 -0.367926	  1.842421
  1.053362	 -0.361704	  1.831987
  1.066055	 -0.355205	  1.817633
  1.076719	 -0.344763	  1.796681
  1.082405	 -0.336330	  1.779394
  1.093315	 -0.332649	  1.770079
  1.113568	 -0.327246	  1.753357
  1.136837	 -0.329776	  1.751279
  1.155778	 -0.333587	  1.755880
  1.176471	 -0.336572	  1.754445
  1.197285	 -0.339639	  1.752801
  1.216263	 -0.342876	  1.757176
  1.234914	 -0.346838	  1.762648
  1.255113	 -0.351702	  1.765447
  1.275130	 -0.355230	  1.768589
  1.294592	 -0.358462	  1.771125
  1.314439	 -0.359432	  1.773285
  1.333872	 -0.362334	  1.774964
  1.352862	 -0.364432	  1.775086
  1.371310	 -0.366035	  1.775146
  1.390165	 -0.370016	  1.773207
  1.409687	 -0.374107	  1.772162
  1.429059	 -0.377345	  1.771628
  1.449495	 -0.380642	  1.771441
  1.470191	 -0.385707	  1.769528
  1.490369	 -0.388478	  1.770095
  1.509658	 -0.390274	  1.770755
  1.529072	 -0.392843	  1.770736
  1.549185	 -0.394153	  1.770089
  1.569180	 -0.396389	  1.768163
  1.589248	 -0.396962	  1.767734
  1.609354	 -0.397030	  1.766474
  1.629570	 -0.397585	  1.764326
  1.649850	 -0.396799	  1.763532
  1.669773	 -0.396652	  1.762365
  1.689836	 -0.396332	  1.761113
  1.709848	 -0.396870	  1.760322
  1.729798	 -0.396213	  1.761156
  1.750796	 -0.397100	  1.760925
  1.769432	 -0.395630	  1.764447
  1.789760	 -0.391286	  1.770186
  1.809634	 -0.393415	  1.770864
