  2.108337	  0.649981	  1.037418
  2.116771	  0.635961	  1.066051
  2.112907	  0.642386	  1.052929
  2.099070	  0.665219	  1.010938
  2.087030	  0.690675	  0.969664
  2.068743	  0.716493	  0.921361
  2.068735	  0.746228	  0.863553
  2.079802	  0.765021	  0.816122
  2.082249	  0.781803	  0.775114
  2.080143	  0.800303	  0.730775
  2.075356	  0.818938	  0.685252
  2.069143	  0.837038	  0.639128
  2.061885	  0.854811	  0.593133
  2.053246	  0.872387	  0.547771
  2.043469	  0.889277	  0.503273
  2.033065	  0.904565	  0.459631
  2.021842	  0.917616	  0.416359
  2.009317	  0.928914	  0.372578
  1.995356	  0.939633	  0.327006
  1.981980	  0.950553	  0.278121
  1.970723	  0.962200	  0.227778
  1.960986	  0.976568	  0.176850
  1.952466	  0.994643	  0.127408
  1.945324	  1.015952	  0.080153
  1.939587	  1.039743	  0.035906
  1.935160	  1.065172	 -0.005665
  1.930696	  1.092265	 -0.045556
  1.924810	  1.120590	 -0.086153
  1.917824	  1.149134	 -0.128088
  1.910303	  1.176785	 -0.170157
  1.902385	  1.202749	 -0.211515
  1.893752	  1.226657	 -0.251841
  1.883737	  1.249092	 -0.292464
  1.871831	  1.270245	 -0.334695
  1.857971	  1.289237	 -0.378896
  1.844433	  1.306696	 -0.425137
  1.832680	  1.323307	 -0.471940
  1.822850	  1.339774	 -0.519840
  1.815599	  1.356169	 -0.567730
  1.810413	  1.372733	 -0.614244
  1.804813	  1.389711	 -0.659925
  1.798579	  1.407593	 -0.706220
  1.791672	  1.426960	 -0.751909
  1.782721	  1.446774	 -0.794804
  1.770768	  1.469381	 -0.838469
  1.758505	  1.492243	 -0.878664
