 -1.044131	 -2.580544	  1.196446
 -1.033793	 -2.554994	  1.184600
 -1.006790	 -2.508698	  1.185496
 -0.977405	 -2.467186	  1.175298
 -0.949929	 -2.423896	  1.167009
 -0.930005	 -2.379191	  1.152470
 -0.900306	 -2.338392	  1.149832
 -0.878917	 -2.295615	  1.134868
 -0.849369	 -2.255003	  1.138927
 -0.822607	 -2.215522	  1.125401
 -0.791771	 -2.179878	  1.114100
 -0.762214	 -2.142728	  1.103068
 -0.733154	 -2.103101	  1.094110
 -0.705040	 -2.061830	  1.086255
 -0.677838	 -2.018603	  1.079621
 -0.651608	 -1.975932	  1.075831
 -0.625776	 -1.933318	  1.074522
 -0.600469	 -1.891389	  1.074173
 -0.575537	 -1.850472	  1.074169
 -0.549350	 -1.807692	  1.073783
 -0.522193	 -1.762349	  1.072562
 -0.496698	 -1.716470	  1.069809
 -0.474748	 -1.672282	  1.066172
 -0.455901	 -1.628501	  1.063447
 -0.441699	 -1.586459	  1.064178
 -0.432715	 -1.546273	  1.069032
 -0.431286	 -1.481901	  1.084132
 -0.460891	 -1.377194	  1.115786
 -0.507503	 -1.284479	  1.141485
 -0.534491	 -1.215335	  1.148301
 -0.535497	 -1.156802	  1.144424
 -0.515354	 -1.104049	  1.132050
 -0.489277	 -1.058271	  1.115850
 -0.462231	 -1.022223	  1.103249
 -0.429969	 -0.988766	  1.089341
 -0.388544	 -0.954970	  1.074487
 -0.351762	 -0.932333	  1.060423
 -0.318497	 -0.919926	  1.047493
 -0.269752	 -0.911111	  1.024215
 -0.196581	 -0.906401	  0.985462
 -0.098511	 -0.894834	  0.927201
 -0.020305	 -0.864327	  0.877454
  0.023991	 -0.833431	  0.848132
  0.056319	 -0.802116	  0.827486
  0.084449	 -0.766463	  0.810605
  0.108912	 -0.726517	  0.796634
  0.130130	 -0.684580	  0.784743
  0.149116	 -0.641021	  0.772897
  0.167135	 -0.596026	  0.759605
  0.187512	 -0.550560	  0.745444
  0.213322	 -0.506008	  0.732722
  0.241270	 -0.463863	  0.721317
  0.269958	 -0.423322	  0.710528
  0.298866	 -0.384874	  0.700722
  0.328071	 -0.347320	  0.691906
  0.358546	 -0.307908	  0.683760
  0.389412	 -0.266993	  0.677327
  0.419048	 -0.226087	  0.672844
  0.447516	 -0.186090	  0.670394
  0.475931	 -0.145784	  0.669114
  0.504978	 -0.104248	  0.667029
  0.533632	 -0.063074	  0.663174
  0.562077	 -0.021848	  0.657338
  0.589283	  0.017578	  0.649858
  0.616056	  0.055325	  0.640252
  0.643322	  0.092715	  0.627466
  0.670787	  0.131377	  0.613002
  0.698116	  0.172284	  0.601199
  0.723165	  0.215938	  0.593332
  0.744946	  0.262869	  0.589673
  0.762976	  0.312694	  0.590109
  0.777508	  0.366249	  0.595635
  0.789378	  0.437017	  0.611546
  0.792048	  0.527154	  0.644176
  0.772212	  0.615048	  0.692902
  0.729744	  0.690990	  0.742630
  0.692881	  0.751313	  0.775616
  0.660760	  0.819404	  0.804338
  0.626446	  0.911118	  0.826426
  0.604948	  1.000223	  0.841413
  0.605380	  1.050238	  0.854377
  0.607384	  1.054231	  0.857185
  0.615915	  1.059000	  0.863966
  0.666538	  1.059049	  0.892436
  0.761220	  1.026971	  0.927577
  0.899653	  0.988274	  0.935317
  1.059750	  1.011190	  0.893544
  1.211653	  1.087495	  0.864367
  1.356612	  1.182215	  0.839696
  1.445963	  1.271974	  0.770931
  1.474624	  1.321914	  0.686615
  1.463950	  1.337545	  0.617812
  1.476587	  1.323184	  0.541221
  1.560893	  1.301273	  0.470223
  1.628587	  1.279314	  0.424150
  1.629260	  1.280033	  0.423427
  1.619007	  1.300099	  0.421045
  1.565545	  1.390316	  0.408415
  1.523800	  1.475336	  0.372740
  1.516087	  1.526689	  0.348296
  1.530302	  1.566603	  0.332094
  1.555808	  1.605535	  0.318672
  1.583937	  1.645745	  0.307690
  1.610950	  1.686215	  0.299484
  1.635379	  1.729567	  0.292487
  1.657804	  1.771988	  0.281514
  1.683261	  1.811629	  0.268614
  1.706671	  1.854326	  0.257181
  1.725780	  1.899876	  0.246523
  1.750224	  1.943247	  0.238575
  1.778047	  1.985382	  0.239388
  1.799026	  2.028582	  0.227810
  1.826773	  2.067787	  0.222689
  1.850853	  2.109322	  0.215771
  1.875489	  2.149421	  0.201704
  1.903984	  2.189685	  0.195917
  1.926566	  2.232123	  0.184558
  1.950876	  2.272447	  0.173405
  1.970385	  2.295171	  0.175139
