 -1.543199	 -2.020130	 -1.648790
 -1.527920	 -2.000129	 -1.632466
 -1.498682	 -1.958752	 -1.612547
 -1.472293	 -1.912738	 -1.603939
 -1.439915	 -1.873108	 -1.594670
 -1.412448	 -1.837094	 -1.574479
 -1.395744	 -1.792803	 -1.562627
 -1.374611	 -1.749095	 -1.550931
 -1.350732	 -1.707358	 -1.535847
 -1.325238	 -1.666865	 -1.519842
 -1.298683	 -1.627515	 -1.503393
 -1.271348	 -1.586956	 -1.488284
 -1.243268	 -1.545938	 -1.475081
 -1.214470	 -1.504657	 -1.463309
 -1.186472	 -1.464630	 -1.452167
 -1.158675	 -1.425208	 -1.440885
 -1.131183	 -1.386468	 -1.429476
 -1.103536	 -1.347667	 -1.417869
 -1.075881	 -1.308502	 -1.406453
 -1.048150	 -1.268275	 -1.395494
 -1.020760	 -1.228001	 -1.386232
 -0.994355	 -1.189171	 -1.379694
 -0.966160	 -1.147814	 -1.376941
 -0.928219	 -1.089264	 -1.383236
 -0.883088	 -1.011284	 -1.421539
 -0.848239	 -0.951804	 -1.493653
 -0.825242	 -0.917120	 -1.551242
 -0.806206	 -0.882403	 -1.590579
 -0.781938	 -0.836505	 -1.623424
 -0.747103	 -0.782021	 -1.656953
 -0.711803	 -0.725170	 -1.674906
 -0.674255	 -0.681901	 -1.673196
 -0.640435	 -0.654846	 -1.656315
 -0.606165	 -0.639062	 -1.625527
 -0.558264	 -0.630823	 -1.571020
 -0.485390	 -0.632833	 -1.489069
 -0.403963	 -0.633777	 -1.405926
 -0.341184	 -0.623483	 -1.337226
 -0.305726	 -0.602603	 -1.289294
 -0.290754	 -0.581512	 -1.261752
 -0.285373	 -0.551998	 -1.237509
 -0.286905	 -0.494800	 -1.205791
 -0.295722	 -0.406738	 -1.170073
 -0.302793	 -0.330025	 -1.142874
 -0.304186	 -0.279897	 -1.125644
 -0.300582	 -0.237561	 -1.112120
 -0.291894	 -0.193411	 -1.099345
 -0.276590	 -0.146692	 -1.086344
 -0.256100	 -0.101370	 -1.073593
 -0.233181	 -0.059630	 -1.061787
 -0.208422	 -0.018870	 -1.050137
 -0.182731	  0.022549	 -1.038753
 -0.157448	  0.064355	 -1.028226
 -0.132209	  0.106235	 -1.017407
 -0.106965	  0.146851	 -1.005268
 -0.080037	  0.186619	 -0.992158
 -0.051682	  0.225610	 -0.977241
 -0.021890	  0.263119	 -0.960697
  0.009210	  0.299590	 -0.941944
  0.041369	  0.335266	 -0.922430
  0.072191	  0.370073	 -0.903233
  0.102057	  0.405321	 -0.884060
  0.130356	  0.441010	 -0.865444
  0.157939	  0.478881	 -0.846983
  0.185022	  0.517838	 -0.829132
  0.211609	  0.557213	 -0.812113
  0.237348	  0.596449	 -0.796166
  0.263190	  0.635342	 -0.780921
  0.291704	  0.674606	 -0.766019
  0.321565	  0.709800	 -0.752368
  0.355078	  0.740391	 -0.739496
  0.392368	  0.764472	 -0.728383
  0.441139	  0.784367	 -0.718833
  0.523521	  0.799436	 -0.717833
  0.627110	  0.800059	 -0.749498
  0.713774	  0.793621	 -0.812142
  0.773981	  0.793658	 -0.879024
  0.826827	  0.801643	 -0.952722
  0.876050	  0.820364	 -1.033099
  0.920645	  0.854003	 -1.105333
  0.963357	  0.902802	 -1.156527
  1.001329	  0.957503	 -1.183115
  1.037970	  1.021693	 -1.191417
  1.071341	  1.124260	 -1.181911
  1.084881	  1.276897	 -1.154469
  1.092155	  1.437953	 -1.134260
  1.090613	  1.570255	 -1.095387
  1.076242	  1.664001	 -1.014005
  1.035944	  1.726450	 -0.934158
  0.978675	  1.759128	 -0.875615
  0.926764	  1.773798	 -0.831000
  0.890202	  1.778803	 -0.780123
  0.865200	  1.796995	 -0.705395
  0.860576	  1.829447	 -0.637751
  0.899252	  1.831580	 -0.588573
  0.969109	  1.816767	 -0.541057
  1.036361	  1.829326	 -0.498444
  1.082357	  1.857208	 -0.471888
  1.116696	  1.888965	 -0.453542
  1.147519	  1.924212	 -0.437207
  1.176630	  1.961718	 -0.421507
  1.203907	  1.999838	 -0.405680
  1.229974	  2.038245	 -0.389287
  1.255495	  2.076593	 -0.371831
  1.281382	  2.114016	 -0.353912
  1.310135	  2.149730	 -0.337158
  1.340002	  2.187294	 -0.322341
  1.364919	  2.228083	 -0.308758
  1.393165	  2.266772	 -0.296579
  1.422820	  2.305226	 -0.283816
  1.451926	  2.345463	 -0.270957
  1.478498	  2.387145	 -0.257319
  1.501964	  2.427998	 -0.241152
  1.524250	  2.469457	 -0.230490
  1.543522	  2.509946	 -0.215901
  1.566329	  2.550036	 -0.209596
  1.581992	  2.575536	 -0.211692
