  0.607030	  0.686036	 -2.290147
  0.636954	  0.685007	 -2.319326
  0.583889	  0.686830	 -2.267584
  0.463146	  0.668862	 -2.146756
  0.329740	  0.698528	 -2.044338
  0.234517	  0.769033	 -1.999785
  0.178942	  0.828583	 -2.003163
  0.146130	  0.873527	 -2.022897
  0.123001	  0.912763	 -2.042664
  0.103013	  0.952233	 -2.061298
  0.083712	  0.993282	 -2.079890
  0.064414	  1.035366	 -2.099005
  0.044964	  1.077953	 -2.119175
  0.025850	  1.119633	 -2.141336
  0.007044	  1.160591	 -2.167147
 -0.012014	  1.201688	 -2.198058
 -0.027664	  1.234076	 -2.225467
