  0.430166	 -2.100942	 -0.971927
  0.410837	 -2.137119	 -0.986011
  0.414833	 -2.120930	 -0.982075
  0.419381	 -2.099137	 -0.975710
  0.426983	 -2.078483	 -0.968945
  0.435936	 -2.063471	 -0.959553
  0.442149	 -2.049019	 -0.952406
  0.451658	 -2.029730	 -0.943137
  0.461937	 -2.015022	 -0.931598
  0.469203	 -2.004254	 -0.923216
  0.477931	 -1.986736	 -0.914831
  0.495875	 -1.964590	 -0.905533
  0.508478	 -1.955858	 -0.898860
  0.516688	 -1.949007	 -0.890810
  0.522034	 -1.937003	 -0.870804
  0.531134	 -1.921730	 -0.856566
  0.540625	 -1.907020	 -0.846104
  0.549978	 -1.893139	 -0.836011
  0.557083	 -1.878853	 -0.823797
  0.564511	 -1.864493	 -0.811538
  0.573275	 -1.850191	 -0.800059
  0.584437	 -1.836903	 -0.790257
  0.595219	 -1.823923	 -0.779365
  0.605615	 -1.811180	 -0.767796
  0.614951	 -1.797874	 -0.755918
  0.624543	 -1.784374	 -0.744504
  0.634868	 -1.770793	 -0.733840
  0.645977	 -1.756973	 -0.724686
  0.657135	 -1.743097	 -0.715418
  0.668088	 -1.729334	 -0.705829
  0.678663	 -1.715396	 -0.696115
  0.689044	 -1.700905	 -0.687041
  0.699410	 -1.686338	 -0.678078
  0.709611	 -1.671349	 -0.669637
  0.719790	 -1.656328	 -0.661223
  0.730047	 -1.641193	 -0.653115
  0.740361	 -1.625975	 -0.645239
  0.750699	 -1.610750	 -0.637412
  0.761646	 -1.595455	 -0.630618
  0.772723	 -1.580151	 -0.624055
  0.783831	 -1.564838	 -0.617575
  0.795714	 -1.549404	 -0.613061
  0.807773	 -1.533961	 -0.609050
  0.819654	 -1.518424	 -0.604879
  0.831149	 -1.502779	 -0.600319
  0.843271	 -1.487955	 -0.595821
  0.857606	 -1.476075	 -0.590071
  0.874030	 -1.465573	 -0.582413
  0.887780	 -1.451585	 -0.577832
  0.898489	 -1.433429	 -0.573718
  0.908687	 -1.413519	 -0.564903
  0.917543	 -1.397599	 -0.554659
  0.926478	 -1.382713	 -0.545712
  0.933633	 -1.372739	 -0.539755
  0.948244	 -1.353943	 -0.530260
  0.961364	 -1.340404	 -0.523242
  0.972836	 -1.322452	 -0.513957
  0.978543	 -1.305828	 -0.508256
  0.982740	 -1.283788	 -0.502272
  0.987727	 -1.266343	 -0.501694
  0.991287	 -1.246619	 -0.494975
  1.000448	 -1.231049	 -0.479252
  1.013568	 -1.221631	 -0.468530
  1.028727	 -1.210274	 -0.463680
  1.042269	 -1.195468	 -0.459489
  1.056699	 -1.180694	 -0.454036
  1.072860	 -1.170007	 -0.450100
  1.092984	 -1.161488	 -0.449608
  1.108980	 -1.153871	 -0.456265
  1.125330	 -1.137896	 -0.466086
  1.139974	 -1.118646	 -0.465644
  1.149983	 -1.105999	 -0.459727
  1.166272	 -1.095394	 -0.451565
  1.186263	 -1.087906	 -0.449860
  1.205610	 -1.078759	 -0.453004
  1.222493	 -1.070080	 -0.456951
  1.238736	 -1.063251	 -0.458172
  1.256778	 -1.053069	 -0.456363
  1.275464	 -1.037273	 -0.455271
  1.291221	 -1.025998	 -0.454486
  1.305614	 -1.019942	 -0.451741
  1.321168	 -1.014579	 -0.447263
  1.329023	 -1.007627	 -0.443368
  1.341922	 -0.997124	 -0.437370
  1.355243	 -0.982926	 -0.427518
  1.362689	 -0.974897	 -0.422884
  1.368932	 -0.956210	 -0.408552
  1.378181	 -0.935597	 -0.387228
  1.383409	 -0.928310	 -0.375449
  1.386050	 -0.922727	 -0.360373
  1.388248	 -0.915433	 -0.336612
  1.392191	 -0.910616	 -0.316406
  1.396666	 -0.909717	 -0.296950
  1.402209	 -0.908649	 -0.278185
  1.407694	 -0.903985	 -0.258543
  1.412412	 -0.896773	 -0.237661
  1.418345	 -0.888790	 -0.219698
  1.423263	 -0.881857	 -0.209354
  1.436123	 -0.872139	 -0.194896
  1.447511	 -0.864432	 -0.177210
  1.457480	 -0.854344	 -0.163103
  1.468447	 -0.841404	 -0.152589
  1.479219	 -0.828112	 -0.142213
  1.490025	 -0.814928	 -0.131768
  1.500293	 -0.801499	 -0.121452
  1.504263	 -0.784932	 -0.112928
  1.502537	 -0.766348	 -0.109169
  1.497846	 -0.747688	 -0.110092
  1.491546	 -0.730446	 -0.113671
  1.485367	 -0.716155	 -0.116269
  1.480935	 -0.698984	 -0.117743
  1.473996	 -0.683319	 -0.116893
  1.462133	 -0.666820	 -0.114357
  1.449808	 -0.652037	 -0.113846
  1.437092	 -0.635963	 -0.115439
  1.429379	 -0.620311	 -0.114945
  1.421792	 -0.613403	 -0.114600
  1.406853	 -0.601054	 -0.112718
  1.392585	 -0.586758	 -0.117934
  1.386352	 -0.568551	 -0.134138
  1.387420	 -0.549023	 -0.145814
  1.385023	 -0.527823	 -0.151065
  1.380659	 -0.507079	 -0.152759
  1.379754	 -0.486063	 -0.158813
  1.388210	 -0.456635	 -0.165360
  1.393591	 -0.441143	 -0.168517
  1.397989	 -0.431997	 -0.175476
  1.412547	 -0.413797	 -0.196311
  1.423104	 -0.403603	 -0.210192
  1.428272	 -0.396280	 -0.217627
  1.437868	 -0.382232	 -0.231014
  1.448756	 -0.369221	 -0.242098
  1.456882	 -0.360269	 -0.251598
  1.471067	 -0.349299	 -0.268241
  1.487280	 -0.337485	 -0.279659
  1.500017	 -0.326448	 -0.284200
  1.519548	 -0.305185	 -0.286320
  1.539269	 -0.292454	 -0.292004
  1.551674	 -0.286841	 -0.294080
  1.563716	 -0.288702	 -0.308215
  1.578669	 -0.285808	 -0.326813
  1.592787	 -0.279733	 -0.340514
  1.605892	 -0.268885	 -0.350789
  1.618706	 -0.257220	 -0.360769
  1.631650	 -0.245718	 -0.370774
  1.644458	 -0.234035	 -0.380745
  1.657373	 -0.222435	 -0.390576
  1.669173	 -0.207556	 -0.396467
  1.680102	 -0.191212	 -0.400032
  1.691058	 -0.174852	 -0.403519
  1.701982	 -0.158463	 -0.406994
  1.712982	 -0.142137	 -0.410492
  1.723696	 -0.125640	 -0.413683
  1.733596	 -0.108477	 -0.411678
  1.743208	 -0.091129	 -0.409136
  1.752879	 -0.073807	 -0.406598
  1.762460	 -0.056442	 -0.404032
  1.772109	 -0.039148	 -0.401395
  1.780632	 -0.021860	 -0.396268
  1.787926	 -0.004837	 -0.388807
  1.795028	  0.012454	 -0.381566
  1.802258	  0.029562	 -0.374027
  1.809534	  0.046103	 -0.365340
  1.816388	  0.061769	 -0.354791
  1.822714	  0.076295	 -0.342503
  1.828886	  0.090776	 -0.330154
  1.835204	  0.105306	 -0.317948
  1.841615	  0.119265	 -0.305139
  1.848055	  0.131896	 -0.291037
  1.854586	  0.144437	 -0.276894
  1.860878	  0.156910	 -0.262576
  1.867165	  0.167901	 -0.247078
  1.873552	  0.178816	 -0.231523
  1.880715	  0.189382	 -0.216061
  1.889011	  0.198090	 -0.200023
  1.897499	  0.206390	 -0.183914
  1.905607	  0.214823	 -0.167676
  1.913893	  0.222790	 -0.151299
  1.923003	  0.228697	 -0.134492
  1.932263	  0.234451	 -0.117726
  1.941965	  0.239330	 -0.100957
  1.952196	  0.243264	 -0.084170
  1.962239	  0.247701	 -0.067412
  1.971868	  0.253220	 -0.050518
  1.981261	  0.261205	 -0.034362
  1.989146	  0.270335	 -0.018234
  1.995641	  0.280031	 -0.001837
  2.001564	  0.290457	  0.014380
  2.007579	  0.302156	  0.029555
  2.013629	  0.314665	  0.044080
  2.020764	  0.327450	  0.057497
  2.027467	  0.340221	  0.071717
  2.035236	  0.351071	  0.087096
  2.042913	  0.360851	  0.102954
  2.050623	  0.369918	  0.119033
  2.058160	  0.379505	  0.134913
  2.065989	  0.388808	  0.150831
  2.074012	  0.397916	  0.166658
  2.081860	  0.407510	  0.182082
  2.089582	  0.413058	  0.198244
  2.093800	  0.416159	  0.220597
  2.093773	  0.427032	  0.242649
  2.099299	  0.441441	  0.259355
  2.109232	  0.452107	  0.271247
  2.118874	  0.469662	  0.287176
  2.132222	  0.490346	  0.298701
  2.140019	  0.500192	  0.301161
  2.150028	  0.511043	  0.304500
  2.169482	  0.525986	  0.313003
  2.181424	  0.539558	  0.324017
  2.192624	  0.547072	  0.335601
  2.202962	  0.560968	  0.339103
  2.217176	  0.586360	  0.349200
  2.225089	  0.595801	  0.359197
  2.230424	  0.606219	  0.367661
  2.243586	  0.626480	  0.377043
  2.253747	  0.643537	  0.385340
  2.258819	  0.653669	  0.391488
  2.267210	  0.667521	  0.399602
  2.278272	  0.687695	  0.410163
  2.285247	  0.714422	  0.436615
  2.293124	  0.731077	  0.444397
