 -0.893448	  2.351516	 -0.244995
 -0.895103	  2.356245	 -0.251426
 -0.890980	  2.344848	 -0.235533
 -0.886921	  2.333826	 -0.219607
 -0.883509	  2.322056	 -0.203515
 -0.880709	  2.311752	 -0.186923
 -0.876608	  2.298225	 -0.171062
 -0.872385	  2.284572	 -0.158069
 -0.869416	  2.269522	 -0.144579
 -0.867389	  2.256605	 -0.129236
 -0.863570	  2.244138	 -0.114232
 -0.857106	  2.229215	 -0.101577
 -0.850131	  2.213207	 -0.089787
 -0.845011	  2.197905	 -0.079180
 -0.840693	  2.184205	 -0.065669
 -0.836735	  2.169019	 -0.053400
 -0.834796	  2.147503	 -0.045788
 -0.833011	  2.132555	 -0.035435
 -0.828689	  2.117144	 -0.023078
 -0.824219	  2.100338	 -0.012407
 -0.819611	  2.083853	 -0.002394
 -0.814603	  2.068523	  0.008129
 -0.809506	  2.048606	  0.017706
 -0.806300	  2.030208	  0.023312
 -0.802036	  2.015061	  0.033140
 -0.797848	  1.996554	  0.042053
 -0.794283	  1.976936	  0.048768
 -0.790960	  1.960906	  0.056534
 -0.787217	  1.944660	  0.067603
 -0.782285	  1.926403	  0.078056
 -0.777564	  1.909691	  0.087541
 -0.774229	  1.890714	  0.093094
 -0.773367	  1.872139	  0.098995
 -0.771936	  1.851552	  0.104229
 -0.769508	  1.832761	  0.109394
 -0.761089	  1.814856	  0.116409
 -0.758942	  1.799340	  0.125122
 -0.760999	  1.779925	  0.138041
 -0.761434	  1.765637	  0.153177
 -0.757679	  1.750197	  0.168009
 -0.753157	  1.731070	  0.175280
 -0.749424	  1.712352	  0.177011
 -0.749487	  1.691191	  0.183131
 -0.750172	  1.675281	  0.192184
 -0.746227	  1.656852	  0.203429
 -0.741988	  1.640552	  0.212615
 -0.738903	  1.621744	  0.221220
 -0.738665	  1.602443	  0.228370
 -0.743160	  1.585464	  0.234850
 -0.747728	  1.566474	  0.240418
 -0.756615	  1.549217	  0.249378
 -0.765545	  1.531882	  0.257521
 -0.766161	  1.510965	  0.263007
 -0.764657	  1.491905	  0.265265
 -0.767193	  1.472679	  0.267859
 -0.768151	  1.452306	  0.268795
 -0.772250	  1.432614	  0.267401
 -0.768123	  1.413065	  0.266095
 -0.760113	  1.390923	  0.275604
 -0.757078	  1.373291	  0.284457
 -0.750641	  1.357240	  0.287065
 -0.757453	  1.332143	  0.280705
 -0.755324	  1.308983	  0.274735
 -0.747904	  1.290437	  0.278127
 -0.729485	  1.280041	  0.288490
 -0.718379	  1.264031	  0.298319
 -0.706283	  1.251187	  0.303971
 -0.700479	  1.228757	  0.307947
 -0.687467	  1.215673	  0.310906
 -0.676451	  1.199792	  0.308007
 -0.663818	  1.180802	  0.308492
 -0.652006	  1.167479	  0.312922
 -0.638663	  1.154426	  0.315966
 -0.622501	  1.139466	  0.320254
 -0.605077	  1.130420	  0.320895
 -0.582572	  1.119138	  0.326868
 -0.575770	  1.106308	  0.326955
 -0.564944	  1.087126	  0.330809
 -0.552442	  1.068993	  0.338299
 -0.539900	  1.059120	  0.346202
 -0.522337	  1.048839	  0.351127
 -0.504303	  1.037685	  0.355688
 -0.488674	  1.028664	  0.366120
 -0.476006	  1.023403	  0.382003
 -0.463544	  1.016270	  0.395607
 -0.446220	  1.008266	  0.405270
 -0.430423	  1.000136	  0.416197
 -0.416636	  0.992578	  0.424851
 -0.400500	  0.984542	  0.435765
 -0.384296	  0.973500	  0.438594
 -0.366652	  0.964246	  0.445905
 -0.349810	  0.959288	  0.458249
 -0.333530	  0.959047	  0.468516
 -0.316021	  0.957269	  0.479524
 -0.301734	  0.953433	  0.493549
 -0.288353	  0.943723	  0.505559
 -0.274775	  0.934852	  0.518044
 -0.262245	  0.934885	  0.538533
 -0.248594	  0.937441	  0.551620
 -0.232285	  0.938853	  0.560837
 -0.215505	  0.941354	  0.576571
 -0.202427	  0.942635	  0.590974
 -0.189723	  0.938317	  0.602626
 -0.172274	  0.930263	  0.618017
 -0.158165	  0.927238	  0.636514
 -0.154642	  0.925671	  0.650086
 -0.141922	  0.924040	  0.665853
 -0.124664	  0.919023	  0.681945
 -0.111023	  0.915344	  0.694124
 -0.094489	  0.917123	  0.707022
 -0.083941	  0.912402	  0.726505
 -0.074995	  0.904316	  0.738377
 -0.059959	  0.898730	  0.751309
 -0.045259	  0.894660	  0.764596
 -0.030294	  0.886726	  0.779958
 -0.024588	  0.880113	  0.798736
 -0.021586	  0.873948	  0.818179
 -0.013058	  0.865133	  0.833403
 -0.002870	  0.856473	  0.847476
  0.001012	  0.845918	  0.866501
  0.003886	  0.836365	  0.884620
  0.013955	  0.830362	  0.901824
  0.020842	  0.827288	  0.917595
  0.021887	  0.817277	  0.936450
  0.025264	  0.805043	  0.954641
  0.028455	  0.798982	  0.973308
  0.028286	  0.795237	  0.989293
  0.024761	  0.789478	  1.011626
  0.025536	  0.782720	  1.030667
  0.029396	  0.774437	  1.046894
  0.030336	  0.766994	  1.066023
  0.026062	  0.759823	  1.088199
  0.021112	  0.753448	  1.104633
  0.017781	  0.747424	  1.121954
  0.015476	  0.740526	  1.141959
  0.006536	  0.732387	  1.158677
  0.000748	  0.725037	  1.176349
 -0.002272	  0.718117	  1.195169
 -0.008226	  0.710831	  1.212498
 -0.014093	  0.703038	  1.230606
 -0.016817	  0.695998	  1.247987
 -0.022141	  0.688299	  1.263947
 -0.028288	  0.677939	  1.286226
 -0.028473	  0.672753	  1.302842
 -0.031988	  0.665741	  1.318963
 -0.035986	  0.654474	  1.340963
 -0.037817	  0.648794	  1.357892
 -0.042286	  0.644227	  1.375864
 -0.044140	  0.637007	  1.394153
 -0.049328	  0.631761	  1.413551
 -0.055977	  0.627344	  1.432764
 -0.058469	  0.617734	  1.451629
 -0.058101	  0.610532	  1.469522
 -0.061188	  0.609471	  1.490161
 -0.062702	  0.603439	  1.510615
 -0.062237	  0.596396	  1.526221
 -0.063089	  0.593671	  1.546662
 -0.062537	  0.589515	  1.568131
 -0.064222	  0.583145	  1.586604
 -0.068650	  0.578896	  1.604742
 -0.071442	  0.575048	  1.624896
 -0.069788	  0.568159	  1.644742
 -0.070002	  0.565343	  1.663335
 -0.074131	  0.562315	  1.683459
 -0.077983	  0.556172	  1.703319
 -0.079251	  0.550757	  1.722219
 -0.075009	  0.548087	  1.743363
 -0.069857	  0.547673	  1.761576
 -0.065216	  0.541259	  1.782270
 -0.064664	  0.533347	  1.800507
 -0.059729	  0.531146	  1.818202
 -0.052724	  0.527896	  1.839327
 -0.050385	  0.525674	  1.858812
 -0.051552	  0.520803	  1.877161
 -0.052773	  0.509748	  1.898162
 -0.051126	  0.500121	  1.914863
 -0.045935	  0.499462	  1.934343
 -0.040863	  0.498248	  1.954303
 -0.038914	  0.491439	  1.973829
 -0.033174	  0.486225	  1.991645
 -0.025107	  0.480851	  2.009667
 -0.020103	  0.473554	  2.027531
 -0.014103	  0.469513	  2.046418
 -0.007355	  0.465178	  2.065706
 -0.002776	  0.457142	  2.082092
  0.002769	  0.452992	  2.100455
  0.008673	  0.446667	  2.120836
  0.013404	  0.436022	  2.136846
  0.021609	  0.428872	  2.153825
  0.033799	  0.425471	  2.172676
  0.040097	  0.421322	  2.186823
  0.048623	  0.419319	  2.207067
  0.058631	  0.415399	  2.226954
  0.066837	  0.406796	  2.241154
  0.076040	  0.399588	  2.256606
  0.085290	  0.394649	  2.273146
  0.098781	  0.387809	  2.290025
  0.110033	  0.379645	  2.303349
  0.117667	  0.372426	  2.319066
  0.127469	  0.363689	  2.335321
  0.138564	  0.355923	  2.349887
  0.149700	  0.350098	  2.364618
  0.162460	  0.344577	  2.380979
  0.175456	  0.332193	  2.392787
  0.185697	  0.320600	  2.405316
  0.193812	  0.305224	  2.415941
  0.199353	  0.289795	  2.427409
  0.206302	  0.276246	  2.439653
  0.214610	  0.261523	  2.450340
