 -1.953338	  0.842876	  1.376621
 -1.991476	  0.857559	  1.368555
 -1.973392	  0.849967	  1.372468
 -1.955637	  0.841656	  1.376430
 -1.937882	  0.833346	  1.380391
 -1.920490	  0.824226	  1.384183
 -1.903276	  0.814745	  1.387895
 -1.886062	  0.805265	  1.391607
 -1.869279	  0.794903	  1.394926
 -1.852530	  0.784480	  1.398215
 -1.835870	  0.773890	  1.401421
 -1.819623	  0.762577	  1.404257
 -1.803375	  0.751265	  1.407093
 -1.787389	  0.739595	  1.409970
 -1.771654	  0.727599	  1.412884
 -1.755943	  0.715601	  1.415921
 -1.740454	  0.703602	  1.419938
 -1.724966	  0.691604	  1.423955
 -1.709793	  0.679396	  1.428510
 -1.694695	  0.667142	  1.433189
 -1.679902	  0.654549	  1.437942
 -1.665713	  0.641330	  1.442831
 -1.651523	  0.628110	  1.447720
 -1.637584	  0.614668	  1.452724
 -1.623695	  0.601185	  1.457750
 -1.609564	  0.588135	  1.463229
 -1.595218	  0.575514	  1.469136
 -1.580593	  0.563356	  1.475326
 -1.565486	  0.552094	  1.482029
 -1.550352	  0.540863	  1.488725
 -1.534555	  0.530471	  1.495240
 -1.518757	  0.520080	  1.501756
 -1.502697	  0.510024	  1.508157
 -1.486429	  0.500247	  1.514463
 -1.470133	  0.490513	  1.520762
 -1.453548	  0.481233	  1.526991
 -1.436962	  0.471953	  1.533220
 -1.420255	  0.462795	  1.539303
 -1.403467	  0.453720	  1.545288
 -1.386674	  0.444643	  1.551255
 -1.369766	  0.435524	  1.556820
 -1.352858	  0.426406	  1.562385
 -1.335923	  0.417229	  1.567767
 -1.318953	  0.407976	  1.572907
 -1.301983	  0.398723	  1.578047
 -1.284813	  0.389578	  1.582688
 -1.267598	  0.380458	  1.587213
 -1.250344	  0.371356	  1.591622
 -1.232943	  0.362323	  1.595573
 -1.215541	  0.353291	  1.599524
 -1.198221	  0.344041	  1.603324
 -1.180947	  0.334670	  1.607038
 -1.163686	  0.325270	  1.610741
 -1.146662	  0.315380	  1.614255
 -1.129637	  0.305490	  1.617770
 -1.112686	  0.295460	  1.621242
 -1.095830	  0.285251	  1.624659
 -1.078975	  0.275042	  1.628075
 -1.062054	  0.265033	  1.631749
 -1.045125	  0.255047	  1.635451
 -1.028112	  0.245248	  1.639264
 -1.011003	  0.235671	  1.643205
 -0.993880	  0.226112	  1.647136
 -0.976613	  0.216768	  1.650946
 -0.959345	  0.207424	  1.654756
 -0.941801	  0.198440	  1.658147
 -0.924088	  0.189692	  1.661267
 -0.906319	  0.181040	  1.664331
 -0.888126	  0.173154	  1.666947
 -0.869934	  0.165268	  1.669563
 -0.851666	  0.157610	  1.672327
 -0.833361	  0.150069	  1.675166
 -0.815077	  0.142477	  1.678007
 -0.796918	  0.134594	  1.680856
 -0.778759	  0.126712	  1.683705
 -0.760608	  0.118730	  1.686314
 -0.742465	  0.110664	  1.688719
 -0.724323	  0.102598	  1.691124
 -0.706268	  0.094252	  1.693220
 -0.688224	  0.085878	  1.695285
 -0.670261	  0.077332	  1.697363
 -0.652483	  0.068415	  1.699469
 -0.634705	  0.059498	  1.701574
 -0.617099	  0.050224	  1.703572
 -0.599566	  0.040801	  1.705525
 -0.582038	  0.031366	  1.707460
 -0.564694	  0.021493	  1.708768
 -0.547350	  0.011620	  1.710075
 -0.530017	  0.001692	  1.711081
 -0.512730	 -0.008363	  1.711326
 -0.495444	 -0.018419	  1.711571
 -0.478149	 -0.028449	  1.711034
 -0.460869	 -0.038442	  1.709797
 -0.443589	 -0.048436	  1.708560
 -0.426348	 -0.058200	  1.705839
 -0.409122	 -0.067924	  1.702889
 -0.391952	 -0.077543	  1.699327
 -0.374938	 -0.086936	  1.694607
 -0.357923	 -0.096329	  1.689887
 -0.341260	 -0.105646	  1.683926
 -0.324720	 -0.114932	  1.677586
 -0.308180	 -0.124218	  1.671246
 -0.291711	 -0.133344	  1.664501
 -0.275271	 -0.142407	  1.657601
 -0.258832	 -0.151470	  1.650702
 -0.242393	 -0.160534	  1.643802
 -0.225393	 -0.168413	  1.636807
 -0.208229	 -0.175903	  1.629788
 -0.191064	 -0.183393	  1.622768
 -0.173899	 -0.190883	  1.615749
 -0.156734	 -0.198372	  1.608729
 -0.138855	 -0.203592	  1.601444
 -0.120972	 -0.208799	  1.594158
 -0.103089	 -0.214006	  1.586871
 -0.085206	 -0.219214	  1.579585
 -0.066886	 -0.223467	  1.572782
 -0.048352	 -0.227190	  1.566254
 -0.029817	 -0.230913	  1.559726
 -0.010981	 -0.234661	  1.554144
  0.008010	 -0.238421	  1.549124
  0.027328	 -0.242827	  1.546407
  0.046715	 -0.247734	  1.546099
  0.065909	 -0.252993	  1.548085
  0.084622	 -0.258557	  1.552425
  0.101905	 -0.264515	  1.560537
  0.116835	 -0.270472	  1.572437
  0.130071	 -0.276323	  1.586242
  0.140937	 -0.282278	  1.601941
  0.151401	 -0.288237	  1.617910
  0.160949	 -0.294717	  1.634245
  0.169326	 -0.301812	  1.650963
  0.177703	 -0.308906	  1.667681
  0.186080	 -0.316001	  1.684399
  0.192571	 -0.326654	  1.700032
  0.198992	 -0.337423	  1.715614
  0.205413	 -0.348192	  1.731196
  0.211833	 -0.358961	  1.746779
  0.218224	 -0.370612	  1.761726
  0.224599	 -0.382568	  1.776437
  0.230974	 -0.394524	  1.791147
  0.237350	 -0.406480	  1.805858
  0.244705	 -0.417654	  1.820725
  0.254251	 -0.426815	  1.835724
  0.263797	 -0.435975	  1.850723
  0.273342	 -0.445136	  1.865722
  0.282888	 -0.454296	  1.880721
  0.293524	 -0.464509	  1.894232
  0.305885	 -0.476389	  1.904532
  0.318246	 -0.488269	  1.914832
  0.330606	 -0.500149	  1.925131
  0.342967	 -0.512029	  1.935431
  0.356818	 -0.523916	  1.943606
  0.371587	 -0.535687	  1.950187
  0.386356	 -0.547459	  1.956768
  0.401183	 -0.559189	  1.963294
  0.417728	 -0.569437	  1.967900
  0.434274	 -0.579685	  1.972507
  0.450944	 -0.589784	  1.976991
  0.468458	 -0.598757	  1.980563
  0.485971	 -0.607731	  1.984136
  0.503576	 -0.616569	  1.987595
  0.521290	 -0.625240	  1.990916
  0.538999	 -0.633909	  1.994265
  0.556570	 -0.642531	  1.998379
  0.574141	 -0.651153	  2.002493
  0.591653	 -0.659826	  2.006749
  0.609140	 -0.668519	  2.011062
  0.626654	 -0.677210	  2.015275
  0.644281	 -0.685885	  2.019021
  0.661908	 -0.694560	  2.022768
  0.679532	 -0.703316	  2.026333
  0.697154	 -0.712135	  2.029757
  0.714769	 -0.720963	  2.033187
  0.732105	 -0.730209	  2.036925
  0.749440	 -0.739456	  2.040664
  0.766602	 -0.748879	  2.044748
  0.783646	 -0.758415	  2.049056
  0.800633	 -0.767945	  2.053597
  0.817467	 -0.777454	  2.058716
  0.834295	 -0.786958	  2.063864
  0.850943	 -0.796312	  2.069810
  0.867591	 -0.805666	  2.075756
  0.884066	 -0.815251	  2.081811
  0.900446	 -0.824964	  2.087924
  0.916823	 -0.834687	  2.094026
  0.933100	 -0.844916	  2.099545
  0.949377	 -0.855144	  2.105064
  0.965636	 -0.865489	  2.110412
  0.981855	 -0.876069	  2.115413
  0.998074	 -0.886649	  2.120414
  1.014255	 -0.897330	  2.125320
  1.030424	 -0.908048	  2.130191
  1.046592	 -0.918765	  2.135062
  1.062760	 -0.929482	  2.139933
  1.081045	 -0.941625	  2.145452
  1.097199	 -0.952361	  2.150331
