  0.815437	  1.174124	  2.054547
  0.831408	  1.187442	  2.062688
  0.817090	  1.175529	  2.055403
  0.801619	  1.164737	  2.048761
  0.785885	  1.154224	  2.042287
  0.770508	  1.143123	  2.035940
  0.755770	  1.131070	  2.029817
  0.741049	  1.118992	  2.023702
  0.727148	  1.105897	  2.017765
  0.713855	  1.092125	  2.011968
  0.700582	  1.078336	  2.006164
  0.687726	  1.064304	  2.000012
  0.674949	  1.050228	  1.993800
  0.662086	  1.036241	  1.987562
  0.649057	  1.022430	  1.981275
  0.636014	  1.008634	  1.974990
  0.622270	  0.995465	  1.968852
  0.608466	  0.982355	  1.962722
  0.594021	  0.970002	  1.956498
  0.579249	  0.958065	  1.950232
  0.564436	  0.946198	  1.943928
  0.549532	  0.934493	  1.937536
  0.534635	  0.922785	  1.931133
  0.520296	  0.910747	  1.924100
  0.506248	  0.898548	  1.916763
  0.492216	  0.886339	  1.909405
  0.479496	  0.873735	  1.900490
  0.467045	  0.861074	  1.891284
  0.454719	  0.848426	  1.881893
  0.443041	  0.835742	  1.871751
  0.431371	  0.823030	  1.861649
  0.419629	  0.810382	  1.851554
  0.407632	  0.798561	  1.840834
  0.395173	  0.787616	  1.829545
  0.382995	  0.776751	  1.817997
  0.371582	  0.766542	  1.806832
  0.362725	  0.758553	  1.792205
  0.357276	  0.746780	  1.772489
  0.348411	  0.734903	  1.759669
  0.332503	  0.722811	  1.750240
  0.312813	  0.707858	  1.739832
  0.302091	  0.695226	  1.731710
  0.293778	  0.682233	  1.722431
  0.282124	  0.662242	  1.709993
  0.276684	  0.651277	  1.703655
  0.267506	  0.634616	  1.696598
  0.258387	  0.618945	  1.688121
  0.246013	  0.606718	  1.680484
  0.230898	  0.595340	  1.674105
  0.211150	  0.579386	  1.668175
  0.190133	  0.564661	  1.660835
  0.182514	  0.559297	  1.656886
  0.166761	  0.548098	  1.647769
  0.151478	  0.533028	  1.638344
  0.143656	  0.525838	  1.632572
  0.128293	  0.508442	  1.625879
  0.115267	  0.492764	  1.620870
  0.105708	  0.484225	  1.617406
  0.089467	  0.470238	  1.611545
  0.071817	  0.454282	  1.604763
  0.060439	  0.444446	  1.600591
  0.043499	  0.424287	  1.590427
  0.034224	  0.412159	  1.585367
  0.026299	  0.401758	  1.582363
  0.013631	  0.387170	  1.577166
 -0.002182	  0.368313	  1.569067
 -0.018284	  0.355414	  1.560423
 -0.030099	  0.347990	  1.555229
 -0.047627	  0.337267	  1.547749
 -0.061175	  0.324634	  1.537741
 -0.070672	  0.313230	  1.529673
 -0.084996	  0.298475	  1.523300
 -0.106424	  0.277335	  1.511782
 -0.113782	  0.270071	  1.507435
 -0.121933	  0.264534	  1.502676
 -0.144020	  0.253900	  1.495139
 -0.165222	  0.238145	  1.491567
 -0.177679	  0.226728	  1.490219
 -0.187229	  0.214437	  1.487678
 -0.201715	  0.194319	  1.480686
 -0.217874	  0.176264	  1.466625
 -0.226789	  0.168347	  1.458982
 -0.237701	  0.158803	  1.452710
 -0.255279	  0.144905	  1.448816
 -0.269654	  0.134618	  1.447004
 -0.288179	  0.122102	  1.442219
 -0.302933	  0.108707	  1.438721
 -0.317729	  0.091661	  1.432644
 -0.328154	  0.074782	  1.423793
 -0.336359	  0.066594	  1.414125
 -0.347793	  0.054902	  1.402426
 -0.366038	  0.037277	  1.388765
 -0.382506	  0.026272	  1.383067
 -0.391464	  0.018368	  1.379921
 -0.409129	  0.006560	  1.377654
 -0.423447	 -0.007810	  1.371565
 -0.433848	 -0.023019	  1.363364
 -0.441298	 -0.036304	  1.356578
 -0.450360	 -0.053432	  1.348536
 -0.459413	 -0.071910	  1.335828
 -0.466344	 -0.082455	  1.327017
 -0.483150	 -0.098274	  1.310807
 -0.493664	 -0.105709	  1.304137
 -0.507780	 -0.114574	  1.292865
 -0.529234	 -0.130220	  1.273435
 -0.536184	 -0.138775	  1.263127
 -0.540881	 -0.144282	  1.256832
 -0.549383	 -0.162576	  1.244798
 -0.561206	 -0.178648	  1.232553
 -0.574046	 -0.187564	  1.220099
 -0.588976	 -0.194952	  1.208570
 -0.605659	 -0.202624	  1.196520
 -0.621933	 -0.210476	  1.183837
 -0.632538	 -0.215174	  1.175327
 -0.650184	 -0.227814	  1.160861
 -0.664684	 -0.236846	  1.153038
 -0.677266	 -0.244407	  1.146376
 -0.697141	 -0.250488	  1.134516
 -0.716185	 -0.254389	  1.122828
 -0.728440	 -0.256975	  1.112574
 -0.743387	 -0.259882	  1.099133
 -0.758859	 -0.261128	  1.082208
 -0.770008	 -0.259508	  1.068626
 -0.781945	 -0.258298	  1.052507
 -0.792886	 -0.259518	  1.039658
 -0.809628	 -0.262197	  1.021351
 -0.824050	 -0.260919	  1.008065
 -0.836543	 -0.258687	  0.997470
 -0.852038	 -0.257558	  0.983507
 -0.866433	 -0.255437	  0.969486
 -0.880777	 -0.254339	  0.955012
 -0.898237	 -0.253551	  0.939575
 -0.913423	 -0.252527	  0.928793
 -0.928551	 -0.255039	  0.921161
 -0.949476	 -0.258740	  0.911579
 -0.971957	 -0.254966	  0.897324
 -0.981677	 -0.251273	  0.889943
 -0.997209	 -0.243052	  0.878811
 -1.012760	 -0.236037	  0.869485
 -1.029595	 -0.234605	  0.860578
 -1.044638	 -0.238414	  0.850659
 -1.059337	 -0.242684	  0.838701
 -1.074703	 -0.246020	  0.824386
 -1.090369	 -0.246514	  0.811171
 -1.111844	 -0.250398	  0.800451
 -1.131614	 -0.257419	  0.799453
 -1.144081	 -0.262401	  0.800989
 -1.166051	 -0.272664	  0.803948
 -1.188283	 -0.283536	  0.801956
 -1.205051	 -0.289312	  0.797209
 -1.228222	 -0.291429	  0.785977
 -1.248525	 -0.293984	  0.777206
 -1.260907	 -0.298543	  0.771570
 -1.275212	 -0.306713	  0.763260
 -1.289408	 -0.318881	  0.754035
 -1.304174	 -0.329960	  0.745405
 -1.322654	 -0.339123	  0.733568
 -1.341587	 -0.348342	  0.719314
 -1.354221	 -0.357453	  0.710967
 -1.362670	 -0.367929	  0.704104
 -1.375191	 -0.384393	  0.697097
 -1.384601	 -0.398718	  0.691461
 -1.392319	 -0.412708	  0.685474
 -1.405800	 -0.436052	  0.671263
 -1.416142	 -0.450496	  0.656646
 -1.422306	 -0.461200	  0.641655
 -1.428252	 -0.471686	  0.630225
 -1.433274	 -0.486606	  0.619870
 -1.440627	 -0.503676	  0.608745
 -1.448182	 -0.531166	  0.601741
 -1.450340	 -0.541252	  0.599140
 -1.454915	 -0.559644	  0.591091
 -1.458456	 -0.575911	  0.583009
 -1.461004	 -0.586598	  0.574122
 -1.466885	 -0.601126	  0.560217
 -1.470160	 -0.628694	  0.550807
 -1.471285	 -0.643441	  0.544900
 -1.474346	 -0.656144	  0.540079
 -1.483366	 -0.679042	  0.531035
 -1.487452	 -0.703536	  0.527281
 -1.489104	 -0.713317	  0.525989
 -1.493314	 -0.733993	  0.524614
 -1.494965	 -0.757882	  0.525915
 -1.497055	 -0.775683	  0.529560
 -1.501048	 -0.796148	  0.533272
 -1.508992	 -0.818014	  0.536552
 -1.516334	 -0.839011	  0.536184
 -1.522955	 -0.857348	  0.531406
 -1.527575	 -0.871829	  0.526161
 -1.530699	 -0.889977	  0.521853
 -1.532461	 -0.909402	  0.521703
 -1.532606	 -0.927077	  0.525372
 -1.539669	 -0.953971	  0.527612
 -1.546509	 -0.974271	  0.524465
 -1.551934	 -0.987824	  0.521499
 -1.558449	 -1.005865	  0.517282
 -1.566419	 -1.031457	  0.510266
 -1.571474	 -1.041817	  0.508419
 -1.586388	 -1.064043	  0.506523
 -1.598785	 -1.079191	  0.506834
 -1.609437	 -1.092112	  0.506875
 -1.625508	 -1.109840	  0.506102
 -1.635141	 -1.125009	  0.506732
 -1.643915	 -1.138175	  0.507047
 -1.659006	 -1.170736	  0.505802
 -1.664295	 -1.183347	  0.503207
 -1.670603	 -1.192595	  0.500236
 -1.684871	 -1.210158	  0.496611
 -1.699702	 -1.224924	  0.492436
 -1.712862	 -1.239753	  0.485412
 -1.725242	 -1.253302	  0.479466
 -1.738524	 -1.267109	  0.475660
 -1.753238	 -1.282764	  0.471278
 -1.767413	 -1.296615	  0.464574
 -1.780798	 -1.307281	  0.459361
 -1.793885	 -1.316599	  0.457178
 -1.809449	 -1.328763	  0.455495
 -1.836585	 -1.349216	  0.448484
 -1.848048	 -1.355705	  0.441844
 -1.857480	 -1.363526	  0.431914
 -1.871520	 -1.378139	  0.416538
 -1.882872	 -1.390417	  0.405294
 -1.895506	 -1.401399	  0.398771
 -1.912975	 -1.416692	  0.397715
 -1.930566	 -1.432662	  0.397563
 -1.944404	 -1.449279	  0.391125
 -1.950238	 -1.460514	  0.383388
 -1.958181	 -1.477044	  0.370152
 -1.971618	 -1.489434	  0.353481
 -1.980159	 -1.495493	  0.343463
 -1.996936	 -1.515913	  0.332059
 -2.009572	 -1.528890	  0.323578
