  2.881259	  0.807206	  0.477145
  2.852731	  0.799214	  0.472420
  2.809438	  0.785178	  0.484095
  2.767856	  0.767087	  0.493065
  2.727058	  0.741118	  0.491681
  2.681117	  0.717457	  0.491512
  2.633569	  0.694581	  0.498788
  2.588031	  0.673356	  0.508590
  2.543116	  0.652669	  0.520312
  2.498013	  0.632147	  0.534141
  2.453804	  0.612276	  0.549526
  2.410087	  0.593039	  0.566324
  2.366626	  0.574537	  0.584077
  2.323600	  0.556469	  0.602318
  2.281996	  0.538794	  0.620758
  2.240599	  0.520722	  0.638992
  2.199197	  0.502234	  0.656203
  2.157356	  0.482849	  0.672658
  2.114286	  0.463070	  0.688004
  2.070325	  0.444178	  0.701184
  2.025143	  0.425648	  0.713155
  1.976219	  0.409365	  0.724234
  1.926955	  0.394465	  0.733593
  1.877069	  0.380004	  0.740944
  1.827982	  0.366207	  0.746307
  1.778967	  0.352509	  0.750021
  1.730330	  0.338722	  0.752856
  1.682495	  0.324183	  0.755864
  1.636797	  0.309366	  0.759693
  1.589710	  0.293782	  0.765112
  1.544899	  0.278452	  0.771032
  1.498257	  0.262260	  0.775954
  1.450545	  0.239299	  0.776883
  1.405598	  0.215287	  0.776555
  1.361066	  0.192051	  0.776643
  1.316520	  0.168706	  0.778037
  1.271620	  0.145151	  0.781808
  1.226173	  0.121613	  0.787819
  1.181448	  0.099101	  0.798449
  1.138410	  0.078351	  0.812495
  1.096446	  0.058930	  0.828395
  1.053643	  0.039697	  0.846210
  1.009456	  0.019918	  0.865418
  0.965566	  0.001069	  0.883814
  0.920948	 -0.014388	  0.899580
  0.875433	 -0.029350	  0.910283
  0.828668	 -0.047870	  0.910563
  0.781736	 -0.081274	  0.889052
  0.735421	 -0.142024	  0.835582
  0.691572	 -0.222707	  0.755372
  0.658314	 -0.290035	  0.690545
  0.626903	 -0.342627	  0.653997
  0.588351	 -0.380432	  0.653939
  0.561018	 -0.392093	  0.675193
  0.544027	 -0.393023	  0.699206
  0.521293	 -0.386010	  0.742902
  0.483787	 -0.367388	  0.813146
  0.419141	 -0.339706	  0.906481
  0.333117	 -0.317461	  0.979871
  0.253200	 -0.318379	  1.010473
  0.197279	 -0.331360	  1.020965
  0.149654	 -0.348846	  1.024756
  0.103908	 -0.368115	  1.026444
  0.056389	 -0.387312	  1.028775
  0.009785	 -0.405666	  1.033998
 -0.038456	 -0.421630	  1.043876
 -0.085093	 -0.435166	  1.058034
 -0.130936	 -0.448717	  1.072565
 -0.176730	 -0.461869	  1.088906
 -0.220856	 -0.473411	  1.109894
 -0.265294	 -0.488059	  1.131396
 -0.307743	 -0.507533	  1.149643
 -0.351541	 -0.528919	  1.161402
 -0.396611	 -0.550167	  1.168976
 -0.441670	 -0.571432	  1.175862
 -0.485317	 -0.592510	  1.184789
 -0.525528	 -0.612660	  1.197961
 -0.563767	 -0.630669	  1.220901
 -0.606114	 -0.652078	  1.264080
 -0.655966	 -0.681797	  1.344815
 -0.701229	 -0.710066	  1.447049
 -0.729044	 -0.727651	  1.524395
 -0.750339	 -0.739650	  1.570588
 -0.778287	 -0.751902	  1.610847
 -0.823600	 -0.767657	  1.653787
 -0.877914	 -0.785569	  1.686069
 -0.919318	 -0.803970	  1.696830
 -0.952378	 -0.822228	  1.694592
 -0.997573	 -0.849048	  1.679875
 -1.050392	 -0.880757	  1.649771
 -1.096789	 -0.902449	  1.614333
 -1.143304	 -0.904875	  1.564136
 -1.209272	 -0.892862	  1.476524
 -1.286188	 -0.896937	  1.409367
 -1.349801	 -0.914576	  1.395908
 -1.401940	 -0.932997	  1.403955
 -1.450532	 -0.953628	  1.412243
 -1.497525	 -0.976305	  1.419386
 -1.543075	 -1.000767	  1.425447
 -1.586622	 -1.026358	  1.430478
 -1.627949	 -1.052380	  1.435408
 -1.668807	 -1.078892	  1.441538
 -1.708761	 -1.105408	  1.448348
 -1.747731	 -1.131054	  1.456087
 -1.787475	 -1.155946	  1.465148
 -1.829623	 -1.180220	  1.471438
 -1.875266	 -1.202822	  1.474998
 -1.918287	 -1.230130	  1.486681
 -1.965703	 -1.248766	  1.496752
 -2.010095	 -1.271942	  1.502707
 -2.055957	 -1.290229	  1.507692
 -2.102239	 -1.301229	  1.520960
 -2.146114	 -1.324693	  1.534336
 -2.195363	 -1.348802	  1.536591
 -2.217317	 -1.362290	  1.551957
