  0.616664	  0.123016	  2.401235
  0.621395	  0.129326	  2.405516
  0.626126	  0.135636	  2.409797
  0.615581	  0.121572	  2.400256
  0.605014	  0.107504	  2.390749
  0.593725	  0.093296	  2.382347
  0.582238	  0.079058	  2.374266
  0.570623	  0.064794	  2.366440
  0.558017	  0.050311	  2.360873
  0.545347	  0.035815	  2.355459
  0.532256	  0.021363	  2.351055
  0.518207	  0.007221	  2.349521
  0.504127	 -0.006908	  2.348089
  0.489794	 -0.020807	  2.347418
  0.474268	 -0.032763	  2.351294
  0.458706	 -0.044654	  2.355340
  0.443144	 -0.056545	  2.359389
  0.427605	 -0.068360	  2.363610
  0.412866	 -0.077765	  2.373255
  0.398758	 -0.086044	  2.384755
  0.384668	 -0.094283	  2.396309
  0.370443	 -0.102037	  2.407974
  0.355888	 -0.108962	  2.419908
  0.341341	 -0.115932	  2.431832
  0.326992	 -0.123357	  2.443720
  0.313258	 -0.131982	  2.455425
  0.301263	 -0.140695	  2.464736
  0.295928	 -0.147375	  2.471387
  0.285741	 -0.156483	  2.485991
  0.275554	 -0.165591	  2.500595
