 -2.902324	  0.693584	 -0.525698
 -2.873588	  0.686716	 -0.520493
 -2.822329	  0.682048	 -0.507392
 -2.776043	  0.662959	 -0.496751
 -2.725461	  0.649949	 -0.487711
 -2.678973	  0.635562	 -0.469225
 -2.633631	  0.619344	 -0.457873
 -2.590578	  0.604347	 -0.447960
 -2.543433	  0.594723	 -0.433040
 -2.493088	  0.582795	 -0.427692
 -2.447562	  0.569086	 -0.420757
 -2.406086	  0.549148	 -0.412069
 -2.360644	  0.529172	 -0.403453
 -2.311426	  0.510244	 -0.399772
 -2.260237	  0.494572	 -0.392013
 -2.212212	  0.483314	 -0.385697
 -2.162726	  0.476137	 -0.378872
 -2.112347	  0.471014	 -0.369476
 -2.062242	  0.468304	 -0.357724
 -2.013799	  0.467307	 -0.345319
 -1.966462	  0.467051	 -0.332585
 -1.917804	  0.465860	 -0.318963
 -1.869089	  0.461811	 -0.304677
 -1.819234	  0.452903	 -0.289372
 -1.771154	  0.439238	 -0.274127
 -1.724470	  0.423320	 -0.261106
 -1.679092	  0.407839	 -0.251154
 -1.632909	  0.389469	 -0.249770
 -1.586019	  0.369275	 -0.240730
 -1.539892	  0.348007	 -0.227691
 -1.497048	  0.330996	 -0.202455
 -1.452557	  0.310420	 -0.188314
 -1.409236	  0.290231	 -0.179933
 -1.364819	  0.271886	 -0.172818
 -1.318354	  0.254777	 -0.165664
 -1.269227	  0.239004	 -0.158346
 -1.222166	  0.224732	 -0.150106
 -1.176486	  0.210546	 -0.141022
 -1.129448	  0.195428	 -0.131156
 -1.082835	  0.180576	 -0.120668
 -1.037445	  0.166753	 -0.110541
 -0.991249	  0.154465	 -0.100790
 -0.943562	  0.143517	 -0.091450
 -0.894903	  0.132941	 -0.082179
 -0.848603	  0.123396	 -0.072914
 -0.802089	  0.113857	 -0.062926
 -0.752682	  0.102189	 -0.052118
 -0.703399	  0.087132	 -0.042016
 -0.655213	  0.069615	 -0.033491
 -0.609638	  0.051852	 -0.027124
 -0.563943	  0.035103	 -0.021239
 -0.516806	  0.019376	 -0.014291
 -0.469677	  0.004815	 -0.005850
 -0.423321	 -0.008209	  0.004555
 -0.376297	 -0.020142	  0.017427
 -0.329322	 -0.030730	  0.031964
 -0.281920	 -0.041776	  0.047149
 -0.235221	 -0.054776	  0.061341
 -0.188843	 -0.070141	  0.073971
 -0.141211	 -0.086606	  0.084189
 -0.095673	 -0.101702	  0.091122
 -0.050537	 -0.115662	  0.096147
 -0.002726	 -0.129607	  0.100736
  0.044541	 -0.142796	  0.106690
  0.092125	 -0.156380	  0.114725
  0.140269	 -0.171267	  0.124462
  0.189214	 -0.185752	  0.134983
  0.235725	 -0.198146	  0.145055
  0.281453	 -0.208420	  0.154818
  0.329852	 -0.219078	  0.164027
  0.378812	 -0.231584	  0.171681
  0.422951	 -0.250114	  0.179203
  0.467366	 -0.273059	  0.187997
  0.514206	 -0.294644	  0.195922
  0.561479	 -0.314292	  0.205192
  0.608541	 -0.332021	  0.216230
  0.654789	 -0.347345	  0.228915
  0.700671	 -0.360098	  0.243196
  0.745253	 -0.369684	  0.259320
  0.793343	 -0.377166	  0.276230
  0.841320	 -0.383155	  0.289308
  0.887503	 -0.390042	  0.300599
  0.935587	 -0.399010	  0.311548
  0.983717	 -0.409659	  0.321598
  1.031415	 -0.421774	  0.330757
  1.080709	 -0.435797	  0.339673
  1.126563	 -0.451189	  0.347410
  1.174087	 -0.470401	  0.356824
  1.221471	 -0.486127	  0.367802
  1.269616	 -0.499627	  0.374209
  1.331176	 -0.498368	  0.371891
  1.402196	 -0.469171	  0.302326
  1.464482	 -0.503925	  0.161720
  1.511447	 -0.528036	  0.116796
  1.555085	 -0.552303	  0.111491
  1.631034	 -0.599888	  0.127325
  1.747748	 -0.693682	  0.144312
  1.794636	 -0.750238	  0.139796
  1.802165	 -0.761033	  0.142628
  1.816592	 -0.791257	  0.166635
  1.820331	 -0.804443	  0.191552
  1.810338	 -0.791361	  0.295048
  1.845317	 -0.702807	  0.430301
  1.916862	 -0.691401	  0.491757
  1.969370	 -0.704563	  0.511922
  2.016913	 -0.721231	  0.525491
  2.063688	 -0.739276	  0.539156
  2.106682	 -0.756726	  0.553068
  2.150135	 -0.774147	  0.567963
  2.197390	 -0.789843	  0.582239
  2.245658	 -0.803333	  0.595411
  2.291838	 -0.814856	  0.607282
  2.339638	 -0.826022	  0.619094
  2.387709	 -0.836595	  0.629745
  2.433806	 -0.847497	  0.638679
  2.480907	 -0.860626	  0.647314
  2.528437	 -0.875495	  0.655209
  2.575307	 -0.888404	  0.662941
  2.623403	 -0.899122	  0.670794
  2.673887	 -0.910027	  0.678788
  2.722337	 -0.921336	  0.689913
  2.765450	 -0.939846	  0.684817
  2.793105	 -0.949245	  0.691665
