 -0.903589	  2.884440	 -0.210793
 -0.894643	  2.855881	 -0.208706
 -0.897094	  2.812964	 -0.194793
 -0.901246	  2.762146	 -0.190145
 -0.910025	  2.713360	 -0.184172
 -0.918075	  2.666443	 -0.178498
 -0.924431	  2.617311	 -0.172549
 -0.928737	  2.569045	 -0.167465
 -0.931561	  2.517896	 -0.163514
 -0.933108	  2.466967	 -0.160499
 -0.935406	  2.418872	 -0.156569
 -0.938975	  2.369840	 -0.151067
 -0.942641	  2.319265	 -0.145023
 -0.944436	  2.269255	 -0.141612
 -0.945256	  2.221284	 -0.140093
 -0.945582	  2.171181	 -0.139782
 -0.945651	  2.122881	 -0.139666
 -0.945184	  2.072732	 -0.139265
 -0.943160	  2.022988	 -0.138371
 -0.938827	  1.974735	 -0.137171
 -0.924685	  1.921781	 -0.138427
 -0.868516	  1.871071	 -0.149817
 -0.756144	  1.827173	 -0.155085
 -0.715791	  1.795724	 -0.155960
 -0.690776	  1.759521	 -0.149483
 -0.684484	  1.737851	 -0.144737
 -0.675190	  1.659854	 -0.116021
 -0.666145	  1.581068	 -0.046059
 -0.655496	  1.535253	 -0.004488
 -0.660711	  1.523702	  0.000340
 -0.665670	  1.462917	  0.020922
 -0.676980	  1.368274	  0.060753
 -0.710535	  1.314165	  0.090022
 -0.745816	  1.275603	  0.106751
 -0.804709	  1.216455	  0.137046
 -0.882732	  1.120425	  0.200725
 -0.886653	  1.116429	  0.202125
 -0.891014	  1.114519	  0.202880
 -0.891954	  1.112420	  0.200338
 -0.946210	  1.032756	  0.077429
 -0.980326	  0.932845	 -0.007491
 -0.985010	  0.880594	 -0.033244
 -0.984135	  0.835099	 -0.042175
 -0.984008	  0.787146	 -0.040238
 -0.984977	  0.735895	 -0.033101
 -0.985255	  0.688053	 -0.026032
 -0.983426	  0.638158	 -0.019976
 -0.980870	  0.590956	 -0.015076
 -0.978661	  0.543376	 -0.009749
 -0.976871	  0.492555	 -0.003478
 -0.976273	  0.441210	  0.003848
 -0.977915	  0.393008	  0.012137
 -0.981914	  0.344078	  0.021197
 -0.986955	  0.294580	  0.028612
 -0.992591	  0.245142	  0.033292
 -0.999756	  0.194108	  0.035333
 -1.007186	  0.147063	  0.036516
 -1.014337	  0.100462	  0.038369
 -1.020010	  0.049915	  0.041164
 -1.022666	 -0.001248	  0.044297
 -1.023117	 -0.051919	  0.047831
 -1.021516	 -0.101476	  0.051532
 -1.017977	 -0.150596	  0.053813
 -1.012746	 -0.202433	  0.054334
 -1.007416	 -0.250542	  0.053683
 -1.002841	 -0.295638	  0.053356
 -0.999924	 -0.344244	  0.054130
 -0.999385	 -0.393656	  0.056521
 -1.000913	 -0.443438	  0.060393
 -1.004018	 -0.493916	  0.065169
 -1.008681	 -0.545492	  0.068820
 -1.014427	 -0.595858	  0.071618
 -1.020882	 -0.646170	  0.073786
 -1.027659	 -0.696872	  0.074894
 -1.034691	 -0.747391	  0.074286
 -1.040963	 -0.794671	  0.072114
 -1.046556	 -0.842235	  0.069930
 -1.051529	 -0.890664	  0.067894
 -1.055890	 -0.942194	  0.066712
 -1.057142	 -0.992956	  0.069281
 -1.053999	 -1.042377	  0.074216
 -1.049446	 -1.089595	  0.079488
 -1.044986	 -1.140179	  0.085869
 -1.043242	 -1.191124	  0.094798
 -1.046295	 -1.239860	  0.106902
 -1.057110	 -1.292250	  0.123386
 -1.089524	 -1.361945	  0.150394
 -1.195673	 -1.454069	  0.232424
 -1.305728	 -1.477851	  0.370922
 -1.338940	 -1.482026	  0.427484
 -1.348789	 -1.501202	  0.453454
 -1.358570	 -1.556653	  0.483705
 -1.391903	 -1.612468	  0.531047
 -1.411186	 -1.654386	  0.541233
 -1.361564	 -1.698981	  0.540450
 -1.336522	 -1.739039	  0.533714
 -1.402437	 -1.784190	  0.482163
 -1.312721	 -1.863541	  0.363178
 -1.192840	 -1.942497	  0.244940
 -1.123323	 -1.987536	  0.184904
 -1.101511	 -2.027992	  0.169158
 -1.101850	 -2.079404	  0.170857
 -1.103674	 -2.127780	  0.173594
 -1.107293	 -2.176025	  0.178240
 -1.110176	 -2.227888	  0.186849
 -1.104607	 -2.275773	  0.196662
 -1.107077	 -2.325141	  0.200547
 -1.106664	 -2.375058	  0.210310
 -1.106558	 -2.424465	  0.208775
 -1.106863	 -2.470865	  0.217176
 -1.107765	 -2.518884	  0.222071
 -1.107055	 -2.568690	  0.225794
 -1.113957	 -2.620827	  0.224001
 -1.111114	 -2.669172	  0.230810
 -1.110453	 -2.719813	  0.234930
 -1.120467	 -2.772948	  0.235183
 -1.131671	 -2.800678	  0.237535
