 -0.810481	  2.745421	  0.993319
 -0.802457	  2.718239	  0.983484
 -0.787371	  2.681900	  0.956489
 -0.776605	  2.646981	  0.924542
 -0.772936	  2.604996	  0.898539
 -0.768679	  2.568458	  0.864703
 -0.759482	  2.532479	  0.831494
 -0.750940	  2.496086	  0.798871
 -0.741599	  2.459861	  0.765675
 -0.730873	  2.423201	  0.732732
 -0.718885	  2.386457	  0.700749
 -0.704884	  2.351371	  0.668572
 -0.691766	  2.315223	  0.637462
 -0.680576	  2.277479	  0.606688
 -0.671419	  2.239472	  0.575881
 -0.663985	  2.201928	  0.544604
 -0.657961	  2.165148	  0.512399
 -0.651559	  2.128720	  0.478758
 -0.642598	  2.092276	  0.444805
 -0.630125	  2.055691	  0.412283
 -0.614395	  2.018810	  0.382466
 -0.595253	  1.980797	  0.355453
 -0.573916	  1.941415	  0.332271
 -0.551436	  1.900737	  0.313808
 -0.529420	  1.859568	  0.300025
 -0.508838	  1.818085	  0.290329
 -0.489692	  1.775420	  0.283211
 -0.473104	  1.733476	  0.278535
 -0.458455	  1.691013	  0.275591
 -0.445021	  1.643552	  0.273606
 -0.433658	  1.587375	  0.270253
 -0.424178	  1.518720	  0.267010
 -0.416276	  1.446112	  0.265045
 -0.409900	  1.376285	  0.258687
 -0.404358	  1.311666	  0.248245
 -0.397985	  1.251384	  0.236573
 -0.391142	  1.194634	  0.222416
 -0.384534	  1.138159	  0.202652
 -0.377847	  1.083517	  0.177311
 -0.371966	  1.032204	  0.146544
 -0.367512	  0.987045	  0.111358
 -0.364606	  0.948954	  0.074338
 -0.361759	  0.915751	  0.031504
 -0.357155	  0.888451	 -0.020763
 -0.347475	  0.869399	 -0.080030
 -0.334539	  0.859764	 -0.139654
 -0.319510	  0.841942	 -0.193189
 -0.303921	  0.835961	 -0.252558
 -0.288568	  0.839456	 -0.320251
 -0.273331	  0.842530	 -0.389842
 -0.258651	  0.828856	 -0.455404
 -0.247040	  0.804099	 -0.509994
 -0.236921	  0.773579	 -0.554061
 -0.228777	  0.739670	 -0.590174
 -0.222165	  0.701539	 -0.621257
 -0.216669	  0.660646	 -0.648307
 -0.212126	  0.618047	 -0.672539
 -0.208263	  0.575292	 -0.694455
 -0.203841	  0.532742	 -0.715234
 -0.196686	  0.489803	 -0.736574
 -0.184833	  0.443188	 -0.760977
 -0.164462	  0.384621	 -0.791474
 -0.132964	  0.314674	 -0.824806
 -0.095309	  0.243765	 -0.853320
 -0.063709	  0.188763	 -0.873153
 -0.045720	  0.157021	 -0.886030
 -0.037781	  0.141935	 -0.893821
 -0.032456	  0.130323	 -0.901968
 -0.026199	  0.113471	 -0.917466
 -0.018180	  0.086923	 -0.948583
 -0.012025	  0.054299	 -1.000070
 -0.011620	  0.022690	 -1.067142
 -0.015532	 -0.005464	 -1.134017
 -0.017726	 -0.031829	 -1.190476
 -0.017202	 -0.058190	 -1.236769
 -0.014012	 -0.087651	 -1.278521
 -0.007622	 -0.121009	 -1.317292
  0.001461	 -0.157206	 -1.352681
  0.012406	 -0.195072	 -1.385011
  0.025249	 -0.233031	 -1.415413
  0.039831	 -0.270158	 -1.444599
  0.055525	 -0.307438	 -1.473357
  0.071660	 -0.344616	 -1.501759
  0.087886	 -0.381364	 -1.530321
  0.104111	 -0.418054	 -1.560516
  0.119772	 -0.454301	 -1.592631
  0.134239	 -0.491414	 -1.625398
  0.147292	 -0.529344	 -1.657127
  0.159000	 -0.568135	 -1.687658
  0.169147	 -0.607920	 -1.716998
  0.177800	 -0.648760	 -1.744959
  0.184116	 -0.690816	 -1.772352
  0.188297	 -0.733752	 -1.798107
  0.192150	 -0.776401	 -1.822711
  0.197990	 -0.819061	 -1.848252
  0.205705	 -0.861122	 -1.873623
  0.214816	 -0.902596	 -1.899052
  0.225552	 -0.943394	 -1.924984
  0.238171	 -0.983836	 -1.951801
  0.252556	 -1.023393	 -1.979308
  0.265887	 -1.062544	 -2.008491
  0.277144	 -1.100987	 -2.039620
  0.288560	 -1.138157	 -2.072500
  0.300530	 -1.174306	 -2.105770
  0.311101	 -1.209187	 -2.140271
  0.324711	 -1.238526	 -2.178427
  0.335084	 -1.276409	 -2.208641
  0.349514	 -1.312711	 -2.239187
  0.357310	 -1.352959	 -2.267801
  0.371597	 -1.390933	 -2.297812
  0.383495	 -1.432365	 -2.324479
  0.391765	 -1.468407	 -2.358921
  0.400426	 -1.507625	 -2.389389
  0.411042	 -1.545966	 -2.420902
  0.423879	 -1.585228	 -2.451724
  0.430869	 -1.625411	 -2.484430
  0.435177	 -1.641665	 -2.509274
