 -2.182478	 -0.149620	  1.123908
 -2.193238	 -0.156792	  1.122667
 -2.176673	 -0.145749	  1.124578
 -2.160114	 -0.134696	  1.126475
 -2.144078	 -0.122766	  1.127179
 -2.128058	 -0.110811	  1.127827
 -2.111232	 -0.100073	  1.126597
 -2.094016	 -0.090187	  1.124185
 -2.076266	 -0.081956	  1.120047
 -2.058318	 -0.074768	  1.114935
 -2.039857	 -0.067783	  1.111732
 -2.020980	 -0.061195	  1.111283
 -2.002100	 -0.054612	  1.110899
 -1.983207	 -0.048220	  1.112360
 -1.964320	 -0.041839	  1.113958
 -1.945613	 -0.034927	  1.115467
 -1.927306	 -0.026986	  1.116791
 -1.909003	 -0.019033	  1.118118
 -1.891107	 -0.010235	  1.119627
 -1.873756	 -0.000438	  1.121354
 -1.856413	  0.009372	  1.123084
 -1.839474	  0.019830	  1.124998
 -1.822934	  0.030879	  1.127080
 -1.806402	  0.041940	  1.129170
 -1.790256	  0.053439	  1.131828
 -1.774226	  0.065062	  1.134648
 -1.758280	  0.076768	  1.137598
 -1.742593	  0.088715	  1.140937
 -1.726913	  0.100673	  1.144270
 -1.712032	  0.113830	  1.146599
 -1.697998	  0.128013	  1.147970
 -1.683997	  0.142220	  1.149233
 -1.669628	  0.155896	  1.146742
 -1.655169	  0.169317	  1.143499
 -1.639182	  0.180561	  1.139253
 -1.622569	  0.190610	  1.134428
 -1.605674	  0.200317	  1.129959
 -1.588475	  0.209540	  1.126221
 -1.570126	  0.217214	  1.123715
 -1.551495	  0.225412	  1.120449
 -1.535147	  0.235961	  1.116333
 -1.519376	  0.247922	  1.113194
 -1.503233	  0.259654	  1.111130
 -1.486189	  0.270124	  1.109215
 -1.469886	  0.281726	  1.108354
 -1.453744	  0.293525	  1.107542
 -1.437771	  0.305524	  1.106927
 -1.422143	  0.317687	  1.106611
 -1.408223	  0.332052	  1.105130
 -1.394239	  0.348023	  1.103583
 -1.377499	  0.360277	  1.104252
 -1.359554	  0.366526	  1.109216
 -1.336015	  0.371944	  1.117156
 -1.317696	  0.377608	  1.121555
 -1.302761	  0.384887	  1.124450
 -1.283092	  0.392384	  1.125588
 -1.264296	  0.396097	  1.125263
 -1.242767	  0.399571	  1.123359
 -1.220664	  0.411176	  1.119405
 -1.208410	  0.425402	  1.118553
 -1.193581	  0.441710	  1.122820
 -1.176515	  0.451335	  1.128637
 -1.158381	  0.452965	  1.135644
 -1.135071	  0.454695	  1.146542
 -1.117860	  0.459973	  1.153490
 -1.102509	  0.466579	  1.158442
 -1.085062	  0.478520	  1.163061
 -1.069272	  0.490527	  1.168712
 -1.052897	  0.500883	  1.171243
 -1.035979	  0.506175	  1.178626
 -1.018949	  0.506961	  1.187917
 -0.998516	  0.504384	  1.193176
 -0.977559	  0.506075	  1.195121
 -0.957909	  0.506081	  1.196800
 -0.937590	  0.499744	  1.197097
 -0.918254	  0.496263	  1.199682
 -0.899547	  0.495973	  1.205576
 -0.878683	  0.493192	  1.214310
 -0.861826	  0.482309	  1.223887
 -0.851466	  0.472347	  1.235115
 -0.837485	  0.459934	  1.246120
 -0.819332	  0.448252	  1.250534
 -0.799253	  0.442050	  1.249209
 -0.779097	  0.438945	  1.249895
 -0.759461	  0.433427	  1.253469
 -0.741202	  0.425567	  1.257593
 -0.723225	  0.417739	  1.261509
 -0.704594	  0.410985	  1.264104
 -0.685393	  0.405475	  1.265125
 -0.666183	  0.399934	  1.266074
 -0.646976	  0.394451	  1.266996
 -0.628169	  0.388400	  1.267531
 -0.610115	  0.380904	  1.267366
 -0.589618	  0.373856	  1.267356
 -0.569524	  0.369889	  1.268423
 -0.547197	  0.373308	  1.267485
 -0.527091	  0.376037	  1.261630
 -0.511361	  0.369542	  1.255281
 -0.492331	  0.362212	  1.249006
 -0.472312	  0.364402	  1.240024
 -0.453022	  0.369651	  1.236817
 -0.435760	  0.372031	  1.234830
 -0.418867	  0.378962	  1.225934
 -0.400859	  0.387515	  1.221520
 -0.384852	  0.398817	  1.219734
 -0.369357	  0.410745	  1.212930
 -0.355615	  0.420852	  1.205027
 -0.340418	  0.432512	  1.198188
 -0.322169	  0.445979	  1.188748
 -0.311355	  0.452928	  1.183107
 -0.293676	  0.463842	  1.174430
 -0.278238	  0.471997	  1.161663
 -0.266455	  0.476945	  1.147228
 -0.251433	  0.482853	  1.134118
 -0.236338	  0.489275	  1.122848
 -0.222384	  0.496047	  1.113035
 -0.207508	  0.503095	  1.104971
 -0.185002	  0.512781	  1.087212
 -0.175882	  0.516887	  1.073847
 -0.168004	  0.522343	  1.060378
 -0.158921	  0.534861	  1.045864
 -0.148649	  0.544044	  1.030530
 -0.145043	  0.556009	  1.010500
 -0.146351	  0.570902	  1.000427
 -0.146894	  0.590277	  0.995574
 -0.145960	  0.611374	  0.984227
 -0.139350	  0.626551	  0.966591
 -0.124723	  0.634777	  0.956506
 -0.111340	  0.650463	  0.948751
 -0.102371	  0.667118	  0.943844
 -0.095145	  0.684617	  0.935017
 -0.087099	  0.702921	  0.934777
 -0.078911	  0.721086	  0.936635
 -0.070900	  0.739019	  0.938597
 -0.065702	  0.758143	  0.941783
 -0.062805	  0.777987	  0.945733
 -0.054199	  0.795130	  0.948794
 -0.040818	  0.810042	  0.953102
 -0.025564	  0.832053	  0.957162
 -0.020452	  0.848945	  0.955213
 -0.017480	  0.868006	  0.954613
 -0.013702	  0.885649	  0.958958
 -0.005100	  0.902113	  0.964658
  0.003381	  0.922416	  0.968426
  0.004883	  0.946007	  0.973500
  0.004236	  0.959405	  0.977880
  0.004859	  0.978538	  0.988650
  0.001544	  0.996306	  1.000934
 -0.003874	  1.016354	  1.008330
 -0.002590	  1.034713	  1.012045
  0.001348	  1.052352	  1.017788
  0.001730	  1.073469	  1.025629
  0.001573	  1.094493	  1.031335
  0.004012	  1.110717	  1.035842
  0.010240	  1.126843	  1.043786
  0.015329	  1.149928	  1.056040
  0.012128	  1.163270	  1.063930
  0.009172	  1.181916	  1.073844
  0.012386	  1.204078	  1.084682
  0.028370	  1.219688	  1.089465
  0.047429	  1.232293	  1.091332
  0.059831	  1.245401	  1.092550
  0.073126	  1.263506	  1.094700
  0.087721	  1.278194	  1.097474
  0.103237	  1.285163	  1.094624
  0.122188	  1.294533	  1.091385
  0.141712	  1.306994	  1.091508
  0.153901	  1.319626	  1.090389
  0.169987	  1.332080	  1.087179
  0.186521	  1.343308	  1.084609
  0.200597	  1.356415	  1.082019
  0.217421	  1.371504	  1.082412
  0.234403	  1.378212	  1.081533
  0.253120	  1.385467	  1.077950
  0.272670	  1.394803	  1.076642
  0.287343	  1.407021	  1.076627
  0.301174	  1.422912	  1.076851
  0.318010	  1.436127	  1.077836
  0.334478	  1.443005	  1.075646
  0.352474	  1.454113	  1.073299
  0.370805	  1.466647	  1.076098
  0.383626	  1.479633	  1.079170
  0.399249	  1.492183	  1.080757
  0.417962	  1.502913	  1.083693
  0.430549	  1.513799	  1.086923
  0.443612	  1.530413	  1.090279
  0.454950	  1.547722	  1.092874
  0.467405	  1.564360	  1.095217
  0.478728	  1.580639	  1.096856
  0.490887	  1.596408	  1.097664
  0.505699	  1.610029	  1.098164
  0.521160	  1.623188	  1.100381
  0.538344	  1.634277	  1.101661
  0.558156	  1.644131	  1.098444
  0.577047	  1.649403	  1.092221
  0.595299	  1.656721	  1.080885
  0.609848	  1.666639	  1.072510
  0.625626	  1.678980	  1.069273
  0.641764	  1.690829	  1.069521
  0.660016	  1.700141	  1.068209
  0.678494	  1.707853	  1.065121
  0.695312	  1.718304	  1.062082
  0.709920	  1.729736	  1.059220
  0.727789	  1.740914	  1.054565
  0.747830	  1.748506	  1.050876
  0.764967	  1.754217	  1.050462
  0.782413	  1.762915	  1.054433
  0.807196	  1.772758	  1.058706
  0.821750	  1.784192	  1.060072
  0.832142	  1.796106	  1.060171
  0.847904	  1.812661	  1.060348
  0.865340	  1.823349	  1.059722
  0.883091	  1.829314	  1.060253
  0.904474	  1.834646	  1.064394
  0.923537	  1.842983	  1.066731
  0.939098	  1.856208	  1.064455
  0.951348	  1.871516	  1.060593
  0.966845	  1.886290	  1.056499
  0.986999	  1.893428	  1.052543
  1.010193	  1.897254	  1.055199
  1.028779	  1.904594	  1.063185
  1.040338	  1.913213	  1.065673
  1.059166	  1.925569	  1.063484
  1.077114	  1.936197	  1.062400
  1.096159	  1.947143	  1.062151
  1.113559	  1.957002	  1.061947
