 -1.194682	 -1.468161	  1.293269
 -1.223785	 -1.463133	  1.311587
 -1.252888	 -1.458105	  1.329905
 -1.234590	 -1.464516	  1.324183
 -1.217926	 -1.465701	  1.312946
 -1.201982	 -1.467226	  1.299655
 -1.185872	 -1.472059	  1.289356
 -1.166652	 -1.477000	  1.280500
 -1.147742	 -1.479264	  1.270962
 -1.134953	 -1.478991	  1.259539
 -1.116947	 -1.480477	  1.248240
 -1.102489	 -1.483143	  1.235150
 -1.086700	 -1.486229	  1.223444
 -1.069916	 -1.488776	  1.212667
 -1.053564	 -1.490782	  1.198738
 -1.037197	 -1.490541	  1.187978
 -1.020185	 -1.490857	  1.178493
 -1.003363	 -1.494819	  1.167620
 -0.986790	 -1.499792	  1.156851
 -0.970484	 -1.505062	  1.147168
 -0.953571	 -1.508433	  1.136347
 -0.937097	 -1.512103	  1.125618
 -0.920721	 -1.516214	  1.114897
 -0.904346	 -1.520326	  1.104176
 -0.888225	 -1.525178	  1.093379
 -0.872256	 -1.530539	  1.083117
 -0.855677	 -1.536161	  1.073901
 -0.839657	 -1.542638	  1.063506
 -0.824292	 -1.548998	  1.049910
 -0.810260	 -1.555226	  1.039348
 -0.794097	 -1.564200	  1.031038
 -0.778119	 -1.572330	  1.019888
 -0.763604	 -1.575915	  1.008433
 -0.746280	 -1.578514	  0.993911
 -0.732607	 -1.585729	  0.979879
 -0.719928	 -1.598214	  0.972090
 -0.704140	 -1.610385	  0.965658
 -0.691642	 -1.625673	  0.955553
 -0.678411	 -1.640035	  0.947117
 -0.666157	 -1.647610	  0.935184
 -0.651869	 -1.654693	  0.922479
 -0.637836	 -1.659898	  0.905020
 -0.630545	 -1.667717	  0.890026
 -0.616733	 -1.678064	  0.878816
 -0.601620	 -1.686304	  0.864335
 -0.592890	 -1.697803	  0.851436
 -0.586935	 -1.711828	  0.839215
 -0.574507	 -1.723653	  0.823734
 -0.560995	 -1.728080	  0.808794
 -0.555105	 -1.736629	  0.793205
 -0.547927	 -1.748026	  0.775873
 -0.538487	 -1.758821	  0.762704
 -0.526754	 -1.770468	  0.751413
 -0.517318	 -1.783225	  0.737269
 -0.503246	 -1.788588	  0.721342
 -0.494791	 -1.793901	  0.708224
 -0.485466	 -1.805072	  0.692954
 -0.475414	 -1.815972	  0.679092
 -0.461692	 -1.827466	  0.665974
 -0.451825	 -1.838569	  0.652825
 -0.438259	 -1.843093	  0.636498
 -0.425498	 -1.843378	  0.623385
 -0.413771	 -1.853702	  0.609704
 -0.401458	 -1.862847	  0.593052
 -0.386958	 -1.866898	  0.582455
 -0.373883	 -1.875715	  0.570703
 -0.361004	 -1.886570	  0.558233
 -0.348087	 -1.892969	  0.541321
 -0.334489	 -1.897135	  0.531079
 -0.318429	 -1.904571	  0.521842
 -0.301114	 -1.913177	  0.509116
 -0.288411	 -1.922020	  0.496283
 -0.276743	 -1.927945	  0.483405
 -0.263202	 -1.932160	  0.469506
 -0.245415	 -1.930869	  0.454778
 -0.229193	 -1.931983	  0.445243
 -0.210919	 -1.934687	  0.436732
 -0.194731	 -1.935887	  0.422497
 -0.184194	 -1.938255	  0.409507
 -0.166445	 -1.938762	  0.400008
 -0.147852	 -1.936998	  0.390875
 -0.130431	 -1.929713	  0.378302
 -0.115905	 -1.924953	  0.370902
 -0.097411	 -1.916994	  0.364543
 -0.080567	 -1.909974	  0.356077
 -0.064474	 -1.904061	  0.347542
 -0.045929	 -1.895077	  0.338272
 -0.030006	 -1.885286	  0.332986
 -0.013633	 -1.876599	  0.330244
  0.004438	 -1.866782	  0.324527
  0.021705	 -1.857622	  0.320903
  0.037622	 -1.848438	  0.319445
  0.053722	 -1.837854	  0.314002
  0.071083	 -1.824646	  0.304210
  0.086650	 -1.815621	  0.300826
  0.103995	 -1.808236	  0.298376
  0.123523	 -1.799346	  0.294475
  0.138318	 -1.788230	  0.287719
  0.153668	 -1.779525	  0.278201
  0.170157	 -1.772490	  0.270817
  0.190303	 -1.764813	  0.264707
  0.207589	 -1.760992	  0.257268
  0.226245	 -1.753961	  0.248556
  0.242510	 -1.749711	  0.244557
  0.261793	 -1.747140	  0.237632
  0.281181	 -1.747962	  0.229766
  0.299367	 -1.744795	  0.221835
  0.316853	 -1.742120	  0.213421
  0.335790	 -1.743583	  0.205086
  0.354257	 -1.742431	  0.197314
  0.371035	 -1.740576	  0.188280
  0.389127	 -1.743978	  0.179314
  0.408169	 -1.745147	  0.171168
  0.424702	 -1.743899	  0.161967
  0.442484	 -1.747287	  0.152365
  0.460924	 -1.750959	  0.143550
  0.477644	 -1.748721	  0.134272
  0.494268	 -1.748279	  0.122926
  0.512104	 -1.754557	  0.110427
  0.529370	 -1.759041	  0.102255
  0.547190	 -1.760094	  0.097419
  0.567677	 -1.761020	  0.090212
  0.582348	 -1.765883	  0.076767
  0.594068	 -1.772236	  0.061231
  0.610334	 -1.778060	  0.046846
  0.626932	 -1.779689	  0.038061
  0.646761	 -1.778473	  0.030675
  0.661984	 -1.781201	  0.017856
  0.673424	 -1.785152	  0.003554
  0.691989	 -1.788242	 -0.010717
  0.708358	 -1.790620	 -0.022462
  0.718140	 -1.793103	 -0.035576
  0.732997	 -1.795466	 -0.051503
  0.747737	 -1.797777	 -0.064560
  0.759782	 -1.800887	 -0.080450
  0.774580	 -1.803653	 -0.095639
  0.789787	 -1.804683	 -0.106241
  0.806813	 -1.805529	 -0.118118
  0.822096	 -1.807845	 -0.132673
  0.832144	 -1.810579	 -0.149119
  0.844786	 -1.812560	 -0.164671
  0.860570	 -1.813513	 -0.177733
  0.876179	 -1.813862	 -0.189273
  0.890838	 -1.814895	 -0.203577
  0.904749	 -1.816018	 -0.217925
  0.918537	 -1.817083	 -0.232373
  0.932326	 -1.818147	 -0.246821
  0.946473	 -1.819399	 -0.260902
  0.960701	 -1.820693	 -0.274898
  0.974934	 -1.821986	 -0.288889
  0.990015	 -1.823625	 -0.301922
  1.005173	 -1.825294	 -0.314862
  1.020333	 -1.826963	 -0.327800
  1.036041	 -1.828950	 -0.340020
  1.051774	 -1.830952	 -0.352204
  1.067512	 -1.832959	 -0.364382
  1.083599	 -1.835517	 -0.375986
  1.099686	 -1.838075	 -0.387590
  1.115791	 -1.840672	 -0.399161
  1.132095	 -1.843718	 -0.410337
  1.148399	 -1.846765	 -0.421513
  1.164736	 -1.849916	 -0.432611
  1.181186	 -1.853436	 -0.443428
  1.197637	 -1.856957	 -0.454244
  1.214081	 -1.860661	 -0.465008
  1.230514	 -1.864598	 -0.475705
  1.246948	 -1.868535	 -0.486403
  1.262995	 -1.872993	 -0.497476
  1.278897	 -1.877635	 -0.508682
  1.294805	 -1.882280	 -0.519892
  1.310836	 -1.887057	 -0.531229
  1.326517	 -1.892221	 -0.542518
  1.342198	 -1.897385	 -0.553807
