  0.857375	  1.029108	  2.209504
  0.873346	  1.042426	  2.217645
  0.859033	  1.030509	  2.210359
  0.843798	  1.019470	  2.203575
  0.828069	  1.008953	  2.197096
  0.812746	  0.997768	  2.190766
  0.798015	  0.985704	  2.184649
  0.783992	  0.972751	  2.178685
  0.770701	  0.958977	  2.172885
  0.757538	  0.945123	  2.166987
  0.744756	  0.931049	  2.160777
  0.731977	  0.916975	  2.154565
  0.719042	  0.903065	  2.148305
  0.706015	  0.889252	  2.142019
  0.692954	  0.875470	  2.135739
  0.679168	  0.862342	  2.129608
  0.665370	  0.849225	  2.123479
  0.651265	  0.836462	  2.117304
  0.636495	  0.824521	  2.111038
  0.621718	  0.812589	  2.104770
  0.606869	  0.800785	  2.098433
  0.591965	  0.789081	  2.092039
  0.577067	  0.777374	  2.085637
  0.562865	  0.765264	  2.078451
  0.548829	  0.753068	  2.071087
  0.534805	  0.740865	  2.063710
  0.521966	  0.728308	  2.054910
  0.509533	  0.715647	  2.045690
  0.497015	  0.702898	  2.036759
  0.484375	  0.690532	  2.027895
  0.468401	  0.680398	  2.020770
  0.450048	  0.669719	  2.016505
  0.435023	  0.652342	  2.010559
  0.427209	  0.635362	  2.000671
  0.422578	  0.620693	  1.985328
  0.418960	  0.613528	  1.966687
  0.411907	  0.605725	  1.949019
  0.405486	  0.586843	  1.934491
  0.398019	  0.563348	  1.922355
  0.388100	  0.552578	  1.914609
  0.377004	  0.547512	  1.904951
  0.360519	  0.541487	  1.886374
  0.343030	  0.534959	  1.876903
  0.318216	  0.526533	  1.872551
  0.302382	  0.515129	  1.866636
  0.291549	  0.497864	  1.857968
  0.289261	  0.478223	  1.847644
  0.287507	  0.459975	  1.833121
  0.279895	  0.446833	  1.818486
  0.265500	  0.437783	  1.804589
  0.252124	  0.427160	  1.794679
  0.242740	  0.414926	  1.785723
  0.229148	  0.396812	  1.776318
  0.213353	  0.382741	  1.770124
  0.199079	  0.364574	  1.764175
  0.191902	  0.356541	  1.761658
  0.180165	  0.336436	  1.755963
  0.161869	  0.319537	  1.750655
  0.149802	  0.309025	  1.748440
  0.138382	  0.296854	  1.748638
  0.124045	  0.279969	  1.746410
  0.108375	  0.263963	  1.741584
  0.093710	  0.251472	  1.737648
  0.074445	  0.244476	  1.732779
  0.055333	  0.235446	  1.727853
  0.040978	  0.219299	  1.724919
  0.034234	  0.209308	  1.724200
  0.023981	  0.185731	  1.725383
  0.007898	  0.166596	  1.722418
 -0.007733	  0.158463	  1.714240
 -0.026209	  0.151151	  1.701245
 -0.045517	  0.143029	  1.688965
 -0.056075	  0.136010	  1.682657
 -0.072274	  0.118987	  1.674266
 -0.084997	  0.105226	  1.670093
 -0.098324	  0.093515	  1.667108
 -0.120760	  0.079894	  1.671561
 -0.143564	  0.071226	  1.665807
 -0.155773	  0.067001	  1.651711
 -0.165690	  0.062046	  1.633931
 -0.178927	  0.052303	  1.615384
 -0.188976	  0.041997	  1.600869
 -0.195740	  0.023289	  1.587115
 -0.207520	  0.002658	  1.583296
 -0.225969	 -0.011115	  1.584828
 -0.250267	 -0.024222	  1.585050
 -0.260967	 -0.029896	  1.582699
 -0.276838	 -0.041270	  1.577973
 -0.286785	 -0.053888	  1.576488
 -0.305983	 -0.072449	  1.571203
 -0.320852	 -0.085372	  1.562973
 -0.336029	 -0.096474	  1.547948
 -0.346967	 -0.106002	  1.536198
 -0.356147	 -0.112381	  1.527549
 -0.369366	 -0.128084	  1.515996
 -0.385913	 -0.149913	  1.509865
 -0.391024	 -0.157739	  1.507942
 -0.405231	 -0.178718	  1.503552
 -0.414665	 -0.194856	  1.496442
 -0.420631	 -0.205520	  1.491031
 -0.436286	 -0.231736	  1.474053
 -0.446428	 -0.246876	  1.464337
 -0.450782	 -0.254840	  1.460359
 -0.458246	 -0.261310	  1.451885
 -0.467659	 -0.277782	  1.432510
 -0.481311	 -0.290122	  1.418155
 -0.492668	 -0.296606	  1.405823
 -0.506678	 -0.306494	  1.393318
 -0.528325	 -0.322709	  1.383537
 -0.538568	 -0.330496	  1.382327
 -0.560636	 -0.343575	  1.382336
 -0.580325	 -0.360537	  1.372228
 -0.589813	 -0.375085	  1.360552
 -0.595487	 -0.387471	  1.352647
 -0.601571	 -0.403019	  1.337143
 -0.613446	 -0.407848	  1.321310
 -0.631222	 -0.409483	  1.307252
 -0.650763	 -0.411919	  1.291082
 -0.661496	 -0.417161	  1.279474
 -0.670505	 -0.428154	  1.267212
 -0.683783	 -0.439981	  1.251008
 -0.700790	 -0.446874	  1.235932
 -0.712742	 -0.449794	  1.227064
 -0.725053	 -0.450133	  1.211529
 -0.736516	 -0.453811	  1.193068
 -0.748658	 -0.460529	  1.176797
 -0.761745	 -0.467140	  1.162042
 -0.776585	 -0.467125	  1.151176
 -0.796328	 -0.464311	  1.141855
 -0.816242	 -0.459824	  1.134772
 -0.836599	 -0.459280	  1.128702
 -0.857304	 -0.467509	  1.117052
 -0.871150	 -0.477218	  1.096402
 -0.876644	 -0.481932	  1.076064
 -0.882814	 -0.478259	  1.060581
 -0.897107	 -0.467989	  1.044646
 -0.913332	 -0.461677	  1.032679
 -0.929975	 -0.459908	  1.020752
 -0.946685	 -0.455299	  1.010308
 -0.962189	 -0.450369	  0.998620
 -0.977291	 -0.445738	  0.986327
 -0.992517	 -0.441086	  0.974221
 -1.008104	 -0.436096	  0.962726
 -1.023719	 -0.431168	  0.951256
 -1.041013	 -0.430746	  0.941260
 -1.058527	 -0.431714	  0.931820
 -1.074453	 -0.436661	  0.923951
 -1.088076	 -0.449143	  0.918920
 -1.107189	 -0.458428	  0.914597
 -1.135878	 -0.457619	  0.903011
 -1.153242	 -0.457210	  0.890358
 -1.166656	 -0.458170	  0.878349
 -1.176497	 -0.464418	  0.873719
 -1.195479	 -0.480218	  0.874231
 -1.213312	 -0.495978	  0.875529
 -1.228691	 -0.511677	  0.868475
 -1.240202	 -0.523080	  0.855484
 -1.251237	 -0.531686	  0.837734
 -1.261956	 -0.536392	  0.821341
 -1.275738	 -0.542880	  0.807157
 -1.291627	 -0.551476	  0.795921
 -1.307899	 -0.560420	  0.789714
 -1.326042	 -0.571216	  0.785644
 -1.343676	 -0.584812	  0.777651
 -1.355896	 -0.602625	  0.770717
 -1.358935	 -0.623273	  0.769462
 -1.362088	 -0.645271	  0.765980
 -1.361971	 -0.665387	  0.757272
 -1.363353	 -0.678419	  0.747768
 -1.366741	 -0.693958	  0.733816
 -1.366905	 -0.711211	  0.719591
 -1.366438	 -0.731680	  0.716666
 -1.366192	 -0.756242	  0.718152
 -1.365893	 -0.771742	  0.720184
 -1.371496	 -0.792506	  0.723638
 -1.378093	 -0.811407	  0.723932
 -1.383342	 -0.831003	  0.722351
 -1.389124	 -0.850966	  0.720903
 -1.392327	 -0.871327	  0.720174
 -1.392599	 -0.893658	  0.717271
 -1.394705	 -0.912893	  0.711380
 -1.400283	 -0.930100	  0.707842
 -1.405044	 -0.948398	  0.711982
 -1.407267	 -0.968381	  0.719472
 -1.411936	 -0.987167	  0.727449
 -1.423712	 -1.006414	  0.731101
 -1.436154	 -1.026539	  0.723220
 -1.440477	 -1.040216	  0.715921
 -1.445338	 -1.060119	  0.706691
 -1.454321	 -1.078851	  0.706738
 -1.463097	 -1.106103	  0.708530
 -1.466124	 -1.117962	  0.708070
 -1.472236	 -1.144399	  0.705040
 -1.478187	 -1.161765	  0.701519
 -1.486078	 -1.177936	  0.701402
 -1.499390	 -1.199121	  0.700735
 -1.506808	 -1.209945	  0.698664
 -1.516209	 -1.227095	  0.699433
 -1.531120	 -1.252174	  0.696800
 -1.541466	 -1.266753	  0.695690
 -1.553286	 -1.283991	  0.694710
 -1.562335	 -1.296397	  0.692108
 -1.578172	 -1.314415	  0.679905
 -1.590146	 -1.326255	  0.671276
 -1.606100	 -1.337847	  0.666923
 -1.633130	 -1.353628	  0.665533
 -1.646858	 -1.362528	  0.664703
 -1.655741	 -1.369715	  0.662622
 -1.668452	 -1.382765	  0.653487
 -1.686675	 -1.405068	  0.641315
 -1.694745	 -1.413651	  0.638935
 -1.708518	 -1.428100	  0.635785
 -1.730011	 -1.443773	  0.628871
 -1.741119	 -1.452040	  0.623348
 -1.752982	 -1.465040	  0.614049
 -1.761802	 -1.481093	  0.602078
 -1.772430	 -1.496325	  0.586831
 -1.782287	 -1.504138	  0.576547
 -1.801503	 -1.513753	  0.568564
 -1.817695	 -1.523898	  0.561904
 -1.832514	 -1.537621	  0.560241
 -1.845832	 -1.555624	  0.560192
 -1.858754	 -1.572268	  0.557957
 -1.871544	 -1.584075	  0.550836
 -1.886095	 -1.595833	  0.540107
 -1.899319	 -1.605079	  0.532425
 -1.913542	 -1.618693	  0.524068
 -1.926397	 -1.632059	  0.515583
 -1.939566	 -1.645786	  0.506798
 -1.955432	 -1.662215	  0.496184
 -1.968068	 -1.675192	  0.487703
