  1.396710	 -0.617055	  1.950944
  1.393383	 -0.607357	  1.961742
  1.397852	 -0.620383	  1.947239
  1.403152	 -0.633472	  1.933077
  1.410157	 -0.646606	  1.919718
  1.417172	 -0.659735	  1.906361
  1.425032	 -0.672214	  1.892852
  1.432945	 -0.684647	  1.879330
  1.440960	 -0.697563	  1.866333
  1.449088	 -0.711060	  1.854015
  1.457208	 -0.724555	  1.841687
  1.464820	 -0.739175	  1.830360
  1.472169	 -0.754313	  1.819552
  1.479709	 -0.769357	  1.808809
  1.487540	 -0.784455	  1.799016
  1.495364	 -0.795845	  1.788214
  1.501976	 -0.808082	  1.773244
  1.506062	 -0.830650	  1.756812
  1.513066	 -0.847879	  1.749487
  1.520119	 -0.861329	  1.745554
  1.530603	 -0.878559	  1.737494
  1.538733	 -0.893885	  1.727234
  1.549063	 -0.907629	  1.716472
  1.557064	 -0.922271	  1.705444
