 -1.820067	 -1.953295	  1.432793
 -1.802046	 -1.933955	  1.418607
 -1.784687	 -1.915877	  1.375976
 -1.766109	 -1.901273	  1.331112
 -1.755289	 -1.884654	  1.284100
 -1.746212	 -1.864204	  1.238998
 -1.739521	 -1.843412	  1.194323
 -1.735471	 -1.823661	  1.149290
 -1.733283	 -1.804901	  1.103867
 -1.730782	 -1.785796	  1.060113
 -1.726546	 -1.765181	  1.015303
 -1.720450	 -1.745155	  0.969156
 -1.712967	 -1.730426	  0.923157
 -1.702395	 -1.720950	  0.874222
 -1.684013	 -1.715903	  0.828360
 -1.657750	 -1.715582	  0.785031
 -1.636479	 -1.706554	  0.737114
 -1.621725	 -1.690434	  0.689862
 -1.612508	 -1.670185	  0.644438
 -1.606071	 -1.650206	  0.597910
 -1.599622	 -1.632090	  0.548707
 -1.595606	 -1.612383	  0.500628
 -1.593955	 -1.592068	  0.456678
 -1.589380	 -1.572525	  0.413098
 -1.577480	 -1.552138	  0.369120
 -1.563188	 -1.528942	  0.327323
 -1.550933	 -1.504531	  0.286435
 -1.541666	 -1.480552	  0.243385
 -1.532788	 -1.457540	  0.199075
 -1.522760	 -1.436045	  0.154148
 -1.511457	 -1.417957	  0.108871
 -1.500001	 -1.402965	  0.063817
 -1.489088	 -1.390248	  0.019007
 -1.477880	 -1.378565	 -0.027891
 -1.467813	 -1.367433	 -0.075886
 -1.461307	 -1.356769	 -0.123974
 -1.457234	 -1.345247	 -0.173770
 -1.454434	 -1.330834	 -0.222610
 -1.452207	 -1.315403	 -0.268161
 -1.449926	 -1.299285	 -0.314006
 -1.444505	 -1.276558	 -0.360753
 -1.435727	 -1.247771	 -0.404107
 -1.424149	 -1.220026	 -0.445803
 -1.410736	 -1.196457	 -0.488454
 -1.395787	 -1.176525	 -0.532331
 -1.381572	 -1.159533	 -0.577514
 -1.369314	 -1.145316	 -0.623817
 -1.358174	 -1.133857	 -0.668628
 -1.347935	 -1.124542	 -0.711518
 -1.338027	 -1.117037	 -0.754241
 -1.324128	 -1.115531	 -0.807214
 -1.295134	 -1.152984	 -0.870377
 -1.271417	 -1.226134	 -0.912300
 -1.253218	 -1.285558	 -0.953447
 -1.230299	 -1.321177	 -0.987193
 -1.228725	 -1.334995	 -1.023786
 -1.232654	 -1.335226	 -1.089568
 -1.222594	 -1.307979	 -1.188909
 -1.191824	 -1.273952	 -1.288182
 -1.161624	 -1.247663	 -1.360306
 -1.139473	 -1.223621	 -1.410766
 -1.126323	 -1.201203	 -1.442210
 -1.114798	 -1.166489	 -1.475879
 -1.104670	 -1.117989	 -1.512973
 -1.100340	 -1.067800	 -1.546078
 -1.101344	 -1.024940	 -1.567242
 -1.107867	 -0.963632	 -1.586736
 -1.121727	 -0.881311	 -1.607850
 -1.137986	 -0.809528	 -1.637350
 -1.149361	 -0.757088	 -1.672357
 -1.152867	 -0.718907	 -1.709882
 -1.149544	 -0.688768	 -1.749760
 -1.140124	 -0.663969	 -1.791391
 -1.127041	 -0.642056	 -1.834182
 -1.113298	 -0.622563	 -1.878032
 -1.100360	 -0.605413	 -1.922333
 -1.088269	 -0.589811	 -1.967770
 -1.076932	 -0.575425	 -2.014994
 -1.066837	 -0.562972	 -2.062287
 -1.056999	 -0.552105	 -2.109366
 -1.047356	 -0.541648	 -2.155168
 -1.036952	 -0.530583	 -2.203027
 -1.026409	 -0.518667	 -2.252361
 -1.017906	 -0.503697	 -2.301834
 -1.012069	 -0.486339	 -2.348568
 -1.008001	 -0.466545	 -2.394098
 -1.005192	 -0.443780	 -2.439232
 -1.002349	 -0.420108	 -2.482223
 -0.997709	 -0.397433	 -2.524425
 -0.991247	 -0.375548	 -2.566041
 -0.983070	 -0.353012	 -2.608059
 -0.972291	 -0.327515	 -2.650604
 -0.961328	 -0.305927	 -2.695221
 -0.952412	 -0.285957	 -2.740039
 -0.939552	 -0.271614	 -2.787372
 -0.935944	 -0.260095	 -2.838373
 -0.945303	 -0.262696	 -2.866756
