  2.218434	 -1.556169	 -1.355650
  2.196470	 -1.540761	 -1.342228
  2.180729	 -1.492519	 -1.321646
  2.170290	 -1.447103	 -1.300714
  2.147929	 -1.405159	 -1.284162
  2.138596	 -1.361566	 -1.271220
  2.121886	 -1.314923	 -1.254367
  2.105794	 -1.274439	 -1.229856
  2.087684	 -1.228570	 -1.219180
  2.067450	 -1.187659	 -1.202630
  2.052354	 -1.142774	 -1.183430
  2.034216	 -1.101041	 -1.165846
  2.016337	 -1.058823	 -1.152487
  1.998377	 -1.011261	 -1.136609
  1.982558	 -0.969659	 -1.120825
  1.964629	 -0.923545	 -1.102737
  1.946363	 -0.876605	 -1.083794
  1.929922	 -0.833872	 -1.066588
  1.914705	 -0.793657	 -1.050709
  1.899040	 -0.750925	 -1.033855
  1.884374	 -0.708643	 -1.016871
  1.870084	 -0.663296	 -0.998142
  1.857695	 -0.621395	 -0.980481
  1.842492	 -0.576546	 -0.961521
  1.822949	 -0.531997	 -0.938844
  1.804845	 -0.494492	 -0.918995
  1.789521	 -0.455096	 -0.898831
  1.771419	 -0.412338	 -0.875068
  1.751207	 -0.366753	 -0.856845
  1.735071	 -0.328164	 -0.835612
  1.717821	 -0.281377	 -0.813627
  1.703200	 -0.235165	 -0.799469
  1.692434	 -0.187514	 -0.797331
  1.687090	 -0.133391	 -0.810342
  1.684788	 -0.008473	 -0.899580
  1.677370	  0.102010	 -1.096345
  1.658184	  0.143317	 -1.179025
  1.612942	  0.177812	 -1.211999
  1.584799	  0.304173	 -1.297527
  1.559349	  0.348682	 -1.212813
  1.522882	  0.420344	 -1.226422
  1.558533	  0.484324	 -1.182738
  1.543126	  0.475706	 -1.052748
  1.515936	  0.454892	 -0.948391
  1.515616	  0.415407	 -0.804275
  1.490071	  0.405568	 -0.623054
  1.465382	  0.435427	 -0.566398
  1.445422	  0.469716	 -0.534544
  1.428048	  0.505912	 -0.512553
  1.410462	  0.545952	 -0.492587
  1.393899	  0.587990	 -0.470618
  1.382992	  0.623823	 -0.446151
  1.378750	  0.650006	 -0.419386
  1.388739	  0.684744	 -0.348431
  1.440494	  0.732973	 -0.145950
  1.460739	  0.761616	 -0.047218
  1.485801	  0.794932	  0.030626
  1.550473	  0.829529	  0.051878
  1.547553	  0.855868	  0.039132
  1.500689	  0.909555	  0.063346
  1.480025	  0.959975	  0.073580
  1.464475	  0.990287	  0.079383
  1.443959	  1.036710	  0.103885
  1.436363	  1.085477	  0.137479
  1.426898	  1.198103	  0.180449
  1.374724	  1.213153	  0.227697
  1.359960	  1.232138	  0.231585
  1.370996	  1.287494	  0.206404
  1.379467	  1.345217	  0.137955
  1.352748	  1.394725	  0.041914
  1.327561	  1.414635	  0.013466
  1.169359	  1.475141	 -0.057928
  1.050822	  1.550864	 -0.082712
  1.012006	  1.593032	 -0.079076
  0.986637	  1.629147	 -0.068024
  0.963767	  1.672367	 -0.050876
  0.945048	  1.717095	 -0.031896
  0.929338	  1.756185	 -0.014453
  0.911920	  1.798252	  0.004534
  0.894271	  1.841121	  0.023288
  0.877225	  1.885358	  0.041692
  0.861238	  1.929539	  0.058749
  0.845320	  1.975313	  0.076420
  0.830463	  2.018180	  0.092851
  0.815549	  2.061143	  0.109604
  0.798932	  2.109219	  0.128321
  0.784122	  2.151311	  0.145268
  0.770045	  2.190690	  0.162282
  0.754572	  2.234540	  0.181537
  0.737984	  2.281746	  0.200379
  0.720706	  2.327495	  0.216594
  0.704124	  2.369040	  0.230513
  0.686462	  2.411735	  0.244674
  0.669563	  2.452089	  0.258907
  0.650753	  2.497713	  0.278114
  0.635317	  2.541935	  0.294814
  0.621857	  2.587814	  0.312231
  0.604130	  2.629465	  0.331772
  0.585261	  2.675751	  0.346296
  0.563080	  2.717673	  0.359503
  0.549434	  2.761129	  0.383152
  0.534329	  2.803935	  0.399643
  0.512996	  2.848108	  0.418720
  0.503664	  2.893669	  0.434277
  0.476464	  2.928685	  0.442476
  0.481229	  2.957972	  0.446900
