  1.821973	  0.280866	  2.404668
  1.803934	  0.278086	  2.380859
  1.772337	  0.287814	  2.347540
  1.734304	  0.292889	  2.318225
  1.693621	  0.297075	  2.290814
  1.651268	  0.300673	  2.265031
  1.607783	  0.303613	  2.240548
  1.564037	  0.306576	  2.216943
  1.520318	  0.310927	  2.193013
  1.477062	  0.313290	  2.168053
  1.434779	  0.312248	  2.141694
  1.393421	  0.309288	  2.113712
  1.352159	  0.306821	  2.083984
  1.310828	  0.303838	  2.054867
  1.269764	  0.297038	  2.027904
  1.229824	  0.286565	  2.001738
  1.191315	  0.273145	  1.974217
  1.150210	  0.260345	  1.948992
  1.107853	  0.251532	  1.922959
  1.064244	  0.245539	  1.896956
  1.018001	  0.246203	  1.874928
  0.972126	  0.260553	  1.864063
  0.933434	  0.285279	  1.865756
  0.890096	  0.324938	  1.878012
  0.825837	  0.392699	  1.898437
  0.741325	  0.469452	  1.916499
  0.659183	  0.518626	  1.916244
  0.599942	  0.542270	  1.896916
  0.555114	  0.553673	  1.865819
  0.522174	  0.559248	  1.832496
  0.493593	  0.563684	  1.799810
  0.458972	  0.567530	  1.763766
  0.416820	  0.567618	  1.727385
  0.370010	  0.563199	  1.692791
  0.321898	  0.555141	  1.659838
  0.276802	  0.543793	  1.627907
  0.238069	  0.530294	  1.596567
  0.204621	  0.514297	  1.566055
  0.175315	  0.495773	  1.535714
  0.149625	  0.474428	  1.505228
  0.127547	  0.450763	  1.474988
  0.105848	  0.422076	  1.440990
  0.078344	  0.384772	  1.396033
  0.038313	  0.343494	  1.340808
 -0.010100	  0.310818	  1.285815
 -0.057003	  0.288994	  1.239080
 -0.096965	  0.275304	  1.201229
 -0.131630	  0.266039	  1.167410
 -0.164821	  0.259373	  1.134510
 -0.199637	  0.256010	  1.102330
 -0.237105	  0.256944	  1.070763
 -0.276542	  0.261371	  1.039738
 -0.316323	  0.265500	  1.009751
 -0.356707	  0.268091	  0.980872
 -0.397573	  0.269408	  0.952612
 -0.438491	  0.271651	  0.924739
 -0.479668	  0.275243	  0.896613
 -0.519924	  0.279461	  0.868999
 -0.559514	  0.283415	  0.841083
 -0.598973	  0.286430	  0.811810
 -0.639803	  0.287740	  0.782439
 -0.681213	  0.286933	  0.753095
 -0.722662	  0.284245	  0.723497
 -0.763525	  0.280215	  0.693961
 -0.803616	  0.275881	  0.665251
 -0.844611	  0.272215	  0.637026
 -0.886249	  0.269850	  0.610688
 -0.928560	  0.268484	  0.585900
 -0.970396	  0.265770	  0.561425
 -1.009071	  0.261845	  0.535743
 -1.039761	  0.257335	  0.507290
 -1.064146	  0.253777	  0.468913
 -1.085822	  0.250720	  0.400912
 -1.106758	  0.247504	  0.310655
 -1.130277	  0.245015	  0.234401
 -1.145148	  0.235449	  0.199273
 -1.153068	  0.225538	  0.187696
 -1.171726	  0.195548	  0.172229
 -1.197886	  0.147653	  0.157984
 -1.220646	  0.105394	  0.154903
 -1.247544	  0.058917	  0.166172
 -1.303305	 -0.016684	  0.195105
 -1.385143	 -0.102914	  0.214935
 -1.459041	 -0.173834	  0.217364
 -1.522315	 -0.218210	  0.211106
 -1.611841	 -0.209997	  0.203531
 -1.706531	 -0.166654	  0.195244
 -1.773788	 -0.111871	  0.155799
 -1.827496	 -0.064661	  0.140817
 -1.880009	 -0.008108	  0.123798
 -1.945290	  0.060469	  0.092920
 -2.005979	  0.119018	  0.040239
 -2.050205	  0.153214	 -0.002599
 -2.084857	  0.170052	 -0.031888
 -2.118606	  0.179909	 -0.059076
 -2.155035	  0.188263	 -0.087782
 -2.193466	  0.198846	 -0.116552
 -2.231598	  0.213850	 -0.144305
 -2.269428	  0.231092	 -0.172339
 -2.308012	  0.245331	 -0.201866
 -2.348249	  0.254658	 -0.232425
 -2.389391	  0.258971	 -0.263100
 -2.429980	  0.260153	 -0.293765
 -2.468338	  0.258742	 -0.325705
 -2.506569	  0.253828	 -0.357496
 -2.546042	  0.246889	 -0.387538
 -2.585948	  0.241533	 -0.417368
 -2.625935	  0.235135	 -0.445662
 -2.667377	  0.229802	 -0.471658
 -2.708467	  0.216804	 -0.497511
 -2.750560	  0.214639	 -0.524242
 -2.794438	  0.210768	 -0.548322
 -2.838374	  0.214234	 -0.574410
 -2.881426	  0.207301	 -0.603809
 -2.924885	  0.204574	 -0.634977
 -2.954134	  0.206620	 -0.641327
