 -0.680332	  0.853993	 -2.151488
 -0.664627	  0.859593	 -2.180538
 -0.648922	  0.865193	 -2.209588
 -0.661003	  0.864870	 -2.194216
 -0.670205	  0.859024	 -2.177661
 -0.679259	  0.855348	 -2.160259
 -0.693637	  0.855014	 -2.141184
 -0.708359	  0.853536	 -2.130820
 -0.724835	  0.851137	 -2.117410
 -0.733348	  0.850075	 -2.100682
 -0.741107	  0.848314	 -2.081243
 -0.752924	  0.845909	 -2.062658
 -0.767943	  0.843422	 -2.049693
 -0.784849	  0.840944	 -2.038285
 -0.796917	  0.840968	 -2.024022
 -0.807066	  0.840979	 -2.008393
 -0.821363	  0.844128	 -1.989349
 -0.835713	  0.846402	 -1.973520
 -0.846015	  0.843592	 -1.959986
 -0.858599	  0.840093	 -1.944162
 -0.871543	  0.839804	 -1.928332
 -0.882987	  0.841873	 -1.913756
 -0.894980	  0.845673	 -1.893932
 -0.905883	  0.846993	 -1.878554
 -0.918682	  0.843769	 -1.864690
 -0.929709	  0.840204	 -1.847100
 -0.943078	  0.843110	 -1.832233
 -0.956344	  0.848865	 -1.816859
 -0.963986	  0.851130	 -1.798739
 -0.972259	  0.851481	 -1.780385
 -0.983841	  0.850438	 -1.762361
 -0.994045	  0.852128	 -1.747307
 -1.003009	  0.853737	 -1.728792
 -1.015845	  0.858355	 -1.711700
 -1.024273	  0.860450	 -1.696697
 -1.031360	  0.858843	 -1.676363
 -1.040345	  0.857230	 -1.657735
 -1.049773	  0.857954	 -1.641350
 -1.058685	  0.859642	 -1.621327
 -1.062826	  0.860796	 -1.602543
 -1.066407	  0.860920	 -1.584125
 -1.070303	  0.859957	 -1.562971
 -1.074996	  0.858466	 -1.543213
 -1.080423	  0.854378	 -1.524239
 -1.084600	  0.849294	 -1.505212
 -1.087455	  0.843055	 -1.486215
 -1.088347	  0.836004	 -1.466835
 -1.087847	  0.828381	 -1.448267
 -1.085861	  0.819678	 -1.429831
 -1.082975	  0.812255	 -1.411207
 -1.077649	  0.802287	 -1.394242
 -1.070180	  0.795214	 -1.377172
 -1.060790	  0.785350	 -1.360875
 -1.052426	  0.775792	 -1.346881
 -1.044792	  0.764061	 -1.330919
 -1.035163	  0.754884	 -1.316397
 -1.030596	  0.742899	 -1.299648
 -1.022907	  0.731858	 -1.285780
 -1.015331	  0.718761	 -1.273265
 -1.007487	  0.707897	 -1.258933
 -0.995756	  0.699370	 -1.245619
 -0.982573	  0.687506	 -1.229992
 -0.977635	  0.677484	 -1.215620
 -0.971056	  0.669935	 -1.200108
 -0.953678	  0.659717	 -1.185313
 -0.942118	  0.649366	 -1.173248
 -0.935248	  0.641323	 -1.159374
 -0.922676	  0.633287	 -1.144958
 -0.907711	  0.623662	 -1.133134
 -0.896442	  0.620533	 -1.116605
 -0.887309	  0.617800	 -1.097768
 -0.877459	  0.609885	 -1.083233
 -0.864497	  0.603436	 -1.071432
 -0.849815	  0.598728	 -1.052234
 -0.840534	  0.598059	 -1.033627
 -0.837022	  0.591795	 -1.015420
 -0.827573	  0.582293	 -1.000022
 -0.818324	  0.574516	 -0.984697
 -0.806772	  0.561048	 -0.971332
 -0.791850	  0.552273	 -0.959181
 -0.782422	  0.549295	 -0.942055
 -0.774101	  0.548084	 -0.923354
 -0.761727	  0.548203	 -0.906677
 -0.751491	  0.542479	 -0.890762
 -0.742867	  0.533361	 -0.872919
 -0.730010	  0.529989	 -0.858431
 -0.715439	  0.528478	 -0.843200
 -0.710535	  0.523073	 -0.824483
 -0.702422	  0.518115	 -0.805800
 -0.692897	  0.513512	 -0.790078
 -0.679684	  0.506727	 -0.772815
 -0.674100	  0.503427	 -0.755869
 -0.670772	  0.499943	 -0.736630
 -0.665531	  0.495415	 -0.716454
 -0.657647	  0.491293	 -0.698085
 -0.652273	  0.489100	 -0.678782
 -0.648774	  0.486705	 -0.659455
 -0.639122	  0.483883	 -0.641294
 -0.627165	  0.484419	 -0.623173
 -0.626007	  0.480431	 -0.603729
 -0.623958	  0.477030	 -0.585902
 -0.614938	  0.473351	 -0.564062
 -0.605772	  0.471316	 -0.545718
 -0.606131	  0.472786	 -0.528492
 -0.605808	  0.473710	 -0.506514
 -0.605482	  0.471379	 -0.486098
 -0.601398	  0.467741	 -0.467990
 -0.598473	  0.464757	 -0.446353
 -0.599561	  0.461087	 -0.426069
 -0.597393	  0.460181	 -0.408536
 -0.593861	  0.456276	 -0.388036
 -0.593105	  0.452316	 -0.368051
 -0.593339	  0.453672	 -0.348930
 -0.592368	  0.453818	 -0.327585
 -0.591477	  0.449526	 -0.308761
 -0.590889	  0.443562	 -0.288353
 -0.591769	  0.442686	 -0.268125
 -0.591790	  0.438459	 -0.247383
 -0.589622	  0.434250	 -0.231132
 -0.586990	  0.430646	 -0.211090
 -0.581857	  0.427627	 -0.189990
 -0.582200	  0.423090	 -0.170629
 -0.583325	  0.420649	 -0.151418
 -0.579779	  0.418520	 -0.131050
 -0.575369	  0.410440	 -0.111270
 -0.575354	  0.405340	 -0.094078
 -0.576475	  0.403746	 -0.073201
 -0.574809	  0.402158	 -0.053194
 -0.571807	  0.398330	 -0.033735
 -0.568948	  0.392458	 -0.014577
 -0.566844	  0.386065	  0.004032
 -0.565962	  0.380390	  0.023135
 -0.564161	  0.375521	  0.041725
 -0.565865	  0.371387	  0.063926
 -0.568809	  0.367913	  0.083036
 -0.569393	  0.360088	  0.099974
 -0.569722	  0.352248	  0.119107
 -0.568989	  0.348039	  0.139590
 -0.571510	  0.342205	  0.158284
 -0.575195	  0.332331	  0.175701
 -0.579735	  0.327668	  0.195085
 -0.581697	  0.324729	  0.213361
 -0.587253	  0.318913	  0.235068
 -0.592455	  0.311401	  0.253087
 -0.591606	  0.302173	  0.269220
 -0.591532	  0.295596	  0.288648
 -0.594958	  0.290157	  0.308613
 -0.598260	  0.284845	  0.325431
 -0.598299	  0.278058	  0.346378
 -0.599518	  0.270847	  0.366220
 -0.604045	  0.262660	  0.381532
 -0.607398	  0.253387	  0.398858
 -0.609304	  0.244554	  0.417622
 -0.610144	  0.235920	  0.435661
 -0.610982	  0.227292	  0.453685
 -0.611570	  0.218904	  0.471832
 -0.612049	  0.210623	  0.490030
 -0.612547	  0.202954	  0.507825
 -0.613083	  0.195127	  0.526721
 -0.613830	  0.188012	  0.544395
 -0.614175	  0.180188	  0.565687
 -0.612578	  0.173938	  0.581561
 -0.612888	  0.165758	  0.603874
 -0.614722	  0.157810	  0.619376
 -0.613521	  0.151809	  0.636222
 -0.613328	  0.146531	  0.661875
 -0.617078	  0.142233	  0.678576
 -0.618975	  0.135032	  0.694850
 -0.619017	  0.124382	  0.715607
 -0.621498	  0.118910	  0.732851
 -0.625095	  0.114194	  0.751417
 -0.628472	  0.105097	  0.771113
 -0.631964	  0.097644	  0.789003
 -0.637184	  0.096687	  0.809281
 -0.638657	  0.093066	  0.828732
 -0.639402	  0.087056	  0.846985
 -0.644010	  0.085015	  0.867393
 -0.646751	  0.078594	  0.887705
 -0.646868	  0.071330	  0.904184
 -0.647926	  0.067331	  0.924229
 -0.649638	  0.064881	  0.943621
 -0.654428	  0.059911	  0.964355
 -0.660783	  0.055564	  0.983597
 -0.666816	  0.055064	  1.003290
 -0.668313	  0.050948	  1.019422
 -0.669585	  0.045075	  1.041808
 -0.673494	  0.043469	  1.061469
 -0.676671	  0.042773	  1.082439
 -0.675937	  0.040019	  1.100155
 -0.671578	  0.039319	  1.120660
 -0.672250	  0.038416	  1.141602
 -0.681550	  0.033747	  1.161376
 -0.686710	  0.030698	  1.180028
 -0.686485	  0.025076	  1.197638
 -0.689089	  0.020108	  1.217504
 -0.693008	  0.020235	  1.239899
 -0.690854	  0.018818	  1.257922
 -0.691366	  0.011599	  1.277004
 -0.697649	  0.005895	  1.297046
 -0.700564	  0.007245	  1.317266
 -0.693643	  0.003763	  1.338015
 -0.692684	 -0.004561	  1.355954
 -0.698870	 -0.007915	  1.376319
 -0.703074	 -0.010130	  1.394389
 -0.702910	 -0.015662	  1.413253
 -0.702184	 -0.022970	  1.432105
 -0.703728	 -0.028761	  1.454736
 -0.702713	 -0.029036	  1.472655
 -0.702080	 -0.034233	  1.491909
 -0.702309	 -0.041551	  1.510082
 -0.699739	 -0.044932	  1.531722
 -0.697310	 -0.047731	  1.551613
 -0.700058	 -0.053954	  1.569314
 -0.701160	 -0.059228	  1.589447
 -0.700957	 -0.061022	  1.611750
 -0.696594	 -0.068604	  1.626393
 -0.691301	 -0.075685	  1.645032
 -0.690210	 -0.079688	  1.668061
 -0.693182	 -0.085940	  1.684359
 -0.693670	 -0.092121	  1.705625
 -0.687734	 -0.096149	  1.722217
 -0.682560	 -0.104154	  1.741182
 -0.679707	 -0.111824	  1.761416
 -0.679036	 -0.116725	  1.782621
 -0.676852	 -0.117962	  1.797942
 -0.673704	 -0.126167	  1.817896
 -0.671651	 -0.132832	  1.837537
 -0.669177	 -0.135238	  1.856663
 -0.666884	 -0.141186	  1.875874
 -0.665072	 -0.147412	  1.895203
 -0.663232	 -0.149386	  1.914780
 -0.661567	 -0.154828	  1.934340
 -0.660543	 -0.162921	  1.954091
 -0.659184	 -0.165390	  1.972667
 -0.657531	 -0.165503	  1.992111
 -0.656276	 -0.167817	  2.012817
 -0.655782	 -0.170697	  2.032712
 -0.655331	 -0.173693	  2.052424
 -0.655927	 -0.177857	  2.071503
 -0.657596	 -0.182524	  2.091800
 -0.661167	 -0.186627	  2.110642
 -0.662530	 -0.187300	  2.131798
 -0.659940	 -0.187250	  2.151608
 -0.657833	 -0.189146	  2.171418
 -0.658358	 -0.191608	  2.191299
 -0.660088	 -0.194592	  2.211047
 -0.659472	 -0.197099	  2.230717
 -0.657307	 -0.199654	  2.250804
 -0.657251	 -0.200171	  2.271584
 -0.660284	 -0.202895	  2.290283
 -0.660160	 -0.207121	  2.309898
 -0.657240	 -0.212006	  2.329069
 -0.655734	 -0.214407	  2.350176
 -0.659994	 -0.214401	  2.370898
 -0.661543	 -0.220276	  2.393507
 -0.661693	 -0.223124	  2.413302
 -0.661843	 -0.225972	  2.433097
