 0.0 0.0 0.0 0
 0.3396414467342834 -0.8853475317681948 -0.3169864912771643 1000
 0.9538153086497739 0.29041976344665177 -0.07256526706990574 1000
 -0.41374853575192144 -0.7277976170715229 -0.5476931419582989 1000
 0.7105152913576119 -0.62283062984851 0.32840832399547293 1000
 -0.42419399327388196 0.904322171900784 -0.037548175441772705 1000
 -0.7233858875960104 0.037768874167327965 -0.689402908153907 1000
 -0.7340315298702713 0.6174237117881942 0.28402759245889747 1000
 -0.7586472959494206 -0.4070907888583824 0.509036707885877 1000
 0.0 0.0 0.0 0
 0.40951179140416666 0.8675372957267482 0.2808863350611246 1000
 0.7255727718103573 -0.24698029761524826 -0.6424911558903501 1000
 -0.26991447878113595 0.6149160024525705 -0.7414401419346389 1000
 0.851004999784621 -0.5183737175919592 -0.0860242945421141 1000
 -0.15910772169698897 0.8418629923103103 0.5150159561360438 1000
 -0.039307312115037955 -0.9063586364937578 0.41950680240905114 1000
 -0.5565135907020581 0.8152837354021616 0.16176233848643462 1000
 0.2797349587282881 0.33227358896014153 -0.9005368481882513 1000
 0.0 0.0 0.0 0
 -0.2673359294776379 -0.9626210186832589 -0.030500413104281837 1000
 -0.47677907835234 -0.5207070006382408 -0.708132000358563 1000
 -0.23083130989958386 -0.9142512748981386 -0.33179890403250295 1000
 0.9176260642032099 0.1223748370464832 -0.37858526853639274 1000
 -0.6224534902892308 0.7627213205443498 -0.17463344357206384 1000
 0.1655581379983708 -0.9839963277085992 0.06209452470631295 1000
 -0.3318952022700704 -0.6076174301697155 0.7213942287432438 1000
 0.5775208076815005 -0.08171627255396566 0.8116853870156792 1000
 0.0 0.0 0.0 0
 0.310600234315755 0.9359104151523575 -0.16339580549187713 1000
 0.7071141836061463 0.3676593518071837 0.6036755191091769 1000
 0.06505303775484131 0.40531175157851407 -0.9120737285500683 1000
 0.006488289320951303 0.28833329568691546 0.957487238922801 1000
 -0.9476118328921227 0.1722013325446701 0.27081823282909 1000
 0.22969276364697097 0.6045081263234428 0.7625353496967447 1000
