 -0.822081	  1.380311	 -1.918889
 -0.824589	  1.386135	 -1.910152
 -0.826682	  1.390996	 -1.902861
 -0.830706	  1.401534	 -1.886560
 -0.833456	  1.412476	 -1.870152
 -0.836097	  1.424219	 -1.851751
 -0.838770	  1.434195	 -1.836255
 -0.844039	  1.442204	 -1.817697
 -0.849353	  1.451469	 -1.801248
 -0.857726	  1.459757	 -1.785714
 -0.863301	  1.478214	 -1.782521
 -0.864026	  1.487895	 -1.773460
 -0.864759	  1.525529	 -1.781840
 -0.864780	  1.526415	 -1.782190
