  2.222109	 -2.057079	 -0.107511
  2.200108	 -2.036712	 -0.106446
  2.166469	 -2.001703	 -0.094443
  2.126286	 -1.971484	 -0.082442
  2.085831	 -1.946201	 -0.063246
  2.048436	 -1.918089	 -0.047225
  2.013342	 -1.886609	 -0.035357
  1.978918	 -1.853808	 -0.018668
  1.940421	 -1.823285	 -0.002449
  1.901282	 -1.793925	  0.011440
  1.864440	 -1.766899	  0.023284
  1.828405	 -1.739938	  0.036926
  1.786334	 -1.711750	  0.047229
  1.743426	 -1.683897	  0.054625
  1.701066	 -1.653605	  0.061162
  1.661613	 -1.623184	  0.066646
  1.624501	 -1.592467	  0.071101
  1.589214	 -1.560034	  0.074362
  1.556539	 -1.523975	  0.075291
  1.527425	 -1.479920	  0.072808
  1.501694	 -1.394444	  0.064217
  1.529359	 -1.278882	  0.069896
  1.541525	 -1.267041	  0.089755
  1.544322	 -1.284572	  0.141913
  1.541347	 -1.353389	  0.263921
  1.538843	 -1.386144	  0.380132
  1.520773	 -1.365797	  0.472661
  1.471681	 -1.325912	  0.544696
  1.433764	 -1.296539	  0.572161
  1.397510	 -1.248992	  0.571010
  1.308621	 -1.145991	  0.536361
  1.176893	 -1.102040	  0.550373
  1.098060	 -1.095355	  0.570740
  1.022367	 -1.114824	  0.577456
  0.937894	 -1.155672	  0.575123
  0.898893	 -1.147530	  0.574538
  0.864789	 -1.080847	  0.565563
  0.808814	 -1.054928	  0.526805
  0.772631	 -1.030970	  0.483561
  0.749277	 -0.980210	  0.427518
  0.711491	 -0.917458	  0.345750
  0.654084	 -0.871090	  0.325628
  0.613470	 -0.835289	  0.333827
  0.571905	 -0.807366	  0.337456
  0.532185	 -0.780134	  0.348979
  0.489057	 -0.754516	  0.360404
  0.445205	 -0.729426	  0.373463
  0.404197	 -0.702122	  0.387044
  0.367908	 -0.670824	  0.404847
  0.328853	 -0.642132	  0.412234
  0.289847	 -0.612286	  0.418172
  0.251860	 -0.582640	  0.424717
  0.214268	 -0.556611	  0.436111
  0.175133	 -0.527945	  0.448561
  0.136446	 -0.497280	  0.461732
  0.097873	 -0.464766	  0.475803
  0.060962	 -0.432870	  0.489432
  0.023714	 -0.401510	  0.501430
 -0.014694	 -0.370914	  0.511383
 -0.052309	 -0.342536	  0.519701
 -0.090728	 -0.314910	  0.526949
 -0.129142	 -0.286469	  0.533706
 -0.170831	 -0.257219	  0.540357
 -0.204739	 -0.223809	  0.554684
 -0.241477	 -0.198785	  0.574389
 -0.277658	 -0.170169	  0.593934
 -0.315013	 -0.138104	  0.608248
 -0.354137	 -0.104038	  0.619388
 -0.392411	 -0.070458	  0.626201
 -0.429577	 -0.040132	  0.632099
 -0.468427	 -0.010167	  0.637875
 -0.508905	  0.019423	  0.643403
 -0.549603	  0.048290	  0.647586
 -0.590103	  0.077454	  0.651513
 -0.629672	  0.107427	  0.657118
 -0.667703	  0.137147	  0.664047
 -0.706273	  0.167683	  0.672209
 -0.745309	  0.198331	  0.681211
 -0.785588	  0.228838	  0.691647
 -0.826521	  0.258340	  0.703163
 -0.864974	  0.285775	  0.713025
 -0.905252	  0.312418	  0.721281
 -0.946347	  0.337198	  0.728349
 -0.988491	  0.363954	  0.736188
 -1.031166	  0.392350	  0.745960
 -1.072466	  0.421378	  0.756519
 -1.112611	  0.451167	  0.767924
 -1.150939	  0.480957	  0.780751
 -1.185970	  0.508654	  0.794270
 -1.223780	  0.537873	  0.809596
 -1.262367	  0.566184	  0.825517
 -1.300476	  0.593906	  0.840538
 -1.338952	  0.621797	  0.854318
 -1.377262	  0.650094	  0.868242
 -1.415619	  0.679368	  0.882350
 -1.454451	  0.709638	  0.897119
 -1.491744	  0.739017	  0.912749
 -1.529946	  0.769604	  0.928769
 -1.566190	  0.798832	  0.943134
 -1.602043	  0.827320	  0.955674
 -1.637587	  0.855592	  0.966097
 -1.675985	  0.885904	  0.976860
 -1.714421	  0.914501	  0.987460
 -1.754790	  0.944319	  0.998206
 -1.795414	  0.976422	  1.007541
 -1.835939	  1.008122	  1.014827
 -1.874342	  1.037095	  1.021179
 -1.913028	  1.064304	  1.029857
 -1.952168	  1.095009	  1.039693
 -1.993402	  1.124492	  1.046785
 -2.034065	  1.154189	  1.050317
 -2.075035	  1.180327	  1.064700
 -2.113890	  1.208443	  1.071394
 -2.152836	  1.236576	  1.085468
 -2.191858	  1.268327	  1.092788
 -2.231040	  1.298904	  1.106100
 -2.269220	  1.326272	  1.119665
 -2.303994	  1.358053	  1.128812
 -2.343415	  1.383919	  1.137160
 -2.388861	  1.407963	  1.144982
 -2.412750	  1.422042	  1.156432
