 -0.050014	 -2.198317	  1.093372
 -0.037209	 -2.220673	  1.114103
 -0.043018	 -2.210531	  1.104698
 -0.063390	 -2.179786	  1.075813
 -0.087128	 -2.149344	  1.045601
 -0.112639	 -2.120647	  1.014212
 -0.138464	 -2.096190	  0.983807
 -0.164564	 -2.076103	  0.955016
 -0.192113	 -2.058930	  0.926920
 -0.222136	 -2.043327	  0.899240
 -0.255211	 -2.027713	  0.873042
 -0.292968	 -2.009547	  0.848741
 -0.333419	 -1.988171	  0.827805
 -0.371315	 -1.964464	  0.812601
 -0.404580	 -1.938748	  0.802294
 -0.432558	 -1.911709	  0.795155
 -0.454586	 -1.885523	  0.789935
 -0.473084	 -1.858915	  0.785686
 -0.490543	 -1.828216	  0.781628
 -0.508484	 -1.789898	  0.777848
 -0.526904	 -1.741569	  0.774835
 -0.545111	 -1.683623	  0.774361
 -0.563255	 -1.616489	  0.778718
 -0.580526	 -1.544666	  0.786853
 -0.598273	 -1.463296	  0.799960
 -0.613207	 -1.382953	  0.803693
 -0.628160	 -1.296171	  0.805387
 -0.640037	 -1.211467	  0.784944
 -0.647045	 -1.138377	  0.761380
 -0.654315	 -1.054056	  0.722571
 -0.654130	 -0.978165	  0.673701
 -0.673686	 -0.913395	  0.624583
 -0.734881	 -0.868879	  0.571046
 -0.776036	 -0.838442	  0.523331
 -0.810359	 -0.816785	  0.483269
 -0.836231	 -0.798277	  0.447599
 -0.857007	 -0.780072	  0.414293
 -0.875387	 -0.758971	  0.379109
 -0.890857	 -0.735263	  0.342405
 -0.902173	 -0.711645	  0.309085
 -0.909205	 -0.690320	  0.283026
 -0.912746	 -0.672382	  0.264634
 -0.913996	 -0.658025	  0.252625
 -0.913824	 -0.642817	  0.242483
 -0.911634	 -0.619182	  0.229854
 -0.905730	 -0.581822	  0.213495
 -0.895922	 -0.531005	  0.195289
 -0.884402	 -0.467946	  0.178056
 -0.873210	 -0.394122	  0.162295
 -0.865606	 -0.313876	  0.146470
 -0.865933	 -0.231382	  0.126953
 -0.874168	 -0.148936	  0.101532
 -0.890008	 -0.067731	  0.068686
 -0.912758	  0.011022	  0.027634
 -0.942179	  0.084601	 -0.021133
 -0.978089	  0.150022	 -0.073797
 -1.020268	  0.205342	 -0.126054
 -1.070049	  0.252303	 -0.176020
 -1.131997	  0.293879	 -0.227305
 -1.205205	  0.328520	 -0.282338
 -1.285978	  0.353049	 -0.340763
 -1.368570	  0.364658	 -0.399002
 -1.444725	  0.366045	 -0.453221
 -1.507124	  0.362387	 -0.500845
 -1.552461	  0.357941	 -0.538019
 -1.582657	  0.354462	 -0.563204
 -1.602163	  0.352648	 -0.579237
 -1.616775	  0.351873	 -0.590641
 -1.630082	  0.351917	 -0.600543
 -1.644153	  0.352968	 -0.610673
 -1.659332	  0.355123	 -0.621152
 -1.676967	  0.359160	 -0.632911
 -1.695627	  0.365451	 -0.645028
 -1.717132	  0.375387	 -0.658606
 -1.740379	  0.389042	 -0.672499
 -1.765929	  0.407341	 -0.686641
 -1.794910	  0.432989	 -0.702642
 -1.826828	  0.469604	 -0.723346
 -1.856698	  0.514909	 -0.751055
 -1.880130	  0.559775	 -0.782128
 -1.898253	  0.599454	 -0.810849
 -1.917180	  0.637762	 -0.837733
 -1.938964	  0.676688	 -0.865548
 -1.963040	  0.714905	 -0.893968
 -1.988213	  0.751835	 -0.922794
 -2.013747	  0.787018	 -0.951404
 -2.039135	  0.820039	 -0.979009
 -2.090531	  0.881509	 -1.030306
 -2.092354	  0.883636	 -1.032071
