 -0.647478	  1.250615	  2.006765
 -0.654192	  1.259546	  2.014831
 -0.650586	  1.241527	  2.003209
 -0.642594	  1.229544	  1.989060
 -0.632084	  1.219779	  1.974823
 -0.619563	  1.209902	  1.962784
 -0.606358	  1.198192	  1.953057
 -0.595472	  1.186483	  1.941390
 -0.585966	  1.175806	  1.924789
 -0.579780	  1.167961	  1.905238
 -0.573651	  1.159316	  1.891352
 -0.562187	  1.148041	  1.877622
 -0.547481	  1.137132	  1.868172
 -0.532887	  1.128419	  1.856493
 -0.522550	  1.119446	  1.839879
 -0.515637	  1.111097	  1.821515
 -0.511375	  1.099074	  1.805111
 -0.504722	  1.085514	  1.792273
 -0.495629	  1.071443	  1.781385
 -0.485007	  1.057425	  1.769195
 -0.474060	  1.043363	  1.760590
 -0.463060	  1.029602	  1.750170
 -0.452621	  1.016010	  1.739588
 -0.442434	  1.002628	  1.728735
 -0.432152	  0.988813	  1.718547
 -0.421813	  0.974556	  1.709050
 -0.411469	  0.960277	  1.699613
 -0.401366	  0.945529	  1.690636
 -0.391359	  0.930616	  1.681830
 -0.381425	  0.915597	  1.673129
 -0.371758	  0.900089	  1.665003
 -0.362095	  0.884566	  1.656901
 -0.352370	  0.868743	  1.649483
 -0.342580	  0.852532	  1.643050
 -0.332784	  0.836312	  1.636654
 -0.322811	  0.819873	  1.631162
 -0.312671	  0.803208	  1.626750
 -0.302496	  0.786588	  1.622348
 -0.292195	  0.770064	  1.619102
 -0.281024	  0.752459	  1.618212
 -0.268814	  0.735796	  1.614777
 -0.257683	  0.720673	  1.606759
 -0.249506	  0.706744	  1.597283
 -0.240700	  0.689219	  1.591137
 -0.230699	  0.670670	  1.583159
 -0.221241	  0.656427	  1.574673
 -0.214377	  0.643989	  1.562944
 -0.208407	  0.626483	  1.554028
 -0.189271	  0.609170	  1.542661
 -0.175659	  0.600469	  1.531702
 -0.170348	  0.594834	  1.519045
 -0.161833	  0.586005	  1.497621
 -0.152593	  0.575148	  1.479855
 -0.144409	  0.561177	  1.470971
 -0.133782	  0.548994	  1.458858
 -0.118727	  0.541773	  1.444433
 -0.103340	  0.535070	  1.436567
 -0.084304	  0.521112	  1.424730
 -0.077508	  0.512005	  1.414766
 -0.069316	  0.502629	  1.399017
 -0.052205	  0.491770	  1.383352
 -0.040133	  0.484585	  1.374310
 -0.026393	  0.476087	  1.364969
 -0.009124	  0.466861	  1.352768
  0.001978	  0.460757	  1.340571
  0.008115	  0.454134	  1.322755
  0.017562	  0.443192	  1.302323
  0.023164	  0.433277	  1.284876
  0.024918	  0.424782	  1.271677
  0.023824	  0.415074	  1.253777
  0.025614	  0.408944	  1.232385
  0.034340	  0.404510	  1.209734
  0.039550	  0.400882	  1.195818
  0.037793	  0.397085	  1.177836
  0.035733	  0.390048	  1.159163
  0.037104	  0.382095	  1.137101
  0.038830	  0.372501	  1.116902
  0.038570	  0.367126	  1.104341
  0.037172	  0.360975	  1.084985
  0.037030	  0.355446	  1.065587
  0.033751	  0.350768	  1.044935
  0.030672	  0.347860	  1.024854
  0.024528	  0.344612	  1.006065
  0.019813	  0.337954	  0.988690
  0.016245	  0.329673	  0.970935
  0.016039	  0.319722	  0.953461
  0.019231	  0.309434	  0.936064
  0.022621	  0.301069	  0.919118
  0.023888	  0.293717	  0.900733
  0.023848	  0.283897	  0.883882
  0.023832	  0.270255	  0.869921
  0.026877	  0.251820	  0.855633
  0.033681	  0.239565	  0.841144
  0.047819	  0.231692	  0.824061
  0.058157	  0.226680	  0.809994
  0.065870	  0.217701	  0.796312
  0.071743	  0.203329	  0.780121
  0.073195	  0.186444	  0.767268
  0.077232	  0.168906	  0.755988
  0.086670	  0.153295	  0.745595
  0.098142	  0.141227	  0.737177
  0.115081	  0.122775	  0.734078
  0.122281	  0.105508	  0.728485
  0.129459	  0.086585	  0.716722
  0.141432	  0.071280	  0.711221
  0.162224	  0.055750	  0.716901
  0.173657	  0.049752	  0.719685
  0.194258	  0.038882	  0.723915
  0.210728	  0.023862	  0.729999
  0.217907	  0.009951	  0.733886
  0.235654	 -0.000996	  0.742963
  0.253400	 -0.009073	  0.753672
  0.265053	 -0.025235	  0.762288
  0.272486	 -0.041560	  0.764755
  0.291571	 -0.056012	  0.764741
  0.315435	 -0.063890	  0.767051
  0.327643	 -0.068807	  0.770886
  0.343397	 -0.079109	  0.780955
  0.357531	 -0.089307	  0.785619
  0.374331	 -0.105026	  0.788101
  0.393004	 -0.119555	  0.796172
  0.407238	 -0.128369	  0.801434
  0.420341	 -0.138493	  0.803929
  0.434314	 -0.154056	  0.806002
  0.450993	 -0.166704	  0.813366
  0.469097	 -0.174082	  0.823625
  0.483617	 -0.184157	  0.829033
  0.490727	 -0.200903	  0.828432
  0.503298	 -0.218186	  0.835544
  0.516144	 -0.232638	  0.837639
  0.527488	 -0.250379	  0.841170
  0.541088	 -0.265431	  0.848381
  0.554730	 -0.276936	  0.856104
  0.570811	 -0.287546	  0.860499
  0.586173	 -0.301419	  0.860938
  0.599966	 -0.314617	  0.854409
  0.612779	 -0.329083	  0.849051
  0.624970	 -0.344075	  0.842661
  0.637440	 -0.357367	  0.834194
  0.648018	 -0.370766	  0.825131
  0.660099	 -0.386376	  0.817232
  0.673666	 -0.400179	  0.810439
  0.685114	 -0.409704	  0.797054
  0.693165	 -0.418769	  0.778502
  0.703188	 -0.431036	  0.762783
  0.720611	 -0.440000	  0.756047
  0.739868	 -0.445600	  0.750344
  0.758793	 -0.454563	  0.743282
  0.770616	 -0.464333	  0.731881
  0.780747	 -0.471067	  0.718570
  0.798900	 -0.480575	  0.702939
  0.812902	 -0.490055	  0.695191
  0.823871	 -0.504615	  0.689840
  0.837659	 -0.523812	  0.678682
  0.842841	 -0.532837	  0.668027
  0.850618	 -0.545587	  0.652893
  0.863366	 -0.562993	  0.641218
  0.879410	 -0.571354	  0.634284
  0.896295	 -0.577801	  0.629936
  0.914269	 -0.592533	  0.617001
  0.922808	 -0.606905	  0.607035
  0.930029	 -0.619903	  0.601655
  0.940749	 -0.635935	  0.594373
  0.951320	 -0.652040	  0.585240
  0.959437	 -0.668522	  0.577570
  0.966546	 -0.685996	  0.572110
  0.970006	 -0.705464	  0.566449
  0.971011	 -0.724132	  0.562183
  0.974498	 -0.739558	  0.556838
  0.977075	 -0.758714	  0.557403
  0.976789	 -0.777751	  0.559379
  0.976035	 -0.797633	  0.562261
  0.975944	 -0.817089	  0.566369
  0.975050	 -0.835232	  0.574981
  0.974188	 -0.853220	  0.583674
  0.973266	 -0.871212	  0.592364
  0.972324	 -0.889201	  0.601053
  0.971444	 -0.907193	  0.609733
  0.973710	 -0.925233	  0.618048
  0.976933	 -0.943204	  0.626213
  0.980143	 -0.961090	  0.634493
  0.983327	 -0.978852	  0.643234
  0.986519	 -0.996634	  0.651562
  0.989602	 -1.013537	  0.661621
  0.994584	 -1.031119	  0.673025
  1.000022	 -1.049947	  0.681255
  1.005193	 -1.069064	  0.681839
  1.010346	 -1.087852	  0.682303
  1.015976	 -1.107330	  0.687088
  1.022840	 -1.125028	  0.693483
  1.032066	 -1.140966	  0.701272
  1.041334	 -1.156873	  0.709087
  1.050603	 -1.172780	  0.716902
  1.059871	 -1.188687	  0.724717
  1.069207	 -1.204537	  0.732541
  1.082119	 -1.217172	  0.741044
  1.096526	 -1.227767	  0.749924
  1.110209	 -1.238421	  0.758172
  1.124457	 -1.250823	  0.764961
  1.139705	 -1.262768	  0.769818
  1.160074	 -1.273058	  0.780950
  1.171141	 -1.278455	  0.791699
  1.184289	 -1.286049	  0.804392
  1.201607	 -1.295245	  0.815738
  1.218501	 -1.302505	  0.818451
  1.237483	 -1.310414	  0.822533
  1.254307	 -1.316913	  0.830489
  1.271083	 -1.324042	  0.835362
  1.293082	 -1.332341	  0.841674
  1.306742	 -1.337077	  0.851622
  1.321591	 -1.343254	  0.864266
  1.341481	 -1.349447	  0.876877
  1.358204	 -1.354987	  0.880630
  1.374362	 -1.361543	  0.880612
  1.394682	 -1.369571	  0.884784
  1.413637	 -1.376059	  0.886936
  1.420955	 -1.375954	  0.868363
  1.427606	 -1.375507	  0.848930
  1.434947	 -1.371790	  0.831312
  1.442813	 -1.371899	  0.813433
  1.451281	 -1.371567	  0.792965
  1.457185	 -1.371883	  0.773973
  1.465127	 -1.365831	  0.756541
  1.473576	 -1.361953	  0.739032
  1.480907	 -1.357592	  0.721359
  1.485874	 -1.350220	  0.702088
  1.488965	 -1.342830	  0.683313
  1.494867	 -1.333910	  0.665429
  1.508856	 -1.327778	  0.647830
  1.522937	 -1.328140	  0.632580
  1.533799	 -1.332525	  0.617319
  1.540173	 -1.335274	  0.596129
  1.541977	 -1.335391	  0.574267
  1.544794	 -1.334070	  0.554749
  1.553933	 -1.332757	  0.537251
  1.566134	 -1.331656	  0.518956
  1.573794	 -1.328524	  0.500479
  1.577765	 -1.317867	  0.481605
  1.582185	 -1.304423	  0.464406
  1.589129	 -1.295615	  0.447937
  1.597344	 -1.290688	  0.429359
  1.606042	 -1.286920	  0.413014
  1.615139	 -1.282445	  0.395129
  1.624794	 -1.279122	  0.377516
  1.635308	 -1.278247	  0.360203
  1.646210	 -1.279143	  0.342732
  1.656264	 -1.280637	  0.324568
  1.665407	 -1.283481	  0.310497
  1.674119	 -1.286437	  0.295643
  1.689936	 -1.286650	  0.276622
  1.696339	 -1.286928	  0.260699
  1.704348	 -1.289751	  0.243432
  1.718079	 -1.296023	  0.226529
  1.732696	 -1.297879	  0.215257
  1.745894	 -1.306194	  0.206699
  1.759689	 -1.316816	  0.197123
  1.774123	 -1.325200	  0.185386
  1.789528	 -1.338303	  0.178911
  1.804742	 -1.348411	  0.174705
  1.819022	 -1.355090	  0.165368
  1.831498	 -1.365464	  0.154972
  1.846081	 -1.375700	  0.145623
  1.856919	 -1.390134	  0.139135
  1.865565	 -1.406067	  0.132625
  1.875852	 -1.424108	  0.127530
  1.887391	 -1.438757	  0.124118
  1.899646	 -1.450923	  0.117271
  1.909592	 -1.466805	  0.109558
  1.916991	 -1.488063	  0.107697
  1.929553	 -1.506551	  0.109281
  1.941308	 -1.518569	  0.104481
  1.951400	 -1.532357	  0.094803
  1.962003	 -1.547038	  0.084722
  1.970300	 -1.564427	  0.076648
  1.982043	 -1.579321	  0.068526
  1.991215	 -1.595721	  0.060231
  2.000771	 -1.611263	  0.051236
  2.014306	 -1.624110	  0.041629
  2.034737	 -1.630984	  0.031240
  2.045335	 -1.644755	  0.021338
