  0.041445	  1.371330	  2.089913
  0.041445	  1.371330	  2.089913
  0.051602	  1.361984	  2.075441
  0.061562	  1.354618	  2.059750
  0.071312	  1.348739	  2.043311
  0.081462	  1.343152	  2.027020
  0.093682	  1.338970	  2.011761
  0.105989	  1.334832	  1.996548
  0.117647	  1.329480	  1.981208
  0.129094	  1.323305	  1.966010
  0.140862	  1.317046	  1.951085
  0.151974	  1.309862	  1.936150
  0.164343	  1.302432	  1.922781
  0.178348	  1.293483	  1.910547
  0.190980	  1.285195	  1.897385
  0.205187	  1.281503	  1.883880
  0.220138	  1.275243	  1.870687
  0.233608	  1.263300	  1.858357
  0.244886	  1.255064	  1.847125
  0.258104	  1.251457	  1.828494
  0.259923	  1.248208	  1.804631
  0.259883	  1.242684	  1.779051
  0.266245	  1.234493	  1.761922
  0.276373	  1.228081	  1.748080
  0.286732	  1.220978	  1.735583
  0.302128	  1.213223	  1.716250
  0.316112	  1.209789	  1.700023
  0.323872	  1.207073	  1.689628
  0.337066	  1.203119	  1.670117
  0.346387	  1.197059	  1.650263
  0.349697	  1.192471	  1.635779
  0.351310	  1.185526	  1.613154
  0.356817	  1.180540	  1.585816
  0.361401	  1.177703	  1.574760
  0.370791	  1.171874	  1.558480
  0.387884	  1.157944	  1.545076
  0.403468	  1.149304	  1.536271
  0.417957	  1.147152	  1.519182
  0.424263	  1.146136	  1.498037
  0.426771	  1.142180	  1.478797
  0.432223	  1.136932	  1.459515
  0.438901	  1.131390	  1.441079
  0.444814	  1.125961	  1.422690
  0.449192	  1.122104	  1.403755
  0.455453	  1.118597	  1.385024
  0.462156	  1.114869	  1.366536
  0.469087	  1.111033	  1.348191
  0.476119	  1.107200	  1.329855
  0.483035	  1.103527	  1.311450
  0.490441	  1.100130	  1.293159
  0.498083	  1.096960	  1.274873
  0.505372	  1.093938	  1.256404
  0.512077	  1.091134	  1.237706
  0.517625	  1.088191	  1.218888
  0.522578	  1.082406	  1.200742
  0.528039	  1.075625	  1.182640
  0.532324	  1.067397	  1.164895
  0.536015	  1.058348	  1.147436
  0.539869	  1.049300	  1.130031
  0.545454	  1.040677	  1.112912
  0.550716	  1.031175	  1.096150
  0.556211	  1.020876	  1.079849
  0.562697	  1.011088	  1.064540
  0.569374	  0.999936	  1.050348
  0.576642	  0.989157	  1.031714
  0.587333	  0.982622	  1.011432
  0.594310	  0.979256	  0.997155
  0.608902	  0.972419	  0.982892
  0.622616	  0.966475	  0.963504
  0.631134	  0.966018	  0.945767
  0.638010	  0.966772	  0.924900
  0.644094	  0.965794	  0.908640
  0.652328	  0.963540	  0.893632
  0.668369	  0.960074	  0.875686
  0.678658	  0.959717	  0.857560
  0.684229	  0.960751	  0.841438
  0.690571	  0.959452	  0.818702
  0.697488	  0.957897	  0.802610
  0.712083	  0.955954	  0.786444
  0.728916	  0.956608	  0.766450
  0.737284	  0.959373	  0.754296
  0.742009	  0.965203	  0.740018
  0.745649	  0.973020	  0.708699
  0.744225	  0.975966	  0.684206
  0.742158	  0.977414	  0.671249
  0.739023	  0.968012	  0.650432
  0.729937	  0.961746	  0.626694
  0.724094	  0.961784	  0.614373
  0.720597	  0.964156	  0.604971
  0.718025	  0.971105	  0.582047
  0.700961	  0.975886	  0.542984
  0.694031	  0.983588	  0.533582
  0.687165	  0.984315	  0.527506
  0.679911	  0.993130	  0.520563
  0.654221	  1.000139	  0.500939
  0.641368	  1.006649	  0.488515
  0.629589	  1.012216	  0.475707
  0.621828	  1.014488	  0.464252
  0.610962	  1.014119	  0.445562
  0.597925	  1.016817	  0.426326
  0.589302	  1.024161	  0.410015
  0.582739	  1.028887	  0.396813
  0.576266	  1.032966	  0.374961
  0.568765	  1.034412	  0.355233
  0.563622	  1.037520	  0.343734
  0.550760	  1.047591	  0.318645
  0.543408	  1.049376	  0.300844
  0.537208	  1.055779	  0.288685
  0.528825	  1.053782	  0.272748
  0.515774	  1.058401	  0.243569
  0.510169	  1.061928	  0.232470
  0.500652	  1.064504	  0.219090
  0.486252	  1.063738	  0.194802
  0.478363	  1.065297	  0.177407
  0.476360	  1.065432	  0.161856
  0.473066	  1.068202	  0.139218
  0.471684	  1.072154	  0.118584
  0.470631	  1.070588	  0.096567
  0.468066	  1.073320	  0.077277
  0.466491	  1.074703	  0.062035
  0.469506	  1.076653	  0.041758
  0.470147	  1.080548	  0.017225
  0.470306	  1.083941	  0.004429
  0.469561	  1.089618	 -0.015536
  0.465751	  1.093092	 -0.040492
  0.466321	  1.093030	 -0.050799
  0.474147	  1.092500	 -0.080250
  0.474890	  1.091362	 -0.105955
  0.475904	  1.082762	 -0.123435
  0.479340	  1.074784	 -0.140743
  0.482777	  1.063915	 -0.169014
  0.487261	  1.059475	 -0.188021
  0.500599	  1.046734	 -0.197567
  0.512812	  1.030272	 -0.207524
  0.530774	  1.015294	 -0.210007
  0.543494	  1.007805	 -0.222774
  0.559354	  1.000268	 -0.228104
  0.573957	  0.984724	 -0.246960
  0.593902	  0.979022	 -0.255317
  0.594617	  0.966338	 -0.263707
  0.617029	  0.964968	 -0.278844
  0.632528	  0.960373	 -0.295794
  0.646268	  0.957379	 -0.308579
  0.658026	  0.946240	 -0.323621
  0.668489	  0.937775	 -0.333418
  0.690706	  0.927743	 -0.343032
  0.709276	  0.920781	 -0.346854
  0.722491	  0.914036	 -0.350557
  0.738879	  0.899730	 -0.361993
  0.751265	  0.885273	 -0.371521
  0.764869	  0.870759	 -0.374070
  0.783878	  0.857179	 -0.374944
  0.798026	  0.845824	 -0.372020
  0.814782	  0.833572	 -0.372873
  0.833348	  0.816978	 -0.373180
  0.847915	  0.804818	 -0.372625
  0.862594	  0.792983	 -0.367169
  0.877526	  0.780733	 -0.361843
  0.897170	  0.764086	 -0.351591
  0.912726	  0.751245	 -0.346774
  0.917927	  0.747783	 -0.346922
  0.937393	  0.725511	 -0.343109
  0.951751	  0.709292	 -0.343473
  0.963645	  0.702588	 -0.343328
  0.982556	  0.689749	 -0.347977
  1.007426	  0.676103	 -0.338643
  1.019430	  0.670616	 -0.330523
  1.037747	  0.665440	 -0.319203
  1.053988	  0.658267	 -0.314925
  1.070596	  0.650199	 -0.313792
  1.096687	  0.637433	 -0.307346
  1.104534	  0.634100	 -0.304297
  1.119276	  0.626098	 -0.300586
  1.140433	  0.624038	 -0.305575
  1.156489	  0.629832	 -0.319460
  1.167633	  0.635247	 -0.337977
  1.178689	  0.633956	 -0.352999
  1.192205	  0.624214	 -0.366490
  1.206506	  0.608814	 -0.386842
  1.213698	  0.605070	 -0.404620
  1.217988	  0.605340	 -0.420449
  1.223333	  0.607759	 -0.443452
  1.230370	  0.607354	 -0.462015
  1.237942	  0.606125	 -0.476957
  1.250774	  0.604685	 -0.494133
  1.264321	  0.602052	 -0.510263
  1.274106	  0.597448	 -0.522164
  1.287856	  0.592304	 -0.541323
  1.299959	  0.589851	 -0.561898
  1.307027	  0.590748	 -0.573678
  1.318151	  0.592089	 -0.593045
  1.330000	  0.592471	 -0.608687
  1.344697	  0.590472	 -0.624787
  1.358502	  0.586791	 -0.637183
  1.369809	  0.582614	 -0.652503
  1.382920	  0.578207	 -0.670870
  1.393848	  0.575142	 -0.686991
  1.402762	  0.571941	 -0.699340
  1.414200	  0.565266	 -0.719511
  1.422311	  0.560102	 -0.732483
  1.429749	  0.554611	 -0.757054
  1.434481	  0.549762	 -0.779831
  1.438111	  0.545856	 -0.791478
  1.448082	  0.536746	 -0.811112
  1.461776	  0.525981	 -0.828984
  1.468668	  0.520337	 -0.838606
  1.481385	  0.513607	 -0.854720
  1.493153	  0.508152	 -0.872323
  1.500953	  0.503392	 -0.887071
  1.510668	  0.497223	 -0.905417
  1.520724	  0.490730	 -0.922885
  1.527831	  0.484340	 -0.936994
  1.533489	  0.474811	 -0.952291
  1.541545	  0.462230	 -0.970419
  1.556703	  0.452051	 -0.989115
  1.566288	  0.449373	 -1.000116
  1.578355	  0.450122	 -1.011861
  1.591780	  0.453677	 -1.029669
  1.601808	  0.451418	 -1.055992
  1.603994	  0.446188	 -1.077053
  1.605704	  0.442070	 -1.092880
  1.611072	  0.437401	 -1.113500
  1.618418	  0.434037	 -1.132077
  1.626537	  0.428930	 -1.151854
  1.636709	  0.420347	 -1.166496
  1.645396	  0.413696	 -1.178814
  1.659687	  0.403330	 -1.192516
  1.674037	  0.395170	 -1.212364
  1.681334	  0.391700	 -1.228018
  1.687276	  0.387906	 -1.244621
  1.694741	  0.381545	 -1.263111
  1.706942	  0.375035	 -1.279365
  1.719281	  0.367922	 -1.294058
  1.723734	  0.358165	 -1.311856
  1.728588	  0.347481	 -1.326340
  1.739945	  0.333638	 -1.338591
  1.747790	  0.328283	 -1.357597
  1.750878	  0.331257	 -1.386453
  1.755418	  0.329656	 -1.405622
  1.762272	  0.322038	 -1.416876
  1.772524	  0.308056	 -1.425056
  1.786735	  0.289572	 -1.448803
  1.792502	  0.283791	 -1.464633
  1.795624	  0.280268	 -1.474983
  1.802281	  0.274080	 -1.497051
  1.804581	  0.273624	 -1.526137
  1.803959	  0.273910	 -1.549268
  1.805044	  0.273407	 -1.562631
  1.810674	  0.267680	 -1.583425
  1.819851	  0.263421	 -1.597473
  1.832580	  0.262027	 -1.614926
  1.852196	  0.251456	 -1.660163
  1.852450	  0.251233	 -1.660762
