 -1.558473	 -0.434587	 -1.869521
 -1.555324	 -0.437739	 -1.879789
 -1.557615	 -0.436042	 -1.862985
 -1.561643	 -0.428333	 -1.835817
 -1.567714	 -0.421397	 -1.822112
 -1.574559	 -0.415343	 -1.807298
 -1.580745	 -0.408823	 -1.786463
 -1.589545	 -0.401589	 -1.771295
 -1.600411	 -0.393111	 -1.755049
 -1.607201	 -0.387106	 -1.737320
 -1.615844	 -0.381643	 -1.721343
 -1.627587	 -0.373207	 -1.703775
 -1.632405	 -0.368700	 -1.685138
 -1.634070	 -0.368429	 -1.666796
 -1.638752	 -0.363995	 -1.643486
 -1.647856	 -0.354476	 -1.626270
 -1.660160	 -0.344523	 -1.613206
 -1.669154	 -0.341916	 -1.600005
 -1.676795	 -0.339873	 -1.578514
 -1.683107	 -0.337930	 -1.559269
 -1.691545	 -0.333580	 -1.541397
 -1.699941	 -0.329079	 -1.523807
 -1.708289	 -0.325135	 -1.506065
 -1.716632	 -0.321255	 -1.488307
 -1.724968	 -0.317377	 -1.470546
 -1.732562	 -0.315245	 -1.452168
 -1.740068	 -0.313292	 -1.433733
 -1.747574	 -0.311339	 -1.415298
 -1.755014	 -0.310199	 -1.396768
 -1.762432	 -0.309165	 -1.378234
 -1.769315	 -0.305563	 -1.360317
 -1.775014	 -0.300485	 -1.345065
 -1.784845	 -0.289336	 -1.327349
 -1.797134	 -0.279123	 -1.306921
 -1.802397	 -0.277747	 -1.291271
 -1.808920	 -0.276894	 -1.273489
 -1.818630	 -0.272533	 -1.256020
 -1.826160	 -0.271330	 -1.238547
 -1.836664	 -0.269765	 -1.217297
 -1.848029	 -0.262653	 -1.203878
 -1.860906	 -0.252172	 -1.194348
 -1.877457	 -0.241354	 -1.178227
 -1.887510	 -0.239895	 -1.161802
 -1.897096	 -0.240151	 -1.146546
 -1.910207	 -0.236563	 -1.130148
 -1.920857	 -0.236347	 -1.114039
 -1.933125	 -0.237217	 -1.094614
 -1.945702	 -0.232640	 -1.080432
 -1.959523	 -0.224438	 -1.071368
 -1.976811	 -0.214429	 -1.057806
 -1.989837	 -0.210893	 -1.040400
 -1.998741	 -0.212186	 -1.026967
 -2.012857	 -0.209421	 -1.010633
 -2.024398	 -0.208793	 -0.993871
 -2.034499	 -0.211004	 -0.975754
 -2.045969	 -0.208940	 -0.958793
 -2.057212	 -0.204309	 -0.945627
 -2.068797	 -0.201215	 -0.926873
 -2.080165	 -0.196346	 -0.906094
 -2.088423	 -0.190494	 -0.893974
 -2.097568	 -0.185982	 -0.881851
 -2.108043	 -0.179380	 -0.861943
 -2.113369	 -0.173413	 -0.843149
 -2.118366	 -0.167563	 -0.824681
 -2.122378	 -0.161751	 -0.805970
 -2.125343	 -0.155991	 -0.787048
 -2.128307	 -0.150231	 -0.768127
 -2.132319	 -0.144494	 -0.749392
 -2.136489	 -0.138756	 -0.730694
 -2.140825	 -0.132923	 -0.712065
 -2.145601	 -0.126881	 -0.693875
 -2.146794	 -0.119522	 -0.675804
 -2.148519	 -0.111127	 -0.656866
 -2.158991	 -0.102832	 -0.635925
 -2.167335	 -0.098266	 -0.621275
 -2.170535	 -0.094628	 -0.603776
 -2.175893	 -0.085131	 -0.583162
 -2.190520	 -0.080509	 -0.563800
 -2.202680	 -0.083720	 -0.552245
 -2.216321	 -0.085206	 -0.533946
 -2.224142	 -0.080225	 -0.516430
 -2.227494	 -0.070903	 -0.498424
 -2.236780	 -0.061369	 -0.477742
 -2.248263	 -0.060185	 -0.464394
 -2.260280	 -0.065009	 -0.451244
 -2.277915	 -0.064055	 -0.431210
 -2.290424	 -0.056924	 -0.417881
 -2.301485	 -0.050576	 -0.407383
 -2.311527	 -0.044121	 -0.387292
 -2.315012	 -0.039225	 -0.363826
 -2.318470	 -0.040303	 -0.343086
 -2.326774	 -0.044282	 -0.326833
 -2.336135	 -0.044302	 -0.308174
 -2.343594	 -0.040693	 -0.290491
 -2.351219	 -0.035960	 -0.273414
 -2.356263	 -0.031426	 -0.251657
 -2.360683	 -0.026714	 -0.230866
 -2.364620	 -0.021975	 -0.218338
 -2.373436	 -0.013153	 -0.200616
 -2.382695	 -0.010697	 -0.183975
 -2.395071	 -0.013909	 -0.156707
 -2.395814	 -0.015014	 -0.141073
 -2.394206	 -0.012255	 -0.119570
 -2.393496	 -0.005108	 -0.097348
 -2.399272	  0.001681	 -0.080162
 -2.410540	  0.006329	 -0.064928
 -2.419381	  0.012561	 -0.046901
 -2.427967	  0.016738	 -0.028312
 -2.439143	  0.019114	 -0.012448
 -2.447768	  0.022884	  0.005628
 -2.455433	  0.027127	  0.023615
 -2.466764	  0.030143	  0.039446
 -2.477393	  0.033262	  0.058267
 -2.479810	  0.038938	  0.078169
 -2.488068	  0.042902	  0.095947
