 -0.811188	  2.295315	  0.617188
 -0.811303	  2.295700	  0.617509
 -0.800842	  2.260527	  0.588199
 -0.792500	  2.226086	  0.559637
 -0.785504	  2.191322	  0.530136
 -0.779213	  2.155321	  0.498603
 -0.771688	  2.115948	  0.462373
 -0.760136	  2.073658	  0.423174
 -0.744048	  2.030084	  0.385625
 -0.723636	  1.985863	  0.351618
 -0.699630	  1.941739	  0.322533
 -0.674680	  1.898655	  0.299516
 -0.650296	  1.856274	  0.282049
 -0.628011	  1.815604	  0.269645
 -0.608204	  1.776184	  0.261038
 -0.590562	  1.737001	  0.254934
 -0.576070	  1.699830	  0.250693
 -0.564150	  1.662714	  0.247071
 -0.553740	  1.621427	  0.242983
 -0.544834	  1.571622	  0.238204
 -0.537506	  1.509118	  0.232207
 -0.531702	  1.442032	  0.225601
 -0.527014	  1.376048	  0.215564
 -0.522238	  1.312093	  0.202623
 -0.516667	  1.252041	  0.187665
 -0.510909	  1.197234	  0.171235
 -0.505124	  1.145336	  0.152345
 -0.500063	  1.096767	  0.130054
 -0.496117	  1.051949	  0.103422
 -0.493088	  1.012895	  0.073091
 -0.491250	  0.978992	  0.040169
 -0.489176	  0.946831	 -0.000223
 -0.483979	  0.916940	 -0.052315
 -0.472193	  0.891631	 -0.115511
 -0.454917	  0.865900	 -0.174499
 -0.438377	  0.851957	 -0.229722
 -0.421842	  0.846473	 -0.286975
 -0.405627	  0.846852	 -0.348629
 -0.391238	  0.851937	 -0.415031
 -0.376449	  0.838144	 -0.482175
 -0.364035	  0.811245	 -0.538689
 -0.353400	  0.777656	 -0.583597
 -0.345167	  0.742085	 -0.619003
 -0.338417	  0.703384	 -0.649204
 -0.332808	  0.662932	 -0.675577
 -0.328294	  0.621784	 -0.699428
 -0.324664	  0.580193	 -0.722147
 -0.320418	  0.535615	 -0.746439
 -0.312715	  0.487104	 -0.774127
 -0.299405	  0.432869	 -0.806873
 -0.277178	  0.366516	 -0.846522
 -0.244307	  0.290845	 -0.887033
 -0.206896	  0.216936	 -0.919903
 -0.176824	  0.161936	 -0.941312
 -0.160770	  0.132642	 -0.953711
 -0.156240	  0.123932	 -0.958331
 -0.152057	  0.113321	 -0.967829
 -0.146136	  0.094795	 -0.988821
 -0.140056	  0.069460	 -1.025268
 -0.137215	  0.041391	 -1.077338
 -0.137782	  0.012618	 -1.137951
 -0.138163	 -0.016900	 -1.197327
 -0.136559	 -0.047297	 -1.249615
 -0.132685	 -0.080919	 -1.297536
 -0.125855	 -0.118618	 -1.342314
 -0.116318	 -0.159037	 -1.382973
 -0.104771	 -0.200736	 -1.419705
 -0.091260	 -0.242785	 -1.453989
 -0.075898	 -0.283254	 -1.486414
 -0.059467	 -0.322469	 -1.517349
 -0.042726	 -0.360478	 -1.546847
 -0.026275	 -0.396851	 -1.575399
 -0.010339	 -0.431918	 -1.604543
  0.004648	 -0.465812	 -1.634604
  0.018619	 -0.500220	 -1.665720
  0.031446	 -0.535689	 -1.696482
  0.042952	 -0.572462	 -1.725778
  0.052899	 -0.610028	 -1.752977
  0.060709	 -0.647616	 -1.778176
  0.066120	 -0.686147	 -1.802299
  0.069887	 -0.728263	 -1.826450
  0.074105	 -0.773294	 -1.851567
  0.080389	 -0.819669	 -1.878500
  0.088420	 -0.865458	 -1.905180
  0.097979	 -0.910642	 -1.931591
  0.109394	 -0.955392	 -1.958560
  0.123001	 -0.999664	 -1.986530
  0.137523	 -1.039849	 -2.013532
  0.149743	 -1.075644	 -2.039721
  0.160244	 -1.111486	 -2.068255
  0.171409	 -1.149095	 -2.101286
  0.183713	 -1.185077	 -2.135282
  0.201466	 -1.232835	 -2.189121
  0.209003	 -1.248279	 -2.210191
