  1.117481	  0.942143	 -2.654148
  1.106416	  0.932815	 -2.627870
  1.075784	  0.963994	 -2.599309
  1.035977	  0.990300	 -2.583533
  1.006416	  1.015368	 -2.553589
  0.966946	  1.039695	 -2.534086
  0.929764	  1.062315	 -2.514469
  0.894749	  1.089680	 -2.489586
  0.852411	  1.107109	 -2.470458
  0.816381	  1.136976	 -2.450493
  0.777554	  1.159184	 -2.428048
  0.742152	  1.181366	 -2.409030
  0.704121	  1.206726	 -2.386838
  0.666689	  1.231804	 -2.365854
  0.626690	  1.260629	 -2.346920
  0.588324	  1.287721	 -2.322601
  0.552587	  1.314616	 -2.298926
  0.521543	  1.340826	 -2.280080
  0.482874	  1.364163	 -2.254726
  0.447993	  1.389382	 -2.231173
  0.412669	  1.412031	 -2.205559
  0.375356	  1.432013	 -2.181566
  0.335313	  1.456885	 -2.165095
  0.300131	  1.481101	 -2.142215
  0.262495	  1.501583	 -2.119492
  0.222648	  1.527966	 -2.095545
  0.188549	  1.558811	 -2.075937
  0.151273	  1.579615	 -2.056398
  0.119942	  1.609928	 -2.031428
  0.078587	  1.638909	 -2.009374
  0.041305	  1.664657	 -1.988277
  0.005495	  1.689350	 -1.967580
 -0.031959	  1.715492	 -1.946090
 -0.067980	  1.741260	 -1.925189
 -0.102633	  1.766888	 -1.904701
 -0.136344	  1.792774	 -1.884106
 -0.171594	  1.820502	 -1.861850
 -0.202642	  1.845439	 -1.841127
 -0.239619	  1.873578	 -1.815206
 -0.273415	  1.897938	 -1.791132
 -0.307896	  1.922801	 -1.767419
 -0.344508	  1.949295	 -1.744458
 -0.383227	  1.975725	 -1.721308
 -0.421765	  1.999491	 -1.699403
 -0.456467	  2.021317	 -1.681460
 -0.497080	  2.048750	 -1.662001
 -0.538348	  2.072839	 -1.642609
 -0.575609	  2.091824	 -1.619266
 -0.617505	  2.117194	 -1.600827
 -0.652662	  2.143302	 -1.577343
 -0.686815	  2.164248	 -1.557102
 -0.723185	  2.187849	 -1.537046
 -0.763195	  2.215817	 -1.511551
 -0.799602	  2.243523	 -1.486694
 -0.834194	  2.271528	 -1.463379
 -0.868918	  2.298085	 -1.440580
 -0.903356	  2.323488	 -1.417376
 -0.941102	  2.347719	 -1.394155
 -0.977824	  2.368269	 -1.375549
 -1.014399	  2.390122	 -1.355829
 -1.055283	  2.408778	 -1.335773
 -1.094151	  2.432499	 -1.308711
 -1.134429	  2.457777	 -1.293214
 -1.145773	  2.482355	 -1.306146
