 0.0 0.0 0.0 0
 0.04012958345435022 -0.9181296344806804 0.45101087574134086 1000
 0.7929111724514502 0.014437171762664375 0.5194525372482339 1000
 0.8033081821450307 0.0534084940671421 -0.6162679420367825 1000
 0.07851035359141056 -0.69687672393808 -0.6132024242870497 1000
 0.5737885716682007 0.6568699314301483 -0.5568955395979408 1000
 -0.35355840334498634 -0.36932275831810596 -0.7518872186113443 1000
 -0.9986059608919793 -0.05142108552699581 0.08362712471549416 1000
 0.5918217608101669 -0.6433556823674613 -0.43934122421314414 1000
 0.0 0.0 0.0 0
 0.29847469408688854 0.9540753170887724 -0.12281248221258773 1000
 -0.8993350978312328 0.3711315169382584 -0.18999166567065595 1000
 -0.5043304542621889 -0.2981860697293744 0.8225383796949987 1000
 0.8695006979525419 0.4334886249910852 -0.3211654771309491 1000
 -0.06519123673968066 0.23903594104085485 0.8947306711798636 1000
 0.7304204384892684 -0.30367285822409285 -0.5967095384697958 1000
 -0.237550126235023 -0.08000131546643918 -0.8877502261669616 1000
 -0.33236964036616945 -0.5868746382716348 0.7692018039195716 1000
 0.0 0.0 0.0 0
 0.1708680376749661 -0.9800860686496663 0.17523734483910716 1000
 -0.9408527130804349 -0.1313080102556045 0.3678848553059711 1000
 0.15817236032672352 0.5763625566113064 0.6921394973967595 1000
 -0.8748192847188735 -0.48002795203950144 0.04575735558132987 1000
 0.5856002792298514 0.6629512997772999 0.34040544237468473 1000
 0.013907027249067214 0.8558079892333432 0.4084526112345165 1000
 0.4262041269077503 0.8796852303851499 0.08865598468233679 1000
 -0.14433901709721578 0.01718398068952104 0.9388551271945079 1000
 0.0 0.0 0.0 0
 -0.3689901605910598 0.9287554113718481 -0.021737543921947322 1000
 0.9705775055348609 -0.09466176043809735 -0.2625225861510314 1000
 -0.468659937523194 -0.8584156039078364 0.3029751949078545 1000
 0.4228541404241646 0.5688309948834452 0.583763522104191 1000
 0.8193742525470853 -0.5641533172162569 0.09251513937827074 1000
 0.546507733485204 0.493780492274416 -0.7167776470578202 1000
 -0.17491060013525372 0.12657124214988283 -0.9182703296536092 1000
 0.7501313089240315 0.5796042426057613 0.19614728981171442 1000
 0.0 0.0 0.0 0
 -0.8700271534977959 0.1525022247040012 -0.3972440366248158 1000
 0.36942878569788773 0.7294848721890813 -0.6313806579283054 1000
 0.11951256129185267 -0.9160175579463574 -0.2853376883896498 1000
 0.30306355609540175 0.16782076897032916 -0.9175429459193758 1000
 0.9034731755383072 0.14998547180312105 0.30377746173686054 1000
 0.4137396968495338 0.09382438302097024 0.815958098467731 1000
 -0.6215778937419324 0.22050209995433645 0.7280108228089126 1000
 -0.6565010915621712 0.7127391530783329 0.21104782111963452 1000
 0.0 0.0 0.0 0
 0.23147016202879306 -0.4124311554153425 -0.807253070660871 1000
 0.2514309656474156 0.9521503584725275 0.059700030100373586 1000
