  0.107310	  2.477388	  0.335431
  0.119632	  2.508332	  0.323601
  0.112331	  2.489377	  0.333834
  0.104522	  2.474497	  0.338496
  0.098833	  2.456333	  0.343213
  0.092733	  2.437630	  0.352050
  0.084481	  2.421962	  0.357481
  0.078090	  2.404203	  0.362368
  0.072264	  2.384143	  0.372679
  0.065017	  2.367965	  0.381980
  0.059302	  2.352405	  0.388290
  0.057683	  2.335382	  0.398386
  0.056670	  2.317526	  0.408420
  0.055847	  2.298915	  0.417047
  0.056067	  2.280313	  0.426115
  0.056675	  2.266513	  0.442079
  0.056338	  2.256448	  0.459104
  0.056453	  2.250440	  0.478132
  0.057500	  2.248438	  0.498222
  0.059298	  2.249745	  0.518335
  0.060210	  2.252532	  0.538118
  0.060960	  2.255580	  0.557870
  0.061323	  2.258165	  0.577699
  0.061108	  2.260055	  0.597608
  0.060887	  2.261938	  0.617518
  0.059971	  2.262937	  0.637472
  0.058679	  2.263454	  0.657423
  0.057687	  2.264094	  0.677239
  0.057270	  2.265229	  0.696638
  0.055735	  2.267746	  0.718226
  0.052806	  2.271489	  0.737872
  0.048579	  2.270053	  0.756255
  0.046915	  2.270976	  0.775647
  0.043314	  2.273338	  0.797434
  0.038580	  2.272647	  0.815393
  0.036322	  2.271959	  0.834905
  0.033566	  2.274096	  0.856320
  0.027008	  2.275066	  0.876842
  0.022967	  2.272762	  0.893910
  0.020133	  2.270657	  0.913353
  0.016719	  2.269147	  0.933827
  0.013117	  2.268001	  0.953635
  0.009554	  2.266890	  0.973284
  0.005936	  2.265139	  0.992876
  0.002306	  2.263234	  1.012451
 -0.001412	  2.261193	  1.031996
 -0.005326	  2.258848	  1.051453
 -0.008634	  2.257119	  1.070964
 -0.011664	  2.255872	  1.090997
 -0.015120	  2.254115	  1.110874
 -0.020363	  2.251273	  1.129817
 -0.025666	  2.249144	  1.148483
 -0.030257	  2.247815	  1.168190
 -0.034463	  2.246788	  1.188147
 -0.039883	  2.246391	  1.215632
 -0.043711	  2.246244	  1.235262
