  0.817530	  1.517057	  1.869003
  0.807242	  1.506314	  1.895805
  0.813954	  1.513324	  1.878318
  0.819600	  1.519887	  1.860288
  0.824976	  1.526334	  1.842136
  0.830356	  1.532783	  1.823984
  0.834303	  1.538489	  1.805226
  0.837831	  1.543973	  1.786319
  0.841363	  1.549458	  1.767412
  0.844095	  1.554688	  1.748303
  0.846687	  1.559872	  1.729161
  0.849182	  1.565036	  1.710001
  0.851056	  1.570066	  1.690735
  0.852931	  1.575096	  1.671468
  0.854468	  1.580084	  1.652162
  0.855579	  1.585017	  1.632811
  0.856689	  1.589950	  1.613461
  0.857246	  1.595089	  1.594141
  0.857554	  1.600320	  1.574839
  0.857939	  1.605667	  1.555571
  0.859142	  1.612208	  1.536710
  0.860348	  1.618754	  1.517850
  0.862668	  1.626637	  1.499703
  0.864260	  1.634861	  1.481787
  0.864733	  1.644849	  1.463905
  0.866476	  1.655790	  1.446188
  0.873603	  1.664166	  1.429947
  0.880870	  1.672590	  1.414287
  0.887385	  1.687025	  1.397395
  0.895309	  1.696704	  1.382430
  0.903196	  1.705650	  1.367433
  0.904570	  1.717039	  1.350554
  0.908825	  1.728000	  1.333098
  0.913925	  1.740993	  1.318623
  0.918843	  1.750819	  1.303237
  0.924820	  1.760088	  1.285806
  0.929426	  1.774369	  1.271331
  0.937047	  1.786571	  1.258035
  0.945897	  1.794887	  1.243269
  0.952576	  1.804592	  1.224872
  0.959561	  1.813291	  1.209424
  0.965011	  1.826747	  1.193943
  0.967574	  1.839397	  1.178106
  0.973596	  1.846439	  1.161384
  0.983223	  1.855569	  1.145083
  0.985071	  1.869267	  1.129062
  0.987375	  1.876596	  1.111480
  0.995794	  1.884995	  1.093455
  1.002492	  1.896712	  1.077597
  1.003924	  1.903990	  1.060387
  1.009500	  1.909808	  1.042564
  1.017779	  1.916518	  1.025082
  1.023791	  1.922123	  1.003977
  1.026273	  1.929188	  0.986624
  1.031056	  1.938531	  0.969690
  1.037025	  1.946946	  0.953357
  1.042667	  1.954412	  0.934926
  1.047894	  1.961332	  0.916885
  1.053164	  1.968212	  0.898860
  1.058654	  1.974936	  0.880842
  1.064143	  1.981660	  0.862824
  1.069941	  1.987710	  0.844664
  1.075801	  1.993622	  0.826479
  1.081466	  1.999528	  0.808230
  1.086124	  2.005392	  0.789685
  1.090782	  2.011257	  0.771140
  1.095283	  2.017270	  0.752605
  1.097761	  2.025088	  0.734363
  1.100238	  2.032909	  0.716123
  1.102713	  2.040735	  0.697886
  1.104002	  2.050843	  0.681296
  1.105294	  2.062395	  0.664463
  1.106138	  2.075091	  0.649631
  1.107428	  2.086945	  0.631155
  1.110778	  2.097551	  0.616508
  1.113032	  2.109789	  0.600772
  1.115525	  2.123269	  0.585655
  1.118600	  2.134401	  0.570127
  1.121739	  2.147887	  0.554439
  1.123063	  2.159825	  0.538565
  1.126226	  2.170473	  0.522013
  1.130130	  2.181630	  0.505282
  1.133895	  2.189066	  0.487443
  1.137669	  2.198856	  0.469783
  1.140476	  2.208940	  0.452634
  1.142661	  2.218778	  0.435706
  1.145631	  2.232371	  0.419527
  1.152150	  2.249438	  0.380370
  1.155290	  2.259387	  0.363306
