  1.453541	  0.380716	 -1.955519
  1.462512	  0.384629	 -1.990759
  1.459278	  0.383218	 -1.978057
  1.441424	  0.380927	 -1.930294
  1.425333	  0.382133	 -1.881491
  1.413065	  0.382446	 -1.831510
  1.404377	  0.380313	 -1.781130
  1.396759	  0.377836	 -1.731414
  1.386121	  0.378075	 -1.683609
  1.371846	  0.381588	 -1.636363
  1.356057	  0.385711	 -1.587829
  1.339739	  0.389026	 -1.539119
  1.324406	  0.390530	 -1.492069
  1.309882	  0.390269	 -1.446407
  1.293281	  0.390721	 -1.401116
  1.274368	  0.393462	 -1.355157
  1.254626	  0.394936	 -1.309677
  1.234206	  0.392725	 -1.264093
  1.212612	  0.389222	 -1.217285
  1.192175	  0.385694	 -1.170002
  1.172770	  0.382038	 -1.123981
  1.153737	  0.377793	 -1.078885
  1.135909	  0.373396	 -1.034350
  1.119173	  0.369190	 -0.988662
  1.102654	  0.366570	 -0.941608
  1.086683	  0.365836	 -0.895168
  1.071075	  0.366578	 -0.848183
  1.057585	  0.368353	 -0.797768
  1.047387	  0.370420	 -0.748111
  1.036305	  0.371993	 -0.698601
  1.023167	  0.372544	 -0.649495
  1.009224	  0.372631	 -0.602290
  0.995654	  0.373831	 -0.556855
  0.983271	  0.377077	 -0.511615
  0.970123	  0.383717	 -0.465704
  0.954909	  0.393964	 -0.418361
  0.939849	  0.402947	 -0.369622
  0.925839	  0.408403	 -0.320222
  0.913614	  0.410505	 -0.271948
  0.902486	  0.409250	 -0.223771
  0.892265	  0.404400	 -0.175067
  0.883110	  0.396312	 -0.125690
  0.874611	  0.385792	 -0.078446
  0.865838	  0.372989	 -0.031823
  0.854834	  0.357282	  0.016356
  0.839562	  0.344705	  0.065650
  0.822534	  0.338515	  0.113996
  0.806378	  0.336358	  0.160733
  0.792533	  0.336363	  0.209668
  0.775500	  0.337751	  0.257599
  0.754428	  0.338782	  0.302374
  0.733638	  0.339550	  0.349309
  0.714188	  0.342711	  0.396978
  0.694278	  0.348782	  0.443355
  0.671977	  0.355774	  0.488940
  0.649807	  0.361795	  0.533388
  0.628425	  0.365870	  0.577082
  0.608126	  0.367421	  0.619897
  0.589062	  0.366873	  0.664150
  0.572815	  0.364365	  0.709951
  0.557727	  0.360181	  0.758275
  0.542173	  0.356372	  0.807842
  0.526068	  0.356807	  0.860144
  0.506089	  0.366605	  0.926141
  0.474597	  0.409097	  1.016920
  0.440123	  0.509698	  1.079614
  0.410220	  0.611169	  1.074774
  0.387007	  0.658049	  1.085163
  0.364954	  0.689001	  1.112595
  0.341298	  0.712762	  1.157832
  0.314984	  0.729476	  1.219940
  0.296428	  0.733083	  1.270743
  0.286650	  0.729539	  1.309145
  0.281152	  0.716434	  1.355483
  0.281752	  0.694058	  1.393619
  0.287011	  0.671499	  1.418026
  0.298200	  0.638369	  1.443670
  0.315824	  0.579742	  1.479323
  0.326141	  0.500642	  1.533965
  0.314996	  0.419547	  1.612535
  0.289791	  0.366613	  1.691469
  0.269715	  0.339773	  1.753193
  0.252964	  0.323732	  1.805212
  0.235113	  0.311945	  1.853351
  0.215191	  0.303315	  1.899517
  0.194664	  0.298772	  1.945585
  0.173709	  0.297499	  1.991545
  0.152141	  0.298836	  2.036979
  0.129932	  0.302329	  2.083318
  0.108898	  0.307698	  2.131180
  0.091700	  0.314713	  2.177464
  0.077523	  0.323431	  2.223372
  0.065109	  0.332081	  2.268902
  0.053715	  0.339012	  2.314707
  0.042040	  0.342706	  2.364048
  0.029021	  0.342705	  2.414623
  0.014383	  0.337676	  2.477048
  0.006880	  0.333972	  2.510287
