  1.821973	  0.280866	  2.404668
  1.803934	  0.278086	  2.380859
  1.768347	  0.284114	  2.353261
  1.730373	  0.286821	  2.323953
  1.689790	  0.288768	  2.296735
  1.647866	  0.290521	  2.271651
  1.604533	  0.291822	  2.247232
  1.560140	  0.292961	  2.222729
  1.516649	  0.293725	  2.198339
  1.473694	  0.294216	  2.172851
  1.431939	  0.294622	  2.146147
  1.391586	  0.294721	  2.117687
  1.350454	  0.293264	  2.087112
  1.309133	  0.290656	  2.058363
  1.268619	  0.285935	  2.032672
  1.228388	  0.278162	  2.007259
  1.186639	  0.271207	  1.981123
  1.144811	  0.266905	  1.956271
  1.102970	  0.262564	  1.930097
  1.060875	  0.258673	  1.902451
  1.016023	  0.256829	  1.874332
  0.971356	  0.260650	  1.852025
  0.930593	  0.275473	  1.841453
  0.892746	  0.302769	  1.846341
  0.833103	  0.367364	  1.874960
  0.728653	  0.484167	  1.933500
  0.638317	  0.546438	  1.952557
  0.584682	  0.555010	  1.920491
  0.538850	  0.546250	  1.863416
  0.520366	  0.541576	  1.834507
  0.495365	  0.544910	  1.803555
  0.452606	  0.554903	  1.766931
  0.409854	  0.563039	  1.739459
  0.361821	  0.566761	  1.710109
  0.307926	  0.564393	  1.676411
  0.258482	  0.555813	  1.645666
  0.216171	  0.546275	  1.617152
  0.176848	  0.530875	  1.587209
  0.144323	  0.513437	  1.557008
  0.112908	  0.492612	  1.519309
  0.089177	  0.468030	  1.485315
  0.071254	  0.442601	  1.453555
  0.052825	  0.403828	  1.408541
  0.024040	  0.350130	  1.346617
 -0.018056	  0.301737	  1.282847
 -0.058155	  0.275608	  1.235234
 -0.091944	  0.261668	  1.198283
 -0.125509	  0.253793	  1.163800
 -0.159808	  0.249579	  1.131300
 -0.196106	  0.248304	  1.100120
 -0.236959	  0.250950	  1.069045
 -0.278931	  0.255321	  1.040497
 -0.319364	  0.258851	  1.014051
 -0.361534	  0.260933	  0.986991
 -0.403174	  0.261215	  0.960281
 -0.443974	  0.261372	  0.933807
 -0.486283	  0.262348	  0.905803
 -0.528374	  0.264662	  0.877620
 -0.568158	  0.266954	  0.850410
 -0.608061	  0.269000	  0.822927
 -0.648159	  0.269791	  0.796068
 -0.689717	  0.268480	  0.767841
 -0.731826	  0.266005	  0.738971
 -0.772889	  0.262667	  0.710876
 -0.813293	  0.259264	  0.682402
 -0.854712	  0.256064	  0.654461
 -0.895673	  0.253866	  0.628180
 -0.938546	  0.252711	  0.602586
 -0.980859	  0.252396	  0.579053
 -1.024255	  0.251101	  0.554769
 -1.061816	  0.248398	  0.527917
 -1.086123	  0.247536	  0.492756
 -1.096830	  0.251708	  0.424959
 -1.099039	  0.270108	  0.301936
 -1.113198	  0.290462	  0.201010
 -1.129463	  0.286344	  0.157541
 -1.140049	  0.271508	  0.142265
 -1.165673	  0.234215	  0.123307
 -1.210105	  0.151426	  0.098164
 -1.232154	  0.100281	  0.088691
 -1.242293	  0.071925	  0.096068
 -1.281412	 -0.027996	  0.169312
 -1.369173	 -0.137294	  0.226230
 -1.437922	 -0.227479	  0.233253
 -1.500576	 -0.252971	  0.228614
 -1.608005	 -0.213904	  0.238134
 -1.729533	 -0.167111	  0.202191
 -1.812753	 -0.141201	  0.160215
 -1.859137	 -0.100862	  0.142754
 -1.895992	 -0.052343	  0.118579
 -1.944736	  0.060585	  0.084050
 -1.989755	  0.154282	  0.018785
 -2.027555	  0.186949	 -0.022613
 -2.060902	  0.198806	 -0.050603
 -2.098880	  0.203762	 -0.077592
 -2.139555	  0.206340	 -0.105345
 -2.180738	  0.210272	 -0.132323
 -2.221486	  0.216853	 -0.158383
 -2.261408	  0.225879	 -0.185416
 -2.301148	  0.233601	 -0.213639
 -2.341967	  0.238174	 -0.242633
 -2.384137	  0.239912	 -0.272233
 -2.424279	  0.239312	 -0.301132
 -2.463503	  0.237733	 -0.330103
 -2.503266	  0.235281	 -0.359884
 -2.542709	  0.231626	 -0.388900
 -2.584571	  0.229087	 -0.418330
 -2.625449	  0.223655	 -0.445155
 -2.667033	  0.223014	 -0.469910
 -2.708955	  0.214931	 -0.497429
 -2.750549	  0.214646	 -0.524238
 -2.793688	  0.210690	 -0.547878
 -2.837859	  0.214529	 -0.573986
 -2.880828	  0.207207	 -0.603281
 -2.924885	  0.204574	 -0.634977
 -2.954134	  0.206620	 -0.641327
