 -0.539428	 -1.802464	 -1.579870
 -0.544645	 -1.836209	 -1.613602
 -0.542472	 -1.821976	 -1.599723
 -0.540308	 -1.805988	 -1.587909
 -0.538144	 -1.789977	 -1.576120
 -0.535981	 -1.773966	 -1.564331
 -0.533817	 -1.757956	 -1.552542
 -0.531667	 -1.741930	 -1.540776
 -0.531491	 -1.724075	 -1.531790
 -0.534383	 -1.704702	 -1.527788
 -0.537301	 -1.685316	 -1.523825
 -0.540218	 -1.665931	 -1.519863
 -0.543135	 -1.646546	 -1.515901
 -0.546053	 -1.627161	 -1.511939
 -0.548970	 -1.607775	 -1.507976
 -0.551907	 -1.588392	 -1.504062
 -0.557192	 -1.569207	 -1.505922
 -0.564120	 -1.551723	 -1.512708
 -0.571061	 -1.534252	 -1.519535
 -0.578002	 -1.516782	 -1.526361
 -0.584944	 -1.499312	 -1.533188
 -0.591885	 -1.481842	 -1.540018
 -0.599065	 -1.464655	 -1.547297
 -0.606934	 -1.448422	 -1.555932
 -0.614809	 -1.432198	 -1.564578
 -0.622676	 -1.415967	 -1.573219
 -0.629534	 -1.398973	 -1.581228
 -0.636053	 -1.381747	 -1.589024
 -0.642548	 -1.364507	 -1.596805
 -0.647311	 -1.346354	 -1.603711
 -0.651776	 -1.328073	 -1.610470
 -0.656042	 -1.309748	 -1.617190
 -0.658042	 -1.290862	 -1.623447
 -0.659536	 -1.271910	 -1.629571
 -0.661114	 -1.253002	 -1.635732
 -0.659322	 -1.234639	 -1.641920
 -0.654250	 -1.215173	 -1.648623
 -0.650468	 -1.196151	 -1.653440
 -0.648252	 -1.178179	 -1.657756
 -0.644348	 -1.158115	 -1.661758
 -0.639959	 -1.139343	 -1.664851
 -0.638730	 -1.120362	 -1.670075
 -0.635216	 -1.101314	 -1.675632
 -0.633164	 -1.079124	 -1.672351
 -0.628750	 -1.060627	 -1.665953
 -0.621283	 -1.042823	 -1.662564
 -0.610970	 -1.025518	 -1.661874
 -0.600010	 -1.008915	 -1.658657
 -0.590673	 -0.990271	 -1.651634
 -0.580634	 -0.978686	 -1.639202
 -0.568026	 -0.968097	 -1.627092
 -0.553417	 -0.959746	 -1.616214
 -0.537792	 -0.951643	 -1.606883
 -0.521828	 -0.943375	 -1.597914
 -0.507292	 -0.932674	 -1.586327
 -0.496614	 -0.924707	 -1.568552
 -0.484845	 -0.921155	 -1.553741
 -0.469010	 -0.916503	 -1.544220
 -0.452342	 -0.910843	 -1.532854
 -0.438210	 -0.905279	 -1.519570
 -0.425042	 -0.898516	 -1.506799
 -0.411212	 -0.891007	 -1.495849
 -0.397984	 -0.882839	 -1.478085
 -0.390148	 -0.879769	 -1.459446
 -0.378737	 -0.876441	 -1.443419
 -0.366413	 -0.872776	 -1.433302
 -0.356110	 -0.868271	 -1.415757
 -0.346060	 -0.859527	 -1.395320
 -0.335083	 -0.850498	 -1.382284
 -0.320563	 -0.845022	 -1.370083
 -0.307438	 -0.845758	 -1.357704
 -0.295698	 -0.843380	 -1.338068
 -0.289835	 -0.836440	 -1.318956
 -0.282745	 -0.827171	 -1.302823
 -0.274920	 -0.823193	 -1.287023
 -0.268181	 -0.820875	 -1.267628
 -0.260232	 -0.812306	 -1.249359
 -0.249676	 -0.802957	 -1.236458
 -0.240694	 -0.795637	 -1.219907
 -0.233875	 -0.788315	 -1.202950
 -0.225401	 -0.775867	 -1.188133
 -0.216719	 -0.759128	 -1.175801
 -0.215057	 -0.745617	 -1.157008
 -0.215977	 -0.742241	 -1.138094
 -0.216567	 -0.738319	 -1.114417
 -0.216282	 -0.731012	 -1.096028
 -0.217565	 -0.723005	 -1.078036
 -0.221106	 -0.718240	 -1.061627
 -0.227581	 -0.710897	 -1.041539
 -0.230113	 -0.698860	 -1.026718
 -0.231018	 -0.681046	 -1.012247
 -0.232714	 -0.668825	 -0.996559
 -0.238498	 -0.664022	 -0.978461
 -0.245880	 -0.657390	 -0.963183
 -0.250646	 -0.643275	 -0.951709
 -0.251395	 -0.619637	 -0.931972
 -0.248691	 -0.615769	 -0.916336
 -0.247724	 -0.610715	 -0.887381
 -0.250126	 -0.607934	 -0.871628
 -0.261485	 -0.598433	 -0.855777
 -0.272479	 -0.586090	 -0.841495
 -0.279308	 -0.572243	 -0.831111
 -0.284072	 -0.552150	 -0.817456
 -0.285615	 -0.531366	 -0.803662
 -0.287510	 -0.515365	 -0.785790
 -0.287626	 -0.507937	 -0.780721
 -0.292058	 -0.496812	 -0.763439
 -0.299559	 -0.481535	 -0.750027
 -0.314039	 -0.464249	 -0.740547
 -0.331733	 -0.452092	 -0.732269
 -0.343607	 -0.443763	 -0.717238
 -0.343473	 -0.434386	 -0.694062
 -0.340313	 -0.426791	 -0.675873
 -0.344891	 -0.418539	 -0.656755
 -0.357219	 -0.404047	 -0.641660
 -0.367355	 -0.387079	 -0.634332
 -0.374685	 -0.370270	 -0.626444
 -0.380900	 -0.354819	 -0.613198
 -0.383070	 -0.341062	 -0.600421
 -0.379766	 -0.324195	 -0.583511
 -0.375513	 -0.309352	 -0.566053
 -0.374431	 -0.297702	 -0.553574
 -0.377924	 -0.282521	 -0.542470
 -0.381180	 -0.269162	 -0.532833
 -0.386047	 -0.254346	 -0.519141
 -0.389702	 -0.232619	 -0.499414
 -0.389638	 -0.218577	 -0.486873
 -0.387439	 -0.207876	 -0.476309
 -0.382647	 -0.198159	 -0.463283
 -0.375851	 -0.187817	 -0.444353
 -0.366319	 -0.170831	 -0.422142
 -0.367819	 -0.155773	 -0.411724
 -0.377323	 -0.139132	 -0.403661
 -0.382091	 -0.125016	 -0.390403
 -0.379858	 -0.110066	 -0.372933
 -0.379764	 -0.093099	 -0.364120
 -0.376587	 -0.075070	 -0.355077
 -0.370572	 -0.058094	 -0.337012
 -0.368545	 -0.047647	 -0.322819
 -0.369347	 -0.037968	 -0.310424
 -0.368754	 -0.021415	 -0.292907
 -0.364700	 -0.009703	 -0.278616
 -0.364437	  0.003990	 -0.264994
 -0.369052	  0.024947	 -0.251389
 -0.370902	  0.042041	 -0.241080
 -0.366243	  0.053417	 -0.229414
 -0.357890	  0.067580	 -0.215580
 -0.354198	  0.085430	 -0.206862
 -0.354231	  0.104388	 -0.193313
 -0.351787	  0.118612	 -0.181106
 -0.346713	  0.132615	 -0.172162
 -0.338178	  0.148336	 -0.159922
 -0.336075	  0.163324	 -0.143964
 -0.342466	  0.179763	 -0.129375
 -0.345273	  0.197189	 -0.116611
 -0.339394	  0.211447	 -0.107337
 -0.335101	  0.225641	 -0.096981
 -0.335456	  0.242547	 -0.081116
 -0.329750	  0.256381	 -0.067247
 -0.322020	  0.270593	 -0.057917
 -0.312694	  0.287187	 -0.044224
 -0.310376	  0.300743	 -0.029907
 -0.312345	  0.315656	 -0.018109
 -0.310347	  0.331754	 -0.005265
 -0.307804	  0.346618	  0.007311
 -0.309094	  0.361849	  0.020375
 -0.305937	  0.377556	  0.036828
 -0.297374	  0.390007	  0.047143
 -0.286965	  0.405549	  0.058422
 -0.278149	  0.419986	  0.072992
 -0.275800	  0.433320	  0.086486
 -0.276349	  0.447504	  0.096397
 -0.272856	  0.464853	  0.109455
 -0.268183	  0.480326	  0.121779
 -0.263545	  0.495566	  0.133874
 -0.258955	  0.510841	  0.145942
 -0.254602	  0.526308	  0.157848
 -0.249910	  0.541511	  0.169163
 -0.243042	  0.556534	  0.178926
 -0.235723	  0.572439	  0.188352
 -0.232880	  0.593879	  0.202307
 -0.232171	  0.606060	  0.214036
 -0.228706	  0.620304	  0.224245
 -0.225688	  0.638598	  0.235083
 -0.224274	  0.654208	  0.250395
 -0.219349	  0.668264	  0.263960
 -0.214066	  0.684830	  0.274605
 -0.210039	  0.702978	  0.283712
 -0.205476	  0.717764	  0.293375
 -0.199370	  0.729086	  0.306974
 -0.193745	  0.741905	  0.326159
 -0.189997	  0.758743	  0.338608
 -0.186438	  0.773648	  0.345661
 -0.181572	  0.789287	  0.358284
 -0.178207	  0.806158	  0.371915
 -0.174276	  0.825500	  0.382682
 -0.169316	  0.841696	  0.390545
 -0.163201	  0.857226	  0.396134
 -0.154927	  0.878185	  0.404130
 -0.151645	  0.892538	  0.414475
 -0.147897	  0.904503	  0.429673
 -0.140920	  0.921220	  0.445131
 -0.136188	  0.935993	  0.453311
 -0.131438	  0.952192	  0.463605
 -0.126355	  0.968736	  0.476925
 -0.118463	  0.981861	  0.487377
 -0.106571	  0.996394	  0.499944
 -0.098079	  1.010362	  0.508491
 -0.090968	  1.029655	  0.516873
 -0.085627	  1.046987	  0.527206
 -0.079731	  1.058619	  0.537464
 -0.067632	  1.071789	  0.549753
 -0.057924	  1.084897	  0.561166
 -0.051631	  1.098820	  0.574115
 -0.045974	  1.114916	  0.587179
 -0.039337	  1.132991	  0.596740
 -0.028274	  1.144389	  0.603292
 -0.011951	  1.157971	  0.612063
  0.000766	  1.176048	  0.617662
  0.005997	  1.191952	  0.626678
  0.011915	  1.202713	  0.639933
  0.024669	  1.218526	  0.651504
  0.037807	  1.234438	  0.655283
  0.047896	  1.254533	  0.660303
  0.052150	  1.273321	  0.669387
  0.053604	  1.288183	  0.682007
  0.060100	  1.302100	  0.696269
  0.071144	  1.313996	  0.708687
  0.077724	  1.324865	  0.725171
  0.077752	  1.337415	  0.743941
  0.073470	  1.353303	  0.758280
  0.074179	  1.372924	  0.768871
  0.079204	  1.384986	  0.777901
  0.085643	  1.399811	  0.790391
  0.093914	  1.428009	  0.803142
  0.095225	  1.442322	  0.809173
  0.095024	  1.455928	  0.814077
  0.091291	  1.471243	  0.830317
  0.092537	  1.481981	  0.844640
  0.094145	  1.498497	  0.860310
  0.090617	  1.513444	  0.871158
  0.086042	  1.530449	  0.880628
  0.089849	  1.549405	  0.890962
  0.099779	  1.565019	  0.900628
  0.106347	  1.586789	  0.914040
  0.105028	  1.605724	  0.922906
  0.102702	  1.616870	  0.927567
  0.097467	  1.635515	  0.939150
  0.094185	  1.654735	  0.950295
  0.093669	  1.668700	  0.957262
  0.096189	  1.693063	  0.968119
  0.097043	  1.711522	  0.977254
  0.094464	  1.727184	  0.987356
  0.092333	  1.739546	  0.997087
  0.091475	  1.759330	  1.009172
  0.085618	  1.775630	  1.019478
  0.079446	  1.792215	  1.027665
  0.076933	  1.812434	  1.036268
  0.075390	  1.830849	  1.044961
  0.076392	  1.842735	  1.058597
  0.078763	  1.862136	  1.070638
  0.075105	  1.882155	  1.079064
  0.064363	  1.894345	  1.095526
  0.057808	  1.906214	  1.111370
  0.059193	  1.919030	  1.124099
  0.061275	  1.935745	  1.136985
  0.062395	  1.950786	  1.151174
  0.063420	  1.965401	  1.164862
  0.064106	  1.981232	  1.177392
  0.064840	  1.997055	  1.189614
  0.065584	  2.012859	  1.201848
  0.067041	  2.028577	  1.214049
  0.069211	  2.043370	  1.227105
  0.071559	  2.058689	  1.240626
  0.074002	  2.074629	  1.252498
  0.075684	  2.091334	  1.262604
  0.077904	  2.107867	  1.273929
  0.080560	  2.124427	  1.286074
  0.084409	  2.146226	  1.302191
  0.087392	  2.162100	  1.313986
