 -1.529684	 -0.680481	 -1.785215
 -1.526535	 -0.683633	 -1.795483
 -1.532162	 -0.678002	 -1.777136
 -1.537789	 -0.672370	 -1.758788
 -1.543669	 -0.666194	 -1.740698
 -1.549556	 -0.660001	 -1.722615
 -1.555607	 -0.653767	 -1.704600
 -1.561966	 -0.647454	 -1.686720
 -1.568326	 -0.641141	 -1.668840
 -1.575227	 -0.635193	 -1.651036
 -1.582294	 -0.629357	 -1.633259
 -1.589498	 -0.623637	 -1.615500
 -1.597124	 -0.618276	 -1.597805
 -1.604750	 -0.612915	 -1.580110
 -1.612676	 -0.607836	 -1.562464
 -1.620689	 -0.602839	 -1.544834
 -1.628781	 -0.597925	 -1.527217
 -1.637045	 -0.593189	 -1.509631
 -1.645308	 -0.588452	 -1.492044
 -1.653681	 -0.583915	 -1.474457
 -1.662072	 -0.579410	 -1.456870
 -1.670443	 -0.575179	 -1.439206
 -1.678786	 -0.571299	 -1.421448
 -1.686837	 -0.568113	 -1.403420
 -1.694343	 -0.566161	 -1.384985
 -1.701826	 -0.564516	 -1.366510
 -1.709256	 -0.563500	 -1.347969
 -1.716685	 -0.562484	 -1.329428
 -1.723885	 -0.559681	 -1.310981
 -1.730846	 -0.555392	 -1.292729
 -1.737807	 -0.551104	 -1.274476
 -1.744768	 -0.546159	 -1.256390
 -1.751713	 -0.540298	 -1.238574
 -1.758659	 -0.534437	 -1.220758
 -1.766615	 -0.528862	 -1.203276
 -1.775385	 -0.523536	 -1.186109
 -1.784155	 -0.518210	 -1.168941
 -1.794308	 -0.513276	 -1.152431
 -1.804770	 -0.508436	 -1.136088
 -1.815408	 -0.503690	 -1.119830
 -1.827114	 -0.499539	 -1.104154
 -1.838821	 -0.495388	 -1.088479
 -1.850925	 -0.491455	 -1.073051
 -1.863337	 -0.487694	 -1.057826
 -1.875750	 -0.483934	 -1.042602
 -1.888585	 -0.480446	 -1.027665
 -1.901421	 -0.476958	 -1.012729
 -1.914284	 -0.473611	 -0.997785
 -1.927176	 -0.470405	 -0.982834
 -1.940058	 -0.467213	 -0.967872
 -1.952744	 -0.464281	 -0.952691
 -1.965431	 -0.461350	 -0.937510
 -1.977875	 -0.458538	 -0.922108
 -1.990172	 -0.455799	 -0.906575
 -2.002331	 -0.453008	 -0.890942
 -2.013890	 -0.450003	 -0.874900
 -2.025449	 -0.446998	 -0.858858
 -2.036261	 -0.443217	 -0.842462
 -2.046642	 -0.439010	 -0.825893
 -2.056914	 -0.434719	 -0.809277
 -2.065492	 -0.429221	 -0.792068
 -2.074070	 -0.423723	 -0.774858
 -2.079854	 -0.417933	 -0.756609
 -2.084849	 -0.412085	 -0.738146
 -2.088525	 -0.406290	 -0.719361
 -2.091486	 -0.400534	 -0.700437
 -2.094585	 -0.394780	 -0.681535
 -2.098779	 -0.389041	 -0.662841
 -2.102973	 -0.383303	 -0.644146
 -2.107589	 -0.377516	 -0.625567
 -2.113027	 -0.371640	 -0.607239
 -2.118464	 -0.365765	 -0.588911
 -2.124717	 -0.360089	 -0.570781
 -2.131393	 -0.354524	 -0.552769
 -2.138253	 -0.349072	 -0.534790
 -2.146136	 -0.344278	 -0.517046
 -2.154020	 -0.339484	 -0.499301
 -2.162460	 -0.335048	 -0.481720
 -2.171127	 -0.330762	 -0.464213
 -2.179928	 -0.326522	 -0.446761
 -2.189236	 -0.322467	 -0.429529
 -2.198544	 -0.318412	 -0.412298
 -2.208415	 -0.314555	 -0.395337
 -2.218578	 -0.310802	 -0.378526
 -2.228823	 -0.307110	 -0.361750
 -2.239522	 -0.303761	 -0.345188
 -2.250221	 -0.300412	 -0.328625
 -2.259928	 -0.298074	 -0.311296
 -2.269541	 -0.295830	 -0.293902
 -2.277399	 -0.293929	 -0.275609
 -2.284934	 -0.292093	 -0.257174
 -2.291740	 -0.289712	 -0.238519
 -2.297740	 -0.286746	 -0.219672
 -2.303740	 -0.283779	 -0.200825
 -2.309405	 -0.280057	 -0.182009
 -2.314984	 -0.276148	 -0.163205
 -2.320610	 -0.272222	 -0.144418
 -2.326668	 -0.268135	 -0.125801
 -2.332726	 -0.264049	 -0.107184
 -2.339060	 -0.259988	 -0.088653
 -2.345748	 -0.255964	 -0.070239
 -2.352437	 -0.251939	 -0.051826
 -2.359308	 -0.248100	 -0.033439
 -2.366208	 -0.244291	 -0.015058
 -2.373150	 -0.240517	  0.003315
 -2.380163	 -0.236805	  0.021674
 -2.387176	 -0.233093	  0.040033
 -2.394366	 -0.229182	  0.058281
 -2.401585	 -0.225239	  0.076511
 -2.409013	 -0.221218	  0.094640
 -2.416894	 -0.217028	  0.112538
 -2.424776	 -0.212838	  0.130435
 -2.432658	 -0.208648	  0.148333
 -2.442530	 -0.203859	  0.169698
 -2.450789	 -0.199895	  0.187477
