 -1.762807	 -2.461655	 -0.116889
 -1.745354	 -2.437283	 -0.115732
 -1.717642	 -2.393907	 -0.100749
 -1.695909	 -2.346803	 -0.092488
 -1.670422	 -2.302800	 -0.086275
 -1.645048	 -2.262198	 -0.070016
 -1.618577	 -2.219460	 -0.065640
 -1.590812	 -2.179714	 -0.053447
 -1.571427	 -2.133971	 -0.051168
 -1.543462	 -2.092940	 -0.044485
 -1.512187	 -2.053975	 -0.038489
 -1.484390	 -2.014236	 -0.030049
 -1.453072	 -1.978044	 -0.014984
 -1.425403	 -1.937938	 -0.002461
 -1.398981	 -1.897048	  0.009199
 -1.374967	 -1.856006	  0.022591
 -1.354939	 -1.814372	  0.041235
 -1.341510	 -1.769818	  0.068580
 -1.337810	 -1.710869	  0.110883
 -1.362662	 -1.622088	  0.173746
 -1.424243	 -1.512135	  0.224958
 -1.464593	 -1.425277	  0.243159
 -1.472792	 -1.387524	  0.242214
 -1.471190	 -1.380868	  0.240715
 -1.457930	 -1.368263	  0.233681
 -1.401057	 -1.348861	  0.206731
 -1.289700	 -1.338297	  0.164929
 -1.178732	 -1.313359	  0.145609
 -1.104075	 -1.281747	  0.144403
 -1.054426	 -1.252801	  0.148206
 -1.012594	 -1.221028	  0.153439
 -0.976303	 -1.182921	  0.159353
 -0.947090	 -1.140465	  0.165749
 -0.924890	 -1.096129	  0.172449
 -0.907426	 -1.049729	  0.179725
 -0.893138	 -1.001591	  0.187822
 -0.880584	 -0.952800	  0.197478
 -0.869099	 -0.904986	  0.208556
 -0.857353	 -0.858587	  0.221379
 -0.844867	 -0.812975	  0.236096
 -0.830291	 -0.766782	  0.252597
 -0.812535	 -0.723003	  0.268909
 -0.792458	 -0.680532	  0.284435
 -0.770481	 -0.637397	  0.299314
 -0.745765	 -0.592565	  0.313204
 -0.718005	 -0.548470	  0.324429
 -0.688608	 -0.507007	  0.331720
 -0.658700	 -0.467551	  0.335169
 -0.629367	 -0.428336	  0.337411
 -0.599337	 -0.387917	  0.340488
 -0.568065	 -0.349951	  0.345988
 -0.535980	 -0.313823	  0.354830
 -0.503961	 -0.278738	  0.367157
 -0.472270	 -0.241368	  0.380519
 -0.442910	 -0.200751	  0.391416
 -0.413731	 -0.158323	  0.397830
 -0.385247	 -0.116830	  0.400891
 -0.358336	 -0.075999	  0.402365
 -0.332757	 -0.034717	  0.402959
 -0.309279	  0.008820	  0.406121
 -0.286476	  0.053123	  0.418103
 -0.264463	  0.095781	  0.437872
 -0.254317	  0.143162	  0.454877
 -0.228887	  0.184527	  0.463643
 -0.200168	  0.222361	  0.474272
 -0.173214	  0.262173	  0.486037
 -0.146051	  0.302936	  0.496202
 -0.117935	  0.344762	  0.503985
 -0.089449	  0.386377	  0.510059
 -0.061502	  0.427308	  0.516675
 -0.034083	  0.468338	  0.524606
 -0.007513	  0.508134	  0.533311
  0.019740	  0.548716	  0.543247
  0.046139	  0.588576	  0.555079
  0.071912	  0.628672	  0.568879
  0.096862	  0.670197	  0.583469
  0.119510	  0.713200	  0.597145
  0.139451	  0.756678	  0.610251
  0.158118	  0.802126	  0.623867
  0.175737	  0.847408	  0.637404
  0.192550	  0.890933	  0.650379
  0.209435	  0.933537	  0.663208
  0.227701	  0.976489	  0.676657
  0.248917	  1.020853	  0.689738
  0.272837	  1.064525	  0.699994
  0.298342	  1.107026	  0.707829
  0.325987	  1.147940	  0.714275
  0.356322	  1.186711	  0.719526
  0.389849	  1.223621	  0.723982
  0.424945	  1.259341	  0.728080
  0.459820	  1.294258	  0.733462
  0.495457	  1.329706	  0.740500
  0.531056	  1.366482	  0.749194
  0.564456	  1.407712	  0.758509
  0.591747	  1.454005	  0.767587
  0.613111	  1.501937	  0.775604
  0.630395	  1.549912	  0.782328
  0.645314	  1.597634	  0.788108
  0.658755	  1.645173	  0.793111
  0.671479	  1.692740	  0.797157
  0.685452	  1.739810	  0.800254
  0.701903	  1.786164	  0.803353
  0.720912	  1.833116	  0.808827
  0.742286	  1.878688	  0.817848
  0.764649	  1.922572	  0.828620
  0.787238	  1.964925	  0.839705
  0.810614	  2.006440	  0.851047
  0.835207	  2.047636	  0.862445
  0.860491	  2.089980	  0.873376
  0.884781	  2.132920	  0.883048
  0.907614	  2.175564	  0.891261
  0.930546	  2.218410	  0.899060
  0.955390	  2.259708	  0.907737
  0.983699	  2.299189	  0.915602
  1.010570	  2.341040	  0.928150
  1.030660	  2.385397	  0.943935
  1.059803	  2.422326	  0.963608
  1.083957	  2.466827	  0.964092
  1.107425	  2.507410	  0.978914
  1.129161	  2.546800	  0.992855
  1.150170	  2.587261	  0.991558
  1.161672	  2.613134	  1.001474
