  1.388705	 -0.787605	  2.575282
  1.374955	 -0.779807	  2.549784
  1.336579	 -0.756581	  2.531234
  1.299165	 -0.741249	  2.503814
  1.266646	 -0.727784	  2.469156
  1.230333	 -0.715247	  2.436794
  1.190405	 -0.699900	  2.409703
  1.149107	 -0.686052	  2.383828
  1.109450	 -0.669785	  2.357075
  1.071019	 -0.651434	  2.330107
  1.033359	 -0.631459	  2.303447
  0.996064	 -0.610535	  2.277449
  0.958715	 -0.588828	  2.252242
  0.920236	 -0.567169	  2.228394
  0.879086	 -0.548037	  2.207165
  0.836842	 -0.531126	  2.187094
  0.793988	 -0.516819	  2.166690
  0.750091	 -0.507736	  2.144369
  0.703842	 -0.509189	  2.117096
  0.654686	 -0.523533	  2.078646
  0.604231	 -0.551476	  2.025959
  0.552248	 -0.587340	  1.965918
  0.500864	 -0.624035	  1.907939
  0.457071	 -0.658001	  1.857013
  0.418735	 -0.684576	  1.811912
  0.384521	 -0.702066	  1.767004
  0.352917	 -0.710147	  1.722665
  0.320329	 -0.704024	  1.675412
  0.282867	 -0.677744	  1.629854
  0.242612	 -0.638058	  1.594787
  0.204504	 -0.595230	  1.571873
  0.168084	 -0.553791	  1.558060
  0.132972	 -0.513942	  1.550162
  0.100010	 -0.476830	  1.546045
  0.068089	 -0.442797	  1.544601
  0.031234	 -0.405982	  1.542931
 -0.015569	 -0.361174	  1.534889
 -0.071807	 -0.313287	  1.534075
 -0.123308	 -0.266731	  1.525358
 -0.163978	 -0.227454	  1.513573
 -0.195971	 -0.196635	  1.501714
 -0.225950	 -0.169519	  1.489153
 -0.257578	 -0.143261	  1.474856
 -0.291075	 -0.117505	  1.458602
 -0.327694	 -0.091578	  1.440254
 -0.366634	 -0.065653	  1.419794
 -0.406151	 -0.040574	  1.398090
 -0.445776	 -0.016202	  1.376079
 -0.484657	  0.008553	  1.353653
 -0.521898	  0.033776	  1.331105
 -0.558242	  0.059986	  1.308121
 -0.594690	  0.086593	  1.284346
 -0.632314	  0.112425	  1.259452
 -0.670676	  0.135037	  1.232846
 -0.708026	  0.152914	  1.204856
 -0.745640	  0.166603	  1.175574
 -0.784327	  0.176831	  1.145870
 -0.823938	  0.184096	  1.117697
 -0.864206	  0.189275	  1.090753
 -0.905180	  0.193618	  1.064362
 -0.947966	  0.197856	  1.037744
 -0.992008	  0.202623	  1.010689
 -1.036347	  0.209176	  0.982325
 -1.078842	  0.219802	  0.952138
 -1.119522	  0.235404	  0.921645
 -1.158387	  0.256009	  0.892989
 -1.195581	  0.280770	  0.866896
 -1.234119	  0.311193	  0.842329
 -1.278382	  0.355318	  0.818490
 -1.326217	  0.425728	  0.799875
 -1.368362	  0.518741	  0.792328
 -1.405009	  0.613735	  0.790317
 -1.436291	  0.689431	  0.791733
 -1.462384	  0.743482	  0.794163
 -1.486006	  0.783376	  0.796471
 -1.512107	  0.817926	  0.798257
 -1.545061	  0.851475	  0.799724
 -1.592985	  0.886521	  0.801857
 -1.661925	  0.921533	  0.807061
 -1.753951	  0.949654	  0.817468
 -1.860957	  0.946572	  0.822865
 -1.951565	  0.907044	  0.802447
 -2.004989	  0.862186	  0.759483
 -2.030928	  0.828383	  0.707414
 -2.046122	  0.800053	  0.644009
 -2.055726	  0.773095	  0.559358
 -2.060695	  0.756833	  0.463688
 -2.065372	  0.752472	  0.380197
 -2.075695	  0.752975	  0.323087
 -2.090694	  0.756266	  0.284948
 -2.112835	  0.762502	  0.252184
 -2.144493	  0.772296	  0.221299
 -2.183028	  0.782845	  0.192989
 -2.224572	  0.793515	  0.166642
 -2.266552	  0.803717	  0.141071
 -2.308291	  0.813043	  0.116271
 -2.351161	  0.821426	  0.092480
 -2.396444	  0.828512	  0.068360
 -2.440497	  0.838170	  0.040587
 -2.481442	  0.851484	  0.009979
 -2.520776	  0.865581	 -0.020264
 -2.559072	  0.880029	 -0.049365
 -2.596556	  0.895050	 -0.077500
 -2.633496	  0.911149	 -0.105267
 -2.669842	  0.929032	 -0.133460
 -2.706822	  0.948405	 -0.161240
 -2.743115	  0.969012	 -0.190357
 -2.778949	  0.990229	 -0.220407
 -2.812186	  1.013794	 -0.252648
 -2.840308	  1.023931	 -0.255175
