  2.080712	 -0.710694	  0.824192
  2.173963	 -0.682871	  0.856063
  2.153029	 -0.699540	  0.855893
  2.135840	 -0.698518	  0.848097
  2.116635	 -0.703736	  0.841222
  2.092604	 -0.705742	  0.829033
  2.079909	 -0.703893	  0.821321
  2.062626	 -0.700473	  0.810659
  2.045700	 -0.693450	  0.798710
  2.029905	 -0.691009	  0.789820
  2.009460	 -0.696065	  0.778552
  1.993389	 -0.695035	  0.765507
  1.982176	 -0.693711	  0.753897
  1.965206	 -0.698695	  0.741461
  1.946893	 -0.704507	  0.730659
  1.928922	 -0.705637	  0.716937
  1.915710	 -0.705462	  0.703597
  1.903989	 -0.700122	  0.686813
  1.900404	 -0.698051	  0.668275
  1.896450	 -0.706002	  0.649496
  1.886660	 -0.717258	  0.635742
  1.876305	 -0.732965	  0.623938
  1.874313	 -0.749528	  0.610459
  1.874931	 -0.752628	  0.589255
  1.883292	 -0.752700	  0.562423
  1.888336	 -0.763291	  0.541592
  1.887519	 -0.774102	  0.530225
  1.882724	 -0.786420	  0.519556
  1.889382	 -0.805541	  0.493251
  1.891908	 -0.815624	  0.479455
  1.893921	 -0.820101	  0.471892
  1.888726	 -0.823502	  0.451391
  1.895394	 -0.819391	  0.421642
  1.908073	 -0.818392	  0.402906
  1.919968	 -0.819348	  0.386906
  1.933008	 -0.829016	  0.371052
  1.939513	 -0.843423	  0.353455
  1.938323	 -0.857243	  0.337153
  1.936703	 -0.867902	  0.321523
  1.933980	 -0.881633	  0.305218
  1.928187	 -0.897188	  0.286940
  1.927006	 -0.908274	  0.267927
  1.937710	 -0.920018	  0.251186
  1.950790	 -0.928900	  0.241303
  1.962005	 -0.941138	  0.233612
  1.973947	 -0.959830	  0.221910
  1.981024	 -0.971868	  0.209508
  1.985342	 -0.983584	  0.197362
  1.995804	 -1.001226	  0.176807
  1.998304	 -1.007908	  0.162024
  1.998760	 -1.013823	  0.143801
  2.001280	 -1.025863	  0.122674
  2.006615	 -1.037724	  0.111858
  2.015852	 -1.054056	  0.102030
  2.024637	 -1.072736	  0.090037
  2.027283	 -1.084239	  0.083036
  2.032670	 -1.109492	  0.074005
  2.039600	 -1.133410	  0.065330
  2.043443	 -1.145377	  0.060099
  2.045036	 -1.163328	  0.047782
  2.045117	 -1.174655	  0.034711
  2.047884	 -1.186889	  0.009462
  2.049714	 -1.199802	 -0.010936
  2.050846	 -1.206067	 -0.019489
  2.053088	 -1.223359	 -0.033958
  2.056859	 -1.243905	 -0.048682
  2.059318	 -1.256140	 -0.059815
  2.062984	 -1.271235	 -0.079294
  2.065159	 -1.278996	 -0.094125
  2.067946	 -1.282596	 -0.113406
  2.078594	 -1.282750	 -0.138659
  2.083562	 -1.293909	 -0.154495
