  0.969649	 -1.950686	  2.106064
  0.960049	 -1.931372	  2.085212
  0.920248	 -1.904761	  2.097338
  0.880554	 -1.876773	  2.107173
  0.834773	 -1.857528	  2.111683
  0.792700	 -1.831623	  2.119934
  0.747847	 -1.808517	  2.122069
  0.702388	 -1.787606	  2.128805
  0.658887	 -1.764490	  2.137573
  0.615572	 -1.741338	  2.147628
  0.571569	 -1.719225	  2.156701
  0.526933	 -1.698090	  2.165210
  0.481749	 -1.677678	  2.173329
  0.436091	 -1.656968	  2.181244
  0.391080	 -1.634742	  2.189238
  0.346885	 -1.611591	  2.197246
  0.303288	 -1.587868	  2.205275
  0.260198	 -1.563823	  2.213413
  0.217602	 -1.539639	  2.221575
  0.174957	 -1.516307	  2.229406
  0.131889	 -1.493563	  2.236534
  0.088474	 -1.470915	  2.242436
  0.044479	 -1.447881	  2.247247
  0.000282	 -1.424125	  2.251498
 -0.043832	 -1.400093	  2.255779
 -0.087766	 -1.376434	  2.260765
 -0.131165	 -1.353179	  2.266190
 -0.174580	 -1.329998	  2.271908
 -0.217896	 -1.306117	  2.279033
 -0.260497	 -1.281794	  2.287231
 -0.302844	 -1.256985	  2.295684
 -0.345291	 -1.231059	  2.303234
 -0.386777	 -1.202488	  2.307927
 -0.427188	 -1.171575	  2.311126
 -0.467117	 -1.140085	  2.315444
 -0.506736	 -1.108677	  2.322127
 -0.545878	 -1.077797	  2.331916
 -0.584826	 -1.047805	  2.343940
 -0.624349	 -1.019278	  2.356722
 -0.665369	 -0.993565	  2.370087
 -0.707682	 -0.970580	  2.383407
 -0.751108	 -0.949924	  2.395908
 -0.795750	 -0.931308	  2.407208
 -0.840980	 -0.912997	  2.417410
 -0.886579	 -0.893617	  2.426736
 -0.931955	 -0.872595	  2.435050
 -0.976671	 -0.849528	  2.442070
 -1.021005	 -0.825908	  2.448786
 -1.064766	 -0.801400	  2.454557
 -1.107563	 -0.775318	  2.456366
 -1.150998	 -0.749705	  2.458143
 -1.186273	 -0.715694	  2.469900
 -1.229308	 -0.692471	  2.480134
 -1.273458	 -0.669691	  2.485406
 -1.316727	 -0.644672	  2.486780
 -1.356707	 -0.616852	  2.498488
 -1.400817	 -0.594057	  2.506506
 -1.441739	 -0.564756	  2.511686
 -1.485771	 -0.540681	  2.520303
 -1.534401	 -0.525152	  2.523852
 -1.549745	 -0.530403	  2.549091
