 -2.088274	  1.035825	 -0.845391
 -2.091874	  1.035085	 -0.847317
 -2.074521	  1.038652	 -0.838036
 -2.057168	  1.042219	 -0.828754
 -2.039376	  1.044655	 -0.819950
 -2.021481	  1.046792	 -0.811278
 -2.003529	  1.048540	 -0.802636
 -1.985503	  1.049686	 -0.794048
 -1.967477	  1.050832	 -0.785460
 -1.949492	  1.051533	 -0.776740
 -1.931507	  1.052231	 -0.768020
 -1.913568	  1.052843	 -0.759197
 -1.895669	  1.053384	 -0.750291
 -1.877772	  1.053927	 -0.741380
 -1.859976	  1.054611	 -0.732278
 -1.842181	  1.055295	 -0.723176
 -1.824449	  1.056237	 -0.713973
 -1.806793	  1.057467	 -0.704659
 -1.789137	  1.058697	 -0.695345
 -1.771500	  1.060606	 -0.686110
 -1.753866	  1.062603	 -0.676887
 -1.736238	  1.064879	 -0.667719
 -1.718635	  1.067805	 -0.658687
 -1.701032	  1.070731	 -0.649655
 -1.683501	  1.074390	 -0.640751
 -1.666009	  1.078377	 -0.631910
 -1.648540	  1.082533	 -0.623105
 -1.631263	  1.087902	 -0.614578
 -1.613987	  1.093271	 -0.606052
 -1.597070	  1.100169	 -0.597914
 -1.580346	  1.107728	 -0.589965
 -1.564215	  1.116882	 -0.582483
 -1.548850	  1.127653	 -0.575562
 -1.533892	  1.139155	 -0.568931
 -1.521425	  1.153979	 -0.563948
 -1.508958	  1.168802	 -0.558965
 -1.496491	  1.183626	 -0.553983
 -1.486207	  1.200257	 -0.549781
 -1.478731	  1.218532	 -0.546599
 -1.471255	  1.236808	 -0.543417
 -1.463779	  1.255083	 -0.540235
 -1.456303	  1.273358	 -0.537053
 -1.449220	  1.291788	 -0.533862
 -1.444244	  1.310891	 -0.530650
 -1.439268	  1.329994	 -0.527438
 -1.434292	  1.349097	 -0.524227
 -1.429317	  1.368200	 -0.521015
 -1.424286	  1.387280	 -0.517755
 -1.418997	  1.406250	 -0.514265
 -1.413708	  1.425219	 -0.510775
 -1.408419	  1.444189	 -0.507285
 -1.403130	  1.463159	 -0.503795
 -1.400766	  1.482858	 -0.501276
 -1.399229	  1.502673	 -0.499038
 -1.397691	  1.522488	 -0.496801
 -1.396154	  1.542303	 -0.494564
 -1.401587	  1.561537	 -0.493836
 -1.413422	  1.577634	 -0.494747
 -1.425257	  1.593730	 -0.495659
 -1.442180	  1.604338	 -0.496707
 -1.460690	  1.596802	 -0.497460
 -1.479200	  1.589265	 -0.498213
 -1.496983	  1.580117	 -0.498535
 -1.505904	  1.562408	 -0.495932
 -1.514826	  1.544698	 -0.493328
 -1.523747	  1.526989	 -0.490724
 -1.532669	  1.509279	 -0.488120
 -1.541590	  1.491570	 -0.485517
 -1.550512	  1.473860	 -0.482913
 -1.559433	  1.456150	 -0.480309
 -1.568355	  1.438441	 -0.477706
 -1.577276	  1.420731	 -0.475102
 -1.582722	  1.402264	 -0.469690
 -1.580692	  1.385065	 -0.459686
 -1.578662	  1.367866	 -0.449682
 -1.576632	  1.350667	 -0.439678
 -1.574602	  1.333468	 -0.429674
 -1.572572	  1.316269	 -0.419670
 -1.570542	  1.299071	 -0.409666
 -1.568512	  1.281872	 -0.399662
 -1.566482	  1.264673	 -0.389658
 -1.564452	  1.247474	 -0.379654
 -1.562422	  1.230275	 -0.369650
 -1.560227	  1.213526	 -0.358944
 -1.556621	  1.202955	 -0.342353
 -1.553015	  1.192384	 -0.325762
 -1.549408	  1.181813	 -0.309172
 -1.545802	  1.171243	 -0.292581
 -1.542196	  1.160672	 -0.275990
 -1.538590	  1.150101	 -0.259399
 -1.534983	  1.139530	 -0.242808
 -1.531377	  1.128960	 -0.226218
 -1.527771	  1.118389	 -0.209627
 -1.524165	  1.107818	 -0.193036
 -1.520558	  1.097247	 -0.176445
 -1.509960	  1.090812	 -0.160752
 -1.497729	  1.085717	 -0.145771
 -1.485498	  1.080621	 -0.130790
 -1.473267	  1.075526	 -0.115809
 -1.461036	  1.070430	 -0.100828
 -1.448805	  1.065335	 -0.085846
 -1.436574	  1.060239	 -0.070865
 -1.424343	  1.055144	 -0.055884
 -1.412111	  1.050048	 -0.040903
 -1.395901	  1.047087	 -0.029569
 -1.378387	  1.045129	 -0.020113
 -1.360873	  1.043171	 -0.010657
 -1.343358	  1.041213	 -0.001200
 -1.325844	  1.039255	  0.008256
 -1.308330	  1.037298	  0.017712
 -1.290816	  1.035340	  0.027169
 -1.273302	  1.033382	  0.036625
 -1.253755	  1.029167	  0.037022
 -1.234578	  1.024354	  0.034014
 -1.215400	  1.019540	  0.031005
 -1.196223	  1.014726	  0.027996
 -1.177045	  1.009913	  0.024988
 -1.157868	  1.005099	  0.021979
 -1.138199	  1.001716	  0.023277
 -1.118678	  0.999149	  0.026793
 -1.099158	  0.996582	  0.030309
 -1.079637	  0.994015	  0.033824
 -1.060117	  0.991448	  0.037340
 -1.042651	  0.986414	  0.045683
 -1.027319	  0.979993	  0.056805
 -1.011986	  0.973573	  0.067927
 -0.996654	  0.967153	  0.079049
 -0.981322	  0.960728	  0.090169
 -0.965995	  0.953955	  0.101087
 -0.950668	  0.947182	  0.112005
 -0.935341	  0.940408	  0.122923
 -0.919760	  0.933742	  0.133544
 -0.902889	  0.927720	  0.142438
 -0.886018	  0.921698	  0.151332
 -0.868664	  0.916183	  0.159605
 -0.850845	  0.911216	  0.167206
 -0.832627	  0.906687	  0.174106
 -0.814013	  0.902654	  0.180211
 -0.795127	  0.899220	  0.185826
 -0.775945	  0.896545	  0.190812
 -0.756762	  0.893870	  0.195798
 -0.737200	  0.892843	  0.199833
 -0.717632	  0.891848	  0.203848
 -0.697846	  0.892269	  0.206736
 -0.678026	  0.893124	  0.209272
 -0.658220	  0.895602	  0.210531
 -0.638490	  0.898803	  0.211209
 -0.618831	  0.902483	  0.211277
 -0.599725	  0.907943	  0.209011
 -0.580792	  0.913609	  0.205937
 -0.563258	  0.920149	  0.198881
 -0.548037	  0.926873	  0.187786
 -0.533385	  0.933619	  0.175962
 -0.519531	  0.941497	  0.163879
 -0.505676	  0.949375	  0.151796
 -0.491822	  0.957253	  0.139713
 -0.477968	  0.965131	  0.127630
 -0.463687	  0.973131	  0.116138
 -0.446607	  0.981715	  0.110258
 -0.429526	  0.990298	  0.104378
 -0.412445	  0.998881	  0.098498
 -0.395365	  1.007465	  0.092618
 -0.378284	  1.016048	  0.086738
 -0.361203	  1.024632	  0.080858
 -0.343916	  1.033137	  0.075490
 -0.325249	  1.039450	  0.078909
 -0.306582	  1.045763	  0.082328
 -0.287916	  1.052076	  0.085747
 -0.269249	  1.058389	  0.089166
 -0.250582	  1.064702	  0.092586
 -0.232032	  1.070901	  0.096769
 -0.214999	  1.076094	  0.105874
 -0.197966	  1.081286	  0.114979
 -0.180932	  1.086479	  0.124084
 -0.164330	  1.091679	  0.133949
 -0.148375	  1.096871	  0.144834
 -0.132420	  1.102064	  0.155718
 -0.116642	  1.107649	  0.166667
 -0.100969	  1.113456	  0.177650
 -0.085295	  1.119268	  0.188629
 -0.069362	  1.125676	  0.198880
 -0.053430	  1.132085	  0.209132
 -0.037129	  1.138462	  0.218806
 -0.020355	  1.144785	  0.227675
 -0.003581	  1.151108	  0.236544
  0.014154	  1.156551	  0.244016
  0.031953	  1.161927	  0.251385
  0.050143	  1.166925	  0.258030
  0.068648	  1.171579	  0.264020
  0.087219	  1.176151	  0.269870
  0.106229	  1.180110	  0.274662
  0.125239	  1.184069	  0.279453
  0.144353	  1.187496	  0.284239
  0.163521	  1.190611	  0.289021
  0.182721	  1.193487	  0.293826
  0.201999	  1.195644	  0.298696
  0.221277	  1.197801	  0.303566
  0.240537	  1.198695	  0.308882
  0.259792	  1.199493	  0.314230
  0.278630	  1.199324	  0.320946
  0.296997	  1.198324	  0.328797
  0.314806	  1.196807	  0.337772
  0.330619	  1.193883	  0.349662
  0.346433	  1.190960	  0.361553
  0.363660	  1.190016	  0.371670
  0.381789	  1.190792	  0.380079
  0.399919	  1.191568	  0.388489
  0.416015	  1.190076	  0.400266
  0.430869	  1.187544	  0.413417
  0.445723	  1.185012	  0.426568
  0.454329	  1.178058	  0.443228
  0.460566	  1.169923	  0.460401
  0.466802	  1.161787	  0.477575
  0.473038	  1.153652	  0.494748
  0.479275	  1.145516	  0.511921
  0.486008	  1.138388	  0.529353
  0.493298	  1.132478	  0.547014
  0.500589	  1.126568	  0.564675
  0.507879	  1.120659	  0.582337
  0.515169	  1.114749	  0.599998
  0.522460	  1.108839	  0.617659
  0.523904	  1.103158	  0.636781
  0.523155	  1.097692	  0.656005
  0.522405	  1.092226	  0.675229
  0.521655	  1.086760	  0.694453
  0.521708	  1.082365	  0.713964
  0.522996	  1.079661	  0.733738
  0.524283	  1.076956	  0.753513
  0.526145	  1.074612	  0.773288
  0.531427	  1.074499	  0.792577
  0.536709	  1.074387	  0.811867
  0.543659	  1.075063	  0.830608
  0.552883	  1.076857	  0.848263
  0.562108	  1.078651	  0.865918
  0.572612	  1.080581	  0.882828
  0.584757	  1.082677	  0.898579
  0.596902	  1.084773	  0.914331
  0.609689	  1.086670	  0.929591
  0.623850	  1.088103	  0.943641
  0.638012	  1.089537	  0.957691
  0.653213	  1.091344	  0.970562
  0.668643	  1.093236	  0.983144
  0.684766	  1.095169	  0.994820
  0.701424	  1.097130	  1.005713
  0.718083	  1.099091	  1.016605
  0.736182	  1.099473	  1.025108
  0.754635	  1.099357	  1.032818
  0.773089	  1.099241	  1.040527
  0.791543	  1.099126	  1.048237
  0.811442	  1.099124	  1.050250
  0.831430	  1.099149	  1.050942
  0.851418	  1.099174	  1.051633
  0.871406	  1.099199	  1.052324
  0.891280	  1.101263	  1.051442
  0.909806	  1.107538	  1.047271
  0.928332	  1.113813	  1.043101
  0.946859	  1.120088	  1.038930
  0.963140	  1.130664	  1.034125
  0.978500	  1.142479	  1.029179
  0.993860	  1.154294	  1.024232
  1.009552	  1.164999	  1.017973
  1.025536	  1.172420	  1.008515
  1.041520	  1.179840	  0.999057
  1.057504	  1.187261	  0.989599
  1.072051	  1.195338	  0.978503
  1.085297	  1.203871	  0.966185
  1.098544	  1.212403	  0.953867
  1.111790	  1.220936	  0.941550
  1.125877	  1.229176	  0.929989
  1.140597	  1.237165	  0.919056
  1.155316	  1.245153	  0.908124
  1.170036	  1.253142	  0.897191
  1.186074	  1.260286	  0.887614
  1.205616	  1.263240	  0.884550
  1.225158	  1.266194	  0.881487
  1.245047	  1.268081	  0.882421
  1.264538	  1.268970	  0.886814
  1.283583	  1.269750	  0.892871
  1.302023	  1.270413	  0.900586
  1.320333	  1.270996	  0.908611
  1.338352	  1.271412	  0.917280
  1.356371	  1.271827	  0.925948
  1.374431	  1.271833	  0.934542
  1.392493	  1.271812	  0.943131
  1.410648	  1.271621	  0.951519
  1.428893	  1.271259	  0.959703
  1.447138	  1.270897	  0.967888
  1.465691	  1.270310	  0.975333
  1.484253	  1.269715	  0.982757
  1.502949	  1.269167	  0.989839
  1.521953	  1.268736	  0.996057
  1.540957	  1.268305	  1.002276
  1.559895	  1.269142	  1.008651
  1.578746	  1.270824	  1.015117
  1.597588	  1.272459	  1.021621
  1.616353	  1.273716	  1.028424
  1.635119	  1.274972	  1.035227
  1.653316	  1.275419	  1.043513
  1.671273	  1.275573	  1.052318
  1.689030	  1.276169	  1.061501
  1.706297	  1.277720	  1.071473
  1.723564	  1.279271	  1.081445
  1.741768	  1.282250	  1.089175
  1.760587	  1.286739	  1.094244
  1.779406	  1.291229	  1.099313
  1.798224	  1.295719	  1.104381
  1.817250	  1.300052	  1.109401
  1.836435	  1.303411	  1.113948
