  0.284439	  2.464768	  0.440550
  0.272324	  2.489546	  0.460949
  0.278461	  2.476994	  0.450614
  0.296494	  2.440447	  0.418256
  0.313572	  2.403719	  0.385108
  0.328763	  2.368539	  0.352389
  0.342363	  2.337109	  0.321927
  0.351741	  2.320753	  0.303145
  0.394371	  2.357197	  0.264595
  0.621943	  2.456222	  0.166944
  0.654388	  2.466363	  0.156325
