  0.444604	 -2.340295	  0.738759
  0.444098	 -2.342321	  0.739437
  0.455221	 -2.297781	  0.724534
  0.468304	 -2.250885	  0.708945
  0.483104	 -2.206489	  0.693545
  0.498021	 -2.167659	  0.680696
  0.513000	 -2.131829	  0.672077
  0.530263	 -2.092462	  0.667337
  0.547111	 -2.048704	  0.665169
  0.563650	 -1.999598	  0.664450
  0.579554	 -1.944594	  0.660429
  0.593525	 -1.886542	  0.650987
  0.602478	 -1.831619	  0.635927
  0.608846	 -1.781725	  0.619402
  0.614729	 -1.732862	  0.602340
  0.619851	 -1.683493	  0.583990
  0.624912	 -1.632314	  0.561661
  0.629790	 -1.591535	  0.540547
  0.645203	 -1.555504	  0.528653
  0.667400	 -1.512784	  0.518518
  0.686670	 -1.467325	  0.505492
  0.697169	 -1.434887	  0.497511
  0.691774	 -1.381851	  0.496671
  0.717189	 -1.327832	  0.481890
  0.727839	 -1.293286	  0.476777
  0.702430	 -1.249609	  0.493380
  0.634022	 -1.180172	  0.544189
  0.551530	 -1.085765	  0.619053
  0.534738	 -0.970982	  0.670480
  0.553566	 -0.882397	  0.693283
  0.582025	 -0.809536	  0.711989
  0.609485	 -0.751762	  0.709936
  0.638572	 -0.702881	  0.678253
  0.669380	 -0.659261	  0.647157
  0.709331	 -0.610063	  0.603665
  0.754930	 -0.577863	  0.538595
  0.804952	 -0.567819	  0.445396
  0.868359	 -0.573309	  0.330980
  0.910388	 -0.560722	  0.289915
  0.934022	 -0.489848	  0.275776
  0.946411	 -0.442237	  0.266186
  0.957451	 -0.395969	  0.257299
  0.968055	 -0.350401	  0.249648
  0.978399	 -0.304937	  0.243024
  0.989169	 -0.256595	  0.236440
  1.001496	 -0.202488	  0.228175
  1.014405	 -0.149996	  0.217443
  1.026780	 -0.103543	  0.206966
  1.040987	 -0.056886	  0.197105
  1.056611	 -0.007825	  0.185313
  1.070646	  0.042337	  0.170984
  1.080068	  0.088081	  0.156533
  1.083603	  0.129234	  0.145081
  1.092335	  0.168399	  0.137454
  1.107791	  0.205511	  0.136269
  1.128084	  0.249296	  0.137260
  1.151845	  0.303858	  0.135559
  1.180329	  0.374868	  0.123062
  1.210449	  0.437513	  0.088594
  1.229074	  0.475683	  0.061301
  1.239403	  0.505684	  0.048876
  1.251467	  0.542489	  0.036249
  1.261791	  0.581337	  0.028111
  1.273192	  0.617857	  0.018850
  1.291852	  0.670306	  0.018346
  1.319121	  0.735746	 -0.005800
  1.337816	  0.784058	 -0.027803
  1.354581	  0.828667	 -0.049985
  1.370682	  0.871200	 -0.071892
  1.385977	  0.913712	 -0.094224
  1.398973	  0.955969	 -0.116194
  1.408687	  0.999250	 -0.137491
  1.414993	  1.043939	 -0.157982
  1.419486	  1.087341	 -0.176129
  1.423788	  1.130097	 -0.192104
  1.428852	  1.173108	 -0.206262
  1.435642	  1.217435	 -0.218664
  1.444705	  1.261513	 -0.228862
  1.456093	  1.303724	 -0.236876
  1.470464	  1.347035	 -0.243620
  1.486448	  1.391561	 -0.248438
  1.502251	  1.436561	 -0.251280
  1.516841	  1.480278	 -0.252719
  1.530730	  1.525373	 -0.253487
  1.544727	  1.575517	 -0.254202
  1.558647	  1.628001	 -0.256688
  1.570913	  1.677865	 -0.260767
  1.581978	  1.727848	 -0.266095
  1.594695	  1.786056	 -0.274684
  1.625992	  1.887818	 -0.303040
  1.626699	  1.889966	 -0.303718
