  2.492041	  1.717424	  0.145210
  2.467367	  1.700420	  0.143773
  2.449641	  1.657739	  0.145408
  2.439320	  1.612190	  0.140270
  2.423805	  1.563766	  0.141316
  2.401352	  1.519415	  0.136251
  2.379489	  1.475941	  0.130633
  2.359944	  1.429157	  0.127603
  2.343234	  1.381908	  0.125228
  2.330322	  1.334234	  0.121459
  2.316982	  1.284409	  0.117463
  2.303398	  1.234833	  0.114257
  2.289585	  1.185204	  0.112049
  2.277112	  1.138651	  0.110542
  2.264878	  1.091772	  0.108997
  2.251070	  1.044863	  0.107215
  2.234980	  0.996808	  0.104849
  2.214625	  0.948432	  0.101726
  2.189894	  0.905278	  0.097275
  2.170422	  0.862695	  0.098024
  2.192176	  0.818406	  0.116585
  2.260232	  0.743953	  0.179942
  2.305720	  0.652102	  0.237276
  2.322969	  0.589954	  0.264972
  2.338279	  0.537212	  0.288419
  2.360432	  0.472786	  0.307580
  2.359561	  0.417797	  0.316112
  2.342232	  0.359350	  0.319868
  2.317752	  0.312647	  0.321941
  2.281333	  0.252734	  0.321168
  2.261133	  0.221324	  0.315938
  2.236851	  0.191050	  0.299241
  2.180544	  0.143011	  0.259975
  2.136031	  0.114609	  0.230181
  2.087992	  0.094768	  0.196565
  2.007147	  0.075644	  0.144567
  1.870923	  0.072615	  0.066488
  1.730664	  0.071047	 -0.006550
  1.651827	  0.035184	 -0.040998
  1.597781	 -0.018151	 -0.052868
  1.544211	 -0.086575	 -0.064332
  1.528113	 -0.108359	 -0.073277
  1.475136	 -0.173029	 -0.122757
  1.408126	 -0.242059	 -0.208930
  1.375098	 -0.284739	 -0.254184
  1.400035	 -0.289712	 -0.258125
  1.418824	 -0.292431	 -0.234210
  1.434886	 -0.314708	 -0.190843
  1.464797	 -0.361557	 -0.157475
  1.538007	 -0.445825	 -0.088225
  1.623571	 -0.570606	 -0.052333
  1.692187	 -0.708891	 -0.055805
  1.731246	 -0.789775	 -0.052710
  1.750404	 -0.831682	 -0.068133
  1.769844	 -0.872469	 -0.109723
  1.785053	 -0.900897	 -0.160299
  1.819851	 -0.939945	 -0.272749
  1.864245	 -1.001906	 -0.386749
  1.921561	 -1.111373	 -0.431009
  1.936361	 -1.176203	 -0.420048
  1.933658	 -1.235949	 -0.396742
  1.920951	 -1.302306	 -0.362705
  1.903361	 -1.349963	 -0.330145
  1.893714	 -1.389215	 -0.314053
  1.874526	 -1.421860	 -0.293622
  1.855210	 -1.454689	 -0.286633
  1.831125	 -1.485726	 -0.286591
  1.791264	 -1.514772	 -0.293923
  1.722179	 -1.547647	 -0.314685
  1.584998	 -1.593051	 -0.348370
  1.516740	 -1.616238	 -0.350241
  1.454023	 -1.654354	 -0.328937
  1.432751	 -1.699075	 -0.316942
  1.422231	 -1.740294	 -0.322666
  1.399531	 -1.759885	 -0.317283
  1.341917	 -1.779770	 -0.254665
  1.291518	 -1.815252	 -0.150566
  1.187916	 -1.840639	 -0.049139
  1.123725	 -1.888384	 -0.013201
  1.095398	 -1.936152	 -0.006421
  1.078220	 -1.982853	 -0.007473
  1.062782	 -2.028147	 -0.010595
  1.043731	 -2.075985	 -0.014656
  1.022993	 -2.124097	 -0.019119
  1.003362	 -2.169744	 -0.023197
  0.985009	 -2.213894	 -0.027026
  0.968154	 -2.257385	 -0.030694
  0.951868	 -2.303527	 -0.034806
  0.935357	 -2.350901	 -0.039911
  0.915120	 -2.397010	 -0.047073
  0.893442	 -2.442696	 -0.051621
  0.870610	 -2.488995	 -0.047038
  0.854670	 -2.537525	 -0.044407
  0.835013	 -2.583322	 -0.049407
  0.816528	 -2.631097	 -0.048778
  0.805166	 -2.680306	 -0.045749
  0.779187	 -2.723078	 -0.052970
  0.763511	 -2.771108	 -0.054642
  0.750888	 -2.818276	 -0.052986
  0.725623	 -2.862953	 -0.059795
  0.707702	 -2.914642	 -0.063382
  0.714779	 -2.943789	 -0.064016
