  1.013531	  0.067544	 -2.303292
  1.013543	  0.067535	 -2.303316
  1.004978	  0.078239	 -2.287072
  0.997405	  0.080041	 -2.271203
  0.988037	  0.083007	 -2.250296
  0.979519	  0.091650	 -2.235209
  0.970765	  0.102586	 -2.222494
  0.959012	  0.115684	 -2.201353
  0.953751	  0.119252	 -2.188382
  0.945958	  0.124355	 -2.172256
  0.935678	  0.132575	 -2.155236
  0.927586	  0.139173	 -2.142113
  0.915266	  0.148897	 -2.118559
  0.907435	  0.154529	 -2.103727
  0.900682	  0.157775	 -2.090744
  0.887872	  0.162888	 -2.071698
  0.875529	  0.176264	 -2.056957
  0.866148	  0.190287	 -2.051099
  0.852685	  0.203848	 -2.042413
  0.838635	  0.217333	 -2.033158
  0.825431	  0.230780	 -2.019804
  0.816679	  0.233196	 -2.000341
  0.807177	  0.235414	 -1.979449
  0.798182	  0.241690	 -1.962665
  0.787950	  0.249912	 -1.942115
  0.780345	  0.254201	 -1.926488
  0.774116	  0.256850	 -1.914141
  0.765117	  0.260247	 -1.894968
  0.751085	  0.260707	 -1.870477
  0.740161	  0.259155	 -1.854667
  0.724351	  0.255821	 -1.838089
  0.707914	  0.252491	 -1.824472
  0.695248	  0.251023	 -1.815067
  0.680839	  0.250213	 -1.800651
  0.668574	  0.243720	 -1.783456
  0.656611	  0.236517	 -1.766354
  0.646196	  0.228176	 -1.753235
  0.632774	  0.218104	 -1.740113
  0.619131	  0.207726	 -1.728058
  0.608433	  0.195369	 -1.716086
  0.599675	  0.182125	 -1.703526
  0.591959	  0.167970	 -1.693047
  0.579920	  0.151837	 -1.683957
  0.562828	  0.138484	 -1.673531
  0.548766	  0.132756	 -1.662659
  0.535900	  0.128032	 -1.646066
  0.527840	  0.120049	 -1.628841
  0.519891	  0.103908	 -1.617220
  0.509755	  0.084641	 -1.610382
  0.501763	  0.068743	 -1.604262
  0.497852	  0.054177	 -1.595439
  0.495251	  0.036220	 -1.581704
  0.486437	  0.021118	 -1.570050
  0.476896	  0.009182	 -1.557552
  0.472126	 -0.003800	 -1.541860
  0.469928	 -0.016101	 -1.522263
  0.467212	 -0.021541	 -1.499312
  0.462281	 -0.017075	 -1.480862
  0.456554	 -0.008841	 -1.465797
  0.449000	  0.003209	 -1.450987
  0.437349	  0.016714	 -1.438568
  0.425836	  0.027314	 -1.424108
  0.418484	  0.035469	 -1.409870
  0.408148	  0.042748	 -1.393946
  0.399787	  0.052583	 -1.375584
  0.395103	  0.061660	 -1.361455
  0.389582	  0.072939	 -1.349333
  0.382253	  0.088060	 -1.337674
  0.374871	  0.102117	 -1.325870
  0.365409	  0.110467	 -1.305782
  0.362427	  0.120363	 -1.283840
  0.363161	  0.130530	 -1.269201
  0.364148	  0.143121	 -1.252728
  0.363971	  0.156625	 -1.236524
  0.361785	  0.171094	 -1.220910
  0.359278	  0.186572	 -1.209408
  0.357256	  0.204732	 -1.198098
  0.354973	  0.221524	 -1.188511
  0.351525	  0.239289	 -1.175876
  0.350515	  0.253275	 -1.162968
  0.347233	  0.263379	 -1.154555
  0.349484	  0.285307	 -1.145404
  0.344872	  0.298896	 -1.130836
  0.341070	  0.323633	 -1.120149
  0.333814	  0.335744	 -1.103888
  0.333586	  0.348552	 -1.091633
  0.329093	  0.355846	 -1.073091
  0.327352	  0.369234	 -1.057805
  0.325518	  0.372830	 -1.045040
  0.320099	  0.381271	 -1.030808
  0.315957	  0.391665	 -1.004342
  0.315024	  0.397084	 -0.987259
  0.311869	  0.401173	 -0.970383
  0.307517	  0.410279	 -0.950136
  0.300398	  0.420419	 -0.930642
  0.289044	  0.426066	 -0.914284
  0.276842	  0.431034	 -0.903022
  0.262799	  0.437536	 -0.891299
  0.241136	  0.450237	 -0.870687
  0.230417	  0.456137	 -0.860363
  0.224556	  0.464408	 -0.849211
  0.210882	  0.479030	 -0.831924
  0.205808	  0.487640	 -0.818040
  0.198179	  0.493987	 -0.800192
  0.191719	  0.497951	 -0.783740
  0.182402	  0.504808	 -0.759827
  0.175309	  0.511297	 -0.736307
  0.169957	  0.515155	 -0.726727
  0.161059	  0.519627	 -0.715641
  0.151633	  0.525397	 -0.698733
  0.139152	  0.534262	 -0.677945
  0.129935	  0.539813	 -0.663571
  0.117032	  0.549598	 -0.647053
  0.108720	  0.558122	 -0.626175
  0.105834	  0.559977	 -0.613777
  0.100196	  0.560513	 -0.591789
  0.092726	  0.560072	 -0.573186
  0.082838	  0.560952	 -0.558340
  0.067051	  0.565797	 -0.539969
  0.055676	  0.567841	 -0.521032
  0.043449	  0.567290	 -0.504153
  0.038755	  0.565380	 -0.494847
  0.025760	  0.566515	 -0.478354
  0.017368	  0.569648	 -0.456515
  0.008384	  0.574910	 -0.436820
 -0.001700	  0.579198	 -0.424783
 -0.023851	  0.590389	 -0.403704
 -0.032428	  0.592365	 -0.393404
 -0.045128	  0.595784	 -0.375823
 -0.054533	  0.603952	 -0.358431
 -0.060038	  0.606222	 -0.347569
 -0.068752	  0.604779	 -0.325010
 -0.077410	  0.605629	 -0.301700
 -0.083513	  0.610680	 -0.286757
 -0.095216	  0.619648	 -0.270339
 -0.102888	  0.627484	 -0.257158
 -0.113161	  0.643189	 -0.239337
 -0.126863	  0.651773	 -0.224950
 -0.139291	  0.657842	 -0.213313
 -0.153305	  0.660858	 -0.197154
 -0.168950	  0.660472	 -0.180746
 -0.178379	  0.663449	 -0.168095
 -0.192783	  0.671196	 -0.144047
 -0.200072	  0.675468	 -0.131304
 -0.210693	  0.677994	 -0.115609
 -0.222573	  0.681711	 -0.101943
 -0.234510	  0.685056	 -0.090987
 -0.254176	  0.687977	 -0.074223
 -0.271051	  0.690869	 -0.056722
 -0.283699	  0.692818	 -0.041908
 -0.292982	  0.693811	 -0.030580
 -0.307426	  0.693905	 -0.012738
 -0.319333	  0.694983	  0.002893
 -0.326578	  0.696168	  0.015664
 -0.341518	  0.696094	  0.036718
 -0.358560	  0.697601	  0.053344
 -0.366957	  0.701686	  0.069171
 -0.370095	  0.706739	  0.082301
 -0.374475	  0.724228	  0.100342
 -0.387545	  0.730446	  0.123715
 -0.396937	  0.729491	  0.138508
 -0.406786	  0.727080	  0.154511
 -0.417547	  0.724380	  0.172583
 -0.426311	  0.722306	  0.188681
 -0.436158	  0.722751	  0.207558
 -0.445450	  0.724485	  0.225887
 -0.451012	  0.729184	  0.243597
 -0.456992	  0.736477	  0.268140
 -0.461360	  0.744213	  0.286386
 -0.464323	  0.747461	  0.298801
 -0.469831	  0.747354	  0.321543
 -0.480390	  0.744801	  0.346076
 -0.486243	  0.746665	  0.360801
 -0.492179	  0.752040	  0.375030
 -0.499117	  0.758275	  0.393094
 -0.514342	  0.766259	  0.415069
 -0.521974	  0.770667	  0.428014
 -0.529708	  0.771890	  0.442583
 -0.539983	  0.769808	  0.457537
 -0.558511	  0.761561	  0.484823
 -0.562084	  0.760032	  0.488372
 -0.569520	  0.757646	  0.502054
 -0.584772	  0.744510	  0.528401
 -0.594175	  0.736973	  0.542004
 -0.594635	  0.732592	  0.549456
 -0.601010	  0.724298	  0.564970
 -0.612736	  0.715472	  0.583757
 -0.626962	  0.700946	  0.595334
 -0.636925	  0.689539	  0.603001
 -0.651204	  0.677249	  0.613152
 -0.666376	  0.665344	  0.622288
 -0.680327	  0.654473	  0.629304
 -0.697379	  0.643651	  0.637114
 -0.712580	  0.634082	  0.643739
 -0.728380	  0.624867	  0.651054
 -0.743620	  0.614781	  0.658536
 -0.759498	  0.605716	  0.667383
 -0.775639	  0.600652	  0.678504
 -0.788132	  0.602090	  0.691381
 -0.800733	  0.607100	  0.707595
 -0.818498	  0.604614	  0.726249
 -0.835960	  0.594031	  0.738691
 -0.854894	  0.582257	  0.747831
 -0.865355	  0.578742	  0.751798
 -0.885965	  0.574663	  0.756902
 -0.916062	  0.575149	  0.768633
 -0.923122	  0.575574	  0.772299
 -0.943346	  0.580638	  0.785153
 -0.958924	  0.586360	  0.798026
 -0.970170	  0.590191	  0.808917
 -0.991371	  0.597221	  0.824406
 -1.008668	  0.601605	  0.834226
 -1.022100	  0.603759	  0.843029
 -1.037820	  0.599512	  0.854212
 -1.061030	  0.584554	  0.871926
 -1.074094	  0.577422	  0.880391
 -1.087505	  0.574185	  0.887232
 -1.110395	  0.575906	  0.902970
 -1.126125	  0.581412	  0.915565
 -1.136401	  0.585939	  0.925937
 -1.146559	  0.588076	  0.943628
 -1.159164	  0.587084	  0.960998
 -1.174172	  0.589176	  0.975688
 -1.186693	  0.593111	  0.986947
 -1.206080	  0.597428	  0.999779
 -1.220372	  0.601036	  1.014140
 -1.230205	  0.600164	  1.031225
 -1.238790	  0.604332	  1.049704
 -1.245530	  0.617014	  1.076841
 -1.245118	  0.622636	  1.086477
 -1.250251	  0.636124	  1.106443
 -1.248325	  0.647600	  1.124553
 -1.248930	  0.655049	  1.137284
 -1.250261	  0.667734	  1.160010
 -1.251029	  0.676565	  1.176495
 -1.251645	  0.681569	  1.184631
 -1.250352	  0.699151	  1.217395
 -1.250961	  0.710570	  1.237133
 -1.248785	  0.718263	  1.244731
 -1.250539	  0.724464	  1.254775
 -1.249724	  0.741389	  1.270274
 -1.250796	  0.755602	  1.288004
 -1.248752	  0.771458	  1.307644
 -1.239168	  0.783315	  1.323181
 -1.228596	  0.790623	  1.330232
 -1.213080	  0.807821	  1.336821
 -1.203753	  0.826203	  1.342235
 -1.197291	  0.843954	  1.348522
 -1.186954	  0.860138	  1.354983
 -1.178417	  0.877074	  1.359367
 -1.172248	  0.894929	  1.356550
 -1.165059	  0.917964	  1.351214
 -1.157066	  0.937729	  1.351146
 -1.148911	  0.952187	  1.357149
 -1.142099	  0.971385	  1.359525
 -1.134132	  0.993710	  1.364375
 -1.128881	  1.008114	  1.371425
 -1.125604	  1.027299	  1.378564
 -1.119891	  1.050679	  1.387775
 -1.111561	  1.066273	  1.399242
 -1.105594	  1.078799	  1.416699
 -1.106600	  1.087312	  1.435668
 -1.110976	  1.098086	  1.454248
 -1.112699	  1.109764	  1.470533
 -1.115282	  1.120972	  1.488233
 -1.120646	  1.130963	  1.505123
 -1.128146	  1.138002	  1.522235
 -1.135206	  1.145896	  1.538387
 -1.141860	  1.157643	  1.553210
 -1.144988	  1.167628	  1.572563
 -1.148405	  1.172704	  1.595087
 -1.154177	  1.170416	  1.614772
 -1.162968	  1.168011	  1.634617
 -1.171266	  1.172585	  1.652605
 -1.180567	  1.181441	  1.670181
 -1.191282	  1.189424	  1.684099
 -1.204981	  1.195252	  1.698905
 -1.216614	  1.200687	  1.714213
 -1.226667	  1.206401	  1.731689
 -1.237533	  1.210115	  1.748740
 -1.250016	  1.211114	  1.763406
 -1.261899	  1.214059	  1.780226
 -1.275032	  1.217105	  1.797499
 -1.286137	  1.220828	  1.813710
