 0.0 0.0 0.0 0
 -0.35814229224756716 -0.842566798608988 0.4026428794669783 1000
 0.0890898034426103 -0.6113218990773557 -0.7859761717959475 1000
 0.5581559104928521 0.7995768796182467 0.22176517571937102 1000
 0.1487319128424806 0.9889746748671471 0.007675322380067989 1000
 -0.21993316348458367 -0.8157149921696476 -0.5358016938656835 1000
 -0.449207479540572 -0.257937875390297 0.8556662274298003 1000
 0.5430822473816457 0.831286660167161 -0.11987977814055294 1000
 -0.6976792903697824 0.7130114909064975 0.0633026194119238 1000
 0.0 0.0 0.0 0
 -0.7784128390186016 -0.19409913681574853 -0.5969832301986232 1000
 -0.08593200445816017 0.571705782867339 -0.8158236258198498 1000
 -0.1358264355075568 0.29818287808986965 0.9445089468244088 1000
 0.19758438245926516 0.21770096528495597 -0.9557702137659394 1000
 -0.5403165994858681 -0.19317113704351088 -0.8194204562575587 1000
 0.26831622818088274 -0.24945891268890288 0.9304314335698549 1000
 0.9719593920251108 0.12422733204434122 -0.19739430140539002 1000
 0.48476030136696624 -0.8742686761757955 -0.01325639756609398 1000
 0.0 0.0 0.0 0
 0.8788774004515953 0.1317857818902009 0.4600565429021033 1000
 -0.01908077433364841 -0.6937586159361735 0.7197901825290156 1000
