 -0.599695	  2.303870	 -0.355624
 -0.601350	  2.308599	 -0.362055
 -0.583810	  2.294603	 -0.348107
 -0.582533	  2.281283	 -0.329611
 -0.586511	  2.274222	 -0.318118
 -0.589174	  2.260492	 -0.297780
 -0.583567	  2.247816	 -0.284127
 -0.571955	  2.233802	 -0.272125
 -0.562009	  2.220371	 -0.259840
 -0.561021	  2.210247	 -0.247258
 -0.563280	  2.194918	 -0.231573
 -0.563996	  2.176325	 -0.214978
 -0.565694	  2.165260	 -0.204215
 -0.569011	  2.149115	 -0.188435
 -0.566374	  2.130300	 -0.175265
 -0.562838	  2.115891	 -0.171403
 -0.552314	  2.087209	 -0.163080
 -0.543097	  2.073338	 -0.154588
 -0.535761	  2.064103	 -0.147510
 -0.524236	  2.046442	 -0.130157
 -0.522137	  2.033487	 -0.117411
 -0.521672	  2.015166	 -0.101745
 -0.520324	  1.996730	 -0.091041
 -0.518997	  1.983791	 -0.086158
 -0.516646	  1.962327	 -0.080468
 -0.512300	  1.943779	 -0.073042
 -0.506255	  1.924619	 -0.064380
 -0.500517	  1.907919	 -0.054351
 -0.495743	  1.901080	 -0.047402
 -0.483690	  1.884071	 -0.029611
 -0.478474	  1.864372	 -0.013626
 -0.481624	  1.850237	 -0.007458
 -0.484229	  1.835743	 -0.004899
 -0.487898	  1.799269	 -0.005585
 -0.484697	  1.772855	 -0.004033
 -0.477257	  1.750937	 -0.000778
 -0.473270	  1.733420	  0.000294
 -0.468595	  1.721105	  0.002702
 -0.464749	  1.703406	  0.007137
 -0.463112	  1.681628	  0.018032
 -0.462495	  1.663536	  0.026380
 -0.463053	  1.645328	  0.033350
 -0.464831	  1.626253	  0.041799
 -0.466777	  1.609568	  0.050111
 -0.469982	  1.589132	  0.061749
 -0.470125	  1.565895	  0.074588
 -0.468834	  1.550686	  0.088360
 -0.469444	  1.543382	  0.091658
 -0.472352	  1.525314	  0.101709
 -0.475074	  1.506855	  0.113077
 -0.475070	  1.493131	  0.120250
 -0.471269	  1.476577	  0.127336
 -0.467579	  1.457031	  0.139847
 -0.463940	  1.440144	  0.146090
 -0.457717	  1.424928	  0.146391
 -0.451788	  1.401577	  0.144827
 -0.435452	  1.391054	  0.141911
 -0.427857	  1.377611	  0.140485
 -0.419318	  1.362934	  0.141382
 -0.405744	  1.348774	  0.145496
 -0.391163	  1.324486	  0.153936
 -0.381945	  1.308341	  0.157200
 -0.379300	  1.298594	  0.158345
 -0.371317	  1.285589	  0.159018
 -0.356277	  1.263789	  0.165379
 -0.334062	  1.247225	  0.177514
 -0.323673	  1.238187	  0.181388
 -0.308976	  1.223919	  0.192132
 -0.292753	  1.213961	  0.201753
 -0.271304	  1.207059	  0.215121
 -0.256723	  1.198778	  0.225226
 -0.244686	  1.193160	  0.234587
 -0.227997	  1.186318	  0.250367
 -0.209938	  1.183439	  0.261475
 -0.198775	  1.178167	  0.268348
 -0.183134	  1.169897	  0.277267
 -0.169262	  1.163332	  0.286940
 -0.149729	  1.160011	  0.303752
 -0.133356	  1.155676	  0.318026
 -0.119768	  1.153788	  0.326615
 -0.104001	  1.148059	  0.337849
 -0.089439	  1.143329	  0.349926
 -0.075950	  1.136299	  0.362445
 -0.061252	  1.130613	  0.375965
 -0.045674	  1.127804	  0.392001
 -0.032675	  1.126955	  0.403273
 -0.018433	  1.126734	  0.420489
 -0.007805	  1.124447	  0.434651
  0.002496	  1.121786	  0.447925
  0.021501	  1.118330	  0.469882
  0.034538	  1.118456	  0.484262
  0.042417	  1.118773	  0.492511
  0.058329	  1.120406	  0.507252
  0.074397	  1.117679	  0.523110
  0.088022	  1.112732	  0.536725
  0.100655	  1.106343	  0.551655
  0.112622	  1.101350	  0.566902
  0.122995	  1.100316	  0.580487
  0.131989	  1.099079	  0.596098
  0.145468	  1.093628	  0.615818
  0.160752	  1.088410	  0.629550
  0.173247	  1.082134	  0.640535
  0.188024	  1.074171	  0.651631
  0.208124	  1.063147	  0.671422
  0.214783	  1.056008	  0.681458
  0.221846	  1.047871	  0.693345
  0.230232	  1.034675	  0.710416
  0.239959	  1.026229	  0.725509
  0.249597	  1.020782	  0.743449
  0.253302	  1.017017	  0.762884
  0.255962	  1.013190	  0.782373
  0.260298	  1.005493	  0.811764
  0.261775	  1.002916	  0.815802
  0.267064	  0.992042	  0.831161
  0.272205	  0.976876	  0.851214
  0.279012	  0.964772	  0.872299
  0.287782	  0.958118	  0.885599
  0.296862	  0.951305	  0.900667
  0.303255	  0.945114	  0.919235
  0.309485	  0.940304	  0.938506
  0.315741	  0.936935	  0.956228
  0.320791	  0.932344	  0.974515
  0.323930	  0.925332	  0.993693
  0.325833	  0.917905	  1.012305
  0.326139	  0.910330	  1.030864
  0.325128	  0.903234	  1.049539
  0.323900	  0.895821	  1.068065
  0.323031	  0.889739	  1.087103
  0.321564	  0.883869	  1.106224
  0.319375	  0.877583	  1.124988
  0.315255	  0.873832	  1.143906
  0.310724	  0.872443	  1.163906
  0.308983	  0.870775	  1.184675
  0.309269	  0.866784	  1.204618
  0.311333	  0.855436	  1.226317
  0.310911	  0.839640	  1.242465
  0.306337	  0.825382	  1.256852
  0.299570	  0.816277	  1.271326
  0.291821	  0.810565	  1.289583
  0.285418	  0.805392	  1.308279
  0.279930	  0.799617	  1.326823
  0.274808	  0.792528	  1.344899
  0.270510	  0.784524	  1.362813
  0.267300	  0.776131	  1.380702
  0.264709	  0.767506	  1.398536
  0.260780	  0.758603	  1.416276
  0.254966	  0.749887	  1.433752
  0.248063	  0.742040	  1.451896
  0.242007	  0.734951	  1.470787
  0.239406	  0.730564	  1.487631
  0.240856	  0.731221	  1.504495
  0.245080	  0.732592	  1.524597
  0.245083	  0.725473	  1.554107
  0.240695	  0.719779	  1.572436
  0.236515	  0.715444	  1.592029
  0.231852	  0.712183	  1.611236
  0.228280	  0.708368	  1.622621
  0.224371	  0.701312	  1.644236
  0.222287	  0.699396	  1.667052
  0.221960	  0.699122	  1.686305
  0.224606	  0.694489	  1.709789
  0.227817	  0.687964	  1.728750
  0.228843	  0.682207	  1.743593
  0.225791	  0.676932	  1.763145
  0.222991	  0.671566	  1.786820
  0.223113	  0.666662	  1.803779
  0.222292	  0.660249	  1.819145
  0.223752	  0.651106	  1.845618
  0.229165	  0.645531	  1.862543
  0.235090	  0.642625	  1.876888
  0.245576	  0.641802	  1.898454
  0.254603	  0.638342	  1.918528
  0.262677	  0.634405	  1.936163
  0.268434	  0.630900	  1.955242
  0.272668	  0.628408	  1.973086
  0.280577	  0.626891	  1.992884
  0.288437	  0.623551	  2.013154
  0.294929	  0.616424	  2.030996
  0.300331	  0.604329	  2.046835
  0.305524	  0.594131	  2.060477
  0.310876	  0.586465	  2.080015
  0.314833	  0.578605	  2.098768
  0.319000	  0.569284	  2.115261
  0.326653	  0.561440	  2.132462
  0.336078	  0.554119	  2.148467
  0.345818	  0.547229	  2.164675
  0.355559	  0.540445	  2.180834
  0.365785	  0.533544	  2.196546
  0.376185	  0.526746	  2.212213
  0.386916	  0.519279	  2.227307
  0.397737	  0.511406	  2.242149
  0.408428	  0.503407	  2.256978
  0.418861	  0.494174	  2.271193
  0.429160	  0.484219	  2.285070
  0.439316	  0.474081	  2.298943
  0.449078	  0.463068	  2.312331
  0.458398	  0.450297	  2.324307
  0.467494	  0.437083	  2.336274
  0.476477	  0.423802	  2.348236
  0.485735	  0.410929	  2.360175
  0.495203	  0.398444	  2.371365
  0.503511	  0.383721	  2.382052
