 -0.594958	 -2.148882	  1.097783
 -0.594680	 -2.163104	  1.105497
 -0.595345	 -2.129086	  1.087046
 -0.596224	 -2.079430	  1.057248
 -0.597601	 -2.034678	  1.028281
 -0.599274	 -1.996181	  1.003119
 -0.601207	 -1.961812	  0.982340
 -0.603697	 -1.929929	  0.965029
 -0.606763	 -1.900033	  0.950643
 -0.610286	 -1.873007	  0.939280
 -0.614664	 -1.846393	  0.929697
 -0.620339	 -1.816372	  0.920588
 -0.627660	 -1.780177	  0.911505
 -0.635994	 -1.739277	  0.903432
 -0.644824	 -1.693940	  0.897527
 -0.652878	 -1.645854	  0.894106
 -0.658530	 -1.600098	  0.893260
 -0.661124	 -1.556022	  0.894905
 -0.660240	 -1.508833	  0.899022
 -0.654986	 -1.454672	  0.905523
 -0.642840	 -1.389151	  0.913554
 -0.622312	 -1.315110	  0.920297
 -0.592484	 -1.232946	  0.922395
 -0.554780	 -1.145778	  0.914148
 -0.514030	 -1.061411	  0.892586
 -0.475461	 -0.985688	  0.861261
 -0.439932	 -0.918682	  0.823809
 -0.408719	 -0.858794	  0.782209
 -0.382755	 -0.804114	  0.738297
 -0.362914	 -0.753206	  0.693316
 -0.349890	 -0.706612	  0.650511
 -0.342454	 -0.665587	  0.612622
 -0.338634	 -0.630621	  0.580855
 -0.336568	 -0.601343	  0.555172
 -0.335083	 -0.576093	  0.534294
 -0.333965	 -0.550097	  0.514625
 -0.333406	 -0.520241	  0.494002
 -0.332974	 -0.486199	  0.472151
 -0.332470	 -0.448817	  0.449396
 -0.331839	 -0.408581	  0.425713
 -0.330970	 -0.365732	  0.400764
 -0.329939	 -0.320806	  0.374154
 -0.328845	 -0.275905	  0.346444
 -0.326921	 -0.233523	  0.319412
 -0.323449	 -0.194637	  0.294986
 -0.319603	 -0.158952	  0.273794
 -0.316333	 -0.126971	  0.256838
 -0.313785	 -0.097128	  0.243771
 -0.311545	 -0.064895	  0.232671
 -0.309103	 -0.027261	  0.222179
 -0.306107	  0.015295	  0.211879
 -0.302675	  0.061857	  0.201350
 -0.298895	  0.113578	  0.189472
 -0.295257	  0.170822	  0.174603
 -0.292724	  0.230977	  0.155841
 -0.292795	  0.292247	  0.132998
 -0.296200	  0.353624	  0.105698
 -0.301508	  0.412643	  0.074279
 -0.307136	  0.466773	  0.040837
 -0.312300	  0.515591	  0.007249
 -0.317200	  0.559431	 -0.024988
 -0.322273	  0.599762	 -0.055165
 -0.327722	  0.639290	 -0.084493
 -0.333176	  0.678813	 -0.113786
 -0.338322	  0.718678	 -0.143410
 -0.342947	  0.758302	 -0.173841
 -0.346897	  0.794889	 -0.203398
 -0.350630	  0.824463	 -0.228719
 -0.354561	  0.845761	 -0.247210
 -0.359139	  0.862171	 -0.261161
 -0.366382	  0.880831	 -0.276551
 -0.381122	  0.909723	 -0.300896
 -0.409186	  0.952784	 -0.342763
 -0.444824	  0.993483	 -0.395810
 -0.477400	  1.026142	 -0.444573
 -0.505806	  1.057604	 -0.486640
 -0.532959	  1.097265	 -0.526638
 -0.535295	  1.232425	 -0.533346
 -0.508914	  1.387412	 -0.595715
 -0.476465	  1.459328	 -0.621731
 -0.446342	  1.535851	 -0.611208
 -0.383627	  1.619780	 -0.611554
 -0.343359	  1.671136	 -0.617577
 -0.321740	  1.701757	 -0.619440
 -0.304959	  1.727470	 -0.619790
 -0.289075	  1.753586	 -0.619779
 -0.272013	  1.783571	 -0.620415
 -0.254129	  1.817634	 -0.623224
 -0.236298	  1.854830	 -0.628559
 -0.218023	  1.895488	 -0.637319
 -0.199568	  1.940075	 -0.649771
 -0.183206	  1.989194	 -0.666557
 -0.172056	  2.039013	 -0.685725
 -0.164837	  2.088333	 -0.705410
 -0.160013	  2.139276	 -0.726924
 -0.157349	  2.188706	 -0.749226
 -0.155663	  2.234715	 -0.770496
 -0.152985	  2.276241	 -0.790107
 -0.142356	  2.346746	 -0.823214
 -0.139520	  2.360582	 -0.829589
