  0.707580	  1.962229	  1.050380
  0.739824	  1.980672	  1.073527
  0.772068	  1.999115	  1.096674
  0.758501	  1.988960	  1.085669
  0.743176	  1.982230	  1.077155
  0.725334	  1.971783	  1.066181
  0.713520	  1.960820	  1.056728
  0.701854	  1.949433	  1.047124
  0.688389	  1.938007	  1.037068
  0.674386	  1.926991	  1.027076
  0.660606	  1.916502	  1.017069
  0.646825	  1.906069	  1.007009
  0.632985	  1.895721	  0.996940
  0.618655	  1.886143	  0.986795
  0.604320	  1.876574	  0.976650
  0.589835	  1.867219	  0.966518
  0.574869	  1.858586	  0.956444
  0.559896	  1.849963	  0.946370
  0.544785	  1.841635	  0.936382
  0.530903	  1.832579	  0.927007
  0.519455	  1.822842	  0.917534
  0.499675	  1.816147	  0.903433
  0.479238	  1.812612	  0.892742
  0.465815	  1.805175	  0.889142
  0.449196	  1.790052	  0.883730
  0.429033	  1.784925	  0.878133
  0.413970	  1.783273	  0.869063
  0.395730	  1.778639	  0.857403
  0.378860	  1.774864	  0.844212
  0.365262	  1.767557	  0.838297
  0.348170	  1.757670	  0.827517
  0.331443	  1.755051	  0.817416
  0.313619	  1.751595	  0.808978
  0.293220	  1.747380	  0.801737
  0.278195	  1.745325	  0.790915
  0.264773	  1.738572	  0.778176
  0.250154	  1.732503	  0.763640
  0.228404	  1.727851	  0.756542
  0.208459	  1.724483	  0.755801
  0.189498	  1.724248	  0.747768
  0.174188	  1.721044	  0.736557
  0.160286	  1.715897	  0.721163
  0.144495	  1.716783	  0.706453
  0.125648	  1.714089	  0.698885
  0.109547	  1.716197	  0.687987
  0.091935	  1.719919	  0.672169
  0.078527	  1.716450	  0.665741
  0.063447	  1.718441	  0.653724
  0.045022	  1.721829	  0.640052
  0.030311	  1.721549	  0.627163
  0.016671	  1.722799	  0.613130
  0.004724	  1.726662	  0.598406
 -0.009143	  1.730572	  0.583626
 -0.022058	  1.733586	  0.568801
 -0.033340	  1.736494	  0.552942
 -0.045214	  1.743487	  0.536703
 -0.059634	  1.751474	  0.524180
 -0.074776	  1.757981	  0.513505
 -0.089004	  1.764646	  0.500926
 -0.100824	  1.771530	  0.486466
 -0.114172	  1.778574	  0.473406
 -0.129457	  1.785443	  0.462335
 -0.142952	  1.793870	  0.450020
 -0.155670	  1.795157	  0.436012
 -0.165519	  1.790391	  0.425771
 -0.174871	  1.778710	  0.415310
 -0.180965	  1.760917	  0.409026
 -0.186936	  1.742684	  0.402842
 -0.190856	  1.724562	  0.395589
 -0.196067	  1.707083	  0.387703
 -0.200961	  1.689439	  0.379922
 -0.207231	  1.671284	  0.373982
 -0.212751	  1.653712	  0.368937
 -0.220701	  1.636216	  0.364371
 -0.229990	  1.617492	  0.358991
 -0.237342	  1.597266	  0.353797
 -0.244548	  1.582994	  0.353114
 -0.253680	  1.566553	  0.351298
 -0.265489	  1.544868	  0.344634
 -0.274561	  1.530429	  0.341966
 -0.288760	  1.518009	  0.335215
 -0.297063	  1.498559	  0.336121
 -0.305749	  1.478975	  0.332624
 -0.318373	  1.464974	  0.328597
 -0.342529	  1.456558	  0.325797
 -0.358129	  1.446697	  0.325800
 -0.371171	  1.432001	  0.325735
 -0.377796	  1.407607	  0.326338
 -0.389085	  1.388412	  0.328951
 -0.404846	  1.377644	  0.323760
 -0.414769	  1.366168	  0.312441
 -0.426950	  1.347777	  0.307043
 -0.443898	  1.336897	  0.307717
 -0.460730	  1.324200	  0.305010
 -0.469737	  1.307596	  0.300278
 -0.480714	  1.291582	  0.302081
 -0.497731	  1.274994	  0.302228
 -0.512661	  1.263468	  0.292650
 -0.525308	  1.252435	  0.285347
 -0.540809	  1.233388	  0.287623
 -0.552792	  1.224364	  0.289562
 -0.562364	  1.206687	  0.293147
 -0.575241	  1.186070	  0.296037
 -0.593689	  1.177593	  0.292253
 -0.612077	  1.166864	  0.297299
 -0.625864	  1.149609	  0.299721
 -0.635273	  1.137946	  0.298332
 -0.647883	  1.122973	  0.300270
 -0.666718	  1.106327	  0.304166
 -0.682598	  1.096283	  0.311711
 -0.692677	  1.083015	  0.317605
 -0.702600	  1.066164	  0.318192
 -0.720167	  1.049569	  0.316569
 -0.735137	  1.037888	  0.316450
 -0.750600	  1.030245	  0.316330
 -0.767785	  1.018670	  0.313401
 -0.782006	  1.001023	  0.321695
 -0.796739	  0.995132	  0.325012
 -0.814613	  0.986755	  0.318508
 -0.835926	  0.974879	  0.318505
 -0.850404	  0.963292	  0.320946
 -0.867777	  0.957848	  0.317570
 -0.891087	  0.954442	  0.315136
 -0.908572	  0.942429	  0.316257
 -0.922789	  0.933242	  0.319526
 -0.941138	  0.927126	  0.323909
 -0.966660	  0.920381	  0.322765
 -0.985213	  0.915437	  0.318922
 -1.000780	  0.916440	  0.317588
 -1.021691	  0.908604	  0.316669
 -1.042114	  0.902985	  0.315333
 -1.061073	  0.901728	  0.315674
 -1.081228	  0.900508	  0.315085
 -1.102850	  0.896171	  0.320596
 -1.121154	  0.890487	  0.320670
 -1.140882	  0.886252	  0.324293
 -1.160590	  0.886361	  0.331638
 -1.177505	  0.887659	  0.336331
 -1.198701	  0.884936	  0.337464
 -1.220106	  0.884712	  0.341077
 -1.239343	  0.882894	  0.343536
 -1.259983	  0.875866	  0.342724
 -1.279063	  0.871433	  0.348753
 -1.298297	  0.870266	  0.355681
 -1.313797	  0.876179	  0.369419
 -1.333551	  0.881172	  0.380019
 -1.351579	  0.882364	  0.382470
 -1.372328	  0.883247	  0.383779
 -1.393439	  0.886084	  0.387743
 -1.410427	  0.886198	  0.392761
 -1.431136	  0.886108	  0.397525
 -1.452347	  0.889687	  0.399408
 -1.469117	  0.890878	  0.401020
 -1.489889	  0.892999	  0.404574
 -1.508784	  0.897895	  0.407800
 -1.527636	  0.903831	  0.408081
 -1.547350	  0.908850	  0.408282
 -1.565806	  0.914444	  0.409758
 -1.585016	  0.919296	  0.412716
 -1.607114	  0.921032	  0.412571
 -1.625440	  0.924789	  0.407226
 -1.643664	  0.932390	  0.403753
 -1.660677	  0.942527	  0.399478
 -1.676663	  0.952054	  0.394719
 -1.693214	  0.960546	  0.389632
 -1.711499	  0.968779	  0.384398
 -1.729357	  0.975630	  0.379534
 -1.746748	  0.984132	  0.373457
 -1.763423	  0.993006	  0.366827
 -1.776064	  1.003573	  0.355507
 -1.788667	  1.014157	  0.344142
 -1.801225	  1.024717	  0.332748
 -1.813127	  1.034952	  0.320641
 -1.824629	  1.044946	  0.307481
 -1.833442	  1.053823	  0.292468
 -1.841367	  1.062672	  0.276893
 -1.850486	  1.073072	  0.261976
 -1.857986	  1.082376	  0.246588
 -1.864020	  1.090937	  0.230868
 -1.867855	  1.097871	  0.213319
 -1.873157	  1.101390	  0.194160
 -1.877176	  1.100982	  0.174973
 -1.882382	  1.101082	  0.157421
 -1.885364	  1.099574	  0.137989
 -1.888399	  1.093096	  0.119038
 -1.891591	  1.086031	  0.100534
 -1.894582	  1.077874	  0.082581
 -1.896570	  1.068085	  0.065176
 -1.898526	  1.058303	  0.047841
 -1.900480	  1.048518	  0.030508
 -1.902244	  1.038539	  0.013293
 -1.904004	  1.028824	 -0.004067
 -1.905558	  1.019537	 -0.021933
 -1.906405	  1.009586	 -0.039332
 -1.908182	  0.999533	 -0.056114
 -1.910294	  0.988654	 -0.073274
 -1.910166	  0.980157	 -0.091643
 -1.907325	  0.969307	 -0.108862
 -1.906483	  0.958388	 -0.124957
 -1.907355	  0.945129	 -0.139803
 -1.908074	  0.932335	 -0.156522
 -1.906948	  0.922468	 -0.174084
 -1.911313	  0.916919	 -0.189693
 -1.916511	  0.910196	 -0.203086
 -1.933518	  0.905265	 -0.213038
 -1.948993	  0.898421	 -0.222114
 -1.964013	  0.891141	 -0.231895
 -1.980507	  0.884625	 -0.242543
 -1.995922	  0.877875	 -0.252949
 -2.012876	  0.873701	 -0.263137
 -2.029932	  0.870201	 -0.273073
 -2.046910	  0.866417	 -0.282944
 -2.063863	  0.862465	 -0.292791
 -2.080810	  0.858509	 -0.302646
 -2.097162	  0.854472	 -0.313432
 -2.113459	  0.850427	 -0.324296
 -2.129744	  0.846389	 -0.335181
 -2.145953	  0.842399	 -0.346197
 -2.162162	  0.838406	 -0.357212
 -2.178441	  0.834079	 -0.367995
 -2.194758	  0.829560	 -0.378641
 -2.211131	  0.824741	 -0.389066
 -2.227611	  0.819395	 -0.399056
 -2.244078	  0.813964	 -0.409027
 -2.260566	  0.807952	 -0.418618
 -2.277068	  0.801970	 -0.428205
 -2.293604	  0.795596	 -0.437473
 -2.310155	  0.789021	 -0.446576
 -2.326705	  0.782444	 -0.455677
 -2.330359	  0.780992	 -0.457687
 -2.343255	  0.775868	 -0.464779
