 -1.848784	 -1.436563	  0.959172
 -1.891428	 -1.435708	  0.973939
 -1.872682	 -1.436203	  0.966985
 -1.853989	 -1.436741	  0.959896
 -1.835302	 -1.437283	  0.952790
 -1.816799	 -1.437878	  0.945234
 -1.798382	 -1.439012	  0.939221
 -1.779773	 -1.441515	  0.935804
 -1.759242	 -1.444988	  0.928070
 -1.740186	 -1.447851	  0.913011
 -1.725812	 -1.445224	  0.903314
 -1.707520	 -1.441543	  0.897004
 -1.688534	 -1.440696	  0.889177
 -1.670444	 -1.441126	  0.880943
 -1.652830	 -1.439305	  0.874439
 -1.631992	 -1.436009	  0.864403
 -1.615434	 -1.437633	  0.852885
 -1.600486	 -1.441086	  0.845825
 -1.580930	 -1.445245	  0.837014
 -1.562294	 -1.444547	  0.824244
 -1.546555	 -1.435739	  0.815217
 -1.530000	 -1.427540	  0.808440
 -1.510617	 -1.423381	  0.799599
 -1.493125	 -1.426635	  0.791107
 -1.474783	 -1.427712	  0.783458
 -1.456747	 -1.426855	  0.774535
 -1.438360	 -1.426834	  0.763288
 -1.421506	 -1.426004	  0.751877
 -1.403906	 -1.420321	  0.745534
 -1.383801	 -1.412278	  0.740233
 -1.365183	 -1.403891	  0.730778
 -1.353071	 -1.398603	  0.724220
 -1.334564	 -1.396264	  0.716807
 -1.311232	 -1.388251	  0.710887
 -1.294846	 -1.376498	  0.708067
 -1.280335	 -1.364781	  0.702899
 -1.263297	 -1.357050	  0.692581
 -1.249569	 -1.354632	  0.681024
 -1.233155	 -1.348311	  0.666726
 -1.217543	 -1.337098	  0.659429
 -1.197567	 -1.326413	  0.657358
 -1.181335	 -1.320714	  0.653211
 -1.164041	 -1.313522	  0.642031
 -1.151827	 -1.303019	  0.628328
 -1.136955	 -1.291328	  0.615196
 -1.126836	 -1.283310	  0.606108
 -1.110067	 -1.274373	  0.597025
 -1.091489	 -1.263976	  0.589895
 -1.075767	 -1.258911	  0.584148
 -1.057140	 -1.256373	  0.575000
 -1.036802	 -1.249024	  0.566936
 -1.025413	 -1.239562	  0.557326
 -1.011631	 -1.230231	  0.545021
 -0.994104	 -1.221144	  0.535124
 -0.977573	 -1.211274	  0.528210
 -0.965638	 -1.204481	  0.520214
 -0.950276	 -1.195152	  0.507433
 -0.931415	 -1.187619	  0.495058
 -0.915255	 -1.182101	  0.484915
 -0.899527	 -1.170765	  0.481353
 -0.883892	 -1.157177	  0.483723
 -0.861043	 -1.138177	  0.488927
 -0.847804	 -1.129496	  0.497548
 -0.827135	 -1.116138	  0.509400
 -0.811930	 -1.105001	  0.512876
 -0.802543	 -1.098866	  0.512070
 -0.784439	 -1.083050	  0.507243
 -0.767122	 -1.070110	  0.506921
 -0.751358	 -1.062003	  0.510380
 -0.730942	 -1.054114	  0.509385
 -0.712567	 -1.044678	  0.506814
 -0.696988	 -1.033826	  0.508408
 -0.680395	 -1.021800	  0.508665
 -0.661313	 -1.013251	  0.506401
 -0.643323	 -1.009487	  0.508189
 -0.615315	 -1.003840	  0.511105
 -0.604195	 -1.002192	  0.510864
 -0.583284	 -0.997649	  0.505692
 -0.562414	 -0.992613	  0.502697
 -0.545042	 -0.988989	  0.500685
 -0.524732	 -0.986835	  0.495916
 -0.502298	 -0.986665	  0.489902
 -0.487848	 -0.986496	  0.486846
 -0.467216	 -0.985851	  0.480662
 -0.449105	 -0.989632	  0.471062
 -0.433986	 -0.991721	  0.464430
 -0.408494	 -0.992595	  0.457182
 -0.385799	 -0.996136	  0.453057
 -0.376408	 -1.000717	  0.447960
 -0.364522	 -1.008304	  0.437741
 -0.347009	 -1.020534	  0.422883
 -0.326996	 -1.026411	  0.416864
 -0.307953	 -1.027399	  0.411208
 -0.292242	 -1.031987	  0.400385
 -0.277360	 -1.042470	  0.388152
 -0.261686	 -1.048385	  0.381949
 -0.243332	 -1.054004	  0.372923
 -0.230322	 -1.066436	  0.362217
 -0.216441	 -1.082589	  0.351828
 -0.203848	 -1.089704	  0.342401
 -0.190398	 -1.093974	  0.328608
 -0.176743	 -1.102336	  0.314144
 -0.158153	 -1.110657	  0.303915
 -0.141244	 -1.115690	  0.295449
 -0.126105	 -1.113256	  0.282731
 -0.110384	 -1.110896	  0.267427
 -0.093809	 -1.113366	  0.256158
 -0.074907	 -1.123261	  0.249360
 -0.057030	 -1.129971	  0.241390
 -0.040998	 -1.132640	  0.230547
 -0.026136	 -1.134995	  0.218358
 -0.009145	 -1.140953	  0.208518
  0.012055	 -1.142456	  0.201285
  0.027867	 -1.138842	  0.189973
  0.040451	 -1.137149	  0.175340
  0.059087	 -1.133503	  0.162642
  0.082438	 -1.133021	  0.155736
  0.095419	 -1.136984	  0.148807
  0.109780	 -1.141079	  0.136305
  0.130136	 -1.143388	  0.124855
  0.144419	 -1.147664	  0.110520
  0.154584	 -1.150488	  0.096030
  0.170554	 -1.151359	  0.081568
  0.187232	 -1.151555	  0.069800
  0.203774	 -1.151393	  0.058563
  0.220445	 -1.151053	  0.047517
  0.237430	 -1.149866	  0.037023
  0.254421	 -1.148660	  0.026543
  0.271757	 -1.146007	  0.016930
  0.289213	 -1.142661	  0.007760
  0.306665	 -1.139298	 -0.001410
  0.323600	 -1.133803	 -0.010519
  0.340210	 -1.127295	 -0.019560
  0.356818	 -1.120784	 -0.028603
  0.373402	 -1.114259	 -0.037673
  0.387205	 -1.105923	 -0.049495
  0.400090	 -1.097130	 -0.062013
  0.412969	 -1.088338	 -0.074535
  0.425826	 -1.079547	 -0.087078
  0.435871	 -1.070903	 -0.102053
  0.444926	 -1.062369	 -0.117711
  0.453965	 -1.053832	 -0.133376
  0.462101	 -1.046012	 -0.149884
  0.469381	 -1.038850	 -0.167084
  0.476668	 -1.031735	 -0.184313
  0.483742	 -1.026369	 -0.202042
  0.489059	 -1.021603	 -0.219749
  0.495104	 -1.018442	 -0.236532
  0.508082	 -1.012137	 -0.258947
  0.518903	 -1.009270	 -0.272730
  0.531125	 -1.009149	 -0.289773
  0.540249	 -1.009166	 -0.306825
  0.549585	 -1.007098	 -0.322560
  0.560961	 -1.005129	 -0.339641
  0.572122	 -1.005042	 -0.357317
  0.580840	 -1.004728	 -0.373927
  0.591750	 -1.004136	 -0.390777
  0.603805	 -1.004002	 -0.407816
  0.613096	 -1.003325	 -0.424124
  0.623728	 -1.001932	 -0.442407
  0.635872	 -1.000476	 -0.457064
  0.646943	 -0.997515	 -0.473295
  0.662943	 -0.995029	 -0.491592
  0.679406	 -0.992852	 -0.500941
  0.695094	 -0.989721	 -0.506393
  0.713073	 -0.987388	 -0.518668
  0.724759	 -0.987964	 -0.535579
  0.737085	 -0.990339	 -0.556170
  0.754577	 -0.996758	 -0.573444
  0.771176	 -1.002798	 -0.580774
  0.788491	 -1.004939	 -0.589009
  0.806031	 -1.001459	 -0.596334
  0.828188	 -0.996877	 -0.603056
  0.849045	 -0.992866	 -0.607894
  0.865863	 -0.992277	 -0.611244
  0.884424	 -0.998675	 -0.614434
  0.906588	 -1.007577	 -0.623550
  0.921948	 -1.012621	 -0.629051
  0.942609	 -1.018170	 -0.630303
  0.961618	 -1.022530	 -0.632889
  0.977165	 -1.024769	 -0.639620
  0.997667	 -1.029651	 -0.646489
  1.016316	 -1.036535	 -0.647018
  1.035909	 -1.044051	 -0.646842
  1.054338	 -1.054234	 -0.647645
  1.070306	 -1.064327	 -0.654677
  1.086982	 -1.070836	 -0.663028
  1.105517	 -1.076000	 -0.671146
  1.122353	 -1.084779	 -0.680131
  1.138267	 -1.096418	 -0.683995
  1.155490	 -1.105251	 -0.684357
  1.174050	 -1.113651	 -0.685158
  1.191361	 -1.127682	 -0.690489
  1.205546	 -1.139248	 -0.699806
  1.221697	 -1.144537	 -0.707437
  1.240569	 -1.150308	 -0.712703
  1.258767	 -1.159522	 -0.716959
  1.275134	 -1.171610	 -0.722519
  1.291322	 -1.178777	 -0.729774
  1.312090	 -1.179396	 -0.733994
  1.333515	 -1.179787	 -0.736327
  1.351203	 -1.181764	 -0.739932
  1.370088	 -1.185470	 -0.751303
  1.389883	 -1.188949	 -0.767246
  1.406885	 -1.190427	 -0.777253
  1.418254	 -1.193367	 -0.780103
  1.440882	 -1.197147	 -0.783373
  1.460961	 -1.199702	 -0.786709
  1.481261	 -1.198836	 -0.789768
  1.501098	 -1.197413	 -0.791693
  1.520985	 -1.195027	 -0.792146
  1.540619	 -1.192752	 -0.793835
  1.560227	 -1.188886	 -0.791708
  1.579896	 -1.185362	 -0.791013
  1.599114	 -1.180706	 -0.789325
  1.618232	 -1.175580	 -0.786208
  1.636908	 -1.169785	 -0.782115
  1.654943	 -1.163021	 -0.776760
  1.672941	 -1.156207	 -0.771311
  1.689651	 -1.147798	 -0.764239
  1.705884	 -1.138899	 -0.756670
  1.722111	 -1.129994	 -0.749096
  1.738094	 -1.120672	 -0.741504
  1.753047	 -1.109795	 -0.733886
  1.767991	 -1.098903	 -0.726266
  1.782935	 -1.088012	 -0.718647
  1.797880	 -1.077113	 -0.711041
  1.812896	 -1.065280	 -0.705172
  1.827892	 -1.053049	 -0.700119
  1.842890	 -1.040820	 -0.695069
  1.857885	 -1.028586	 -0.690022
  1.872861	 -1.016319	 -0.685022
  1.888280	 -1.003848	 -0.682515
  1.903905	 -0.991400	 -0.681529
  1.919513	 -0.978937	 -0.680506
  1.935089	 -0.966448	 -0.679359
  1.950662	 -0.953959	 -0.678223
  1.966705	 -0.942120	 -0.679744
  1.982863	 -0.930665	 -0.682518
  1.999022	 -0.919214	 -0.685303
  2.015179	 -0.907760	 -0.688090
  2.031695	 -0.897240	 -0.692151
  2.048475	 -0.887782	 -0.697537
  2.065252	 -0.878321	 -0.702925
  2.082041	 -0.868913	 -0.708361
  2.099117	 -0.861399	 -0.715565
  2.116196	 -0.853903	 -0.722784
  2.133275	 -0.846431	 -0.730022
  2.150434	 -0.840576	 -0.738462
  2.167593	 -0.834769	 -0.746939
  2.184748	 -0.829262	 -0.755620
  2.201857	 -0.824798	 -0.764966
  2.218963	 -0.820352	 -0.774325
  2.236031	 -0.816598	 -0.784051
  2.253054	 -0.813341	 -0.794031
  2.270079	 -0.810090	 -0.804013
  2.287101	 -0.807216	 -0.814142
  2.304094	 -0.804650	 -0.824372
