 -1.332796	 -1.872374	  0.792748
 -1.367057	 -1.893754	  0.781376
 -1.352521	 -1.888254	  0.777221
 -1.332487	 -1.879798	  0.776759
 -1.314157	 -1.870358	  0.780986
 -1.299180	 -1.862075	  0.786507
 -1.270442	 -1.845490	  0.793930
 -1.257481	 -1.837152	  0.796222
 -1.242003	 -1.832533	  0.797967
 -1.228569	 -1.826096	  0.798256
 -1.213330	 -1.816379	  0.799541
 -1.191955	 -1.803101	  0.803279
 -1.176290	 -1.791529	  0.806329
 -1.159226	 -1.779046	  0.806992
 -1.139642	 -1.765436	  0.804580
 -1.127656	 -1.758245	  0.801150
 -1.108902	 -1.745089	  0.798837
 -1.091992	 -1.734054	  0.798867
 -1.078645	 -1.725719	  0.802571
 -1.061097	 -1.713717	  0.810626
 -1.044464	 -1.705051	  0.817039
 -1.028562	 -1.694830	  0.825505
 -1.012316	 -1.684645	  0.832657
 -0.999483	 -1.676045	  0.836873
 -0.983321	 -1.665685	  0.842771
 -0.967812	 -1.652745	  0.848654
 -0.955770	 -1.636554	  0.855076
 -0.939913	 -1.617986	  0.860374
 -0.921736	 -1.604458	  0.863110
 -0.909266	 -1.594681	  0.863112
 -0.897400	 -1.582809	  0.866628
 -0.886673	 -1.571007	  0.873376
 -0.874884	 -1.552490	  0.889700
 -0.861039	 -1.537372	  0.902356
 -0.846224	 -1.526346	  0.911927
 -0.835587	 -1.516955	  0.918327
 -0.818932	 -1.502402	  0.927609
 -0.799686	 -1.489296	  0.934568
 -0.786520	 -1.482245	  0.938640
 -0.773360	 -1.477274	  0.942123
 -0.753358	 -1.467484	  0.953185
 -0.730571	 -1.459308	  0.963805
 -0.709869	 -1.452476	  0.967812
 -0.693634	 -1.448069	  0.966545
 -0.676233	 -1.438553	  0.966169
 -0.657840	 -1.428149	  0.969477
 -0.639901	 -1.419339	  0.970166
 -0.622459	 -1.410765	  0.972737
 -0.605202	 -1.401812	  0.976319
 -0.588098	 -1.388814	  0.973091
 -0.565850	 -1.374784	  0.970919
 -0.548810	 -1.365865	  0.975001
 -0.536173	 -1.358810	  0.977718
 -0.520292	 -1.348549	  0.986110
 -0.500995	 -1.339830	  1.002957
 -0.491951	 -1.334073	  1.017797
 -0.483995	 -1.327990	  1.036157
 -0.470482	 -1.317354	  1.053255
 -0.460580	 -1.308099	  1.062690
 -0.446347	 -1.294748	  1.070458
 -0.435657	 -1.281609	  1.082189
 -0.429141	 -1.271893	  1.096586
 -0.425373	 -1.260956	  1.114600
 -0.418821	 -1.247919	  1.129618
 -0.412275	 -1.236308	  1.139870
 -0.403273	 -1.223769	  1.150057
 -0.390373	 -1.209714	  1.172068
 -0.384777	 -1.198431	  1.190639
 -0.381566	 -1.191567	  1.200038
 -0.379204	 -1.173304	  1.212984
 -0.378936	 -1.154462	  1.219342
 -0.371189	 -1.139514	  1.231564
 -0.360950	 -1.129018	  1.241996
 -0.343476	 -1.120817	  1.243595
 -0.324931	 -1.111268	  1.245948
 -0.311483	 -1.103957	  1.251755
 -0.294019	 -1.101498	  1.252062
 -0.267699	 -1.090952	  1.246136
 -0.252941	 -1.077527	  1.253958
 -0.238230	 -1.063633	  1.262913
 -0.223236	 -1.056383	  1.265781
 -0.202842	 -1.050301	  1.262741
 -0.187056	 -1.045072	  1.256038
 -0.175159	 -1.042309	  1.247033
 -0.162198	 -1.038666	  1.238681
 -0.145253	 -1.041471	  1.228406
 -0.118553	 -1.046398	  1.219945
 -0.097560	 -1.044000	  1.213569
 -0.083466	 -1.039889	  1.207474
 -0.071452	 -1.036185	  1.197351
 -0.055005	 -1.035111	  1.182520
 -0.039708	 -1.035108	  1.170284
 -0.021412	 -1.039415	  1.158693
 -0.001376	 -1.039330	  1.148608
  0.014311	 -1.034171	  1.138683
  0.029013	 -1.030407	  1.125634
  0.044391	 -1.027332	  1.112862
  0.058382	 -1.023912	  1.100331
  0.072065	 -1.018693	  1.085991
  0.092371	 -1.010769	  1.078611
  0.117562	 -1.004966	  1.074575
  0.132536	 -1.003220	  1.069120
  0.147805	 -1.001092	  1.059383
  0.164806	 -0.994652	  1.049050
  0.183948	 -0.988542	  1.043726
  0.202278	 -0.985585	  1.040499
  0.224299	 -0.982096	  1.035499
  0.240980	 -0.975240	  1.033164
  0.254843	 -0.965516	  1.033488
  0.272798	 -0.948310	  1.036498
  0.294171	 -0.937797	  1.037296
  0.308693	 -0.934572	  1.038248
  0.332618	 -0.929345	  1.040869
  0.350750	 -0.924073	  1.042721
  0.364290	 -0.920557	  1.043495
  0.386218	 -0.914392	  1.041815
  0.405320	 -0.907871	  1.048921
  0.421946	 -0.899339	  1.054944
  0.442927	 -0.880082	  1.052675
  0.457881	 -0.867633	  1.052889
  0.471630	 -0.858447	  1.053051
  0.489627	 -0.850210	  1.055523
  0.509451	 -0.843463	  1.057925
  0.525859	 -0.836987	  1.057205
  0.546051	 -0.827207	  1.056028
  0.569016	 -0.814855	  1.058085
  0.586448	 -0.804950	  1.066926
  0.596988	 -0.798684	  1.072636
  0.610435	 -0.790556	  1.080524
  0.632468	 -0.780108	  1.074716
  0.655251	 -0.766072	  1.070653
  0.669133	 -0.755717	  1.070872
  0.681112	 -0.744351	  1.073920
  0.696846	 -0.736048	  1.078606
  0.716242	 -0.730344	  1.082068
  0.744576	 -0.714228	  1.085705
  0.757422	 -0.698756	  1.092004
  0.763609	 -0.690548	  1.096145
  0.776567	 -0.680627	  1.107447
  0.795744	 -0.671226	  1.115769
  0.813492	 -0.662345	  1.120896
  0.830103	 -0.651968	  1.125132
  0.847549	 -0.643036	  1.128961
  0.865013	 -0.633406	  1.132129
  0.882449	 -0.623654	  1.134150
  0.899936	 -0.613860	  1.135838
  0.917334	 -0.603050	  1.136819
  0.934288	 -0.591664	  1.137307
  0.948978	 -0.577998	  1.137236
  0.963667	 -0.564253	  1.137357
  0.979035	 -0.551468	  1.137395
  0.995667	 -0.540067	  1.136379
  1.012192	 -0.528511	  1.135475
  1.027453	 -0.516091	  1.136287
  1.043078	 -0.505093	  1.133177
  1.060696	 -0.493973	  1.128089
  1.076205	 -0.483723	  1.128374
  1.095337	 -0.475911	  1.123997
  1.116702	 -0.464041	  1.121352
  1.133722	 -0.450051	  1.124948
  1.144169	 -0.438364	  1.134657
  1.159467	 -0.427088	  1.142286
  1.177415	 -0.417068	  1.145284
  1.194928	 -0.407771	  1.148504
  1.212730	 -0.399131	  1.152120
  1.230618	 -0.391009	  1.156520
  1.248496	 -0.382919	  1.161245
  1.265933	 -0.374442	  1.167230
  1.283077	 -0.366463	  1.173914
  1.299119	 -0.358691	  1.180344
  1.317363	 -0.351044	  1.180583
  1.336834	 -0.341262	  1.181056
  1.352387	 -0.326576	  1.187228
  1.370924	 -0.311343	  1.197806
  1.385944	 -0.301270	  1.206083
  1.396617	 -0.292364	  1.216390
  1.412186	 -0.281685	  1.230349
  1.426678	 -0.271790	  1.239449
  1.438427	 -0.264593	  1.247411
  1.451778	 -0.256015	  1.258971
  1.464518	 -0.245273	  1.271805
  1.476086	 -0.231655	  1.281950
  1.487259	 -0.219769	  1.290314
  1.499402	 -0.195945	  1.303200
  1.506732	 -0.180073	  1.310983
  1.513466	 -0.172712	  1.315473
  1.527856	 -0.159639	  1.322180
  1.544376	 -0.149189	  1.330317
  1.561870	 -0.135454	  1.338684
  1.577851	 -0.123011	  1.343193
  1.591502	 -0.113018	  1.346907
  1.615140	 -0.095542	  1.350114
  1.632595	 -0.080837	  1.353954
  1.642594	 -0.071770	  1.355751
  1.655190	 -0.056644	  1.357820
  1.670144	 -0.042044	  1.354471
  1.686431	 -0.029089	  1.347405
  1.703407	 -0.017937	  1.337242
  1.720848	 -0.009528	  1.328719
  1.739351	 -0.002190	  1.324052
  1.758202	  0.005618	  1.323259
  1.776705	  0.015028	  1.324616
  1.793137	  0.025852	  1.326495
  1.809462	  0.038020	  1.327449
  1.825543	  0.047475	  1.326463
  1.845401	  0.054667	  1.326742
  1.864422	  0.058164	  1.329727
  1.883166	  0.062538	  1.333801
  1.901126	  0.070262	  1.340938
  1.917364	  0.084772	  1.347977
  1.930324	  0.099888	  1.351680
  1.943794	  0.116107	  1.349224
  1.963378	  0.127038	  1.345858
  1.982504	  0.131299	  1.344880
  2.003578	  0.137061	  1.345480
  2.022437	  0.144730	  1.349256
  2.040843	  0.151842	  1.354394
  2.059520	  0.155731	  1.363418
  2.077413	  0.163699	  1.367463
