 -0.910628	  2.853726	  0.455962
 -0.901612	  2.825472	  0.451448
 -0.866318	  2.796365	  0.437710
 -0.836300	  2.759200	  0.423004
 -0.803049	  2.729040	  0.400647
 -0.773067	  2.694538	  0.382999
 -0.746368	  2.655946	  0.368447
 -0.713385	  2.624431	  0.345665
 -0.681427	  2.590767	  0.326332
 -0.649860	  2.558112	  0.306669
 -0.622115	  2.526227	  0.284214
 -0.593560	  2.495071	  0.261188
 -0.561882	  2.463432	  0.238571
 -0.529083	  2.430331	  0.217026
 -0.496386	  2.396859	  0.197468
 -0.464318	  2.363250	  0.180120
 -0.432605	  2.328541	  0.163324
 -0.403415	  2.292582	  0.145155
 -0.380274	  2.258158	  0.121789
 -0.367050	  2.232778	  0.096714
 -0.361843	  2.212075	  0.064493
 -0.370247	  2.178868	 -0.008918
 -0.406330	  2.123681	 -0.119933
 -0.455341	  2.050079	 -0.219479
 -0.500615	  1.988363	 -0.283306
 -0.546463	  1.947146	 -0.324113
 -0.596551	  1.921156	 -0.355217
 -0.601203	  1.916270	 -0.365366
 -0.609515	  1.913528	 -0.363748
 -0.578752	  1.910785	 -0.349152
 -0.481222	  1.875790	 -0.221794
 -0.374231	  1.699993	  0.067849
 -0.271976	  1.483835	  0.154485
 -0.124907	  1.286154	  0.103968
 -0.008150	  1.237233	 -0.015305
  0.028250	  1.238409	 -0.069351
  0.030603	  1.236134	 -0.075961
  0.041849	  1.239092	 -0.091653
  0.051333	  1.228791	 -0.078802
  0.049952	  1.211269	 -0.067704
  0.051826	  1.189069	 -0.057080
  0.066027	  1.147528	 -0.027627
  0.106918	  1.066222	  0.031395
  0.167897	  0.979547	  0.096726
  0.213713	  0.916642	  0.132226
  0.247207	  0.865397	  0.146197
  0.270589	  0.828484	  0.149497
  0.299927	  0.786763	  0.139917
  0.322906	  0.751519	  0.118167
  0.341486	  0.727665	  0.092072
  0.373319	  0.692649	  0.038294
  0.408751	  0.658841	 -0.045564
  0.430616	  0.642972	 -0.112296
  0.447249	  0.636540	 -0.163883
  0.452257	  0.631312	 -0.229253
  0.461141	  0.628528	 -0.325770
  0.480991	  0.614346	 -0.429032
  0.507590	  0.580358	 -0.499811
  0.536530	  0.542293	 -0.555389
  0.556933	  0.517353	 -0.589532
  0.582892	  0.496215	 -0.621027
  0.606610	  0.479346	 -0.641879
  0.636276	  0.468405	 -0.651463
  0.673418	  0.461473	 -0.664349
  0.742604	  0.459018	 -0.688139
  0.825604	  0.471860	 -0.711285
  0.934477	  0.495437	 -0.733971
  1.042163	  0.499052	 -0.759354
  1.104895	  0.480016	 -0.779783
  1.144753	  0.454281	 -0.795740
  1.178184	  0.422123	 -0.810886
  1.208150	  0.385108	 -0.825365
  1.235890	  0.345578	 -0.838368
  1.262873	  0.306018	 -0.849256
  1.291692	  0.265499	 -0.859776
  1.321583	  0.227658	 -0.871632
  1.353555	  0.191318	 -0.887956
  1.386217	  0.158255	 -0.907136
  1.416411	  0.126880	 -0.927661
  1.446022	  0.094344	 -0.950953
  1.476405	  0.060964	 -0.976195
  1.506321	  0.028845	 -1.000383
  1.535641	 -0.001520	 -1.023201
  1.566389	 -0.033588	 -1.045593
  1.598590	 -0.068193	 -1.067068
  1.630557	 -0.103271	 -1.086163
  1.661927	 -0.136980	 -1.103312
  1.694568	 -0.171196	 -1.119862
  1.726465	 -0.203769	 -1.135034
  1.757893	 -0.236579	 -1.150719
  1.788721	 -0.269805	 -1.167179
  1.819652	 -0.304450	 -1.185250
  1.848963	 -0.338006	 -1.203845
  1.877806	 -0.373176	 -1.224609
  1.906860	 -0.413070	 -1.239321
  1.939070	 -0.451048	 -1.249952
  1.966520	 -0.484920	 -1.275053
  2.002138	 -0.515577	 -1.291934
  2.033177	 -0.550020	 -1.307577
  2.064198	 -0.582296	 -1.330072
  2.092210	 -0.617830	 -1.351944
  2.121786	 -0.651388	 -1.374083
  2.150046	 -0.688212	 -1.392974
  2.178913	 -0.728106	 -1.404089
  2.211622	 -0.759600	 -1.426449
  2.239686	 -0.800318	 -1.437791
  2.272074	 -0.834274	 -1.451548
  2.301344	 -0.866672	 -1.471464
  2.329163	 -0.904249	 -1.491478
  2.361360	 -0.939942	 -1.509483
  2.386811	 -0.976069	 -1.533109
  2.410679	 -0.985830	 -1.548440
