 -1.076237	  1.642768	 -1.782336
 -1.090580	  1.642700	 -1.788310
 -1.084049	  1.651295	 -1.810493
 -1.065641	  1.658183	 -1.819221
 -1.049538	  1.664882	 -1.829053
 -1.032237	  1.671211	 -1.837102
 -1.016708	  1.678059	 -1.847583
 -0.999324	  1.684377	 -1.855732
 -0.983264	  1.691246	 -1.865703
 -0.965399	  1.698425	 -1.874417
 -0.940603	  1.701940	 -1.873955
 -0.924477	  1.707600	 -1.884345
