 -2.060235	 -0.455298	 -1.032843
 -2.098217	 -0.482253	 -1.044284
 -2.084317	 -0.478454	 -1.039256
 -2.065263	 -0.464406	 -1.032459
 -2.052810	 -0.448307	 -1.030307
 -2.038248	 -0.428813	 -1.030135
 -2.018819	 -0.415662	 -1.026824
 -2.004886	 -0.410609	 -1.022653
 -1.984883	 -0.405268	 -1.014925
 -1.967687	 -0.400305	 -1.008089
 -1.951779	 -0.394058	 -1.001676
 -1.929352	 -0.379409	 -0.995217
 -1.916390	 -0.370039	 -0.994107
 -1.899672	 -0.359439	 -0.993940
 -1.882927	 -0.353527	 -0.993085
 -1.862253	 -0.350018	 -0.987797
 -1.840380	 -0.343729	 -0.980303
 -1.822300	 -0.329299	 -0.973495
 -1.809758	 -0.314338	 -0.968646
 -1.796885	 -0.299470	 -0.965004
 -1.782265	 -0.287669	 -0.961032
 -1.766236	 -0.278540	 -0.954234
 -1.750406	 -0.269833	 -0.945758
 -1.733939	 -0.260677	 -0.936710
 -1.717371	 -0.249191	 -0.927748
 -1.704113	 -0.240077	 -0.920183
 -1.688594	 -0.230793	 -0.912322
 -1.671622	 -0.220233	 -0.904300
 -1.658017	 -0.209106	 -0.897165
 -1.641968	 -0.198596	 -0.889906
 -1.625509	 -0.190496	 -0.884429
 -1.609786	 -0.186447	 -0.878035
 -1.590572	 -0.182259	 -0.866958
 -1.570853	 -0.170828	 -0.852027
 -1.555882	 -0.159064	 -0.842055
 -1.547730	 -0.151563	 -0.839433
 -1.534943	 -0.131292	 -0.837803
 -1.516592	 -0.113109	 -0.838531
 -1.504207	 -0.106996	 -0.833425
 -1.485863	 -0.100193	 -0.820128
 -1.468193	 -0.095853	 -0.809900
 -1.455861	 -0.094659	 -0.801263
 -1.437685	 -0.092342	 -0.785755
 -1.419248	 -0.091613	 -0.774899
 -1.398636	 -0.086802	 -0.768163
 -1.375534	 -0.066955	 -0.757462
 -1.360609	 -0.051710	 -0.751276
 -1.353672	 -0.043839	 -0.745662
 -1.342004	 -0.030992	 -0.732597
 -1.328227	 -0.024385	 -0.717205
 -1.321359	 -0.018801	 -0.705693
 -1.313083	 -0.006232	 -0.686384
 -1.300920	  0.011046	 -0.666060
 -1.284281	  0.022320	 -0.655991
 -1.276500	  0.026118	 -0.648209
 -1.256792	  0.037996	 -0.637690
 -1.240689	  0.046830	 -0.626214
 -1.230444	  0.051574	 -0.621205
 -1.209593	  0.065769	 -0.608936
 -1.188943	  0.082584	 -0.597680
 -1.178126	  0.089525	 -0.592378
 -1.172165	  0.096376	 -0.586124
 -1.155602	  0.108320	 -0.579202
 -1.139634	  0.121869	 -0.567711
 -1.124596	  0.134565	 -0.553541
 -1.114715	  0.140527	 -0.544305
 -1.101417	  0.150671	 -0.531275
 -1.086472	  0.160481	 -0.519592
 -1.071304	  0.170227	 -0.509760
 -1.056273	  0.177995	 -0.499507
 -1.041674	  0.184532	 -0.487893
 -1.025886	  0.189501	 -0.475224
 -1.012093	  0.195055	 -0.465176
 -0.994632	  0.204447	 -0.455992
 -0.980806	  0.211804	 -0.445552
 -0.965061	  0.220032	 -0.430955
 -0.952509	  0.226452	 -0.422916
 -0.935132	  0.234390	 -0.414296
 -0.913345	  0.244125	 -0.405754
 -0.895060	  0.252536	 -0.399479
 -0.882357	  0.258683	 -0.391313
 -0.860187	  0.275145	 -0.381287
 -0.851700	  0.283536	 -0.378960
 -0.840189	  0.292133	 -0.374447
 -0.819917	  0.305377	 -0.365277
 -0.798018	  0.318252	 -0.360326
 -0.788294	  0.323506	 -0.356566
 -0.771698	  0.335834	 -0.354485
 -0.753181	  0.345231	 -0.348805
 -0.735319	  0.352517	 -0.343517
 -0.720203	  0.361308	 -0.334976
 -0.708457	  0.374661	 -0.325607
 -0.693409	  0.389495	 -0.315974
 -0.672527	  0.397826	 -0.302866
 -0.660480	  0.400325	 -0.296602
 -0.641116	  0.403917	 -0.289095
 -0.621650	  0.407276	 -0.283060
 -0.605023	  0.412572	 -0.277194
 -0.586496	  0.420142	 -0.271083
 -0.570151	  0.427400	 -0.267759
 -0.550339	  0.434190	 -0.262960
 -0.526741	  0.443954	 -0.251305
 -0.511984	  0.451847	 -0.241611
 -0.501295	  0.455234	 -0.236633
 -0.480863	  0.462184	 -0.228516
 -0.459413	  0.463819	 -0.215305
 -0.445045	  0.462020	 -0.204065
 -0.431900	  0.460727	 -0.191605
 -0.415948	  0.459388	 -0.182631
 -0.393668	  0.454993	 -0.170386
 -0.381341	  0.451470	 -0.163622
 -0.356154	  0.447244	 -0.155982
 -0.333983	  0.445610	 -0.148346
 -0.323131	  0.446245	 -0.143055
 -0.301626	  0.449589	 -0.133622
 -0.283911	  0.453963	 -0.127347
 -0.271132	  0.456072	 -0.123374
 -0.236943	  0.459051	 -0.116468
 -0.218970	  0.457279	 -0.112473
 -0.209461	  0.455852	 -0.109282
 -0.187033	  0.452898	 -0.099355
 -0.166676	  0.451402	 -0.090420
 -0.145003	  0.455936	 -0.082934
 -0.125624	  0.465110	 -0.076599
 -0.112987	  0.472072	 -0.072800
 -0.097580	  0.477200	 -0.068921
 -0.074540	  0.484024	 -0.063060
 -0.053219	  0.493066	 -0.050565
 -0.045796	  0.495143	 -0.047999
 -0.032542	  0.498877	 -0.040753
 -0.004362	  0.508967	 -0.031423
  0.014593	  0.518141	 -0.019596
  0.025220	  0.526433	 -0.013691
  0.035834	  0.542113	 -0.003476
  0.050947	  0.556362	  0.005789
  0.066607	  0.568209	  0.010525
  0.085684	  0.579162	  0.014302
  0.107100	  0.586539	  0.025497
  0.118212	  0.588072	  0.037857
  0.136067	  0.588032	  0.052009
  0.162328	  0.587770	  0.067490
  0.173801	  0.587251	  0.071415
  0.191421	  0.587618	  0.078706
  0.209438	  0.586905	  0.088361
  0.246847	  0.595050	  0.088648
  0.273011	  0.600530	  0.084738
  0.276861	  0.614587	  0.081450
  0.302951	  0.615109	  0.090277
  0.320411	  0.639885	  0.086684
  0.340353	  0.640288	  0.090633
  0.351287	  0.655476	  0.082593
  0.375086	  0.660967	  0.089157
  0.383217	  0.666359	  0.078522
  0.397790	  0.672258	  0.078715
  0.419580	  0.681978	  0.067788
  0.434388	  0.687056	  0.064380
  0.460273	  0.692885	  0.061096
  0.482918	  0.696387	  0.055245
  0.491817	  0.691387	  0.049366
  0.514906	  0.694779	  0.047935
  0.534823	  0.701230	  0.045987
  0.556722	  0.707740	  0.045253
  0.569679	  0.711585	  0.045408
  0.594427	  0.717299	  0.043686
  0.618329	  0.722175	  0.040369
  0.629538	  0.725477	  0.037973
  0.651808	  0.727778	  0.040159
  0.674381	  0.732424	  0.042447
  0.690627	  0.732349	  0.041079
  0.709297	  0.729497	  0.039744
  0.731089	  0.726517	  0.036941
  0.751550	  0.724541	  0.038248
  0.765926	  0.724320	  0.038064
  0.789757	  0.724384	  0.035967
  0.810749	  0.723499	  0.033968
  0.826478	  0.724327	  0.032623
  0.847488	  0.727432	  0.033104
  0.870731	  0.728658	  0.035396
  0.883428	  0.727287	  0.036755
  0.903801	  0.729813	  0.041777
  0.925224	  0.735245	  0.044872
  0.942968	  0.740159	  0.045282
  0.963242	  0.739022	  0.044237
  0.983037	  0.741959	  0.041522
  1.009061	  0.749566	  0.039472
  1.024796	  0.752280	  0.040894
  1.041418	  0.756656	  0.044845
  1.065731	  0.762790	  0.048285
  1.085397	  0.770711	  0.050131
  1.102056	  0.780221	  0.052596
  1.118314	  0.790830	  0.054991
  1.134810	  0.803146	  0.058088
  1.152226	  0.810593	  0.060010
  1.166010	  0.816088	  0.062410
  1.182464	  0.819212	  0.066320
  1.201827	  0.825481	  0.070848
  1.220107	  0.834639	  0.074794
  1.237882	  0.845319	  0.077234
  1.255353	  0.857630	  0.079318
  1.272715	  0.868689	  0.081389
  1.286685	  0.876587	  0.082727
  1.305562	  0.885579	  0.085546
  1.325585	  0.893996	  0.092943
  1.341045	  0.903417	  0.100827
  1.351559	  0.918061	  0.107886
  1.363515	  0.938033	  0.114625
  1.376058	  0.956867	  0.108899
  1.389771	  0.974567	  0.104295
  1.400559	  0.996930	  0.095095
  1.404868	  1.011467	  0.091986
  1.412440	  1.027338	  0.090674
  1.419438	  1.045297	  0.088597
  1.425106	  1.064632	  0.086078
  1.435071	  1.087273	  0.082610
  1.446228	  1.107226	  0.083316
  1.451253	  1.118569	  0.086532
  1.459862	  1.139296	  0.093203
  1.466746	  1.159767	  0.099991
  1.463283	  1.188951	  0.103660
  1.460081	  1.209451	  0.103650
  1.458930	  1.217237	  0.107169
  1.463122	  1.247280	  0.113222
  1.467855	  1.265178	  0.111616
  1.472040	  1.279999	  0.111271
  1.480562	  1.302206	  0.107774
  1.484106	  1.315774	  0.107396
  1.486699	  1.338692	  0.111427
  1.485521	  1.361467	  0.115264
  1.485094	  1.371678	  0.115987
  1.484914	  1.394930	  0.120041
  1.482714	  1.419672	  0.125584
  1.482609	  1.432903	  0.126974
  1.485058	  1.452819	  0.131573
  1.488490	  1.478419	  0.135059
  1.490423	  1.495241	  0.132998
  1.490656	  1.516734	  0.130575
  1.486294	  1.540848	  0.126004
  1.479414	  1.557906	  0.125815
  1.470954	  1.570742	  0.132169
  1.465981	  1.592352	  0.139555
  1.464523	  1.609876	  0.144982
  1.464404	  1.630789	  0.155893
  1.456259	  1.646379	  0.165459
  1.451932	  1.665172	  0.173345
  1.448831	  1.685720	  0.175388
  1.444675	  1.699502	  0.177033
  1.438898	  1.721646	  0.181067
  1.435762	  1.744017	  0.186714
  1.431785	  1.758079	  0.192777
  1.427445	  1.775167	  0.201461
  1.420984	  1.796023	  0.210640
  1.417044	  1.813661	  0.224850
  1.417067	  1.824676	  0.237503
  1.410474	  1.845251	  0.246823
  1.397843	  1.862869	  0.243143
  1.390417	  1.882348	  0.245833
  1.383816	  1.900159	  0.251142
  1.385789	  1.911461	  0.256059
  1.398232	  1.920125	  0.266212
  1.403465	  1.924936	  0.271764
  1.408782	  1.938543	  0.287689
  1.407672	  1.943161	  0.293711
  1.410887	  1.953136	  0.307889
  1.417982	  1.963156	  0.323161
  1.425280	  1.974489	  0.338716
  1.434419	  1.984440	  0.353884
  1.445521	  1.993172	  0.369121
  1.457252	  2.000738	  0.381899
  1.470709	  2.008350	  0.396244
  1.486407	  2.015317	  0.411270
  1.502155	  2.021187	  0.425863
  1.514831	  2.023825	  0.432974
  1.530878	  2.030460	  0.442898
