  1.040692	 -0.073677	 -2.236069
  1.040704	 -0.073686	 -2.236093
  1.032198	 -0.067192	 -2.219197
  1.023694	 -0.060707	 -2.202296
  1.015318	 -0.054349	 -2.185284
  1.007065	 -0.048117	 -2.168166
  0.998811	 -0.041880	 -2.151049
  0.990304	 -0.034807	 -2.134388
  0.981755	 -0.027592	 -2.117809
  0.973202	 -0.020366	 -2.101237
  0.964092	 -0.011808	 -2.085625
  0.954973	 -0.003093	 -2.070248
  0.945841	  0.006675	 -2.056078
  0.934892	  0.019363	 -2.043206
  0.924655	  0.029931	 -2.030474
  0.914557	  0.036538	 -2.015381
  0.903775	  0.044918	 -1.996651
  0.896147	  0.054030	 -1.983747
  0.886594	  0.060166	 -1.968734
  0.871091	  0.064542	 -1.947596
  0.862028	  0.073729	 -1.940297
  0.848502	  0.085176	 -1.928800
  0.834109	  0.098452	 -1.911544
  0.828515	  0.099923	 -1.894107
  0.819797	  0.098146	 -1.874541
  0.806182	  0.100624	 -1.861903
  0.794063	  0.104872	 -1.845653
  0.782856	  0.098688	 -1.826366
  0.771429	  0.097264	 -1.813709
  0.759812	  0.091344	 -1.798231
  0.747794	  0.087549	 -1.778244
  0.739638	  0.081964	 -1.766647
  0.724396	  0.072100	 -1.755465
  0.706711	  0.064093	 -1.743269
  0.698106	  0.060213	 -1.726748
  0.688341	  0.052053	 -1.709926
  0.676252	  0.042750	 -1.698567
  0.663136	  0.030829	 -1.688111
  0.654507	  0.018274	 -1.676906
  0.647201	  0.005741	 -1.659883
  0.637818	 -0.008993	 -1.645651
  0.627754	 -0.025332	 -1.643228
  0.620473	 -0.042507	 -1.636366
  0.613179	 -0.056699	 -1.619753
  0.602296	 -0.067821	 -1.609003
  0.595673	 -0.079646	 -1.596668
  0.593804	 -0.097044	 -1.582285
  0.585979	 -0.106761	 -1.565873
  0.574214	 -0.118268	 -1.551827
  0.568047	 -0.130103	 -1.541461
  0.559875	 -0.139400	 -1.524132
  0.550906	 -0.142364	 -1.506028
  0.541643	 -0.144228	 -1.488202
  0.531300	 -0.148549	 -1.472026
  0.520468	 -0.152691	 -1.455147
  0.511082	 -0.155130	 -1.437076
  0.505377	 -0.151186	 -1.417438
  0.498581	 -0.142074	 -1.400386
  0.491791	 -0.131705	 -1.383721
  0.485314	 -0.124258	 -1.367873
  0.478056	 -0.117947	 -1.351624
  0.471877	 -0.107649	 -1.334993
  0.464439	 -0.098889	 -1.319432
  0.460656	 -0.089843	 -1.302346
  0.457046	 -0.080928	 -1.283939
  0.455879	 -0.070859	 -1.266765
  0.453484	 -0.060318	 -1.249997
  0.442189	 -0.048295	 -1.233933
  0.434905	 -0.036505	 -1.219426
  0.429564	 -0.024598	 -1.206587
  0.427503	 -0.009407	 -1.192482
  0.426360	  0.007599	 -1.180866
  0.424052	  0.024425	 -1.168964
  0.418865	  0.037566	 -1.155505
  0.414456	  0.050605	 -1.140879
  0.411072	  0.065550	 -1.128870
  0.407031	  0.082504	 -1.116688
  0.402519	  0.096924	 -1.104221
  0.401777	  0.111152	 -1.091323
  0.406748	  0.128807	 -1.076741
  0.410495	  0.142306	 -1.063412
  0.408657	  0.155388	 -1.049565
  0.407562	  0.173334	 -1.036899
  0.402881	  0.189647	 -1.023910
  0.393731	  0.204043	 -1.014105
  0.387008	  0.220911	 -1.002514
  0.382276	  0.234449	 -0.989500
  0.379850	  0.243955	 -0.976568
  0.375878	  0.256216	 -0.959851
  0.371200	  0.268274	 -0.943687
  0.365659	  0.275040	 -0.925784
  0.359212	  0.282413	 -0.907422
  0.353376	  0.293194	 -0.891146
  0.345556	  0.304195	 -0.876440
  0.334633	  0.312467	 -0.860853
  0.325408	  0.317369	 -0.845356
  0.314911	  0.323454	 -0.829316
  0.303653	  0.330484	 -0.811990
  0.296393	  0.336434	 -0.795245
  0.290262	  0.341384	 -0.777267
  0.280651	  0.347221	 -0.759593
  0.266889	  0.354916	 -0.746070
  0.256103	  0.367175	 -0.733035
  0.248934	  0.378184	 -0.717093
  0.242253	  0.384033	 -0.700352
  0.232650	  0.391341	 -0.685338
  0.224025	  0.400707	 -0.666237
  0.217512	  0.409578	 -0.651936
  0.204957	  0.415183	 -0.633866
  0.193656	  0.415778	 -0.614614
  0.189601	  0.421319	 -0.596866
  0.181881	  0.429359	 -0.580678
  0.169526	  0.432251	 -0.564172
  0.162359	  0.431519	 -0.545573
  0.155839	  0.437382	 -0.527956
  0.144210	  0.443513	 -0.510575
  0.131663	  0.443613	 -0.492672
  0.125693	  0.446294	 -0.474007
  0.118756	  0.449971	 -0.458156
  0.107956	  0.451915	 -0.439945
  0.098485	  0.455207	 -0.422542
  0.089645	  0.462387	 -0.404589
  0.079395	  0.465093	 -0.387160
  0.068535	  0.461594	 -0.372292
  0.057205	  0.461464	 -0.354495
  0.046985	  0.463875	 -0.337258
  0.036833	  0.466782	 -0.320666
  0.026091	  0.468385	 -0.303256
  0.016005	  0.468308	 -0.285485
  0.005262	  0.473022	 -0.268534
 -0.005640	  0.478983	 -0.254211
 -0.017538	  0.485394	 -0.238034
 -0.027846	  0.493569	 -0.222007
 -0.037877	  0.502789	 -0.210394
 -0.051603	  0.511870	 -0.191669
 -0.060762	  0.510579	 -0.173618
 -0.071513	  0.500939	 -0.152792
 -0.084235	  0.502420	 -0.140289
 -0.096942	  0.513589	 -0.127705
 -0.110481	  0.522829	 -0.114758
 -0.119059	  0.528786	 -0.096676
 -0.125241	  0.536818	 -0.079567
 -0.140724	  0.544711	 -0.062931
 -0.156801	  0.547864	 -0.050861
 -0.168047	  0.547183	 -0.038183
 -0.180504	  0.549970	 -0.021050
 -0.192074	  0.552322	 -0.001480
 -0.201989	  0.554112	  0.014011
 -0.216536	  0.560001	  0.030726
 -0.229190	  0.562232	  0.039971
 -0.242706	  0.564659	  0.056393
 -0.251656	  0.568740	  0.074437
 -0.263148	  0.573760	  0.090503
 -0.275728	  0.580192	  0.104045
 -0.288674	  0.584766	  0.119402
 -0.302265	  0.586335	  0.135671
 -0.313185	  0.586167	  0.151630
 -0.321541	  0.588948	  0.168634
 -0.329126	  0.593142	  0.189062
 -0.337348	  0.598393	  0.205675
 -0.346424	  0.600350	  0.222535
 -0.353346	  0.601645	  0.244073
 -0.360204	  0.605672	  0.260709
 -0.368980	  0.609926	  0.277725
 -0.376758	  0.615815	  0.297090
 -0.381940	  0.615067	  0.315183
 -0.389337	  0.616522	  0.334081
 -0.396514	  0.620253	  0.352845
 -0.403288	  0.621366	  0.371198
 -0.410575	  0.621622	  0.391114
 -0.417431	  0.624855	  0.409414
 -0.426496	  0.627061	  0.425773
 -0.438013	  0.625811	  0.443003
 -0.447947	  0.628551	  0.462766
 -0.453696	  0.634288	  0.478933
 -0.462326	  0.637764	  0.496004
 -0.474593	  0.636773	  0.513444
 -0.483009	  0.637482	  0.529663
 -0.493108	  0.634046	  0.542654
 -0.503887	  0.621588	  0.551699
 -0.514076	  0.605484	  0.562897
 -0.523077	  0.591712	  0.572393
 -0.533777	  0.579685	  0.581014
 -0.546022	  0.565785	  0.589174
 -0.559989	  0.554582	  0.602437
 -0.572666	  0.544198	  0.614002
 -0.585034	  0.530608	  0.620742
 -0.598623	  0.518448	  0.628196
 -0.613201	  0.507023	  0.638802
 -0.626444	  0.494906	  0.647892
 -0.639080	  0.482212	  0.653507
 -0.655819	  0.475836	  0.663170
 -0.673514	  0.474791	  0.675597
 -0.690097	  0.472919	  0.687829
 -0.704519	  0.462241	  0.697302
 -0.719305	  0.450834	  0.705773
 -0.734676	  0.442051	  0.716927
 -0.751612	  0.442336	  0.728821
 -0.770587	  0.444406	  0.738839
 -0.785540	  0.445785	  0.749042
 -0.800733	  0.446471	  0.760859
 -0.817254	  0.446729	  0.776814
 -0.833655	  0.443262	  0.788507
 -0.850104	  0.437696	  0.796554
 -0.867326	  0.433564	  0.805622
 -0.884742	  0.431326	  0.815509
 -0.903759	  0.427065	  0.824796
 -0.922757	  0.422719	  0.834546
 -0.934917	  0.425477	  0.848372
 -0.950365	  0.428528	  0.861235
 -0.968204	  0.429088	  0.872654
 -0.988452	  0.425360	  0.878505
 -1.004661	  0.424956	  0.891465
 -1.017417	  0.426391	  0.904395
 -1.033941	  0.428309	  0.915374
 -1.051339	  0.433614	  0.928259
 -1.064576	  0.436865	  0.943115
 -1.077666	  0.436291	  0.957421
 -1.091919	  0.436576	  0.972054
 -1.105875	  0.436870	  0.984906
 -1.119636	  0.435727	  0.999679
 -1.130485	  0.433949	  1.017077
 -1.143928	  0.430034	  1.033339
 -1.156854	  0.434664	  1.046532
 -1.170964	  0.445548	  1.059634
 -1.181544	  0.451626	  1.077460
 -1.190058	  0.451548	  1.093561
 -1.198684	  0.459466	  1.108710
 -1.206205	  0.466531	  1.127157
 -1.211306	  0.473477	  1.145109
 -1.218858	  0.484237	  1.160854
 -1.222194	  0.494249	  1.175469
 -1.228855	  0.501608	  1.193887
 -1.233852	  0.512782	  1.211646
 -1.236060	  0.520583	  1.226190
 -1.236729	  0.530501	  1.246993
 -1.239828	  0.540090	  1.265976
 -1.241102	  0.549538	  1.276683
 -1.237397	  0.563902	  1.293581
 -1.235637	  0.573735	  1.312790
 -1.239862	  0.582952	  1.328470
 -1.233829	  0.597552	  1.343788
 -1.233041	  0.608877	  1.358730
 -1.232832	  0.620335	  1.373503
 -1.231444	  0.633569	  1.388762
 -1.228502	  0.647379	  1.403280
 -1.224046	  0.660417	  1.418230
 -1.219594	  0.673157	  1.432991
 -1.215131	  0.685903	  1.447688
 -1.205343	  0.701511	  1.455357
 -1.195244	  0.717206	  1.462552
 -1.185197	  0.732924	  1.469755
 -1.175086	  0.748612	  1.476944
 -1.164996	  0.764313	  1.484139
 -1.154939	  0.779586	  1.491590
 -1.144043	  0.794080	  1.500401
 -1.132665	  0.810323	  1.507313
 -1.123408	  0.828855	  1.509698
 -1.116290	  0.847455	  1.508854
 -1.106799	  0.864644	  1.511764
 -1.096677	  0.881898	  1.515465
 -1.090361	  0.900369	  1.517612
 -1.082464	  0.918176	  1.522176
 -1.076423	  0.936007	  1.529096
 -1.076492	  0.951878	  1.538165
 -1.075439	  0.969469	  1.548659
 -1.079315	  0.979021	  1.565369
 -1.084264	  0.986190	  1.583193
 -1.091281	  0.991589	  1.601532
 -1.096806	  0.999913	  1.618309
 -1.103631	  1.009847	  1.634129
 -1.110009	  1.021119	  1.650326
 -1.117018	  1.026392	  1.669684
 -1.127342	  1.029369	  1.686019
 -1.139591	  1.031219	  1.703040
 -1.150057	  1.033102	  1.719871
 -1.158437	  1.036222	  1.737296
 -1.167581	  1.042483	  1.754888
 -1.172900	  1.048497	  1.773031
 -1.178350	  1.054831	  1.791652
 -1.186272	  1.059180	  1.810138
 -1.198871	  1.062512	  1.824659
 -1.211380	  1.066383	  1.840685
 -1.221949	  1.070574	  1.857636
 -1.237563	  1.076337	  1.881457
 -1.248669	  1.080061	  1.897668
