 -2.597904	 -0.637866	 -1.422997
 -2.572182	 -0.631551	 -1.408908
 -2.534018	 -0.604190	 -1.382450
 -2.497058	 -0.574449	 -1.358943
 -2.458937	 -0.546841	 -1.337642
 -2.419309	 -0.521248	 -1.319526
 -2.380074	 -0.496129	 -1.302250
 -2.342407	 -0.470838	 -1.284778
 -2.305894	 -0.444633	 -1.266738
 -2.268552	 -0.417826	 -1.247986
 -2.230297	 -0.391324	 -1.229293
 -2.191446	 -0.365561	 -1.211650
 -2.152643	 -0.340170	 -1.195491
 -2.113441	 -0.313870	 -1.180270
 -2.073948	 -0.286792	 -1.165186
 -2.033690	 -0.259938	 -1.149684
 -1.992796	 -0.234245	 -1.133174
 -1.951775	 -0.210131	 -1.115999
 -1.910796	 -0.187063	 -1.099307
 -1.870522	 -0.163839	 -1.082913
 -1.831713	 -0.139940	 -1.066173
 -1.793736	 -0.115777	 -1.049191
 -1.756147	 -0.091657	 -1.031374
 -1.718094	 -0.067305	 -1.012442
 -1.679361	 -0.042863	 -0.993152
 -1.640485	 -0.017642	 -0.974585
 -1.601568	  0.007811	 -0.956418
 -1.563174	  0.033698	 -0.938666
 -1.524700	  0.059880	 -0.920589
 -1.486292	  0.086164	 -0.901259
 -1.447799	  0.112610	 -0.880813
 -1.409452	  0.138620	 -0.859388
 -1.371990	  0.163771	 -0.837718
 -1.335098	  0.188292	 -0.815482
 -1.298301	  0.212187	 -0.793269
 -1.261058	  0.235218	 -0.770661
 -1.223928	  0.258617	 -0.747948
 -1.186386	  0.281179	 -0.725005
 -1.148848	  0.304285	 -0.701950
 -1.109899	  0.326695	 -0.678520
 -1.070948	  0.349303	 -0.654897
 -1.032590	  0.371042	 -0.632421
 -0.994511	  0.392907	 -0.610740
 -0.956303	  0.415121	 -0.589711
 -0.917134	  0.438502	 -0.568922
 -0.878562	  0.461857	 -0.550176
 -0.839570	  0.485979	 -0.532439
 -0.799719	  0.511830	 -0.514954
 -0.760309	  0.538770	 -0.497432
 -0.721809	  0.565832	 -0.480144
 -0.684916	  0.592339	 -0.463257
 -0.648190	  0.618979	 -0.445772
 -0.609747	  0.644073	 -0.427374
 -0.570121	  0.666545	 -0.408782
 -0.528641	  0.682113	 -0.389771
 -0.489127	  0.686965	 -0.370897
 -0.448432	  0.683168	 -0.350341
 -0.383038	  0.662866	 -0.318419
 -0.293273	  0.631245	 -0.280952
 -0.214061	  0.610472	 -0.248805
 -0.155858	  0.605308	 -0.229517
 -0.104834	  0.610153	 -0.212423
 -0.059742	  0.625166	 -0.193511
 -0.021300	  0.643428	 -0.179848
  0.006376	  0.666547	 -0.168716
  0.031873	  0.700476	 -0.157446
  0.058898	  0.742144	 -0.144744
  0.083441	  0.790664	 -0.123826
  0.113775	  0.847263	 -0.094253
  0.154069	  0.901557	 -0.063686
  0.177919	  0.925292	 -0.044159
  0.184284	  0.929099	 -0.039568
  0.191178	  0.930386	 -0.035424
  0.215530	  0.931260	 -0.021553
  0.252276	  0.929814	 -0.004324
  0.296531	  0.922862	  0.009332
  0.324503	  0.917624	  0.017079
  0.337410	  0.914059	  0.017877
  0.356946	  0.904676	  0.015806
  0.403924	  0.887170	  0.006407
  0.488511	  0.860547	 -0.028599
  0.613770	  0.849350	 -0.090792
  0.750351	  0.890126	 -0.110122
  0.975461	  0.943165	 -0.140339
  1.358233	  1.148413	 -0.045477
  1.534268	  1.435850	 -0.067170
  1.371568	  1.739873	 -0.102928
  1.158653	  1.876921	 -0.096602
  1.106883	  1.922440	 -0.049609
  1.053948	  1.960784	  0.003672
  1.030839	  1.994375	  0.068416
  1.024848	  2.003955	  0.096296
  1.025759	  2.010797	  0.110922
  1.028933	  2.015479	  0.123338
  1.036579	  2.021462	  0.146265
  1.057550	  2.024285	  0.180830
  1.086956	  2.023788	  0.217308
  1.122258	  2.023710	  0.248516
  1.157646	  2.008941	  0.291291
  1.206046	  1.986581	  0.336928
  1.247038	  1.951724	  0.386803
  1.287873	  1.922018	  0.431642
  1.329764	  1.906972	  0.471373
  1.372198	  1.912663	  0.505053
  1.412682	  1.931765	  0.529592
  1.452663	  1.953715	  0.549224
  1.492375	  1.975728	  0.569042
  1.528678	  2.002193	  0.590779
  1.565524	  2.027454	  0.612966
  1.604834	  2.054474	  0.628615
  1.647001	  2.075302	  0.646050
  1.681197	  2.105721	  0.665876
  1.723623	  2.125907	  0.680061
  1.759848	  2.151835	  0.699302
  1.797099	  2.174204	  0.720291
  1.834163	  2.202240	  0.730864
  1.872512	  2.220245	  0.751139
  1.891237	  2.242448	  0.758650
