  0.788277	  1.788068	  1.436337
  0.791701	  1.804379	  1.452747
  0.788774	  1.790432	  1.438714
  0.785274	  1.776597	  1.424702
  0.781577	  1.762804	  1.410699
  0.777490	  1.749068	  1.396749
  0.773020	  1.735393	  1.382856
  0.768340	  1.721806	  1.368945
  0.763050	  1.708489	  1.354993
  0.757761	  1.695172	  1.341040
  0.751564	  1.682447	  1.326910
  0.745347	  1.669736	  1.312776
  0.738539	  1.657595	  1.298414
  0.731441	  1.645749	  1.283947
  0.723907	  1.634230	  1.269436
  0.715776	  1.623181	  1.254883
  0.707201	  1.612271	  1.240480
  0.697944	  1.601591	  1.226330
  0.687685	  1.591131	  1.212716
  0.675137	  1.581014	  1.200875
  0.660028	  1.571547	  1.191814
  0.644255	  1.562286	  1.183724
  0.627602	  1.553391	  1.177126
  0.610838	  1.544559	  1.170725
  0.593771	  1.535912	  1.164900
  0.576703	  1.527266	  1.159074
  0.559635	  1.518619	  1.153249
  0.542362	  1.510758	  1.146938
  0.525087	  1.502902	  1.140624
  0.507812	  1.495046	  1.134310
  0.490744	  1.486855	  1.127861
  0.473863	  1.478374	  1.121296
  0.456982	  1.469892	  1.114731
  0.440741	  1.460219	  1.108201
  0.425174	  1.449457	  1.101732
  0.409607	  1.438695	  1.095263
  0.395968	  1.425577	  1.088791
  0.382671	  1.412105	  1.082334
  0.369618	  1.398423	  1.075821
  0.359033	  1.382941	  1.068873
  0.348449	  1.367459	  1.061925
  0.337864	  1.351977	  1.054976
  0.329088	  1.335785	  1.047178
  0.321118	  1.319345	  1.039042
  0.313147	  1.302905	  1.030905
  0.305177	  1.286465	  1.022769
  0.297888	  1.269965	  1.014132
  0.292624	  1.253457	  1.004143
  0.287361	  1.236948	  0.994154
  0.282097	  1.220440	  0.984165
  0.276834	  1.203932	  0.974177
  0.271570	  1.187424	  0.964188
  0.269024	  1.171368	  0.952538
  0.266704	  1.155367	  0.940765
  0.264385	  1.139367	  0.928992
  0.262065	  1.123366	  0.917219
  0.259746	  1.107366	  0.905446
  0.258236	  1.091610	  0.893220
  0.258444	  1.076490	  0.880130
  0.258652	  1.061370	  0.867040
  0.258860	  1.046250	  0.853951
  0.259068	  1.031130	  0.840861
  0.259335	  1.016024	  0.827756
  0.261831	  1.001587	  0.814142
  0.264327	  0.987149	  0.800529
  0.266823	  0.972712	  0.786915
  0.269319	  0.958275	  0.773301
  0.272117	  0.943935	  0.759643
  0.276000	  0.929982	  0.745851
  0.279882	  0.916028	  0.732059
  0.283765	  0.902074	  0.718267
  0.287647	  0.888120	  0.704475
  0.292191	  0.874323	  0.690728
  0.296741	  0.860527	  0.676981
  0.301291	  0.846732	  0.663234
  0.305821	  0.832910	  0.649506
  0.310273	  0.818992	  0.635851
  0.314724	  0.805073	  0.622196
  0.319176	  0.791155	  0.608541
  0.322883	  0.777082	  0.594822
  0.326462	  0.762984	  0.581095
  0.330040	  0.748886	  0.567367
  0.332944	  0.734615	  0.553660
  0.335591	  0.720282	  0.539965
  0.338238	  0.705949	  0.526269
  0.340665	  0.691444	  0.512714
  0.342973	  0.676848	  0.499238
  0.345273	  0.662247	  0.485764
  0.346853	  0.647303	  0.472567
  0.346954	  0.631641	  0.460129
  0.343595	  0.615008	  0.449543
  0.339513	  0.598422	  0.439140
  0.334926	  0.582167	  0.428429
  0.329988	  0.566156	  0.417508
  0.325049	  0.550144	  0.406588
  0.320110	  0.534133	  0.395668
  0.314817	  0.519089	  0.383599
  0.309500	  0.504115	  0.371454
  0.304183	  0.489141	  0.359308
  0.298866	  0.474168	  0.347163
  0.293506	  0.459664	  0.334478
  0.288062	  0.446599	  0.320347
  0.282618	  0.433534	  0.306216
  0.277174	  0.420470	  0.292085
  0.271730	  0.407405	  0.277954
  0.266341	  0.394679	  0.263497
  0.261485	  0.384833	  0.246780
  0.256629	  0.374987	  0.230062
  0.251773	  0.365141	  0.213345
  0.246917	  0.355295	  0.196627
  0.242138	  0.345850	  0.179658
  0.238178	  0.340269	  0.160866
  0.234218	  0.334687	  0.142073
  0.230258	  0.329106	  0.123280
  0.226298	  0.323524	  0.104487
  0.222836	  0.321267	  0.084919
  0.219514	  0.319851	  0.065248
  0.216192	  0.318435	  0.045577
  0.212961	  0.317492	  0.025862
  0.210423	  0.319898	  0.006170
  0.207886	  0.322305	 -0.013522
  0.205348	  0.324711	 -0.033214
  0.203076	  0.329561	 -0.052483
  0.200925	  0.335419	 -0.071485
  0.198775	  0.341276	 -0.090487
  0.196716	  0.347844	 -0.109265
  0.194947	  0.356477	 -0.127219
  0.193177	  0.365110	 -0.145173
  0.191408	  0.373743	 -0.163126
  0.189739	  0.383025	 -0.180763
  0.188277	  0.393560	 -0.197701
  0.186814	  0.404095	 -0.214638
  0.185352	  0.414630	 -0.231576
  0.183890	  0.425165	 -0.248513
  0.182822	  0.436050	 -0.265257
  0.182258	  0.447369	 -0.281737
  0.181694	  0.458688	 -0.298216
  0.181129	  0.470007	 -0.314695
  0.180565	  0.481326	 -0.331174
  0.180001	  0.492645	 -0.347653
  0.179847	  0.504108	 -0.364041
  0.180449	  0.515823	 -0.380240
  0.181051	  0.527538	 -0.396439
  0.181653	  0.539253	 -0.412637
  0.182255	  0.550968	 -0.428836
  0.182857	  0.562683	 -0.445035
  0.183459	  0.574398	 -0.461233
  0.183739	  0.585417	 -0.477921
  0.183994	  0.596381	 -0.494646
  0.184249	  0.607345	 -0.511371
  0.184504	  0.618309	 -0.528096
  0.184723	  0.629211	 -0.544862
  0.182815	  0.636135	 -0.563528
  0.180907	  0.643059	 -0.582195
  0.178998	  0.649982	 -0.600861
  0.175988	  0.651403	 -0.620582
  0.172857	  0.652131	 -0.640322
  0.169651	  0.651067	 -0.660034
  0.166385	  0.647533	 -0.679447
  0.163118	  0.643481	 -0.698758
  0.159871	  0.637394	 -0.717530
  0.156640	  0.631047	 -0.736219
  0.153505	  0.623324	 -0.754399
  0.150379	  0.615556	 -0.772562
  0.147519	  0.606596	 -0.790213
  0.144659	  0.597635	 -0.807863
  0.141906	  0.587976	 -0.825158
  0.139179	  0.578153	 -0.842364
  0.136401	  0.567873	 -0.859294
  0.133590	  0.557295	 -0.876034
  0.130604	  0.546360	 -0.892511
  0.127467	  0.535115	 -0.908750
  0.124008	  0.523376	 -0.924569
  0.120368	  0.511366	 -0.940141
  0.116130	  0.498564	 -0.954911
  0.111430	  0.485166	 -0.968997
  0.106309	  0.471204	 -0.982370
  0.100536	  0.456233	 -0.994308
  0.094634	  0.440993	 -1.005838
  0.088298	  0.424861	 -1.015818
  0.081961	  0.408729	 -1.025798
  0.075770	  0.392082	 -1.034993
  0.069892	  0.374559	 -1.042636
  0.064015	  0.357037	 -1.050279
  0.058137	  0.339514	 -1.057922
  0.052955	  0.321377	 -1.064569
  0.048875	  0.302467	 -1.069645
  0.044794	  0.283557	 -1.074721
  0.040714	  0.264647	 -1.079797
  0.036633	  0.245737	 -1.084874
  0.034104	  0.226287	 -1.088782
  0.032376	  0.206636	 -1.092079
  0.030648	  0.186986	 -1.095376
  0.028920	  0.167335	 -1.098673
  0.027192	  0.147685	 -1.101969
  0.026635	  0.127993	 -1.105422
  0.027113	  0.108321	 -1.109002
  0.027590	  0.088650	 -1.112581
  0.028067	  0.068979	 -1.116161
  0.028545	  0.049308	 -1.119740
  0.029225	  0.029923	 -1.124615
  0.030041	  0.010779	 -1.130348
  0.030856	 -0.008364	 -1.136082
  0.031671	 -0.027507	 -1.141816
  0.032182	 -0.046301	 -1.148636
  0.032177	 -0.064362	 -1.157227
  0.032172	 -0.082423	 -1.165818
  0.032168	 -0.100484	 -1.174409
  0.031206	 -0.117446	 -1.184961
  0.029810	 -0.133820	 -1.196361
  0.028414	 -0.150194	 -1.207761
  0.026499	 -0.165990	 -1.219877
  0.023337	 -0.180191	 -1.233601
  0.020175	 -0.194391	 -1.247325
  0.017013	 -0.208591	 -1.261049
  0.012000	 -0.220124	 -1.276601
  0.006916	 -0.231538	 -1.292217
  0.001831	 -0.242953	 -1.307833
 -0.004297	 -0.252822	 -1.324113
 -0.011276	 -0.261284	 -1.340837
 -0.018255	 -0.269746	 -1.357561
 -0.025519	 -0.277729	 -1.374399
 -0.034200	 -0.283051	 -1.391612
 -0.042882	 -0.288374	 -1.408826
 -0.051564	 -0.293696	 -1.426039
 -0.061018	 -0.296331	 -1.443465
 -0.070719	 -0.297931	 -1.460882
 -0.080419	 -0.299530	 -1.478299
 -0.090160	 -0.300542	 -1.495737
 -0.099957	 -0.297583	 -1.512920
 -0.109755	 -0.294624	 -1.530103
 -0.119552	 -0.291664	 -1.547286
 -0.129349	 -0.288705	 -1.564469
 -0.137750	 -0.281369	 -1.581070
 -0.145949	 -0.273526	 -1.597540
 -0.154149	 -0.265683	 -1.614010
 -0.162349	 -0.257840	 -1.630480
 -0.170548	 -0.249998	 -1.646950
 -0.176992	 -0.239719	 -1.662850
 -0.182676	 -0.228514	 -1.678411
 -0.188359	 -0.217309	 -1.693972
 -0.194043	 -0.206104	 -1.709533
 -0.199726	 -0.194899	 -1.725094
 -0.205410	 -0.183694	 -1.740656
 -0.209192	 -0.171527	 -1.756071
 -0.212929	 -0.159338	 -1.771482
 -0.216666	 -0.147150	 -1.786892
 -0.220403	 -0.134961	 -1.802302
 -0.224140	 -0.122773	 -1.817713
 -0.227540	 -0.110733	 -1.833317
 -0.229735	 -0.099261	 -1.849551
 -0.231931	 -0.087788	 -1.865786
 -0.234126	 -0.076316	 -1.882021
 -0.236322	 -0.064844	 -1.898255
 -0.238517	 -0.053371	 -1.914490
 -0.239128	 -0.043785	 -1.932032
 -0.239507	 -0.034491	 -1.949738
 -0.239885	 -0.025197	 -1.967443
 -0.240263	 -0.015903	 -1.985148
 -0.240058	 -0.008581	 -2.003758
 -0.239199	 -0.003588	 -2.023106
 -0.238340	  0.001405	 -2.042454
 -0.237359	  0.004852	 -2.062130
 -0.236170	  0.005401	 -2.082087
 -0.234977	  0.005772	 -2.102048
 -0.233722	  0.002588	 -2.121753
 -0.232472	 -0.000634	 -2.141452
 -0.231516	 -0.005930	 -2.160714
 -0.230563	 -0.011234	 -2.179975
 -0.230057	 -0.017530	 -2.198951
 -0.229552	 -0.023826	 -2.217928
 -0.229805	 -0.030539	 -2.236766
 -0.230095	 -0.037271	 -2.255596
 -0.231126	 -0.044427	 -2.274244
 -0.232224	 -0.051621	 -2.292873
 -0.233635	 -0.059156	 -2.311345
 -0.235140	 -0.066792	 -2.329769
 -0.236914	 -0.074821	 -2.348000
 -0.238900	 -0.083158	 -2.366071
 -0.241453	 -0.091856	 -2.383899
 -0.244460	 -0.100837	 -2.401514
 -0.247468	 -0.109818	 -2.419129
 -0.250476	 -0.118800	 -2.436744
 -0.258218	 -0.139913	 -2.477213
 -0.261648	 -0.149069	 -2.494660
