 0.0 0.0 0.0 0
 -0.26590957311401286 -0.22781112630684608 0.9364887557558444 1000
 -0.6146118803922808 -0.7578171510264081 0.21970753762873738 1000
 -0.44768186185429226 0.7098555083400999 -0.5438088890831898 1000
 0.17131358231534655 -0.5879990194073803 -0.7901384750094393 1000
 0.10217908971013617 0.8233937291867625 -0.5582313143867198 1000
 0.6274036643585731 0.6503051744338854 0.4283792969483342 1000
 0.7807194856975936 -0.6187404098371387 0.08254326069797908 1000
 0.41477606091414965 -0.2525503671438903 0.8746823030952598 1000
 0.0 0.0 0.0 0
 0.5645456621720318 -0.10461402208406881 -0.8192155404447209 1000
 -0.7870209237784449 0.26034486034137355 -0.5603067188859633 1000
 0.4976688161634498 -0.8095836308582719 -0.31076855385448493 1000
 0.530252343460487 0.529721670290021 -0.6618363878480935 1000
 0.06547782951469056 -0.522241701159715 0.850779794901038 1000
 -0.4779398388763163 0.5849344272510675 0.6559895016167153 1000
 0.7313658918963092 -0.5539920559937649 0.3984955885157546 1000
 0.7109737269910711 0.6965376990406713 0.09848143654290015 1000
 0.0 0.0 0.0 0
 -0.12505607767194205 0.12565604114700277 -0.9837243194922916 1000
 0.9874477830664554 0.12366161848602335 -0.09594102266788623 1000
 -0.5310326299934908 0.8453171906903785 -0.050913583703398435 1000
 0.24426074742928866 0.8870927095888792 0.3906676488519954 1000
 -0.8541789488392466 -0.36043514880228145 -0.3741267524085349 1000
 0.018087435953989844 -0.9981592330148334 0.05882168144358092 1000
 -0.6517357604722412 0.6499195637375834 0.3902717760648583 1000
 -0.32878343629740386 -0.04174394160209114 -0.9438569252572089 1000
 0.0 0.0 0.0 0
 0.3226992551924923 -0.9345426427484571 -0.14647948519482354 1000
 -0.9450875702075529 0.026854194841716 0.32603579076320305 1000
 -0.23784412067758354 0.6323715452890624 -0.7377298983827553 1000
 -0.4369477695687084 -0.892447117745335 0.10904030767094902 1000
 0.2371608725761692 -0.04041041678383056 -0.9701297432479159 1000
 -0.6826545021827023 -0.45014093088535456 -0.5749556269759897 1000
 -0.6309081314244701 0.28816295036543876 -0.7200062803470323 1000
 0.10026811675209468 -0.38482756482676533 -0.9172600776837996 1000
 0.0 0.0 0.0 0
 0.36197733700194595 0.4327738179216167 -0.8254109461465404 1000
 -0.5797844113755568 -0.23736530520641647 -0.7793309619219322 1000
 -0.8870025348152062 0.29738299920733313 0.3534272980597996 1000
 0.5790171210619475 0.6646481435432442 -0.47239815706843447 1000
 0.9937018693600006 -0.08385575142438761 0.06802064233371886 1000
 -0.782897921178516 -0.5558688903753531 -0.2779255686820337 1000
 0.3742156872066534 -0.47260080259906684 -0.7975538231562621 1000
 0.19464939681763818 0.20249697621630153 0.9598419593567393 1000
 0.0 0.0 0.0 0
 0.24768821827278326 0.8693702655618643 -0.4270549003181534 1000
 -0.42198376280335137 -0.010177957551265743 0.9066449763332997 1000
 0.9385996405086308 0.263421482894882 -0.2235617077822825 1000
 -0.6863128265678013 0.6913725593469644 -0.2250948428341782 1000
 0.7316208158661887 -0.07931402418353023 0.678148411012742 1000
 -0.22316415755060615 0.7106969205289931 0.667086685472986 1000
 0.20339932440832004 0.9768611631511815 -0.0589065595427192 1000
 0.57790654798369 0.34708817328241365 -0.7382240999622354 1000
 0.0 0.0 0.0 0
 0.744058015853155 -0.6245518719898254 -0.23859092237273236 1000
 -0.7350107356272801 0.27078163430759117 0.6212105319731422 1000
 0.14350365844585208 0.4794642234433061 -0.865972723849062 1000
 0.4978197267723166 -0.858541262491674 -0.12075769224169117 1000
 0.16775120830123014 -0.9004277517225956 0.40110272504842104 1000
 -0.8192905632152256 -0.3934377241056045 0.4176753886418024 1000
