  2.222109	 -2.057079	 -0.107511
  2.200108	 -2.036712	 -0.106446
  2.167403	 -2.002433	 -0.094717
  2.126099	 -1.971217	 -0.082616
  2.084536	 -1.943524	 -0.066945
  2.047522	 -1.914853	 -0.055636
  2.008785	 -1.888385	 -0.049711
  1.971996	 -1.854423	 -0.034053
  1.931916	 -1.827408	 -0.020196
  1.891075	 -1.797022	 -0.013090
  1.853842	 -1.766472	 -0.004440
  1.818120	 -1.742864	  0.012343
  1.777457	 -1.713991	  0.020398
  1.738124	 -1.686716	  0.033091
  1.695724	 -1.655346	  0.040507
  1.657956	 -1.623277	  0.050411
  1.622752	 -1.595193	  0.059680
  1.585456	 -1.566549	  0.069571
  1.544116	 -1.534053	  0.081120
  1.509986	 -1.501698	  0.090757
  1.508416	 -1.440231	  0.084428
  1.589166	 -1.250762	  0.094590
  1.548846	 -1.183865	  0.034365
  1.569138	 -1.247084	  0.097970
  1.537424	 -1.332724	  0.212998
  1.508580	 -1.261025	  0.327419
  1.477215	 -1.245965	  0.376405
  1.408616	 -1.243399	  0.476493
  1.385809	 -1.201725	  0.515117
  1.357775	 -1.208027	  0.534824
  1.291409	 -1.110358	  0.581737
  1.148402	 -1.040222	  0.562625
  1.086099	 -1.061723	  0.548258
  1.033171	 -1.099360	  0.573791
  0.927623	 -1.161698	  0.557735
  0.803179	 -1.275857	  0.589956
  0.887721	 -0.988301	  0.566725
  0.719204	 -1.152519	  0.567642
  0.722550	 -1.050085	  0.433930
  0.735534	 -0.983605	  0.454218
  0.699143	 -0.909588	  0.316033
  0.647822	 -0.865656	  0.325978
  0.614227	 -0.834682	  0.336436
  0.573080	 -0.806275	  0.342841
  0.536635	 -0.779662	  0.355667
  0.495089	 -0.747064	  0.365634
  0.450611	 -0.718529	  0.373443
  0.411420	 -0.692340	  0.382431
  0.375234	 -0.658739	  0.401895
  0.336970	 -0.630584	  0.409411
  0.298722	 -0.599761	  0.419368
  0.258053	 -0.572677	  0.429012
  0.221559	 -0.547631	  0.437584
  0.183081	 -0.519793	  0.451809
  0.145442	 -0.488736	  0.462099
  0.104309	 -0.454309	  0.471917
  0.066250	 -0.425698	  0.482195
  0.026822	 -0.396635	  0.492075
 -0.013583	 -0.365814	  0.502898
 -0.050434	 -0.339673	  0.515239
 -0.090082	 -0.312644	  0.524273
 -0.124725	 -0.282344	  0.533416
 -0.171166	 -0.254318	  0.543655
 -0.202295	 -0.218628	  0.553344
 -0.240949	 -0.194082	  0.565993
 -0.279306	 -0.167082	  0.582951
 -0.319300	 -0.137751	  0.589426
 -0.361102	 -0.106028	  0.604961
 -0.401917	 -0.076252	  0.613870
 -0.437223	 -0.049970	  0.621918
 -0.476706	 -0.020030	  0.631963
 -0.515748	  0.010603	  0.641733
 -0.557376	  0.042027	  0.650440
 -0.592625	  0.068710	  0.658733
 -0.634739	  0.100212	  0.670112
 -0.668847	  0.125900	  0.681041
 -0.709222	  0.157318	  0.689892
 -0.747733	  0.186817	  0.704064
 -0.786071	  0.217970	  0.711038
 -0.827478	  0.252298	  0.726327
 -0.863651	  0.278510	  0.734844
 -0.904949	  0.310631	  0.747244
 -0.941515	  0.333911	  0.755810
 -0.980691	  0.362296	  0.764858
 -1.021928	  0.393890	  0.776578
 -1.061172	  0.424038	  0.788522
 -1.099766	  0.453258	  0.801016
 -1.141946	  0.482622	  0.812288
 -1.175620	  0.507424	  0.820697
 -1.216319	  0.538770	  0.832922
 -1.254992	  0.566918	  0.844614
 -1.295474	  0.595377	  0.854754
 -1.334457	  0.623792	  0.863311
 -1.372945	  0.654530	  0.872701
 -1.409388	  0.684561	  0.882867
 -1.452497	  0.715795	  0.894277
 -1.489065	  0.741812	  0.904757
 -1.530916	  0.773676	  0.918750
 -1.568048	  0.800607	  0.927581
 -1.605141	  0.833458	  0.935236
 -1.639692	  0.857611	  0.946842
 -1.679207	  0.888528	  0.958580
 -1.719031	  0.916839	  0.968188
 -1.760720	  0.942304	  0.980627
 -1.803025	  0.970564	  0.993313
 -1.840043	  1.008718	  1.002790
 -1.877997	  1.035817	  1.007601
 -1.917235	  1.059483	  1.023362
 -1.954226	  1.094301	  1.035029
 -1.995433	  1.124331	  1.044694
 -2.033346	  1.153630	  1.049835
 -2.076873	  1.181590	  1.065164
 -2.112461	  1.207410	  1.071075
 -2.153054	  1.236718	  1.085579
 -2.191052	  1.267705	  1.092486
 -2.232604	  1.300087	  1.106641
 -2.268988	  1.326172	  1.119549
 -2.304891	  1.358559	  1.128985
 -2.340836	  1.382385	  1.136670
 -2.388861	  1.407963	  1.144982
 -2.412750	  1.422042	  1.156432
