 -1.158195	 -1.636964	  1.463511
 -1.187298	 -1.631936	  1.481829
 -1.170579	 -1.634848	  1.471246
 -1.153941	 -1.637809	  1.460558
 -1.137450	 -1.640722	  1.449957
 -1.121966	 -1.648259	  1.442849
 -1.104755	 -1.662927	  1.433350
 -1.088651	 -1.670965	  1.421091
 -1.071683	 -1.668231	  1.411913
 -1.052506	 -1.656036	  1.400173
 -1.031238	 -1.651587	  1.383947
 -1.018841	 -1.654906	  1.375035
 -1.004058	 -1.662748	  1.364664
 -0.986474	 -1.667808	  1.353727
 -0.971869	 -1.668204	  1.344536
 -0.952643	 -1.666597	  1.331639
 -0.937000	 -1.672193	  1.319642
 -0.925968	 -1.682427	  1.308740
 -0.912568	 -1.697165	  1.296985
 -0.897092	 -1.696243	  1.282940
 -0.879975	 -1.684906	  1.264468
 -0.860551	 -1.681710	  1.252445
 -0.844428	 -1.684973	  1.244077
 -0.826083	 -1.692203	  1.234936
 -0.808020	 -1.699060	  1.224614
 -0.797247	 -1.703361	  1.217728
 -0.780867	 -1.710696	  1.208242
 -0.760709	 -1.719289	  1.193221
 -0.748666	 -1.724898	  1.182807
 -0.733018	 -1.732937	  1.172208
 -0.718896	 -1.740682	  1.163981
 -0.702642	 -1.745116	  1.152570
 -0.682789	 -1.749257	  1.142325
 -0.661266	 -1.757625	  1.131616
 -0.647879	 -1.767439	  1.121649
 -0.634455	 -1.776987	  1.106477
 -0.628420	 -1.783664	  1.099309
 -0.614600	 -1.800702	  1.086777
 -0.602460	 -1.815821	  1.075632
 -0.594632	 -1.824821	  1.068385
 -0.582770	 -1.847620	  1.053308
 -0.575803	 -1.863035	  1.041198
 -0.570275	 -1.873812	  1.029791
 -0.559948	 -1.887256	  1.014593
 -0.549720	 -1.898485	  0.999925
 -0.540179	 -1.906469	  0.988099
 -0.528191	 -1.916012	  0.972876
 -0.516957	 -1.926175	  0.956301
 -0.507592	 -1.935914	  0.941510
 -0.496532	 -1.941510	  0.929248
 -0.486549	 -1.947939	  0.917038
 -0.473188	 -1.957365	  0.901762
 -0.462138	 -1.967882	  0.886436
 -0.454272	 -1.976795	  0.872838
 -0.440957	 -1.989039	  0.855119
 -0.427016	 -1.995238	  0.836924
 -0.421621	 -2.000178	  0.828921
 -0.408851	 -2.006244	  0.810673
 -0.392814	 -2.011035	  0.791918
 -0.381568	 -2.013761	  0.781696
 -0.361811	 -2.018519	  0.767397
 -0.350009	 -2.021783	  0.759313
 -0.333055	 -2.025626	  0.746501
 -0.313849	 -2.038596	  0.729207
 -0.304783	 -2.046879	  0.717873
 -0.295848	 -2.053609	  0.705497
 -0.287655	 -2.062533	  0.690981
 -0.274457	 -2.075559	  0.674874
 -0.263641	 -2.085480	  0.664783
 -0.252013	 -2.095074	  0.653108
 -0.234490	 -2.103984	  0.637715
 -0.216323	 -2.107155	  0.626147
 -0.204948	 -2.107260	  0.619230
 -0.184579	 -2.107462	  0.605879
 -0.168012	 -2.111921	  0.593516
 -0.155693	 -2.118283	  0.582547
 -0.139598	 -2.123465	  0.568596
 -0.124370	 -2.123824	  0.558123
 -0.109106	 -2.123142	  0.548176
 -0.094823	 -2.124771	  0.534982
 -0.082830	 -2.128681	  0.517202
 -0.060311	 -2.133040	  0.496025
 -0.041241	 -2.131808	  0.488480
 -0.023937	 -2.126419	  0.484491
 -0.005226	 -2.113453	  0.477038
  0.005364	 -2.106487	  0.471339
  0.025001	 -2.098224	  0.462375
  0.043545	 -2.089573	  0.456637
  0.058391	 -2.081493	  0.452392
  0.078834	 -2.070174	  0.446765
  0.092978	 -2.062822	  0.440765
  0.107281	 -2.055897	  0.431045
  0.130202	 -2.044173	  0.419266
  0.143170	 -2.037517	  0.415336
  0.161456	 -2.027049	  0.413071
  0.181344	 -2.013771	  0.408260
  0.190638	 -2.007089	  0.405288
  0.207712	 -1.998683	  0.398757
  0.223838	 -1.990156	  0.395987
  0.243164	 -1.987112	  0.389878
  0.276688	 -1.974887	  0.383438
  0.285295	 -1.967983	  0.380642
  0.297051	 -1.958497	  0.376830
  0.316534	 -1.948726	  0.368774
  0.331947	 -1.943449	  0.361608
  0.350879	 -1.942183	  0.353324
  0.370151	 -1.940546	  0.345619
  0.387329	 -1.939854	  0.338994
  0.406522	 -1.940068	  0.330275
  0.424680	 -1.939526	  0.321390
  0.441846	 -1.941381	  0.314904
  0.462418	 -1.945089	  0.309091
  0.482051	 -1.951418	  0.302212
  0.496480	 -1.952555	  0.294901
  0.514189	 -1.945449	  0.285010
  0.535800	 -1.939749	  0.279790
  0.557652	 -1.940433	  0.271400
  0.573659	 -1.944147	  0.258616
  0.585028	 -1.948299	  0.244458
  0.601591	 -1.951157	  0.232587
  0.618863	 -1.953340	  0.224732
  0.639609	 -1.955135	  0.218340
  0.657274	 -1.960426	  0.205559
  0.669078	 -1.966124	  0.190161
  0.680160	 -1.968689	  0.176640
  0.699542	 -1.968025	  0.167623
  0.715979	 -1.969889	  0.156811
  0.733579	 -1.975954	  0.136492
  0.745277	 -1.978170	  0.124751
  0.758695	 -1.980509	  0.113899
  0.776604	 -1.986418	  0.095598
  0.786208	 -1.988862	  0.086117
  0.800117	 -1.990683	  0.076818
  0.825861	 -1.992692	  0.060626
  0.837413	 -1.993877	  0.048660
  0.846793	 -1.995656	  0.035133
  0.860720	 -1.998524	  0.016320
  0.872143	 -2.000971	  0.002858
  0.886203	 -2.004058	 -0.015755
  0.899310	 -2.004577	 -0.033452
  0.907783	 -2.004617	 -0.046547
  0.919672	 -2.003711	 -0.064578
  0.930794	 -2.004017	 -0.077940
  0.944486	 -2.003282	 -0.095090
  0.960326	 -2.005003	 -0.112676
  0.971719	 -2.006376	 -0.122237
  0.985182	 -2.006022	 -0.137865
  1.002558	 -2.008610	 -0.156962
  1.018512	 -2.012748	 -0.167566
  1.034044	 -2.015719	 -0.175385
  1.050976	 -2.017278	 -0.188273
  1.066676	 -2.018805	 -0.201232
  1.082533	 -2.020791	 -0.213508
  1.098914	 -2.023417	 -0.225224
  1.115877	 -2.026409	 -0.236058
  1.133342	 -2.029315	 -0.245007
  1.150496	 -2.031944	 -0.255373
  1.166828	 -2.034534	 -0.266725
  1.183058	 -2.037517	 -0.278032
  1.199352	 -2.040594	 -0.289215
  1.215713	 -2.043716	 -0.300281
  1.232198	 -2.047136	 -0.311070
  1.248672	 -2.050607	 -0.321870
  1.265119	 -2.054430	 -0.332587
  1.281553	 -2.058367	 -0.343285
  1.297854	 -2.062486	 -0.354116
  1.313760	 -2.067123	 -0.365318
  1.329671	 -2.071769	 -0.376530
  1.345730	 -2.076474	 -0.387855
  1.362160	 -2.081769	 -0.399635
  1.377841	 -2.086933	 -0.410924
