 -0.458101	  2.450327	  0.321884
 -0.445458	  2.470466	  0.309745
 -0.461098	  2.460897	  0.320853
 -0.469568	  2.445381	  0.331404
 -0.477594	  2.431128	  0.337285
 -0.491315	  2.412608	  0.336970
 -0.503046	  2.392838	  0.340804
 -0.510887	  2.373963	  0.353134
 -0.516141	  2.358136	  0.366177
 -0.520787	  2.347363	  0.374183
 -0.526398	  2.328827	  0.380207
 -0.532604	  2.306515	  0.388663
 -0.539610	  2.288915	  0.399126
 -0.544752	  2.277410	  0.409094
 -0.557695	  2.261321	  0.424553
 -0.568026	  2.250522	  0.434935
 -0.579420	  2.238499	  0.446942
 -0.590165	  2.228298	  0.458219
 -0.600209	  2.216783	  0.470007
 -0.608073	  2.200139	  0.482201
 -0.614550	  2.183004	  0.492952
 -0.620758	  2.166074	  0.501164
 -0.627228	  2.148198	  0.507821
 -0.633827	  2.130919	  0.514521
 -0.642354	  2.111720	  0.523608
 -0.648812	  2.097264	  0.530667
 -0.654657	  2.082550	  0.538374
 -0.665826	  2.059288	  0.552622
 -0.675542	  2.051340	  0.559149
 -0.684610	  2.044319	  0.567910
 -0.703634	  2.021465	  0.586265
 -0.705071	  2.009057	  0.594884
 -0.706793	  1.992215	  0.606924
 -0.708832	  1.976067	  0.614100
 -0.708133	  1.959212	  0.625938
 -0.706181	  1.944098	  0.644142
 -0.706523	  1.927321	  0.663549
 -0.706916	  1.912401	  0.675547
 -0.705577	  1.902544	  0.682730
 -0.704557	  1.882749	  0.698782
 -0.706475	  1.864742	  0.709080
 -0.706535	  1.848632	  0.716055
 -0.702645	  1.828910	  0.723481
 -0.697375	  1.807265	  0.731753
 -0.698244	  1.788359	  0.739425
 -0.705529	  1.765805	  0.747287
 -0.713980	  1.751922	  0.751998
 -0.728641	  1.733672	  0.761918
 -0.742810	  1.715782	  0.771467
 -0.747651	  1.706367	  0.775656
 -0.754406	  1.682275	  0.786213
 -0.757732	  1.670581	  0.795175
 -0.762320	  1.656431	  0.808256
 -0.767079	  1.640921	  0.820926
 -0.775397	  1.624090	  0.832691
 -0.779853	  1.607578	  0.847008
 -0.780444	  1.598454	  0.857409
 -0.782291	  1.578310	  0.874816
 -0.790880	  1.557614	  0.881940
 -0.811410	  1.533348	  0.890444
 -0.826819	  1.518551	  0.892681
 -0.837890	  1.506269	  0.894875
 -0.851954	  1.491177	  0.891210
 -0.868381	  1.476186	  0.887835
 -0.890618	  1.460485	  0.888926
 -0.907245	  1.448004	  0.892228
 -0.914639	  1.443236	  0.892081
 -0.922575	  1.426513	  0.904036
 -0.936022	  1.399617	  0.908708
 -0.957139	  1.386802	  0.906027
 -0.972718	  1.383023	  0.902618
 -0.997935	  1.377087	  0.899243
 -1.015872	  1.364330	  0.898529
 -1.025173	  1.353192	  0.898719
 -1.039663	  1.337202	  0.898892
 -1.053840	  1.323899	  0.898106
 -1.066067	  1.306060	  0.898453
 -1.084015	  1.290430	  0.894723
 -1.102811	  1.284770	  0.887611
 -1.120172	  1.281833	  0.882040
 -1.135963	  1.275605	  0.876826
 -1.157627	  1.262937	  0.869361
 -1.178461	  1.253810	  0.864015
 -1.191838	  1.251604	  0.859673
 -1.214646	  1.250686	  0.852813
 -1.235336	  1.248334	  0.845365
 -1.249596	  1.243215	  0.844572
 -1.268991	  1.234945	  0.846905
 -1.287295	  1.224095	  0.849238
 -1.302814	  1.211044	  0.851474
 -1.316257	  1.196144	  0.857080
 -1.321377	  1.185010	  0.856872
 -1.324910	  1.179104	  0.863018
 -1.329619	  1.159123	  0.871969
 -1.333297	  1.149119	  0.873139
 -1.343074	  1.131717	  0.889322
 -1.343146	  1.125606	  0.900808
 -1.341868	  1.115032	  0.911104
 -1.323578	  1.099350	  0.932162
 -1.315605	  1.094040	  0.940963
 -1.303420	  1.087075	  0.952472
 -1.282293	  1.077789	  0.965451
 -1.268512	  1.072582	  0.972455
 -1.257183	  1.065311	  0.983604
 -1.241295	  1.053790	  1.000691
 -1.229678	  1.045662	  1.013985
 -1.220579	  1.037591	  1.025354
 -1.201696	  1.024588	  1.038977
 -1.190631	  1.019326	  1.045495
 -1.179171	  1.014519	  1.063000
 -1.173360	  1.003128	  1.080613
 -1.163084	  0.990630	  1.094443
 -1.152521	  0.979186	  1.107075
 -1.141981	  0.967777	  1.119676
 -1.131444	  0.956372	  1.132280
 -1.120930	  0.945012	  1.144934
 -1.110574	  0.933755	  1.157662
 -1.105888	  0.921560	  1.171715
 -1.104352	  0.910581	  1.191984
 -1.107965	  0.898080	  1.211089
 -1.110157	  0.878165	  1.222708
 -1.102908	  0.860878	  1.227726
 -1.087822	  0.841850	  1.230271
 -1.077716	  0.817875	  1.230265
 -1.077986	  0.792810	  1.234882
 -1.079871	  0.776195	  1.243433
 -1.083141	  0.763659	  1.255267
 -1.085950	  0.745794	  1.271423
 -1.091579	  0.728155	  1.280195
 -1.100021	  0.712153	  1.285100
 -1.101009	  0.691708	  1.296260
 -1.096114	  0.669340	  1.306489
 -1.093682	  0.656186	  1.312369
 -1.091965	  0.631635	  1.316575
 -1.102202	  0.608397	  1.319543
 -1.114708	  0.592682	  1.324033
 -1.127046	  0.584589	  1.331601
 -1.142441	  0.570895	  1.346416
 -1.157967	  0.555472	  1.358951
 -1.168737	  0.540773	  1.367009
 -1.173077	  0.520280	  1.367394
 -1.177391	  0.492951	  1.368461
 -1.178916	  0.477569	  1.367182
 -1.178728	  0.461007	  1.369783
 -1.178703	  0.429487	  1.380478
 -1.179247	  0.415752	  1.386865
 -1.181587	  0.403257	  1.391536
 -1.189748	  0.376693	  1.400160
 -1.198042	  0.360810	  1.404713
 -1.207844	  0.344785	  1.409736
 -1.220571	  0.327471	  1.419427
 -1.229248	  0.316239	  1.427406
 -1.240058	  0.299610	  1.434936
 -1.250431	  0.287290	  1.437668
 -1.265970	  0.273362	  1.448034
 -1.274727	  0.255361	  1.464242
 -1.275213	  0.238928	  1.473756
 -1.275726	  0.220074	  1.484834
 -1.279126	  0.200535	  1.499290
 -1.279830	  0.193401	  1.506931
 -1.286036	  0.177543	  1.532106
 -1.299851	  0.163554	  1.550487
 -1.306392	  0.158097	  1.556391
 -1.321219	  0.146685	  1.567255
 -1.334591	  0.127217	  1.577489
 -1.340003	  0.113344	  1.581554
 -1.346321	  0.094382	  1.585794
 -1.355961	  0.076499	  1.607163
 -1.360942	  0.065239	  1.621159
 -1.360626	  0.047111	  1.634201
 -1.358666	  0.029221	  1.635195
 -1.364255	  0.008116	  1.641883
 -1.370059	 -0.009923	  1.649809
 -1.375730	 -0.027452	  1.657641
 -1.381407	 -0.044959	  1.665464
 -1.387357	 -0.063111	  1.671373
 -1.393355	 -0.081250	  1.677285
 -1.399357	 -0.099126	  1.683120
 -1.404334	 -0.114448	  1.691882
 -1.404850	 -0.130421	  1.704601
 -1.406146	 -0.150993	  1.710292
 -1.420197	 -0.178724	  1.710134
 -1.434160	 -0.195835	  1.715706
 -1.445013	 -0.205496	  1.720980
 -1.446397	 -0.217416	  1.735633
 -1.445081	 -0.231529	  1.753183
 -1.447228	 -0.247386	  1.766963
 -1.452829	 -0.265276	  1.774968
 -1.458461	 -0.282949	  1.782579
 -1.464550	 -0.300457	  1.790163
 -1.472785	 -0.317527	  1.796645
 -1.481795	 -0.334376	  1.802583
 -1.490656	 -0.351276	  1.808582
 -1.500856	 -0.366754	  1.816080
 -1.511752	 -0.381286	  1.824420
 -1.517934	 -0.397654	  1.834045
 -1.523372	 -0.414339	  1.843642
 -1.528577	 -0.431367	  1.852749
 -1.533780	 -0.448402	  1.861850
 -1.539027	 -0.465588	  1.871028
 -1.545361	 -0.486389	  1.882196
 -1.556095	 -0.522010	  1.901703
 -1.561176	 -0.538944	  1.911053
