  0.974675	  1.620589	 -1.673894
  0.975097	  1.621994	 -1.674599
  0.966846	  1.614383	 -1.658050
  0.962957	  1.591320	 -1.659492
  0.959182	  1.562596	 -1.657126
  0.956993	  1.543129	 -1.653074
  0.954376	  1.528123	 -1.649305
  0.950581	  1.505442	 -1.640118
  0.946881	  1.486073	 -1.628875
  0.943003	  1.477343	 -1.619694
  0.938581	  1.461184	 -1.606553
  0.930774	  1.441466	 -1.586287
  0.927711	  1.433315	 -1.579829
  0.918456	  1.416880	 -1.568241
  0.907508	  1.394400	 -1.554952
  0.902995	  1.379741	 -1.545375
  0.902412	  1.366935	 -1.538563
  0.907067	  1.346961	 -1.530048
  0.907929	  1.327224	 -1.519988
  0.910251	  1.308716	 -1.513259
  0.914041	  1.291254	 -1.504208
  0.918913	  1.275068	 -1.492705
  0.923541	  1.257924	 -1.482707
  0.927572	  1.240275	 -1.475364
  0.934348	  1.224568	 -1.465975
  0.942499	  1.209984	 -1.455017
  0.949246	  1.195446	 -1.443037
  0.955079	  1.179948	 -1.432188
  0.961894	  1.164176	 -1.422048
  0.969816	  1.149188	 -1.411316
  0.976885	  1.133887	 -1.402611
  0.985247	  1.115270	 -1.397935
  0.999490	  1.098716	 -1.393193
  1.017528	  1.083203	 -1.375143
  1.024518	  1.074877	 -1.356614
  1.020517	  1.067241	 -1.339766
  1.011628	  1.054816	 -1.320505
  1.011502	  1.040541	 -1.304267
  1.023473	  1.024452	 -1.291762
  1.036194	  1.009047	 -1.282221
  1.041285	  0.998075	 -1.273539
  1.040862	  0.987119	 -1.253093
  1.040696	  0.974210	 -1.231311
  1.043561	  0.959856	 -1.218424
  1.048337	  0.946842	 -1.209055
  1.056903	  0.931032	 -1.198931
  1.062461	  0.912318	 -1.185712
  1.062385	  0.897377	 -1.172476
  1.062755	  0.886113	 -1.157788
  1.063610	  0.875950	 -1.138817
  1.063512	  0.866845	 -1.122848
  1.064320	  0.856646	 -1.104720
  1.069927	  0.843575	 -1.086398
  1.082287	  0.820358	 -1.072491
  1.089465	  0.802213	 -1.064454
  1.091683	  0.785808	 -1.054357
  1.089620	  0.772448	 -1.043431
  1.079804	  0.759268	 -1.025183
  1.071328	  0.746625	 -1.009986
  1.064852	  0.731544	 -0.996728
  1.059456	  0.715050	 -0.985298
  1.052394	  0.699155	 -0.975045
  1.042333	  0.683682	 -0.965482
  1.032956	  0.669139	 -0.958688
  1.024153	  0.652848	 -0.948473
  1.016980	  0.635317	 -0.939203
  1.010253	  0.617044	 -0.933850
  1.002017	  0.600277	 -0.931745
  0.989557	  0.582926	 -0.928995
  0.981043	  0.561629	 -0.919385
  0.974594	  0.545129	 -0.913586
  0.968728	  0.528356	 -0.908214
  0.962703	  0.504094	 -0.899478
  0.960329	  0.493189	 -0.896901
  0.954863	  0.476440	 -0.893628
  0.944270	  0.453717	 -0.891259
  0.936042	  0.437459	 -0.890203
  0.927625	  0.420213	 -0.891217
  0.916065	  0.395333	 -0.889442
  0.911765	  0.384959	 -0.886407
  0.906104	  0.366469	 -0.881091
  0.902210	  0.344230	 -0.877001
  0.900577	  0.323663	 -0.868857
  0.897584	  0.305371	 -0.859260
  0.892412	  0.286193	 -0.853864
  0.886095	  0.267664	 -0.851524
  0.879243	  0.249389	 -0.848228
  0.870717	  0.231647	 -0.843795
  0.860895	  0.214338	 -0.838864
  0.853283	  0.196959	 -0.832504
  0.844736	  0.181529	 -0.825841
  0.830844	  0.165285	 -0.820339
  0.819048	  0.147613	 -0.814892
  0.812270	  0.129938	 -0.809251
  0.806722	  0.114141	 -0.799956
  0.798790	  0.100208	 -0.785733
  0.792644	  0.088966	 -0.771231
  0.783092	  0.075207	 -0.759841
  0.773242	  0.061443	 -0.748812
  0.762861	  0.049206	 -0.736654
  0.752916	  0.037853	 -0.723115
  0.744232	  0.026403	 -0.708927
  0.737268	  0.014586	 -0.696170
  0.730298	  0.001050	 -0.688604
  0.732895	 -0.018638	 -0.686393
  0.738537	 -0.039769	 -0.679916
  0.739633	 -0.064161	 -0.658179
  0.739379	 -0.079318	 -0.646605
  0.739907	 -0.089031	 -0.643043
  0.743447	 -0.103928	 -0.639178
  0.744298	 -0.134559	 -0.633738
  0.745072	 -0.145782	 -0.631970
  0.747924	 -0.164827	 -0.631103
  0.750191	 -0.187224	 -0.634907
  0.752660	 -0.204546	 -0.640991
  0.755346	 -0.226054	 -0.644085
  0.757789	 -0.246019	 -0.644742
  0.759159	 -0.263579	 -0.642852
  0.765141	 -0.289735	 -0.642865
  0.773291	 -0.306934	 -0.648278
  0.782310	 -0.319184	 -0.652955
  0.798393	 -0.340636	 -0.661340
  0.808029	 -0.359958	 -0.666321
  0.810334	 -0.373840	 -0.666652
  0.804016	 -0.396217	 -0.665022
  0.801624	 -0.417837	 -0.666476
  0.804374	 -0.438102	 -0.668259
  0.806794	 -0.457927	 -0.669770
  0.806387	 -0.477916	 -0.669368
  0.805952	 -0.497907	 -0.668946
  0.805515	 -0.517898	 -0.668523
  0.805058	 -0.537886	 -0.668078
  0.802530	 -0.557581	 -0.665714
  0.799622	 -0.576950	 -0.662983
  0.796469	 -0.593746	 -0.659432
  0.789137	 -0.607030	 -0.649043
  0.780680	 -0.623987	 -0.637404
  0.778984	 -0.654314	 -0.631185
  0.777286	 -0.671958	 -0.626891
  0.772367	 -0.694495	 -0.626196
  0.768573	 -0.705205	 -0.623729
  0.763690	 -0.721253	 -0.620631
  0.756352	 -0.748138	 -0.609570
  0.754389	 -0.761652	 -0.600832
  0.753317	 -0.776342	 -0.592426
  0.752365	 -0.796593	 -0.582935
  0.749888	 -0.809881	 -0.576291
  0.745068	 -0.829107	 -0.562726
  0.740357	 -0.849733	 -0.549492
  0.736449	 -0.860939	 -0.542307
  0.732602	 -0.879100	 -0.532688
  0.727702	 -0.900798	 -0.526198
  0.725436	 -0.915357	 -0.521505
  0.722487	 -0.938428	 -0.513840
  0.719930	 -0.960795	 -0.504939
  0.719683	 -0.972842	 -0.498125
  0.723780	 -0.986803	 -0.489191
  0.733947	 -1.003179	 -0.474697
  0.742365	 -1.020451	 -0.456936
  0.744198	 -1.039038	 -0.445326
  0.744390	 -1.059850	 -0.438599
  0.743823	 -1.079696	 -0.433397
  0.740271	 -1.098637	 -0.426854
  0.733991	 -1.115906	 -0.418459
  0.726840	 -1.134596	 -0.409832
  0.720750	 -1.152372	 -0.404068
  0.716160	 -1.168624	 -0.399558
  0.711434	 -1.188842	 -0.390980
  0.706067	 -1.207723	 -0.382425
  0.700897	 -1.224143	 -0.375968
  0.696197	 -1.239331	 -0.369936
  0.689598	 -1.258021	 -0.360220
  0.681599	 -1.279838	 -0.350151
  0.677294	 -1.291379	 -0.345457
  0.671795	 -1.308723	 -0.335826
  0.660854	 -1.332919	 -0.322727
  0.656139	 -1.349088	 -0.316883
  0.655016	 -1.359504	 -0.313445
  0.654418	 -1.380691	 -0.311396
  0.651538	 -1.404814	 -0.304559
  0.649805	 -1.424833	 -0.295811
  0.649087	 -1.439118	 -0.288927
  0.647440	 -1.458561	 -0.281307
  0.640634	 -1.477854	 -0.275936
  0.632880	 -1.495044	 -0.270987
  0.625975	 -1.514392	 -0.267736
  0.618117	 -1.533248	 -0.263381
  0.612394	 -1.551313	 -0.258246
  0.607377	 -1.570447	 -0.250638
  0.604786	 -1.588314	 -0.238102
  0.605324	 -1.605279	 -0.226341
  0.605211	 -1.622691	 -0.216808
  0.602862	 -1.640885	 -0.209422
  0.598419	 -1.659890	 -0.203939
  0.594511	 -1.679479	 -0.198859
  0.590893	 -1.699121	 -0.192658
  0.589581	 -1.716144	 -0.184594
  0.590743	 -1.731123	 -0.171176
  0.600613	 -1.750996	 -0.154120
  0.612821	 -1.768273	 -0.145205
  0.618130	 -1.782525	 -0.139159
  0.617177	 -1.797688	 -0.132048
  0.616637	 -1.815719	 -0.121970
  0.615752	 -1.841498	 -0.113007
  0.614952	 -1.860649	 -0.107673
  0.614681	 -1.875440	 -0.104553
  0.613412	 -1.905358	 -0.100590
  0.612948	 -1.920364	 -0.095977
  0.613313	 -1.934226	 -0.088330
  0.615544	 -1.955349	 -0.074975
  0.616701	 -1.969833	 -0.066701
  0.619036	 -1.987484	 -0.055489
  0.621618	 -2.005211	 -0.043590
  0.623294	 -2.019569	 -0.034283
  0.623874	 -2.040436	 -0.023117
  0.621860	 -2.058324	 -0.016855
  0.618561	 -2.074718	 -0.013561
  0.613011	 -2.101551	 -0.007984
  0.610901	 -2.118355	 -0.000478
  0.610690	 -2.131209	  0.007495
  0.611103	 -2.152396	  0.021522
  0.611086	 -2.166343	  0.029701
  0.613110	 -2.184056	  0.040991
  0.612774	 -2.208922	  0.052369
  0.611362	 -2.222863	  0.058005
  0.607559	 -2.235629	  0.061156
  0.601783	 -2.256787	  0.072636
  0.600494	 -2.275376	  0.082990
  0.599028	 -2.292910	  0.092534
  0.596038	 -2.310698	  0.101225
  0.593354	 -2.328766	  0.109406
  0.591126	 -2.347124	  0.117030
  0.588906	 -2.365498	  0.124611
  0.586990	 -2.384088	  0.131733
  0.585148	 -2.402714	  0.138783
  0.583235	 -2.421307	  0.145900
  0.581231	 -2.439862	  0.153094
  0.579229	 -2.458448	  0.160297
  0.576981	 -2.477049	  0.167687
  0.573620	 -2.495048	  0.175734
