  0.200238	  2.473258	  0.380233
  0.188123	  2.498036	  0.400632
  0.195161	  2.483665	  0.388634
  0.202092	  2.469619	  0.376197
  0.209022	  2.455573	  0.363761
  0.215667	  2.441534	  0.351161
  0.222193	  2.427499	  0.338495
  0.228606	  2.413479	  0.325754
  0.234636	  2.399516	  0.312767
  0.240665	  2.385552	  0.299780
  0.246616	  2.371793	  0.286542
  0.252551	  2.358078	  0.273249
  0.259081	  2.345098	  0.259506
  0.266130	  2.332806	  0.245392
  0.278814	  2.342730	  0.233533
  0.291342	  2.353440	  0.222204
  0.303870	  2.364150	  0.210875
  0.316397	  2.374860	  0.199546
  0.328943	  2.385562	  0.188228
  0.346008	  2.392988	  0.180905
  0.363074	  2.400413	  0.173582
  0.380140	  2.407839	  0.166259
  0.397205	  2.415265	  0.158936
  0.414271	  2.422691	  0.151614
  0.431336	  2.430117	  0.144291
  0.448402	  2.437543	  0.136968
  0.465467	  2.444969	  0.129645
  0.482533	  2.452395	  0.122322
  0.499598	  2.459820	  0.115000
  0.516664	  2.467246	  0.107677
  0.533729	  2.474672	  0.100354
  0.550795	  2.482098	  0.093031
  0.567861	  2.489524	  0.085708
  0.585745	  2.496143	  0.079000
  0.603965	  2.501838	  0.073037
