 -2.442390	 -0.888723	  1.557499
 -2.418208	 -0.879924	  1.542078
 -2.376795	 -0.860025	  1.518853
 -2.344532	 -0.847684	  1.482061
 -2.311240	 -0.832371	  1.448739
 -2.276129	 -0.816872	  1.416467
 -2.241487	 -0.802242	  1.383930
 -2.212623	 -0.789831	  1.345287
 -2.182386	 -0.766506	  1.312602
 -2.146718	 -0.754489	  1.278277
 -2.112486	 -0.735121	  1.247172
 -2.075946	 -0.723463	  1.217162
 -2.042658	 -0.714384	  1.182844
 -2.003108	 -0.699350	  1.154556
 -1.963922	 -0.689344	  1.123267
 -1.925974	 -0.679457	  1.092620
 -1.888906	 -0.665224	  1.062301
 -1.855852	 -0.644660	  1.029361
 -1.827230	 -0.628993	  0.995787
 -1.823784	 -0.677602	  0.946411
 -1.789040	 -0.774700	  0.859302
 -1.701236	 -0.846867	  0.779249
 -1.628639	 -0.877574	  0.733622
 -1.575737	 -0.887685	  0.704578
 -1.534529	 -0.892557	  0.682693
 -1.504395	 -0.884592	  0.670588
 -1.478088	 -0.874472	  0.659330
 -1.442186	 -0.831832	  0.649674
 -1.408644	 -0.725717	  0.636273
 -1.393838	 -0.586381	  0.601311
 -1.379003	 -0.507335	  0.566183
 -1.363178	 -0.468499	  0.541714
 -1.343042	 -0.438348	  0.517030
 -1.316448	 -0.411942	  0.489673
 -1.285410	 -0.390343	  0.462568
 -1.250348	 -0.371512	  0.435160
 -1.211507	 -0.353645	  0.406744
 -1.173524	 -0.337174	  0.380305
 -1.136167	 -0.320516	  0.355680
 -1.098748	 -0.302478	  0.333031
 -1.057841	 -0.283493	  0.309096
 -1.016170	 -0.268736	  0.280691
 -0.976089	 -0.258319	  0.249942
 -0.938210	 -0.250394	  0.216555
 -0.902618	 -0.243571	  0.179820
 -0.868311	 -0.235965	  0.141707
 -0.834582	 -0.227190	  0.104641
 -0.801553	 -0.217351	  0.067900
 -0.769480	 -0.206563	  0.030804
 -0.739141	 -0.194688	 -0.006468
 -0.708065	 -0.180448	 -0.042900
 -0.675985	 -0.164666	 -0.076521
 -0.642611	 -0.148570	 -0.108260
 -0.608218	 -0.131264	 -0.140131
 -0.574867	 -0.113815	 -0.171569
 -0.542498	 -0.097130	 -0.203433
 -0.511671	 -0.081614	 -0.237076
 -0.480692	 -0.066019	 -0.273676
 -0.450371	 -0.050404	 -0.310991
 -0.420481	 -0.034432	 -0.348446
 -0.390438	 -0.017310	 -0.385167
 -0.359665	  0.001408	 -0.420950
 -0.327623	  0.021283	 -0.456309
 -0.295252	  0.040545	 -0.489815
 -0.262050	  0.058518	 -0.522048
 -0.227684	  0.074487	 -0.552280
 -0.191418	  0.088428	 -0.582085
 -0.153442	  0.100524	 -0.611069
 -0.114903	  0.110758	 -0.639173
 -0.074653	  0.120392	 -0.667922
 -0.034222	  0.130975	 -0.697827
  0.004509	  0.142497	 -0.727785
  0.042253	  0.154600	 -0.758251
  0.079433	  0.166488	 -0.788774
  0.116241	  0.177744	 -0.819230
  0.151855	  0.188410	 -0.848945
  0.188450	  0.199109	 -0.878818
  0.226608	  0.209517	 -0.909379
  0.263844	  0.219323	 -0.937859
  0.302294	  0.228285	 -0.964457
  0.343569	  0.237208	 -0.989393
  0.385429	  0.245722	 -1.012669
  0.422916	  0.252435	 -1.032169
  0.450727	  0.255890	 -1.045017
  0.467440	  0.256352	 -1.051412
  0.488400	  0.254478	 -1.057364
  0.542971	  0.245598	 -1.070811
  0.611119	  0.230887	 -1.087398
  0.658695	  0.222128	 -1.107014
  0.707253	  0.208912	 -1.121220
  0.774069	  0.214277	 -1.155372
  0.866078	  0.227351	 -1.213715
  0.953878	  0.224642	 -1.279078
  1.029360	  0.216712	 -1.343691
  1.081125	  0.189517	 -1.387405
  1.119251	  0.196141	 -1.428171
  1.158526	  0.219994	 -1.474062
  1.189853	  0.264496	 -1.516719
  1.205352	  0.325631	 -1.560174
  1.196395	  0.385530	 -1.597036
  1.170556	  0.453437	 -1.641845
  1.146142	  0.504453	 -1.684366
  1.136291	  0.546757	 -1.728052
  1.146309	  0.587633	 -1.771617
  1.164647	  0.619136	 -1.804815
  1.186689	  0.644331	 -1.833063
  1.213432	  0.667694	 -1.862303
  1.243055	  0.689686	 -1.892814
  1.274515	  0.710516	 -1.925460
  1.306044	  0.729464	 -1.960134
  1.336298	  0.745909	 -1.995426
  1.366016	  0.760937	 -2.031179
  1.396093	  0.776039	 -2.066727
  1.426395	  0.791633	 -2.101737
  1.459249	  0.808243	 -2.136736
  1.494850	  0.823913	 -2.169954
  1.531056	  0.838536	 -2.201170
  1.566798	  0.852540	 -2.231518
  1.601609	  0.865957	 -2.261245
  1.636533	  0.878680	 -2.292058
  1.672529	  0.888029	 -2.326812
  1.689254	  0.896909	 -2.350080
