  0.848214	 -2.351818	 -1.711837
  0.839816	 -2.328532	 -1.694888
  0.840941	 -2.274646	 -1.683529
  0.844496	 -2.223682	 -1.670996
  0.838214	 -2.177793	 -1.655919
  0.837221	 -2.127634	 -1.645802
  0.834126	 -2.077352	 -1.635832
  0.834016	 -2.030360	 -1.624540
  0.826254	 -1.982782	 -1.615044
  0.823243	 -1.934865	 -1.605353
  0.820064	 -1.887495	 -1.595230
  0.817014	 -1.837113	 -1.587300
  0.812754	 -1.785965	 -1.576610
  0.809220	 -1.736706	 -1.566670
  0.809578	 -1.689538	 -1.555160
  0.811610	 -1.639872	 -1.542134
  0.813074	 -1.591812	 -1.529405
  0.814220	 -1.546702	 -1.516647
  0.814561	 -1.498488	 -1.504396
  0.813153	 -1.450110	 -1.493960
  0.809888	 -1.399723	 -1.484262
  0.805775	 -1.351323	 -1.474476
  0.801422	 -1.301324	 -1.463120
  0.796994	 -1.255309	 -1.452149
  0.791986	 -1.208349	 -1.441149
  0.787107	 -1.159005	 -1.430787
  0.782650	 -1.109146	 -1.421550
  0.778366	 -1.057878	 -1.412199
  0.774561	 -1.010042	 -1.403855
  0.770129	 -0.959848	 -1.395270
  0.766094	 -0.907700	 -1.386662
  0.760861	 -0.858447	 -1.379822
  0.751900	 -0.816108	 -1.376362
  0.737580	 -0.783882	 -1.378537
  0.690840	 -0.735684	 -1.395431
  0.614804	 -0.685910	 -1.424026
  0.617231	 -0.717490	 -1.483186
  0.658593	 -0.651451	 -1.608277
  0.781757	 -0.599923	 -1.696027
  0.784560	 -0.575331	 -1.749549
  0.803887	 -0.569013	 -1.768587
  0.770875	 -0.469191	 -1.830732
  0.782642	 -0.360204	 -1.881243
  0.834666	 -0.152956	 -1.928906
  0.816417	  0.052843	 -1.819744
  0.764308	  0.160765	 -1.684340
  0.724404	  0.170717	 -1.596267
  0.646938	  0.125256	 -1.460214
  0.621577	  0.142268	 -1.412170
  0.617071	  0.154379	 -1.369625
  0.624710	  0.154113	 -1.314289
  0.635318	  0.155487	 -1.264500
  0.653702	  0.169038	 -1.227460
  0.683448	  0.221285	 -1.169284
  0.695485	  0.263266	 -1.146419
  0.702883	  0.308029	 -1.132329
  0.706722	  0.358223	 -1.121409
  0.706142	  0.405383	 -1.113249
  0.703593	  0.453407	 -1.100430
  0.700984	  0.497701	 -1.077605
  0.699210	  0.550803	 -1.081426
  0.698739	  0.599567	 -1.078114
  0.699537	  0.648403	 -1.069231
  0.699393	  0.699761	 -1.057917
  0.698197	  0.748802	 -1.046173
  0.696608	  0.797207	 -1.032973
  0.694587	  0.842630	 -1.019996
  0.692390	  0.890546	 -1.006225
  0.690026	  0.939879	 -0.992734
  0.687789	  0.991015	 -0.981869
  0.686737	  1.036980	 -0.977761
  0.687247	  1.084055	 -0.980945
  0.690062	  1.131567	 -0.997152
  0.701934	  1.248066	 -1.092848
  0.783813	  1.388196	 -1.415228
  0.868432	  1.458759	 -1.558999
  0.874208	  1.463292	 -1.562829
  0.881306	  1.516140	 -1.564602
  0.894720	  1.583801	 -1.538793
  0.899138	  1.655699	 -1.517373
  0.908255	  1.697938	 -1.481062
  0.896846	  1.740083	 -1.365898
  0.815595	  1.737164	 -1.195387
  0.805909	  1.753776	 -1.106001
  0.725486	  1.765971	 -0.981445
  0.654263	  1.782194	 -0.851821
  0.642167	  1.817404	 -0.818607
  0.643677	  1.868862	 -0.804634
  0.646045	  1.916964	 -0.793810
  0.645981	  1.964110	 -0.783319
  0.645915	  2.013896	 -0.772210
  0.642081	  2.061710	 -0.763615
  0.636508	  2.109400	 -0.752965
  0.625253	  2.160002	 -0.739010
  0.618651	  2.206356	 -0.727707
  0.616110	  2.254688	 -0.717822
  0.611447	  2.305958	 -0.709100
  0.609386	  2.356132	 -0.697977
  0.609066	  2.402332	 -0.686129
  0.607929	  2.448873	 -0.675156
  0.605878	  2.494773	 -0.664613
  0.602531	  2.543196	 -0.651243
  0.602620	  2.593556	 -0.640561
  0.599031	  2.646251	 -0.627070
  0.601906	  2.695484	 -0.617838
  0.602121	  2.746222	 -0.608672
  0.599527	  2.794233	 -0.595630
  0.593083	  2.840165	 -0.593614
  0.588917	  2.883206	 -0.583350
  0.594806	  2.912038	 -0.589184
