 -0.768699	  2.105558	 -1.180852
 -0.769235	  2.106058	 -1.181235
 -0.756277	  2.093967	 -1.171967
 -0.743320	  2.081871	 -1.162704
 -0.730467	  2.069584	 -1.153554
 -0.718380	  2.056004	 -1.145224
 -0.706317	  2.042393	 -1.136905
 -0.694236	  2.029142	 -1.128051
 -0.682098	  2.016483	 -1.118481
 -0.668478	  2.007130	 -1.107238
 -0.654674	  1.998034	 -1.095983
 -0.640776	  1.988646	 -1.085075
 -0.626937	  1.979199	 -1.074144
 -0.613347	  1.969461	 -1.063142
 -0.600816	  1.957306	 -1.053272
 -0.588176	  1.945203	 -1.043550
 -0.576059	  1.932929	 -1.033583
 -0.563185	  1.922230	 -1.024215
 -0.546754	  1.911472	 -1.018100
 -0.531750	  1.896061	 -1.016680
 -0.519421	  1.877641	 -1.011785
 -0.511310	  1.857719	 -1.000646
 -0.503822	  1.841777	 -0.989103
 -0.495612	  1.832512	 -0.978362
 -0.482592	  1.818799	 -0.965726
 -0.470089	  1.805206	 -0.955781
 -0.459726	  1.791941	 -0.945289
 -0.452857	  1.779781	 -0.934155
 -0.445421	  1.763485	 -0.919077
 -0.438113	  1.753189	 -0.909517
 -0.425241	  1.740117	 -0.896681
 -0.409315	  1.726727	 -0.881394
 -0.401534	  1.719980	 -0.874296
 -0.389954	  1.710674	 -0.862090
 -0.371546	  1.697705	 -0.847932
 -0.361663	  1.693089	 -0.843552
 -0.342473	  1.683475	 -0.836959
 -0.323238	  1.671303	 -0.828755
 -0.311105	  1.664338	 -0.822254
 -0.287531	  1.658185	 -0.811206
 -0.272189	  1.657345	 -0.807038
 -0.261474	  1.660319	 -0.804132
 -0.242966	  1.662646	 -0.790442
 -0.214104	  1.658639	 -0.778293
 -0.198349	  1.654619	 -0.777085
 -0.182397	  1.653386	 -0.774967
 -0.155298	  1.654095	 -0.769165
 -0.144417	  1.654105	 -0.766071
 -0.124048	  1.659341	 -0.751912
 -0.109110	  1.664008	 -0.739526
 -0.098224	  1.666983	 -0.732191
 -0.077103	  1.669186	 -0.721263
 -0.062964	  1.666874	 -0.709194
 -0.051487	  1.665225	 -0.696826
 -0.040305	  1.660320	 -0.679484
 -0.031817	  1.657902	 -0.664138
 -0.023521	  1.651473	 -0.647064
 -0.015191	  1.649060	 -0.631084
 -0.011289	  1.644071	 -0.615451
 -0.000303	  1.633845	 -0.595186
  0.007437	  1.622040	 -0.583430
  0.017294	  1.612853	 -0.575899
  0.035795	  1.613404	 -0.562480
  0.050353	  1.612391	 -0.548139
  0.059276	  1.602210	 -0.534449
  0.060733	  1.588998	 -0.522065
  0.062057	  1.572381	 -0.510135
  0.063840	  1.555103	 -0.499669
  0.065198	  1.537496	 -0.490174
  0.065835	  1.519406	 -0.481105
  0.065978	  1.501239	 -0.472416
  0.064890	  1.483221	 -0.464436
  0.062074	  1.465538	 -0.456168
  0.062934	  1.448960	 -0.447342
  0.068249	  1.433018	 -0.438649
  0.074559	  1.416777	 -0.428520
  0.080826	  1.400160	 -0.418383
  0.086810	  1.383221	 -0.408440
  0.092356	  1.366019	 -0.399826
  0.098024	  1.350026	 -0.390641
  0.104843	  1.336168	 -0.380841
  0.113740	  1.323989	 -0.370680
  0.123903	  1.313134	 -0.358688
  0.138171	  1.303784	 -0.349805
  0.156430	  1.297841	 -0.343333
  0.175289	  1.292031	 -0.337215
  0.194101	  1.282617	 -0.327305
  0.202885	  1.268183	 -0.310179
  0.211770	  1.257110	 -0.296661
  0.222426	  1.253479	 -0.290875
  0.242569	  1.250970	 -0.287853
  0.282148	  1.252248	 -0.291864
  0.306065	  1.236475	 -0.281321
  0.313410	  1.229443	 -0.275096
  0.319192	  1.211426	 -0.255081
  0.326370	  1.189400	 -0.233556
  0.331656	  1.183408	 -0.228796
  0.343075	  1.170218	 -0.210711
  0.353568	  1.163608	 -0.193092
  0.362697	  1.154691	 -0.183284
  0.380051	  1.130640	 -0.161254
  0.384652	  1.123508	 -0.151792
  0.390458	  1.110929	 -0.139666
  0.396179	  1.092679	 -0.116435
  0.399904	  1.086762	 -0.107275
  0.398749	  1.084230	 -0.090276
  0.407578	  1.060767	 -0.061483
  0.411386	  1.054120	 -0.052425
  0.416892	  1.046840	 -0.042964
  0.424477	  1.030812	 -0.024532
  0.434351	  1.016619	 -0.009724
  0.448565	  1.006847	  0.002980
  0.460422	  0.998766	  0.012099
  0.471704	  0.990982	  0.024450
  0.483065	  0.982365	  0.039067
  0.496804	  0.970400	  0.053906
  0.508019	  0.956670	  0.073621
  0.513514	  0.952154	  0.084385
  0.522185	  0.938673	  0.100039
  0.532137	  0.927405	  0.113301
  0.541094	  0.915108	  0.123456
  0.554885	  0.899935	  0.138689
  0.565225	  0.889235	  0.145090
  0.575068	  0.881571	  0.151370
  0.595206	  0.870361	  0.161374
  0.617232	  0.856853	  0.175686
  0.626661	  0.848436	  0.183184
  0.638387	  0.841223	  0.185963
  0.656667	  0.827322	  0.195959
  0.675742	  0.810876	  0.214923
  0.682832	  0.798641	  0.231580
  0.685890	  0.794328	  0.237145
  0.690299	  0.783196	  0.255986
  0.699221	  0.767291	  0.281164
  0.706716	  0.759417	  0.297771
  0.709923	  0.753913	  0.306488
  0.722069	  0.737100	  0.323746
  0.728727	  0.724896	  0.337113
  0.734934	  0.714386	  0.351619
  0.746203	  0.705143	  0.371647
  0.759192	  0.699113	  0.397030
  0.755723	  0.683931	  0.419303
  0.751122	  0.670321	  0.436987
  0.743554	  0.653425	  0.460838
  0.729387	  0.641724	  0.479862
  0.713248	  0.637724	  0.488088
  0.695718	  0.633532	  0.500483
  0.683018	  0.622653	  0.513137
  0.675222	  0.608404	  0.527015
  0.662873	  0.592615	  0.539392
  0.649878	  0.577866	  0.548505
  0.638064	  0.563342	  0.557644
  0.624759	  0.550324	  0.566828
  0.609122	  0.539751	  0.575311
  0.591502	  0.532961	  0.581240
  0.574777	  0.529034	  0.589558
  0.560846	  0.519664	  0.605292
  0.558892	  0.501216	  0.622242
  0.557439	  0.478048	  0.642472
  0.556427	  0.464977	  0.650370
  0.557759	  0.449504	  0.656688
  0.559908	  0.436071	  0.660097
  0.564795	  0.421425	  0.667104
  0.572312	  0.411265	  0.674186
  0.583813	  0.398721	  0.683417
  0.599268	  0.386394	  0.691656
  0.610963	  0.378379	  0.698236
  0.627138	  0.367823	  0.706029
  0.642478	  0.354683	  0.713627
  0.655013	  0.347422	  0.718349
  0.678007	  0.337058	  0.725227
  0.700063	  0.328437	  0.724956
  0.711574	  0.324606	  0.724774
  0.733244	  0.317447	  0.726099
  0.754203	  0.311592	  0.733229
  0.770049	  0.307445	  0.739131
  0.796110	  0.305489	  0.741413
  0.817507	  0.308926	  0.734843
  0.837931	  0.312789	  0.725838
  0.856126	  0.312414	  0.719072
  0.875337	  0.314360	  0.714624
  0.902098	  0.321504	  0.714261
  0.920175	  0.330980	  0.713802
  0.929504	  0.338420	  0.713933
  0.949369	  0.347656	  0.717935
  0.968198	  0.362087	  0.721521
  0.978067	  0.375312	  0.724281
  0.989928	  0.384922	  0.730952
  1.004725	  0.386653	  0.744928
  1.020967	  0.386379	  0.757954
  1.036572	  0.383374	  0.770177
  1.050865	  0.375808	  0.781557
  1.064303	  0.367867	  0.794049
  1.077806	  0.359919	  0.806591
  1.090892	  0.350632	  0.818840
  1.104037	  0.341074	  0.830487
  1.117081	  0.331452	  0.842110
  1.129746	  0.322016	  0.854114
  1.142319	  0.312382	  0.866262
  1.154747	  0.303101	  0.878868
  1.166830	  0.293906	  0.892031
  1.180077	  0.285452	  0.904401
  1.193256	  0.277525	  0.917318
  1.207228	  0.269397	  0.929454
  1.220793	  0.261247	  0.941741
  1.234465	  0.252340	  0.953698
  1.247667	  0.242394	  0.965348
  1.260397	  0.231749	  0.977065
  1.273715	  0.220614	  0.987559
  1.287079	  0.209838	  0.997800
  1.301126	  0.198918	  1.007478
  1.315879	  0.187902	  1.015703
  1.328121	  0.177913	  1.023986
  1.339135	  0.166488	  1.034132
  1.359710	  0.152403	  1.047269
  1.375430	  0.141889	  1.052878
  1.393142	  0.131105	  1.056131
  1.409606	  0.119272	  1.057442
  1.417241	  0.114230	  1.061220
  1.426414	  0.110506	  1.080901
  1.452454	  0.091503	  1.110818
  1.459130	  0.087250	  1.118244
  1.467138	  0.083221	  1.125064
  1.480759	  0.078952	  1.137000
  1.498710	  0.076024	  1.152508
  1.518432	  0.071191	  1.172003
  1.533815	  0.067465	  1.182019
  1.552438	  0.059442	  1.192170
  1.574443	  0.037958	  1.211991
  1.580717	  0.032041	  1.216672
  1.585410	  0.027480	  1.222968
  1.592630	  0.016307	  1.237138
  1.597230	 -0.003842	  1.253620
  1.608050	 -0.030794	  1.268177
  1.612814	 -0.052478	  1.272094
  1.615812	 -0.059320	  1.277723
  1.623106	 -0.081393	  1.307701
  1.626759	 -0.091694	  1.318964
  1.632465	 -0.105171	  1.326047
  1.637955	 -0.120401	  1.346424
  1.644168	 -0.136351	  1.357972
  1.650252	 -0.144662	  1.364438
  1.668003	 -0.158134	  1.384253
  1.677497	 -0.164664	  1.396682
  1.684485	 -0.169333	  1.403604
  1.703297	 -0.183182	  1.422495
  1.717912	 -0.192279	  1.435143
  1.727034	 -0.197155	  1.442466
  1.745179	 -0.202198	  1.455748
  1.756058	 -0.216549	  1.473888
  1.762691	 -0.228218	  1.485992
  1.771509	 -0.237817	  1.501172
  1.779654	 -0.249909	  1.516113
  1.790223	 -0.262293	  1.531153
  1.801094	 -0.272168	  1.542387
  1.810894	 -0.282924	  1.554659
  1.830136	 -0.297689	  1.572332
  1.839798	 -0.303373	  1.579049
  1.856008	 -0.309223	  1.588665
  1.870897	 -0.316719	  1.596384
  1.887152	 -0.327801	  1.608746
  1.901855	 -0.337850	  1.618761
  1.917130	 -0.348102	  1.627068
  1.933894	 -0.359535	  1.629072
  1.947936	 -0.370313	  1.638381
