 -0.544535	 -2.691855	 -1.279960
 -0.539144	 -2.665203	 -1.267287
 -0.513272	 -2.625975	 -1.242029
 -0.484701	 -2.588045	 -1.219547
 -0.454560	 -2.548498	 -1.205984
 -0.428198	 -2.511055	 -1.183619
 -0.404403	 -2.470787	 -1.163749
 -0.378140	 -2.433502	 -1.141716
 -0.351974	 -2.393445	 -1.126381
 -0.321807	 -2.361831	 -1.102776
 -0.300036	 -2.322122	 -1.083449
 -0.274809	 -2.281035	 -1.072972
 -0.251966	 -2.239419	 -1.057012
 -0.232976	 -2.196959	 -1.038611
 -0.212726	 -2.154402	 -1.020874
 -0.189783	 -2.112187	 -1.004310
 -0.164933	 -2.070473	 -0.987749
 -0.138482	 -2.029545	 -0.970497
 -0.110843	 -1.989872	 -0.952247
 -0.082466	 -1.951796	 -0.932978
 -0.053501	 -1.915546	 -0.912708
 -0.023694	 -1.881069	 -0.892095
  0.006662	 -1.847309	 -0.871790
  0.037545	 -1.814758	 -0.850974
  0.069473	 -1.782859	 -0.829950
  0.103060	 -1.751221	 -0.809629
  0.136967	 -1.719381	 -0.789484
  0.171661	 -1.688492	 -0.769438
  0.207835	 -1.660307	 -0.747576
  0.242182	 -1.631054	 -0.722852
  0.271893	 -1.597326	 -0.696299
  0.295372	 -1.558221	 -0.670200
  0.315249	 -1.515907	 -0.646823
  0.333483	 -1.471738	 -0.627500
  0.350306	 -1.426614	 -0.611637
  0.366852	 -1.380686	 -0.597685
  0.384096	 -1.335069	 -0.583253
  0.402592	 -1.290467	 -0.567447
  0.421709	 -1.246882	 -0.550473
  0.440977	 -1.203790	 -0.532265
  0.459768	 -1.161198	 -0.512986
  0.477864	 -1.118655	 -0.492706
  0.495091	 -1.076662	 -0.471560
  0.510802	 -1.036384	 -0.450539
  0.524206	 -0.997889	 -0.430613
  0.535754	 -0.958679	 -0.411775
  0.547026	 -0.912406	 -0.392382
  0.559953	 -0.851014	 -0.371810
  0.576454	 -0.773695	 -0.354114
  0.597147	 -0.693705	 -0.345108
  0.618153	 -0.627173	 -0.345916
  0.636450	 -0.581794	 -0.350342
  0.652746	 -0.553194	 -0.351446
  0.670913	 -0.532086	 -0.347115
  0.695742	 -0.513172	 -0.333147
  0.732930	 -0.495389	 -0.299703
  0.781478	 -0.485510	 -0.245192
  0.844151	 -0.488175	 -0.188482
  0.913543	 -0.482918	 -0.155074
  0.968771	 -0.457586	 -0.135504
  1.009046	 -0.424535	 -0.115683
  1.041427	 -0.390379	 -0.092543
  1.069504	 -0.355336	 -0.068632
  1.094900	 -0.319544	 -0.044123
  1.118066	 -0.283337	 -0.019048
  1.140113	 -0.247261	  0.006974
  1.161518	 -0.212051	  0.034167
  1.182930	 -0.177025	  0.061924
  1.204574	 -0.141995	  0.089160
  1.227065	 -0.106900	  0.115649
  1.251430	 -0.070007	  0.140851
  1.274876	 -0.030913	  0.164407
  1.296877	  0.009648	  0.186491
  1.318811	  0.051011	  0.206443
  1.342460	  0.091909	  0.223947
  1.370381	  0.129002	  0.240512
  1.405841	  0.155711	  0.261058
  1.450421	  0.166258	  0.290059
  1.508122	  0.153732	  0.333105
  1.584307	  0.117263	  0.392248
  1.680176	  0.082230	  0.457701
  1.776692	  0.083163	  0.508858
  1.846915	  0.114385	  0.537007
  1.894999	  0.155785	  0.550097
  1.932419	  0.208719	  0.552498
  1.962076	  0.271382	  0.544210
  1.981362	  0.333306	  0.528729
  1.988963	  0.386295	  0.512556
  1.987956	  0.430616	  0.500944
  1.981529	  0.472145	  0.494717
  1.970457	  0.521158	  0.494715
  1.952616	  0.584460	  0.507155
  1.932847	  0.659683	  0.537802
  1.920282	  0.737533	  0.576627
  1.917697	  0.808676	  0.609632
  1.922111	  0.867566	  0.634742
  1.930836	  0.917068	  0.654694
  1.943343	  0.962809	  0.672515
  1.961027	  1.007885	  0.689418
  1.983562	  1.051549	  0.705129
  2.009645	  1.093234	  0.719363
  2.037828	  1.133181	  0.732398
  2.067127	  1.170979	  0.745747
  2.096610	  1.207834	  0.760682
  2.125740	  1.243973	  0.777344
  2.154982	  1.280081	  0.796213
  2.183892	  1.315263	  0.817500
  2.212168	  1.348875	  0.840624
  2.241458	  1.382563	  0.864017
  2.271733	  1.413967	  0.886964
  2.305036	  1.441927	  0.910722
  2.329588	  1.478663	  0.932623
  2.351470	  1.518992	  0.948377
  2.376884	  1.555995	  0.964004
  2.400653	  1.571555	  0.973644
