  1.851804	 -2.376599	  0.321717
  1.833469	 -2.353068	  0.318531
  1.804062	 -2.310958	  0.343416
  1.777263	 -2.276989	  0.356928
  1.745161	 -2.242573	  0.372302
  1.713992	 -2.203935	  0.383887
  1.682050	 -2.173885	  0.397714
  1.657264	 -2.132236	  0.421506
  1.622353	 -2.101488	  0.432005
  1.590615	 -2.062744	  0.444253
  1.563782	 -2.029790	  0.466152
  1.528899	 -1.991933	  0.476339
  1.497185	 -1.958526	  0.496874
  1.471866	 -1.916794	  0.510243
  1.441250	 -1.885186	  0.526908
  1.403698	 -1.847709	  0.543737
  1.374738	 -1.810263	  0.560725
  1.350233	 -1.777456	  0.567939
  1.317971	 -1.738282	  0.583480
  1.283011	 -1.701967	  0.601609
  1.258310	 -1.665617	  0.619339
  1.224777	 -1.630708	  0.630779
  1.189437	 -1.597508	  0.649002
  1.158615	 -1.557759	  0.669315
  1.135945	 -1.523029	  0.685614
  1.096896	 -1.492025	  0.701558
  1.069862	 -1.455571	  0.716331
  1.036231	 -1.418216	  0.732274
  1.006069	 -1.384587	  0.743471
  0.981490	 -1.347609	  0.761565
  0.946727	 -1.314921	  0.771852
  0.912008	 -1.271870	  0.787776
  0.885063	 -1.237160	  0.807987
  0.860133	 -1.202433	  0.817003
  0.826943	 -1.164043	  0.834989
  0.789408	 -1.136711	  0.855109
  0.761993	 -1.093379	  0.870913
  0.734544	 -1.063247	  0.885383
  0.701246	 -1.028192	  0.895634
  0.673101	 -0.985143	  0.913897
  0.640887	 -0.951298	  0.925099
  0.610144	 -0.913877	  0.950144
  0.582027	 -0.885297	  0.959916
  0.549531	 -0.850176	  0.976111
  0.521710	 -0.807090	  0.996256
  0.484446	 -0.779779	  1.003131
  0.452971	 -0.735264	  1.020412
  0.423131	 -0.706111	  1.039808
  0.390140	 -0.666288	  1.053415
  0.361395	 -0.631958	  1.066145
  0.337324	 -0.592119	  1.085876
  0.306384	 -0.555870	  1.101957
  0.275603	 -0.525993	  1.116719
  0.235796	 -0.486340	  1.134797
  0.205314	 -0.453378	  1.146996
  0.176995	 -0.420609	  1.165351
  0.143896	 -0.386787	  1.180153
  0.115040	 -0.343285	  1.194282
  0.086225	 -0.305983	  1.210912
  0.053068	 -0.270520	  1.224720
  0.027646	 -0.238657	  1.238785
 -0.005731	 -0.201233	  1.252307
 -0.031336	 -0.165439	  1.270820
 -0.066175	 -0.136113	  1.283325
 -0.093541	 -0.098554	  1.298514
 -0.128090	 -0.056087	  1.322550
 -0.159851	 -0.022676	  1.330573
 -0.189426	  0.012102	  1.344628
 -0.220780	  0.049616	  1.366387
 -0.248834	  0.082827	  1.383155
 -0.276900	  0.121794	  1.394421
 -0.308502	  0.158830	  1.410536
 -0.345133	  0.191396	  1.428601
 -0.370562	  0.227123	  1.443463
 -0.401072	  0.257946	  1.459698
 -0.435078	  0.299792	  1.476068
 -0.461614	  0.331484	  1.489911
 -0.500554	  0.373848	  1.509227
 -0.524852	  0.405711	  1.519353
 -0.562331	  0.439655	  1.535698
 -0.592212	  0.479035	  1.552819
 -0.622293	  0.513562	  1.567859
 -0.654134	  0.543007	  1.586650
 -0.677073	  0.583560	  1.602406
 -0.707654	  0.615800	  1.609816
 -0.746984	  0.652835	  1.630361
 -0.776053	  0.691711	  1.640056
 -0.803459	  0.730920	  1.658094
 -0.838918	  0.766291	  1.674438
 -0.862338	  0.793561	  1.688190
 -0.893579	  0.830246	  1.704318
 -0.925051	  0.870944	  1.720871
 -0.957246	  0.900433	  1.735942
 -0.991075	  0.944839	  1.752077
 -1.014549	  0.977794	  1.771246
 -1.046314	  1.015650	  1.782569
 -1.084655	  1.043663	  1.803902
 -1.111063	  1.079828	  1.811989
 -1.138802	  1.118584	  1.827974
 -1.177489	  1.156127	  1.847786
 -1.199020	  1.188397	  1.860631
 -1.232597	  1.224242	  1.879506
 -1.265714	  1.261748	  1.894527
 -1.298327	  1.302871	  1.904267
 -1.322266	  1.330845	  1.925510
 -1.354970	  1.365070	  1.937743
 -1.390696	  1.408839	  1.952624
 -1.420882	  1.439593	  1.966575
 -1.444286	  1.476932	  1.984619
 -1.477953	  1.517763	  2.003072
 -1.507311	  1.547637	  2.012949
 -1.546463	  1.579312	  2.028355
 -1.561927	  1.595106	  2.048639
