  1.690295	 -1.727078	 -0.724335
  1.689992	 -1.735675	 -0.718407
  1.690572	 -1.719216	 -0.729755
  1.691153	 -1.702757	 -0.741102
  1.691755	 -1.686531	 -0.752779
  1.692357	 -1.670309	 -0.764462
  1.692870	 -1.654213	 -0.776321
  1.693245	 -1.638316	 -0.788452
  1.693620	 -1.622420	 -0.800583
  1.693653	 -1.606812	 -0.813089
  1.693577	 -1.591301	 -0.825715
  1.693477	 -1.575805	 -0.838358
  1.692650	 -1.560763	 -0.851513
  1.691824	 -1.545721	 -0.864668
  1.690820	 -1.530893	 -0.878052
  1.689359	 -1.516644	 -0.892011
  1.687898	 -1.502395	 -0.905969
  1.686436	 -1.488882	 -0.920640
  1.684975	 -1.476031	 -0.935895
  1.683514	 -1.463179	 -0.951150
  1.681821	 -1.451027	 -0.966944
  1.680097	 -1.438969	 -0.982807
  1.678134	 -1.426716	 -0.998492
  1.675584	 -1.414004	 -1.013720
  1.673035	 -1.401292	 -1.028948
  1.670058	 -1.387555	 -1.043177
  1.666945	 -1.373502	 -1.057062
  1.663808	 -1.359147	 -1.070630
  1.660617	 -1.344092	 -1.083404
  1.657427	 -1.329037	 -1.096178
  1.654465	 -1.313332	 -1.108202
  1.651528	 -1.297561	 -1.120145
  1.648816	 -1.281357	 -1.131551
  1.646264	 -1.264865	 -1.142573
  1.643822	 -1.248216	 -1.153384
  1.641591	 -1.231282	 -1.163787
  1.639354	 -1.214341	 -1.174180
  1.636957	 -1.197218	 -1.184233
  1.634560	 -1.180095	 -1.194286
  1.631880	 -1.163420	 -1.204998
  1.628758	 -1.147519	 -1.216721
  1.625636	 -1.131619	 -1.228444
  1.622768	 -1.115592	 -1.240058
  1.620007	 -1.099512	 -1.251626
  1.617601	 -1.083296	 -1.263083
  1.615813	 -1.066860	 -1.274338
  1.614063	 -1.050437	 -1.285617
  1.613314	 -1.034377	 -1.297512
  1.612564	 -1.018316	 -1.309408
  1.612317	 -1.002534	 -1.321690
  1.612366	 -0.986922	 -1.334191
  1.612542	 -0.971381	 -1.346779
  1.613154	 -0.956090	 -1.359655
  1.613767	 -0.940798	 -1.372531
  1.614694	 -0.925623	 -1.385525
  1.615682	 -0.910470	 -1.398541
  1.616626	 -0.895284	 -1.411521
  1.617494	 -0.880040	 -1.424439
  1.618363	 -0.864796	 -1.437357
  1.618788	 -0.849332	 -1.450033
  1.619116	 -0.833820	 -1.462653
  1.619311	 -0.818256	 -1.475212
  1.619008	 -0.802504	 -1.487532
  1.618705	 -0.786751	 -1.499851
  1.618019	 -0.770790	 -1.511883
  1.617075	 -0.754694	 -1.523717
  1.616126	 -0.738594	 -1.535545
  1.614493	 -0.721932	 -1.546485
  1.612860	 -0.705269	 -1.557425
  1.610939	 -0.688460	 -1.568091
  1.608618	 -0.671460	 -1.578368
  1.606297	 -0.654461	 -1.588646
  1.603438	 -0.637345	 -1.598590
  1.600436	 -0.620202	 -1.608444
  1.597342	 -0.603060	 -1.618272
  1.593814	 -0.585932	 -1.627975
  1.590286	 -0.568803	 -1.637679
  1.586914	 -0.551723	 -1.647523
  1.583601	 -0.534662	 -1.657420
  1.580691	 -0.517604	 -1.667447
  1.578346	 -0.500562	 -1.677649
  1.576047	 -0.483524	 -1.687867
  1.574334	 -0.466541	 -1.698291
  1.572622	 -0.449558	 -1.708715
  1.571147	 -0.432656	 -1.719305
  1.569806	 -0.415801	 -1.729987
  1.568452	 -0.398977	 -1.740717
  1.566925	 -0.382654	 -1.752172
  1.565397	 -0.366332	 -1.763628
  1.563646	 -0.350072	 -1.775141
  1.561593	 -0.333901	 -1.786730
  1.559540	 -0.317731	 -1.798319
  1.556784	 -0.301165	 -1.809180
  1.553952	 -0.284558	 -1.819960
  1.550892	 -0.268063	 -1.830848
  1.547047	 -0.251975	 -1.842090
  1.543203	 -0.235886	 -1.853332
  1.539050	 -0.220091	 -1.864876
  1.534209	 -0.205000	 -1.877075
  1.529369	 -0.189909	 -1.889275
  1.524206	 -0.175143	 -1.901737
  1.518598	 -0.160852	 -1.914556
  1.512990	 -0.146560	 -1.927374
  1.507647	 -0.132331	 -1.940373
  1.502375	 -0.118118	 -1.953419
  1.497725	 -0.103779	 -1.966563
  1.493804	 -0.089310	 -1.979803
  1.490156	 -0.074873	 -1.993154
  1.487506	 -0.060574	 -2.006884
  1.484856	 -0.046275	 -2.020614
  1.482206	 -0.031976	 -2.034344
  1.479145	 -0.014447	 -2.051309
  1.477019	 -0.000280	 -2.065265
