 -1.788155	  1.560126	 -0.958320
 -1.822272	  1.576004	 -0.949093
 -1.804582	  1.568085	 -0.954024
 -1.786863	  1.560273	 -0.959023
 -1.769139	  1.552554	 -0.964146
 -1.751416	  1.545040	 -0.969554
 -1.733649	  1.537781	 -0.975150
 -1.716118	  1.530444	 -0.981358
 -1.699057	  1.523248	 -0.987967
 -1.682156	  1.517724	 -0.995506
 -1.663173	  1.515766	 -1.005631
 -1.642017	  1.513672	 -1.014528
 -1.622162	  1.504176	 -1.017837
 -1.605391	  1.490060	 -1.018986
 -1.591162	  1.475807	 -1.022003
 -1.574735	  1.465686	 -1.030109
 -1.559577	  1.457590	 -1.042891
 -1.550853	  1.446851	 -1.058309
 -1.543591	  1.433530	 -1.074314
 -1.536425	  1.419421	 -1.088233
 -1.526824	  1.406706	 -1.101587
 -1.517967	  1.393188	 -1.113707
 -1.511689	  1.377644	 -1.123912
 -1.506275	  1.357539	 -1.131596
 -1.500022	  1.338614	 -1.134169
 -1.487024	  1.322009	 -1.139790
 -1.471098	  1.310131	 -1.147571
 -1.459082	  1.297115	 -1.156313
 -1.452206	  1.280285	 -1.166614
 -1.449247	  1.264383	 -1.177590
 -1.443545	  1.250384	 -1.189759
 -1.437374	  1.229449	 -1.201073
 -1.440092	  1.208155	 -1.206556
 -1.450521	  1.189558	 -1.207971
 -1.463071	  1.171431	 -1.212352
 -1.466925	  1.150330	 -1.217440
 -1.461413	  1.132043	 -1.225184
 -1.458309	  1.118064	 -1.236952
 -1.460537	  1.101324	 -1.249718
 -1.464274	  1.082122	 -1.257855
 -1.467799	  1.063512	 -1.264552
 -1.470445	  1.045340	 -1.270790
 -1.466607	  1.026918	 -1.275246
 -1.461639	  1.004743	 -1.285270
 -1.468176	  0.983646	 -1.292983
 -1.480513	  0.964199	 -1.294696
 -1.487034	  0.950084	 -1.294251
 -1.489409	  0.928648	 -1.298740
 -1.497148	  0.905477	 -1.301894
 -1.503269	  0.892331	 -1.300086
 -1.512531	  0.874020	 -1.293038
 -1.519780	  0.851297	 -1.288098
 -1.522528	  0.830631	 -1.289695
 -1.523943	  0.814328	 -1.293187
 -1.525019	  0.793045	 -1.293352
 -1.526174	  0.771997	 -1.292399
 -1.525350	  0.753073	 -1.294404
 -1.525871	  0.732623	 -1.296924
 -1.530206	  0.711869	 -1.296531
 -1.530951	  0.696253	 -1.297078
 -1.523001	  0.673783	 -1.305179
 -1.518671	  0.652245	 -1.306846
 -1.518345	  0.636824	 -1.303924
 -1.519605	  0.615856	 -1.297058
 -1.513269	  0.588245	 -1.294882
 -1.506678	  0.574208	 -1.296815
 -1.498548	  0.563410	 -1.299223
 -1.481721	  0.545458	 -1.305678
 -1.470021	  0.523222	 -1.311617
 -1.462880	  0.511725	 -1.315916
 -1.453976	  0.496288	 -1.318452
 -1.444490	  0.473533	 -1.321132
 -1.437185	  0.456119	 -1.327124
 -1.434042	  0.440943	 -1.333936
 -1.428277	  0.424874	 -1.336951
 -1.413208	  0.408304	 -1.335991
 -1.395931	  0.397629	 -1.339422
 -1.377862	  0.392424	 -1.343696
 -1.357562	  0.390110	 -1.349747
 -1.335994	  0.402266	 -1.354118
 -1.318824	  0.416833	 -1.351273
 -1.304568	  0.428338	 -1.345979
 -1.286962	  0.439221	 -1.344423
 -1.271943	  0.448489	 -1.344991
 -1.256389	  0.457406	 -1.347437
 -1.231560	  0.472835	 -1.349348
 -1.218647	  0.483357	 -1.348227
 -1.206041	  0.496158	 -1.347103
 -1.192166	  0.511796	 -1.342392
 -1.176227	  0.527925	 -1.332676
 -1.162758	  0.538748	 -1.321369
 -1.151608	  0.545760	 -1.310036
 -1.137201	  0.557663	 -1.296381
 -1.123884	  0.572997	 -1.282009
 -1.112445	  0.586747	 -1.270553
 -1.106539	  0.596621	 -1.265491
 -1.094302	  0.611681	 -1.261860
 -1.081988	  0.630402	 -1.256006
 -1.069673	  0.648861	 -1.246914
 -1.057654	  0.660224	 -1.238550
 -1.042732	  0.671760	 -1.230128
 -1.026440	  0.684725	 -1.222422
 -1.011341	  0.693558	 -1.217285
 -0.992486	  0.702022	 -1.209653
 -0.975995	  0.710922	 -1.204288
 -0.962451	  0.722675	 -1.197355
 -0.944620	  0.738130	 -1.187000
 -0.934971	  0.748085	 -1.182146
 -0.925201	  0.756309	 -1.174554
 -0.905989	  0.770142	 -1.167498
 -0.888048	  0.783498	 -1.154809
 -0.878276	  0.790612	 -1.145459
 -0.864847	  0.797387	 -1.135165
 -0.842720	  0.803936	 -1.125208
 -0.822837	  0.813208	 -1.117308
 -0.810925	  0.820381	 -1.112152
 -0.800071	  0.829799	 -1.097795
 -0.790868	  0.839573	 -1.079419
 -0.777133	  0.853846	 -1.069466
 -0.762773	  0.867351	 -1.059751
 -0.746576	  0.876080	 -1.047736
 -0.729405	  0.880388	 -1.040176
 -0.713694	  0.888978	 -1.034471
 -0.698064	  0.901305	 -1.021771
 -0.683654	  0.906917	 -1.011131
 -0.665730	  0.912403	 -1.005160
 -0.637684	  0.903107	 -0.996738
 -0.613071	  0.899167	 -0.984067
 -0.600211	  0.899527	 -0.979940
 -0.584085	  0.901228	 -0.977245
 -0.559734	  0.904516	 -0.969160
 -0.538703	  0.905279	 -0.963030
 -0.527027	  0.908799	 -0.961521
 -0.504592	  0.916451	 -0.955631
 -0.481185	  0.916456	 -0.947655
 -0.464171	  0.914422	 -0.940829
 -0.446121	  0.915067	 -0.929990
 -0.429509	  0.913860	 -0.919942
 -0.412411	  0.911359	 -0.908569
 -0.396542	  0.910780	 -0.899778
 -0.380158	  0.911402	 -0.886653
 -0.362331	  0.914054	 -0.872204
 -0.342412	  0.916005	 -0.862106
 -0.329006	  0.911782	 -0.855741
 -0.311674	  0.900624	 -0.852023
 -0.291072	  0.894613	 -0.846332
 -0.271789	  0.889010	 -0.841449
 -0.254241	  0.880110	 -0.836862
 -0.238213	  0.870715	 -0.831816
 -0.219329	  0.865247	 -0.828505
 -0.199547	  0.861055	 -0.826939
 -0.179854	  0.855257	 -0.829981
 -0.159511	  0.847814	 -0.831371
 -0.141559	  0.836008	 -0.820108
 -0.131647	  0.817994	 -0.809065
 -0.122777	  0.802944	 -0.805709
 -0.115897	  0.785752	 -0.805544
 -0.104670	  0.763686	 -0.805487
 -0.084424	  0.738107	 -0.802816
 -0.075472	  0.732648	 -0.801116
 -0.064187	  0.720650	 -0.800367
 -0.039686	  0.705171	 -0.802534
 -0.028147	  0.695763	 -0.803647
 -0.013315	  0.682377	 -0.802031
  0.004215	  0.667529	 -0.798874
  0.017890	  0.655448	 -0.798464
  0.032869	  0.636870	 -0.800183
  0.043431	  0.621140	 -0.800393
  0.052174	  0.609030	 -0.801500
  0.065916	  0.583316	 -0.807887
  0.074604	  0.566033	 -0.808797
  0.079075	  0.555592	 -0.814341
  0.088535	  0.537430	 -0.819914
  0.096073	  0.519782	 -0.831180
  0.103422	  0.501991	 -0.838591
  0.111138	  0.480572	 -0.846248
  0.117634	  0.462222	 -0.856822
  0.123354	  0.448297	 -0.863423
  0.129275	  0.432324	 -0.867278
  0.135733	  0.412497	 -0.872497
  0.144749	  0.388056	 -0.879017
  0.151685	  0.374582	 -0.880930
  0.162627	  0.359477	 -0.880474
  0.173957	  0.338990	 -0.880462
  0.179490	  0.320935	 -0.881484
  0.184513	  0.299100	 -0.883850
  0.189079	  0.285577	 -0.885747
  0.196887	  0.265017	 -0.886903
  0.203009	  0.242428	 -0.891200
  0.208168	  0.229260	 -0.896520
  0.216958	  0.211140	 -0.904084
  0.221965	  0.190543	 -0.905833
  0.222809	  0.172346	 -0.905700
  0.219900	  0.148173	 -0.914262
  0.217311	  0.131190	 -0.925741
  0.214302	  0.117434	 -0.935583
  0.214022	  0.098809	 -0.945050
  0.218947	  0.068405	 -0.966363
  0.222430	  0.056870	 -0.970798
  0.222679	  0.044752	 -0.975696
  0.221593	  0.023441	 -0.980593
  0.217061	  0.002093	 -0.982507
  0.219647	 -0.020604	 -0.985169
  0.227617	 -0.044515	 -0.988488
  0.232848	 -0.055010	 -0.989416
  0.242257	 -0.073272	 -0.995732
  0.252441	 -0.088772	 -1.004710
  0.261492	 -0.103779	 -1.013570
  0.268588	 -0.119013	 -1.026231
  0.273948	 -0.131957	 -1.039222
  0.277354	 -0.138015	 -1.046929
  0.280627	 -0.147167	 -1.061343
  0.282895	 -0.153848	 -1.076636
  0.287112	 -0.156097	 -1.099410
  0.288427	 -0.159618	 -1.115448
  0.293701	 -0.168629	 -1.129787
  0.308618	 -0.175234	 -1.146470
  0.330318	 -0.165238	 -1.172847
  0.334693	 -0.156592	 -1.191075
  0.336431	 -0.152888	 -1.203313
  0.336516	 -0.153181	 -1.224886
  0.339268	 -0.151923	 -1.247390
  0.343636	 -0.146679	 -1.264250
  0.346005	 -0.141123	 -1.280861
  0.351921	 -0.136995	 -1.299206
  0.359784	 -0.133302	 -1.316093
  0.370316	 -0.129812	 -1.329016
  0.383299	 -0.127139	 -1.342975
  0.397252	 -0.125514	 -1.357857
  0.412464	 -0.121069	 -1.372756
  0.427977	 -0.115649	 -1.383542
  0.445144	 -0.107382	 -1.396637
  0.453206	 -0.102387	 -1.404341
  0.464703	 -0.089656	 -1.418236
  0.477220	 -0.082663	 -1.426380
  0.494112	 -0.074908	 -1.437235
  0.512332	 -0.067133	 -1.445293
  0.532099	 -0.062335	 -1.451813
  0.550646	 -0.062421	 -1.457275
  0.568747	 -0.069801	 -1.463990
  0.586295	 -0.079799	 -1.468369
  0.609870	 -0.086574	 -1.470360
  0.630090	 -0.082249	 -1.475864
  0.652499	 -0.075442	 -1.487086
  0.662918	 -0.070482	 -1.495449
  0.680473	 -0.076385	 -1.506228
  0.698540	 -0.090114	 -1.509843
  0.718695	 -0.100447	 -1.511876
  0.738380	 -0.102911	 -1.516919
  0.761539	 -0.100439	 -1.532400
  0.773832	 -0.101661	 -1.546348
  0.784092	 -0.106471	 -1.555572
  0.803955	 -0.119830	 -1.559268
  0.823906	 -0.129161	 -1.561165
  0.839630	 -0.136957	 -1.567515
  0.852159	 -0.140819	 -1.575900
  0.868554	 -0.145543	 -1.586540
  0.889557	 -0.145514	 -1.595502
  0.908283	 -0.144596	 -1.599408
  0.928546	 -0.148756	 -1.594147
  0.949953	 -0.162268	 -1.581793
  0.966993	 -0.172620	 -1.581664
  0.986846	 -0.179231	 -1.592576
  0.998817	 -0.183967	 -1.606125
  1.018568	 -0.191862	 -1.604450
  1.039380	 -0.199262	 -1.604212
  1.060834	 -0.205880	 -1.611866
  1.073916	 -0.211629	 -1.616516
  1.091305	 -0.222571	 -1.611459
  1.118642	 -0.231626	 -1.608937
  1.134605	 -0.237885	 -1.619690
  1.143728	 -0.246347	 -1.640078
  1.159376	 -0.254143	 -1.662350
  1.178514	 -0.260975	 -1.670451
  1.194711	 -0.267873	 -1.670803
  1.211520	 -0.277687	 -1.671435
  1.230208	 -0.286470	 -1.675785
  1.249130	 -0.294351	 -1.676684
  1.269434	 -0.305455	 -1.671426
  1.288361	 -0.317080	 -1.668362
  1.304524	 -0.323797	 -1.679244
  1.317510	 -0.330821	 -1.692878
  1.332695	 -0.341941	 -1.703153
  1.348852	 -0.352156	 -1.707907
  1.365194	 -0.362010	 -1.705183
  1.386828	 -0.373853	 -1.707167
  1.404739	 -0.383179	 -1.716212
  1.415790	 -0.393351	 -1.725593
  1.427665	 -0.407363	 -1.736607
  1.444864	 -0.420599	 -1.743855
  1.460863	 -0.427520	 -1.744251
  1.481756	 -0.435246	 -1.743321
  1.499488	 -0.445448	 -1.748336
  1.510808	 -0.458474	 -1.757799
  1.524473	 -0.474249	 -1.768316
  1.539739	 -0.485281	 -1.771947
  1.556718	 -0.492275	 -1.770902
  1.581492	 -0.500289	 -1.771698
  1.600252	 -0.509420	 -1.779493
  1.604563	 -0.527882	 -1.790282
  1.620027	 -0.539183	 -1.796041
