  2.332913	  0.158369	 -0.751000
  2.349779	  0.153052	 -0.741796
  2.366645	  0.147735	 -0.732592
  2.350356	  0.152315	 -0.741541
  2.331548	  0.158132	 -0.751908
  2.314482	  0.162458	 -0.759144
  2.297359	  0.165269	 -0.767176
  2.279041	  0.170379	 -0.776696
  2.260766	  0.174426	 -0.784579
  2.243893	  0.175940	 -0.791220
  2.224700	  0.179107	 -0.798653
  2.203668	  0.177456	 -0.805166
  2.185952	  0.174653	 -0.810797
  2.166866	  0.175988	 -0.817569
  2.147001	  0.176146	 -0.824119
  2.128932	  0.173026	 -0.829528
  2.109885	  0.173952	 -0.836054
  2.089669	  0.174393	 -0.842848
  2.072588	  0.171068	 -0.848584
  2.053571	  0.172903	 -0.856118
  2.033450	  0.174890	 -0.863718
  2.015780	  0.172457	 -0.869746
  1.997189	  0.170310	 -0.876639
  1.978407	  0.169837	 -0.883865
  1.959296	  0.170632	 -0.890486
  1.940380	  0.171524	 -0.896920
  1.921345	  0.173119	 -0.902832
  1.902163	  0.176403	 -0.907434
  1.882984	  0.179744	 -0.912015
  1.864082	  0.183883	 -0.917070
  1.845423	  0.188625	 -0.922486
  1.826798	  0.193211	 -0.928090
  1.808538	  0.197126	 -0.934876
  1.791270	  0.201822	 -0.942282
  1.773059	  0.204334	 -0.951482
  1.752928	  0.203752	 -0.960459
  1.733461	  0.202680	 -0.965684
  1.715428	  0.207319	 -0.969569
  1.697467	  0.211760	 -0.978325
  1.679155	  0.212736	 -0.987792
  1.660732	  0.213106	 -0.995849
  1.644239	  0.217052	 -1.005559
  1.628718	  0.221336	 -1.017447
  1.611601	  0.225868	 -1.028473
  1.590214	  0.228544	 -1.033648
  1.573163	  0.228405	 -1.039969
  1.554878	  0.231425	 -1.050081
  1.540635	  0.235713	 -1.062193
  1.524110	  0.240024	 -1.074078
  1.507695	  0.243674	 -1.084564
  1.491973	  0.248880	 -1.095983
  1.477200	  0.253547	 -1.108916
  1.460576	  0.257379	 -1.120639
  1.443898	  0.263426	 -1.129742
  1.424943	  0.268981	 -1.136224
  1.403904	  0.265680	 -1.144363
  1.388950	  0.265153	 -1.155599
  1.373321	  0.268254	 -1.167074
  1.356400	  0.267013	 -1.178263
  1.336152	  0.265067	 -1.188572
  1.319405	  0.267983	 -1.195473
  1.301510	  0.267876	 -1.202197
  1.282252	  0.260085	 -1.210302
  1.265424	  0.260909	 -1.221949
  1.249496	  0.264235	 -1.230849
  1.229542	  0.260458	 -1.239734
  1.211763	  0.254870	 -1.248621
  1.193415	  0.249947	 -1.251284
  1.174542	  0.244271	 -1.253118
  1.155735	  0.236099	 -1.257880
  1.138009	  0.234214	 -1.263802
  1.119231	  0.230011	 -1.266718
  1.099223	  0.220383	 -1.271733
  1.083579	  0.209141	 -1.276965
  1.067124	  0.202782	 -1.278867
  1.047353	  0.195315	 -1.282972
  1.030261	  0.183848	 -1.289657
  1.014338	  0.175845	 -1.291275
  0.996311	  0.168730	 -1.293195
  0.975054	  0.161568	 -1.300049
  0.958226	  0.150070	 -1.303590
  0.941641	  0.148310	 -1.306154
  0.920017	  0.148917	 -1.311349
  0.901084	  0.142746	 -1.315585
  0.883008	  0.132875	 -1.317369
  0.865668	  0.122145	 -1.319514
  0.846581	  0.117420	 -1.323599
  0.824400	  0.116200	 -1.326690
  0.805115	  0.111736	 -1.326443
  0.788035	  0.104411	 -1.324738
  0.770969	  0.095648	 -1.322302
  0.752573	  0.084802	 -1.319105
  0.732251	  0.078213	 -1.317109
  0.714457	  0.077017	 -1.316156
  0.693262	  0.073742	 -1.313369
  0.671638	  0.068622	 -1.311108
  0.655774	  0.060239	 -1.306088
  0.635211	  0.058093	 -1.301235
  0.614314	  0.060206	 -1.298316
  0.597049	  0.067438	 -1.296988
  0.578927	  0.077073	 -1.297045
  0.557260	  0.087583	 -1.300562
  0.543982	  0.098814	 -1.306763
  0.523657	  0.104540	 -1.304635
  0.510016	  0.120848	 -1.307509
  0.496078	  0.134959	 -1.311614
  0.484221	  0.146935	 -1.312910
  0.470449	  0.162528	 -1.319896
  0.454419	  0.176289	 -1.326293
  0.447477	  0.193170	 -1.330333
  0.437093	  0.211645	 -1.330084
  0.422081	  0.222731	 -1.332238
  0.406452	  0.235207	 -1.337674
  0.396591	  0.255288	 -1.346995
  0.392180	  0.274799	 -1.344537
  0.375692	  0.289181	 -1.347514
  0.361974	  0.305753	 -1.348950
  0.356726	  0.326426	 -1.353215
  0.346421	  0.343812	 -1.345614
  0.329170	  0.358285	 -1.343674
  0.315709	  0.366771	 -1.332686
  0.304063	  0.381917	 -1.323388
  0.289104	  0.396482	 -1.317639
  0.278347	  0.410201	 -1.311223
  0.267056	  0.426837	 -1.305024
  0.255885	  0.445947	 -1.301792
  0.245283	  0.461994	 -1.305611
  0.231895	  0.476414	 -1.306817
  0.214031	  0.489375	 -1.306794
  0.202044	  0.501196	 -1.303110
  0.190562	  0.521420	 -1.297526
  0.176430	  0.537562	 -1.294313
  0.161454	  0.549277	 -1.294264
  0.152484	  0.561427	 -1.292177
  0.139609	  0.579809	 -1.289046
  0.121294	  0.592968	 -1.287819
  0.101751	  0.606640	 -1.276652
  0.095081	  0.620184	 -1.262867
  0.093883	  0.637078	 -1.253008
  0.089559	  0.659338	 -1.250218
  0.081815	  0.672797	 -1.241773
  0.076851	  0.692019	 -1.233190
  0.071247	  0.710605	 -1.228871
  0.061611	  0.725573	 -1.219898
  0.053011	  0.743082	 -1.215479
  0.049889	  0.763457	 -1.221491
  0.046317	  0.781893	 -1.223169
  0.039610	  0.800636	 -1.222717
  0.031464	  0.819778	 -1.223327
  0.028748	  0.835974	 -1.234910
  0.026242	  0.855634	 -1.240535
  0.024924	  0.870862	 -1.253405
  0.019871	  0.885832	 -1.264966
  0.013739	  0.896557	 -1.281355
  0.010129	  0.905580	 -1.298498
  0.015854	  0.917382	 -1.314505
  0.015383	  0.929872	 -1.329583
  0.011086	  0.942617	 -1.344910
  0.008345	  0.945139	 -1.366163
  0.010608	  0.951347	 -1.385518
  0.012852	  0.955878	 -1.403092
  0.012180	  0.960495	 -1.423030
  0.010045	  0.962853	 -1.441833
  0.005209	  0.960907	 -1.464603
  0.009491	  0.957658	 -1.486201
  0.015398	  0.960497	 -1.504007
  0.016292	  0.969340	 -1.520746
  0.017694	  0.976005	 -1.539972
  0.022073	  0.980319	 -1.561371
  0.032486	  0.982492	 -1.580500
  0.035406	  0.987511	 -1.597027
  0.038438	  0.993301	 -1.616614
  0.043254	  0.997518	 -1.635111
  0.049099	  1.000604	 -1.655450
  0.052341	  1.007740	 -1.672156
  0.057126	  1.015528	 -1.691014
  0.062385	  1.022474	 -1.709162
  0.067986	  1.028554	 -1.727436
  0.073572	  1.034616	 -1.745659
  0.079158	  1.040677	 -1.763881
  0.084744	  1.046739	 -1.782103
  0.090330	  1.052801	 -1.800326
  0.095893	  1.058802	 -1.818570
  0.100517	  1.062523	 -1.837664
  0.105014	  1.065942	 -1.856850
  0.109510	  1.069357	 -1.876036
  0.114006	  1.072771	 -1.895223
  0.118502	  1.076186	 -1.914410
  0.122998	  1.079600	 -1.933596
  0.127493	  1.083015	 -1.952783
  0.131989	  1.086429	 -1.971970
  0.136485	  1.089844	 -1.991156
  0.140892	  1.093128	 -2.010358
  0.141470	  1.090720	 -2.030149
  0.142066	  1.087759	 -2.049710
  0.144773	  1.085754	 -2.069460
  0.146015	  1.081741	 -2.090574
  0.145711	  1.077374	 -2.109813
  0.143525	  1.073639	 -2.128141
  0.141792	  1.069293	 -2.148492
  0.130532	  1.059710	 -2.165625
  0.116348	  1.050664	 -2.175667
  0.097378	  1.042277	 -2.176261
  0.080185	  1.035319	 -2.171304
  0.064399	  1.030927	 -2.160425
  0.046260	  1.025863	 -2.148305
  0.031455	  1.019786	 -2.140479
  0.015600	  1.014133	 -2.125452
  0.000650	  1.010671	 -2.112229
 -0.011830	  1.007511	 -2.098344
 -0.028127	  1.000048	 -2.089837
 -0.045586	  0.993659	 -2.079355
 -0.058748	  0.989913	 -2.065936
 -0.074511	  0.983204	 -2.054025
 -0.090397	  0.975981	 -2.044026
 -0.103823	  0.968017	 -2.032074
 -0.115075	  0.959440	 -2.018891
 -0.128531	  0.949991	 -2.006384
 -0.141874	  0.940770	 -1.994645
 -0.155204	  0.931559	 -1.982920
 -0.168578	  0.922691	 -1.971256
 -0.182612	  0.915089	 -1.960394
 -0.198206	  0.902223	 -1.954140
 -0.212315	  0.886814	 -1.949074
 -0.220546	  0.871460	 -1.940380
 -0.231157	  0.856563	 -1.932345
 -0.244408	  0.842311	 -1.927130
 -0.255849	  0.827723	 -1.920050
 -0.266693	  0.812262	 -1.911772
 -0.279672	  0.797843	 -1.907088
 -0.293640	  0.784928	 -1.903095
 -0.306134	  0.769767	 -1.896993
 -0.318803	  0.753294	 -1.896843
 -0.330601	  0.738873	 -1.894989
 -0.348177	  0.724039	 -1.891598
 -0.361968	  0.711654	 -1.890729
 -0.376766	  0.700066	 -1.889791
 -0.395752	  0.690720	 -1.885381
 -0.411487	  0.681070	 -1.880957
 -0.427604	  0.671180	 -1.880579
 -0.446482	  0.660648	 -1.878908
 -0.469672	  0.656551	 -1.881159
 -0.486990	  0.658081	 -1.888689
 -0.503719	  0.648027	 -1.889060
 -0.521292	  0.642812	 -1.893397
 -0.540561	  0.642485	 -1.898775
 -0.563098	  0.647033	 -1.907841
 -0.578916	  0.641669	 -1.911913
 -0.598558	  0.642696	 -1.920356
 -0.614985	  0.651042	 -1.930240
 -0.631244	  0.657688	 -1.937262
 -0.649995	  0.663080	 -1.941795
 -0.673387	  0.664121	 -1.950425
 -0.690181	  0.663910	 -1.959866
 -0.703265	  0.671374	 -1.969966
 -0.720915	  0.675670	 -1.980566
 -0.739051	  0.682364	 -1.992170
 -0.751160	  0.686021	 -1.999531
 -0.770452	  0.689274	 -2.010331
 -0.789886	  0.690798	 -2.021714
 -0.806152	  0.693294	 -2.027193
 -0.822797	  0.701899	 -2.036410
 -0.839172	  0.707835	 -2.049937
 -0.855564	  0.711754	 -2.060269
 -0.875369	  0.717076	 -2.065102
 -0.894005	  0.720716	 -2.074559
 -0.908154	  0.716847	 -2.084338
 -0.926585	  0.719499	 -2.094376
 -0.945324	  0.723464	 -2.104657
 -0.962467	  0.723771	 -2.113151
 -0.980169	  0.726564	 -2.121088
 -0.999029	  0.731141	 -2.130366
 -1.016278	  0.729281	 -2.138928
 -1.034307	  0.731419	 -2.147316
 -1.052336	  0.733557	 -2.155704
