 -0.717622	  0.456743	 -2.286856
 -0.701917	  0.462343	 -2.315906
 -0.715342	  0.457251	 -2.302455
 -0.724689	  0.450658	 -2.292398
 -0.739878	  0.439848	 -2.271709
 -0.748967	  0.439381	 -2.251513
 -0.756780	  0.443118	 -2.235863
 -0.769825	  0.447693	 -2.220639
 -0.789652	  0.449909	 -2.202880
 -0.798926	  0.445601	 -2.191780
 -0.807193	  0.435715	 -2.177606
 -0.817446	  0.421866	 -2.158938
 -0.829596	  0.414673	 -2.140632
 -0.843790	  0.415491	 -2.126623
 -0.860915	  0.422960	 -2.115069
 -0.880022	  0.433916	 -2.095161
 -0.891499	  0.438863	 -2.079270
 -0.900272	  0.441551	 -2.067850
 -0.912731	  0.443470	 -2.057153
 -0.928273	  0.442159	 -2.039265
 -0.939106	  0.439317	 -2.022185
 -0.949955	  0.438242	 -2.004233
 -0.960805	  0.435703	 -1.987534
 -0.973062	  0.435360	 -1.971448
 -0.985287	  0.435300	 -1.955597
 -0.997131	  0.435932	 -1.939494
 -1.008862	  0.436766	 -1.923317
 -1.020594	  0.437602	 -1.907141
 -1.032327	  0.438441	 -1.890966
 -1.043897	  0.439480	 -1.874686
 -1.054969	  0.441157	 -1.858126
 -1.066460	  0.442176	 -1.841834
 -1.078580	  0.442344	 -1.825809
 -1.090431	  0.442615	 -1.809470
 -1.100450	  0.444327	 -1.792323
 -1.111337	  0.443570	 -1.776953
 -1.124336	  0.438946	 -1.761815
 -1.138629	  0.437374	 -1.747446
 -1.151802	  0.430244	 -1.725394
 -1.157863	  0.428483	 -1.699706
 -1.157849	  0.428123	 -1.688115
 -1.158737	  0.426800	 -1.676172
 -1.156654	  0.424272	 -1.654265
 -1.150427	  0.428887	 -1.632877
 -1.152381	  0.431817	 -1.614565
 -1.157704	  0.421227	 -1.588876
 -1.156335	  0.412110	 -1.570987
 -1.153678	  0.406447	 -1.562033
 -1.140419	  0.396253	 -1.546127
 -1.127505	  0.388095	 -1.531622
 -1.120366	  0.382138	 -1.519168
 -1.109734	  0.367494	 -1.492390
 -1.107147	  0.358849	 -1.478083
 -1.104811	  0.350867	 -1.466573
 -1.094923	  0.337144	 -1.446032
 -1.088036	  0.330652	 -1.430892
 -1.082313	  0.328840	 -1.416789
 -1.067317	  0.316779	 -1.397078
 -1.050845	  0.303672	 -1.387616
 -1.039073	  0.294505	 -1.383597
 -1.022265	  0.285363	 -1.376857
 -1.007454	  0.274673	 -1.363422
 -0.992184	  0.259125	 -1.347978
 -0.983738	  0.251555	 -1.334584
 -0.977875	  0.244862	 -1.312962
 -0.973361	  0.238963	 -1.294756
 -0.966830	  0.227038	 -1.278713
 -0.956203	  0.215275	 -1.267539
 -0.946790	  0.207881	 -1.259483
 -0.931833	  0.200896	 -1.246817
 -0.914820	  0.197155	 -1.223871
 -0.903579	  0.196641	 -1.203808
 -0.897525	  0.193329	 -1.189819
 -0.885227	  0.185634	 -1.167422
 -0.876443	  0.181281	 -1.156547
 -0.862421	  0.175074	 -1.139182
 -0.851351	  0.170945	 -1.125160
 -0.843093	  0.168106	 -1.113702
 -0.826235	  0.160939	 -1.090464
 -0.812974	  0.154339	 -1.075285
 -0.801322	  0.144981	 -1.063391
 -0.793870	  0.140288	 -1.053930
 -0.780731	  0.135349	 -1.037300
 -0.771007	  0.129090	 -1.017824
 -0.763269	  0.121429	 -1.001574
 -0.755854	  0.113721	 -0.979050
 -0.749654	  0.107063	 -0.956650
 -0.748425	  0.104156	 -0.947993
 -0.742845	  0.100822	 -0.922732
 -0.736836	  0.098895	 -0.896161
 -0.731662	  0.098375	 -0.881068
 -0.725013	  0.094936	 -0.866017
 -0.714010	  0.092728	 -0.846937
 -0.700457	  0.092918	 -0.831055
 -0.689985	  0.094446	 -0.821285
 -0.678543	  0.094568	 -0.803851
 -0.663766	  0.089107	 -0.779604
 -0.652465	  0.082067	 -0.759521
 -0.647387	  0.078860	 -0.749585
 -0.641381	  0.078382	 -0.728990
 -0.638687	  0.072047	 -0.709816
 -0.634306	  0.061444	 -0.690411
 -0.628735	  0.055013	 -0.674252
 -0.622370	  0.050742	 -0.652805
 -0.618283	  0.046908	 -0.635354
 -0.613929	  0.042403	 -0.616858
 -0.609587	  0.040234	 -0.593425
 -0.607003	  0.042325	 -0.575977
 -0.604711	  0.045096	 -0.554660
 -0.601088	  0.048529	 -0.528516
 -0.599885	  0.050073	 -0.518633
 -0.598606	  0.051173	 -0.496515
 -0.600418	  0.048547	 -0.476484
 -0.603075	  0.046789	 -0.455534
 -0.602572	  0.043397	 -0.431098
 -0.601371	  0.041379	 -0.415446
 -0.601543	  0.037185	 -0.395341
 -0.601873	  0.032021	 -0.374294
 -0.601791	  0.029592	 -0.360906
 -0.599306	  0.021072	 -0.333736
 -0.593961	  0.014549	 -0.312009
 -0.590133	  0.011691	 -0.298863
 -0.581276	  0.005963	 -0.278589
 -0.572234	  0.005972	 -0.260913
 -0.562195	  0.005431	 -0.241039
 -0.559593	 -0.004197	 -0.213769
 -0.563675	 -0.010547	 -0.200640
 -0.567053	 -0.015205	 -0.187889
 -0.563778	 -0.013699	 -0.169661
 -0.556123	 -0.009954	 -0.147089
 -0.559086	 -0.012634	 -0.112325
 -0.563047	 -0.014145	 -0.096760
 -0.566485	 -0.018632	 -0.085943
 -0.568925	 -0.023558	 -0.065362
 -0.572325	 -0.030116	 -0.041235
 -0.576856	 -0.039439	 -0.022949
 -0.581267	 -0.046877	 -0.010308
 -0.587200	 -0.055315	  0.008575
 -0.593643	 -0.068458	  0.033987
 -0.598019	 -0.077321	  0.047630
 -0.604935	 -0.085426	  0.058688
 -0.609786	 -0.088517	  0.079846
 -0.612031	 -0.089307	  0.103984
 -0.611997	 -0.090409	  0.124503
 -0.611553	 -0.096305	  0.138977
 -0.617366	 -0.111634	  0.158729
 -0.620371	 -0.121124	  0.178622
 -0.615677	 -0.126467	  0.199557
 -0.607303	 -0.131141	  0.215950
 -0.606251	 -0.139628	  0.235010
 -0.606254	 -0.147906	  0.253339
 -0.606085	 -0.156447	  0.271279
 -0.607861	 -0.164314	  0.289688
 -0.609815	 -0.170577	  0.308249
 -0.614671	 -0.174191	  0.326907
 -0.622908	 -0.176036	  0.348342
 -0.623903	 -0.182469	  0.366982
 -0.626868	 -0.187223	  0.383725
 -0.632162	 -0.192734	  0.410171
 -0.632242	 -0.199452	  0.430348
 -0.630794	 -0.205394	  0.444212
 -0.628973	 -0.215040	  0.463620
 -0.623929	 -0.226253	  0.481189
 -0.618092	 -0.229825	  0.494918
 -0.613140	 -0.233382	  0.519105
 -0.611102	 -0.246509	  0.539547
 -0.612358	 -0.258622	  0.553263
 -0.614625	 -0.270885	  0.567361
 -0.619551	 -0.283574	  0.590034
 -0.622558	 -0.290512	  0.607725
 -0.625722	 -0.294235	  0.621718
 -0.629922	 -0.299957	  0.644113
 -0.632655	 -0.304854	  0.665709
 -0.634318	 -0.308491	  0.678724
 -0.637056	 -0.315206	  0.698943
 -0.643923	 -0.320825	  0.723092
 -0.649674	 -0.327805	  0.745087
 -0.650060	 -0.330848	  0.755066
 -0.648913	 -0.339122	  0.770821
 -0.644617	 -0.352705	  0.789637
 -0.644846	 -0.372059	  0.813380
 -0.648019	 -0.374495	  0.835402
 -0.649536	 -0.365800	  0.854605
 -0.654876	 -0.353827	  0.873834
 -0.664246	 -0.351375	  0.901207
 -0.668766	 -0.354408	  0.916289
 -0.673623	 -0.357734	  0.930557
 -0.676837	 -0.359093	  0.953195
 -0.678466	 -0.360088	  0.975433
 -0.681392	 -0.363345	  0.993486
 -0.683158	 -0.369560	  1.010525
 -0.684057	 -0.375073	  1.032313
 -0.687056	 -0.379068	  1.051862
 -0.693543	 -0.385221	  1.070302
 -0.697538	 -0.391649	  1.084198
 -0.702379	 -0.401295	  1.106526
 -0.707515	 -0.405211	  1.127812
 -0.714829	 -0.408848	  1.148702
 -0.718997	 -0.411518	  1.163068
 -0.718080	 -0.414895	  1.184170
 -0.715391	 -0.419357	  1.209231
 -0.714434	 -0.422489	  1.224606
 -0.714781	 -0.428212	  1.243555
 -0.710754	 -0.431678	  1.268858
 -0.705348	 -0.431938	  1.294806
 -0.702636	 -0.433324	  1.306992
 -0.700449	 -0.438664	  1.322006
 -0.700408	 -0.443122	  1.339989
 -0.696638	 -0.446128	  1.363433
 -0.694243	 -0.448197	  1.385247
 -0.693754	 -0.451341	  1.403868
 -0.691977	 -0.453102	  1.422744
 -0.690793	 -0.454671	  1.444051
 -0.694070	 -0.454388	  1.465545
 -0.697302	 -0.452844	  1.486799
 -0.697124	 -0.453823	  1.506191
 -0.691442	 -0.464167	  1.529613
 -0.685792	 -0.482786	  1.546828
 -0.684078	 -0.493051	  1.553440
 -0.683118	 -0.503069	  1.573236
 -0.685613	 -0.506082	  1.594901
 -0.690846	 -0.512076	  1.614462
 -0.694100	 -0.516592	  1.635316
 -0.691483	 -0.520553	  1.655560
 -0.685875	 -0.526026	  1.672992
 -0.683541	 -0.533536	  1.691758
 -0.681914	 -0.539933	  1.711007
 -0.677431	 -0.543981	  1.730095
 -0.674586	 -0.548037	  1.748970
 -0.673672	 -0.554547	  1.766400
 -0.681625	 -0.566222	  1.783392
 -0.689303	 -0.572065	  1.805971
 -0.687802	 -0.570946	  1.830991
 -0.679500	 -0.569908	  1.850657
 -0.666487	 -0.573065	  1.865274
 -0.661427	 -0.577846	  1.885359
 -0.658936	 -0.580648	  1.905164
 -0.656348	 -0.583531	  1.924795
 -0.654479	 -0.586491	  1.944450
 -0.653787	 -0.589355	  1.964242
 -0.653337	 -0.592252	  1.984016
 -0.653221	 -0.595100	  2.003792
 -0.653329	 -0.597743	  2.023553
 -0.650711	 -0.598176	  2.043230
 -0.644392	 -0.598124	  2.063554
 -0.641601	 -0.600712	  2.084005
 -0.642552	 -0.600375	  2.103095
 -0.640201	 -0.600550	  2.123203
 -0.636780	 -0.606208	  2.145596
 -0.642592	 -0.609395	  2.162981
 -0.653911	 -0.616612	  2.180440
 -0.659080	 -0.626297	  2.208971
 -0.656285	 -0.629133	  2.224556
 -0.648381	 -0.631077	  2.238743
 -0.641062	 -0.629122	  2.260935
 -0.644604	 -0.632735	  2.282524
 -0.653186	 -0.636160	  2.300047
 -0.659124	 -0.638864	  2.322945
 -0.658488	 -0.642989	  2.354224
 -0.658639	 -0.645837	  2.374020
