  2.286529	  0.750462	 -0.634598
  2.303534	  0.756454	 -0.635767
  2.272703	  0.745590	 -0.633647
  2.223881	  0.729318	 -0.629884
  2.173749	  0.713246	 -0.625802
  2.121849	  0.698402	 -0.621152
  2.070790	  0.685606	 -0.616330
  2.023318	  0.674409	 -0.611965
  1.976831	  0.662501	 -0.609030
  1.932094	  0.650723	 -0.605254
  1.887615	  0.634611	 -0.598695
  1.834832	  0.618470	 -0.595538
  1.779299	  0.608081	 -0.595738
  1.732160	  0.602180	 -0.597314
  1.690536	  0.593196	 -0.600149
  1.646072	  0.580954	 -0.603271
  1.599977	  0.565926	 -0.605215
  1.550333	  0.548055	 -0.604929
  1.494485	  0.526293	 -0.600879
  1.433163	  0.499035	 -0.593093
  1.368972	  0.466056	 -0.582898
  1.308069	  0.431524	 -0.573093
  1.256606	  0.402229	 -0.566189
  1.215501	  0.381753	 -0.562445
  1.180987	  0.369644	 -0.560458
  1.145345	  0.362745	 -0.558986
  1.102125	  0.360298	 -0.558057
  1.052377	  0.361266	 -0.558312
  1.003199	  0.362697	 -0.559699
  0.957613	  0.361262	 -0.561620
  0.915974	  0.356564	 -0.563130
  0.875673	  0.348407	 -0.564404
  0.834333	  0.336422	 -0.565763
  0.791341	  0.321281	 -0.566516
  0.747670	  0.304013	 -0.565688
  0.703062	  0.284670	 -0.563808
  0.656205	  0.264156	 -0.561453
  0.607948	  0.243990	 -0.559244
  0.559979	  0.224968	 -0.557276
  0.512277	  0.206997	 -0.555898
  0.464558	  0.189335	 -0.554429
  0.415644	  0.171953	 -0.551889
  0.366202	  0.155483	 -0.547600
  0.317275	  0.139766	 -0.542527
  0.268438	  0.124733	 -0.537607
  0.218620	  0.110136	 -0.532994
  0.167157	  0.095972	 -0.528353
  0.115319	  0.083186	 -0.524132
  0.064077	  0.071946	 -0.521461
  0.013172	  0.061957	 -0.521404
 -0.036236	  0.052689	 -0.524091
 -0.084319	  0.043505	 -0.529293
 -0.132008	  0.033974	 -0.536824
 -0.179249	  0.024176	 -0.546076
 -0.226276	  0.014302	 -0.556368
 -0.275454	  0.004421	 -0.567237
 -0.324810	 -0.005017	 -0.576907
 -0.375559	 -0.014675	 -0.583065
 -0.425996	 -0.024981	 -0.584674
 -0.477342	 -0.035300	 -0.582662
 -0.529848	 -0.044325	 -0.578116
 -0.582043	 -0.050216	 -0.572059
 -0.632715	 -0.052128	 -0.565084
 -0.681209	 -0.050154	 -0.557410
 -0.730797	 -0.044800	 -0.549794
 -0.786468	 -0.036290	 -0.542984
 -0.852361	 -0.024635	 -0.537368
 -0.925551	 -0.008261	 -0.530934
 -0.996365	  0.012611	 -0.524924
 -1.057640	  0.033225	 -0.522248
 -1.108018	  0.050434	 -0.523937
 -1.151042	  0.064360	 -0.529956
 -1.193718	  0.076879	 -0.541172
 -1.244577	  0.089043	 -0.560768
 -1.306509	  0.099575	 -0.592501
 -1.376294	  0.104682	 -0.637063
 -1.443970	  0.100431	 -0.689922
 -1.500700	  0.084827	 -0.744089
 -1.545453	  0.057771	 -0.795783
 -1.579815	  0.023379	 -0.844668
 -1.606236	 -0.012625	 -0.885359
 -1.625942	 -0.044350	 -0.910983
 -1.638692	 -0.066253	 -0.919549
 -1.657632	 -0.097234	 -0.895041
 -1.676503	 -0.134711	 -0.841108
 -1.695913	 -0.186996	 -0.749157
 -1.718099	 -0.251965	 -0.638818
 -1.750835	 -0.328219	 -0.532565
 -1.804258	 -0.412667	 -0.449670
 -1.882578	 -0.491453	 -0.408740
 -1.965672	 -0.543405	 -0.403978
 -2.036374	 -0.570169	 -0.413497
 -2.092673	 -0.585003	 -0.425517
 -2.141200	 -0.596075	 -0.434749
 -2.188758	 -0.605435	 -0.440811
 -2.236632	 -0.613749	 -0.444039
 -2.284381	 -0.620941	 -0.444603
 -2.367484	 -0.631806	 -0.440242
 -2.382893	 -0.633755	 -0.439078
