  0.702673	  0.370882	 -2.440983
  0.730974	  0.399164	 -2.448252
  0.717054	  0.385255	 -2.444680
  0.703134	  0.371346	 -2.441105
  0.689215	  0.357437	 -2.437528
  0.675228	  0.343657	 -2.433879
  0.658413	  0.335378	 -2.426986
  0.641223	  0.328392	 -2.419525
  0.623970	  0.321606	 -2.412061
  0.606410	  0.315734	 -2.404573
  0.588655	  0.310270	 -2.396901
  0.570957	  0.305420	 -2.388872
  0.553598	  0.299266	 -2.380432
  0.536383	  0.294089	 -2.371979
  0.519142	  0.289172	 -2.365391
  0.502557	  0.286310	 -2.358316
  0.485119	  0.287143	 -2.347709
  0.469485	  0.287004	 -2.334693
  0.454026	  0.284883	 -2.321932
  0.437582	  0.281485	 -2.312512
  0.419328	  0.281960	 -2.303136
  0.403014	  0.283380	 -2.291553
  0.387403	  0.285161	 -2.282057
  0.367305	  0.284716	 -2.283702
  0.343037	  0.276372	 -2.282701
  0.326942	  0.270373	 -2.275431
  0.312786	  0.265945	 -2.269019
  0.292136	  0.260389	 -2.263882
  0.273083	  0.254591	 -2.268987
  0.258667	  0.250853	 -2.277724
  0.240186	  0.244379	 -2.287176
  0.221349	  0.236709	 -2.302435
  0.211906	  0.233854	 -2.315082
  0.200006	  0.230034	 -2.327700
  0.184338	  0.223100	 -2.339732
  0.168251	  0.217518	 -2.351758
  0.155627	  0.214551	 -2.366600
  0.146126	  0.213791	 -2.384681
  0.131061	  0.214368	 -2.402043
  0.113568	  0.217289	 -2.414500
  0.093798	  0.212908	 -2.424079
  0.080872	  0.201509	 -2.435107
  0.071754	  0.185768	 -2.446620
  0.058601	  0.166366	 -2.454779
  0.040042	  0.153940	 -2.461271
  0.024544	  0.150233	 -2.469684
  0.011494	  0.146188	 -2.485268
  0.000694	  0.140971	 -2.502415
 -0.013738	  0.134684	 -2.516876
 -0.028760	  0.127449	 -2.528256
 -0.041371	  0.117666	 -2.538550
 -0.054785	  0.103394	 -2.546227
 -0.069618	  0.095398	 -2.557001
