  1.534357	  1.069133	  1.592797
  1.537978	  1.070777	  1.594436
  1.521258	  1.063219	  1.586481
  1.504587	  1.055642	  1.578430
  1.488200	  1.047355	  1.570482
  1.471838	  1.038905	  1.562646
  1.455821	  1.029668	  1.555175
  1.440508	  1.019653	  1.547040
  1.425279	  1.009623	  1.538632
  1.409329	  0.999902	  1.531367
  1.393413	  0.990066	  1.524531
  1.377727	  0.979523	  1.517741
  1.361798	  0.969103	  1.511379
  1.345621	  0.959176	  1.505275
  1.329501	  0.948723	  1.499431
  1.313169	  0.938405	  1.493934
  1.296694	  0.928398	  1.488289
  1.279349	  0.919644	  1.483702
  1.262158	  0.910577	  1.478865
  1.245092	  0.901486	  1.473622
  1.227976	  0.892654	  1.468224
  1.210856	  0.883841	  1.462818
  1.193384	  0.875796	  1.457340
  1.175786	  0.868047	  1.451840
  1.158161	  0.860384	  1.446308
  1.140301	  0.853533	  1.440470
  1.122434	  0.846708	  1.434626
  1.104376	  0.840280	  1.428929
  1.085426	  0.836118	  1.424086
  1.066486	  0.831953	  1.419218
  1.048465	  0.826000	  1.412924
  1.030859	  0.819411	  1.406096
  1.013159	  0.814341	  1.398292
  0.995465	  0.809954	  1.390074
  0.978139	  0.803344	  1.382603
  0.961578	  0.794177	  1.376178
  0.945053	  0.785139	  1.369792
  0.926864	  0.780255	  1.364763
  0.905359	  0.779884	  1.362194
  0.883053	  0.775308	  1.355284
  0.869047	  0.767036	  1.347122
  0.855250	  0.757660	  1.340105
  0.834495	  0.750440	  1.334645
  0.819148	  0.739531	  1.327351
  0.803701	  0.729611	  1.321218
  0.784726	  0.722850	  1.314208
  0.768705	  0.714010	  1.305732
  0.755456	  0.702934	  1.296244
  0.738707	  0.694865	  1.287886
  0.721522	  0.688015	  1.280240
  0.703289	  0.682921	  1.273799
  0.685070	  0.677780	  1.267373
  0.668298	  0.669129	  1.260782
  0.651817	  0.659951	  1.254140
  0.635589	  0.651216	  1.246378
  0.619969	  0.641275	  1.238855
  0.606808	  0.627634	  1.232525
  0.593691	  0.613925	  1.226210
  0.578896	  0.602048	  1.219895
  0.563688	  0.590680	  1.213613
  0.548531	  0.579266	  1.207371
  0.533275	  0.568832	  1.201486
  0.518412	  0.557618	  1.201155
  0.495822	  0.545045	  1.204033
  0.477715	  0.536798	  1.197587
  0.463017	  0.530361	  1.181678
  0.449462	  0.524332	  1.169552
  0.432653	  0.516525	  1.160497
  0.417430	  0.510486	  1.151233
  0.399388	  0.504672	  1.139341
  0.382896	  0.499580	  1.132744
  0.367237	  0.495857	  1.124037
  0.344591	  0.490901	  1.112477
  0.323136	  0.485336	  1.111258
  0.311172	  0.483559	  1.115307
  0.286835	  0.488924	  1.109421
  0.264592	  0.488242	  1.097626
  0.250712	  0.481735	  1.084939
  0.239872	  0.473764	  1.071307
  0.221016	  0.471592	  1.056205
  0.206501	  0.472168	  1.048373
  0.188754	  0.473773	  1.039198
  0.164228	  0.471571	  1.026084
  0.148146	  0.471104	  1.017676
  0.136866	  0.473353	  1.012296
  0.120584	  0.472096	  0.992991
  0.101481	  0.464054	  0.979694
  0.081516	  0.451738	  0.978647
  0.063065	  0.442019	  0.978859
  0.043627	  0.433761	  0.974542
  0.026448	  0.426097	  0.966513
  0.014096	  0.418481	  0.960987
 -0.006511	  0.403391	  0.958381
 -0.026986	  0.393977	  0.952426
 -0.039337	  0.387907	  0.945301
 -0.053675	  0.384322	  0.929923
 -0.071532	  0.382980	  0.915757
 -0.094272	  0.377919	  0.905382
 -0.107648	  0.371298	  0.899538
 -0.122391	  0.362501	  0.892832
 -0.140163	  0.353991	  0.884365
 -0.158883	  0.345342	  0.878016
 -0.173355	  0.334145	  0.873948
 -0.188447	  0.320363	  0.869544
 -0.206335	  0.312348	  0.862562
 -0.228076	  0.309245	  0.855308
 -0.246703	  0.304949	  0.849529
 -0.262932	  0.295263	  0.844083
 -0.274290	  0.283953	  0.838394
 -0.287804	  0.272927	  0.825736
 -0.303118	  0.262784	  0.811463
 -0.316312	  0.250173	  0.799985
 -0.334494	  0.232045	  0.795768
 -0.354167	  0.220429	  0.801467
 -0.374332	  0.212957	  0.807279
 -0.392707	  0.206831	  0.807425
 -0.409414	  0.200308	  0.803320
 -0.426947	  0.191880	  0.797203
 -0.445972	  0.184678	  0.793679
 -0.465336	  0.178229	  0.793473
 -0.482391	  0.169360	  0.794037
 -0.495434	  0.155295	  0.792419
 -0.512276	  0.139473	  0.788390
 -0.529671	  0.131597	  0.782295
 -0.547155	  0.128806	  0.778408
 -0.570120	  0.121950	  0.771978
 -0.582260	  0.111079	  0.767507
 -0.594941	  0.094917	  0.762195
 -0.613066	  0.082694	  0.755499
 -0.632163	  0.077970	  0.750881
 -0.652771	  0.073188	  0.745994
 -0.667247	  0.064296	  0.739254
 -0.678392	  0.051489	  0.731457
 -0.696644	  0.037107	  0.722477
 -0.713769	  0.031117	  0.717085
 -0.733884	  0.027304	  0.711948
 -0.751710	  0.021569	  0.705847
 -0.768647	  0.017079	  0.700316
 -0.791421	  0.010877	  0.693612
 -0.805809	  0.000516	  0.687071
 -0.817033	 -0.012121	  0.680569
 -0.835843	 -0.025165	  0.672202
 -0.854198	 -0.028686	  0.666568
 -0.873786	 -0.030761	  0.660842
 -0.892059	 -0.034501	  0.653723
 -0.909929	 -0.035325	  0.647871
 -0.936005	 -0.035160	  0.640042
 -0.954321	 -0.041167	  0.631275
 -0.962684	 -0.048304	  0.624740
 -0.976903	 -0.056920	  0.610463
 -0.992254	 -0.066199	  0.597190
 -1.007964	 -0.073048	  0.585990
 -1.024524	 -0.077730	  0.575254
 -1.041553	 -0.081407	  0.565512
 -1.058302	 -0.085520	  0.555297
 -1.075424	 -0.090013	  0.545774
 -1.091847	 -0.095190	  0.536930
 -1.095191	 -0.113553	  0.532261
 -1.093804	 -0.133469	  0.531661
 -1.092646	 -0.153463	  0.531626
 -1.092106	 -0.173553	  0.531977
 -1.092408	 -0.193410	  0.533058
 -1.093601	 -0.212997	  0.536455
 -1.093570	 -0.232138	  0.540892
 -1.089577	 -0.253295	  0.548288
 -1.084794	 -0.272525	  0.554449
 -1.086618	 -0.291741	  0.550885
 -1.093950	 -0.315351	  0.541204
 -1.098934	 -0.334325	  0.537172
 -1.099237	 -0.353701	  0.540725
 -1.105597	 -0.380391	  0.545378
 -1.108625	 -0.401580	  0.544749
 -1.109166	 -0.414906	  0.543930
 -1.110121	 -0.430039	  0.542836
 -1.111678	 -0.455269	  0.545051
 -1.117105	 -0.481751	  0.537175
 -1.125686	 -0.501093	  0.523377
 -1.138364	 -0.514349	  0.512787
 -1.156597	 -0.525621	  0.506966
 -1.179137	 -0.535531	  0.500172
 -1.202835	 -0.543068	  0.493611
 -1.217145	 -0.547568	  0.491003
 -1.242020	 -0.546824	  0.483581
 -1.258657	 -0.551852	  0.477383
 -1.275999	 -0.548069	  0.470204
 -1.287209	 -0.550101	  0.468644
 -1.306798	 -0.548957	  0.459757
 -1.328274	 -0.544157	  0.452035
 -1.346260	 -0.546724	  0.449465
 -1.361596	 -0.545491	  0.444674
 -1.384024	 -0.541299	  0.441452
 -1.406842	 -0.537134	  0.439652
 -1.420980	 -0.530350	  0.438947
 -1.443457	 -0.526157	  0.439550
 -1.463968	 -0.521306	  0.440484
 -1.487619	 -0.517687	  0.440815
 -1.504658	 -0.515679	  0.438566
 -1.522335	 -0.509810	  0.431527
 -1.539334	 -0.494815	  0.417802
 -1.554662	 -0.482092	  0.412181
 -1.567976	 -0.475595	  0.416235
 -1.584979	 -0.460017	  0.418852
 -1.600352	 -0.445526	  0.416862
 -1.614032	 -0.431413	  0.413137
 -1.627285	 -0.417441	  0.409231
 -1.640380	 -0.407462	  0.403817
 -1.655987	 -0.410389	  0.395048
 -1.664308	 -0.414152	  0.390395
 -1.677606	 -0.420573	  0.383046
 -1.694897	 -0.428937	  0.376638
 -1.713488	 -0.436794	  0.370622
 -1.730799	 -0.446206	  0.363243
 -1.748400	 -0.454508	  0.357242
 -1.767721	 -0.460309	  0.353479
 -1.787815	 -0.466444	  0.349786
 -1.809952	 -0.471595	  0.345890
 -1.831319	 -0.475625	  0.342505
 -1.851243	 -0.477406	  0.340160
 -1.870956	 -0.479090	  0.337905
 -1.890779	 -0.480816	  0.336019
 -1.910832	 -0.482185	  0.334839
 -1.931240	 -0.482877	  0.334329
 -1.953053	 -0.480335	  0.336755
 -1.975868	 -0.475680	  0.339487
 -1.996914	 -0.467903	  0.344405
 -2.014190	 -0.459748	  0.348394
 -2.031796	 -0.449303	  0.350857
 -2.049985	 -0.439909	  0.354133
 -2.067526	 -0.433758	  0.360376
 -2.084945	 -0.427731	  0.368022
 -2.100293	 -0.420531	  0.373444
 -2.116454	 -0.407601	  0.378224
 -2.137581	 -0.393050	  0.382136
 -2.155719	 -0.385637	  0.387324
 -2.171474	 -0.383913	  0.393239
 -2.191703	 -0.376005	  0.402509
 -2.207648	 -0.366295	  0.412557
 -2.221457	 -0.357585	  0.423269
 -2.235801	 -0.347029	  0.431691
 -2.248598	 -0.338874	  0.434875
 -2.257716	 -0.343154	  0.423461
 -2.253188	 -0.345372	  0.423906
 -2.261847	 -0.350154	  0.423784
 -2.274774	 -0.356589	  0.417179
 -2.291722	 -0.366514	  0.407545
 -2.310377	 -0.374106	  0.399280
 -2.329173	 -0.381199	  0.389902
 -2.345735	 -0.388015	  0.380557
 -2.364574	 -0.393884	  0.374040
 -2.380371	 -0.399622	  0.366813
 -2.399749	 -0.405493	  0.360653
 -2.414765	 -0.410856	  0.355073
 -2.432017	 -0.417216	  0.347378
 -2.449550	 -0.425662	  0.340657
 -2.465038	 -0.430822	  0.334018
 -2.483395	 -0.438373	  0.327616
 -2.499985	 -0.443985	  0.321134
 -2.516828	 -0.453229	  0.312379
 -2.541375	 -0.458183	  0.305883
 -2.567553	 -0.454884	  0.304443
 -2.594774	 -0.432847	  0.315157
 -2.611284	 -0.441198	  0.307562
