 -1.953184	  0.146123	  2.311843
 -1.933846	  0.144676	  2.288954
 -1.895233	  0.144791	  2.258112
 -1.855225	  0.149129	  2.226539
 -1.820808	  0.139706	  2.193458
 -1.776632	  0.141966	  2.165386
 -1.739441	  0.138583	  2.130798
 -1.701249	  0.134953	  2.099034
 -1.662785	  0.133758	  2.066833
 -1.621866	  0.130475	  2.034835
 -1.583885	  0.126650	  2.005467
 -1.545730	  0.124180	  1.975301
 -1.509695	  0.121624	  1.945967
 -1.472227	  0.120400	  1.914626
 -1.436387	  0.121260	  1.881935
 -1.399617	  0.119924	  1.846435
 -1.361021	  0.116987	  1.814419
 -1.322254	  0.114498	  1.781317
 -1.285329	  0.108680	  1.748771
 -1.246710	  0.104329	  1.720546
 -1.205836	  0.103175	  1.689254
 -1.165634	  0.098621	  1.659641
 -1.125953	  0.092131	  1.627031
 -1.088564	  0.086176	  1.594227
 -1.051385	  0.080629	  1.562774
 -1.013964	  0.076986	  1.531128
 -0.978167	  0.076699	  1.498794
 -0.944090	  0.077401	  1.466746
 -0.908443	  0.078603	  1.432492
 -0.871517	  0.079871	  1.396173
 -0.831746	  0.080150	  1.361245
 -0.793060	  0.079787	  1.331160
 -0.754783	  0.080454	  1.303001
 -0.713924	  0.081749	  1.273141
 -0.673415	  0.081756	  1.239740
 -0.635641	  0.079837	  1.206815
 -0.602598	  0.077717	  1.175953
 -0.564628	  0.073658	  1.140278
 -0.529879	  0.069934	  1.105865
 -0.492387	  0.065338	  1.070716
 -0.454424	  0.061546	  1.038326
 -0.414023	  0.056552	  1.006013
 -0.376647	  0.051515	  0.977793
 -0.337794	  0.046336	  0.946749
 -0.302591	  0.041293	  0.916019
 -0.261226	  0.034141	  0.881518
 -0.221925	  0.033239	  0.854486
 -0.185645	  0.033278	  0.822009
 -0.147028	  0.032796	  0.790682
 -0.105556	  0.031808	  0.755012
 -0.070865	  0.029832	  0.726207
 -0.029485	  0.028278	  0.692763
  0.006226	  0.025977	  0.662022
  0.045626	  0.019995	  0.624450
  0.081577	  0.016887	  0.592382
  0.119423	  0.014431	  0.559842
  0.156672	  0.011918	  0.527732
  0.192297	  0.009100	  0.497146
  0.230779	  0.005519	  0.465125
  0.268365	  0.002178	  0.435156
  0.309873	 -0.000514	  0.402150
  0.344307	 -0.001492	  0.373559
  0.385387	 -0.001940	  0.338039
  0.419589	 -0.000834	  0.309486
  0.459042	 -0.000115	  0.274871
  0.496770	 -0.000220	  0.241202
  0.532561	 -0.000691	  0.209751
  0.569493	 -0.000820	  0.179339
  0.608619	 -0.002113	  0.146876
  0.648550	 -0.006368	  0.114395
  0.688216	 -0.010247	  0.085723
  0.728281	 -0.012328	  0.055781
  0.769762	 -0.015373	  0.024761
  0.807532	 -0.018284	 -0.006375
  0.844453	 -0.023976	 -0.036556
  0.882280	 -0.026507	 -0.066690
  0.918966	 -0.025001	 -0.098598
  0.957038	 -0.024050	 -0.132968
  0.993694	 -0.026501	 -0.163120
  1.034491	 -0.030140	 -0.195760
  1.077032	 -0.035738	 -0.232363
  1.113494	 -0.039876	 -0.263962
  1.148331	 -0.041845	 -0.292135
  1.188419	 -0.047094	 -0.326146
  1.213410	 -0.062781	 -0.362246
  1.186562	 -0.140937	 -0.440993
  1.147022	 -0.326830	 -0.561708
  1.097858	 -0.330025	 -0.699710
  1.156864	 -0.306739	 -0.692754
  1.191568	 -0.439714	 -0.780900
  1.194656	 -0.504426	 -0.817340
  1.268886	 -0.576699	 -0.808898
  1.326105	 -0.423655	 -0.919436
  1.339650	 -0.383102	 -0.928073
  1.405252	 -0.371314	 -0.920916
  1.495695	 -0.327604	 -0.892280
  1.545864	 -0.289050	 -0.853371
  1.697269	 -0.130152	 -0.769528
  1.760843	 -0.090241	 -0.793098
  1.804558	 -0.083903	 -0.825955
  1.839932	 -0.083736	 -0.858649
  1.875064	 -0.086347	 -0.893474
  1.908792	 -0.090487	 -0.927026
  1.944022	 -0.092871	 -0.960486
  1.983898	 -0.097069	 -0.997780
  2.023460	 -0.103281	 -1.033521
  2.055874	 -0.108651	 -1.063457
  2.093589	 -0.113358	 -1.100355
  2.128526	 -0.117466	 -1.130898
  2.167990	 -0.117684	 -1.160911
  2.204120	 -0.122468	 -1.195263
  2.248035	 -0.126633	 -1.225259
  2.281615	 -0.126374	 -1.252758
  2.321115	 -0.128814	 -1.285626
  2.364784	 -0.130126	 -1.320433
  2.404361	 -0.129515	 -1.351981
  2.442138	 -0.129910	 -1.383140
  2.480569	 -0.131515	 -1.416763
  2.513762	 -0.134856	 -1.447415
  2.555283	 -0.133846	 -1.479844
  2.585510	 -0.146754	 -1.514464
  2.611365	 -0.148222	 -1.529609
