 -0.799279	  0.555696	  2.280428
 -0.796671	  0.555758	  2.281931
 -0.813995	  0.555346	  2.271946
 -0.831319	  0.554935	  2.261961
 -0.848777	  0.553958	  2.252251
 -0.866327	  0.552531	  2.242766
 -0.883878	  0.551105	  2.233282
 -0.901426	  0.548693	  2.223996
 -0.918972	  0.546205	  2.214726
 -0.936475	  0.543398	  2.205464
 -0.953884	  0.539997	  2.196224
 -0.971292	  0.536597	  2.186985
 -0.988675	  0.532847	  2.177832
 -1.006048	  0.528977	  2.168710
 -1.023694	  0.526063	  2.159759
 -1.041737	  0.524984	  2.151198
 -1.059780	  0.523906	  2.142637
 -1.076183	  0.518603	  2.132497
 -1.092032	  0.512295	  2.122056
 -1.108775	  0.507085	  2.112436
 -1.127504	  0.505342	  2.105642
 -1.146234	  0.503598	  2.098849
 -1.163906	  0.498679	  2.090881
 -1.181012	  0.492556	  2.082520
 -1.197769	  0.487869	  2.072658
 -1.213684	  0.485368	  2.060807
 -1.229632	  0.482851	  2.049004
 -1.247543	  0.479187	  2.040893
 -1.265454	  0.475524	  2.032782
 -1.282777	  0.472971	  2.023118
 -1.299301	  0.471606	  2.011934
 -1.315897	  0.470140	  2.000869
 -1.333509	  0.466995	  1.991929
 -1.351121	  0.463849	  1.982989
 -1.368868	  0.460706	  1.974320
 -1.386912	  0.457571	  1.966283
 -1.404956	  0.454435	  1.958246
 -1.423097	  0.452137	  1.950145
 -1.441252	  0.449989	  1.942035
 -1.459208	  0.447921	  1.933473
 -1.476938	  0.445940	  1.924433
 -1.494668	  0.443959	  1.915393
 -1.512398	  0.441977	  1.906353
 -1.530128	  0.439996	  1.897313
 -1.549419	  0.437735	  1.887176
 -1.566902	  0.435586	  1.877704
