 -0.255317	 -1.301202	 -2.059479
 -0.256292	 -1.308676	 -2.091014
 -0.256117	 -1.302784	 -2.071944
 -0.255898	 -1.296554	 -2.053097
 -0.259732	 -1.291250	 -2.034250
 -0.264489	 -1.284784	 -2.014418
 -0.264728	 -1.276728	 -1.995353
 -0.261804	 -1.267218	 -1.980046
 -0.263223	 -1.253002	 -1.967002
 -0.263402	 -1.234776	 -1.957522
 -0.249701	 -1.220674	 -1.950150
 -0.214929	 -1.206450	 -1.940171
 -0.205667	 -1.203458	 -1.936481
 -0.192263	 -1.197556	 -1.930588
 -0.172910	 -1.187517	 -1.921720
 -0.157997	 -1.180494	 -1.914472
 -0.140256	 -1.174563	 -1.903770
 -0.122951	 -1.169484	 -1.892771
 -0.109680	 -1.165632	 -1.883044
 -0.090574	 -1.161591	 -1.871090
 -0.072636	 -1.159207	 -1.861316
 -0.061309	 -1.157763	 -1.853469
 -0.036186	 -1.154665	 -1.834001
 -0.020042	 -1.153348	 -1.826731
 -0.006695	 -1.152572	 -1.822206
  0.008290	 -1.150321	 -1.815584
  0.026720	 -1.147878	 -1.799552
  0.041961	 -1.147173	 -1.785824
  0.056638	 -1.146053	 -1.772235
  0.071477	 -1.145602	 -1.758840
  0.086039	 -1.144217	 -1.745305
  0.099676	 -1.142825	 -1.730803
  0.112769	 -1.142592	 -1.715684
  0.125445	 -1.140787	 -1.700288
  0.138624	 -1.140725	 -1.685229
  0.151706	 -1.138431	 -1.670234
  0.164810	 -1.137609	 -1.655109
  0.177465	 -1.136082	 -1.639839
  0.189994	 -1.134836	 -1.624443
  0.201297	 -1.133165	 -1.608564
  0.212023	 -1.130248	 -1.592064
  0.222876	 -1.127290	 -1.575509
  0.233626	 -1.124506	 -1.558843
  0.244369	 -1.122690	 -1.542062
  0.255038	 -1.119411	 -1.525480
  0.265727	 -1.116354	 -1.508819
  0.276054	 -1.114241	 -1.491844
  0.284862	 -1.111882	 -1.474084
  0.292250	 -1.109249	 -1.455723
  0.299436	 -1.106269	 -1.437264
  0.306813	 -1.104551	 -1.418724
  0.313770	 -1.101720	 -1.400271
  0.320497	 -1.099302	 -1.381528
  0.326427	 -1.098263	 -1.362444
  0.329828	 -1.094447	 -1.345210
  0.334744	 -1.086215	 -1.326928
  0.340370	 -1.089722	 -1.298100
  0.337931	 -1.098824	 -1.280587
  0.335633	 -1.107327	 -1.267996
  0.330919	 -1.122911	 -1.242886
  0.330486	 -1.130460	 -1.222126
  0.331767	 -1.132704	 -1.201260
  0.333315	 -1.133240	 -1.186428
  0.333836	 -1.132407	 -1.166252
  0.334544	 -1.129986	 -1.148980
  0.331068	 -1.124158	 -1.124897
  0.329594	 -1.125460	 -1.096520
  0.326461	 -1.129371	 -1.083306
  0.324599	 -1.137990	 -1.069159
  0.317330	 -1.148126	 -1.049932
  0.310724	 -1.156584	 -1.033425
  0.308134	 -1.165167	 -1.017931
  0.308314	 -1.176972	 -0.990913
  0.308057	 -1.186338	 -0.973511
  0.304105	 -1.192615	 -0.960927
  0.288369	 -1.197136	 -0.943858
  0.271988	 -1.193199	 -0.925520
  0.258812	 -1.186212	 -0.908921
  0.247510	 -1.182761	 -0.892495
  0.240910	 -1.183914	 -0.871992
  0.236384	 -1.186072	 -0.856968
  0.225459	 -1.186359	 -0.838034
  0.213491	 -1.190761	 -0.818495
  0.201104	 -1.203460	 -0.804592
  0.187291	 -1.218312	 -0.790042
  0.176009	 -1.225979	 -0.775557
  0.169654	 -1.228288	 -0.765239
  0.157410	 -1.225491	 -0.746378
  0.144906	 -1.219202	 -0.727900
  0.133021	 -1.209769	 -0.712738
  0.122653	 -1.200288	 -0.702631
  0.111289	 -1.193941	 -0.689630
  0.099945	 -1.196140	 -0.672314
  0.088881	 -1.191709	 -0.656009
  0.078167	 -1.186712	 -0.640024
  0.068184	 -1.178322	 -0.624929
  0.058048	 -1.170485	 -0.609887
  0.048625	 -1.161478	 -0.595490
  0.039490	 -1.150809	 -0.581603
  0.030244	 -1.140669	 -0.567046
  0.021343	 -1.129703	 -0.553214
  0.012811	 -1.118284	 -0.539672
  0.004455	 -1.106596	 -0.525897
 -0.003792	 -1.094541	 -0.512320
 -0.011789	 -1.082796	 -0.498425
 -0.019008	 -1.070283	 -0.484741
 -0.026033	 -1.058117	 -0.470401
 -0.031459	 -1.048868	 -0.456461
 -0.032736	 -1.042293	 -0.437173
 -0.036579	 -1.030940	 -0.411801
 -0.041891	 -1.023337	 -0.400063
 -0.050831	 -1.013146	 -0.386561
 -0.061224	 -0.999938	 -0.362032
 -0.063442	 -0.995989	 -0.350299
 -0.063630	 -0.992685	 -0.330161
 -0.061995	 -0.990015	 -0.308433
 -0.062411	 -0.987723	 -0.290240
 -0.066522	 -0.983385	 -0.270807
 -0.072688	 -0.973481	 -0.254258
 -0.077125	 -0.962691	 -0.239624
 -0.078764	 -0.945822	 -0.213007
 -0.076090	 -0.940115	 -0.196808
 -0.074840	 -0.937797	 -0.172593
 -0.073528	 -0.937953	 -0.151822
 -0.074130	 -0.941436	 -0.125976
 -0.076116	 -0.945385	 -0.109581
 -0.077509	 -0.947537	 -0.099458
 -0.076736	 -0.949776	 -0.076769
 -0.079004	 -0.949829	 -0.045445
 -0.080204	 -0.951319	 -0.031630
 -0.081739	 -0.952245	 -0.004697
 -0.086992	 -0.953780	  0.013086
 -0.093817	 -0.956385	  0.031007
 -0.098982	 -0.962690	  0.048267
 -0.101718	 -0.967325	  0.069211
 -0.103908	 -0.976427	  0.083416
 -0.106737	 -0.988795	  0.102141
 -0.111792	 -0.999996	  0.115921
 -0.120605	 -1.015330	  0.136417
 -0.126916	 -1.020578	  0.155940
 -0.131992	 -1.021338	  0.175704
 -0.136127	 -1.021302	  0.194076
 -0.139415	 -1.020830	  0.215210
 -0.142448	 -1.020560	  0.235154
 -0.145513	 -1.019993	  0.255395
 -0.150080	 -1.018760	  0.275955
 -0.154878	 -1.017488	  0.296949
 -0.156696	 -1.017145	  0.314691
 -0.156495	 -1.018124	  0.332203
 -0.157971	 -1.020674	  0.355674
 -0.160920	 -1.025988	  0.377840
 -0.162679	 -1.031245	  0.390521
 -0.164391	 -1.043670	  0.409498
 -0.164393	 -1.052126	  0.433856
 -0.163187	 -1.053614	  0.455765
 -0.161510	 -1.051627	  0.470889
 -0.159341	 -1.048965	  0.488203
 -0.153209	 -1.045701	  0.513684
 -0.150423	 -1.041417	  0.534492
 -0.151537	 -1.038629	  0.553299
 -0.155741	 -1.038189	  0.570820
 -0.158080	 -1.040090	  0.590630
 -0.158665	 -1.038028	  0.612542
 -0.161100	 -1.033715	  0.631569
 -0.161464	 -1.031226	  0.651289
 -0.158955	 -1.029137	  0.671063
 -0.157658	 -1.028218	  0.691001
 -0.157352	 -1.027163	  0.710907
 -0.156667	 -1.025858	  0.730949
 -0.158771	 -1.024214	  0.749201
 -0.163883	 -1.027925	  0.767617
 -0.161091	 -1.035247	  0.789500
 -0.154297	 -1.031804	  0.821303
 -0.153022	 -1.028722	  0.833735
 -0.152063	 -1.026048	  0.845771
 -0.150393	 -1.025161	  0.872172
 -0.148808	 -1.022128	  0.892841
 -0.148324	 -1.019263	  0.908211
 -0.146721	 -1.016243	  0.930489
 -0.143977	 -1.012322	  0.953465
 -0.142784	 -1.010214	  0.967694
 -0.141803	 -1.007088	  0.989974
 -0.139556	 -1.001436	  1.012294
 -0.137682	 -0.998608	  1.028095
 -0.135084	 -0.997037	  1.047909
 -0.131323	 -0.994736	  1.071349
 -0.130353	 -0.992678	  1.086236
 -0.132165	 -0.987303	  1.104077
 -0.131665	 -0.974519	  1.127530
 -0.127457	 -0.957333	  1.146664
 -0.125942	 -0.941533	  1.162531
 -0.127994	 -0.933444	  1.177008
 -0.128664	 -0.929257	  1.197830
 -0.120704	 -0.926036	  1.227595
 -0.114957	 -0.935770	  1.245967
 -0.107995	 -0.946427	  1.259651
 -0.101105	 -0.951678	  1.278216
 -0.091752	 -0.942516	  1.299368
 -0.085161	 -0.927621	  1.322391
 -0.085467	 -0.921644	  1.347364
 -0.085633	 -0.923253	  1.363369
 -0.086770	 -0.932638	  1.384194
 -0.090797	 -0.942547	  1.407438
 -0.098105	 -0.956408	  1.430986
 -0.101919	 -0.964742	  1.441323
 -0.107589	 -0.977838	  1.458026
 -0.107904	 -0.988893	  1.476222
 -0.105478	 -0.994658	  1.494991
 -0.103459	 -0.999980	  1.514368
 -0.104073	 -1.005964	  1.533963
 -0.106330	 -1.009368	  1.560326
 -0.106529	 -1.009788	  1.576164
 -0.106491	 -1.009963	  1.591633
 -0.096621	 -1.017637	  1.618685
 -0.091039	 -1.024242	  1.638894
 -0.087127	 -1.028263	  1.654193
 -0.088469	 -1.034927	  1.675339
 -0.096066	 -1.047804	  1.698666
 -0.098611	 -1.053099	  1.708512
 -0.101476	 -1.063633	  1.725295
 -0.104840	 -1.075487	  1.746468
 -0.109894	 -1.083078	  1.762923
 -0.117110	 -1.087611	  1.779238
 -0.121321	 -1.094976	  1.799166
 -0.123542	 -1.103957	  1.816834
 -0.124387	 -1.111536	  1.835600
 -0.127027	 -1.120757	  1.853520
 -0.130657	 -1.128938	  1.870495
 -0.135408	 -1.135923	  1.888332
 -0.140128	 -1.142222	  1.906604
 -0.143329	 -1.148136	  1.924957
 -0.145690	 -1.154383	  1.943158
 -0.147463	 -1.159473	  1.962414
 -0.149591	 -1.164358	  1.981416
 -0.150871	 -1.166836	  2.000348
 -0.151868	 -1.168074	  2.019541
 -0.152369	 -1.168266	  2.039468
 -0.152846	 -1.168163	  2.059389
 -0.153180	 -1.168250	  2.078802
 -0.152775	 -1.165453	  2.097351
 -0.152116	 -1.160925	  2.116239
 -0.151157	 -1.156239	  2.135639
 -0.149930	 -1.150496	  2.154591
 -0.148630	 -1.145068	  2.173187
 -0.146834	 -1.137308	  2.190310
 -0.144816	 -1.128364	  2.207850
 -0.142529	 -1.119269	  2.225474
 -0.140080	 -1.110112	  2.242753
 -0.137450	 -1.099282	  2.258638
 -0.135213	 -1.088615	  2.275050
 -0.132067	 -1.076011	  2.290230
 -0.129693	 -1.064603	  2.306316
 -0.127259	 -1.051865	  2.321054
 -0.125237	 -1.038657	  2.335816
 -0.123117	 -1.025241	  2.350514
 -0.121664	 -1.011916	  2.365251
 -0.120809	 -0.997878	  2.379304
 -0.120110	 -0.983556	  2.393236
 -0.119934	 -0.969121	  2.407007
 -0.120698	 -0.954910	  2.421030
 -0.121714	 -0.939926	  2.434116
 -0.122946	 -0.925191	  2.447642
 -0.124580	 -0.910054	  2.460669
 -0.127038	 -0.895562	  2.474214
 -0.129146	 -0.879979	  2.486557
 -0.131526	 -0.864990	  2.499718
 -0.134120	 -0.850447	  2.513220
 -0.135772	 -0.832905	  2.525593
 -0.142315	 -0.821021	  2.547938
 -0.144461	 -0.805912	  2.560867
