  1.743076	 -1.692483	 -0.484396
  1.758778	 -1.711147	 -0.471109
  1.746676	 -1.701298	 -0.483861
  1.734442	 -1.689574	 -0.496075
  1.724473	 -1.675989	 -0.507388
  1.716456	 -1.662040	 -0.518332
  1.706078	 -1.648547	 -0.530590
  1.693845	 -1.634280	 -0.540210
  1.682876	 -1.618539	 -0.544948
  1.672675	 -1.602663	 -0.551043
  1.662850	 -1.587005	 -0.558905
  1.653080	 -1.572413	 -0.568728
  1.643888	 -1.558115	 -0.579278
  1.635170	 -1.543915	 -0.590364
  1.626410	 -1.529477	 -0.601224
  1.617456	 -1.514513	 -0.611188
  1.608573	 -1.499374	 -0.620849
  1.599483	 -1.484063	 -0.630242
  1.590143	 -1.468814	 -0.639492
  1.579998	 -1.453793	 -0.647954
  1.569548	 -1.439657	 -0.656643
  1.559323	 -1.425715	 -0.666629
  1.548109	 -1.412090	 -0.676243
  1.536003	 -1.399395	 -0.685034
  1.523987	 -1.386616	 -0.694655
  1.512777	 -1.374279	 -0.705745
  1.502309	 -1.362418	 -0.718045
  1.491525	 -1.349812	 -0.729234
  1.480882	 -1.336419	 -0.738311
  1.468994	 -1.321198	 -0.740863
  1.458892	 -1.300706	 -0.746422
  1.448876	 -1.283994	 -0.759176
  1.441303	 -1.270915	 -0.770263
  1.436592	 -1.259738	 -0.780400
  1.429656	 -1.239370	 -0.797249
  1.424047	 -1.228134	 -0.808960
  1.418395	 -1.219797	 -0.821304
  1.406777	 -1.205109	 -0.842078
  1.399571	 -1.190393	 -0.852922
  1.395693	 -1.178268	 -0.858918
  1.387258	 -1.159219	 -0.870223
  1.379350	 -1.142239	 -0.880698
  1.374545	 -1.126462	 -0.888247
  1.369179	 -1.107643	 -0.896788
  1.363072	 -1.090519	 -0.905558
  1.357570	 -1.072791	 -0.913745
  1.352331	 -1.054830	 -0.922685
  1.346891	 -1.040130	 -0.930588
  1.340359	 -1.020684	 -0.937027
  1.333239	 -1.002074	 -0.943926
  1.327223	 -0.987440	 -0.951171
  1.321197	 -0.968771	 -0.958636
  1.312848	 -0.948312	 -0.969138
  1.305015	 -0.935957	 -0.979731
  1.297183	 -0.923627	 -0.991154
  1.286811	 -0.902179	 -1.009844
  1.280464	 -0.890690	 -1.021579
  1.275538	 -0.880980	 -1.031569
  1.262791	 -0.870177	 -1.038877
  1.247999	 -0.854412	 -1.048701
  1.237082	 -0.839480	 -1.058174
  1.225838	 -0.824234	 -1.065309
  1.214304	 -0.809197	 -1.071144
  1.202461	 -0.794282	 -1.077734
  1.190539	 -0.779586	 -1.084533
  1.177829	 -0.765639	 -1.091143
  1.164158	 -0.753000	 -1.098450
  1.150585	 -0.740646	 -1.106447
  1.137044	 -0.728375	 -1.114525
  1.123178	 -0.716979	 -1.122839
  1.106566	 -0.713255	 -1.132854
  1.089487	 -0.712795	 -1.143168
  1.072373	 -0.712645	 -1.153510
  1.055356	 -0.712493	 -1.163997
  1.039499	 -0.712307	 -1.176088
  1.026301	 -0.712063	 -1.191049
  1.013702	 -0.711577	 -1.206517
  1.003867	 -0.709210	 -1.223689
  0.996547	 -0.705337	 -1.241864
  0.989578	 -0.701131	 -1.260121
  0.983384	 -0.695750	 -1.278349
  0.977447	 -0.690006	 -1.296554
  0.972218	 -0.683411	 -1.314682
  0.967378	 -0.676292	 -1.332735
  0.962842	 -0.669236	 -1.350888
  0.959548	 -0.662286	 -1.369345
  0.956772	 -0.655310	 -1.387882
  0.954003	 -0.648294	 -1.406406
  0.951310	 -0.641394	 -1.424983
  0.949374	 -0.635290	 -1.443907
  0.947189	 -0.628851	 -1.462742
  0.944583	 -0.622099	 -1.481520
  0.942542	 -0.616192	 -1.500791
  0.941972	 -0.611283	 -1.520506
  0.944120	 -0.607249	 -1.540077
  0.946747	 -0.602657	 -1.559379
  0.948901	 -0.597940	 -1.578753
  0.950059	 -0.593018	 -1.598087
  0.951620	 -0.587033	 -1.617053
  0.954149	 -0.580098	 -1.635685
  0.957511	 -0.574417	 -1.654233
  0.960723	 -0.575562	 -1.674187
  0.956460	 -0.578330	 -1.696680
  0.954561	 -0.573446	 -1.721581
  0.956811	 -0.567436	 -1.740829
  0.962630	 -0.558648	 -1.753684
  0.973904	 -0.550165	 -1.765929
  0.986923	 -0.541826	 -1.784298
  0.993522	 -0.529721	 -1.804885
  0.993354	 -0.523827	 -1.825355
  0.990821	 -0.520593	 -1.848255
  0.989287	 -0.521078	 -1.864998
  0.995487	 -0.503038	 -1.869326
  1.001252	 -0.482458	 -1.868121
  1.001516	 -0.467941	 -1.868319
  0.999995	 -0.447718	 -1.869157
  0.997879	 -0.429415	 -1.862029
  0.992605	 -0.412448	 -1.846479
  0.987553	 -0.407912	 -1.830678
  0.981908	 -0.406677	 -1.813394
  0.972192	 -0.401559	 -1.792167
  0.965728	 -0.392169	 -1.775020
  0.961647	 -0.377384	 -1.759318
  0.958509	 -0.364661	 -1.743138
  0.954330	 -0.357791	 -1.728830
  0.949663	 -0.359031	 -1.710246
  0.940561	 -0.366065	 -1.682846
  0.929349	 -0.357854	 -1.660548
  0.916059	 -0.347347	 -1.648917
  0.902552	 -0.331578	 -1.638588
  0.891286	 -0.314128	 -1.630113
  0.880594	 -0.300658	 -1.618414
  0.872413	 -0.289900	 -1.605983
  0.862626	 -0.275206	 -1.595418
  0.852541	 -0.259025	 -1.585375
  0.841495	 -0.245431	 -1.575860
  0.828981	 -0.235677	 -1.563867
  0.817636	 -0.229883	 -1.550284
  0.802372	 -0.226231	 -1.535327
  0.785367	 -0.219894	 -1.523746
  0.768265	 -0.210596	 -1.515424
  0.753898	 -0.198898	 -1.507048
  0.744928	 -0.180771	 -1.496788
  0.740508	 -0.156028	 -1.489013
  0.730420	 -0.137181	 -1.482314
  0.712212	 -0.126282	 -1.480596
  0.693807	 -0.121477	 -1.481068
  0.674637	 -0.117945	 -1.474575
  0.661279	 -0.106125	 -1.468565
  0.648050	 -0.079802	 -1.474421
  0.630471	 -0.060361	 -1.486338
  0.617823	 -0.050997	 -1.491794
  0.603410	 -0.038894	 -1.495283
  0.593817	 -0.030418	 -1.496712
  0.578749	 -0.011179	 -1.497013
  0.567106	  0.013864	 -1.502220
  0.561604	  0.024062	 -1.506481
  0.549641	  0.037787	 -1.519065
  0.536388	  0.050827	 -1.536444
  0.527671	  0.060483	 -1.547231
  0.517773	  0.070401	 -1.556286
  0.509417	  0.087016	 -1.568885
  0.503722	  0.103454	 -1.580909
  0.496815	  0.118403	 -1.592304
  0.491518	  0.134872	 -1.601848
  0.485208	  0.155796	 -1.609439
  0.478398	  0.176920	 -1.620414
  0.467877	  0.189797	 -1.645798
  0.463274	  0.187289	 -1.669409
  0.466235	  0.190329	 -1.691750
  0.477102	  0.198419	 -1.708163
  0.486165	  0.208777	 -1.724232
  0.495751	  0.219704	 -1.740002
  0.503925	  0.230027	 -1.755614
  0.509004	  0.239647	 -1.772608
  0.512284	  0.250068	 -1.789480
  0.515234	  0.261234	 -1.805918
  0.517916	  0.273009	 -1.821867
  0.518775	  0.285814	 -1.837239
  0.518946	  0.298498	 -1.852623
  0.519342	  0.311203	 -1.868110
  0.520825	  0.323546	 -1.883853
  0.522239	  0.336066	 -1.899399
  0.523650	  0.348592	 -1.914925
  0.525263	  0.361042	 -1.930454
  0.529225	  0.372597	 -1.945990
  0.540461	  0.380334	 -1.960309
  0.552555	  0.387596	 -1.974456
  0.564678	  0.394853	 -1.988610
  0.576803	  0.402110	 -2.002765
  0.588927	  0.409367	 -2.016919
  0.601051	  0.416623	 -2.031073
  0.613175	  0.423880	 -2.045227
  0.625300	  0.431137	 -2.059381
  0.637424	  0.438394	 -2.073536
  0.649549	  0.445644	 -2.087690
  0.661749	  0.452628	 -2.101884
  0.674628	  0.457078	 -2.116419
  0.688192	  0.457265	 -2.131036
  0.701824	  0.456951	 -2.145651
  0.715310	  0.456583	 -2.160201
  0.726441	  0.454684	 -2.175158
  0.734536	  0.444345	 -2.190982
  0.754737	  0.431135	 -2.206079
  0.773469	  0.428333	 -2.219301
  0.784816	  0.430343	 -2.233700
  0.789318	  0.431502	 -2.251118
  0.794653	  0.429258	 -2.272490
  0.807636	  0.430765	 -2.293941
  0.818281	  0.439065	 -2.308852
  0.823752	  0.449810	 -2.321023
  0.831860	  0.457068	 -2.331308
  0.835273	  0.459061	 -2.350913
