  0.522359	  1.575467	  1.865929
  0.523605	  1.575649	  1.869001
  0.521506	  1.572422	  1.848616
  0.512042	  1.571688	  1.830569
  0.497862	  1.572437	  1.815456
  0.483653	  1.574674	  1.797550
  0.479306	  1.575241	  1.778656
  0.483503	  1.572425	  1.756616
  0.485799	  1.572522	  1.733440
  0.477532	  1.576502	  1.714008
  0.466692	  1.575919	  1.701158
  0.457126	  1.572561	  1.683518
  0.449084	  1.571893	  1.658558
  0.444516	  1.575874	  1.639874
  0.438178	  1.580476	  1.625466
  0.430892	  1.579590	  1.604243
  0.424415	  1.579417	  1.584108
  0.416586	  1.584875	  1.569424
  0.406278	  1.587627	  1.551646
  0.397115	  1.590489	  1.532035
  0.388728	  1.596104	  1.515718
  0.379729	  1.600286	  1.497760
  0.372522	  1.597426	  1.476727
  0.365811	  1.598164	  1.458356
  0.356811	  1.605846	  1.444140
  0.346018	  1.613403	  1.429911
  0.335809	  1.614911	  1.415093
  0.322245	  1.615422	  1.386654
  0.316627	  1.615276	  1.369886
  0.311754	  1.627817	  1.353601
  0.303257	  1.643074	  1.338377
  0.295836	  1.651814	  1.328769
  0.284322	  1.662310	  1.311673
  0.274949	  1.665248	  1.292732
  0.267717	  1.666433	  1.269675
  0.267178	  1.667604	  1.249048
  0.268091	  1.667323	  1.227394
  0.265401	  1.666535	  1.207839
  0.257926	  1.669066	  1.189120
  0.249769	  1.674584	  1.173874
  0.242872	  1.680321	  1.154872
  0.235050	  1.681889	  1.137450
  0.220052	  1.682193	  1.120042
  0.205428	  1.687461	  1.101495
  0.202221	  1.692332	  1.084716
  0.201368	  1.691165	  1.065113
  0.190210	  1.685302	  1.040709
  0.178693	  1.685541	  1.024497
  0.169399	  1.687707	  1.013172
  0.156616	  1.690688	  0.999181
  0.140636	  1.694650	  0.976919
  0.136847	  1.696470	  0.960592
  0.134196	  1.696388	  0.941213
  0.126143	  1.699918	  0.920097
  0.117908	  1.705694	  0.905358
  0.112303	  1.711962	  0.890965
  0.102234	  1.715405	  0.866352
  0.092913	  1.718432	  0.849887
  0.084674	  1.727718	  0.835759
  0.083370	  1.744119	  0.816468
  0.085279	  1.752747	  0.799696
  0.086298	  1.758183	  0.780033
  0.092018	  1.764301	  0.763237
  0.100293	  1.770307	  0.743065
  0.109935	  1.778215	  0.728490
  0.112879	  1.786952	  0.711280
  0.121912	  1.795027	  0.697079
  0.135169	  1.798699	  0.681023
  0.144853	  1.803007	  0.659452
  0.152911	  1.810222	  0.642312
  0.156444	  1.817458	  0.628525
  0.165057	  1.829438	  0.613947
  0.176671	  1.843381	  0.596901
  0.187134	  1.849834	  0.584949
  0.198815	  1.857247	  0.574554
  0.212244	  1.870553	  0.568330
  0.232532	  1.900949	  0.560425
  0.235482	  1.912473	  0.560236
  0.236483	  1.919342	  0.555078
  0.237579	  1.928077	  0.551913
  0.229752	  1.951759	  0.555823
  0.214869	  1.965635	  0.563573
  0.193420	  1.972863	  0.576058
  0.177800	  1.963043	  0.590248
  0.158295	  1.950428	  0.601244
  0.143857	  1.944111	  0.606835
  0.124122	  1.945116	  0.613798
  0.105295	  1.946038	  0.626275
  0.090626	  1.944606	  0.635918
  0.071415	  1.940268	  0.644502
  0.054365	  1.939729	  0.650855
  0.035604	  1.940501	  0.654243
  0.007103	  1.943735	  0.657361
 -0.007756	  1.944649	  0.660171
 -0.026152	  1.941541	  0.664393
 -0.048974	  1.938637	  0.666724
 -0.067366	  1.940325	  0.667711
 -0.085749	  1.938653	  0.668864
 -0.109491	  1.932066	  0.670261
 -0.128611	  1.933583	  0.672176
 -0.145034	  1.936346	  0.674347
 -0.168651	  1.933297	  0.675161
 -0.189133	  1.931428	  0.678081
 -0.206939	  1.933815	  0.685567
 -0.227064	  1.937246	  0.688890
 -0.248626	  1.937694	  0.684968
 -0.266392	  1.936607	  0.682901
 -0.283499	  1.933418	  0.682161
 -0.303943	  1.927574	  0.676293
 -0.322714	  1.922331	  0.671551
 -0.341725	  1.916842	  0.668161
 -0.360966	  1.912114	  0.664081
 -0.379281	  1.906572	  0.660313
 -0.397405	  1.898532	  0.655308
 -0.414452	  1.889594	  0.651796
 -0.433541	  1.882722	  0.645802
 -0.450056	  1.880724	  0.640562
 -0.477054	  1.887282	  0.630510
 -0.496556	  1.887342	  0.623130
 -0.511188	  1.879254	  0.617543
 -0.523453	  1.866423	  0.607684
 -0.538157	  1.853758	  0.597221
 -0.556903	  1.844352	  0.593738
 -0.574768	  1.838264	  0.594440
 -0.599642	  1.830209	  0.591043
 -0.616590	  1.824044	  0.582496
 -0.628356	  1.818150	  0.565847
 -0.637575	  1.809266	  0.549270
 -0.648185	  1.795320	  0.537955
 -0.663642	  1.781409	  0.528616
 -0.679402	  1.772405	  0.516240
 -0.692168	  1.767050	  0.504069
 -0.707646	  1.763231	  0.492798
 -0.725163	  1.759839	  0.482629
 -0.738257	  1.755955	  0.467696
 -0.749032	  1.747536	  0.446648
 -0.758926	  1.738237	  0.433317
 -0.771697	  1.727572	  0.429170
 -0.794384	  1.712815	  0.424976
 -0.807836	  1.702809	  0.415294
 -0.813147	  1.692304	  0.397978
 -0.816981	  1.679915	  0.378674
 -0.826739	  1.671776	  0.363410
 -0.839623	  1.661985	  0.350234
 -0.851898	  1.649434	  0.339754
 -0.861968	  1.640147	  0.328763
 -0.872010	  1.636225	  0.310503
 -0.873122	  1.640052	  0.290451
 -0.870082	  1.648540	  0.272929
 -0.863459	  1.661027	  0.256193
 -0.856596	  1.676795	  0.241188
 -0.850174	  1.685753	  0.229982
 -0.838163	  1.694078	  0.213414
 -0.827983	  1.703819	  0.199215
 -0.813792	  1.704619	  0.180243
 -0.803189	  1.704661	  0.165038
 -0.794586	  1.707646	  0.152330
 -0.783449	  1.716200	  0.132423
 -0.774219	  1.719597	  0.115284
 -0.767472	  1.723075	  0.100912
 -0.754062	  1.731090	  0.081514
 -0.738699	  1.737545	  0.070908
 -0.718031	  1.739405	  0.067736
 -0.694809	  1.738856	  0.055874
 -0.682297	  1.734751	  0.037580
 -0.679297	  1.736428	  0.017103
 -0.661052	  1.737805	 -0.000176
 -0.648775	  1.741314	 -0.007598
 -0.628041	  1.748034	 -0.014703
 -0.609811	  1.747621	 -0.026629
 -0.594229	  1.741377	 -0.038837
 -0.577198	  1.734387	 -0.048547
 -0.558393	  1.735409	 -0.055382
 -0.541115	  1.739092	 -0.063893
 -0.523853	  1.740395	 -0.077283
 -0.504551	  1.741441	 -0.090000
 -0.488092	  1.744568	 -0.100071
 -0.476794	  1.754534	 -0.109964
 -0.464538	  1.765834	 -0.128136
 -0.455080	  1.771373	 -0.137417
 -0.440436	  1.783643	 -0.159552
 -0.434888	  1.793842	 -0.173119
 -0.434585	  1.803342	 -0.182463
 -0.417662	  1.827292	 -0.192793
 -0.403469	  1.852877	 -0.195431
 -0.405315	  1.874300	 -0.192385
 -0.419738	  1.894577	 -0.195174
 -0.434152	  1.905943	 -0.203583
 -0.443224	  1.920144	 -0.223487
 -0.447422	  1.933500	 -0.237885
 -0.454832	  1.940931	 -0.254526
 -0.465942	  1.938515	 -0.273495
 -0.469207	  1.949062	 -0.278688
 -0.481529	  1.957781	 -0.283673
 -0.493634	  1.965381	 -0.295110
 -0.508653	  1.959579	 -0.310929
 -0.519628	  1.948904	 -0.321055
 -0.530104	  1.934589	 -0.333187
 -0.537022	  1.922842	 -0.350215
 -0.538470	  1.915723	 -0.368949
 -0.538718	  1.910005	 -0.388530
 -0.542201	  1.899562	 -0.408756
 -0.549471	  1.888296	 -0.423470
 -0.557568	  1.876401	 -0.435811
 -0.563951	  1.862397	 -0.450936
 -0.567134	  1.853115	 -0.464953
 -0.572882	  1.846609	 -0.480684
 -0.579157	  1.837644	 -0.495088
 -0.593024	  1.842115	 -0.515015
 -0.596436	  1.832058	 -0.532164
 -0.605614	  1.832492	 -0.545562
 -0.617879	  1.830163	 -0.560964
 -0.628583	  1.833174	 -0.578818
 -0.633189	  1.834453	 -0.597968
 -0.638483	  1.832470	 -0.612373
 -0.654018	  1.836137	 -0.633094
 -0.672220	  1.841356	 -0.646022
 -0.686681	  1.844733	 -0.661080
 -0.693136	  1.846430	 -0.672283
 -0.700325	  1.848626	 -0.696231
 -0.704620	  1.847675	 -0.716800
 -0.709392	  1.846512	 -0.736498
 -0.716199	  1.847112	 -0.754616
 -0.722213	  1.847542	 -0.774270
 -0.732162	  1.848594	 -0.791871
 -0.739421	  1.848457	 -0.810568
 -0.749484	  1.848396	 -0.827791
 -0.757443	  1.848184	 -0.846420
 -0.768376	  1.847464	 -0.864230
 -0.775566	  1.847496	 -0.883859
 -0.787208	  1.845761	 -0.900014
 -0.795237	  1.845376	 -0.918833
 -0.805070	  1.844692	 -0.936274
 -0.814772	  1.844034	 -0.953105
 -0.822828	  1.843170	 -0.970616
 -0.830825	  1.842131	 -0.988484
 -0.838626	  1.841459	 -1.005731
 -0.847061	  1.840492	 -1.022925
 -0.852369	  1.839933	 -1.041640
 -0.859378	  1.839289	 -1.059999
 -0.864744	  1.838957	 -1.079238
 -0.872855	  1.838046	 -1.097352
 -0.878247	  1.838335	 -1.116809
 -0.886377	  1.838252	 -1.135533
 -0.890342	  1.838058	 -1.155769
 -0.898489	  1.838864	 -1.173936
 -0.905952	  1.840434	 -1.191484
 -0.912254	  1.843760	 -1.208673
 -0.926059	  1.843768	 -1.231870
 -0.932403	  1.842253	 -1.249287
 -0.937348	  1.842243	 -1.264980
 -0.946312	  1.844619	 -1.283993
 -0.954940	  1.844916	 -1.303555
 -0.959068	  1.844455	 -1.322379
 -0.965745	  1.845714	 -1.342830
 -0.979199	  1.847519	 -1.360092
 -0.999060	  1.844317	 -1.370846
 -1.006725	  1.846052	 -1.389237
