  0.784819	  1.148808	 -2.095299
  0.789310	  1.154163	 -2.100872
  0.779263	  1.142186	 -2.088398
  0.769016	  1.130263	 -2.076107
  0.757645	  1.119540	 -2.063925
  0.745129	  1.111289	 -2.050503
  0.734593	  1.100256	 -2.038131
  0.736384	  1.090232	 -2.026589
  0.737128	  1.081301	 -2.014737
  0.747165	  1.083596	 -2.010686
  0.743951	  1.080603	 -2.005816
  0.753265	  1.075960	 -1.989625
  0.765395	  1.074344	 -1.973217
  0.777756	  1.067685	 -1.954854
  0.786142	  1.061401	 -1.938946
  0.792119	  1.056945	 -1.922926
  0.801410	  1.049195	 -1.902570
  0.810222	  1.042236	 -1.888873
  0.823989	  1.034035	 -1.873126
  0.834277	  1.029180	 -1.857184
  0.841621	  1.028022	 -1.840361
  0.854048	  1.024234	 -1.820871
  0.865883	  1.018969	 -1.807668
  0.881476	  1.009376	 -1.796865
  0.894546	  1.003195	 -1.781381
  0.902928	  1.002379	 -1.761379
  0.902398	  1.002677	 -1.744504
  0.904178	  0.999546	 -1.722815
  0.910295	  0.993926	 -1.703691
  0.912987	  0.990376	 -1.684631
  0.915288	  0.985422	 -1.668358
  0.915193	  0.978192	 -1.649308
  0.918844	  0.971488	 -1.628501
  0.922199	  0.968436	 -1.608143
  0.919919	  0.966116	 -1.590537
  0.914009	  0.960875	 -1.571490
  0.911388	  0.954874	 -1.553079
  0.916540	  0.951245	 -1.528824
  0.916794	  0.951800	 -1.510295
  0.909125	  0.953484	 -1.490882
  0.897973	  0.954522	 -1.473242
  0.890236	  0.954308	 -1.453968
  0.886139	  0.951780	 -1.436681
  0.881233	  0.949546	 -1.417642
  0.878931	  0.952499	 -1.398585
  0.875256	  0.956497	 -1.376541
  0.868345	  0.956937	 -1.357160
  0.858911	  0.951731	 -1.340222
  0.848058	  0.944460	 -1.324572
  0.834641	  0.939065	 -1.308789
  0.821945	  0.936563	 -1.292184
  0.814393	  0.933336	 -1.277457
  0.803644	  0.925308	 -1.260240
  0.787765	  0.914874	 -1.247949
  0.769196	  0.905712	 -1.239972
  0.754532	  0.899114	 -1.234027
  0.741706	  0.892894	 -1.225174
  0.725433	  0.881592	 -1.217550
  0.700814	  0.871077	 -1.207772
  0.688295	  0.864808	 -1.202984
  0.676649	  0.859193	 -1.195910
  0.659698	  0.848117	 -1.192910
  0.635070	  0.836943	 -1.185620
  0.621681	  0.829834	 -1.175285
  0.610616	  0.819226	 -1.168392
  0.595570	  0.803828	 -1.167307
  0.576726	  0.789390	 -1.164178
  0.563056	  0.776210	 -1.157623
  0.548144	  0.764134	 -1.151800
  0.535180	  0.748315	 -1.146748
  0.524753	  0.729603	 -1.142702
  0.518824	  0.712425	 -1.138043
  0.515098	  0.693614	 -1.133939
  0.505018	  0.675505	 -1.127059
  0.483939	  0.655968	 -1.121607
  0.475157	  0.643009	 -1.123747
  0.469906	  0.628121	 -1.129821
  0.463672	  0.604401	 -1.135404
  0.446334	  0.584819	 -1.134218
  0.436311	  0.571765	 -1.130532
  0.424046	  0.556426	 -1.126554
  0.412899	  0.538596	 -1.120956
  0.401840	  0.525720	 -1.114336
  0.389543	  0.512645	 -1.105238
  0.381758	  0.496546	 -1.096521
  0.374464	  0.480245	 -1.089039
  0.368365	  0.465164	 -1.085078
  0.351647	  0.436210	 -1.076924
  0.343477	  0.423082	 -1.074012
  0.336588	  0.411310	 -1.071274
  0.319520	  0.390162	 -1.070950
  0.305678	  0.373359	 -1.067700
  0.296378	  0.364699	 -1.065687
  0.283621	  0.347322	 -1.061503
  0.273190	  0.328311	 -1.055382
  0.266414	  0.307668	 -1.048573
  0.262127	  0.292234	 -1.042574
  0.254798	  0.276279	 -1.036951
  0.242612	  0.256365	 -1.029084
  0.236501	  0.243631	 -1.024770
  0.227837	  0.228757	 -1.015427
  0.220747	  0.212907	 -1.002856
  0.212361	  0.195768	 -0.991228
  0.207932	  0.171850	 -0.984413
  0.206785	  0.159553	 -0.981272
  0.202182	  0.144134	 -0.970976
  0.194885	  0.129512	 -0.953636
  0.188858	  0.115769	 -0.944618
  0.180268	  0.095962	 -0.935616
  0.167387	  0.074494	 -0.932721
  0.155690	  0.055997	 -0.926792
  0.148569	  0.046325	 -0.922346
  0.140116	  0.030974	 -0.911610
  0.129598	  0.015449	 -0.898773
  0.116677	  0.000873	 -0.884703
  0.106155	 -0.008352	 -0.876090
  0.099468	 -0.021886	 -0.859633
  0.095080	 -0.031635	 -0.845012
  0.097014	 -0.043748	 -0.824350
  0.093941	 -0.055997	 -0.808794
  0.081969	 -0.069707	 -0.798167
  0.065516	 -0.082355	 -0.787702
  0.055845	 -0.094825	 -0.772626
  0.053157	 -0.103704	 -0.759932
  0.052000	 -0.116038	 -0.741786
  0.042156	 -0.128072	 -0.726510
  0.028254	 -0.138706	 -0.717913
  0.015354	 -0.150941	 -0.709783
  0.005458	 -0.162743	 -0.692899
 -0.001289	 -0.173251	 -0.677708
 -0.007774	 -0.185969	 -0.658560
 -0.011736	 -0.198167	 -0.641952
 -0.017392	 -0.206432	 -0.628995
 -0.023652	 -0.214720	 -0.617869
 -0.034483	 -0.227417	 -0.602285
 -0.046342	 -0.241636	 -0.588901
 -0.059587	 -0.252549	 -0.577443
 -0.069984	 -0.262175	 -0.565859
 -0.079977	 -0.275850	 -0.551739
 -0.083964	 -0.287922	 -0.540418
 -0.092297	 -0.303224	 -0.518548
 -0.095619	 -0.312233	 -0.504292
 -0.099156	 -0.325101	 -0.486922
 -0.105803	 -0.332655	 -0.473328
 -0.113194	 -0.335565	 -0.455528
 -0.122909	 -0.344700	 -0.437152
 -0.132941	 -0.358391	 -0.422936
 -0.139266	 -0.367587	 -0.410798
 -0.145637	 -0.382390	 -0.398084
 -0.156438	 -0.399481	 -0.382084
 -0.163158	 -0.408442	 -0.372074
 -0.172456	 -0.416315	 -0.358913
 -0.188587	 -0.430015	 -0.337541
 -0.193112	 -0.435669	 -0.329295
 -0.202053	 -0.446066	 -0.317183
 -0.214268	 -0.459029	 -0.298604
 -0.227113	 -0.469101	 -0.282596
 -0.235157	 -0.474163	 -0.274963
 -0.245762	 -0.487815	 -0.264594
 -0.257095	 -0.502085	 -0.245700
 -0.267703	 -0.511010	 -0.230935
 -0.277686	 -0.518657	 -0.220360
 -0.287119	 -0.531168	 -0.206873
 -0.296426	 -0.545805	 -0.188420
 -0.300187	 -0.554550	 -0.176515
 -0.309718	 -0.563001	 -0.162115
 -0.324167	 -0.572426	 -0.146337
 -0.335115	 -0.586255	 -0.134574
 -0.344389	 -0.600333	 -0.122910
 -0.351571	 -0.612955	 -0.108647
 -0.357726	 -0.626026	 -0.094537
 -0.363920	 -0.641544	 -0.082273
 -0.370957	 -0.656331	 -0.068273
 -0.376459	 -0.667102	 -0.053821
 -0.380616	 -0.680121	 -0.040087
 -0.388471	 -0.696083	 -0.025480
 -0.394876	 -0.707091	 -0.009177
 -0.399310	 -0.714648	  0.005825
 -0.405024	 -0.725253	  0.022986
 -0.415451	 -0.739389	  0.037555
 -0.429410	 -0.750875	  0.051493
 -0.438537	 -0.761496	  0.062154
 -0.444497	 -0.778446	  0.074313
 -0.447344	 -0.795150	  0.083935
 -0.452153	 -0.812077	  0.099032
 -0.453848	 -0.822932	  0.116907
 -0.457422	 -0.831406	  0.134313
 -0.459887	 -0.842720	  0.147319
 -0.466527	 -0.862897	  0.165939
 -0.465087	 -0.872276	  0.176781
 -0.462377	 -0.883910	  0.193964
 -0.461714	 -0.898471	  0.213519
 -0.463981	 -0.911807	  0.226003
 -0.469946	 -0.927035	  0.237098
 -0.475596	 -0.942732	  0.249764
 -0.480351	 -0.956553	  0.261505
 -0.485720	 -0.972832	  0.274498
 -0.486980	 -0.985749	  0.286770
 -0.488976	 -1.000184	  0.297552
 -0.495857	 -1.024054	  0.314468
 -0.501232	 -1.035411	  0.329887
 -0.505142	 -1.044043	  0.339835
 -0.511326	 -1.056767	  0.356628
 -0.515258	 -1.071513	  0.368379
 -0.518926	 -1.089843	  0.377231
 -0.523028	 -1.107954	  0.385754
 -0.527734	 -1.122622	  0.398901
 -0.530638	 -1.135411	  0.414140
 -0.534253	 -1.148391	  0.428601
 -0.538221	 -1.163559	  0.443183
 -0.541748	 -1.176350	  0.456486
 -0.545534	 -1.190953	  0.472055
 -0.547364	 -1.204359	  0.487547
 -0.551961	 -1.218327	  0.501275
 -0.561590	 -1.231878	  0.512040
 -0.571630	 -1.246694	  0.522388
 -0.580025	 -1.258967	  0.535334
 -0.587901	 -1.274629	  0.550929
 -0.591502	 -1.289391	  0.561381
 -0.595411	 -1.300279	  0.572652
 -0.599381	 -1.314296	  0.587633
 -0.601527	 -1.332047	  0.602892
 -0.604255	 -1.342987	  0.612616
 -0.608919	 -1.356868	  0.627621
 -0.617056	 -1.371750	  0.641559
 -0.625402	 -1.383720	  0.653521
 -0.636161	 -1.395811	  0.666266
 -0.645999	 -1.408854	  0.676428
 -0.655778	 -1.418633	  0.685696
 -0.667921	 -1.429461	  0.700475
 -0.681060	 -1.441195	  0.714727
 -0.687925	 -1.447769	  0.722884
 -0.699786	 -1.452794	  0.736436
 -0.719732	 -1.470668	  0.757235
 -0.725150	 -1.474993	  0.763719
 -0.739935	 -1.487464	  0.776907
 -0.754990	 -1.497667	  0.785606
 -0.764592	 -1.504730	  0.792353
 -0.777945	 -1.511702	  0.806596
 -0.790448	 -1.518022	  0.821529
 -0.802353	 -1.525661	  0.836193
 -0.817727	 -1.534902	  0.855152
 -0.822466	 -1.541201	  0.862674
 -0.831838	 -1.548397	  0.879559
 -0.845100	 -1.552893	  0.898023
 -0.856515	 -1.554836	  0.913927
 -0.866868	 -1.558664	  0.930596
 -0.880756	 -1.564075	  0.949250
 -0.891225	 -1.570269	  0.960080
 -0.905721	 -1.578264	  0.972707
 -0.921414	 -1.587355	  0.984982
 -0.936852	 -1.601239	  1.004076
 -0.945251	 -1.605633	  1.014276
 -0.955054	 -1.612599	  1.033684
 -0.960580	 -1.623271	  1.051304
 -0.964910	 -1.638512	  1.065017
 -0.971967	 -1.649811	  1.078467
 -0.977298	 -1.662610	  1.094341
 -0.988191	 -1.678092	  1.108843
 -0.998534	 -1.690978	  1.114326
 -1.012719	 -1.704543	  1.123699
 -1.024126	 -1.719978	  1.136551
 -1.028614	 -1.731286	  1.150456
 -1.034330	 -1.740763	  1.167686
 -1.041965	 -1.751522	  1.183624
 -1.048853	 -1.763830	  1.197495
 -1.054244	 -1.774001	  1.213901
 -1.058907	 -1.785285	  1.231737
 -1.067269	 -1.801516	  1.245110
 -1.078613	 -1.814950	  1.250812
 -1.092163	 -1.830375	  1.258073
 -1.104005	 -1.848136	  1.270065
 -1.108927	 -1.862316	  1.284726
 -1.107620	 -1.894971	  1.314370
 -1.115329	 -1.908163	  1.327275
