 -2.479261	  0.639834	 -1.620116
 -2.454714	  0.633499	 -1.604076
 -2.405857	  0.637463	 -1.582537
 -2.359178	  0.632477	 -1.565873
 -2.314864	  0.616334	 -1.549820
 -2.264768	  0.611916	 -1.538481
 -2.214526	  0.609431	 -1.523792
 -2.166000	  0.605122	 -1.509041
 -2.118244	  0.601203	 -1.494002
 -2.070810	  0.599015	 -1.478138
 -2.024072	  0.599055	 -1.461316
 -1.977672	  0.599849	 -1.442353
 -1.931056	  0.600315	 -1.421246
 -1.885058	  0.599258	 -1.400113
 -1.839816	  0.596199	 -1.380022
 -1.795300	  0.591106	 -1.362172
 -1.748345	  0.585523	 -1.345563
 -1.700726	  0.579985	 -1.329768
 -1.654436	  0.573412	 -1.314213
 -1.608469	  0.565404	 -1.297350
 -1.562554	  0.556784	 -1.278584
 -1.516384	  0.548190	 -1.258704
 -1.470050	  0.539249	 -1.236667
 -1.425133	  0.530872	 -1.214477
 -1.381260	  0.524092	 -1.192899
 -1.337741	  0.518873	 -1.171643
 -1.293468	  0.515007	 -1.149686
 -1.249558	  0.512470	 -1.126660
 -1.205382	  0.510783	 -1.103437
 -1.159606	  0.509820	 -1.080756
 -1.113300	  0.509296	 -1.059130
 -1.067580	  0.508132	 -1.038560
 -1.021330	  0.505928	 -1.018942
 -0.974123	  0.502295	 -1.000498
 -0.926848	  0.497176	 -0.983464
 -0.879836	  0.490852	 -0.967604
 -0.832881	  0.483625	 -0.952509
 -0.787425	  0.476204	 -0.938320
 -0.742166	  0.468597	 -0.924386
 -0.694440	  0.460478	 -0.909636
 -0.646056	  0.452489	 -0.894300
 -0.598063	  0.444639	 -0.878116
 -0.553062	  0.437567	 -0.861240
 -0.508868	  0.430694	 -0.842405
 -0.463250	  0.423735	 -0.820409
 -0.418857	  0.417560	 -0.796453
 -0.376435	  0.414113	 -0.771087
 -0.334808	  0.414630	 -0.744135
 -0.292787	  0.417096	 -0.716724
 -0.250046	  0.420878	 -0.689960
 -0.205972	  0.425223	 -0.664254
 -0.160976	  0.428875	 -0.639976
 -0.113372	  0.430207	 -0.616826
 -0.065324	  0.428751	 -0.596361
 -0.017494	  0.425145	 -0.577886
  0.030459	  0.420293	 -0.561097
  0.078738	  0.415336	 -0.546347
  0.126222	  0.411043	 -0.534928
  0.176006	  0.407274	 -0.525013
  0.225224	  0.403233	 -0.515983
  0.272295	  0.397742	 -0.507008
  0.319297	  0.390705	 -0.496034
  0.366185	  0.383242	 -0.481192
  0.412568	  0.375661	 -0.462836
  0.458793	  0.368628	 -0.443332
  0.505675	  0.362025	 -0.423721
  0.552640	  0.356003	 -0.404415
  0.597732	  0.351530	 -0.386024
  0.641400	  0.348106	 -0.368889
  0.686629	  0.344865	 -0.351368
  0.734508	  0.340333	 -0.332624
  0.781109	  0.333728	 -0.312811
  0.827274	  0.326008	 -0.292162
  0.873465	  0.318354	 -0.271951
  0.919135	  0.311868	 -0.253633
  0.964873	  0.305888	 -0.236791
  1.010271	  0.299796	 -0.221743
  1.056865	  0.293562	 -0.207109
  1.103542	  0.287689	 -0.190613
  1.148791	  0.281847	 -0.170935
  1.194146	  0.275478	 -0.148736
  1.238446	  0.268297	 -0.124784
  1.278936	  0.259546	 -0.099483
  1.309753	  0.247754	 -0.074520
  1.333560	  0.226876	 -0.043715
  1.358810	  0.169418	  0.015808
  1.387187	  0.068182	  0.087209
  1.423335	 -0.004655	  0.133169
  1.459389	 -0.039024	  0.164783
  1.485470	 -0.043599	  0.183629
  1.501472	 -0.033179	  0.195467
  1.529260	  0.011032	  0.210773
  1.577049	  0.089556	  0.218284
  1.627720	  0.143905	  0.221383
  1.708479	  0.179907	  0.230035
  1.784936	  0.178785	  0.248046
  1.831830	  0.190631	  0.243904
  1.886006	  0.192487	  0.247887
  1.961016	  0.219423	  0.229537
  2.049596	  0.229126	  0.223276
  2.121070	  0.228734	  0.223433
  2.173515	  0.221676	  0.230713
  2.220162	  0.212071	  0.241680
  2.266726	  0.202941	  0.255613
  2.314286	  0.194606	  0.273079
  2.360145	  0.188043	  0.291760
  2.405223	  0.183678	  0.311574
  2.449778	  0.181264	  0.332942
  2.492908	  0.180683	  0.355012
  2.537881	  0.180978	  0.378217
  2.583455	  0.175466	  0.401152
  2.629074	  0.171839	  0.424178
  2.676120	  0.171744	  0.441182
  2.719579	  0.160378	  0.461463
  2.765496	  0.164540	  0.480420
  2.812500	  0.154294	  0.495865
  2.857924	  0.147060	  0.515870
  2.903338	  0.142793	  0.529754
  2.946590	  0.137831	  0.546454
  2.976055	  0.139210	  0.551919
