 -0.939175	 -1.913773	 -1.238227
 -0.925166	 -1.954437	 -1.215284
 -0.911157	 -1.995101	 -1.192341
 -0.916936	 -1.979622	 -1.205176
 -0.920586	 -1.963198	 -1.213984
 -0.926897	 -1.945461	 -1.221497
 -0.933450	 -1.927684	 -1.228955
 -0.939379	 -1.910487	 -1.236889
 -0.945368	 -1.894620	 -1.245931
 -0.954173	 -1.876602	 -1.256859
 -0.961531	 -1.860316	 -1.266518
 -0.962759	 -1.843495	 -1.273697
 -0.964754	 -1.825399	 -1.282862
 -0.966665	 -1.807791	 -1.292934
 -0.970086	 -1.791431	 -1.302654
 -0.975322	 -1.774566	 -1.312487
 -0.980298	 -1.755914	 -1.323601
 -0.980462	 -1.739390	 -1.334046
 -0.978599	 -1.724238	 -1.344703
 -0.977739	 -1.706065	 -1.357522
 -0.981188	 -1.690717	 -1.367769
 -0.985698	 -1.674814	 -1.379373
 -0.986868	 -1.658281	 -1.391699
 -0.984563	 -1.643412	 -1.403861
 -0.981282	 -1.627096	 -1.417153
 -0.983718	 -1.611132	 -1.428076
 -0.987059	 -1.594819	 -1.439234
 -0.991131	 -1.576774	 -1.450239
 -0.991132	 -1.560170	 -1.459431
 -0.989930	 -1.544048	 -1.470289
 -0.986727	 -1.528998	 -1.485051
 -0.984122	 -1.513463	 -1.499716
 -0.984856	 -1.495067	 -1.506978
 -0.987557	 -1.477733	 -1.515392
 -0.991137	 -1.458616	 -1.524049
 -0.991659	 -1.441682	 -1.533891
 -0.991267	 -1.425894	 -1.545638
 -0.992037	 -1.407897	 -1.557153
 -0.994942	 -1.391185	 -1.566595
 -0.999601	 -1.373869	 -1.574226
 -0.999904	 -1.352305	 -1.583603
 -0.999858	 -1.338424	 -1.592373
 -1.002656	 -1.321055	 -1.601911
 -1.009014	 -1.300290	 -1.609142
 -1.013599	 -1.283893	 -1.618185
 -1.014889	 -1.267983	 -1.629161
 -1.016388	 -1.250929	 -1.641508
 -1.019060	 -1.233563	 -1.650587
 -1.021532	 -1.214842	 -1.657485
 -1.024884	 -1.196592	 -1.667206
 -1.025735	 -1.182237	 -1.679923
 -1.025615	 -1.167001	 -1.693952
 -1.027767	 -1.150556	 -1.706008
 -1.029987	 -1.133007	 -1.713410
 -1.032315	 -1.113776	 -1.722961
 -1.034989	 -1.096834	 -1.735947
 -1.034298	 -1.085255	 -1.748407
 -1.034651	 -1.069205	 -1.761692
 -1.036446	 -1.052772	 -1.773737
 -1.037893	 -1.036573	 -1.785622
 -1.038852	 -1.020583	 -1.797608
 -1.039795	 -1.004575	 -1.809559
 -1.040650	 -0.988420	 -1.821319
 -1.041504	 -0.972265	 -1.833079
 -1.042337	 -0.956002	 -1.844690
 -1.043158	 -0.939685	 -1.856226
 -1.043950	 -0.923330	 -1.867710
 -1.044612	 -0.906802	 -1.878952
 -1.045274	 -0.890273	 -1.890193
 -1.045883	 -0.873582	 -1.901194
 -1.046466	 -0.856808	 -1.912071
 -1.047063	 -0.840013	 -1.922914
 -1.047791	 -0.822993	 -1.933070
 -1.047477	 -0.806877	 -1.942888
 -1.047979	 -0.788745	 -1.955236
 -1.051199	 -0.772856	 -1.969103
 -1.057273	 -0.756862	 -1.978727
 -1.060114	 -0.738290	 -1.984367
 -1.060173	 -0.717409	 -1.990405
 -1.057752	 -0.699368	 -1.998269
 -1.056390	 -0.682571	 -2.010113
 -1.061360	 -0.665992	 -2.021318
 -1.068703	 -0.649091	 -2.028151
 -1.073682	 -0.628762	 -2.033554
 -1.073576	 -0.611240	 -2.042384
 -1.074712	 -0.595723	 -2.054455
 -1.080930	 -0.577688	 -2.066871
 -1.085942	 -0.560011	 -2.072832
 -1.085356	 -0.541858	 -2.079564
 -1.086772	 -0.525091	 -2.089578
 -1.093725	 -0.507266	 -2.100617
 -1.099215	 -0.488561	 -2.106520
 -1.099904	 -0.471766	 -2.115114
 -1.100507	 -0.457344	 -2.128789
 -1.105136	 -0.441734	 -2.143672
 -1.113134	 -0.422024	 -2.151205
 -1.117349	 -0.403216	 -2.156845
 -1.116905	 -0.388506	 -2.165552
 -1.117929	 -0.372177	 -2.178995
 -1.120142	 -0.356267	 -2.192469
 -1.125812	 -0.342558	 -2.205720
 -1.126422	 -0.341083	 -2.207146
