 -0.190190	  1.949797	  1.574233
 -0.198897	  1.943650	  1.559700
 -0.200713	  1.942368	  1.556669
 -0.208555	  1.930539	  1.542592
 -0.213000	  1.918964	  1.526519
 -0.218782	  1.912965	  1.509005
 -0.225961	  1.907088	  1.491022
 -0.233908	  1.897084	  1.473480
 -0.243595	  1.884690	  1.459970
 -0.254264	  1.878926	  1.445947
 -0.263925	  1.874254	  1.429418
 -0.273476	  1.870159	  1.412471
 -0.288110	  1.861636	  1.394465
 -0.301788	  1.855104	  1.383219
 -0.313415	  1.848942	  1.370755
 -0.326239	  1.846875	  1.355548
 -0.339258	  1.841396	  1.340008
 -0.352336	  1.838450	  1.324740
 -0.364056	  1.842578	  1.309238
 -0.378059	  1.844508	  1.293884
 -0.393155	  1.837335	  1.280783
 -0.406834	  1.836993	  1.266342
 -0.421141	  1.840983	  1.252091
 -0.436818	  1.840360	  1.238793
 -0.452068	  1.838534	  1.229262
 -0.468522	  1.843233	  1.218004
 -0.487706	  1.840336	  1.204696
 -0.504614	  1.830448	  1.196078
 -0.522423	  1.823563	  1.187833
 -0.538551	  1.824348	  1.179315
 -0.555497	  1.827306	  1.170569
 -0.575397	  1.827759	  1.163299
 -0.594431	  1.826637	  1.156503
 -0.614098	  1.828537	  1.153429
 -0.633463	  1.830408	  1.150465
 -0.652501	  1.831404	  1.146239
 -0.673231	  1.831055	  1.141696
 -0.691564	  1.830333	  1.137407
 -0.710232	  1.828086	  1.131405
 -0.727645	  1.822512	  1.124509
 -0.747280	  1.816285	  1.118344
 -0.766391	  1.813741	  1.113016
 -0.780416	  1.810205	  1.102263
 -0.793841	  1.802473	  1.091303
 -0.809665	  1.789644	  1.082098
 -0.824611	  1.780141	  1.073508
 -0.834810	  1.771294	  1.060542
 -0.845113	  1.759904	  1.047357
 -0.855685	  1.744751	  1.035897
 -0.867361	  1.731052	  1.027777
 -0.876701	  1.719220	  1.015868
 -0.879517	  1.705993	  1.000881
 -0.882197	  1.693964	  0.984584
 -0.889429	  1.682349	  0.970576
 -0.897193	  1.668079	  0.955183
 -0.906135	  1.656695	  0.938303
 -0.906334	  1.643946	  0.923933
 -0.906500	  1.625612	  0.909511
 -0.909909	  1.614271	  0.895791
 -0.907748	  1.592834	  0.887116
 -0.901373	  1.575997	  0.870563
 -0.898872	  1.565670	  0.859164
 -0.893139	  1.547556	  0.840053
 -0.894638	  1.544898	  0.826160
 -0.889878	  1.541951	  0.810853
 -0.883905	  1.534969	  0.786476
 -0.879779	  1.523779	  0.768288
 -0.877395	  1.507334	  0.754856
 -0.881498	  1.496101	  0.737912
 -0.881789	  1.489725	  0.718766
 -0.882778	  1.484407	  0.697211
 -0.878568	  1.472217	  0.684499
 -0.871891	  1.453512	  0.673590
 -0.875463	  1.436582	  0.655992
 -0.878987	  1.420784	  0.646724
 -0.875478	  1.410402	  0.630311
 -0.867980	  1.395883	  0.619608
 -0.866963	  1.381017	  0.605936
 -0.862964	  1.361729	  0.593623
 -0.857486	  1.350868	  0.578541
 -0.859933	  1.346167	  0.555385
 -0.863497	  1.342303	  0.530833
 -0.867051	  1.332438	  0.515008
 -0.865416	  1.319220	  0.501616
 -0.864435	  1.306343	  0.486267
 -0.861844	  1.284456	  0.475796
 -0.859401	  1.272627	  0.460660
 -0.855978	  1.261763	  0.445866
 -0.855690	  1.246451	  0.432574
 -0.860569	  1.222633	  0.420630
 -0.861156	  1.209478	  0.406822
 -0.862024	  1.205083	  0.390926
 -0.861819	  1.193050	  0.371531
 -0.860894	  1.176934	  0.358076
 -0.862120	  1.160998	  0.347314
 -0.863296	  1.144549	  0.331598
 -0.861810	  1.134602	  0.316727
 -0.863027	  1.117879	  0.306328
 -0.867060	  1.097170	  0.295348
 -0.869206	  1.086544	  0.277893
 -0.870929	  1.071745	  0.269634
 -0.873322	  1.053286	  0.258840
 -0.873819	  1.037275	  0.245986
 -0.873040	  1.019494	  0.232731
 -0.873095	  1.002605	  0.228240
 -0.876051	  0.985815	  0.220096
 -0.881244	  0.966557	  0.214911
 -0.880165	  0.944585	  0.203879
 -0.878801	  0.928299	  0.191681
 -0.885619	  0.912328	  0.186762
 -0.890177	  0.894289	  0.183167
 -0.893955	  0.872453	  0.179795
 -0.899055	  0.853285	  0.174901
 -0.904896	  0.836798	  0.173216
 -0.911531	  0.817321	  0.173178
 -0.921931	  0.799586	  0.172615
 -0.933313	  0.783300	  0.173605
 -0.944196	  0.766899	  0.175255
 -0.954702	  0.749691	  0.177455
 -0.965618	  0.734857	  0.179759
 -0.982623	  0.718473	  0.184094
 -0.995246	  0.704703	  0.185777
 -1.001544	  0.684327	  0.186807
 -1.013933	  0.668428	  0.187720
 -1.029695	  0.657394	  0.187828
 -1.042822	  0.641888	  0.184424
 -1.055406	  0.623902	  0.186307
 -1.071400	  0.616869	  0.178544
 -1.085289	  0.608727	  0.165565
 -1.098253	  0.603158	  0.157533
 -1.114790	  0.593253	  0.150891
 -1.125718	  0.586235	  0.137061
 -1.136185	  0.582238	  0.119764
 -1.145503	  0.580465	  0.101940
 -1.153502	  0.580931	  0.083800
 -1.163822	  0.582397	  0.066467
 -1.176230	  0.586449	  0.050095
 -1.185757	  0.588370	  0.033126
 -1.189557	  0.591591	  0.014190
 -1.193161	  0.596007	 -0.005331
 -1.195262	  0.600967	 -0.024491
 -1.198120	  0.607072	 -0.043501
 -1.201879	  0.614212	 -0.062157
 -1.205587	  0.622700	 -0.080093
 -1.207676	  0.632916	 -0.097336
 -1.206507	  0.641853	 -0.114916
 -1.206285	  0.650838	 -0.133049
 -1.207954	  0.659464	 -0.151156
 -1.210018	  0.667537	 -0.169361
 -1.211729	  0.675719	 -0.187514
 -1.211931	  0.683966	 -0.205531
 -1.211506	  0.692804	 -0.223317
 -1.217488	  0.704530	 -0.241573
 -1.225094	  0.713391	 -0.258455
 -1.227711	  0.718895	 -0.275861
 -1.228925	  0.724734	 -0.294381
 -1.232543	  0.731766	 -0.313536
 -1.238116	  0.739331	 -0.331479
 -1.243886	  0.746985	 -0.349036
 -1.249667	  0.754634	 -0.366587
 -1.257010	  0.761704	 -0.383793
 -1.265592	  0.768265	 -0.400625
 -1.274184	  0.774821	 -0.417453
 -1.282789	  0.781383	 -0.434243
 -1.293136	  0.786882	 -0.449740
 -1.305697	  0.793293	 -0.465484
 -1.317571	  0.801201	 -0.480249
 -1.327029	  0.805051	 -0.498225
 -1.336757	  0.806345	 -0.514415
 -1.348911	  0.807053	 -0.530403
 -1.361147	  0.809104	 -0.546937
 -1.371873	  0.808229	 -0.563212
 -1.384492	  0.804227	 -0.578541
 -1.397613	  0.802445	 -0.594312
 -1.408628	  0.804660	 -0.610953
 -1.419843	  0.808384	 -0.628629
 -1.434128	  0.808726	 -0.644023
 -1.445706	  0.802857	 -0.656876
 -1.458113	  0.796097	 -0.672699
 -1.471736	  0.791996	 -0.687678
 -1.482179	  0.793362	 -0.703953
 -1.493682	  0.793172	 -0.721429
 -1.507019	  0.788243	 -0.736382
 -1.517794	  0.779656	 -0.750469
 -1.528941	  0.771418	 -0.765515
 -1.543173	  0.766405	 -0.778677
 -1.556159	  0.759878	 -0.792450
 -1.565810	  0.753171	 -0.811897
 -1.577316	  0.750333	 -0.826115
 -1.588932	  0.743702	 -0.841650
 -1.594363	  0.735977	 -0.858835
 -1.602864	  0.728311	 -0.875953
 -1.612907	  0.723266	 -0.892935
 -1.621218	  0.717584	 -0.910794
 -1.627683	  0.710588	 -0.927480
 -1.631928	  0.704829	 -0.946337
 -1.637556	  0.699699	 -0.967367
 -1.644722	  0.694245	 -0.984360
 -1.653209	  0.683419	 -1.001809
 -1.661913	  0.677135	 -1.014802
 -1.670425	  0.670573	 -1.031526
 -1.679321	  0.660801	 -1.051152
 -1.682896	  0.656065	 -1.069837
 -1.680468	  0.650951	 -1.089317
 -1.681304	  0.644016	 -1.108580
 -1.687360	  0.638106	 -1.126636
 -1.695706	  0.630621	 -1.144105
 -1.702652	  0.620120	 -1.162625
 -1.708458	  0.613600	 -1.175855
 -1.714002	  0.607472	 -1.192963
 -1.720319	  0.601198	 -1.218428
 -1.721558	  0.596177	 -1.235512
 -1.726071	  0.587367	 -1.251698
 -1.731763	  0.576692	 -1.267823
 -1.736630	  0.567474	 -1.285259
 -1.742027	  0.562351	 -1.303258
 -1.747896	  0.557604	 -1.323059
 -1.752137	  0.549022	 -1.340842
 -1.758888	  0.539688	 -1.356348
 -1.767613	  0.529903	 -1.372957
 -1.772959	  0.520204	 -1.390462
 -1.779146	  0.516759	 -1.407848
 -1.787547	  0.512258	 -1.426155
 -1.794565	  0.505489	 -1.444573
 -1.800641	  0.496300	 -1.461254
 -1.809675	  0.489337	 -1.478537
 -1.822145	  0.486688	 -1.493214
 -1.834444	  0.483006	 -1.509213
 -1.845942	  0.479182	 -1.525424
 -1.857185	  0.475376	 -1.541522
 -1.868910	  0.471614	 -1.557281
 -1.883328	  0.467033	 -1.576374
 -1.892579	  0.464052	 -1.588628
