 -1.543171	 -0.611521	 -1.557435
 -1.550150	 -0.621499	 -1.554262
 -1.528869	 -0.591071	 -1.563939
 -1.499103	 -0.551429	 -1.577577
 -1.467893	 -0.512005	 -1.592189
 -1.436376	 -0.473911	 -1.607622
 -1.405693	 -0.438969	 -1.622637
 -1.375145	 -0.406837	 -1.636890
 -1.342815	 -0.376653	 -1.650902
 -1.307704	 -0.347356	 -1.665320
 -1.270622	 -0.318242	 -1.680043
 -1.231868	 -0.288686	 -1.695241
 -1.192502	 -0.259138	 -1.711083
 -1.154737	 -0.231045	 -1.726504
 -1.118003	 -0.203813	 -1.740937
 -1.080412	 -0.175510	 -1.755270
 -1.040486	 -0.143323	 -1.770775
 -1.000618	 -0.106487	 -1.787796
 -0.963262	 -0.066379	 -1.805803
 -0.931395	 -0.026375	 -1.823342
 -0.905118	  0.010268	 -1.838167
 -0.878928	  0.047268	 -1.851823
 -0.848368	  0.085115	 -1.867532
 -0.813693	  0.118251	 -1.885411
 -0.776258	  0.145568	 -1.904367
 -0.737431	  0.169798	 -1.923763
 -0.698456	  0.193212	 -1.943023
 -0.658516	  0.217480	 -1.962521
 -0.617348	  0.243454	 -1.983149
 -0.577374	  0.270474	 -2.004067
 -0.539003	  0.298357	 -2.024545
 -0.500482	  0.327942	 -2.045499
 -0.461581	  0.359815	 -2.067687
 -0.424081	  0.393776	 -2.090431
 -0.388914	  0.429213	 -2.112988
 -0.356873	  0.464908	 -2.134678
 -0.327758	  0.500520	 -2.154686
 -0.299563	  0.537360	 -2.174099
 -0.265369	  0.581844	 -2.197984
 -0.243124	  0.610405	 -2.213350
