  2.382354	 -0.493454	 -0.010343
  2.406311	 -0.487316	 -0.008228
  2.430268	 -0.481178	 -0.006113
  2.410965	 -0.486125	 -0.007820
  2.391735	 -0.491232	 -0.009858
  2.372549	 -0.496424	 -0.012078
  2.353365	 -0.501620	 -0.014302
  2.334330	 -0.507172	 -0.016920
  2.315299	 -0.512731	 -0.019546
  2.296342	 -0.518489	 -0.022283
  2.277524	 -0.524598	 -0.025213
  2.258710	 -0.530714	 -0.028145
  2.240091	 -0.537399	 -0.031090
  2.221537	 -0.544258	 -0.034036
  2.203081	 -0.551430	 -0.036858
  2.184915	 -0.559417	 -0.039345
  2.166806	 -0.567573	 -0.041681
  2.149472	 -0.577421	 -0.042353
  2.136377	 -0.590918	 -0.038601
  2.128356	 -0.607857	 -0.029547
  2.123918	 -0.624496	 -0.019267
  2.119897	 -0.639198	 -0.008435
  2.110151	 -0.656419	  0.001518
  2.101030	 -0.671597	  0.007230
  2.083701	 -0.687164	  0.016352
  2.070126	 -0.696775	  0.027576
  2.057057	 -0.712426	  0.035436
  2.052274	 -0.728414	  0.041118
  2.047305	 -0.745690	  0.047247
  2.038490	 -0.763460	  0.054475
  2.033355	 -0.779597	  0.064656
  2.025986	 -0.796830	  0.073439
  2.017527	 -0.813594	  0.080932
  2.006327	 -0.829626	  0.085184
  1.994556	 -0.845432	  0.088581
  1.982793	 -0.861242	  0.091985
  1.971018	 -0.877056	  0.095324
  1.958727	 -0.892609	  0.097845
  1.945262	 -0.907366	  0.098344
  1.931957	 -0.921994	  0.098782
  1.918941	 -0.936813	  0.099102
  1.906104	 -0.950136	  0.097313
  1.888939	 -0.966283	  0.094872
  1.875430	 -0.979955	  0.098424
  1.860881	 -0.993848	  0.098960
  1.845339	 -1.006450	  0.093363
  1.830974	 -1.016549	  0.085294
  1.815421	 -1.028274	  0.079037
  1.799926	 -1.040170	  0.073544
  1.784508	 -1.050504	  0.066095
  1.769085	 -1.060876	  0.058730
  1.753934	 -1.071105	  0.050776
  1.739175	 -1.080435	  0.041280
  1.725041	 -1.088903	  0.030240
  1.710360	 -1.097641	  0.019056
  1.696047	 -1.105241	  0.007372
  1.680182	 -1.112601	 -0.002621
  1.666698	 -1.120159	 -0.012264
  1.652938	 -1.128434	 -0.024862
  1.637725	 -1.135827	 -0.036828
  1.622543	 -1.143753	 -0.046976
  1.606884	 -1.150989	 -0.057291
  1.592330	 -1.156316	 -0.071179
  1.578794	 -1.159870	 -0.085613
  1.565229	 -1.163532	 -0.099799
  1.551930	 -1.167230	 -0.114393
  1.539904	 -1.171196	 -0.129736
  1.528087	 -1.175576	 -0.145625
  1.517304	 -1.179229	 -0.162755
  1.506368	 -1.183495	 -0.178891
  1.495733	 -1.186064	 -0.195754
  1.484578	 -1.187731	 -0.212291
  1.472720	 -1.189800	 -0.228578
  1.462952	 -1.190228	 -0.246109
  1.452939	 -1.192037	 -0.263482
  1.444302	 -1.193411	 -0.281556
  1.435002	 -1.195965	 -0.299069
  1.425320	 -1.198163	 -0.315956
  1.414122	 -1.197453	 -0.333549
  1.403016	 -1.193915	 -0.352200
  1.393862	 -1.189069	 -0.369161
  1.380515	 -1.185932	 -0.382298
  1.366796	 -1.185135	 -0.397360
  1.352566	 -1.182612	 -0.411949
  1.337369	 -1.178253	 -0.423591
  1.320912	 -1.173629	 -0.434585
  1.305056	 -1.171462	 -0.446168
  1.288293	 -1.169489	 -0.456825
  1.269605	 -1.166437	 -0.463198
  1.250729	 -1.163891	 -0.470051
  1.232587	 -1.164069	 -0.477301
  1.213293	 -1.165753	 -0.483088
  1.193831	 -1.166064	 -0.488563
  1.173929	 -1.166996	 -0.490625
  1.153980	 -1.168433	 -0.492018
  1.134475	 -1.172555	 -0.491541
  1.114831	 -1.177242	 -0.491228
  1.095261	 -1.181823	 -0.489583
  1.075100	 -1.184001	 -0.490438
  1.055411	 -1.187238	 -0.492316
  1.036294	 -1.191664	 -0.494471
  1.016132	 -1.196837	 -0.495036
  0.997895	 -1.204016	 -0.492908
  0.980143	 -1.211206	 -0.488351
  0.962748	 -1.217382	 -0.482576
  0.940610	 -1.224497	 -0.477226
  0.923446	 -1.231237	 -0.475050
  0.907536	 -1.240293	 -0.471060
  0.888924	 -1.249778	 -0.466600
  0.870547	 -1.253740	 -0.460744
  0.852403	 -1.256576	 -0.453439
  0.834455	 -1.260564	 -0.448600
  0.815509	 -1.269510	 -0.442687
  0.795988	 -1.278612	 -0.433504
  0.777622	 -1.286359	 -0.431338
  0.764870	 -1.291079	 -0.423600
  0.748671	 -1.298063	 -0.410952
  0.726533	 -1.300535	 -0.401984
  0.708238	 -1.306050	 -0.400038
  0.694473	 -1.313723	 -0.389281
  0.678513	 -1.316398	 -0.374302
  0.659611	 -1.315635	 -0.366457
  0.640483	 -1.317037	 -0.358630
  0.622354	 -1.324560	 -0.349378
  0.607337	 -1.330009	 -0.341997
  0.591059	 -1.337073	 -0.333914
  0.572816	 -1.344904	 -0.325507
  0.552827	 -1.344049	 -0.314933
  0.536809	 -1.344852	 -0.306786
  0.518413	 -1.351033	 -0.300367
  0.499253	 -1.356613	 -0.292853
  0.482669	 -1.359780	 -0.285113
  0.463508	 -1.365554	 -0.279341
  0.441798	 -1.369813	 -0.275942
  0.428382	 -1.372191	 -0.266682
  0.409498	 -1.377342	 -0.257052
  0.388665	 -1.380859	 -0.250989
  0.368863	 -1.382425	 -0.247099
  0.353387	 -1.386054	 -0.244602
  0.332737	 -1.392311	 -0.241099
  0.313377	 -1.398354	 -0.239354
  0.294125	 -1.403673	 -0.237555
  0.275025	 -1.409503	 -0.236382
  0.256121	 -1.416035	 -0.236059
  0.237739	 -1.422455	 -0.235934
  0.220233	 -1.430767	 -0.237642
  0.201479	 -1.440836	 -0.241269
  0.182655	 -1.450481	 -0.243594
  0.168122	 -1.460667	 -0.244040
  0.153925	 -1.474125	 -0.246695
  0.138045	 -1.488224	 -0.250996
  0.120838	 -1.500453	 -0.250699
  0.110364	 -1.516668	 -0.247241
  0.100724	 -1.534526	 -0.248692
  0.083328	 -1.548354	 -0.250359
  0.070144	 -1.564088	 -0.246671
  0.064618	 -1.581372	 -0.243295
  0.055298	 -1.600219	 -0.242656
  0.045800	 -1.618243	 -0.242634
  0.039024	 -1.637658	 -0.240630
  0.032182	 -1.656867	 -0.238411
  0.022343	 -1.673458	 -0.239232
  0.011574	 -1.689659	 -0.241142
  0.001977	 -1.708079	 -0.242310
 -0.004360	 -1.727099	 -0.243446
 -0.007043	 -1.746411	 -0.244106
 -0.010449	 -1.769215	 -0.248621
 -0.015137	 -1.787544	 -0.253033
 -0.021345	 -1.804999	 -0.254545
 -0.030168	 -1.822373	 -0.256310
 -0.042442	 -1.841834	 -0.262534
 -0.051146	 -1.858622	 -0.269951
 -0.059144	 -1.873033	 -0.273492
 -0.070224	 -1.890136	 -0.278867
 -0.079075	 -1.908020	 -0.285996
 -0.082006	 -1.926237	 -0.291576
 -0.088335	 -1.944851	 -0.297924
 -0.097875	 -1.960560	 -0.304659
 -0.107953	 -1.976593	 -0.312457
 -0.117765	 -1.992109	 -0.320504
 -0.127774	 -2.007666	 -0.328192
 -0.137686	 -2.023144	 -0.336138
 -0.147091	 -2.038483	 -0.344488
 -0.158641	 -2.052977	 -0.352572
 -0.171147	 -2.067120	 -0.359848
 -0.182213	 -2.080633	 -0.369277
 -0.191380	 -2.094809	 -0.378813
 -0.203557	 -2.109429	 -0.389942
 -0.217897	 -2.120443	 -0.400589
 -0.227933	 -2.129362	 -0.413762
 -0.237840	 -2.141524	 -0.426142
 -0.247773	 -2.154120	 -0.437296
 -0.260207	 -2.165316	 -0.449274
 -0.273293	 -2.174086	 -0.461595
 -0.286386	 -2.182839	 -0.473925
 -0.299458	 -2.191591	 -0.486273
 -0.312565	 -2.200325	 -0.498598
 -0.326524	 -2.206949	 -0.511291
 -0.340975	 -2.212139	 -0.524103
 -0.355435	 -2.217318	 -0.536915
 -0.369891	 -2.222491	 -0.549731
 -0.384573	 -2.227088	 -0.562503
 -0.400150	 -2.228923	 -0.574904
 -0.415737	 -2.230735	 -0.587306
 -0.431331	 -2.232543	 -0.599698
 -0.447058	 -2.233987	 -0.611960
 -0.463679	 -2.232301	 -0.622943
 -0.480304	 -2.230588	 -0.633928
 -0.496940	 -2.228864	 -0.644891
 -0.514037	 -2.226034	 -0.654854
 -0.531732	 -2.221018	 -0.662691
 -0.549440	 -2.215980	 -0.670504
 -0.567345	 -2.210786	 -0.677701
 -0.586101	 -2.204683	 -0.680949
 -0.604860	 -2.198565	 -0.684191
 -0.623773	 -2.192298	 -0.685810
 -0.642684	 -2.185861	 -0.685000
 -0.661599	 -2.179427	 -0.684140
 -0.680474	 -2.173127	 -0.682168
 -0.699299	 -2.166922	 -0.679511
 -0.718123	 -2.160732	 -0.676815
 -0.737199	 -2.155732	 -0.673509
 -0.756297	 -2.150869	 -0.670098
 -0.775475	 -2.146417	 -0.666589
 -0.794805	 -2.142921	 -0.662837
 -0.814137	 -2.139438	 -0.659081
 -0.833494	 -2.136396	 -0.655079
 -0.852861	 -2.133656	 -0.650906
 -0.872229	 -2.130917	 -0.646741
 -0.891536	 -2.128535	 -0.642104
 -0.910828	 -2.126231	 -0.637364
 -0.930114	 -2.123961	 -0.632588
 -0.949315	 -2.122188	 -0.627283
 -0.968517	 -2.120419	 -0.621974
 -0.987703	 -2.118685	 -0.616604
 -1.006779	 -2.117198	 -0.610785
 -1.025859	 -2.115709	 -0.604978
 -1.044937	 -2.114222	 -0.599162
 -1.063998	 -2.112907	 -0.593252
 -1.083052	 -2.111611	 -0.587313
 -1.102104	 -2.110312	 -0.581371
 -1.121010	 -2.108823	 -0.575030
 -1.139781	 -2.107160	 -0.568333
 -1.158540	 -2.105503	 -0.561598
 -1.177141	 -2.103732	 -0.554485
 -1.194801	 -2.101419	 -0.545398
 -1.212462	 -2.099108	 -0.536305
 -1.230119	 -2.098030	 -0.526979
 -1.247728	 -2.098092	 -0.517501
 -1.256228	 -2.099504	 -0.513784
 -1.265846	 -2.101101	 -0.509579
