 -1.420352	 -1.460563	 -1.436145
 -1.429817	 -1.474740	 -1.440846
 -1.420282	 -1.458004	 -1.435367
 -1.410565	 -1.441314	 -1.429971
 -1.400546	 -1.424885	 -1.424382
 -1.390262	 -1.408696	 -1.418430
 -1.380044	 -1.392196	 -1.412942
 -1.369580	 -1.375638	 -1.408153
 -1.357997	 -1.359840	 -1.404193
 -1.347411	 -1.343301	 -1.400502
 -1.337007	 -1.326645	 -1.397185
 -1.326950	 -1.310554	 -1.392885
 -1.319399	 -1.295999	 -1.391003
 -1.322540	 -1.273481	 -1.391520
 -1.316371	 -1.245383	 -1.382407
 -1.294297	 -1.230475	 -1.371400
 -1.284621	 -1.220515	 -1.365480
 -1.275022	 -1.207973	 -1.359402
 -1.261551	 -1.187207	 -1.351878
 -1.242692	 -1.170397	 -1.346197
 -1.229846	 -1.160699	 -1.344880
 -1.216471	 -1.151499	 -1.345920
 -1.198885	 -1.136048	 -1.347312
 -1.183292	 -1.120368	 -1.347157
 -1.172454	 -1.104502	 -1.345085
 -1.164846	 -1.085103	 -1.336880
 -1.160659	 -1.071134	 -1.330085
 -1.143382	 -1.053263	 -1.328154
 -1.124995	 -1.041252	 -1.332700
 -1.111162	 -1.027180	 -1.336589
 -1.097842	 -1.011799	 -1.339206
 -1.084953	 -0.996415	 -1.341187
 -1.072478	 -0.980977	 -1.343775
 -1.061963	 -0.964788	 -1.348636
 -1.053493	 -0.948211	 -1.355489
 -1.044906	 -0.931707	 -1.363046
 -1.037341	 -0.914776	 -1.370316
 -1.029897	 -0.897752	 -1.377616
 -1.020883	 -0.882674	 -1.387304
 -1.011293	 -0.868566	 -1.397775
 -1.001709	 -0.854489	 -1.408265
 -0.992173	 -0.840511	 -1.418921
 -0.982823	 -0.826684	 -1.429858
 -0.975030	 -0.814731	 -1.443737
 -0.968649	 -0.804589	 -1.459701
 -0.962359	 -0.794472	 -1.475712
 -0.956596	 -0.785175	 -1.492511
 -0.951613	 -0.775995	 -1.509741
 -0.946443	 -0.766268	 -1.526704
 -0.940148	 -0.755072	 -1.543127
 -0.931824	 -0.743937	 -1.558458
 -0.921018	 -0.731864	 -1.571460
 -0.908634	 -0.718584	 -1.581081
 -0.895541	 -0.703738	 -1.588137
 -0.884018	 -0.686968	 -1.592279
 -0.875599	 -0.674401	 -1.600211
 -0.870301	 -0.666379	 -1.615008
 -0.859749	 -0.656488	 -1.628633
 -0.843562	 -0.637233	 -1.628883
 -0.828744	 -0.617438	 -1.626343
 -0.816915	 -0.608585	 -1.620868
 -0.805768	 -0.601298	 -1.615843
 -0.789735	 -0.587076	 -1.614398
 -0.776183	 -0.578331	 -1.610132
 -0.768144	 -0.566668	 -1.603904
 -0.760969	 -0.543787	 -1.593485
 -0.753316	 -0.515003	 -1.579332
 -0.744248	 -0.501217	 -1.569407
 -0.726474	 -0.484689	 -1.542666
 -0.717510	 -0.482453	 -1.529492
 -0.714539	 -0.477167	 -1.503970
 -0.714839	 -0.475093	 -1.482775
 -0.704471	 -0.479766	 -1.460331
 -0.683033	 -0.485575	 -1.446563
 -0.669233	 -0.490821	 -1.437874
 -0.661515	 -0.495777	 -1.422760
 -0.654760	 -0.502033	 -1.400342
 -0.644303	 -0.505834	 -1.380871
 -0.633687	 -0.505549	 -1.364471
 -0.625150	 -0.501237	 -1.347213
 -0.618563	 -0.502665	 -1.329002
 -0.601289	 -0.505121	 -1.313226
 -0.573895	 -0.496241	 -1.307550
 -0.556456	 -0.487015	 -1.295259
 -0.546331	 -0.484702	 -1.278269
 -0.537318	 -0.475345	 -1.267778
 -0.522374	 -0.466407	 -1.256638
 -0.504470	 -0.444994	 -1.246040
 -0.488974	 -0.433252	 -1.236542
 -0.485791	 -0.419322	 -1.230410
 -0.479308	 -0.401218	 -1.222147
 -0.478926	 -0.381488	 -1.216059
 -0.480201	 -0.367408	 -1.214266
 -0.480766	 -0.345534	 -1.214441
 -0.486068	 -0.322066	 -1.212337
 -0.491474	 -0.293112	 -1.203649
 -0.492035	 -0.279514	 -1.200577
 -0.489832	 -0.262249	 -1.199084
 -0.485746	 -0.239142	 -1.195271
 -0.477067	 -0.216239	 -1.185545
 -0.472200	 -0.200425	 -1.180704
 -0.468108	 -0.187432	 -1.178224
 -0.461942	 -0.169462	 -1.174531
 -0.455893	 -0.149008	 -1.169690
 -0.448252	 -0.118881	 -1.162136
 -0.444533	 -0.108302	 -1.159423
 -0.438974	 -0.096356	 -1.153930
 -0.429623	 -0.065314	 -1.142985
 -0.427569	 -0.050855	 -1.140011
 -0.426459	 -0.038879	 -1.135723
 -0.424226	 -0.018418	 -1.129545
 -0.418625	  0.000646	 -1.121064
 -0.411954	  0.019360	 -1.114745
 -0.404425	  0.041844	 -1.110419
 -0.400021	  0.057025	 -1.108319
 -0.395665	  0.072304	 -1.105501
 -0.384365	  0.101244	 -1.101579
 -0.378351	  0.116703	 -1.101590
 -0.373556	  0.128824	 -1.101122
 -0.361051	  0.153551	 -1.098309
 -0.350108	  0.173999	 -1.093656
 -0.342032	  0.186613	 -1.090708
 -0.328207	  0.207850	 -1.087967
 -0.315993	  0.231321	 -1.084506
 -0.306513	  0.243574	 -1.074953
 -0.299700	  0.251562	 -1.060309
 -0.296526	  0.268872	 -1.050124
 -0.280978	  0.291598	 -1.051718
 -0.258134	  0.309883	 -1.052041
 -0.244780	  0.316602	 -1.046067
 -0.240233	  0.320518	 -1.046325
 -0.232400	  0.345703	 -1.047334
 -0.219793	  0.365160	 -1.031642
 -0.202796	  0.380250	 -1.006423
 -0.188165	  0.391948	 -0.996132
 -0.178074	  0.396981	 -0.991423
 -0.166948	  0.404314	 -0.987494
 -0.150502	  0.433165	 -0.986672
 -0.141411	  0.455973	 -0.985210
 -0.136626	  0.465953	 -0.982641
 -0.119727	  0.481349	 -0.968824
 -0.107259	  0.492412	 -0.957137
 -0.096552	  0.506697	 -0.943505
 -0.083737	  0.518232	 -0.927177
 -0.075487	  0.523339	 -0.917102
 -0.063610	  0.530520	 -0.902391
 -0.045102	  0.547257	 -0.886232
 -0.034168	  0.555668	 -0.880528
 -0.020576	  0.567734	 -0.874723
  0.000652	  0.586095	 -0.865548
  0.010214	  0.592007	 -0.861237
  0.022446	  0.598343	 -0.853883
  0.043962	  0.619629	 -0.838335
  0.053257	  0.636912	 -0.831528
  0.058247	  0.647597	 -0.827427
  0.070245	  0.663907	 -0.819560
  0.082144	  0.679997	 -0.810569
  0.088542	  0.692093	 -0.801625
  0.099224	  0.706998	 -0.791859
  0.111156	  0.722991	 -0.785925
  0.120588	  0.740869	 -0.779688
  0.130910	  0.761622	 -0.768646
  0.139905	  0.773209	 -0.761860
  0.150529	  0.786386	 -0.758435
  0.163008	  0.804982	 -0.755985
  0.174861	  0.821038	 -0.747685
  0.188160	  0.829632	 -0.736587
  0.207528	  0.837344	 -0.726417
  0.226119	  0.849686	 -0.719700
  0.237324	  0.859976	 -0.715565
  0.246896	  0.877826	 -0.712759
  0.263631	  0.892844	 -0.709255
  0.283712	  0.898719	 -0.705684
  0.304915	  0.900770	 -0.700743
  0.325157	  0.910685	 -0.696500
  0.337192	  0.920629	 -0.693896
  0.347506	  0.940113	 -0.691778
  0.368088	  0.956278	 -0.691619
  0.386572	  0.961476	 -0.691310
  0.407791	  0.962282	 -0.690549
  0.428430	  0.968143	 -0.689661
  0.445716	  0.976391	 -0.689783
  0.459413	  0.983090	 -0.688320
  0.481706	  0.990477	 -0.688295
  0.501928	  0.993870	 -0.690030
  0.521647	  0.995273	 -0.693506
  0.541061	  0.998113	 -0.697681
  0.560300	  1.001344	 -0.702075
  0.579292	  1.004874	 -0.706955
  0.598018	  1.009212	 -0.712737
  0.616477	  1.013713	 -0.718736
  0.633638	  1.016961	 -0.727339
  0.650190	  1.020513	 -0.737836
  0.666869	  1.024528	 -0.748904
  0.685360	  1.025069	 -0.759161
  0.703382	  1.023496	 -0.768947
  0.720817	  1.019539	 -0.778763
  0.737048	  1.017234	 -0.789117
  0.751815	  1.014838	 -0.801645
  0.766039	  1.014294	 -0.816150
  0.779094	  1.012059	 -0.831284
  0.791288	  1.009577	 -0.846619
  0.803475	  1.008317	 -0.861486
  0.815615	  1.008258	 -0.872031
  0.836382	  1.010365	 -0.875723
  0.863719	  1.016622	 -0.886973
  0.874874	  1.018454	 -0.907114
  0.878634	  1.019489	 -0.921857
  0.885834	  1.029308	 -0.937426
  0.893789	  1.044175	 -0.951948
  0.898231	  1.057534	 -0.966292
  0.900552	  1.065740	 -0.976256
  0.905094	  1.076859	 -0.985723
  0.916117	  1.093317	 -0.984554
  0.933124	  1.111409	 -0.981026
  0.944041	  1.123806	 -0.978796
  0.952525	  1.141364	 -0.981217
  0.955415	  1.160213	 -0.988245
  0.958277	  1.182633	 -1.000503
  0.957877	  1.204626	 -0.998976
  0.955207	  1.219469	 -0.989964
  0.953908	  1.238780	 -0.978172
  0.953372	  1.257888	 -0.977355
  0.953162	  1.280831	 -0.984925
  0.951483	  1.306824	 -0.983481
  0.950776	  1.318353	 -0.978397
  0.949317	  1.337021	 -0.966601
  0.948236	  1.355670	 -0.958069
  0.946784	  1.371665	 -0.949933
  0.944866	  1.401528	 -0.943576
  0.944409	  1.417405	 -0.944330
  0.943562	  1.434707	 -0.945027
  0.942741	  1.452953	 -0.940123
  0.941823	  1.470602	 -0.934494
  0.938799	  1.488031	 -0.922844
  0.936114	  1.511091	 -0.914220
  0.931179	  1.531601	 -0.907163
  0.924440	  1.538067	 -0.891835
  0.917575	  1.540965	 -0.871083
  0.905095	  1.544884	 -0.853272
  0.892492	  1.550184	 -0.838073
  0.880113	  1.555925	 -0.823394
  0.867769	  1.560996	 -0.808501
  0.855490	  1.564708	 -0.793161
  0.843220	  1.568321	 -0.777789
  0.831172	  1.571996	 -0.762285
  0.822100	  1.576521	 -0.745074
  0.813932	  1.581271	 -0.727451
  0.805818	  1.586034	 -0.709802
  0.797710	  1.590799	 -0.692153
  0.789847	  1.595640	 -0.674441
  0.785394	  1.601542	 -0.655907
  0.784248	  1.608265	 -0.637129
  0.783338	  1.615045	 -0.618337
  0.782437	  1.621824	 -0.599546
  0.781824	  1.628516	 -0.580756
  0.785522	  1.633886	 -0.562074
  0.797663	  1.635659	 -0.546505
  0.810412	  1.637164	 -0.531187
  0.823180	  1.638664	 -0.515870
  0.836159	  1.640086	 -0.500762
  0.851900	  1.640478	 -0.488487
  0.868358	  1.640561	 -0.477130
  0.884858	  1.640625	 -0.465830
  0.901412	  1.640670	 -0.454624
  0.918171	  1.640852	 -0.443673
  0.934288	  1.644081	 -0.432316
  0.950188	  1.648853	 -0.421171
  0.966229	  1.653666	 -0.410229
  0.982266	  1.658479	 -0.399291
  0.998300	  1.663296	 -0.388355
  1.014260	  1.668401	 -0.377494
  1.029175	  1.677296	 -0.367639
  1.043826	  1.686861	 -0.358032
  1.058027	  1.697213	 -0.349968
  1.072608	  1.710785	 -0.346815
  1.083645	  1.723249	 -0.338472
  1.094058	  1.733050	 -0.322236
  1.111938	  1.750075	 -0.317653
  1.125396	  1.764939	 -0.315094
  1.132675	  1.774135	 -0.310118
  1.148675	  1.788004	 -0.298205
  1.161468	  1.797899	 -0.290103
  1.176301	  1.810833	 -0.280475
  1.187895	  1.823998	 -0.271611
  1.199717	  1.840264	 -0.267377
  1.215126	  1.859081	 -0.265855
  1.226823	  1.873554	 -0.264258
  1.239478	  1.890899	 -0.258187
  1.256921	  1.905633	 -0.245558
  1.259620	  1.909687	 -0.242877
  1.273327	  1.926541	 -0.231046
  1.288811	  1.950068	 -0.224285
  1.297449	  1.962443	 -0.222356
  1.307236	  1.973746	 -0.221083
  1.324079	  1.992373	 -0.208249
  1.326394	  1.992770	 -0.175111
  1.338170	  2.006623	 -0.166779
