  1.405023	 -1.501564	  1.533935
  1.416049	 -1.502599	  1.526917
  1.401509	 -1.510126	  1.544501
  1.384540	 -1.508064	  1.555679
  1.368213	 -1.503059	  1.561762
  1.348817	 -1.500724	  1.570791
  1.329911	 -1.495767	  1.578109
  1.310869	 -1.489102	  1.584511
  1.293178	 -1.485618	  1.592145
  1.277096	 -1.482065	  1.598311
  1.256716	 -1.476327	  1.605089
  1.237428	 -1.472511	  1.613042
  1.222847	 -1.470796	  1.618996
  1.204239	 -1.466188	  1.623945
  1.180301	 -1.460566	  1.632092
  1.167194	 -1.458539	  1.636950
  1.149682	 -1.455583	  1.642276
  1.124416	 -1.448471	  1.649484
  1.108190	 -1.446617	  1.656299
  1.093540	 -1.443918	  1.661997
  1.070339	 -1.436911	  1.670424
  1.050641	 -1.433273	  1.682775
  1.038862	 -1.433597	  1.694162
  1.024529	 -1.434516	  1.700474
  1.001836	 -1.431091	  1.707227
  0.982901	 -1.428136	  1.714562
  0.964665	 -1.425273	  1.722275
  0.946908	 -1.422271	  1.731000
  0.928642	 -1.420972	  1.739042
  0.909954	 -1.421714	  1.746128
  0.891338	 -1.422151	  1.753426
  0.873023	 -1.421413	  1.761427
  0.854708	 -1.420675	  1.769429
  0.836436	 -1.419643	  1.777494
  0.818513	 -1.416694	  1.785864
  0.800591	 -1.413744	  1.794236
  0.782733	 -1.410820	  1.802754
  0.765006	 -1.407954	  1.811561
  0.747285	 -1.405096	  1.820380
  0.730380	 -1.402924	  1.830842
  0.713517	 -1.400787	  1.841382
  0.696962	 -1.398287	  1.852320
  0.680814	 -1.395332	  1.863745
  0.664665	 -1.392381	  1.875169
  0.648638	 -1.388508	  1.886490
  0.632710	 -1.384046	  1.897732
  0.616780	 -1.379593	  1.908975
  0.600886	 -1.374277	  1.919888
  0.585010	 -1.368721	  1.930709
  0.569125	 -1.363138	  1.941504
  0.553086	 -1.356922	  1.951708
  0.537045	 -1.350706	  1.961898
  0.521175	 -1.344442	  1.972035
  0.506885	 -1.337431	  1.983777
  0.493514	 -1.329906	  1.997811
  0.478728	 -1.323717	  2.009745
  0.465700	 -1.319499	  2.021925
  0.447295	 -1.314580	  2.040311
  0.429024	 -1.313291	  2.047611
  0.409752	 -1.313254	  2.049978
  0.389396	 -1.310685	  2.053167
  0.371923	 -1.299710	  2.062290
  0.361482	 -1.282746	  2.075321
  0.346186	 -1.269484	  2.091310
  0.329103	 -1.269319	  2.101919
  0.314166	 -1.271109	  2.106834
  0.293383	 -1.265667	  2.111061
  0.274673	 -1.259608	  2.120358
  0.258147	 -1.253269	  2.129922
  0.241239	 -1.247333	  2.138782
  0.223935	 -1.243752	  2.148066
  0.206719	 -1.243113	  2.158266
  0.189751	 -1.244264	  2.168794
  0.173136	 -1.244987	  2.179904
  0.156717	 -1.245478	  2.191313
  0.140298	 -1.245969	  2.202723
  0.124122	 -1.245394	  2.214470
  0.107953	 -1.244812	  2.226216
  0.091787	 -1.244184	  2.237916
  0.075337	 -1.242868	  2.249214
