  2.377586	  0.559694	  0.054823
  2.418986	  0.559153	  0.050360
  2.285377	  0.560899	  0.064761
  2.161248	  0.589068	  0.132021
  2.108900	  0.629088	  0.198063
  2.093499	  0.665912	  0.253899
  2.094141	  0.699806	  0.302846
  2.101419	  0.733027	  0.346143
  2.110313	  0.763948	  0.385395
  2.116717	  0.792863	  0.423646
  2.118037	  0.819253	  0.462585
  2.114225	  0.842219	  0.501352
  2.106030	  0.862497	  0.540666
  2.094736	  0.881584	  0.580716
  2.081602	  0.899926	  0.622006
  2.067058	  0.917919	  0.665846
  2.050037	  0.935110	  0.710606
  2.030302	  0.952690	  0.755607
  2.010616	  0.971134	  0.798810
  1.990994	  0.991924	  0.842530
  1.971267	  1.017861	  0.887158
  1.954468	  1.046163	  0.927201
  1.937224	  1.079306	  0.967175
  1.916301	  1.135442	  1.026204
  1.912410	  1.150133	  1.041592
