 -2.062018	 -1.049370	 -1.095580
 -2.062496	 -1.050940	 -1.120142
 -2.062126	 -1.049669	 -1.100186
 -2.062578	 -1.048544	 -1.080223
 -2.063339	 -1.047501	 -1.060266
 -2.064036	 -1.047482	 -1.040279
 -2.064666	 -1.048041	 -1.020299
 -2.064141	 -1.049503	 -1.000361
 -2.063284	 -1.051224	 -0.980455
 -2.061812	 -1.053149	 -0.960649
 -2.059978	 -1.054473	 -0.941375
 -2.059107	 -1.050164	 -0.922104
 -2.059373	 -1.045644	 -0.899087
 -2.056049	 -1.050039	 -0.882855
 -2.047948	 -1.069523	 -0.869543
 -2.041027	 -1.081015	 -0.844830
 -2.036934	 -1.079811	 -0.823681
 -2.037055	 -1.071187	 -0.799504
 -2.040962	 -1.066458	 -0.778569
 -2.038803	 -1.072615	 -0.757340
 -2.035112	 -1.080883	 -0.742298
 -2.027202	 -1.097754	 -0.732123
 -2.016780	 -1.118690	 -0.721402
 -2.004260	 -1.134576	 -0.702846
 -1.993407	 -1.139409	 -0.688502
 -1.992497	 -1.143658	 -0.666797
 -1.998257	 -1.146117	 -0.642883
 -1.999479	 -1.148293	 -0.629315
 -2.001549	 -1.153922	 -0.611467
 -2.006090	 -1.165508	 -0.591719
 -2.008809	 -1.175215	 -0.577115
 -2.013260	 -1.185774	 -0.565452
 -2.018647	 -1.202388	 -0.550040
 -2.024339	 -1.215604	 -0.533625
 -2.029321	 -1.226209	 -0.519455
 -2.036848	 -1.238341	 -0.507951
 -2.047420	 -1.255160	 -0.497681
 -2.058988	 -1.271162	 -0.487577
 -2.066563	 -1.282510	 -0.478887
 -2.078661	 -1.300533	 -0.468143
 -2.084209	 -1.318534	 -0.451569
 -2.084175	 -1.332419	 -0.436725
 -2.081717	 -1.348764	 -0.426501
 -2.081878	 -1.367023	 -0.413518
 -2.074103	 -1.383334	 -0.390348
 -2.059379	 -1.390475	 -0.377373
 -2.043085	 -1.400000	 -0.365178
 -2.033065	 -1.414268	 -0.352613
 -2.022586	 -1.424974	 -0.344090
 -2.010741	 -1.434797	 -0.335869
 -1.994547	 -1.447439	 -0.320314
 -1.986421	 -1.461066	 -0.306757
 -1.983931	 -1.472175	 -0.296742
 -1.978118	 -1.487713	 -0.280451
 -1.964943	 -1.502767	 -0.263194
 -1.954204	 -1.509983	 -0.253032
 -1.944689	 -1.513886	 -0.240419
 -1.931841	 -1.520318	 -0.222510
 -1.917545	 -1.524630	 -0.206589
 -1.909365	 -1.528621	 -0.193617
 -1.900199	 -1.537534	 -0.171863
 -1.887950	 -1.545900	 -0.153626
 -1.877451	 -1.548976	 -0.142189
 -1.862128	 -1.549504	 -0.135626
 -1.843353	 -1.554265	 -0.126673
 -1.827199	 -1.557569	 -0.112299
 -1.811484	 -1.560756	 -0.099045
 -1.798168	 -1.563058	 -0.083892
 -1.787316	 -1.564557	 -0.067046
 -1.779331	 -1.562612	 -0.049012
 -1.774918	 -1.557287	 -0.031838
 -1.773410	 -1.545507	 -0.014146
 -1.768382	 -1.534652	  0.005086
 -1.761024	 -1.533603	  0.024802
 -1.751233	 -1.542975	  0.043710
 -1.741207	 -1.545700	  0.065351
 -1.734394	 -1.538883	  0.081538
 -1.730664	 -1.522770	  0.095679
 -1.730776	 -1.504271	  0.111038
 -1.724474	 -1.496595	  0.131702
 -1.717759	 -1.497779	  0.145428
 -1.711413	 -1.496363	  0.165048
 -1.703189	 -1.487542	  0.182734
 -1.698497	 -1.476195	  0.197957
 -1.691516	 -1.470501	  0.216346
 -1.686759	 -1.461613	  0.245967
 -1.686288	 -1.459317	  0.261682
 -1.685057	 -1.458550	  0.275405
 -1.677215	 -1.450519	  0.298426
 -1.672720	 -1.438757	  0.317013
 -1.671969	 -1.431488	  0.330537
 -1.670627	 -1.420779	  0.352289
 -1.667256	 -1.408209	  0.369985
 -1.664132	 -1.397074	  0.383281
 -1.664637	 -1.382637	  0.396419
 -1.669547	 -1.365829	  0.408908
 -1.674542	 -1.342261	  0.427653
 -1.673486	 -1.332513	  0.438714
 -1.670391	 -1.322656	  0.454999
 -1.668394	 -1.317027	  0.470090
 -1.661838	 -1.309683	  0.498942
 -1.658591	 -1.301766	  0.517313
 -1.656446	 -1.296839	  0.528005
 -1.651744	 -1.287574	  0.549607
 -1.643983	 -1.283211	  0.565342
 -1.637649	 -1.285152	  0.580098
 -1.631353	 -1.288145	  0.596405
 -1.624021	 -1.289947	  0.621063
 -1.618215	 -1.290628	  0.642142
 -1.614711	 -1.288987	  0.658972
 -1.610611	 -1.285558	  0.681202
 -1.609281	 -1.285276	  0.695453
 -1.609128	 -1.286390	  0.720157
 -1.601948	 -1.291104	  0.742142
 -1.595641	 -1.295603	  0.752847
 -1.586525	 -1.302670	  0.763702
 -1.570121	 -1.314740	  0.784758
 -1.558535	 -1.317590	  0.803170
 -1.549352	 -1.317297	  0.822324
 -1.543630	 -1.316463	  0.836205
 -1.539024	 -1.316951	  0.858579
 -1.534625	 -1.315273	  0.882002
 -1.530968	 -1.312544	  0.899061
 -1.525131	 -1.310656	  0.919948
 -1.516658	 -1.314417	  0.946366
 -1.513216	 -1.318161	  0.957921
 -1.508291	 -1.329056	  0.972269
 -1.505596	 -1.337623	  0.992350
 -1.500347	 -1.341550	  1.013178
 -1.495630	 -1.344292	  1.032516
 -1.491223	 -1.346809	  1.051863
 -1.486835	 -1.349311	  1.071205
 -1.483065	 -1.351357	  1.090501
 -1.484121	 -1.351387	  1.109518
 -1.488774	 -1.349273	  1.130212
 -1.485753	 -1.344026	  1.151635
 -1.470065	 -1.342519	  1.171378
 -1.456090	 -1.347149	  1.193163
 -1.452877	 -1.353021	  1.208771
 -1.452761	 -1.360002	  1.225903
 -1.451088	 -1.361662	  1.247496
 -1.446081	 -1.360422	  1.267237
 -1.442157	 -1.358582	  1.286260
 -1.441379	 -1.359438	  1.305454
 -1.440905	 -1.360973	  1.326263
 -1.436529	 -1.361654	  1.346942
 -1.430837	 -1.361260	  1.366412
 -1.428159	 -1.360164	  1.384361
 -1.427000	 -1.360934	  1.405176
 -1.421996	 -1.361226	  1.425570
 -1.415310	 -1.360921	  1.444619
 -1.411184	 -1.361951	  1.461870
 -1.406813	 -1.364044	  1.483076
 -1.398730	 -1.364081	  1.503345
 -1.392209	 -1.364195	  1.518923
 -1.387260	 -1.368097	  1.536744
 -1.376676	 -1.376492	  1.564339
 -1.367359	 -1.378135	  1.576135
 -1.351567	 -1.377732	  1.593264
 -1.339100	 -1.368936	  1.634520
 -1.331979	 -1.370666	  1.653129
