  2.374347	  0.710857	  0.006456
  2.415747	  0.710316	  0.001993
  2.395871	  0.710971	  0.004161
  2.376023	  0.711084	  0.006031
  2.356258	  0.710339	  0.005266
  2.335678	  0.707856	  0.001504
  2.314435	  0.706401	  0.003030
  2.296002	  0.707784	  0.007411
  2.273582	  0.709696	  0.009738
  2.250188	  0.707682	  0.013482
  2.232403	  0.712418	  0.027731
  2.223920	  0.725058	  0.045914
  2.211079	  0.736436	  0.063123
  2.197392	  0.742104	  0.073920
  2.188339	  0.748311	  0.082087
  2.173864	  0.759154	  0.099435
  2.163091	  0.764991	  0.110943
  2.156142	  0.770134	  0.119489
  2.144468	  0.781667	  0.136428
  2.133305	  0.788840	  0.153248
  2.125607	  0.794347	  0.165069
  2.125471	  0.813713	  0.190316
  2.129895	  0.823043	  0.205941
  2.132885	  0.826659	  0.210442
  2.148120	  0.844785	  0.224261
  2.154446	  0.860595	  0.243410
  2.154446	  0.868987	  0.263498
  2.143099	  0.880675	  0.282424
  2.138463	  0.893973	  0.293723
  2.142343	  0.911278	  0.312696
  2.146582	  0.919081	  0.320396
  2.160060	  0.932944	  0.335057
  2.165266	  0.948455	  0.357413
  2.162925	  0.958105	  0.374947
  2.159087	  0.965010	  0.386767
  2.155434	  0.981786	  0.407790
  2.152839	  0.992330	  0.425538
  2.148373	  0.999484	  0.442442
  2.142473	  1.008673	  0.461739
  2.138180	  1.017592	  0.478866
  2.135185	  1.026238	  0.492953
  2.134632	  1.039683	  0.512119
  2.130731	  1.044499	  0.529522
  2.124199	  1.048965	  0.545887
  2.116193	  1.052443	  0.571640
  2.106786	  1.055401	  0.591617
  2.096545	  1.061460	  0.604125
  2.084348	  1.072143	  0.617249
  2.079831	  1.079241	  0.634827
  2.077259	  1.081371	  0.652132
  2.067722	  1.082979	  0.671703
  2.049970	  1.095023	  0.700720
  2.047964	  1.098716	  0.705997
  2.041504	  1.106068	  0.717766
  2.028890	  1.120504	  0.743269
  2.023776	  1.127654	  0.754733
  2.018574	  1.135438	  0.768404
  2.011828	  1.147630	  0.790228
  2.007745	  1.157086	  0.806131
  2.005422	  1.169512	  0.826007
  2.004330	  1.177797	  0.839025
  2.001455	  1.186395	  0.854608
  1.992766	  1.203986	  0.866420
  1.982473	  1.218272	  0.877488
  1.975315	  1.227845	  0.894731
  1.969903	  1.235909	  0.911462
  1.963601	  1.250641	  0.927654
  1.957648	  1.271311	  0.949179
  1.954050	  1.284896	  0.963409
