  1.954582	 -0.016120	 -1.593888
  1.990114	  0.000190	 -1.605386
  1.972700	 -0.007710	 -1.599528
  1.955309	 -0.015509	 -1.593466
  1.937918	 -0.023308	 -1.587404
  1.920574	 -0.030811	 -1.580856
  1.903235	 -0.038283	 -1.574259
  1.885858	 -0.045628	 -1.567619
  1.868366	 -0.052570	 -1.560847
  1.850875	 -0.059511	 -1.554074
  1.833345	 -0.066147	 -1.547098
  1.815779	 -0.072428	 -1.539887
  1.798214	 -0.078708	 -1.532676
  1.780604	 -0.084371	 -1.525070
  1.762980	 -0.089643	 -1.517223
  1.745355	 -0.094916	 -1.509376
  1.727669	 -0.099264	 -1.501113
  1.709966	 -0.102939	 -1.492562
  1.692264	 -0.106614	 -1.484011
  1.674575	 -0.109670	 -1.475192
  1.656981	 -0.111422	 -1.465845
  1.639386	 -0.113174	 -1.456498
  1.621828	 -0.114780	 -1.447058
  1.604402	 -0.115883	 -1.437305
  1.586975	 -0.116987	 -1.427553
  1.569452	 -0.118604	 -1.418050
  1.551886	 -0.120469	 -1.408671
  1.534170	 -0.122342	 -1.399581
  1.516198	 -0.124229	 -1.391009
  1.498227	 -0.126115	 -1.382438
  1.480393	 -0.126901	 -1.373419
  1.462622	 -0.127303	 -1.364252
  1.444852	 -0.127704	 -1.355085
  1.427715	 -0.126048	 -1.344906
  1.411161	 -0.122980	 -1.334111
  1.394607	 -0.119912	 -1.323315
  1.378052	 -0.116845	 -1.312520
  1.364290	 -0.109935	 -1.299758
  1.350769	 -0.102761	 -1.286885
  1.337248	 -0.095586	 -1.274012
  1.323917	 -0.088238	 -1.261039
  1.313648	 -0.078516	 -1.246896
  1.303380	 -0.068794	 -1.232753
  1.293111	 -0.059072	 -1.218610
  1.283908	 -0.050130	 -1.203268
  1.274974	 -0.041388	 -1.187655
  1.265970	 -0.034693	 -1.171100
  1.256971	 -0.028934	 -1.154192
  1.248141	 -0.023775	 -1.137004
  1.239531	 -0.019353	 -1.119503
  1.230920	 -0.014930	 -1.102002
  1.222314	 -0.010506	 -1.084498
  1.213947	 -0.006010	 -1.066898
  1.205581	 -0.001514	 -1.049297
  1.197214	  0.002982	 -1.031696
  1.188667	  0.007445	 -1.014174
  1.179517	  0.011795	 -0.996930
  1.170367	  0.016145	 -0.979686
  1.158110	  0.011083	 -0.964715
  1.145506	  0.003082	 -0.951405
  1.132903	 -0.004919	 -0.938096
  1.120299	 -0.012920	 -0.924787
  1.107732	 -0.019950	 -0.910907
  1.095210	 -0.026341	 -0.896682
  1.082688	 -0.032732	 -0.882457
  1.070166	 -0.039124	 -0.868232
  1.057644	 -0.045515	 -0.854007
  1.045122	 -0.051906	 -0.839782
  1.032600	 -0.058297	 -0.825557
  1.021142	 -0.062012	 -0.809591
  1.010517	 -0.063993	 -0.792763
  0.999893	 -0.065974	 -0.775934
  0.989268	 -0.067954	 -0.759106
  0.978643	 -0.069935	 -0.742278
  0.968018	 -0.071916	 -0.725449
  0.957743	 -0.074183	 -0.708441
  0.948981	 -0.077622	 -0.690795
  0.940219	 -0.081060	 -0.673148
  0.931457	 -0.084499	 -0.655501
  0.913890	 -0.094057	 -0.655684
  0.897593	 -0.103423	 -0.662517
  0.881297	 -0.112790	 -0.669350
  0.865000	 -0.122156	 -0.676184
  0.848704	 -0.131522	 -0.683017
  0.832407	 -0.140889	 -0.689850
  0.816110	 -0.150255	 -0.696683
  0.799814	 -0.159622	 -0.703516
  0.783517	 -0.168988	 -0.710349
  0.767220	 -0.178354	 -0.717182
  0.750924	 -0.187721	 -0.724015
  0.734627	 -0.197087	 -0.730849
  0.718331	 -0.206453	 -0.737682
  0.702034	 -0.215820	 -0.744515
  0.685737	 -0.225186	 -0.751348
  0.669441	 -0.234552	 -0.758181
  0.653144	 -0.243919	 -0.765014
  0.636848	 -0.253285	 -0.771847
  0.620551	 -0.262652	 -0.778681
  0.604254	 -0.272018	 -0.785514
  0.587958	 -0.281384	 -0.792347
  0.571661	 -0.290751	 -0.799180
  0.555365	 -0.300117	 -0.806013
  0.539068	 -0.309483	 -0.812846
  0.522771	 -0.318850	 -0.819679
  0.506475	 -0.328216	 -0.826513
  0.490178	 -0.337583	 -0.833346
  0.473882	 -0.346949	 -0.840179
  0.455592	 -0.355016	 -0.840822
  0.437162	 -0.362771	 -0.840391
  0.418731	 -0.370525	 -0.839960
  0.400301	 -0.378280	 -0.839529
  0.381711	 -0.385486	 -0.837947
  0.363030	 -0.391610	 -0.834274
  0.344348	 -0.397735	 -0.830602
  0.325727	 -0.403835	 -0.826594
  0.307461	 -0.409793	 -0.821039
  0.289196	 -0.415752	 -0.815485
  0.271241	 -0.421965	 -0.809236
  0.253496	 -0.428331	 -0.802561
  0.235820	 -0.434784	 -0.795785
  0.218619	 -0.441792	 -0.788366
  0.201419	 -0.448799	 -0.780947
  0.184644	 -0.456341	 -0.773090
  0.168125	 -0.464182	 -0.764988
  0.151650	 -0.472100	 -0.756872
  0.135461	 -0.480499	 -0.748662
  0.119273	 -0.488898	 -0.740453
  0.102946	 -0.497344	 -0.732575
  0.086532	 -0.505820	 -0.724908
  0.070049	 -0.514239	 -0.717332
  0.053178	 -0.522332	 -0.710268
  0.036308	 -0.530426	 -0.703204
  0.019265	 -0.537949	 -0.695929
  0.002159	 -0.545246	 -0.688572
 -0.014949	 -0.552309	 -0.680993
 -0.032035	 -0.558656	 -0.672761
 -0.049122	 -0.565003	 -0.664529
 -0.066103	 -0.570776	 -0.655679
 -0.083054	 -0.576407	 -0.646683
 -0.099914	 -0.581862	 -0.637408
 -0.116593	 -0.586987	 -0.627635
 -0.133273	 -0.592113	 -0.617861
 -0.149794	 -0.596983	 -0.607696
 -0.166299	 -0.601829	 -0.597493
 -0.182890	 -0.606601	 -0.587395
 -0.199615	 -0.611255	 -0.577464
 -0.216340	 -0.615908	 -0.567534
 -0.233180	 -0.620363	 -0.557707
 -0.250051	 -0.624763	 -0.547909
 -0.266915	 -0.629130	 -0.538084
 -0.283746	 -0.633351	 -0.528138
 -0.300577	 -0.637572	 -0.518193
 -0.317376	 -0.641818	 -0.508205
 -0.334159	 -0.646076	 -0.498195
 -0.350956	 -0.650358	 -0.488219
 -0.367806	 -0.654743	 -0.478379
 -0.384657	 -0.659128	 -0.468538
 -0.401754	 -0.663538	 -0.459145
 -0.418948	 -0.667957	 -0.449933
 -0.436271	 -0.672390	 -0.440976
 -0.454052	 -0.676865	 -0.432986
 -0.471832	 -0.681341	 -0.424996
 -0.490018	 -0.685670	 -0.417888
 -0.508411	 -0.689914	 -0.411278
 -0.526803	 -0.694159	 -0.404668
 -0.545580	 -0.698398	 -0.399239
 -0.564384	 -0.702637	 -0.393906
 -0.583267	 -0.706873	 -0.388856
 -0.602393	 -0.711088	 -0.384807
 -0.621520	 -0.715304	 -0.380757
 -0.640779	 -0.719412	 -0.377263
 -0.660146	 -0.723419	 -0.374284
 -0.679513	 -0.727425	 -0.371305
 -0.698935	 -0.731353	 -0.368593
 -0.718365	 -0.735269	 -0.365922
 -0.737777	 -0.739253	 -0.363220
 -0.757146	 -0.743390	 -0.360444
 -0.776516	 -0.747527	 -0.357669
 -0.795732	 -0.752200	 -0.354686
 -0.814910	 -0.757000	 -0.351654
 -0.833964	 -0.762114	 -0.348370
 -0.852777	 -0.767784	 -0.344639
 -0.871590	 -0.773454	 -0.340908
 -0.889730	 -0.780005	 -0.335613
 -0.907806	 -0.786626	 -0.330189
 -0.925504	 -0.793588	 -0.324002
 -0.942736	 -0.800914	 -0.316974
 -0.959968	 -0.808240	 -0.309946
 -0.976611	 -0.815978	 -0.302000
 -0.993236	 -0.823728	 -0.294029
 -1.009734	 -0.831397	 -0.285722
 -1.026056	 -0.838957	 -0.276979
 -1.042378	 -0.846517	 -0.268235
 -1.058824	 -0.853105	 -0.258955
 -1.075278	 -0.859614	 -0.249633
 -1.091680	 -0.865563	 -0.239856
 -1.108012	 -0.870974	 -0.229660
 -1.124239	 -0.876383	 -0.219294
 -1.139548	 -0.881752	 -0.207598
 -1.154857	 -0.887121	 -0.195902
 -1.169438	 -0.893655	 -0.183872
 -1.183549	 -0.900869	 -0.171672
 -1.197489	 -0.908409	 -0.159474
 -1.209914	 -0.918452	 -0.147442
 -1.222339	 -0.928495	 -0.135410
 -1.236307	 -0.937709	 -0.124455
 -1.252938	 -0.944951	 -0.116032
 -1.269570	 -0.952192	 -0.107609
 -1.285442	 -0.960818	 -0.099026
 -1.300830	 -0.970220	 -0.090376
 -1.316217	 -0.979622	 -0.081726
 -1.335719	 -0.981985	 -0.077969
 -1.355351	 -0.983803	 -0.074611
 -1.374977	 -0.985727	 -0.071277
 -1.394552	 -0.988317	 -0.068100
 -1.414128	 -0.990906	 -0.064923
 -1.433522	 -0.994271	 -0.061383
 -1.452705	 -0.998384	 -0.057494
 -1.471887	 -1.002498	 -0.053606
 -1.490305	 -1.008234	 -0.048325
 -1.508712	 -1.013988	 -0.043028
 -1.527022	 -1.019935	 -0.037610
 -1.545246	 -1.026049	 -0.032086
 -1.563483	 -1.032169	 -0.026612
 -1.581794	 -1.038329	 -0.021437
 -1.600104	 -1.044488	 -0.016262
 -1.618427	 -1.050741	 -0.011244
 -1.636753	 -1.057025	 -0.006277
 -1.654954	 -1.063460	 -0.001051
 -1.672791	 -1.070295	  0.004877
 -1.690627	 -1.077129	  0.010805
 -1.708052	 -1.084342	  0.017464
 -1.725324	 -1.091684	  0.024377
 -1.742515	 -1.099017	  0.031496
 -1.759420	 -1.106317	  0.039303
 -1.776324	 -1.113618	  0.047110
 -1.793071	 -1.120840	  0.055318
 -1.809750	 -1.128030	  0.063692
 -1.826439	 -1.135180	  0.072079
 -1.843178	 -1.142129	  0.080537
 -1.859916	 -1.149078	  0.088995
 -1.876773	 -1.155711	  0.097472
 -1.893699	 -1.162152	  0.105958
 -1.910634	 -1.168537	  0.114468
 -1.927628	 -1.174557	  0.123127
 -1.944623	 -1.180576	  0.131785
 -1.961577	 -1.186502	  0.140584
 -1.978509	 -1.192373	  0.149464
 -1.995449	 -1.198245	  0.158326
 -2.012424	 -1.204119	  0.167122
 -2.029398	 -1.209992	  0.175919
 -2.046374	 -1.216149	  0.184516
 -2.063350	 -1.222378	  0.193061
 -2.080407	 -1.228974	  0.201157
 -2.097580	 -1.236255	  0.208373
 -2.114753	 -1.243536	  0.215589
 -2.131926	 -1.250817	  0.222805
 -2.149715	 -1.259000	  0.230375
 -2.166310	 -1.267533	  0.237570
