 -2.257542	  0.789202	 -0.688412
 -2.261869	  0.793663	 -0.680375
 -2.266196	  0.798124	 -0.672338
 -2.260822	  0.792118	 -0.692417
 -2.251085	  0.782389	 -0.705515
 -2.242350	  0.772262	 -0.720107
 -2.236025	  0.761915	 -0.736407
 -2.227579	  0.751384	 -0.754042
 -2.217948	  0.742227	 -0.767671
 -2.206914	  0.732145	 -0.780636
 -2.197514	  0.721948	 -0.795431
 -2.186198	  0.714599	 -0.810207
 -2.176211	  0.705067	 -0.825243
 -2.165420	  0.697116	 -0.838056
 -2.155270	  0.687272	 -0.853884
 -2.147597	  0.675765	 -0.870346
 -2.137332	  0.667591	 -0.885751
 -2.124333	  0.663317	 -0.897449
 -2.110770	  0.656278	 -0.914282
 -2.103267	  0.647149	 -0.930041
 -2.096178	  0.637459	 -0.945049
 -2.086762	  0.628868	 -0.961157
 -2.080312	  0.618189	 -0.977198
 -2.075380	  0.606560	 -0.993268
 -2.067264	  0.597359	 -1.009303
 -2.059524	  0.588281	 -1.024183
 -2.054487	  0.576024	 -1.040265
 -2.046443	  0.567088	 -1.056371
 -2.039434	  0.557280	 -1.071509
 -2.035336	  0.544271	 -1.087963
 -2.029701	  0.534479	 -1.103310
 -2.024813	  0.523108	 -1.118474
 -2.020222	  0.510533	 -1.134562
 -2.013438	  0.500533	 -1.150847
 -2.007877	  0.489999	 -1.165517
 -2.000673	  0.478232	 -1.182818
 -1.994580	  0.468838	 -1.197727
 -1.989787	  0.457573	 -1.212391
 -1.981567	  0.446209	 -1.230725
 -1.976456	  0.437351	 -1.244847
 -1.970935	  0.425609	 -1.261007
 -1.966296	  0.414720	 -1.276137
 -1.961107	  0.403515	 -1.292842
 -1.955608	  0.394287	 -1.309716
 -1.950106	  0.385066	 -1.326589
 -1.943417	  0.377712	 -1.343943
 -1.936709	  0.370592	 -1.361296
 -1.931066	  0.365008	 -1.379069
 -1.925282	  0.359807	 -1.398526
 -1.919008	  0.357235	 -1.416390
 -1.905149	  0.355859	 -1.435914
 -1.895703	  0.350658	 -1.448854
 -1.889195	  0.344979	 -1.467158
 -1.881260	  0.340892	 -1.485998
 -1.869897	  0.336565	 -1.503789
 -1.860544	  0.329627	 -1.518864
 -1.852039	  0.320573	 -1.534531
 -1.842789	  0.314349	 -1.551410
 -1.833325	  0.306231	 -1.567262
 -1.824878	  0.295807	 -1.582057
 -1.815938	  0.287750	 -1.597947
 -1.806761	  0.280032	 -1.614224
 -1.799354	  0.269878	 -1.629193
 -1.792727	  0.259556	 -1.645107
 -1.785474	  0.250355	 -1.662296
 -1.774510	  0.237897	 -1.676140
 -1.764251	  0.226236	 -1.690029
 -1.756624	  0.219955	 -1.701981
 -1.747258	  0.210010	 -1.719427
 -1.738923	  0.200899	 -1.735450
 -1.731010	  0.191904	 -1.751618
 -1.723443	  0.183400	 -1.768062
 -1.715876	  0.174896	 -1.784507
 -1.708217	  0.166287	 -1.801160
 -1.698257	  0.154926	 -1.823714
 -1.691092	  0.146658	 -1.840456
 -1.683927	  0.138390	 -1.857198
