  1.412126	 -1.692885	  1.114353
  1.412596	 -1.712470	  1.104803
  1.411969	 -1.686366	  1.117532
  1.410166	 -1.637956	  1.139776
  1.402701	 -1.589958	  1.163711
  1.391681	 -1.545383	  1.186567
  1.376676	 -1.502086	  1.208588
  1.358853	 -1.460446	  1.229072
  1.343820	 -1.420298	  1.248216
  1.331433	 -1.378321	  1.265789
  1.320227	 -1.333944	  1.283826
  1.309593	 -1.288068	  1.303032
  1.298775	 -1.240004	  1.324970
  1.287663	 -1.191432	  1.350481
  1.276503	 -1.145588	  1.378485
  1.265588	 -1.106134	  1.405259
  1.254163	 -1.071299	  1.426542
  1.241830	 -1.034612	  1.443471
  1.227935	 -0.988698	  1.461667
  1.216766	 -0.938312	  1.487131
  1.210996	 -0.891450	  1.518742
  1.209249	 -0.849579	  1.553260
  1.210148	 -0.811554	  1.589544
  1.211076	 -0.775433	  1.625441
  1.210775	 -0.739887	  1.659633
  1.207511	 -0.702412	  1.689508
  1.200314	 -0.662984	  1.713081
  1.190076	 -0.622446	  1.732578
  1.180818	 -0.580594	  1.751708
  1.173917	 -0.537922	  1.771418
  1.171387	 -0.493824	  1.792233
  1.169984	 -0.449020	  1.817377
  1.162118	 -0.402303	  1.837898
  1.155329	 -0.354957	  1.857682
  1.148756	 -0.308656	  1.878382
  1.141681	 -0.264038	  1.899035
  1.132770	 -0.218754	  1.920249
  1.120907	 -0.172971	  1.941587
  1.107962	 -0.130037	  1.959932
  1.095571	 -0.085595	  1.975386
  1.080807	 -0.040193	  1.994893
  1.065830	  0.007885	  2.017820
  1.052768	  0.051203	  2.047541
  1.042126	  0.088015	  2.074006
  1.033269	  0.126898	  2.096006
  1.017543	  0.166527	  2.112518
  1.005345	  0.209743	  2.125422
  0.997615	  0.254406	  2.141307
  0.997183	  0.302404	  2.158275
  0.993003	  0.351736	  2.177678
  0.987197	  0.401484	  2.197871
  0.976534	  0.466384	  2.233673
  0.970574	  0.490499	  2.252806
