  1.115150	 -1.817653	  1.372848
  1.122872	 -1.816726	  1.379525
  1.107068	 -1.823402	  1.368656
  1.090258	 -1.826611	  1.356129
  1.075817	 -1.827324	  1.343651
  1.059560	 -1.827733	  1.330231
  1.043202	 -1.828338	  1.319125
  1.026943	 -1.829487	  1.309589
  1.010039	 -1.830367	  1.297557
  0.991167	 -1.829835	  1.283851
  0.977703	 -1.827885	  1.272380
  0.964988	 -1.824302	  1.260920
  0.948224	 -1.817943	  1.247796
  0.932068	 -1.813930	  1.236434
  0.915876	 -1.810635	  1.225501
  0.899885	 -1.808545	  1.212852
  0.884947	 -1.806473	  1.199760
  0.868352	 -1.803193	  1.187802
  0.848806	 -1.800633	  1.180534
  0.831110	 -1.798750	  1.179556
  0.808509	 -1.795286	  1.183442
  0.784060	 -1.789964	  1.179660
  0.767779	 -1.786611	  1.174872
  0.749284	 -1.784899	  1.166815
  0.723821	 -1.787944	  1.148978
  0.712803	 -1.790128	  1.139220
  0.698206	 -1.793705	  1.127749
  0.680226	 -1.795973	  1.113498
  0.663879	 -1.799483	  1.099469
  0.651533	 -1.802050	  1.087456
  0.636168	 -1.804924	  1.073982
  0.619011	 -1.806710	  1.058866
  0.607851	 -1.807961	  1.047247
  0.597284	 -1.807161	  1.036388
  0.575305	 -1.804710	  1.016235
  0.556239	 -1.805643	  1.000446
  0.547703	 -1.806404	  0.991844
  0.532159	 -1.809668	  0.976345
  0.518117	 -1.809754	  0.958519
  0.503481	 -1.815591	  0.947233
  0.485511	 -1.823286	  0.935983
  0.465610	 -1.833570	  0.927718
  0.454728	 -1.839884	  0.925514
  0.435429	 -1.846077	  0.919425
  0.413902	 -1.857407	  0.913873
  0.396884	 -1.865795	  0.905549
  0.386227	 -1.868933	  0.897002
  0.367787	 -1.870843	  0.882413
  0.354215	 -1.874708	  0.873743
  0.337151	 -1.876223	  0.861999
  0.318825	 -1.880951	  0.848432
  0.306606	 -1.887622	  0.840688
  0.289787	 -1.900629	  0.829767
  0.271694	 -1.913334	  0.818980
  0.263090	 -1.918116	  0.814221
  0.243538	 -1.930817	  0.804201
  0.229061	 -1.956417	  0.793612
  0.224712	 -1.969328	  0.789168
  0.223713	 -1.988610	  0.780991
  0.222096	 -2.003797	  0.768436
  0.215842	 -2.021229	  0.756188
  0.210982	 -2.037182	  0.744686
  0.207910	 -2.052900	  0.732673
  0.204165	 -2.068869	  0.721101
  0.200016	 -2.085024	  0.709987
  0.195090	 -2.100144	  0.698032
  0.189539	 -2.114026	  0.685088
  0.186765	 -2.127122	  0.670439
  0.184369	 -2.143900	  0.660467
  0.178955	 -2.166019	  0.650860
  0.171560	 -2.181404	  0.635847
  0.156274	 -2.185540	  0.616960
  0.143392	 -2.185712	  0.600887
  0.130686	 -2.184093	  0.585086
  0.115386	 -2.184713	  0.567038
  0.101382	 -2.178004	  0.557386
  0.089002	 -2.169999	  0.549450
  0.073032	 -2.157589	  0.539545
  0.059575	 -2.144202	  0.532707
  0.046795	 -2.132897	  0.523473
  0.033220	 -2.122037	  0.513701
  0.018857	 -2.106614	  0.504993
  0.007964	 -2.092510	  0.497160
 -0.001919	 -2.079643	  0.491084
 -0.020304	 -2.055153	  0.488067
 -0.032609	 -2.036527	  0.491153
 -0.045032	 -2.023296	  0.495366
 -0.056944	 -2.012797	  0.498039
 -0.069917	 -2.002717	  0.495972
 -0.086212	 -1.993408	  0.491407
 -0.103902	 -1.983302	  0.482742
 -0.123292	 -1.972083	  0.473105
 -0.136268	 -1.965501	  0.467344
 -0.154564	 -1.958805	  0.458361
 -0.173692	 -1.952628	  0.446529
 -0.180727	 -1.944172	  0.442505
 -0.189690	 -1.935407	  0.434205
 -0.203467	 -1.926397	  0.426257
 -0.214354	 -1.926494	  0.421115
 -0.223074	 -1.934257	  0.417426
 -0.232173	 -1.934310	  0.416153
 -0.245110	 -1.940298	  0.414514
 -0.254695	 -1.943362	  0.410273
 -0.259812	 -1.953341	  0.411000
 -0.270701	 -1.957569	  0.406400
 -0.278633	 -1.973241	  0.402331
 -0.289787	 -1.988835	  0.391294
 -0.295866	 -2.012567	  0.386320
 -0.294207	 -2.024615	  0.386133
 -0.297992	 -2.053216	  0.384139
 -0.301659	 -2.078726	  0.381229
 -0.305692	 -2.089383	  0.380621
 -0.314534	 -2.107524	  0.381291
 -0.326231	 -2.128073	  0.381761
 -0.333153	 -2.141560	  0.383041
 -0.343042	 -2.167465	  0.383087
 -0.355187	 -2.191028	  0.375398
 -0.362767	 -2.202582	  0.370182
 -0.369273	 -2.214861	  0.366872
 -0.381494	 -2.234388	  0.363957
 -0.392891	 -2.254112	  0.361620
 -0.402454	 -2.270381	  0.360427
 -0.412719	 -2.287876	  0.360258
 -0.426057	 -2.306106	  0.357166
 -0.437912	 -2.329544	  0.348492
 -0.445975	 -2.341295	  0.339440
 -0.459973	 -2.355897	  0.327969
 -0.472278	 -2.371372	  0.315892
 -0.484350	 -2.379880	  0.304277
 -0.497406	 -2.388293	  0.292766
 -0.511540	 -2.400114	  0.280953
 -0.525762	 -2.408039	  0.269592
 -0.541502	 -2.417135	  0.256956
 -0.558454	 -2.427169	  0.245052
 -0.573251	 -2.437780	  0.233515
 -0.587919	 -2.446273	  0.222623
 -0.602636	 -2.453712	  0.211076
 -0.618022	 -2.458787	  0.199372
 -0.634094	 -2.464251	  0.186833
 -0.651836	 -2.469779	  0.173507
 -0.668824	 -2.474610	  0.160763
 -0.684198	 -2.478986	  0.148706
 -0.700043	 -2.481375	  0.136945
 -0.717292	 -2.483229	  0.124030
 -0.734119	 -2.484843	  0.109462
 -0.749235	 -2.483479	  0.096708
 -0.762966	 -2.483641	  0.082465
 -0.776360	 -2.482500	  0.069437
 -0.792296	 -2.482007	  0.055219
 -0.808343	 -2.482061	  0.039706
 -0.823064	 -2.478150	  0.028333
 -0.838895	 -2.474474	  0.015601
 -0.859145	 -2.466135	  0.003123
 -0.881533	 -2.442915	  0.007202
 -0.896631	 -2.440542	 -0.005697
