 -0.528718	  2.499630	  0.044994
 -0.537650	  2.508684	  0.050949
 -0.524878	  2.495896	  0.042385
 -0.512154	  2.483001	  0.033900
 -0.499821	  2.469409	  0.026095
 -0.485906	  2.457042	  0.019841
 -0.469340	  2.445022	  0.013374
 -0.455529	  2.431805	  0.004338
 -0.447799	  2.417100	 -0.005464
 -0.437825	  2.402040	 -0.014687
 -0.425834	  2.388767	 -0.027228
 -0.420151	  2.375406	 -0.042948
 -0.417493	  2.365035	 -0.058521
 -0.416658	  2.351031	 -0.080590
 -0.420182	  2.338011	 -0.097570
 -0.432101	  2.327965	 -0.109459
 -0.442214	  2.317984	 -0.124220
 -0.448143	  2.307883	 -0.140599
 -0.456968	  2.299178	 -0.154696
 -0.468408	  2.286536	 -0.172703
 -0.468879	  2.275778	 -0.188492
 -0.465303	  2.267014	 -0.204267
 -0.470230	  2.251454	 -0.226741
 -0.480242	  2.242218	 -0.237812
 -0.487761	  2.233722	 -0.249817
 -0.496739	  2.221999	 -0.268488
 -0.508887	  2.212922	 -0.280485
 -0.521981	  2.202252	 -0.292044
 -0.532305	  2.189191	 -0.304930
 -0.542188	  2.177281	 -0.315711
 -0.552887	  2.164734	 -0.328248
 -0.560284	  2.149167	 -0.341596
 -0.565830	  2.133597	 -0.350166
 -0.569287	  2.112993	 -0.357647
 -0.570399	  2.094137	 -0.369772
 -0.574537	  2.083870	 -0.381955
 -0.584873	  2.068589	 -0.392581
 -0.595684	  2.052619	 -0.399722
 -0.606728	  2.036517	 -0.406355
 -0.616136	  2.018905	 -0.410214
 -0.622781	  2.001147	 -0.416105
 -0.625645	  1.982118	 -0.422740
 -0.626260	  1.965835	 -0.433343
 -0.630024	  1.946722	 -0.438997
 -0.635449	  1.927036	 -0.439880
 -0.641047	  1.907068	 -0.438057
 -0.642198	  1.886775	 -0.433887
 -0.634076	  1.867593	 -0.430550
 -0.616095	  1.844815	 -0.418429
 -0.606033	  1.831376	 -0.412523
 -0.594791	  1.815435	 -0.404676
 -0.577820	  1.801318	 -0.401644
 -0.571126	  1.792741	 -0.401208
 -0.553509	  1.782185	 -0.390404
 -0.539823	  1.769173	 -0.378533
 -0.527107	  1.756526	 -0.369008
 -0.514851	  1.748042	 -0.355723
 -0.502941	  1.741188	 -0.341197
 -0.491040	  1.734388	 -0.326634
 -0.479047	  1.727496	 -0.312206
 -0.466895	  1.720459	 -0.297943
 -0.454764	  1.713441	 -0.283636
 -0.442993	  1.706754	 -0.268909
 -0.431329	  1.700171	 -0.254093
 -0.419697	  1.693522	 -0.239247
 -0.410041	  1.685391	 -0.223787
 -0.406536	  1.674986	 -0.207190
 -0.403147	  1.665298	 -0.189979
 -0.399626	  1.655060	 -0.173014
 -0.396120	  1.644665	 -0.156227
 -0.392658	  1.634092	 -0.139576
 -0.389452	  1.622691	 -0.123406
 -0.386311	  1.611717	 -0.107002
 -0.382618	  1.598956	 -0.092107
 -0.377984	  1.585616	 -0.077901
 -0.372938	  1.570836	 -0.065679
 -0.367633	  1.555516	 -0.054496
 -0.361641	  1.542138	 -0.043752
 -0.358415	  1.531773	 -0.025602
 -0.356583	  1.514760	 -0.006926
 -0.348693	  1.492687	 -0.000864
 -0.339304	  1.470776	 -0.003132
 -0.328117	  1.456734	 -0.013652
 -0.315594	  1.442147	 -0.021653
 -0.298191	  1.431113	 -0.026919
 -0.281660	  1.413347	 -0.024243
 -0.270853	  1.396808	 -0.024577
 -0.259498	  1.379422	 -0.032150
 -0.249542	  1.370103	 -0.040619
 -0.234200	  1.363287	 -0.048305
 -0.217928	  1.356647	 -0.056355
 -0.203340	  1.345121	 -0.067307
 -0.190903	  1.330476	 -0.074860
 -0.177823	  1.317678	 -0.081335
 -0.163785	  1.305972	 -0.090753
 -0.151120	  1.294863	 -0.101509
 -0.141307	  1.280956	 -0.111403
 -0.131183	  1.266102	 -0.120586
 -0.121697	  1.251549	 -0.129546
 -0.115357	  1.235418	 -0.141443
 -0.107467	  1.218144	 -0.151621
 -0.094040	  1.203096	 -0.155331
 -0.080852	  1.187925	 -0.157086
 -0.071716	  1.171490	 -0.157861
 -0.067998	  1.149918	 -0.158007
 -0.065302	  1.127833	 -0.157986
 -0.054747	  1.110045	 -0.156061
 -0.034476	  1.100069	 -0.150900
 -0.016319	  1.089103	 -0.147641
 -0.006617	  1.072057	 -0.140545
 -0.001671	  1.051610	 -0.130168
 -0.001692	  1.034385	 -0.124319
  0.003428	  1.011673	 -0.116780
  0.013354	  0.994438	 -0.107940
  0.023738	  0.982733	 -0.102086
  0.039391	  0.966130	 -0.093648
  0.048857	  0.955289	 -0.086090
  0.059639	  0.938541	 -0.072851
  0.076859	  0.920568	 -0.064752
  0.083159	  0.914870	 -0.061658
  0.097725	  0.898720	 -0.056268
  0.110168	  0.877826	 -0.056256
  0.121912	  0.857679	 -0.055140
  0.130977	  0.841881	 -0.051331
  0.136039	  0.831530	 -0.050764
  0.150697	  0.821683	 -0.059799
  0.163072	  0.816534	 -0.072577
  0.172707	  0.807368	 -0.078084
  0.183833	  0.798307	 -0.088861
  0.191863	  0.789805	 -0.101861
  0.198854	  0.783056	 -0.113269
  0.207408	  0.777011	 -0.128108
  0.210848	  0.767714	 -0.139817
  0.212846	  0.763452	 -0.156960
  0.217627	  0.751530	 -0.175907
  0.226304	  0.742528	 -0.193784
  0.237771	  0.725911	 -0.212015
  0.244751	  0.721362	 -0.221227
  0.252977	  0.709781	 -0.232661
  0.262867	  0.702401	 -0.255563
  0.267644	  0.699056	 -0.272190
  0.273918	  0.693613	 -0.291502
  0.279245	  0.689151	 -0.311684
  0.287221	  0.689174	 -0.328891
  0.296418	  0.690300	 -0.345224
  0.304500	  0.687396	 -0.363799
  0.310150	  0.685438	 -0.381780
  0.320003	  0.684543	 -0.400120
  0.331188	  0.681916	 -0.418179
  0.337989	  0.677258	 -0.435535
  0.344456	  0.672510	 -0.453672
  0.352344	  0.668925	 -0.471120
  0.358475	  0.663822	 -0.489169
  0.363566	  0.654991	 -0.507256
  0.375188	  0.646360	 -0.527206
  0.385985	  0.643744	 -0.539779
  0.397017	  0.639125	 -0.553910
  0.406264	  0.628691	 -0.572890
  0.413340	  0.619486	 -0.588854
  0.419345	  0.610567	 -0.603436
  0.430347	  0.601695	 -0.617448
  0.444807	  0.588190	 -0.629351
  0.460018	  0.575816	 -0.641474
  0.472420	  0.566793	 -0.653106
  0.483883	  0.560121	 -0.664153
  0.500125	  0.556412	 -0.681704
  0.507761	  0.555418	 -0.694469
  0.524241	  0.550271	 -0.712591
  0.538874	  0.545513	 -0.727355
  0.548491	  0.541230	 -0.736528
  0.563780	  0.535495	 -0.749819
  0.578841	  0.529787	 -0.764071
  0.592190	  0.525960	 -0.775014
  0.608664	  0.521584	 -0.785031
  0.627145	  0.516457	 -0.792602
  0.652184	  0.513155	 -0.799296
  0.667764	  0.514931	 -0.806539
  0.681803	  0.517513	 -0.817471
  0.700772	  0.519086	 -0.829230
  0.718289	  0.519938	 -0.835376
  0.737004	  0.520143	 -0.841499
  0.762386	  0.514928	 -0.848850
  0.774460	  0.511020	 -0.849751
  0.795716	  0.505575	 -0.851149
  0.822132	  0.503869	 -0.856256
  0.835992	  0.505194	 -0.862908
  0.854689	  0.503333	 -0.872697
  0.875609	  0.503936	 -0.878973
  0.893622	  0.505844	 -0.880316
  0.914721	  0.510832	 -0.883915
  0.932356	  0.511951	 -0.891184
  0.948937	  0.508584	 -0.901644
  0.967265	  0.505339	 -0.910449
  0.985423	  0.501493	 -0.913508
  1.000852	  0.493489	 -0.915351
  1.025051	  0.473829	 -0.929542
  1.033247	  0.464033	 -0.935696
  1.043200	  0.451168	 -0.944861
  1.061506	  0.442510	 -0.950164
  1.074314	  0.433885	 -0.952484
  1.088535	  0.423514	 -0.956604
  1.103496	  0.404523	 -0.962997
  1.118978	  0.390176	 -0.969590
  1.127740	  0.382162	 -0.974145
  1.143427	  0.371114	 -0.978960
  1.159700	  0.355862	 -0.981524
  1.173587	  0.341962	 -0.983540
  1.180493	  0.328677	 -0.986325
  1.192918	  0.307122	 -0.990365
  1.209422	  0.292025	 -0.993060
  1.223418	  0.279321	 -0.997547
  1.236893	  0.266991	 -1.005363
  1.248943	  0.255255	 -1.014457
  1.263640	  0.241307	 -1.023587
  1.277928	  0.228931	 -1.028746
  1.290917	  0.214598	 -1.031124
  1.303077	  0.198771	 -1.033095
  1.315919	  0.183503	 -1.037733
  1.329693	  0.170445	 -1.047787
  1.339979	  0.159687	 -1.060511
  1.348984	  0.147239	 -1.072065
  1.360104	  0.132385	 -1.080387
  1.375266	  0.118559	 -1.091288
  1.388548	  0.107688	 -1.103064
  1.397202	  0.099749	 -1.112833
  1.404927	  0.084705	 -1.125203
  1.410974	  0.067227	 -1.138701
  1.420082	  0.053045	 -1.152449
  1.431572	  0.041567	 -1.162757
  1.447038	  0.030087	 -1.169427
  1.465327	  0.018570	 -1.174035
  1.481682	  0.007923	 -1.182336
  1.496782	 -0.001988	 -1.194654
  1.507799	 -0.008825	 -1.203043
  1.525327	 -0.021034	 -1.209826
  1.538517	 -0.037823	 -1.212889
  1.547627	 -0.057046	 -1.217413
  1.555822	 -0.073745	 -1.222930
  1.569339	 -0.088656	 -1.228763
  1.582243	 -0.098472	 -1.237707
  1.594128	 -0.109478	 -1.246877
  1.612774	 -0.126065	 -1.259724
  1.624015	 -0.134959	 -1.270263
  1.633504	 -0.142622	 -1.281365
  1.648983	 -0.156329	 -1.294355
  1.662876	 -0.169879	 -1.296996
  1.677623	 -0.184582	 -1.298065
  1.691343	 -0.198018	 -1.302788
  1.703014	 -0.210911	 -1.306917
  1.720786	 -0.229934	 -1.312238
  1.731875	 -0.241021	 -1.321291
  1.740936	 -0.250233	 -1.332651
  1.755465	 -0.265075	 -1.347864
  1.767695	 -0.277502	 -1.354353
  1.778082	 -0.290153	 -1.355383
  1.791878	 -0.307402	 -1.360282
  1.804276	 -0.321938	 -1.368415
  1.816209	 -0.335787	 -1.376589
  1.827780	 -0.350596	 -1.383443
  1.838747	 -0.366481	 -1.388703
  1.849637	 -0.382411	 -1.393965
  1.860642	 -0.398308	 -1.399100
  1.872751	 -0.413629	 -1.403396
  1.884642	 -0.428313	 -1.409730
  1.895855	 -0.441800	 -1.419175
  1.908448	 -0.454745	 -1.427843
  1.922777	 -0.466753	 -1.434994
  1.937156	 -0.478715	 -1.442057
  1.951135	 -0.490981	 -1.449360
  1.964434	 -0.503702	 -1.457191
  1.977930	 -0.516591	 -1.465089
  1.991900	 -0.530097	 -1.474109
  2.004399	 -0.542614	 -1.483440
