  0.522359	  1.471725	  1.872068
  0.523605	  1.471907	  1.875140
  0.517255	  1.470225	  1.856200
  0.509983	  1.468891	  1.837696
  0.504776	  1.467747	  1.818744
  0.499080	  1.466652	  1.799728
  0.487372	  1.463717	  1.783909
  0.468636	  1.465357	  1.765865
  0.457996	  1.470641	  1.747573
  0.460922	  1.474286	  1.727934
  0.468121	  1.473457	  1.705417
  0.469680	  1.472812	  1.682752
  0.462221	  1.476777	  1.662226
  0.448987	  1.478471	  1.648998
  0.437390	  1.478349	  1.631131
  0.429715	  1.479678	  1.611948
  0.423235	  1.481505	  1.593048
  0.416138	  1.483481	  1.574474
  0.407883	  1.485063	  1.556432
  0.402138	  1.487183	  1.537560
  0.398646	  1.490156	  1.517778
  0.393381	  1.493573	  1.497218
  0.387138	  1.496511	  1.478228
  0.377961	  1.496485	  1.460141
  0.363735	  1.495532	  1.442584
  0.348639	  1.497218	  1.428188
  0.334429	  1.501558	  1.413628
  0.321708	  1.507911	  1.400140
  0.309324	  1.513368	  1.385410
  0.299714	  1.517173	  1.366531
  0.294424	  1.521686	  1.344266
  0.291476	  1.526947	  1.326464
  0.286371	  1.534621	  1.310395
  0.279904	  1.544035	  1.291512
  0.271768	  1.551155	  1.272754
  0.264959	  1.555422	  1.257456
  0.257093	  1.558845	  1.238582
  0.247908	  1.565134	  1.222722
  0.236739	  1.570971	  1.205036
  0.226566	  1.572546	  1.188181
  0.216478	  1.574493	  1.169407
  0.209589	  1.577141	  1.149217
  0.210166	  1.578964	  1.128642
  0.210519	  1.580281	  1.110632
  0.211155	  1.579794	  1.087464
  0.206503	  1.579381	  1.064267
  0.202175	  1.580305	  1.046438
  0.190880	  1.584186	  1.028685
  0.178845	  1.588165	  1.012388
  0.168952	  1.592986	  0.993365
  0.158419	  1.594294	  0.979937
  0.150182	  1.597462	  0.961887
  0.141842	  1.602006	  0.940812
  0.136261	  1.605774	  0.926462
  0.125809	  1.602979	  0.906472
  0.121410	  1.604658	  0.887576
  0.115354	  1.611209	  0.870024
  0.098340	  1.616971	  0.854679
  0.087471	  1.624322	  0.843737
  0.073726	  1.631168	  0.824813
  0.068248	  1.634700	  0.805397
  0.070244	  1.637209	  0.785618
  0.073168	  1.639483	  0.765565
  0.076278	  1.642992	  0.746810
  0.078392	  1.648873	  0.724131
  0.078600	  1.656905	  0.700127
  0.076103	  1.659141	  0.689699
  0.074651	  1.665225	  0.661428
  0.084683	  1.675140	  0.637376
  0.094707	  1.680861	  0.627913
  0.104576	  1.686296	  0.617912
  0.117388	  1.698504	  0.600216
  0.130650	  1.712959	  0.582025
  0.139507	  1.721396	  0.572806
  0.151313	  1.726908	  0.561070
  0.164293	  1.738780	  0.545969
  0.174957	  1.754433	  0.535896
  0.186537	  1.768090	  0.526328
  0.199040	  1.779811	  0.515852
  0.211727	  1.791237	  0.505506
  0.224896	  1.802160	  0.495107
  0.238620	  1.812733	  0.484992
  0.251971	  1.824071	  0.475016
  0.263551	  1.837631	  0.465845
  0.272460	  1.855079	  0.461923
  0.281124	  1.873036	  0.458212
  0.289244	  1.891048	  0.454369
  0.297408	  1.909530	  0.451915
  0.300949	  1.928385	  0.451955
  0.303462	  1.944929	  0.456493
  0.303711	  1.962527	  0.459771
  0.298066	  1.982075	  0.463516
  0.292187	  1.998195	  0.475911
  0.286900	  2.011277	  0.492118
  0.273404	  2.024246	  0.504598
  0.256228	  2.032268	  0.510765
  0.238874	  2.033765	  0.515338
  0.220243	  2.029970	  0.526082
  0.202558	  2.032510	  0.538672
  0.184502	  2.037768	  0.544554
  0.164793	  2.042225	  0.544520
  0.143871	  2.042622	  0.543372
  0.123838	  2.039494	  0.546612
  0.101933	  2.039128	  0.556885
  0.085934	  2.043242	  0.570218
  0.070215	  2.047305	  0.588792
  0.056073	  2.049929	  0.603390
  0.038583	  2.051984	  0.612900
  0.017345	  2.052037	  0.613760
 -0.001463	  2.047784	  0.615472
 -0.023381	  2.042730	  0.617285
 -0.045550	  2.035740	  0.620289
 -0.064949	  2.030946	  0.621108
 -0.082159	  2.027802	  0.621369
 -0.103265	  2.027255	  0.622308
 -0.125040	  2.025400	  0.623629
 -0.141570	  2.022418	  0.625449
 -0.163598	  2.021984	  0.627669
 -0.184562	  2.021581	  0.630880
 -0.200711	  2.020879	  0.633899
 -0.222880	  2.019689	  0.638092
 -0.245045	  2.018556	  0.641025
 -0.261068	  2.019949	  0.643474
 -0.281170	  2.021820	  0.642512
 -0.301901	  2.021222	  0.639678
 -0.321666	  2.018038	  0.632506
 -0.338401	  2.011677	  0.626527
 -0.357862	  2.004172	  0.622576
 -0.375903	  1.999556	  0.617229
 -0.393227	  1.994151	  0.610910
 -0.412517	  1.986825	  0.606529
 -0.432900	  1.982595	  0.600885
 -0.452087	  1.979753	  0.593275
 -0.467305	  1.976328	  0.585985
 -0.484645	  1.969521	  0.582222
 -0.503085	  1.962635	  0.582140
 -0.531449	  1.951175	  0.583278
 -0.546472	  1.945870	  0.572415
 -0.562094	  1.940236	  0.569461
 -0.577359	  1.934230	  0.554897
 -0.591954	  1.927418	  0.536433
 -0.602666	  1.919849	  0.528425
 -0.617614	  1.908435	  0.523133
 -0.635135	  1.892758	  0.510468
 -0.647136	  1.884754	  0.503227
 -0.663809	  1.877997	  0.493726
 -0.683880	  1.870503	  0.484304
 -0.703594	  1.865548	  0.475913
 -0.719281	  1.861975	  0.464732
 -0.732558	  1.856917	  0.451460
 -0.742239	  1.849923	  0.439609
 -0.752291	  1.842064	  0.425666
 -0.764718	  1.831739	  0.404456
 -0.775380	  1.821305	  0.385711
 -0.784459	  1.812830	  0.372838
 -0.794953	  1.806672	  0.359427
 -0.805271	  1.802103	  0.348228
 -0.814458	  1.798507	  0.328595
 -0.820213	  1.786139	  0.310333
 -0.828881	  1.766734	  0.294751
 -0.840199	  1.750639	  0.283337
 -0.842022	  1.742748	  0.272067
 -0.847995	  1.740554	  0.269311
 -0.851048	  1.739860	  0.264264
 -0.855048	  1.745943	  0.249039
 -0.850626	  1.756408	  0.229861
 -0.845752	  1.768300	  0.214645
 -0.839158	  1.780574	  0.200870
 -0.824753	  1.782713	  0.176298
 -0.814508	  1.778246	  0.154376
 -0.805118	  1.777419	  0.141900
 -0.792838	  1.777938	  0.127684
 -0.780437	  1.782540	  0.111142
 -0.769278	  1.788051	  0.096222
 -0.756767	  1.791831	  0.077516
 -0.746855	  1.794296	  0.063694
 -0.738439	  1.797221	  0.048493
 -0.719028	  1.803787	  0.030209
 -0.697437	  1.804012	  0.015794
 -0.686610	  1.802444	  0.008373
 -0.674444	  1.798729	 -0.005354
 -0.655696	  1.794452	 -0.013313
 -0.632645	  1.793950	 -0.022754
 -0.613645	  1.793448	 -0.032332
 -0.599693	  1.793591	 -0.040275
 -0.581549	  1.797837	 -0.051451
 -0.565742	  1.801117	 -0.064557
 -0.552423	  1.800114	 -0.076348
 -0.535994	  1.801617	 -0.084536
 -0.520826	  1.807508	 -0.098006
 -0.513890	  1.811093	 -0.108173
 -0.510731	  1.815081	 -0.125872
 -0.510890	  1.823161	 -0.134785
 -0.498579	  1.835928	 -0.140335
 -0.499179	  1.859403	 -0.146246
 -0.514058	  1.869688	 -0.148028
 -0.491972	  1.881642	 -0.152890
 -0.495705	  1.896913	 -0.161655
 -0.502525	  1.913537	 -0.180681
 -0.500681	  1.924942	 -0.196763
 -0.496726	  1.932248	 -0.216360
 -0.501262	  1.936371	 -0.226888
 -0.522696	  1.954463	 -0.238385
 -0.534149	  1.942262	 -0.250995
 -0.542132	  1.954299	 -0.255452
 -0.558176	  1.955626	 -0.274717
 -0.566144	  1.953892	 -0.293348
 -0.573689	  1.949248	 -0.305215
 -0.576807	  1.937286	 -0.323103
 -0.590247	  1.925307	 -0.344298
 -0.601736	  1.912835	 -0.357291
 -0.611970	  1.905177	 -0.369627
 -0.619060	  1.893340	 -0.386495
 -0.625893	  1.881867	 -0.398509
 -0.639036	  1.868728	 -0.411592
 -0.650488	  1.852966	 -0.430361
 -0.653417	  1.845483	 -0.438765
 -0.657956	  1.841074	 -0.449848
 -0.665803	  1.835987	 -0.462955
 -0.675528	  1.833857	 -0.475876
 -0.684317	  1.834495	 -0.489788
 -0.691772	  1.833329	 -0.506246
 -0.697974	  1.830539	 -0.522858
 -0.707017	  1.832185	 -0.538421
 -0.719061	  1.837036	 -0.553689
 -0.734597	  1.844565	 -0.570287
 -0.749296	  1.848444	 -0.589458
 -0.754262	  1.847018	 -0.607723
 -0.761363	  1.846719	 -0.625117
 -0.765759	  1.846791	 -0.646594
 -0.773736	  1.847519	 -0.666540
 -0.780594	  1.846776	 -0.685864
 -0.785691	  1.845130	 -0.704947
 -0.790430	  1.846216	 -0.726594
 -0.798203	  1.850751	 -0.746860
 -0.809676	  1.854506	 -0.765189
 -0.822156	  1.854406	 -0.778174
 -0.833794	  1.852784	 -0.794980
 -0.844867	  1.852123	 -0.811990
 -0.854323	  1.851320	 -0.828267
 -0.862546	  1.850260	 -0.846474
 -0.871101	  1.848355	 -0.864064
 -0.880884	  1.848071	 -0.881341
 -0.890763	  1.848071	 -0.899376
 -0.901420	  1.847274	 -0.917238
 -0.909694	  1.846143	 -0.935645
 -0.917348	  1.845137	 -0.955410
 -0.926219	  1.843975	 -0.975047
 -0.934256	  1.843593	 -0.993536
 -0.940908	  1.842402	 -1.013278
 -0.949107	  1.842220	 -1.032306
 -0.954787	  1.841706	 -1.051529
 -0.960802	  1.840763	 -1.070497
 -0.968064	  1.841295	 -1.088704
 -0.974036	  1.840802	 -1.106954
 -0.980791	  1.841174	 -1.124865
 -0.987427	  1.841622	 -1.143476
 -0.994930	  1.842786	 -1.160695
 -1.004521	  1.846259	 -1.177859
 -1.011786	  1.848619	 -1.195630
 -1.017032	  1.847944	 -1.213892
 -1.025932	  1.844571	 -1.241291
 -1.029173	  1.843729	 -1.252978
 -1.035906	  1.843361	 -1.271913
 -1.049725	  1.846663	 -1.291566
 -1.055805	  1.847956	 -1.307896
 -1.053552	  1.845407	 -1.330098
 -1.040780	  1.836705	 -1.357984
 -1.048446	  1.838440	 -1.376375
