 -1.571981	  2.009198	 -1.634900
 -1.556417	  1.989305	 -1.618713
 -1.542954	  1.980875	 -1.569863
 -1.531255	  1.958028	 -1.523766
 -1.518311	  1.942124	 -1.477440
 -1.504178	  1.923709	 -1.432931
 -1.490302	  1.901494	 -1.392821
 -1.479418	  1.882229	 -1.349691
 -1.469703	  1.860657	 -1.302975
 -1.461074	  1.846094	 -1.256543
 -1.451942	  1.825336	 -1.213287
 -1.441738	  1.810469	 -1.166108
 -1.428289	  1.789306	 -1.121744
 -1.413054	  1.771012	 -1.077461
 -1.403948	  1.747203	 -1.035670
 -1.390952	  1.730060	 -0.994491
 -1.380241	  1.708187	 -0.949714
 -1.366978	  1.690311	 -0.903208
 -1.356772	  1.672062	 -0.858199
 -1.346145	  1.651962	 -0.817181
 -1.334351	  1.629067	 -0.771876
 -1.321958	  1.609755	 -0.729799
 -1.308035	  1.590083	 -0.685504
 -1.294491	  1.570850	 -0.643976
 -1.282648	  1.547309	 -0.600143
 -1.280862	  1.517243	 -0.568670
 -1.287914	  1.470831	 -0.544045
 -1.321200	  1.380062	 -0.520570
 -1.356586	  1.354515	 -0.505796
 -1.432348	  1.368712	 -0.461982
 -1.564984	  1.335941	 -0.389120
 -1.622376	  1.329829	 -0.302518
 -1.632266	  1.307464	 -0.219278
 -1.616126	  1.230383	 -0.133600
 -1.602704	  1.193497	 -0.084930
 -1.573663	  1.142521	 -0.022865
 -1.518309	  1.070054	  0.016156
 -1.488108	  1.038988	  0.027687
 -1.425691	  1.002563	  0.047707
 -1.311316	  0.970462	  0.108849
 -1.221843	  0.934210	  0.142423
 -1.197459	  0.950871	  0.158268
 -1.170415	  0.977336	  0.172269
 -1.127711	  1.055169	  0.218350
 -1.099970	  1.092664	  0.282178
 -1.073838	  1.105731	  0.336779
 -1.054481	  1.105079	  0.378578
 -1.036506	  1.095124	  0.423221
 -1.022972	  1.074958	  0.465199
 -1.015701	  1.050866	  0.498330
 -1.011722	  1.027375	  0.525571
 -1.010988	  0.965699	  0.569840
 -1.024104	  0.854850	  0.600105
 -1.036814	  0.786500	  0.620509
 -1.044884	  0.710932	  0.649422
 -1.052422	  0.672148	  0.669507
 -1.063259	  0.635246	  0.693101
 -1.099646	  0.557874	  0.764860
 -1.095471	  0.542005	  0.780849
 -1.044642	  0.489034	  0.844394
 -1.010980	  0.458738	  0.899136
 -1.001761	  0.453187	  0.924827
 -0.999700	  0.454135	  0.979153
 -0.998219	  0.462865	  1.034961
 -0.960559	  0.481342	  1.132321
 -0.909721	  0.499179	  1.167824
 -0.882930	  0.518423	  1.186928
 -0.849979	  0.606815	  1.259873
 -0.795259	  0.659019	  1.326473
 -0.761665	  0.666253	  1.382799
 -0.742206	  0.655337	  1.433341
 -0.727231	  0.638540	  1.479445
 -0.714275	  0.619916	  1.524093
 -0.701303	  0.601104	  1.568531
 -0.690546	  0.582891	  1.612990
 -0.680514	  0.564701	  1.652397
 -0.668501	  0.545439	  1.697311
 -0.658000	  0.523820	  1.745413
 -0.648355	  0.506546	  1.787361
 -0.640080	  0.488501	  1.830585
 -0.630078	  0.468383	  1.878453
 -0.619807	  0.448438	  1.925006
 -0.607963	  0.431310	  1.967358
 -0.598733	  0.416880	  2.013614
 -0.587267	  0.397000	  2.056328
 -0.580971	  0.371073	  2.100486
 -0.567166	  0.352838	  2.146045
 -0.550390	  0.328197	  2.184009
 -0.541627	  0.309510	  2.229497
 -0.535613	  0.296741	  2.277759
 -0.518662	  0.270511	  2.317844
 -0.512993	  0.252315	  2.363676
 -0.501233	  0.241241	  2.407997
 -0.488752	  0.222914	  2.452259
 -0.476607	  0.201138	  2.499251
 -0.460825	  0.184773	  2.544090
 -0.445086	  0.166688	  2.591209
 -0.431129	  0.141414	  2.632869
 -0.420136	  0.122882	  2.678514
 -0.414625	  0.107172	  2.723237
 -0.397782	  0.082631	  2.763410
 -0.388622	  0.066530	  2.808606
 -0.378627	  0.044349	  2.852368
 -0.373925	  0.024627	  2.893809
 -0.355586	  0.003307	  2.937247
 -0.351334	 -0.019954	  2.979290
 -0.354847	 -0.020154	  3.009082
