 -0.960801	  2.295758	 -0.034058
 -0.960035	  2.312946	 -0.035522
 -0.969531	  2.294604	 -0.033836
 -0.966368	  2.273594	 -0.031322
 -0.966656	  2.255245	 -0.028911
 -0.975676	  2.235906	 -0.023981
 -0.983214	  2.213935	 -0.019917
 -0.981277	  2.193423	 -0.021488
 -0.972311	  2.173406	 -0.026554
 -0.963865	  2.146285	 -0.031361
 -0.963645	  2.133095	 -0.031597
 -0.966861	  2.114792	 -0.029984
 -0.969173	  2.092045	 -0.028964
 -0.969412	  2.074967	 -0.030283
 -0.967837	  2.048955	 -0.033059
 -0.968383	  2.028834	 -0.033284
 -0.970895	  2.015139	 -0.031946
 -0.974193	  1.990666	 -0.028640
 -0.967369	  1.967601	 -0.031129
 -0.955407	  1.949568	 -0.035623
 -0.942670	  1.935431	 -0.039471
 -0.934096	  1.915910	 -0.041417
 -0.924944	  1.898027	 -0.043209
 -0.910925	  1.883719	 -0.046094
 -0.897063	  1.869818	 -0.049577
 -0.884725	  1.855173	 -0.052937
 -0.874672	  1.837572	 -0.055789
 -0.858873	  1.820926	 -0.064414
 -0.840190	  1.812451	 -0.073539
 -0.818610	  1.807501	 -0.073265
 -0.809065	  1.799757	 -0.069394
 -0.801787	  1.782598	 -0.061725
 -0.775985	  1.763419	 -0.048948
 -0.766971	  1.754416	 -0.044996
 -0.757185	  1.743036	 -0.037392
 -0.746282	  1.725166	 -0.030563
 -0.738687	  1.713685	 -0.024685
 -0.734721	  1.705385	 -0.020222
 -0.732775	  1.687829	 -0.012170
 -0.735452	  1.671329	  0.001368
 -0.735284	  1.650347	  0.019616
 -0.732008	  1.640199	  0.028833
 -0.728204	  1.630449	  0.041583
 -0.723721	  1.617650	  0.060121
 -0.719844	  1.600655	  0.071401
 -0.713800	  1.581995	  0.083721
 -0.708077	  1.561134	  0.088616
 -0.703234	  1.541195	  0.093420
 -0.702796	  1.526447	  0.099404
 -0.704261	  1.510579	  0.105986
 -0.711348	  1.489861	  0.114456
 -0.719368	  1.469739	  0.120951
 -0.726760	  1.449413	  0.124213
 -0.725622	  1.431026	  0.124009
 -0.732261	  1.413846	  0.131400
 -0.734602	  1.391615	  0.135881
 -0.741143	  1.381635	  0.140852
 -0.752022	  1.363934	  0.142858
 -0.767272	  1.348857	  0.148495
 -0.779473	  1.334516	  0.153366
 -0.788527	  1.323622	  0.156083
 -0.803046	  1.308309	  0.159756
 -0.821402	  1.289840	  0.162455
 -0.832729	  1.275241	  0.168186
 -0.843396	  1.263604	  0.170648
 -0.861379	  1.251996	  0.182120
 -0.871551	  1.244083	  0.191563
 -0.883552	  1.236051	  0.199643
 -0.904229	  1.218341	  0.204102
 -0.916845	  1.203407	  0.201907
 -0.925965	  1.192005	  0.199715
 -0.933947	  1.175673	  0.195964
 -0.942160	  1.160379	  0.196323
 -0.953743	  1.149836	  0.190304
 -0.968331	  1.135434	  0.184917
 -0.978114	  1.127559	  0.178984
 -0.993174	  1.115813	  0.174828
 -1.003723	  1.105410	  0.163409
 -1.006062	  1.087105	  0.146767
 -1.012953	  1.067191	  0.129212
 -1.016863	  1.059652	  0.122861
 -1.023389	  1.045524	  0.111256
 -1.030964	  1.016980	  0.099649
 -1.033659	  1.003223	  0.093011
 -1.036715	  0.992096	  0.088103
 -1.039290	  0.972095	  0.073310
 -1.041406	  0.958619	  0.062735
 -1.047464	  0.939679	  0.049426
 -1.053820	  0.920415	  0.036709
 -1.059684	  0.906691	  0.030305
 -1.070319	  0.891107	  0.028213
 -1.076371	  0.869108	  0.031187
 -1.073963	  0.845531	  0.031015
 -1.072348	  0.830921	  0.030064
 -1.074430	  0.811879	  0.027522
 -1.075636	  0.785051	  0.025176
 -1.073178	  0.768960	  0.025928
 -1.069058	  0.750082	  0.029191
 -1.066849	  0.723823	  0.034907
 -1.067566	  0.711624	  0.038686
 -1.070226	  0.691944	  0.045532
 -1.068557	  0.667643	  0.051703
 -1.066292	  0.651985	  0.055130
 -1.066307	  0.632371	  0.058671
 -1.069092	  0.614408	  0.058883
 -1.075501	  0.586647	  0.056992
 -1.077048	  0.569830	  0.057612
 -1.077577	  0.550586	  0.061444
 -1.072775	  0.528405	  0.066066
 -1.071235	  0.509720	  0.069439
 -1.074491	  0.499041	  0.070841
 -1.083174	  0.470947	  0.074902
 -1.084213	  0.447941	  0.082625
 -1.084990	  0.439715	  0.086504
 -1.082134	  0.420321	  0.093518
 -1.077644	  0.396648	  0.097635
 -1.078546	  0.379016	  0.100300
 -1.078551	  0.359617	  0.098647
 -1.074439	  0.328342	  0.095946
 -1.071830	  0.308116	  0.096248
 -1.071386	  0.297329	  0.095898
 -1.073166	  0.274808	  0.095958
 -1.074262	  0.253643	  0.100361
 -1.078055	  0.235575	  0.105590
 -1.084309	  0.213516	  0.110857
 -1.088713	  0.195881	  0.114452
 -1.094540	  0.178343	  0.115254
 -1.104013	  0.158431	  0.114383
 -1.111549	  0.139332	  0.115568
 -1.118459	  0.120438	  0.118675
 -1.123603	  0.101452	  0.122292
 -1.123960	  0.080054	  0.127122
 -1.122081	  0.059579	  0.128114
 -1.121183	  0.039109	  0.124238
 -1.121018	  0.018751	  0.116624
 -1.121950	 -0.001733	  0.106974
 -1.123660	 -0.022350	  0.100596
 -1.123327	 -0.043093	  0.101120
 -1.120301	 -0.060812	  0.105463
 -1.118504	 -0.081662	  0.112144
 -1.118411	 -0.099032	  0.117773
 -1.117694	 -0.119011	  0.125367
 -1.112537	 -0.139258	  0.129744
 -1.107011	 -0.160519	  0.128488
 -1.103620	 -0.180466	  0.124335
 -1.101824	 -0.199547	  0.121607
 -1.101879	 -0.216373	  0.121771
 -1.103146	 -0.237742	  0.121946
 -1.098516	 -0.262762	  0.120678
 -1.093479	 -0.281451	  0.119046
 -1.090220	 -0.295875	  0.117997
 -1.088191	 -0.318064	  0.118100
 -1.084192	 -0.338160	  0.121116
 -1.079387	 -0.356461	  0.126929
 -1.075513	 -0.376160	  0.132402
 -1.075227	 -0.396870	  0.133005
 -1.078453	 -0.418188	  0.127495
 -1.085162	 -0.443977	  0.120644
 -1.090846	 -0.459281	  0.119780
 -1.094957	 -0.477307	  0.123040
 -1.095017	 -0.497923	  0.130689
 -1.093489	 -0.518009	  0.139586
 -1.090761	 -0.537103	  0.146852
 -1.088526	 -0.555288	  0.147054
 -1.084378	 -0.577831	  0.141921
 -1.081193	 -0.597933	  0.131547
 -1.081656	 -0.620681	  0.118837
 -1.084852	 -0.641088	  0.113014
 -1.090113	 -0.655250	  0.111567
 -1.099952	 -0.673047	  0.112015
 -1.109523	 -0.691603	  0.110092
 -1.117118	 -0.712237	  0.108271
 -1.119165	 -0.733091	  0.106902
 -1.115965	 -0.756919	  0.103862
 -1.114660	 -0.777226	  0.102871
 -1.117241	 -0.792802	  0.104084
 -1.127608	 -0.812288	  0.107634
 -1.139218	 -0.831575	  0.112690
 -1.148101	 -0.852740	  0.113862
 -1.151532	 -0.872404	  0.109873
 -1.150645	 -0.890097	  0.105976
 -1.149625	 -0.910372	  0.105311
 -1.150517	 -0.931293	  0.106496
 -1.152339	 -0.951396	  0.107811
 -1.153101	 -0.971533	  0.109063
 -1.150992	 -0.992095	  0.108176
 -1.144905	 -1.011626	  0.105374
 -1.138231	 -1.030971	  0.102944
 -1.135874	 -1.050448	  0.105266
 -1.138698	 -1.068534	  0.108798
 -1.141974	 -1.088265	  0.112408
 -1.140339	 -1.112013	  0.116315
 -1.139081	 -1.132173	  0.120109
 -1.139211	 -1.142900	  0.123179
 -1.138642	 -1.173003	  0.122994
 -1.138521	 -1.191763	  0.119655
 -1.135604	 -1.204313	  0.120551
 -1.135940	 -1.231273	  0.128915
 -1.137468	 -1.256285	  0.137097
 -1.144835	 -1.264593	  0.139090
 -1.146506	 -1.277076	  0.143467
 -1.154460	 -1.303840	  0.158449
 -1.157981	 -1.318671	  0.171218
 -1.164348	 -1.330500	  0.187393
 -1.174048	 -1.345217	  0.205791
 -1.181784	 -1.356876	  0.214214
 -1.198829	 -1.369025	  0.221596
 -1.211946	 -1.377033	  0.227479
 -1.230488	 -1.384629	  0.238243
 -1.250073	 -1.392846	  0.251063
 -1.264805	 -1.398488	  0.264005
 -1.275456	 -1.403406	  0.281476
 -1.282997	 -1.404717	  0.295666
 -1.295702	 -1.406194	  0.312613
 -1.307970	 -1.409859	  0.328875
 -1.319406	 -1.413079	  0.345079
 -1.331935	 -1.414987	  0.359612
 -1.347361	 -1.415687	  0.372927
 -1.362471	 -1.416485	  0.386018
 -1.375524	 -1.417557	  0.401586
 -1.387313	 -1.412431	  0.425311
 -1.391573	 -1.413830	  0.448086
 -1.392710	 -1.425524	  0.465255
 -1.393378	 -1.440527	  0.478325
 -1.397215	 -1.455225	  0.489234
 -1.403974	 -1.467903	  0.504301
 -1.409629	 -1.480740	  0.517641
 -1.414183	 -1.498173	  0.527568
 -1.416712	 -1.519345	  0.534866
 -1.419170	 -1.537841	  0.543381
 -1.423244	 -1.552504	  0.558071
 -1.429233	 -1.560094	  0.572785
 -1.439866	 -1.572878	  0.586681
 -1.449225	 -1.588673	  0.595512
 -1.453029	 -1.603359	  0.607919
 -1.452355	 -1.621409	  0.619834
 -1.440683	 -1.640103	  0.619913
 -1.442358	 -1.654425	  0.618952
 -1.448014	 -1.670697	  0.620176
 -1.442314	 -1.690289	  0.622754
 -1.430379	 -1.708173	  0.624119
 -1.419093	 -1.724693	  0.624869
 -1.414239	 -1.743532	  0.620567
 -1.411161	 -1.762487	  0.615034
 -1.408764	 -1.781122	  0.609108
 -1.414913	 -1.794267	  0.595702
 -1.423309	 -1.804774	  0.580970
 -1.431971	 -1.815147	  0.566221
 -1.440638	 -1.825502	  0.551465
 -1.449284	 -1.835734	  0.536612
 -1.457760	 -1.845944	  0.521674
 -1.462041	 -1.856823	  0.505644
 -1.454162	 -1.867011	  0.490526
 -1.445769	 -1.877114	  0.475452
 -1.437419	 -1.887241	  0.460366
 -1.429205	 -1.897386	  0.445240
 -1.422137	 -1.906970	  0.429742
 -1.420068	 -1.914429	  0.410432
 -1.416447	 -1.920725	  0.389289
 -1.408165	 -1.929650	  0.372493
 -1.401178	 -1.940934	  0.359459
 -1.385214	 -1.952624	  0.339975
 -1.365320	 -1.963968	  0.329091
 -1.354044	 -1.972101	  0.325738
 -1.339102	 -1.985465	  0.319397
 -1.325167	 -1.997553	  0.309312
 -1.312809	 -2.008320	  0.302141
 -1.294304	 -2.022082	  0.292033
 -1.280053	 -2.029299	  0.275531
 -1.274090	 -2.030847	  0.257639
 -1.269300	 -2.036219	  0.234446
 -1.254097	 -2.047110	  0.219057
 -1.235299	 -2.057410	  0.216708
 -1.219925	 -2.069049	  0.214693
 -1.211894	 -2.085312	  0.206675
 -1.212140	 -2.103904	  0.207001
 -1.212988	 -2.123772	  0.208653
 -1.215204	 -2.143534	  0.210955
 -1.216263	 -2.163337	  0.213731
 -1.217647	 -2.183405	  0.216470
 -1.222690	 -2.209565	  0.219310
 -1.216538	 -2.255171	  0.228784
 -1.217471	 -2.274877	  0.232073
