 -1.262956	  0.696992	 -2.052994
 -1.252502	  0.698925	 -2.047619
 -1.246900	  0.699961	 -2.044739
 -1.228700	  0.701512	 -2.036207
 -1.210819	  0.706772	 -2.027876
 -1.194432	  0.714696	 -2.021264
 -1.177171	  0.723477	 -2.014675
 -1.158941	  0.730435	 -2.005513
 -1.142836	  0.734064	 -1.998615
 -1.124385	  0.740545	 -1.990849
 -1.107315	  0.747329	 -1.983907
 -1.090474	  0.753174	 -1.977353
 -1.072115	  0.760709	 -1.966707
 -1.056947	  0.768733	 -1.959587
 -1.038481	  0.778396	 -1.953167
 -1.021212	  0.782490	 -1.948121
 -1.001222	  0.785275	 -1.942405
 -0.982063	  0.792065	 -1.933882
 -0.969173	  0.802423	 -1.924869
 -0.953890	  0.814006	 -1.917002
 -0.936087	  0.820485	 -1.910687
 -0.917795	  0.822821	 -1.904524
 -0.896079	  0.828235	 -1.896600
 -0.882134	  0.837578	 -1.887492
 -0.868705	  0.849586	 -1.879931
 -0.851225	  0.860372	 -1.873273
 -0.833315	  0.862280	 -1.867768
 -0.811615	  0.866593	 -1.862649
 -0.795465	  0.875538	 -1.852443
 -0.784758	  0.890367	 -1.843310
 -0.768416	  0.904530	 -1.834637
 -0.752182	  0.909334	 -1.834502
 -0.735012	  0.918728	 -1.830237
 -0.713871	  0.927206	 -1.825733
 -0.696107	  0.936272	 -1.823672
 -0.679698	  0.944515	 -1.822555
 -0.661907	  0.953057	 -1.820397
 -0.643391	  0.962252	 -1.817920
 -0.627297	  0.972428	 -1.819631
 -0.610461	  0.986022	 -1.820806
 -0.592377	  0.999222	 -1.816992
 -0.576273	  1.006864	 -1.812459
 -0.558310	  1.012498	 -1.811168
 -0.539154	  1.020603	 -1.809862
 -0.520749	  1.027389	 -1.808349
 -0.500480	  1.033313	 -1.804788
 -0.483505	  1.043279	 -1.802432
 -0.465240	  1.051758	 -1.802201
 -0.447441	  1.057121	 -1.802075
 -0.427377	  1.063135	 -1.800007
 -0.408032	  1.067577	 -1.797499
 -0.388401	  1.070840	 -1.794099
 -0.369357	  1.072695	 -1.789078
 -0.350603	  1.071100	 -1.782921
 -0.332527	  1.066538	 -1.775341
 -0.315271	  1.063412	 -1.766251
 -0.297123	  1.061558	 -1.756653
 -0.279966	  1.057889	 -1.747890
 -0.263121	  1.051770	 -1.739497
 -0.246689	  1.043864	 -1.730973
 -0.230452	  1.035967	 -1.721929
 -0.213384	  1.030325	 -1.712656
 -0.197590	  1.026167	 -1.700413
 -0.183321	  1.020778	 -1.687514
 -0.170000	  1.012317	 -1.675278
 -0.156535	  1.001685	 -1.664158
 -0.144004	  0.993567	 -1.650221
 -0.132340	  0.988254	 -1.635067
 -0.119698	  0.985345	 -1.618354
 -0.104082	  0.978980	 -1.605338
 -0.093988	  0.968314	 -1.594845
 -0.081666	  0.956135	 -1.581543
 -0.068692	  0.946691	 -1.567752
 -0.059949	  0.942337	 -1.551814
 -0.050983	  0.935158	 -1.534850
 -0.041180	  0.930129	 -1.517766
 -0.025015	  0.926003	 -1.502703
 -0.014845	  0.918835	 -1.489219
 -0.005774	  0.910898	 -1.472414
  0.000968	  0.903848	 -1.455131
  0.009175	  0.895173	 -1.438650
  0.018608	  0.883675	 -1.425010
  0.032354	  0.869759	 -1.418136
  0.041887	  0.863401	 -1.404667
  0.052321	  0.853669	 -1.391911
  0.064682	  0.842612	 -1.378844
  0.080102	  0.833977	 -1.367124
  0.092737	  0.821902	 -1.358520
  0.105433	  0.810908	 -1.348344
  0.119120	  0.801791	 -1.336233
  0.133432	  0.793314	 -1.324981
  0.150045	  0.790351	 -1.316604
  0.168400	  0.786625	 -1.307224
  0.190526	  0.783911	 -1.298975
  0.203572	  0.780248	 -1.284610
  0.215988	  0.777250	 -1.265989
  0.232916	  0.778601	 -1.251472
  0.249186	  0.773132	 -1.252865
  0.269691	  0.772380	 -1.245882
  0.288638	  0.777555	 -1.239233
  0.309218	  0.778163	 -1.233901
  0.328449	  0.777867	 -1.229802
  0.347939	  0.778662	 -1.221612
  0.366234	  0.779671	 -1.213770
  0.385569	  0.780998	 -1.202708
  0.402321	  0.787048	 -1.195941
  0.414468	  0.802768	 -1.187178
  0.430714	  0.815947	 -1.176840
  0.440422	  0.826016	 -1.159938
  0.448565	  0.833712	 -1.143624
  0.462697	  0.840022	 -1.127086
  0.478554	  0.856126	 -1.127025
  0.495875	  0.867632	 -1.127294
  0.512847	  0.877475	 -1.121983
  0.524278	  0.891022	 -1.114871
  0.534687	  0.905852	 -1.107436
  0.549520	  0.920793	 -1.100347
  0.564030	  0.935770	 -1.097564
  0.574586	  0.950053	 -1.092959
  0.583062	  0.969768	 -1.094003
  0.597434	  0.982719	 -1.090335
  0.613718	  0.995065	 -1.098105
  0.628836	  1.007465	 -1.095121
  0.645176	  1.022896	 -1.089981
  0.653084	  1.039104	 -1.084961
  0.662975	  1.056251	 -1.085686
  0.676108	  1.071803	 -1.089890
  0.684812	  1.088420	 -1.093624
  0.698088	  1.109662	 -1.095474
  0.713820	  1.122361	 -1.091512
  0.731983	  1.130438	 -1.089757
  0.749799	  1.140343	 -1.092043
  0.764042	  1.153607	 -1.093527
  0.779122	  1.167276	 -1.089311
  0.790271	  1.182483	 -1.085965
  0.805089	  1.196442	 -1.085307
  0.825714	  1.204281	 -1.085635
  0.840628	  1.214468	 -1.080261
  0.855528	  1.224097	 -1.078157
  0.874880	  1.232506	 -1.077361
  0.894058	  1.238982	 -1.075747
  0.913371	  1.244379	 -1.074751
  0.933779	  1.248403	 -1.074326
  0.952103	  1.252110	 -1.070905
  0.970953	  1.255510	 -1.065706
  0.992392	  1.258349	 -1.064741
  1.011413	  1.260476	 -1.062696
  1.030279	  1.261915	 -1.056565
  1.049966	  1.263104	 -1.052900
  1.070232	  1.264235	 -1.050411
  1.088115	  1.264868	 -1.042215
  1.107940	  1.265784	 -1.036255
  1.131132	  1.267264	 -1.036310
  1.146754	  1.269183	 -1.033559
  1.166897	  1.271077	 -1.025896
  1.183991	  1.273925	 -1.017652
  1.203440	  1.278413	 -1.012550
  1.222705	  1.282104	 -1.005935
  1.240510	  1.282721	 -0.997544
  1.259957	  1.286003	 -0.989425
  1.277736	  1.292687	 -0.984566
  1.295750	  1.297764	 -0.978451
  1.314492	  1.301764	 -0.970970
  1.332307	  1.308696	 -0.965722
  1.350148	  1.314726	 -0.960167
  1.369262	  1.318782	 -0.952114
  1.386289	  1.327219	 -0.948414
  1.404293	  1.333627	 -0.943839
  1.424063	  1.337768	 -0.935958
  1.441189	  1.345585	 -0.931786
  1.458997	  1.351102	 -0.927664
  1.479202	  1.354529	 -0.920054
  1.495430	  1.360798	 -0.913581
  1.513256	  1.364894	 -0.907441
  1.533925	  1.367584	 -0.897055
  1.550445	  1.372376	 -0.889992
  1.566263	  1.376416	 -0.888413
  1.586878	  1.380534	 -0.879792
  1.607965	  1.388665	 -0.862558
  1.620884	  1.389963	 -0.845706
  1.635246	  1.385883	 -0.848462
  1.661956	  1.387502	 -0.849241
  1.682802	  1.394931	 -0.840938
  1.695627	  1.400089	 -0.828651
  1.708365	  1.405598	 -0.811971
  1.723518	  1.411452	 -0.798661
  1.740281	  1.416783	 -0.790951
  1.757937	  1.420788	 -0.781788
  1.775562	  1.423143	 -0.771481
  1.795278	  1.427201	 -0.763737
  1.809823	  1.433201	 -0.755269
  1.826267	  1.438033	 -0.743754
  1.843760	  1.443826	 -0.734168
  1.861093	  1.447275	 -0.726154
  1.878803	  1.450870	 -0.717969
  1.904673	  1.456308	 -0.708087
  1.916329	  1.456993	 -0.702258
