 -1.655296	  1.196872	  1.548467
 -1.662036	  1.195957	  1.557386
 -1.650020	  1.197593	  1.541482
 -1.638259	  1.199652	  1.525480
 -1.627121	  1.202552	  1.509105
 -1.616316	  1.206237	  1.492705
 -1.606499	  1.210851	  1.476314
 -1.596816	  1.217496	  1.459167
 -1.587844	  1.224680	  1.442737
 -1.576975	  1.231614	  1.428260
 -1.567253	  1.239699	  1.413154
 -1.560005	  1.249714	  1.397037
 -1.554597	  1.260696	  1.381310
 -1.549912	  1.271693	  1.365762
 -1.545596	  1.283291	  1.350608
 -1.541883	  1.298264	  1.334537
 -1.538863	  1.310273	  1.320876
 -1.535972	  1.322151	  1.304141
 -1.534269	  1.335720	  1.286712
 -1.530679	  1.346860	  1.275440
 -1.526587	  1.359916	  1.259444
 -1.524043	  1.373079	  1.242935
 -1.518775	  1.387836	  1.231400
 -1.512780	  1.401921	  1.218351
 -1.508588	  1.414456	  1.202936
 -1.503924	  1.426561	  1.188241
 -1.496470	  1.440444	  1.174151
 -1.491583	  1.452131	  1.158903
 -1.487389	  1.460348	  1.142432
 -1.481479	  1.471499	  1.124937
 -1.477531	  1.483648	  1.109535
 -1.471038	  1.489780	  1.093063
 -1.462005	  1.495850	  1.072294
 -1.452357	  1.504209	  1.058891
 -1.441419	  1.513293	  1.045215
 -1.431494	  1.518853	  1.028085
 -1.426554	  1.526219	  1.009135
 -1.418442	  1.530200	  0.988285
 -1.406985	  1.532301	  0.976699
 -1.394226	  1.535106	  0.960019
 -1.383941	  1.537246	  0.941986
 -1.377770	  1.536641	  0.923724
 -1.369176	  1.535641	  0.903767
 -1.358220	  1.535239	  0.887887
 -1.346102	  1.534607	  0.873214
 -1.332292	  1.537212	  0.855332
 -1.327358	  1.538496	  0.837035
 -1.324475	  1.534494	  0.814282
 -1.317753	  1.528171	  0.797347
 -1.303193	  1.525953	  0.782810
 -1.291565	  1.522732	  0.765721
 -1.286091	  1.517314	  0.747358
 -1.279546	  1.514766	  0.729234
 -1.268953	  1.518200	  0.711876
 -1.260340	  1.517325	  0.691802
 -1.254016	  1.509433	  0.671625
 -1.246546	  1.500143	  0.656110
 -1.237131	  1.497268	  0.642178
 -1.225881	  1.497851	  0.622677
 -1.217251	  1.494212	  0.605978
 -1.207497	  1.487313	  0.589584
 -1.195742	  1.482721	  0.574497
 -1.182798	  1.477379	  0.558228
 -1.170260	  1.468366	  0.546972
 -1.162524	  1.455190	  0.530638
 -1.154868	  1.446110	  0.517039
 -1.142754	  1.443957	  0.500842
 -1.128495	  1.440574	  0.478984
 -1.118632	  1.439339	  0.458704
 -1.104299	  1.431428	  0.445805
 -1.092729	  1.420962	  0.443538
 -1.078139	  1.412847	  0.426929
 -1.063800	  1.397305	  0.415731
 -1.055151	  1.383404	  0.406085
 -1.041096	  1.368522	  0.399941
 -1.022809	  1.358235	  0.393181
 -1.004832	  1.351793	  0.390027
 -0.988512	  1.344331	  0.381481
 -0.969825	  1.336617	  0.374395
 -0.950631	  1.333807	  0.367509
 -0.939160	  1.319951	  0.351382
 -0.927580	  1.305317	  0.338324
 -0.921669	  1.295532	  0.322735
 -0.905383	  1.282400	  0.319062
 -0.889215	  1.268541	  0.311052
 -0.874114	  1.258764	  0.308076
 -0.856369	  1.251153	  0.304514
 -0.839581	  1.238230	  0.305025
 -0.827722	  1.219575	  0.301889
 -0.813896	  1.204238	  0.294463
 -0.795887	  1.195573	  0.296083
 -0.779674	  1.189674	  0.284213
 -0.760516	  1.177692	  0.283782
 -0.741855	  1.167508	  0.287300
 -0.728597	  1.159997	  0.287294
 -0.707397	  1.150436	  0.287387
 -0.690162	  1.140259	  0.290224
 -0.675973	  1.128933	  0.290524
 -0.658821	  1.117745	  0.285961
 -0.640243	  1.105797	  0.281690
 -0.625136	  1.095016	  0.283504
 -0.604508	  1.087738	  0.285063
 -0.583554	  1.082082	  0.286475
 -0.574242	  1.071108	  0.289582
 -0.556189	  1.057589	  0.288818
 -0.539522	  1.043009	  0.287846
 -0.522799	  1.034334	  0.286987
 -0.499458	  1.031534	  0.283357
 -0.482301	  1.032816	  0.276326
 -0.464690	  1.019697	  0.266524
 -0.446848	  1.010104	  0.258971
 -0.431184	  1.001365	  0.257582
 -0.412137	  0.999423	  0.256530
 -0.390350	  0.995710	  0.254136
 -0.371793	  0.988788	  0.248178
 -0.353953	  0.982285	  0.237425
 -0.334659	  0.991125	  0.229687
 -0.317831	  0.991992	  0.223473
 -0.296944	  0.994234	  0.218188
 -0.276971	  0.995599	  0.215658
 -0.258343	  0.990830	  0.214794
 -0.233538	  0.984976	  0.210497
 -0.219862	  0.986864	  0.200235
 -0.201072	  0.987691	  0.193881
 -0.179974	  0.984608	  0.189138
 -0.160579	  0.981773	  0.179538
 -0.144528	  0.985456	  0.168585
 -0.126447	  0.988290	  0.165593
 -0.104164	  0.988000	  0.160274
 -0.088982	  0.989248	  0.153675
 -0.069263	  0.987049	  0.144152
 -0.050150	  0.985683	  0.133325
 -0.035737	  0.989946	  0.118438
 -0.022655	  0.989219	  0.107088
 -0.005650	  0.980595	  0.097904
  0.011828	  0.972389	  0.088007
  0.029246	  0.972340	  0.076382
  0.046819	  0.974300	  0.068339
  0.068217	  0.971822	  0.063368
  0.083780	  0.965247	  0.053108
  0.098611	  0.955151	  0.041773
  0.120411	  0.953492	  0.032742
  0.136595	  0.952810	  0.027048
  0.153517	  0.948322	  0.018358
  0.168168	  0.947546	  0.001012
  0.184303	  0.948456	 -0.009305
  0.203560	  0.946177	 -0.021779
  0.220747	  0.940631	 -0.032897
  0.231487	  0.938506	 -0.040725
  0.250487	  0.935898	 -0.051278
  0.270964	  0.937358	 -0.064697
  0.283967	  0.936828	 -0.073678
  0.300445	  0.932860	 -0.083583
  0.319572	  0.925952	 -0.095402
  0.334780	  0.919814	 -0.105610
  0.355577	  0.917291	 -0.119555
  0.369253	  0.922821	 -0.127710
  0.384467	  0.926681	 -0.136686
  0.400344	  0.926107	 -0.150169
  0.421665	  0.924565	 -0.160708
  0.438794	  0.925404	 -0.167263
  0.459715	  0.921989	 -0.173796
  0.478440	  0.922979	 -0.178974
  0.496110	  0.923057	 -0.186579
  0.512279	  0.921606	 -0.196302
  0.534609	  0.922339	 -0.201862
  0.553282	  0.923776	 -0.209547
  0.570179	  0.926882	 -0.214533
  0.586305	  0.928779	 -0.223918
  0.606197	  0.926412	 -0.238516
  0.625565	  0.925041	 -0.245697
  0.643240	  0.929004	 -0.248376
  0.662447	  0.931635	 -0.255863
  0.681892	  0.934338	 -0.259297
  0.701713	  0.938230	 -0.261009
  0.720982	  0.940144	 -0.270073
  0.740368	  0.941568	 -0.277635
  0.758777	  0.942345	 -0.277819
  0.779004	  0.947588	 -0.277387
  0.797594	  0.954680	 -0.281291
  0.819569	  0.962235	 -0.279616
  0.839634	  0.965684	 -0.280154
  0.855199	  0.966791	 -0.285278
  0.874792	  0.973397	 -0.283743
  0.895561	  0.974410	 -0.280689
  0.916190	  0.971263	 -0.275555
  0.935162	  0.971389	 -0.269678
  0.953378	  0.978989	 -0.267337
  0.971526	  0.988840	 -0.265540
  0.991158	  0.996536	 -0.263205
  1.009711	  1.003032	 -0.259772
  1.028951	  1.006101	 -0.252608
  1.048590	  1.007328	 -0.252601
  1.067459	  1.008914	 -0.245155
  1.086735	  1.015384	 -0.248155
  1.104021	  1.023263	 -0.249225
  1.120984	  1.034630	 -0.254392
  1.136706	  1.046059	 -0.255449
  1.154234	  1.056834	 -0.255646
  1.171614	  1.064363	 -0.261843
  1.189569	  1.070372	 -0.269133
  1.204541	  1.075761	 -0.282833
  1.225241	  1.082107	 -0.282818
  1.237786	  1.095926	 -0.290305
  1.249530	  1.106602	 -0.303331
  1.264338	  1.111680	 -0.318007
  1.280368	  1.117570	 -0.327848
  1.291234	  1.129131	 -0.338302
  1.302393	  1.144068	 -0.347655
  1.310048	  1.158576	 -0.360140
  1.325059	  1.168168	 -0.373029
  1.338410	  1.176742	 -0.380722
  1.351004	  1.190037	 -0.391398
  1.363901	  1.202345	 -0.399592
  1.376698	  1.214133	 -0.409859
  1.387208	  1.227581	 -0.420879
  1.396809	  1.241000	 -0.432166
  1.405423	  1.255205	 -0.443646
  1.412886	  1.270511	 -0.453888
  1.420960	  1.285116	 -0.464677
  1.428426	  1.300861	 -0.475100
  1.435721	  1.316793	 -0.483635
  1.441877	  1.333035	 -0.491247
  1.445472	  1.350511	 -0.500743
  1.446400	  1.366883	 -0.511045
  1.440036	  1.378890	 -0.525945
  1.433414	  1.390382	 -0.540924
  1.426770	  1.401814	 -0.555915
  1.417609	  1.407277	 -0.572820
  1.407956	  1.411173	 -0.589885
  1.397842	  1.410911	 -0.606983
  1.388770	  1.400984	 -0.622509
  1.382686	  1.388042	 -0.636877
  1.382291	  1.372060	 -0.651581
  1.383940	  1.357550	 -0.666136
  1.382729	  1.345833	 -0.678823
  1.383030	  1.333054	 -0.695557
  1.387130	  1.318191	 -0.710209
  1.389952	  1.303593	 -0.721760
  1.395328	  1.291080	 -0.737399
  1.400612	  1.277653	 -0.751551
  1.407578	  1.261032	 -0.761706
  1.414534	  1.246755	 -0.773168
  1.421082	  1.237000	 -0.788223
  1.430974	  1.226314	 -0.805456
  1.441092	  1.214413	 -0.819775
  1.451256	  1.205530	 -0.833426
  1.461312	  1.197753	 -0.845636
  1.474298	  1.190181	 -0.861075
  1.486447	  1.184637	 -0.875752
  1.497633	  1.177144	 -0.889359
  1.510752	  1.168229	 -0.903644
  1.525617	  1.161163	 -0.918836
  1.539302	  1.160122	 -0.931413
  1.554876	  1.159847	 -0.944108
  1.569281	  1.155751	 -0.957461
  1.584386	  1.153643	 -0.969824
  1.601454	  1.154349	 -0.982519
  1.615905	  1.150327	 -0.995318
  1.630742	  1.146111	 -1.006367
  1.648272	  1.145071	 -1.018976
  1.662718	  1.143707	 -1.030497
  1.679048	  1.141588	 -1.041111
  1.697428	  1.136863	 -1.054309
  1.712192	  1.137741	 -1.065162
  1.729530	  1.139249	 -1.075906
  1.746353	  1.139963	 -1.085136
  1.764314	  1.140073	 -1.095585
  1.781582	  1.140277	 -1.105530
  1.799314	  1.140839	 -1.114451
  1.817196	  1.139673	 -1.126150
  1.834410	  1.139984	 -1.136328
