 -1.002335	  1.040420	  2.054320
 -0.996244	  1.060925	  2.075535
 -1.002105	  1.041194	  2.055119
 -1.009350	  0.995855	  2.011327
 -1.015415	  0.955351	  1.978445
 -1.022691	  0.922227	  1.953056
 -1.031787	  0.892891	  1.930522
 -1.043612	  0.863789	  1.907068
 -1.057435	  0.834030	  1.880753
 -1.072340	  0.805063	  1.851571
 -1.088182	  0.777115	  1.820365
 -1.105124	  0.750046	  1.785572
 -1.122194	  0.722441	  1.743706
 -1.136033	  0.694152	  1.694908
 -1.143690	  0.666635	  1.643131
 -1.147336	  0.638341	  1.590123
 -1.148201	  0.607496	  1.537569
 -1.146836	  0.575669	  1.488052
 -1.144614	  0.543615	  1.442671
 -1.143808	  0.512930	  1.402868
 -1.145809	  0.483905	  1.367117
 -1.150332	  0.455359	  1.332300
 -1.157551	  0.425236	  1.296259
 -1.167145	  0.393153	  1.260218
 -1.178882	  0.360635	  1.226776
 -1.192063	  0.328544	  1.195505
 -1.206349	  0.298131	  1.166749
 -1.221715	  0.270490	  1.139913
 -1.238563	  0.245328	  1.112379
 -1.257280	  0.220132	  1.080135
 -1.276612	  0.194344	  1.043673
 -1.295002	  0.169423	  1.006510
 -1.314349	  0.144601	  0.968000
 -1.335159	  0.116555	  0.925986
 -1.354881	  0.086438	  0.883506
 -1.372545	  0.055336	  0.840920
 -1.382750	  0.025666	  0.792580
 -1.380505	  0.002754	  0.743929
 -1.384666	 -0.018865	  0.704304
 -1.390719	 -0.039182	  0.668502
 -1.407884	 -0.062151	  0.635182
 -1.432260	 -0.095328	  0.590525
 -1.449594	 -0.134484	  0.537587
 -1.459563	 -0.175515	  0.485399
 -1.463705	 -0.216916	  0.436765
 -1.463831	 -0.257322	  0.390917
 -1.460453	 -0.299386	  0.345411
 -1.452234	 -0.346338	  0.298856
 -1.434853	 -0.404664	  0.247830
 -1.398444	 -0.485018	  0.191799
 -1.337801	 -0.586361	  0.150677
 -1.281396	 -0.683168	  0.139658
 -1.253900	 -0.743873	  0.135546
 -1.246591	 -0.772667	  0.130531
 -1.246151	 -0.800055	  0.124388
 -1.254199	 -0.844983	  0.113061
 -1.268365	 -0.894452	  0.098701
 -1.281538	 -0.926631	  0.088290
 -1.292841	 -0.943949	  0.081778
 -1.318609	 -0.971382	  0.069169
 -1.359916	 -1.010336	  0.047145
 -1.401973	 -1.042594	  0.018715
 -1.436612	 -1.062418	 -0.013110
 -1.462812	 -1.072924	 -0.042171
 -1.481635	 -1.077578	 -0.065660
 -1.498622	 -1.079095	 -0.090238
 -1.518248	 -1.076977	 -0.124345
 -1.541127	 -1.067963	 -0.174601
 -1.565547	 -1.050083	 -0.244887
 -1.587102	 -1.030650	 -0.330972
 -1.604850	 -1.025251	 -0.434690
 -1.622383	 -1.058780	 -0.529017
 -1.640754	 -1.097232	 -0.589931
 -1.656735	 -1.128179	 -0.631942
 -1.671210	 -1.155507	 -0.670065
 -1.686178	 -1.185790	 -0.711354
 -1.696470	 -1.217129	 -0.749639
 -1.701719	 -1.245534	 -0.784864
 -1.705258	 -1.271581	 -0.818859
 -1.706973	 -1.298085	 -0.856897
 -1.709668	 -1.326231	 -0.896418
 -1.710177	 -1.362600	 -0.948837
 -1.728071	 -1.409170	 -0.999463
 -1.732360	 -1.431967	 -1.028049
