  1.690460	 -0.976963	  1.476620
  1.706798	 -0.992496	  1.488063
  1.699333	 -0.980692	  1.479661
  1.683229	 -0.964809	  1.471304
  1.668304	 -0.954859	  1.462449
  1.652099	 -0.947778	  1.449667
  1.636724	 -0.934791	  1.436011
  1.627511	 -0.921839	  1.429747
  1.616336	 -0.910880	  1.425504
  1.598793	 -0.896656	  1.419666
  1.583553	 -0.884020	  1.414674
  1.567530	 -0.873473	  1.409767
  1.550525	 -0.866313	  1.405534
  1.535076	 -0.856642	  1.397984
  1.521673	 -0.837567	  1.389474
  1.506673	 -0.818452	  1.386276
  1.490953	 -0.809502	  1.386446
  1.474957	 -0.803075	  1.384309
  1.458112	 -0.791064	  1.377352
  1.441852	 -0.777043	  1.373732
  1.426245	 -0.768264	  1.372866
  1.408984	 -0.759461	  1.369044
  1.393589	 -0.747766	  1.362963
  1.377537	 -0.735064	  1.358543
  1.360393	 -0.726259	  1.356104
  1.342196	 -0.717446	  1.352316
  1.326518	 -0.706335	  1.346346
  1.311961	 -0.694111	  1.339623
  1.295566	 -0.683318	  1.335609
  1.276822	 -0.674364	  1.335027
  1.257515	 -0.666164	  1.335889
  1.239055	 -0.656324	  1.333102
  1.226065	 -0.646639	  1.323651
  1.210346	 -0.635077	  1.313267
  1.197185	 -0.625053	  1.301535
  1.183149	 -0.617099	  1.292674
  1.168951	 -0.609352	  1.280607
  1.154842	 -0.593654	  1.262594
  1.142655	 -0.578950	  1.254378
  1.134128	 -0.569728	  1.252356
  1.117349	 -0.552359	  1.247179
  1.104817	 -0.538136	  1.236636
  1.097135	 -0.528684	  1.224206
  1.086500	 -0.515426	  1.211442
  1.076391	 -0.502815	  1.200781
  1.066890	 -0.491077	  1.186184
  1.054988	 -0.475924	  1.175441
  1.043275	 -0.462037	  1.173699
  1.027044	 -0.442881	  1.170960
  1.013561	 -0.425061	  1.161243
  1.007670	 -0.416926	  1.151686
  0.998940	 -0.407324	  1.140297
  0.986041	 -0.392103	  1.128069
  0.978119	 -0.381230	  1.112878
  0.971877	 -0.372651	  1.096024
  0.968889	 -0.370416	  1.076518
  0.966693	 -0.369624	  1.056662
  0.964411	 -0.368860	  1.036809
  0.960630	 -0.367848	  1.017159
  0.952276	 -0.366316	  0.999033
  0.944018	 -0.364719	  0.980907
  0.935972	 -0.363045	  0.962659
  0.927863	 -0.361335	  0.944663
  0.921937	 -0.356153	  0.927202
  0.915567	 -0.346774	  0.910724
  0.899652	 -0.344831	  0.896155
  0.881148	 -0.346727	  0.881739
  0.873637	 -0.343511	  0.859903
  0.872168	 -0.339859	  0.839477
  0.868649	 -0.334307	  0.822578
  0.857059	 -0.322585	  0.804152
  0.849600	 -0.312904	  0.795787
  0.839302	 -0.295355	  0.775352
  0.833167	 -0.289685	  0.755919
  0.828826	 -0.286513	  0.744110
  0.815710	 -0.280119	  0.725983
  0.806771	 -0.276261	  0.709072
  0.802066	 -0.272019	  0.689867
  0.793770	 -0.260787	  0.671713
  0.776107	 -0.251236	  0.664625
  0.755880	 -0.242492	  0.657469
  0.745371	 -0.231916	  0.643452
  0.746376	 -0.218044	  0.624044
  0.746514	 -0.201964	  0.607770
  0.737522	 -0.183045	  0.598442
  0.724132	 -0.172512	  0.593503
  0.709036	 -0.162794	  0.578940
  0.693114	 -0.150860	  0.564195
  0.681166	 -0.133961	  0.566057
  0.674323	 -0.114391	  0.576217
  0.661041	 -0.092446	  0.583677
  0.645647	 -0.075919	  0.582293
  0.637062	 -0.069379	  0.578614
  0.620420	 -0.052201	  0.578687
  0.606983	 -0.036044	  0.578612
  0.597124	 -0.023310	  0.579588
  0.579632	 -0.004483	  0.587488
  0.565166	  0.007540	  0.594132
  0.552639	  0.015723	  0.595790
  0.533231	  0.026555	  0.594253
  0.514776	  0.038966	  0.600821
  0.500151	  0.051844	  0.610916
  0.489192	  0.064202	  0.617271
  0.477220	  0.077197	  0.618841
  0.460460	  0.094383	  0.622639
  0.447911	  0.108098	  0.635509
  0.436127	  0.119460	  0.649971
  0.425939	  0.125708	  0.654337
  0.405005	  0.138031	  0.655285
  0.386126	  0.150707	  0.661702
  0.377963	  0.160916	  0.671205
  0.366434	  0.176340	  0.680987
  0.345880	  0.188828	  0.687724
  0.330208	  0.198272	  0.694439
  0.320090	  0.214167	  0.697756
  0.305315	  0.231353	  0.695059
  0.286054	  0.241114	  0.690654
  0.268280	  0.247272	  0.684053
  0.254856	  0.258933	  0.681392
  0.246029	  0.276774	  0.686546
  0.222773	  0.296818	  0.696591
  0.195818	  0.303777	  0.701327
  0.178841	  0.303745	  0.702191
  0.154737	  0.306092	  0.700825
  0.136264	  0.305143	  0.697534
  0.117238	  0.305864	  0.690826
  0.096903	  0.312128	  0.679124
  0.079171	  0.324879	  0.667604
  0.064553	  0.338587	  0.664777
  0.049959	  0.351590	  0.668128
  0.034904	  0.363059	  0.671768
  0.017947	  0.372828	  0.675281
 -0.001968	  0.385126	  0.682536
 -0.016285	  0.399265	  0.688409
 -0.029806	  0.414087	  0.691779
 -0.040883	  0.426358	  0.692845
 -0.057278	  0.440381	  0.697322
 -0.077198	  0.459346	  0.695374
 -0.092142	  0.475625	  0.686300
 -0.103791	  0.487639	  0.673508
 -0.115042	  0.494622	  0.659468
 -0.131999	  0.504790	  0.652831
 -0.148914	  0.516350	  0.646351
 -0.166348	  0.524986	  0.635377
 -0.178531	  0.530542	  0.623358
 -0.194858	  0.540733	  0.605246
 -0.206059	  0.547482	  0.591524
 -0.218851	  0.554876	  0.580464
 -0.230096	  0.560819	  0.571870
 -0.240311	  0.572002	  0.556928
 -0.248049	  0.586079	  0.538436
 -0.262069	  0.595065	  0.526076
 -0.280271	  0.597475	  0.518227
 -0.300432	  0.602964	  0.508994
 -0.314652	  0.615014	  0.497130
 -0.323328	  0.623711	  0.489405
 -0.335528	  0.635164	  0.482238
 -0.348781	  0.653759	  0.473196
 -0.361780	  0.667671	  0.467732
 -0.378130	  0.682557	  0.463906
 -0.391299	  0.696781	  0.458831
 -0.403522	  0.708962	  0.452061
 -0.415258	  0.721886	  0.440306
 -0.427804	  0.736666	  0.430450
 -0.439390	  0.744946	  0.425028
 -0.452692	  0.756587	  0.421316
 -0.467120	  0.776066	  0.415374
 -0.482786	  0.793690	  0.406233
 -0.489987	  0.802293	  0.401007
 -0.504034	  0.819891	  0.393456
 -0.515914	  0.834413	  0.391254
 -0.530291	  0.853249	  0.385941
 -0.542066	  0.864804	  0.377416
 -0.554709	  0.873802	  0.366574
 -0.572846	  0.878095	  0.352742
 -0.583498	  0.887262	  0.346401
 -0.595301	  0.908144	  0.335655
 -0.611130	  0.921687	  0.331169
 -0.625118	  0.933950	  0.329988
 -0.646400	  0.945969	  0.324736
 -0.667337	  0.952038	  0.320229
 -0.682027	  0.957046	  0.317331
 -0.699555	  0.966543	  0.312219
 -0.713984	  0.976961	  0.302082
 -0.727852	  0.989969	  0.294833
 -0.742960	  1.003556	  0.287352
 -0.758970	  1.015304	  0.281563
 -0.772714	  1.025835	  0.276628
 -0.785835	  1.036313	  0.276145
 -0.801327	  1.046174	  0.267005
 -0.821968	  1.059960	  0.256977
 -0.828832	  1.068753	  0.251743
 -0.846222	  1.082458	  0.245723
 -0.869276	  1.094087	  0.234474
 -0.884840	  1.101717	  0.227947
 -0.895602	  1.104506	  0.223502
 -0.916226	  1.111555	  0.217119
 -0.938457	  1.115511	  0.216309
 -0.959047	  1.121855	  0.215425
 -0.980421	  1.131351	  0.214866
 -0.997735	  1.141466	  0.212585
 -1.006487	  1.151620	  0.210845
 -1.025722	  1.165045	  0.211091
 -1.043925	  1.175803	  0.212406
 -1.060893	  1.188515	  0.213933
 -1.076520	  1.199235	  0.220488
 -1.092768	  1.209733	  0.228185
 -1.107101	  1.221100	  0.231539
 -1.121784	  1.236191	  0.233044
 -1.140622	  1.251245	  0.240944
 -1.154597	  1.259034	  0.248907
 -1.168857	  1.264389	  0.258096
 -1.191483	  1.271762	  0.272269
 -1.204338	  1.277781	  0.277859
 -1.218981	  1.288479	  0.283245
 -1.233993	  1.300929	  0.291685
 -1.247354	  1.311555	  0.305071
 -1.264221	  1.319120	  0.316801
 -1.280220	  1.326553	  0.323725
 -1.295534	  1.332984	  0.323248
 -1.316934	  1.343489	  0.323807
 -1.333022	  1.352791	  0.329784
 -1.345224	  1.364270	  0.335707
 -1.355529	  1.380387	  0.333158
 -1.368270	  1.394933	  0.322328
 -1.383312	  1.404980	  0.311315
 -1.397189	  1.410553	  0.305110
 -1.413467	  1.416164	  0.298997
 -1.427528	  1.422627	  0.288665
 -1.435555	  1.429187	  0.275216
 -1.437301	  1.440008	  0.252719
 -1.439737	  1.450688	  0.238357
 -1.443659	  1.458846	  0.225492
 -1.448369	  1.466478	  0.205255
 -1.448803	  1.469602	  0.185197
 -1.446653	  1.465223	  0.164351
 -1.443511	  1.460273	  0.142524
 -1.442653	  1.466192	  0.120615
 -1.447261	  1.478231	  0.105326
 -1.454468	  1.486913	  0.087963
 -1.458985	  1.494249	  0.068737
 -1.462262	  1.500566	  0.049989
 -1.465258	  1.506318	  0.031051
 -1.468240	  1.512041	  0.012125
 -1.473553	  1.519748	 -0.005538
 -1.481778	  1.529797	 -0.020735
 -1.489949	  1.539772	 -0.035817
 -1.495712	  1.547569	 -0.050816
 -1.500270	  1.555878	 -0.069139
 -1.508605	  1.573780	 -0.089034
 -1.517970	  1.586501	 -0.099185
 -1.528077	  1.593003	 -0.107857
 -1.542616	  1.602337	 -0.119260
 -1.557533	  1.620308	 -0.133106
 -1.569948	  1.630898	 -0.139124
 -1.587223	  1.639086	 -0.141941
 -1.603297	  1.649819	 -0.149799
 -1.613200	  1.660907	 -0.161787
 -1.631794	  1.675007	 -0.168816
 -1.646513	  1.690587	 -0.170976
 -1.655129	  1.709044	 -0.178580
 -1.659020	  1.720684	 -0.192115
 -1.670801	  1.732205	 -0.206127
 -1.685339	  1.743277	 -0.215926
 -1.700315	  1.756015	 -0.223575
 -1.712894	  1.772874	 -0.234153
 -1.725800	  1.786093	 -0.241815
