 -0.943574	  0.882539	  2.190042
 -0.937483	  0.903044	  2.211257
 -0.941519	  0.889429	  2.197175
 -0.944057	  0.875228	  2.183322
 -0.946340	  0.860933	  2.169523
 -0.948637	  0.846124	  2.156278
 -0.950947	  0.830705	  2.143753
 -0.953612	  0.815207	  2.131395
 -0.957044	  0.799570	  2.119406
 -0.960678	  0.783964	  2.107440
 -0.965530	  0.768572	  2.095825
 -0.971433	  0.752090	  2.086060
 -0.978275	  0.734652	  2.077503
 -0.984408	  0.718473	  2.067349
 -0.992726	  0.705194	  2.056373
 -1.001895	  0.691058	  2.041912
 -1.006625	  0.674945	  2.030013
 -1.006092	  0.658702	  2.014720
 -1.011129	  0.645780	  2.001818
 -1.021044	  0.633854	  1.990454
 -1.031633	  0.621825	  1.976957
 -1.041062	  0.612368	  1.961903
 -1.048677	  0.605124	  1.941044
 -1.051280	  0.595361	  1.921421
 -1.053619	  0.580233	  1.908626
 -1.062088	  0.565855	  1.899150
 -1.073335	  0.550114	  1.888590
 -1.078989	  0.536161	  1.871745
 -1.080542	  0.527832	  1.853468
 -1.085648	  0.521557	  1.834438
 -1.092538	  0.517004	  1.817344
 -1.098668	  0.508052	  1.799370
 -1.102264	  0.498574	  1.781899
 -1.104944	  0.489373	  1.764331
 -1.107580	  0.480269	  1.746808
 -1.110842	  0.472413	  1.728723
 -1.114412	  0.466660	  1.709539
 -1.114589	  0.458669	  1.689651
 -1.113906	  0.450119	  1.671600
 -1.115355	  0.439405	  1.655946
 -1.116719	  0.429143	  1.637142
 -1.114531	  0.422124	  1.617451
 -1.111578	  0.411098	  1.602605
 -1.112375	  0.397382	  1.586630
 -1.112971	  0.385042	  1.569648
 -1.109296	  0.369515	  1.553314
 -1.108101	  0.353816	  1.542080
 -1.111457	  0.341380	  1.528837
 -1.115230	  0.332148	  1.512955
 -1.118895	  0.319339	  1.492470
 -1.122640	  0.306292	  1.479681
 -1.125548	  0.291675	  1.467890
 -1.123969	  0.276484	  1.452263
 -1.122986	  0.262242	  1.439684
 -1.125007	  0.245840	  1.425631
 -1.127652	  0.233949	  1.409652
 -1.130510	  0.225884	  1.393662
 -1.136231	  0.212752	  1.375610
 -1.142617	  0.196160	  1.362074
 -1.145839	  0.184191	  1.355250
 -1.149922	  0.166525	  1.342815
 -1.153731	  0.152200	  1.325706
 -1.159592	  0.141487	  1.308546
 -1.169553	  0.131199	  1.295418
 -1.180058	  0.117881	  1.284362
 -1.190842	  0.103993	  1.274046
 -1.201436	  0.091515	  1.261342
 -1.209617	  0.080534	  1.246683
 -1.215888	  0.068582	  1.232173
 -1.221392	  0.054540	  1.219435
 -1.227330	  0.040130	  1.205076
 -1.232036	  0.030523	  1.186473
 -1.239848	  0.026337	  1.165527
 -1.249322	  0.020305	  1.150849
 -1.259162	  0.009633	  1.137635
 -1.268240	 -0.003090	  1.125470
 -1.276955	 -0.016189	  1.111588
 -1.285142	 -0.027972	  1.097199
 -1.292990	 -0.038063	  1.081691
 -1.300673	 -0.048293	  1.066319
 -1.308296	 -0.058609	  1.050974
 -1.315731	 -0.069087	  1.035643
 -1.322798	 -0.079946	  1.020406
 -1.329867	 -0.090789	  1.005160
 -1.336367	 -0.101901	  0.989854
 -1.342720	 -0.113086	  0.974539
 -1.349055	 -0.124265	  0.959214
 -1.353228	 -0.134782	  0.942723
 -1.356792	 -0.145072	  0.925950
 -1.360403	 -0.155352	  0.909179
 -1.363611	 -0.165491	  0.892229
 -1.363033	 -0.174019	  0.874115
 -1.362461	 -0.182535	  0.856047
 -1.362832	 -0.190419	  0.837900
 -1.365939	 -0.197650	  0.819512
 -1.370455	 -0.205910	  0.801977
 -1.378573	 -0.214851	  0.787176
 -1.388567	 -0.226666	  0.772957
 -1.396679	 -0.235210	  0.759183
 -1.400155	 -0.244975	  0.738152
 -1.400015	 -0.255049	  0.719900
 -1.400818	 -0.268356	  0.703792
 -1.407936	 -0.281749	  0.691976
 -1.414498	 -0.295671	  0.678310
 -1.418997	 -0.309129	  0.664014
 -1.423642	 -0.320961	  0.648647
 -1.428088	 -0.330978	  0.633719
 -1.434268	 -0.341848	  0.617324
 -1.439479	 -0.355164	  0.602503
 -1.440894	 -0.375904	  0.587202
 -1.437918	 -0.386420	  0.576994
 -1.429374	 -0.403718	  0.557291
 -1.427365	 -0.415682	  0.544690
 -1.423671	 -0.427146	  0.534150
 -1.424515	 -0.444443	  0.516176
 -1.425859	 -0.452835	  0.500061
 -1.422777	 -0.459560	  0.479983
 -1.418662	 -0.472358	  0.462438
 -1.417841	 -0.485878	  0.450624
 -1.418107	 -0.503716	  0.437763
 -1.414656	 -0.520659	  0.423725
 -1.407372	 -0.531456	  0.415206
 -1.394723	 -0.547213	  0.402783
 -1.385843	 -0.562162	  0.391912
 -1.379191	 -0.576307	  0.383714
 -1.368695	 -0.593584	  0.374564
 -1.356991	 -0.610648	  0.367325
 -1.351642	 -0.623799	  0.361060
 -1.342750	 -0.640981	  0.349966
 -1.332376	 -0.659456	  0.339840
 -1.325340	 -0.679613	  0.340703
 -1.320808	 -0.699083	  0.341200
 -1.314907	 -0.719841	  0.341357
 -1.301938	 -0.736020	  0.338027
 -1.286096	 -0.751157	  0.338111
 -1.274613	 -0.768582	  0.339643
 -1.269629	 -0.786531	  0.341331
 -1.265460	 -0.807526	  0.339313
 -1.264200	 -0.828448	  0.335867
 -1.266043	 -0.848555	  0.331898
 -1.269916	 -0.868208	  0.326908
 -1.274737	 -0.887097	  0.322323
 -1.279985	 -0.905908	  0.317337
 -1.286152	 -0.924371	  0.312345
 -1.292397	 -0.942718	  0.307653
 -1.299435	 -0.960719	  0.302327
 -1.306774	 -0.978422	  0.296623
 -1.316080	 -0.995057	  0.290738
 -1.327386	 -1.010353	  0.284624
 -1.340297	 -1.024243	  0.278319
 -1.353270	 -1.038050	  0.271917
 -1.366787	 -1.050908	  0.264711
 -1.380347	 -1.063710	  0.257490
 -1.393907	 -1.076539	  0.250318
 -1.407479	 -1.089340	  0.243120
 -1.421422	 -1.100391	  0.234000
 -1.435406	 -1.111121	  0.224548
 -1.449391	 -1.121847	  0.215094
 -1.463376	 -1.132573	  0.205640
 -1.477350	 -1.143091	  0.195948
 -1.490926	 -1.150894	  0.183515
 -1.504492	 -1.158672	  0.171066
 -1.516804	 -1.167341	  0.158711
 -1.527139	 -1.178094	  0.144260
 -1.538459	 -1.185953	  0.128626
 -1.550981	 -1.192363	  0.117860
 -1.570835	 -1.198212	  0.103126
 -1.583219	 -1.202815	  0.084999
 -1.587864	 -1.207183	  0.071934
 -1.596751	 -1.212064	  0.052739
 -1.610434	 -1.215431	  0.036924
 -1.626568	 -1.212229	  0.023496
 -1.640342	 -1.204862	  0.006284
 -1.650473	 -1.203644	 -0.009257
 -1.659750	 -1.204332	 -0.026007
 -1.668527	 -1.200711	 -0.044383
 -1.676154	 -1.199722	 -0.063056
 -1.683395	 -1.203954	 -0.082990
 -1.691872	 -1.201688	 -0.100446
 -1.702190	 -1.193624	 -0.116656
 -1.712499	 -1.187750	 -0.131261
 -1.720862	 -1.183566	 -0.149978
 -1.728311	 -1.179542	 -0.168138
 -1.734683	 -1.174783	 -0.186539
 -1.741018	 -1.170050	 -0.204918
 -1.746953	 -1.165499	 -0.223413
 -1.750429	 -1.160727	 -0.242569
 -1.753701	 -1.155834	 -0.261963
 -1.760013	 -1.152373	 -0.280441
 -1.765649	 -1.148524	 -0.299314
 -1.769645	 -1.145819	 -0.318755
 -1.773170	 -1.144746	 -0.338384
 -1.776591	 -1.143694	 -0.358073
 -1.780132	 -1.142727	 -0.377733
 -1.783683	 -1.146164	 -0.397138
 -1.787076	 -1.152765	 -0.415705
 -1.789762	 -1.159762	 -0.434286
 -1.793940	 -1.169522	 -0.451348
 -1.799875	 -1.179329	 -0.467640
 -1.805565	 -1.190044	 -0.483607
 -1.811423	 -1.201410	 -0.498996
 -1.817298	 -1.212767	 -0.514372
 -1.823246	 -1.223940	 -0.529856
 -1.829169	 -1.235077	 -0.545378
 -1.834890	 -1.246354	 -0.560873
 -1.840506	 -1.257705	 -0.576352
 -1.846109	 -1.269063	 -0.591831
 -1.850451	 -1.281293	 -0.607048
 -1.854525	 -1.293696	 -0.622200
 -1.858588	 -1.306097	 -0.637355
 -1.861325	 -1.318561	 -0.652754
 -1.863636	 -1.331038	 -0.668214
 -1.865968	 -1.343536	 -0.683651
 -1.867775	 -1.355777	 -0.699369
 -1.869391	 -1.368234	 -0.714892
 -1.870617	 -1.381309	 -0.730152
 -1.871293	 -1.392264	 -0.746937
 -1.872268	 -1.402754	 -0.763880
 -1.873271	 -1.414192	 -0.780308
 -1.874379	 -1.425776	 -0.796575
 -1.875443	 -1.437352	 -0.812849
 -1.875615	 -1.448756	 -0.829278
 -1.876378	 -1.460415	 -0.845502
 -1.881367	 -1.473500	 -0.859771
 -1.886406	 -1.486626	 -0.874041
 -1.890812	 -1.499820	 -0.888951
 -1.893142	 -1.512205	 -0.904481
