  1.265099	  0.920844	 -1.949483
  1.267698	  0.922549	 -1.954411
  1.255322	  0.922518	 -1.937721
  1.245732	  0.919113	 -1.920565
  1.240850	  0.916693	 -1.901774
  1.237888	  0.909094	 -1.881900
  1.230253	  0.893372	 -1.863036
  1.220887	  0.885467	 -1.849123
  1.207947	  0.882966	 -1.834381
  1.193184	  0.880486	 -1.816914
  1.185375	  0.871994	 -1.800285
  1.183866	  0.859044	 -1.783634
  1.190570	  0.847977	 -1.768112
  1.197979	  0.841702	 -1.752764
  1.206962	  0.838044	 -1.735375
  1.217523	  0.831480	 -1.719483
  1.228243	  0.821090	 -1.706578
  1.242421	  0.812073	 -1.692935
  1.255365	  0.806723	 -1.679846
  1.265297	  0.800252	 -1.668373
  1.281028	  0.788334	 -1.654603
  1.303966	  0.783540	 -1.642703
  1.315816	  0.782486	 -1.637623
  1.331005	  0.781401	 -1.623803
  1.341328	  0.772968	 -1.606444
  1.355541	  0.764840	 -1.593341
  1.369557	  0.757377	 -1.581107
  1.383542	  0.749895	 -1.568892
  1.394873	  0.741378	 -1.554672
  1.404848	  0.732449	 -1.539733
  1.414506	  0.723097	 -1.524868
  1.423513	  0.712956	 -1.510244
  1.432674	  0.702955	 -1.495531
  1.442144	  0.693380	 -1.480716
  1.451403	  0.683999	 -1.465701
  1.453947	  0.675591	 -1.447757
  1.456380	  0.667200	 -1.429767
  1.458813	  0.658809	 -1.411776
  1.461246	  0.650418	 -1.393786
  1.463648	  0.642042	 -1.375786
  1.464151	  0.634616	 -1.357228
  1.462152	  0.628568	 -1.338273
  1.460115	  0.622547	 -1.319310
  1.458271	  0.616817	 -1.300239
  1.457475	  0.612677	 -1.280690
  1.456713	  0.608624	 -1.261128
  1.456988	  0.608352	 -1.241182
  1.457118	  0.610639	 -1.221302
  1.456963	  0.614837	 -1.201473
  1.456070	  0.619061	 -1.181880
  1.452418	  0.621652	 -1.162745
  1.445343	  0.624035	 -1.147569
  1.433002	  0.624099	 -1.132767
  1.420868	  0.621611	 -1.117387
  1.409199	  0.620797	 -1.100591
  1.398470	  0.620626	 -1.083294
  1.385971	  0.622599	 -1.067582
  1.373089	  0.624986	 -1.052455
  1.359285	  0.626575	 -1.038133
  1.341042	  0.622444	 -1.031300
  1.323508	  0.619457	 -1.024729
  1.306755	  0.613955	 -1.020772
  1.284089	  0.596867	 -1.015252
  1.267193	  0.587637	 -1.008773
  1.250922	  0.591402	 -1.001053
  1.232399	  0.599320	 -0.991648
  1.209711	  0.591758	 -0.984615
  1.196111	  0.579524	 -0.983972
  1.179203	  0.564824	 -0.982458
  1.158747	  0.558477	 -0.977740
  1.144085	  0.556509	 -0.974853
  1.121997	  0.554847	 -0.973673
  1.096579	  0.546167	 -0.976474
  1.079419	  0.534791	 -0.976024
  1.066226	  0.524806	 -0.975102
  1.051059	  0.511493	 -0.970841
  1.033621	  0.498561	 -0.967781
  1.012286	  0.487073	 -0.961757
  0.990571	  0.476868	 -0.949925
  0.981157	  0.472068	 -0.943617
  0.971559	  0.466063	 -0.934673
  0.953738	  0.455437	 -0.921927
  0.936194	  0.446410	 -0.914558
  0.918781	  0.437727	 -0.907487
  0.904251	  0.430026	 -0.899259
  0.884894	  0.419561	 -0.889568
  0.868468	  0.409730	 -0.884221
  0.853001	  0.397547	 -0.879123
  0.840907	  0.384459	 -0.875178
  0.826030	  0.373228	 -0.866937
  0.804535	  0.364467	 -0.855152
  0.791771	  0.358808	 -0.845291
  0.783644	  0.350448	 -0.833058
  0.777941	  0.333773	 -0.818496
  0.773706	  0.320155	 -0.802956
  0.766159	  0.309397	 -0.785058
  0.754842	  0.299291	 -0.772315
  0.742804	  0.286694	 -0.762953
  0.733040	  0.270115	 -0.751502
  0.726286	  0.256371	 -0.738869
  0.717593	  0.242481	 -0.725072
  0.707204	  0.234638	 -0.710133
  0.696495	  0.226661	 -0.694999
  0.686457	  0.221199	 -0.678383
  0.677283	  0.214349	 -0.660216
  0.672383	  0.205979	 -0.644358
  0.668101	  0.194773	 -0.627879
  0.664956	  0.184543	 -0.611113
  0.661532	  0.174951	 -0.593972
  0.658940	  0.165890	 -0.575424
  0.655140	  0.156653	 -0.557118
  0.649439	  0.146352	 -0.543028
  0.639451	  0.134458	 -0.528321
  0.622206	  0.125326	 -0.510294
  0.608114	  0.120749	 -0.493671
  0.599762	  0.116687	 -0.477052
  0.596753	  0.119715	 -0.458648
  0.597814	  0.120464	 -0.432428
  0.597261	  0.118656	 -0.413367
  0.593072	  0.118408	 -0.390020
  0.582449	  0.110833	 -0.372578
  0.571135	  0.089074	 -0.360384
  0.563820	  0.069940	 -0.353924
  0.558894	  0.052191	 -0.341297
  0.557236	  0.043434	 -0.325341
  0.557408	  0.036904	 -0.305714
  0.554353	  0.026507	 -0.286439
  0.547434	  0.015123	 -0.270451
  0.537364	  0.005452	 -0.255292
  0.527203	 -0.001103	 -0.239252
  0.518308	 -0.007934	 -0.222365
  0.510361	 -0.017489	 -0.206433
  0.503331	 -0.028316	 -0.191336
  0.498210	 -0.040524	 -0.175849
  0.491537	 -0.052384	 -0.160571
  0.481721	 -0.061211	 -0.146044
  0.476934	 -0.071609	 -0.129990
  0.475774	 -0.087177	 -0.114571
  0.467022	 -0.103089	 -0.100522
  0.457312	 -0.112661	 -0.087549
  0.449558	 -0.117861	 -0.069550
  0.445796	 -0.131571	 -0.052417
  0.433946	 -0.151159	 -0.040256
  0.413247	 -0.160345	 -0.032020
  0.394337	 -0.164062	 -0.021454
  0.381369	 -0.162086	 -0.007505
  0.367413	 -0.169028	  0.005102
  0.353420	 -0.185368	  0.012454
  0.341230	 -0.198847	  0.031648
  0.332752	 -0.198389	  0.052972
  0.324425	 -0.199801	  0.068467
  0.312813	 -0.205830	  0.084392
  0.301790	 -0.212127	  0.100134
  0.291847	 -0.216299	  0.116176
  0.283494	 -0.222125	  0.131819
  0.278255	 -0.229389	  0.148200
  0.269409	 -0.237004	  0.164003
  0.249217	 -0.250177	  0.186293
  0.244588	 -0.253602	  0.195803
  0.238058	 -0.260456	  0.208400
  0.226304	 -0.277995	  0.227612
  0.213517	 -0.292742	  0.242251
  0.210584	 -0.297014	  0.246800
  0.198297	 -0.309732	  0.261504
  0.184885	 -0.323714	  0.278722
  0.175578	 -0.330724	  0.295464
  0.168898	 -0.334722	  0.307220
  0.158217	 -0.346225	  0.324301
  0.146029	 -0.354320	  0.343451
  0.140675	 -0.355129	  0.355232
  0.133156	 -0.355949	  0.374436
  0.119993	 -0.365294	  0.403857
  0.113884	 -0.371236	  0.413544
  0.105363	 -0.377584	  0.425432
  0.087055	 -0.390853	  0.446738
  0.079907	 -0.402603	  0.462075
  0.077184	 -0.403080	  0.464126
  0.067877	 -0.418390	  0.483899
  0.056775	 -0.430672	  0.514768
  0.051855	 -0.433417	  0.523749
  0.044908	 -0.436072	  0.536430
  0.027180	 -0.450331	  0.549961
  0.028996	 -0.459028	  0.572358
  0.033840	 -0.459768	  0.592327
  0.029312	 -0.463602	  0.612551
  0.024081	 -0.467940	  0.631439
  0.018088	 -0.472333	  0.650007
  0.010565	 -0.476858	  0.667975
  0.002979	 -0.481385	  0.685901
 -0.006388	 -0.485851	  0.702979
 -0.017259	 -0.489892	  0.719568
 -0.024643	 -0.494183	  0.737752
 -0.031262	 -0.500112	  0.755733
 -0.039581	 -0.507095	  0.772592
 -0.048327	 -0.512606	  0.789182
 -0.058739	 -0.513956	  0.806868
 -0.072426	 -0.516299	  0.823703
 -0.086811	 -0.524853	  0.838828
 -0.097051	 -0.534947	  0.852181
 -0.104348	 -0.539566	  0.868655
 -0.112335	 -0.540882	  0.887585
 -0.125346	 -0.554267	  0.905600
 -0.134012	 -0.572090	  0.918709
 -0.137313	 -0.585100	  0.930031
 -0.137580	 -0.598350	  0.944485
 -0.139940	 -0.613203	  0.961874
 -0.149256	 -0.626371	  0.976925
 -0.160340	 -0.635779	  0.991698
 -0.168860	 -0.643430	  1.008286
 -0.173825	 -0.654053	  1.025108
 -0.176574	 -0.663852	  1.041409
 -0.174390	 -0.675998	  1.057806
 -0.170847	 -0.690382	  1.074448
 -0.173017	 -0.703548	  1.092904
 -0.181938	 -0.710378	  1.109291
 -0.192535	 -0.715338	  1.125224
 -0.201828	 -0.723186	  1.143196
 -0.207864	 -0.732452	  1.159647
 -0.212497	 -0.739400	  1.175837
 -0.219243	 -0.745913	  1.193412
 -0.231716	 -0.758593	  1.211710
 -0.236048	 -0.770103	  1.227676
 -0.236975	 -0.778905	  1.237934
 -0.237463	 -0.790898	  1.259161
 -0.246087	 -0.803545	  1.276092
 -0.263627	 -0.816160	  1.288485
 -0.274711	 -0.826063	  1.294889
 -0.286960	 -0.843814	  1.306534
 -0.297193	 -0.856338	  1.323836
 -0.302114	 -0.860244	  1.336602
 -0.308956	 -0.865038	  1.353904
 -0.321260	 -0.872183	  1.367915
 -0.339807	 -0.881373	  1.381047
 -0.361130	 -0.890513	  1.398370
 -0.377663	 -0.900033	  1.411948
 -0.380593	 -0.903770	  1.416972
 -0.389159	 -0.921684	  1.434869
 -0.396510	 -0.934397	  1.448121
 -0.395858	 -0.944936	  1.465795
 -0.395389	 -0.949413	  1.488884
 -0.414888	 -0.955961	  1.510037
 -0.425855	 -0.961604	  1.516328
 -0.439197	 -0.973532	  1.527656
 -0.449908	 -0.983004	  1.542605
 -0.456829	 -0.989831	  1.558345
 -0.465360	 -0.995194	  1.577766
 -0.478777	 -1.002589	  1.595355
 -0.491664	 -1.012373	  1.603581
 -0.505499	 -1.032809	  1.607937
 -0.519853	 -1.050497	  1.622746
 -0.530151	 -1.057079	  1.645596
 -0.531714	 -1.059778	  1.662200
 -0.524590	 -1.064754	  1.684464
 -0.522798	 -1.070677	  1.707151
 -0.529269	 -1.077119	  1.725879
 -0.540482	 -1.084739	  1.738283
 -0.550483	 -1.094253	  1.748483
 -0.562236	 -1.103521	  1.760438
 -0.577779	 -1.112419	  1.779937
 -0.581403	 -1.122712	  1.801468
 -0.585859	 -1.129253	  1.816127
 -0.591576	 -1.136937	  1.832773
 -0.595476	 -1.146578	  1.858321
 -0.595179	 -1.151054	  1.871095
 -0.588580	 -1.157272	  1.894361
 -0.591709	 -1.165366	  1.916991
 -0.596126	 -1.171295	  1.930326
 -0.604529	 -1.179879	  1.948466
 -0.612607	 -1.187657	  1.965624
 -0.622727	 -1.194549	  1.981270
 -0.631290	 -1.203913	  2.002892
 -0.633372	 -1.210557	  2.019827
 -0.633390	 -1.215151	  2.034877
 -0.640479	 -1.221501	  2.057688
 -0.651954	 -1.234535	  2.091519
 -0.658155	 -1.241473	  2.109223
