  0.115944	 -2.359199	  0.817374
  0.128749	 -2.381555	  0.838105
  0.120946	 -2.368057	  0.825578
  0.112249	 -2.354932	  0.813246
  0.103551	 -2.341806	  0.800915
  0.094392	 -2.329001	  0.788580
  0.084707	 -2.316581	  0.776254
  0.074956	 -2.304249	  0.763891
  0.064669	 -2.292676	  0.751232
  0.054381	 -2.281103	  0.738574
  0.043366	 -2.270614	  0.725588
  0.032328	 -2.260160	  0.712592
  0.020447	 -2.250898	  0.699437
  0.008514	 -2.241715	  0.686273
 -0.004235	 -2.233599	  0.673175
 -0.017069	 -2.225599	  0.660086
 -0.030470	 -2.218131	  0.647256
 -0.044206	 -2.210992	  0.634592
 -0.057941	 -2.203853	  0.621928
 -0.072423	 -2.196862	  0.610037
 -0.087127	 -2.189921	  0.598391
 -0.101830	 -2.182980	  0.586745
 -0.116672	 -2.175953	  0.575328
 -0.132262	 -2.168453	  0.565294
 -0.147853	 -2.160952	  0.555260
 -0.163443	 -2.153451	  0.545226
 -0.179033	 -2.145950	  0.535192
 -0.195094	 -2.137494	  0.526793
 -0.211173	 -2.128997	  0.518470
 -0.227252	 -2.120501	  0.510148
 -0.243332	 -2.112004	  0.501825
 -0.259426	 -2.102676	  0.494480
 -0.275479	 -2.092634	  0.488040
 -0.291532	 -2.082592	  0.481600
 -0.307584	 -2.072550	  0.475160
 -0.323486	 -2.062017	  0.469144
 -0.338853	 -2.050136	  0.464382
 -0.354221	 -2.038255	  0.459620
 -0.369589	 -2.026374	  0.454858
 -0.384318	 -2.013494	  0.450717
 -0.398463	 -1.999823	  0.447107
 -0.412608	 -1.986152	  0.443498
 -0.425976	 -1.971642	  0.440218
 -0.438704	 -1.956513	  0.437202
 -0.451145	 -1.941130	  0.434271
 -0.462464	 -1.924848	  0.431671
 -0.473618	 -1.908446	  0.429105
 -0.483441	 -1.891175	  0.426822
 -0.493263	 -1.873903	  0.424539
 -0.501908	 -1.855963	  0.422687
 -0.510355	 -1.837922	  0.420908
 -0.518611	 -1.819785	  0.419217
 -0.525722	 -1.801128	  0.418054
 -0.532833	 -1.782470	  0.416891
 -0.539944	 -1.763813	  0.415729
 -0.546214	 -1.744826	  0.415327
 -0.552209	 -1.725746	  0.415170
 -0.558205	 -1.706667	  0.415014
 -0.564200	 -1.687587	  0.414858
 -0.569739	 -1.668381	  0.415525
 -0.574946	 -1.649111	  0.416776
 -0.580154	 -1.629842	  0.418027
 -0.585361	 -1.610572	  0.419278
 -0.590563	 -1.591302	  0.420539
 -0.595211	 -1.571973	  0.422728
 -0.599859	 -1.552644	  0.424917
 -0.604507	 -1.533315	  0.427106
 -0.609154	 -1.513986	  0.429295
 -0.613615	 -1.494662	  0.431881
 -0.617825	 -1.475359	  0.434991
 -0.622035	 -1.456056	  0.438100
 -0.626245	 -1.436753	  0.441210
 -0.630034	 -1.417168	  0.442645
 -0.633685	 -1.397525	  0.443558
 -0.637337	 -1.377883	  0.444471
 -0.640763	 -1.358183	  0.444919
 -0.644159	 -1.338478	  0.445303
 -0.646010	 -1.319486	  0.439313
 -0.647827	 -1.300529	  0.433202
 -0.649644	 -1.281573	  0.427090
 -0.651360	 -1.262932	  0.420050
 -0.652921	 -1.244819	  0.411714
 -0.654307	 -1.226827	  0.403090
 -0.654266	 -1.210012	  0.392262
 -0.654225	 -1.193197	  0.381433
 -0.656853	 -1.176999	  0.370000
 -0.661531	 -1.161505	  0.358251
 -0.672403	 -1.149727	  0.346289
 -0.685606	 -1.140122	  0.334738
 -0.697830	 -1.131130	  0.321711
 -0.709593	 -1.122432	  0.308073
 -0.721549	 -1.114489	  0.294146
 -0.733587	 -1.106894	  0.280096
 -0.744903	 -1.099203	  0.265509
 -0.755729	 -1.091458	  0.250582
 -0.765964	 -1.083380	  0.235416
 -0.775567	 -1.074966	  0.220022
 -0.784938	 -1.066386	  0.204576
 -0.793115	 -1.056998	  0.188923
 -0.801291	 -1.047611	  0.173270
 -0.808501	 -1.037669	  0.157485
 -0.815176	 -1.027439	  0.141648
 -0.821851	 -1.017210	  0.125812
 -0.827225	 -1.006086	  0.110083
 -0.832565	 -0.994940	  0.094359
 -0.837747	 -0.983628	  0.078701
 -0.841836	 -0.971229	  0.063549
 -0.845925	 -0.958831	  0.048398
 -0.849667	 -0.946048	  0.033479
 -0.852398	 -0.932214	  0.019296
 -0.855129	 -0.918380	  0.005112
 -0.857164	 -0.903782	 -0.008406
 -0.858496	 -0.888475	 -0.021209
 -0.859828	 -0.873168	 -0.034013
 -0.859801	 -0.856657	 -0.045299
 -0.859613	 -0.840018	 -0.056395
 -0.858931	 -0.823030	 -0.066927
 -0.857303	 -0.805448	 -0.076321
 -0.855674	 -0.787867	 -0.085715
 -0.853274	 -0.769923	 -0.094216
 -0.850409	 -0.751792	 -0.102155
 -0.847543	 -0.733660	 -0.110095
 -0.844387	 -0.715356	 -0.117510
 -0.840812	 -0.696831	 -0.124146
 -0.837237	 -0.678306	 -0.130783
 -0.833662	 -0.659781	 -0.137419
 -0.830128	 -0.641040	 -0.143444
 -0.826657	 -0.622040	 -0.148636
 -0.823186	 -0.603040	 -0.153829
 -0.819715	 -0.584041	 -0.159021
 -0.816244	 -0.565041	 -0.164214
 -0.813246	 -0.545731	 -0.168473
 -0.810312	 -0.526383	 -0.172603
 -0.807379	 -0.507036	 -0.176734
 -0.804446	 -0.487688	 -0.180865
 -0.801822	 -0.468279	 -0.184917
 -0.799971	 -0.448741	 -0.188770
 -0.798119	 -0.429204	 -0.192623
 -0.796268	 -0.409666	 -0.196475
 -0.794623	 -0.390126	 -0.200411
 -0.794701	 -0.370663	 -0.205016
 -0.794778	 -0.351201	 -0.209620
 -0.794855	 -0.331738	 -0.214225
 -0.795774	 -0.312446	 -0.219419
 -0.797674	 -0.293421	 -0.225286
 -0.799575	 -0.274395	 -0.231152
 -0.801729	 -0.255471	 -0.237254
 -0.805288	 -0.237226	 -0.244634
 -0.808847	 -0.218981	 -0.252013
 -0.812406	 -0.200736	 -0.259393
 -0.817345	 -0.183536	 -0.268323
 -0.822308	 -0.166355	 -0.277278
 -0.827271	 -0.149175	 -0.286234
 -0.833347	 -0.133085	 -0.296441
 -0.839671	 -0.117269	 -0.306924
 -0.845995	 -0.101454	 -0.317406
 -0.853003	 -0.086262	 -0.328365
 -0.860866	 -0.071938	 -0.339897
 -0.868729	 -0.057613	 -0.351429
 -0.876592	 -0.043288	 -0.362960
 -0.885838	 -0.030147	 -0.374868
 -0.895534	 -0.017430	 -0.386880
 -0.905229	 -0.004714	 -0.398892
 -0.914925	  0.008003	 -0.410904
 -0.926241	  0.019462	 -0.422763
 -0.937991	  0.030546	 -0.434557
 -0.949740	  0.041630	 -0.446350
 -0.961490	  0.052715	 -0.458143
 -0.974517	  0.062594	 -0.469663
 -0.988202	  0.071779	 -0.480992
 -1.001887	  0.080964	 -0.492322
 -1.015572	  0.090148	 -0.503651
 -1.029902	  0.098321	 -0.514959
 -1.044854	  0.105397	 -0.526200
 -1.059807	  0.112472	 -0.537440
 -1.074760	  0.119548	 -0.548681
 -1.090077	  0.125646	 -0.560003
 -1.105813	  0.130425	 -0.571385
 -1.121549	  0.135203	 -0.582767
 -1.137285	  0.139982	 -0.594149
 -1.153257	  0.143752	 -0.605581
 -1.169495	  0.146034	 -0.617031
 -1.185733	  0.148316	 -0.628482
 -1.201971	  0.150599	 -0.639932
 -1.218255	  0.151937	 -0.651467
 -1.234546	  0.152233	 -0.663065
 -1.250836	  0.152530	 -0.674664
 -1.267127	  0.152827	 -0.686262
 -1.283037	  0.151974	 -0.698352
 -1.298918	  0.151043	 -0.710472
 -1.314800	  0.150112	 -0.722593
 -1.330227	  0.148607	 -0.735232
 -1.345648	  0.147095	 -0.747877
 -1.360999	  0.145436	 -0.760590
 -1.376298	  0.143673	 -0.773350
 -1.391665	  0.142108	 -0.786055
 -1.407075	  0.140675	 -0.798722
 -1.422779	  0.139749	 -0.811073
 -1.438585	  0.139068	 -0.823308
 -1.454630	  0.139121	 -0.835248
 -1.470763	  0.139772	 -0.847050
 -1.486965	  0.140983	 -0.858714
 -1.503286	  0.143065	 -0.870085
 -1.519633	  0.145386	 -0.881370
 -1.535983	  0.149011	 -0.892304
 -1.552329	  0.152753	 -0.903203
 -1.568523	  0.157846	 -0.913778
 -1.584664	  0.163288	 -0.924259
 -1.600633	  0.169639	 -0.934490
 -1.616385	  0.176916	 -0.944436
 -1.632136	  0.184193	 -0.954382
 -1.647529	  0.192979	 -0.963649
 -1.662858	  0.201983	 -0.972810
 -1.678185	  0.210999	 -0.981965
 -1.693013	  0.221619	 -0.990172
 -1.707840	  0.232239	 -0.998379
 -1.722588	  0.243005	 -1.006541
 -1.736429	  0.255254	 -1.014183
 -1.750269	  0.267503	 -1.021825
 -1.763559	  0.280301	 -1.029544
 -1.775649	  0.294169	 -1.037386
 -1.787739	  0.308038	 -1.045228
 -1.797684	  0.322858	 -1.054253
 -1.807489	  0.337729	 -1.063349
 -1.815562	  0.352824	 -1.073691
 -1.823453	  0.367932	 -1.084155
 -1.830599	  0.383111	 -1.095041
 -1.837539	  0.398306	 -1.106039
 -1.844623	  0.413498	 -1.116949
 -1.852122	  0.428674	 -1.127600
 -1.859620	  0.443851	 -1.138251
 -1.867572	  0.458821	 -1.148865
 -1.875859	  0.473631	 -1.159448
 -1.884177	  0.488421	 -1.170033
 -1.893200	  0.502744	 -1.180684
 -1.902223	  0.517067	 -1.191335
 -1.911516	  0.531128	 -1.202102
 -1.920983	  0.545016	 -1.212942
 -1.930524	  0.558826	 -1.223816
 -1.940337	  0.572347	 -1.234811
 -1.950149	  0.585868	 -1.245807
 -1.960242	  0.599146	 -1.256845
 -1.970404	  0.612362	 -1.267893
 -1.980758	  0.625493	 -1.278864
 -1.991562	  0.638415	 -1.289648
 -2.002366	  0.651337	 -1.300432
 -2.013171	  0.664259	 -1.311215
 -2.023975	  0.677182	 -1.321999
 -2.040656	  0.696827	 -1.338336
 -2.051668	  0.709675	 -1.348997
