  2.993463	  0.048315	 -0.466633
  2.963824	  0.047837	 -0.462013
  2.926798	  0.054381	 -0.491538
  2.884758	  0.061984	 -0.513447
  2.841624	  0.071431	 -0.535740
  2.795721	  0.082094	 -0.556242
  2.749300	  0.091039	 -0.571404
  2.705157	  0.099751	 -0.585895
  2.660636	  0.109546	 -0.599645
  2.614898	  0.128597	 -0.606776
  2.567552	  0.146137	 -0.622765
  2.521293	  0.156353	 -0.647576
  2.478678	  0.166911	 -0.671526
  2.437714	  0.178472	 -0.694588
  2.396421	  0.190923	 -0.717412
  2.352829	  0.203702	 -0.740444
  2.306140	  0.213607	 -0.762458
  2.259545	  0.220234	 -0.782440
  2.214242	  0.224177	 -0.800438
  2.168602	  0.226003	 -0.817288
  2.120759	  0.225242	 -0.833335
  2.072305	  0.224389	 -0.850124
  2.024410	  0.224862	 -0.868675
  1.978291	  0.227002	 -0.886809
  1.933083	  0.229761	 -0.903054
  1.886768	  0.236527	 -0.916002
  1.840593	  0.248749	 -0.928702
  1.794170	  0.256989	 -0.946273
  1.747969	  0.263833	 -0.965487
  1.702844	  0.270230	 -0.986094
  1.659640	  0.275317	 -1.007097
  1.615240	  0.281552	 -1.029229
  1.571672	  0.289863	 -1.052477
  1.529086	  0.299319	 -1.076495
  1.488238	  0.308141	 -1.100363
  1.446830	  0.315815	 -1.125415
  1.404445	  0.321887	 -1.150960
  1.361902	  0.325903	 -1.175290
  1.317441	  0.328336	 -1.199609
  1.271588	  0.327714	 -1.222036
  1.225376	  0.323416	 -1.240938
  1.181038	  0.316062	 -1.256135
  1.139418	  0.306791	 -1.267560
  1.102483	  0.295951	 -1.276118
  1.057068	  0.277345	 -1.285993
  0.986254	  0.242804	 -1.300775
  0.902390	  0.205054	 -1.315977
  0.827748	  0.182018	 -1.326158
  0.768189	  0.164160	 -1.330445
  0.717599	  0.141820	 -1.327458
  0.657981	  0.116132	 -1.315080
  0.600831	  0.113584	 -1.304403
  0.566249	  0.123629	 -1.301361
  0.534674	  0.147194	 -1.304965
  0.492434	  0.199448	 -1.318995
  0.431339	  0.300090	 -1.344812
  0.346451	  0.434340	 -1.332959
  0.242373	  0.542078	 -1.303358
  0.182449	  0.617848	 -1.266693
  0.149361	  0.681280	 -1.232274
  0.126812	  0.734404	 -1.212417
  0.109888	  0.783177	 -1.205964
  0.089734	  0.851189	 -1.218155
  0.071950	  0.926785	 -1.270490
  0.053998	  0.969338	 -1.359766
  0.043624	  0.985001	 -1.475628
  0.081067	  1.011344	 -1.616976
  0.141026	  1.062222	 -1.807710
  0.192865	  1.082713	 -2.015338
  0.193652	  1.047264	 -2.180463
  0.144555	  1.013051	 -2.240777
  0.113207	  0.998669	 -2.246363
  0.077823	  0.987528	 -2.233247
  0.001800	  0.964758	 -2.180951
 -0.098870	  0.933436	 -2.097956
 -0.190219	  0.871261	 -2.013207
 -0.281838	  0.761484	 -1.962544
 -0.381028	  0.666056	 -1.938120
 -0.473527	  0.623279	 -1.938964
 -0.543487	  0.618581	 -1.957178
 -0.597199	  0.625812	 -1.978862
 -0.644154	  0.636455	 -2.001027
 -0.687988	  0.647573	 -2.023436
 -0.729969	  0.658144	 -2.046493
 -0.770624	  0.667659	 -2.069336
 -0.811342	  0.675933	 -2.092559
 -0.854370	  0.683377	 -2.116909
 -0.898874	  0.690553	 -2.139863
 -0.944586	  0.696974	 -2.161623
 -0.988494	  0.702559	 -2.181563
 -1.031982	  0.707915	 -2.201304
 -1.077673	  0.714534	 -2.222196
 -1.122899	  0.724486	 -2.241147
 -1.169234	  0.737358	 -2.258570
 -1.214140	  0.752549	 -2.272374
 -1.257282	  0.765227	 -2.290033
 -1.302100	  0.773709	 -2.308995
 -1.347096	  0.783495	 -2.331030
 -1.394452	  0.791314	 -2.349309
 -1.439746	  0.804329	 -2.362767
 -1.483221	  0.813823	 -2.382047
 -1.529918	  0.814991	 -2.404271
 -1.583508	  0.815303	 -2.414080
 -1.599343	  0.823456	 -2.438221
