 -2.433384	  0.093995	  0.565517
 -2.433384	  0.093995	  0.565517
 -2.416229	  0.103239	  0.561009
 -2.397642	  0.110416	  0.559313
 -2.378492	  0.116190	  0.559384
 -2.359379	  0.122074	  0.559567
 -2.340928	  0.129534	  0.561548
 -2.322480	  0.136998	  0.563533
 -2.304143	  0.144969	  0.563975
 -2.286066	  0.153434	  0.562719
 -2.267990	  0.161898	  0.561451
 -2.249912	  0.169970	  0.558619
 -2.231841	  0.178019	  0.555682
 -2.214097	  0.186735	  0.552653
 -2.196740	  0.196168	  0.549528
 -2.179389	  0.205613	  0.546414
 -2.162886	  0.216763	  0.544602
 -2.146406	  0.227955	  0.542827
 -2.129508	  0.238544	  0.541291
 -2.112028	  0.247793	  0.539790
 -2.093662	  0.255081	  0.538262
 -2.074185	  0.262809	  0.537898
 -2.056481	  0.270710	  0.536491
 -2.040200	  0.280524	  0.533296
 -2.022734	  0.292708	  0.531351
 -2.005095	  0.304056	  0.534437
 -1.988602	  0.312674	  0.533355
 -1.970746	  0.322283	  0.530748
 -1.953154	  0.331997	  0.529338
 -1.936168	  0.340949	  0.527073
 -1.917578	  0.351083	  0.523572
 -1.898477	  0.361311	  0.524898
 -1.883622	  0.368742	  0.522526
 -1.864381	  0.377348	  0.517902
 -1.848501	  0.388960	  0.513871
 -1.832636	  0.401756	  0.510454
 -1.820479	  0.416563	  0.505359
 -1.806828	  0.430735	  0.499959
 -1.793292	  0.444653	  0.494843
 -1.780525	  0.459126	  0.489595
 -1.767740	  0.473572	  0.484346
 -1.749756	  0.480104	  0.478552
 -1.731524	  0.485950	  0.472769
 -1.713530	  0.492721	  0.467264
 -1.696360	  0.501823	  0.462537
 -1.679196	  0.510939	  0.457830
 -1.663269	  0.522989	  0.458824
 -1.648485	  0.535967	  0.462425
 -1.634219	  0.548535	  0.465254
 -1.619747	  0.559823	  0.456524
 -1.605089	  0.571568	  0.447949
 -1.590852	  0.581357	  0.440843
 -1.575270	  0.590781	  0.432713
 -1.559662	  0.603670	  0.424567
 -1.544282	  0.614403	  0.422561
 -1.527105	  0.625373	  0.420244
 -1.510769	  0.636937	  0.417108
 -1.494745	  0.647412	  0.414598
 -1.476048	  0.658352	  0.415202
 -1.460189	  0.670410	  0.413254
 -1.445320	  0.679901	  0.407997
 -1.427471	  0.691486	  0.403254
 -1.411285	  0.703163	  0.402274
 -1.394332	  0.710697	  0.399813
 -1.377095	  0.722017	  0.393078
 -1.360907	  0.735260	  0.388129
 -1.343607	  0.741149	  0.391435
 -1.323944	  0.746039	  0.390737
 -1.303717	  0.756618	  0.386467
 -1.287823	  0.771004	  0.383332
 -1.271267	  0.773281	  0.383717
 -1.250062	  0.775515	  0.379666
 -1.230181	  0.778579	  0.374449
 -1.209666	  0.784552	  0.370570
 -1.192496	  0.791881	  0.367060
 -1.175005	  0.802855	  0.362455
 -1.156233	  0.809802	  0.362206
 -1.135855	  0.814878	  0.366281
 -1.117456	  0.817758	  0.366968
 -1.097008	  0.824367	  0.362262
 -1.076608	  0.832016	  0.364267
 -1.058497	  0.838429	  0.369889
 -1.041689	  0.841316	  0.368241
 -1.021284	  0.852583	  0.372519
 -1.006630	  0.860114	  0.378668
 -0.988328	  0.866115	  0.385406
 -0.969602	  0.874523	  0.389850
 -0.952312	  0.882725	  0.389970
 -0.931329	  0.890639	  0.395110
 -0.916478	  0.898931	  0.402587
 -0.901016	  0.912109	  0.410507
 -0.884548	  0.921726	  0.416104
 -0.868548	  0.927692	  0.422173
 -0.852401	  0.938384	  0.436922
 -0.839034	  0.950952	  0.445495
 -0.822074	  0.965953	  0.441304
 -0.806914	  0.976712	  0.439423
 -0.784519	  0.984701	  0.438080
 -0.766650	  0.993128	  0.441578
 -0.753666	  1.005581	  0.443978
 -0.735968	  1.016070	  0.443305
 -0.716051	  1.027715	  0.444197
 -0.703717	  1.038943	  0.444909
 -0.690915	  1.051533	  0.448806
 -0.677238	  1.069223	  0.445170
 -0.657640	  1.084195	  0.438848
 -0.641538	  1.090588	  0.441297
 -0.618141	  1.097723	  0.445134
 -0.601683	  1.102440	  0.443642
 -0.585952	  1.114639	  0.448321
 -0.571560	  1.127941	  0.449398
 -0.555277	  1.141262	  0.445163
 -0.540180	  1.155605	  0.444894
 -0.523700	  1.166901	  0.443366
 -0.507396	  1.179505	  0.441960
 -0.492905	  1.195317	  0.445899
 -0.478646	  1.201699	  0.450762
 -0.455453	  1.210536	  0.453102
 -0.436875	  1.221894	  0.459353
 -0.425725	  1.237314	  0.453436
 -0.414047	  1.252720	  0.444645
 -0.398942	  1.266734	  0.439910
 -0.382909	  1.275504	  0.443146
 -0.361576	  1.282152	  0.442466
 -0.340650	  1.284645	  0.435699
 -0.323225	  1.289849	  0.431506
 -0.305040	  1.300817	  0.427245
 -0.288647	  1.309676	  0.424925
 -0.270597	  1.321160	  0.422197
 -0.253914	  1.333108	  0.423113
 -0.238246	  1.342123	  0.417931
 -0.221623	  1.352558	  0.413223
 -0.206922	  1.365920	  0.415779
 -0.189833	  1.374563	  0.415539
 -0.171995	  1.381180	  0.416604
 -0.154258	  1.388925	  0.419447
 -0.136091	  1.396876	  0.425235
 -0.120386	  1.406143	  0.431703
 -0.104190	  1.418331	  0.435142
 -0.088809	  1.424127	  0.443566
 -0.069070	  1.433412	  0.448088
 -0.052845	  1.438071	  0.463143
 -0.039862	  1.436784	  0.479657
 -0.029403	  1.431450	  0.495768
 -0.015863	  1.431234	  0.510633
 -0.003284	  1.437788	  0.522053
  0.013777	  1.441413	  0.533605
  0.035058	  1.439223	  0.545267
  0.049327	  1.436988	  0.555430
  0.068220	  1.433279	  0.560560
  0.084030	  1.427101	  0.572433
  0.101890	  1.418909	  0.578624
  0.120566	  1.413749	  0.582487
  0.142338	  1.412471	  0.582782
  0.161019	  1.409913	  0.586516
  0.180406	  1.410920	  0.592056
  0.202543	  1.413190	  0.592838
  0.222817	  1.414709	  0.590150
  0.240331	  1.420079	  0.589694
  0.261533	  1.425016	  0.591046
  0.283699	  1.426211	  0.589411
  0.300335	  1.433790	  0.585775
  0.316781	  1.441549	  0.587539
  0.339875	  1.456430	  0.584377
  0.357677	  1.462684	  0.575466
  0.372104	  1.476771	  0.564385
  0.379414	  1.495705	  0.557725
  0.389163	  1.516285	  0.558886
  0.396550	  1.530959	  0.562579
  0.411845	  1.546825	  0.561588
  0.425779	  1.561088	  0.559322
  0.437170	  1.579315	  0.554335
  0.445283	  1.595574	  0.546296
  0.455000	  1.611245	  0.536397
  0.462321	  1.628937	  0.532158
  0.469040	  1.646364	  0.528770
  0.474011	  1.660639	  0.519970
  0.480348	  1.677371	  0.510082
  0.487392	  1.686317	  0.499428
  0.495995	  1.698777	  0.483604
  0.503096	  1.710580	  0.470896
  0.508691	  1.721158	  0.454242
  0.513464	  1.730756	  0.437101
  0.518386	  1.739404	  0.419710
  0.523337	  1.747951	  0.402320
  0.528288	  1.756504	  0.384931
  0.532869	  1.766780	  0.368397
  0.537305	  1.777655	  0.352209
  0.541742	  1.788530	  0.336021
  0.546178	  1.799406	  0.319833
  0.550642	  1.810285	  0.303668
  0.563478	  1.823575	  0.296045
  0.577781	  1.836692	  0.291213
  0.592095	  1.849803	  0.286399
  0.608787	  1.860815	  0.286364
  0.626029	  1.870790	  0.288151
  0.643249	  1.880754	  0.290197
  0.660320	  1.890646	  0.293471
  0.677390	  1.900539	  0.296749
  0.694149	  1.910776	  0.300535
  0.710747	  1.921181	  0.304567
  0.727286	  1.931771	  0.308349
  0.743410	  1.943377	  0.310649
  0.759536	  1.954982	  0.312941
  0.775623	  1.966842	  0.313743
  0.791442	  1.978780	  0.313537
  0.807993	  1.990762	  0.314737
  0.824210	  2.003222	  0.314264
  0.838476	  2.016963	  0.311986
  0.852340	  2.030614	  0.308143
  0.868272	  2.043361	  0.305554
  0.886247	  2.054014	  0.300369
  0.904513	  2.061574	  0.294605
  0.917352	  2.073866	  0.287011
  0.931882	  2.087812	  0.284733
  0.949191	  2.098185	  0.278736
  0.966441	  2.105930	  0.268337
  0.977043	  2.119504	  0.259344
  0.990320	  2.133211	  0.252887
  1.006471	  2.143522	  0.246242
  1.019020	  2.158572	  0.238383
  1.032530	  2.173790	  0.232272
  1.049531	  2.183193	  0.230142
  1.069845	  2.186014	  0.227207
  1.093482	  2.190708	  0.219301
  1.107645	  2.202838	  0.211547
  1.135211	  2.217762	  0.206955
  1.141640	  2.218280	  0.206837
