 -1.742877	 -0.516168	 -1.696810
 -1.749856	 -0.526146	 -1.693637
 -1.736844	 -0.515296	 -1.697131
 -1.718371	 -0.496919	 -1.701003
 -1.710471	 -0.481363	 -1.706030
 -1.701897	 -0.468006	 -1.711094
 -1.685078	 -0.450295	 -1.716477
 -1.675704	 -0.435460	 -1.721921
 -1.665962	 -0.421446	 -1.728340
 -1.651238	 -0.405651	 -1.733842
 -1.641610	 -0.386622	 -1.740725
 -1.638561	 -0.370854	 -1.748319
 -1.628843	 -0.354273	 -1.756842
 -1.611175	 -0.342656	 -1.761528
 -1.595460	 -0.330843	 -1.766724
 -1.582059	 -0.316890	 -1.772987
 -1.568929	 -0.303099	 -1.779128
 -1.555730	 -0.289367	 -1.785223
 -1.541842	 -0.276268	 -1.791141
 -1.527846	 -0.263738	 -1.795876
 -1.513314	 -0.250275	 -1.798569
 -1.500143	 -0.235499	 -1.806577
 -1.487476	 -0.221730	 -1.816921
 -1.473477	 -0.210872	 -1.821039
 -1.453630	 -0.202739	 -1.822438
 -1.432791	 -0.192039	 -1.830473
 -1.424562	 -0.180953	 -1.838591
 -1.415101	 -0.164099	 -1.849204
 -1.399034	 -0.149542	 -1.860056
 -1.383539	 -0.141786	 -1.863957
 -1.365955	 -0.133275	 -1.864183
 -1.348467	 -0.121900	 -1.868437
 -1.331894	 -0.111396	 -1.876059
 -1.314929	 -0.105037	 -1.881232
 -1.292651	 -0.097495	 -1.889602
 -1.276984	 -0.089124	 -1.900430
 -1.265454	 -0.081598	 -1.909964
 -1.249447	 -0.067027	 -1.917695
 -1.236171	 -0.048532	 -1.920978
 -1.226501	 -0.033173	 -1.920352
 -1.211525	 -0.018584	 -1.924107
 -1.197337	 -0.005146	 -1.929929
 -1.183591	  0.008206	 -1.935577
 -1.170624	  0.022210	 -1.941651
 -1.157748	  0.036248	 -1.947748
 -1.145884	  0.051012	 -1.954185
 -1.134097	  0.065811	 -1.960672
 -1.122936	  0.081174	 -1.966948
 -1.111864	  0.096614	 -1.973195
 -1.100796	  0.112181	 -1.979127
 -1.089732	  0.127811	 -1.984895
 -1.078665	  0.143438	 -1.990667
 -1.066729	  0.158266	 -1.996803
 -1.054773	  0.173074	 -2.002948
 -1.042823	  0.187889	 -2.009094
 -1.029750	  0.201445	 -2.015826
 -1.016191	  0.214379	 -2.022818
 -1.002646	  0.227331	 -2.029803
 -0.988871	  0.239985	 -2.036882
 -0.973922	  0.250903	 -2.044454
 -0.958971	  0.261817	 -2.052025
 -0.944017	  0.272729	 -2.059596
 -0.928489	  0.282653	 -2.067369
 -0.912864	  0.292396	 -2.075174
 -0.897237	  0.302137	 -2.082980
 -0.881450	  0.311619	 -2.090782
 -0.865661	  0.321099	 -2.098582
 -0.849869	  0.330594	 -2.106350
 -0.834027	  0.339937	 -2.114171
 -0.817951	  0.348890	 -2.122020
 -0.801752	  0.357717	 -2.129782
 -0.785626	  0.366841	 -2.137482
 -0.770111	  0.375855	 -2.145792
 -0.753803	  0.382462	 -2.155028
 -0.737067	  0.389420	 -2.163610
 -0.718078	  0.398731	 -2.169789
 -0.703191	  0.410556	 -2.171362
 -0.689022	  0.430815	 -2.177027
 -0.676267	  0.443291	 -2.187368
 -0.660772	  0.451428	 -2.197577
 -0.647601	  0.456052	 -2.204386
 -0.625471	  0.466685	 -2.214356
 -0.614845	  0.482350	 -2.225856
 -0.606134	  0.495550	 -2.235092
 -0.597639	  0.512695	 -2.245381
 -0.586622	  0.525519	 -2.253434
 -0.575402	  0.540094	 -2.261629
 -0.564926	  0.556537	 -2.269767
 -0.554862	  0.571889	 -2.276181
 -0.546758	  0.588109	 -2.284100
 -0.539836	  0.607387	 -2.296130
 -0.527809	  0.621297	 -2.306735
 -0.512264	  0.628805	 -2.310684
 -0.496939	  0.642007	 -2.314283
 -0.484968	  0.657706	 -2.322348
 -0.472576	  0.672543	 -2.329282
 -0.461264	  0.687067	 -2.337096
