  0.468947	  2.357086	  0.099498
  0.462923	  2.372932	  0.095724
  0.456899	  2.388778	  0.091950
  0.468900	  2.377611	  0.098763
  0.475736	  2.357861	  0.104661
  0.482332	  2.336064	  0.112769
  0.485104	  2.317758	  0.118989
  0.484966	  2.304359	  0.123716
  0.487913	  2.274832	  0.131086
  0.491591	  2.258383	  0.129989
  0.494078	  2.241707	  0.128285
  0.499779	  2.215636	  0.127761
  0.511071	  2.193951	  0.127280
  0.520419	  2.181042	  0.128436
  0.532403	  2.163012	  0.129688
  0.543023	  2.140500	  0.133478
  0.547310	  2.122061	  0.137503
  0.553974	  2.109264	  0.139243
  0.565948	  2.090613	  0.141825
  0.577491	  2.069042	  0.143510
  0.593188	  2.047318	  0.143502
  0.608390	  2.034835	  0.142621
  0.617576	  2.028724	  0.141589
  0.625540	  2.011662	  0.138199
  0.642663	  2.003421	  0.126831
  0.681873	  1.994448	  0.117391
  0.704094	  1.980404	  0.117527
  0.710149	  1.972359	  0.119125
  0.719317	  1.958734	  0.120665
  0.731221	  1.940885	  0.123471
  0.749413	  1.925140	  0.123083
  0.767171	  1.912477	  0.118839
  0.779695	  1.902391	  0.113668
  0.793438	  1.890315	  0.107624
  0.809290	  1.876027	  0.103233
  0.825940	  1.865382	  0.099856
  0.844067	  1.858482	  0.095190
  0.861714	  1.854905	  0.084398
  0.885906	  1.849645	  0.075259
  0.900494	  1.842776	  0.075438
  0.914315	  1.834232	  0.076440
  0.939922	  1.816762	  0.068895
  0.953708	  1.809005	  0.056889
  0.964597	  1.799972	  0.046585
  0.977120	  1.790404	  0.038406
  0.993656	  1.778552	  0.032726
  1.009835	  1.766442	  0.026396
  1.023805	  1.757691	  0.017377
  1.036919	  1.746475	  0.006142
  1.050445	  1.733315	 -0.003836
  1.062054	  1.720886	 -0.012585
  1.074699	  1.706610	 -0.020387
  1.088677	  1.691415	 -0.029448
  1.102357	  1.677675	 -0.038945
  1.109716	  1.668325	 -0.044598
  1.121424	  1.662733	 -0.049438
  1.140401	  1.653473	 -0.056425
  1.162203	  1.645645	 -0.061195
  1.178522	  1.634391	 -0.069015
  1.191357	  1.620116	 -0.080739
  1.202208	  1.605864	 -0.089754
  1.214492	  1.590349	 -0.093473
  1.224613	  1.565104	 -0.100433
  1.228354	  1.552559	 -0.102001
  1.231675	  1.536504	 -0.104664
  1.235717	  1.515725	 -0.108498
  1.250320	  1.490122	 -0.113495
  1.261672	  1.473130	 -0.113848
  1.272355	  1.458934	 -0.115195
  1.283796	  1.449017	 -0.113327
  1.294119	  1.438096	 -0.110250
  1.312531	  1.416037	 -0.107037
  1.325662	  1.401881	 -0.105037
  1.337705	  1.388028	 -0.105907
  1.347945	  1.370713	 -0.104257
  1.363550	  1.358430	 -0.101870
  1.372233	  1.343272	 -0.102650
  1.394092	  1.329966	 -0.098369
  1.404291	  1.307041	 -0.103152
  1.414499	  1.296172	 -0.097072
  1.426379	  1.279683	 -0.096761
  1.437921	  1.261788	 -0.090022
  1.450036	  1.245178	 -0.087278
  1.460657	  1.231473	 -0.085553
  1.472957	  1.222653	 -0.081706
  1.484419	  1.202691	 -0.076370
  1.495032	  1.183755	 -0.068466
  1.505641	  1.172370	 -0.058945
  1.517200	  1.160856	 -0.047925
  1.528457	  1.148124	 -0.038169
  1.540626	  1.134191	 -0.029092
  1.552241	  1.119145	 -0.017339
  1.557182	  1.110236	 -0.008714
  1.564563	  1.097899	  0.011735
  1.565678	  1.085188	  0.033978
  1.563686	  1.077108	  0.055432
  1.563374	  1.072733	  0.071919
  1.564212	  1.069460	  0.086529
  1.574471	  1.066408	  0.106203
  1.576253	  1.061666	  0.123698
  1.572697	  1.053263	  0.140638
  1.565340	  1.041689	  0.159147
  1.571594	  1.030079	  0.189553
  1.585895	  1.027036	  0.212809
  1.594615	  1.027296	  0.224094
  1.602405	  1.025331	  0.235239
  1.609323	  1.018830	  0.254285
  1.614551	  1.011008	  0.273034
  1.621464	  1.003762	  0.292360
  1.629334	  0.997778	  0.309992
  1.637342	  0.995102	  0.329365
  1.645694	  0.992059	  0.346415
  1.651606	  0.987114	  0.363749
  1.658516	  0.981821	  0.378514
  1.663049	  0.973209	  0.396169
  1.666436	  0.964715	  0.415157
  1.670131	  0.958408	  0.434267
  1.675945	  0.950054	  0.452442
  1.684417	  0.940959	  0.468299
  1.692841	  0.930066	  0.483521
  1.698689	  0.916543	  0.495317
  1.697036	  0.898872	  0.503372
  1.687403	  0.883127	  0.513006
  1.678374	  0.864046	  0.524162
  1.677047	  0.844231	  0.535916
  1.678048	  0.825894	  0.542858
  1.676502	  0.809790	  0.545949
  1.673990	  0.789693	  0.552733
  1.678986	  0.768160	  0.565410
  1.686125	  0.755304	  0.574305
  1.689892	  0.737977	  0.577788
  1.687411	  0.716571	  0.575126
  1.685588	  0.696028	  0.573697
  1.684536	  0.676760	  0.576397
  1.680843	  0.657358	  0.577504
  1.673987	  0.638502	  0.577244
  1.667604	  0.619594	  0.576727
  1.660318	  0.601352	  0.575805
  1.650831	  0.584155	  0.573635
  1.640042	  0.567438	  0.571134
  1.629131	  0.550904	  0.568594
  1.616363	  0.535826	  0.565815
  1.601909	  0.522354	  0.562834
  1.587258	  0.509080	  0.559811
  1.572602	  0.495814	  0.556779
  1.557984	  0.482499	  0.553781
  1.543758	  0.468692	  0.551145
  1.529589	  0.454819	  0.548550
  1.515419	  0.440945	  0.545949
  1.501254	  0.427068	  0.543352
  1.487245	  0.413042	  0.540807
  1.475022	  0.397430	  0.538607
  1.466139	  0.379624	  0.537014
  1.457476	  0.361675	  0.535616
  1.448387	  0.343858	  0.534670
  1.439260	  0.326040	  0.533757
  1.431008	  0.307828	  0.532321
  1.426200	  0.288289	  0.532165
  1.424624	  0.268170	  0.533531
  1.423961	  0.248103	  0.534905
  1.424984	  0.228063	  0.535088
  1.425438	  0.208779	  0.535978
  1.425534	  0.188793	  0.540266
  1.431328	  0.169824	  0.543522
  1.443662	  0.154926	  0.549329
  1.454154	  0.138546	  0.556269
  1.456341	  0.112475	  0.560144
  1.464347	  0.086203	  0.557503
  1.471926	  0.074693	  0.555114
  1.484250	  0.063093	  0.558379
  1.500134	  0.052507	  0.569822
  1.515401	  0.040818	  0.580124
  1.529559	  0.027257	  0.586091
  1.542613	  0.007544	  0.589136
  1.557059	 -0.009516	  0.591098
  1.574317	 -0.019695	  0.596816
  1.591123	 -0.026009	  0.602572
  1.608750	 -0.032487	  0.609789
  1.626870	 -0.040453	  0.617017
  1.644455	 -0.048129	  0.623318
  1.661818	 -0.056505	  0.629390
  1.679547	 -0.065363	  0.634892
  1.699127	 -0.072915	  0.640351
  1.718550	 -0.075544	  0.645377
  1.737753	 -0.078388	  0.653171
  1.757464	 -0.077756	  0.660403
  1.776195	 -0.080162	  0.667227
  1.794832	 -0.084306	  0.673369
  1.813840	 -0.086930	  0.678521
  1.832621	 -0.089875	  0.685373
  1.851430	 -0.091302	  0.692074
  1.870240	 -0.092954	  0.698991
  1.888906	 -0.094961	  0.705934
  1.907536	 -0.097059	  0.712893
  1.926191	 -0.099256	  0.719731
  1.945416	 -0.101890	  0.724511
  1.964890	 -0.104756	  0.728028
  1.984385	 -0.107644	  0.731432
  2.003883	 -0.110603	  0.734702
  2.023403	 -0.114402	  0.736362
  2.042506	 -0.119904	  0.734550
  2.061563	 -0.125570	  0.732403
  2.080609	 -0.131257	  0.730217
  2.099451	 -0.137253	  0.727455
  2.117016	 -0.144805	  0.721701
  2.134452	 -0.152507	  0.715656
  2.151884	 -0.160216	  0.709601
  2.169187	 -0.168070	  0.703409
  2.185145	 -0.177333	  0.695778
  2.200908	 -0.186293	  0.687285
  2.216723	 -0.195339	  0.678745
  2.231278	 -0.206629	  0.671846
  2.239377	 -0.219737	  0.664440
  2.232017	 -0.235409	  0.661947
  2.225628	 -0.245740	  0.660806
  2.216628	 -0.261298	  0.657698
  2.204378	 -0.275718	  0.654291
  2.191869	 -0.290804	  0.650353
  2.179776	 -0.306575	  0.645849
  2.169201	 -0.324587	  0.641912
  2.160770	 -0.340983	  0.635197
  2.153104	 -0.357972	  0.627193
  2.145956	 -0.370779	  0.615279
  2.139947	 -0.385148	  0.611652
  2.125748	 -0.407457	  0.605411
  2.108791	 -0.422536	  0.590272
  2.100075	 -0.430054	  0.581570
  2.086009	 -0.439569	  0.569161
  2.072437	 -0.448240	  0.551758
  2.062703	 -0.462031	  0.540431
  2.054097	 -0.475605	  0.533654
  2.044748	 -0.492534	  0.526114
  2.039748	 -0.513020	  0.524070
  2.036193	 -0.533670	  0.519077
  2.034425	 -0.555322	  0.511703
  2.032960	 -0.573773	  0.503732
  2.037953	 -0.589918	  0.497449
  2.042827	 -0.608226	  0.498485
  2.041766	 -0.631743	  0.496022
  2.038768	 -0.655102	  0.485571
  2.036475	 -0.684849	  0.468817
  2.032698	 -0.693846	  0.459972
  2.031463	 -0.704580	  0.453804
  2.027886	 -0.726707	  0.443584
  2.027015	 -0.753324	  0.441565
  2.031272	 -0.773002	  0.440489
  2.036156	 -0.782301	  0.441574
  2.043279	 -0.808809	  0.439097
  2.049960	 -0.833534	  0.428838
  2.057166	 -0.849469	  0.418811
  2.071759	 -0.871623	  0.411291
  2.081355	 -0.887635	  0.412624
  2.086279	 -0.898140	  0.418527
  2.093578	 -0.924538	  0.433651
  2.099214	 -0.946601	  0.441600
  2.102210	 -0.953938	  0.445143
  2.106591	 -0.971435	  0.448535
  2.119347	 -0.993394	  0.453649
  2.135816	 -1.026216	  0.450995
  2.141686	 -1.038928	  0.451213
  2.143841	 -1.049524	  0.479690
  2.153573	 -1.066837	  0.482043
  2.163305	 -1.084150	  0.484396
