 -2.241984	 -0.945435	 -1.098717
 -2.242462	 -0.947005	 -1.123279
 -2.242062	 -0.945693	 -1.102735
 -2.243658	 -0.943476	 -1.061250
 -2.245365	 -0.944875	 -1.009629
 -2.242834	 -0.950004	 -0.950243
 -2.237280	 -0.956036	 -0.892574
 -2.229605	 -0.962670	 -0.836425
 -2.219336	 -0.970226	 -0.780128
 -2.206071	 -0.979497	 -0.725828
 -2.192088	 -0.989614	 -0.677622
 -2.180931	 -0.998750	 -0.638679
 -2.174470	 -1.006488	 -0.611288
 -2.174106	 -1.018231	 -0.587062
 -2.188244	 -1.060072	 -0.533935
 -2.206197	 -1.104730	 -0.484889
 -2.228046	 -1.163983	 -0.427500
 -2.243284	 -1.234562	 -0.365806
 -2.240935	 -1.317964	 -0.298692
 -2.205625	 -1.410843	 -0.226331
 -2.138452	 -1.491713	 -0.154863
 -2.066361	 -1.541809	 -0.087582
 -2.009465	 -1.565892	 -0.027465
 -1.970861	 -1.571440	  0.032396
 -1.945456	 -1.564136	  0.091702
 -1.928880	 -1.548151	  0.149453
 -1.917082	 -1.526722	  0.204050
 -1.907613	 -1.501098	  0.258743
 -1.897645	 -1.468380	  0.320819
 -1.886431	 -1.426498	  0.390752
 -1.874915	 -1.379575	  0.461790
 -1.864529	 -1.336600	  0.525880
 -1.855509	 -1.307451	  0.573621
 -1.848308	 -1.293296	  0.605318
 -1.837743	 -1.286387	  0.649985
 -1.831324	 -1.285206	  0.677523
 -1.822759	 -1.286656	  0.712079
 -1.812034	 -1.291038	  0.751386
 -1.799095	 -1.298034	  0.793658
 -1.784027	 -1.307120	  0.837202
 -1.767134	 -1.317763	  0.881073
 -1.749405	 -1.329118	  0.924350
 -1.731521	 -1.340767	  0.970675
 -1.715009	 -1.351224	  1.018847
 -1.701039	 -1.359613	  1.067775
 -1.689230	 -1.366355	  1.119706
 -1.678584	 -1.371650	  1.174774
 -1.668379	 -1.374986	  1.233160
 -1.658113	 -1.375928	  1.292306
 -1.647599	 -1.374816	  1.349495
 -1.636769	 -1.372546	  1.402878
 -1.625367	 -1.370717	  1.452088
 -1.612477	 -1.370266	  1.499433
 -1.597562	 -1.371190	  1.545465
 -1.581233	 -1.373409	  1.588146
 -1.547716	 -1.380951	  1.671944
 -1.545839	 -1.381407	  1.676849
