 -0.654944	  1.966299	 -1.507051
 -0.658618	  2.000388	 -1.499814
 -0.655568	  1.981783	 -1.500559
 -0.656225	  1.964229	 -1.505170
 -0.660891	  1.934593	 -1.521108
 -0.663814	  1.922218	 -1.526394
 -0.668913	  1.906177	 -1.530374
 -0.673868	  1.879751	 -1.539976
 -0.657284	  1.858527	 -1.549938
 -0.639869	  1.843301	 -1.549841
 -0.632086	  1.833061	 -1.545613
 -0.628279	  1.808899	 -1.545702
 -0.624186	  1.787933	 -1.549129
 -0.616282	  1.770217	 -1.549098
 -0.611385	  1.750212	 -1.550637
 -0.607992	  1.730521	 -1.553015
 -0.604928	  1.710803	 -1.554383
 -0.601947	  1.691071	 -1.555693
 -0.599045	  1.671312	 -1.556802
 -0.596157	  1.651545	 -1.557726
 -0.593089	  1.631879	 -1.558181
 -0.589851	  1.612146	 -1.557529
 -0.586958	  1.591925	 -1.556280
 -0.584938	  1.572309	 -1.554008
 -0.583892	  1.551259	 -1.554815
 -0.583055	  1.531522	 -1.555333
 -0.582054	  1.511516	 -1.557026
 -0.582227	  1.491426	 -1.559241
 -0.582617	  1.471219	 -1.559890
 -0.584465	  1.450757	 -1.557836
 -0.588558	  1.430724	 -1.560012
 -0.592398	  1.412283	 -1.566010
 -0.594767	  1.391657	 -1.571437
 -0.594403	  1.373413	 -1.579692
 -0.592198	  1.354796	 -1.587267
 -0.587970	  1.336193	 -1.594424
 -0.585273	  1.315539	 -1.599141
 -0.581609	  1.295419	 -1.599843
 -0.584050	  1.275168	 -1.601679
 -0.587057	  1.256479	 -1.605639
 -0.587354	  1.235301	 -1.614618
 -0.584732	  1.219938	 -1.626179
 -0.582965	  1.205142	 -1.639288
 -0.578587	  1.186110	 -1.651123
 -0.573204	  1.168976	 -1.653539
 -0.567340	  1.148963	 -1.654984
 -0.559266	  1.128358	 -1.662203
 -0.553733	  1.116167	 -1.672889
 -0.544766	  1.100648	 -1.683978
 -0.535055	  1.084062	 -1.691165
 -0.526797	  1.067734	 -1.698500
 -0.522379	  1.046461	 -1.709128
 -0.522796	  1.027446	 -1.716891
 -0.521765	  1.011931	 -1.723863
 -0.514217	  0.994644	 -1.733483
 -0.509823	  0.979883	 -1.745490
 -0.508620	  0.963922	 -1.760067
 -0.505259	  0.950223	 -1.772615
 -0.501723	  0.938721	 -1.788802
 -0.501885	  0.926844	 -1.806018
 -0.502828	  0.911407	 -1.816998
 -0.513885	  0.894593	 -1.834485
 -0.523944	  0.883324	 -1.852946
 -0.528196	  0.877993	 -1.858883
 -0.531764	  0.861567	 -1.874598
 -0.538905	  0.846894	 -1.892153
 -0.540452	  0.836821	 -1.907344
 -0.539559	  0.825938	 -1.926277
 -0.543865	  0.814373	 -1.942124
 -0.555744	  0.806271	 -1.955764
 -0.569086	  0.796474	 -1.973357
 -0.569135	  0.788626	 -1.990242
 -0.564330	  0.778971	 -2.008100
 -0.567045	  0.769455	 -2.029530
 -0.573440	  0.763366	 -2.047179
 -0.576461	  0.755590	 -2.063517
 -0.576057	  0.741623	 -2.082223
 -0.577956	  0.728895	 -2.101675
 -0.581834	  0.722106	 -2.115465
 -0.589810	  0.714418	 -2.128423
 -0.603271	  0.697570	 -2.144119
 -0.612020	  0.684605	 -2.156077
 -0.617705	  0.678056	 -2.173560
 -0.623722	  0.674703	 -2.196148
 -0.626886	  0.663440	 -2.213205
 -0.624322	  0.648062	 -2.226212
 -0.623730	  0.632626	 -2.246187
 -0.627636	  0.623347	 -2.260479
 -0.634103	  0.608782	 -2.272063
 -0.639170	  0.592815	 -2.285288
 -0.640868	  0.576014	 -2.295559
 -0.642281	  0.556779	 -2.305269
 -0.646817	  0.541049	 -2.314725
 -0.651736	  0.524699	 -2.324324
 -0.652412	  0.504393	 -2.331457
 -0.654712	  0.486860	 -2.342906
 -0.660164	  0.472556	 -2.349935
 -0.662553	  0.452036	 -2.354858
 -0.660999	  0.430647	 -2.362557
 -0.664722	  0.416629	 -2.371004
 -0.667168	  0.396559	 -2.374956
 -0.664378	  0.375304	 -2.375957
 -0.666394	  0.358268	 -2.384366
 -0.669006	  0.338402	 -2.390168
 -0.667958	  0.317915	 -2.393775
 -0.665083	  0.299059	 -2.391351
 -0.662914	  0.278393	 -2.386977
 -0.656702	  0.256628	 -2.382857
 -0.656568	  0.241692	 -2.386863
 -0.657769	  0.220865	 -2.386582
 -0.653604	  0.197199	 -2.384982
 -0.647424	  0.179818	 -2.378545
 -0.645007	  0.164051	 -2.369949
 -0.642580	  0.143021	 -2.366167
 -0.637926	  0.123379	 -2.360784
 -0.634433	  0.109434	 -2.347408
 -0.632539	  0.092140	 -2.337739
 -0.630585	  0.073585	 -2.329110
 -0.623659	  0.056053	 -2.315841
 -0.620846	  0.046063	 -2.301217
 -0.620434	  0.033680	 -2.284746
 -0.614605	  0.019144	 -2.267737
 -0.607712	  0.001104	 -2.259823
 -0.605777	 -0.014893	 -2.253538
 -0.604014	 -0.029831	 -2.237437
 -0.601166	 -0.040360	 -2.217844
 -0.598447	 -0.051337	 -2.202135
 -0.595561	 -0.064301	 -2.189136
 -0.591743	 -0.077635	 -2.172652
 -0.587592	 -0.092649	 -2.160674
 -0.583607	 -0.107102	 -2.147415
 -0.579871	 -0.120089	 -2.132134
 -0.572503	 -0.133364	 -2.119276
 -0.563674	 -0.145672	 -2.106103
 -0.554984	 -0.157490	 -2.092488
 -0.546309	 -0.169295	 -2.078871
 -0.537630	 -0.181098	 -2.065255
 -0.528924	 -0.192858	 -2.051627
 -0.518786	 -0.201792	 -2.036906
 -0.506978	 -0.205247	 -2.021358
 -0.495356	 -0.205972	 -2.004929
 -0.484720	 -0.205483	 -1.986824
 -0.474659	 -0.208692	 -1.969446
 -0.463692	 -0.214843	 -1.955022
 -0.452084	 -0.218742	 -1.939126
 -0.440953	 -0.225296	 -1.922227
 -0.432436	 -0.233478	 -1.908712
 -0.422188	 -0.249276	 -1.894955
 -0.414485	 -0.265316	 -1.881713
 -0.404388	 -0.273996	 -1.870120
 -0.393604	 -0.286214	 -1.861940
 -0.390717	 -0.308933	 -1.863552
 -0.392089	 -0.331013	 -1.859608
 -0.385412	 -0.350621	 -1.856406
 -0.373953	 -0.365812	 -1.856353
 -0.360560	 -0.380475	 -1.858091
 -0.346101	 -0.404624	 -1.861648
 -0.342860	 -0.420640	 -1.867128
 -0.340422	 -0.437063	 -1.876408
 -0.334279	 -0.454790	 -1.887021
 -0.332803	 -0.472229	 -1.894928
 -0.332728	 -0.491899	 -1.903833
 -0.327812	 -0.510333	 -1.911615
 -0.320077	 -0.525200	 -1.918329
 -0.314958	 -0.545338	 -1.925586
 -0.309158	 -0.565706	 -1.931740
 -0.304229	 -0.581852	 -1.936269
 -0.301166	 -0.597340	 -1.943450
 -0.299119	 -0.617258	 -1.951288
 -0.296593	 -0.642475	 -1.952108
 -0.290949	 -0.659824	 -1.950911
 -0.281662	 -0.676416	 -1.951870
 -0.273236	 -0.697953	 -1.951369
 -0.273095	 -0.715746	 -1.952697
 -0.275642	 -0.734785	 -1.957313
 -0.272812	 -0.761711	 -1.958816
 -0.266426	 -0.777241	 -1.959444
 -0.259166	 -0.792512	 -1.958933
 -0.254944	 -0.818428	 -1.956281
 -0.255461	 -0.835580	 -1.958512
 -0.255660	 -0.855024	 -1.964040
 -0.252776	 -0.877800	 -1.966064
 -0.249564	 -0.893059	 -1.966183
 -0.245996	 -0.913084	 -1.969918
 -0.243509	 -0.936126	 -1.970585
 -0.244379	 -0.952953	 -1.966206
 -0.245538	 -0.975245	 -1.963427
 -0.242731	 -0.996800	 -1.965483
 -0.239392	 -1.014466	 -1.973083
 -0.238104	 -1.033546	 -1.977872
 -0.236351	 -1.054210	 -1.980263
 -0.234070	 -1.072378	 -1.986193
 -0.230892	 -1.093293	 -1.991049
 -0.228978	 -1.112271	 -1.990429
 -0.228621	 -1.131206	 -1.992230
 -0.225243	 -1.152378	 -1.997634
 -0.219845	 -1.172814	 -1.998400
 -0.219751	 -1.189842	 -1.998105
 -0.218704	 -1.212663	 -1.998213
 -0.213141	 -1.232521	 -1.998780
 -0.210931	 -1.249433	 -2.004638
 -0.213072	 -1.270760	 -2.008907
 -0.212056	 -1.292282	 -2.008656
 -0.202023	 -1.309477	 -2.010184
 -0.192088	 -1.328245	 -2.014141
 -0.189005	 -1.347869	 -2.018074
 -0.194821	 -1.366949	 -2.022825
 -0.201370	 -1.391004	 -2.025022
 -0.200386	 -1.412329	 -2.024393
 -0.192807	 -1.426725	 -2.026821
 -0.187488	 -1.447931	 -2.032487
 -0.189424	 -1.468399	 -2.036086
 -0.194685	 -1.488057	 -2.038405
 -0.199195	 -1.506446	 -2.041653
 -0.200237	 -1.526894	 -2.045038
 -0.197869	 -1.546299	 -2.048520
 -0.195316	 -1.565819	 -2.052050
