  0.945701	  1.650843	 -1.630938
  0.946123	  1.652248	 -1.631643
  0.941608	  1.636365	 -1.628661
  0.930551	  1.620879	 -1.613133
  0.922083	  1.605243	 -1.600818
  0.915440	  1.591649	 -1.592102
  0.904786	  1.572841	 -1.580243
  0.896011	  1.549641	 -1.569299
  0.894505	  1.541987	 -1.565979
  0.890712	  1.521162	 -1.556887
  0.887935	  1.503563	 -1.545117
  0.883736	  1.487272	 -1.536555
  0.877878	  1.463433	 -1.529191
  0.873885	  1.439553	 -1.522814
  0.873068	  1.425783	 -1.519924
  0.872288	  1.408927	 -1.517700
  0.878823	  1.386793	 -1.510681
  0.882751	  1.370248	 -1.498936
  0.884754	  1.353287	 -1.486974
  0.886243	  1.335574	 -1.476916
  0.885538	  1.318588	 -1.466870
  0.886278	  1.301723	 -1.456506
  0.889454	  1.284430	 -1.446759
  0.895395	  1.268187	 -1.436711
  0.901492	  1.252064	 -1.426567
  0.907703	  1.236059	 -1.416556
  0.913799	  1.219891	 -1.406708
  0.920518	  1.204532	 -1.395767
  0.927354	  1.189677	 -1.384284
  0.933747	  1.174430	 -1.372949
  0.940321	  1.159737	 -1.361063
  0.945932	  1.146373	 -1.349492
  0.949821	  1.129673	 -1.340720
  0.966491	  1.111979	 -1.329377
  0.981836	  1.100884	 -1.316012
  0.992375	  1.090536	 -1.302243
  0.992447	  1.082033	 -1.287278
  0.985016	  1.068844	 -1.270151
  0.982447	  1.050829	 -1.255608
  0.991636	  1.035557	 -1.238431
  0.998865	  1.025704	 -1.223099
  1.002685	  1.018322	 -1.209079
  1.005281	  1.006172	 -1.190827
  1.008055	  0.990127	 -1.176266
  1.012262	  0.975501	 -1.166142
  1.019328	  0.959528	 -1.155931
  1.023434	  0.942898	 -1.144399
  1.022298	  0.925551	 -1.131982
  1.019969	  0.912238	 -1.119456
  1.017661	  0.900203	 -1.104054
  1.016419	  0.887245	 -1.088942
  1.019449	  0.872584	 -1.074253
  1.023995	  0.858601	 -1.062679
  1.029411	  0.840619	 -1.047553
  1.034461	  0.829091	 -1.029517
  1.042265	  0.822345	 -1.009175
  1.050443	  0.807099	 -0.989167
  1.051200	  0.783812	 -0.976683
  1.048293	  0.768858	 -0.970435
  1.039897	  0.750837	 -0.963836
  1.030175	  0.735444	 -0.953381
  1.019299	  0.724224	 -0.939642
  1.009378	  0.710935	 -0.926050
  1.003135	  0.693237	 -0.915071
  0.996162	  0.674933	 -0.907438
  0.986154	  0.657109	 -0.902159
  0.975993	  0.640775	 -0.897872
  0.970662	  0.624862	 -0.890666
  0.967636	  0.609459	 -0.878940
  0.958084	  0.589311	 -0.868494
  0.947819	  0.568321	 -0.862905
  0.942136	  0.555880	 -0.860865
  0.931786	  0.533244	 -0.858827
  0.923655	  0.514556	 -0.857101
  0.917922	  0.502910	 -0.854868
  0.906725	  0.481788	 -0.851747
  0.895731	  0.456019	 -0.847436
  0.891877	  0.448853	 -0.846953
  0.882381	  0.424265	 -0.845736
  0.877514	  0.405465	 -0.843515
  0.874473	  0.392735	 -0.842027
  0.867189	  0.367588	 -0.840872
  0.862271	  0.348576	 -0.838408
  0.857850	  0.328729	 -0.831193
  0.854312	  0.314734	 -0.822608
  0.848104	  0.293798	 -0.815732
  0.843009	  0.274998	 -0.810325
  0.836791	  0.256900	 -0.804231
  0.828725	  0.239227	 -0.798304
  0.819513	  0.222326	 -0.792211
  0.811157	  0.205535	 -0.785067
  0.803991	  0.188465	 -0.777827
  0.796796	  0.172112	 -0.770125
  0.785912	  0.156724	 -0.761450
  0.775364	  0.141753	 -0.752270
  0.767475	  0.127557	 -0.740803
  0.760172	  0.114962	 -0.727095
  0.750755	  0.102614	 -0.713485
  0.740305	  0.090453	 -0.701327
  0.729575	  0.078863	 -0.689697
  0.720276	  0.066497	 -0.677737
  0.712765	  0.052660	 -0.665816
  0.706521	  0.037909	 -0.654590
  0.701937	  0.024003	 -0.645385
  0.703201	  0.009645	 -0.640234
  0.707436	 -0.013693	 -0.628349
  0.701304	 -0.034787	 -0.613458
  0.699457	 -0.046569	 -0.608005
  0.699430	 -0.059837	 -0.601425
  0.702339	 -0.088190	 -0.594620
  0.703976	 -0.101941	 -0.592394
  0.706568	 -0.114987	 -0.590182
  0.711874	 -0.139463	 -0.588537
  0.714999	 -0.160283	 -0.590129
  0.716704	 -0.174422	 -0.590910
  0.718834	 -0.196928	 -0.590691
  0.720483	 -0.217835	 -0.591828
  0.721327	 -0.237433	 -0.593001
  0.723870	 -0.257720	 -0.595157
  0.727538	 -0.275845	 -0.596402
  0.731765	 -0.295506	 -0.594429
  0.739542	 -0.324128	 -0.592643
  0.743312	 -0.335489	 -0.593384
  0.750938	 -0.354597	 -0.595422
  0.755448	 -0.371641	 -0.601555
  0.763194	 -0.390343	 -0.609551
  0.767258	 -0.409799	 -0.614936
  0.769667	 -0.429806	 -0.617076
  0.772374	 -0.449554	 -0.618895
  0.773550	 -0.469518	 -0.619581
  0.773143	 -0.489518	 -0.619215
  0.772717	 -0.509510	 -0.618836
  0.772223	 -0.529504	 -0.618358
  0.769945	 -0.549245	 -0.616250
  0.767175	 -0.568053	 -0.613610
  0.763375	 -0.582660	 -0.607772
  0.754685	 -0.596876	 -0.592239
  0.748324	 -0.625618	 -0.583324
  0.747492	 -0.639518	 -0.582551
  0.745150	 -0.658632	 -0.579925
  0.740686	 -0.680988	 -0.572018
  0.739245	 -0.691484	 -0.567647
  0.735423	 -0.716543	 -0.557897
  0.732130	 -0.737410	 -0.551846
  0.728006	 -0.750849	 -0.549687
  0.719937	 -0.769703	 -0.542798
  0.710804	 -0.789249	 -0.536984
  0.705650	 -0.809283	 -0.529056
  0.704985	 -0.825855	 -0.519463
  0.707358	 -0.841178	 -0.512308
  0.710319	 -0.860973	 -0.503654
  0.713249	 -0.883411	 -0.496630
  0.716646	 -0.900220	 -0.488995
  0.720843	 -0.914830	 -0.478940
  0.722241	 -0.932514	 -0.465209
  0.721597	 -0.951584	 -0.451070
  0.719804	 -0.965098	 -0.439301
  0.719502	 -0.980380	 -0.425959
  0.713778	 -0.999669	 -0.411707
  0.709131	 -1.015112	 -0.402525
  0.707922	 -1.026684	 -0.396149
  0.708523	 -1.045286	 -0.384550
  0.708257	 -1.065148	 -0.373657
  0.706868	 -1.085487	 -0.366424
  0.705491	 -1.105189	 -0.362577
  0.704245	 -1.125190	 -0.359188
  0.700918	 -1.144491	 -0.355260
  0.696589	 -1.164443	 -0.348902
  0.692065	 -1.183045	 -0.342517
  0.685724	 -1.202387	 -0.335470
  0.679950	 -1.217837	 -0.328957
  0.673611	 -1.235243	 -0.319003
  0.669027	 -1.253506	 -0.309689
  0.664969	 -1.271306	 -0.302198
  0.660655	 -1.286288	 -0.295965
  0.655049	 -1.307635	 -0.287724
  0.651242	 -1.330718	 -0.280230
  0.650776	 -1.346829	 -0.275864
  0.649546	 -1.361223	 -0.270917
  0.648219	 -1.380440	 -0.263598
  0.647014	 -1.405096	 -0.253799
  0.644160	 -1.425312	 -0.248247
  0.639480	 -1.441879	 -0.244747
  0.632997	 -1.456526	 -0.243691
  0.624531	 -1.476515	 -0.242160
  0.617018	 -1.497300	 -0.238141
  0.608828	 -1.517072	 -0.234218
  0.599636	 -1.531734	 -0.228395
  0.590416	 -1.549141	 -0.217468
  0.587398	 -1.565672	 -0.206437
  0.584430	 -1.584168	 -0.196407
  0.581237	 -1.602829	 -0.188528
  0.580196	 -1.621170	 -0.180692
  0.580628	 -1.639333	 -0.172528
  0.580479	 -1.657706	 -0.163742
  0.580282	 -1.675632	 -0.155537
  0.579442	 -1.693585	 -0.146534
  0.578220	 -1.711356	 -0.137243
  0.577507	 -1.729189	 -0.127997
  0.577196	 -1.747109	 -0.119061
  0.577405	 -1.765247	 -0.111130
  0.577471	 -1.783138	 -0.103248
  0.581406	 -1.797769	 -0.091691
  0.584850	 -1.815658	 -0.081094
  0.585929	 -1.838634	 -0.071754
  0.587318	 -1.855071	 -0.063103
  0.589225	 -1.868872	 -0.055244
  0.592210	 -1.889067	 -0.043257
  0.594509	 -1.904059	 -0.033376
  0.595642	 -1.920205	 -0.023322
  0.594177	 -1.944432	 -0.012976
  0.592810	 -1.956761	 -0.009543
  0.588622	 -1.979595	 -0.006132
  0.586301	 -2.002935	  0.002188
  0.585541	 -2.016229	  0.008578
  0.586996	 -2.033970	  0.021048
  0.588882	 -2.051283	  0.033666
  0.590552	 -2.066482	  0.043897
  0.591141	 -2.085613	  0.055201
  0.590858	 -2.101250	  0.064103
  0.590217	 -2.118930	  0.073758
  0.586442	 -2.145964	  0.083705
  0.584810	 -2.153070	  0.084834
  0.578864	 -2.175000	  0.087362
  0.572072	 -2.204795	  0.092843
  0.569181	 -2.218314	  0.096863
  0.565433	 -2.232229	  0.103138
  0.561621	 -2.253268	  0.115770
  0.562476	 -2.271257	  0.128037
  0.565994	 -2.283553	  0.142333
  0.564487	 -2.301404	  0.153879
  0.562017	 -2.319772	  0.161982
  0.559788	 -2.338137	  0.169616
  0.557785	 -2.356648	  0.176919
  0.555951	 -2.375272	  0.183975
  0.554093	 -2.393886	  0.191049
  0.552090	 -2.412441	  0.198241
  0.550082	 -2.431003	  0.205440
  0.548013	 -2.449726	  0.212729
  0.544598	 -2.468540	  0.221072
  0.541237	 -2.486539	  0.229119
