  0.772437	  2.496317	  0.119752
  0.766413	  2.512163	  0.115978
  0.773359	  2.493943	  0.120314
  0.780771	  2.476238	  0.124109
  0.791469	  2.459588	  0.125682
  0.806427	  2.443839	  0.126885
  0.822098	  2.429728	  0.131022
  0.834970	  2.413111	  0.139658
  0.843241	  2.395956	  0.148431
  0.845657	  2.376017	  0.153347
  0.850546	  2.356204	  0.156102
  0.852195	  2.336583	  0.156210
  0.857952	  2.317111	  0.156469
  0.865288	  2.297732	  0.156370
  0.872568	  2.278655	  0.156509
  0.880991	  2.258769	  0.156618
  0.890005	  2.241247	  0.155671
  0.905633	  2.229539	  0.154495
  0.928072	  2.221455	  0.149836
  0.944372	  2.214695	  0.144430
  0.963323	  2.206140	  0.137933
  0.981198	  2.194040	  0.136932
  0.997572	  2.177454	  0.134365
  1.006908	  2.167470	  0.130012
  1.016757	  2.155939	  0.121475
  1.030711	  2.141067	  0.108174
  1.051604	  2.127841	  0.098133
  1.071132	  2.122764	  0.091497
  1.080032	  2.119647	  0.089406
  1.097768	  2.108481	  0.093818
  1.120544	  2.094873	  0.092280
  1.142176	  2.087992	  0.084541
  1.155569	  2.084241	  0.079580
  1.173314	  2.069895	  0.071482
  1.186723	  2.055719	  0.063184
  1.199131	  2.045388	  0.053809
  1.215335	  2.039794	  0.042878
  1.233504	  2.036307	  0.031361
  1.246804	  2.030374	  0.021143
  1.260284	  2.018470	  0.010040
  1.273220	  2.005667	 -0.000642
  1.288209	  1.995326	 -0.007193
  1.309351	  1.988434	 -0.013155
  1.329583	  1.981071	 -0.018382
  1.347895	  1.970240	 -0.023197
  1.360027	  1.954826	 -0.029207
  1.370356	  1.938608	 -0.039499
  1.379399	  1.924206	 -0.050680
  1.387123	  1.908981	 -0.063520
  1.394948	  1.891897	 -0.073062
  1.404014	  1.874535	 -0.079647
  1.415107	  1.858111	 -0.082576
  1.429652	  1.845103	 -0.085777
  1.446864	  1.831922	 -0.092247
  1.460335	  1.821136	 -0.100499
  1.472950	  1.807453	 -0.110738
  1.481694	  1.791514	 -0.119899
  1.488864	  1.774131	 -0.127133
  1.495970	  1.755868	 -0.132921
  1.503943	  1.737980	 -0.136825
  1.513887	  1.720855	 -0.138614
  1.525918	  1.704865	 -0.137866
  1.540572	  1.689827	 -0.136940
  1.553560	  1.677123	 -0.136354
  1.569089	  1.661190	 -0.137933
  1.577764	  1.643665	 -0.141911
  1.584177	  1.625617	 -0.145750
  1.593827	  1.607482	 -0.147522
  1.602991	  1.590268	 -0.147515
  1.613808	  1.574013	 -0.145266
  1.625109	  1.557896	 -0.143817
  1.637102	  1.542172	 -0.143008
  1.649098	  1.526958	 -0.141220
  1.658036	  1.511867	 -0.133738
  1.669746	  1.499554	 -0.120459
  1.693015	  1.488093	 -0.109139
  1.712934	  1.476395	 -0.108021
  1.723630	  1.464575	 -0.110498
  1.733349	  1.448278	 -0.106460
  1.743284	  1.432259	 -0.101834
  1.758383	  1.420158	 -0.099793
  1.780046	  1.403176	 -0.100340
  1.791405	  1.382176	 -0.098324
  1.792710	  1.363963	 -0.092053
  1.792601	  1.346524	 -0.082068
  1.798929	  1.330240	 -0.070619
  1.808026	  1.317726	 -0.060901
  1.815789	  1.310544	 -0.047654
  1.823518	  1.305829	 -0.030707
  1.835214	  1.299338	 -0.012700
  1.849339	  1.287701	  0.002729
  1.858300	  1.273266	  0.017016
  1.861072	  1.260319	  0.030286
  1.861631	  1.247585	  0.047588
  1.862242	  1.237061	  0.066299
  1.865886	  1.232948	  0.081368
  1.871973	  1.233333	  0.099792
  1.876544	  1.233743	  0.124393
  1.880705	  1.229233	  0.150083
  1.883474	  1.226543	  0.162399
  1.886684	  1.221766	  0.180675
  1.893039	  1.214635	  0.199964
  1.899618	  1.203612	  0.216361
  1.905185	  1.191793	  0.234637
  1.911490	  1.186320	  0.253117
  1.916245	  1.186800	  0.269416
  1.920781	  1.191725	  0.294665
  1.927547	  1.190176	  0.316672
  1.933377	  1.183321	  0.332251
  1.938186	  1.174555	  0.350899
  1.944155	  1.165860	  0.367853
  1.949204	  1.157030	  0.380776
  1.958359	  1.137266	  0.396616
  1.965888	  1.126178	  0.412017
  1.974436	  1.119098	  0.429634
  1.983001	  1.114699	  0.442394
  1.991408	  1.098250	  0.457007
  1.998826	  1.082529	  0.468246
  2.006041	  1.069532	  0.480167
  2.012851	  1.059507	  0.494181
  2.021571	  1.048872	  0.510471
  2.022028	  1.035540	  0.528759
  2.018370	  1.019820	  0.542208
  2.018241	  1.003297	  0.556101
  2.018372	  0.987937	  0.569538
  2.021576	  0.971283	  0.587405
  2.020507	  0.962973	  0.594434
  2.026318	  0.938434	  0.610317
  2.024233	  0.915453	  0.622233
  2.020767	  0.902450	  0.629671
  2.017471	  0.888566	  0.632157
  2.011800	  0.863526	  0.639858
  2.002525	  0.843580	  0.642246
  2.000157	  0.832040	  0.646303
  1.994476	  0.807576	  0.651978
  1.993838	  0.795112	  0.658859
  1.995201	  0.775686	  0.663809
  1.996262	  0.756887	  0.666641
  2.000599	  0.732126	  0.673882
  2.004030	  0.708046	  0.675039
  2.006338	  0.693621	  0.675588
  2.008138	  0.671963	  0.680931
  2.011153	  0.653414	  0.695820
  2.018178	  0.635665	  0.713389
  2.013892	  0.610655	  0.725791
  2.002153	  0.588361	  0.726757
  1.992243	  0.573088	  0.718729
  1.985445	  0.556255	  0.708589
  1.980594	  0.538158	  0.700218
  1.970076	  0.516316	  0.700149
  1.954950	  0.499090	  0.701729
  1.947400	  0.487245	  0.702129
  1.939483	  0.470124	  0.703364
  1.932453	  0.451960	  0.702708
  1.925643	  0.423968	  0.702813
  1.921430	  0.414757	  0.700417
  1.907898	  0.397920	  0.693065
  1.885002	  0.376528	  0.683876
  1.876806	  0.362610	  0.681721
  1.871119	  0.352185	  0.681605
  1.863406	  0.330884	  0.682073
  1.852547	  0.310313	  0.681952
  1.840644	  0.288367	  0.676473
  1.830855	  0.274862	  0.670767
  1.818515	  0.259814	  0.662833
  1.799790	  0.248231	  0.653296
  1.780773	  0.240722	  0.645447
  1.776279	  0.234219	  0.640294
  1.773086	  0.234219	  0.639828
  1.772679	  0.216004	  0.639076
  1.779314	  0.201202	  0.637183
  1.785670	  0.195430	  0.635200
  1.788084	  0.174146	  0.629556
  1.795479	  0.152292	  0.625664
  1.800787	  0.136584	  0.623366
  1.812988	  0.112453	  0.616362
  1.827604	  0.098676	  0.603304
  1.834272	  0.094814	  0.596293
  1.850404	  0.088910	  0.579973
  1.884162	  0.076174	  0.563016
  1.893643	  0.072134	  0.560547
  1.903513	  0.067965	  0.558678
  1.922198	  0.055407	  0.552356
  1.940829	  0.036881	  0.542253
  1.948300	  0.027786	  0.538766
  1.959764	  0.009305	  0.533775
  1.976115	 -0.011231	  0.525535
  1.987676	 -0.026245	  0.518870
  1.994413	 -0.036326	  0.515909
  2.016643	 -0.043949	  0.506980
  2.038651	 -0.044106	  0.494063
  2.056780	 -0.050859	  0.483281
  2.069882	 -0.068799	  0.473232
  2.076466	 -0.089585	  0.466442
  2.080369	 -0.107213	  0.460180
  2.089535	 -0.124652	  0.453910
  2.101614	 -0.137467	  0.445888
  2.114976	 -0.150112	  0.437906
  2.129492	 -0.162978	  0.430513
  2.140713	 -0.176451	  0.421308
  2.142952	 -0.193636	  0.410007
  2.144072	 -0.204537	  0.404630
  2.142878	 -0.220992	  0.394099
  2.136619	 -0.234742	  0.383502
  2.126456	 -0.245653	  0.375673
  2.116119	 -0.259315	  0.367540
  2.108296	 -0.273846	  0.359179
  2.099557	 -0.288973	  0.352332
  2.088309	 -0.304962	  0.348288
  2.080022	 -0.319589	  0.343738
  2.072919	 -0.339215	  0.338022
  2.068215	 -0.358423	  0.330176
  2.063679	 -0.375942	  0.321988
  2.059137	 -0.394628	  0.315185
  2.054467	 -0.412071	  0.305620
  2.047204	 -0.427841	  0.295994
  2.039758	 -0.445063	  0.287574
  2.031863	 -0.458540	  0.276947
  2.022475	 -0.475218	  0.267860
  2.014681	 -0.491686	  0.258833
  2.007969	 -0.505260	  0.248712
  2.002884	 -0.525145	  0.239303
  2.001003	 -0.543740	  0.231088
  2.000490	 -0.561268	  0.222084
  2.000312	 -0.579666	  0.216635
  2.000680	 -0.599014	  0.210616
  2.001254	 -0.620419	  0.204542
  2.001604	 -0.639425	  0.198804
  2.003061	 -0.658533	  0.192823
  2.004654	 -0.677683	  0.191464
  2.005496	 -0.696173	  0.189225
  2.005594	 -0.717366	  0.189000
  2.006084	 -0.740417	  0.181297
  2.013110	 -0.763307	  0.168982
  2.019443	 -0.781350	  0.167358
  2.023005	 -0.794712	  0.167201
  2.028561	 -0.812005	  0.174490
  2.039945	 -0.837021	  0.184006
  2.049131	 -0.858442	  0.186824
  2.054457	 -0.872004	  0.188572
  2.060442	 -0.890006	  0.189829
  2.069036	 -0.914237	  0.190379
  2.075317	 -0.931911	  0.184785
  2.081751	 -0.951020	  0.182865
  2.091225	 -0.969226	  0.179267
  2.102886	 -0.984302	  0.179590
  2.116761	 -0.999232	  0.181412
  2.127833	 -1.015268	  0.186824
  2.135368	 -1.033464	  0.192219
  2.136802	 -1.049858	  0.195992
  2.141146	 -1.073775	  0.208430
  2.150878	 -1.091088	  0.210783
