  1.365153	 -1.684970	  2.116160
  1.351637	 -1.668287	  2.095208
  1.337830	 -1.620250	  2.072450
  1.325523	 -1.579262	  2.055566
  1.311330	 -1.544285	  2.025014
  1.289016	 -1.498682	  2.005903
  1.281791	 -1.454993	  1.981110
  1.256641	 -1.417021	  1.960512
  1.241500	 -1.376479	  1.939114
  1.229374	 -1.338048	  1.906937
  1.212516	 -1.298778	  1.888504
  1.194075	 -1.254123	  1.867617
  1.182595	 -1.213914	  1.843959
  1.164695	 -1.173084	  1.818810
  1.149499	 -1.131527	  1.795472
  1.131610	 -1.087251	  1.770865
  1.117322	 -1.048323	  1.746758
  1.098748	 -1.010636	  1.721230
  1.081690	 -0.966426	  1.698938
  1.070950	 -0.926530	  1.678667
  1.050231	 -0.886621	  1.651892
  1.034152	 -0.845276	  1.630778
  1.023170	 -0.808129	  1.602145
  1.005720	 -0.761913	  1.578896
  0.993711	 -0.723650	  1.559473
  0.971617	 -0.679868	  1.528295
  0.958888	 -0.637426	  1.510529
  0.944623	 -0.600619	  1.483281
  0.926523	 -0.562501	  1.463295
  0.910862	 -0.515727	  1.440241
  0.893109	 -0.472962	  1.413172
  0.877725	 -0.434359	  1.390341
  0.862081	 -0.396315	  1.369584
  0.843453	 -0.355294	  1.345299
  0.841538	 -0.385524	  1.215880
  0.820199	 -0.492695	  0.938913
  0.801240	 -0.480454	  0.919194
  0.878188	 -0.406323	  0.839750
  0.716556	 -0.378280	  0.885205
  0.921295	 -0.302754	  0.751798
  0.871975	 -0.151495	  0.938397
  0.851948	 -0.086533	  0.948726
  0.882275	 -0.008510	  0.935043
  0.896437	  0.034241	  0.883933
  0.867060	  0.070770	  0.898338
  0.831743	  0.136171	  0.926693
  0.830157	  0.167645	  0.902988
  0.741886	  0.150684	  0.794023
  0.750225	  0.251672	  0.875475
  0.718263	  0.284695	  0.865232
  0.617129	  0.319411	  0.909299
  0.564706	  0.381902	  0.918138
  0.547276	  0.426331	  0.893125
  0.531404	  0.468561	  0.871508
  0.517371	  0.507798	  0.851712
  0.500407	  0.548587	  0.826103
  0.487243	  0.590281	  0.805165
  0.468081	  0.631352	  0.778281
  0.454472	  0.671975	  0.757299
  0.440044	  0.712322	  0.732814
  0.424710	  0.757732	  0.705952
  0.409107	  0.792871	  0.684797
  0.386642	  0.838551	  0.655699
  0.373267	  0.875970	  0.634975
  0.355174	  0.920084	  0.613325
  0.341016	  0.960014	  0.588714
  0.323259	  0.997101	  0.563878
  0.307289	  1.039126	  0.541702
  0.291056	  1.078358	  0.520920
  0.272537	  1.123795	  0.495450
  0.257662	  1.161434	  0.473028
  0.241883	  1.205089	  0.446609
  0.229544	  1.245241	  0.425141
  0.215234	  1.286337	  0.403147
  0.200357	  1.329488	  0.380261
  0.182290	  1.371058	  0.355428
  0.163058	  1.402829	  0.330958
  0.084155	  1.418210	  0.336781
  0.040255	  1.447128	  0.285342
  0.032856	  1.496862	  0.278571
  0.027032	  1.489436	  0.304882
 -0.063302	  1.499495	  0.296620
 -0.156311	  1.552951	  0.275465
 -0.178727	  1.558254	  0.264762
 -0.257839	  1.562049	  0.232693
 -0.467088	  1.681320	  0.281154
 -0.429303	  1.764260	  0.135167
 -0.559523	  1.836232	  0.506500
 -0.370380	  1.917899	  0.289445
 -0.506490	  2.076309	  0.381803
 -0.400100	  2.101458	  0.303842
 -0.370297	  2.116305	  0.211555
 -0.383999	  2.135692	  0.122004
 -0.231215	  2.154253	 -0.007010
 -0.171247	  2.155604	 -0.050913
 -0.153566	  2.157755	 -0.095673
 -0.149446	  2.222974	 -0.144061
 -0.165141	  2.271159	 -0.163490
 -0.188475	  2.306147	 -0.191401
 -0.197033	  2.349045	 -0.215179
 -0.214801	  2.388088	 -0.234470
 -0.232023	  2.430326	 -0.258759
 -0.252145	  2.473278	 -0.279525
 -0.269427	  2.510123	 -0.312404
 -0.280221	  2.556287	 -0.326939
 -0.292041	  2.595537	 -0.356637
 -0.308571	  2.636066	 -0.380747
 -0.330079	  2.676833	 -0.401551
 -0.342326	  2.721934	 -0.426892
 -0.356715	  2.760122	 -0.447853
 -0.376577	  2.796249	 -0.477107
 -0.390370	  2.843247	 -0.497414
 -0.412957	  2.879543	 -0.515886
 -0.428908	  2.918011	 -0.548862
 -0.433197	  2.947191	 -0.554350
