  1.083949	  1.888959	  1.250596
  1.082375	  1.880561	  1.241755
  1.081308	  1.874872	  1.235765
  1.077030	  1.862775	  1.221720
  1.072310	  1.848164	  1.208661
  1.068058	  1.834027	  1.193867
  1.064390	  1.820490	  1.179735
  1.058314	  1.808284	  1.165958
  1.054202	  1.793233	  1.152540
  1.050660	  1.778869	  1.137892
  1.044351	  1.767069	  1.122524
  1.035252	  1.758260	  1.107950
  1.027847	  1.746148	  1.092922
  1.020241	  1.734475	  1.078396
  1.012586	  1.723010	  1.063940
  1.004542	  1.711860	  1.049374
  0.996308	  1.700862	  1.035061
  0.986717	  1.689401	  1.021798
  0.976140	  1.677289	  1.010501
  0.967395	  1.663186	  0.995764
  0.960434	  1.650608	  0.981638
  0.952037	  1.643422	  0.966590
  0.940375	  1.634271	  0.952063
  0.928348	  1.626508	  0.938476
  0.915147	  1.616848	  0.926262
  0.902223	  1.606927	  0.914642
  0.889300	  1.597012	  0.903037
  0.875706	  1.587199	  0.892136
  0.860611	  1.577729	  0.883057
  0.845502	  1.568262	  0.873996
  0.830388	  1.558797	  0.864943
  0.814723	  1.549524	  0.856687
  0.797785	  1.541208	  0.850172
  0.780238	  1.533773	  0.843945
  0.762210	  1.527073	  0.838355
  0.744229	  1.519067	  0.833357
  0.727052	  1.509797	  0.828534
  0.709866	  1.500498	  0.823492
  0.696022	  1.489299	  0.815177
  0.681048	  1.478599	  0.805913
  0.665071	  1.469235	  0.796855
  0.649552	  1.460653	  0.788164
  0.631435	  1.453131	  0.782024
  0.613790	  1.444825	  0.777853
  0.596067	  1.435023	  0.774540
  0.578879	  1.426439	  0.769551
  0.563341	  1.416735	  0.761248
  0.551212	  1.403658	  0.752604
  0.539327	  1.389602	  0.743952
  0.530945	  1.373524	  0.735599
  0.524674	  1.356090	  0.727366
  0.519266	  1.338448	  0.721306
  0.513417	  1.320254	  0.715214
  0.509678	  1.302758	  0.706777
  0.508390	  1.286739	  0.696065
  0.507437	  1.271961	  0.679787
  0.509528	  1.256437	  0.666317
  0.501961	  1.242267	  0.657130
  0.497717	  1.226477	  0.643398
  0.496161	  1.210079	  0.629913
  0.500668	  1.196748	  0.616135
  0.505033	  1.183705	  0.601678
  0.507317	  1.168928	  0.587901
  0.511391	  1.155240	  0.573987
  0.519524	  1.142890	  0.559264
  0.525694	  1.129957	  0.545494
  0.527128	  1.117107	  0.531925
  0.533171	  1.105733	  0.516919
  0.539831	  1.087213	  0.501872
  0.541281	  1.072962	  0.492579
  0.541876	  1.059062	  0.479451
  0.540627	  1.043505	  0.466163
  0.543299	  1.026406	  0.449794
  0.547118	  1.015575	  0.434086
  0.555574	  1.004915	  0.419411
  0.562432	  0.991122	  0.407292
  0.568279	  0.976798	  0.395715
  0.572929	  0.957095	  0.383317
  0.574165	  0.944090	  0.370558
  0.574329	  0.931320	  0.354551
  0.573134	  0.913797	  0.339536
  0.573982	  0.901995	  0.328904
  0.576050	  0.888406	  0.311820
  0.580755	  0.875778	  0.299480
  0.587202	  0.855311	  0.290466
  0.592488	  0.838188	  0.280356
  0.594394	  0.826848	  0.266685
  0.593723	  0.813103	  0.242979
  0.588769	  0.799625	  0.226952
  0.590978	  0.787319	  0.212092
  0.588179	  0.771610	  0.205298
  0.582838	  0.752484	  0.197877
  0.577685	  0.731258	  0.195263
  0.573329	  0.708021	  0.190627
  0.567983	  0.690695	  0.177656
  0.564704	  0.684393	  0.166975
  0.555968	  0.667387	  0.146015
  0.552113	  0.651796	  0.129580
  0.552844	  0.634000	  0.129984
  0.552137	  0.614395	  0.116383
  0.544417	  0.608815	  0.098839
  0.533276	  0.594604	  0.086699
  0.526271	  0.577035	  0.077615
  0.526041	  0.563202	  0.059874
  0.524799	  0.551992	  0.042799
  0.519389	  0.551666	  0.024176
  0.511707	  0.543160	  0.007755
  0.509849	  0.548673	 -0.014294
  0.509344	  0.544367	 -0.035050
  0.506436	  0.554895	 -0.050298
  0.502925	  0.562980	 -0.069392
  0.500516	  0.572651	 -0.084936
  0.498746	  0.583495	 -0.104033
  0.494955	  0.589043	 -0.126099
  0.491873	  0.596430	 -0.144208
  0.493000	  0.608263	 -0.154644
  0.492804	  0.618616	 -0.174943
  0.492001	  0.628461	 -0.194107
  0.490849	  0.640336	 -0.209027
  0.489416	  0.651762	 -0.227347
  0.492017	  0.661894	 -0.242523
  0.496061	  0.671736	 -0.259717
  0.501104	  0.685591	 -0.275136
  0.504091	  0.697490	 -0.289889
  0.496818	  0.717806	 -0.306414
  0.497021	  0.728690	 -0.320851
  0.497155	  0.739586	 -0.333369
  0.497717	  0.754140	 -0.351660
  0.497088	  0.764494	 -0.366118
  0.498408	  0.774103	 -0.382540
  0.500475	  0.784961	 -0.400868
  0.501383	  0.797328	 -0.417502
  0.500480	  0.808656	 -0.433939
  0.498811	  0.818138	 -0.451036
  0.497269	  0.826516	 -0.469613
  0.495143	  0.832974	 -0.488558
  0.493235	  0.839905	 -0.507246
  0.491297	  0.846925	 -0.525744
  0.489240	  0.854549	 -0.542965
  0.487356	  0.861759	 -0.563317
  0.486196	  0.865490	 -0.582036
  0.483889	  0.864767	 -0.603846
  0.481336	  0.872187	 -0.620463
  0.477244	  0.874962	 -0.641315
  0.474505	  0.876644	 -0.660776
  0.471284	  0.878257	 -0.678647
  0.468787	  0.881064	 -0.699147
  0.467527	  0.878868	 -0.718963
  0.467140	  0.873466	 -0.740923
  0.467444	  0.868315	 -0.760431
  0.459073	  0.866592	 -0.776794
  0.448646	  0.861008	 -0.796174
  0.444353	  0.857441	 -0.815096
  0.442798	  0.851848	 -0.831009
  0.443646	  0.846087	 -0.855208
  0.439814	  0.841720	 -0.876184
  0.435419	  0.833635	 -0.892316
  0.436655	  0.820829	 -0.906392
  0.435812	  0.812416	 -0.926663
  0.425821	  0.805779	 -0.942501
  0.418099	  0.795172	 -0.959802
  0.418232	  0.787998	 -0.978515
  0.415862	  0.776254	 -0.994088
  0.409784	  0.760740	 -1.010472
  0.410576	  0.751702	 -1.025189
  0.409918	  0.739018	 -1.041358
  0.404371	  0.729292	 -1.057826
  0.398705	  0.718055	 -1.074398
  0.394966	  0.705786	 -1.088570
  0.392912	  0.691788	 -1.103601
  0.390833	  0.677246	 -1.117835
  0.394570	  0.661622	 -1.134289
  0.397322	  0.654323	 -1.154192
  0.390746	  0.642769	 -1.165612
  0.382667	  0.629333	 -1.176163
  0.377976	  0.617200	 -1.193633
  0.373658	  0.605560	 -1.214091
  0.368073	  0.596506	 -1.231156
  0.366836	  0.586467	 -1.248363
  0.359201	  0.568525	 -1.256418
  0.354858	  0.550726	 -1.267270
  0.352034	  0.533744	 -1.278403
  0.342425	  0.521569	 -1.293932
  0.329475	  0.507617	 -1.299744
  0.321171	  0.491269	 -1.307748
  0.312111	  0.469485	 -1.310877
  0.302950	  0.455000	 -1.319811
  0.297944	  0.441316	 -1.336235
  0.290736	  0.424147	 -1.345504
  0.283948	  0.406839	 -1.351642
  0.282918	  0.388671	 -1.355918
  0.280423	  0.367096	 -1.361473
  0.269718	  0.348786	 -1.369022
  0.266766	  0.332557	 -1.374834
  0.263648	  0.316900	 -1.387493
  0.259392	  0.291989	 -1.391443
  0.262266	  0.270343	 -1.382559
  0.252628	  0.254339	 -1.387814
  0.245391	  0.235204	 -1.397248
  0.247890	  0.215459	 -1.401935
  0.251237	  0.196071	 -1.409122
  0.252402	  0.176264	 -1.412389
  0.250571	  0.155655	 -1.411641
  0.251064	  0.137062	 -1.413441
  0.254431	  0.116917	 -1.425911
  0.256453	  0.097276	 -1.424896
  0.253847	  0.078916	 -1.424992
  0.250651	  0.058733	 -1.430684
  0.249535	  0.041354	 -1.441817
  0.252611	  0.026696	 -1.455650
  0.254077	  0.011112	 -1.471149
  0.247763	 -0.001977	 -1.481653
  0.233612	 -0.008854	 -1.498381
  0.218813	 -0.020194	 -1.509831
  0.213585	 -0.036565	 -1.522315
  0.211469	 -0.052374	 -1.533758
  0.207945	 -0.066587	 -1.549223
  0.208253	 -0.078271	 -1.568418
  0.204007	 -0.091865	 -1.588277
  0.195664	 -0.085452	 -1.608124
  0.189103	 -0.082770	 -1.625852
  0.177584	 -0.080567	 -1.644228
  0.166660	 -0.076224	 -1.662824
  0.162745	 -0.064586	 -1.680295
  0.158283	 -0.054909	 -1.696719
  0.149866	 -0.045997	 -1.714586
  0.144760	 -0.039340	 -1.729531
  0.136317	 -0.022371	 -1.748177
  0.133664	 -0.011490	 -1.761694
  0.135418	  0.001667	 -1.775661
  0.136855	  0.017855	 -1.791433
  0.129612	  0.026537	 -1.803763
  0.121769	  0.035246	 -1.822836
  0.116940	  0.045921	 -1.841238
  0.121512	  0.061222	 -1.855082
  0.123939	  0.071140	 -1.868897
  0.121343	  0.082084	 -1.886886
  0.120847	  0.093435	 -1.905592
  0.119646	  0.108029	 -1.921787
  0.116728	  0.116810	 -1.935809
  0.113983	  0.123368	 -1.953892
  0.113574	  0.127329	 -1.975281
  0.115373	  0.130951	 -1.995072
  0.116842	  0.135550	 -2.014601
  0.118067	  0.136862	 -2.034552
  0.119256	  0.137418	 -2.054508
  0.120432	  0.137939	 -2.074460
  0.121454	  0.137006	 -2.094407
  0.122694	  0.133876	 -2.114108
  0.124161	  0.130916	 -2.133819
  0.125347	  0.127239	 -2.153379
  0.126179	  0.122185	 -2.171752
  0.127034	  0.116514	 -2.192318
  0.128327	  0.109287	 -2.211423
  0.129245	  0.104108	 -2.230249
  0.129149	  0.097993	 -2.248106
  0.130216	  0.088048	 -2.266892
  0.129845	  0.083285	 -2.286084
  0.128435	  0.078409	 -2.305392
  0.128046	  0.070290	 -2.324030
  0.126815	  0.064238	 -2.342814
  0.124627	  0.059071	 -2.362866
  0.123714	  0.051383	 -2.381135
  0.122404	  0.042672	 -2.397809
  0.120055	  0.035718	 -2.418982
  0.119595	  0.027397	 -2.436728
  0.117594	  0.017451	 -2.451657
  0.115732	  0.004777	 -2.470130
  0.111478	 -0.002446	 -2.497512
  0.108862	 -0.004834	 -2.508795
