  1.453541	  0.380716	 -1.955519
  1.462512	  0.384629	 -1.990759
  1.456868	  0.382769	 -1.971883
  1.447789	  0.385688	 -1.956835
  1.437198	  0.391969	 -1.940397
  1.430720	  0.389149	 -1.911667
  1.426816	  0.389185	 -1.895812
  1.422483	  0.390862	 -1.882182
  1.415552	  0.389907	 -1.851963
  1.413956	  0.386434	 -1.837835
  1.412705	  0.380959	 -1.819522
  1.409125	  0.379086	 -1.798193
  1.404715	  0.380794	 -1.781366
  1.398856	  0.382977	 -1.757834
  1.396545	  0.380560	 -1.740056
  1.395640	  0.374705	 -1.721842
  1.393211	  0.367719	 -1.693997
  1.391431	  0.365529	 -1.678761
  1.386403	  0.370731	 -1.662650
  1.379879	  0.379516	 -1.643694
  1.377576	  0.383832	 -1.622234
  1.373991	  0.387774	 -1.601047
  1.366146	  0.389308	 -1.582795
  1.360252	  0.387250	 -1.567653
  1.360180	  0.385155	 -1.546926
  1.354805	  0.391692	 -1.515561
  1.345567	  0.394219	 -1.496600
  1.340999	  0.395007	 -1.488841
  1.335210	  0.394083	 -1.471819
  1.331718	  0.393665	 -1.447060
  1.322684	  0.397652	 -1.424931
  1.311182	  0.399463	 -1.410735
  1.297356	  0.397017	 -1.395346
  1.285431	  0.400149	 -1.380917
  1.275010	  0.411873	 -1.361353
  1.267487	  0.412335	 -1.343702
  1.259535	  0.400951	 -1.323668
  1.249380	  0.392812	 -1.304445
  1.239558	  0.393613	 -1.290231
  1.229496	  0.393136	 -1.274406
  1.216223	  0.389137	 -1.252796
  1.208153	  0.387294	 -1.230455
  1.205635	  0.386579	 -1.218246
  1.203716	  0.384135	 -1.196152
  1.202016	  0.382008	 -1.177321
  1.193602	  0.377662	 -1.152337
  1.183583	  0.373815	 -1.133514
  1.178209	  0.371845	 -1.121844
  1.171979	  0.369622	 -1.106180
  1.160759	  0.370737	 -1.080313
  1.153772	  0.370035	 -1.066921
  1.145334	  0.367713	 -1.053788
  1.135035	  0.363902	 -1.032292
  1.122741	  0.361238	 -1.007886
  1.113806	  0.360160	 -0.994606
  1.104194	  0.358782	 -0.981615
  1.093355	  0.355980	 -0.966447
  1.082291	  0.358131	 -0.940325
  1.076795	  0.360754	 -0.918779
  1.074673	  0.361036	 -0.904306
  1.071633	  0.361849	 -0.884821
  1.064015	  0.360659	 -0.854383
  1.061803	  0.358780	 -0.843906
  1.058407	  0.356445	 -0.828274
  1.053622	  0.352099	 -0.804675
  1.049164	  0.349186	 -0.786021
  1.045060	  0.346983	 -0.763751
  1.044955	  0.360713	 -0.729299
  1.045979	  0.367937	 -0.719799
  1.047182	  0.373752	 -0.703221
  1.044914	  0.376647	 -0.683800
  1.036797	  0.372539	 -0.662498
  1.030587	  0.366986	 -0.646101
  1.023175	  0.363348	 -0.625563
  1.013947	  0.365621	 -0.605326
  1.008315	  0.369339	 -0.590658
  1.000796	  0.378464	 -0.567584
  0.993961	  0.380701	 -0.549742
  0.988257	  0.380569	 -0.533338
  0.981427	  0.380286	 -0.512735
  0.976171	  0.384428	 -0.496954
  0.970069	  0.392860	 -0.477966
  0.963781	  0.397082	 -0.452739
  0.960977	  0.397745	 -0.440323
  0.955557	  0.398758	 -0.420030
  0.950012	  0.403624	 -0.402150
  0.945520	  0.410009	 -0.387393
  0.940146	  0.419087	 -0.357525
  0.936608	  0.420380	 -0.337856
  0.931724	  0.420830	 -0.320866
  0.927882	  0.423472	 -0.307152
  0.918134	  0.421456	 -0.282029
  0.912804	  0.417447	 -0.268330
  0.907411	  0.412412	 -0.248352
  0.903023	  0.408654	 -0.225868
  0.902133	  0.406548	 -0.205412
  0.903620	  0.404119	 -0.180447
  0.903427	  0.402025	 -0.167910
  0.902498	  0.400790	 -0.147690
  0.898108	  0.390995	 -0.126831
  0.892004	  0.384463	 -0.108395
  0.885863	  0.381950	 -0.091390
  0.876644	  0.380853	 -0.071905
  0.868889	  0.377904	 -0.052869
  0.861861	  0.375833	 -0.034784
  0.852618	  0.374466	 -0.012860
  0.846374	  0.370953	  0.004755
  0.841501	  0.367330	  0.020698
  0.839102	  0.362290	  0.042644
  0.840727	  0.352051	  0.072363
  0.841211	  0.346542	  0.082491
  0.840037	  0.343039	  0.095926
  0.827495	  0.338860	  0.114998
  0.819491	  0.337231	  0.135782
  0.813749	  0.336565	  0.155064
  0.806458	  0.336572	  0.173719
  0.799208	  0.336401	  0.192134
  0.792413	  0.336407	  0.211042
  0.785424	  0.336943	  0.229823
  0.778828	  0.337481	  0.248422
  0.775520	  0.339000	  0.265207
  0.774856	  0.339170	  0.285352
  0.760669	  0.331702	  0.313581
  0.748006	  0.332732	  0.331985
  0.743673	  0.334073	  0.338589
  0.733255	  0.335827	  0.357991
  0.722944	  0.338760	  0.376878
  0.712068	  0.341836	  0.393051
  0.700173	  0.344184	  0.408203
  0.689353	  0.346564	  0.424633
  0.680207	  0.351597	  0.447647
  0.676558	  0.356001	  0.465904
  0.669999	  0.361959	  0.483585
  0.664099	  0.363492	  0.498715
  0.655542	  0.367025	  0.516057
  0.641035	  0.371017	  0.539191
  0.630302	  0.371866	  0.554981
  0.625774	  0.373057	  0.565189
  0.613064	  0.378999	  0.595769
  0.607450	  0.380105	  0.615034
  0.604923	  0.379623	  0.624616
  0.598328	  0.377470	  0.644407
  0.587756	  0.372994	  0.666226
  0.581421	  0.368664	  0.681776
  0.574045	  0.362281	  0.702444
  0.564316	  0.357398	  0.723294
  0.558919	  0.354819	  0.732655
  0.548120	  0.350849	  0.752245
  0.537335	  0.347571	  0.777391
  0.532735	  0.347280	  0.793723
  0.528875	  0.350180	  0.816828
  0.525913	  0.355421	  0.838620
  0.524019	  0.359740	  0.852043
  0.521476	  0.366066	  0.871162
  0.511905	  0.374052	  0.899227
  0.507973	  0.375761	  0.908491
  0.499743	  0.376672	  0.922754
  0.490727	  0.381948	  0.944245
  0.484003	  0.387839	  0.965813
  0.480597	  0.395064	  0.983832
  0.477499	  0.402671	  1.001351
  0.473312	  0.405829	  1.016206
  0.462824	  0.416656	  1.037793
  0.459150	  0.436074	  1.047227
  0.456826	  0.455815	  1.052108
  0.451868	  0.473941	  1.059734
  0.446425	  0.490804	  1.068463
  0.441421	  0.508878	  1.073219
  0.435382	  0.527094	  1.073904
  0.429268	  0.546210	  1.075379
  0.423316	  0.565407	  1.076063
  0.417185	  0.583633	  1.076523
  0.411192	  0.603181	  1.073179
  0.405308	  0.624624	  1.068907
  0.398950	  0.644589	  1.070829
  0.393413	  0.659023	  1.080534
  0.389783	  0.672460	  1.098135
  0.381046	  0.685957	  1.112077
  0.364795	  0.701407	  1.127570
  0.357076	  0.708885	  1.138657
  0.350240	  0.719402	  1.151456
  0.345953	  0.730169	  1.172654
  0.338850	  0.736691	  1.195757
  0.333042	  0.738025	  1.210449
  0.324767	  0.738361	  1.227869
  0.314678	  0.737012	  1.247893
  0.306035	  0.734199	  1.268406
  0.300551	  0.729470	  1.286357
  0.296467	  0.722934	  1.304213
  0.294021	  0.715910	  1.320821
  0.292616	  0.708718	  1.337905
  0.292118	  0.702190	  1.354527
  0.292630	  0.694384	  1.370615
  0.292408	  0.686277	  1.386111
  0.294461	  0.673813	  1.400912
  0.298744	  0.662424	  1.412438
  0.306162	  0.648254	  1.423804
  0.310282	  0.635323	  1.432462
  0.312017	  0.615635	  1.440525
  0.314656	  0.591070	  1.449034
  0.316658	  0.572015	  1.458957
  0.318178	  0.557592	  1.471900
  0.320105	  0.543369	  1.485422
  0.320418	  0.531194	  1.497590
  0.326950	  0.514698	  1.515435
  0.326643	  0.504047	  1.528933
  0.323176	  0.488432	  1.549214
  0.319262	  0.479912	  1.562152
  0.317224	  0.463042	  1.576028
  0.317140	  0.447793	  1.588966
  0.316800	  0.432004	  1.601839
  0.312340	  0.417229	  1.617783
  0.311964	  0.407909	  1.626466
  0.303448	  0.396675	  1.646639
  0.295154	  0.386501	  1.668132
  0.293613	  0.379327	  1.680127
  0.290043	  0.372228	  1.694262
  0.284658	  0.356851	  1.719717
  0.281929	  0.350716	  1.729393
  0.276550	  0.339890	  1.744979
  0.264957	  0.329302	  1.767776
  0.261185	  0.325542	  1.777398
  0.253500	  0.319736	  1.798846
  0.241647	  0.310795	  1.824377
  0.237621	  0.307892	  1.834870
  0.231925	  0.304892	  1.853205
  0.226741	  0.299986	  1.871824
  0.218511	  0.293788	  1.891456
  0.208629	  0.288650	  1.912909
  0.200395	  0.288093	  1.935754
  0.196054	  0.288112	  1.946004
  0.185764	  0.287179	  1.964740
  0.177738	  0.287640	  1.980525
  0.168774	  0.289135	  1.998998
  0.155984	  0.291624	  2.022993
  0.143245	  0.298071	  2.041990
  0.134533	  0.300500	  2.053468
  0.123545	  0.301699	  2.068336
  0.113079	  0.304466	  2.087131
  0.103365	  0.308462	  2.109396
  0.098244	  0.310326	  2.121914
  0.092559	  0.311847	  2.142654
  0.089625	  0.313186	  2.167359
  0.084361	  0.315936	  2.190806
  0.080415	  0.315488	  2.200510
  0.076236	  0.319633	  2.220635
  0.072063	  0.321178	  2.240603
  0.064686	  0.320829	  2.260549
  0.054618	  0.320863	  2.276843
  0.041645	  0.321674	  2.298941
  0.034913	  0.327128	  2.320773
  0.033268	  0.332453	  2.334636
  0.036287	  0.335512	  2.352334
  0.038968	  0.336152	  2.374126
  0.035001	  0.333889	  2.395807
  0.028401	  0.331381	  2.416608
  0.024170	  0.332027	  2.433761
  0.023375	  0.333338	  2.454881
  0.027024	  0.332776	  2.478214
  0.010227	  0.335624	  2.495461
  0.005849	  0.333463	  2.514856
