 -1.986966	 -0.420954	 -1.356960
 -2.024948	 -0.447909	 -1.368401
 -2.009025	 -0.436652	 -1.363956
 -1.993130	 -0.425400	 -1.359406
 -1.977229	 -0.414286	 -1.354880
 -1.961624	 -0.405367	 -1.349872
 -1.943032	 -0.400666	 -1.341951
 -1.923217	 -0.390285	 -1.335406
 -1.908266	 -0.376039	 -1.332516
 -1.898361	 -0.360846	 -1.332715
 -1.880289	 -0.339825	 -1.330868
 -1.862620	 -0.333521	 -1.323599
 -1.848811	 -0.330778	 -1.317293
 -1.828865	 -0.323450	 -1.309884
 -1.812358	 -0.318293	 -1.304114
 -1.789554	 -0.313461	 -1.295555
 -1.769351	 -0.301192	 -1.290304
 -1.760355	 -0.292489	 -1.289063
 -1.745388	 -0.278091	 -1.286271
 -1.727575	 -0.266312	 -1.280968
 -1.710369	 -0.257146	 -1.275198
 -1.693462	 -0.248266	 -1.269200
 -1.676746	 -0.239234	 -1.262909
 -1.660094	 -0.230014	 -1.256734
 -1.643780	 -0.220232	 -1.250588
 -1.627625	 -0.210592	 -1.243862
 -1.611287	 -0.201393	 -1.236806
 -1.595136	 -0.191983	 -1.229606
 -1.579372	 -0.181951	 -1.222604
 -1.563754	 -0.172033	 -1.215145
 -1.548706	 -0.162666	 -1.205735
 -1.533943	 -0.152798	 -1.196937
 -1.520692	 -0.145056	 -1.185459
 -1.509700	 -0.134924	 -1.170515
 -1.497279	 -0.119769	 -1.157262
 -1.482007	 -0.107693	 -1.147392
 -1.465926	 -0.101314	 -1.141081
 -1.445823	 -0.090970	 -1.142424
 -1.423308	 -0.074500	 -1.149661
 -1.405663	 -0.064390	 -1.149578
 -1.393317	 -0.059806	 -1.138325
 -1.380759	 -0.057786	 -1.119338
 -1.361640	 -0.056673	 -1.105698
 -1.336361	 -0.041389	 -1.099297
 -1.327000	 -0.029122	 -1.096337
 -1.318735	 -0.015539	 -1.089784
 -1.301642	  0.004139	 -1.078014
 -1.285038	  0.013815	 -1.070258
 -1.274427	  0.020280	 -1.066581
 -1.262123	  0.033162	 -1.055071
 -1.251225	  0.045709	 -1.046496
 -1.232119	  0.059794	 -1.037196
 -1.217365	  0.067384	 -1.025323
 -1.203988	  0.075257	 -1.014214
 -1.191282	  0.083754	 -1.006427
 -1.174643	  0.093870	 -0.998872
 -1.157358	  0.104913	 -0.991083
 -1.142880	  0.116343	 -0.979489
 -1.131583	  0.123135	 -0.967843
 -1.116903	  0.131045	 -0.952151
 -1.106374	  0.139832	 -0.943150
 -1.091534	  0.149483	 -0.932340
 -1.069778	  0.157899	 -0.918445
 -1.064379	  0.160779	 -0.913134
 -1.049958	  0.171414	 -0.902434
 -1.029887	  0.186429	 -0.880876
 -1.021158	  0.187704	 -0.866884
 -1.006770	  0.192349	 -0.856253
 -0.988530	  0.199073	 -0.850101
 -0.963530	  0.212370	 -0.846096
 -0.951853	  0.220677	 -0.840652
 -0.939491	  0.231723	 -0.830894
 -0.923659	  0.243270	 -0.816652
 -0.915286	  0.249443	 -0.807556
 -0.897322	  0.262907	 -0.793061
 -0.882496	  0.273077	 -0.779151
 -0.877231	  0.275758	 -0.775231
 -0.859043	  0.288292	 -0.762674
 -0.840343	  0.298942	 -0.752991
 -0.828291	  0.303832	 -0.748324
 -0.807147	  0.313081	 -0.735099
 -0.791230	  0.317787	 -0.721320
 -0.779618	  0.324593	 -0.712227
 -0.763082	  0.332910	 -0.697933
 -0.747902	  0.342285	 -0.686542
 -0.735839	  0.348771	 -0.679335
 -0.718866	  0.357904	 -0.674479
 -0.697160	  0.370224	 -0.669731
 -0.680588	  0.381160	 -0.665106
 -0.666226	  0.390328	 -0.661505
 -0.650809	  0.401677	 -0.653754
 -0.637289	  0.412817	 -0.643791
 -0.622224	  0.422484	 -0.633671
 -0.606602	  0.430869	 -0.623783
 -0.589064	  0.443537	 -0.614573
 -0.577739	  0.451126	 -0.610285
 -0.552494	  0.462210	 -0.604286
 -0.536430	  0.467653	 -0.600927
 -0.524696	  0.471329	 -0.599090
 -0.500645	  0.476910	 -0.591694
 -0.480411	  0.486915	 -0.583983
 -0.467836	  0.495509	 -0.577776
 -0.454844	  0.506180	 -0.566348
 -0.438562	  0.509140	 -0.556655
 -0.419733	  0.512486	 -0.546956
 -0.403645	  0.517993	 -0.534083
 -0.382838	  0.521099	 -0.521640
 -0.369208	  0.519491	 -0.517116
 -0.348185	  0.514277	 -0.514690
 -0.326311	  0.514539	 -0.508271
 -0.310613	  0.518405	 -0.501476
 -0.293639	  0.522735	 -0.494565
 -0.265639	  0.525299	 -0.481572
 -0.250369	  0.525282	 -0.471517
 -0.237801	  0.524211	 -0.463263
 -0.220474	  0.521449	 -0.456072
 -0.202609	  0.519780	 -0.453794
 -0.176655	  0.518883	 -0.450447
 -0.152080	  0.520604	 -0.449479
 -0.137544	  0.523211	 -0.450305
 -0.120467	  0.527076	 -0.445534
 -0.100600	  0.530969	 -0.430613
 -0.082449	  0.535570	 -0.414939
 -0.067891	  0.542508	 -0.406032
 -0.052235	  0.549183	 -0.399929
 -0.031191	  0.551907	 -0.392746
 -0.016650	  0.549283	 -0.386333
  0.008521	  0.548249	 -0.375367
  0.030582	  0.546617	 -0.369394
  0.039988	  0.548647	 -0.364672
  0.061198	  0.547536	 -0.356941
  0.088232	  0.553379	 -0.341525
  0.098240	  0.555637	 -0.335728
  0.112790	  0.554677	 -0.326903
  0.136996	  0.562306	 -0.313653
  0.156708	  0.576191	 -0.310256
  0.171593	  0.588463	 -0.311930
  0.189313	  0.600866	 -0.310607
  0.201675	  0.609316	 -0.306329
  0.217903	  0.621902	 -0.298938
  0.234604	  0.638369	 -0.290202
  0.247397	  0.649949	 -0.285522
  0.262339	  0.657857	 -0.281303
  0.282334	  0.663229	 -0.278939
  0.301861	  0.670596	 -0.278155
  0.316804	  0.683610	 -0.274019
  0.331090	  0.694862	 -0.274986
  0.352740	  0.711379	 -0.273901
  0.371092	  0.715941	 -0.274504
  0.387954	  0.718551	 -0.275615
  0.408185	  0.719422	 -0.275465
  0.430565	  0.723213	 -0.275508
  0.452639	  0.723776	 -0.275170
  0.468795	  0.723963	 -0.276137
  0.497027	  0.720364	 -0.280355
  0.511294	  0.721096	 -0.278856
  0.533411	  0.721563	 -0.280139
  0.555814	  0.723613	 -0.283268
  0.577075	  0.714600	 -0.296121
  0.582637	  0.712854	 -0.302553
  0.604242	  0.708538	 -0.315416
  0.628900	  0.712277	 -0.323492
  0.647253	  0.715882	 -0.329781
  0.663243	  0.717155	 -0.336089
  0.685047	  0.714660	 -0.342574
  0.702725	  0.711181	 -0.342705
  0.721920	  0.708768	 -0.340046
  0.749182	  0.709795	 -0.337319
  0.779524	  0.717046	 -0.336101
  0.787899	  0.720642	 -0.335981
  0.803221	  0.725199	 -0.331134
  0.828128	  0.730190	 -0.322703
  0.855175	  0.727956	 -0.311950
  0.871489	  0.725716	 -0.307180
  0.887414	  0.725182	 -0.304328
  0.905685	  0.725555	 -0.303568
  0.927063	  0.726361	 -0.303720
  0.952078	  0.722025	 -0.305774
  0.968284	  0.722702	 -0.305705
  0.985464	  0.722935	 -0.306995
  1.009037	  0.726622	 -0.306011
  1.028509	  0.730392	 -0.304428
  1.045370	  0.733843	 -0.303364
  1.068501	  0.740831	 -0.310401
  1.090032	  0.749843	 -0.320001
  1.108097	  0.758450	 -0.322694
  1.125085	  0.764145	 -0.318826
  1.141719	  0.765540	 -0.314804
  1.163487	  0.763705	 -0.305508
  1.186067	  0.770063	 -0.292542
  1.198581	  0.783006	 -0.289610
  1.210592	  0.799169	 -0.291021
  1.235834	  0.827470	 -0.292002
  1.247578	  0.833296	 -0.292000
  1.253465	  0.841167	 -0.290779
  1.273848	  0.845575	 -0.287597
  1.305143	  0.859140	 -0.273487
  1.317650	  0.868294	 -0.266893
  1.329474	  0.880444	 -0.262164
  1.343652	  0.893732	 -0.258605
  1.358554	  0.904944	 -0.256330
  1.372895	  0.915797	 -0.253940
  1.389694	  0.928559	 -0.253522
  1.409474	  0.944955	 -0.255877
  1.424327	  0.961990	 -0.251400
  1.433012	  0.967810	 -0.252340
  1.448939	  0.979101	 -0.243792
  1.461810	  0.996126	 -0.239046
  1.476037	  1.021314	 -0.235042
  1.476062	  1.038500	 -0.234608
  1.484822	  1.054913	 -0.233379
  1.488457	  1.081217	 -0.232337
  1.486237	  1.096786	 -0.233140
  1.488429	  1.118352	 -0.235190
  1.489959	  1.142799	 -0.236878
  1.490060	  1.161097	 -0.237081
  1.500289	  1.183997	 -0.228491
  1.509411	  1.200516	 -0.218758
  1.509963	  1.215816	 -0.216806
  1.523121	  1.232680	 -0.213340
  1.527647	  1.248711	 -0.217936
  1.528836	  1.271166	 -0.221851
  1.531761	  1.297671	 -0.224604
  1.535097	  1.315521	 -0.221499
  1.540694	  1.330276	 -0.219657
  1.547383	  1.348029	 -0.215349
  1.551332	  1.369462	 -0.210216
  1.554963	  1.388747	 -0.210016
  1.557880	  1.410811	 -0.214266
  1.556163	  1.433769	 -0.215382
  1.554800	  1.449209	 -0.213911
  1.554164	  1.470761	 -0.209436
  1.552410	  1.489115	 -0.207150
  1.553596	  1.507703	 -0.204693
  1.558846	  1.527577	 -0.198616
  1.562670	  1.548435	 -0.189951
  1.561231	  1.569182	 -0.181163
  1.557616	  1.589695	 -0.175509
  1.556284	  1.606355	 -0.174141
  1.554919	  1.626816	 -0.177404
  1.549305	  1.647815	 -0.179762
  1.544893	  1.667647	 -0.178682
  1.543640	  1.688151	 -0.176287
  1.543039	  1.708156	 -0.171764
  1.543296	  1.727637	 -0.164778
  1.543720	  1.746739	 -0.156406
  1.540881	  1.766690	 -0.148635
  1.533019	  1.783712	 -0.143495
  1.526151	  1.802389	 -0.138127
  1.516784	  1.820485	 -0.133555
  1.505032	  1.837404	 -0.131952
  1.490101	  1.855652	 -0.132093
  1.476515	  1.873403	 -0.127216
  1.471246	  1.889295	 -0.118679
  1.468849	  1.905341	 -0.111125
  1.460151	  1.925421	 -0.105023
  1.453733	  1.942345	 -0.096024
  1.449104	  1.957569	 -0.087772
  1.439926	  1.976531	 -0.081729
  1.432679	  1.992935	 -0.072379
  1.426824	  2.008720	 -0.062066
  1.419544	  2.025800	 -0.053623
  1.408714	  2.040596	 -0.045266
  1.397372	  2.054700	 -0.036725
  1.385968	  2.068730	 -0.028182
  1.374651	  2.082839	 -0.019643
  1.363368	  2.096971	 -0.011099
  1.352096	  2.111114	 -0.002560
  1.340734	  2.125148	  0.006030
  1.328180	  2.137373	  0.015666
  1.315057	  2.148554	  0.025806
  1.301914	  2.159688	  0.035968
  1.288724	  2.170740	  0.046163
  1.275676	  2.181123	  0.057201
  1.263068	  2.190241	  0.069758
  1.251156	  2.198837	  0.083286
  1.242176	  2.205671	  0.099691
  1.238895	  2.209760	  0.118840
  1.240144	  2.211930	  0.138597
  1.243995	  2.212747	  0.158254
  1.249573	  2.212034	  0.177143
  1.259468	  2.209183	  0.194206
  1.269848	  2.205693	  0.211625
  1.275681	  2.203760	  0.229066
  1.284437	  2.207434	  0.247360
  1.293248	  2.212093	  0.267457
  1.300783	  2.210150	  0.289186
  1.309913	  2.202575	  0.303204
  1.322469	  2.196579	  0.318150
  1.334068	  2.190593	  0.332870
  1.347076	  2.186721	  0.348161
  1.359692	  2.182546	  0.362525
  1.373245	  2.182120	  0.377293
  1.387384	  2.183299	  0.391305
  1.402427	  2.186992	  0.403919
  1.417680	  2.191366	  0.416063
  1.433226	  2.196998	  0.426823
  1.448371	  2.203128	  0.436475
  1.464418	  2.209763	  0.446399
