 -0.360923	  1.617826	 -1.883539
 -0.364829	  1.608283	 -1.878916
 -0.367835	  1.600941	 -1.875359
 -0.373478	  1.583458	 -1.867613
 -0.376610	  1.565196	 -1.860174
 -0.379310	  1.546856	 -1.852679
 -0.381972	  1.528500	 -1.845213
 -0.383952	  1.510088	 -1.837796
 -0.382882	  1.491343	 -1.831082
 -0.380912	  1.472639	 -1.824345
 -0.379424	  1.454127	 -1.817076
 -0.378348	  1.435793	 -1.809007
 -0.376550	  1.417430	 -1.801134
 -0.371376	  1.399788	 -1.795173
 -0.361163	  1.381517	 -1.794889
 -0.353330	  1.360696	 -1.794264
 -0.347455	  1.338879	 -1.785785
 -0.344432	  1.324144	 -1.779808
 -0.341648	  1.307947	 -1.772912
 -0.334168	  1.284729	 -1.764588
 -0.327774	  1.269626	 -1.758961
 -0.321881	  1.254621	 -1.752897
 -0.315191	  1.235783	 -1.744968
 -0.303375	  1.215503	 -1.737193
 -0.295317	  1.202912	 -1.732278
 -0.287663	  1.186143	 -1.724851
 -0.281357	  1.169098	 -1.718908
 -0.273801	  1.151652	 -1.715465
 -0.261799	  1.129013	 -1.710019
 -0.250288	  1.114116	 -1.701855
 -0.239274	  1.101324	 -1.692730
 -0.228412	  1.087741	 -1.685632
 -0.214252	  1.074250	 -1.678742
 -0.196702	  1.060392	 -1.667581
 -0.182548	  1.052022	 -1.656255
 -0.169700	  1.044146	 -1.644656
 -0.153171	  1.034307	 -1.630197
 -0.140849	  1.023754	 -1.617962
 -0.133949	  1.015100	 -1.608081
 -0.122783	  1.004321	 -1.591406
 -0.112002	  0.995619	 -1.576412
 -0.101881	  0.986740	 -1.563008
 -0.088123	  0.972526	 -1.548721
 -0.080210	  0.964187	 -1.538283
 -0.070891	  0.952165	 -1.522906
 -0.057928	  0.941368	 -1.501985
 -0.047394	  0.937176	 -1.489195
 -0.037645	  0.932330	 -1.478072
 -0.021866	  0.924263	 -1.460648
 -0.011675	  0.917037	 -1.443354
 -0.006293	  0.909416	 -1.433927
  0.000445	  0.900422	 -1.423581
  0.013168	  0.886757	 -1.409007
  0.024118	  0.876534	 -1.393837
  0.037648	  0.867760	 -1.380816
  0.050703	  0.861590	 -1.370942
  0.066195	  0.854674	 -1.360624
  0.080680	  0.845926	 -1.348798
  0.094922	  0.837841	 -1.337239
  0.109857	  0.834060	 -1.324657
  0.123599	  0.827631	 -1.311752
  0.133324	  0.820569	 -1.301118
  0.147332	  0.814804	 -1.290528
  0.167036	  0.808474	 -1.280505
  0.179183	  0.804677	 -1.273246
  0.194272	  0.804476	 -1.263478
  0.215791	  0.799582	 -1.254559
  0.235774	  0.788425	 -1.234443
  0.249343	  0.776617	 -1.221755
  0.258600	  0.770257	 -1.219810
  0.270159	  0.761750	 -1.204882
  0.291958	  0.748801	 -1.185928
  0.300502	  0.742089	 -1.176484
  0.316012	  0.733343	 -1.157004
  0.320497	  0.724824	 -1.139174
  0.325158	  0.719875	 -1.127269
  0.333847	  0.711369	 -1.110645
  0.350008	  0.704749	 -1.097549
  0.360203	  0.699883	 -1.091322
  0.376885	  0.681788	 -1.079927
  0.392507	  0.667824	 -1.066124
  0.400925	  0.662103	 -1.056978
  0.408313	  0.654560	 -1.042788
  0.414818	  0.643671	 -1.022385
  0.420305	  0.630911	 -1.000097
  0.426117	  0.624615	 -0.984491
  0.430566	  0.619622	 -0.971151
  0.437095	  0.608744	 -0.953283
  0.440810	  0.598927	 -0.939347
  0.444844	  0.587553	 -0.921681
  0.451054	  0.570017	 -0.900783
  0.455316	  0.563724	 -0.892786
  0.463267	  0.552426	 -0.878081
  0.472919	  0.536770	 -0.858401
  0.478079	  0.526120	 -0.847011
  0.482777	  0.516431	 -0.835229
  0.489221	  0.505151	 -0.820392
  0.496237	  0.492820	 -0.802562
  0.499718	  0.480154	 -0.784896
  0.498036	  0.468381	 -0.766323
  0.494286	  0.461655	 -0.753925
  0.487846	  0.450575	 -0.733868
  0.483782	  0.427213	 -0.706122
  0.482725	  0.416794	 -0.698932
  0.482736	  0.407410	 -0.686258
  0.487239	  0.394558	 -0.668384
  0.494381	  0.383637	 -0.650377
  0.500537	  0.376438	 -0.638363
  0.506947	  0.364082	 -0.621596
  0.512786	  0.353775	 -0.608144
  0.522770	  0.333561	 -0.586341
  0.527567	  0.322194	 -0.575827
  0.529761	  0.310560	 -0.562112
  0.531430	  0.297204	 -0.547918
  0.532850	  0.287759	 -0.533419
  0.536352	  0.276721	 -0.510443
  0.539549	  0.270113	 -0.492069
  0.543452	  0.267300	 -0.477030
  0.546051	  0.261836	 -0.449951
  0.548664	  0.253972	 -0.433455
  0.552331	  0.246025	 -0.419660
  0.557298	  0.224480	 -0.395657
  0.559733	  0.213778	 -0.385114
  0.563216	  0.204755	 -0.374204
  0.567758	  0.192987	 -0.351931
  0.571464	  0.185672	 -0.329354
  0.572888	  0.184828	 -0.314611
  0.571390	  0.189260	 -0.293569
  0.573252	  0.192475	 -0.270981
  0.577097	  0.191576	 -0.251954
  0.578325	  0.188307	 -0.231559
  0.581291	  0.187218	 -0.209290
  0.586544	  0.189392	 -0.188629
  0.593780	  0.195729	 -0.170980
  0.599927	  0.203791	 -0.154132
  0.604627	  0.209999	 -0.134966
  0.611080	  0.217527	 -0.117044
  0.618962	  0.227016	 -0.100774
  0.627337	  0.237296	 -0.085603
  0.635793	  0.249456	 -0.072203
  0.645587	  0.262516	 -0.060984
  0.656775	  0.275909	 -0.051188
  0.667430	  0.290331	 -0.042742
  0.678188	  0.305493	 -0.036580
  0.688797	  0.321988	 -0.033339
  0.697300	  0.337772	 -0.031862
  0.706496	  0.355447	 -0.026975
  0.724615	  0.374653	 -0.021948
  0.738828	  0.384553	 -0.021591
  0.754793	  0.390985	 -0.024755
  0.781203	  0.402565	 -0.029998
  0.798519	  0.417026	 -0.032277
  0.807032	  0.427224	 -0.034447
  0.816669	  0.442628	 -0.038066
  0.828245	  0.462020	 -0.043395
  0.838594	  0.480567	 -0.046106
  0.846315	  0.503504	 -0.047907
  0.852760	  0.521584	 -0.053713
  0.865027	  0.532288	 -0.061277
  0.883592	  0.540733	 -0.070335
  0.898290	  0.551097	 -0.080909
  0.912612	  0.562136	 -0.090356
  0.927941	  0.570783	 -0.097263
  0.943945	  0.580381	 -0.101167
  0.957814	  0.594326	 -0.106252
  0.969110	  0.614194	 -0.117557
  0.984687	  0.634089	 -0.133794
  0.992802	  0.642072	 -0.138852
  1.002626	  0.654459	 -0.141389
  1.014140	  0.671940	 -0.145187
  1.027211	  0.691022	 -0.146435
  1.038701	  0.704943	 -0.145873
  1.049769	  0.722280	 -0.148374
  1.063812	  0.737722	 -0.149664
  1.080730	  0.753454	 -0.154633
  1.087484	  0.769153	 -0.154598
  1.097036	  0.779085	 -0.154082
  1.112926	  0.789094	 -0.152859
  1.129034	  0.799980	 -0.153046
  1.145444	  0.800572	 -0.151031
  1.149940	  0.803617	 -0.145619
  1.163578	  0.813270	 -0.141506
  1.181764	  0.818708	 -0.143260
  1.211006	  0.830447	 -0.147569
  1.231675	  0.834276	 -0.152796
  1.256799	  0.838396	 -0.156081
  1.270374	  0.839612	 -0.153700
  1.281118	  0.846136	 -0.160661
  1.309324	  0.849067	 -0.171524
  1.324149	  0.849048	 -0.183904
  1.336454	  0.849585	 -0.189249
  1.352654	  0.850891	 -0.198187
  1.371250	  0.848702	 -0.209966
  1.386272	  0.847789	 -0.219198
  1.406702	  0.849315	 -0.228794
  1.427473	  0.849634	 -0.236303
  1.443351	  0.849099	 -0.240378
  1.464459	  0.848430	 -0.246527
  1.488181	  0.848199	 -0.257914
  1.505467	  0.847656	 -0.268478
  1.517044	  0.849495	 -0.275341
  1.531918	  0.850476	 -0.291363
  1.548830	  0.861810	 -0.303856
  1.563200	  0.872585	 -0.313937
  1.579017	  0.881538	 -0.322186
  1.597894	  0.887331	 -0.328017
  1.616668	  0.893493	 -0.333098
  1.634173	  0.901888	 -0.338167
  1.651822	  0.909699	 -0.343537
  1.669157	  0.918229	 -0.349282
  1.686437	  0.927454	 -0.354105
  1.703995	  0.937126	 -0.355999
  1.721759	  0.946646	 -0.354284
  1.739365	  0.955866	 -0.351450
  1.756578	  0.965645	 -0.347655
  1.772528	  0.976172	 -0.341323
  1.787108	  0.986536	 -0.332119
  1.801180	  0.996408	 -0.321653
  1.814079	  1.005537	 -0.308898
  1.825364	  1.013696	 -0.294111
  1.835589	  1.021900	 -0.278909
  1.844342	  1.029290	 -0.262566
  1.852144	  1.034644	 -0.245032
  1.859043	  1.036002	 -0.228020
  1.863710	  1.033610	 -0.208924
  1.861774	  1.030055	 -0.186996
  1.857681	  1.034149	 -0.164577
  1.856180	  1.041608	 -0.141512
  1.857174	  1.046450	 -0.125198
  1.860891	  1.049650	 -0.108674
  1.866472	  1.047551	 -0.090306
  1.871737	  1.043478	 -0.071370
  1.874931	  1.042218	 -0.052103
  1.879396	  1.040020	 -0.031985
  1.886649	  1.037260	 -0.011282
  1.894481	  1.035791	  0.008466
  1.901073	  1.036113	  0.026463
  1.905198	  1.037034	  0.048203
  1.905377	  1.037052	  0.069104
  1.899124	  1.033929	  0.090107
  1.888889	  1.024986	  0.110054
  1.881295	  1.013254	  0.126035
  1.877739	  0.998860	  0.140229
  1.877260	  0.981780	  0.154271
  1.880615	  0.964195	  0.168491
  1.885294	  0.948377	  0.180932
  1.890138	  0.938561	  0.193756
  1.898280	  0.926175	  0.208324
  1.906777	  0.913626	  0.221963
  1.915030	  0.899811	  0.232620
  1.924357	  0.884618	  0.241831
  1.933309	  0.868167	  0.247494
  1.944611	  0.855702	  0.251148
  1.957636	  0.838851	  0.255200
  1.970299	  0.822601	  0.263869
  1.981402	  0.807161	  0.275034
  1.990961	  0.795902	  0.284644
  2.004150	  0.782466	  0.295456
  2.015704	  0.772953	  0.303953
  2.038359	  0.766338	  0.311716
  2.058987	  0.757207	  0.322591
  2.071538	  0.748081	  0.330728
  2.084909	  0.737033	  0.340029
  2.100937	  0.725273	  0.352840
  2.112247	  0.718593	  0.361219
  2.129158	  0.712612	  0.370470
  2.148087	  0.706386	  0.379164
  2.163645	  0.700226	  0.386548
  2.182913	  0.691545	  0.397031
  2.198516	  0.681193	  0.408696
  2.206614	  0.674499	  0.416756
  2.219786	  0.671603	  0.430489
  2.243583	  0.672315	  0.439749
  2.262250	  0.668440	  0.450278
  2.277529	  0.664077	  0.462193
  2.296002	  0.657928	  0.473821
  2.311189	  0.651579	  0.482742
  2.323784	  0.647621	  0.489955
  2.346022	  0.642146	  0.505167
  2.362054	  0.635156	  0.516988
  2.370549	  0.629296	  0.524138
