  0.310709	  2.085943	  1.366572
  0.300666	  2.079549	  1.354650
  0.297550	  2.077565	  1.350951
  0.278734	  2.072583	  1.335108
  0.259598	  2.064422	  1.326619
  0.244507	  2.053263	  1.323219
  0.233193	  2.040061	  1.319620
  0.221386	  2.027254	  1.309802
  0.205373	  2.017276	  1.299705
  0.189134	  2.007319	  1.291651
  0.176032	  1.996414	  1.286218
  0.161997	  1.982500	  1.279924
  0.146153	  1.971981	  1.271706
  0.130870	  1.960977	  1.263926
  0.114700	  1.948849	  1.261187
  0.094949	  1.936816	  1.261164
  0.079810	  1.930433	  1.259327
  0.061257	  1.927475	  1.243914
  0.053265	  1.921809	  1.217767
  0.044983	  1.899274	  1.200711
  0.029676	  1.877282	  1.205726
  0.020006	  1.868310	  1.206463
  0.003591	  1.851492	  1.209629
 -0.008949	  1.831631	  1.208630
 -0.016769	  1.817050	  1.204326
 -0.027022	  1.798551	  1.199192
 -0.040546	  1.779524	  1.196507
 -0.047319	  1.764411	  1.194024
 -0.055525	  1.750183	  1.192442
 -0.068603	  1.732988	  1.190225
 -0.089201	  1.708643	  1.188972
 -0.099395	  1.697449	  1.186965
 -0.115747	  1.677198	  1.178539
 -0.123991	  1.664932	  1.171758
 -0.127229	  1.651857	  1.165965
 -0.133060	  1.634569	  1.155522
 -0.142787	  1.617136	  1.148748
 -0.152520	  1.604423	  1.145319
 -0.166939	  1.586899	  1.138082
 -0.175233	  1.569424	  1.133631
 -0.183245	  1.552556	  1.130616
 -0.193808	  1.532755	  1.122631
 -0.202003	  1.519250	  1.113308
 -0.211286	  1.510602	  1.102600
 -0.223731	  1.491311	  1.086062
 -0.231765	  1.467095	  1.080501
 -0.232679	  1.453119	  1.080309
 -0.234119	  1.431644	  1.077235
 -0.224781	  1.414651	  1.066303
 -0.222902	  1.398540	  1.053443
 -0.222177	  1.381494	  1.042540
 -0.219394	  1.364103	  1.032673
 -0.215402	  1.347176	  1.021890
 -0.209257	  1.330796	  1.010372
 -0.201314	  1.316681	  0.998374
 -0.196718	  1.306161	  0.984856
 -0.195998	  1.290294	  0.970915
 -0.177220	  1.268643	  0.960584
 -0.162172	  1.256682	  0.950989
 -0.156987	  1.250642	  0.943885
 -0.156439	  1.241944	  0.926168
 -0.159780	  1.234403	  0.909045
 -0.160614	  1.232808	  0.898828
 -0.164033	  1.230928	  0.885778
 -0.172110	  1.229034	  0.873326
 -0.177355	  1.226513	  0.862920
 -0.193494	  1.230727	  0.846866
 -0.205985	  1.231643	  0.830573
 -0.217508	  1.228674	  0.808669
 -0.221743	  1.224608	  0.787630
 -0.226610	  1.224071	  0.766555
 -0.229002	  1.224047	  0.745953
 -0.234557	  1.224809	  0.727708
 -0.246259	  1.227532	  0.708308
 -0.258001	  1.229059	  0.693135
 -0.269771	  1.225751	  0.681476
 -0.277480	  1.214342	  0.666690
 -0.277516	  1.197802	  0.631242
 -0.278079	  1.195909	  0.616516
 -0.278669	  1.194409	  0.598974
 -0.281425	  1.188229	  0.579721
 -0.288495	  1.176713	  0.562589
 -0.299936	  1.166317	  0.543784
 -0.308386	  1.157350	  0.531219
 -0.314077	  1.147536	  0.514494
 -0.319335	  1.136971	  0.495327
 -0.325835	  1.124326	  0.480428
 -0.333763	  1.115682	  0.467958
 -0.343871	  1.103146	  0.452738
 -0.348679	  1.093799	  0.446663
 -0.360829	  1.075883	  0.435990
 -0.374684	  1.054390	  0.421208
 -0.377840	  1.048711	  0.419031
 -0.387355	  1.038769	  0.410995
 -0.396271	  1.029007	  0.404578
 -0.408629	  1.019379	  0.400908
 -0.426894	  1.005285	  0.398098
 -0.443413	  0.991357	  0.401033
 -0.452172	  0.984155	  0.403592
 -0.468571	  0.966882	  0.411120
 -0.492420	  0.950989	  0.424473
 -0.495132	  0.949547	  0.431404
 -0.512884	  0.942322	  0.439329
 -0.530164	  0.932676	  0.452718
 -0.541298	  0.927522	  0.460095
 -0.562389	  0.915378	  0.474018
 -0.574361	  0.908791	  0.483537
 -0.585639	  0.903725	  0.491655
 -0.606305	  0.892601	  0.507359
 -0.615928	  0.886274	  0.514843
 -0.633186	  0.876009	  0.522509
 -0.652217	  0.866077	  0.531335
 -0.668775	  0.854464	  0.540106
 -0.678459	  0.848124	  0.545671
 -0.690492	  0.835168	  0.566482
 -0.704609	  0.831043	  0.582925
 -0.721457	  0.832071	  0.595897
 -0.738987	  0.831371	  0.612946
 -0.748856	  0.828094	  0.629684
 -0.765602	  0.825060	  0.641965
 -0.790546	  0.816781	  0.643417
 -0.811148	  0.804045	  0.643136
 -0.823083	  0.794677	  0.646643
 -0.835342	  0.783522	  0.656341
 -0.855177	  0.770093	  0.663654
 -0.874432	  0.762004	  0.666485
 -0.895297	  0.750316	  0.669246
 -0.908859	  0.741090	  0.673137
 -0.924575	  0.729468	  0.674953
 -0.942128	  0.718635	  0.675030
 -0.958577	  0.705149	  0.677353
 -0.978566	  0.690695	  0.674247
 -0.995967	  0.680969	  0.670355
 -1.012933	  0.670548	  0.668129
 -1.031367	  0.656092	  0.663255
 -1.045156	  0.647463	  0.659038
 -1.054866	  0.639412	  0.656811
 -1.075255	  0.619303	  0.651509
 -1.091213	  0.606637	  0.653763
 -1.106009	  0.597344	  0.658076
 -1.126187	  0.585389	  0.658698
 -1.142457	  0.579737	  0.651099
 -1.158553	  0.572147	  0.640192
 -1.171722	  0.566440	  0.632779
 -1.189169	  0.559352	  0.618317
 -1.210775	  0.542537	  0.604503
 -1.219798	  0.534948	  0.600076
 -1.228709	  0.524101	  0.598305
 -1.245550	  0.505902	  0.590334
 -1.258608	  0.491665	  0.579513
 -1.270887	  0.478239	  0.572348
 -1.284808	  0.467651	  0.567013
 -1.302232	  0.455228	  0.568223
 -1.317635	  0.444411	  0.558745
 -1.328235	  0.433445	  0.544846
 -1.338436	  0.423688	  0.530380
 -1.347488	  0.413567	  0.515184
 -1.357063	  0.405267	  0.499475
 -1.364085	  0.395250	  0.483478
 -1.371982	  0.387467	  0.466787
 -1.379614	  0.379876	  0.449632
 -1.384298	  0.371538	  0.431399
 -1.390038	  0.365245	  0.412625
 -1.392431	  0.358170	  0.393776
 -1.395981	  0.353752	  0.374632
 -1.397461	  0.347721	  0.355502
 -1.401378	  0.342884	  0.336428
 -1.402597	  0.336209	  0.317176
 -1.405057	  0.331379	  0.297407
 -1.404988	  0.325735	  0.277914
 -1.404993	  0.320613	  0.258534
 -1.404738	  0.314755	  0.239358
 -1.406476	  0.309209	  0.219919
 -1.406654	  0.302085	  0.200714
 -1.409100	  0.295513	  0.181756
 -1.410387	  0.285755	  0.163681
 -1.413019	  0.275981	  0.146457
 -1.416566	  0.264659	  0.135508
 -1.427668	  0.258726	  0.138708
 -1.432395	  0.255810	  0.139490
 -1.443230	  0.249135	  0.140495
 -1.459364	  0.240860	  0.144914
 -1.475815	  0.230933	  0.148417
 -1.494122	  0.222293	  0.152009
 -1.513070	  0.213750	  0.155519
 -1.531921	  0.204606	  0.158745
 -1.549810	  0.195882	  0.162501
 -1.567092	  0.185680	  0.164965
 -1.584519	  0.176200	  0.169212
 -1.602309	  0.164123	  0.171957
 -1.619553	  0.153848	  0.176769
 -1.635398	  0.140817	  0.179514
 -1.650000	  0.128702	  0.182582
 -1.665235	  0.117355	  0.188224
 -1.675553	  0.104533	  0.193853
 -1.687082	  0.087079	  0.196131
 -1.706696	  0.063208	  0.197392
 -1.717872	  0.051133	  0.200604
 -1.729480	  0.038449	  0.205307
 -1.743769	  0.023567	  0.210487
 -1.754297	  0.012272	  0.212594
 -1.766234	  0.001550	  0.225766
 -1.781068	 -0.017805	  0.233441
 -1.795540	 -0.037814	  0.229757
 -1.807332	 -0.050418	  0.228843
 -1.825253	 -0.071589	  0.224167
 -1.835015	 -0.088026	  0.217868
 -1.844017	 -0.098616	  0.212962
 -1.860087	 -0.109882	  0.208094
 -1.872178	 -0.116876	  0.206024
 -1.895983	 -0.128667	  0.209348
 -1.917870	 -0.139639	  0.210113
 -1.924772	 -0.146502	  0.211740
 -1.933387	 -0.151266	  0.208938
 -1.964400	 -0.157625	  0.205117
 -1.979336	 -0.160062	  0.198695
 -1.990161	 -0.162104	  0.194002
 -2.010673	 -0.165197	  0.190293
 -2.029203	 -0.165609	  0.187514
 -2.046823	 -0.164664	  0.183814
 -2.067450	 -0.160016	  0.179180
 -2.080989	 -0.150928	  0.170781
 -2.100179	 -0.138006	  0.159637
 -2.119921	 -0.130816	  0.152617
 -2.134613	 -0.129590	  0.149228
 -2.152967	 -0.132450	  0.149413
 -2.177762	 -0.132400	  0.146232
 -2.198573	 -0.136029	  0.139778
 -2.215361	 -0.144795	  0.133711
 -2.228964	 -0.158366	  0.128729
 -2.239958	 -0.174257	  0.126831
 -2.244718	 -0.194451	  0.124136
 -2.247953	 -0.213887	  0.122318
 -2.252918	 -0.233168	  0.121353
 -2.255107	 -0.253128	  0.118258
 -2.257608	 -0.276462	  0.115034
 -2.256810	 -0.300001	  0.111446
 -2.250880	 -0.312843	  0.108726
 -2.235854	 -0.334218	  0.103261
 -2.220959	 -0.354628	  0.101580
 -2.209245	 -0.375362	  0.107795
 -2.200794	 -0.395226	  0.122393
 -2.200657	 -0.418033	  0.131502
 -2.213371	 -0.447176	  0.130772
 -2.228609	 -0.468540	  0.112662
 -2.234608	 -0.477031	  0.090678
 -2.239647	 -0.485195	  0.072166
 -2.249840	 -0.500457	  0.059170
 -2.257486	 -0.513021	  0.054238
 -2.267713	 -0.524429	  0.051258
 -2.281294	 -0.541235	  0.048176
 -2.294838	 -0.552870	  0.045601
 -2.312456	 -0.566147	  0.040035
 -2.327872	 -0.577544	  0.031030
 -2.338567	 -0.586096	  0.022130
 -2.361410	 -0.601542	  0.010896
 -2.374711	 -0.610664	  0.009824
 -2.385741	 -0.619137	  0.011445
 -2.416038	 -0.642455	  0.003766
 -2.421843	 -0.646674	 -0.000422
