  1.997452	 -1.422453	 -0.337328
  2.030700	 -1.413796	 -0.365207
  1.999518	 -1.421416	 -0.336104
  1.970984	 -1.427587	 -0.306227
  1.941448	 -1.433121	 -0.272146
  1.910103	 -1.438991	 -0.234104
  1.877664	 -1.444909	 -0.195157
  1.844498	 -1.450254	 -0.156739
  1.810130	 -1.455715	 -0.118708
  1.774163	 -1.463047	 -0.079820
  1.737385	 -1.473760	 -0.040757
  1.702559	 -1.488123	 -0.003225
  1.671794	 -1.506332	  0.032327
  1.644601	 -1.529394	  0.068641
  1.622529	 -1.557416	  0.106825
  1.607589	 -1.588649	  0.151988
  1.601522	 -1.619379	  0.202200
  1.604759	 -1.645981	  0.254931
  1.614537	 -1.681357	  0.325120
  1.594464	 -1.728215	  0.400180
  1.562183	 -1.760082	  0.448633
  1.542611	 -1.777839	  0.482352
  1.523942	 -1.790788	  0.523151
  1.495489	 -1.800505	  0.575946
  1.455421	 -1.805435	  0.627409
  1.402497	 -1.803276	  0.671019
  1.335834	 -1.793160	  0.701778
  1.265251	 -1.777420	  0.716204
  1.201722	 -1.758146	  0.719424
  1.144851	 -1.733312	  0.716959
  1.090876	 -1.704646	  0.714769
  1.040862	 -1.676975	  0.719625
  0.993999	 -1.652010	  0.735750
  0.944356	 -1.630033	  0.763104
  0.896032	 -1.615338	  0.792833
  0.854838	 -1.606473	  0.820839
  0.816926	 -1.598801	  0.848536
  0.778930	 -1.590936	  0.877364
  0.741179	 -1.584152	  0.907365
  0.702972	 -1.579252	  0.940579
  0.663562	 -1.577481	  0.977024
  0.624739	 -1.579427	  1.014552
  0.586649	 -1.585097	  1.052527
  0.548477	 -1.594523	  1.090813
  0.511169	 -1.607684	  1.128693
  0.475789	 -1.624634	  1.165846
  0.443233	 -1.644359	  1.201446
  0.414576	 -1.665279	  1.234684
  0.388639	 -1.685925	  1.267113
  0.361785	 -1.701813	  1.299921
  0.333958	 -1.712421	  1.332990
  0.303656	 -1.719018	  1.368456
  0.269277	 -1.723412	  1.406921
  0.231805	 -1.726533	  1.446090
  0.191931	 -1.728854	  1.484645
  0.150540	 -1.730864	  1.521362
  0.107972	 -1.733465	  1.556285
  0.063894	 -1.738005	  1.590754
  0.019420	 -1.746215	  1.623866
 -0.021928	 -1.758065	  1.654510
 -0.061442	 -1.773388	  1.684772
 -0.100136	 -1.791131	  1.714938
 -0.153045	 -1.815668	  1.755368
 -0.177642	 -1.826265	  1.774268
