  1.602607	  1.611952	 -0.745809
  1.640448	  1.607921	 -0.762397
  1.678289	  1.603890	 -0.778985
  1.655648	  1.609975	 -0.770527
  1.636805	  1.615076	 -0.766816
  1.621723	  1.620496	 -0.765965
  1.594863	  1.624857	 -0.761256
  1.577848	  1.619101	 -0.756553
  1.559677	  1.612664	 -0.747872
  1.544029	  1.606136	 -0.736397
  1.529640	  1.603799	 -0.726256
  1.509444	  1.602807	 -0.712867
  1.492305	  1.599316	 -0.701926
  1.479248	  1.595784	 -0.695593
  1.460947	  1.586910	 -0.685492
  1.440860	  1.582323	 -0.674766
  1.417055	  1.585562	 -0.663438
  1.404223	  1.586652	 -0.659686
  1.389873	  1.585569	 -0.654801
  1.368255	  1.578296	 -0.646255
  1.347977	  1.575496	 -0.638855
  1.328685	  1.576419	 -0.633051
  1.309886	  1.576063	 -0.627459
  1.293901	  1.575207	 -0.622084
  1.274065	  1.570522	 -0.613367
  1.249460	  1.569574	 -0.602370
  1.238763	  1.571830	 -0.597160
  1.220164	  1.571825	 -0.588128
  1.191493	  1.583310	 -0.572724
  1.178591	  1.595651	 -0.566845
  1.170747	  1.608727	 -0.565209
  1.162087	  1.627893	 -0.561230
  1.159257	  1.649714	 -0.558469
  1.156211	  1.670379	 -0.560220
  1.152326	  1.688305	 -0.554018
  1.144106	  1.702493	 -0.537705
  1.131008	  1.718908	 -0.525428
  1.120744	  1.740506	 -0.516561
  1.117741	  1.756529	 -0.511284
  1.115052	  1.780522	 -0.512691
  1.109970	  1.801670	 -0.518611
  1.108677	  1.818315	 -0.523821
  1.103849	  1.842717	 -0.521390
  1.096472	  1.858855	 -0.517134
  1.087390	  1.875610	 -0.512322
  1.081380	  1.891028	 -0.508332
  1.075527	  1.908498	 -0.503665
  1.064610	  1.928492	 -0.494305
  1.055428	  1.944064	 -0.485549
  1.046544	  1.955370	 -0.475996
  1.032276	  1.966401	 -0.457094
  1.024696	  1.971543	 -0.440952
  1.023125	  1.974602	 -0.437242
  1.018884	  1.977142	 -0.433043
  1.015684	  1.979679	 -0.423514
  1.003781	  1.981391	 -0.407672
  0.987731	  1.978797	 -0.390637
  0.976115	  1.974881	 -0.378768
  0.966276	  1.966013	 -0.357729
  0.957884	  1.961878	 -0.336219
  0.953744	  1.959775	 -0.327695
  0.948198	  1.952285	 -0.307552
  0.936715	  1.940442	 -0.286141
  0.927175	  1.936885	 -0.273608
  0.915999	  1.933227	 -0.261704
  0.898741	  1.931697	 -0.247067
  0.879173	  1.930627	 -0.233373
  0.863457	  1.920122	 -0.223721
  0.843016	  1.928200	 -0.212934
  0.837039	  1.926463	 -0.207728
  0.835207	  1.922617	 -0.194825
  0.822827	  1.941926	 -0.195780
  0.814450	  1.932820	 -0.188926
  0.823032	  1.959459	 -0.187855
  0.826145	  1.977817	 -0.209478
  0.822529	  1.980092	 -0.217696
  0.807300	  1.994343	 -0.213410
  0.797241	  2.000226	 -0.223240
  0.788414	  1.996635	 -0.242144
  0.780341	  2.006495	 -0.257445
  0.771751	  2.004455	 -0.276413
  0.768149	  2.003596	 -0.287369
  0.766145	  1.990973	 -0.298165
  0.765758	  1.984486	 -0.303063
  0.776351	  1.967467	 -0.311427
  0.790000	  1.937115	 -0.312789
  0.795096	  1.920159	 -0.306395
  0.799588	  1.907329	 -0.305480
  0.801759	  1.896271	 -0.310442
  0.807566	  1.876314	 -0.315573
  0.813446	  1.849055	 -0.320467
  0.816422	  1.824679	 -0.318988
  0.819318	  1.805880	 -0.315042
  0.819600	  1.793717	 -0.309672
  0.825150	  1.775192	 -0.301938
  0.821144	  1.753756	 -0.296792
  0.815191	  1.735871	 -0.293827
  0.818910	  1.715969	 -0.291207
  0.809333	  1.701556	 -0.283232
  0.803323	  1.688754	 -0.275717
  0.788260	  1.667821	 -0.265713
  0.776867	  1.658031	 -0.263084
  0.761696	  1.645027	 -0.260226
  0.751461	  1.629387	 -0.253015
  0.740810	  1.614019	 -0.244086
  0.729425	  1.602741	 -0.240377
  0.710876	  1.594182	 -0.231842
  0.690236	  1.582563	 -0.222258
  0.676295	  1.570650	 -0.215491
  0.666285	  1.556863	 -0.211999
  0.657478	  1.537914	 -0.207402
  0.647067	  1.521064	 -0.200694
  0.634805	  1.505964	 -0.194940
  0.621735	  1.491536	 -0.190779
  0.608645	  1.476693	 -0.188252
  0.595279	  1.461224	 -0.187092
  0.581479	  1.445371	 -0.185981
  0.567451	  1.430210	 -0.183792
  0.553251	  1.416279	 -0.181686
  0.543904	  1.400425	 -0.179111
  0.543927	  1.384529	 -0.176452
  0.526916	  1.369466	 -0.166310
  0.527199	  1.346091	 -0.160766
  0.514438	  1.334258	 -0.151932
  0.511396	  1.317207	 -0.142601
  0.514420	  1.300509	 -0.134378
  0.517926	  1.281530	 -0.127099
  0.520602	  1.262187	 -0.122559
  0.525872	  1.245746	 -0.120665
  0.539008	  1.234656	 -0.118519
  0.539331	  1.207304	 -0.106911
  0.532144	  1.179896	 -0.101026
  0.535590	  1.162994	 -0.103402
  0.528572	  1.150127	 -0.105224
  0.520299	  1.123042	 -0.109976
  0.517112	  1.113738	 -0.110193
  0.507639	  1.099479	 -0.107191
  0.509488	  1.070843	 -0.102032
  0.504723	  1.049921	 -0.101275
  0.503018	  1.035737	 -0.099712
  0.498518	  1.012290	 -0.095892
  0.491522	  0.996938	 -0.095890
  0.483882	  0.982489	 -0.093702
  0.468838	  0.954734	 -0.085687
  0.459877	  0.932531	 -0.084741
  0.454867	  0.923463	 -0.079892
  0.445699	  0.909787	 -0.084662
  0.437733	  0.883509	 -0.082882
  0.428549	  0.871686	 -0.086828
  0.412802	  0.853775	 -0.076372
  0.401384	  0.836532	 -0.075883
  0.383096	  0.819114	 -0.076907
  0.376197	  0.806858	 -0.061788
  0.362545	  0.793577	 -0.066710
  0.354549	  0.772043	 -0.062154
  0.346105	  0.755335	 -0.058427
  0.344316	  0.742638	 -0.047590
  0.338847	  0.725294	 -0.059023
  0.326181	  0.702007	 -0.040575
  0.311938	  0.684972	 -0.043010
  0.304285	  0.677195	 -0.040051
  0.289790	  0.653368	 -0.033681
  0.273538	  0.633890	 -0.026042
  0.255711	  0.613050	 -0.026309
  0.239768	  0.620392	 -0.016515
  0.231385	  0.596270	 -0.015387
  0.210671	  0.584865	 -0.003540
  0.202193	  0.574750	  0.001094
  0.186605	  0.576520	  0.008436
  0.173187	  0.561531	  0.013848
  0.146964	  0.548326	  0.026647
  0.129433	  0.545317	  0.028727
  0.104511	  0.557104	  0.030217
  0.087645	  0.557575	  0.032565
  0.061394	  0.554193	  0.040866
  0.055204	  0.552967	  0.042654
  0.035630	  0.550665	  0.048109
  0.018190	  0.551295	  0.047396
 -0.004959	  0.552992	  0.049436
 -0.028368	  0.558620	  0.053266
 -0.051331	  0.566176	  0.060784
 -0.060906	  0.567158	  0.065913
 -0.074162	  0.567213	  0.076103
 -0.098354	  0.563186	  0.092074
 -0.118578	  0.576278	  0.098431
 -0.137788	  0.588859	  0.099570
 -0.154803	  0.604305	  0.096806
 -0.170295	  0.616693	  0.093649
 -0.185982	  0.627961	  0.088637
 -0.201390	  0.637836	  0.086381
 -0.217755	  0.648109	  0.085763
 -0.233197	  0.661355	  0.082630
 -0.248909	  0.670069	  0.081205
 -0.264809	  0.683505	  0.078980
 -0.281989	  0.696560	  0.075618
 -0.296364	  0.707247	  0.072498
 -0.311210	  0.718591	  0.070016
 -0.326799	  0.734748	  0.069829
 -0.333170	  0.754324	  0.067246
 -0.340019	  0.776906	  0.064245
 -0.346730	  0.802028	  0.061931
 -0.350695	  0.814163	  0.062209
 -0.353272	  0.831892	  0.060997
 -0.362153	  0.854207	  0.063237
 -0.366335	  0.872286	  0.067375
 -0.371205	  0.887005	  0.064670
 -0.376804	  0.898918	  0.063386
 -0.383056	  0.918466	  0.065073
 -0.389845	  0.937382	  0.064168
 -0.397860	  0.960999	  0.062632
 -0.401423	  0.974014	  0.060983
 -0.406906	  0.998459	  0.063787
 -0.406661	  1.020915	  0.070487
 -0.405922	  1.038270	  0.077741
 -0.411974	  1.056817	  0.085127
 -0.409395	  1.072551	  0.099120
 -0.412510	  1.092222	  0.108528
 -0.407802	  1.106605	  0.119842
 -0.408458	  1.123300	  0.130307
 -0.405346	  1.140957	  0.136195
 -0.398293	  1.161769	  0.145562
 -0.389319	  1.181281	  0.150232
 -0.386625	  1.193426	  0.152047
 -0.384864	  1.213616	  0.159557
 -0.395438	  1.230200	  0.170669
 -0.396856	  1.240223	  0.173288
 -0.398161	  1.257331	  0.174335
 -0.401182	  1.274159	  0.183305
 -0.412930	  1.281003	  0.190945
 -0.445110	  1.292089	  0.214383
 -0.456162	  1.285549	  0.214374
 -0.461561	  1.300389	  0.224882
 -0.467048	  1.318405	  0.240460
 -0.481079	  1.316471	  0.240069
 -0.497289	  1.323231	  0.252310
 -0.520127	  1.331672	  0.265592
 -0.538270	  1.332014	  0.277215
 -0.558923	  1.334512	  0.278685
 -0.571590	  1.336877	  0.278517
 -0.585963	  1.333781	  0.294770
 -0.612679	  1.339873	  0.289412
 -0.632376	  1.334848	  0.311275
 -0.652218	  1.334197	  0.301718
 -0.668119	  1.333892	  0.316276
 -0.687959	  1.331215	  0.319196
 -0.710354	  1.328698	  0.328553
 -0.730723	  1.331177	  0.330512
 -0.750033	  1.340068	  0.329649
 -0.768181	  1.343241	  0.348049
 -0.788330	  1.353734	  0.347764
 -0.803047	  1.361291	  0.354543
 -0.817573	  1.365988	  0.364093
 -0.837915	  1.373277	  0.365609
 -0.854956	  1.373252	  0.370423
 -0.874755	  1.373866	  0.377431
 -0.897456	  1.374474	  0.384303
 -0.912423	  1.372927	  0.391601
 -0.935266	  1.377256	  0.399230
 -0.956848	  1.379775	  0.403436
 -0.963651	  1.382831	  0.412168
 -0.984164	  1.382881	  0.425729
 -1.004017	  1.383126	  0.439005
 -1.021724	  1.385115	  0.446452
 -1.039549	  1.386927	  0.456744
 -1.057650	  1.388554	  0.467650
 -1.067880	  1.386902	  0.475083
 -1.085755	  1.390186	  0.488698
 -1.105017	  1.390231	  0.504161
 -1.127832	  1.393240	  0.517245
 -1.137986	  1.399395	  0.525799
 -1.152900	  1.403035	  0.531856
 -1.171858	  1.408299	  0.543360
 -1.190398	  1.412638	  0.552170
 -1.208477	  1.411761	  0.557820
 -1.228069	  1.410921	  0.567434
 -1.245121	  1.409530	  0.571692
 -1.265825	  1.410418	  0.578873
 -1.284469	  1.411854	  0.583633
 -1.302721	  1.414456	  0.588373
 -1.321921	  1.416688	  0.593307
 -1.347812	  1.418573	  0.599426
 -1.368469	  1.421792	  0.603351
 -1.383907	  1.416480	  0.607337
 -1.397722	  1.415003	  0.612651
 -1.421859	  1.409085	  0.617567
 -1.444209	  1.406324	  0.624719
 -1.458369	  1.403285	  0.632307
 -1.472708	  1.398325	  0.640107
 -1.490233	  1.391295	  0.651237
 -1.510102	  1.384360	  0.660857
 -1.526604	  1.377144	  0.670493
 -1.539948	  1.370372	  0.677377
 -1.556932	  1.361701	  0.686998
 -1.576675	  1.358180	  0.695311
 -1.596460	  1.360377	  0.703858
 -1.615739	  1.365459	  0.711563
 -1.634494	  1.373893	  0.724649
 -1.650779	  1.371701	  0.736051
 -1.667064	  1.369509	  0.747453
