  1.989220	 -0.552374	  1.302129
  2.029027	 -0.570965	  1.318353
  2.012587	 -0.562374	  1.310874
  1.996483	 -0.553424	  1.303093
  1.980378	 -0.544474	  1.295312
  1.964909	 -0.534938	  1.286959
  1.949615	 -0.525251	  1.278460
  1.934320	 -0.515564	  1.269960
  1.920177	 -0.504853	  1.260729
  1.906198	 -0.494007	  1.251403
  1.892251	 -0.483208	  1.241976
  1.878506	 -0.472699	  1.231944
  1.864762	 -0.462190	  1.221912
  1.850670	 -0.452700	  1.211359
  1.836499	 -0.443472	  1.200681
  1.822040	 -0.434733	  1.189977
  1.807334	 -0.426437	  1.179257
  1.792544	 -0.418143	  1.168653
  1.776994	 -0.409884	  1.159166
  1.761444	 -0.401625	  1.149680
  1.745634	 -0.392618	  1.141378
  1.729554	 -0.382362	  1.135357
  1.713474	 -0.372106	  1.129336
  1.697445	 -0.361004	  1.124888
  1.682192	 -0.348067	  1.124856
  1.666939	 -0.335131	  1.124824
  1.651148	 -0.323001	  1.122945
  1.635010	 -0.311744	  1.119362
  1.618825	 -0.300540	  1.115823
  1.602415	 -0.289603	  1.112498
  1.586004	 -0.278665	  1.109173
  1.568986	 -0.269476	  1.104079
  1.551878	 -0.260665	  1.098631
  1.534300	 -0.253226	  1.092657
  1.516560	 -0.246363	  1.086478
  1.498613	 -0.239009	  1.081598
  1.480693	 -0.230131	  1.081870
  1.462774	 -0.221252	  1.082142
  1.444953	 -0.212263	  1.083405
  1.427306	 -0.203171	  1.085839
  1.409659	 -0.194080	  1.088273
  1.392025	 -0.184932	  1.090587
  1.374392	 -0.175778	  1.092886
  1.356787	 -0.166494	  1.094860
  1.339268	 -0.156925	  1.096090
  1.321749	 -0.147356	  1.097320
  1.304350	 -0.137509	  1.097877
  1.287019	 -0.127529	  1.098104
  1.269697	 -0.117535	  1.098303
  1.252609	 -0.107155	  1.097784
  1.235522	 -0.096775	  1.097265
  1.218557	 -0.086204	  1.096585
  1.201831	 -0.075282	  1.095604
  1.185106	 -0.064360	  1.094623
  1.168659	 -0.053116	  1.092869
  1.152360	 -0.041723	  1.090738
  1.136061	 -0.030329	  1.088606
  1.120319	 -0.018440	  1.085317
  1.104634	 -0.006506	  1.081917
  1.089008	  0.005485	  1.078444
  1.073937	  0.017968	  1.074320
  1.058865	  0.030452	  1.070195
  1.043983	  0.043122	  1.065954
  1.029601	  0.056258	  1.061416
  1.015218	  0.069394	  1.056878
  1.000840	  0.082365	  1.051878
  0.986468	  0.095232	  1.046598
  0.970819	  0.106365	  1.041015
  0.954352	  0.116144	  1.035251
  0.937340	  0.124837	  1.029333
  0.920103	  0.133029	  1.023352
  0.902815	  0.141153	  1.017424
  0.885435	  0.149150	  1.011597
  0.868054	  0.157146	  1.005769
  0.850597	  0.165157	  1.000192
  0.833130	  0.173169	  0.994650
  0.815717	  0.181465	  0.989364
  0.798429	  0.190321	  0.984598
  0.781142	  0.199178	  0.979833
  0.764162	  0.208804	  0.975470
  0.747354	  0.218816	  0.971318
  0.730556	  0.228831	  0.967134
  0.713882	  0.238880	  0.962548
  0.697209	  0.248928	  0.957961
  0.680424	  0.258396	  0.952612
  0.663594	  0.267530	  0.946841
  0.646749	  0.276306	  0.940577
  0.629929	  0.284248	  0.933228
  0.613108	  0.292189	  0.925879
  0.596746	  0.299977	  0.917415
  0.580534	  0.307713	  0.908621
  0.564322	  0.315448	  0.899827
  0.548728	  0.323840	  0.890533
  0.533144	  0.332244	  0.881230
  0.517560	  0.340773	  0.872044
  0.501987	  0.349867	  0.863397
  0.486414	  0.358960	  0.854749
  0.470617	  0.368207	  0.846689
  0.454666	  0.377560	  0.839068
  0.438681	  0.386938	  0.831549
  0.422422	  0.396522	  0.824932
  0.406163	  0.406106	  0.818315
  0.389761	  0.415849	  0.812310
  0.373279	  0.425684	  0.806688
  0.356758	  0.435552	  0.801240
  0.340017	  0.445619	  0.796951
  0.323275	  0.455686	  0.792662
  0.306371	  0.465795	  0.789195
  0.289402	  0.475919	  0.786102
  0.272392	  0.486071	  0.783341
  0.255311	  0.496274	  0.781309
  0.238230	  0.506477	  0.779278
  0.221145	  0.516824	  0.778262
  0.204064	  0.527194	  0.777429
  0.187008	  0.537626	  0.776897
  0.170000	  0.548148	  0.776830
  0.152992	  0.558671	  0.776763
  0.136064	  0.569317	  0.776433
  0.119149	  0.579982	  0.776064
  0.102223	  0.590612	  0.775343
  0.085292	  0.601160	  0.773897
  0.068362	  0.611708	  0.772450
  0.051482	  0.622143	  0.769964
  0.034632	  0.632530	  0.767104
  0.017805	  0.642917	  0.764108
  0.001214	  0.653283	  0.759949
 -0.015377	  0.663649	  0.755791
 -0.031850	  0.674127	  0.751450
 -0.048118	  0.684792	  0.746802
 -0.064387	  0.695457	  0.742155
 -0.080482	  0.706344	  0.737422
 -0.096477	  0.717358	  0.732642
 -0.112472	  0.728372	  0.727861
 -0.128260	  0.739582	  0.722853
 -0.144039	  0.750800	  0.717836
 -0.159756	  0.762044	  0.712682
 -0.175320	  0.773347	  0.707206
 -0.190885	  0.784650	  0.701730
 -0.206442	  0.795931	  0.696188
 -0.221997	  0.807205	  0.690625
 -0.237635	  0.818446	  0.685231
 -0.253415	  0.829627	  0.680136
 -0.269210	  0.840808	  0.675087
 -0.285212	  0.851984	  0.670722
 -0.301213	  0.863161	  0.666358
 -0.317263	  0.874474	  0.662563
 -0.333329	  0.885842	  0.659008
 -0.349393	  0.897259	  0.655600
 -0.365433	  0.908893	  0.652883
 -0.381472	  0.920527	  0.650166
 -0.397500	  0.932305	  0.648067
 -0.413514	  0.944156	  0.646310
 -0.429530	  0.956032	  0.644747
 -0.445542	  0.967984	  0.643864
 -0.461554	  0.979936	  0.642982
 -0.477749	  0.991666	  0.642637
 -0.493978	  1.003352	  0.642397
 -0.510736	  1.014267	  0.642279
 -0.527806	  1.024689	  0.642237
 -0.545275	  1.034422	  0.641912
 -0.563249	  1.043164	  0.641192
 -0.581235	  1.051875	  0.640394
 -0.599401	  1.059899	  0.638027
 -0.617567	  1.067923	  0.635660
 -0.635549	  1.076125	  0.632597
 -0.652830	  1.084793	  0.627476
 -0.670111	  1.093462	  0.622355
 -0.687746	  1.101970	  0.618278
 -0.705666	  1.110301	  0.615203
 -0.723729	  1.118531	  0.612753
 -0.742108	  1.126401	  0.612206
 -0.760486	  1.134270	  0.611658
 -0.778575	  1.142761	  0.610817
 -0.796539	  1.151500	  0.609858
 -0.814502	  1.160240	  0.608899
 -0.831675	  1.170147	  0.606264
 -0.848805	  1.180107	  0.603549
 -0.865830	  1.190291	  0.601009
 -0.882757	  1.200673	  0.598626
 -0.899701	  1.211186	  0.597084
 -0.916659	  1.221763	  0.596348
 -0.933643	  1.232301	  0.597067
 -0.950564	  1.242768	  0.599095
 -0.967455	  1.253208	  0.601484
 -0.984301	  1.263581	  0.604413
 -1.001084	  1.273873	  0.607938
 -1.017867	  1.284164	  0.611462
 -1.034650	  1.294455	  0.614987
 -1.051379	  1.304850	  0.618464
 -1.068023	  1.315405	  0.621869
 -1.084667	  1.325959	  0.625273
 -1.101310	  1.336513	  0.628677
 -1.117954	  1.347068	  0.632082
 -1.134553	  1.357712	  0.635423
 -1.150859	  1.368915	  0.638361
 -1.167164	  1.380117	  0.641299
 -1.183470	  1.391320	  0.644237
 -1.199775	  1.402523	  0.647174
 -1.215970	  1.414024	  0.649508
 -1.232014	  1.425852	  0.651145
 -1.248059	  1.437680	  0.652781
 -1.264095	  1.449588	  0.653799
 -1.280016	  1.461664	  0.652958
 -1.295936	  1.473740	  0.652116
 -1.311503	  1.485696	  0.648278
 -1.326915	  1.497598	  0.643716
 -1.341522	  1.509154	  0.636430
 -1.355404	  1.520406	  0.627449
 -1.368498	  1.531286	  0.616951
 -1.381280	  1.542002	  0.605915
 -1.392576	  1.551895	  0.592705
 -1.403872	  1.561789	  0.579495
 -1.415169	  1.571682	  0.566284
 -1.425960	  1.581332	  0.552484
 -1.435201	  1.590191	  0.537119
 -1.444443	  1.599051	  0.521753
 -1.453684	  1.607910	  0.506387
 -1.462925	  1.616769	  0.491021
 -1.472006	  1.625310	  0.475382
 -1.479863	  1.631543	  0.458078
 -1.487719	  1.637776	  0.440774
 -1.495575	  1.644010	  0.423470
 -1.503432	  1.650243	  0.406166
 -1.512829	  1.654288	  0.388981
 -1.522750	  1.657512	  0.371917
 -1.532998	  1.660846	  0.355069
 -1.546764	  1.665377	  0.341286
 -1.561756	  1.671047	  0.329324
 -1.577882	  1.677930	  0.319703
 -1.594754	  1.685699	  0.312288
 -1.611793	  1.693703	  0.305535
 -1.629180	  1.701516	  0.299479
 -1.646672	  1.709264	  0.293650
 -1.664448	  1.715552	  0.286980
 -1.682338	  1.720869	  0.279791
 -1.700227	  1.726186	  0.272601
 -1.718117	  1.731503	  0.265412
 -1.736007	  1.736821	  0.258223
 -1.755904	  1.741905	  0.249371
 -1.773690	  1.746403	  0.241408
