  0.292569	 -0.677678	  2.264872
  0.261858	 -0.659946	  2.321215
  0.271051	 -0.665336	  2.304291
  0.280294	 -0.670632	  2.287364
  0.289535	 -0.675930	  2.270436
  0.298763	 -0.681255	  2.253510
  0.307960	 -0.686603	  2.236576
  0.315995	 -0.692774	  2.219334
  0.323750	 -0.699135	  2.202031
  0.331499	 -0.705501	  2.184727
  0.339247	 -0.711867	  2.167422
  0.346941	 -0.718302	  2.150130
  0.352388	 -0.727667	  2.133372
  0.352880	 -0.741850	  2.119334
  0.352119	 -0.756692	  2.106107
  0.346714	 -0.772896	  2.095825
  0.341183	 -0.789130	  2.085481
  0.336523	 -0.804082	  2.072952
  0.332495	 -0.817662	  2.058913
  0.323765	 -0.827629	  2.044666
  0.307487	 -0.830201	  2.034183
  0.290607	 -0.833514	  2.023971
  0.273639	 -0.836600	  2.013790
  0.257316	 -0.840784	  2.002954
  0.241455	 -0.845132	  1.991983
  0.224508	 -0.843508	  1.982670
  0.207497	 -0.836422	  1.975580
  0.190211	 -0.829283	  1.968472
  0.173070	 -0.821882	  1.961327
  0.156193	 -0.814380	  1.953812
  0.139669	 -0.806109	  1.946241
  0.125715	 -0.796464	  1.939092
  0.112617	 -0.780352	  1.933241
  0.095784	 -0.764148	  1.929926
  0.074665	 -0.758423	  1.922477
  0.052851	 -0.769841	  1.909119
  0.030643	 -0.777616	  1.897676
  0.016019	 -0.775227	  1.892468
 -0.003516	 -0.765790	  1.887173
 -0.022398	 -0.760199	  1.879827
 -0.037876	 -0.764373	  1.869086
 -0.056350	 -0.773033	  1.855400
 -0.073794	 -0.773183	  1.848107
 -0.090554	 -0.767293	  1.843024
 -0.115870	 -0.763967	  1.834804
 -0.135011	 -0.769295	  1.825621
 -0.145297	 -0.772554	  1.820888
 -0.168411	 -0.775726	  1.810498
 -0.186505	 -0.785910	  1.799145
 -0.194470	 -0.796143	  1.790655
 -0.204911	 -0.814526	  1.776813
 -0.221368	 -0.828929	  1.765138
 -0.230646	 -0.834633	  1.760671
 -0.244571	 -0.847394	  1.748204
 -0.256715	 -0.857253	  1.735532
 -0.267940	 -0.865484	  1.721977
 -0.278370	 -0.879258	  1.706570
 -0.282709	 -0.891976	  1.695808
 -0.284989	 -0.909839	  1.681836
 -0.297547	 -0.924800	  1.669172
 -0.307618	 -0.935598	  1.657750
 -0.317229	 -0.942329	  1.651827
 -0.341202	 -0.956308	  1.640308
 -0.355326	 -0.974759	  1.628850
 -0.360587	 -0.984950	  1.622045
 -0.365798	 -1.004986	  1.611917
 -0.370946	 -1.021096	  1.603067
 -0.378865	 -1.034060	  1.593994
 -0.394630	 -1.054700	  1.584047
 -0.406019	 -1.067566	  1.580944
 -0.418185	 -1.079017	  1.578325
 -0.436067	 -1.099940	  1.570329
 -0.443903	 -1.113845	  1.564315
 -0.447392	 -1.132204	  1.552403
 -0.446557	 -1.147254	  1.542656
 -0.458477	 -1.163024	  1.531708
 -0.474096	 -1.173449	  1.523614
 -0.488708	 -1.186358	  1.516481
 -0.502015	 -1.199513	  1.509254
 -0.514548	 -1.212652	  1.500970
 -0.527064	 -1.225334	  1.491904
 -0.539403	 -1.238313	  1.482922
 -0.550197	 -1.251856	  1.472929
 -0.558003	 -1.264172	  1.460624
 -0.563254	 -1.276374	  1.445321
 -0.576525	 -1.292549	  1.438550
 -0.593196	 -1.311748	  1.433228
 -0.601759	 -1.324409	  1.425293
 -0.610355	 -1.337787	  1.415286
 -0.620290	 -1.352615	  1.405238
 -0.629379	 -1.366954	  1.394608
 -0.637839	 -1.381205	  1.383499
 -0.647600	 -1.395584	  1.373618
 -0.656126	 -1.409657	  1.363281
 -0.665595	 -1.425417	  1.351502
 -0.674584	 -1.439389	  1.342506
 -0.681944	 -1.452440	  1.331624
 -0.690520	 -1.469445	  1.314550
 -0.698493	 -1.478867	  1.304666
 -0.714675	 -1.488811	  1.295565
 -0.730948	 -1.508627	  1.287152
 -0.737433	 -1.527185	  1.285996
 -0.744206	 -1.545457	  1.282767
 -0.752764	 -1.563471	  1.277542
 -0.760164	 -1.580191	  1.273884
 -0.772626	 -1.599639	  1.266147
 -0.782839	 -1.609801	  1.257399
 -0.797244	 -1.618498	  1.242837
 -0.810529	 -1.631689	  1.232301
 -0.820353	 -1.646105	  1.227770
 -0.832893	 -1.665068	  1.222343
 -0.845066	 -1.676050	  1.212459
 -0.857303	 -1.683287	  1.200029
 -0.873061	 -1.694952	  1.187698
 -0.886145	 -1.707690	  1.182750
 -0.901219	 -1.724438	  1.176493
 -0.910142	 -1.733807	  1.168537
 -0.921235	 -1.744396	  1.153267
 -0.935917	 -1.764609	  1.137763
 -0.943203	 -1.779629	  1.130047
 -0.948207	 -1.787435	  1.126584
 -0.956896	 -1.804430	  1.114437
 -0.966683	 -1.816044	  1.103712
 -0.983352	 -1.837184	  1.079514
 -0.987026	 -1.844787	  1.073704
 -0.995497	 -1.858525	  1.064749
 -1.005259	 -1.878749	  1.059497
 -1.009624	 -1.895914	  1.056235
 -1.013149	 -1.915836	  1.046769
 -1.019656	 -1.934486	  1.035354
 -1.027910	 -1.948552	  1.024706
 -1.038226	 -1.963972	  1.013305
 -1.046883	 -1.975977	  1.003553
 -1.056031	 -1.990909	  0.992529
 -1.069068	 -2.006069	  0.976452
 -1.081794	 -2.013129	  0.964571
 -1.102628	 -2.022590	  0.957134
 -1.111923	 -2.036871	  0.946662
