 -0.207354	 -1.674247	  1.784089
 -0.206233	 -1.679543	  1.784755
 -0.208076	 -1.659062	  1.787622
 -0.212165	 -1.639407	  1.784191
 -0.217578	 -1.620871	  1.778125
 -0.223363	 -1.602531	  1.771915
 -0.229749	 -1.584282	  1.766192
 -0.236351	 -1.565747	  1.762131
 -0.242721	 -1.547083	  1.758378
 -0.248228	 -1.528006	  1.756160
 -0.253607	 -1.508911	  1.754094
 -0.260047	 -1.490409	  1.751764
 -0.270150	 -1.473431	  1.747786
 -0.281979	 -1.456742	  1.744080
 -0.293653	 -1.439751	  1.743030
 -0.303219	 -1.421758	  1.742817
 -0.311577	 -1.403250	  1.739780
 -0.318715	 -1.385207	  1.734669
 -0.321969	 -1.364526	  1.731280
 -0.318124	 -1.340773	  1.732041
 -0.314848	 -1.311144	  1.739748
 -0.319042	 -1.297889	  1.744989
 -0.329136	 -1.284946	  1.752204
 -0.344175	 -1.267845	  1.756002
 -0.354197	 -1.249073	  1.758617
 -0.357913	 -1.228407	  1.760302
 -0.360489	 -1.207153	  1.759536
 -0.363451	 -1.186731	  1.758686
 -0.367318	 -1.168111	  1.757900
 -0.373021	 -1.148683	  1.757481
 -0.378906	 -1.129797	  1.757178
 -0.384670	 -1.110402	  1.756114
 -0.389390	 -1.090922	  1.754248
 -0.392604	 -1.071394	  1.751313
 -0.397142	 -1.050799	  1.747247
 -0.403180	 -1.030483	  1.743733
 -0.408253	 -1.010525	  1.743923
 -0.412178	 -0.991165	  1.748921
 -0.415073	 -0.976642	  1.753272
 -0.422514	 -0.956447	  1.755261
 -0.431788	 -0.934553	  1.753050
 -0.437381	 -0.918113	  1.751069
 -0.441152	 -0.898363	  1.748904
 -0.444260	 -0.878639	  1.747244
 -0.447547	 -0.856400	  1.748589
 -0.446076	 -0.835278	  1.750355
 -0.440149	 -0.816361	  1.748946
 -0.435757	 -0.796532	  1.747915
 -0.433891	 -0.778425	  1.745906
 -0.431214	 -0.758909	  1.751721
 -0.431725	 -0.734954	  1.758622
 -0.433835	 -0.712982	  1.759004
 -0.434629	 -0.697204	  1.756050
 -0.435263	 -0.674077	  1.754876
 -0.437932	 -0.650558	  1.752684
 -0.439496	 -0.635568	  1.749154
 -0.442280	 -0.611602	  1.746830
 -0.447411	 -0.587889	  1.740105
 -0.452336	 -0.572469	  1.731484
 -0.457945	 -0.560352	  1.720676
 -0.464175	 -0.541118	  1.712604
 -0.469365	 -0.522279	  1.705623
 -0.474716	 -0.505547	  1.697075
 -0.483240	 -0.490926	  1.692143
 -0.492429	 -0.472325	  1.691251
 -0.497403	 -0.444218	  1.686562
 -0.500469	 -0.429059	  1.680427
 -0.500768	 -0.413984	  1.673579
 -0.503773	 -0.389827	  1.664235
 -0.510682	 -0.369009	  1.657727
 -0.515168	 -0.357921	  1.655166
 -0.524987	 -0.337405	  1.650283
 -0.533357	 -0.323412	  1.641137
 -0.543777	 -0.309011	  1.633074
 -0.554560	 -0.289614	  1.627801
 -0.558779	 -0.267010	  1.618814
 -0.559197	 -0.253449	  1.613547
 -0.560981	 -0.229258	  1.607815
 -0.564960	 -0.210006	  1.604025
 -0.568510	 -0.195261	  1.601862
 -0.574983	 -0.170673	  1.598535
 -0.576469	 -0.145511	  1.597302
 -0.574351	 -0.134941	  1.597513
 -0.567854	 -0.111992	  1.600060
 -0.561531	 -0.087882	  1.603514
 -0.558902	 -0.072108	  1.604193
 -0.558596	 -0.046006	  1.602836
 -0.560049	 -0.024183	  1.600882
 -0.561654	 -0.014047	  1.600602
 -0.565513	  0.006198	  1.603102
 -0.571516	  0.031280	  1.605964
 -0.576350	  0.049083	  1.604971
 -0.580794	  0.068567	  1.599649
 -0.585968	  0.089167	  1.593575
 -0.591513	  0.107243	  1.592194
 -0.596218	  0.123996	  1.594454
 -0.598867	  0.144075	  1.601134
 -0.599794	  0.172499	  1.603540
 -0.601600	  0.193848	  1.598234
 -0.603325	  0.206935	  1.592198
 -0.612446	  0.222181	  1.585679
 -0.624708	  0.244504	  1.586877
 -0.632913	  0.265118	  1.584439
 -0.639370	  0.280842	  1.569639
 -0.643533	  0.294951	  1.554399
 -0.647660	  0.313950	  1.547558
 -0.653037	  0.333049	  1.541894
 -0.658549	  0.348574	  1.536972
 -0.666465	  0.369434	  1.527699
 -0.669365	  0.386437	  1.517874
 -0.670090	  0.406358	  1.506880
 -0.667804	  0.428576	  1.499407
 -0.667925	  0.446581	  1.495279
 -0.666945	  0.466956	  1.489544
 -0.665184	  0.485903	  1.485963
 -0.663797	  0.508962	  1.486157
 -0.659457	  0.530779	  1.489639
 -0.656711	  0.546186	  1.492193
 -0.654169	  0.563690	  1.490259
 -0.653204	  0.590535	  1.486121
 -0.653010	  0.609750	  1.480688
 -0.656351	  0.628964	  1.475767
 -0.659045	  0.656848	  1.475535
 -0.659552	  0.670725	  1.475834
 -0.664938	  0.684877	  1.479399
 -0.670124	  0.704247	  1.482414
 -0.676932	  0.737541	  1.488875
 -0.678779	  0.754706	  1.494459
 -0.681166	  0.763960	  1.495497
 -0.695325	  0.782597	  1.498785
 -0.706837	  0.805572	  1.502636
 -0.708973	  0.826736	  1.509719
 -0.708451	  0.845383	  1.517780
 -0.709106	  0.859031	  1.521455
 -0.717504	  0.881447	  1.516926
 -0.731547	  0.901914	  1.513858
 -0.746919	  0.920383	  1.524275
 -0.759882	  0.934327	  1.536727
 -0.770514	  0.945366	  1.544628
 -0.783150	  0.959087	  1.552986
 -0.795863	  0.973491	  1.560651
 -0.808312	  0.985506	  1.566981
 -0.821968	  0.998554	  1.575554
 -0.835146	  1.013006	  1.586178
 -0.846857	  1.023692	  1.592745
 -0.860906	  1.036971	  1.598244
 -0.882534	  1.054146	  1.609159
 -0.892356	  1.060161	  1.617552
 -0.901868	  1.065516	  1.626837
 -0.914624	  1.076616	  1.644221
 -0.927685	  1.086710	  1.658166
 -0.941692	  1.098423	  1.666771
 -0.953871	  1.111638	  1.673328
 -0.961413	  1.125854	  1.677358
 -0.961712	  1.139028	  1.677280
 -0.960807	  1.160540	  1.671066
 -0.962066	  1.180096	  1.662265
 -0.960279	  1.194950	  1.650330
 -0.954409	  1.203515	  1.631349
 -0.949867	  1.217275	  1.615750
 -0.946690	  1.237379	  1.605738
 -0.943076	  1.257811	  1.592268
 -0.939783	  1.268774	  1.579433
 -0.936910	  1.276198	  1.568518
 -0.931452	  1.292295	  1.544610
 -0.928009	  1.304256	  1.530686
 -0.922969	  1.312528	  1.521159
 -0.914085	  1.326514	  1.503825
 -0.907527	  1.340364	  1.489802
 -0.901960	  1.352669	  1.478876
 -0.897277	  1.367845	  1.464317
 -0.895380	  1.383806	  1.450323
 -0.895582	  1.397267	  1.442325
 -0.896582	  1.413029	  1.436781
 -0.897515	  1.434776	  1.432324
 -0.897440	  1.453127	  1.427061
 -0.898941	  1.471453	  1.424132
 -0.900779	  1.488549	  1.420412
 -0.903495	  1.507206	  1.417609
 -0.906828	  1.525818	  1.416358
 -0.910342	  1.544271	  1.415036
 -0.914678	  1.563543	  1.413990
 -0.919009	  1.583485	  1.413034
 -0.924161	  1.602923	  1.412451
 -0.928189	  1.622353	  1.412296
 -0.930647	  1.641898	  1.415789
 -0.931980	  1.662748	  1.419735
 -0.934940	  1.682698	  1.421865
 -0.939722	  1.702475	  1.421157
 -0.945075	  1.723327	  1.419239
 -0.947783	  1.739099	  1.417428
 -0.947453	  1.758595	  1.410481
 -0.945897	  1.786878	  1.396706
 -0.953259	  1.815174	  1.377527
 -0.958129	  1.834326	  1.374449
