 -1.949198	 -0.474375	  1.419753
 -1.966123	 -0.487889	  1.464339
 -1.954360	 -0.487045	  1.446105
 -1.945237	 -0.478134	  1.429023
 -1.938291	 -0.469424	  1.413748
 -1.932422	 -0.461747	  1.397075
 -1.926197	 -0.455084	  1.380273
 -1.914486	 -0.449135	  1.363644
 -1.897728	 -0.438070	  1.352481
 -1.885401	 -0.420729	  1.340119
 -1.881626	 -0.408838	  1.329177
 -1.877834	 -0.398288	  1.311722
 -1.872439	 -0.387462	  1.295172
 -1.864827	 -0.373025	  1.282162
 -1.850792	 -0.359645	  1.273091
 -1.831412	 -0.351639	  1.265816
 -1.815492	 -0.349165	  1.261479
 -1.797126	 -0.344082	  1.249493
 -1.787008	 -0.333399	  1.236506
 -1.773448	 -0.320635	  1.225504
 -1.758232	 -0.310614	  1.216389
 -1.743430	 -0.300892	  1.207123
 -1.727217	 -0.291015	  1.200976
 -1.709612	 -0.281631	  1.202142
 -1.691994	 -0.272254	  1.203419
 -1.674374	 -0.262878	  1.204697
 -1.656754	 -0.253502	  1.205974
 -1.639158	 -0.244134	  1.207254
 -1.622245	 -0.234749	  1.209044
 -1.612449	 -0.222649	  1.218591
 -1.605748	 -0.207712	  1.235162
 -1.590704	 -0.193958	  1.250316
 -1.573133	 -0.184816	  1.254588
 -1.558234	 -0.177634	  1.256453
 -1.541376	 -0.164227	  1.267287
 -1.526159	 -0.153623	  1.276216
 -1.512218	 -0.144602	  1.282324
 -1.496124	 -0.133192	  1.293761
 -1.478984	 -0.121437	  1.305949
 -1.463106	 -0.114883	  1.308139
 -1.446421	 -0.110182	  1.304871
 -1.425311	 -0.100356	  1.308938
 -1.408384	 -0.091075	  1.316537
 -1.392405	 -0.081985	  1.324435
 -1.376460	 -0.073051	  1.332618
 -1.360503	 -0.064314	  1.340966
 -1.344509	 -0.055708	  1.349350
 -1.329292	 -0.046344	  1.358350
 -1.315044	 -0.036353	  1.368237
 -1.301138	 -0.026229	  1.378502
 -1.286966	 -0.015631	  1.387673
 -1.273522	 -0.004195	  1.396729
 -1.261209	  0.007577	  1.407296
 -1.249207	  0.018291	  1.419345
 -1.236159	  0.028403	  1.430942
 -1.223568	  0.039507	  1.441705
 -1.211276	  0.051777	  1.451073
 -1.199785	  0.064032	  1.457388
 -1.185230	  0.079079	  1.456853
 -1.168051	  0.100862	  1.464906
 -1.160972	  0.114869	  1.479784
 -1.153582	  0.127432	  1.489485
 -1.144771	  0.140128	  1.499892
 -1.133715	  0.155520	  1.510741
 -1.121850	  0.169536	  1.521628
 -1.107733	  0.181568	  1.535223
 -1.098064	  0.187119	  1.543517
 -1.082932	  0.194786	  1.555636
 -1.068881	  0.203757	  1.567241
 -1.054391	  0.211968	  1.579203
 -1.038587	  0.220748	  1.591044
 -1.023443	  0.230382	  1.602160
 -1.009090	  0.237605	  1.610385
 -0.994146	  0.244908	  1.620897
 -0.979378	  0.254147	  1.633542
 -0.961239	  0.267814	  1.644461
 -0.948197	  0.278520	  1.648742
 -0.935790	  0.288153	  1.649194
 -0.916366	  0.297015	  1.655480
 -0.899130	  0.308241	  1.663099
 -0.885417	  0.320347	  1.671690
 -0.874926	  0.331656	  1.680321
 -0.868373	  0.344678	  1.694730
 -0.864070	  0.358944	  1.713699
 -0.847030	  0.374470	  1.727903
 -0.831295	  0.381591	  1.731221
 -0.814210	  0.388756	  1.736069
 -0.797600	  0.399309	  1.744628
 -0.781946	  0.410580	  1.753305
 -0.767363	  0.422592	  1.761454
 -0.754393	  0.432997	  1.765873
 -0.742194	  0.446689	  1.774905
 -0.721241	  0.464256	  1.785926
 -0.713427	  0.469048	  1.788504
 -0.691379	  0.478715	  1.793178
 -0.669867	  0.490314	  1.800127
 -0.658005	  0.497842	  1.805433
 -0.646033	  0.505065	  1.810481
 -0.626746	  0.515791	  1.814635
 -0.608762	  0.526212	  1.817526
 -0.589831	  0.540091	  1.821703
 -0.579252	  0.552581	  1.826156
 -0.568788	  0.567827	  1.831589
 -0.546415	  0.587985	  1.838249
 -0.535390	  0.592943	  1.839509
 -0.518904	  0.596344	  1.839907
 -0.495252	  0.603293	  1.844392
 -0.478032	  0.617641	  1.845626
 -0.466507	  0.645065	  1.855072
 -0.458917	  0.659313	  1.871260
 -0.451056	  0.665529	  1.884571
 -0.436594	  0.669186	  1.899981
 -0.423440	  0.674868	  1.914863
 -0.410185	  0.686362	  1.929064
 -0.397419	  0.700051	  1.936652
 -0.384066	  0.712325	  1.939494
 -0.364990	  0.727261	  1.942023
 -0.349632	  0.735804	  1.947730
 -0.335385	  0.744202	  1.957231
 -0.317255	  0.759924	  1.975837
 -0.308277	  0.772102	  1.986182
 -0.300727	  0.779366	  1.992980
 -0.288351	  0.795159	  2.009121
 -0.278682	  0.808081	  2.020795
 -0.267573	  0.822298	  2.030553
 -0.255760	  0.837694	  2.037784
 -0.244509	  0.853266	  2.041557
 -0.232152	  0.869945	  2.044700
 -0.220917	  0.885477	  2.050104
 -0.208818	  0.899532	  2.057790
 -0.192931	  0.914605	  2.066691
 -0.181878	  0.925310	  2.071984
 -0.168761	  0.937352	  2.077534
 -0.148380	  0.952988	  2.086242
 -0.137066	  0.958993	  2.092132
 -0.120483	  0.966789	  2.101399
 -0.099013	  0.977315	  2.117240
 -0.092156	  0.981418	  2.123291
 -0.078912	  0.989944	  2.138116
 -0.065850	  1.007061	  2.154641
 -0.052580	  1.027628	  2.166035
 -0.043544	  1.039801	  2.169783
 -0.027542	  1.056803	  2.174386
 -0.017924	  1.065291	  2.178289
  0.008739	  1.072360	  2.185344
  0.024157	  1.081985	  2.193690
