 -0.645141	 -1.247938	 -2.060058
 -0.646116	 -1.255412	 -2.091593
 -0.645609	 -1.251520	 -2.075175
 -0.643761	 -1.239416	 -2.032746
 -0.642286	 -1.226675	 -2.001321
 -0.641273	 -1.213361	 -1.980227
 -0.640053	 -1.197274	 -1.965013
 -0.637328	 -1.172548	 -1.951953
 -0.629832	 -1.130214	 -1.940995
 -0.608893	 -1.061212	 -1.933232
 -0.560743	 -0.977098	 -1.928078
 -0.486863	 -0.901603	 -1.920111
 -0.397728	 -0.844496	 -1.901571
 -0.300474	 -0.805015	 -1.868391
 -0.199869	 -0.781885	 -1.819660
 -0.101434	 -0.769845	 -1.755018
 -0.009085	 -0.763489	 -1.671786
  0.071324	 -0.756626	 -1.576647
  0.141341	 -0.739019	 -1.468251
  0.194638	 -0.721235	 -1.328919
  0.214906	 -0.734120	 -1.172476
  0.210559	 -0.767929	 -1.041039
  0.187869	 -0.798194	 -0.945049
  0.156317	 -0.817868	 -0.878023
  0.129069	 -0.827639	 -0.837432
  0.114212	 -0.825852	 -0.816545
  0.086874	 -0.794230	 -0.774254
  0.068219	 -0.767280	 -0.743544
  0.050691	 -0.737755	 -0.710837
  0.035198	 -0.709768	 -0.675862
  0.022175	 -0.685277	 -0.638457
  0.011233	 -0.663935	 -0.598802
  0.000972	 -0.643880	 -0.555696
 -0.008812	 -0.624949	 -0.510404
 -0.017482	 -0.607350	 -0.464701
 -0.024203	 -0.590834	 -0.417377
 -0.028607	 -0.575648	 -0.367000
 -0.031429	 -0.561824	 -0.311555
 -0.033632	 -0.550214	 -0.248221
 -0.035443	 -0.543551	 -0.178916
 -0.037622	 -0.543047	 -0.107364
 -0.041394	 -0.548373	 -0.034662
 -0.048247	 -0.558141	  0.038429
 -0.058814	 -0.570650	  0.111150
 -0.072293	 -0.583965	  0.181857
 -0.087364	 -0.596826	  0.247780
 -0.100800	 -0.607921	  0.304011
 -0.110774	 -0.616149	  0.348576
 -0.117477	 -0.621705	  0.383715
 -0.121821	 -0.625480	  0.414540
 -0.124678	 -0.628132	  0.446045
 -0.126439	 -0.629765	  0.480999
 -0.127331	 -0.630176	  0.519273
 -0.127321	 -0.629258	  0.559891
 -0.126457	 -0.627005	  0.602400
 -0.125041	 -0.623477	  0.646545
 -0.123328	 -0.618880	  0.691532
 -0.121185	 -0.613402	  0.737540
 -0.118428	 -0.607587	  0.783680
 -0.115170	 -0.601298	  0.828901
 -0.111600	 -0.594317	  0.873729
 -0.107456	 -0.586482	  0.919432
 -0.102890	 -0.577908	  0.966454
 -0.097971	 -0.568972	  1.014541
 -0.092199	 -0.559822	  1.064734
 -0.085391	 -0.550869	  1.119218
 -0.078342	 -0.543561	  1.178127
 -0.071660	 -0.539286	  1.239556
 -0.066079	 -0.538482	  1.300736
 -0.061834	 -0.540600	  1.360574
 -0.058284	 -0.545753	  1.423050
 -0.055238	 -0.555675	  1.491168
 -0.054031	 -0.571345	  1.564180
 -0.053501	 -0.593211	  1.640506
 -0.054070	 -0.620114	  1.716813
 -0.057034	 -0.649509	  1.790855
 -0.062723	 -0.680493	  1.861576
 -0.071067	 -0.711164	  1.925448
 -0.078726	 -0.736674	  1.975895
 -0.084394	 -0.753920	  2.013068
 -0.088279	 -0.763401	  2.039128
 -0.082140	 -0.725058	  2.081629
 -0.080709	 -0.689193	  2.117341
 -0.084108	 -0.646483	  2.155807
 -0.098512	 -0.555427	  2.234567
 -0.099703	 -0.547042	  2.241742
