 -1.208762	  2.776875	 -0.093599
 -1.196794	  2.749381	 -0.092672
 -1.178556	  2.719660	 -0.053747
 -1.172861	  2.681226	 -0.023071
 -1.163636	  2.642332	  0.008545
 -1.158004	  2.604925	  0.039525
 -1.152650	  2.565746	  0.071321
 -1.147788	  2.527293	  0.100922
 -1.142617	  2.491409	  0.129012
 -1.133262	  2.451909	  0.157777
 -1.123906	  2.409749	  0.187621
 -1.119826	  2.374112	  0.214822
 -1.109355	  2.333297	  0.247364
 -1.100278	  2.290641	  0.275872
 -1.090347	  2.252078	  0.309547
 -1.080808	  2.221434	  0.340078
 -1.078708	  2.182237	  0.365615
 -1.061985	  2.141036	  0.392215
 -1.054199	  2.097277	  0.419229
 -1.049448	  2.062038	  0.453533
 -1.037360	  2.024616	  0.485463
 -1.030177	  1.990436	  0.520402
 -1.027229	  1.953466	  0.553403
 -1.022103	  1.919847	  0.583705
 -1.013942	  1.883472	  0.619272
 -1.006061	  1.846847	  0.652513
 -1.000369	  1.807477	  0.685745
 -0.995689	  1.770464	  0.717748
 -0.988628	  1.730428	  0.750005
 -0.980601	  1.691455	  0.780762
 -0.972259	  1.655706	  0.810218
 -0.961756	  1.614261	  0.842554
 -0.951891	  1.574583	  0.870746
 -0.943888	  1.538386	  0.898233
 -0.939953	  1.511651	  0.928239
 -0.946586	  1.504339	  0.980158
 -1.025678	  1.572839	  1.156222
 -0.961628	  1.520701	  1.145852
 -1.218336	  1.515403	  1.290495
 -1.277463	  1.502275	  1.345955
 -1.320215	  1.498557	  1.426511
 -1.475161	  1.403429	  1.510131
 -1.484702	  1.361658	  1.547964
 -1.469738	  1.343560	  1.562571
 -1.389141	  1.263665	  1.579228
 -1.363883	  1.194218	  1.596779
 -1.355274	  1.155713	  1.597590
 -1.336046	  1.068999	  1.580373
 -1.247823	  1.023322	  1.585073
 -1.147900	  1.000297	  1.588711
 -0.980616	  0.942563	  1.489464
 -0.824744	  0.850458	  1.432704
 -0.793067	  0.797302	  1.458337
 -0.781354	  0.757517	  1.487147
 -0.774017	  0.722117	  1.515323
 -0.765679	  0.683539	  1.546038
 -0.758896	  0.644795	  1.578112
 -0.753049	  0.607442	  1.606886
 -0.747032	  0.570651	  1.636779
 -0.740410	  0.528393	  1.669269
 -0.733928	  0.490852	  1.699449
 -0.727741	  0.455980	  1.727072
 -0.721210	  0.416959	  1.757983
 -0.712660	  0.376858	  1.788331
 -0.703872	  0.339440	  1.816375
 -0.694177	  0.298749	  1.848255
 -0.687152	  0.262753	  1.881161
 -0.682915	  0.221940	  1.912077
 -0.670460	  0.183659	  1.936904
 -0.663839	  0.146607	  1.969611
 -0.655174	  0.112598	  2.003566
 -0.649017	  0.077924	  2.038471
 -0.640153	  0.033701	  2.068332
 -0.628846	 -0.005399	  2.096574
 -0.622617	 -0.037681	  2.124773
 -0.611075	 -0.075955	  2.155836
 -0.604688	 -0.118191	  2.187441
 -0.594845	 -0.157582	  2.220989
 -0.587750	 -0.192995	  2.251599
 -0.581279	 -0.229725	  2.281185
 -0.572552	 -0.269951	  2.311332
 -0.563440	 -0.311747	  2.340949
 -0.556065	 -0.348238	  2.367176
 -0.547627	 -0.385388	  2.395434
 -0.537887	 -0.424073	  2.425186
 -0.529198	 -0.465550	  2.456762
 -0.522555	 -0.503654	  2.487119
 -0.515750	 -0.544893	  2.519419
 -0.509915	 -0.580661	  2.546081
 -0.503093	 -0.623646	  2.575872
 -0.493558	 -0.661698	  2.605013
 -0.487852	 -0.701189	  2.636207
 -0.479416	 -0.737666	  2.665645
 -0.472353	 -0.773629	  2.699235
 -0.466522	 -0.812554	  2.732109
 -0.458119	 -0.850824	  2.758288
 -0.454641	 -0.883440	  2.792956
 -0.449539	 -0.930721	  2.816323
 -0.454034	 -0.940028	  2.844486
