 -0.405250	 -1.148480	 -2.091045
 -0.406225	 -1.155954	 -2.122580
 -0.405349	 -1.150330	 -2.103842
 -0.402957	 -1.141482	 -2.088247
 -0.395228	 -1.129590	 -2.081982
 -0.388334	 -1.119772	 -2.077512
 -0.379150	 -1.105925	 -2.068155
 -0.368753	 -1.089819	 -2.061184
 -0.354531	 -1.076420	 -2.056862
 -0.339217	 -1.064885	 -2.053045
 -0.324529	 -1.053192	 -2.049395
 -0.309494	 -1.041785	 -2.045552
 -0.293054	 -1.031859	 -2.041000
 -0.275695	 -1.023267	 -2.036847
 -0.258065	 -1.015427	 -2.033695
 -0.239792	 -1.008460	 -2.030410
 -0.223238	 -1.001750	 -2.027464
 -0.203924	 -0.995764	 -2.025900
 -0.180613	 -0.986976	 -2.020687
 -0.164265	 -0.980846	 -2.010105
 -0.152151	 -0.976852	 -2.000148
 -0.136625	 -0.972006	 -1.987736
 -0.120620	 -0.967448	 -1.975820
 -0.104181	 -0.963752	 -1.963508
 -0.087389	 -0.959673	 -1.952534
 -0.074207	 -0.957671	 -1.942588
 -0.054734	 -0.954845	 -1.930372
 -0.033766	 -0.951604	 -1.919584
 -0.021971	 -0.950362	 -1.912275
 -0.007166	 -0.949318	 -1.904042
  0.008096	 -0.947412	 -1.891512
  0.025295	 -0.946068	 -1.876995
  0.042752	 -0.943028	 -1.863690
  0.057972	 -0.940370	 -1.854190
  0.078395	 -0.938031	 -1.840881
  0.089355	 -0.939091	 -1.828025
  0.098232	 -0.941630	 -1.813326
  0.112416	 -0.942882	 -1.792853
  0.125623	 -0.940529	 -1.780853
  0.143234	 -0.935814	 -1.769749
  0.159434	 -0.932361	 -1.756824
  0.168018	 -0.933129	 -1.743124
  0.177748	 -0.937306	 -1.722618
  0.194005	 -0.939065	 -1.700104
  0.202382	 -0.938476	 -1.690673
  0.216502	 -0.936031	 -1.678425
  0.229670	 -0.930662	 -1.661414
  0.241310	 -0.927652	 -1.645422
  0.254133	 -0.923524	 -1.629783
  0.265589	 -0.920276	 -1.613312
  0.276353	 -0.917266	 -1.596756
  0.287275	 -0.913733	 -1.580416
  0.297354	 -0.911165	 -1.563374
  0.307067	 -0.908566	 -1.546310
  0.315570	 -0.906106	 -1.528730
  0.324747	 -0.903336	 -1.511471
  0.332352	 -0.900885	 -1.493349
  0.339628	 -0.897760	 -1.475054
  0.346143	 -0.894533	 -1.456293
  0.352908	 -0.891532	 -1.437640
  0.358398	 -0.890206	 -1.421612
  0.360420	 -0.894830	 -1.402294
  0.363954	 -0.902786	 -1.380244
  0.371429	 -0.900941	 -1.356952
  0.376249	 -0.896808	 -1.342653
  0.383626	 -0.892014	 -1.322346
  0.387683	 -0.892845	 -1.306336
  0.389530	 -0.896101	 -1.292993
  0.392578	 -0.902654	 -1.259548
  0.395702	 -0.903327	 -1.238722
  0.396924	 -0.902751	 -1.230105
  0.400754	 -0.898390	 -1.208241
  0.402163	 -0.900402	 -1.181461
  0.402164	 -0.904453	 -1.166166
  0.400923	 -0.913361	 -1.148229
  0.398605	 -0.919292	 -1.133405
  0.397033	 -0.923124	 -1.110859
  0.394969	 -0.928097	 -1.091071
  0.392486	 -0.933642	 -1.072307
  0.390393	 -0.939366	 -1.053726
  0.387511	 -0.945128	 -1.034862
  0.383718	 -0.951069	 -1.016234
  0.379638	 -0.957054	 -0.997662
  0.375231	 -0.963025	 -0.979127
  0.369853	 -0.968895	 -0.960879
  0.363425	 -0.974246	 -0.942949
  0.357369	 -0.979689	 -0.925007
  0.350638	 -0.985170	 -0.907160
  0.343054	 -0.990497	 -0.889588
  0.334279	 -0.995939	 -0.872332
  0.325380	 -1.000950	 -0.855342
  0.315415	 -1.005914	 -0.838977
  0.305876	 -1.011599	 -0.822440
  0.295423	 -1.016704	 -0.806028
  0.284090	 -1.021198	 -0.790104
  0.271764	 -1.024576	 -0.774425
  0.260517	 -1.026235	 -0.758555
  0.249195	 -1.028453	 -0.744838
  0.230690	 -1.031717	 -0.728231
  0.215669	 -1.029564	 -0.710988
  0.204992	 -1.023738	 -0.694457
  0.198224	 -1.015100	 -0.677485
  0.190735	 -1.007498	 -0.662119
  0.179148	 -0.998686	 -0.645907
  0.168981	 -0.989594	 -0.630869
  0.160595	 -0.979895	 -0.615826
  0.150959	 -0.969458	 -0.601525
  0.141766	 -0.958113	 -0.586837
  0.134452	 -0.946048	 -0.572080
  0.128130	 -0.933430	 -0.557613
  0.123467	 -0.920923	 -0.543243
  0.117821	 -0.908583	 -0.528040
  0.113456	 -0.898896	 -0.514272
  0.115658	 -0.892009	 -0.495719
  0.117093	 -0.882342	 -0.469329
  0.107817	 -0.871876	 -0.454474
  0.096499	 -0.861861	 -0.441697
  0.086673	 -0.851804	 -0.426554
  0.083752	 -0.844521	 -0.410038
  0.084476	 -0.839412	 -0.390363
  0.084922	 -0.835465	 -0.369527
  0.082360	 -0.830175	 -0.354119
  0.078063	 -0.820595	 -0.334313
  0.076037	 -0.809698	 -0.308583
  0.075110	 -0.805664	 -0.298793
  0.076745	 -0.799691	 -0.279361
  0.075217	 -0.793671	 -0.261437
  0.070171	 -0.785445	 -0.241611
  0.068051	 -0.781140	 -0.220993
  0.066836	 -0.778603	 -0.200941
  0.065555	 -0.777201	 -0.181223
  0.064514	 -0.774840	 -0.161309
  0.062704	 -0.773244	 -0.141334
  0.061401	 -0.772178	 -0.121689
  0.059814	 -0.769760	 -0.102680
  0.057065	 -0.765392	 -0.082856
  0.055445	 -0.761525	 -0.060544
  0.055749	 -0.762175	 -0.034777
  0.055346	 -0.765655	 -0.015709
  0.055973	 -0.768881	 -0.001848
  0.053754	 -0.771961	  0.019228
  0.050178	 -0.777225	  0.043032
  0.047664	 -0.781660	  0.061290
  0.046626	 -0.786038	  0.076622
  0.045729	 -0.789433	  0.096415
  0.042841	 -0.796263	  0.119628
  0.036917	 -0.805591	  0.135554
  0.029180	 -0.817851	  0.153148
  0.021790	 -0.827034	  0.173985
  0.019498	 -0.830079	  0.188924
  0.015094	 -0.831854	  0.210641
  0.012045	 -0.834037	  0.229120
  0.013350	 -0.834713	  0.246937
  0.011689	 -0.835372	  0.270069
  0.008024	 -0.834561	  0.289285
  0.005971	 -0.831763	  0.307331
  0.003707	 -0.827868	  0.333139
 -0.001655	 -0.831378	  0.355770
 -0.006947	 -0.836517	  0.372111
 -0.012410	 -0.842612	  0.385215
 -0.018843	 -0.850792	  0.405746
 -0.022834	 -0.855356	  0.425577
 -0.025636	 -0.858353	  0.443003
 -0.026173	 -0.857707	  0.462546
 -0.025168	 -0.855462	  0.483099
 -0.023094	 -0.854817	  0.505598
 -0.023990	 -0.857528	  0.525689
 -0.026846	 -0.859035	  0.544592
 -0.031910	 -0.859793	  0.562312
 -0.037247	 -0.861421	  0.581617
 -0.039970	 -0.865385	  0.606251
 -0.037597	 -0.867660	  0.628685
 -0.036538	 -0.867441	  0.642124
 -0.036636	 -0.866480	  0.662714
 -0.037005	 -0.863062	  0.682535
 -0.035373	 -0.856987	  0.701113
 -0.032780	 -0.851124	  0.722066
 -0.026716	 -0.842735	  0.751153
 -0.023493	 -0.840016	  0.763145
 -0.020901	 -0.837194	  0.778168
 -0.017342	 -0.831528	  0.803414
 -0.015048	 -0.830710	  0.821930
 -0.013151	 -0.830524	  0.838524
 -0.011062	 -0.828935	  0.859605
 -0.006999	 -0.827458	  0.879371
 -0.001777	 -0.828740	  0.902756
 -0.001206	 -0.830593	  0.926002
 -0.002481	 -0.830693	  0.942743
 -0.002212	 -0.832446	  0.963148
 -0.001255	 -0.829937	  0.981430
  0.001145	 -0.826593	  1.000232
  0.005213	 -0.823493	  1.024279
  0.007636	 -0.821616	  1.042269
  0.006142	 -0.813479	  1.062672
  0.002649	 -0.806191	  1.075922
  0.003236	 -0.801553	  1.098814
  0.006489	 -0.798217	  1.119085
  0.009835	 -0.793996	  1.138127
  0.012853	 -0.790078	  1.157414
  0.015228	 -0.786606	  1.176827
  0.017069	 -0.783659	  1.196392
  0.019103	 -0.781755	  1.216133
  0.020492	 -0.781101	  1.236110
  0.022696	 -0.779684	  1.255765
  0.024985	 -0.778919	  1.275431
  0.026694	 -0.779078	  1.295259
  0.028399	 -0.779128	  1.315133
  0.029736	 -0.780155	  1.334982
  0.030934	 -0.781484	  1.354753
  0.032420	 -0.783144	  1.373733
  0.037495	 -0.781086	  1.392017
  0.040758	 -0.775913	  1.417124
  0.041232	 -0.779117	  1.436834
  0.040452	 -0.785880	  1.455777
  0.038426	 -0.792958	  1.474176
  0.037131	 -0.798848	  1.494467
  0.037001	 -0.804365	  1.513536
  0.037100	 -0.810768	  1.530051
  0.037130	 -0.816749	  1.550758
  0.037014	 -0.821449	  1.571392
  0.036819	 -0.827036	  1.587435
  0.036822	 -0.833632	  1.607530
  0.036858	 -0.838940	  1.628278
  0.036360	 -0.844958	  1.646004
  0.034851	 -0.852209	  1.664497
  0.033599	 -0.860096	  1.682913
  0.033255	 -0.870242	  1.700131
  0.032037	 -0.883695	  1.717723
  0.030100	 -0.894305	  1.734624
  0.028277	 -0.903124	  1.749854
  0.026588	 -0.913289	  1.768384
  0.024522	 -0.922486	  1.788157
  0.022563	 -0.929327	  1.802910
  0.019985	 -0.938901	  1.821227
  0.017085	 -0.948933	  1.842811
  0.014857	 -0.955714	  1.857053
  0.011879	 -0.963989	  1.870296
  0.006860	 -0.980978	  1.894528
  0.003357	 -0.987252	  1.912429
 -0.000350	 -0.989380	  1.927464
 -0.002829	 -0.990908	  1.948398
 -0.003667	 -0.996104	  1.970198
 -0.004835	 -1.000687	  1.990219
 -0.005045	 -1.003666	  2.009940
 -0.005271	 -1.005003	  2.029998
 -0.005949	 -1.005101	  2.050029
 -0.005554	 -1.002553	  2.069605
 -0.004906	 -0.999025	  2.089152
 -0.003177	 -0.992166	  2.107655
 -0.001619	 -0.984785	  2.126233
  0.000689	 -0.974780	  2.143260
  0.002924	 -0.964577	  2.160360
  0.005523	 -0.953233	  2.176516
  0.007801	 -0.940371	  2.191742
  0.010076	 -0.927913	  2.207223
  0.012018	 -0.914824	  2.222076
  0.013170	 -0.901036	  2.236481
  0.014805	 -0.887477	  2.250901
  0.015788	 -0.873584	  2.265118
  0.015595	 -0.859192	  2.279013
  0.015254	 -0.844728	  2.292630
  0.015431	 -0.830900	  2.306382
  0.014279	 -0.818277	  2.321792
  0.012528	 -0.805934	  2.338900
  0.011019	 -0.791575	  2.354755
  0.010104	 -0.778182	  2.366749
  0.008705	 -0.763024	  2.380901
  0.006028	 -0.747196	  2.394491
  0.003155	 -0.732441	  2.405870
 -0.000988	 -0.713565	  2.421607
 -0.001393	 -0.682635	  2.433317
 -0.003539	 -0.667527	  2.446245
