  1.997452	 -1.620950	 -0.398963
  2.030700	 -1.612293	 -0.426842
  2.016137	 -1.615915	 -0.413621
  2.001744	 -1.619432	 -0.400187
  1.987565	 -1.622781	 -0.386485
  1.973903	 -1.625736	 -0.372180
  1.960242	 -1.628691	 -0.357875
  1.947120	 -1.631220	 -0.342995
  1.934119	 -1.633656	 -0.327993
  1.921237	 -1.636069	 -0.312886
  1.908608	 -1.638434	 -0.297559
  1.895979	 -1.640798	 -0.282232
  1.883284	 -1.643127	 -0.266955
  1.870570	 -1.645447	 -0.251691
  1.857802	 -1.647723	 -0.236466
  1.844804	 -1.649818	 -0.221411
  1.831807	 -1.651913	 -0.206355
  1.818596	 -1.654023	 -0.191488
  1.805262	 -1.656142	 -0.176733
  1.791897	 -1.658420	 -0.162030
  1.778445	 -1.661162	 -0.147486
  1.764992	 -1.663982	 -0.132958
  1.751548	 -1.667898	 -0.118678
  1.738111	 -1.671851	 -0.104401
  1.725013	 -1.677253	 -0.090285
  1.712085	 -1.683029	 -0.076160
  1.699880	 -1.690252	 -0.062058
  1.688556	 -1.698579	 -0.047831
  1.677869	 -1.707642	 -0.033559
  1.669243	 -1.718246	 -0.018961
  1.660795	 -1.728972	 -0.004346
  1.654763	 -1.739918	  0.011268
  1.649513	 -1.750895	  0.027141
  1.644262	 -1.761873	  0.043013
  1.641618	 -1.772390	  0.059818
  1.639568	 -1.782774	  0.076787
  1.637517	 -1.793159	  0.093756
  1.636872	 -1.802960	  0.111178
  1.637966	 -1.811955	  0.129008
  1.639060	 -1.820949	  0.146837
  1.640525	 -1.829932	  0.164647
  1.642994	 -1.838865	  0.182370
  1.645463	 -1.847797	  0.200093
  1.647932	 -1.856730	  0.217816
  1.646680	 -1.866570	  0.235183
  1.642256	 -1.876898	  0.251729
  1.637831	 -1.887227	  0.268274
  1.633407	 -1.897556	  0.284819
  1.628874	 -1.907878	  0.301339
  1.619147	 -1.917481	  0.315939
  1.609419	 -1.927083	  0.330539
  1.599692	 -1.936686	  0.345140
  1.590042	 -1.946111	  0.359906
  1.580905	 -1.954400	  0.375647
  1.571767	 -1.962690	  0.391389
  1.562630	 -1.970979	  0.407130
  1.554371	 -1.977124	  0.424278
  1.546376	 -1.982669	  0.441751
  1.538380	 -1.988215	  0.459224
  1.530304	 -1.993632	  0.476701
  1.520937	 -1.996831	  0.494080
  1.511571	 -2.000030	  0.511459
  1.502205	 -2.003229	  0.528839
  1.492675	 -2.006340	  0.546145
  1.480423	 -2.007848	  0.561881
  1.468172	 -2.009355	  0.577617
  1.455920	 -2.010862	  0.593353
  1.443669	 -2.012370	  0.609090
  1.428290	 -2.011779	  0.621863
  1.412863	 -2.011149	  0.634575
  1.397436	 -2.010520	  0.647287
  1.382008	 -2.009890	  0.659999
  1.364658	 -2.007783	  0.669722
  1.346668	 -2.005053	  0.678023
  1.328678	 -2.002323	  0.686324
  1.310688	 -1.999593	  0.694625
  1.292317	 -1.996469	  0.701888
  1.273174	 -1.992200	  0.705801
  1.254031	 -1.987931	  0.709714
  1.234887	 -1.983662	  0.713627
  1.215744	 -1.979393	  0.717539
  1.196587	 -1.973839	  0.719003
  1.177471	 -1.968039	  0.719971
  1.158354	 -1.962240	  0.720940
  1.139238	 -1.956440	  0.721909
  1.120475	 -1.949517	  0.721992
  1.102161	 -1.941519	  0.721198
  1.083847	 -1.933522	  0.720405
  1.065532	 -1.925524	  0.719611
  1.047462	 -1.916988	  0.718847
  1.029809	 -1.907614	  0.718131
  1.012157	 -1.898239	  0.717415
  0.994505	 -1.888864	  0.716699
  0.977019	 -1.879248	  0.718028
  0.959581	 -1.869601	  0.719720
  0.942144	 -1.859953	  0.721413
  0.925243	 -1.850945	  0.727176
  0.908353	 -1.841948	  0.732988
  0.891762	 -1.834070	  0.740906
  0.875430	 -1.826840	  0.749905
  0.858987	 -1.820703	  0.759494
  0.842497	 -1.815688	  0.769639
  0.826082	 -1.811340	  0.780206
  0.809798	 -1.807836	  0.791277
  0.793609	 -1.804410	  0.802510
  0.777671	 -1.801185	  0.814153
  0.761733	 -1.797960	  0.825797
  0.745990	 -1.794708	  0.837696
  0.730270	 -1.791454	  0.849624
  0.714664	 -1.788454	  0.861768
  0.699159	 -1.785668	  0.874090
  0.683821	 -1.783190	  0.886683
  0.668797	 -1.781263	  0.899744
  0.653856	 -1.779659	  0.912941
  0.639180	 -1.779000	  0.926513
  0.624549	 -1.778569	  0.940142
  0.610179	 -1.779289	  0.954033
  0.595835	 -1.780158	  0.967944
  0.581750	 -1.782255	  0.981987
  0.567674	 -1.784439	  0.996027
  0.553763	 -1.787874	  1.009979
  0.539852	 -1.791310	  1.023932
  0.526229	 -1.796117	  1.037764
  0.512606	 -1.800923	  1.051596
  0.499493	 -1.807153	  1.065351
  0.486397	 -1.813427	  1.079104
  0.473875	 -1.820940	  1.092770
  0.461382	 -1.828509	  1.106431
  0.449539	 -1.837039	  1.120106
  0.437751	 -1.845645	  1.133779
  0.426439	 -1.854488	  1.147702
  0.415254	 -1.863392	  1.161688
  0.404061	 -1.872278	  1.175679
  0.392198	 -1.879296	  1.190172
  0.380336	 -1.886315	  1.204664
  0.368473	 -1.893333	  1.219156
  0.356171	 -1.898889	  1.233914
  0.343665	 -1.903656	  1.248775
  0.331159	 -1.908423	  1.263637
  0.318514	 -1.912510	  1.278584
  0.305650	 -1.915311	  1.293640
  0.292786	 -1.918112	  1.308695
  0.279818	 -1.920649	  1.323709
  0.266539	 -1.922346	  1.338567
  0.253259	 -1.924044	  1.353425
  0.239821	 -1.925578	  1.368158
  0.226018	 -1.926728	  1.382586
  0.212215	 -1.927877	  1.397014
  0.198155	 -1.928885	  1.411201
  0.183789	 -1.929722	  1.425091
  0.169424	 -1.930558	  1.438982
  0.154663	 -1.931321	  1.452456
  0.139712	 -1.932047	  1.465719
  0.124747	 -1.932779	  1.478967
  0.109301	 -1.933722	  1.491638
  0.093856	 -1.934666	  1.504309
  0.078260	 -1.935995	  1.516759
  0.062557	 -1.937613	  1.529039
  0.046791	 -1.939661	  1.541173
  0.030922	 -1.942591	  1.552987
  0.015104	 -1.945977	  1.564749
 -0.000555	 -1.950465	  1.576354
 -0.016029	 -1.955517	  1.587973
 -0.031205	 -1.961402	  1.599595
 -0.046255	 -1.967635	  1.611198
 -0.061088	 -1.974437	  1.622762
 -0.075924	 -1.981243	  1.634319
 -0.090835	 -1.988159	  1.645713
 -0.105747	 -1.995074	  1.657108
 -0.120658	 -2.001989	  1.668502
 -0.136134	 -2.008943	  1.680357
 -0.151141	 -2.015409	  1.691889
