 -0.603553	  0.597684	  2.376996
 -0.605817	  0.599695	  2.378291
 -0.592825	  0.585917	  2.371516
 -0.578991	  0.573699	  2.363633
 -0.564728	  0.562363	  2.355594
 -0.550322	  0.550844	  2.347821
 -0.536104	  0.538851	  2.340403
 -0.521557	  0.527139	  2.333245
 -0.506963	  0.515475	  2.326107
 -0.492242	  0.503969	  2.318979
 -0.477383	  0.492689	  2.311757
 -0.462582	  0.481392	  2.304494
 -0.447529	  0.470433	  2.297153
 -0.432429	  0.459609	  2.289702
 -0.417658	  0.448582	  2.282033
 -0.402617	  0.438229	  2.273863
 -0.387260	  0.428186	  2.265739
 -0.372320	  0.417879	  2.257174
 -0.358286	  0.407848	  2.247229
 -0.344336	  0.397989	  2.236984
 -0.329609	  0.388611	  2.227048
 -0.314367	  0.380322	  2.217082
 -0.298940	  0.372622	  2.206946
 -0.283499	  0.364977	  2.196790
 -0.267836	  0.357884	  2.186592
 -0.251999	  0.351797	  2.176006
 -0.236267	  0.345776	  2.165159
 -0.220225	  0.339898	  2.154672
 -0.203466	  0.334759	  2.145041
 -0.186677	  0.329911	  2.135431
 -0.170011	  0.325301	  2.125264
 -0.152899	  0.320737	  2.115842
 -0.135635	  0.316822	  2.106665
 -0.118259	  0.313183	  2.097199
 -0.101130	  0.307189	  2.088856
 -0.083920	  0.300727	  2.080915
 -0.066288	  0.295044	  2.073613
 -0.050031	  0.288044	  2.064876
 -0.034633	  0.277933	  2.056189
 -0.018160	  0.269680	  2.048085
  0.001275	  0.269119	  2.040812
  0.028071	  0.273887	  2.035523
  0.049714	  0.271527	  2.033068
  0.066230	  0.265322	  2.029844
  0.078341	  0.258884	  2.026828
  0.095126	  0.246442	  2.021298
  0.116053	  0.232677	  2.013038
  0.134781	  0.223462	  2.008308
  0.147260	  0.218309	  2.005974
  0.168090	  0.212801	  2.001462
  0.190521	  0.208653	  1.999313
  0.207822	  0.206507	  1.998173
  0.228729	  0.205061	  1.994801
  0.250635	  0.198091	  1.994556
  0.270465	  0.189223	  1.995560
  0.283153	  0.183076	  1.994658
  0.304570	  0.180743	  1.989140
  0.325483	  0.179749	  1.985170
  0.345387	  0.177072	  1.983195
  0.365195	  0.174519	  1.981805
  0.385013	  0.172017	  1.980743
  0.404813	  0.169541	  1.979672
  0.424718	  0.168752	  1.978595
  0.444663	  0.169039	  1.977543
  0.464644	  0.169542	  1.976651
  0.484617	  0.170142	  1.975807
  0.504580	  0.170876	  1.974957
  0.524351	  0.173659	  1.973946
  0.543884	  0.177803	  1.972847
  0.563402	  0.182024	  1.971743
  0.582918	  0.186260	  1.970654
  0.602375	  0.190710	  1.969568
  0.621603	  0.195870	  1.968533
  0.639954	  0.200996	  1.967900
  0.656443	  0.209059	  1.969995
  0.674832	  0.220261	  1.976120
  0.704175	  0.228682	  1.976665
  0.716460	  0.230467	  1.976301
  0.730762	  0.232185	  1.977662
  0.755243	  0.241574	  1.983103
  0.774834	  0.244486	  1.981328
  0.793780	  0.252198	  1.979238
  0.812653	  0.265399	  1.974147
  0.829245	  0.274533	  1.966133
  0.845609	  0.282679	  1.956868
  0.862449	  0.286704	  1.949393
  0.879907	  0.290471	  1.941686
  0.898133	  0.300745	  1.933144
  0.919028	  0.314333	  1.928793
  0.931029	  0.321482	  1.931116
  0.951098	  0.334088	  1.933648
  0.969348	  0.347403	  1.928425
  0.980679	  0.355308	  1.922156
  0.995844	  0.365514	  1.911534
  1.015205	  0.381034	  1.902111
  1.027086	  0.389254	  1.892965
  1.039258	  0.396030	  1.880024
  1.053210	  0.406275	  1.864170
  1.067673	  0.413161	  1.845335
  1.073035	  0.414162	  1.837901
  1.090868	  0.406132	  1.820940
  1.103710	  0.413473	  1.802903
  1.114749	  0.418928	  1.785302
  1.121997	  0.421893	  1.774193
  1.137768	  0.414740	  1.753074
  1.146849	  0.405937	  1.742031
  1.155175	  0.397762	  1.731596
  1.168760	  0.380723	  1.713755
  1.179149	  0.374737	  1.697164
  1.186064	  0.379976	  1.681679
  1.196712	  0.376001	  1.663681
  1.207282	  0.366279	  1.648317
  1.217401	  0.356201	  1.634083
  1.227942	  0.346871	  1.619820
  1.238708	  0.338013	  1.606005
  1.249423	  0.328200	  1.592247
  1.259966	  0.317965	  1.578612
  1.270238	  0.307343	  1.565115
  1.280397	  0.296544	  1.551689
  1.290504	  0.285682	  1.538279
  1.300004	  0.274172	  1.524971
  1.309335	  0.262481	  1.511695
  1.318658	  0.250779	  1.498423
  1.327981	  0.239076	  1.485151
  1.337295	  0.227368	  1.471879
  1.346370	  0.215516	  1.458571
  1.354521	  0.203123	  1.445160
  1.362602	  0.190692	  1.431748
  1.370359	  0.177959	  1.418607
  1.372120	  0.160349	  1.409925
  1.366715	  0.141417	  1.407536
  1.360060	  0.122640	  1.405678
  1.352839	  0.103932	  1.403569
  1.345360	  0.085439	  1.401997
  1.337904	  0.067101	  1.400764
  1.330298	  0.048772	  1.399499
  1.323512	  0.030109	  1.397626
  1.316456	  0.011744	  1.395934
  1.312392	 -0.007163	  1.393452
  1.309313	 -0.026493	  1.391012
  1.307439	 -0.045616	  1.388013
  1.310708	 -0.063341	  1.385821
  1.325476	 -0.071636	  1.389759
  1.342506	 -0.070816	  1.398771
  1.360795	 -0.068254	  1.411927
  1.377897	 -0.063684	  1.424059
  1.394368	 -0.054006	  1.428885
  1.411343	 -0.042344	  1.430912
  1.428057	 -0.031562	  1.431252
  1.445735	 -0.021848	  1.436460
  1.462926	 -0.012902	  1.441837
  1.480535	 -0.005001	  1.446624
  1.498381	  0.003307	  1.449782
  1.515944	  0.012414	  1.453095
  1.534058	  0.020484	  1.455913
  1.552225	  0.028274	  1.458600
  1.570226	  0.036521	  1.461853
  1.588608	  0.043995	  1.463519
  1.607378	  0.050530	  1.464298
  1.626236	  0.057207	  1.464594
  1.645120	  0.063853	  1.464310
  1.664038	  0.070203	  1.463973
  1.682873	  0.077025	  1.463710
  1.701569	  0.083934	  1.463819
  1.719883	  0.091772	  1.464822
  1.738890	  0.098862	  1.465222
  1.758060	  0.105941	  1.466248
  1.777365	  0.112319	  1.467305
  1.796985	  0.116621	  1.467601
  1.818377	  0.119885	  1.468236
  1.839356	  0.116962	  1.468286
  1.861051	  0.104872	  1.464764
  1.881334	  0.098940	  1.454027
  1.898060	  0.102256	  1.442338
  1.914119	  0.109005	  1.432567
  1.933734	  0.114243	  1.424900
  1.954844	  0.111904	  1.418614
  1.975070	  0.105846	  1.415375
  1.993960	  0.100213	  1.418380
  2.014389	  0.095392	  1.422683
  2.035943	  0.092243	  1.423077
  2.056919	  0.092661	  1.418581
  2.073575	  0.096069	  1.412828
  2.095427	  0.099036	  1.406587
  2.115724	  0.092764	  1.398605
  2.129602	  0.080992	  1.392009
  2.146953	  0.072062	  1.385049
  2.164241	  0.064656	  1.377904
  2.180708	  0.057148	  1.369482
  2.197379	  0.049511	  1.361465
  2.213745	  0.042021	  1.352924
  2.229334	  0.034327	  1.343792
  2.242443	  0.024608	  1.333060
  2.255352	  0.014665	  1.321478
  2.268124	  0.004825	  1.309733
  2.280520	 -0.005067	  1.298039
  2.289363	 -0.016100	  1.284645
  2.297770	 -0.028018	  1.271053
  2.305520	 -0.039652	  1.256800
  2.312861	 -0.051235	  1.242404
  2.318694	 -0.063733	  1.228321
  2.321895	 -0.076828	  1.213826
  2.324720	 -0.089936	  1.198975
  2.327764	 -0.103238	  1.184333
  2.330532	 -0.116591	  1.169765
  2.331793	 -0.130950	  1.155947
  2.332274	 -0.145181	  1.141910
  2.333133	 -0.159762	  1.128228
  2.333895	 -0.174370	  1.114586
  2.334578	 -0.189099	  1.100964
  2.334569	 -0.205009	  1.088565
  2.333979	 -0.220798	  1.076325
  2.334002	 -0.236904	  1.064433
  2.333666	 -0.252624	  1.052068
  2.333837	 -0.268814	  1.040306
  2.332833	 -0.285435	  1.029150
  2.330731	 -0.302352	  1.018685
  2.328943	 -0.319590	  1.008666
  2.326677	 -0.336483	  0.998198
  2.324934	 -0.353722	  0.988239
  2.322688	 -0.370704	  0.977958
  2.319643	 -0.387983	  0.968555
  2.315679	 -0.404903	  0.958639
  2.312428	 -0.422345	  0.949424
  2.308697	 -0.439186	  0.939556
  2.306119	 -0.454718	  0.927698
  2.305686	 -0.469005	  0.913955
  2.305712	 -0.483008	  0.899583
  2.311176	 -0.494295	  0.883708
  2.320139	 -0.504344	  0.868688
  2.329333	 -0.514212	  0.853799
  2.339856	 -0.524132	  0.839648
  2.351342	 -0.533772	  0.826180
  2.363290	 -0.543006	  0.812928
  2.376097	 -0.552174	  0.800457
  2.389242	 -0.561172	  0.788261
  2.402609	 -0.569657	  0.775877
  2.416735	 -0.578362	  0.764575
  2.430910	 -0.586456	  0.752836
  2.445883	 -0.595157	  0.742333
  2.462166	 -0.604858	  0.734010
  2.476826	 -0.612765	  0.722940
