 -1.625465	  0.682915	 -1.779253
 -1.620492	  0.681264	 -1.777607
 -1.607357	  0.676902	 -1.773259
 -1.589188	  0.671040	 -1.767299
 -1.570974	  0.665285	 -1.761370
 -1.552748	  0.659570	 -1.755445
 -1.534301	  0.654371	 -1.749731
 -1.515845	  0.649191	 -1.744046
 -1.497639	  0.643432	 -1.738487
 -1.479838	  0.636409	 -1.732783
 -1.463208	  0.629378	 -1.727996
 -1.447773	  0.616378	 -1.726072
 -1.428593	  0.604091	 -1.724042
 -1.404509	  0.604326	 -1.718950
 -1.382619	  0.606974	 -1.714716
 -1.364585	  0.607025	 -1.710885
 -1.346820	  0.604315	 -1.706965
 -1.327939	  0.598476	 -1.702577
 -1.307792	  0.588591	 -1.699927
 -1.294776	  0.578761	 -1.699527
 -1.275464	  0.561909	 -1.701653
 -1.253588	  0.552760	 -1.702031
 -1.240916	  0.549128	 -1.701242
 -1.219390	  0.545166	 -1.698493
 -1.198637	  0.539884	 -1.695804
 -1.180111	  0.536020	 -1.693276
 -1.158768	  0.531625	 -1.690593
 -1.141582	  0.528086	 -1.687449
 -1.121885	  0.522725	 -1.682889
 -1.099496	  0.512389	 -1.679811
 -1.088480	  0.504492	 -1.678664
 -1.071589	  0.486097	 -1.677322
 -1.049541	  0.470614	 -1.673358
 -1.039621	  0.463586	 -1.670862
 -1.020602	  0.455992	 -1.665752
 -0.988798	  0.452455	 -1.655568
 -0.970543	  0.458068	 -1.647598
 -0.959109	  0.463545	 -1.641890
 -0.939637	  0.469645	 -1.632723
 -0.920486	  0.471167	 -1.623006
 -0.904042	  0.469853	 -1.612630
 -0.886440	  0.466756	 -1.601163
 -0.866687	  0.467309	 -1.586853
 -0.849894	  0.470188	 -1.572007
 -0.837344	  0.475575	 -1.555283
 -0.828700	  0.482653	 -1.537577
 -0.821799	  0.488268	 -1.522554
 -0.814320	  0.493549	 -1.504460
 -0.807763	  0.502796	 -1.486258
 -0.803969	  0.522697	 -1.462854
 -0.800414	  0.533183	 -1.445715
 -0.797082	  0.538757	 -1.435700
 -0.788986	  0.548129	 -1.417997
 -0.781323	  0.558891	 -1.399714
 -0.776992	  0.568299	 -1.382195
 -0.775133	  0.577243	 -1.367070
 -0.773854	  0.585679	 -1.355166
 -0.766937	  0.603414	 -1.325631
 -0.759817	  0.611380	 -1.309802
 -0.756252	  0.613578	 -1.302241
 -0.746112	  0.618199	 -1.285544
 -0.736946	  0.626977	 -1.265730
 -0.729371	  0.630613	 -1.246024
 -0.722895	  0.634206	 -1.231128
 -0.714535	  0.634672	 -1.212222
 -0.704842	  0.631539	 -1.193804
 -0.697011	  0.628552	 -1.175270
 -0.687129	  0.624181	 -1.161358
 -0.676352	  0.620726	 -1.148158
 -0.664841	  0.615687	 -1.136655
 -0.650103	  0.613277	 -1.118623
 -0.636981	  0.610997	 -1.102898
 -0.625402	  0.606409	 -1.090165
 -0.612128	  0.596564	 -1.075992
 -0.599717	  0.588940	 -1.062593
 -0.593066	  0.584530	 -1.052268
 -0.583302	  0.578125	 -1.042175
 -0.569680	  0.573746	 -1.026928
 -0.554446	  0.568319	 -1.015799
 -0.542207	  0.564703	 -1.004037
 -0.527970	  0.560943	 -0.991937
 -0.510849	  0.556461	 -0.982953
 -0.490711	  0.549705	 -0.977717
 -0.471797	  0.541917	 -0.973347
 -0.458287	  0.536591	 -0.968449
 -0.443528	  0.530176	 -0.963384
 -0.429389	  0.522544	 -0.957733
 -0.413504	  0.511640	 -0.949198
 -0.396783	  0.500635	 -0.944772
 -0.382202	  0.488251	 -0.943337
 -0.368334	  0.470364	 -0.942702
 -0.356831	  0.447589	 -0.934113
 -0.344482	  0.434600	 -0.926296
 -0.326751	  0.426153	 -0.925625
 -0.307012	  0.420266	 -0.927454
 -0.289069	  0.416442	 -0.927739
 -0.268841	  0.411624	 -0.927105
 -0.249098	  0.404333	 -0.929649
 -0.232521	  0.397136	 -0.936141
 -0.221967	  0.393482	 -0.944913
 -0.210157	  0.389817	 -0.958711
 -0.188646	  0.376597	 -0.975560
 -0.175051	  0.371984	 -0.986559
 -0.163363	  0.368267	 -0.991997
 -0.146229	  0.363876	 -1.005480
 -0.131054	  0.353712	 -1.014683
 -0.115606	  0.344178	 -1.022760
 -0.097012	  0.334227	 -1.031198
 -0.094735	  0.334990	 -1.044620
 -0.079905	  0.329637	 -1.050200
 -0.059768	  0.317280	 -1.077244
 -0.052507	  0.313612	 -1.083914
 -0.044432	  0.305768	 -1.093861
 -0.032691	  0.298459	 -1.106448
 -0.018389	  0.291466	 -1.122047
 -0.001201	  0.285107	 -1.143823
  0.008517	  0.278955	 -1.156844
  0.017989	  0.272619	 -1.168393
  0.027514	  0.261513	 -1.185263
  0.035696	  0.247087	 -1.203014
  0.041795	  0.238183	 -1.218494
  0.047550	  0.232792	 -1.230494
  0.054630	  0.226182	 -1.246249
  0.066694	  0.218925	 -1.267472
  0.073355	  0.216108	 -1.278564
  0.082241	  0.213327	 -1.287563
  0.094596	  0.208246	 -1.305082
  0.104505	  0.207087	 -1.326712
  0.113077	  0.207712	 -1.346379
  0.125335	  0.200565	 -1.364774
  0.135125	  0.194595	 -1.372599
  0.153094	  0.192087	 -1.383720
  0.175514	  0.188158	 -1.397483
  0.190470	  0.186087	 -1.408316
  0.209042	  0.189553	 -1.417564
  0.223692	  0.195006	 -1.425092
  0.246416	  0.198058	 -1.436036
  0.262900	  0.199102	 -1.439417
  0.285577	  0.205898	 -1.444086
  0.308983	  0.215430	 -1.457888
  0.320550	  0.218658	 -1.463596
  0.337299	  0.220971	 -1.473641
  0.358461	  0.214590	 -1.473010
  0.379296	  0.214520	 -1.473331
  0.405140	  0.217911	 -1.473853
  0.424477	  0.218124	 -1.468190
  0.442293	  0.217387	 -1.457568
  0.461375	  0.220146	 -1.448903
  0.486845	  0.220049	 -1.440621
  0.500843	  0.219099	 -1.437435
  0.519721	  0.220477	 -1.434954
  0.542106	  0.222278	 -1.429740
  0.561202	  0.220578	 -1.421583
  0.581987	  0.213721	 -1.408786
  0.599969	  0.210354	 -1.398077
  0.615154	  0.208764	 -1.387088
  0.631691	  0.211240	 -1.376550
  0.648809	  0.215498	 -1.363894
  0.661280	  0.219317	 -1.353238
  0.673079	  0.220760	 -1.339442
  0.692563	  0.224011	 -1.326436
  0.708862	  0.223434	 -1.314495
  0.721858	  0.222031	 -1.298342
  0.735567	  0.222939	 -1.285070
  0.749152	  0.224432	 -1.274194
  0.766955	  0.225427	 -1.254780
  0.787146	  0.224804	 -1.240770
  0.805817	  0.225794	 -1.233226
  0.817881	  0.227744	 -1.228368
  0.833631	  0.230155	 -1.221709
  0.856265	  0.239903	 -1.213574
  0.874371	  0.249595	 -1.204527
  0.885394	  0.257465	 -1.200771
  0.901348	  0.269327	 -1.195153
  0.927444	  0.283945	 -1.190987
  0.938986	  0.289723	 -1.188577
  0.955919	  0.298995	 -1.188227
  0.976049	  0.308335	 -1.188441
  0.996065	  0.316718	 -1.187234
  1.015521	  0.320531	 -1.188687
  1.040007	  0.323488	 -1.190730
  1.054163	  0.321848	 -1.191788
  1.071999	  0.314975	 -1.194518
  1.095611	  0.307340	 -1.198090
  1.116942	  0.308757	 -1.194538
  1.128785	  0.311691	 -1.192738
  1.151146	  0.311737	 -1.186187
  1.167883	  0.307742	 -1.182326
  1.185900	  0.300020	 -1.179744
  1.205836	  0.286803	 -1.177121
  1.219698	  0.278409	 -1.179377
  1.231825	  0.267310	 -1.182238
  1.250278	  0.249536	 -1.185016
  1.257548	  0.238924	 -1.183294
  1.268152	  0.221953	 -1.175961
  1.277789	  0.201745	 -1.167927
  1.284265	  0.190600	 -1.165310
  1.293696	  0.173043	 -1.160972
  1.306217	  0.153684	 -1.161926
  1.314517	  0.138807	 -1.163320
  1.325384	  0.122367	 -1.162999
  1.338079	  0.104058	 -1.161586
  1.346312	  0.089091	 -1.160242
  1.355171	  0.071182	 -1.158571
  1.365967	  0.047535	 -1.157241
  1.373663	  0.031366	 -1.156753
  1.381279	  0.015087	 -1.154580
  1.391756	 -0.004315	 -1.149195
  1.405631	 -0.021957	 -1.144276
  1.422331	 -0.032922	 -1.140914
  1.440275	 -0.042667	 -1.139071
  1.458317	 -0.053915	 -1.139107
  1.474756	 -0.063561	 -1.139443
  1.490338	 -0.071419	 -1.139717
  1.511689	 -0.080724	 -1.138781
  1.539563	 -0.089107	 -1.133278
  1.555924	 -0.093629	 -1.124804
  1.563471	 -0.096644	 -1.118863
  1.584107	 -0.106236	 -1.100622
  1.605117	 -0.120107	 -1.091107
  1.608095	 -0.122520	 -1.087285
  1.637457	 -0.132461	 -1.078371
  1.662057	 -0.136920	 -1.069916
  1.673439	 -0.137403	 -1.066344
  1.691736	 -0.141285	 -1.064443
  1.716146	 -0.146863	 -1.058446
  1.733093	 -0.153341	 -1.059090
  1.749350	 -0.159167	 -1.058706
  1.771327	 -0.167596	 -1.058831
  1.789579	 -0.172977	 -1.057403
  1.809764	 -0.177834	 -1.055653
  1.829821	 -0.183928	 -1.049864
  1.842507	 -0.188453	 -1.045506
  1.859769	 -0.195530	 -1.046282
  1.879353	 -0.207729	 -1.043039
  1.896467	 -0.218248	 -1.034074
  1.910889	 -0.225826	 -1.028019
  1.926969	 -0.239498	 -1.020823
  1.945943	 -0.250855	 -1.008042
  1.962730	 -0.253399	 -0.997437
  1.980025	 -0.251324	 -0.989519
  1.999728	 -0.251950	 -0.984075
  2.018753	 -0.257010	 -0.976982
  2.037622	 -0.260801	 -0.970800
  2.056857	 -0.263941	 -0.965505
  2.075954	 -0.267490	 -0.960786
  2.095028	 -0.271062	 -0.955745
  2.114129	 -0.274158	 -0.950668
  2.133341	 -0.276972	 -0.945878
  2.152776	 -0.279227	 -0.941727
  2.172247	 -0.281417	 -0.937747
  2.192067	 -0.283243	 -0.935887
  2.211875	 -0.285261	 -0.934344
  2.230679	 -0.291580	 -0.932096
  2.248733	 -0.299780	 -0.929550
  2.267009	 -0.307377	 -0.926729
  2.302661	 -0.318006	 -0.920121
  2.304752	 -0.318624	 -0.919732
