 -2.327148	 -0.342986	  0.698952
 -2.339199	 -0.354368	  0.699323
 -2.315036	 -0.331547	  0.698580
 -2.278214	 -0.300124	  0.698790
 -2.244287	 -0.271071	  0.703647
 -2.200878	 -0.246829	  0.707803
 -2.155050	 -0.210554	  0.719553
 -2.121303	 -0.169158	  0.729426
 -2.087299	 -0.132469	  0.730675
 -2.052286	 -0.095913	  0.723756
 -2.020456	 -0.065490	  0.715698
 -1.976503	 -0.037135	  0.702227
 -1.942164	  0.003820	  0.687323
 -1.894161	  0.051672	  0.689996
 -1.880367	  0.142276	  0.724105
 -1.911933	  0.251738	  0.805039
 -1.934210	  0.373236	  0.901002
 -1.943755	  0.447597	  0.965951
 -1.937793	  0.490158	  1.001056
 -1.919147	  0.522091	  1.019027
 -1.900179	  0.538235	  1.023133
 -1.848398	  0.535721	  1.001418
 -1.792234	  0.512341	  0.956005
 -1.717000	  0.454665	  0.851920
 -1.607930	  0.418613	  0.718328
 -1.491007	  0.442944	  0.641671
 -1.412514	  0.484080	  0.612776
 -1.355222	  0.526304	  0.604354
 -1.309010	  0.570888	  0.605497
 -1.271018	  0.615736	  0.612294
 -1.238998	  0.661412	  0.623483
 -1.210240	  0.706468	  0.635317
 -1.182826	  0.748222	  0.645742
 -1.154996	  0.787878	  0.654400
 -1.126645	  0.827641	  0.659455
 -1.097956	  0.868611	  0.659335
 -1.069867	  0.910546	  0.652718
 -1.038553	  0.961824	  0.632375
 -1.003451	  1.030036	  0.571115
 -0.968309	  1.104974	  0.457001
 -0.935213	  1.148965	  0.401264
 -0.926059	  1.155842	  0.402672
 -0.912069	  1.166022	  0.409389
 -0.830401	  1.215930	  0.466669
 -0.746980	  1.270961	  0.523523
 -0.696088	  1.313698	  0.551330
 -0.661841	  1.354066	  0.564293
 -0.627537	  1.419670	  0.566771
 -0.613016	  1.516721	  0.540701
 -0.633386	  1.607971	  0.484504
 -0.645386	  1.664183	  0.443275
 -0.645010	  1.712092	  0.408415
 -0.631991	  1.759499	  0.375817
 -0.610335	  1.792741	  0.354198
 -0.582504	  1.815110	  0.342174
 -0.541850	  1.834405	  0.337249
 -0.477685	  1.852471	  0.343357
 -0.413453	  1.862676	  0.358743
 -0.355270	  1.866523	  0.378164
 -0.293133	  1.862865	  0.402021
 -0.213981	  1.854095	  0.435637
 -0.134355	  1.853729	  0.474957
 -0.073290	  1.865941	  0.508688
 -0.027362	  1.886076	  0.532252
  0.013993	  1.913376	  0.549608
  0.053736	  1.946079	  0.563186
  0.090661	  1.979633	  0.573814
  0.125963	  2.012594	  0.582761
  0.162193	  2.045754	  0.591165
  0.198889	  2.077436	  0.599165
  0.237681	  2.109648	  0.607136
  0.279700	  2.148556	  0.612144
  0.320224	  2.192898	  0.612473
  0.353985	  2.239330	  0.608706
  0.379445	  2.282677	  0.608679
  0.405083	  2.317328	  0.605668
  0.446723	  2.358480	  0.603473
  0.471139	  2.382611	  0.602755
