  0.773075	  2.292689	  0.040421
  0.786098	  2.327487	  0.056351
  0.783378	  2.320221	  0.053025
  0.765739	  2.281570	  0.035388
  0.746920	  2.244634	  0.019664
  0.728692	  2.209483	  0.006822
  0.709947	  2.171571	 -0.004084
  0.690689	  2.130920	 -0.013229
  0.671744	  2.088563	 -0.020211
  0.652804	  2.045934	 -0.025348
  0.632475	  2.001587	 -0.029598
  0.610061	  1.953914	 -0.034385
  0.587141	  1.905994	 -0.042002
  0.566539	  1.866178	 -0.050899
  0.551927	  1.841253	 -0.057636
  0.546282	  1.832807	 -0.059982
  0.541317	  1.826316	 -0.061641
  0.525826	  1.808024	 -0.066480
  0.497768	  1.777240	 -0.077500
  0.475890	  1.750983	 -0.088332
  0.288999	  1.539876	 -0.040700
  0.244368	  1.514266	 -0.042363
  0.185024	  1.436598	  0.058173
  0.134373	  1.327168	  0.164810
  0.093001	  1.230363	  0.220565
  0.079552	  1.193769	  0.229728
  0.069578	  1.160992	  0.229503
  0.060805	  1.127373	  0.219194
  0.054725	  1.086708	  0.197288
  0.049171	  1.020005	  0.137636
  0.055222	  0.954253	  0.055532
  0.086708	  0.874408	 -0.064214
  0.159871	  0.805929	 -0.202234
  0.230354	  0.777156	 -0.318929
  0.258181	  0.765342	 -0.389903
  0.250638	  0.748736	 -0.408875
  0.233134	  0.705943	 -0.422575
  0.219441	  0.665915	 -0.432224
  0.205844	  0.619757	 -0.442256
  0.190585	  0.570117	 -0.452734
  0.173282	  0.519100	 -0.464886
  0.156373	  0.470675	 -0.478885
  0.140592	  0.423829	 -0.493592
  0.124127	  0.378080	 -0.508135
  0.106703	  0.333281	 -0.522428
  0.087871	  0.287738	 -0.537291
  0.068776	  0.242130	 -0.552803
  0.049428	  0.196858	 -0.569033
  0.029671	  0.152203	 -0.585952
  0.009713	  0.108241	 -0.603318
 -0.010158	  0.064036	 -0.621195
 -0.028372	  0.023059	 -0.637751
 -0.046971	 -0.018677	 -0.654286
 -0.064459	 -0.057631	 -0.669154
 -0.082471	 -0.099077	 -0.683885
 -0.099532	 -0.141321	 -0.698117
 -0.117606	 -0.189335	 -0.715448
 -0.134540	 -0.237728	 -0.736096
 -0.149070	 -0.281397	 -0.756304
 -0.162681	 -0.322324	 -0.774016
 -0.175246	 -0.364260	 -0.790732
 -0.186086	 -0.407395	 -0.807255
 -0.194722	 -0.450523	 -0.823388
 -0.201111	 -0.493328	 -0.839097
 -0.205251	 -0.534785	 -0.854341
 -0.207307	 -0.575082	 -0.869442
 -0.207458	 -0.621086	 -0.886429
 -0.202901	 -0.691848	 -0.909706
 -0.182292	 -0.784883	 -0.935007
 -0.163201	 -0.837108	 -0.946929
 -0.218349	 -0.874882	 -0.891983
 -0.260079	 -0.938540	 -0.807970
 -0.318863	 -0.995241	 -0.747155
 -0.358035	 -1.048200	 -0.731203
 -0.414478	 -1.127516	 -0.738701
 -0.504525	 -1.209515	 -0.761940
 -0.647737	 -1.292428	 -0.830846
 -0.768038	 -1.321117	 -0.960875
 -0.847333	 -1.305662	 -1.005682
 -0.854169	 -1.326769	 -1.022599
 -0.845800	 -1.353057	 -1.043828
 -0.825225	 -1.385774	 -1.069129
 -0.789290	 -1.429209	 -1.099857
 -0.743498	 -1.499172	 -1.144524
 -0.714944	 -1.573966	 -1.186216
 -0.708358	 -1.633315	 -1.213645
 -0.713076	 -1.681914	 -1.233896
 -0.724827	 -1.726065	 -1.250622
 -0.741313	 -1.767023	 -1.264986
 -0.760053	 -1.807100	 -1.278405
 -0.780952	 -1.850431	 -1.291942
 -0.814366	 -1.919751	 -1.315127
 -0.823477	 -1.938314	 -1.321376
