 -1.015977	  2.214239	  0.345341
 -1.024268	  2.239172	  0.321769
 -1.020126	  2.224099	  0.334245
 -1.018214	  2.206187	  0.342934
 -1.016302	  2.188275	  0.351622
 -1.010177	  2.171817	  0.361195
 -1.003876	  2.155442	  0.370796
 -0.999232	  2.138933	  0.381085
 -0.996072	  2.122416	  0.391911
 -0.992913	  2.105899	  0.402737
 -0.988319	  2.091348	  0.415667
 -0.983458	  2.077228	  0.428970
 -0.978730	  2.063184	  0.442403
 -0.974192	  2.049250	  0.456013
 -0.969653	  2.035316	  0.469623
 -0.967413	  2.021637	  0.484041
 -0.966792	  2.008256	  0.498892
 -0.966172	  1.994876	  0.513744
 -0.965235	  1.982772	  0.529638
 -0.964212	  1.971030	  0.545796
 -0.962943	  1.959769	  0.562276
 -0.961281	  1.949310	  0.579242
 -0.959617	  1.938847	  0.596205
 -0.957814	  1.928140	  0.613002
 -0.956011	  1.917434	  0.629798
 -0.954526	  1.906193	  0.646274
 -0.953453	  1.894289	  0.662309
 -0.952379	  1.882385	  0.678345
 -0.952196	  1.868847	  0.693065
 -0.952460	  1.854557	  0.707056
 -0.952724	  1.840267	  0.721046
 -0.953491	  1.825584	  0.734603
 -0.954307	  1.810863	  0.748118
 -0.954656	  1.796506	  0.762037
 -0.954390	  1.782653	  0.776460
 -0.954124	  1.768800	  0.790884
 -0.952391	  1.754507	  0.804765
 -0.950659	  1.740213	  0.818646
 -0.947772	  1.725530	  0.831916
 -0.944012	  1.710596	  0.844676
 -0.939885	  1.695568	  0.857212
 -0.934226	  1.680229	  0.868730
 -0.928567	  1.664889	  0.880249
 -0.922784	  1.649402	  0.891505
 -0.916947	  1.633851	  0.902645
 -0.911403	  1.618354	  0.914007
 -0.907273	  1.603181	  0.926365
 -0.903144	  1.588008	  0.938724
 -0.901405	  1.575591	  0.954305
 -0.899697	  1.563213	  0.969921
 -0.901165	  1.555709	  0.988402
 -0.902687	  1.548296	  1.006915
 -0.904209	  1.540884	  1.025429
 -0.907883	  1.538384	  1.044929
 -0.913074	  1.539921	  1.064182
 -0.918265	  1.541459	  1.083435
 -0.923456	  1.542996	  1.102688
 -0.928647	  1.544534	  1.121942
 -0.933839	  1.546071	  1.141195
 -0.941453	  1.544107	  1.159584
 -0.949367	  1.541679	  1.177790
 -0.957280	  1.539250	  1.195997
 -0.965194	  1.536822	  1.214204
 -0.973107	  1.534394	  1.232410
 -0.986847	  1.534447	  1.246944
 -1.002372	  1.535470	  1.259510
 -1.017897	  1.536494	  1.272077
 -1.033422	  1.537517	  1.284644
 -1.048947	  1.538541	  1.297211
 -1.064472	  1.539564	  1.309777
 -1.079998	  1.540588	  1.322344
 -1.095523	  1.541611	  1.334911
 -1.111036	  1.542549	  1.347499
 -1.126188	  1.541514	  1.360512
 -1.141341	  1.540480	  1.373525
 -1.156493	  1.539445	  1.386537
 -1.171646	  1.538411	  1.399550
 -1.186798	  1.537376	  1.412563
 -1.201951	  1.536342	  1.425576
 -1.217103	  1.535307	  1.438588
 -1.232256	  1.534273	  1.451601
 -1.247408	  1.533238	  1.464614
 -1.262561	  1.532204	  1.477627
 -1.277713	  1.531169	  1.490639
 -1.293001	  1.530107	  1.503784
 -1.307841	  1.528456	  1.517090
