 -1.986594	  1.808357	 -1.401496
 -1.966925	  1.790452	 -1.387620
 -1.972326	  1.748793	 -1.364701
 -1.985420	  1.706027	 -1.345071
 -1.993628	  1.656383	 -1.333342
 -2.002007	  1.612567	 -1.312627
 -2.004253	  1.567614	 -1.296517
 -2.020025	  1.523070	 -1.278724
 -2.025582	  1.472459	 -1.273479
 -2.036311	  1.428873	 -1.250154
 -2.045464	  1.379851	 -1.238764
 -2.052406	  1.332779	 -1.221582
 -2.065180	  1.291282	 -1.199976
 -2.067337	  1.247326	 -1.175704
 -2.077298	  1.198949	 -1.156781
 -2.087628	  1.153316	 -1.138861
 -2.100464	  1.109323	 -1.118809
 -2.116086	  1.064007	 -1.098957
 -2.131115	  1.019813	 -1.082935
 -2.145052	  0.977094	 -1.068611
 -2.159332	  0.931389	 -1.053824
 -2.172728	  0.883988	 -1.039507
 -2.185016	  0.834547	 -1.025887
 -2.194796	  0.784691	 -1.012848
 -2.201054	  0.737794	 -0.999873
 -2.207207	  0.691232	 -0.986140
 -2.213725	  0.642312	 -0.970436
 -2.220380	  0.595276	 -0.954899
 -2.227549	  0.547055	 -0.938900
 -2.234273	  0.499921	 -0.922453
 -2.240024	  0.455539	 -0.905400
 -2.245354	  0.408071	 -0.886612
 -2.251115	  0.362912	 -0.868125
 -2.260825	  0.316411	 -0.848359
 -2.271447	  0.274152	 -0.829716
 -2.279740	  0.230195	 -0.808369
 -2.285775	  0.186280	 -0.785402
 -2.295449	  0.135327	 -0.765250
 -2.305412	  0.087519	 -0.750235
 -2.315140	  0.040823	 -0.737073
 -2.325741	 -0.004223	 -0.725499
 -2.339226	 -0.049536	 -0.715395
 -2.355826	 -0.096508	 -0.705919
 -2.370833	 -0.141458	 -0.696074
 -2.383952	 -0.188626	 -0.683196
 -2.394299	 -0.238719	 -0.666420
 -2.402315	 -0.283948	 -0.647895
 -2.410687	 -0.326110	 -0.629890
 -2.419875	 -0.373076	 -0.615342
 -2.427206	 -0.421595	 -0.602715
 -2.434204	 -0.470289	 -0.588676
 -2.442491	 -0.517849	 -0.573765
 -2.451629	 -0.565379	 -0.556370
 -2.461178	 -0.612917	 -0.536080
 -2.470541	 -0.653886	 -0.517385
 -2.481465	 -0.697042	 -0.496325
 -2.492933	 -0.739897	 -0.475608
 -2.505313	 -0.784271	 -0.456168
 -2.516800	 -0.831820	 -0.437229
 -2.525190	 -0.880940	 -0.419750
 -2.529950	 -0.927421	 -0.404471
 -2.532925	 -0.975675	 -0.387643
 -2.534960	 -1.023234	 -0.369611
 -2.537436	 -1.071091	 -0.350662
 -2.542185	 -1.116360	 -0.332144
 -2.550458	 -1.163402	 -0.312341
 -2.563805	 -1.209616	 -0.295685
 -2.578879	 -1.253022	 -0.281786
 -2.588281	 -1.297112	 -0.271649
 -2.599233	 -1.343217	 -0.253121
 -2.605371	 -1.390344	 -0.233842
 -2.620718	 -1.442562	 -0.225510
 -2.646925	 -1.456987	 -0.227765
