  0.172367	  1.997940	 -1.310699
  0.199413	  2.015438	 -1.345676
  0.176695	  2.011365	 -1.335996
  0.161031	  1.998838	 -1.314006
  0.157633	  1.998032	 -1.309085
  0.138507	  1.989472	 -1.298933
  0.123203	  1.982438	 -1.285416
  0.113287	  1.968600	 -1.269893
  0.109018	  1.959988	 -1.253383
  0.103705	  1.948198	 -1.236468
  0.097738	  1.934307	 -1.221957
  0.089427	  1.923409	 -1.206870
  0.081237	  1.913946	 -1.191176
  0.072923	  1.904394	 -1.175706
  0.064788	  1.894343	 -1.160431
  0.057366	  1.884804	 -1.144306
  0.049861	  1.875380	 -1.128169
  0.042138	  1.867647	 -1.111609
  0.038133	  1.858174	 -1.096271
  0.037018	  1.844460	 -1.081266
  0.035777	  1.828709	 -1.063505
  0.031894	  1.817761	 -1.038871
  0.021801	  1.817545	 -1.018422
  0.004117	  1.822428	 -0.999599
 -0.012067	  1.825423	 -0.984212
 -0.020461	  1.823148	 -0.971233
 -0.026401	  1.816073	 -0.953216
 -0.034625	  1.812690	 -0.935130
 -0.051375	  1.808947	 -0.919084
 -0.075568	  1.802057	 -0.911167
 -0.096635	  1.799704	 -0.911151
 -0.117074	  1.797848	 -0.907207
 -0.135482	  1.796179	 -0.904972
 -0.161546	  1.795952	 -0.900399
 -0.172073	  1.796007	 -0.898556
 -0.192629	  1.800306	 -0.891209
 -0.213800	  1.799401	 -0.890298
 -0.230588	  1.797819	 -0.892154
 -0.252381	  1.793293	 -0.898019
 -0.276146	  1.784259	 -0.900048
 -0.293698	  1.780709	 -0.897602
 -0.310508	  1.780746	 -0.889733
 -0.331761	  1.780659	 -0.883488
 -0.351057	  1.777846	 -0.879595
 -0.367703	  1.776108	 -0.871495
 -0.386229	  1.777223	 -0.860663
 -0.410988	  1.778081	 -0.852997
 -0.427166	  1.776079	 -0.854305
 -0.445138	  1.773550	 -0.854581
 -0.464781	  1.764443	 -0.854445
 -0.486215	  1.755203	 -0.849815
 -0.502280	  1.754219	 -0.844737
 -0.521738	  1.754954	 -0.838582
 -0.550399	  1.757337	 -0.824333
 -0.561977	  1.764999	 -0.811632
 -0.572102	  1.777119	 -0.796444
 -0.589959	  1.785321	 -0.787767
 -0.604426	  1.792361	 -0.779610
 -0.613529	  1.798622	 -0.770433
 -0.620546	  1.809677	 -0.752609
 -0.630097	  1.829913	 -0.727787
 -0.610377	  1.850497	 -0.695417
 -0.605223	  1.859025	 -0.678011
 -0.593691	  1.862312	 -0.672427
 -0.608510	  1.881569	 -0.651714
 -0.614609	  1.889040	 -0.645996
 -0.627386	  1.897827	 -0.634420
 -0.636214	  1.907647	 -0.615926
 -0.644548	  1.917446	 -0.607660
 -0.646813	  1.932697	 -0.593081
 -0.645061	  1.945937	 -0.576066
 -0.642678	  1.957743	 -0.559973
 -0.640076	  1.969317	 -0.543929
 -0.632443	  1.977085	 -0.527229
 -0.622921	  1.983080	 -0.510723
 -0.613516	  1.989148	 -0.494502
 -0.605683	  1.999110	 -0.480146
 -0.599414	  2.011082	 -0.464398
 -0.589861	  2.011419	 -0.440304
 -0.578480	  2.010019	 -0.423530
 -0.564840	  2.010136	 -0.410899
 -0.549497	  2.012001	 -0.395285
 -0.542109	  2.015117	 -0.376493
 -0.536906	  2.017798	 -0.359787
 -0.533255	  2.023017	 -0.340102
 -0.530281	  2.030259	 -0.320285
 -0.535094	  2.034967	 -0.299719
 -0.541168	  2.032170	 -0.273441
 -0.538774	  2.027742	 -0.256580
 -0.538450	  2.018550	 -0.238755
 -0.537848	  2.010957	 -0.223845
 -0.542082	  2.001869	 -0.206223
 -0.553496	  1.992130	 -0.191499
 -0.563453	  1.981000	 -0.181483
 -0.571519	  1.969158	 -0.173074
 -0.583098	  1.960687	 -0.167946
 -0.605506	  1.951293	 -0.155566
 -0.619678	  1.939889	 -0.145109
 -0.626338	  1.932056	 -0.139659
 -0.640016	  1.918457	 -0.131413
 -0.652273	  1.899784	 -0.122440
 -0.665364	  1.885976	 -0.115723
 -0.676929	  1.878733	 -0.111009
 -0.700381	  1.865313	 -0.103504
 -0.717514	  1.848962	 -0.094990
 -0.723851	  1.841467	 -0.093006
 -0.736531	  1.825860	 -0.087728
 -0.747722	  1.800109	 -0.076956
 -0.758594	  1.785670	 -0.070806
 -0.765894	  1.771032	 -0.066693
 -0.781086	  1.755054	 -0.063263
 -0.795660	  1.735254	 -0.055862
 -0.805573	  1.718211	 -0.042660
 -0.809951	  1.706327	 -0.034283
 -0.814597	  1.691861	 -0.024860
 -0.822400	  1.678283	 -0.013875
 -0.834426	  1.659898	 -0.004613
 -0.838294	  1.637557	  0.003805
 -0.835950	  1.617820	  0.014480
 -0.834094	  1.600854	  0.026586
 -0.834599	  1.585045	  0.038575
 -0.835720	  1.570786	  0.052099
 -0.839556	  1.557693	  0.066929
 -0.844687	  1.545714	  0.081763
 -0.850588	  1.533608	  0.096496
 -0.856190	  1.521722	  0.110375
 -0.861488	  1.510190	  0.123184
 -0.866420	  1.496954	  0.134566
 -0.872970	  1.482838	  0.147146
 -0.877903	  1.470859	  0.160454
 -0.886050	  1.459112	  0.175733
 -0.896887	  1.447612	  0.187176
 -0.909970	  1.439017	  0.197645
 -0.923176	  1.435580	  0.205338
 -0.942251	  1.442899	  0.215059
 -0.961346	  1.444768	  0.239807
 -0.974744	  1.430185	  0.254268
 -0.989551	  1.420557	  0.264524
 -0.994252	  1.414421	  0.272161
 -1.003657	  1.398359	  0.293962
 -1.013034	  1.384148	  0.316904
 -1.019712	  1.375080	  0.330402
 -1.024835	  1.368056	  0.340513
 -1.040906	  1.354399	  0.360882
 -1.047945	  1.340802	  0.370787
 -1.050614	  1.342976	  0.385684
 -1.065784	  1.328687	  0.399575
 -1.079059	  1.322648	  0.414795
 -1.101173	  1.308485	  0.427103
 -1.115164	  1.305547	  0.434837
 -1.131711	  1.304632	  0.438429
 -1.148531	  1.302661	  0.452094
 -1.170528	  1.302982	  0.453055
 -1.192431	  1.301664	  0.452876
 -1.209973	  1.297591	  0.455028
 -1.232238	  1.299232	  0.459869
 -1.248934	  1.299914	  0.466970
 -1.270981	  1.300180	  0.476466
 -1.288345	  1.297591	  0.482671
 -1.302876	  1.293585	  0.487580
 -1.324275	  1.288492	  0.495414
 -1.346145	  1.286958	  0.500824
 -1.369533	  1.285296	  0.505342
 -1.384390	  1.284244	  0.509113
 -1.399376	  1.281948	  0.516713
 -1.419016	  1.281103	  0.522604
 -1.440226	  1.276277	  0.528326
 -1.460349	  1.269485	  0.537770
 -1.474549	  1.265432	  0.543875
 -1.491105	  1.259021	  0.563107
 -1.504504	  1.254977	  0.583004
 -1.513404	  1.253535	  0.592358
 -1.535444	  1.257070	  0.597221
 -1.556280	  1.259712	  0.604243
 -1.573139	  1.256760	  0.616025
 -1.588797	  1.253105	  0.627994
 -1.602316	  1.248582	  0.641993
 -1.613870	  1.243416	  0.657467
 -1.625324	  1.238214	  0.673016
 -1.636770	  1.233011	  0.688569
 -1.648216	  1.227805	  0.704120
 -1.659442	  1.222530	  0.719771
 -1.666574	  1.215937	  0.737220
 -1.673419	  1.209265	  0.754784
 -1.680400	  1.202794	  0.772367
 -1.687549	  1.196522	  0.789995
 -1.693444	  1.189529	  0.807860
 -1.696991	  1.182561	  0.826433
 -1.700490	  1.174255	  0.844412
 -1.704156	  1.164600	  0.861328
 -1.705972	  1.158202	  0.880625
 -1.706023	  1.150206	  0.899764
 -1.707147	  1.137889	  0.915168
 -1.707070	  1.128494	  0.932920
 -1.706392	  1.120010	  0.951565
 -1.704419	  1.110339	  0.966837
 -1.697348	  1.105546	  0.987372
 -1.690497	  1.100424	  1.006445
 -1.680194	  1.090984	  1.021821
 -1.670256	  1.080361	  1.039053
 -1.665596	  1.069017	  1.056228
 -1.663444	  1.056376	  1.069115
 -1.662901	  1.040672	  1.080676
 -1.658772	  1.026650	  1.097777
 -1.656702	  1.010611	  1.109812
 -1.651746	  0.993983	  1.120170
 -1.643034	  0.980783	  1.133897
 -1.633663	  0.969278	  1.147514
 -1.623951	  0.957323	  1.160011
 -1.613660	  0.946331	  1.173338
 -1.600574	  0.937642	  1.185858
 -1.587323	  0.929240	  1.198246
 -1.574094	  0.920847	  1.210649
 -1.561025	  0.912586	  1.223384
 -1.547819	  0.904039	  1.235760
 -1.534532	  0.895365	  1.247817
 -1.522131	  0.886472	  1.259520
 -1.511924	  0.871640	  1.269190
 -1.507823	  0.858051	  1.282068
 -1.510721	  0.850799	  1.294342
 -1.513218	  0.843506	  1.307886
 -1.519814	  0.836532	  1.325383
 -1.526891	  0.830109	  1.343502
 -1.534922	  0.822864	  1.360845
 -1.542628	  0.816837	  1.378931
 -1.549046	  0.812792	  1.398068
 -1.556691	  0.807391	  1.416188
 -1.562998	  0.804862	  1.435236
 -1.571225	  0.800377	  1.453425
 -1.577885	  0.798208	  1.471866
 -1.587764	  0.794659	  1.489165
 -1.596207	  0.793112	  1.505656
 -1.609367	  0.796277	  1.519912
 -1.622970	  0.805253	  1.543116
 -1.630915	  0.805097	  1.560927
 -1.636807	  0.790369	  1.576748
 -1.643578	  0.775239	  1.592841
 -1.653250	  0.770260	  1.609924
 -1.663487	  0.774791	  1.625242
 -1.678334	  0.781835	  1.645944
 -1.686601	  0.770254	  1.666537
 -1.684571	  0.748157	  1.679038
 -1.694516	  0.740258	  1.694488
