 0.0 0.0 0.0 0
 0.5939003757009231 -0.4532517859046169 0.5118697708663916 1000
 0.5810433592427195 -0.23763023698676022 -0.6732670184331995 1000
 0.28575797901880357 -0.7544915863933823 -0.573054766634141 1000
 -0.6151717045593958 0.7532549559521396 -0.1202958979255423 1000
 -0.2852771869381314 0.3400519796480399 0.7848457141071585 1000
 -0.054634563404049874 0.9187001982858422 0.4243696235427653 1000
 -0.6839736397427779 0.11468887358830376 -0.5949432035013202 1000
 0.8117370982836114 -0.5755786534262718 -0.1354554681182831 1000
 0.0 0.0 0.0 0
 0.9887725929173224 -0.10670282212574733 0.08147563559695897 1000
 0.3302294113587786 -0.9292040117514928 0.042313805753888545 1000
 -0.9074440915915993 -0.1818756755076376 0.29300470552860125 1000
 -0.7031927869804693 -0.26037366397848427 -0.5846662245639641 1000
 -0.5807500480758974 -0.40756640346407474 0.5435205698732597 1000
 -0.7869059065640193 0.4218210127962199 -0.33598563475605225 1000
 -0.6372911016796765 -0.6106339390576868 0.3257426151092804 1000
 0.04452489651743184 0.24551540559009308 -0.7841099935437394 1000
 0.0 0.0 0.0 0
 0.48408635424449403 0.2934460997488062 -0.6562597547117938 1000
 -0.4578587500331994 -0.8282456179843362 -0.3604572985248851 1000
 0.9119071212239065 0.35757972820626144 0.21250216559626878 1000
 0.12063088115841053 0.8739058070221193 0.4868020850909721 1000
 -0.9537986202196889 0.2931664355742154 -0.02267925285255784 1000
 0.6149038114894755 0.10863039920195287 0.6682283265347936 1000
 0.18633380361645527 0.9002029609330104 -0.23288981269705245 1000
 -0.6567586677783985 0.5489338922876597 0.4871334699970906 1000
 0.0 0.0 0.0 0
