  0.830407	 -0.686271	  2.280695
  0.846677	 -0.695538	  2.290686
  0.831297	 -0.686852	  2.281312
  0.815006	 -0.679040	  2.272740
  0.798541	 -0.671421	  2.264330
  0.781546	 -0.664579	  2.256310
  0.764478	 -0.657869	  2.248334
  0.747152	 -0.652029	  2.240233
  0.729756	 -0.646489	  2.232074
  0.712162	 -0.642882	  2.223296
  0.694593	 -0.640923	  2.213967
  0.677351	 -0.641680	  2.203888
  0.660992	 -0.644510	  2.192757
  0.645555	 -0.648990	  2.180867
  0.630249	 -0.653701	  2.168936
  0.616391	 -0.660954	  2.156619
  0.602968	 -0.669434	  2.144426
  0.589621	 -0.677075	  2.133229
  0.573199	 -0.687447	  2.126291
  0.557639	 -0.702532	  2.116823
  0.548634	 -0.714233	  2.099580
  0.541243	 -0.719297	  2.078399
  0.530998	 -0.719269	  2.062270
  0.515870	 -0.721057	  2.049502
  0.504643	 -0.724263	  2.028753
  0.498732	 -0.730936	  2.007682
  0.487030	 -0.745298	  1.990015
  0.480340	 -0.754702	  1.983030
  0.466693	 -0.768729	  1.978392
  0.447827	 -0.778040	  1.968502
  0.434109	 -0.787529	  1.954857
  0.421067	 -0.795484	  1.941560
  0.408954	 -0.802673	  1.927287
  0.396672	 -0.810793	  1.913654
  0.385506	 -0.817610	  1.897984
  0.375036	 -0.822661	  1.881493
  0.362340	 -0.826415	  1.868202
  0.345146	 -0.830591	  1.856851
  0.329495	 -0.832264	  1.842452
  0.317531	 -0.832297	  1.822825
  0.311766	 -0.834991	  1.801930
  0.305370	 -0.839280	  1.782860
  0.297583	 -0.844106	  1.769439
  0.284239	 -0.850023	  1.755253
  0.269678	 -0.855675	  1.740038
  0.258877	 -0.859115	  1.721631
  0.250781	 -0.856699	  1.699457
  0.242271	 -0.848155	  1.680286
  0.230944	 -0.835780	  1.668438
  0.215697	 -0.825721	  1.659101
  0.199789	 -0.814752	  1.650643
  0.186149	 -0.803467	  1.638844
  0.177390	 -0.793785	  1.624772
  0.170493	 -0.782871	  1.610610
  0.162102	 -0.769698	  1.600060
  0.155129	 -0.753746	  1.595877
  0.147044	 -0.731120	  1.593252
  0.134493	 -0.712000	  1.588412
  0.118894	 -0.705056	  1.578360
  0.104143	 -0.697573	  1.568545
  0.083087	 -0.689904	  1.555661
  0.065598	 -0.675348	  1.546198
  0.054422	 -0.666867	  1.543814
  0.035611	 -0.655621	  1.538276
  0.018151	 -0.644542	  1.537552
  0.004171	 -0.630821	  1.537686
 -0.011081	 -0.611547	  1.538366
 -0.021768	 -0.591651	  1.539575
 -0.028640	 -0.577966	  1.537592
 -0.038129	 -0.558449	  1.534754
 -0.050005	 -0.541554	  1.532748
 -0.065369	 -0.528288	  1.532249
 -0.080354	 -0.516734	  1.528269
 -0.092737	 -0.506838	  1.521758
 -0.109766	 -0.490358	  1.512521
 -0.122243	 -0.481228	  1.510095
 -0.143737	 -0.469186	  1.507664
 -0.161580	 -0.462142	  1.509214
 -0.178099	 -0.457050	  1.511240
 -0.204008	 -0.451585	  1.515474
 -0.234401	 -0.448764	  1.515600
 -0.251997	 -0.433305	  1.503612
 -0.259137	 -0.410010	  1.498807
 -0.260691	 -0.382925	  1.492508
 -0.260289	 -0.363525	  1.487370
 -0.266311	 -0.345265	  1.478964
 -0.283870	 -0.334978	  1.470020
 -0.302628	 -0.327482	  1.461068
 -0.317186	 -0.322977	  1.456994
 -0.338733	 -0.311965	  1.454657
 -0.356563	 -0.298634	  1.449377
 -0.370591	 -0.287872	  1.443738
 -0.383718	 -0.279960	  1.439139
 -0.402630	 -0.266565	  1.435638
 -0.413819	 -0.254638	  1.432854
 -0.430130	 -0.237589	  1.424758
 -0.443075	 -0.222642	  1.416891
 -0.450251	 -0.213944	  1.411357
 -0.461283	 -0.201061	  1.398106
 -0.473566	 -0.190955	  1.384570
 -0.488179	 -0.183505	  1.375773
 -0.510712	 -0.175912	  1.367245
 -0.531520	 -0.166524	  1.360772
 -0.548493	 -0.156225	  1.357385
 -0.563999	 -0.144654	  1.352788
 -0.577116	 -0.131156	  1.346200
 -0.586560	 -0.116548	  1.337601
 -0.595320	 -0.101692	  1.329543
 -0.610119	 -0.084497	  1.316708
 -0.627484	 -0.074470	  1.304101
 -0.640997	 -0.069485	  1.296305
 -0.654121	 -0.067262	  1.290449
 -0.675958	 -0.059468	  1.283083
 -0.690492	 -0.051423	  1.276463
 -0.707193	 -0.042686	  1.265988
 -0.726108	 -0.035990	  1.249999
 -0.734977	 -0.032802	  1.242027
 -0.749220	 -0.027937	  1.227768
 -0.772555	 -0.012357	  1.208314
 -0.776712	 -0.008815	  1.205618
 -0.792459	  0.004795	  1.201313
 -0.813979	  0.019528	  1.191279
 -0.825821	  0.023723	  1.185035
 -0.846496	  0.026358	  1.176264
 -0.865641	  0.029187	  1.165990
 -0.878691	  0.031367	  1.155906
 -0.893329	  0.031799	  1.141994
 -0.908959	  0.031283	  1.126896
 -0.924165	  0.030318	  1.111311
 -0.936708	  0.032074	  1.098568
 -0.953871	  0.035454	  1.082942
 -0.970863	  0.040837	  1.066994
 -0.980971	  0.046382	  1.054783
 -0.992679	  0.049018	  1.045676
 -1.018387	  0.047346	  1.041206
 -1.042270	  0.046184	  1.038264
 -1.059398	  0.046892	  1.028719
 -1.071805	  0.051729	  1.013985
 -1.083252	  0.058160	  0.996370
 -1.099482	  0.061249	  0.982948
 -1.116778	  0.062935	  0.975526
 -1.136001	  0.065060	  0.969976
 -1.157272	  0.069052	  0.959194
 -1.170620	  0.072360	  0.946189
 -1.183327	  0.075992	  0.932345
 -1.200617	  0.083069	  0.917053
 -1.216519	  0.093156	  0.908690
 -1.229218	  0.103371	  0.903058
 -1.246345	  0.120763	  0.889767
 -1.259050	  0.132388	  0.879028
 -1.268257	  0.138366	  0.872855
 -1.289496	  0.144617	  0.857998
 -1.305989	  0.152180	  0.844513
 -1.314688	  0.158060	  0.838682
 -1.328552	  0.170450	  0.831322
 -1.342427	  0.187259	  0.820868
 -1.352859	  0.203447	  0.813530
 -1.365361	  0.217662	  0.806914
 -1.378602	  0.231005	  0.800002
 -1.391817	  0.244280	  0.792992
 -1.403705	  0.259462	  0.787679
 -1.414780	  0.275542	  0.783320
 -1.425810	  0.291660	  0.779025
 -1.436869	  0.307736	  0.774657
 -1.448017	  0.323684	  0.770019
 -1.458934	  0.339797	  0.765667
 -1.468320	  0.355202	  0.762566
 -1.481589	  0.366591	  0.754941
 -1.495583	  0.386387	  0.743588
 -1.500649	  0.414208	  0.748165
 -1.503239	  0.432462	  0.754017
 -1.508221	  0.450702	  0.757268
 -1.514966	  0.466543	  0.756827
 -1.521040	  0.480415	  0.757093
 -1.538233	  0.508613	  0.751915
 -1.543772	  0.519394	  0.750602
 -1.554188	  0.541589	  0.751195
 -1.560610	  0.560839	  0.751520
 -1.565557	  0.574321	  0.752626
 -1.569221	  0.594493	  0.755202
 -1.581272	  0.619553	  0.756559
 -1.590927	  0.632527	  0.755628
 -1.603549	  0.644274	  0.752037
 -1.615575	  0.660426	  0.747822
 -1.627479	  0.676156	  0.747402
 -1.642372	  0.690449	  0.746751
 -1.657196	  0.703808	  0.747387
 -1.669007	  0.714660	  0.749167
 -1.679699	  0.727782	  0.752763
 -1.693614	  0.742843	  0.756255
 -1.706398	  0.754249	  0.759212
 -1.721569	  0.766726	  0.762835
 -1.740941	  0.778779	  0.768419
 -1.757688	  0.787489	  0.770912
 -1.772253	  0.796007	  0.770665
 -1.792465	  0.799210	  0.764007
 -1.810018	  0.789093	  0.755613
 -1.826105	  0.778447	  0.748224
 -1.840613	  0.773639	  0.738389
 -1.851277	  0.769635	  0.729341
 -1.858959	  0.759284	  0.719642
 -1.863575	  0.742795	  0.710616
 -1.875494	  0.727822	  0.697763
 -1.881282	  0.714467	  0.671508
 -1.880176	  0.708114	  0.654795
 -1.879053	  0.704366	  0.641568
 -1.876889	  0.698783	  0.618246
 -1.879959	  0.694582	  0.597221
 -1.885658	  0.695670	  0.585246
 -1.894524	  0.695999	  0.568575
 -1.905393	  0.695820	  0.538315
 -1.909528	  0.689597	  0.518774
 -1.910011	  0.682290	  0.507296
 -1.911528	  0.673911	  0.487079
 -1.911636	  0.668646	  0.466637
 -1.909985	  0.665974	  0.446856
 -1.906072	  0.662937	  0.425950
 -1.903032	  0.662290	  0.406270
 -1.898463	  0.662268	  0.383529
 -1.891538	  0.652338	  0.354668
 -1.888496	  0.644203	  0.338608
 -1.885540	  0.636845	  0.318634
 -1.898570	  0.633411	  0.297697
 -1.912936	  0.644387	  0.278267
 -1.922359	  0.655554	  0.265778
 -1.934563	  0.661314	  0.245752
 -1.944396	  0.661314	  0.226987
 -1.950565	  0.663122	  0.212538
 -1.960096	  0.669423	  0.196931
 -1.974653	  0.676388	  0.177812
 -1.984911	  0.680186	  0.163420
 -1.994584	  0.684156	  0.150219
 -2.008452	  0.689847	  0.135168
 -2.025403	  0.693107	  0.122552
 -2.041000	  0.693800	  0.111854
 -2.061150	  0.694799	  0.097286
 -2.075781	  0.696330	  0.085106
 -2.085323	  0.695965	  0.076056
 -2.096797	  0.702079	  0.060771
 -2.108935	  0.711784	  0.042673
 -2.124734	  0.716591	  0.028381
 -2.141049	  0.718735	  0.017037
 -2.160020	  0.721736	  0.008498
 -2.178576	  0.726909	 -0.000390
 -2.192251	  0.732777	 -0.009902
 -2.206296	  0.738899	 -0.021416
 -2.222475	  0.746650	 -0.032204
 -2.245033	  0.751709	 -0.039574
 -2.264569	  0.752088	 -0.047447
 -2.279194	  0.752249	 -0.055091
 -2.296246	  0.750706	 -0.068346
 -2.313779	  0.753345	 -0.077600
