 -1.544946	  0.875013	 -1.522387
 -1.530501	  0.886465	 -1.534107
 -1.516056	  0.897917	 -1.545827
 -1.527674	  0.884816	 -1.535997
 -1.539149	  0.872490	 -1.525318
 -1.550832	  0.860576	 -1.514507
 -1.562494	  0.848337	 -1.503951
 -1.573719	  0.835391	 -1.493624
 -1.585741	  0.823438	 -1.483030
 -1.598164	  0.810787	 -1.473568
 -1.611012	  0.798677	 -1.464061
 -1.624040	  0.786745	 -1.454549
 -1.638076	  0.776129	 -1.445162
 -1.651664	  0.764445	 -1.436159
 -1.664812	  0.752070	 -1.427592
 -1.678110	  0.740233	 -1.419393
 -1.693428	  0.732939	 -1.407777
 -1.709244	  0.726214	 -1.394702
 -1.723774	  0.710418	 -1.391080
 -1.734883	  0.689035	 -1.388526
 -1.745985	  0.673722	 -1.383844
 -1.757835	  0.661255	 -1.377736
 -1.767777	  0.645711	 -1.371690
 -1.784696	  0.627166	 -1.361454
 -1.799610	  0.621799	 -1.352315
 -1.813299	  0.618147	 -1.341412
 -1.830835	  0.613001	 -1.325856
 -1.850990	  0.602062	 -1.310555
 -1.865174	  0.592378	 -1.300306
 -1.879358	  0.582694	 -1.290057
