  1.103859	 -1.725698	  1.257690
  1.116927	 -1.746872	  1.259783
  1.112514	 -1.731198	  1.257187
  1.096820	 -1.709090	  1.254726
  1.084963	 -1.693189	  1.253549
  1.077456	 -1.681165	  1.253091
  1.063805	 -1.661107	  1.251210
  1.052078	 -1.643959	  1.249404
  1.042326	 -1.628914	  1.246151
  1.033220	 -1.612751	  1.241739
  1.025746	 -1.598542	  1.236495
  1.015452	 -1.580492	  1.227071
  1.001905	 -1.561183	  1.219274
  0.990692	 -1.549105	  1.219069
  0.975770	 -1.535291	  1.221652
  0.957215	 -1.513816	  1.218387
  0.950555	 -1.505140	  1.215902
  0.935577	 -1.488428	  1.213180
  0.922383	 -1.471059	  1.208397
  0.913875	 -1.456652	  1.202135
  0.903995	 -1.440378	  1.195197
  0.893807	 -1.423501	  1.189519
  0.885178	 -1.406603	  1.181641
  0.871692	 -1.387500	  1.175203
  0.858915	 -1.374785	  1.174879
  0.847833	 -1.363510	  1.176463
  0.836062	 -1.344400	  1.173573
  0.824184	 -1.327267	  1.170980
  0.812996	 -1.310749	  1.168843
  0.801818	 -1.294334	  1.166443
  0.790651	 -1.277887	  1.164250
  0.779554	 -1.261338	  1.162521
  0.768443	 -1.244798	  1.160801
  0.756703	 -1.228707	  1.159003
  0.744742	 -1.212799	  1.157097
  0.733380	 -1.196913	  1.152813
  0.722122	 -1.181073	  1.148088
  0.709445	 -1.166099	  1.144250
  0.694707	 -1.152784	  1.141936
  0.679929	 -1.139501	  1.139660
  0.665195	 -1.126170	  1.137427
  0.651634	 -1.111487	  1.136856
  0.638185	 -1.096691	  1.136411
  0.625050	 -1.081620	  1.135969
  0.613723	 -1.065149	  1.135631
  0.602480	 -1.048632	  1.135292
  0.591718	 -1.032218	  1.135318
  0.581566	 -1.017670	  1.139036
  0.568016	 -1.002859	  1.149871
  0.553380	 -0.982401	  1.151556
  0.544087	 -0.965380	  1.145424
  0.537049	 -0.950902	  1.138550
  0.523156	 -0.928712	  1.132125
  0.511520	 -0.914251	  1.132305
  0.501525	 -0.903063	  1.133583
  0.485970	 -0.885317	  1.134395
  0.473858	 -0.870972	  1.135780
  0.460433	 -0.855852	  1.138280
  0.448012	 -0.841168	  1.140683
  0.435187	 -0.825582	  1.145174
  0.420161	 -0.806108	  1.148330
  0.405973	 -0.789599	  1.146376
  0.395613	 -0.775458	  1.135822
  0.386215	 -0.762858	  1.123025
  0.374954	 -0.753691	  1.110637
  0.358243	 -0.746833	  1.098545
  0.341058	 -0.734695	  1.089085
  0.325217	 -0.718194	  1.085515
  0.313623	 -0.696790	  1.085193
  0.307181	 -0.673615	  1.085126
  0.302741	 -0.654977	  1.080643
  0.298861	 -0.642641	  1.074913
  0.286383	 -0.629149	  1.066380
  0.267483	 -0.615502	  1.060109
  0.254180	 -0.598426	  1.052076
  0.244724	 -0.580236	  1.044531
  0.241155	 -0.563667	  1.040614
  0.235679	 -0.543369	  1.040580
  0.227399	 -0.524056	  1.037993
  0.220278	 -0.507370	  1.028153
  0.214261	 -0.491809	  1.016746
  0.205023	 -0.473155	  1.012419
  0.192924	 -0.449387	  1.014266
  0.185902	 -0.437864	  1.014752
  0.175480	 -0.422242	  1.012225
  0.163066	 -0.402681	  1.006640
  0.154413	 -0.389116	  1.001754
  0.142542	 -0.373979	  0.996792
  0.129027	 -0.354744	  0.994343
  0.124610	 -0.340203	  0.995693
  0.118017	 -0.310453	  0.999351
  0.110133	 -0.284857	  1.001156
  0.104572	 -0.275494	  1.002336
  0.093561	 -0.257103	  1.009402
  0.078685	 -0.242478	  1.011804
  0.063959	 -0.229670	  1.011171
  0.046914	 -0.210436	  1.005892
  0.033009	 -0.196158	  0.995254
  0.023640	 -0.187981	  0.982726
  0.009469	 -0.175926	  0.973720
 -0.004211	 -0.160941	  0.973036
 -0.014154	 -0.144154	  0.976970
 -0.031054	 -0.116870	  0.977237
 -0.037841	 -0.104852	  0.972451
 -0.045062	 -0.093652	  0.967565
 -0.059974	 -0.077464	  0.959645
 -0.071358	 -0.064514	  0.948572
 -0.085364	 -0.054181	  0.934373
 -0.101760	 -0.040182	  0.926378
 -0.113587	 -0.023432	  0.926681
 -0.122202	 -0.005996	  0.932629
 -0.128627	  0.014678	  0.939641
 -0.140089	  0.041288	  0.942120
 -0.147412	  0.051038	  0.942868
 -0.160841	  0.061810	  0.946105
 -0.184452	  0.080031	  0.948900
 -0.199352	  0.098471	  0.939862
 -0.203780	  0.107821	  0.933920
 -0.207245	  0.125331	  0.922993
 -0.220101	  0.151101	  0.921108
 -0.235770	  0.166360	  0.920967
 -0.244696	  0.178140	  0.918265
 -0.257307	  0.189930	  0.914882
 -0.273972	  0.208871	  0.911602
 -0.285219	  0.220215	  0.910647
 -0.298330	  0.235492	  0.909731
 -0.314093	  0.255278	  0.915030
 -0.329155	  0.268553	  0.922362
 -0.342527	  0.278983	  0.930282
 -0.356143	  0.293257	  0.935740
 -0.370544	  0.310564	  0.934572
 -0.382212	  0.324644	  0.932571
 -0.391257	  0.334801	  0.934138
 -0.408515	  0.353608	  0.940292
 -0.425569	  0.373540	  0.941789
 -0.432226	  0.382669	  0.939666
 -0.442864	  0.403124	  0.934000
 -0.456195	  0.422257	  0.933529
 -0.470394	  0.440030	  0.938385
 -0.481116	  0.450887	  0.942036
 -0.495748	  0.468864	  0.937584
 -0.508765	  0.478082	  0.926813
 -0.528574	  0.482012	  0.916506
 -0.546678	  0.482076	  0.905821
 -0.561874	  0.483544	  0.895504
 -0.576799	  0.486737	  0.887354
 -0.595153	  0.490640	  0.881089
 -0.614999	  0.493163	  0.875823
 -0.634145	  0.495769	  0.872000
 -0.654104	  0.494351	  0.870148
 -0.673716	  0.489532	  0.869334
 -0.693136	  0.484405	  0.868254
 -0.712329	  0.481029	  0.867065
 -0.730961	  0.476776	  0.868007
 -0.750214	  0.471172	  0.870672
 -0.768792	  0.468153	  0.871924
 -0.789479	  0.466245	  0.863496
 -0.815824	  0.467704	  0.852492
 -0.832668	  0.467378	  0.849370
 -0.850247	  0.465233	  0.850413
 -0.870639	  0.463077	  0.851470
 -0.890384	  0.457937	  0.850471
 -0.911098	  0.452874	  0.847989
 -0.928842	  0.450096	  0.845931
 -0.945858	  0.445844	  0.844204
 -0.966183	  0.440748	  0.841910
 -0.995093	  0.437271	  0.838934
 -1.009723	  0.434559	  0.837009
 -1.027102	  0.430955	  0.834999
 -1.044460	  0.425956	  0.831095
 -1.058507	  0.422607	  0.824553
 -1.085407	  0.416268	  0.810738
 -1.107964	  0.415044	  0.802479
 -1.120566	  0.415446	  0.797582
 -1.142710	  0.422731	  0.796629
 -1.162509	  0.428516	  0.795780
 -1.183841	  0.428658	  0.791989
 -1.207748	  0.429143	  0.791020
 -1.225785	  0.429229	  0.791514
 -1.244399	  0.435062	  0.787971
 -1.267310	  0.437982	  0.780150
 -1.285641	  0.445039	  0.774519
 -1.306090	  0.453181	  0.771599
 -1.325035	  0.466334	  0.776070
 -1.340135	  0.480121	  0.781040
 -1.353254	  0.495806	  0.784587
 -1.367787	  0.514069	  0.786962
 -1.376550	  0.529153	  0.789758
 -1.389535	  0.549427	  0.792806
 -1.404011	  0.564274	  0.797318
 -1.412322	  0.579751	  0.801784
 -1.421484	  0.593250	  0.805437
 -1.427483	  0.615349	  0.807720
 -1.432830	  0.630480	  0.807617
 -1.437040	  0.651142	  0.807952
 -1.442090	  0.672914	  0.811166
 -1.448658	  0.695800	  0.812571
 -1.455180	  0.713552	  0.811349
 -1.461125	  0.728100	  0.808334
 -1.466734	  0.746105	  0.810984
 -1.468513	  0.772148	  0.821678
 -1.471979	  0.789230	  0.828123
 -1.471776	  0.811073	  0.833880
 -1.471218	  0.832515	  0.837114
 -1.470596	  0.842249	  0.838302
 -1.466765	  0.863108	  0.843348
 -1.465379	  0.883095	  0.848062
 -1.464177	  0.913359	  0.845035
 -1.462483	  0.926732	  0.842674
 -1.457028	  0.940655	  0.841137
 -1.446214	  0.966849	  0.838520
 -1.440062	  0.991622	  0.839306
 -1.439264	  1.001983	  0.841543
 -1.436256	  1.016570	  0.846186
 -1.434724	  1.040930	  0.850067
 -1.433297	  1.061314	  0.850240
 -1.429828	  1.084796	  0.854657
 -1.425290	  1.102645	  0.857761
 -1.415027	  1.123720	  0.859716
 -1.407111	  1.141575	  0.860898
 -1.396895	  1.159846	  0.862001
 -1.392693	  1.171827	  0.863885
 -1.381048	  1.196429	  0.863512
 -1.375432	  1.221061	  0.863812
 -1.372203	  1.234414	  0.864074
 -1.367045	  1.247633	  0.867192
 -1.353881	  1.273010	  0.869315
 -1.346750	  1.287092	  0.869938
 -1.340637	  1.302180	  0.869945
 -1.337341	  1.329215	  0.865661
 -1.337019	  1.342711	  0.863162
 -1.336308	  1.364424	  0.857661
 -1.332439	  1.389358	  0.852967
 -1.328389	  1.406054	  0.852573
 -1.323886	  1.423892	  0.854120
 -1.322873	  1.439162	  0.858734
 -1.330634	  1.460495	  0.860815
 -1.340712	  1.488365	  0.858243
 -1.345190	  1.499996	  0.855567
 -1.351331	  1.513881	  0.851150
 -1.360318	  1.534824	  0.845830
 -1.369553	  1.547987	  0.841541
 -1.378461	  1.567313	  0.833909
 -1.386466	  1.585164	  0.826413
 -1.392778	  1.596537	  0.822129
 -1.412800	  1.618859	  0.823747
 -1.431570	  1.633826	  0.831579
 -1.434754	  1.640187	  0.832105
 -1.449491	  1.648981	  0.832977
 -1.467502	  1.668378	  0.827859
 -1.481715	  1.686040	  0.821364
 -1.487636	  1.697781	  0.815232
 -1.500015	  1.718374	  0.802955
 -1.514469	  1.731092	  0.797539
