  0.032965	 -2.420085	  0.802970
  0.045770	 -2.442441	  0.823701
  0.039463	 -2.431431	  0.813491
  0.019323	 -2.401036	  0.784934
 -0.000695	 -2.375364	  0.759457
 -0.019522	 -2.354186	  0.736292
 -0.037815	 -2.336862	  0.714755
 -0.057421	 -2.321773	  0.693127
 -0.082105	 -2.306386	  0.667953
 -0.117581	 -2.287949	  0.635246
 -0.168649	 -2.263841	  0.594796
 -0.233981	 -2.232408	  0.552748
 -0.307867	 -2.193364	  0.514505
 -0.381865	 -2.147072	  0.484819
 -0.446185	 -2.097347	  0.464888
 -0.495694	 -2.049500	  0.452255
 -0.531820	 -2.006555	  0.443696
 -0.560773	 -1.964910	  0.437044
 -0.587143	 -1.918541	  0.430915
 -0.613332	 -1.862608	  0.425397
 -0.639806	 -1.793146	  0.421068
 -0.666272	 -1.708915	  0.420378
 -0.690929	 -1.617682	  0.426299
 -0.712749	 -1.526941	  0.436576
 -0.728802	 -1.453339	  0.448433
 -0.739830	 -1.394007	  0.451190
 -0.746826	 -1.353410	  0.451982
 -0.751425	 -1.320608	  0.444065
 -0.755570	 -1.277377	  0.430128
 -0.759582	 -1.230851	  0.408714
 -0.759493	 -1.194721	  0.385448
 -0.794540	 -1.168801	  0.344815
 -0.820907	 -1.152164	  0.314039
 -0.847766	 -1.132949	  0.277008
 -0.874029	 -1.109937	  0.234905
 -0.898239	 -1.082143	  0.188561
 -0.918887	 -1.050500	  0.139574
 -0.936191	 -1.014382	  0.088619
 -0.949592	 -0.973747	  0.038963
 -0.958301	 -0.929626	 -0.006275
 -0.962379	 -0.882773	 -0.045465
 -0.961813	 -0.832691	 -0.078865
 -0.956712	 -0.777631	 -0.108286
 -0.946612	 -0.713717	 -0.136272
 -0.931881	 -0.637391	 -0.163616
 -0.916175	 -0.551421	 -0.187111
 -0.903212	 -0.465915	 -0.205366
 -0.896203	 -0.391945	 -0.219953
 -0.896443	 -0.331234	 -0.234317
 -0.901745	 -0.278153	 -0.250683
 -0.911285	 -0.229243	 -0.270467
 -0.924673	 -0.182898	 -0.294626
 -0.942842	 -0.137459	 -0.324741
 -0.967357	 -0.092799	 -0.360693
 -0.999551	 -0.050575	 -0.400579
 -1.039979	 -0.012437	 -0.441158
 -1.087875	  0.019708	 -0.480809
 -1.139869	  0.044311	 -0.519895
 -1.194412	  0.060874	 -0.559347
 -1.250430	  0.068748	 -0.598848
 -1.303607	  0.069717	 -0.636708
 -1.349106	  0.067050	 -0.671433
 -1.385834	  0.063447	 -0.701549
 -1.416371	  0.059930	 -0.727018
 -1.444066	  0.057354	 -0.749782
 -1.471748	  0.055886	 -0.771385
 -1.500798	  0.055982	 -0.793003
 -1.531818	  0.058299	 -0.815335
 -1.565796	  0.063123	 -0.838792
 -1.605275	  0.072161	 -0.865117
 -1.648075	  0.086590	 -0.892909
 -1.694884	  0.108216	 -0.922464
 -1.743698	  0.136889	 -0.951636
 -1.792422	  0.171785	 -0.978605
 -1.837803	  0.211948	 -1.003661
 -1.874507	  0.254053	 -1.027469
 -1.900318	  0.293203	 -1.051414
 -1.920051	  0.330984	 -1.077580
 -1.937966	  0.370208	 -1.105971
 -1.956713	  0.408153	 -1.132601
 -1.975840	  0.442331	 -1.157023
 -1.996141	  0.474556	 -1.180987
 -2.017556	  0.505972	 -1.205509
 -2.040091	  0.537024	 -1.230760
 -2.063996	  0.568115	 -1.256751
 -2.115305	  0.629481	 -1.307961
 -2.117128	  0.631608	 -1.309726
