 -2.279022	 -1.268723	 -1.541849
 -2.256458	 -1.256161	 -1.526584
 -2.216933	 -1.229642	 -1.545883
 -2.181858	 -1.196775	 -1.563922
 -2.148065	 -1.162705	 -1.581397
 -2.115653	 -1.127800	 -1.598951
 -2.083331	 -1.093025	 -1.615983
 -2.050062	 -1.059096	 -1.631994
 -2.015857	 -1.025800	 -1.646807
 -1.980868	 -0.993193	 -1.660471
 -1.946068	 -0.960525	 -1.673947
 -1.911544	 -0.927681	 -1.687490
 -1.876811	 -0.894394	 -1.700269
 -1.842094	 -0.859832	 -1.710542
 -1.807792	 -0.824614	 -1.720021
 -1.774327	 -0.788767	 -1.729841
 -1.742071	 -0.751811	 -1.739591
 -1.711635	 -0.713222	 -1.748829
 -1.683469	 -0.672832	 -1.758781
 -1.656437	 -0.631608	 -1.770038
 -1.628077	 -0.591603	 -1.782899
 -1.598526	 -0.553026	 -1.796575
 -1.568468	 -0.515359	 -1.810649
 -1.537823	 -0.478473	 -1.825751
 -1.506291	 -0.442515	 -1.841126
 -1.473199	 -0.407591	 -1.856508
 -1.437893	 -0.374492	 -1.871745
 -1.400578	 -0.343197	 -1.886947
 -1.362304	 -0.312926	 -1.901914
 -1.323950	 -0.283475	 -1.917049
 -1.285731	 -0.254573	 -1.932617
 -1.247487	 -0.225869	 -1.948425
 -1.209135	 -0.197170	 -1.963678
 -1.171516	 -0.168599	 -1.978161
 -1.134613	 -0.138792	 -1.992555
 -1.099886	 -0.106732	 -2.007366
 -1.067851	 -0.072462	 -2.022769
 -1.038720	 -0.036046	 -2.038892
 -1.011219	  0.002134	 -2.054473
 -0.983416	  0.041273	 -2.068876
 -0.953122	  0.078889	 -2.084217
 -0.918664	  0.111902	 -2.101613
 -0.880886	  0.139724	 -2.120593
 -0.841619	  0.164639	 -2.140020
 -0.802101	  0.188867	 -2.159437
 -0.762764	  0.213250	 -2.178526
 -0.723909	  0.238191	 -2.197855
 -0.685925	  0.264295	 -2.217542
 -0.648678	  0.291659	 -2.237222
 -0.612081	  0.319979	 -2.256930
 -0.576111	  0.349561	 -2.277255
 -0.541390	  0.380970	 -2.298128
 -0.508463	  0.413968	 -2.319093
 -0.477350	  0.448308	 -2.339995
 -0.447831	  0.483962	 -2.360006
 -0.419660	  0.520472	 -2.379068
 -0.391639	  0.556835	 -2.398456
 -0.363057	  0.593146	 -2.417790
 -0.333627	  0.629567	 -2.436220
 -0.303428	  0.666085	 -2.453497
 -0.272673	  0.702547	 -2.469831
 -0.241604	  0.738942	 -2.486021
 -0.210583	  0.776128	 -2.500944
 -0.179634	  0.813442	 -2.513830
 -0.148662	  0.850448	 -2.525561
 -0.117415	  0.887261	 -2.538035
 -0.085585	  0.923770	 -2.550736
 -0.052510	  0.960120	 -2.562984
 -0.017706	  0.995763	 -2.573978
  0.017741	  1.031015	 -2.583661
  0.053372	  1.065973	 -2.592152
  0.088757	  1.100294	 -2.599043
  0.123989	  1.134658	 -2.604668
  0.158884	  1.169405	 -2.608856
  0.193973	  1.204189	 -2.612298
  0.231855	  1.235116	 -2.621611
  0.272213	  1.259711	 -2.637177
  0.305615	  1.294445	 -2.647163
  0.337139	  1.323021	 -2.671320
  0.340511	  1.336251	 -2.698034
