  0.396430	 -0.313626	  2.443725
  0.399735	 -0.313395	  2.447855
  0.372678	 -0.315287	  2.414045
  0.340641	 -0.314103	  2.375489
  0.307504	 -0.310954	  2.337024
  0.274028	 -0.308806	  2.298881
  0.242477	 -0.307970	  2.263741
  0.214324	 -0.304732	  2.233607
  0.188607	 -0.295180	  2.207280
  0.155357	 -0.267303	  2.180169
  0.124850	 -0.209168	  2.185238
  0.108086	 -0.132978	  2.207630
  0.104362	 -0.059362	  2.212144
  0.116456	  0.008334	  2.164307
  0.070584	  0.094109	  2.025820
 -0.067952	  0.159550	  1.903206
 -0.214787	  0.104305	  1.802884
 -0.291174	 -0.024593	  1.714380
 -0.309425	 -0.119866	  1.660325
 -0.315452	 -0.166557	  1.640223
 -0.320613	 -0.204491	  1.631419
 -0.328085	 -0.255428	  1.627041
 -0.337838	 -0.323903	  1.626271
 -0.353376	 -0.379786	  1.621497
 -0.377598	 -0.410549	  1.603129
 -0.409480	 -0.424681	  1.573394
 -0.446909	 -0.430837	  1.540228
 -0.485191	 -0.436955	  1.508260
 -0.522514	 -0.443953	  1.478388
 -0.560411	 -0.449865	  1.448482
 -0.599910	 -0.455271	  1.417445
 -0.638995	 -0.462560	  1.384420
 -0.676507	 -0.470860	  1.351026
 -0.711805	 -0.478248	  1.319612
 -0.749134	 -0.482526	  1.288792
 -0.799169	 -0.479483	  1.252642
 -0.872532	 -0.441216	  1.210802
 -0.936768	 -0.360766	  1.174790
 -0.978073	 -0.282123	  1.137075
 -1.005051	 -0.214756	  1.086564
 -1.021230	 -0.183784	  1.045499
 -1.038938	 -0.171205	  1.013039
 -1.067125	 -0.165968	  0.972148
 -1.095177	 -0.169704	  0.936702
 -1.128070	 -0.182667	  0.899555
 -1.151550	 -0.199576	  0.876338
 -1.168487	 -0.218691	  0.863268
 -1.200474	 -0.269297	  0.842924
 -1.227323	 -0.324323	  0.827219
 -1.245287	 -0.374255	  0.819516
 -1.266907	 -0.458791	  0.808875
 -1.311814	 -0.556145	  0.748719
 -1.350370	 -0.621947	  0.665740
 -1.381451	 -0.650075	  0.600956
 -1.406876	 -0.666689	  0.552415
 -1.428610	 -0.680172	  0.513515
 -1.445817	 -0.692599	  0.483909
 -1.461840	 -0.708275	  0.456772
 -1.481620	 -0.737134	  0.422713
 -1.500904	 -0.793808	  0.382516
 -1.509807	 -0.857660	  0.357058
 -1.523074	 -0.899134	  0.335017
 -1.570275	 -0.950655	  0.291788
 -1.653132	 -0.993025	  0.254291
 -1.728787	 -1.014862	  0.229494
 -1.799531	 -1.025096	  0.191391
 -1.862817	 -1.028272	  0.137383
 -1.914936	 -1.030057	  0.073026
 -1.936617	 -1.023432	  0.036632
 -1.953148	 -0.997133	  0.007210
 -1.972033	 -0.937237	 -0.027146
 -1.996837	 -0.864533	 -0.069676
 -2.021393	 -0.812155	 -0.112676
 -2.046298	 -0.776238	 -0.154652
 -2.073070	 -0.755239	 -0.193561
 -2.102423	 -0.746275	 -0.232216
 -2.135391	 -0.746873	 -0.271036
 -2.169718	 -0.752609	 -0.308422
 -2.203573	 -0.760956	 -0.344743
 -2.235834	 -0.770073	 -0.380782
 -2.264922	 -0.778414	 -0.416879
 -2.319748	 -0.792545	 -0.490551
 -2.323926	 -0.793555	 -0.496019
