 -0.468137	  1.855803	  1.645179
 -0.485891	  1.898824	  1.653484
 -0.485080	  1.896859	  1.653105
 -0.466644	  1.855548	  1.643845
 -0.449678	  1.822740	  1.636299
 -0.436800	  1.801492	  1.633053
 -0.405921	  1.765829	  1.640359
 -0.368349	  1.729669	  1.651024
 -0.315300	  1.686998	  1.664172
 -0.256442	  1.647397	  1.678421
 -0.200358	  1.609628	  1.693598
 -0.149546	  1.571415	  1.708106
 -0.101954	  1.527791	  1.721160
 -0.058978	  1.475485	  1.731932
 -0.019198	  1.409963	  1.738957
  0.017487	  1.327646	  1.738303
  0.047074	  1.236297	  1.723106
  0.065416	  1.153172	  1.691569
  0.077800	  1.087106	  1.651102
  0.087352	  1.033754	  1.602130
  0.092955	  0.990630	  1.550597
  0.093517	  0.953949	  1.498437
  0.088106	  0.924650	  1.450190
  0.080790	  0.903392	  1.417903
  0.073286	  0.853815	  1.371959
  0.046394	  0.787685	  1.322661
  0.037834	  0.751750	  1.303484
  0.057848	  0.684409	  1.276600
  0.074651	  0.637767	  1.255177
  0.091327	  0.587890	  1.229426
  0.105252	  0.537286	  1.202879
  0.116037	  0.487133	  1.176831
  0.123255	  0.438743	  1.148724
  0.125568	  0.392808	  1.116706
  0.121605	  0.351240	  1.080357
  0.111652	  0.311162	  1.037763
  0.095118	  0.261433	  0.982194
  0.076274	  0.195614	  0.919874
  0.061475	  0.132389	  0.871138
  0.058613	  0.090779	  0.845623
  0.062119	  0.062316	  0.831293
  0.081027	  0.021496	  0.819945
  0.098414	 -0.005694	  0.825988
  0.132519	 -0.031106	  0.858811
  0.202314	 -0.068253	  0.913034
  0.296227	 -0.124272	  0.966596
  0.385021	 -0.184548	  0.994137
  0.454413	 -0.237786	  1.001516
  0.510880	 -0.287917	  0.998592
  0.560753	 -0.339547	  0.987620
  0.605784	 -0.394142	  0.968561
  0.644956	 -0.452617	  0.942137
  0.674930	 -0.511809	  0.911256
  0.695087	 -0.565832	  0.882688
  0.709838	 -0.615016	  0.859838
  0.721589	 -0.660479	  0.842281
  0.732056	 -0.703140	  0.829578
  0.742082	 -0.741632	  0.821198
  0.754457	 -0.780144	  0.814417
  0.770799	 -0.824465	  0.806104
  0.788897	 -0.873455	  0.796289
  0.806050	 -0.924728	  0.786671
  0.820712	 -0.974548	  0.778339
  0.834196	 -1.019731	  0.769916
  0.847385	 -1.059783	  0.761812
  0.862361	 -1.096959	  0.754035
  0.882075	 -1.138026	  0.744044
  0.903883	 -1.181087	  0.730617
  0.924132	 -1.220032	  0.717808
  0.943451	 -1.258802	  0.711887
  0.959778	 -1.303474	  0.720388
  0.969888	 -1.360583	  0.757001
  0.978352	 -1.439736	  0.813986
  0.999219	 -1.545574	  0.860167
  1.013597	 -1.657316	  0.876259
  1.014306	 -1.735564	  0.876191
  1.014103	 -1.782689	  0.866605
  1.016363	 -1.814917	  0.848859
  1.023843	 -1.846051	  0.814459
  1.046518	 -1.873304	  0.755291
  1.093342	 -1.885047	  0.686176
  1.139752	 -1.893907	  0.629573
  1.170355	 -1.910557	  0.595269
  1.194745	 -1.938902	  0.569987
  1.214511	 -1.978934	  0.549567
  1.228863	 -2.019022	  0.535361
  1.241435	 -2.054267	  0.526158
  1.255217	 -2.090045	  0.519750
  1.278566	 -2.151153	  0.513336
  1.289226	 -2.181933	  0.510276
