 -0.606063	  0.431171	  2.937291
 -0.600063	  0.426902	  2.908209
 -0.583841	  0.450762	  2.868915
 -0.566736	  0.475345	  2.829673
 -0.547568	  0.501857	  2.791821
 -0.524503	  0.525867	  2.753611
 -0.502067	  0.549155	  2.714235
 -0.482501	  0.572508	  2.674153
 -0.464920	  0.596451	  2.633741
 -0.447794	  0.620038	  2.593498
 -0.430992	  0.643073	  2.552668
 -0.414703	  0.665905	  2.511433
 -0.399131	  0.689177	  2.470238
 -0.383787	  0.712971	  2.429975
 -0.368446	  0.737251	  2.390530
 -0.352360	  0.762701	  2.350612
 -0.336019	  0.788217	  2.310590
 -0.318744	  0.813895	  2.270955
 -0.300526	  0.839501	  2.231071
 -0.281360	  0.864071	  2.191120
 -0.262010	  0.887692	  2.150558
 -0.242812	  0.910278	  2.109799
 -0.225341	  0.931418	  2.068539
 -0.208037	  0.951373	  2.027503
 -0.191906	  0.970378	  1.985717
 -0.175904	  0.989528	  1.942203
 -0.161760	  1.008846	  1.898846
 -0.148730	  1.028427	  1.854708
 -0.136731	  1.047413	  1.811868
 -0.122147	  1.066966	  1.771918
 -0.098699	  1.087300	  1.741346
 -0.063344	  1.108542	  1.719942
 -0.010194	  1.135672	  1.699685
  0.056688	  1.169493	  1.673016
  0.121003	  1.202253	  1.640256
  0.173563	  1.233775	  1.606096
  0.207976	  1.257836	  1.573775
  0.230515	  1.279735	  1.540622
  0.242976	  1.298759	  1.501351
  0.243767	  1.317755	  1.456705
  0.231093	  1.335296	  1.399993
  0.205821	  1.352137	  1.331336
  0.182508	  1.367496	  1.259583
  0.169293	  1.382455	  1.194146
  0.165560	  1.396487	  1.144334
  0.167267	  1.410603	  1.101988
  0.173745	  1.427555	  1.058972
  0.183230	  1.448354	  1.015131
  0.194134	  1.472507	  0.972638
  0.206397	  1.499981	  0.931448
  0.219775	  1.528813	  0.892150
  0.235351	  1.558791	  0.855432
  0.253799	  1.588833	  0.820895
  0.275223	  1.618910	  0.789597
  0.298475	  1.647876	  0.761849
  0.323278	  1.677381	  0.736957
  0.353925	  1.713836	  0.711520
  0.395101	  1.763593	  0.683626
  0.444816	  1.825170	  0.657816
  0.501085	  1.897835	  0.639162
  0.554220	  1.974732	  0.631541
  0.593862	  2.051316	  0.633069
  0.617889	  2.126596	  0.631374
  0.640377	  2.189992	  0.619775
  0.666218	  2.245396	  0.605909
  0.689264	  2.280246	  0.583287
  0.706723	  2.288465	  0.541506
  0.705817	  2.274638	  0.489510
  0.684300	  2.242039	  0.424134
  0.655414	  2.203573	  0.352718
  0.628046	  2.166780	  0.273421
  0.601357	  2.139343	  0.185932
  0.582964	  2.126416	  0.094746
  0.575750	  2.126730	  0.010485
  0.576278	  2.137034	 -0.064317
  0.581923	  2.151155	 -0.124608
  0.590487	  2.166554	 -0.175443
  0.602476	  2.182882	 -0.223130
  0.617863	  2.200570	 -0.268614
  0.637167	  2.218448	 -0.310755
  0.660319	  2.235749	 -0.350494
  0.685717	  2.252798	 -0.389326
  0.712061	  2.269925	 -0.429349
  0.738052	  2.286334	 -0.470373
  0.762759	  2.303977	 -0.511420
  0.786086	  2.323490	 -0.551348
  0.807426	  2.344733	 -0.590694
  0.826443	  2.367312	 -0.630108
  0.844191	  2.390118	 -0.670193
  0.860201	  2.411700	 -0.711977
  0.875319	  2.433162	 -0.754170
  0.890246	  2.455680	 -0.796227
  0.904987	  2.479877	 -0.838285
  0.915831	  2.501281	 -0.883260
  0.930592	  2.527444	 -0.924323
  0.945719	  2.552465	 -0.965176
  0.956561	  2.575517	 -1.007781
  0.973216	  2.593064	 -1.050886
  0.987818	  2.613016	 -1.093784
  0.997696	  2.639146	 -1.104722
