 -1.592404	  0.805426	 -1.681266
 -1.612716	  0.812181	 -1.687996
 -1.592600	  0.802801	 -1.686825
 -1.576366	  0.799414	 -1.682063
 -1.556199	  0.794837	 -1.678518
 -1.535576	  0.787616	 -1.670882
 -1.520069	  0.783103	 -1.661309
 -1.504821	  0.778834	 -1.653789
 -1.484707	  0.773680	 -1.647434
 -1.465984	  0.769134	 -1.641979
 -1.447710	  0.767243	 -1.635848
 -1.428287	  0.767820	 -1.629622
 -1.406035	  0.760894	 -1.625434
 -1.389633	  0.750963	 -1.623806
 -1.372279	  0.747005	 -1.620098
 -1.348718	  0.743199	 -1.616153
 -1.333086	  0.734116	 -1.615135
 -1.316872	  0.723818	 -1.614313
 -1.295009	  0.712541	 -1.613122
 -1.279656	  0.709911	 -1.611278
 -1.260616	  0.702250	 -1.610253
 -1.240727	  0.692758	 -1.608954
 -1.222134	  0.689854	 -1.606545
 -1.201483	  0.685836	 -1.603799
 -1.183982	  0.676963	 -1.602646
 -1.165705	  0.670542	 -1.600827
 -1.143514	  0.664359	 -1.597624
 -1.130909	  0.654268	 -1.596257
 -1.114734	  0.642126	 -1.592423
 -1.093428	  0.633442	 -1.587842
 -1.071745	  0.631413	 -1.585978
 -1.055409	  0.623817	 -1.585931
 -1.039417	  0.612589	 -1.582563
 -1.018032	  0.607242	 -1.576188
 -0.998863	  0.609450	 -1.568264
 -0.986087	  0.611260	 -1.557800
 -0.971334	  0.616593	 -1.543306
 -0.956757	  0.625142	 -1.531859
 -0.942163	  0.627600	 -1.518878
 -0.932421	  0.628783	 -1.501958
 -0.930242	  0.633835	 -1.484194
 -0.929432	  0.645145	 -1.463684
 -0.923513	  0.650693	 -1.450272
 -0.913703	  0.658532	 -1.430388
 -0.905848	  0.668195	 -1.411214
 -0.905560	  0.676933	 -1.397730
 -0.908514	  0.686012	 -1.379745
 -0.903537	  0.698992	 -1.359308
 -0.892494	  0.709760	 -1.344821
 -0.881275	  0.716996	 -1.331913
 -0.874775	  0.724698	 -1.311900
 -0.873210	  0.730340	 -1.292386
 -0.870952	  0.737135	 -1.276724
 -0.860266	  0.745932	 -1.259002
 -0.849967	  0.754721	 -1.242295
 -0.845352	  0.758812	 -1.227214
 -0.842165	  0.759973	 -1.206956
 -0.830544	  0.759148	 -1.184702
 -0.821455	  0.760057	 -1.167232
 -0.817119	  0.761848	 -1.150370
 -0.813296	  0.763608	 -1.129287
 -0.802889	  0.767712	 -1.112477
 -0.787926	  0.771218	 -1.097699
 -0.775453	  0.770688	 -1.083291
 -0.763789	  0.767184	 -1.063227
 -0.754209	  0.764195	 -1.045758
 -0.745130	  0.761532	 -1.030175
 -0.734399	  0.757513	 -1.014107
 -0.720111	  0.750241	 -0.996545
 -0.709581	  0.742312	 -0.984651
 -0.699072	  0.735422	 -0.969125
 -0.688768	  0.732995	 -0.952244
 -0.677725	  0.732812	 -0.936653
 -0.659128	  0.723324	 -0.922960
 -0.646706	  0.716069	 -0.909256
 -0.637264	  0.705976	 -0.900006
 -0.621816	  0.700315	 -0.880174
 -0.607976	  0.693821	 -0.870432
 -0.593417	  0.686241	 -0.863404
 -0.577176	  0.676971	 -0.854989
 -0.560850	  0.671832	 -0.844222
 -0.546548	  0.666763	 -0.831136
 -0.529695	  0.650378	 -0.818952
 -0.519181	  0.636282	 -0.816344
 -0.503621	  0.620825	 -0.814976
 -0.482949	  0.611902	 -0.811452
 -0.468483	  0.610598	 -0.803795
 -0.448325	  0.604528	 -0.793848
 -0.430555	  0.593479	 -0.786971
 -0.417979	  0.582184	 -0.783548
 -0.403105	  0.570526	 -0.784137
 -0.381783	  0.560764	 -0.783527
 -0.363479	  0.553096	 -0.779628
 -0.346340	  0.543898	 -0.776391
 -0.329416	  0.535218	 -0.774585
 -0.311193	  0.526764	 -0.770535
 -0.293443	  0.516192	 -0.767974
 -0.278193	  0.504749	 -0.770950
 -0.260710	  0.496394	 -0.777202
 -0.244431	  0.491239	 -0.782450
 -0.226062	  0.485096	 -0.786539
 -0.207243	  0.474837	 -0.792318
 -0.192119	  0.466150	 -0.795968
 -0.173962	  0.456061	 -0.797441
 -0.156161	  0.444937	 -0.798520
 -0.137676	  0.435465	 -0.802171
 -0.120974	  0.430858	 -0.810308
 -0.103982	  0.428205	 -0.821408
 -0.091500	  0.424693	 -0.834845
 -0.070143	  0.414437	 -0.844085
 -0.053294	  0.402729	 -0.852228
 -0.041320	  0.396716	 -0.850103
 -0.027844	  0.389339	 -0.864216
 -0.015127	  0.387982	 -0.879429
  0.006371	  0.387238	 -0.898302
  0.022305	  0.381395	 -0.907183
  0.037457	  0.373558	 -0.914030
  0.051933	  0.361350	 -0.920497
  0.064105	  0.351083	 -0.933459
  0.075140	  0.343550	 -0.950435
  0.080968	  0.336221	 -0.966055
  0.090377	  0.325064	 -0.982255
  0.103814	  0.317094	 -0.995707
  0.118974	  0.309524	 -1.007612
  0.131203	  0.300012	 -1.016999
  0.142508	  0.286043	 -1.033841
  0.151190	  0.278813	 -1.057726
  0.153901	  0.273439	 -1.062979
  0.165318	  0.264243	 -1.078169
  0.176567	  0.249967	 -1.088505
  0.180971	  0.235161	 -1.112223
  0.181292	  0.225873	 -1.132736
  0.179675	  0.222077	 -1.151088
  0.187352	  0.219004	 -1.170728
  0.199814	  0.219743	 -1.184138
  0.219264	  0.216501	 -1.195136
  0.235001	  0.212314	 -1.211300
  0.247315	  0.205727	 -1.224504
  0.263626	  0.202885	 -1.234385
  0.270961	  0.199190	 -1.247340
  0.289175	  0.198294	 -1.252144
  0.306347	  0.196579	 -1.260264
  0.326174	  0.193568	 -1.262787
  0.349822	  0.191464	 -1.264826
  0.358866	  0.189198	 -1.271784
  0.379538	  0.191827	 -1.272703
  0.409284	  0.200414	 -1.271342
  0.424368	  0.202458	 -1.263916
  0.435940	  0.206722	 -1.264074
  0.456590	  0.204481	 -1.257924
  0.479483	  0.207649	 -1.252915
  0.500189	  0.207577	 -1.245010
  0.516075	  0.205830	 -1.233437
  0.528443	  0.204383	 -1.218031
  0.542242	  0.206182	 -1.199232
  0.552157	  0.205352	 -1.187781
  0.572931	  0.202557	 -1.176110
  0.590473	  0.205121	 -1.166417
  0.605160	  0.205521	 -1.156873
  0.626589	  0.202409	 -1.144897
  0.642107	  0.203428	 -1.138820
  0.659941	  0.210458	 -1.131716
  0.682014	  0.219700	 -1.125377
  0.699331	  0.222113	 -1.114477
  0.712439	  0.219899	 -1.099394
  0.727347	  0.217281	 -1.089378
  0.749280	  0.217945	 -1.082582
  0.768828	  0.221892	 -1.073872
  0.784892	  0.229733	 -1.067173
  0.802447	  0.237942	 -1.064757
  0.822632	  0.244290	 -1.063198
  0.842871	  0.250474	 -1.061930
  0.860809	  0.258901	 -1.056484
  0.876268	  0.270543	 -1.047938
  0.888604	  0.281101	 -1.038732
  0.906349	  0.288968	 -1.030845
  0.926432	  0.294043	 -1.026643
  0.944821	  0.300727	 -1.026810
  0.963330	  0.310014	 -1.026566
  0.979812	  0.318546	 -1.027693
  0.999772	  0.328051	 -1.029169
  1.018333	  0.336305	 -1.027360
  1.036354	  0.341657	 -1.024419
  1.053783	  0.344171	 -1.023105
  1.074173	  0.346695	 -1.021491
  1.090799	  0.352348	 -1.020878
  1.109782	  0.350958	 -1.021609
  1.129637	  0.345105	 -1.022983
  1.147740	  0.342411	 -1.024926
  1.169803	  0.337299	 -1.026813
  1.186617	  0.328922	 -1.029250
  1.201583	  0.319414	 -1.030800
  1.225828	  0.305978	 -1.023642
  1.240156	  0.299112	 -1.015015
  1.253395	  0.289331	 -1.007942
  1.264481	  0.272275	 -1.003647
  1.275603	  0.254103	 -0.998988
  1.285259	  0.240292	 -0.997276
  1.292544	  0.221457	 -0.998320
  1.301385	  0.200593	 -0.997134
  1.311148	  0.186442	 -0.995861
  1.320538	  0.169709	 -0.995581
  1.331795	  0.148164	 -0.992867
  1.339505	  0.134391	 -0.992112
  1.345799	  0.114756	 -0.994428
  1.351420	  0.093256	 -0.994424
  1.361770	  0.073104	 -0.989277
  1.374613	  0.056862	 -0.984463
  1.381829	  0.044595	 -0.984271
  1.395344	  0.026823	 -0.988630
  1.412435	  0.010496	 -0.989812
  1.434101	  0.002540	 -0.983502
  1.457842	 -0.000758	 -0.968643
  1.472589	 -0.003808	 -0.959031
  1.488185	 -0.014143	 -0.955767
  1.503739	 -0.027254	 -0.955972
  1.512166	 -0.043535	 -0.952680
  1.526267	 -0.062839	 -0.944071
  1.544402	 -0.075339	 -0.940773
  1.562404	 -0.078873	 -0.940271
  1.582793	 -0.079957	 -0.938391
  1.603948	 -0.085481	 -0.936919
  1.617696	 -0.095682	 -0.932889
  1.635236	 -0.108837	 -0.929693
  1.659267	 -0.115886	 -0.931934
  1.678324	 -0.112455	 -0.931872
  1.698311	 -0.109460	 -0.931167
  1.720191	 -0.116087	 -0.931892
  1.738187	 -0.124052	 -0.928819
  1.754043	 -0.134677	 -0.917854
  1.772439	 -0.141332	 -0.903855
  1.793720	 -0.140217	 -0.894366
  1.808825	 -0.137654	 -0.891313
  1.831405	 -0.142698	 -0.885296
  1.844558	 -0.155174	 -0.879398
  1.861235	 -0.166248	 -0.870204
  1.877193	 -0.174122	 -0.861804
  1.892927	 -0.184841	 -0.855504
  1.911045	 -0.197088	 -0.846243
  1.926701	 -0.200424	 -0.836675
  1.944034	 -0.202380	 -0.827744
  1.962645	 -0.206169	 -0.821572
  1.981272	 -0.212566	 -0.815071
  1.999497	 -0.218191	 -0.809030
  2.018209	 -0.222643	 -0.803548
  2.036933	 -0.227060	 -0.798082
  2.055888	 -0.230736	 -0.792871
  2.074963	 -0.233982	 -0.787811
  2.094048	 -0.237202	 -0.782771
  2.113472	 -0.239484	 -0.778597
  2.132915	 -0.241714	 -0.774471
  2.152365	 -0.243936	 -0.770391
  2.172201	 -0.245749	 -0.768630
  2.192065	 -0.247532	 -0.767134
  2.211797	 -0.250223	 -0.765486
  2.229838	 -0.258430	 -0.762943
  2.247862	 -0.266699	 -0.760367
  2.266670	 -0.272568	 -0.756950
  2.285551	 -0.278150	 -0.753439
  2.304459	 -0.283697	 -0.749914
  2.323860	 -0.287581	 -0.745959
  2.343129	 -0.291172	 -0.741981
