  0.904568	 -2.357370	  0.099027
  0.904538	 -2.374945	  0.104453
  0.904569	 -2.355872	  0.098564
  0.904654	 -2.337477	  0.092763
  0.908340	 -2.319774	  0.086841
  0.918925	 -2.304017	  0.076850
  0.918826	 -2.284387	  0.058250
  0.905562	 -2.263886	  0.047777
  0.896609	 -2.249865	  0.047142
  0.884027	 -2.229157	  0.047813
  0.876308	 -2.204458	  0.042897
  0.873856	 -2.189558	  0.035897
  0.871411	 -2.168958	  0.026999
  0.870077	 -2.154424	  0.017959
  0.868698	 -2.140754	  0.004082
  0.866631	 -2.121941	 -0.010619
  0.868269	 -2.101696	 -0.017584
  0.873990	 -2.084855	 -0.017869
  0.881035	 -2.056679	 -0.021575
  0.881616	 -2.038986	 -0.030448
  0.880580	 -2.026912	 -0.038663
  0.877206	 -2.008067	 -0.053036
  0.874933	 -1.992914	 -0.063241
  0.872817	 -1.976161	 -0.074389
  0.870813	 -1.958101	 -0.085458
  0.868203	 -1.943943	 -0.095454
  0.864293	 -1.920930	 -0.109257
  0.866989	 -1.899294	 -0.113131
  0.870727	 -1.884264	 -0.112715
  0.875929	 -1.860050	 -0.114299
  0.875322	 -1.841121	 -0.120358
  0.871213	 -1.825236	 -0.128674
  0.866726	 -1.805986	 -0.138424
  0.861760	 -1.792163	 -0.146953
  0.851541	 -1.770627	 -0.162182
  0.850032	 -1.744368	 -0.166388
  0.851982	 -1.730538	 -0.164559
  0.858277	 -1.711655	 -0.159759
  0.859075	 -1.689513	 -0.160499
  0.857003	 -1.669072	 -0.164298
  0.854060	 -1.649608	 -0.168066
  0.851246	 -1.630389	 -0.171395
  0.852186	 -1.610431	 -0.172133
  0.853078	 -1.588804	 -0.171138
  0.849378	 -1.568898	 -0.167589
  0.837262	 -1.546628	 -0.165459
  0.828504	 -1.528631	 -0.168789
  0.824786	 -1.511864	 -0.173225
  0.826731	 -1.493380	 -0.178191
  0.829608	 -1.473187	 -0.179098
  0.826523	 -1.452165	 -0.177941
  0.819413	 -1.428479	 -0.180098
  0.814310	 -1.410057	 -0.185481
  0.811249	 -1.396012	 -0.189452
  0.811888	 -1.375581	 -0.192601
  0.808869	 -1.352439	 -0.193718
  0.798895	 -1.329148	 -0.197685
  0.788645	 -1.310944	 -0.208151
  0.780796	 -1.297962	 -0.221933
  0.771009	 -1.287384	 -0.238857
  0.758994	 -1.273256	 -0.252462
  0.748911	 -1.255317	 -0.260311
  0.744502	 -1.244090	 -0.264367
  0.741751	 -1.222278	 -0.268431
  0.744090	 -1.198588	 -0.274848
  0.745961	 -1.183698	 -0.280231
  0.746255	 -1.169321	 -0.288293
  0.749723	 -1.146655	 -0.296053
  0.751165	 -1.130386	 -0.299927
  0.753732	 -1.113969	 -0.302966
  0.755665	 -1.089362	 -0.306317
  0.751697	 -1.069296	 -0.310352
  0.749835	 -1.056394	 -0.312347
  0.745110	 -1.036293	 -0.319107
  0.743364	 -1.016357	 -0.327546
  0.744242	 -0.998032	 -0.334654
  0.749715	 -0.978440	 -0.339209
  0.754335	 -0.958068	 -0.341121
  0.756061	 -0.936707	 -0.340277
  0.757462	 -0.911785	 -0.338745
  0.751235	 -0.883868	 -0.342341
  0.741049	 -0.862753	 -0.347092
  0.737849	 -0.855433	 -0.351145
  0.725262	 -0.827865	 -0.365781
  0.717399	 -0.812063	 -0.375399
  0.714369	 -0.806594	 -0.379090
  0.709605	 -0.784787	 -0.389108
  0.703634	 -0.762885	 -0.402001
  0.698249	 -0.754074	 -0.408573
  0.685267	 -0.731969	 -0.418870
  0.676221	 -0.714360	 -0.422354
  0.665464	 -0.695382	 -0.428674
  0.657805	 -0.676377	 -0.436975
  0.651652	 -0.661517	 -0.447328
  0.648018	 -0.652803	 -0.457328
  0.643418	 -0.639181	 -0.470132
  0.636904	 -0.620822	 -0.484837
  0.627248	 -0.605549	 -0.505373
  0.622686	 -0.595918	 -0.522918
  0.619264	 -0.584605	 -0.537542
  0.618331	 -0.567534	 -0.545350
  0.616485	 -0.545906	 -0.548296
  0.614569	 -0.524530	 -0.551823
  0.612141	 -0.505904	 -0.561113
  0.609582	 -0.489405	 -0.570431
  0.607172	 -0.470119	 -0.581338
  0.604884	 -0.454027	 -0.589964
  0.604904	 -0.437576	 -0.596712
  0.606040	 -0.416414	 -0.602053
  0.604867	 -0.398173	 -0.603591
  0.601583	 -0.376934	 -0.604246
  0.598277	 -0.352587	 -0.610592
  0.596647	 -0.333807	 -0.619671
  0.595803	 -0.321351	 -0.626531
  0.594725	 -0.301507	 -0.634865
  0.595297	 -0.276736	 -0.645367
  0.595939	 -0.261247	 -0.655881
  0.594808	 -0.251668	 -0.662681
  0.588238	 -0.230689	 -0.680548
  0.583661	 -0.216058	 -0.689569
  0.582249	 -0.196959	 -0.702874
  0.578865	 -0.184308	 -0.710851
  0.574270	 -0.166226	 -0.720899
  0.573982	 -0.139766	 -0.736916
  0.574518	 -0.131400	 -0.741009
  0.575627	 -0.113215	 -0.748119
  0.574450	 -0.086369	 -0.752380
  0.574774	 -0.070955	 -0.757443
  0.578170	 -0.054335	 -0.768000
  0.579894	 -0.038510	 -0.778132
  0.578151	 -0.019019	 -0.788056
  0.579086	 -0.002020	 -0.795779
  0.580976	  0.014115	 -0.806278
  0.577467	  0.033576	 -0.814046
  0.565330	  0.061405	 -0.826516
  0.560004	  0.071160	 -0.831935
  0.549677	  0.083228	 -0.836994
  0.533915	  0.104078	 -0.843715
  0.530991	  0.125851	 -0.847085
  0.532779	  0.137466	 -0.846471
  0.532478	  0.158757	 -0.840422
  0.528752	  0.194685	 -0.837037
  0.529037	  0.220115	 -0.839368
  0.530431	  0.233426	 -0.840739
  0.531758	  0.247483	 -0.844138
  0.529451	  0.264422	 -0.847269
  0.519655	  0.288714	 -0.855856
  0.511527	  0.308250	 -0.863801
  0.509249	  0.323455	 -0.873627
  0.511812	  0.343529	 -0.882102
  0.519336	  0.363609	 -0.887064
  0.527923	  0.381150	 -0.891784
  0.530503	  0.396142	 -0.897812
  0.523444	  0.416715	 -0.908229
  0.517182	  0.440087	 -0.914210
  0.514273	  0.455866	 -0.915897
  0.513896	  0.474282	 -0.919512
  0.519292	  0.493728	 -0.929676
  0.521879	  0.507571	 -0.940122
  0.521757	  0.527988	 -0.953704
  0.519783	  0.548643	 -0.962423
  0.514126	  0.570785	 -0.965615
  0.502424	  0.596702	 -0.967818
  0.491983	  0.612538	 -0.971052
  0.484916	  0.623203	 -0.976826
  0.472788	  0.639333	 -0.979672
  0.462519	  0.654843	 -0.984897
  0.453518	  0.672414	 -0.993670
  0.447559	  0.689065	 -0.999255
  0.439681	  0.717426	 -1.005046
  0.436660	  0.728314	 -1.006611
  0.433592	  0.744677	 -1.009714
  0.425775	  0.773976	 -1.015173
  0.422841	  0.785105	 -1.016281
  0.414584	  0.806537	 -1.017433
  0.405766	  0.828246	 -1.023957
  0.401233	  0.844746	 -1.025728
  0.398437	  0.856998	 -1.027452
  0.393439	  0.882581	 -1.036056
  0.389647	  0.900130	 -1.040139
  0.388319	  0.921597	 -1.042863
  0.387008	  0.937715	 -1.048676
  0.383718	  0.952463	 -1.054919
  0.379111	  0.972312	 -1.059477
  0.375333	  0.991949	 -1.063166
  0.370737	  1.013603	 -1.071504
  0.364350	  1.033045	 -1.081363
  0.358961	  1.050218	 -1.085890
  0.356939	  1.070132	 -1.092775
  0.356122	  1.082524	 -1.099262
  0.358129	  1.101476	 -1.103166
  0.350225	  1.122146	 -1.106042
  0.346848	  1.141202	 -1.113587
  0.344176	  1.158249	 -1.127038
  0.344013	  1.170387	 -1.138928
  0.342601	  1.193381	 -1.145548
  0.338880	  1.215043	 -1.145470
  0.337704	  1.234521	 -1.146488
  0.334027	  1.253865	 -1.150345
  0.325081	  1.272020	 -1.151701
  0.316529	  1.290028	 -1.151341
  0.307616	  1.308016	 -1.152012
  0.299346	  1.326152	 -1.151558
  0.290540	  1.344184	 -1.152080
  0.281977	  1.362240	 -1.152263
  0.273110	  1.380167	 -1.153087
  0.263873	  1.397407	 -1.150769
  0.252827	  1.413951	 -1.145415
  0.245186	  1.430167	 -1.139564
  0.240383	  1.446029	 -1.130606
  0.236866	  1.471029	 -1.127988
  0.240963	  1.495479	 -1.120852
  0.244880	  1.508339	 -1.121752
  0.250108	  1.524301	 -1.133346
  0.252475	  1.534681	 -1.134238
  0.257636	  1.549054	 -1.138070
  0.261473	  1.558657	 -1.142159
  0.260989	  1.568353	 -1.144320
  0.260718	  1.578269	 -1.150128
  0.260427	  1.605560	 -1.166111
  0.259293	  1.616202	 -1.170593
  0.257209	  1.629387	 -1.175611
  0.253927	  1.661369	 -1.183952
  0.249369	  1.680552	 -1.193597
  0.245274	  1.688985	 -1.199966
  0.238230	  1.709061	 -1.208327
  0.240386	  1.729897	 -1.221563
  0.238341	  1.747966	 -1.228645
  0.237006	  1.765880	 -1.235465
  0.231686	  1.780481	 -1.239658
  0.221608	  1.800623	 -1.247940
  0.216759	  1.821835	 -1.255363
  0.213772	  1.838420	 -1.262099
  0.206511	  1.856876	 -1.271946
  0.207417	  1.883943	 -1.283356
  0.213529	  1.897600	 -1.288086
  0.215661	  1.910664	 -1.293831
  0.211743	  1.931553	 -1.301666
  0.203470	  1.948256	 -1.310823
  0.196987	  1.962400	 -1.318625
  0.193495	  1.987308	 -1.327696
  0.199338	  2.011934	 -1.334126
  0.198889	  2.022367	 -1.340473
  0.197484	  2.039070	 -1.351580
  0.189637	  2.060207	 -1.357808
  0.177719	  2.085665	 -1.343846
  0.175391	  2.104991	 -1.348440
