  0.848214	 -2.351818	 -1.711837
  0.839816	 -2.328532	 -1.694888
  0.840940	 -2.275489	 -1.683634
  0.844446	 -2.224775	 -1.671274
  0.838189	 -2.177233	 -1.655788
  0.837202	 -2.127611	 -1.645797
  0.834155	 -2.078171	 -1.636010
  0.834062	 -2.030257	 -1.624505
  0.825673	 -1.983091	 -1.614912
  0.818391	 -1.936043	 -1.603961
  0.812397	 -1.887684	 -1.593585
  0.807596	 -1.837931	 -1.584845
  0.804082	 -1.787376	 -1.575252
  0.803252	 -1.737901	 -1.564714
  0.805721	 -1.689314	 -1.552329
  0.810726	 -1.641159	 -1.538206
  0.815873	 -1.593750	 -1.524214
  0.819594	 -1.548079	 -1.509500
  0.822194	 -1.500747	 -1.495491
  0.821711	 -1.451620	 -1.483652
  0.818421	 -1.402084	 -1.472570
  0.813616	 -1.353294	 -1.461198
  0.807655	 -1.305471	 -1.449520
  0.800892	 -1.258682	 -1.437769
  0.792939	 -1.210458	 -1.426897
  0.785031	 -1.161432	 -1.417868
  0.777802	 -1.110898	 -1.410144
  0.770778	 -1.060555	 -1.403430
  0.763127	 -1.010635	 -1.397770
  0.755151	 -0.960183	 -1.393306
  0.747101	 -0.909480	 -1.390232
  0.739344	 -0.863664	 -1.388757
  0.730684	 -0.823419	 -1.389310
  0.718276	 -0.784388	 -1.393262
  0.689932	 -0.732217	 -1.406106
  0.645073	 -0.693913	 -1.437017
  0.635526	 -0.688468	 -1.501842
  0.680209	 -0.637423	 -1.589230
  0.737597	 -0.584012	 -1.677048
  0.765224	 -0.562180	 -1.733753
  0.762295	 -0.532141	 -1.768007
  0.759974	 -0.457593	 -1.821455
  0.799149	 -0.331308	 -1.861542
  0.845148	 -0.170499	 -1.838830
  0.858069	 -0.024445	 -1.740046
  0.821604	  0.088208	 -1.636982
  0.754564	  0.158401	 -1.557417
  0.693359	  0.170471	 -1.470912
  0.670311	  0.159899	 -1.406068
  0.666360	  0.160255	 -1.368517
  0.667699	  0.169399	 -1.326602
  0.671515	  0.187162	 -1.285574
  0.675326	  0.211180	 -1.249361
  0.680088	  0.247446	 -1.210948
  0.683390	  0.284403	 -1.181952
  0.686029	  0.321772	 -1.160187
  0.688755	  0.364266	 -1.142027
  0.690708	  0.408013	 -1.122784
  0.691255	  0.454355	 -1.105755
  0.691352	  0.503451	 -1.090978
  0.691726	  0.546860	 -1.073095
  0.693833	  0.598110	 -1.081070
  0.697538	  0.650691	 -1.084647
  0.701461	  0.703096	 -1.077331
  0.703818	  0.753670	 -1.063893
  0.704581	  0.801488	 -1.048209
  0.704209	  0.848513	 -1.032191
  0.703085	  0.895980	 -1.017106
  0.701763	  0.944418	 -1.004530
  0.700562	  0.992357	 -0.996910
  0.699952	  1.037187	 -0.996060
  0.700316	  1.083738	 -1.003350
  0.701303	  1.157658	 -1.033399
  0.698753	  1.291441	 -1.142983
  0.732735	  1.413561	 -1.356085
  0.819902	  1.483588	 -1.485835
  0.841739	  1.508191	 -1.505146
  0.856140	  1.532994	 -1.509683
  0.875657	  1.579718	 -1.502356
  0.890504	  1.630843	 -1.480056
  0.895290	  1.678206	 -1.437691
  0.879131	  1.734963	 -1.348550
  0.813769	  1.761005	 -1.226040
  0.750846	  1.777900	 -1.117985
  0.698470	  1.796697	 -1.000296
  0.656455	  1.803687	 -0.891584
  0.643983	  1.826620	 -0.836167
  0.646853	  1.871552	 -0.816942
  0.651062	  1.919370	 -0.804753
  0.654533	  1.967247	 -0.793416
  0.656014	  2.015932	 -0.782041
  0.652006	  2.064129	 -0.770777
  0.640833	  2.112525	 -0.758399
  0.625752	  2.159994	 -0.745018
  0.612823	  2.207155	 -0.734016
  0.605226	  2.256108	 -0.724546
  0.600649	  2.306271	 -0.714235
  0.597878	  2.355959	 -0.702884
  0.596574	  2.403434	 -0.691074
  0.595615	  2.449624	 -0.679153
  0.594427	  2.495931	 -0.667004
  0.593161	  2.544332	 -0.654341
  0.593199	  2.594413	 -0.641545
  0.593662	  2.645175	 -0.628250
  0.600215	  2.695435	 -0.617865
  0.602137	  2.745594	 -0.608826
  0.600272	  2.793356	 -0.597194
  0.594231	  2.840074	 -0.596920
  0.588917	  2.883206	 -0.583350
  0.594806	  2.912038	 -0.589184
