 -1.429078	 -1.834661	  0.790575
 -1.449108	 -1.827162	  0.812200
 -1.440455	 -1.831654	  0.794349
 -1.429437	 -1.837307	  0.777669
 -1.417759	 -1.845189	  0.764351
 -1.406253	 -1.857078	  0.751680
 -1.391797	 -1.865678	  0.736034
 -1.379034	 -1.865670	  0.722519
 -1.365068	 -1.866095	  0.705954
 -1.349402	 -1.872280	  0.691458
 -1.334414	 -1.879292	  0.684304
 -1.318142	 -1.885629	  0.672729
 -1.302858	 -1.894242	  0.661393
 -1.287902	 -1.903754	  0.652045
 -1.272532	 -1.912460	  0.642341
 -1.257560	 -1.920132	  0.631429
 -1.242360	 -1.927595	  0.620744
 -1.227371	 -1.934806	  0.609734
 -1.211936	 -1.942833	  0.600237
 -1.194730	 -1.951640	  0.592121
 -1.179291	 -1.957106	  0.582484
 -1.164080	 -1.962063	  0.570707
 -1.144293	 -1.968229	  0.556854
 -1.128002	 -1.969825	  0.541902
 -1.119147	 -1.969545	  0.531353
 -1.104445	 -1.972442	  0.515057
 -1.090373	 -1.976230	  0.498151
 -1.078831	 -1.981425	  0.483758
 -1.064579	 -1.992365	  0.470435
 -1.053363	 -2.003683	  0.458654
 -1.043486	 -2.013278	  0.443425
 -1.038170	 -2.021520	  0.424959
 -1.031176	 -2.030492	  0.406213
 -1.021242	 -2.039055	  0.391425
 -1.008294	 -2.048149	  0.378886
 -0.995566	 -2.056495	  0.366179
 -0.982782	 -2.063963	  0.352855
 -0.969624	 -2.070242	  0.339599
 -0.955611	 -2.077170	  0.326568
 -0.943684	 -2.086313	  0.312582
 -0.933492	 -2.098726	  0.296766
 -0.924966	 -2.108248	  0.282662
 -0.916356	 -2.114639	  0.268602
 -0.903956	 -2.118535	  0.252649
 -0.889617	 -2.123759	  0.239067
 -0.875047	 -2.135194	  0.223867
 -0.868252	 -2.148303	  0.211206
 -0.859075	 -2.164545	  0.198416
 -0.844296	 -2.177630	  0.184026
 -0.830940	 -2.183773	  0.176221
 -0.812597	 -2.186932	  0.169091
 -0.788267	 -2.185218	  0.155620
 -0.773784	 -2.186639	  0.141823
 -0.763625	 -2.188764	  0.127845
 -0.751534	 -2.195023	  0.111064
 -0.736773	 -2.203960	  0.098790
 -0.724824	 -2.211296	  0.088875
 -0.709120	 -2.218575	  0.075012
 -0.693789	 -2.223849	  0.062904
 -0.680255	 -2.227485	  0.050456
 -0.667067	 -2.230298	  0.033900
 -0.653857	 -2.233701	  0.017877
 -0.639415	 -2.240389	  0.005290
 -0.623137	 -2.249944	 -0.003187
 -0.606556	 -2.259549	 -0.011325
 -0.590574	 -2.268329	 -0.020523
 -0.575544	 -2.277349	 -0.030538
 -0.561020	 -2.286689	 -0.041585
 -0.548159	 -2.294879	 -0.053249
 -0.533479	 -2.304169	 -0.065014
 -0.516212	 -2.309220	 -0.075332
 -0.496988	 -2.312801	 -0.084394
 -0.480367	 -2.311379	 -0.095335
 -0.465823	 -2.310394	 -0.108687
 -0.449834	 -2.312466	 -0.122272
 -0.433596	 -2.316168	 -0.133988
 -0.417701	 -2.319681	 -0.145620
 -0.402040	 -2.323192	 -0.157553
 -0.386907	 -2.326704	 -0.170151
 -0.371774	 -2.330218	 -0.182746
 -0.356411	 -2.333526	 -0.195117
 -0.341016	 -2.336810	 -0.207455
 -0.326032	 -2.339268	 -0.220470
 -0.311565	 -2.340782	 -0.234198
 -0.297100	 -2.342318	 -0.247923
 -0.282050	 -2.346017	 -0.260562
 -0.266984	 -2.349815	 -0.273155
 -0.251946	 -2.354075	 -0.285634
 -0.236997	 -2.359304	 -0.297849
 -0.222049	 -2.364532	 -0.310065
 -0.206911	 -2.370858	 -0.321502
 -0.191697	 -2.377711	 -0.332528
 -0.176824	 -2.384572	 -0.344004
 -0.163125	 -2.391434	 -0.356849
 -0.150463	 -2.399096	 -0.369690
 -0.140626	 -2.408726	 -0.385600
 -0.130269	 -2.416658	 -0.402245
 -0.116592	 -2.421153	 -0.414958
 -0.098403	 -2.425353	 -0.422634
 -0.080916	 -2.427897	 -0.440211
 -0.067705	 -2.433307	 -0.454217
