 -1.447497	  2.658459	  0.135079
 -1.433166	  2.632138	  0.133742
 -1.415650	  2.630912	  0.182608
 -1.411285	  2.624738	  0.233069
 -1.397566	  2.614204	  0.281507
 -1.394985	  2.616542	  0.331132
 -1.380312	  2.612025	  0.376097
 -1.371640	  2.608859	  0.423986
 -1.364031	  2.601184	  0.468030
 -1.352595	  2.596150	  0.517919
 -1.344783	  2.586338	  0.566957
 -1.335124	  2.578722	  0.611073
 -1.327346	  2.574646	  0.659162
 -1.320625	  2.569281	  0.705324
 -1.310422	  2.566266	  0.754338
 -1.300539	  2.557259	  0.800112
 -1.296131	  2.550002	  0.846340
 -1.285881	  2.537962	  0.893509
 -1.279171	  2.534567	  0.946390
 -1.269051	  2.531616	  0.990716
 -1.262929	  2.516903	  1.034510
 -1.275558	  2.542072	  1.044855
