 -1.576236	  1.540359	  1.163163
 -1.589202	  1.550276	  1.168635
 -1.574140	  1.538755	  1.162278
 -1.558589	  1.527961	  1.155825
 -1.542546	  1.517970	  1.149283
 -1.526517	  1.507996	  1.142679
 -1.510649	  1.498225	  1.135418
 -1.494781	  1.488453	  1.128158
 -1.479196	  1.478481	  1.120564
 -1.463899	  1.468317	  1.112645
 -1.448602	  1.458154	  1.104727
 -1.433833	  1.447516	  1.096437
 -1.419133	  1.436819	  1.088102
 -1.404549	  1.425923	  1.079819
 -1.390281	  1.414513	  1.071682
 -1.376013	  1.403102	  1.063544
 -1.362038	  1.391267	  1.055505
 -1.348201	  1.379239	  1.047515
 -1.334477	  1.367094	  1.039503
 -1.321161	  1.354549	  1.031422
 -1.307845	  1.342004	  1.023342
 -1.295274	  1.329045	  1.014737
 -1.282908	  1.315981	  1.005995
 -1.270578	  1.302898	  0.997231
 -1.259754	  1.289088	  0.987634
 -1.248929	  1.275278	  0.978036
 -1.238105	  1.261469	  0.968438
 -1.228617	  1.247160	  0.958179
 -1.220354	  1.232486	  0.947390
 -1.212091	  1.217812	  0.936601
 -1.203829	  1.203138	  0.925812
 -1.196375	  1.188344	  0.914605
 -1.192361	  1.173390	  0.901946
 -1.188347	  1.158436	  0.889286
 -1.184332	  1.143482	  0.876627
 -1.180318	  1.128528	  0.863968
 -1.176353	  1.113946	  0.850867
 -1.172394	  1.099404	  0.837718
 -1.168434	  1.084863	  0.824570
 -1.164361	  1.070374	  0.811400
 -1.159847	  1.056090	  0.798148
 -1.155333	  1.041806	  0.784897
 -1.150683	  1.027424	  0.771800
 -1.145799	  1.012878	  0.758972
 -1.139820	  0.998120	  0.746870
 -1.132158	  0.983162	  0.736027
 -1.122759	  0.968379	  0.726379
 -1.112433	  0.953764	  0.717446
 -1.101321	  0.939426	  0.709023
 -1.089189	  0.925515	  0.701322
 -1.077058	  0.911604	  0.693620
 -1.063587	  0.898435	  0.686906
 -1.050072	  0.885292	  0.680225
 -1.035820	  0.872724	  0.673988
 -1.021121	  0.860535	  0.668039
 -1.005888	  0.848832	  0.662471
 -0.990050	  0.837735	  0.657371
 -0.973958	  0.826884	  0.652544
 -0.957130	  0.816830	  0.648577
 -0.940302	  0.806776	  0.644610
 -0.922995	  0.797152	  0.641811
 -0.905429	  0.787816	  0.639744
 -0.887863	  0.778479	  0.637676
 -0.870007	  0.769478	  0.637295
 -0.852082	  0.760611	  0.637506
 -0.834153	  0.751750	  0.637749
 -0.816149	  0.743584	  0.640775
 -0.798145	  0.735418	  0.643802
 -0.780286	  0.728031	  0.648950
 -0.762585	  0.721065	  0.655127
 -0.745019	  0.714515	  0.662093
 -0.727998	  0.709158	  0.671125
 -0.710977	  0.703801	  0.680158
 -0.693986	  0.698768	  0.689430
 -0.677116	  0.694643	  0.699349
 -0.660246	  0.690518	  0.709268
 -0.643376	  0.686393	  0.719187
 -0.625675	  0.683081	  0.727889
 -0.607658	  0.680124	  0.736052
 -0.589641	  0.677168	  0.744215
 -0.571497	  0.674169	  0.752078
 -0.552332	  0.670782	  0.756683
 -0.533166	  0.667394	  0.761288
 -0.514001	  0.664007	  0.765892
 -0.494777	  0.658750	  0.767576
 -0.475732	  0.652651	  0.767837
 -0.456686	  0.646552	  0.768098
 -0.438366	  0.638848	  0.765852
 -0.420720	  0.630231	  0.762063
 -0.403074	  0.621614	  0.758274
 -0.386717	  0.611742	  0.752358
 -0.370942	  0.601438	  0.745651
 -0.355168	  0.591133	  0.738945
 -0.340563	  0.579611	  0.731600
 -0.326017	  0.568033	  0.724227
 -0.311512	  0.555996	  0.717540
 -0.297111	  0.543325	  0.711877
 -0.282711	  0.530654	  0.706213
 -0.267937	  0.518031	  0.701482
 -0.253141	  0.505412	  0.696807
 -0.238102	  0.493231	  0.691762
 -0.222770	  0.481635	  0.686243
 -0.207438	  0.470039	  0.680725
 -0.191751	  0.459223	  0.674648
 -0.176036	  0.448476	  0.668522
 -0.160218	  0.438059	  0.662097
 -0.144261	  0.428151	  0.655224
 -0.128305	  0.418244	  0.648352
 -0.112183	  0.408988	  0.640976
 -0.096043	  0.399808	  0.633543
 -0.079812	  0.390914	  0.625963
 -0.063461	  0.382427	  0.618178
 -0.047110	  0.373940	  0.610393
 -0.030509	  0.366302	  0.602264
 -0.013902	  0.358690	  0.594124
  0.002841	  0.351606	  0.585789
  0.019666	  0.344867	  0.577331
  0.036506	  0.338277	  0.568789
  0.053386	  0.332103	  0.560018
  0.070266	  0.325928	  0.551246
  0.087037	  0.319911	  0.542162
  0.103795	  0.313913	  0.533040
  0.120553	  0.307939	  0.523903
  0.137311	  0.301995	  0.514748
  0.154070	  0.296051	  0.505593
  0.170675	  0.289304	  0.496719
  0.187253	  0.282430	  0.487891
  0.203781	  0.275303	  0.479172
  0.219911	  0.266562	  0.471208
  0.236041	  0.257822	  0.463244
  0.252163	  0.248653	  0.455759
  0.268233	  0.238782	  0.449102
  0.284303	  0.228910	  0.442445
  0.300350	  0.218545	  0.436526
  0.316382	  0.208012	  0.430866
  0.332386	  0.197398	  0.425278
  0.348237	  0.186382	  0.420046
  0.364089	  0.175366	  0.414814
  0.379786	  0.164117	  0.409611
  0.395375	  0.152711	  0.404428
  0.410952	  0.141290	  0.399238
  0.426302	  0.129627	  0.393914
  0.441652	  0.117963	  0.388590
  0.456935	  0.106035	  0.383677
  0.472138	  0.093834	  0.379204
  0.487341	  0.081633	  0.374730
  0.502597	  0.069135	  0.371405
  0.517855	  0.056613	  0.368185
  0.533199	  0.044073	  0.365479
  0.548650	  0.031523	  0.363541
  0.564101	  0.018972	  0.361602
  0.579682	  0.006471	  0.360640
  0.595274	 -0.006025	  0.359766
  0.610979	 -0.018394	  0.359182
  0.626818	 -0.030604	  0.358955
  0.642657	 -0.042814	  0.358727
  0.658595	 -0.054860	  0.357806
  0.674538	 -0.066898	  0.356844
  0.690443	 -0.078891	  0.355056
  0.706229	 -0.090771	  0.351944
  0.722015	 -0.102650	  0.348832
  0.737465	 -0.114167	  0.343478
  0.752801	 -0.125572	  0.337587
  0.768049	 -0.136996	  0.331502
  0.782865	 -0.148484	  0.324539
  0.797682	 -0.159973	  0.317576
  0.812249	 -0.171673	  0.310441
  0.826600	 -0.183549	  0.303162
  0.840952	 -0.195425	  0.295883
  0.855043	 -0.207460	  0.288360
  0.869123	 -0.219502	  0.280826
  0.883192	 -0.231606	  0.273371
  0.897247	 -0.243788	  0.266020
  0.911306	 -0.255969	  0.258674
  0.925721	 -0.267965	  0.251724
  0.940135	 -0.279962	  0.244774
  0.954848	 -0.291764	  0.238123
  0.969752	 -0.303436	  0.231669
  0.984709	 -0.315058	  0.225248
  0.999901	 -0.326450	  0.218971
  1.015094	 -0.337842	  0.212693
  1.030357	 -0.348750	  0.205761
  1.045639	 -0.359479	  0.198596
  1.060942	 -0.369872	  0.190993
  1.076253	 -0.379554	  0.182516
  1.091565	 -0.389210	  0.174015
  1.106920	 -0.397177	  0.163977
  1.122275	 -0.405143	  0.153938
  1.137659	 -0.411036	  0.142598
  1.152981	 -0.415957	  0.130722
  1.168302	 -0.420878	  0.118847
  1.182923	 -0.420260	  0.105214
  1.197524	 -0.419562	  0.091564
  1.212126	 -0.418865	  0.077915
  1.225465	 -0.413049	  0.064195
  1.237943	 -0.405078	  0.050750
  1.250420	 -0.397106	  0.037305
  1.263659	 -0.388676	  0.024909
  1.278633	 -0.379212	  0.015622
  1.293606	 -0.369749	  0.006336
  1.311666	 -0.363100	  0.000893
  1.331517	 -0.360937	 -0.000235
  1.350368	 -0.365960	  0.004171
  1.367509	 -0.374149	  0.010427
  1.382325	 -0.385503	  0.017607
  1.397142	 -0.396858	  0.024786
  1.411308	 -0.409727	  0.030592
  1.425225	 -0.423061	  0.035931
  1.439142	 -0.436395	  0.041271
  1.453060	 -0.449729	  0.046610
  1.467704	 -0.463098	  0.049219
  1.482436	 -0.476449	  0.051397
  1.497168	 -0.489799	  0.053575
  1.511899	 -0.503150	  0.055753
  1.526631	 -0.516500	  0.057931
  1.542379	 -0.528820	  0.057471
  1.558186	 -0.541056	  0.056824
  1.573993	 -0.553292	  0.056176
  1.589800	 -0.565528	  0.055529
  1.605341	 -0.578091	  0.054713
  1.620094	 -0.591533	  0.053428
  1.634847	 -0.604975	  0.052143
  1.649600	 -0.618418	  0.050857
  1.662558	 -0.633588	  0.049452
  1.675155	 -0.649056	  0.048026
  1.687306	 -0.664877	  0.046597
  1.698162	 -0.681614	  0.045169
  1.709018	 -0.698350	  0.043741
  1.718655	 -0.715839	  0.042622
  1.728038	 -0.733470	  0.041567
  1.737422	 -0.751101	  0.040512
  1.747512	 -0.768266	  0.038628
  1.758355	 -0.784834	  0.035816
  1.769199	 -0.801402	  0.033005
  1.780043	 -0.817971	  0.030193
  1.791279	 -0.834160	  0.026778
  1.803012	 -0.849797	  0.022558
  1.814746	 -0.865434	  0.018339
  1.826480	 -0.881071	  0.014120
  1.838407	 -0.896360	  0.009223
  1.850509	 -0.911281	  0.003661
  1.862610	 -0.926201	 -0.001901
  1.874875	 -0.940876	 -0.007753
  1.887368	 -0.955178	 -0.014025
  1.899862	 -0.969481	 -0.020297
  1.912930	 -0.983153	 -0.026801
  1.926013	 -0.996809	 -0.033310
  1.939549	 -1.009845	 -0.040153
  1.953290	 -1.022583	 -0.047149
  1.967204	 -1.034993	 -0.054387
  1.981526	 -1.046545	 -0.062225
  1.995847	 -1.058097	 -0.070063
  2.010575	 -1.068832	 -0.078300
  2.025391	 -1.079375	 -0.086627
  2.040270	 -1.089793	 -0.094999
  2.055295	 -1.099909	 -0.103479
  2.070320	 -1.110024	 -0.111960
  2.085289	 -1.120228	 -0.120434
  2.100242	 -1.130457	 -0.128907
  2.115178	 -1.140763	 -0.137314
  2.130075	 -1.151254	 -0.145562
  2.144972	 -1.161745	 -0.153810
  2.159696	 -1.172753	 -0.161685
  2.174388	 -1.183853	 -0.169492
  2.189079	 -1.194954	 -0.177298
  2.203771	 -1.206054	 -0.185105
  2.221613	 -1.220107	 -0.194418
  2.236141	 -1.231577	 -0.201993
