 -1.688032	  0.872025	 -1.742375
 -1.673587	  0.883477	 -1.754095
 -1.686816	  0.872994	 -1.743367
 -1.699218	  0.861637	 -1.732539
 -1.711083	  0.849761	 -1.721669
 -1.722867	  0.837704	 -1.710909
 -1.734371	  0.825066	 -1.700519
 -1.745879	  0.812430	 -1.690132
 -1.758464	  0.800123	 -1.680637
 -1.771052	  0.787817	 -1.671144
 -1.784045	  0.775484	 -1.662251
 -1.797135	  0.763148	 -1.653505
 -1.810265	  0.750594	 -1.645140
 -1.823424	  0.737861	 -1.637096
 -1.836760	  0.725181	 -1.629263
 -1.850509	  0.712635	 -1.621944
 -1.864259	  0.700089	 -1.614626
 -1.878388	  0.688390	 -1.606658
 -1.892649	  0.676998	 -1.598483
 -1.906933	  0.665620	 -1.590343
 -1.921471	  0.655275	 -1.581296
 -1.936216	  0.645316	 -1.572003
 -1.950188	  0.635362	 -1.561734
 -1.964037	  0.625430	 -1.551358
 -1.978413	  0.615295	 -1.541102
 -1.995933	  0.603104	 -1.528450
 -2.010117	  0.593421	 -1.518201
