 -2.272620	 -0.845837	 -0.640281
 -2.262524	 -0.843745	 -0.647363
 -2.256482	 -0.842493	 -0.651602
 -2.240154	 -0.839090	 -0.662612
 -2.224366	 -0.835012	 -0.673604
 -2.209775	 -0.830951	 -0.685044
 -2.190206	 -0.828867	 -0.696100
 -2.170750	 -0.827711	 -0.704545
 -2.155428	 -0.825130	 -0.710194
 -2.137650	 -0.822295	 -0.718556
 -2.115556	 -0.818779	 -0.726949
 -2.099154	 -0.818420	 -0.733397
 -2.081455	 -0.816921	 -0.740896
 -2.060559	 -0.814036	 -0.748267
 -2.043372	 -0.815580	 -0.753960
 -2.024991	 -0.815700	 -0.760711
 -2.003714	 -0.814825	 -0.767491
 -1.986694	 -0.815726	 -0.773585
 -1.969238	 -0.817018	 -0.781058
 -1.947866	 -0.820635	 -0.789815
 -1.931546	 -0.819515	 -0.795648
 -1.913657	 -0.821740	 -0.804394
 -1.894924	 -0.827076	 -0.814644
 -1.877997	 -0.826376	 -0.822201
 -1.861919	 -0.829253	 -0.834145
 -1.847807	 -0.837272	 -0.846023
 -1.835574	 -0.845893	 -0.858671
 -1.827214	 -0.854065	 -0.874163
 -1.824825	 -0.864899	 -0.890654
 -1.821882	 -0.877017	 -0.906786
 -1.818305	 -0.887776	 -0.923089
 -1.817006	 -0.899363	 -0.939280
 -1.816240	 -0.911610	 -0.955137
 -1.815496	 -0.923831	 -0.970950
 -1.817318	 -0.936542	 -0.986282
 -1.819811	 -0.949344	 -1.001443
 -1.822309	 -0.962148	 -1.016603
 -1.824841	 -0.974949	 -1.031755
 -1.831073	 -0.987844	 -1.045711
 -1.837474	 -1.000729	 -1.059603
 -1.843865	 -1.013564	 -1.073529
 -1.848958	 -1.019715	 -1.091851
 -1.853674	 -1.024326	 -1.110731
 -1.858393	 -1.028954	 -1.129607
 -1.863434	 -1.034795	 -1.148058
 -1.868477	 -1.040646	 -1.166507
 -1.873520	 -1.046496	 -1.184955
 -1.878563	 -1.052347	 -1.203403
 -1.883606	 -1.058197	 -1.221852
 -1.889393	 -1.065109	 -1.243277
 -1.893280	 -1.070606	 -1.258769
