 -1.276694	  0.078932	  2.189543
 -1.278390	  0.081651	  2.191865
 -1.269820	  0.067909	  2.180130
 -1.261250	  0.054165	  2.168394
 -1.250286	  0.041033	  2.158037
 -1.237961	  0.028402	  2.148625
 -1.225795	  0.015707	  2.139097
 -1.215308	  0.002426	  2.128439
 -1.204842	 -0.010864	  2.117770
 -1.195584	 -0.025005	  2.107078
 -1.186801	 -0.039450	  2.096392
 -1.178347	 -0.053904	  2.085455
 -1.170523	 -0.068357	  2.074059
 -1.162696	 -0.082817	  2.062672
 -1.155774	 -0.097090	  2.050491
 -1.149051	 -0.111338	  2.038165
 -1.142788	 -0.125461	  2.025454
 -1.137457	 -0.139301	  2.012029
 -1.132114	 -0.153175	  1.998646
 -1.126773	 -0.166729	  1.984934
 -1.121442	 -0.180086	  1.971036
 -1.116021	 -0.193434	  1.957165
 -1.110101	 -0.206456	  1.943173
 -1.104199	 -0.219464	  1.929169
 -1.097944	 -0.232148	  1.915050
 -1.091297	 -0.244784	  1.901034
 -1.084667	 -0.257478	  1.887066
 -1.077352	 -0.270017	  1.873305
 -1.069875	 -0.282518	  1.859596
 -1.062088	 -0.294902	  1.845957
 -1.053602	 -0.306987	  1.832462
 -1.045137	 -0.319053	  1.818959
 -1.037343	 -0.330457	  1.805399
 -1.030945	 -0.340056	  1.790697
 -1.017246	 -0.351685	  1.774687
 -1.002672	 -0.363510	  1.764068
 -0.995577	 -0.376351	  1.755176
 -0.987620	 -0.386772	  1.741660
 -0.972702	 -0.398797	  1.727145
 -0.963574	 -0.412643	  1.717484
 -0.957341	 -0.423876	  1.705069
 -0.946057	 -0.434393	  1.690738
 -0.933521	 -0.449739	  1.679047
 -0.927231	 -0.460741	  1.668188
 -0.916829	 -0.469707	  1.653559
 -0.900531	 -0.486193	  1.639727
 -0.895123	 -0.497309	  1.632163
 -0.885888	 -0.510110	  1.616813
 -0.877801	 -0.516137	  1.600872
 -0.869631	 -0.526418	  1.583951
 -0.862665	 -0.537120	  1.568426
 -0.854099	 -0.546623	  1.553134
 -0.846568	 -0.556559	  1.537663
 -0.840279	 -0.567628	  1.522152
 -0.834149	 -0.579263	  1.507082
 -0.828264	 -0.591512	  1.492399
 -0.822333	 -0.603956	  1.477905
 -0.816466	 -0.617135	  1.464073
 -0.809628	 -0.629058	  1.450374
 -0.799297	 -0.638973	  1.435893
 -0.787306	 -0.649112	  1.422584
 -0.774860	 -0.665448	  1.412719
 -0.769356	 -0.681157	  1.401925
 -0.766092	 -0.693692	  1.386216
 -0.760909	 -0.706557	  1.372078
 -0.750212	 -0.721948	  1.363459
 -0.738979	 -0.736205	  1.357667
 -0.726944	 -0.751435	  1.353447
 -0.716495	 -0.767938	  1.343997
 -0.707022	 -0.777985	  1.336142
 -0.696894	 -0.790159	  1.322040
 -0.688326	 -0.808098	  1.310632
 -0.679967	 -0.828302	  1.302382
 -0.670634	 -0.839399	  1.294267
 -0.656823	 -0.847049	  1.281917
 -0.643359	 -0.858086	  1.269839
 -0.634776	 -0.872373	  1.257882
 -0.626191	 -0.883893	  1.242665
 -0.620108	 -0.892880	  1.225026
 -0.614398	 -0.905152	  1.214282
 -0.607888	 -0.921630	  1.202102
 -0.601460	 -0.935061	  1.190203
 -0.595505	 -0.948989	  1.174981
 -0.587620	 -0.963524	  1.159842
 -0.583233	 -0.975341	  1.143118
 -0.584117	 -0.982312	  1.128900
 -0.580506	 -0.993914	  1.109846
 -0.571306	 -1.006837	  1.096509
 -0.560505	 -1.019089	  1.086071
 -0.549980	 -1.030952	  1.072702
 -0.538800	 -1.043473	  1.059942
 -0.525732	 -1.054227	  1.052405
 -0.514350	 -1.065588	  1.039401
 -0.502392	 -1.078274	  1.027076
 -0.489878	 -1.089647	  1.019705
 -0.479921	 -1.101029	  1.006586
 -0.470484	 -1.115769	  0.992390
 -0.457928	 -1.127422	  0.988349
 -0.449038	 -1.142136	  0.977097
 -0.444533	 -1.156560	  0.959495
 -0.439710	 -1.169472	  0.946778
 -0.429394	 -1.185179	  0.941446
 -0.421782	 -1.203436	  0.929911
 -0.421081	 -1.217026	  0.914602
 -0.427210	 -1.226698	  0.895906
 -0.426817	 -1.238495	  0.880664
 -0.424793	 -1.253104	  0.866463
 -0.422706	 -1.265928	  0.849110
 -0.425161	 -1.274176	  0.831345
 -0.433474	 -1.282639	  0.813466
 -0.441377	 -1.291395	  0.796785
 -0.442977	 -1.301474	  0.781462
 -0.443194	 -1.313035	  0.763869
 -0.447938	 -1.322297	  0.746285
 -0.452319	 -1.331674	  0.732063
 -0.448983	 -1.343243	  0.713959
 -0.446562	 -1.352514	  0.693412
 -0.447310	 -1.359030	  0.680893
 -0.444712	 -1.367497	  0.667597
 -0.436476	 -1.380343	  0.642637
 -0.434518	 -1.388144	  0.627661
 -0.434492	 -1.397679	  0.613322
 -0.433409	 -1.410058	  0.595278
 -0.431986	 -1.419119	  0.572146
 -0.431209	 -1.421935	  0.560506
 -0.427183	 -1.434384	  0.539871
 -0.422779	 -1.445064	  0.525287
 -0.415118	 -1.456526	  0.510963
 -0.407665	 -1.467741	  0.496205
 -0.396555	 -1.479958	  0.481094
 -0.381477	 -1.492306	  0.465588
 -0.371104	 -1.501605	  0.454700
 -0.363293	 -1.514401	  0.442884
 -0.359995	 -1.533797	  0.432177
 -0.353852	 -1.549191	  0.426149
 -0.344215	 -1.564667	  0.415643
 -0.336793	 -1.580578	  0.403299
 -0.326210	 -1.592878	  0.393382
 -0.312602	 -1.604792	  0.383087
 -0.305789	 -1.619036	  0.367945
 -0.296718	 -1.633385	  0.355340
 -0.281400	 -1.642469	  0.349895
 -0.262654	 -1.651427	  0.343943
 -0.244802	 -1.659856	  0.337950
 -0.227466	 -1.668479	  0.332250
 -0.209046	 -1.675156	  0.328591
 -0.190112	 -1.680122	  0.324905
 -0.170241	 -1.682598	  0.322033
 -0.150439	 -1.685423	  0.319937
 -0.131504	 -1.691873	  0.319053
 -0.112299	 -1.697809	  0.318706
 -0.093552	 -1.703781	  0.319861
 -0.073664	 -1.707579	  0.319832
 -0.053915	 -1.710856	  0.319334
 -0.034240	 -1.714484	  0.318888
 -0.016473	 -1.722063	  0.313581
  0.001117	 -1.729815	  0.307985
  0.017790	 -1.738893	  0.301615
  0.029512	 -1.752187	  0.292237
  0.041144	 -1.765570	  0.283027
  0.050103	 -1.779119	  0.273146
  0.057911	 -1.791455	  0.262326
  0.067042	 -1.811101	  0.248457
  0.073610	 -1.827407	  0.237089
  0.077938	 -1.837201	  0.229445
  0.085628	 -1.853622	  0.216670
  0.093468	 -1.872494	  0.203599
  0.098416	 -1.883218	  0.196635
  0.104192	 -1.897721	  0.182705
  0.111122	 -1.916362	  0.166556
  0.116761	 -1.927511	  0.160105
  0.122140	 -1.941692	  0.145260
  0.126837	 -1.957661	  0.128026
  0.131863	 -1.969939	  0.118103
  0.137769	 -1.984440	  0.103696
  0.143548	 -2.001908	  0.088133
  0.151363	 -2.017727	  0.083424
  0.159522	 -2.032613	  0.077133
  0.168739	 -2.049004	  0.066442
  0.176621	 -2.064315	  0.055214
  0.185219	 -2.079247	  0.045020
  0.193990	 -2.094113	  0.034890
  0.203047	 -2.108830	  0.024808
  0.212930	 -2.123148	  0.014951
  0.222684	 -2.137564	  0.005087
  0.232806	 -2.151501	 -0.005079
  0.243179	 -2.165113	 -0.015427
  0.253513	 -2.178732	 -0.025805
  0.264572	 -2.191200	 -0.036854
  0.275802	 -2.203463	 -0.047998
  0.287169	 -2.215651	 -0.059069
  0.299739	 -2.226147	 -0.070549
  0.312370	 -2.236574	 -0.082018
  0.324926	 -2.246917	 -0.093656
  0.337295	 -2.256061	 -0.105778
  0.347759	 -2.264220	 -0.117937
  0.358903	 -2.273326	 -0.134957
  0.372565	 -2.284129	 -0.152348
  0.385121	 -2.291071	 -0.159046
  0.402534	 -2.300420	 -0.166543
  0.419973	 -2.311526	 -0.176501
  0.430024	 -2.319290	 -0.188627
  0.444605	 -2.327432	 -0.202347
  0.459307	 -2.334267	 -0.214208
  0.469503	 -2.339481	 -0.230531
  0.478333	 -2.348443	 -0.250973
  0.491125	 -2.358731	 -0.262821
  0.502222	 -2.368108	 -0.268902
  0.518001	 -2.379891	 -0.280579
  0.528907	 -2.390653	 -0.294557
  0.538233	 -2.401844	 -0.308494
  0.546038	 -2.414232	 -0.321779
  0.555250	 -2.426593	 -0.334832
  0.565163	 -2.438816	 -0.347547
  0.575848	 -2.452902	 -0.361038
  0.585268	 -2.465853	 -0.373017
