 -1.140084	 -2.207020	 -0.294800
 -1.141250	 -2.204629	 -0.295226
 -1.148731	 -2.189288	 -0.297963
 -1.155460	 -2.170520	 -0.296419
 -1.162181	 -2.151749	 -0.294853
 -1.168902	 -2.132977	 -0.293288
 -1.175623	 -2.114205	 -0.291722
 -1.182347	 -2.095434	 -0.290172
 -1.190135	 -2.077528	 -0.290513
 -1.197730	 -2.060212	 -0.289839
 -1.206622	 -2.039201	 -0.290262
 -1.215246	 -2.021102	 -0.295491
 -1.224824	 -2.007312	 -0.302056
 -1.237299	 -1.994916	 -0.311276
 -1.250627	 -1.980063	 -0.323846
 -1.259807	 -1.967062	 -0.328987
 -1.274264	 -1.956033	 -0.339052
 -1.288258	 -1.946665	 -0.349739
 -1.302330	 -1.941185	 -0.362663
 -1.316166	 -1.936884	 -0.378294
 -1.328681	 -1.928436	 -0.388942
 -1.344084	 -1.921012	 -0.398928
 -1.360975	 -1.914365	 -0.411960
 -1.374433	 -1.908924	 -0.427006
 -1.385447	 -1.908826	 -0.440958
 -1.401430	 -1.905796	 -0.454066
 -1.417209	 -1.900660	 -0.467224
 -1.430323	 -1.899640	 -0.481513
 -1.444264	 -1.899375	 -0.494565
 -1.459810	 -1.898090	 -0.507907
 -1.474630	 -1.897202	 -0.521688
 -1.489070	 -1.896678	 -0.534966
 -1.504958	 -1.896508	 -0.547394
 -1.527632	 -1.896922	 -0.563941
 -1.537498	 -1.897411	 -0.570694
