 -0.688540	 -1.533795	 -1.825599
 -0.693757	 -1.567540	 -1.859331
 -0.705385	 -1.557566	 -1.878772
 -0.712688	 -1.540346	 -1.886225
 -0.719830	 -1.523211	 -1.894555
 -0.724275	 -1.503720	 -1.899892
 -0.730988	 -1.486337	 -1.909287
 -0.734962	 -1.467516	 -1.915197
 -0.738927	 -1.448800	 -1.920704
 -0.742537	 -1.430494	 -1.929135
 -0.745373	 -1.410175	 -1.934330
 -0.747662	 -1.391740	 -1.941443
 -0.749456	 -1.372789	 -1.947755
 -0.750613	 -1.353628	 -1.954623
 -0.750727	 -1.333402	 -1.959488
 -0.750748	 -1.313806	 -1.965021
 -0.750015	 -1.294466	 -1.970157
 -0.747931	 -1.274679	 -1.973849
 -0.747382	 -1.254945	 -1.980517
 -0.744433	 -1.234639	 -1.982654
 -0.743049	 -1.215516	 -1.988578
 -0.739440	 -1.195767	 -1.991274
 -0.735549	 -1.175726	 -1.994433
 -0.732180	 -1.155396	 -1.997630
 -0.728142	 -1.136098	 -1.999509
 -0.723480	 -1.116515	 -2.000799
 -0.718609	 -1.096852	 -2.004256
 -0.712058	 -1.076542	 -2.004463
 -0.706322	 -1.056921	 -2.003886
 -0.701304	 -1.037520	 -2.005904
 -0.693906	 -1.018858	 -2.004589
 -0.686347	 -0.999923	 -2.003781
 -0.676568	 -0.981500	 -1.999422
 -0.668717	 -0.961021	 -1.998098
 -0.660226	 -0.943153	 -1.994830
 -0.650678	 -0.926341	 -1.989456
 -0.641387	 -0.909289	 -1.985161
 -0.631770	 -0.892357	 -1.979804
 -0.621140	 -0.875084	 -1.974669
 -0.609163	 -0.858545	 -1.965596
 -0.597842	 -0.842139	 -1.959451
 -0.585696	 -0.829497	 -1.949723
 -0.573819	 -0.816231	 -1.940850
 -0.561818	 -0.802947	 -1.931987
 -0.549479	 -0.790204	 -1.922239
 -0.535367	 -0.778392	 -1.912323
 -0.521787	 -0.765030	 -1.901890
 -0.509488	 -0.755670	 -1.891307
 -0.494026	 -0.747938	 -1.876734
 -0.477930	 -0.738728	 -1.867707
 -0.465080	 -0.729975	 -1.858655
 -0.451782	 -0.719882	 -1.847205
 -0.435747	 -0.708376	 -1.834126
 -0.420676	 -0.701881	 -1.824256
 -0.407360	 -0.695637	 -1.812090
 -0.393072	 -0.687989	 -1.798282
 -0.377572	 -0.679529	 -1.787572
 -0.363823	 -0.679246	 -1.772936
 -0.348573	 -0.671347	 -1.760915
 -0.332569	 -0.662615	 -1.749942
 -0.320113	 -0.660231	 -1.735320
 -0.308308	 -0.652797	 -1.720431
 -0.293462	 -0.643798	 -1.708485
 -0.277381	 -0.641899	 -1.695167
 -0.261760	 -0.635830	 -1.683456
 -0.253759	 -0.632566	 -1.665838
 -0.243342	 -0.625806	 -1.651012
 -0.230732	 -0.620678	 -1.632029
 -0.218561	 -0.611309	 -1.619139
 -0.208406	 -0.614890	 -1.599403
 -0.192339	 -0.611291	 -1.587259
 -0.176447	 -0.600829	 -1.575648
 -0.170033	 -0.591738	 -1.556209
 -0.164196	 -0.582565	 -1.537249
 -0.158025	 -0.582543	 -1.523798
 -0.149155	 -0.574152	 -1.504896
 -0.139499	 -0.571274	 -1.485662
 -0.126595	 -0.570074	 -1.469504
 -0.113442	 -0.563674	 -1.454734
 -0.104975	 -0.556321	 -1.439239
 -0.098460	 -0.549372	 -1.422107
 -0.092082	 -0.540574	 -1.405839
 -0.086828	 -0.533219	 -1.382534
 -0.081111	 -0.526558	 -1.368891
 -0.075495	 -0.519256	 -1.352549
 -0.071234	 -0.509239	 -1.331164
 -0.065229	 -0.501238	 -1.315328
 -0.064656	 -0.494699	 -1.298921
 -0.063294	 -0.483055	 -1.279786
 -0.055762	 -0.473023	 -1.263098
 -0.055866	 -0.467261	 -1.245213
 -0.056540	 -0.458030	 -1.226570
 -0.061074	 -0.445888	 -1.210483
 -0.065144	 -0.436672	 -1.192968
 -0.065623	 -0.433709	 -1.173206
 -0.068178	 -0.425403	 -1.154924
 -0.073582	 -0.418117	 -1.136845
 -0.084172	 -0.409127	 -1.119288
 -0.093238	 -0.397687	 -1.106850
 -0.090700	 -0.388151	 -1.086202
 -0.088264	 -0.378981	 -1.067134
 -0.092326	 -0.366743	 -1.051532
 -0.097550	 -0.355154	 -1.039742
 -0.102661	 -0.339008	 -1.028866
 -0.107175	 -0.319896	 -1.014530
 -0.106548	 -0.305746	 -1.001859
 -0.114301	 -0.291376	 -0.988130
 -0.125633	 -0.281410	 -0.973227
 -0.129606	 -0.274107	 -0.956895
 -0.131666	 -0.260623	 -0.940722
 -0.136861	 -0.247337	 -0.924938
 -0.146987	 -0.238583	 -0.913349
 -0.150329	 -0.222088	 -0.900171
 -0.158744	 -0.205017	 -0.889630
 -0.172843	 -0.191360	 -0.879286
 -0.180787	 -0.181234	 -0.862232
 -0.181742	 -0.166099	 -0.849133
 -0.181087	 -0.151245	 -0.835760
 -0.184640	 -0.133850	 -0.822753
 -0.190587	 -0.120859	 -0.811107
 -0.196440	 -0.110581	 -0.796142
 -0.197774	 -0.098330	 -0.781943
 -0.202890	 -0.084532	 -0.764209
 -0.201695	 -0.067063	 -0.750765
 -0.199907	 -0.050648	 -0.735515
 -0.203594	 -0.044922	 -0.724078
 -0.207564	 -0.032172	 -0.708545
 -0.206941	 -0.017721	 -0.694335
 -0.203231	  0.003529	 -0.681071
 -0.204967	  0.015972	 -0.670017
 -0.200983	  0.028287	 -0.656547
 -0.197895	  0.044122	 -0.639981
 -0.198813	  0.060022	 -0.629460
 -0.198139	  0.074666	 -0.619184
 -0.196325	  0.091934	 -0.602941
 -0.190798	  0.106251	 -0.592317
 -0.188996	  0.123277	 -0.579963
 -0.191167	  0.134787	 -0.564336
 -0.187634	  0.149469	 -0.551832
 -0.183741	  0.162035	 -0.534522
 -0.181258	  0.177047	 -0.521156
 -0.180148	  0.194001	 -0.510097
 -0.178969	  0.209537	 -0.499525
 -0.175436	  0.221772	 -0.482886
 -0.173168	  0.239353	 -0.471114
 -0.171565	  0.254037	 -0.461141
 -0.169921	  0.267986	 -0.445790
 -0.172970	  0.285872	 -0.429430
 -0.168790	  0.298127	 -0.421915
 -0.162088	  0.317358	 -0.412780
 -0.161794	  0.337101	 -0.398313
 -0.163311	  0.345090	 -0.384220
 -0.160824	  0.360767	 -0.370335
 -0.159004	  0.376717	 -0.356505
 -0.154923	  0.393055	 -0.345710
 -0.150487	  0.408522	 -0.331104
 -0.150425	  0.420536	 -0.319465
 -0.144323	  0.436304	 -0.307162
 -0.142045	  0.450832	 -0.290127
 -0.144169	  0.464073	 -0.276216
 -0.144957	  0.477984	 -0.260929
 -0.139307	  0.492647	 -0.249626
 -0.129802	  0.506596	 -0.237329
 -0.125089	  0.525044	 -0.223061
 -0.124195	  0.538100	 -0.215675
 -0.117454	  0.556935	 -0.204979
 -0.111659	  0.571289	 -0.191017
 -0.108045	  0.585043	 -0.178760
 -0.105080	  0.599040	 -0.165346
 -0.102163	  0.613352	 -0.151191
 -0.099619	  0.628845	 -0.139668
 -0.095564	  0.646078	 -0.128863
 -0.088172	  0.666522	 -0.121136
 -0.086081	  0.675365	 -0.106468
 -0.082130	  0.692745	 -0.096582
 -0.075141	  0.712213	 -0.087540
 -0.070124	  0.728026	 -0.076205
 -0.066733	  0.741932	 -0.063878
 -0.065305	  0.752074	 -0.045513
 -0.061109	  0.768939	 -0.034511
 -0.058132	  0.785390	 -0.019603
 -0.055093	  0.799497	 -0.008933
 -0.048479	  0.816198	  0.001585
 -0.042635	  0.836370	  0.005477
 -0.041657	  0.856052	  0.017268
 -0.038108	  0.864345	  0.032712
 -0.030527	  0.878677	  0.045537
 -0.026011	  0.894862	  0.059978
 -0.029878	  0.913822	  0.070228
 -0.029334	  0.931173	  0.081161
 -0.021036	  0.947658	  0.091329
 -0.012883	  0.956673	  0.103627
 -0.005655	  0.973355	  0.116387
 -0.004137	  0.989834	  0.124987
 -0.001504	  1.008684	  0.139200
  0.003760	  1.024910	  0.151489
  0.012752	  1.037297	  0.162536
  0.019252	  1.049616	  0.174000
  0.025424	  1.066261	  0.184782
  0.031503	  1.082417	  0.196734
  0.036377	  1.099589	  0.206779
  0.041810	  1.112643	  0.221493
  0.050020	  1.126868	  0.232714
  0.059812	  1.142451	  0.241614
  0.069816	  1.155412	  0.251176
  0.076560	  1.173923	  0.261803
  0.081374	  1.190456	  0.269011
  0.090909	  1.208500	  0.273670
  0.101373	  1.222476	  0.284368
  0.110030	  1.239181	  0.292276
  0.116593	  1.252180	  0.303418
  0.128974	  1.265954	  0.317016
  0.137703	  1.279764	  0.325924
  0.143887	  1.294588	  0.336741
  0.149871	  1.309987	  0.351298
  0.158816	  1.321500	  0.364491
  0.166782	  1.338362	  0.374081
  0.173677	  1.354121	  0.383408
  0.183311	  1.369316	  0.389993
  0.195911	  1.388111	  0.394236
  0.202473	  1.401065	  0.408789
  0.207250	  1.415404	  0.420856
  0.215102	  1.429835	  0.436525
  0.226724	  1.444022	  0.444003
  0.234524	  1.458678	  0.456519
  0.239303	  1.474892	  0.468047
  0.244524	  1.488993	  0.480496
  0.249095	  1.506405	  0.490188
  0.253099	  1.522841	  0.504413
  0.256364	  1.534956	  0.518480
  0.264527	  1.549096	  0.527487
  0.269328	  1.567886	  0.535994
  0.268296	  1.586775	  0.551622
  0.266080	  1.601977	  0.562468
  0.275520	  1.610607	  0.577405
  0.279398	  1.628721	  0.590787
  0.281033	  1.642514	  0.603626
  0.278044	  1.661934	  0.610470
  0.275724	  1.682633	  0.618556
  0.274952	  1.696607	  0.629578
  0.274450	  1.712178	  0.641107
  0.272539	  1.730987	  0.650695
  0.274837	  1.743657	  0.665834
  0.281049	  1.761316	  0.677256
  0.283469	  1.780010	  0.690407
  0.278096	  1.794974	  0.698201
  0.275352	  1.811623	  0.707584
  0.270724	  1.830619	  0.720173
  0.269325	  1.845978	  0.726440
  0.268202	  1.867973	  0.730848
  0.264601	  1.886668	  0.744149
  0.264306	  1.897247	  0.758120
  0.265337	  1.914774	  0.772569
  0.262434	  1.931735	  0.783637
  0.256964	  1.949441	  0.789564
  0.251987	  1.970665	  0.796304
  0.248971	  1.982719	  0.810376
  0.249758	  1.998404	  0.821358
  0.246938	  2.016220	  0.837292
  0.244496	  2.032320	  0.848104
  0.243477	  2.045975	  0.860569
  0.242002	  2.064354	  0.871935
  0.238006	  2.082397	  0.880271
  0.238793	  2.095987	  0.891611
  0.240742	  2.117333	  0.901991
  0.237878	  2.129509	  0.914772
  0.237135	  2.144125	  0.929298
  0.236116	  2.160462	  0.943058
  0.239633	  2.178555	  0.950747
  0.244572	  2.197750	  0.959100
  0.243545	  2.211641	  0.973086
  0.243460	  2.224023	  0.987649
  0.245622	  2.241023	  0.999163
  0.247420	  2.255714	  1.013002
  0.250454	  2.273140	  1.023197
  0.252555	  2.290297	  1.035206
  0.254277	  2.308785	  1.068484
  0.257260	  2.324659	  1.080279
