 -1.901904	  1.325191	 -0.974650
 -1.936021	  1.341069	 -0.965423
 -1.925563	  1.336203	 -0.968251
 -1.881249	  1.316782	 -0.980721
 -1.840133	  1.299123	 -0.993302
 -1.803362	  1.282552	 -1.006242
 -1.771176	  1.266143	 -1.019809
 -1.743073	  1.249210	 -1.034115
 -1.719852	  1.231983	 -1.048320
 -1.702991	  1.215783	 -1.061131
 -1.688723	  1.185000	 -1.081144
 -1.689857	  1.130359	 -1.108037
 -1.703671	  1.057562	 -1.134213
 -1.732556	  0.939574	 -1.154709
 -1.756905	  0.787562	 -1.157089
 -1.755036	  0.633748	 -1.153935
 -1.729766	  0.502865	 -1.157360
 -1.693107	  0.398903	 -1.170143
 -1.649682	  0.315471	 -1.188587
 -1.598552	  0.246576	 -1.209369
 -1.533467	  0.186471	 -1.231397
 -1.441312	  0.138543	 -1.254850
 -1.320252	  0.127966	 -1.275847
 -1.198269	  0.168145	 -1.284883
 -1.091811	  0.236572	 -1.274098
 -0.999709	  0.314624	 -1.245475
 -0.922801	  0.388574	 -1.207660
 -0.858771	  0.449903	 -1.171735
 -0.803898	  0.497754	 -1.137773
 -0.753023	  0.534956	 -1.103807
 -0.696177	  0.564659	 -1.064082
 -0.627794	  0.595418	 -1.021281
 -0.557279	  0.621815	 -0.983153
 -0.485480	  0.632649	 -0.944561
 -0.418259	  0.633719	 -0.912520
 -0.360857	  0.624729	 -0.892134
 -0.309503	  0.602000	 -0.880366
 -0.259449	  0.560600	 -0.875610
 -0.210540	  0.501792	 -0.879080
 -0.168255	  0.442001	 -0.887982
 -0.134734	  0.386142	 -0.899353
 -0.106304	  0.327085	 -0.912858
 -0.080976	  0.258141	 -0.929853
 -0.061185	  0.179334	 -0.950335
 -0.049360	  0.091547	 -0.973688
 -0.042973	 -0.000892	 -0.998169
 -0.035740	 -0.083031	 -1.023013
 -0.026881	 -0.146393	 -1.048318
 -0.016513	 -0.190375	 -1.072640
 -0.005517	 -0.219315	 -1.095577
  0.008187	 -0.240852	 -1.121875
  0.025603	 -0.255275	 -1.155137
  0.042787	 -0.260526	 -1.199380
  0.056203	 -0.252263	 -1.274350
  0.078249	 -0.218798	 -1.394062
  0.142490	 -0.171662	 -1.511196
  0.227092	 -0.130663	 -1.600380
  0.318328	 -0.102121	 -1.666935
  0.408853	 -0.088329	 -1.707692
  0.489671	 -0.085585	 -1.735696
  0.546773	 -0.091314	 -1.750186
  0.576774	 -0.097185	 -1.761798
  0.608137	 -0.105267	 -1.781237
  0.653944	 -0.119128	 -1.813290
  0.715297	 -0.139292	 -1.847203
  0.779641	 -0.162091	 -1.867464
  0.837742	 -0.184275	 -1.875943
  0.886706	 -0.202906	 -1.881179
  0.936510	 -0.220016	 -1.886999
  0.982059	 -0.235192	 -1.889436
  1.019530	 -0.250229	 -1.897213
  1.059288	 -0.268815	 -1.909002
  1.099061	 -0.289186	 -1.923268
  1.140926	 -0.311551	 -1.938972
  1.187807	 -0.335535	 -1.954354
  1.236406	 -0.360978	 -1.967391
  1.280836	 -0.386651	 -1.978953
  1.322238	 -0.413093	 -1.991563
  1.364150	 -0.441765	 -2.005356
  1.406298	 -0.471338	 -2.018735
  1.445845	 -0.499792	 -2.031099
  1.500720	 -0.539708	 -2.049848
  1.521204	 -0.554677	 -2.057476
