  2.354109	  0.816745	 -1.723948
  2.330801	  0.808658	 -1.706879
  2.285440	  0.797504	 -1.701666
  2.241040	  0.775586	 -1.711622
  2.197577	  0.753404	 -1.715046
  2.153217	  0.734184	 -1.718946
  2.105646	  0.714241	 -1.719277
  2.063919	  0.699481	 -1.733262
  2.019844	  0.672548	 -1.736450
  1.971050	  0.652668	 -1.741949
  1.927049	  0.632248	 -1.742761
  1.879695	  0.619176	 -1.749044
  1.832098	  0.596015	 -1.746772
  1.785381	  0.575850	 -1.758739
  1.741142	  0.561182	 -1.757294
  1.697231	  0.539023	 -1.763589
  1.650283	  0.519185	 -1.765165
  1.607141	  0.502330	 -1.776770
  1.562265	  0.478081	 -1.777073
  1.514537	  0.456885	 -1.779799
  1.469865	  0.434927	 -1.785968
  1.426305	  0.413066	 -1.793942
  1.378711	  0.389991	 -1.802556
  1.334752	  0.370156	 -1.809937
  1.288672	  0.352487	 -1.818026
  1.242439	  0.336197	 -1.825545
  1.197635	  0.320069	 -1.832028
  1.150535	  0.303396	 -1.837684
  1.100334	  0.287022	 -1.841695
  1.051490	  0.271705	 -1.843757
  1.004830	  0.255742	 -1.845556
  0.960875	  0.238994	 -1.848072
  0.916299	  0.220311	 -1.851231
  0.869498	  0.200680	 -1.856306
  0.822934	  0.181601	 -1.863057
  0.773081	  0.161426	 -1.871308
  0.728695	  0.143604	 -1.878522
  0.680830	  0.124419	 -1.885649
  0.638459	  0.107574	 -1.890606
  0.594524	  0.090448	 -1.894226
  0.547413	  0.070576	 -1.895063
  0.502455	  0.050187	 -1.893001
  0.453577	  0.026883	 -1.890322
  0.408159	  0.004624	 -1.891571
  0.364073	 -0.017676	 -1.897002
  0.319344	 -0.040131	 -1.905082
  0.273804	 -0.062829	 -1.912960
  0.229906	 -0.084997	 -1.919041
  0.186596	 -0.107826	 -1.923446
  0.140205	 -0.131142	 -1.926196
  0.096090	 -0.152117	 -1.927328
  0.051681	 -0.171420	 -1.928080
  0.005141	 -0.190146	 -1.930090
 -0.041823	 -0.207916	 -1.934391
 -0.085808	 -0.224140	 -1.941384
 -0.129903	 -0.240027	 -1.951451
 -0.177554	 -0.257699	 -1.963447
 -0.225419	 -0.276855	 -1.974076
 -0.270054	 -0.295642	 -1.980930
 -0.314386	 -0.314562	 -1.985808
 -0.361929	 -0.334700	 -1.988724
 -0.410980	 -0.357343	 -1.988871
 -0.453335	 -0.378472	 -1.986362
 -0.499766	 -0.402414	 -1.987191
 -0.541721	 -0.424865	 -1.990890
 -0.589886	 -0.441915	 -1.991403
 -0.634644	 -0.462244	 -1.991771
 -0.678797	 -0.487207	 -2.000439
 -0.727228	 -0.503345	 -2.000909
 -0.772002	 -0.523578	 -2.001278
 -0.815191	 -0.545137	 -2.014279
 -0.859053	 -0.569117	 -2.014973
 -0.903387	 -0.592629	 -2.021079
 -0.949532	 -0.615683	 -2.027876
 -0.994972	 -0.637539	 -2.035197
 -1.040864	 -0.658902	 -2.042640
 -1.084226	 -0.678778	 -2.048944
 -1.123890	 -0.698384	 -2.053726
 -1.167486	 -0.722454	 -2.056611
 -1.215150	 -0.747107	 -2.057323
 -1.262315	 -0.768724	 -2.056770
 -1.310752	 -0.789699	 -2.057553
 -1.355546	 -0.807992	 -2.059660
 -1.399729	 -0.825193	 -2.062488
 -1.446130	 -0.842156	 -2.066059
 -1.496028	 -0.858938	 -2.070570
 -1.544218	 -0.873983	 -2.076292
 -1.593882	 -0.888786	 -2.083137
 -1.639202	 -0.902141	 -2.090448
 -1.685694	 -0.920040	 -2.096904
 -1.732985	 -0.934134	 -2.100658
 -1.776853	 -0.954145	 -2.110767
 -1.825546	 -0.978722	 -2.104893
 -1.875333	 -0.998766	 -2.117922
 -1.894086	 -1.008754	 -2.139101
