 -2.234649	  1.946492	  0.631200
 -2.212524	  1.927220	  0.624950
 -2.172800	  1.898387	  0.614055
 -2.141928	  1.865042	  0.594824
 -2.104562	  1.837241	  0.575152
 -2.074118	  1.799164	  0.559075
 -2.040260	  1.769585	  0.536453
 -2.005757	  1.739870	  0.519813
 -1.974760	  1.704102	  0.506962
 -1.945753	  1.673508	  0.482944
 -1.921085	  1.633702	  0.466700
 -1.893069	  1.597959	  0.446865
 -1.863850	  1.561801	  0.425733
 -1.832729	  1.525708	  0.404130
 -1.802203	  1.492295	  0.384315
 -1.770851	  1.458625	  0.365560
 -1.739492	  1.424442	  0.346764
 -1.707278	  1.392917	  0.324901
 -1.673436	  1.365262	  0.299803
 -1.636905	  1.340494	  0.274233
 -1.598708	  1.317978	  0.250877
 -1.560130	  1.295215	  0.228511
 -1.523060	  1.270071	  0.208274
 -1.486946	  1.243792	  0.188703
 -1.449819	  1.215292	  0.166844
 -1.411640	  1.183480	  0.146893
 -1.375264	  1.149701	  0.130753
 -1.341670	  1.114903	  0.116373
 -1.311304	  1.079197	  0.103100
 -1.282910	  1.041318	  0.089799
 -1.256728	  1.001590	  0.076056
 -1.230870	  0.960239	  0.060742
 -1.204606	  0.919236	  0.044901
 -1.176140	  0.879860	  0.029316
 -1.144148	  0.843569	  0.014307
 -1.110153	  0.812129	 -0.000608
 -1.074023	  0.784261	 -0.016990
 -1.035909	  0.756733	 -0.034765
 -0.995600	  0.728652	 -0.053185
 -0.956026	  0.701900	 -0.068797
 -0.917191	  0.675220	 -0.081324
 -0.877619	  0.646001	 -0.091708
 -0.838834	  0.614924	 -0.099552
 -0.802213	  0.583012	 -0.107307
 -0.768092	  0.548673	 -0.118551
 -0.736863	  0.513143	 -0.134719
 -0.706793	  0.476528	 -0.155670
 -0.678221	  0.439753	 -0.178220
 -0.650779	  0.404555	 -0.201114
 -0.623423	  0.370670	 -0.223963
 -0.593921	  0.337150	 -0.247112
 -0.562959	  0.304343	 -0.270203
 -0.532112	  0.272984	 -0.291730
 -0.499683	  0.240442	 -0.311607
 -0.467954	  0.206139	 -0.329416
 -0.437226	  0.170323	 -0.345903
 -0.407826	  0.134284	 -0.361414
 -0.378996	  0.097960	 -0.376713
 -0.349160	  0.060607	 -0.392640
 -0.318678	  0.024331	 -0.409196
 -0.287065	 -0.009760	 -0.427472
 -0.253486	 -0.041681	 -0.447990
 -0.216687	 -0.071310	 -0.470339
 -0.179541	 -0.097792	 -0.492425
 -0.142274	 -0.122364	 -0.513834
 -0.102977	 -0.147928	 -0.535620
 -0.064210	 -0.173543	 -0.555820
 -0.027366	 -0.199602	 -0.572867
  0.010542	 -0.230212	 -0.588303
  0.046544	 -0.261656	 -0.602486
  0.081740	 -0.295888	 -0.617021
  0.113561	 -0.331886	 -0.630734
  0.144045	 -0.367934	 -0.643637
  0.175543	 -0.403479	 -0.657069
  0.208643	 -0.439799	 -0.672030
  0.242007	 -0.475045	 -0.688456
  0.274084	 -0.507355	 -0.706070
  0.304924	 -0.538449	 -0.726048
  0.335602	 -0.569866	 -0.749078
  0.366163	 -0.601568	 -0.774680
  0.396156	 -0.633084	 -0.801834
  0.424753	 -0.663661	 -0.828666
  0.454894	 -0.696667	 -0.853514
  0.484228	 -0.730842	 -0.872237
  0.513106	 -0.766649	 -0.886448
  0.545098	 -0.804617	 -0.898814
  0.579316	 -0.841182	 -0.910474
  0.612415	 -0.875360	 -0.923056
  0.645290	 -0.909757	 -0.939429
  0.678170	 -0.942506	 -0.956961
  0.712282	 -0.975379	 -0.975097
  0.747121	 -1.007583	 -0.993177
  0.781706	 -1.039166	 -1.012297
  0.813983	 -1.069729	 -1.034582
  0.847588	 -1.099825	 -1.056700
  0.881897	 -1.127089	 -1.076211
  0.912643	 -1.155265	 -1.096585
  0.944512	 -1.184986	 -1.118174
  0.981100	 -1.216948	 -1.134544
  1.017627	 -1.249170	 -1.145588
  1.049844	 -1.284454	 -1.161517
  1.083633	 -1.321207	 -1.172260
  1.116796	 -1.349355	 -1.197424
  1.148161	 -1.384083	 -1.217251
  1.182933	 -1.419463	 -1.230288
  1.218004	 -1.447765	 -1.252146
  1.250454	 -1.478777	 -1.270833
  1.279475	 -1.516377	 -1.282766
  1.310581	 -1.549027	 -1.304647
  1.345631	 -1.578748	 -1.325683
  1.380122	 -1.613271	 -1.338096
  1.412296	 -1.642207	 -1.361583
  1.440406	 -1.679737	 -1.376277
  1.466116	 -1.719313	 -1.394938
  1.498701	 -1.751642	 -1.417320
  1.528433	 -1.785942	 -1.434553
  1.558048	 -1.820058	 -1.453893
  1.591342	 -1.852166	 -1.472064
  1.625437	 -1.883512	 -1.489511
  1.660681	 -1.916575	 -1.506683
  1.704000	 -1.942110	 -1.524661
  1.721040	 -1.961532	 -1.539908
