 -1.407490	  0.864880	 -1.895023
 -1.413283	  0.863006	 -1.897688
 -1.395851	  0.868646	 -1.889669
 -1.378420	  0.874291	 -1.881654
 -1.361456	  0.881111	 -1.874074
 -1.345102	  0.890496	 -1.866975
 -1.328501	  0.898408	 -1.859829
 -1.313137	  0.907011	 -1.853623
 -1.292495	  0.917808	 -1.844890
 -1.275353	  0.918850	 -1.836751
 -1.257037	  0.917970	 -1.828314
 -1.238151	  0.922650	 -1.820099
 -1.223436	  0.932542	 -1.814613
 -1.205431	  0.945662	 -1.807916
 -1.187724	  0.952431	 -1.799756
 -1.173846	  0.953966	 -1.791142
 -1.156612	  0.962692	 -1.779241
 -1.140234	  0.975519	 -1.771243
 -1.123811	  0.986293	 -1.767757
 -1.103047	  0.994655	 -1.761379
 -1.091972	  0.996486	 -1.755752
 -1.076362	  1.004942	 -1.744303
 -1.056015	  1.011637	 -1.732428
 -1.035108	  1.013758	 -1.727781
 -1.014915	  1.016862	 -1.727011
 -0.996645	  1.027584	 -1.723689
 -0.985155	  1.038148	 -1.712867
 -0.971715	  1.047221	 -1.699800
 -0.952262	  1.056027	 -1.689141
 -0.933980	  1.063747	 -1.683593
 -0.917779	  1.070620	 -1.681985
 -0.899307	  1.074164	 -1.675720
 -0.880355	  1.081323	 -1.667240
 -0.863026	  1.090212	 -1.662116
 -0.846448	  1.098194	 -1.661314
 -0.823425	  1.112397	 -1.661145
 -0.809347	  1.121165	 -1.661437
 -0.792225	  1.126289	 -1.656853
 -0.770666	  1.132282	 -1.650166
 -0.753152	  1.146429	 -1.647935
 -0.741850	  1.162083	 -1.651275
 -0.725128	  1.178520	 -1.651437
 -0.712636	  1.182401	 -1.644589
 -0.691018	  1.185908	 -1.633250
 -0.666859	  1.193171	 -1.629223
 -0.647463	  1.201815	 -1.633291
 -0.636672	  1.211419	 -1.640362
 -0.619958	  1.221876	 -1.644333
 -0.595841	  1.232376	 -1.648275
 -0.578554	  1.240440	 -1.649675
 -0.564224	  1.249810	 -1.649550
 -0.545436	  1.261028	 -1.644682
 -0.525788	  1.268438	 -1.638832
 -0.506520	  1.271966	 -1.637092
 -0.486051	  1.275911	 -1.640116
 -0.464225	  1.280487	 -1.638569
 -0.444870	  1.280387	 -1.630765
 -0.428950	  1.279201	 -1.624932
 -0.407702	  1.279344	 -1.620067
 -0.391835	  1.277253	 -1.611411
 -0.374089	  1.274356	 -1.597618
 -0.354803	  1.272364	 -1.583868
 -0.337684	  1.270518	 -1.579343
 -0.318788	  1.265001	 -1.574968
 -0.303809	  1.257858	 -1.565525
 -0.288860	  1.249515	 -1.556062
 -0.270972	  1.240528	 -1.545980
 -0.257526	  1.233863	 -1.534786
 -0.243538	  1.229717	 -1.520219
 -0.230247	  1.223681	 -1.505169
 -0.216654	  1.217566	 -1.493735
 -0.201703	  1.210058	 -1.481124
 -0.188931	  1.207142	 -1.469943
 -0.171611	  1.204289	 -1.453877
 -0.159040	  1.197861	 -1.441795
 -0.148296	  1.187792	 -1.430318
 -0.134446	  1.176895	 -1.416252
 -0.123505	  1.171074	 -1.401287
 -0.114468	  1.166548	 -1.383830
 -0.104392	  1.159830	 -1.367260
 -0.095189	  1.152167	 -1.353188
 -0.085566	  1.146456	 -1.336223
 -0.071967	  1.140157	 -1.316191
 -0.063846	  1.135050	 -1.304095
 -0.055635	  1.127615	 -1.288393
 -0.046065	  1.117672	 -1.272112
 -0.036527	  1.107273	 -1.257595
 -0.027091	  1.097327	 -1.242624
 -0.017478	  1.086178	 -1.228765
 -0.008262	  1.075049	 -1.216323
  0.001798	  1.064768	 -1.202868
  0.013489	  1.052560	 -1.191978
  0.025168	  1.039866	 -1.181829
  0.037606	  1.027804	 -1.172147
  0.050816	  1.016574	 -1.161952
  0.064983	  1.006990	 -1.151481
  0.078789	  0.996417	 -1.141086
  0.093904	  0.988003	 -1.131400
  0.110721	  0.981937	 -1.122407
  0.127739	  0.974804	 -1.113097
  0.145588	  0.970698	 -1.105028
  0.163673	  0.968429	 -1.096803
  0.181873	  0.966208	 -1.088163
  0.198693	  0.968807	 -1.080906
  0.216427	  0.976145	 -1.069954
  0.231257	  0.987649	 -1.056803
  0.247211	  0.993248	 -1.047137
  0.263471	  0.993532	 -1.043885
  0.285179	  0.998681	 -1.039569
  0.300435	  1.015846	 -1.032885
  0.306583	  1.033794	 -1.022499
  0.310561	  1.048557	 -1.010876
  0.320526	  1.063714	 -1.003249
  0.334107	  1.079244	 -1.005644
  0.358341	  1.092367	 -1.007066
  0.378316	  1.102163	 -1.000345
  0.385666	  1.111696	 -0.993105
  0.391585	  1.132516	 -0.986805
  0.400641	  1.151876	 -0.985043
  0.417964	  1.166847	 -0.982649
  0.434319	  1.176708	 -0.980927
  0.446768	  1.192334	 -0.981878
  0.453787	  1.209998	 -0.987777
  0.466238	  1.226740	 -0.993933
  0.485064	  1.239586	 -0.994540
  0.496595	  1.252677	 -0.993148
  0.506422	  1.269759	 -0.993145
  0.522651	  1.287203	 -0.991226
  0.539940	  1.298581	 -0.990578
  0.550328	  1.310537	 -0.991924
  0.563032	  1.327938	 -0.987591
  0.579691	  1.342050	 -0.980172
  0.594084	  1.351269	 -0.980559
  0.609306	  1.365605	 -0.983757
  0.623526	  1.380393	 -0.988623
  0.641253	  1.392999	 -0.989378
  0.657082	  1.403978	 -0.983521
  0.670958	  1.415119	 -0.976250
  0.688190	  1.425878	 -0.972793
  0.706169	  1.434863	 -0.971861
  0.724030	  1.443821	 -0.970947
  0.741892	  1.452766	 -0.970023
  0.760609	  1.459791	 -0.969465
  0.779409	  1.466594	 -0.968968
  0.798218	  1.473372	 -0.968464
  0.817421	  1.478843	 -0.967328
  0.836654	  1.484195	 -0.966134
  0.855922	  1.489165	 -0.964599
  0.874174	  1.492419	 -0.960353
  0.894330	  1.494543	 -0.953375
  0.914486	  1.497833	 -0.950449
  0.935688	  1.504465	 -0.953248
  0.951627	  1.506931	 -0.951104
  0.971644	  1.506758	 -0.944302
  0.994088	  1.508350	 -0.942292
  1.012206	  1.510447	 -0.940676
  1.029631	  1.510000	 -0.932960
  1.050963	  1.513013	 -0.929447
  1.075953	  1.517563	 -0.929779
  1.090680	  1.516787	 -0.922768
  1.105947	  1.513583	 -0.910767
  1.125417	  1.516231	 -0.902349
  1.144621	  1.525654	 -0.901611
  1.164892	  1.531066	 -0.895544
  1.183258	  1.531302	 -0.886213
  1.200363	  1.535937	 -0.880248
  1.217757	  1.544331	 -0.875118
  1.235308	  1.549266	 -0.866723
  1.257312	  1.551965	 -0.858559
  1.273572	  1.558834	 -0.856621
  1.289708	  1.567301	 -0.851436
  1.310473	  1.572003	 -0.842793
  1.330150	  1.576595	 -0.840329
  1.345587	  1.585119	 -0.837283
  1.363494	  1.593402	 -0.829342
  1.386851	  1.595416	 -0.823581
  1.402758	  1.598203	 -0.818926
  1.417577	  1.605220	 -0.809895
  1.435598	  1.611987	 -0.800016
  1.459250	  1.613461	 -0.795635
  1.474432	  1.613717	 -0.790919
  1.491438	  1.616179	 -0.781449
  1.509946	  1.620293	 -0.769841
  1.527407	  1.627202	 -0.762375
  1.545879	  1.636097	 -0.754873
  1.559358	  1.642115	 -0.745905
  1.576114	  1.643523	 -0.731547
  1.594623	  1.641667	 -0.715280
  1.608795	  1.641759	 -0.705382
  1.626156	  1.644947	 -0.698564
  1.644626	  1.651508	 -0.690935
  1.663407	  1.658731	 -0.677788
  1.677413	  1.661927	 -0.669177
  1.696612	  1.662165	 -0.664609
  1.720330	  1.661701	 -0.661661
  1.740250	  1.668625	 -0.655481
  1.756219	  1.681642	 -0.646137
  1.768134	  1.689947	 -0.635954
  1.783944	  1.692372	 -0.624695
  1.802659	  1.694312	 -0.614525
  1.821586	  1.696344	 -0.605594
  1.839674	  1.700168	 -0.597964
