  1.312707	 -1.242828	  1.831496
  1.316925	 -1.238767	  1.836212
  1.305972	 -1.250055	  1.823842
  1.294870	 -1.261121	  1.811416
  1.283515	 -1.271869	  1.798865
  1.271872	 -1.281930	  1.786112
  1.260186	 -1.292137	  1.773651
  1.248167	 -1.301869	  1.761476
  1.235169	 -1.307869	  1.749536
  1.219829	 -1.316695	  1.733587
  1.208622	 -1.327037	  1.720012
  1.198144	 -1.339864	  1.712742
  1.183982	 -1.353699	  1.705859
  1.170348	 -1.366634	  1.692964
  1.158544	 -1.370911	  1.680761
  1.143194	 -1.376888	  1.666341
  1.129248	 -1.388014	  1.655870
  1.115959	 -1.400734	  1.650275
  1.101459	 -1.416110	  1.643650
  1.088520	 -1.425900	  1.632347
  1.074580	 -1.431284	  1.620454
  1.058745	 -1.441141	  1.604884
  1.046781	 -1.454207	  1.593061
  1.036955	 -1.465500	  1.590136
  1.020882	 -1.479776	  1.585165
  1.006526	 -1.492723	  1.578772
  0.992749	 -1.505423	  1.573433
  0.975748	 -1.520800	  1.566423
  0.966803	 -1.532080	  1.552967
  0.959661	 -1.543551	  1.536619
  0.948566	 -1.556835	  1.523424
  0.935492	 -1.569789	  1.519416
  0.920264	 -1.585232	  1.515726
  0.907675	 -1.599659	  1.507517
  0.900913	 -1.611491	  1.495001
  0.891268	 -1.626704	  1.481697
  0.878619	 -1.641217	  1.477201
  0.864591	 -1.657127	  1.477330
  0.849097	 -1.674732	  1.474051
  0.841255	 -1.686133	  1.463536
  0.831838	 -1.702719	  1.455350
  0.824069	 -1.718790	  1.446168
  0.815107	 -1.734919	  1.437054
  0.806633	 -1.750973	  1.428723
  0.797202	 -1.767462	  1.422079
  0.787798	 -1.783848	  1.415514
  0.778849	 -1.800448	  1.408851
  0.770001	 -1.817092	  1.402168
  0.761179	 -1.833738	  1.395455
  0.752711	 -1.850401	  1.388338
  0.744244	 -1.867064	  1.381220
  0.735828	 -1.883698	  1.373976
  0.727606	 -1.900211	  1.366248
  0.719382	 -1.916725	  1.358525
  0.711082	 -1.933127	  1.350647
  0.702618	 -1.949245	  1.342378
  0.694193	 -1.965364	  1.334002
  0.685661	 -1.981158	  1.325280
  0.675953	 -1.996139	  1.317693
  0.663318	 -2.012499	  1.311596
  0.650346	 -2.027474	  1.306359
  0.640625	 -2.042802	  1.296132
  0.631901	 -2.057498	  1.285070
  0.627473	 -2.070410	  1.270694
  0.620120	 -2.083880	  1.257192
  0.610774	 -2.097666	  1.245500
  0.600382	 -2.110693	  1.234381
  0.589941	 -2.123672	  1.223310
  0.579298	 -2.136454	  1.212201
  0.568353	 -2.148832	  1.200932
  0.557408	 -2.161210	  1.189664
  0.546244	 -2.173381	  1.178383
  0.535031	 -2.185504	  1.167100
  0.523681	 -2.197644	  1.155973
  0.512154	 -2.209804	  1.145053
  0.500598	 -2.221949	  1.134146
  0.488759	 -2.233941	  1.123374
  0.476921	 -2.245933	  1.112602
  0.464813	 -2.257729	  1.101914
  0.452570	 -2.269426	  1.091269
  0.440218	 -2.281144	  1.080775
  0.427638	 -2.292905	  1.070604
  0.415054	 -2.304668	  1.060444
  0.402173	 -2.316363	  1.050580
  0.389295	 -2.328065	  1.040719
  0.376183	 -2.339690	  1.031080
  0.362960	 -2.351261	  1.021523
  0.349727	 -2.362822	  1.011964
  0.336222	 -2.374571	  1.002244
  0.319301	 -2.388967	  0.990265
  0.305939	 -2.400468	  0.980821
