 -1.208762	  2.776875	 -0.093599
 -1.196794	  2.749381	 -0.092672
 -1.175571	  2.727274	 -0.049456
 -1.168283	  2.689857	 -0.013862
 -1.162421	  2.652500	  0.019627
 -1.158800	  2.614388	  0.052155
 -1.156244	  2.575476	  0.083726
 -1.153499	  2.536142	  0.113025
 -1.149809	  2.497215	  0.140695
 -1.144223	  2.456366	  0.168319
 -1.136974	  2.414564	  0.195546
 -1.129723	  2.375014	  0.221715
 -1.118782	  2.333790	  0.250772
 -1.102535	  2.291191	  0.276461
 -1.090755	  2.253455	  0.308254
 -1.080253	  2.220888	  0.339942
 -1.076263	  2.178963	  0.361811
 -1.059962	  2.137464	  0.385838
 -1.051480	  2.094404	  0.413334
 -1.040545	  2.059070	  0.447670
 -1.029039	  2.024193	  0.481715
 -1.026677	  1.989506	  0.518559
 -1.024200	  1.957332	  0.556156
 -1.019517	  1.930014	  0.595148
 -1.013814	  1.900909	  0.636061
 -1.009371	  1.868610	  0.676199
 -1.007272	  1.831407	  0.712245
 -1.007951	  1.793763	  0.745276
 -1.007551	  1.756118	  0.781929
 -1.002304	  1.717238	  0.816502
 -0.992462	  1.678114	  0.849093
 -0.978215	  1.637339	  0.879522
 -0.964901	  1.599058	  0.907046
 -0.957394	  1.568835	  0.931974
 -0.955012	  1.548368	  0.957271
 -0.960685	  1.527037	  1.013858
 -1.000510	  1.550093	  1.128931
 -1.013025	  1.530423	  1.189907
 -1.160178	  1.538017	  1.299527
 -1.257135	  1.530359	  1.372458
 -1.340429	  1.522762	  1.455196
 -1.432500	  1.461494	  1.541744
 -1.440963	  1.392448	  1.570900
 -1.429169	  1.350673	  1.585056
 -1.397080	  1.273400	  1.600403
 -1.365957	  1.203163	  1.604381
 -1.338786	  1.152547	  1.604951
 -1.296930	  1.091717	  1.604454
 -1.238885	  1.027247	  1.593542
 -1.146994	  0.967563	  1.547866
 -1.005469	  0.921836	  1.455642
 -0.870714	  0.858714	  1.418991
 -0.809955	  0.794885	  1.448056
 -0.788295	  0.751556	  1.479129
 -0.777288	  0.714465	  1.509359
 -0.769836	  0.677134	  1.541466
 -0.763819	  0.640077	  1.573681
 -0.759155	  0.603783	  1.604006
 -0.754689	  0.565603	  1.634386
 -0.748882	  0.524790	  1.666041
 -0.742722	  0.486803	  1.695438
 -0.736391	  0.450032	  1.723877
 -0.728188	  0.412090	  1.752976
 -0.718999	  0.372261	  1.783762
 -0.710914	  0.334891	  1.813449
 -0.703446	  0.295816	  1.845253
 -0.696369	  0.257812	  1.876354
 -0.688206	  0.216756	  1.904563
 -0.674648	  0.178630	  1.932244
 -0.664673	  0.148421	  1.970655
 -0.654663	  0.118584	  2.009412
 -0.647104	  0.085017	  2.047386
 -0.636165	  0.044224	  2.079121
 -0.624881	  0.004047	  2.105251
 -0.615281	 -0.031325	  2.132961
 -0.605993	 -0.069456	  2.163781
 -0.598497	 -0.110949	  2.194790
 -0.589491	 -0.150951	  2.225414
 -0.578880	 -0.187969	  2.255415
 -0.567801	 -0.224858	  2.285304
 -0.557511	 -0.264573	  2.314720
 -0.548242	 -0.305396	  2.342893
 -0.539770	 -0.344020	  2.369038
 -0.531080	 -0.382739	  2.395492
 -0.522413	 -0.422997	  2.423506
 -0.514300	 -0.464643	  2.453100
 -0.507543	 -0.505417	  2.482579
 -0.502097	 -0.546140	  2.512398
 -0.497505	 -0.584698	  2.540600
 -0.491677	 -0.625265	  2.569950
 -0.485340	 -0.664512	  2.599548
 -0.479784	 -0.703539	  2.630531
 -0.473967	 -0.740451	  2.661793
 -0.470259	 -0.774898	  2.697527
 -0.466644	 -0.811768	  2.731475
 -0.458053	 -0.850995	  2.758334
 -0.454467	 -0.884635	  2.793479
 -0.449539	 -0.930721	  2.816323
 -0.454034	 -0.940028	  2.844486
