  0.696451	  0.336794	 -2.379087
  0.693966	  0.335965	 -2.378138
  0.678584	  0.330830	 -2.372261
  0.659986	  0.326557	 -2.365774
  0.641591	  0.321426	 -2.358485
  0.623593	  0.317377	 -2.350604
  0.606162	  0.311245	 -2.342001
  0.588986	  0.307131	 -2.332440
  0.572224	  0.300658	 -2.322127
  0.555615	  0.297572	 -2.312779
  0.540319	  0.294117	 -2.306988
  0.523110	  0.289917	 -2.302178
  0.504897	  0.288648	 -2.292426
  0.488499	  0.289642	 -2.279139
  0.474244	  0.287617	 -2.265917
  0.459166	  0.285203	 -2.254734
  0.440350	  0.283309	 -2.246429
  0.422153	  0.284588	 -2.236081
  0.406254	  0.286582	 -2.224431
  0.390581	  0.287436	 -2.216090
  0.371195	  0.282837	 -2.213964
  0.344929	  0.272930	 -2.210785
  0.330274	  0.267231	 -2.207710
  0.312356	  0.261488	 -2.200345
  0.291724	  0.254619	 -2.198399
  0.274838	  0.249152	 -2.199706
  0.256744	  0.243493	 -2.206076
  0.237306	  0.238416	 -2.214076
  0.218221	  0.232869	 -2.224189
  0.203368	  0.228217	 -2.232312
  0.187532	  0.221891	 -2.243368
  0.166348	  0.216707	 -2.263319
  0.158697	  0.215036	 -2.274130
  0.154349	  0.213065	 -2.286254
  0.142647	  0.203610	 -2.303732
  0.119611	  0.190718	 -2.317293
  0.103088	  0.185739	 -2.327615
  0.088713	  0.183956	 -2.338133
  0.072425	  0.183341	 -2.349218
  0.055854	  0.180607	 -2.361186
  0.041684	  0.174999	 -2.374782
  0.032206	  0.168376	 -2.388553
  0.021813	  0.160961	 -2.403959
  0.007406	  0.152121	 -2.414933
 -0.017308	  0.139240	 -2.427450
 -0.025207	  0.133796	 -2.433103
 -0.038646	  0.122765	 -2.443092
 -0.048681	  0.110345	 -2.456704
 -0.059231	  0.098936	 -2.470953
 -0.074234	  0.091192	 -2.481494
 -0.105190	  0.080313	 -2.504754
 -0.120023	  0.072317	 -2.515527
