  0.488703	 -2.466603	 -0.009296
  0.484237	 -2.476546	 -0.008519
  0.480385	 -2.453909	  0.003890
  0.495122	 -2.433697	  0.006541
  0.512003	 -2.420611	  0.001910
  0.527673	 -2.407021	 -0.008115
  0.539100	 -2.393247	 -0.018585
  0.550108	 -2.377126	 -0.027612
  0.557234	 -2.359976	 -0.035555
  0.564131	 -2.342522	 -0.043013
  0.569044	 -2.324348	 -0.049429
  0.574143	 -2.305548	 -0.054950
  0.579309	 -2.287042	 -0.060410
  0.584106	 -2.268531	 -0.066386
  0.588584	 -2.250104	 -0.073483
  0.593252	 -2.232927	 -0.080517
  0.600714	 -2.218624	 -0.087869
  0.613164	 -2.206007	 -0.094596
  0.630952	 -2.181758	 -0.105493
  0.637913	 -2.166485	 -0.110902
  0.643983	 -2.154523	 -0.115139
  0.652336	 -2.133526	 -0.123886
  0.659255	 -2.112173	 -0.128959
  0.665115	 -2.096725	 -0.129512
  0.671955	 -2.074434	 -0.133328
  0.674585	 -2.056743	 -0.140215
  0.672164	 -2.037679	 -0.150074
  0.672975	 -2.015422	 -0.161046
  0.676115	 -2.000464	 -0.163316
  0.682635	 -1.980130	 -0.164197
  0.686500	 -1.959075	 -0.165572
  0.687099	 -1.939822	 -0.163879
  0.688521	 -1.910032	 -0.159848
  0.689402	 -1.894476	 -0.158276
  0.690412	 -1.877331	 -0.157154
  0.696006	 -1.851580	 -0.159911
  0.700970	 -1.836313	 -0.164984
  0.706829	 -1.822067	 -0.170210
  0.715445	 -1.799645	 -0.177712
  0.723426	 -1.784858	 -0.182958
  0.734440	 -1.767684	 -0.190008
  0.744048	 -1.750014	 -0.196515
  0.753181	 -1.732537	 -0.200123
  0.762244	 -1.714476	 -0.201849
  0.767982	 -1.695618	 -0.204115
  0.774190	 -1.676147	 -0.206904
  0.782247	 -1.657837	 -0.211349
  0.793640	 -1.640723	 -0.215113
  0.805142	 -1.623827	 -0.215391
  0.811770	 -1.605289	 -0.214680
  0.814960	 -1.585473	 -0.215473
  0.821875	 -1.565526	 -0.217128
  0.835001	 -1.548664	 -0.218553
  0.851101	 -1.532185	 -0.215557
  0.862911	 -1.519841	 -0.210303
  0.872442	 -1.499869	 -0.205827
  0.873517	 -1.480562	 -0.205257
  0.873529	 -1.458976	 -0.200491
  0.876773	 -1.433695	 -0.193636
  0.885123	 -1.412180	 -0.194163
  0.893720	 -1.396455	 -0.207519
  0.898840	 -1.381463	 -0.220443
  0.902709	 -1.364044	 -0.231193
  0.908750	 -1.347060	 -0.240875
  0.913528	 -1.331763	 -0.253670
  0.917496	 -1.315344	 -0.264755
  0.921318	 -1.299917	 -0.276464
  0.926262	 -1.282756	 -0.286151
  0.928753	 -1.262977	 -0.295643
  0.930213	 -1.246576	 -0.308952
  0.934631	 -1.240977	 -0.329734
  0.934974	 -1.243291	 -0.356748
  0.930619	 -1.232465	 -0.379792
  0.927916	 -1.222627	 -0.390840
  0.928611	 -1.213102	 -0.402770
  0.930234	 -1.208183	 -0.429761
  0.926558	 -1.198689	 -0.450742
  0.923878	 -1.192977	 -0.461961
  0.921386	 -1.184595	 -0.480324
  0.915499	 -1.170393	 -0.502978
  0.911480	 -1.160656	 -0.511798
  0.904465	 -1.146178	 -0.529648
  0.897062	 -1.133943	 -0.550068
  0.894881	 -1.127463	 -0.555116
  0.893213	 -1.111626	 -0.564588
  0.899953	 -1.096666	 -0.567234
  0.894788	 -1.097342	 -0.570616
  0.903159	 -1.080585	 -0.576884
  0.904142	 -1.070781	 -0.579421
  0.904969	 -1.052448	 -0.582585
  0.903989	 -1.035542	 -0.585396
  0.909483	 -1.017115	 -0.579178
  0.922212	 -0.998732	 -0.559635
  0.927706	 -0.990649	 -0.545064
  0.930124	 -0.983113	 -0.527988
  0.933380	 -0.968297	 -0.503334
  0.933540	 -0.956454	 -0.485697
  0.933798	 -0.939516	 -0.474377
  0.941616	 -0.911150	 -0.470298
  0.949129	 -0.890940	 -0.470331
  0.954770	 -0.878677	 -0.470424
  0.964609	 -0.857593	 -0.467816
  0.976225	 -0.839532	 -0.462006
  0.987659	 -0.823319	 -0.459164
  0.997945	 -0.805208	 -0.457589
  1.006922	 -0.789437	 -0.450654
  1.012069	 -0.772213	 -0.449452
  1.017531	 -0.754610	 -0.440977
  1.022309	 -0.738145	 -0.441018
  1.027924	 -0.713059	 -0.437765
  1.038141	 -0.692654	 -0.444240
  1.046405	 -0.683268	 -0.449939
  1.056313	 -0.669426	 -0.463517
  1.064848	 -0.651405	 -0.473595
  1.072176	 -0.633777	 -0.480862
  1.078774	 -0.615878	 -0.486988
  1.085309	 -0.597316	 -0.491663
  1.091685	 -0.578811	 -0.495603
  1.097585	 -0.559535	 -0.500025
  1.102502	 -0.540022	 -0.501848
  1.105622	 -0.520140	 -0.501926
  1.111440	 -0.500194	 -0.502667
  1.117041	 -0.481007	 -0.501765
  1.121477	 -0.462522	 -0.500426
  1.126525	 -0.444309	 -0.499434
  1.130840	 -0.427663	 -0.497495
  1.133160	 -0.406675	 -0.493485
  1.136274	 -0.384714	 -0.494262
  1.144761	 -0.360992	 -0.500708
  1.152439	 -0.347947	 -0.504512
  1.163317	 -0.334181	 -0.509182
  1.177179	 -0.314299	 -0.515210
  1.185365	 -0.293976	 -0.518390
  1.188843	 -0.282322	 -0.521846
  1.196316	 -0.263307	 -0.528686
  1.201980	 -0.240682	 -0.533618
  1.206653	 -0.218109	 -0.536549
  1.210518	 -0.202796	 -0.537883
  1.215648	 -0.182637	 -0.539560
  1.219863	 -0.163586	 -0.541874
  1.220986	 -0.142565	 -0.546609
  1.220512	 -0.121451	 -0.549915
  1.223544	 -0.103911	 -0.553608
  1.229423	 -0.084335	 -0.557072
  1.234393	 -0.065418	 -0.560583
  1.236492	 -0.046005	 -0.564540
  1.238565	 -0.025309	 -0.569886
  1.239034	 -0.005679	 -0.575255
  1.235158	  0.012882	 -0.579837
  1.224798	  0.030553	 -0.584072
  1.216279	  0.047338	 -0.587818
  1.209187	  0.068008	 -0.592847
  1.198996	  0.084749	 -0.596813
  1.186353	  0.099668	 -0.600652
  1.172842	  0.112847	 -0.604218
  1.168277	  0.122787	 -0.606936
  1.183635	  0.127787	 -0.607235
  1.171464	  0.128288	 -0.610838
  1.149914	  0.180251	 -0.633013
  1.147798	  0.199730	 -0.633618
  1.139285	  0.213239	 -0.627736
  1.150350	  0.231324	 -0.621985
  1.170914	  0.244567	 -0.620927
  1.191449	  0.257825	 -0.626032
  1.204961	  0.268604	 -0.631422
  1.215328	  0.283833	 -0.634084
  1.221986	  0.306595	 -0.636748
  1.228368	  0.323739	 -0.639927
  1.231872	  0.338342	 -0.644369
  1.240263	  0.358689	 -0.648193
  1.247769	  0.374453	 -0.651140
  1.258644	  0.396730	 -0.656761
  1.263607	  0.412775	 -0.662446
  1.265794	  0.430404	 -0.670600
  1.266863	  0.440075	 -0.675346
  1.269812	  0.472960	 -0.683887
  1.270043	  0.486679	 -0.689059
  1.274916	  0.507997	 -0.697697
  1.279499	  0.520079	 -0.702376
  1.289811	  0.542233	 -0.710636
  1.292562	  0.558133	 -0.717502
  1.294822	  0.574708	 -0.723274
  1.299830	  0.596099	 -0.731711
  1.309579	  0.616604	 -0.738472
  1.315512	  0.631053	 -0.740060
  1.320863	  0.651911	 -0.743115
  1.328843	  0.674097	 -0.744533
  1.332758	  0.685269	 -0.746894
  1.338891	  0.714773	 -0.748094
  1.342580	  0.729895	 -0.747845
  1.348998	  0.750560	 -0.747684
  1.359562	  0.765197	 -0.746753
  1.371884	  0.782387	 -0.748258
  1.380810	  0.800857	 -0.748275
  1.388303	  0.819165	 -0.748483
  1.394917	  0.837903	 -0.748806
  1.402169	  0.856446	 -0.750570
  1.409288	  0.875447	 -0.751544
  1.417058	  0.894227	 -0.754228
  1.424709	  0.912614	 -0.755426
  1.432565	  0.930997	 -0.758098
  1.440635	  0.949323	 -0.760990
  1.449457	  0.967020	 -0.762141
  1.457442	  0.985101	 -0.764980
  1.465203	  1.003651	 -0.767193
  1.474067	  1.021354	 -0.768607
  1.482488	  1.038930	 -0.769657
  1.490522	  1.056844	 -0.770839
  1.498368	  1.074894	 -0.770004
  1.506836	  1.088923	 -0.766227
  1.521138	  1.103865	 -0.759863
  1.531037	  1.123348	 -0.761686
  1.544902	  1.154801	 -0.768109
  1.542873	  1.160812	 -0.765740
  1.550908	  1.173332	 -0.772636
  1.554553	  1.199791	 -0.778704
  1.557865	  1.223599	 -0.781613
  1.562098	  1.244843	 -0.786138
  1.567569	  1.263218	 -0.792904
  1.571302	  1.274627	 -0.796672
  1.576228	  1.298256	 -0.803055
  1.584347	  1.321272	 -0.809009
  1.585454	  1.331283	 -0.809561
  1.590543	  1.349933	 -0.816380
  1.596017	  1.378446	 -0.823447
  1.599654	  1.391632	 -0.823736
  1.604146	  1.406721	 -0.827788
  1.610394	  1.431717	 -0.834415
  1.617685	  1.450254	 -0.837182
  1.622325	  1.463472	 -0.840638
  1.630980	  1.484277	 -0.843332
  1.638479	  1.503948	 -0.846577
  1.644107	  1.523767	 -0.848534
  1.646516	  1.544709	 -0.852542
  1.645541	  1.567361	 -0.858646
  1.645646	  1.580432	 -0.860942
  1.645361	  1.604230	 -0.863827
  1.651066	  1.621924	 -0.865297
  1.658506	  1.641936	 -0.868898
  1.661797	  1.661514	 -0.871322
