 -0.372015	  2.111448	  2.141096
 -0.368332	  2.090543	  2.119897
 -0.379575	  2.047098	  2.110519
 -0.397476	  2.007508	  2.087159
 -0.415714	  1.966054	  2.071969
 -0.434027	  1.925658	  2.052471
 -0.451030	  1.881211	  2.038328
 -0.468461	  1.838800	  2.017262
 -0.484695	  1.792893	  2.005169
 -0.502105	  1.749281	  1.988174
 -0.516263	  1.704354	  1.972105
 -0.531454	  1.660540	  1.956627
 -0.547074	  1.616598	  1.941537
 -0.563856	  1.573672	  1.926108
 -0.582077	  1.530464	  1.909252
 -0.599952	  1.486801	  1.891074
 -0.616237	  1.444136	  1.871593
 -0.630517	  1.401874	  1.849994
 -0.642375	  1.360774	  1.825799
 -0.655365	  1.318729	  1.802678
 -0.674356	  1.275379	  1.782454
 -0.695156	  1.232174	  1.765366
 -0.715409	  1.190369	  1.752243
 -0.730091	  1.147031	  1.733498
 -0.741577	  1.101068	  1.714312
 -0.754818	  1.057852	  1.692285
 -0.771248	  1.015513	  1.671551
 -0.790317	  0.975459	  1.653480
 -0.813276	  0.934933	  1.635124
 -0.838480	  0.895827	  1.615616
 -0.863908	  0.858365	  1.596415
 -0.889771	  0.820407	  1.578518
 -0.916289	  0.779034	  1.561317
 -0.941204	  0.736621	  1.545331
 -0.962539	  0.695023	  1.531183
 -0.980348	  0.648458	  1.516034
 -0.989789	  0.599357	  1.499387
 -0.994483	  0.552190	  1.481520
 -1.000235	  0.506471	  1.460591
 -1.008237	  0.461733	  1.438156
 -1.017234	  0.418182	  1.416855
 -1.027637	  0.373219	  1.396462
 -1.039846	  0.327992	  1.377579
 -1.053821	  0.284757	  1.360214
 -1.070976	  0.241531	  1.342830
 -1.089114	  0.201042	  1.327511
 -1.109036	  0.159175	  1.312725
 -1.129673	  0.113198	  1.298841
 -1.147987	  0.068129	  1.288886
 -1.166337	  0.024063	  1.279157
 -1.186170	 -0.021216	  1.266032
 -1.205923	 -0.066101	  1.249543
 -1.217155	 -0.109654	  1.227773
 -1.227876	 -0.153362	  1.203129
 -1.246278	 -0.193787	  1.180801
 -1.264334	 -0.233131	  1.161070
 -1.281802	 -0.273957	  1.137329
 -1.301789	 -0.316505	  1.117025
 -1.320706	 -0.360448	  1.104906
 -1.346347	 -0.400399	  1.093168
 -1.358755	 -0.443525	  1.069716
 -1.372884	 -0.485178	  1.046578
 -1.385156	 -0.527413	  1.026201
 -1.398078	 -0.570633	  1.006711
 -1.416503	 -0.613599	  0.988682
 -1.438915	 -0.655320	  0.972299
 -1.461195	 -0.695716	  0.957434
 -1.470832	 -0.745299	  0.941261
 -1.475379	 -0.795080	  0.926098
 -1.477938	 -0.844052	  0.909497
 -1.492533	 -0.891062	  0.893218
 -1.513850	 -0.934974	  0.879272
 -1.537606	 -0.976135	  0.867928
 -1.561412	 -1.015509	  0.858521
 -1.586072	 -1.057742	  0.848726
 -1.610143	 -1.100872	  0.838706
 -1.633042	 -1.144098	  0.826884
 -1.653439	 -1.186483	  0.812090
 -1.671128	 -1.228952	  0.793733
 -1.687760	 -1.272733	  0.769993
 -1.703223	 -1.316662	  0.743732
 -1.717572	 -1.358841	  0.718094
 -1.731232	 -1.397862	  0.694994
 -1.747250	 -1.440288	  0.672463
 -1.762846	 -1.482803	  0.654294
 -1.777468	 -1.526325	  0.639148
 -1.791766	 -1.570419	  0.624847
 -1.806526	 -1.616715	  0.609440
 -1.820114	 -1.659685	  0.593921
 -1.834246	 -1.705980	  0.575233
 -1.846569	 -1.751325	  0.554183
 -1.861080	 -1.793422	  0.532868
 -1.878545	 -1.833775	  0.511407
 -1.897246	 -1.872508	  0.489401
 -1.916892	 -1.911604	  0.467080
 -1.937000	 -1.953822	  0.447197
 -1.958624	 -1.994623	  0.429038
 -1.979374	 -2.037602	  0.418518
 -2.002594	 -2.077436	  0.400278
 -2.016639	 -2.122821	  0.375651
 -2.039939	 -2.170605	  0.356542
 -2.060338	 -2.192311	  0.360107
