 -2.041185	  1.824519	  1.298304
 -2.020975	  1.806455	  1.285450
 -1.975992	  1.785741	  1.276011
 -1.937381	  1.757888	  1.265592
 -1.896773	  1.731920	  1.246459
 -1.862717	  1.701172	  1.231609
 -1.823438	  1.673294	  1.216219
 -1.787284	  1.642875	  1.209790
 -1.747789	  1.616463	  1.193744
 -1.711982	  1.585562	  1.177030
 -1.670055	  1.557464	  1.165770
 -1.632899	  1.529938	  1.152853
 -1.598992	  1.496966	  1.141020
 -1.558307	  1.469149	  1.123263
 -1.518056	  1.445952	  1.109080
 -1.479195	  1.417400	  1.092023
 -1.442497	  1.388740	  1.080276
 -1.403350	  1.358965	  1.065662
 -1.364065	  1.330512	  1.050402
 -1.326357	  1.301746	  1.033092
 -1.299970	  1.274973	  1.014229
 -1.292351	  1.253721	  0.986809
 -1.292684	  1.188863	  0.894195
 -1.288319	  1.127456	  0.829344
 -1.288864	  1.094920	  0.782556
 -1.308424	  1.042812	  0.732492
 -1.286680	  1.011890	  0.682809
 -1.239156	  0.977917	  0.657642
 -1.206831	  0.929609	  0.620230
 -1.165012	  0.893446	  0.590947
 -1.131987	  0.831500	  0.558236
 -1.087182	  0.801672	  0.546356
 -1.050340	  0.785151	  0.546021
 -1.003224	  0.765972	  0.544027
 -0.866162	  0.714972	  0.519896
 -0.827116	  0.683497	  0.513852
 -0.777043	  0.682470	  0.563286
 -0.731820	  0.680237	  0.605552
 -0.685557	  0.706148	  0.625783
 -0.635354	  0.685099	  0.689249
 -0.534076	  0.695072	  0.741950
 -0.483521	  0.674762	  0.734869
 -0.449540	  0.649960	  0.721283
 -0.412508	  0.619050	  0.705603
 -0.371204	  0.590380	  0.690805
 -0.336168	  0.564606	  0.678728
 -0.296609	  0.533589	  0.664729
 -0.257826	  0.504688	  0.650842
 -0.217526	  0.476173	  0.636270
 -0.178549	  0.448349	  0.622194
 -0.140375	  0.420422	  0.607507
 -0.102572	  0.396166	  0.591553
 -0.062194	  0.365521	  0.577118
 -0.021698	  0.339613	  0.560989
  0.013526	  0.314988	  0.547661
  0.050722	  0.290556	  0.533515
  0.094298	  0.264450	  0.514593
  0.129564	  0.234933	  0.498908
  0.168409	  0.208016	  0.484812
  0.207700	  0.180614	  0.472696
  0.245487	  0.153041	  0.457847
  0.284566	  0.126048	  0.445141
  0.324588	  0.096927	  0.429107
  0.363152	  0.071718	  0.414543
  0.399822	  0.041692	  0.400008
  0.437147	  0.015127	  0.386971
  0.475940	 -0.015913	  0.372679
  0.516248	 -0.047663	  0.359227
  0.555812	 -0.078373	  0.349308
  0.591994	 -0.106006	  0.337054
  0.632880	 -0.134989	  0.324772
  0.670936	 -0.161408	  0.310026
  0.709300	 -0.187529	  0.297621
  0.749399	 -0.217258	  0.282371
  0.789017	 -0.247661	  0.265562
  0.823492	 -0.276537	  0.251591
  0.858673	 -0.303802	  0.240129
  0.899851	 -0.334906	  0.226300
  0.937664	 -0.361630	  0.211749
  0.976158	 -0.389298	  0.197017
  1.013469	 -0.416153	  0.184108
  1.053684	 -0.446347	  0.168187
  1.090966	 -0.473613	  0.154758
  1.128142	 -0.497000	  0.136893
  1.171042	 -0.491721	  0.088695
  1.249662	 -0.368007	 -0.096856
  1.290879	 -0.371872	 -0.121543
  1.349517	 -0.391330	 -0.110292
  1.365552	 -0.358927	 -0.137267
  1.407660	 -0.352110	 -0.066864
  1.416670	 -0.339757	 -0.057130
  1.491711	 -0.382903	 -0.005502
  1.589819	 -0.540834	  0.023134
  1.661933	 -0.567001	  0.001419
  1.679426	 -0.593901	 -0.008989
  1.693518	 -0.606216	  0.021704
  1.743262	 -0.622763	  0.018599
  1.739664	 -0.710310	 -0.013314
  1.735230	 -0.882839	 -0.084884
  1.748025	 -0.941951	 -0.086254
  1.781767	 -0.977191	 -0.093643
  1.818839	 -1.003989	 -0.105284
  1.861794	 -1.034502	 -0.120193
  1.898010	 -1.060549	 -0.134354
  1.936834	 -1.088543	 -0.151077
  1.975956	 -1.116312	 -0.168246
  2.014081	 -1.144462	 -0.184519
  2.050523	 -1.171131	 -0.199145
  2.087655	 -1.199993	 -0.213834
  2.129659	 -1.229301	 -0.227225
  2.164852	 -1.254324	 -0.242034
  2.202553	 -1.283697	 -0.253766
  2.239326	 -1.309437	 -0.269546
  2.278290	 -1.339567	 -0.284041
  2.318448	 -1.372709	 -0.298369
  2.356517	 -1.402305	 -0.310423
  2.395950	 -1.432857	 -0.320870
  2.434634	 -1.453484	 -0.335277
  2.470120	 -1.483178	 -0.354875
  2.506711	 -1.510957	 -0.370856
  2.541025	 -1.547449	 -0.385476
  2.566435	 -1.562924	 -0.389331
