  1.891961	  0.969820	  2.158896
  1.873229	  0.960218	  2.137521
  1.829685	  0.959369	  2.123585
  1.788803	  0.961848	  2.108756
  1.739464	  0.955314	  2.091437
  1.688657	  0.953186	  2.073883
  1.646691	  0.944636	  2.061969
  1.595397	  0.942840	  2.050680
  1.547363	  0.937420	  2.035246
  1.501632	  0.934290	  2.017603
  1.457001	  0.928017	  2.002802
  1.408621	  0.924207	  1.982633
  1.358770	  0.925777	  1.969870
  1.316694	  0.922895	  1.945857
  1.270781	  0.912124	  1.935558
  1.226634	  0.909383	  1.917707
  1.178200	  0.912754	  1.906125
  1.130454	  0.907333	  1.887938
  1.079936	  0.899788	  1.873583
  1.036940	  0.902204	  1.853385
  0.991273	  0.896876	  1.841572
  0.945698	  0.892285	  1.817814
  0.899974	  0.888649	  1.804001
  0.850472	  0.879659	  1.788155
  0.803068	  0.878268	  1.775303
  0.751516	  0.871199	  1.752974
  0.706514	  0.869351	  1.743344
  0.663648	  0.869668	  1.726366
  0.611180	  0.868563	  1.707628
  0.570480	  0.864316	  1.690736
  0.521964	  0.857852	  1.672786
  0.472898	  0.851493	  1.659458
  0.424505	  0.847077	  1.643415
  0.383459	  0.848962	  1.631133
  0.330713	  0.839847	  1.611036
  0.290683	  0.837811	  1.596057
  0.242231	  0.834174	  1.583018
  0.190374	  0.831222	  1.565351
  0.146360	  0.827526	  1.552462
  0.099226	  0.821620	  1.537068
  0.051534	  0.817488	  1.518253
  0.007047	  0.816461	  1.502231
 -0.041742	  0.812993	  1.487419
 -0.085005	  0.809341	  1.474052
 -0.133548	  0.804912	  1.456787
 -0.183960	  0.802009	  1.437358
 -0.226339	  0.794244	  1.421464
 -0.269609	  0.760199	  1.421652
 -0.312387	  0.575283	  1.476743
 -0.363266	  0.552597	  1.461700
 -0.424396	  0.514398	  1.447272
 -0.480446	  0.486093	  1.459226
 -0.514029	  0.464729	  1.407703
 -0.578145	  0.513377	  1.429101
 -0.619688	  0.479336	  1.407662
 -0.682068	  0.275786	  1.465467
 -0.737913	  0.383121	  1.513578
 -0.793556	  0.461678	  1.423276
 -0.842486	  0.463866	  1.392446
 -0.899930	  0.423670	  1.417931
 -0.936661	  0.521768	  1.395997
 -0.951443	  0.470551	  1.290512
 -1.033239	  0.484433	  1.378387
 -1.025931	  0.538451	  1.267558
 -1.062837	  0.691244	  1.165657
 -1.119144	  0.726797	  1.115681
 -1.167760	  0.724280	  1.097994
 -1.211534	  0.720764	  1.082688
 -1.259611	  0.717597	  1.066695
 -1.306039	  0.713138	  1.053159
 -1.350224	  0.707779	  1.041966
 -1.399953	  0.702148	  1.026500
 -1.445786	  0.694616	  1.006651
 -1.495116	  0.689898	  0.987085
 -1.539852	  0.688101	  0.974644
 -1.583024	  0.689308	  0.958659
 -1.628073	  0.683116	  0.943694
 -1.682192	  0.682274	  0.924971
 -1.729543	  0.679770	  0.906705
 -1.776404	  0.674070	  0.892188
 -1.816600	  0.668898	  0.880187
 -1.865124	  0.666427	  0.863071
 -1.911725	  0.665321	  0.842486
 -1.956100	  0.659678	  0.825518
 -2.003427	  0.654779	  0.809316
 -2.049403	  0.652538	  0.796701
 -2.098369	  0.643906	  0.779103
 -2.144068	  0.638349	  0.767851
 -2.198107	  0.636654	  0.751052
 -2.242276	  0.630838	  0.734135
 -2.287106	  0.628366	  0.713966
 -2.331109	  0.627320	  0.703629
 -2.379862	  0.621229	  0.683113
 -2.428883	  0.622996	  0.666373
 -2.470852	  0.618691	  0.652728
 -2.521509	  0.613258	  0.635722
 -2.564440	  0.613073	  0.619442
 -2.610056	  0.608054	  0.600644
 -2.659182	  0.605936	  0.588198
 -2.705421	  0.599804	  0.571185
 -2.757361	  0.594333	  0.557066
 -2.804452	  0.592148	  0.543340
 -2.845034	  0.586745	  0.523675
 -2.900639	  0.577516	  0.502762
 -2.929645	  0.583291	  0.507789
