  1.727399	 -1.600118	 -0.215152
  1.720525	 -1.614446	 -0.213805
  1.728840	 -1.595448	 -0.217818
  1.735545	 -1.575883	 -0.217390
  1.744471	 -1.560655	 -0.218660
  1.753123	 -1.541830	 -0.221289
  1.760933	 -1.523548	 -0.223560
  1.769767	 -1.506231	 -0.226427
  1.779368	 -1.487774	 -0.228199
  1.784869	 -1.468824	 -0.228770
  1.792700	 -1.451223	 -0.232939
  1.801030	 -1.432753	 -0.236406
  1.810379	 -1.415198	 -0.237907
  1.822075	 -1.399567	 -0.238892
  1.834077	 -1.380789	 -0.239021
  1.840877	 -1.361961	 -0.240025
  1.847765	 -1.346522	 -0.244786
  1.858292	 -1.328946	 -0.249536
  1.869384	 -1.312054	 -0.253352
  1.879647	 -1.295041	 -0.256454
  1.889960	 -1.278091	 -0.259973
  1.900318	 -1.261330	 -0.263441
  1.910340	 -1.244207	 -0.263913
  1.919534	 -1.227203	 -0.261440
  1.928118	 -1.205327	 -0.262465
  1.936197	 -1.188884	 -0.269633
  1.949148	 -1.175380	 -0.272847
  1.962180	 -1.158683	 -0.275840
  1.972607	 -1.139389	 -0.276121
  1.983848	 -1.124654	 -0.273596
  1.995305	 -1.110487	 -0.272108
  2.006603	 -1.089529	 -0.272776
  2.015674	 -1.073211	 -0.270453
  2.025163	 -1.057644	 -0.266147
  2.034960	 -1.038352	 -0.267356
  2.045089	 -1.021265	 -0.265358
  2.053892	 -1.004875	 -0.262113
  2.061722	 -0.985548	 -0.260429
  2.073364	 -0.967640	 -0.258366
  2.082550	 -0.951700	 -0.255983
  2.090096	 -0.933591	 -0.254111
  2.095915	 -0.913298	 -0.251147
  2.100214	 -0.894370	 -0.249158
  2.103711	 -0.874324	 -0.245079
  2.109182	 -0.855288	 -0.241508
  2.116067	 -0.836725	 -0.239627
  2.124590	 -0.818807	 -0.239573
  2.132214	 -0.800101	 -0.238699
  2.138044	 -0.780979	 -0.238069
  2.144424	 -0.761965	 -0.237755
  2.152058	 -0.743675	 -0.236863
  2.161015	 -0.725812	 -0.236820
  2.170375	 -0.708343	 -0.237330
  2.177699	 -0.688729	 -0.236460
  2.179929	 -0.667721	 -0.233382
  2.186191	 -0.649819	 -0.231781
  2.196168	 -0.632440	 -0.230957
  2.205705	 -0.614361	 -0.231031
  2.212781	 -0.595137	 -0.232495
  2.218021	 -0.576073	 -0.228946
  2.225907	 -0.558314	 -0.224712
  2.234255	 -0.540237	 -0.220959
  2.242041	 -0.521804	 -0.219443
  2.249848	 -0.503610	 -0.217492
  2.258501	 -0.486528	 -0.212936
  2.266212	 -0.467201	 -0.207957
  2.272087	 -0.448159	 -0.205765
  2.281219	 -0.431481	 -0.206593
  2.292044	 -0.414703	 -0.205194
  2.300674	 -0.394646	 -0.204502
  2.305278	 -0.375030	 -0.201580
  2.314602	 -0.359472	 -0.197619
  2.325186	 -0.341667	 -0.196054
  2.333507	 -0.322179	 -0.196956
  2.344608	 -0.301453	 -0.189585
  2.353535	 -0.283687	 -0.187422
