 -0.321022	  1.233378	 -1.901063
 -0.366784	  1.219401	 -1.932984
 -0.412546	  1.205424	 -1.964905
 -0.396427	  1.210932	 -1.954264
 -0.379629	  1.211939	 -1.943274
 -0.363018	  1.213267	 -1.932241
 -0.346613	  1.213809	 -1.920378
 -0.330251	  1.213382	 -1.908382
 -0.314452	  1.212014	 -1.896706
 -0.298229	  1.205881	 -1.883193
 -0.283074	  1.200354	 -1.871545
 -0.269576	  1.194645	 -1.858481
 -0.262991	  1.188223	 -1.837686
 -0.256610	  1.184378	 -1.818444
 -0.246576	  1.182559	 -1.802146
 -0.234378	  1.180477	 -1.785899
 -0.226847	  1.176406	 -1.767823
 -0.225085	  1.171148	 -1.746265
 -0.226595	  1.162843	 -1.728022
 -0.226530	  1.152330	 -1.712952
 -0.222857	  1.144367	 -1.694370
 -0.225578	  1.136086	 -1.673995
 -0.234159	  1.125407	 -1.661610
 -0.235849	  1.112650	 -1.646792
 -0.245280	  1.096261	 -1.632832
 -0.258985	  1.087692	 -1.620230
 -0.267338	  1.082837	 -1.607487
 -0.280396	  1.072472	 -1.593133
 -0.295984	  1.068888	 -1.582252
 -0.311085	  1.060053	 -1.573304
 -0.327521	  1.051444	 -1.561371
 -0.340286	  1.049220	 -1.548828
 -0.354967	  1.050523	 -1.532820
 -0.369325	  1.047075	 -1.517218
 -0.384993	  1.037478	 -1.508997
 -0.400146	  1.038071	 -1.497299
 -0.415676	  1.038810	 -1.483888
 -0.432208	  1.033256	 -1.471600
 -0.449213	  1.030584	 -1.461779
 -0.464630	  1.029504	 -1.448788
 -0.479129	  1.023987	 -1.437205
 -0.488033	  1.018633	 -1.417043
 -0.504537	  1.017797	 -1.402025
 -0.509838	  1.019057	 -1.384155
 -0.516018	  1.017775	 -1.364499
 -0.520739	  1.011168	 -1.345734
 -0.525597	  1.003807	 -1.327582
 -0.531481	  0.997811	 -1.308798
 -0.537832	  0.994540	 -1.291511
 -0.540449	  0.987800	 -1.273470
 -0.544977	  0.975515	 -1.255699
 -0.550780	  0.969733	 -1.239981
 -0.556719	  0.960408	 -1.222342
 -0.558978	  0.949552	 -1.206051
 -0.562911	  0.938495	 -1.189392
 -0.569093	  0.928157	 -1.174667
 -0.577188	  0.917852	 -1.160653
 -0.587456	  0.906887	 -1.147498
 -0.596703	  0.895957	 -1.133408
 -0.605529	  0.886751	 -1.117231
 -0.615235	  0.878417	 -1.102109
 -0.624746	  0.869414	 -1.088177
 -0.635789	  0.860425	 -1.074326
 -0.644432	  0.851918	 -1.059027
 -0.652124	  0.840659	 -1.040510
 -0.656836	  0.831333	 -1.024591
 -0.660087	  0.816643	 -1.012007
 -0.667221	  0.802988	 -0.997753
 -0.680487	  0.793646	 -0.983686
 -0.688592	  0.786414	 -0.968520
 -0.692851	  0.780840	 -0.947131
 -0.697724	  0.770505	 -0.932120
 -0.704798	  0.756404	 -0.919430
 -0.712688	  0.746875	 -0.903778
 -0.727699	  0.744113	 -0.885926
 -0.739140	  0.739150	 -0.869898
 -0.745663	  0.729010	 -0.854033
 -0.748983	  0.713736	 -0.842081
 -0.757131	  0.701407	 -0.824972
 -0.768278	  0.695901	 -0.810004
 -0.781074	  0.691054	 -0.796208
 -0.791968	  0.680088	 -0.780762
 -0.804628	  0.670359	 -0.771248
 -0.822816	  0.667656	 -0.752230
 -0.831516	  0.667963	 -0.735643
 -0.838060	  0.670983	 -0.714586
 -0.846302	  0.664335	 -0.698230
 -0.859625	  0.666884	 -0.679199
 -0.870481	  0.662000	 -0.667158
 -0.884448	  0.657279	 -0.653718
 -0.900836	  0.655153	 -0.640764
 -0.916209	  0.655609	 -0.625873
 -0.930038	  0.652309	 -0.613116
 -0.944485	  0.652593	 -0.599217
 -0.961030	  0.656486	 -0.585586
 -0.977419	  0.655758	 -0.574732
 -0.994945	  0.657854	 -0.563160
 -1.007884	  0.657181	 -0.551552
 -1.023549	  0.655737	 -0.537957
 -1.038524	  0.660525	 -0.523597
 -1.052826	  0.666222	 -0.509350
 -1.070921	  0.669687	 -0.497560
 -1.086517	  0.665614	 -0.490067
 -1.102131	  0.661113	 -0.476158
 -1.117545	  0.655930	 -0.461874
 -1.130668	  0.656628	 -0.448176
 -1.142923	  0.657850	 -0.431995
 -1.155140	  0.657911	 -0.415465
 -1.167152	  0.655597	 -0.400039
 -1.176585	  0.653475	 -0.383395
 -1.189016	  0.653109	 -0.365078
 -1.203126	  0.653508	 -0.350362
 -1.212467	  0.649371	 -0.335585
 -1.222260	  0.645731	 -0.317924
 -1.235545	  0.644087	 -0.300515
 -1.245804	  0.647870	 -0.284846
 -1.251313	  0.650439	 -0.266199
 -1.257874	  0.646636	 -0.244957
 -1.264798	  0.639259	 -0.226576
 -1.281713	  0.637953	 -0.212545
 -1.292925	  0.643220	 -0.196663
 -1.301971	  0.646897	 -0.177122
 -1.305798	  0.646963	 -0.157591
 -1.306654	  0.645395	 -0.137325
 -1.307346	  0.642661	 -0.116551
 -1.310837	  0.640205	 -0.096414
 -1.317939	  0.641504	 -0.078796
 -1.320985	  0.643949	 -0.058943
 -1.320654	  0.644613	 -0.038656
 -1.322236	  0.639370	 -0.017063
 -1.325275	  0.635768	  0.002229
 -1.328570	  0.637588	  0.019654
 -1.328989	  0.639417	  0.040677
 -1.329198	  0.641407	  0.060540
 -1.328839	  0.641711	  0.080785
 -1.328421	  0.641850	  0.100779
 -1.325647	  0.642540	  0.120572
 -1.322384	  0.643343	  0.140288
 -1.319139	  0.644157	  0.159959
 -1.316426	  0.645405	  0.179183
 -1.314180	  0.648072	  0.197988
 -1.308742	  0.653047	  0.219840
 -1.303626	  0.652393	  0.238286
 -1.299114	  0.652316	  0.256825
 -1.293919	  0.656367	  0.275583
 -1.289684	  0.659726	  0.296134
 -1.287171	  0.662959	  0.315308
 -1.289724	  0.668788	  0.333732
 -1.290389	  0.672548	  0.350278
 -1.299349	  0.679615	  0.366480
 -1.309140	  0.689196	  0.379564
 -1.320040	  0.702595	  0.390642
 -1.330090	  0.713918	  0.403415
 -1.340707	  0.722740	  0.419054
 -1.355971	  0.732225	  0.428327
 -1.373568	  0.738413	  0.436326
 -1.393915	  0.739410	  0.442695
 -1.413113	  0.743921	  0.449512
 -1.430081	  0.743063	  0.452466
 -1.449344	  0.751588	  0.455888
 -1.468159	  0.743040	  0.460643
 -1.485523	  0.733309	  0.461129
 -1.501708	  0.722139	  0.461325
 -1.519158	  0.711487	  0.465021
 -1.531088	  0.697609	  0.471340
 -1.544445	  0.683040	  0.479546
 -1.553649	  0.666116	  0.484742
 -1.567338	  0.653217	  0.485470
 -1.578039	  0.635690	  0.490428
 -1.587186	  0.620233	  0.497372
 -1.597604	  0.603888	  0.505988
 -1.609711	  0.588634	  0.513804
 -1.619470	  0.574773	  0.517850
 -1.627426	  0.558387	  0.528992
 -1.630308	  0.541651	  0.540646
 -1.638289	  0.525476	  0.549463
 -1.647404	  0.509421	  0.555797
 -1.655469	  0.493008	  0.565372
 -1.661480	  0.477852	  0.577738
 -1.667364	  0.463975	  0.591447
 -1.676040	  0.452324	  0.603037
 -1.685834	  0.439236	  0.615429
 -1.694697	  0.425935	  0.627933
 -1.702577	  0.412878	  0.640941
 -1.710736	  0.403179	  0.656408
 -1.718924	  0.394352	  0.672378
 -1.727111	  0.385530	  0.688351
 -1.735298	  0.376708	  0.704325
 -1.743485	  0.367902	  0.720305
 -1.751727	  0.361475	  0.737355
 -1.759905	  0.357155	  0.755087
 -1.768083	  0.352849	  0.772823
 -1.776260	  0.348542	  0.790560
 -1.784427	  0.344230	  0.808185
 -1.792898	  0.342127	  0.825850
 -1.801488	  0.339045	  0.842484
 -1.809928	  0.335747	  0.864498
 -1.813715	  0.336238	  0.884849
 -1.819908	  0.338890	  0.901458
 -1.830913	  0.340308	  0.917308
 -1.841871	  0.341488	  0.934618
 -1.851317	  0.341633	  0.953549
 -1.862142	  0.339417	  0.971371
 -1.875651	  0.338815	  0.986805
 -1.885647	  0.341471	  1.002106
 -1.895091	  0.340995	  1.020030
 -1.906698	  0.339474	  1.036637
 -1.919135	  0.339184	  1.052580
 -1.929607	  0.340422	  1.069308
 -1.940369	  0.341331	  1.086679
 -1.952595	  0.343615	  1.103027
 -1.967189	  0.341933	  1.116119
 -1.980125	  0.338488	  1.130512
 -1.995708	  0.335510	  1.145317
 -2.010987	  0.336920	  1.158225
 -2.022539	  0.337404	  1.173860
 -2.034068	  0.335684	  1.190215
 -2.047931	  0.334619	  1.205375
 -2.063021	  0.333910	  1.219691
 -2.074732	  0.331730	  1.233534
 -2.086536	  0.328643	  1.250240
 -2.096905	  0.325978	  1.266675
 -2.108494	  0.324443	  1.282902
 -2.120083	  0.322908	  1.299129
