 -0.159982	 -2.236606	 -1.112281
 -0.177265	 -2.268670	 -1.124236
 -0.168529	 -2.251871	 -1.117799
 -0.160986	 -2.234829	 -1.110545
 -0.153468	 -2.217781	 -1.103274
 -0.145746	 -2.200770	 -1.096133
 -0.137817	 -2.183798	 -1.089128
 -0.129681	 -2.166881	 -1.082229
 -0.120740	 -2.150200	 -1.075765
 -0.111825	 -2.133505	 -1.069301
 -0.102330	 -2.117127	 -1.062836
 -0.092774	 -2.100777	 -1.056419
 -0.083726	 -2.084878	 -1.049359
 -0.076531	 -2.069759	 -1.039459
 -0.065287	 -2.053570	 -1.029451
 -0.050542	 -2.040271	 -1.022727
 -0.035498	 -2.026191	 -1.019307
 -0.026971	 -2.009720	 -1.015630
 -0.019388	 -1.992100	 -1.008392
 -0.008853	 -1.976064	 -1.000735
  0.002945	 -1.962433	 -0.992581
  0.013204	 -1.949043	 -0.983000
  0.022101	 -1.933613	 -0.974046
  0.038072	 -1.915194	 -0.969059
  0.050371	 -1.906729	 -0.963560
  0.063528	 -1.894908	 -0.952174
  0.077719	 -1.883096	 -0.942095
  0.090258	 -1.869150	 -0.934615
  0.098395	 -1.852587	 -0.927611
  0.107986	 -1.833754	 -0.921275
  0.123784	 -1.818849	 -0.917061
  0.140932	 -1.809680	 -0.909376
  0.152498	 -1.802263	 -0.897976
  0.165136	 -1.790828	 -0.886269
  0.178931	 -1.777966	 -0.877253
  0.192379	 -1.765497	 -0.869234
  0.205840	 -1.753032	 -0.861266
  0.219634	 -1.740906	 -0.853350
  0.233473	 -1.728829	 -0.845437
  0.247557	 -1.717250	 -0.837217
  0.261919	 -1.706295	 -0.828632
  0.276277	 -1.695344	 -0.820036
  0.289985	 -1.684197	 -0.810663
  0.303473	 -1.672994	 -0.801043
  0.316950	 -1.661780	 -0.791417
  0.329035	 -1.649441	 -0.781337
  0.340476	 -1.636641	 -0.771077
  0.351910	 -1.623829	 -0.760824
  0.362152	 -1.609996	 -0.750643
  0.371043	 -1.595156	 -0.740607
  0.379919	 -1.580304	 -0.730575
  0.388185	 -1.564805	 -0.721014
  0.395649	 -1.548542	 -0.712079
  0.403105	 -1.532270	 -0.703158
  0.410171	 -1.515293	 -0.695315
  0.417671	 -1.498936	 -0.688684
  0.427929	 -1.481176	 -0.684890
  0.437384	 -1.462967	 -0.683479
  0.441281	 -1.442793	 -0.673823
  0.443835	 -1.426449	 -0.664429
  0.449207	 -1.407895	 -0.661200
  0.455437	 -1.388897	 -0.658166
  0.461436	 -1.371005	 -0.651868
  0.467778	 -1.350642	 -0.645651
  0.474017	 -1.332552	 -0.636560
  0.479863	 -1.319310	 -0.627819
  0.487480	 -1.299395	 -0.621168
  0.495304	 -1.282772	 -0.616382
  0.504150	 -1.269084	 -0.606106
  0.512381	 -1.251309	 -0.594947
  0.519656	 -1.232552	 -0.591167
  0.528872	 -1.217237	 -0.587774
  0.538623	 -1.200590	 -0.576859
  0.543311	 -1.182718	 -0.570425
  0.549796	 -1.165849	 -0.569083
  0.560205	 -1.144570	 -0.560868
  0.567709	 -1.132425	 -0.551129
  0.573323	 -1.111685	 -0.541986
  0.577135	 -1.092870	 -0.535203
  0.583049	 -1.078553	 -0.528785
  0.592213	 -1.061298	 -0.518764
  0.597743	 -1.043815	 -0.510413
  0.602247	 -1.027236	 -0.501159
  0.610470	 -1.012218	 -0.490648
  0.619216	 -0.996340	 -0.478933
  0.622369	 -0.980638	 -0.469149
  0.623984	 -0.961998	 -0.460572
  0.625411	 -0.942701	 -0.451682
  0.631209	 -0.926207	 -0.443373
  0.640188	 -0.908478	 -0.436538
  0.645946	 -0.890063	 -0.432755
  0.651311	 -0.871688	 -0.430922
  0.659571	 -0.851582	 -0.428498
  0.665483	 -0.832992	 -0.424743
  0.666394	 -0.813271	 -0.418752
  0.665322	 -0.791692	 -0.408491
  0.667839	 -0.772873	 -0.401458
  0.671102	 -0.759458	 -0.398053
  0.676212	 -0.737650	 -0.399205
  0.682138	 -0.717874	 -0.398468
  0.694107	 -0.698538	 -0.392947
  0.706863	 -0.681764	 -0.387950
  0.713769	 -0.667841	 -0.390691
  0.721122	 -0.647771	 -0.394097
  0.727520	 -0.629197	 -0.396581
  0.733910	 -0.610787	 -0.396696
  0.740951	 -0.593493	 -0.395892
  0.754586	 -0.579875	 -0.389704
  0.768994	 -0.568823	 -0.381404
  0.783046	 -0.561768	 -0.369131
  0.797106	 -0.554915	 -0.356660
  0.810893	 -0.549800	 -0.343108
  0.824159	 -0.546850	 -0.328437
  0.837421	 -0.543933	 -0.313754
  0.851305	 -0.542176	 -0.299467
  0.866171	 -0.542598	 -0.286096
  0.881050	 -0.543041	 -0.272738
  0.896551	 -0.543157	 -0.260114
  0.914556	 -0.541651	 -0.251552
  0.932590	 -0.540132	 -0.243040
  0.950625	 -0.538585	 -0.234539
  0.968526	 -0.533197	 -0.227447
  0.985927	 -0.525365	 -0.221458
  1.003325	 -0.517521	 -0.215476
  1.020713	 -0.509660	 -0.209489
  1.036475	 -0.499335	 -0.202797
  1.051101	 -0.487651	 -0.195754
  1.065721	 -0.475962	 -0.188711
  1.080317	 -0.464261	 -0.181643
  1.093030	 -0.451429	 -0.173062
  1.105475	 -0.438466	 -0.164287
  1.117892	 -0.425627	 -0.155633
  1.130306	 -0.413350	 -0.148309
  1.144992	 -0.399414	 -0.139897
  1.158233	 -0.388048	 -0.126882
  1.167533	 -0.374856	 -0.111547
  1.171735	 -0.359277	 -0.105151
  1.180718	 -0.342130	 -0.099377
  1.193759	 -0.329087	 -0.088247
  1.204539	 -0.316022	 -0.076516
  1.210070	 -0.298172	 -0.069164
  1.213365	 -0.276436	 -0.060718
  1.219824	 -0.260810	 -0.051652
  1.231352	 -0.248832	 -0.042124
  1.243494	 -0.234507	 -0.029638
  1.254215	 -0.224132	 -0.015582
  1.266135	 -0.216347	 -0.002468
  1.276925	 -0.205765	  0.011120
  1.278993	 -0.186916	  0.028494
  1.280794	 -0.169655	  0.040278
  1.289314	 -0.156881	  0.046535
  1.301840	 -0.141982	  0.055700
  1.314220	 -0.127974	  0.064537
  1.324523	 -0.113395	  0.074299
  1.332986	 -0.099665	  0.084524
  1.338615	 -0.086052	  0.096117
  1.347555	 -0.066312	  0.111175
  1.357396	 -0.051670	  0.118022
  1.368785	 -0.039533	  0.120598
  1.384046	 -0.020590	  0.126006
  1.391669	 -0.005145	  0.134983
  1.395934	  0.009522	  0.145465
  1.404804	  0.026707	  0.153924
  1.413114	  0.041933	  0.161395
  1.421717	  0.058131	  0.170694
  1.434657	  0.075825	  0.178948
  1.447107	  0.083854	  0.182261
  1.462933	  0.093995	  0.188407
  1.479249	  0.100972	  0.199061
  1.493379	  0.104279	  0.212575
  1.506815	  0.101944	  0.227503
  1.520279	  0.103221	  0.237210
  1.536778	  0.102445	  0.246252
  1.553716	  0.095744	  0.256759
  1.568738	  0.083659	  0.270576
  1.578732	  0.077668	  0.281322
  1.595362	  0.070752	  0.292216
  1.614272	  0.066967	  0.303380
  1.629431	  0.069136	  0.316058
  1.644959	  0.070654	  0.333101
  1.661160	  0.065366	  0.345666
  1.677581	  0.057771	  0.351504
  1.696393	  0.051000	  0.357411
  1.713191	  0.044025	  0.364923
  1.729349	  0.036631	  0.374703
  1.746481	  0.029928	  0.383004
  1.765897	  0.026544	  0.392000
  1.783758	  0.025277	  0.398927
  1.803190	  0.030827	  0.408041
  1.819473	  0.043012	  0.418441
  1.832127	  0.047173	  0.429422
  1.846422	  0.046122	  0.438984
  1.871760	  0.052958	  0.448328
  1.887829	  0.070623	  0.450119
  1.903353	  0.086563	  0.459715
  1.909179	  0.101350	  0.462891
  1.924359	  0.099410	  0.478925
  1.944675	  0.110915	  0.486494
  1.961864	  0.128054	  0.488244
  1.970961	  0.147193	  0.487117
  1.979780	  0.164223	  0.485139
  1.993945	  0.178949	  0.483885
  2.006213	  0.194343	  0.484924
  2.015449	  0.213856	  0.484031
  2.020819	  0.232145	  0.478641
  2.025152	  0.252204	  0.474618
  2.025903	  0.273657	  0.468218
  2.032601	  0.290727	  0.460949
  2.046735	  0.306050	  0.452553
  2.058747	  0.323623	  0.441402
  2.057321	  0.342734	  0.432706
  2.054828	  0.360602	  0.431142
  2.056869	  0.382750	  0.425803
  2.053581	  0.404138	  0.416804
  2.045885	  0.421875	  0.414586
  2.041538	  0.438743	  0.415609
  2.038764	  0.460302	  0.414042
  2.038027	  0.480077	  0.410346
  2.033553	  0.498707	  0.409725
  2.027604	  0.518493	  0.410627
  2.022269	  0.539181	  0.412027
  2.017427	  0.556323	  0.408217
  2.009701	  0.577872	  0.404702
  2.004911	  0.600815	  0.411646
  2.002746	  0.617035	  0.422465
  2.001251	  0.632457	  0.428857
  1.998449	  0.654524	  0.432859
  1.993014	  0.673400	  0.438073
  1.983339	  0.688715	  0.446712
  1.977619	  0.705260	  0.458749
  1.975848	  0.722728	  0.468133
  1.972486	  0.736284	  0.477672
  1.965450	  0.754632	  0.497769
  1.960439	  0.769396	  0.509013
  1.956114	  0.787110	  0.514361
  1.956670	  0.812293	  0.517687
  1.957142	  0.833609	  0.524865
  1.958535	  0.847240	  0.528884
  1.961662	  0.865206	  0.535740
  1.964272	  0.890666	  0.544552
  1.966626	  0.905346	  0.550945
  1.967656	  0.919172	  0.559075
  1.973174	  0.943147	  0.573367
  1.978224	  0.960858	  0.580912
  1.980585	  0.976600	  0.581633
  1.989835	  0.998449	  0.579221
  2.005318	  1.016025	  0.583987
  2.013500	  1.031877	  0.594811
  2.014426	  1.046828	  0.602272
  2.023510	  1.065780	  0.606892
  2.036287	  1.081103	  0.611730
  2.047767	  1.097533	  0.616991
  2.059473	  1.113064	  0.622592
  2.071939	  1.126883	  0.628113
  2.083146	  1.142639	  0.632947
  2.095018	  1.158894	  0.635248
  2.108363	  1.174069	  0.638911
  2.115467	  1.189250	  0.654701
  2.127368	  1.204160	  0.660705
