 -1.873467	  1.266440	 -0.768398
 -1.907584	  1.282318	 -0.759171
 -1.892826	  1.268770	 -0.768806
 -1.871443	  1.260741	 -0.769030
 -1.856823	  1.256352	 -0.770723
 -1.838400	  1.250881	 -0.776470
 -1.816621	  1.242522	 -0.781885
 -1.799374	  1.230785	 -0.787782
 -1.786852	  1.220486	 -0.792939
 -1.772088	  1.209114	 -0.799768
 -1.756273	  1.197317	 -0.807409
 -1.737244	  1.186065	 -0.813859
 -1.721340	  1.178489	 -0.818475
 -1.704530	  1.174196	 -0.825303
 -1.687645	  1.169695	 -0.838362
 -1.672451	  1.161479	 -0.852930
 -1.660897	  1.149166	 -0.865861
 -1.652952	  1.139315	 -0.872694
 -1.647661	  1.128291	 -0.878147
 -1.640315	  1.104574	 -0.878762
 -1.635849	  1.088597	 -0.881957
 -1.632703	  1.071580	 -0.889855
 -1.631117	  1.056088	 -0.905797
 -1.632757	  1.041027	 -0.915420
 -1.633499	  1.026493	 -0.922725
 -1.634530	  1.012593	 -0.926389
 -1.635380	  0.988672	 -0.930769
 -1.636096	  0.972678	 -0.933745
 -1.637704	  0.951786	 -0.935819
 -1.637383	  0.930868	 -0.937637
 -1.639255	  0.915583	 -0.939072
 -1.646376	  0.895356	 -0.938896
 -1.655824	  0.876957	 -0.937107
 -1.664955	  0.859087	 -0.934404
 -1.673753	  0.833457	 -0.934504
 -1.678026	  0.809025	 -0.944697
 -1.680190	  0.797938	 -0.950613
 -1.679927	  0.779950	 -0.959942
 -1.677931	  0.757848	 -0.960959
 -1.678809	  0.741894	 -0.955774
 -1.685334	  0.720971	 -0.944832
 -1.682273	  0.699818	 -0.941092
 -1.675481	  0.674331	 -0.946603
 -1.671402	  0.651257	 -0.950019
 -1.666489	  0.633803	 -0.951709
 -1.659117	  0.616604	 -0.954691
 -1.650716	  0.598264	 -0.958709
 -1.646530	  0.579577	 -0.960879
 -1.643648	  0.555751	 -0.960994
 -1.640713	  0.538753	 -0.961297
 -1.639739	  0.523983	 -0.961115
 -1.640437	  0.501904	 -0.959940
 -1.642937	  0.476732	 -0.960095
 -1.637374	  0.453314	 -0.960398
 -1.633193	  0.442119	 -0.961784
 -1.621940	  0.424476	 -0.969428
 -1.608593	  0.395669	 -0.974420
 -1.601697	  0.380938	 -0.972655
 -1.591537	  0.375115	 -0.978335
 -1.571562	  0.361754	 -0.991931
 -1.555406	  0.345866	 -0.999385
 -1.544058	  0.331345	 -1.001030
 -1.531924	  0.310067	 -1.004843
 -1.526624	  0.299154	 -1.009080
 -1.521303	  0.279352	 -1.015495
 -1.502415	  0.254922	 -1.022144
 -1.490614	  0.245097	 -1.024113
 -1.478845	  0.237052	 -1.024166
 -1.458400	  0.222687	 -1.029243
 -1.445941	  0.214128	 -1.032543
 -1.430804	  0.206334	 -1.037096
 -1.409411	  0.195777	 -1.042021
 -1.394634	  0.190537	 -1.045527
 -1.379997	  0.188941	 -1.050074
 -1.357548	  0.192657	 -1.058655
 -1.329315	  0.194738	 -1.062779
 -1.314875	  0.192828	 -1.062871
 -1.303060	  0.186653	 -1.062912
 -1.281360	  0.177063	 -1.066099
 -1.258301	  0.166719	 -1.076789
 -1.237140	  0.169518	 -1.082912
 -1.220063	  0.179990	 -1.084510
 -1.202709	  0.192863	 -1.082820
 -1.185997	  0.209025	 -1.082581
 -1.171257	  0.219358	 -1.078516
 -1.154933	  0.225459	 -1.072807
 -1.129012	  0.242876	 -1.069706
 -1.112408	  0.257385	 -1.066537
 -1.102809	  0.267451	 -1.063538
 -1.090006	  0.280960	 -1.060600
 -1.077122	  0.295361	 -1.052566
 -1.063920	  0.305191	 -1.045846
 -1.047359	  0.318227	 -1.039674
 -1.032645	  0.332682	 -1.035880
 -1.018679	  0.346543	 -1.030808
 -1.009173	  0.358259	 -1.025004
 -0.994089	  0.373240	 -1.010398
 -0.986020	  0.387593	 -0.999323
 -0.975921	  0.403689	 -0.988340
 -0.966144	  0.414666	 -0.978201
 -0.954025	  0.428859	 -0.963970
 -0.942302	  0.437503	 -0.957230
 -0.927747	  0.451873	 -0.944417
 -0.915465	  0.461770	 -0.935952
 -0.899457	  0.468002	 -0.920643
 -0.883364	  0.480676	 -0.914686
 -0.863496	  0.489383	 -0.901374
 -0.855633	  0.507533	 -0.897400
 -0.834405	  0.500732	 -0.888821
 -0.830955	  0.520659	 -0.875354
 -0.805192	  0.519131	 -0.867294
 -0.791456	  0.532077	 -0.848748
 -0.772165	  0.535478	 -0.851027
 -0.759030	  0.540781	 -0.833808
 -0.745092	  0.545424	 -0.829220
 -0.731976	  0.551567	 -0.816776
 -0.708326	  0.561963	 -0.800715
 -0.693650	  0.571589	 -0.791407
 -0.682607	  0.575084	 -0.782467
 -0.667207	  0.584799	 -0.774503
 -0.645287	  0.590176	 -0.766005
 -0.628625	  0.592963	 -0.762487
 -0.611085	  0.594128	 -0.759141
 -0.575227	  0.592924	 -0.755705
 -0.559819	  0.593520	 -0.751683
 -0.546023	  0.593218	 -0.744872
 -0.524019	  0.590914	 -0.736665
 -0.512229	  0.590505	 -0.730321
 -0.495946	  0.588411	 -0.720746
 -0.468319	  0.581026	 -0.706240
 -0.455203	  0.578917	 -0.699315
 -0.443231	  0.575622	 -0.694134
 -0.429944	  0.574092	 -0.687493
 -0.412308	  0.565221	 -0.676687
 -0.389626	  0.555334	 -0.662369
 -0.371997	  0.548584	 -0.657264
 -0.356454	  0.538042	 -0.654821
 -0.335236	  0.523176	 -0.654799
 -0.320873	  0.511697	 -0.659347
 -0.306841	  0.503267	 -0.661395
 -0.287047	  0.488378	 -0.668900
 -0.272451	  0.474644	 -0.677708
 -0.263927	  0.463771	 -0.680532
 -0.252270	  0.447574	 -0.683647
 -0.234234	  0.423039	 -0.683277
 -0.226680	  0.409301	 -0.681708
 -0.220058	  0.396999	 -0.681611
 -0.209254	  0.377289	 -0.684731
 -0.199745	  0.358947	 -0.688133
 -0.185611	  0.342002	 -0.697967
 -0.172654	  0.324256	 -0.710060
 -0.167042	  0.313518	 -0.714740
 -0.165167	  0.300605	 -0.715652
 -0.158611	  0.277075	 -0.722460
 -0.155832	  0.250195	 -0.727859
 -0.153040	  0.236117	 -0.733076
 -0.149074	  0.215223	 -0.739348
 -0.142931	  0.191886	 -0.738694
 -0.138404	  0.180779	 -0.738252
 -0.129399	  0.161548	 -0.740746
 -0.127345	  0.139854	 -0.742425
 -0.126657	  0.121620	 -0.740200
 -0.117408	  0.096012	 -0.742912
 -0.112305	  0.078769	 -0.744718
 -0.109949	  0.065775	 -0.746928
 -0.103700	  0.043405	 -0.746494
 -0.103954	  0.014971	 -0.754079
 -0.106420	  0.003756	 -0.756438
 -0.108033	 -0.014025	 -0.761697
 -0.107517	 -0.039835	 -0.768584
 -0.100013	 -0.062730	 -0.777670
 -0.094668	 -0.074295	 -0.785077
 -0.088192	 -0.083068	 -0.793102
 -0.084755	 -0.095307	 -0.803396
 -0.071509	 -0.122560	 -0.821278
 -0.063704	 -0.137244	 -0.831141
 -0.060300	 -0.149659	 -0.839322
 -0.055365	 -0.169878	 -0.852959
 -0.049056	 -0.184697	 -0.860742
 -0.038641	 -0.201649	 -0.869924
 -0.031444	 -0.219238	 -0.880109
 -0.030211	 -0.239269	 -0.891132
 -0.035165	 -0.257880	 -0.901249
 -0.036839	 -0.269740	 -0.906452
 -0.036960	 -0.287091	 -0.911007
 -0.035615	 -0.306226	 -0.917491
 -0.033255	 -0.330040	 -0.923606
 -0.029507	 -0.355230	 -0.931656
 -0.026588	 -0.369285	 -0.937536
 -0.019241	 -0.388200	 -0.943734
 -0.011016	 -0.404330	 -0.953629
 -0.004010	 -0.417520	 -0.966841
  0.003525	 -0.430366	 -0.984136
  0.009126	 -0.440010	 -1.001172
  0.015205	 -0.444903	 -1.023213
  0.022651	 -0.446195	 -1.045775
  0.032982	 -0.447379	 -1.065683
  0.039907	 -0.450200	 -1.078644
  0.048898	 -0.453951	 -1.095438
  0.057196	 -0.455477	 -1.116125
  0.064394	 -0.455911	 -1.131054
  0.072522	 -0.457846	 -1.144425
  0.088855	 -0.456157	 -1.168781
  0.097239	 -0.463530	 -1.192310
  0.099873	 -0.467939	 -1.205894
  0.100265	 -0.477866	 -1.224211
  0.099469	 -0.473216	 -1.242456
  0.109405	 -0.465362	 -1.258991
  0.117791	 -0.454071	 -1.277516
  0.118402	 -0.456581	 -1.298257
  0.116042	 -0.463989	 -1.320626
  0.115912	 -0.470183	 -1.343722
  0.120118	 -0.467510	 -1.368588
  0.126588	 -0.457998	 -1.389082
  0.132445	 -0.448768	 -1.407579
  0.135176	 -0.439667	 -1.422515
  0.139021	 -0.430800	 -1.433181
  0.141258	 -0.419384	 -1.454577
  0.144056	 -0.410445	 -1.478825
  0.146306	 -0.404985	 -1.491660
  0.152900	 -0.397434	 -1.507161
  0.166733	 -0.385264	 -1.525547
  0.177195	 -0.377824	 -1.539884
  0.190463	 -0.372419	 -1.555194
  0.200806	 -0.369925	 -1.565247
  0.215696	 -0.365791	 -1.581953
  0.230351	 -0.362029	 -1.600074
  0.245603	 -0.357713	 -1.618708
  0.253325	 -0.352079	 -1.632219
  0.262133	 -0.348089	 -1.645575
  0.273347	 -0.342116	 -1.662011
  0.293329	 -0.339312	 -1.679643
  0.324465	 -0.333934	 -1.682646
  0.335224	 -0.331740	 -1.683706
  0.354808	 -0.331573	 -1.685086
  0.371332	 -0.332531	 -1.698296
  0.385095	 -0.333353	 -1.714623
  0.402500	 -0.335645	 -1.725424
  0.422791	 -0.332940	 -1.734837
  0.442223	 -0.326742	 -1.743239
  0.457267	 -0.321932	 -1.746886
  0.478799	 -0.317106	 -1.749420
  0.495096	 -0.313060	 -1.754210
  0.508342	 -0.311157	 -1.764376
  0.523898	 -0.319571	 -1.779093
  0.542955	 -0.325124	 -1.788821
  0.555305	 -0.328851	 -1.796539
  0.568207	 -0.335037	 -1.808785
  0.589180	 -0.346020	 -1.825566
  0.600774	 -0.350704	 -1.831851
  0.618137	 -0.356499	 -1.838792
  0.634232	 -0.354841	 -1.847572
  0.663438	 -0.358398	 -1.858815
  0.685891	 -0.362643	 -1.859234
  0.699685	 -0.366635	 -1.860483
  0.717579	 -0.372388	 -1.861223
  0.745172	 -0.383329	 -1.861580
  0.757612	 -0.388754	 -1.860009
  0.774731	 -0.394757	 -1.859156
  0.796766	 -0.401916	 -1.861466
  0.810852	 -0.410125	 -1.862459
  0.823830	 -0.421259	 -1.863611
  0.843183	 -0.438674	 -1.863367
  0.861937	 -0.451151	 -1.864501
  0.884285	 -0.453699	 -1.865806
  0.914220	 -0.451239	 -1.864026
  0.935705	 -0.447361	 -1.869739
  0.947593	 -0.444939	 -1.876970
  0.958382	 -0.456509	 -1.891741
  0.974456	 -0.470734	 -1.902996
  0.995549	 -0.479548	 -1.910934
  1.010153	 -0.486423	 -1.912624
  1.030011	 -0.495615	 -1.915486
  1.049234	 -0.504232	 -1.921293
  1.066089	 -0.508953	 -1.921769
  1.086420	 -0.517110	 -1.927769
  1.102621	 -0.532095	 -1.939461
  1.110843	 -0.541184	 -1.941226
  1.124448	 -0.551815	 -1.942099
  1.149359	 -0.562854	 -1.949668
  1.165429	 -0.571892	 -1.960976
  1.173601	 -0.579189	 -1.965089
  1.189786	 -0.591302	 -1.967482
  1.213626	 -0.603905	 -1.967183
  1.236758	 -0.614589	 -1.972968
  1.246451	 -0.621298	 -1.979069
  1.260830	 -0.632139	 -1.994302
  1.277418	 -0.643855	 -2.006682
  1.295882	 -0.650446	 -2.015555
  1.309817	 -0.654599	 -2.018950
  1.327640	 -0.666028	 -2.025644
  1.340352	 -0.683050	 -2.031908
  1.352027	 -0.701057	 -2.035107
  1.368556	 -0.715318	 -2.034556
  1.388412	 -0.725390	 -2.030198
  1.403876	 -0.736691	 -2.035956
