 -0.618252	 -2.166754	  1.111826
 -0.639347	 -2.193087	  1.116979
 -0.627036	 -2.177605	  1.114020
 -0.615355	 -2.161523	  1.111806
 -0.603673	 -2.145441	  1.109591
 -0.592195	 -2.129179	  1.107638
 -0.581171	 -2.112549	  1.106257
 -0.570147	 -2.095919	  1.104875
 -0.559345	 -2.079100	  1.104206
 -0.548684	 -2.062180	  1.103965
 -0.538032	 -2.045254	  1.103747
 -0.527735	 -2.028121	  1.104400
 -0.517438	 -2.010988	  1.105053
 -0.507293	 -1.993769	  1.105819
 -0.497360	 -1.976434	  1.106740
 -0.487427	 -1.959100	  1.107660
 -0.477760	 -1.941610	  1.108479
 -0.468145	 -1.924092	  1.109280
 -0.458586	 -1.906538	  1.109987
 -0.449164	 -1.888903	  1.110471
 -0.439743	 -1.871268	  1.110955
 -0.430348	 -1.853613	  1.111151
 -0.420965	 -1.835950	  1.111227
 -0.411592	 -1.818283	  1.111282
 -0.402444	 -1.800502	  1.110900
 -0.393296	 -1.782721	  1.110518
 -0.384370	 -1.764828	  1.110068
 -0.376142	 -1.746611	  1.109412
 -0.367914	 -1.728394	  1.108756
 -0.360157	 -1.709965	  1.108296
 -0.353085	 -1.691258	  1.108119
 -0.346013	 -1.672551	  1.107942
 -0.339939	 -1.653501	  1.108395
 -0.334280	 -1.634332	  1.109104
 -0.328684	 -1.615145	  1.109849
 -0.325012	 -1.595567	  1.111643
 -0.321340	 -1.575989	  1.113437
 -0.317669	 -1.556411	  1.115231
 -0.316779	 -1.536611	  1.117910
 -0.316757	 -1.516828	  1.120852
 -0.316735	 -1.497046	  1.123794
 -0.316713	 -1.477264	  1.126736
 -0.316910	 -1.457490	  1.129727
 -0.321642	 -1.438453	  1.133630
 -0.326373	 -1.419417	  1.137533
 -0.331104	 -1.400381	  1.141437
 -0.335836	 -1.381345	  1.145340
 -0.340567	 -1.362308	  1.149243
 -0.346133	 -1.343480	  1.153056
 -0.353411	 -1.325203	  1.156656
 -0.360689	 -1.306926	  1.160257
 -0.367968	 -1.288648	  1.163858
 -0.375246	 -1.270371	  1.167458
 -0.382254	 -1.251900	  1.170572
 -0.388461	 -1.232964	  1.172285
 -0.394667	 -1.214029	  1.173999
 -0.400695	 -1.195020	  1.175528
 -0.402453	 -1.175275	  1.172875
 -0.399813	 -1.156041	  1.168070
 -0.390260	 -1.140253	  1.160360
 -0.380634	 -1.124508	  1.152650
 -0.367941	 -1.111038	  1.145071
 -0.354160	 -1.098598	  1.137631
 -0.339511	 -1.087097	  1.130343
 -0.323630	 -1.077151	  1.123351
 -0.307343	 -1.067853	  1.116403
 -0.290200	 -1.060252	  1.109451
 -0.272386	 -1.054569	  1.102354
 -0.254312	 -1.050031	  1.095092
 -0.236067	 -1.047012	  1.087475
 -0.217823	 -1.043993	  1.079857
 -0.199731	 -1.041241	  1.071788
 -0.181709	 -1.038604	  1.063527
 -0.163687	 -1.035968	  1.055265
 -0.145665	 -1.033331	  1.047004
 -0.127840	 -1.030026	  1.038557
 -0.110583	 -1.025138	  1.029708
 -0.093325	 -1.020251	  1.020860
 -0.076068	 -1.015364	  1.012011
 -0.058810	 -1.010476	  1.003162
 -0.041553	 -1.005589	  0.994314
 -0.024917	 -0.998925	  0.985435
 -0.009375	 -0.989917	  0.976642
  0.006166	 -0.980909	  0.967849
  0.021708	 -0.971901	  0.959057
  0.037250	 -0.962894	  0.950264
  0.052792	 -0.953886	  0.941471
  0.067019	 -0.942862	  0.932750
  0.080846	 -0.931307	  0.924072
  0.094672	 -0.919752	  0.915394
  0.108498	 -0.908197	  0.906715
  0.121674	 -0.895845	  0.898122
  0.134279	 -0.882852	  0.889619
  0.146884	 -0.869860	  0.881116
  0.159105	 -0.856447	  0.872706
  0.170420	 -0.842124	  0.864530
  0.181736	 -0.827802	  0.856355
  0.192550	 -0.812999	  0.848360
  0.202488	 -0.797429	  0.840691
  0.212426	 -0.781859	  0.833023
  0.221721	 -0.765711	  0.825753
  0.230414	 -0.749071	  0.818859
  0.239108	 -0.732430	  0.811965
  0.247102	 -0.715228	  0.805628
  0.254841	 -0.697836	  0.799495
  0.262563	 -0.680433	  0.793369
  0.269570	 -0.662616	  0.787583
  0.276576	 -0.644800	  0.781798
  0.283679	 -0.627047	  0.775934
  0.290899	 -0.609372	  0.769977
  0.298411	 -0.591818	  0.764026
  0.307259	 -0.574882	  0.758119
  0.316112	 -0.557948	  0.752214
  0.326351	 -0.541724	  0.746562
  0.336591	 -0.525501	  0.740911
  0.347671	 -0.509699	  0.735664
  0.358957	 -0.494008	  0.730522
  0.370705	 -0.478558	  0.725699
  0.382756	 -0.463275	  0.721093
  0.394967	 -0.448043	  0.716749
  0.407460	 -0.432912	  0.712878
  0.419953	 -0.417781	  0.709008
  0.432559	 -0.402517	  0.706161
  0.445165	 -0.387253	  0.703315
  0.457715	 -0.371864	  0.700934
  0.470208	 -0.356369	  0.698973
  0.482700	 -0.340875	  0.697011
  0.494961	 -0.325103	  0.696052
  0.507212	 -0.309321	  0.695133
  0.519364	 -0.293444	  0.694636
  0.531365	 -0.277445	  0.694740
  0.543366	 -0.261446	  0.694844
  0.555290	 -0.245396	  0.695314
  0.567204	 -0.229340	  0.695830
  0.579124	 -0.213285	  0.696199
  0.591055	 -0.197233	  0.696317
  0.602985	 -0.181182	  0.696435
  0.615043	 -0.165236	  0.695845
  0.627120	 -0.149310	  0.695138
  0.639219	 -0.133415	  0.694157
  0.651361	 -0.117607	  0.692522
  0.663504	 -0.101800	  0.690887
  0.675689	 -0.086114	  0.688542
  0.687884	 -0.070471	  0.685977
  0.700105	 -0.054906	  0.683082
  0.712370	 -0.039530	  0.679456
  0.724635	 -0.024154	  0.675831
  0.736880	 -0.009207	  0.670669
  0.749118	  0.005692	  0.665354
  0.761146	  0.020688	  0.659835
  0.772757	  0.035862	  0.653924
  0.784367	  0.051036	  0.648013
  0.795490	  0.066858	  0.642918
  0.806167	  0.083190	  0.638531
  0.816844	  0.099523	  0.634145
  0.826577	  0.116724	  0.631079
  0.835596	  0.134449	  0.628959
  0.844615	  0.152173	  0.626838
  0.852755	  0.170405	  0.625680
  0.859901	  0.189084	  0.625567
  0.867047	  0.207764	  0.625454
  0.873673	  0.226625	  0.626034
  0.879655	  0.245657	  0.627449
  0.885637	  0.264689	  0.628863
  0.891187	  0.283812	  0.630734
  0.896144	  0.303028	  0.633219
  0.901101	  0.322244	  0.635705
  0.906058	  0.341460	  0.638190
  0.909296	  0.360931	  0.641419
  0.912432	  0.380410	  0.644690
  0.915568	  0.399890	  0.647962
  0.918704	  0.419370	  0.651234
  0.920193	  0.438674	  0.656248
  0.920844	  0.457784	  0.662112
  0.921496	  0.476894	  0.667976
  0.922147	  0.496003	  0.673841
  0.922798	  0.515113	  0.679705
  0.921280	  0.533119	  0.688278
  0.918653	  0.550316	  0.698145
  0.916027	  0.567512	  0.708013
  0.913401	  0.584709	  0.717881
  0.910775	  0.601906	  0.727749
  0.908149	  0.619103	  0.737617
  0.902065	  0.634438	  0.748922
  0.895827	  0.649671	  0.760282
  0.889589	  0.664904	  0.771642
  0.883351	  0.680137	  0.783001
  0.877113	  0.695370	  0.794361
  0.870407	  0.710748	  0.805248
  0.862651	  0.726397	  0.814993
  0.854894	  0.742046	  0.824738
  0.847137	  0.757694	  0.834482
  0.839380	  0.773343	  0.844227
  0.831554	  0.789291	  0.853414
  0.823644	  0.805624	  0.861820
  0.815734	  0.821956	  0.870227
  0.807824	  0.838289	  0.878634
  0.799913	  0.854622	  0.887040
  0.792519	  0.872103	  0.893343
  0.785148	  0.889628	  0.899553
  0.777778	  0.907152	  0.905764
  0.770408	  0.924677	  0.911974
  0.765695	  0.943734	  0.915799
  0.761662	  0.963057	  0.919016
  0.766702	  0.982388	  0.919974
  0.785014	  0.989502	  0.916227
  0.803327	  0.996616	  0.912481
  0.821640	  1.003730	  0.908735
  0.839952	  1.010844	  0.904988
  0.858265	  1.017958	  0.901242
  0.876578	  1.025072	  0.897496
  0.894890	  1.032186	  0.893749
  0.913203	  1.039300	  0.890003
  0.931516	  1.046415	  0.886256
  0.949828	  1.053529	  0.882510
  0.968141	  1.060643	  0.878764
  0.986454	  1.067757	  0.875017
  1.004767	  1.074871	  0.871271
  1.023079	  1.081985	  0.867525
  1.041392	  1.089099	  0.863778
  1.059705	  1.096213	  0.860032
  1.078017	  1.103327	  0.856286
  1.096330	  1.110441	  0.852539
  1.114643	  1.117555	  0.848793
  1.132955	  1.124669	  0.845046
  1.151268	  1.131784	  0.841300
  1.169581	  1.138898	  0.837554
  1.185490	  1.149522	  0.831722
  1.200676	  1.160915	  0.825430
  1.215862	  1.172308	  0.819138
  1.231048	  1.183701	  0.812846
  1.246234	  1.195094	  0.806554
  1.261420	  1.206487	  0.800262
  1.276606	  1.217880	  0.793970
  1.288509	  1.231300	  0.785127
  1.300382	  1.244734	  0.776264
  1.312256	  1.258168	  0.767401
  1.324129	  1.271602	  0.758538
  1.336002	  1.285036	  0.749674
  1.346963	  1.298311	  0.739494
  1.355586	  1.310905	  0.726570
  1.364209	  1.323499	  0.713646
  1.372832	  1.336093	  0.700722
  1.380591	  1.347915	  0.686578
  1.382416	  1.353753	  0.667537
  1.384241	  1.359592	  0.648495
  1.386066	  1.365431	  0.629454
  1.387890	  1.371270	  0.610412
  1.392427	  1.372036	  0.590949
  1.398334	  1.369902	  0.571960
  1.404240	  1.367769	  0.552972
  1.410147	  1.365635	  0.533983
  1.416053	  1.363502	  0.514995
  1.421959	  1.361368	  0.496006
  1.433703	  1.358890	  0.480008
  1.448800	  1.356330	  0.467142
  1.463897	  1.353769	  0.454277
  1.478994	  1.351208	  0.441411
  1.494091	  1.348648	  0.428546
  1.503366	  1.358574	  0.413868
  1.501159	  1.376550	  0.405381
  1.498952	  1.394525	  0.396895
  1.496745	  1.412500	  0.388408
  1.494538	  1.430475	  0.379921
  1.492331	  1.448450	  0.371434
  1.490124	  1.466425	  0.362948
  1.487917	  1.484400	  0.354461
  1.485710	  1.502375	  0.345974
  1.485001	  1.520439	  0.337418
  1.488312	  1.538236	  0.328914
  1.491623	  1.556032	  0.320411
  1.496014	  1.573671	  0.312068
  1.504867	  1.590022	  0.304702
  1.513721	  1.606373	  0.297336
  1.523302	  1.622474	  0.290340
  1.534547	  1.637861	  0.284274
  1.545792	  1.653248	  0.278209
  1.557167	  1.669004	  0.273480
  1.568605	  1.684990	  0.269790
  1.580026	  1.700994	  0.266121
  1.590387	  1.717924	  0.263673
  1.600749	  1.734855	  0.261225
  1.609993	  1.752128	  0.257201
  1.618759	  1.769493	  0.252550
  1.627784	  1.786661	  0.247674
  1.637220	  1.803500	  0.242438
  1.646656	  1.820339	  0.237202
  1.655884	  1.837417	  0.232113
  1.664689	  1.854721	  0.227309
