 -1.607613	 -1.610487	 -0.363235
 -1.596403	 -1.649714	 -0.365302
 -1.585193	 -1.688941	 -0.367369
 -1.591989	 -1.671097	 -0.361523
 -1.592485	 -1.654002	 -0.367760
 -1.597454	 -1.630500	 -0.370352
 -1.603382	 -1.610464	 -0.368752
 -1.609911	 -1.592009	 -0.365322
 -1.616435	 -1.573142	 -0.362551
 -1.622949	 -1.554312	 -0.360055
 -1.629281	 -1.535451	 -0.357860
 -1.636162	 -1.516838	 -0.355122
 -1.643837	 -1.498727	 -0.351420
 -1.651565	 -1.480672	 -0.347641
 -1.659421	 -1.462698	 -0.343726
 -1.668693	 -1.445711	 -0.338644
 -1.677952	 -1.428721	 -0.333583
 -1.687184	 -1.411720	 -0.328520
 -1.696878	 -1.395218	 -0.323042
 -1.707111	 -1.380381	 -0.317831
 -1.723519	 -1.368502	 -0.312479
 -1.738807	 -1.352257	 -0.307012
 -1.740107	 -1.330879	 -0.304264
 -1.741223	 -1.307171	 -0.300841
 -1.745812	 -1.288191	 -0.296048
 -1.749101	 -1.272267	 -0.289810
 -1.754687	 -1.251311	 -0.281758
 -1.763623	 -1.233069	 -0.274964
 -1.768022	 -1.220637	 -0.270893
 -1.777457	 -1.197178	 -0.263469
 -1.789053	 -1.180059	 -0.256962
 -1.795207	 -1.172265	 -0.253145
 -1.808314	 -1.151351	 -0.245066
 -1.812101	 -1.122011	 -0.233696
 -1.810531	 -1.110073	 -0.228556
 -1.808759	 -1.098520	 -0.220628
 -1.809263	 -1.076279	 -0.214522
 -1.815135	 -1.052009	 -0.208154
 -1.825654	 -1.034412	 -0.202655
 -1.832853	 -1.020282	 -0.203089
 -1.834401	 -0.999907	 -0.196357
 -1.847369	 -0.978127	 -0.187162
 -1.863435	 -0.965148	 -0.188716
 -1.873585	 -0.948731	 -0.191374
 -1.879761	 -0.928854	 -0.189890
 -1.888027	 -0.909231	 -0.189365
 -1.902419	 -0.892675	 -0.187486
 -1.918590	 -0.876226	 -0.179977
 -1.929074	 -0.856989	 -0.170375
 -1.930686	 -0.843255	 -0.162164
 -1.924861	 -0.822814	 -0.154853
 -1.927974	 -0.805508	 -0.156080
 -1.937167	 -0.785478	 -0.158038
 -1.939688	 -0.764308	 -0.161812
 -1.942997	 -0.740488	 -0.158246
 -1.951451	 -0.720549	 -0.146935
 -1.962167	 -0.708999	 -0.136829
 -1.976570	 -0.694848	 -0.128903
 -1.985434	 -0.672657	 -0.122491
 -1.983882	 -0.650571	 -0.118470
 -1.977540	 -0.634892	 -0.116323
 -1.976852	 -0.611569	 -0.121482
 -1.989775	 -0.591444	 -0.119852
 -2.006139	 -0.578758	 -0.116321
 -2.018033	 -0.562487	 -0.114167
 -2.027332	 -0.544784	 -0.112006
 -2.036908	 -0.527627	 -0.109259
 -2.049718	 -0.512587	 -0.105839
 -2.063390	 -0.500163	 -0.099352
 -2.070799	 -0.483588	 -0.087103
 -2.083337	 -0.463303	 -0.077432
 -2.097630	 -0.447729	 -0.078535
 -2.106657	 -0.436933	 -0.078855
 -2.115914	 -0.419212	 -0.078711
 -2.128494	 -0.393241	 -0.084006
 -2.137224	 -0.380736	 -0.089942
 -2.150153	 -0.366068	 -0.099465
 -2.172343	 -0.345366	 -0.097906
 -2.184310	 -0.330906	 -0.097741
 -2.192947	 -0.319282	 -0.100105
 -2.207787	 -0.297132	 -0.099560
 -2.221802	 -0.280005	 -0.094353
 -2.228577	 -0.270333	 -0.089259
 -2.231955	 -0.249899	 -0.079437
 -2.231349	 -0.226846	 -0.072137
 -2.232966	 -0.206434	 -0.065790
 -2.237488	 -0.187438	 -0.057595
 -2.244075	 -0.170128	 -0.049043
 -2.249149	 -0.153033	 -0.041842
 -2.253347	 -0.137328	 -0.036544
 -2.251733	 -0.119978	 -0.026295
 -2.242498	 -0.096789	 -0.015093
 -2.239703	 -0.071845	 -0.009274
 -2.247456	 -0.051509	 -0.010341
 -2.261693	 -0.034667	 -0.011010
 -2.275291	 -0.020942	 -0.007923
 -2.282997	 -0.001356	 -0.005383
 -2.290584	  0.017117	 -0.003303
 -2.296124	  0.036201	 -0.000558
 -2.302393	  0.055082	  0.001672
 -2.309448	  0.073673	  0.003342
 -2.318412	  0.091185	  0.006316
 -2.328876	  0.108497	  0.011797
 -2.338203	  0.129715	  0.017267
 -2.343818	  0.162487	  0.011042
 -2.351314	  0.180965	  0.012589
 -2.358810	  0.199443	  0.014136
