  1.064386	  2.121877	  1.882982
  1.053847	  2.100868	  1.864339
  1.036190	  2.108821	  1.818421
  1.023114	  2.099483	  1.770595
  1.011373	  2.086678	  1.723284
  1.000387	  2.071038	  1.676236
  0.991303	  2.051494	  1.629251
  0.986103	  2.028806	  1.582832
  0.983839	  2.003875	  1.538012
  0.982963	  1.976208	  1.494612
  0.981441	  1.945317	  1.453500
  0.978375	  1.911384	  1.414580
  0.973186	  1.875824	  1.377209
  0.965605	  1.839706	  1.340871
  0.956059	  1.804089	  1.304712
  0.944539	  1.768847	  1.268910
  0.930914	  1.734543	  1.232968
  0.914985	  1.701979	  1.196759
  0.897061	  1.672069	  1.160230
  0.876875	  1.644637	  1.124098
  0.854212	  1.618488	  1.089454
  0.828138	  1.593480	  1.057221
  0.796053	  1.568851	  1.028381
  0.754503	  1.542817	  1.003462
  0.701808	  1.514672	  0.982585
  0.643076	  1.484918	  0.962538
  0.586582	  1.459227	  0.941890
  0.541327	  1.436491	  0.924291
  0.508981	  1.414129	  0.910848
  0.483949	  1.388767	  0.898691
  0.460437	  1.354376	  0.883257
  0.436823	  1.305669	  0.859152
  0.417784	  1.245956	  0.823021
  0.408634	  1.182839	  0.776580
  0.409454	  1.123270	  0.725011
  0.419118	  1.067374	  0.672303
  0.433623	  1.015241	  0.620776
  0.450389	  0.964412	  0.570125
  0.466347	  0.914517	  0.521176
  0.478942	  0.864894	  0.472855
  0.487987	  0.815914	  0.426055
  0.494866	  0.772399	  0.385879
  0.498408	  0.738881	  0.356279
  0.498941	  0.717198	  0.338471
  0.497927	  0.702701	  0.327947
  0.494649	  0.682107	  0.314656
  0.485441	  0.644690	  0.291186
  0.468354	  0.589297	  0.253406
  0.447128	  0.529518	  0.204918
  0.426117	  0.479096	  0.150381
  0.410354	  0.447135	  0.096113
  0.400128	  0.432722	  0.047584
  0.392837	  0.429615	  0.004411
  0.387390	  0.434781	 -0.037864
  0.382183	  0.448965	 -0.083875
  0.376701	  0.475712	 -0.139499
  0.370523	  0.520221	 -0.211060
  0.367459	  0.581672	 -0.300525
  0.371244	  0.655327	 -0.402372
  0.372820	  0.723134	 -0.505808
  0.362650	  0.760033	 -0.605290
  0.349387	  0.763117	 -0.688920
  0.338806	  0.751671	 -0.751794
  0.330155	  0.735452	 -0.801813
  0.322303	  0.716110	 -0.847345
  0.315166	  0.693749	 -0.891394
  0.308386	  0.669325	 -0.934174
  0.301560	  0.643640	 -0.974819
  0.294254	  0.617453	 -1.012636
  0.286249	  0.590956	 -1.047132
  0.277019	  0.563068	 -1.079307
  0.265102	  0.530281	 -1.111635
  0.248081	  0.486140	 -1.146833
  0.224011	  0.424861	 -1.184742
  0.197156	  0.344800	 -1.219664
  0.177184	  0.252243	 -1.244510
  0.169182	  0.161251	 -1.259777
  0.171086	  0.082801	 -1.274052
  0.173749	  0.020281	 -1.292778
  0.173735	 -0.030719	 -1.317037
  0.169979	 -0.074774	 -1.347710
  0.161290	 -0.113797	 -1.385424
  0.146227	 -0.147612	 -1.431686
  0.125002	 -0.173348	 -1.482549
  0.099358	 -0.189069	 -1.533394
  0.073092	 -0.193399	 -1.580556
  0.046210	 -0.185280	 -1.627703
  0.019007	 -0.159261	 -1.682343
 -0.004985	 -0.111962	 -1.748031
 -0.023113	 -0.052837	 -1.822785
 -0.033491	  0.001392	 -1.899525
 -0.035048	  0.039654	 -1.972413
 -0.032178	  0.056336	 -2.037056
 -0.028914	  0.057844	 -2.091846
 -0.025822	  0.050004	 -2.140375
 -0.023528	  0.037288	 -2.186620
 -0.022280	  0.021755	 -2.233436
 -0.023008	  0.004854	 -2.280707
 -0.025779	 -0.013295	 -2.327705
 -0.029569	 -0.032528	 -2.374108
 -0.034519	 -0.053307	 -2.419153
 -0.041144	 -0.075251	 -2.463206
 -0.049673	 -0.098011	 -2.506573
 -0.060107	 -0.121526	 -2.550061
 -0.073107	 -0.145109	 -2.593192
 -0.088839	 -0.168812	 -2.635392
 -0.106025	 -0.193685	 -2.675398
 -0.123978	 -0.219080	 -2.714123
 -0.140467	 -0.243952	 -2.753302
 -0.155794	 -0.268794	 -2.792935
 -0.170953	 -0.294105	 -2.833189
 -0.185915	 -0.317161	 -2.876837
 -0.203571	 -0.334745	 -2.924086
 -0.217402	 -0.359454	 -2.970443
 -0.219576	 -0.363048	 -3.000147
