  1.134878	 -1.666356	  1.329029
  1.142600	 -1.665429	  1.335706
  1.114187	 -1.668838	  1.311141
  1.080190	 -1.670666	  1.281547
  1.045843	 -1.670436	  1.252932
  1.010619	 -1.668258	  1.226924
  0.974942	 -1.663905	  1.203585
  0.936454	 -1.657121	  1.181494
  0.891323	 -1.649637	  1.159809
  0.840037	 -1.643843	  1.136938
  0.787080	 -1.642024	  1.111489
  0.737001	 -1.643037	  1.083701
  0.690678	 -1.645621	  1.054263
  0.646656	 -1.649143	  1.023233
  0.604494	 -1.653761	  0.992402
  0.563630	 -1.658864	  0.962650
  0.523092	 -1.664156	  0.933479
  0.481829	 -1.670038	  0.904333
  0.437263	 -1.677836	  0.874468
  0.389628	 -1.689341	  0.844361
  0.340157	 -1.707105	  0.814263
  0.282568	 -1.738570	  0.779277
  0.211886	 -1.802573	  0.732902
  0.154830	 -1.901333	  0.669279
  0.126427	 -1.988857	  0.607291
  0.111266	 -2.027517	  0.573005
 -0.172417	 -1.854206	  0.458516
 -0.209733	 -1.844463	  0.437425
 -0.245787	 -1.845812	  0.414162
 -0.278577	 -1.855634	  0.393328
 -0.304808	 -1.872028	  0.377133
 -0.320660	 -1.888792	  0.367636
 -0.327044	 -1.900426	  0.363865
 -0.333062	 -1.922324	  0.360494
 -0.347769	 -2.000577	  0.356622
 -0.394946	 -2.135344	  0.342427
 -0.481251	 -2.269685	  0.299663
 -0.572680	 -2.357478	  0.231463
 -0.653857	 -2.395193	  0.168954
 -0.716035	 -2.404204	  0.121672
 -0.757402	 -2.402555	  0.088936
 -0.789620	 -2.399799	  0.060643
 -0.855074	 -2.392615	  0.001025
 -0.878973	 -2.388859	 -0.019393
