 -0.449961	 -1.772646	 -1.623534
 -0.455178	 -1.806391	 -1.657266
 -0.453003	 -1.791711	 -1.643861
 -0.450839	 -1.775764	 -1.632000
 -0.448676	 -1.759753	 -1.620211
 -0.446512	 -1.743743	 -1.608423
 -0.444348	 -1.727732	 -1.596634
 -0.442241	 -1.711682	 -1.584922
 -0.444060	 -1.692654	 -1.579111
 -0.446971	 -1.673274	 -1.575126
 -0.449889	 -1.653888	 -1.571163
 -0.452806	 -1.634503	 -1.567201
 -0.455723	 -1.615118	 -1.563239
 -0.458640	 -1.595732	 -1.559277
 -0.461566	 -1.576346	 -1.555329
 -0.465053	 -1.556864	 -1.552709
 -0.471954	 -1.539367	 -1.559405
 -0.478896	 -1.521898	 -1.566232
 -0.485837	 -1.504427	 -1.573058
 -0.492779	 -1.486957	 -1.579884
 -0.499720	 -1.469487	 -1.586711
 -0.506681	 -1.452037	 -1.593564
 -0.514496	 -1.435730	 -1.602104
 -0.522372	 -1.419505	 -1.610748
 -0.530248	 -1.403277	 -1.619387
 -0.537353	 -1.386459	 -1.627552
 -0.543870	 -1.369234	 -1.635349
 -0.550327	 -1.351971	 -1.643106
 -0.554909	 -1.333710	 -1.649841
 -0.559468	 -1.315414	 -1.656525
 -0.562693	 -1.296758	 -1.662983
 -0.564830	 -1.277785	 -1.668639
 -0.568257	 -1.258361	 -1.672914
 -0.570273	 -1.238554	 -1.676672
 -0.570916	 -1.218856	 -1.682090
 -0.570080	 -1.199352	 -1.687219
 -0.567831	 -1.179715	 -1.690352
 -0.564727	 -1.159753	 -1.691683
 -0.560435	 -1.140082	 -1.691670
 -0.553947	 -1.120918	 -1.691282
 -0.546228	 -1.102667	 -1.691069
 -0.537703	 -1.086314	 -1.687888
 -0.528196	 -1.072164	 -1.687265
 -0.513276	 -1.060220	 -1.681178
 -0.496181	 -1.050837	 -1.673697
 -0.480704	 -1.042810	 -1.664644
 -0.465914	 -1.031391	 -1.656625
 -0.453101	 -1.017712	 -1.648629
 -0.442448	 -1.003190	 -1.637556
 -0.432065	 -0.991407	 -1.619694
 -0.420145	 -0.986910	 -1.604118
 -0.405521	 -0.985725	 -1.593616
 -0.387533	 -0.982396	 -1.582310
 -0.372935	 -0.976695	 -1.569570
 -0.359800	 -0.968602	 -1.558001
 -0.347131	 -0.959490	 -1.546921
 -0.333746	 -0.951236	 -1.527642
 -0.321512	 -0.950603	 -1.509772
 -0.310435	 -0.953754	 -1.498767
 -0.291299	 -0.953246	 -1.486003
 -0.276140	 -0.947164	 -1.471116
 -0.267959	 -0.935857	 -1.456512
 -0.257810	 -0.924625	 -1.442682
 -0.246778	 -0.916852	 -1.427443
 -0.234474	 -0.912054	 -1.412377
 -0.220703	 -0.906083	 -1.398580
 -0.209680	 -0.899739	 -1.382807
 -0.202731	 -0.898493	 -1.363115
 -0.199545	 -0.898637	 -1.340561
 -0.191967	 -0.894688	 -1.322105
 -0.178099	 -0.882973	 -1.309940
 -0.165324	 -0.869236	 -1.296429
 -0.158023	 -0.860609	 -1.279452
 -0.152596	 -0.856391	 -1.263409
 -0.145561	 -0.850200	 -1.246468
 -0.140695	 -0.840090	 -1.221119
 -0.140749	 -0.838924	 -1.205015
 -0.139253	 -0.839450	 -1.186814
 -0.134832	 -0.830633	 -1.166569
 -0.130794	 -0.817372	 -1.150077
 -0.128777	 -0.809884	 -1.134777
 -0.127309	 -0.798613	 -1.110403
 -0.125555	 -0.789578	 -1.097343
 -0.123576	 -0.782239	 -1.083820
 -0.121010	 -0.767486	 -1.062114
 -0.120321	 -0.756170	 -1.044557
 -0.118477	 -0.748127	 -1.032708
 -0.120035	 -0.730871	 -1.016981
 -0.120690	 -0.717766	 -1.001566
 -0.120112	 -0.707074	 -0.983891
 -0.119698	 -0.697287	 -0.962988
 -0.122652	 -0.687277	 -0.945686
 -0.127447	 -0.680420	 -0.932108
 -0.133884	 -0.671457	 -0.915209
 -0.139597	 -0.662916	 -0.891818
 -0.144957	 -0.655080	 -0.875723
 -0.149609	 -0.648628	 -0.861705
 -0.156595	 -0.636022	 -0.843334
 -0.159085	 -0.624913	 -0.830135
 -0.161708	 -0.612711	 -0.813769
 -0.171060	 -0.599228	 -0.791778
 -0.180600	 -0.591809	 -0.779493
 -0.190285	 -0.583291	 -0.763831
 -0.197634	 -0.574803	 -0.750037
 -0.204725	 -0.560975	 -0.738959
 -0.212150	 -0.532877	 -0.722722
 -0.214536	 -0.526184	 -0.718724
 -0.221780	 -0.505846	 -0.707991
 -0.236253	 -0.486525	 -0.694263
 -0.243352	 -0.474881	 -0.685878
 -0.248631	 -0.463655	 -0.680483
 -0.255453	 -0.447620	 -0.668986
 -0.267868	 -0.426067	 -0.641285
 -0.267527	 -0.416646	 -0.634232
 -0.268088	 -0.406980	 -0.624265
 -0.265878	 -0.389137	 -0.602674
 -0.268473	 -0.377965	 -0.580761
 -0.269009	 -0.368175	 -0.567037
 -0.272397	 -0.355427	 -0.550848
 -0.274225	 -0.342186	 -0.535070
 -0.273503	 -0.332803	 -0.525530
 -0.276205	 -0.318938	 -0.511587
 -0.281515	 -0.309597	 -0.498409
 -0.282227	 -0.287550	 -0.470916
 -0.284005	 -0.276754	 -0.459942
 -0.284542	 -0.266437	 -0.449532
 -0.288636	 -0.253543	 -0.438422
 -0.297715	 -0.234809	 -0.421983
 -0.303927	 -0.216701	 -0.408058
 -0.303545	 -0.205416	 -0.399021
 -0.296142	 -0.195734	 -0.378179
 -0.282837	 -0.184838	 -0.357613
 -0.274789	 -0.170872	 -0.344269
 -0.273368	 -0.157903	 -0.334089
 -0.269398	 -0.145144	 -0.318066
 -0.262657	 -0.125366	 -0.301859
 -0.261070	 -0.111119	 -0.294377
 -0.261585	 -0.097239	 -0.284332
 -0.258793	 -0.081950	 -0.268861
 -0.254433	 -0.063488	 -0.255690
 -0.256111	 -0.044761	 -0.246999
 -0.260247	 -0.029655	 -0.238955
 -0.266533	 -0.009151	 -0.224166
 -0.264605	  0.008224	 -0.210023
 -0.263256	  0.020005	 -0.202350
 -0.260473	  0.037030	 -0.190612
 -0.261496	  0.051432	 -0.177134
 -0.261379	  0.067497	 -0.161154
 -0.258079	  0.082586	 -0.148179
 -0.249249	  0.095272	 -0.138519
 -0.239173	  0.114326	 -0.122665
 -0.239236	  0.127945	 -0.110561
 -0.241210	  0.138967	 -0.099457
 -0.244423	  0.160303	 -0.081487
 -0.245158	  0.172230	 -0.070853
 -0.245371	  0.185241	 -0.059743
 -0.244863	  0.203171	 -0.044235
 -0.240840	  0.218558	 -0.031558
 -0.235820	  0.232650	 -0.021420
 -0.233325	  0.249767	 -0.005943
 -0.227084	  0.264648	  0.008329
 -0.219418	  0.275844	  0.016450
 -0.210186	  0.293217	  0.028908
 -0.207419	  0.307922	  0.042718
 -0.209544	  0.321896	  0.056378
 -0.208265	  0.337796	  0.073424
 -0.203055	  0.348925	  0.086456
 -0.196148	  0.363573	  0.098982
 -0.191942	  0.380043	  0.107006
 -0.187219	  0.396744	  0.120039
 -0.182656	  0.411809	  0.132465
 -0.178011	  0.426671	  0.144700
 -0.176729	  0.440657	  0.158065
 -0.177599	  0.456298	  0.172214
 -0.175939	  0.470596	  0.186239
 -0.165314	  0.486170	  0.200967
 -0.154120	  0.499966	  0.210469
 -0.146287	  0.514910	  0.217041
 -0.143268	  0.530572	  0.224913
 -0.140485	  0.557319	  0.242103
 -0.137029	  0.569469	  0.250686
 -0.134260	  0.579744	  0.261314
 -0.129341	  0.592320	  0.278991
 -0.123408	  0.606883	  0.296559
 -0.118040	  0.621885	  0.305696
 -0.114724	  0.640594	  0.312585
 -0.111261	  0.664114	  0.321499
 -0.108993	  0.677302	  0.331440
 -0.106416	  0.691314	  0.342695
 -0.099973	  0.711488	  0.357178
 -0.096394	  0.722744	  0.363118
 -0.092319	  0.744757	  0.370766
 -0.088208	  0.767216	  0.377238
 -0.084345	  0.784196	  0.384612
 -0.078895	  0.799771	  0.393253
 -0.068847	  0.816322	  0.405655
 -0.063351	  0.828235	  0.413572
 -0.059148	  0.843242	  0.428704
 -0.055672	  0.862472	  0.445324
 -0.051266	  0.874682	  0.460762
 -0.044649	  0.885985	  0.471246
 -0.036737	  0.898670	  0.476503
 -0.026072	  0.922624	  0.488781
 -0.019826	  0.934411	  0.503364
 -0.015589	  0.946714	  0.516420
 -0.007978	  0.957756	  0.534415
 -0.002307	  0.969411	  0.545022
  0.000805	  0.988204	  0.551733
  0.003923	  1.013603	  0.563964
  0.011882	  1.029113	  0.574263
  0.020976	  1.038237	  0.581976
  0.038094	  1.049909	  0.591593
  0.051203	  1.066533	  0.600188
  0.056879	  1.079249	  0.611307
  0.061777	  1.091771	  0.626986
  0.068621	  1.108314	  0.640552
  0.078222	  1.122063	  0.647902
  0.092739	  1.137161	  0.653454
  0.103272	  1.155270	  0.662278
  0.106724	  1.168655	  0.672988
  0.111682	  1.183789	  0.685443
  0.122742	  1.199959	  0.694823
  0.133447	  1.214200	  0.702159
  0.142654	  1.231898	  0.713212
  0.146627	  1.247372	  0.724764
  0.151475	  1.265256	  0.736135
  0.156922	  1.279308	  0.743270
  0.166283	  1.295944	  0.753698
  0.173828	  1.304262	  0.766580
  0.184983	  1.315632	  0.780543
  0.190194	  1.333817	  0.798470
  0.191426	  1.349290	  0.811673
  0.192614	  1.361542	  0.821854
  0.195204	  1.382993	  0.838529
  0.198021	  1.395168	  0.848241
  0.200264	  1.409123	  0.859961
  0.200865	  1.426604	  0.873642
  0.200609	  1.440975	  0.884435
  0.198797	  1.458930	  0.897220
  0.199024	  1.476179	  0.909898
  0.200697	  1.489301	  0.919477
  0.200055	  1.507772	  0.931623
  0.195740	  1.523421	  0.941476
  0.188364	  1.538461	  0.951475
  0.184238	  1.558392	  0.965748
  0.189159	  1.575082	  0.974591
  0.192227	  1.594402	  0.985040
  0.191049	  1.608962	  0.991761
  0.187958	  1.631633	  1.003293
  0.189631	  1.647659	  1.011486
  0.190734	  1.661259	  1.016835
  0.198771	  1.684703	  1.030087
  0.199413	  1.704816	  1.042480
  0.198694	  1.716821	  1.047257
  0.193215	  1.734241	  1.054400
  0.190269	  1.756421	  1.063421
  0.187984	  1.773531	  1.073024
  0.186906	  1.791925	  1.082511
  0.185549	  1.813340	  1.092132
  0.181432	  1.827282	  1.100128
  0.176267	  1.843572	  1.110949
  0.172781	  1.858568	  1.125457
  0.170790	  1.871969	  1.142632
  0.168911	  1.881273	  1.161032
  0.162671	  1.894622	  1.181355
  0.158770	  1.907383	  1.191306
  0.159123	  1.924192	  1.201787
  0.160450	  1.940048	  1.216454
  0.159026	  1.956157	  1.229276
  0.157017	  1.975501	  1.236577
  0.156175	  1.997316	  1.241290
  0.157664	  2.014098	  1.249108
  0.159733	  2.031104	  1.263563
  0.163927	  2.041132	  1.280711
  0.169213	  2.054504	  1.295798
  0.172941	  2.070014	  1.308464
  0.175929	  2.087102	  1.321155
  0.180368	  2.111424	  1.339229
  0.183351	  2.127298	  1.351024
