 0.0 0.0 0.0 0
 0.6738797648991475 -0.7267397875888009 0.1300436218922503 1000
 0.12111517056679623 -0.9178778096205978 0.37683211389778043 1000
 -0.282066055507821 0.7763870294621005 0.5644102415914108 1000
 -0.23692969673045547 -0.04025513023563468 -0.9702504023688558 1000
 0.9717696454610206 -0.08286858260990039 -0.2198784986686708 1000
 0.24087447790923078 0.3946231014749981 -0.8865957893393185 1000
 -0.14289937769737593 0.5062191136724308 0.8501652644082806 1000
 -0.7837946605797906 -0.30636002829895737 0.5405519985230591 1000
 0.0 0.0 0.0 0
 0.8924684157305944 -0.4178370466548381 0.1688263290073147 1000
 0.7287368523697267 -0.3583305117406286 -0.5837737955355334 1000
 0.31061349214173256 0.5844633718084493 0.7496918203594172 1000
 -0.8743654310692589 0.26333321949629795 0.4078623646045122 1000
 -0.23118012507546654 0.5156226495698337 -0.8254683719081407 1000
 -0.8190280404183795 -0.41479512818611897 -0.39541885468638305 1000
 -0.6786168181395892 -0.15871162390558846 0.717236944513702 1000
 -0.999873775438208 -0.018061876313479316 0.00044923822298331695 1000
 0.0 0.0 0.0 0
 -0.0904106219757721 -0.5620673659696787 -0.8218383025546216 1000
 -0.3028911540310144 -0.947762008479616 0.09509008409106032 1000
 -0.04821704891940779 0.9818230618397537 0.18164963923199834 1000
 -0.683924084301314 -0.7027370023611188 0.1947628106829393 1000
 0.5572380474112437 0.011185025802152443 0.8296997370827052 1000
 0.5930075577985152 -0.7858190238944174 -0.1773231459214117 1000
 0.3281577952875915 0.8702702050878082 0.36525502259162934 1000
 -0.7779924502170659 0.5922179795617399 -0.20853204091711453 1000
 0.0 0.0 0.0 0
