 -0.600004	  2.968661	  0.089134
 -0.594063	  2.939269	  0.088252
 -0.603485	  2.899670	  0.068299
 -0.609069	  2.857346	  0.046083
 -0.622854	  2.817498	  0.012861
 -0.630590	  2.781361	 -0.005453
 -0.643209	  2.737976	 -0.031122
 -0.647942	  2.698082	 -0.061011
 -0.652421	  2.654155	 -0.084877
 -0.662606	  2.609313	 -0.109256
 -0.676827	  2.569113	 -0.135061
 -0.687882	  2.525933	 -0.161344
 -0.695216	  2.486064	 -0.188350
 -0.702215	  2.446342	 -0.214278
 -0.712243	  2.401140	 -0.241617
 -0.722976	  2.358811	 -0.268512
 -0.733173	  2.320859	 -0.293075
 -0.742778	  2.278576	 -0.319849
 -0.754929	  2.236318	 -0.347679
 -0.763986	  2.198934	 -0.368696
 -0.773445	  2.159479	 -0.392287
 -0.782912	  2.112651	 -0.419792
 -0.789373	  2.075830	 -0.441078
 -0.797293	  2.032790	 -0.470857
 -0.812369	  1.991039	 -0.491611
 -0.818023	  1.945068	 -0.515846
 -0.828311	  1.906094	 -0.548262
 -0.840617	  1.863001	 -0.573571
 -0.850779	  1.822788	 -0.598066
 -0.863242	  1.779241	 -0.624477
 -0.871727	  1.737122	 -0.648291
 -0.878010	  1.702159	 -0.672860
 -0.894350	  1.658507	 -0.696785
 -0.900504	  1.614074	 -0.720586
 -0.918001	  1.582028	 -0.716439
 -0.991189	  1.527349	 -0.693460
 -1.005202	  1.418025	 -0.621449
 -1.078774	  1.429693	 -0.673226
 -1.083234	  1.343771	 -0.616818
 -1.202187	  1.303921	 -0.603101
 -1.302990	  1.260782	 -0.619042
 -1.347149	  1.175931	 -0.642563
 -1.423347	  1.108782	 -0.624578
 -1.484884	  1.065965	 -0.606842
 -1.520848	  0.998422	 -0.611001
 -1.494894	  0.984729	 -0.616461
 -1.418858	  0.879232	 -0.720494
 -1.396433	  0.953425	 -0.718732
 -1.456257	  0.860887	 -0.834498
 -1.484184	  0.864255	 -0.912256
 -1.350809	  0.753113	 -0.893884
 -1.326178	  0.796371	 -0.963775
 -1.310531	  0.814885	 -1.093394
 -1.220893	  0.788027	 -1.156193
 -1.111528	  0.753955	 -1.249673
 -1.111767	  0.702433	 -1.292134
 -1.120304	  0.663832	 -1.312560
 -1.131695	  0.623091	 -1.335076
 -1.138857	  0.574997	 -1.363629
 -1.148250	  0.531995	 -1.391667
 -1.161265	  0.490140	 -1.412066
 -1.172767	  0.456043	 -1.440675
 -1.180781	  0.412670	 -1.466003
 -1.185240	  0.367006	 -1.485972
 -1.201418	  0.331410	 -1.511624
 -1.206133	  0.287770	 -1.536422
 -1.220561	  0.245383	 -1.562552
 -1.227827	  0.204759	 -1.592740
 -1.238942	  0.162456	 -1.618462
 -1.250295	  0.117188	 -1.646930
 -1.261772	  0.076684	 -1.672301
 -1.271738	  0.036240	 -1.694930
 -1.280142	 -0.003243	 -1.716012
 -1.289577	 -0.047625	 -1.743804
 -1.299221	 -0.088416	 -1.769302
 -1.307085	 -0.127648	 -1.793083
 -1.316034	 -0.168119	 -1.815016
 -1.326685	 -0.213828	 -1.843810
 -1.336576	 -0.256901	 -1.872607
 -1.344973	 -0.295886	 -1.896900
 -1.351976	 -0.338499	 -1.926113
 -1.361360	 -0.375197	 -1.947312
 -1.370578	 -0.422410	 -1.976942
 -1.383086	 -0.457775	 -2.001462
 -1.391387	 -0.503073	 -2.024788
 -1.404893	 -0.542156	 -2.057019
 -1.411971	 -0.586219	 -2.077630
 -1.423589	 -0.625642	 -2.103428
 -1.434809	 -0.668332	 -2.131904
 -1.441140	 -0.708904	 -2.151448
 -1.452758	 -0.751555	 -2.180652
 -1.459726	 -0.795917	 -2.206445
 -1.469842	 -0.837848	 -2.231702
 -1.480846	 -0.872972	 -2.254686
 -1.492320	 -0.914654	 -2.282864
 -1.497123	 -0.957479	 -2.305304
 -1.508656	 -0.999089	 -2.335086
 -1.522658	 -1.047311	 -2.363187
 -1.537884	 -1.057784	 -2.386819
