  2.102752	  0.433632	 -1.160786
  2.122938	  0.453535	 -1.162485
  2.108725	  0.439515	 -1.161309
  2.094692	  0.425267	 -1.161557
  2.080770	  0.410938	 -1.162476
  2.066865	  0.396593	 -1.163413
  2.054119	  0.381416	 -1.166068
  2.042064	  0.365863	 -1.169649
  2.030057	  0.350279	 -1.173236
  2.019453	  0.333797	 -1.177199
  2.009480	  0.316954	 -1.181298
  1.999473	  0.300138	 -1.185438
  1.989174	  0.283576	 -1.189859
  1.979029	  0.266964	 -1.194477
  1.968944	  0.250226	 -1.198779
  1.958804	  0.233492	 -1.202844
  1.948924	  0.216714	 -1.207251
  1.939744	  0.199631	 -1.211975
  1.930892	  0.182381	 -1.217017
  1.922311	  0.165151	 -1.222752
  1.912794	  0.148225	 -1.228351
  1.901842	  0.131911	 -1.233524
  1.889025	  0.117049	 -1.237975
  1.877039	  0.102704	 -1.242321
  1.867806	  0.086715	 -1.250817
  1.856870	  0.071646	 -1.260871
  1.843469	  0.058061	 -1.268933
  1.827894	  0.046186	 -1.272673
  1.813207	  0.033711	 -1.277576
  1.799178	  0.020925	 -1.285300
  1.784330	  0.008992	 -1.292371
  1.768950	 -0.002807	 -1.298570
  1.755057	 -0.015506	 -1.302637
  1.742006	 -0.032729	 -1.302618
  1.729867	 -0.051393	 -1.303004
  1.718711	 -0.066159	 -1.307640
  1.706026	 -0.077946	 -1.315009
  1.688094	 -0.088986	 -1.322965
  1.672069	 -0.101971	 -1.326395
  1.660349	 -0.114906	 -1.327337
  1.644788	 -0.129467	 -1.332412
  1.629413	 -0.144178	 -1.333442
  1.617748	 -0.158348	 -1.328998
  1.607537	 -0.170025	 -1.321873
  1.583212	 -0.186923	 -1.323318
  1.567113	 -0.204350	 -1.326541
  1.558390	 -0.214785	 -1.328405
  1.549099	 -0.229772	 -1.330166
  1.536538	 -0.249042	 -1.330195
  1.526383	 -0.264142	 -1.329557
  1.515168	 -0.283438	 -1.329285
  1.505385	 -0.300728	 -1.329881
  1.499172	 -0.317578	 -1.331569
  1.488680	 -0.341077	 -1.334124
  1.478777	 -0.354959	 -1.335682
  1.460345	 -0.365952	 -1.339186
  1.445542	 -0.374306	 -1.343008
  1.433889	 -0.392906	 -1.348620
  1.430789	 -0.411380	 -1.356009
  1.431197	 -0.429849	 -1.363700
  1.431672	 -0.448336	 -1.371316
  1.432152	 -0.466819	 -1.378938
  1.433464	 -0.485036	 -1.387024
  1.441344	 -0.499694	 -1.398066
  1.449324	 -0.514286	 -1.409173
  1.457305	 -0.528877	 -1.420281
  1.465209	 -0.543451	 -1.431432
  1.469266	 -0.559197	 -1.442933
  1.468535	 -0.575875	 -1.453918
  1.466941	 -0.592168	 -1.463895
  1.459278	 -0.605428	 -1.471210
  1.446312	 -0.610439	 -1.473583
  1.431278	 -0.614144	 -1.476415
  1.409727	 -0.617887	 -1.470484
  1.386392	 -0.626779	 -1.462964
  1.378722	 -0.630987	 -1.461227
  1.359202	 -0.640495	 -1.457450
  1.332274	 -0.652176	 -1.454233
  1.317713	 -0.656043	 -1.453510
  1.300745	 -0.659278	 -1.451781
  1.276548	 -0.663859	 -1.447838
  1.255891	 -0.667051	 -1.441717
  1.235514	 -0.664900	 -1.433450
  1.216006	 -0.655522	 -1.423999
  1.200363	 -0.654959	 -1.419745
  1.177744	 -0.660705	 -1.412802
  1.155507	 -0.671034	 -1.400700
  1.135575	 -0.685004	 -1.392013
  1.125294	 -0.698875	 -1.389714
  1.113846	 -0.713341	 -1.392288
  1.096271	 -0.731981	 -1.394416
  1.083081	 -0.748202	 -1.395673
  1.075780	 -0.764121	 -1.399423
  1.070878	 -0.782448	 -1.405695
  1.056499	 -0.808808	 -1.413092
  1.047450	 -0.820466	 -1.417695
  1.038673	 -0.832183	 -1.423023
  1.023028	 -0.853600	 -1.432203
  1.012277	 -0.867801	 -1.435383
  1.004305	 -0.879413	 -1.433631
  0.989316	 -0.898754	 -1.429297
  0.977123	 -0.914388	 -1.428819
  0.967009	 -0.929975	 -1.430895
  0.956741	 -0.950382	 -1.437398
  0.947767	 -0.961311	 -1.447160
  0.934209	 -0.974393	 -1.464207
  0.919263	 -0.988192	 -1.477482
  0.910361	 -0.998861	 -1.485216
  0.899245	 -1.011676	 -1.491852
  0.885506	 -1.027222	 -1.497933
  0.871889	 -1.041991	 -1.502187
  0.861336	 -1.051476	 -1.505678
  0.847538	 -1.064833	 -1.515278
  0.827307	 -1.078586	 -1.527842
  0.813439	 -1.087644	 -1.532850
  0.805069	 -1.094007	 -1.536533
  0.780715	 -1.110273	 -1.543853
  0.763357	 -1.119875	 -1.551334
  0.751125	 -1.130549	 -1.553790
  0.731093	 -1.144110	 -1.557260
  0.712164	 -1.156912	 -1.557829
  0.699131	 -1.162980	 -1.557095
  0.679238	 -1.174976	 -1.551268
  0.664719	 -1.189261	 -1.546983
  0.649421	 -1.202975	 -1.546214
  0.633959	 -1.215310	 -1.547260
  0.618067	 -1.228130	 -1.548175
  0.601900	 -1.240184	 -1.549551
  0.586173	 -1.253862	 -1.550733
  0.570236	 -1.267237	 -1.552273
  0.555987	 -1.282585	 -1.553536
  0.541496	 -1.297937	 -1.555418
  0.528375	 -1.314434	 -1.557112
  0.516267	 -1.330309	 -1.559264
  0.504716	 -1.345712	 -1.561322
  0.491698	 -1.357762	 -1.564075
  0.471036	 -1.373734	 -1.570395
  0.454791	 -1.390901	 -1.576402
  0.441304	 -1.405461	 -1.582971
  0.435385	 -1.415855	 -1.585802
  0.420981	 -1.442339	 -1.589282
  0.412312	 -1.460861	 -1.588041
  0.408597	 -1.472358	 -1.584777
  0.404392	 -1.492632	 -1.573583
  0.397100	 -1.520356	 -1.565053
  0.389950	 -1.536495	 -1.564361
  0.380225	 -1.551343	 -1.566914
  0.361002	 -1.571815	 -1.582932
  0.353514	 -1.581322	 -1.587960
  0.342526	 -1.596038	 -1.594185
  0.331178	 -1.608846	 -1.593758
  0.319642	 -1.628608	 -1.590649
  0.308293	 -1.645624	 -1.591467
  0.296579	 -1.661660	 -1.591670
  0.284554	 -1.677536	 -1.592286
  0.271659	 -1.692267	 -1.592569
  0.258301	 -1.706588	 -1.592676
  0.245133	 -1.721208	 -1.592657
  0.231776	 -1.735533	 -1.593196
  0.218548	 -1.749578	 -1.593901
  0.204994	 -1.763651	 -1.595463
  0.191064	 -1.778230	 -1.598089
  0.177599	 -1.793591	 -1.600569
  0.164385	 -1.808142	 -1.603864
  0.151018	 -1.823733	 -1.606830
  0.135787	 -1.839629	 -1.608426
  0.132046	 -1.867582	 -1.602935
  0.117089	 -1.880844	 -1.602285
