  1.134878	 -1.666356	  1.329029
  1.142600	 -1.665429	  1.335706
  1.131361	 -1.664720	  1.321481
  1.113043	 -1.667331	  1.305745
  1.096416	 -1.668193	  1.293968
  1.084270	 -1.671390	  1.285118
  1.066153	 -1.672555	  1.270326
  1.050745	 -1.671931	  1.255040
  1.040065	 -1.670567	  1.243434
  1.026424	 -1.668205	  1.224416
  1.011790	 -1.666385	  1.209608
  0.992762	 -1.665004	  1.201337
  0.973844	 -1.663486	  1.195097
  0.956442	 -1.661052	  1.185042
  0.937210	 -1.656401	  1.174619
  0.920558	 -1.653945	  1.169618
  0.902653	 -1.653846	  1.163995
  0.878115	 -1.648563	  1.151938
  0.863650	 -1.645969	  1.146402
  0.847154	 -1.646152	  1.141408
  0.823826	 -1.646277	  1.136140
  0.805884	 -1.643520	  1.127958
  0.790858	 -1.642744	  1.115934
  0.773643	 -1.642996	  1.104448
  0.755691	 -1.642973	  1.094925
  0.740250	 -1.643608	  1.083940
  0.724367	 -1.642026	  1.070856
  0.706327	 -1.634814	  1.062436
  0.684784	 -1.628263	  1.059854
  0.664800	 -1.633567	  1.058002
  0.644543	 -1.649249	  1.038788
  0.631121	 -1.652194	  1.025185
  0.619802	 -1.653049	  1.013641
  0.601604	 -1.650825	  1.001180
  0.586072	 -1.650463	  0.989213
  0.572390	 -1.650396	  0.977442
  0.551932	 -1.653052	  0.961243
  0.538749	 -1.656639	  0.951452
  0.526594	 -1.662321	  0.940143
  0.512312	 -1.666490	  0.924102
  0.499633	 -1.667323	  0.907967
  0.484652	 -1.668970	  0.892204
  0.469077	 -1.675705	  0.876349
  0.454907	 -1.687203	  0.867944
  0.433165	 -1.696065	  0.858985
  0.413633	 -1.698366	  0.852768
  0.400589	 -1.694779	  0.848344
  0.379408	 -1.694003	  0.837598
  0.364003	 -1.699288	  0.826549
  0.349418	 -1.704493	  0.817731
  0.330804	 -1.711551	  0.808622
  0.314584	 -1.720075	  0.799243
  0.299001	 -1.728625	  0.790035
  0.283504	 -1.737385	  0.780862
  0.269573	 -1.748915	  0.772141
  0.255880	 -1.760709	  0.763534
  0.242354	 -1.772724	  0.754942
  0.229099	 -1.784911	  0.746219
  0.216097	 -1.797241	  0.737227
  0.205143	 -1.811334	  0.727714
  0.195949	 -1.826441	  0.718055
  0.187420	 -1.841584	  0.708187
  0.179028	 -1.856708	  0.698279
  0.169993	 -1.871831	  0.688679
  0.161848	 -1.887241	  0.678844
  0.153996	 -1.902619	  0.669180
  0.149516	 -1.920632	  0.661476
  0.147641	 -1.940940	  0.655792
  0.145633	 -1.960379	  0.643836
  0.140437	 -1.972508	  0.631948
  0.132241	 -1.986523	  0.622708
  0.125948	 -2.005957	  0.607738
  0.116299	 -2.009023	  0.593831
  0.099669	 -2.005983	  0.581634
  0.092464	 -2.000838	  0.579884
  0.076027	 -2.001521	  0.573703
  0.058443	 -1.995800	  0.566907
  0.042059	 -1.987493	  0.560128
  0.027841	 -1.975138	  0.552993
  0.014299	 -1.962434	  0.547258
  0.001130	 -1.950307	  0.541153
 -0.014417	 -1.934087	  0.536443
 -0.028651	 -1.921617	  0.528853
 -0.043748	 -1.912498	  0.516408
 -0.058355	 -1.905213	  0.502789
 -0.079753	 -1.899954	  0.486565
 -0.095279	 -1.898402	  0.478363
 -0.109537	 -1.896187	  0.469114
 -0.129521	 -1.888744	  0.460759
 -0.147567	 -1.878878	  0.453254
 -0.160323	 -1.866704	  0.449125
 -0.174785	 -1.855966	  0.444224
 -0.191130	 -1.850461	  0.435086
 -0.208057	 -1.850081	  0.424059
 -0.223275	 -1.853235	  0.415913
 -0.239485	 -1.857178	  0.406510
 -0.252072	 -1.860381	  0.395239
 -0.262821	 -1.867558	  0.380899
 -0.273195	 -1.882981	  0.369146
 -0.282454	 -1.897735	  0.367154
 -0.292254	 -1.911437	  0.363819
 -0.297489	 -1.920228	  0.359581
 -0.309586	 -1.934093	  0.352625
 -0.320046	 -1.949999	  0.349679
 -0.328217	 -1.964645	  0.348540
 -0.336858	 -1.986519	  0.343659
 -0.343520	 -2.010349	  0.341149
 -0.348396	 -2.024380	  0.340113
 -0.351392	 -2.042926	  0.340517
 -0.360328	 -2.072319	  0.340542
 -0.366046	 -2.086413	  0.341696
 -0.371361	 -2.099528	  0.340613
 -0.379502	 -2.118286	  0.337008
 -0.389011	 -2.136738	  0.334946
 -0.398389	 -2.159209	  0.337984
 -0.407739	 -2.182361	  0.340228
 -0.416306	 -2.195325	  0.335506
 -0.425642	 -2.208495	  0.323383
 -0.438104	 -2.226520	  0.310188
 -0.448167	 -2.241397	  0.306292
 -0.458003	 -2.254648	  0.302498
 -0.470840	 -2.272206	  0.295567
 -0.482179	 -2.283254	  0.285146
 -0.494019	 -2.296383	  0.274466
 -0.507637	 -2.310077	  0.264713
 -0.519056	 -2.320760	  0.257009
 -0.531939	 -2.334760	  0.247763
 -0.548906	 -2.350625	  0.234718
 -0.554845	 -2.359868	  0.229516
 -0.570925	 -2.372056	  0.219244
 -0.587459	 -2.383102	  0.210802
 -0.603993	 -2.393766	  0.200551
 -0.619046	 -2.401221	  0.188509
 -0.633559	 -2.404677	  0.176212
 -0.648455	 -2.409985	  0.163199
 -0.665893	 -2.418017	  0.148143
 -0.679891	 -2.422718	  0.136583
 -0.695123	 -2.427383	  0.124586
 -0.712216	 -2.432294	  0.109733
 -0.731306	 -2.432481	  0.092112
 -0.744859	 -2.427332	  0.081489
 -0.757190	 -2.421658	  0.070571
 -0.770563	 -2.417194	  0.055594
 -0.782782	 -2.415822	  0.039757
 -0.802209	 -2.416636	  0.021652
 -0.819703	 -2.414303	  0.012749
 -0.834850	 -2.409493	  0.006438
 -0.855848	 -2.392493	  0.000364
 -0.870946	 -2.390120	 -0.012536
