  1.365153	 -1.684970	  2.116160
  1.351637	 -1.668287	  2.095208
  1.337895	 -1.620477	  2.072550
  1.325504	 -1.579190	  2.055545
  1.311266	 -1.544152	  2.024950
  1.289068	 -1.498768	  2.005934
  1.281788	 -1.455011	  1.981121
  1.256589	 -1.417153	  1.960442
  1.241215	 -1.376749	  1.938754
  1.228848	 -1.338568	  1.906935
  1.211864	 -1.298893	  1.888422
  1.194299	 -1.254422	  1.867286
  1.181233	 -1.214327	  1.843776
  1.165325	 -1.173014	  1.818467
  1.148552	 -1.132058	  1.794842
  1.131959	 -1.087793	  1.769999
  1.115448	 -1.049494	  1.745999
  1.098480	 -1.010422	  1.721609
  1.081492	 -0.966842	  1.698646
  1.069452	 -0.927215	  1.678081
  1.050159	 -0.886692	  1.652104
  1.033843	 -0.846050	  1.629755
  1.021930	 -0.808297	  1.602125
  1.005260	 -0.762742	  1.578220
  0.992695	 -0.724306	  1.558187
  0.971740	 -0.680447	  1.528010
  0.958723	 -0.637941	  1.509703
  0.943929	 -0.601078	  1.483347
  0.925618	 -0.562485	  1.463570
  0.909228	 -0.516172	  1.440542
  0.891919	 -0.472898	  1.414416
  0.876567	 -0.433925	  1.391865
  0.860605	 -0.396272	  1.370302
  0.843222	 -0.358323	  1.343046
  0.841840	 -0.409959	  1.182750
  0.819013	 -0.557583	  0.837446
  0.806109	 -0.552921	  0.813320
  0.897713	 -0.475229	  0.725608
  0.718114	 -0.450430	  0.777448
  0.966069	 -0.357846	  0.628622
  0.916899	 -0.174354	  0.859379
  0.902317	 -0.105251	  0.881149
  0.939052	 -0.020890	  0.869421
  0.955392	  0.027621	  0.823379
  0.926165	  0.065214	  0.841214
  0.889269	  0.137107	  0.879101
  0.883683	  0.161194	  0.860820
  0.780969	  0.133866	  0.736327
  0.789383	  0.246962	  0.838521
  0.753847	  0.278230	  0.840298
  0.630640	  0.313083	  0.898882
  0.566783	  0.382221	  0.916384
  0.547297	  0.426588	  0.893736
  0.532803	  0.469149	  0.871759
  0.518274	  0.508036	  0.851150
  0.500897	  0.548459	  0.825799
  0.488652	  0.591485	  0.805641
  0.469276	  0.631523	  0.777882
  0.456039	  0.672686	  0.757232
  0.441192	  0.712789	  0.732695
  0.425333	  0.757711	  0.706363
  0.410378	  0.793654	  0.684358
  0.388953	  0.839113	  0.655906
  0.374340	  0.876586	  0.635008
  0.357401	  0.920184	  0.612323
  0.341397	  0.959584	  0.587932
  0.325243	  0.998135	  0.563945
  0.307819	  1.038922	  0.541308
  0.291997	  1.078911	  0.520556
  0.273339	  1.123985	  0.495689
  0.258381	  1.162174	  0.473256
  0.243263	  1.206238	  0.447960
  0.230349	  1.246431	  0.426800
  0.215585	  1.286916	  0.403832
  0.202086	  1.330389	  0.380431
  0.182904	  1.371259	  0.355638
  0.160419	  1.399466	  0.333257
  0.055324	  1.395351	  0.345277
 -0.004733	  1.416029	  0.341128
 -0.027283	  1.381257	  0.359650
 -0.050638	  1.394494	  0.325888
 -0.131539	  1.388183	  0.373169
 -0.258155	  1.455627	  0.333192
 -0.302124	  1.468462	  0.333968
 -0.349696	  1.487787	  0.286091
 -0.598850	  1.650360	  0.324487
 -0.608665	  1.738158	  0.192333
 -0.720483	  1.835477	  0.626244
 -0.488343	  1.937292	  0.378246
 -0.639439	  2.119368	  0.483089
 -0.503364	  2.136876	  0.387750
 -0.454043	  2.146476	  0.280337
 -0.468707	  2.169306	  0.170482
 -0.297234	  2.225854	 -0.007304
 -0.240661	  2.230665	 -0.080814
 -0.206836	  2.214234	 -0.085410
 -0.152942	  2.222943	 -0.142251
 -0.164734	  2.271106	 -0.163634
 -0.188209	  2.306245	 -0.191422
 -0.196952	  2.348975	 -0.215145
 -0.214849	  2.388199	 -0.234528
 -0.232026	  2.430327	 -0.258755
 -0.252147	  2.473281	 -0.279550
 -0.269401	  2.510069	 -0.312352
 -0.280229	  2.556311	 -0.326959
 -0.292037	  2.595522	 -0.356624
 -0.308578	  2.636079	 -0.380753
 -0.330093	  2.676900	 -0.401589
 -0.342267	  2.721756	 -0.426793
 -0.356760	  2.760232	 -0.447919
 -0.376591	  2.796317	 -0.477130
 -0.390301	  2.843089	 -0.497340
 -0.413032	  2.879683	 -0.515987
 -0.428908	  2.918011	 -0.548862
 -0.433197	  2.947191	 -0.554350
