 -1.912046	 -0.790277	 -1.115057
 -1.912524	 -0.791847	 -1.139619
 -1.912137	 -0.790885	 -1.119663
 -1.912575	 -0.790835	 -1.099779
 -1.912646	 -0.792681	 -1.080319
 -1.911306	 -0.795986	 -1.061257
 -1.914275	 -0.798940	 -1.038257
 -1.921467	 -0.800252	 -1.018214
 -1.923313	 -0.796339	 -1.000851
 -1.922193	 -0.797371	 -0.980844
 -1.918799	 -0.800374	 -0.960884
 -1.916901	 -0.801507	 -0.940308
 -1.915247	 -0.801088	 -0.919910
 -1.910600	 -0.799801	 -0.900786
 -1.905934	 -0.800891	 -0.881199
 -1.903528	 -0.802211	 -0.861941
 -1.900769	 -0.799774	 -0.842996
 -1.892657	 -0.798217	 -0.818756
 -1.886798	 -0.800634	 -0.800906
 -1.884013	 -0.807191	 -0.784819
 -1.879017	 -0.813665	 -0.763228
 -1.871649	 -0.821154	 -0.744794
 -1.866502	 -0.829722	 -0.731335
 -1.860609	 -0.841195	 -0.711489
 -1.854927	 -0.848405	 -0.692527
 -1.853004	 -0.848932	 -0.675097
 -1.853075	 -0.852127	 -0.652410
 -1.851126	 -0.854537	 -0.632644
 -1.844067	 -0.855495	 -0.614117
 -1.836663	 -0.861517	 -0.594609
 -1.834699	 -0.871436	 -0.576237
 -1.834929	 -0.877913	 -0.561720
 -1.831542	 -0.887063	 -0.542106
 -1.829419	 -0.897030	 -0.523509
 -1.832516	 -0.906086	 -0.506364
 -1.834081	 -0.916069	 -0.489975
 -1.832862	 -0.929318	 -0.472740
 -1.833348	 -0.939525	 -0.454322
 -1.840723	 -0.947909	 -0.439634
 -1.847527	 -0.960564	 -0.425637
 -1.852066	 -0.973526	 -0.409876
 -1.853243	 -0.981999	 -0.387885
 -1.855721	 -0.990645	 -0.372800
 -1.861229	 -1.005056	 -0.358058
 -1.866765	 -1.019734	 -0.347976
 -1.868456	 -1.034068	 -0.332780
 -1.872642	 -1.048674	 -0.317535
 -1.882293	 -1.062654	 -0.306085
 -1.892513	 -1.076483	 -0.293388
 -1.896286	 -1.088953	 -0.279720
 -1.899497	 -1.103276	 -0.266128
 -1.906196	 -1.118493	 -0.254535
 -1.909915	 -1.133177	 -0.240639
 -1.908147	 -1.147606	 -0.227427
 -1.908753	 -1.163345	 -0.216346
 -1.904560	 -1.179652	 -0.203174
 -1.900111	 -1.193197	 -0.185750
 -1.888884	 -1.201725	 -0.176898
 -1.876432	 -1.214373	 -0.167171
 -1.867133	 -1.228466	 -0.152633
 -1.852885	 -1.233585	 -0.137192
 -1.835599	 -1.237691	 -0.126677
 -1.823822	 -1.243844	 -0.118100
 -1.811156	 -1.250952	 -0.101605
 -1.800690	 -1.253379	 -0.084309
 -1.790029	 -1.257290	 -0.068069
 -1.781279	 -1.256327	 -0.048672
 -1.776321	 -1.247764	 -0.029500
 -1.770613	 -1.241265	 -0.011600
 -1.764461	 -1.239162	  0.006108
 -1.757653	 -1.236111	  0.025772
 -1.755067	 -1.225586	  0.041261
 -1.751309	 -1.214871	  0.056937
 -1.746013	 -1.202977	  0.082010
 -1.743045	 -1.200489	  0.094363
 -1.735796	 -1.195776	  0.115220
 -1.731788	 -1.185494	  0.135193
 -1.734958	 -1.175390	  0.147595
 -1.736210	 -1.160752	  0.166823
 -1.731871	 -1.149511	  0.186201
 -1.729650	 -1.140465	  0.199839
 -1.725316	 -1.131855	  0.213867
 -1.718910	 -1.121984	  0.236691
 -1.722058	 -1.110990	  0.253830
 -1.723215	 -1.101318	  0.265814
 -1.717364	 -1.090919	  0.284560
 -1.713270	 -1.080239	  0.302608
 -1.711370	 -1.067183	  0.317214
 -1.709182	 -1.055599	  0.330074
 -1.709883	 -1.045538	  0.353907
 -1.711444	 -1.037646	  0.375201
 -1.709176	 -1.028094	  0.386144
 -1.704472	 -1.013468	  0.399755
 -1.697753	 -1.001229	  0.417558
 -1.690194	 -0.992637	  0.433893
 -1.682428	 -0.986200	  0.453768
 -1.680725	 -0.980766	  0.470325
 -1.682241	 -0.976521	  0.489938
 -1.677355	 -0.973792	  0.515444
 -1.668327	 -0.970913	  0.527909
 -1.656177	 -0.967357	  0.546629
 -1.653510	 -0.965033	  0.567941
 -1.657248	 -0.962091	  0.585384
 -1.659762	 -0.960155	  0.607541
 -1.655831	 -0.959461	  0.623699
 -1.639545	 -0.959866	  0.651119
 -1.629408	 -0.961164	  0.671736
 -1.625040	 -0.961445	  0.684571
 -1.624123	 -0.962445	  0.696657
 -1.616542	 -0.963685	  0.721360
 -1.609144	 -0.964959	  0.739202
 -1.603863	 -0.974673	  0.756936
 -1.597496	 -0.989367	  0.777053
 -1.591515	 -0.995039	  0.795048
 -1.586196	 -0.994619	  0.814249
 -1.581715	 -0.994363	  0.830397
 -1.573309	 -0.999879	  0.847947
 -1.563500	 -1.003302	  0.866054
 -1.555710	 -1.004187	  0.884844
 -1.547716	 -1.009466	  0.904017
 -1.539417	 -1.015164	  0.923438
 -1.535227	 -1.015754	  0.938735
 -1.530884	 -1.014604	  0.961959
 -1.528356	 -1.018112	  0.982693
 -1.524423	 -1.025749	  1.000898
 -1.516975	 -1.030139	  1.015822
 -1.508578	 -1.033171	  1.033992
 -1.502801	 -1.039323	  1.052447
 -1.495169	 -1.043330	  1.074081
 -1.490000	 -1.039972	  1.093596
 -1.484772	 -1.036025	  1.112699
 -1.477634	 -1.034294	  1.131727
 -1.472791	 -1.036953	  1.149528
 -1.472811	 -1.047265	  1.169947
 -1.474123	 -1.055266	  1.193260
 -1.472494	 -1.054162	  1.210780
 -1.466405	 -1.051726	  1.226683
 -1.456991	 -1.053653	  1.253060
 -1.453749	 -1.055299	  1.269585
 -1.451934	 -1.055687	  1.287517
 -1.448765	 -1.052386	  1.312107
 -1.445155	 -1.047851	  1.330779
 -1.443762	 -1.043307	  1.343043
 -1.443079	 -1.034742	  1.368197
 -1.441912	 -1.034818	  1.389404
 -1.437312	 -1.042889	  1.409057
 -1.429423	 -1.045877	  1.428672
 -1.422676	 -1.045759	  1.443450
 -1.414556	 -1.053275	  1.464892
 -1.403663	 -1.060143	  1.484311
 -1.397575	 -1.057338	  1.499132
 -1.390513	 -1.051027	  1.519762
 -1.381594	 -1.049271	  1.538659
 -1.374693	 -1.047845	  1.553793
 -1.363456	 -1.046619	  1.574279
 -1.354923	 -1.048924	  1.592912
 -1.346174	 -1.048037	  1.609372
 -1.342751	 -1.060008	  1.647881
 -1.335630	 -1.061738	  1.666490
