  0.436232	  0.557247	 -2.330422
  0.446203	  0.557674	 -2.342361
  0.420760	  0.556583	 -2.311899
  0.374986	  0.559779	 -2.270752
  0.322005	  0.569103	 -2.238934
  0.255763	  0.587856	 -2.218311
  0.165510	  0.625587	 -2.212580
  0.054020	  0.692717	 -2.225288
 -0.144399	  0.858044	 -2.247374
 -0.177225	  0.887162	 -2.249133
