  2.737271	  1.281631	  0.213699
  2.710170	  1.268942	  0.211583
  2.663258	  1.271553	  0.218484
  2.616591	  1.261338	  0.220729
  2.566690	  1.251930	  0.219466
  2.517316	  1.243941	  0.220833
  2.468784	  1.233694	  0.223362
  2.419196	  1.222493	  0.225966
  2.372605	  1.213091	  0.228331
  2.324170	  1.204589	  0.230463
  2.274729	  1.197307	  0.231733
  2.224936	  1.190823	  0.233341
  2.174609	  1.183772	  0.235596
  2.124293	  1.176559	  0.238238
  2.077550	  1.169536	  0.240066
  2.027178	  1.161910	  0.241977
  1.978961	  1.153449	  0.242519
  1.932292	  1.144690	  0.242956
  1.881711	  1.135263	  0.243388
  1.831540	  1.126696	  0.243227
  1.784852	  1.124016	  0.238716
  1.749217	  1.132718	  0.227387
  1.709985	  1.157983	  0.204104
  1.627367	  1.244835	  0.128055
  1.578796	  1.299874	  0.086817
  1.507147	  1.352124	  0.068331
  1.459928	  1.393316	  0.037867
  1.429269	  1.420410	  0.016212
  1.316902	  1.496278	 -0.105691
  1.290851	  1.484990	 -0.136132
  1.283753	  1.470293	 -0.141478
  1.278479	  1.392382	 -0.094656
  1.274818	  1.281241	 -0.022058
  1.253917	  1.199633	 -0.031049
  1.137780	  1.118951	 -0.035974
  1.054424	  1.071263	 -0.044939
  0.991451	  1.045417	 -0.065568
  0.911990	  1.016185	 -0.070681
  0.869277	  1.002509	 -0.060306
  0.787149	  0.958305	  0.029105
  0.735959	  0.942350	  0.107316
  0.707567	  0.918645	  0.159850
  0.681175	  0.904072	  0.212301
  0.644075	  0.897953	  0.250356
  0.607206	  0.893208	  0.274149
  0.560760	  0.889236	  0.292490
  0.513963	  0.883430	  0.300709
  0.465669	  0.874176	  0.302981
  0.415259	  0.861834	  0.302205
  0.367249	  0.848849	  0.299813
  0.315622	  0.834772	  0.296402
  0.267973	  0.822951	  0.292907
  0.220496	  0.812482	  0.289476
  0.168368	  0.803448	  0.286098
  0.119619	  0.796979	  0.283884
  0.073555	  0.791033	  0.282920
  0.023371	  0.784037	  0.282915
 -0.024131	  0.776867	  0.283574
 -0.075357	  0.768060	  0.285034
 -0.122396	  0.758970	  0.287387
 -0.170396	  0.748890	  0.289982
 -0.220470	  0.737493	  0.291142
 -0.271095	  0.726724	  0.291281
 -0.319822	  0.716808	  0.291099
 -0.368460	  0.706595	  0.290857
 -0.414543	  0.697053	  0.290792
 -0.461438	  0.687339	  0.290548
 -0.513086	  0.677642	  0.290699
 -0.565280	  0.668792	  0.291570
 -0.614827	  0.660878	  0.293553
 -0.662866	  0.653229	  0.296784
 -0.708881	  0.645613	  0.299714
 -0.757339	  0.637204	  0.302473
 -0.807706	  0.628950	  0.304846
 -0.856617	  0.621731	  0.307110
 -0.907216	  0.615055	  0.309137
 -0.957587	  0.609336	  0.310744
 -1.003747	  0.604215	  0.311866
 -1.051003	  0.598752	  0.313216
 -1.099476	  0.592091	  0.315131
 -1.149226	  0.584869	  0.319331
 -1.198431	  0.578352	  0.331083
 -1.239555	  0.573641	  0.358847
 -1.298447	  0.564547	  0.447736
 -1.360587	  0.580529	  0.566278
 -1.395027	  0.619288	  0.581547
 -1.478616	  0.738737	  0.574495
 -1.556073	  0.843040	  0.585584
 -1.622459	  0.905960	  0.613317
 -1.649706	  0.925390	  0.619187
 -1.741745	  0.969924	  0.592948
 -1.811066	  1.003644	  0.639105
 -1.816708	  0.921275	  0.633754
 -1.841784	  0.687360	  0.581865
 -1.858992	  0.592512	  0.595455
 -1.884050	  0.513858	  0.597150
 -1.923063	  0.462208	  0.533148
 -1.985869	  0.423209	  0.406887
 -2.035043	  0.407421	  0.362729
 -2.081366	  0.398449	  0.347089
 -2.128955	  0.390429	  0.344142
 -2.176813	  0.383276	  0.344290
 -2.227862	  0.376549	  0.345470
 -2.275733	  0.370968	  0.346834
 -2.322884	  0.364955	  0.348077
 -2.373733	  0.357609	  0.349952
 -2.425714	  0.349649	  0.353228
 -2.471081	  0.342031	  0.357235
 -2.518205	  0.334017	  0.362093
 -2.566191	  0.326457	  0.367331
 -2.616594	  0.320003	  0.371624
 -2.668353	  0.310189	  0.372428
 -2.716413	  0.301369	  0.368050
 -2.763844	  0.294682	  0.368063
 -2.814823	  0.283237	  0.366330
 -2.866026	  0.270659	  0.364723
 -2.915040	  0.262426	  0.370853
 -2.967657	  0.247769	  0.362798
 -2.997334	  0.250247	  0.366426
