  1.839096	 -1.468223	 -0.540376
  1.872344	 -1.459566	 -0.568255
  1.847864	 -1.459227	 -0.561763
  1.835270	 -1.460705	 -0.548741
  1.821524	 -1.466471	 -0.536395
  1.806809	 -1.472582	 -0.522202
  1.795321	 -1.476323	 -0.505102
  1.785711	 -1.479508	 -0.488036
  1.770138	 -1.480842	 -0.475426
  1.754783	 -1.481268	 -0.462920
  1.741720	 -1.482573	 -0.443112
  1.731196	 -1.483593	 -0.427159
  1.717124	 -1.484455	 -0.416285
  1.700260	 -1.485022	 -0.405106
  1.685209	 -1.486208	 -0.384830
  1.677931	 -1.488976	 -0.369846
  1.670430	 -1.494898	 -0.352533
  1.662703	 -1.500591	 -0.331114
  1.654465	 -1.505359	 -0.313197
  1.641190	 -1.511401	 -0.298728
  1.621498	 -1.519365	 -0.286068
  1.603148	 -1.525395	 -0.277698
  1.590865	 -1.529566	 -0.265014
  1.579282	 -1.532613	 -0.248431
  1.572601	 -1.534124	 -0.231610
  1.557367	 -1.537048	 -0.215719
  1.540570	 -1.536836	 -0.204374
  1.527030	 -1.539794	 -0.190915
  1.513072	 -1.547055	 -0.177220
  1.497095	 -1.556276	 -0.165688
  1.484611	 -1.562986	 -0.154235
  1.472762	 -1.570771	 -0.138431
  1.466486	 -1.577556	 -0.121518
  1.456848	 -1.586322	 -0.105031
  1.447631	 -1.596472	 -0.090200
  1.439244	 -1.607191	 -0.075544
  1.430826	 -1.617919	 -0.060912
  1.422379	 -1.628652	 -0.046300
  1.415567	 -1.639571	 -0.030989
  1.410317	 -1.650549	 -0.015116
  1.405074	 -1.661508	  0.000771
  1.399831	 -1.672470	  0.016656
  1.394595	 -1.683444	  0.032535
  1.391152	 -1.694122	  0.049090
  1.389091	 -1.704509	  0.066056
  1.387040	 -1.714894	  0.083025
  1.384990	 -1.725279	  0.099994
  1.382943	 -1.735666	  0.116963
  1.382055	 -1.745570	  0.134314
  1.383137	 -1.754569	  0.152142
  1.384232	 -1.763563	  0.169971
  1.385326	 -1.772558	  0.187801
  1.386431	 -1.781553	  0.205630
  1.388719	 -1.790496	  0.223372
  1.391065	 -1.799417	  0.241078
  1.383920	 -1.809218	  0.256965
  1.374838	 -1.818896	  0.271938
  1.365415	 -1.828450	  0.286777
  1.356404	 -1.836794	  0.302489
  1.347152	 -1.845048	  0.318195
  1.338157	 -1.853325	  0.333988
  1.329545	 -1.860192	  0.350605
  1.321543	 -1.865758	  0.368050
  1.313369	 -1.871353	  0.385442
  1.304652	 -1.875863	  0.402918
  1.294857	 -1.878990	  0.420153
  1.282358	 -1.880642	  0.435828
  1.266798	 -1.879978	  0.448547
  1.248850	 -1.877290	  0.457231
  1.230589	 -1.872036	  0.461748
  1.212368	 -1.863455	  0.465264
  1.195453	 -1.852646	  0.464448
  1.175169	 -1.844357	  0.460608
  1.156196	 -1.842127	  0.461344
  1.136706	 -1.839746	  0.466307
  1.116023	 -1.836825	  0.471331
  1.093734	 -1.832954	  0.469568
  1.075444	 -1.824071	  0.463757
  1.061820	 -1.812082	  0.463011
  1.044822	 -1.801756	  0.466421
  1.025010	 -1.792989	  0.466372
  1.006626	 -1.780594	  0.461001
  0.995281	 -1.767206	  0.461836
  0.980481	 -1.753160	  0.468757
  0.965183	 -1.741262	  0.477447
  0.948174	 -1.728106	  0.480629
  0.929682	 -1.719182	  0.477943
  0.910229	 -1.711033	  0.479743
  0.893029	 -1.707775	  0.485977
  0.874514	 -1.701056	  0.494164
  0.857716	 -1.695299	  0.503882
  0.841138	 -1.688358	  0.513374
  0.824925	 -1.681090	  0.522561
  0.808733	 -1.673810	  0.531809
  0.792424	 -1.667394	  0.541412
  0.775822	 -1.662420	  0.551296
  0.759517	 -1.657398	  0.561683
  0.743501	 -1.652479	  0.572097
  0.730015	 -1.648537	  0.585699
  0.715039	 -1.643354	  0.601308
  0.698159	 -1.639392	  0.611422
  0.680698	 -1.637220	  0.618960
  0.662751	 -1.635272	  0.628174
  0.646388	 -1.632161	  0.639876
  0.630439	 -1.629059	  0.651472
  0.614705	 -1.625952	  0.663294
  0.601353	 -1.623621	  0.676237
  0.588202	 -1.621275	  0.691294
  0.571890	 -1.615091	  0.706741
  0.554117	 -1.610023	  0.717249
  0.539129	 -1.611968	  0.725401
  0.521624	 -1.614025	  0.738184
  0.507522	 -1.610326	  0.750662
  0.495911	 -1.603748	  0.763787
  0.476034	 -1.598586	  0.781849
  0.461933	 -1.596789	  0.792420
  0.451137	 -1.599760	  0.802926
  0.435901	 -1.604598	  0.820711
  0.415582	 -1.603926	  0.839647
  0.402344	 -1.607730	  0.850074
  0.392141	 -1.617345	  0.856707
  0.375691	 -1.627136	  0.871132
  0.362081	 -1.628785	  0.887122
  0.351043	 -1.628958	  0.903639
  0.338551	 -1.633636	  0.919266
  0.324893	 -1.638892	  0.933096
  0.311589	 -1.644598	  0.946467
  0.295858	 -1.648622	  0.958701
  0.278674	 -1.653115	  0.970308
  0.263926	 -1.658938	  0.982022
  0.251192	 -1.666540	  0.996204
  0.236268	 -1.673708	  1.008631
  0.225145	 -1.683752	  1.023838
  0.221696	 -1.696430	  1.041669
  0.215639	 -1.709044	  1.059015
  0.203734	 -1.716381	  1.071087
  0.191211	 -1.723194	  1.084539
  0.179610	 -1.731625	  1.099227
  0.163452	 -1.735388	  1.111428
  0.146750	 -1.740030	  1.123510
  0.138744	 -1.748626	  1.139067
  0.135499	 -1.754037	  1.159368
  0.123246	 -1.752975	  1.178922
  0.103196	 -1.752587	  1.191542
  0.089911	 -1.757647	  1.201604
  0.075596	 -1.761773	  1.216413
  0.061806	 -1.762136	  1.232203
  0.050237	 -1.764011	  1.243734
  0.032929	 -1.767757	  1.258546
  0.017508	 -1.768734	  1.273669
  0.007405	 -1.767757	  1.286677
 -0.007138	 -1.767321	  1.303275
 -0.021825	 -1.768773	  1.314654
 -0.039229	 -1.769911	  1.326183
 -0.061923	 -1.770122	  1.342691
 -0.068442	 -1.770747	  1.347924
 -0.084866	 -1.774176	  1.362263
 -0.101617	 -1.777049	  1.375516
 -0.114652	 -1.779295	  1.389739
 -0.129097	 -1.782098	  1.407766
 -0.147710	 -1.780643	  1.421420
 -0.163840	 -1.783490	  1.426877
 -0.178426	 -1.791367	  1.435003
 -0.194509	 -1.800474	  1.447148
 -0.209939	 -1.807025	  1.458935
 -0.224745	 -1.813520	  1.470707
 -0.239529	 -1.820356	  1.482250
 -0.253973	 -1.828105	  1.493224
 -0.268427	 -1.836431	  1.505609
 -0.281666	 -1.843790	  1.518264
 -0.294882	 -1.850006	  1.531437
 -0.315343	 -1.854475	  1.539358
 -0.330351	 -1.860941	  1.550890
