  0.858779	  1.648400	 -1.687847
  0.859201	  1.649805	 -1.688552
  0.854316	  1.631765	 -1.680358
  0.848400	  1.614725	 -1.671863
  0.844067	  1.597289	 -1.665208
  0.840202	  1.576144	 -1.659589
  0.834147	  1.557535	 -1.653342
  0.827422	  1.545003	 -1.641075
  0.821689	  1.528567	 -1.628960
  0.813832	  1.510494	 -1.620540
  0.809949	  1.495678	 -1.612450
  0.806087	  1.477203	 -1.600765
  0.800450	  1.458224	 -1.592115
  0.799646	  1.441086	 -1.586358
  0.798414	  1.424717	 -1.577788
  0.794717	  1.406205	 -1.567908
  0.790144	  1.388451	 -1.558909
  0.787396	  1.369684	 -1.551530
  0.787432	  1.350795	 -1.543481
  0.788771	  1.333449	 -1.534264
  0.790693	  1.315701	 -1.524505
  0.792319	  1.299048	 -1.514008
  0.794428	  1.281145	 -1.504737
  0.797739	  1.263482	 -1.495933
  0.801051	  1.245829	 -1.487134
  0.805921	  1.228846	 -1.477762
  0.811155	  1.212419	 -1.467968
  0.816366	  1.197162	 -1.456393
  0.824266	  1.183955	 -1.443109
  0.833366	  1.168042	 -1.432535
  0.840599	  1.153070	 -1.423310
  0.846704	  1.138310	 -1.412180
  0.854268	  1.123571	 -1.400058
  0.861989	  1.108629	 -1.388866
  0.867378	  1.093915	 -1.377910
  0.874686	  1.080919	 -1.364192
  0.883775	  1.067738	 -1.350649
  0.891744	  1.054334	 -1.338532
  0.897370	  1.039384	 -1.326701
  0.899780	  1.024012	 -1.314400
  0.902360	  1.010029	 -1.300879
  0.908712	  0.996686	 -1.283143
  0.917839	  0.987530	 -1.266500
  0.925552	  0.976405	 -1.255504
  0.930281	  0.961678	 -1.241541
  0.930751	  0.946143	 -1.228867
  0.933175	  0.931310	 -1.214400
  0.938181	  0.918837	 -1.199447
  0.942800	  0.907016	 -1.183652
  0.945148	  0.894256	 -1.169008
  0.945707	  0.879507	 -1.155710
  0.947034	  0.863394	 -1.142658
  0.950423	  0.848710	 -1.129462
  0.950802	  0.835952	 -1.114790
  0.949217	  0.822525	 -1.100094
  0.947559	  0.807497	 -1.086545
  0.945144	  0.791571	 -1.074707
  0.941503	  0.775093	 -1.063858
  0.934966	  0.758757	 -1.054623
  0.927744	  0.742291	 -1.044902
  0.923933	  0.724176	 -1.035406
  0.921870	  0.708466	 -1.024339
  0.916362	  0.695709	 -1.008973
  0.907760	  0.682384	 -0.994549
  0.906953	  0.665519	 -0.981496
  0.908207	  0.646925	 -0.972029
  0.900466	  0.629290	 -0.967095
  0.891069	  0.614351	 -0.960187
  0.883012	  0.597047	 -0.952281
  0.873597	  0.578703	 -0.942066
  0.866038	  0.563699	 -0.937813
  0.858519	  0.544361	 -0.932525
  0.854138	  0.523433	 -0.930050
  0.851197	  0.503994	 -0.928167
  0.846192	  0.485019	 -0.921639
  0.836364	  0.468455	 -0.919815
  0.827152	  0.449713	 -0.918948
  0.820434	  0.432276	 -0.915263
  0.812571	  0.414159	 -0.909144
  0.806031	  0.395888	 -0.902868
  0.801857	  0.375323	 -0.901605
  0.795560	  0.356545	 -0.901273
  0.786324	  0.339191	 -0.899510
  0.778535	  0.320610	 -0.896641
  0.772806	  0.301964	 -0.892261
  0.767304	  0.283305	 -0.887500
  0.760988	  0.264925	 -0.883038
  0.752976	  0.247516	 -0.877429
  0.745259	  0.229918	 -0.871370
  0.738148	  0.212230	 -0.865225
  0.732194	  0.194244	 -0.858332
  0.726135	  0.177532	 -0.849299
  0.719190	  0.161291	 -0.839465
  0.711790	  0.145675	 -0.828725
  0.703336	  0.131192	 -0.817882
  0.693539	  0.117481	 -0.806712
  0.684076	  0.103621	 -0.794801
  0.673179	  0.091946	 -0.782899
  0.662252	  0.080343	 -0.770992
  0.652918	  0.067816	 -0.758915
  0.645640	  0.054347	 -0.746983
  0.636242	  0.042151	 -0.734002
  0.628175	  0.029239	 -0.721893
  0.619703	  0.016724	 -0.709595
  0.613390	  0.002484	 -0.697009
  0.609420	 -0.013279	 -0.685523
  0.605114	 -0.029227	 -0.674290
  0.603330	 -0.047095	 -0.665007
  0.603614	 -0.065329	 -0.657687
  0.608654	 -0.085170	 -0.654936
  0.610780	 -0.105843	 -0.649124
  0.610146	 -0.123296	 -0.644218
  0.616065	 -0.143170	 -0.644069
  0.622539	 -0.163417	 -0.644063
  0.627090	 -0.182063	 -0.647223
  0.629552	 -0.200722	 -0.651703
  0.632008	 -0.219657	 -0.652539
  0.633944	 -0.240676	 -0.652147
  0.637472	 -0.261744	 -0.651116
  0.645121	 -0.278225	 -0.655162
  0.653205	 -0.296000	 -0.660802
  0.661177	 -0.317132	 -0.663633
  0.664392	 -0.335753	 -0.663685
  0.668326	 -0.354724	 -0.666279
  0.675674	 -0.374493	 -0.670143
  0.679812	 -0.392369	 -0.672031
  0.681395	 -0.412923	 -0.673107
  0.682861	 -0.433117	 -0.674295
  0.685548	 -0.452983	 -0.676009
  0.686685	 -0.472940	 -0.676649
  0.686249	 -0.492931	 -0.676224
  0.685813	 -0.512922	 -0.675801
  0.685179	 -0.532902	 -0.675200
  0.682262	 -0.552497	 -0.672465
  0.679362	 -0.571998	 -0.669832
  0.676424	 -0.591488	 -0.668114
  0.672245	 -0.610217	 -0.665044
  0.667254	 -0.630992	 -0.658810
  0.661734	 -0.646198	 -0.652187
  0.655421	 -0.666496	 -0.644818
  0.652244	 -0.687454	 -0.638768
  0.650724	 -0.703464	 -0.634359
  0.644581	 -0.721098	 -0.626796
  0.639205	 -0.739692	 -0.619043
  0.635151	 -0.756407	 -0.611195
  0.632521	 -0.774988	 -0.597401
  0.631651	 -0.791773	 -0.589084
  0.626691	 -0.810276	 -0.585389
  0.622918	 -0.829126	 -0.577471
  0.622534	 -0.847792	 -0.568555
  0.620284	 -0.864948	 -0.561286
  0.615124	 -0.881048	 -0.547975
  0.610442	 -0.899513	 -0.539490
  0.613765	 -0.916478	 -0.530391
  0.616179	 -0.933670	 -0.519571
  0.612814	 -0.950612	 -0.507925
  0.609374	 -0.967322	 -0.498790
  0.607448	 -0.983728	 -0.488434
  0.606667	 -1.001046	 -0.474055
  0.606476	 -1.015523	 -0.462880
  0.606320	 -1.033084	 -0.451481
  0.605449	 -1.052096	 -0.442399
  0.602441	 -1.071987	 -0.439945
  0.600871	 -1.092119	 -0.435224
  0.600035	 -1.111521	 -0.426314
  0.597717	 -1.126798	 -0.418143
  0.594708	 -1.147026	 -0.412475
  0.597200	 -1.163570	 -0.401203
  0.597914	 -1.180642	 -0.387198
  0.595949	 -1.199405	 -0.380651
  0.597655	 -1.221522	 -0.377083
  0.591494	 -1.236951	 -0.371317
  0.584359	 -1.255777	 -0.365748
  0.579496	 -1.276147	 -0.358125
  0.580416	 -1.293213	 -0.349338
  0.573585	 -1.309924	 -0.342618
  0.562719	 -1.329958	 -0.340429
  0.558048	 -1.349165	 -0.334763
  0.558019	 -1.365651	 -0.324788
  0.553888	 -1.383448	 -0.316746
  0.545167	 -1.403608	 -0.316860
  0.534827	 -1.422761	 -0.313393
  0.530868	 -1.438414	 -0.304381
  0.528068	 -1.457645	 -0.296016
  0.527169	 -1.476814	 -0.286271
  0.523553	 -1.492981	 -0.279625
  0.518087	 -1.512304	 -0.273538
  0.512463	 -1.530775	 -0.268837
  0.508675	 -1.549844	 -0.262764
  0.505714	 -1.568492	 -0.256167
  0.502753	 -1.587139	 -0.249570
  0.500140	 -1.605615	 -0.242371
  0.497636	 -1.624031	 -0.234984
  0.495250	 -1.642420	 -0.227491
  0.493516	 -1.660633	 -0.219411
  0.491784	 -1.678846	 -0.211330
  0.490513	 -1.696973	 -0.202977
  0.489706	 -1.715003	 -0.194359
  0.489091	 -1.732888	 -0.185702
  0.490796	 -1.750594	 -0.176233
  0.493831	 -1.768215	 -0.167000
  0.494192	 -1.785581	 -0.157994
  0.493432	 -1.803656	 -0.147984
  0.495420	 -1.822394	 -0.138904
  0.494572	 -1.840949	 -0.132010
  0.491574	 -1.857033	 -0.123355
  0.489574	 -1.876998	 -0.115006
  0.490326	 -1.896201	 -0.108359
  0.495814	 -1.913776	 -0.098817
  0.501098	 -1.932390	 -0.089772
  0.499802	 -1.947793	 -0.081769
  0.501200	 -1.964311	 -0.069335
  0.504991	 -1.980489	 -0.055498
  0.503979	 -1.999148	 -0.045793
  0.500458	 -2.016236	 -0.040378
  0.498796	 -2.035793	 -0.032574
  0.499704	 -2.054353	 -0.022898
  0.499942	 -2.070525	 -0.013333
  0.497411	 -2.089993	 -0.005800
  0.497398	 -2.107410	  0.003275
  0.497869	 -2.123874	  0.014174
  0.497068	 -2.142950	  0.023913
  0.495072	 -2.162194	  0.031073
  0.492930	 -2.178101	  0.038578
  0.490358	 -2.196405	  0.047763
  0.488234	 -2.214544	  0.056780
  0.486348	 -2.232057	  0.066122
  0.483676	 -2.249958	  0.074728
  0.480930	 -2.267872	  0.083186
  0.478321	 -2.285971	  0.091286
  0.475722	 -2.304083	  0.099362
  0.473322	 -2.322327	  0.107196
  0.471107	 -2.340690	  0.114806
  0.468938	 -2.359085	  0.122350
  0.467101	 -2.377708	  0.129408
  0.465266	 -2.396332	  0.136464
  0.463314	 -2.414907	  0.143615
  0.461309	 -2.433461	  0.150808
  0.459300	 -2.452038	  0.158013
  0.456332	 -2.470871	  0.166018
  0.452971	 -2.488870	  0.174065
