  2.419421	  0.497939	  0.662255
  2.424248	  0.499962	  0.660156
  2.400316	  0.502928	  0.661949
  2.381238	  0.497811	  0.669220
  2.367968	  0.486989	  0.681332
  2.361452	  0.468364	  0.691552
  2.350630	  0.450666	  0.705526
  2.331094	  0.444271	  0.721098
  2.311615	  0.443072	  0.728807
  2.293565	  0.439761	  0.729534
  2.274663	  0.432063	  0.732135
  2.255590	  0.425195	  0.737613
  2.237534	  0.418543	  0.743099
  2.220242	  0.410746	  0.749672
  2.202977	  0.402668	  0.755781
  2.185715	  0.394599	  0.761819
  2.168337	  0.386712	  0.767828
  2.150678	  0.379052	  0.773258
  2.133013	  0.371399	  0.778677
  2.115190	  0.363891	  0.783775
  2.097256	  0.356493	  0.788636
  2.079314	  0.349108	  0.793489
  2.060937	  0.342564	  0.797896
  2.042431	  0.336310	  0.802187
  2.023919	  0.330077	  0.806492
  2.005131	  0.324340	  0.810254
  1.986262	  0.318797	  0.813872
  1.967432	  0.313255	  0.817735
  1.948554	  0.307635	  0.821185
  1.929731	  0.301791	  0.824224
  1.912854	  0.294099	  0.827006
  1.894901	  0.283284	  0.829587
  1.874967	  0.277332	  0.831211
  1.847622	  0.277443	  0.832667
  1.835985	  0.275884	  0.833862
  1.818311	  0.267895	  0.835064
  1.797915	  0.258855	  0.832397
  1.774377	  0.254315	  0.831149
  1.757242	  0.251666	  0.834922
  1.737935	  0.247112	  0.840097
  1.718416	  0.242514	  0.841909
  1.700555	  0.237488	  0.844663
  1.680998	  0.231835	  0.854666
  1.659230	  0.228265	  0.862614
  1.641801	  0.224684	  0.856981
  1.622998	  0.216138	  0.848512
  1.607212	  0.202965	  0.843839
  1.589493	  0.191928	  0.848324
  1.570283	  0.188046	  0.859510
  1.543143	  0.189249	  0.867121
  1.524575	  0.190241	  0.864812
  1.508692	  0.186603	  0.860631
  1.491713	  0.178859	  0.851429
  1.468597	  0.161139	  0.843016
  1.452758	  0.150655	  0.840504
  1.438360	  0.141161	  0.840942
  1.422046	  0.127893	  0.846479
  1.400257	  0.111824	  0.856537
  1.390752	  0.103618	  0.862997
  1.370068	  0.088234	  0.868699
  1.356199	  0.079693	  0.873923
  1.337944	  0.070954	  0.876139
  1.323586	  0.062091	  0.874516
  1.306229	  0.048545	  0.865311
  1.289435	  0.037472	  0.861149
  1.270785	  0.026422	  0.864458
  1.255120	  0.016907	  0.873109
  1.237416	  0.010892	  0.886453
  1.219451	  0.008919	  0.899668
  1.201382	  0.007670	  0.906700
  1.180831	  0.001983	  0.907961
  1.160538	 -0.008210	  0.908228
  1.142571	 -0.018439	  0.912510
  1.128882	 -0.024136	  0.917129
  1.109129	 -0.032059	  0.921539
  1.091175	 -0.043481	  0.926317
  1.075359	 -0.052145	  0.935617
  1.060252	 -0.054892	  0.947624
  1.042452	 -0.061377	  0.956852
  1.025159	 -0.068661	  0.964277
  1.007176	 -0.074942	  0.970634
  0.988996	 -0.080945	  0.976228
  0.970862	 -0.087007	  0.982197
  0.952329	 -0.092439	  0.986422
  0.932272	 -0.094049	  0.991345
  0.911554	 -0.095209	  0.996530
  0.891934	 -0.103084	  0.999400
  0.875520	 -0.111229	  0.998036
  0.855301	 -0.115919	  0.995866
  0.832479	 -0.126011	  0.994406
  0.817823	 -0.138721	  0.988686
  0.812414	 -0.155806	  0.973630
  0.808141	 -0.173796	  0.957772
  0.799036	 -0.182506	  0.946418
  0.786384	 -0.190704	  0.932267
  0.777497	 -0.205709	  0.920119
  0.768512	 -0.225234	  0.913540
  0.757965	 -0.240029	  0.907331
  0.749343	 -0.252969	  0.896340
  0.742344	 -0.265321	  0.884251
  0.729506	 -0.282802	  0.872696
  0.715226	 -0.297712	  0.860993
  0.706852	 -0.302203	  0.852986
  0.701948	 -0.314342	  0.831138
  0.695841	 -0.325702	  0.813699
  0.690283	 -0.337792	  0.802764
  0.686205	 -0.355419	  0.792035
  0.677205	 -0.371236	  0.779049
  0.666980	 -0.380985	  0.765247
  0.657661	 -0.392665	  0.755915
  0.644240	 -0.402733	  0.760331
  0.629439	 -0.402691	  0.775743
  0.612456	 -0.404086	  0.787341
  0.589100	 -0.411540	  0.790031
  0.569486	 -0.409621	  0.792808
  0.551261	 -0.403787	  0.798048
  0.529905	 -0.397720	  0.802816
  0.510278	 -0.399074	  0.805218
  0.489870	 -0.403920	  0.810536
  0.473187	 -0.409601	  0.816749
  0.456114	 -0.418407	  0.824776
  0.437761	 -0.425412	  0.830218
  0.416508	 -0.427627	  0.838415
  0.395749	 -0.426249	  0.846523
  0.376729	 -0.423755	  0.853888
  0.359541	 -0.423467	  0.861393
  0.342555	 -0.422187	  0.871914
  0.320830	 -0.419338	  0.880881
  0.308294	 -0.416150	  0.887954
  0.287956	 -0.413328	  0.897271
  0.268946	 -0.412549	  0.903772
  0.253156	 -0.409663	  0.909360
  0.231415	 -0.411940	  0.918043
  0.205324	 -0.417547	  0.923442
  0.190412	 -0.424528	  0.922380
  0.177400	 -0.427668	  0.925010
  0.156786	 -0.444579	  0.924206
  0.141410	 -0.453281	  0.918508
  0.121357	 -0.460712	  0.911984
  0.101935	 -0.468653	  0.908750
  0.083206	 -0.476871	  0.908846
  0.064116	 -0.483864	  0.911133
  0.045337	 -0.491018	  0.912086
  0.026041	 -0.497953	  0.913755
  0.006325	 -0.504474	  0.916618
 -0.013353	 -0.507314	  0.920085
 -0.034015	 -0.506275	  0.922940
 -0.057406	 -0.505986	  0.927083
 -0.077494	 -0.508323	  0.928566
 -0.096584	 -0.515971	  0.932217
 -0.112316	 -0.523992	  0.939618
 -0.126581	 -0.531142	  0.949702
 -0.149375	 -0.537398	  0.961265
 -0.169584	 -0.541729	  0.971645
 -0.180053	 -0.543056	  0.976892
 -0.198747	 -0.544745	  0.988927
 -0.213984	 -0.551975	  0.999981
 -0.230369	 -0.564966	  1.012095
 -0.245337	 -0.572796	  1.020884
 -0.266436	 -0.577994	  1.028148
 -0.284160	 -0.584276	  1.029999
 -0.304314	 -0.594280	  1.035001
 -0.316541	 -0.600601	  1.038144
 -0.331798	 -0.607718	  1.045539
 -0.351157	 -0.619811	  1.045562
 -0.373087	 -0.632164	  1.042339
 -0.386616	 -0.638209	  1.042663
 -0.402381	 -0.647213	  1.049618
 -0.421551	 -0.659678	  1.055392
 -0.440730	 -0.668523	  1.059237
 -0.456416	 -0.674925	  1.063663
 -0.474984	 -0.683023	  1.070829
 -0.492793	 -0.691377	  1.075252
 -0.509643	 -0.697992	  1.083876
 -0.527533	 -0.703548	  1.095800
 -0.544715	 -0.713402	  1.098756
 -0.561897	 -0.724868	  1.100955
 -0.579304	 -0.729388	  1.113763
 -0.596475	 -0.728624	  1.131422
 -0.606261	 -0.734246	  1.145092
 -0.619544	 -0.750427	  1.162369
 -0.628421	 -0.757436	  1.173766
 -0.640071	 -0.762059	  1.186967
 -0.653372	 -0.764153	  1.206899
 -0.665183	 -0.769677	  1.221970
 -0.676173	 -0.777950	  1.235281
 -0.685639	 -0.785627	  1.250934
 -0.694833	 -0.790571	  1.268370
 -0.707221	 -0.797210	  1.283411
 -0.718220	 -0.804131	  1.301667
 -0.725471	 -0.808160	  1.315767
 -0.729113	 -0.811941	  1.338618
 -0.733484	 -0.816668	  1.359074
 -0.739037	 -0.821209	  1.375642
 -0.748178	 -0.828418	  1.391889
 -0.759254	 -0.833810	  1.409808
 -0.768999	 -0.838768	  1.424502
 -0.778751	 -0.845945	  1.439489
 -0.787171	 -0.855814	  1.464546
 -0.791383	 -0.859427	  1.478003
 -0.796671	 -0.863990	  1.493049
 -0.810344	 -0.868228	  1.508867
 -0.823402	 -0.871147	  1.523744
 -0.835458	 -0.875691	  1.537481
 -0.849287	 -0.880533	  1.549187
 -0.863723	 -0.884741	  1.559535
 -0.876388	 -0.890330	  1.563236
 -0.886836	 -0.896062	  1.564530
 -0.900208	 -0.903995	  1.563175
 -0.915590	 -0.912806	  1.558401
 -0.930675	 -0.921563	  1.550734
 -0.945758	 -0.929403	  1.540906
 -0.960230	 -0.937087	  1.531277
 -0.974651	 -0.943225	  1.519602
 -0.989370	 -0.946513	  1.507536
 -1.002311	 -0.950563	  1.494850
 -1.014806	 -0.952232	  1.479228
 -1.028499	 -0.951054	  1.464733
 -1.041152	 -0.950139	  1.450213
 -1.053673	 -0.948477	  1.434776
 -1.065398	 -0.946298	  1.418904
 -1.077296	 -0.944218	  1.402696
 -1.090810	 -0.941801	  1.387792
 -1.104168	 -0.939646	  1.372364
 -1.120258	 -0.935536	  1.357350
 -1.135667	 -0.932546	  1.344568
 -1.151542	 -0.930262	  1.332400
 -1.167006	 -0.928948	  1.319273
 -1.182284	 -0.926756	  1.306883
 -1.200553	 -0.927942	  1.296126
 -1.223045	 -0.931769	  1.291038
 -1.243130	 -0.933983	  1.284204
 -1.262961	 -0.939822	  1.281993
 -1.281256	 -0.947119	  1.280704
 -1.299923	 -0.955561	  1.279553
 -1.317554	 -0.964278	  1.278773
 -1.333254	 -0.970359	  1.276327
 -1.352614	 -0.974391	  1.274534
 -1.382350	 -0.980285	  1.271151
 -1.396709	 -0.985758	  1.266719
 -1.412158	 -0.995460	  1.261794
 -1.433131	 -1.011660	  1.261434
 -1.447964	 -1.020768	  1.268203
 -1.463437	 -1.033918	  1.273162
 -1.476490	 -1.040300	  1.280536
 -1.496670	 -1.049150	  1.285865
 -1.512680	 -1.053772	  1.290393
 -1.533981	 -1.061030	  1.295492
 -1.553421	 -1.070439	  1.298993
 -1.566704	 -1.081791	  1.301855
 -1.579104	 -1.097296	  1.303487
 -1.597670	 -1.112736	  1.303468
 -1.611792	 -1.123353	  1.303078
 -1.628712	 -1.131427	  1.303150
 -1.647608	 -1.140817	  1.307514
 -1.667615	 -1.154764	  1.313509
 -1.681236	 -1.159871	  1.317692
 -1.701359	 -1.166396	  1.322848
 -1.717713	 -1.177433	  1.326126
