  1.338131	  0.083319	  2.034430
  1.323692	  0.089182	  2.053834
  1.335325	  0.084370	  2.038290
  1.346220	  0.080370	  2.021997
  1.356916	  0.076573	  2.005528
  1.368024	  0.073180	  1.989246
  1.379954	  0.070752	  1.973378
  1.391884	  0.068325	  1.957510
  1.404469	  0.067158	  1.942010
  1.417454	  0.066849	  1.926801
  1.430443	  0.066520	  1.911597
  1.444312	  0.064563	  1.897321
  1.458314	  0.062339	  1.883215
  1.472368	  0.060006	  1.869179
  1.487019	  0.056268	  1.856088
  1.501673	  0.052523	  1.843003
  1.516402	  0.048718	  1.830019
  1.531212	  0.044850	  1.817147
  1.546027	  0.040993	  1.804276
  1.561028	  0.037127	  1.791687
  1.575262	  0.034582	  1.777982
  1.589513	  0.033907	  1.763209
  1.605264	  0.032674	  1.749973
  1.621924	  0.027731	  1.739444
  1.637732	  0.021527	  1.728769
  1.651538	  0.015130	  1.716312
  1.666693	  0.011945	  1.702803
  1.682584	  0.007632	  1.691013
  1.697943	  0.000284	  1.680812
  1.712571	 -0.006142	  1.668714
  1.727120	 -0.010433	  1.655273
  1.742071	 -0.015133	  1.642638
  1.757076	 -0.022390	  1.631473
  1.771794	 -0.029710	  1.620064
  1.786963	 -0.037908	  1.609617
  1.802045	 -0.046338	  1.599488
  1.816823	 -0.055500	  1.589547
  1.830947	 -0.066478	  1.580442
  1.844812	 -0.077693	  1.571439
  1.857474	 -0.089666	  1.561576
  1.870093	 -0.101776	  1.551774
  1.882009	 -0.113499	  1.540596
  1.893460	 -0.124844	  1.528697
  1.904377	 -0.136045	  1.516430
  1.916220	 -0.149373	  1.505797
  1.929274	 -0.161524	  1.487994
  1.940120	 -0.172682	  1.475430
