 -1.897722	 -2.086665	  1.106970
 -1.878933	 -2.066004	  1.096009
 -1.838915	 -2.071895	  1.066218
 -1.796318	 -2.074632	  1.040606
 -1.754398	 -2.077265	  1.015962
 -1.710506	 -2.078908	  0.991801
 -1.668644	 -2.082837	  0.963174
 -1.627253	 -2.087930	  0.934710
 -1.586250	 -2.093125	  0.905592
 -1.545559	 -2.096513	  0.875123
 -1.505338	 -2.097839	  0.843182
 -1.466328	 -2.098476	  0.810656
 -1.429001	 -2.098431	  0.778792
 -1.392153	 -2.098022	  0.747778
 -1.353295	 -2.097315	  0.716598
 -1.312444	 -2.096434	  0.686332
 -1.271009	 -2.095819	  0.659102
 -1.227938	 -2.096793	  0.634865
 -1.184549	 -2.098905	  0.611059
 -1.141393	 -2.101774	  0.583817
 -1.099557	 -2.104044	  0.552987
 -1.060396	 -2.105279	  0.520611
 -1.024121	 -2.105734	  0.487024
 -0.989867	 -2.104985	  0.452640
 -0.955215	 -2.103924	  0.418051
 -0.918893	 -2.102914	  0.383309
 -0.879703	 -2.101618	  0.348987
 -0.837673	 -2.099252	  0.316478
 -0.795029	 -2.096211	  0.287140
 -0.752554	 -2.094154	  0.260142
 -0.710038	 -2.094880	  0.234464
 -0.667327	 -2.097939	  0.209688
 -0.624200	 -2.102161	  0.184730
 -0.581294	 -2.107155	  0.159482
 -0.538813	 -2.112804	  0.133737
 -0.497348	 -2.119549	  0.107486
 -0.456691	 -2.126727	  0.080643
 -0.414950	 -2.133607	  0.052342
 -0.372641	 -2.139745	  0.023790
 -0.332011	 -2.144209	 -0.003278
 -0.291987	 -2.146804	 -0.030094
 -0.252253	 -2.149648	 -0.057845
 -0.211225	 -2.152752	 -0.087236
 -0.169361	 -2.154885	 -0.118489
 -0.128324	 -2.156847	 -0.149437
 -0.088364	 -2.159067	 -0.178315
 -0.046189	 -2.161343	 -0.206077
 -0.003137	 -2.161539	 -0.232622
  0.036233	 -2.161586	 -0.262191
  0.071970	 -2.163326	 -0.297034
  0.106638	 -2.165269	 -0.334206
  0.141140	 -2.164399	 -0.370739
  0.175256	 -2.162479	 -0.406015
  0.210637	 -2.162229	 -0.441262
  0.251308	 -2.162890	 -0.474672
  0.296470	 -2.163584	 -0.503559
  0.341761	 -2.164632	 -0.528513
  0.385992	 -2.166268	 -0.550584
  0.430397	 -2.168786	 -0.571453
  0.475265	 -2.170852	 -0.593575
  0.518780	 -2.172054	 -0.614336
  0.564891	 -2.173927	 -0.633137
  0.611753	 -2.176183	 -0.656919
  0.655258	 -2.178147	 -0.684416
  0.695688	 -2.179668	 -0.714075
  0.735768	 -2.181821	 -0.744457
  0.774676	 -2.183910	 -0.775613
  0.811988	 -2.185508	 -0.806844
  0.850097	 -2.186414	 -0.840092
  0.887515	 -2.185613	 -0.875916
  0.921487	 -2.182382	 -0.912358
  0.958959	 -2.178289	 -0.945709
  0.994865	 -2.176225	 -0.981504
  1.032529	 -2.178922	 -1.015378
  1.072548	 -2.176208	 -1.046042
  1.115892	 -2.172727	 -1.072244
  1.160111	 -2.174876	 -1.096631
  1.199309	 -2.183213	 -1.127335
  1.237640	 -2.180055	 -1.160168
  1.276265	 -2.185230	 -1.192936
  1.319025	 -2.188705	 -1.220053
  1.357778	 -2.185211	 -1.251367
  1.396443	 -2.191864	 -1.281563
  1.441000	 -2.191334	 -1.303155
  1.475885	 -2.189559	 -1.338810
  1.513954	 -2.197914	 -1.370080
  1.529094	 -2.219893	 -1.383781
