  2.090366	  1.098468	 -0.593286
  2.103236	  1.108001	 -0.584242
  2.087431	  1.091917	 -0.586023
  2.074721	  1.082443	 -0.595560
  2.059974	  1.074159	 -0.607561
  2.043575	  1.064545	 -0.614763
  2.024025	  1.053928	 -0.620624
  2.010055	  1.043852	 -0.628884
  2.000896	  1.032429	 -0.641276
  1.989975	  1.021732	 -0.658134
  1.976700	  1.012793	 -0.672438
  1.960138	  1.006462	 -0.683203
  1.943373	  1.000140	 -0.688417
  1.925548	  0.990533	 -0.693006
  1.910635	  0.977920	 -0.700333
  1.899712	  0.962862	 -0.710562
  1.885218	  0.951057	 -0.721740
  1.866915	  0.946708	 -0.725219
  1.840984	  0.946295	 -0.724419
  1.816099	  0.948756	 -0.734985
  1.805131	  0.943072	 -0.754666
  1.795458	  0.936872	 -0.771258
  1.781967	  0.931828	 -0.784359
  1.766919	  0.926861	 -0.796766
  1.754669	  0.920975	 -0.810797
  1.740559	  0.915059	 -0.826186
  1.724215	  0.910901	 -0.836025
  1.708121	  0.906097	 -0.842806
  1.691581	  0.901061	 -0.852789
  1.669625	  0.900050	 -0.873917
  1.656248	  0.899616	 -0.884452
  1.645573	  0.899535	 -0.892467
  1.628743	  0.888443	 -0.902575
  1.613055	  0.876926	 -0.913050
  1.598183	  0.869950	 -0.925484
  1.584052	  0.863011	 -0.937914
  1.569736	  0.856248	 -0.950143
  1.555254	  0.850217	 -0.962549
  1.540733	  0.844450	 -0.975034
  1.526207	  0.838711	 -0.987524
  1.511472	  0.834428	 -1.000350
  1.496724	  0.830263	 -1.013201
  1.482056	  0.825836	 -1.026056
  1.467547	  0.820921	 -1.038914
  1.453046	  0.815996	 -1.051777
  1.438899	  0.810993	 -1.065000
  1.424826	  0.805974	 -1.078295
  1.410793	  0.800959	 -1.091628
  1.398791	  0.796215	 -1.106902
  1.386836	  0.791480	 -1.122218
  1.373943	  0.786670	 -1.136690
  1.359814	  0.781907	 -1.149980
  1.345685	  0.777820	 -1.163264
  1.330551	  0.778912	 -1.176352
  1.314486	  0.778362	 -1.189266
  1.298509	  0.771669	 -1.199400
  1.283132	  0.768622	 -1.209816
  1.264113	  0.771690	 -1.222445
  1.242932	  0.765712	 -1.236432
  1.231697	  0.755120	 -1.244481
  1.219634	  0.740440	 -1.251972
  1.204608	  0.729368	 -1.260695
  1.188846	  0.725162	 -1.273088
  1.175927	  0.725011	 -1.288168
  1.160328	  0.725762	 -1.303591
  1.145785	  0.726049	 -1.317446
  1.131425	  0.721010	 -1.329865
  1.122212	  0.715142	 -1.344370
  1.115463	  0.714882	 -1.364264
  1.107008	  0.717393	 -1.382720
  1.096269	  0.716962	 -1.399942
  1.089913	  0.713666	 -1.417095
  1.088648	  0.713388	 -1.435979
  1.083036	  0.713375	 -1.455448
  1.073737	  0.709166	 -1.475469
  1.070251	  0.700560	 -1.498519
  1.074016	  0.699059	 -1.517942
  1.083616	  0.710322	 -1.536171
  1.095574	  0.721391	 -1.558517
  1.101481	  0.722394	 -1.576150
  1.105013	  0.719115	 -1.592105
  1.110119	  0.714115	 -1.615237
  1.118351	  0.714518	 -1.635481
  1.127981	  0.718985	 -1.650061
  1.136714	  0.722751	 -1.668677
  1.139566	  0.723184	 -1.686088
  1.137603	  0.719869	 -1.705118
  1.134106	  0.716549	 -1.735378
  1.132036	  0.709747	 -1.753800
  1.133059	  0.703822	 -1.769044
  1.135819	  0.697014	 -1.785800
  1.135808	  0.689703	 -1.802173
  1.136378	  0.684306	 -1.823267
  1.138669	  0.683067	 -1.844729
  1.138390	  0.679143	 -1.868686
  1.136207	  0.674943	 -1.880573
  1.128399	  0.664926	 -1.902351
  1.112997	  0.660855	 -1.916253
  1.096885	  0.660588	 -1.926208
  1.070585	  0.653161	 -1.947076
  1.064395	  0.642152	 -1.967860
  1.062903	  0.634326	 -1.981250
  1.061471	  0.627430	 -1.990116
  1.053101	  0.615549	 -2.005041
  1.040933	  0.606401	 -2.013669
  1.016005	  0.592040	 -2.023659
  1.006572	  0.586646	 -2.027483
  0.990403	  0.578349	 -2.033433
  0.966392	  0.568126	 -2.039976
  0.951920	  0.562767	 -2.042648
  0.933834	  0.558346	 -2.044560
  0.910936	  0.551392	 -2.049348
  0.895005	  0.547581	 -2.053239
  0.875880	  0.542585	 -2.057643
  0.855909	  0.535343	 -2.066461
  0.845258	  0.531717	 -2.071289
  0.823744	  0.532110	 -2.077548
  0.804501	  0.531300	 -2.087885
  0.791054	  0.529142	 -2.103902
  0.779301	  0.529103	 -2.120252
  0.767818	  0.527717	 -2.137088
  0.757733	  0.523070	 -2.153337
  0.749854	  0.520752	 -2.171916
  0.742619	  0.519702	 -2.190582
  0.735455	  0.518574	 -2.209281
  0.729750	  0.516825	 -2.228207
  0.725745	  0.515939	 -2.248049
  0.721589	  0.514463	 -2.269163
  0.710292	  0.507372	 -2.288587
  0.704258	  0.504323	 -2.307410
