 -1.640332	 -0.813357	  1.529847
 -1.657432	 -0.785535	  1.552961
 -1.649999	 -0.797628	  1.542916
 -1.621333	 -0.842559	  1.511942
 -1.593408	 -0.884664	  1.486161
 -1.565825	 -0.925058	  1.463343
 -1.538505	 -0.964555	  1.442359
 -1.511952	 -1.003293	  1.422724
 -1.488198	 -1.040288	  1.404135
 -1.469257	 -1.073611	  1.385437
 -1.454825	 -1.102330	  1.366483
 -1.443204	 -1.127168	  1.345828
 -1.432072	 -1.151167	  1.320966
 -1.419396	 -1.175488	  1.290843
 -1.406120	 -1.197306	  1.259308
 -1.393845	 -1.214329	  1.228777
 -1.379824	 -1.229285	  1.193422
 -1.359770	 -1.247368	  1.146401
 -1.334295	 -1.272540	  1.092553
 -1.305776	 -1.305391	  1.038482
 -1.276976	 -1.345402	  0.989177
 -1.251454	 -1.388698	  0.946496
 -1.228700	 -1.433958	  0.909448
 -1.208941	 -1.478554	  0.877816
 -1.190472	 -1.521219	  0.849856
 -1.172513	 -1.559864	  0.824955
 -1.154613	 -1.594987	  0.801610
 -1.135719	 -1.627531	  0.778138
 -1.115105	 -1.657218	  0.753783
 -1.091618	 -1.685786	  0.726923
 -1.062902	 -1.715018	  0.697353
 -1.026688	 -1.747265	  0.665930
 -0.986042	 -1.789578	  0.632935
 -0.948520	 -1.842092	  0.605927
 -0.918134	 -1.891879	  0.587947
 -0.897064	 -1.934126	  0.573210
 -0.880989	 -1.970355	  0.558924
 -0.866408	 -2.000549	  0.544017
 -0.849559	 -2.028571	  0.525609
 -0.828762	 -2.057608	  0.502839
 -0.805234	 -2.085631	  0.477532
 -0.779183	 -2.112546	  0.450089
 -0.750549	 -2.141105	  0.419551
 -0.721639	 -2.171231	  0.388950
 -0.697956	 -2.199255	  0.360809
 -0.677937	 -2.224599	  0.332031
 -0.656984	 -2.250695	  0.299523
 -0.629549	 -2.285036	  0.255486
 -0.613671	 -2.305086	  0.229232
