 -0.380979	 -1.721670	  1.758346
 -0.380750	 -1.722663	  1.771288
 -0.388413	 -1.728752	  1.750613
 -0.385828	 -1.727597	  1.730340
 -0.380193	 -1.724152	  1.711114
 -0.375245	 -1.719616	  1.691275
 -0.375714	 -1.717967	  1.672207
 -0.379887	 -1.719430	  1.656397
 -0.381745	 -1.724387	  1.635338
 -0.382701	 -1.725258	  1.604501
 -0.386021	 -1.723770	  1.591213
 -0.391622	 -1.720839	  1.572043
 -0.394238	 -1.716587	  1.546425
 -0.391170	 -1.713153	  1.526409
 -0.387651	 -1.711037	  1.512746
 -0.380076	 -1.706782	  1.489034
 -0.376268	 -1.701772	  1.463628
 -0.374757	 -1.698194	  1.450702
 -0.372306	 -1.692293	  1.436035
 -0.373463	 -1.683232	  1.414743
 -0.380469	 -1.681741	  1.393986
 -0.384976	 -1.682041	  1.374038
 -0.384694	 -1.678650	  1.353896
 -0.383734	 -1.674456	  1.334320
 -0.382168	 -1.668927	  1.315224
 -0.379742	 -1.662892	  1.296255
 -0.377541	 -1.655106	  1.277939
 -0.378115	 -1.645987	  1.261710
 -0.380304	 -1.635263	  1.244702
 -0.380065	 -1.629376	  1.222903
 -0.382289	 -1.623521	  1.200389
 -0.384422	 -1.619109	  1.185525
 -0.386749	 -1.611341	  1.165010
 -0.385048	 -1.605003	  1.147339
 -0.380328	 -1.600285	  1.131234
 -0.374273	 -1.593243	  1.103501
 -0.374915	 -1.588676	  1.087825
 -0.378082	 -1.583463	  1.072179
 -0.382263	 -1.576036	  1.051344
 -0.384267	 -1.570768	  1.032979
 -0.384771	 -1.566339	  1.010154
 -0.381811	 -1.563367	  0.992109
 -0.376016	 -1.559639	  0.976875
 -0.364499	 -1.550654	  0.951602
 -0.366001	 -1.543687	  0.929319
 -0.368836	 -1.539817	  0.916739
 -0.375431	 -1.532784	  0.899382
 -0.376665	 -1.529378	  0.877469
 -0.373781	 -1.529559	  0.859524
 -0.365327	 -1.525291	  0.839980
 -0.362038	 -1.520319	  0.813717
 -0.366917	 -1.519351	  0.793278
 -0.376095	 -1.520762	  0.777314
 -0.386550	 -1.523717	  0.764666
 -0.409942	 -1.537968	  0.729142
 -0.418165	 -1.545922	  0.714836
 -0.425200	 -1.548820	  0.706250
 -0.431057	 -1.557803	  0.683257
 -0.436616	 -1.562378	  0.667124
 -0.440480	 -1.572633	  0.643345
 -0.443055	 -1.580279	  0.629729
 -0.440633	 -1.587027	  0.610508
 -0.436762	 -1.594215	  0.596004
 -0.434845	 -1.606772	  0.563585
 -0.433949	 -1.611271	  0.549221
 -0.437797	 -1.615203	  0.537112
 -0.441851	 -1.628410	  0.517527
 -0.448794	 -1.641958	  0.497716
 -0.449632	 -1.651019	  0.482436
 -0.449639	 -1.659168	  0.466905
 -0.449923	 -1.667053	  0.451273
 -0.448527	 -1.674299	  0.435368
 -0.448614	 -1.688384	  0.418046
 -0.449627	 -1.707913	  0.396990
 -0.446224	 -1.718188	  0.382462
 -0.442740	 -1.729566	  0.371979
 -0.436570	 -1.751016	  0.356716
 -0.432694	 -1.767688	  0.349143
 -0.428688	 -1.785991	  0.340315
 -0.424441	 -1.796311	  0.335162
 -0.414225	 -1.810185	  0.323814
 -0.405651	 -1.825590	  0.310851
 -0.401620	 -1.834121	  0.293821
 -0.393831	 -1.836344	  0.273996
 -0.382811	 -1.839065	  0.253274
 -0.375773	 -1.841911	  0.238656
 -0.366929	 -1.846377	  0.211294
 -0.358861	 -1.851402	  0.199408
 -0.349606	 -1.858203	  0.190329
 -0.337184	 -1.865144	  0.172728
 -0.335708	 -1.865667	  0.154984
 -0.335523	 -1.867104	  0.132075
 -0.331277	 -1.871992	  0.116999
 -0.328396	 -1.877993	  0.099915
 -0.330391	 -1.879269	  0.072206
 -0.331429	 -1.876624	  0.058997
 -0.334156	 -1.872420	  0.045257
 -0.337609	 -1.866558	  0.022294
 -0.344457	 -1.864222	  0.005718
 -0.351795	 -1.862145	 -0.012608
 -0.358742	 -1.858252	 -0.037909
 -0.360802	 -1.853109	 -0.058171
 -0.362876	 -1.850708	 -0.068757
 -0.371987	 -1.847020	 -0.088802
 -0.385690	 -1.842496	 -0.112529
 -0.392464	 -1.841326	 -0.120753
 -0.408446	 -1.844774	 -0.134797
 -0.427888	 -1.852383	 -0.152919
 -0.440035	 -1.855610	 -0.165768
 -0.450783	 -1.857591	 -0.175898
 -0.464313	 -1.859978	 -0.190944
 -0.482335	 -1.856125	 -0.208892
 -0.495404	 -1.852094	 -0.219076
 -0.509784	 -1.846826	 -0.227476
 -0.530373	 -1.842542	 -0.240360
 -0.545773	 -1.846827	 -0.249965
 -0.557637	 -1.853454	 -0.257422
 -0.580521	 -1.863960	 -0.270476
 -0.602664	 -1.864320	 -0.279484
 -0.615196	 -1.863805	 -0.284314
 -0.628803	 -1.862720	 -0.289359
 -0.649527	 -1.868514	 -0.298321
 -0.672232	 -1.872788	 -0.301802
 -0.688756	 -1.876632	 -0.306518
 -0.704123	 -1.878969	 -0.309506
 -0.733825	 -1.890426	 -0.307090
 -0.748066	 -1.899498	 -0.310621
 -0.757912	 -1.905429	 -0.311968
 -0.777892	 -1.912589	 -0.315088
 -0.797148	 -1.921873	 -0.321792
 -0.814595	 -1.930328	 -0.327866
 -0.834184	 -1.935796	 -0.329537
 -0.853604	 -1.940982	 -0.329778
 -0.872734	 -1.946736	 -0.331706
 -0.890779	 -1.949304	 -0.335441
 -0.907760	 -1.944200	 -0.340696
 -0.925549	 -1.935113	 -0.344087
 -0.942783	 -1.925501	 -0.347954
 -0.959724	 -1.915902	 -0.352623
 -0.976434	 -1.905869	 -0.357135
 -0.993370	 -1.896603	 -0.362526
 -1.010522	 -1.887191	 -0.366516
 -1.026769	 -1.877884	 -0.372098
 -1.039559	 -1.866095	 -0.377718
 -1.050115	 -1.851062	 -0.380827
 -1.060354	 -1.833770	 -0.382022
 -1.071510	 -1.817148	 -0.383488
 -1.081844	 -1.800146	 -0.383227
 -1.090281	 -1.782568	 -0.378633
 -1.097591	 -1.763199	 -0.374297
 -1.104711	 -1.744883	 -0.374291
 -1.112427	 -1.729461	 -0.379287
 -1.117716	 -1.711330	 -0.383073
 -1.119151	 -1.690940	 -0.382548
 -1.119713	 -1.670896	 -0.381857
 -1.120217	 -1.650913	 -0.381172
 -1.120670	 -1.630931	 -0.380550
 -1.120881	 -1.611006	 -0.379522
 -1.120556	 -1.591219	 -0.377482
 -1.118204	 -1.571822	 -0.375138
 -1.113622	 -1.553897	 -0.372748
 -1.112090	 -1.535809	 -0.370248
 -1.110878	 -1.509542	 -0.372093
 -1.102408	 -1.488464	 -0.373957
 -1.093186	 -1.471908	 -0.373175
 -1.080798	 -1.458172	 -0.368959
 -1.069208	 -1.447102	 -0.363059
 -1.056974	 -1.430051	 -0.362371
 -1.048282	 -1.411444	 -0.367144
 -1.040772	 -1.395770	 -0.369479
 -1.028752	 -1.380949	 -0.371205
 -1.017338	 -1.359055	 -0.377329
 -1.017390	 -1.341607	 -0.387439
 -1.028759	 -1.329133	 -0.402508
 -1.044490	 -1.313828	 -0.422388
 -1.045332	 -1.301688	 -0.434629
 -1.042764	 -1.290798	 -0.445363
 -1.033795	 -1.272629	 -0.459123
 -1.037881	 -1.252714	 -0.482056
 -1.044696	 -1.243813	 -0.493873
 -1.054624	 -1.238311	 -0.511706
 -1.057629	 -1.239449	 -0.530075
 -1.058326	 -1.239729	 -0.552323
 -1.061197	 -1.237703	 -0.573028
 -1.064134	 -1.237973	 -0.592530
 -1.062837	 -1.240290	 -0.612522
 -1.059560	 -1.243620	 -0.632143
 -1.055471	 -1.247043	 -0.651355
 -1.050519	 -1.253146	 -0.668815
 -1.044447	 -1.259942	 -0.685495
 -1.032235	 -1.258930	 -0.701934
 -1.015604	 -1.259481	 -0.721967
 -0.995101	 -1.265140	 -0.737241
 -0.986436	 -1.271569	 -0.741097
 -0.973655	 -1.281052	 -0.750208
 -0.956195	 -1.292491	 -0.763559
 -0.939143	 -1.301819	 -0.778582
 -0.924318	 -1.309135	 -0.792343
 -0.911612	 -1.318231	 -0.804672
 -0.904940	 -1.319650	 -0.812228
 -0.891126	 -1.319746	 -0.832517
 -0.880187	 -1.312991	 -0.853586
 -0.875615	 -1.310383	 -0.865525
 -0.865575	 -1.308482	 -0.889254
 -0.864337	 -1.309720	 -0.897208
 -0.864968	 -1.310491	 -0.903314
 -0.869955	 -1.309778	 -0.914764
 -0.879299	 -1.310547	 -0.926444
 -0.899101	 -1.308136	 -0.952441
 -0.904255	 -1.308310	 -0.956790
 -0.916873	 -1.307883	 -0.966450
 -0.938467	 -1.309415	 -0.982153
 -0.953970	 -1.310749	 -0.997459
 -0.962791	 -1.309260	 -1.013467
 -0.973345	 -1.299518	 -1.035350
 -0.983527	 -1.292405	 -1.054735
 -0.995945	 -1.291368	 -1.066537
 -1.013595	 -1.291528	 -1.076146
 -1.038452	 -1.292581	 -1.079797
 -1.065044	 -1.296728	 -1.085663
 -1.077475	 -1.300886	 -1.092058
 -1.091728	 -1.307438	 -1.106203
 -1.092583	 -1.307666	 -1.126982
 -1.094253	 -1.308126	 -1.145244
 -1.091384	 -1.306331	 -1.156223
 -1.086842	 -1.302851	 -1.165359
 -1.082758	 -1.298402	 -1.174588
 -1.072642	 -1.293783	 -1.187295
 -1.059943	 -1.289730	 -1.202615
 -1.048226	 -1.281745	 -1.220996
 -1.037738	 -1.274664	 -1.238119
 -1.023811	 -1.268237	 -1.252744
 -1.010755	 -1.260523	 -1.266298
 -0.999205	 -1.255166	 -1.279900
 -0.987278	 -1.250832	 -1.292125
 -0.962901	 -1.249976	 -1.307816
 -0.947133	 -1.248820	 -1.312272
 -0.925242	 -1.246481	 -1.316806
 -0.908724	 -1.243801	 -1.322313
 -0.892250	 -1.239834	 -1.333741
 -0.879848	 -1.235603	 -1.349852
 -0.866503	 -1.232814	 -1.365755
 -0.849654	 -1.235668	 -1.376900
 -0.830159	 -1.242138	 -1.386671
 -0.808346	 -1.247625	 -1.404470
 -0.799132	 -1.248413	 -1.419595
 -0.793236	 -1.248894	 -1.431267
 -0.783303	 -1.245108	 -1.448643
 -0.772547	 -1.242348	 -1.468422
 -0.765455	 -1.241642	 -1.487801
 -0.759153	 -1.242338	 -1.505788
 -0.755562	 -1.242403	 -1.521063
 -0.750625	 -1.242465	 -1.539551
 -0.749957	 -1.242101	 -1.559781
 -0.751149	 -1.241801	 -1.579054
 -0.754032	 -1.240333	 -1.596351
 -0.754986	 -1.238068	 -1.615078
 -0.757050	 -1.235486	 -1.635931
 -0.760891	 -1.233652	 -1.661964
 -0.764988	 -1.232439	 -1.677778
 -0.768974	 -1.230589	 -1.693609
 -0.774930	 -1.226695	 -1.716250
 -0.781299	 -1.223408	 -1.736018
 -0.786422	 -1.219433	 -1.750553
 -0.791718	 -1.212592	 -1.770784
 -0.796801	 -1.207477	 -1.791884
 -0.802304	 -1.203271	 -1.806461
 -0.807888	 -1.196444	 -1.826278
 -0.815024	 -1.191042	 -1.845915
 -0.822796	 -1.188089	 -1.862135
 -0.828207	 -1.184420	 -1.881424
 -0.831509	 -1.180148	 -1.898927
 -0.836706	 -1.175239	 -1.922774
 -0.844677	 -1.171976	 -1.947364
 -0.845240	 -1.170990	 -1.960904
 -0.845437	 -1.169346	 -1.975418
 -0.840306	 -1.164747	 -1.997629
 -0.837562	 -1.159464	 -2.020259
 -0.835741	 -1.155325	 -2.043827
 -0.836686	 -1.150781	 -2.069246
 -0.836740	 -1.147757	 -2.089016
