 -1.430478	  1.910314	 -0.133959
 -1.450690	  1.943703	 -0.158409
 -1.470902	  1.977092	 -0.182859
 -1.459953	  1.964595	 -0.171285
 -1.459162	  1.949404	 -0.160874
 -1.465600	  1.929543	 -0.145219
 -1.462378	  1.912251	 -0.130493
 -1.458983	  1.899809	 -0.119938
 -1.453502	  1.889499	 -0.112614
 -1.437142	  1.871146	 -0.099678
 -1.430251	  1.854925	 -0.085510
 -1.432400	  1.841373	 -0.071731
 -1.433438	  1.828697	 -0.057104
 -1.433464	  1.815526	 -0.042020
 -1.444215	  1.806801	 -0.029641
 -1.458709	  1.798317	 -0.013021
 -1.469140	  1.784553	  0.011120
 -1.475318	  1.775588	  0.023467
 -1.482700	  1.770849	  0.029882
 -1.503622	  1.761572	  0.039033
 -1.531160	  1.744008	  0.050712
 -1.538777	  1.740110	  0.056355
 -1.551810	  1.736625	  0.071004
 -1.568023	  1.733230	  0.091184
 -1.577059	  1.730283	  0.104567
 -1.586197	  1.728858	  0.115964
 -1.604697	  1.725259	  0.136519
 -1.616776	  1.720687	  0.151539
 -1.627145	  1.713728	  0.165064
 -1.639806	  1.701440	  0.181264
 -1.649014	  1.691739	  0.192286
 -1.659583	  1.681071	  0.205362
 -1.672002	  1.668686	  0.222373
 -1.678252	  1.660424	  0.231919
 -1.686713	  1.651153	  0.245749
 -1.696652	  1.637596	  0.268356
 -1.702277	  1.632287	  0.284756
 -1.704423	  1.632584	  0.299487
 -1.700292	  1.626504	  0.322369
 -1.697892	  1.613767	  0.340428
 -1.693433	  1.603143	  0.355623
 -1.686316	  1.591510	  0.373043
 -1.681025	  1.578628	  0.386120
 -1.674085	  1.564819	  0.400239
 -1.671149	  1.547323	  0.421940
 -1.670351	  1.532667	  0.433689
 -1.669282	  1.520909	  0.440938
 -1.661236	  1.500407	  0.448268
 -1.655808	  1.480219	  0.455777
 -1.654895	  1.463791	  0.459735
 -1.649324	  1.444078	  0.458045
 -1.638409	  1.429593	  0.451178
 -1.624680	  1.416217	  0.442418
 -1.614284	  1.404754	  0.430169
 -1.603076	  1.394984	  0.414749
 -1.580827	  1.390232	  0.396584
 -1.560959	  1.384682	  0.389364
 -1.543955	  1.375498	  0.387725
 -1.525085	  1.364384	  0.390466
 -1.505054	  1.350886	  0.388719
 -1.491737	  1.340125	  0.383954
 -1.478730	  1.332885	  0.378497
 -1.460800	  1.326557	  0.371781
 -1.439799	  1.316370	  0.365722
 -1.422417	  1.307141	  0.360416
 -1.408574	  1.295272	  0.354353
 -1.397450	  1.286026	  0.349696
 -1.385007	  1.272294	  0.346200
 -1.364759	  1.257133	  0.339857
 -1.350903	  1.247255	  0.332845
 -1.337789	  1.235953	  0.331568
 -1.320910	  1.222639	  0.332958
 -1.303901	  1.203615	  0.339668
 -1.295517	  1.193188	  0.343458
 -1.283036	  1.177903	  0.345214
 -1.273894	  1.159817	  0.348901
 -1.266402	  1.142321	  0.353202
 -1.257983	  1.124105	  0.358084
 -1.253814	  1.107086	  0.363119
 -1.246938	  1.088445	  0.368422
 -1.241893	  1.066635	  0.375629
 -1.238520	  1.049433	  0.380242
 -1.236469	  1.041190	  0.383454
 -1.227880	  1.004610	  0.394662
 -1.220399	  0.988447	  0.396920
 -1.219051	  0.981623	  0.399223
 -1.203598	  0.955622	  0.406271
 -1.192669	  0.932163	  0.408686
 -1.182574	  0.927344	  0.413687
 -1.172230	  0.911318	  0.415168
 -1.155993	  0.892553	  0.426026
 -1.149181	  0.879608	  0.428766
 -1.137869	  0.864196	  0.434979
 -1.120311	  0.844814	  0.442361
 -1.113037	  0.831623	  0.447730
 -1.103682	  0.815707	  0.457862
 -1.089564	  0.801601	  0.467974
 -1.081719	  0.790422	  0.476213
 -1.076455	  0.772126	  0.486308
 -1.068391	  0.759024	  0.497555
 -1.060451	  0.743983	  0.508820
 -1.054243	  0.729006	  0.515609
 -1.046864	  0.714578	  0.521262
 -1.037449	  0.688626	  0.530679
 -1.032996	  0.670040	  0.543995
 -1.027693	  0.657610	  0.553718
 -1.015595	  0.637305	  0.570642
 -1.009765	  0.627785	  0.576361
 -1.001006	  0.614306	  0.579282
 -0.990874	  0.601829	  0.582301
 -0.979098	  0.583428	  0.594574
 -0.969452	  0.565928	  0.604857
 -0.962932	  0.553478	  0.613786
 -0.954307	  0.537146	  0.627934
 -0.943102	  0.517556	  0.640097
 -0.936117	  0.505475	  0.643559
 -0.925343	  0.490276	  0.646109
 -0.911054	  0.476754	  0.653287
 -0.895843	  0.467095	  0.664789
 -0.879820	  0.457838	  0.676586
 -0.871452	  0.450393	  0.683926
 -0.857729	  0.432517	  0.703058
 -0.851751	  0.411995	  0.723570
 -0.854130	  0.390947	  0.743554
 -0.854137	  0.383767	  0.752674
 -0.859554	  0.367851	  0.766020
 -0.861346	  0.354561	  0.779096
 -0.861636	  0.339821	  0.796914
 -0.856834	  0.327348	  0.809635
 -0.851258	  0.312796	  0.823521
 -0.845579	  0.293126	  0.831742
 -0.837989	  0.279559	  0.838877
 -0.833198	  0.266773	  0.852878
 -0.834471	  0.254766	  0.870055
 -0.829278	  0.237867	  0.884471
 -0.822580	  0.218543	  0.891509
 -0.815992	  0.201255	  0.896398
 -0.807956	  0.175055	  0.908027
 -0.805099	  0.160332	  0.916830
 -0.801015	  0.147991	  0.921657
 -0.794738	  0.126963	  0.928666
 -0.785575	  0.103802	  0.937027
 -0.781818	  0.092179	  0.939938
 -0.777362	  0.079673	  0.942765
 -0.766366	  0.049863	  0.949640
 -0.761975	  0.034748	  0.954254
 -0.759746	  0.018826	  0.958309
 -0.757743	 -0.005786	  0.966496
 -0.752020	 -0.023532	  0.976917
 -0.746112	 -0.035656	  0.983963
 -0.735178	 -0.050035	  0.995190
 -0.726865	 -0.064357	  1.009020
 -0.722455	 -0.079363	  1.019784
 -0.716435	 -0.095197	  1.029296
 -0.706583	 -0.112276	  1.043224
 -0.698863	 -0.127612	  1.054720
 -0.692431	 -0.139230	  1.063073
 -0.684019	 -0.157568	  1.073868
 -0.676067	 -0.176678	  1.083939
 -0.669461	 -0.188757	  1.090249
 -0.661623	 -0.202890	  1.099763
 -0.648740	 -0.224408	  1.111820
 -0.644017	 -0.233829	  1.115218
 -0.631339	 -0.251845	  1.122429
 -0.616165	 -0.275714	  1.130832
 -0.612042	 -0.286306	  1.134870
 -0.604366	 -0.299149	  1.140645
 -0.589653	 -0.322457	  1.150279
 -0.583107	 -0.334108	  1.156646
 -0.572501	 -0.351050	  1.165997
 -0.565109	 -0.366031	  1.173410
 -0.557988	 -0.382555	  1.180013
 -0.548809	 -0.400705	  1.186864
 -0.539010	 -0.418603	  1.195329
 -0.529623	 -0.435860	  1.203364
 -0.524640	 -0.448325	  1.211735
 -0.520930	 -0.462334	  1.228091
 -0.511430	 -0.477722	  1.239583
 -0.502216	 -0.493204	  1.248401
 -0.494028	 -0.509878	  1.256338
 -0.485960	 -0.526260	  1.264930
 -0.477285	 -0.541217	  1.275471
 -0.469235	 -0.555177	  1.287552
 -0.461251	 -0.570045	  1.298378
 -0.454132	 -0.586042	  1.308397
 -0.447694	 -0.602282	  1.318535
 -0.442261	 -0.618615	  1.329374
 -0.438382	 -0.634520	  1.340416
 -0.435256	 -0.646824	  1.352572
 -0.433636	 -0.660279	  1.375331
 -0.431219	 -0.675782	  1.386953
 -0.429903	 -0.694910	  1.393349
 -0.431702	 -0.714451	  1.400329
 -0.431033	 -0.733088	  1.409935
 -0.429278	 -0.746289	  1.418467
 -0.427934	 -0.766615	  1.435901
 -0.428361	 -0.780628	  1.448143
 -0.427492	 -0.790963	  1.456904
 -0.426718	 -0.812456	  1.474019
 -0.425645	 -0.830165	  1.486305
 -0.422639	 -0.848021	  1.495632
 -0.417784	 -0.867127	  1.504084
 -0.413592	 -0.880537	  1.510147
 -0.406389	 -0.897116	  1.521320
 -0.397801	 -0.912558	  1.527368
 -0.392359	 -0.932684	  1.536946
 -0.388875	 -0.951933	  1.540125
 -0.384757	 -0.969586	  1.540207
 -0.370734	 -0.996926	  1.555941
 -0.362203	 -1.012320	  1.568904
 -0.359233	 -1.017831	  1.572272
 -0.350411	 -1.034504	  1.583883
 -0.342011	 -1.055808	  1.592693
 -0.336149	 -1.069511	  1.597962
 -0.326307	 -1.086933	  1.603674
 -0.316308	 -1.104576	  1.609513
 -0.307436	 -1.118104	  1.616300
 -0.295438	 -1.134468	  1.623597
 -0.285549	 -1.151355	  1.630795
 -0.276861	 -1.165531	  1.636767
 -0.265638	 -1.183263	  1.643196
 -0.254292	 -1.200927	  1.652352
 -0.241057	 -1.212734	  1.661372
 -0.222505	 -1.221149	  1.671695
 -0.208151	 -1.231144	  1.683937
 -0.200350	 -1.247252	  1.693749
 -0.192189	 -1.263765	  1.698740
 -0.179297	 -1.278052	  1.706946
 -0.165924	 -1.288476	  1.726759
 -0.161534	 -1.301144	  1.749483
 -0.162015	 -1.310218	  1.762780
 -0.155407	 -1.327530	  1.774406
 -0.147941	 -1.345230	  1.780977
 -0.140598	 -1.363670	  1.790025
 -0.137470	 -1.381139	  1.801574
 -0.133994	 -1.397872	  1.811868
 -0.127865	 -1.414417	  1.821408
 -0.120249	 -1.429639	  1.832104
 -0.113009	 -1.444293	  1.843878
 -0.106662	 -1.459358	  1.855866
 -0.100778	 -1.475039	  1.867334
 -0.096488	 -1.491626	  1.877483
 -0.092299	 -1.508396	  1.887040
 -0.087706	 -1.525576	  1.896639
 -0.082613	 -1.542843	  1.906068
 -0.075526	 -1.563361	  1.917811
 -0.067773	 -1.585533	  1.931707
 -0.064772	 -1.594116	  1.937087
