 -1.942393	 -1.394240	  0.761222
 -1.931470	 -1.394689	  0.757803
 -1.924273	 -1.394985	  0.755550
 -1.905817	 -1.397799	  0.749582
 -1.886752	 -1.400656	  0.742692
 -1.866934	 -1.400871	  0.737873
 -1.845183	 -1.400734	  0.731604
 -1.831140	 -1.399058	  0.721140
 -1.814416	 -1.398327	  0.712117
 -1.793263	 -1.395242	  0.701696
 -1.776446	 -1.394477	  0.693133
 -1.759630	 -1.395679	  0.683878
 -1.741783	 -1.395632	  0.676071
 -1.723018	 -1.396493	  0.672152
 -1.699981	 -1.399393	  0.664538
 -1.683077	 -1.400781	  0.654149
 -1.669556	 -1.402137	  0.640714
 -1.650971	 -1.399063	  0.630724
 -1.631448	 -1.398474	  0.623981
 -1.615181	 -1.395448	  0.619409
 -1.595695	 -1.391856	  0.613047
 -1.574904	 -1.390507	  0.602887
 -1.557525	 -1.391351	  0.591790
 -1.542869	 -1.386817	  0.581289
 -1.525656	 -1.381021	  0.573475
 -1.508209	 -1.375442	  0.566329
 -1.490595	 -1.372169	  0.559360
 -1.469146	 -1.367421	  0.548368
 -1.451412	 -1.363354	  0.540689
 -1.436468	 -1.358278	  0.533117
 -1.419037	 -1.353060	  0.522781
 -1.403951	 -1.342581	  0.515086
 -1.387771	 -1.332894	  0.508061
 -1.369341	 -1.321551	  0.498836
 -1.356429	 -1.314887	  0.492292
 -1.338784	 -1.307167	  0.483609
 -1.321621	 -1.296734	  0.475230
 -1.308650	 -1.285418	  0.468848
 -1.295303	 -1.273100	  0.461097
 -1.275883	 -1.264500	  0.451880
 -1.259913	 -1.259686	  0.441995
 -1.246260	 -1.252340	  0.429032
 -1.231040	 -1.241998	  0.419940
 -1.213912	 -1.235018	  0.412545
 -1.198335	 -1.229986	  0.402251
 -1.181871	 -1.226747	  0.388961
 -1.164137	 -1.221273	  0.378818
 -1.149524	 -1.213584	  0.371508
 -1.132157	 -1.207489	  0.362331
 -1.112618	 -1.201245	  0.356092
 -1.094725	 -1.190993	  0.351455
 -1.080135	 -1.179514	  0.345613
 -1.066234	 -1.167942	  0.337772
 -1.051339	 -1.155138	  0.332596
 -1.036697	 -1.141672	  0.329604
 -1.019854	 -1.129234	  0.326024
 -1.004850	 -1.118022	  0.323428
 -0.989156	 -1.110267	  0.317736
 -0.962955	 -1.105292	  0.309377
 -0.945157	 -1.100416	  0.310580
 -0.929049	 -1.092019	  0.306737
 -0.914678	 -1.079005	  0.303631
 -0.902110	 -1.063423	  0.302949
 -0.886468	 -1.047484	  0.304279
 -0.872787	 -1.034068	  0.304404
 -0.855245	 -1.022588	  0.308863
 -0.838338	 -1.013037	  0.307813
 -0.824703	 -1.005139	  0.303103
 -0.807767	 -0.992072	  0.303097
 -0.784891	 -0.981054	  0.301433
 -0.766834	 -0.978146	  0.296789
 -0.746149	 -0.975754	  0.291665
 -0.726383	 -0.960094	  0.302370
 -0.714810	 -0.946403	  0.315533
 -0.703299	 -0.930180	  0.322698
 -0.683673	 -0.921669	  0.324597
 -0.663580	 -0.920122	  0.321263
 -0.641713	 -0.915460	  0.316252
 -0.622050	 -0.909790	  0.312444
 -0.605779	 -0.904314	  0.312229
 -0.584607	 -0.902637	  0.304976
 -0.562102	 -0.906137	  0.299376
 -0.547342	 -0.908676	  0.294781
 -0.529043	 -0.910439	  0.285365
 -0.509862	 -0.909135	  0.279582
 -0.491448	 -0.909021	  0.275023
 -0.472782	 -0.911353	  0.268309
 -0.454820	 -0.917803	  0.260446
 -0.437858	 -0.920791	  0.255389
 -0.419067	 -0.927882	  0.244416
 -0.401855	 -0.931209	  0.237272
 -0.383785	 -0.935378	  0.230301
 -0.364374	 -0.941622	  0.221293
 -0.353796	 -0.950991	  0.211229
 -0.340129	 -0.960825	  0.198330
 -0.328023	 -0.970076	  0.184897
 -0.314584	 -0.979520	  0.172175
 -0.296287	 -0.987659	  0.164914
 -0.277564	 -0.991269	  0.158428
 -0.260653	 -0.994265	  0.147666
 -0.246012	 -1.000294	  0.135445
 -0.231372	 -1.008468	  0.123515
 -0.213473	 -1.013194	  0.114599
 -0.196082	 -1.016295	  0.104936
 -0.180658	 -1.024388	  0.095667
 -0.163708	 -1.033522	  0.086351
 -0.147270	 -1.036777	  0.076101
 -0.132718	 -1.040542	  0.063577
 -0.120886	 -1.043066	  0.047379
 -0.103413	 -1.042975	  0.031072
 -0.083786	 -1.042659	  0.025677
 -0.056958	 -1.043979	  0.021175
 -0.047456	 -1.045215	  0.011809
 -0.035662	 -1.047169	 -0.004532
 -0.023189	 -1.048410	 -0.019747
 -0.003492	 -1.050428	 -0.038582
  0.012193	 -1.048902	 -0.048445
  0.030285	 -1.048889	 -0.053399
  0.047558	 -1.052261	 -0.064141
  0.065055	 -1.053520	 -0.077071
  0.078590	 -1.051290	 -0.086291
  0.094832	 -1.051360	 -0.100127
  0.110659	 -1.054217	 -0.116198
  0.127972	 -1.054348	 -0.126117
  0.144366	 -1.051331	 -0.132809
  0.163007	 -1.048058	 -0.142500
  0.180825	 -1.044396	 -0.151682
  0.198289	 -1.041026	 -0.160855
  0.215002	 -1.034831	 -0.169922
  0.231551	 -1.028272	 -0.179030
  0.244441	 -1.019499	 -0.191543
  0.254438	 -1.010860	 -0.206555
  0.263037	 -1.002730	 -0.222678
  0.270398	 -0.995702	 -0.239894
  0.277771	 -0.988842	 -0.257173
  0.285326	 -0.983720	 -0.274968
  0.292881	 -0.978610	 -0.292767
  0.300648	 -0.973890	 -0.310583
  0.309205	 -0.970720	 -0.328379
  0.317710	 -0.967548	 -0.346156
  0.325159	 -0.963982	 -0.364316
  0.331724	 -0.960905	 -0.382024
  0.342191	 -0.958297	 -0.399589
  0.356181	 -0.956498	 -0.416065
  0.369997	 -0.955685	 -0.433123
  0.379686	 -0.957597	 -0.449375
  0.387910	 -0.958799	 -0.465362
  0.396588	 -0.956125	 -0.484432
  0.406689	 -0.955426	 -0.501965
  0.419174	 -0.955169	 -0.516726
  0.429962	 -0.950778	 -0.533863
  0.441241	 -0.948796	 -0.551276
  0.455081	 -0.955128	 -0.567355
  0.468374	 -0.955096	 -0.581837
  0.478530	 -0.949701	 -0.596680
  0.492304	 -0.947995	 -0.612802
  0.504958	 -0.950293	 -0.627770
  0.518315	 -0.952912	 -0.642805
  0.532676	 -0.954518	 -0.658361
  0.549096	 -0.953707	 -0.669044
  0.565853	 -0.951971	 -0.680190
  0.582076	 -0.950456	 -0.692142
  0.596929	 -0.949807	 -0.705254
  0.612077	 -0.949591	 -0.719064
  0.628628	 -0.949950	 -0.731885
  0.645633	 -0.949965	 -0.742532
  0.663264	 -0.946979	 -0.749708
  0.680852	 -0.943483	 -0.759836
  0.698998	 -0.942825	 -0.769399
  0.717326	 -0.943334	 -0.777038
  0.735867	 -0.943699	 -0.784597
  0.754305	 -0.943592	 -0.792574
  0.772989	 -0.944116	 -0.799685
  0.791646	 -0.944548	 -0.806885
  0.810587	 -0.946066	 -0.813125
  0.829608	 -0.947974	 -0.819001
  0.848649	 -0.950048	 -0.824762
  0.867755	 -0.953841	 -0.829296
  0.886837	 -0.957637	 -0.833811
  0.905648	 -0.962046	 -0.837128
  0.923998	 -0.967725	 -0.838182
  0.945181	 -0.974791	 -0.841480
  0.962510	 -0.980868	 -0.847557
  0.979339	 -0.987396	 -0.853491
  0.998298	 -0.995256	 -0.859305
  1.015545	 -1.001319	 -0.863405
  1.032823	 -1.009439	 -0.870437
  1.050277	 -1.019369	 -0.876806
  1.067107	 -1.028956	 -0.878824
  1.085863	 -1.039251	 -0.878197
  1.103934	 -1.047810	 -0.882821
  1.117107	 -1.056644	 -0.891070
  1.133649	 -1.068032	 -0.900232
  1.151941	 -1.077365	 -0.907137
  1.168600	 -1.084965	 -0.913828
  1.186282	 -1.091140	 -0.917452
  1.204322	 -1.098703	 -0.920684
  1.222753	 -1.105840	 -0.926589
  1.239192	 -1.113541	 -0.933813
  1.256741	 -1.121276	 -0.941623
  1.275491	 -1.126821	 -0.950824
  1.292330	 -1.129586	 -0.954376
  1.311857	 -1.134110	 -0.960652
  1.330492	 -1.137796	 -0.967275
  1.349615	 -1.138747	 -0.970784
  1.370924	 -1.138854	 -0.975487
  1.389685	 -1.140491	 -0.983217
  1.405350	 -1.142280	 -0.989034
  1.425937	 -1.142460	 -0.995459
  1.446135	 -1.141790	 -1.000852
  1.466126	 -1.139781	 -1.000227
  1.487043	 -1.137052	 -0.997340
  1.506181	 -1.135249	 -0.999728
  1.525783	 -1.132256	 -1.000239
  1.545704	 -1.128523	 -0.997813
  1.565239	 -1.125672	 -0.999016
  1.584699	 -1.121544	 -0.998175
  1.603980	 -1.116686	 -0.994450
  1.623185	 -1.112313	 -0.993851
  1.643125	 -1.107191	 -0.992074
  1.660868	 -1.101245	 -0.986439
  1.678412	 -1.094416	 -0.982365
  1.700120	 -1.087805	 -0.978500
  1.717923	 -1.082340	 -0.970919
  1.731546	 -1.074885	 -0.963759
  1.748060	 -1.064361	 -0.955412
  1.764267	 -1.054852	 -0.947674
  1.780528	 -1.045922	 -0.940084
  1.795573	 -1.035170	 -0.932464
  1.810517	 -1.024279	 -0.924844
  1.825461	 -1.013386	 -0.917228
  1.840433	 -1.002058	 -0.910335
  1.855347	 -0.989770	 -0.905164
  1.870385	 -0.977561	 -0.900179
  1.885501	 -0.965405	 -0.895456
  1.901243	 -0.953860	 -0.893512
  1.917723	 -0.942614	 -0.890997
  1.934598	 -0.932395	 -0.893057
  1.951759	 -0.918635	 -0.899139
  1.964797	 -0.906601	 -0.901074
  1.980891	 -0.894652	 -0.902726
  1.997750	 -0.884162	 -0.907945
  2.015095	 -0.877725	 -0.914655
  2.033833	 -0.872339	 -0.921645
  2.050707	 -0.865198	 -0.930029
  2.067067	 -0.856488	 -0.935134
  2.085616	 -0.849909	 -0.942578
  2.102834	 -0.844519	 -0.951962
  2.119566	 -0.841656	 -0.961162
  2.144807	 -0.835468	 -0.975600
  2.153417	 -0.833611	 -0.981219
