 -1.667453	 -0.922832	  1.641560
 -1.684553	 -0.895010	  1.664674
 -1.675690	 -0.909206	  1.653723
 -1.666389	 -0.923783	  1.643674
 -1.657088	 -0.938361	  1.633624
 -1.647372	 -0.953146	  1.624298
 -1.637525	 -0.967992	  1.615207
 -1.627615	 -0.982861	  1.606223
 -1.617394	 -0.997829	  1.597768
 -1.607173	 -1.012797	  1.589313
 -1.596821	 -1.027832	  1.581141
 -1.586396	 -1.042905	  1.573133
 -1.575969	 -1.057999	  1.565168
 -1.565536	 -1.073219	  1.557454
 -1.555104	 -1.088439	  1.549740
 -1.545010	 -1.103860	  1.541972
 -1.535057	 -1.119361	  1.534183
 -1.525400	 -1.134905	  1.526115
 -1.516518	 -1.150533	  1.517346
 -1.507636	 -1.166160	  1.508578
 -1.499756	 -1.181589	  1.498584
 -1.492020	 -1.196981	  1.488424
 -1.484732	 -1.211960	  1.477356
 -1.477962	 -1.226430	  1.465323
 -1.471209	 -1.240866	  1.453240
 -1.465077	 -1.254087	  1.439543
 -1.458944	 -1.267308	  1.425846
 -1.452760	 -1.279896	  1.411588
 -1.446537	 -1.291837	  1.396800
 -1.440313	 -1.303777	  1.382011
 -1.433817	 -1.314713	  1.366578
 -1.427274	 -1.325466	  1.351035
 -1.420713	 -1.335954	  1.335320
 -1.414087	 -1.345144	  1.318839
 -1.407460	 -1.354334	  1.302357
 -1.400695	 -1.362502	  1.285401
 -1.393833	 -1.369821	  1.268100
 -1.386972	 -1.377140	  1.250798
 -1.379589	 -1.383827	  1.233455
 -1.372193	 -1.390497	  1.216111
 -1.364606	 -1.397601	  1.199024
 -1.356727	 -1.405386	  1.182371
 -1.348848	 -1.413171	  1.165718
 -1.340693	 -1.422295	  1.149899
 -1.332475	 -1.431762	  1.134316
 -1.324238	 -1.441635	  1.118997
 -1.315976	 -1.453111	  1.104853
 -1.307715	 -1.464588	  1.090710
 -1.299762	 -1.477096	  1.077283
 -1.292020	 -1.490229	  1.064337
 -1.284320	 -1.503482	  1.051488
 -1.277069	 -1.517905	  1.039682
 -1.269818	 -1.532329	  1.027876
 -1.262826	 -1.547293	  1.016598
 -1.256028	 -1.562634	  1.005716
 -1.249230	 -1.578007	  0.994877
 -1.242421	 -1.593735	  0.984570
 -1.235612	 -1.609464	  0.974262
 -1.228571	 -1.625160	  0.964061
 -1.221293	 -1.640820	  0.953971
 -1.214016	 -1.656479	  0.943881
 -1.206231	 -1.671830	  0.933695
 -1.198417	 -1.687163	  0.923504
 -1.190320	 -1.702239	  0.913153
 -1.181799	 -1.716915	  0.902569
 -1.173279	 -1.731590	  0.891984
 -1.164058	 -1.745495	  0.880956
 -1.154599	 -1.759118	  0.869779
 -1.145116	 -1.772712	  0.858586
 -1.134839	 -1.785212	  0.846833
 -1.124562	 -1.797713	  0.835080
 -1.113948	 -1.809936	  0.823335
 -1.102583	 -1.821506	  0.811632
 -1.091218	 -1.833075	  0.799928
 -1.079127	 -1.844402	  0.788725
 -1.066593	 -1.855564	  0.777848
 -1.054095	 -1.866857	  0.767065
 -1.042019	 -1.879429	  0.757262
 -1.029942	 -1.892002	  0.747459
 -1.018876	 -1.906492	  0.739239
 -1.008150	 -1.921503	  0.731518
 -0.997736	 -1.937101	  0.724572
 -0.987780	 -1.953416	  0.718680
 -0.977854	 -1.969748	  0.712786
 -0.969334	 -1.986833	  0.706827
 -0.960813	 -2.003917	  0.700867
 -0.952886	 -2.021085	  0.694354
 -0.945255	 -2.038284	  0.687572
 -0.937554	 -2.055336	  0.680508
 -0.929607	 -2.071793	  0.672383
 -0.921659	 -2.088249	  0.664258
 -0.913101	 -2.103860	  0.655144
 -0.904121	 -2.118796	  0.645333
 -0.895140	 -2.133733	  0.635521
 -0.885426	 -2.147609	  0.624888
 -0.875606	 -2.161320	  0.614137
 -0.865679	 -2.174882	  0.603297
 -0.855102	 -2.187480	  0.591920
 -0.844525	 -2.200077	  0.580543
 -0.833683	 -2.212276	  0.568982
 -0.822463	 -2.223869	  0.557162
 -0.811243	 -2.235461	  0.545341
 -0.799961	 -2.246807	  0.533343
 -0.788660	 -2.258079	  0.521291
 -0.777390	 -2.269440	  0.509294
 -0.766221	 -2.281079	  0.497471
 -0.755052	 -2.292718	  0.485648
 -0.744633	 -2.304752	  0.473539
 -0.734389	 -2.316873	  0.461368
 -0.724547	 -2.328836	  0.448718
 -0.715292	 -2.340554	  0.435412
 -0.706037	 -2.352271	  0.422106
 -0.697040	 -2.363486	  0.408204
 -0.688058	 -2.374673	  0.394269
 -0.679145	 -2.385797	  0.380240
 -0.670326	 -2.396835	  0.366084
 -0.661508	 -2.407874	  0.351928
 -0.652574	 -2.419081	  0.337479
 -0.643910	 -2.430022	  0.323153
