 -1.990226	  1.419299	 -1.790389
 -1.970521	  1.405246	 -1.772662
 -1.939593	  1.377851	 -1.739251
 -1.912620	  1.343230	 -1.713586
 -1.890329	  1.315395	 -1.678603
 -1.870421	  1.285589	 -1.641183
 -1.846024	  1.254717	 -1.608142
 -1.820257	  1.223665	 -1.579379
 -1.795435	  1.193573	 -1.550354
 -1.770982	  1.162492	 -1.519579
 -1.746965	  1.129152	 -1.491060
 -1.723585	  1.095882	 -1.463954
 -1.698407	  1.062253	 -1.436791
 -1.668959	  1.028252	 -1.411497
 -1.636978	  0.993988	 -1.390057
 -1.604798	  0.960857	 -1.370965
 -1.574753	  0.927564	 -1.352372
 -1.548419	  0.890957	 -1.332046
 -1.521918	  0.854707	 -1.308175
 -1.492145	  0.823008	 -1.281030
 -1.462062	  0.793018	 -1.253442
 -1.431535	  0.763084	 -1.225328
 -1.402613	  0.733010	 -1.197457
 -1.375129	  0.701860	 -1.169048
 -1.349698	  0.670268	 -1.139114
 -1.325935	  0.637048	 -1.107027
 -1.304554	  0.602855	 -1.076208
 -1.284757	  0.568185	 -1.047473
 -1.264688	  0.533805	 -1.019339
 -1.243269	  0.498942	 -0.990788
 -1.220320	  0.464149	 -0.963360
 -1.195040	  0.429695	 -0.937800
 -1.166199	  0.395274	 -0.913300
 -1.135608	  0.362459	 -0.888994
 -1.103506	  0.330883	 -0.863747
 -1.071009	  0.300541	 -0.838107
 -1.039780	  0.270513	 -0.811582
 -1.011536	  0.239826	 -0.783340
 -0.986815	  0.209080	 -0.754869
 -0.963976	  0.177491	 -0.726602
 -0.941469	  0.144404	 -0.698295
 -0.918489	  0.109300	 -0.669916
 -0.895693	  0.073535	 -0.642867
 -0.873237	  0.038729	 -0.617730
 -0.850534	  0.003949	 -0.592772
 -0.825908	 -0.033203	 -0.566637
 -0.801375	 -0.070340	 -0.539045
 -0.777474	 -0.104855	 -0.508450
 -0.752775	 -0.135550	 -0.477142
 -0.728113	 -0.164693	 -0.448215
 -0.702101	 -0.195490	 -0.419578
 -0.675146	 -0.226109	 -0.390456
 -0.647384	 -0.256575	 -0.360984
 -0.619588	 -0.287701	 -0.331542
 -0.593318	 -0.319776	 -0.302568
 -0.570063	 -0.351250	 -0.276033
 -0.547655	 -0.385171	 -0.250608
 -0.523220	 -0.421161	 -0.225803
 -0.497683	 -0.457745	 -0.200201
 -0.471744	 -0.494743	 -0.174201
 -0.446097	 -0.530371	 -0.148884
 -0.420755	 -0.565627	 -0.122562
 -0.393683	 -0.598955	 -0.094291
 -0.364867	 -0.629026	 -0.064753
 -0.334661	 -0.656425	 -0.034456
 -0.303515	 -0.681640	 -0.003929
 -0.271955	 -0.705791	  0.026910
 -0.240226	 -0.729542	  0.057446
 -0.208982	 -0.753173	  0.086747
 -0.177716	 -0.777775	  0.115275
 -0.145733	 -0.804527	  0.143664
 -0.113556	 -0.833706	  0.172040
 -0.083887	 -0.863283	  0.198559
 -0.055422	 -0.893339	  0.223836
 -0.025352	 -0.924339	  0.249813
  0.005212	 -0.952239	  0.272368
  0.036696	 -0.975333	  0.290327
  0.073474	 -0.994852	  0.304899
  0.136004	 -1.017589	  0.319427
  0.236890	 -1.045841	  0.320592
  0.325862	 -1.073003	  0.294722
  0.386180	 -1.061055	  0.314034
  0.405038	 -1.133330	  0.309775
  0.472228	 -1.156129	  0.314457
  0.514105	 -1.198964	  0.307208
  0.540943	 -1.241732	  0.319051
  0.553140	 -1.272249	  0.363419
  0.566942	 -1.302773	  0.425558
  0.587026	 -1.334637	  0.475165
  0.597655	 -1.360375	  0.507606
  0.595808	 -1.385727	  0.538250
  0.575525	 -1.418120	  0.581377
  0.537360	 -1.454073	  0.638009
  0.504114	 -1.500585	  0.711765
  0.501023	 -1.556033	  0.790272
  0.515912	 -1.600952	  0.843209
  0.534082	 -1.634905	  0.880825
  0.553568	 -1.667704	  0.914856
  0.574247	 -1.702663	  0.946926
  0.594726	 -1.738176	  0.976306
  0.615291	 -1.774219	  1.003559
  0.636624	 -1.811322	  1.030348
  0.658717	 -1.848931	  1.056553
  0.680159	 -1.884771	  1.081179
  0.701999	 -1.920298	  1.105815
  0.726158	 -1.956515	  1.131236
  0.753070	 -1.991283	  1.156833
  0.782111	 -2.023762	  1.182552
  0.813015	 -2.054848	  1.209269
  0.842826	 -2.085911	  1.236503
  0.871220	 -2.117454	  1.264293
  0.897720	 -2.148641	  1.292328
  0.921831	 -2.178609	  1.320336
  0.949725	 -2.208884	  1.346259
  0.975695	 -2.244687	  1.374195
  1.005275	 -2.275690	  1.403950
  1.033484	 -2.305094	  1.433541
  1.059762	 -2.340048	  1.455202
  1.077251	 -2.376416	  1.480600
  1.088023	 -2.400181	  1.495406
