 -0.266189	  3.016574	 -0.101608
 -0.263553	  2.986707	 -0.100602
 -0.271288	  2.951380	 -0.072288
 -0.286983	  2.912464	 -0.053578
 -0.307858	  2.870508	 -0.031317
 -0.321635	  2.827102	 -0.004649
 -0.337314	  2.787648	  0.013077
 -0.353029	  2.743930	  0.039883
 -0.373052	  2.699110	  0.061045
 -0.391517	  2.660472	  0.084361
 -0.402151	  2.620223	  0.105668
 -0.424877	  2.580481	  0.127072
 -0.437861	  2.536440	  0.148188
 -0.459653	  2.498262	  0.172975
 -0.476603	  2.453745	  0.195473
 -0.490488	  2.415404	  0.214664
 -0.507859	  2.373010	  0.237759
 -0.525063	  2.330500	  0.260833
 -0.543195	  2.291031	  0.283137
 -0.559875	  2.252366	  0.306376
 -0.576025	  2.215905	  0.328840
 -0.594747	  2.174650	  0.352445
 -0.613373	  2.133949	  0.375776
 -0.632097	  2.091473	  0.399262
 -0.649031	  2.051853	  0.421275
 -0.667008	  2.008797	  0.442583
 -0.682886	  1.967471	  0.464425
 -0.698611	  1.925828	  0.486546
 -0.712995	  1.885958	  0.508760
 -0.727485	  1.846847	  0.531713
 -0.742074	  1.803717	  0.557505
 -0.756499	  1.759782	  0.581774
 -0.770297	  1.718278	  0.603646
 -0.785326	  1.673608	  0.625370
 -0.800539	  1.632706	  0.645188
 -0.817463	  1.592678	  0.666582
 -0.835130	  1.551099	  0.690067
 -0.852787	  1.509428	  0.712973
 -0.875750	  1.469804	  0.733391
 -0.905558	  1.448338	  0.739730
 -1.025073	  1.425057	  0.730216
 -1.149007	  1.414794	  0.737957
 -1.235699	  1.367077	  0.704090
 -1.233010	  1.309237	  0.698247
 -1.324163	  1.266971	  0.744877
 -1.344052	  1.257384	  0.752773
 -1.369794	  1.233973	  0.768304
 -1.427049	  1.189302	  0.779324
 -1.508512	  1.137899	  0.777685
 -1.458133	  1.073614	  0.863409
 -1.399072	  1.013610	  0.884689
 -1.388586	  0.979167	  0.898181
 -1.406581	  0.949933	  0.956258
 -1.382708	  0.912984	  0.992858
 -1.315586	  0.863020	  1.018446
 -1.188211	  0.789616	  1.104799
 -1.176632	  0.733874	  1.141968
 -1.186625	  0.690917	  1.165597
 -1.202103	  0.648148	  1.187821
 -1.216329	  0.611903	  1.206096
 -1.233214	  0.568397	  1.228194
 -1.249889	  0.522641	  1.249546
 -1.265078	  0.481280	  1.268717
 -1.281047	  0.441382	  1.287850
 -1.298758	  0.397434	  1.308605
 -1.316518	  0.356123	  1.329214
 -1.334564	  0.316995	  1.349920
 -1.353476	  0.274356	  1.375151
 -1.370007	  0.234669	  1.399392
 -1.386690	  0.191444	  1.424602
 -1.400585	  0.151252	  1.446154
 -1.414421	  0.111853	  1.468235
 -1.429282	  0.074530	  1.491346
 -1.445573	  0.033047	  1.516150
 -1.466273	 -0.012913	  1.541401
 -1.482936	 -0.055566	  1.564834
 -1.498685	 -0.092781	  1.583107
 -1.514459	 -0.135633	  1.602825
 -1.532618	 -0.174075	  1.620831
 -1.547960	 -0.218109	  1.645281
 -1.564356	 -0.256914	  1.675284
 -1.575460	 -0.296409	  1.691476
 -1.593676	 -0.341505	  1.709888
 -1.617270	 -0.378300	  1.735578
 -1.631724	 -0.423474	  1.762112
 -1.648574	 -0.466389	  1.784501
 -1.661554	 -0.508215	  1.807371
 -1.679014	 -0.549112	  1.830076
 -1.691808	 -0.586411	  1.848724
 -1.708538	 -0.631014	  1.873581
 -1.725566	 -0.673642	  1.897604
 -1.742669	 -0.712435	  1.918928
 -1.760815	 -0.752197	  1.940901
 -1.776578	 -0.792579	  1.962532
 -1.789906	 -0.834051	  1.982811
 -1.807875	 -0.873163	  2.008767
 -1.827388	 -0.915016	  2.033145
 -1.842067	 -0.954943	  2.048683
 -1.857581	 -0.997142	  2.076299
 -1.881873	 -1.045014	  2.089617
 -1.900692	 -1.055464	  2.110513
