 -0.253006	 -2.012092	  1.321725
 -0.248662	 -2.050189	  1.297565
 -0.250860	 -2.033162	  1.307822
 -0.253126	 -2.016078	  1.317973
 -0.255448	 -1.998984	  1.328087
 -0.259641	 -1.981727	  1.337279
 -0.263884	 -1.964445	  1.346414
 -0.268342	 -1.947229	  1.355562
 -0.275485	 -1.930698	  1.364247
 -0.282695	 -1.914131	  1.372830
 -0.289855	 -1.897575	  1.381471
 -0.299076	 -1.882117	  1.390175
 -0.308348	 -1.866648	  1.398831
 -0.317725	 -1.851522	  1.407425
 -0.330300	 -1.838406	  1.415597
 -0.345271	 -1.826991	  1.423535
 -0.354105	 -1.808834	  1.433634
 -0.357912	 -1.790286	  1.441583
 -0.365600	 -1.773437	  1.448830
 -0.376794	 -1.759343	  1.456917
 -0.384579	 -1.743606	  1.465564
 -0.395076	 -1.728602	  1.475509
 -0.406169	 -1.716047	  1.487579
 -0.413223	 -1.697636	  1.497608
 -0.411063	 -1.678513	  1.503618
 -0.407420	 -1.659184	  1.510347
 -0.410549	 -1.636015	  1.523630
 -0.414236	 -1.626948	  1.531201
 -0.418261	 -1.610044	  1.547222
 -0.417301	 -1.590535	  1.559199
 -0.418469	 -1.573386	  1.565332
 -0.425192	 -1.560070	  1.575298
 -0.430812	 -1.543315	  1.588276
 -0.432015	 -1.524842	  1.595619
 -0.433823	 -1.505144	  1.606133
 -0.437431	 -1.490418	  1.619882
 -0.442263	 -1.478305	  1.629352
 -0.448286	 -1.459888	  1.639151
 -0.454924	 -1.442193	  1.647060
 -0.462429	 -1.424504	  1.655443
 -0.471310	 -1.408567	  1.664085
 -0.480905	 -1.394327	  1.675656
 -0.488356	 -1.381773	  1.691847
 -0.490021	 -1.368334	  1.709532
 -0.490163	 -1.354323	  1.725062
 -0.490156	 -1.338236	  1.734318
 -0.493355	 -1.320681	  1.745220
 -0.497018	 -1.302969	  1.754050
 -0.499389	 -1.284412	  1.762979
 -0.502838	 -1.267088	  1.771039
 -0.505139	 -1.248857	  1.781999
 -0.509506	 -1.234268	  1.794107
 -0.510495	 -1.220336	  1.813116
 -0.508459	 -1.205967	  1.825628
 -0.508458	 -1.187687	  1.833303
 -0.510213	 -1.168807	  1.841089
 -0.513176	 -1.150940	  1.850210
 -0.516564	 -1.133727	  1.859985
 -0.520473	 -1.116525	  1.869511
 -0.525614	 -1.099005	  1.877207
 -0.530803	 -1.080751	  1.883175
 -0.535984	 -1.062394	  1.888864
 -0.540009	 -1.044750	  1.901158
 -0.543064	 -1.030644	  1.920113
 -0.547137	 -1.017349	  1.931358
 -0.552651	 -0.998603	  1.941799
 -0.558512	 -0.980842	  1.946023
 -0.564897	 -0.962413	  1.949958
 -0.573616	 -0.943839	  1.955175
 -0.582312	 -0.926283	  1.958522
 -0.588205	 -0.908065	  1.965201
 -0.592083	 -0.890106	  1.973174
 -0.593814	 -0.871763	  1.980954
 -0.595465	 -0.853406	  1.988720
 -0.597696	 -0.835371	  1.997071
 -0.600327	 -0.817578	  2.005818
 -0.602957	 -0.799785	  2.014564
 -0.606306	 -0.782574	  2.024184
 -0.610261	 -0.765917	  2.034523
 -0.614210	 -0.749258	  2.044863
 -0.619191	 -0.732988	  2.055373
 -0.625669	 -0.717383	  2.066077
 -0.632139	 -0.701775	  2.076778
 -0.639184	 -0.686604	  2.087740
 -0.647303	 -0.672449	  2.099158
 -0.656297	 -0.660566	  2.111118
 -0.667963	 -0.647669	  2.124649
 -0.679933	 -0.634826	  2.135198
 -0.685063	 -0.615031	  2.144838
 -0.684187	 -0.599978	  2.155379
 -0.684584	 -0.585770	  2.169442
 -0.689705	 -0.564859	  2.182344
 -0.699153	 -0.550190	  2.189332
 -0.707229	 -0.537718	  2.200609
 -0.711913	 -0.521432	  2.213118
 -0.719282	 -0.505357	  2.222935
 -0.730136	 -0.492039	  2.233320
 -0.739470	 -0.475489	  2.242968
 -0.741845	 -0.459422	  2.252722
 -0.743738	 -0.443843	  2.263449
 -0.749140	 -0.420347	  2.273793
 -0.757464	 -0.405505	  2.282980
 -0.762648	 -0.388528	  2.292193
