  0.659886	  2.479906	  0.230490
  0.653862	  2.495752	  0.226716
  0.660995	  2.477655	  0.231423
  0.668091	  2.459463	  0.235705
  0.675374	  2.441382	  0.239825
  0.683915	  2.424844	  0.244190
  0.693758	  2.409486	  0.248302
  0.695559	  2.391638	  0.254942
  0.697901	  2.362468	  0.264705
  0.708513	  2.345957	  0.265671
  0.716892	  2.333853	  0.265525
  0.734857	  2.317852	  0.261252
  0.750712	  2.299420	  0.260286
  0.760105	  2.287963	  0.262450
  0.772756	  2.269807	  0.268065
  0.780471	  2.250768	  0.272853
  0.784270	  2.232299	  0.275280
  0.793757	  2.214413	  0.273384
  0.806808	  2.203903	  0.273751
  0.826730	  2.192764	  0.276246
  0.849636	  2.177264	  0.278158
  0.858778	  2.168463	  0.280216
  0.870752	  2.152359	  0.276994
  0.881797	  2.132391	  0.271813
  0.889835	  2.112900	  0.266190
  0.895921	  2.096564	  0.262792
  0.913274	  2.075720	  0.262510
  0.928066	  2.065458	  0.262551
  0.946928	  2.055412	  0.262527
  0.966316	  2.045661	  0.256057
  0.980455	  2.039451	  0.244510
  0.998793	  2.032301	  0.228610
  1.016303	  2.024181	  0.218675
  1.028036	  2.019112	  0.210803
  1.045961	  2.007981	  0.207470
  1.060908	  1.994832	  0.204491
  1.076621	  1.979978	  0.197478
  1.091337	  1.966610	  0.191979
  1.102706	  1.955163	  0.188234
  1.122867	  1.944790	  0.179467
  1.139279	  1.937095	  0.171614
  1.153383	  1.930807	  0.164862
  1.170459	  1.922626	  0.155996
  1.188956	  1.912584	  0.147149
  1.203498	  1.903882	  0.139862
  1.216711	  1.894601	  0.130427
  1.230411	  1.885429	  0.117721
  1.243530	  1.875083	  0.104956
  1.257548	  1.867515	  0.093548
  1.274578	  1.861652	  0.081906
  1.294177	  1.856472	  0.072724
  1.309852	  1.849248	  0.064697
  1.325481	  1.835396	  0.056700
  1.338185	  1.818227	  0.049999
  1.346227	  1.805768	  0.044369
  1.356546	  1.788798	  0.034632
  1.369213	  1.772499	  0.023455
  1.376825	  1.760919	  0.015740
  1.388088	  1.744862	  0.005937
  1.400215	  1.724355	 -0.003881
  1.408667	  1.710275	 -0.005954
  1.417314	  1.696797	 -0.008147
  1.430209	  1.677486	 -0.009655
  1.442076	  1.661109	 -0.012152
  1.451825	  1.644039	 -0.016104
  1.460095	  1.626368	 -0.020656
  1.470475	  1.609310	 -0.025182
  1.486634	  1.596798	 -0.028734
  1.506818	  1.583089	 -0.028195
  1.518592	  1.571000	 -0.025600
  1.526673	  1.550836	 -0.018452
  1.531845	  1.529782	 -0.010630
  1.540807	  1.509767	 -0.007998
  1.551422	  1.495714	 -0.009926
  1.565899	  1.484575	 -0.012712
  1.584610	  1.470708	 -0.011506
  1.602115	  1.450771	 -0.005312
  1.611620	  1.438825	 -0.000049
  1.619832	  1.429033	  0.002571
  1.635035	  1.413893	  0.007093
  1.651448	  1.400521	  0.009316
  1.667026	  1.382895	  0.007897
  1.675749	  1.361466	  0.008533
  1.676104	  1.345552	  0.020893
  1.674051	  1.332908	  0.042941
  1.675792	  1.325697	  0.058177
  1.681010	  1.317925	  0.074450
  1.688748	  1.312967	  0.091817
  1.693141	  1.306666	  0.111545
  1.697054	  1.298214	  0.128682
  1.705657	  1.290273	  0.143658
  1.721752	  1.286283	  0.159416
  1.738990	  1.284089	  0.180163
  1.747884	  1.283072	  0.195783
  1.750370	  1.278211	  0.215276
  1.754464	  1.272933	  0.231945
  1.756722	  1.267863	  0.252460
  1.757898	  1.260375	  0.276588
  1.757021	  1.250476	  0.291040
  1.760272	  1.235506	  0.308131
  1.764311	  1.223966	  0.326475
  1.767833	  1.214563	  0.345088
  1.778967	  1.211627	  0.359743
  1.797866	  1.214404	  0.376200
  1.813557	  1.220977	  0.392973
  1.823690	  1.220162	  0.413548
  1.827700	  1.212523	  0.430806
  1.834025	  1.204655	  0.450008
  1.837558	  1.193235	  0.465757
  1.843772	  1.182667	  0.483368
  1.848858	  1.168700	  0.498972
  1.853873	  1.155224	  0.513288
  1.858343	  1.141738	  0.527076
  1.859160	  1.127628	  0.540587
  1.860136	  1.112946	  0.555770
  1.865653	  1.098262	  0.571832
  1.870413	  1.084543	  0.582308
  1.871051	  1.068770	  0.590734
  1.873199	  1.053170	  0.603572
  1.887344	  1.034411	  0.623011
  1.895377	  1.028279	  0.632639
  1.903707	  1.014042	  0.644492
  1.905208	  0.995225	  0.661121
  1.905089	  0.983424	  0.668726
  1.902930	  0.963621	  0.675913
  1.904481	  0.942207	  0.680269
  1.906895	  0.920842	  0.684862
  1.908320	  0.904131	  0.692782
  1.911016	  0.885603	  0.703291
  1.911817	  0.868098	  0.714940
  1.915060	  0.853852	  0.727515
  1.910127	  0.836180	  0.738874
  1.905664	  0.818186	  0.747749
  1.901728	  0.798853	  0.751601
  1.900522	  0.779295	  0.756517
  1.898439	  0.760250	  0.762825
  1.893642	  0.742207	  0.770785
  1.885765	  0.723043	  0.778213
  1.878036	  0.706154	  0.779923
  1.870623	  0.685753	  0.778664
  1.866140	  0.665860	  0.777685
  1.861743	  0.646339	  0.777419
  1.855879	  0.627029	  0.777244
  1.849618	  0.607981	  0.776741
  1.843491	  0.589132	  0.775891
  1.837647	  0.570114	  0.775360
  1.832550	  0.550953	  0.775070
  1.824231	  0.535229	  0.771793
  1.810048	  0.519520	  0.762944
  1.796318	  0.504651	  0.755893
  1.787300	  0.487616	  0.754755
  1.779921	  0.469143	  0.757245
  1.765775	  0.444674	  0.756066
  1.761243	  0.435213	  0.754537
  1.749905	  0.417356	  0.753023
  1.734662	  0.404140	  0.750066
  1.717677	  0.397696	  0.746962
  1.696140	  0.380907	  0.745765
  1.684189	  0.368790	  0.745859
  1.674634	  0.358921	  0.746293
  1.657096	  0.336959	  0.744839
  1.643237	  0.320098	  0.743390
  1.635590	  0.310509	  0.742431
  1.622227	  0.292100	  0.739971
  1.613047	  0.273377	  0.736506
  1.611765	  0.257358	  0.733257
  1.613345	  0.243382	  0.734559
  1.619824	  0.227266	  0.742315
  1.631097	  0.216397	  0.750252
  1.647060	  0.204607	  0.752081
  1.666684	  0.186548	  0.751078
  1.682195	  0.176071	  0.753523
  1.696349	  0.171808	  0.763432
  1.714122	  0.169224	  0.778436
  1.732661	  0.164853	  0.783576
  1.753060	  0.160020	  0.784838
  1.777797	  0.153244	  0.791047
  1.787455	  0.150155	  0.796096
  1.805581	  0.146599	  0.805015
  1.829932	  0.141739	  0.814131
  1.846648	  0.137837	  0.821402
  1.858902	  0.137172	  0.830285
  1.878871	  0.136226	  0.841071
  1.897973	  0.134107	  0.848616
  1.916611	  0.131898	  0.855576
  1.935735	  0.129347	  0.860809
  1.955211	  0.126478	  0.864312
  1.974706	  0.123591	  0.867718
  1.994202	  0.120705	  0.871124
  2.013697	  0.117818	  0.874529
  2.033192	  0.114930	  0.877933
  2.052689	  0.111969	  0.881196
  2.072185	  0.107680	  0.881902
  2.091268	  0.102085	  0.879902
  2.110327	  0.096417	  0.877751
  2.129385	  0.090749	  0.875599
  2.148444	  0.085080	  0.873448
  2.167503	  0.079412	  0.871296
  2.186557	  0.073735	  0.869128
  2.205463	  0.067829	  0.866536
  2.222980	  0.060222	  0.860673
  2.240415	  0.052516	  0.854623
  2.257845	  0.044796	  0.848611
  2.275050	  0.037072	  0.842861
  2.291039	  0.027448	  0.839895
  2.305363	  0.011788	  0.836575
  2.319731	 -0.005532	  0.826904
  2.336095	 -0.014018	  0.816728
  2.349193	 -0.019252	  0.812011
  2.367551	 -0.031418	  0.805657
  2.386341	 -0.037021	  0.796603
  2.406582	 -0.034872	  0.787622
  2.426625	 -0.039915	  0.779998
  2.440556	 -0.055376	  0.771082
  2.448560	 -0.070048	  0.762636
  2.459509	 -0.084092	  0.754534
  2.473261	 -0.097758	  0.746782
  2.483161	 -0.114471	  0.742094
  2.492392	 -0.131711	  0.737911
  2.501593	 -0.148974	  0.733748
  2.510713	 -0.166279	  0.729634
  2.517963	 -0.184463	  0.726569
  2.515690	 -0.204036	  0.728712
  2.512869	 -0.223678	  0.731154
  2.510043	 -0.243326	  0.733600
  2.507217	 -0.262974	  0.736045
  2.504388	 -0.282619	  0.738489
  2.501197	 -0.302151	  0.740845
  2.491738	 -0.319675	  0.741677
  2.481461	 -0.336818	  0.742291
  2.471154	 -0.353947	  0.742897
  2.460846	 -0.371075	  0.743503
  2.450539	 -0.388204	  0.744108
  2.440202	 -0.405314	  0.744670
  2.429341	 -0.422088	  0.744360
  2.417168	 -0.437746	  0.741823
  2.404855	 -0.453285	  0.739199
  2.392494	 -0.468787	  0.736599
  2.380191	 -0.484335	  0.733965
  2.367912	 -0.499846	  0.731229
  2.356405	 -0.514773	  0.727096
  2.347614	 -0.532276	  0.725397
  2.337513	 -0.554148	  0.726783
  2.323002	 -0.571970	  0.721611
  2.310864	 -0.578550	  0.708118
  2.298270	 -0.587623	  0.694281
  2.286001	 -0.604245	  0.684568
  2.278190	 -0.617662	  0.676680
  2.266972	 -0.633501	  0.664275
  2.256273	 -0.653594	  0.656595
  2.253464	 -0.666898	  0.656754
  2.253095	 -0.689106	  0.653422
  2.255087	 -0.707597	  0.646541
  2.259398	 -0.720647	  0.638240
  2.269440	 -0.737739	  0.632127
  2.276108	 -0.757441	  0.628537
  2.276353	 -0.776913	  0.624955
  2.275596	 -0.793321	  0.625362
  2.278014	 -0.815152	  0.630574
  2.282277	 -0.828936	  0.632328
  2.292607	 -0.847919	  0.633982
  2.299429	 -0.867090	  0.635499
  2.305543	 -0.886513	  0.635951
  2.312947	 -0.905204	  0.635941
  2.322668	 -0.923936	  0.637831
  2.332400	 -0.941250	  0.640184
