 -0.411050	 -1.960648	  1.406613
 -0.413038	 -1.970037	  1.425550
 -0.411067	 -1.960726	  1.406772
 -0.401135	 -1.943678	  1.374194
 -0.385928	 -1.923083	  1.334623
 -0.369156	 -1.900249	  1.289433
 -0.354034	 -1.876052	  1.239952
 -0.343567	 -1.850717	  1.187529
 -0.338434	 -1.823801	  1.137003
 -0.335877	 -1.798448	  1.093269
 -0.333133	 -1.774320	  1.052913
 -0.328632	 -1.750646	  1.014508
 -0.321759	 -1.727059	  0.975373
 -0.312692	 -1.704160	  0.935273
 -0.302049	 -1.682361	  0.895256
 -0.289667	 -1.660564	  0.853081
 -0.275838	 -1.639358	  0.808271
 -0.261056	 -1.618718	  0.758852
 -0.246713	 -1.598664	  0.701965
 -0.242118	 -1.585823	  0.651404
 -0.237029	 -1.573055	  0.615248
 -0.233256	 -1.562698	  0.589216
 -0.228038	 -1.552509	  0.567656
 -0.215144	 -1.530536	  0.528834
 -0.194221	 -1.500911	  0.487895
 -0.149945	 -1.453481	  0.440044
 -0.101226	 -1.417403	  0.394663
 -0.054761	 -1.403087	  0.375441
  0.023705	 -1.410698	  0.350585
  0.125209	 -1.422571	  0.271846
  0.146175	 -1.373588	  0.174672
  0.131824	 -1.301836	  0.115046
  0.120423	 -1.247387	  0.080126
  0.116695	 -1.215292	  0.061551
  0.116141	 -1.181940	  0.043929
  0.117573	 -1.114479	  0.009422
  0.108386	 -1.002769	 -0.044957
  0.087101	 -0.918191	 -0.085496
  0.057174	 -0.858828	 -0.120857
  0.002050	 -0.801143	 -0.170140
 -0.073425	 -0.760059	 -0.224302
 -0.133499	 -0.745064	 -0.264781
 -0.176384	 -0.745713	 -0.293810
 -0.226544	 -0.761180	 -0.328548
 -0.281816	 -0.808115	 -0.390999
 -0.297251	 -0.866974	 -0.485218
 -0.291989	 -0.889188	 -0.565708
 -0.283575	 -0.887934	 -0.615240
 -0.274332	 -0.884725	 -0.641680
 -0.261773	 -0.882094	 -0.660750
 -0.227908	 -0.878599	 -0.692603
 -0.150585	 -0.869847	 -0.749466
 -0.053245	 -0.837836	 -0.821052
  0.013380	 -0.806042	 -0.886103
  0.044479	 -0.788901	 -0.939822
  0.054310	 -0.778575	 -0.992489
  0.047500	 -0.773621	 -1.041904
  0.029741	 -0.773510	 -1.082230
 -0.005294	 -0.776824	 -1.127914
 -0.075480	 -0.771986	 -1.186055
 -0.173423	 -0.720424	 -1.233312
 -0.224446	 -0.678425	 -1.270932
 -0.241772	 -0.648765	 -1.300121
 -0.251370	 -0.618925	 -1.334405
 -0.257325	 -0.588639	 -1.373139
 -0.261437	 -0.559136	 -1.414683
 -0.264355	 -0.531375	 -1.456984
 -0.266670	 -0.505392	 -1.500119
 -0.268957	 -0.480874	 -1.544988
 -0.273229	 -0.455043	 -1.595993
 -0.280680	 -0.430750	 -1.649191
 -0.289016	 -0.411578	 -1.701219
 -0.295997	 -0.396907	 -1.753712
 -0.301730	 -0.387413	 -1.806727
 -0.304058	 -0.380680	 -1.854808
 -0.302412	 -0.371615	 -1.895798
 -0.298655	 -0.358030	 -1.932777
 -0.293130	 -0.340178	 -1.969239
 -0.286316	 -0.318053	 -2.007802
 -0.279148	 -0.292804	 -2.049466
 -0.272104	 -0.266947	 -2.090297
 -0.264415	 -0.240432	 -2.132991
 -0.256276	 -0.212539	 -2.180609
 -0.252771	 -0.184762	 -2.233444
 -0.256032	 -0.160951	 -2.283573
 -0.260743	 -0.139316	 -2.326757
 -0.264517	 -0.117077	 -2.367339
 -0.267029	 -0.080446	 -2.431681
 -0.267172	 -0.070041	 -2.450248
