 -2.463415	 -1.417048	  1.050932
 -2.439025	 -1.403018	  1.040527
 -2.387778	 -1.396499	  1.025708
 -2.342731	 -1.387582	  1.009996
 -2.301436	 -1.380002	  0.982693
 -2.250703	 -1.376521	  0.966279
 -2.206515	 -1.370105	  0.948287
 -2.161640	 -1.356581	  0.924563
 -2.113475	 -1.355176	  0.905145
 -2.067910	 -1.349249	  0.885297
 -2.023541	 -1.344333	  0.867843
 -1.978253	 -1.335501	  0.852273
 -1.936429	 -1.329435	  0.830994
 -1.890585	 -1.323212	  0.811615
 -1.844752	 -1.317549	  0.792212
 -1.797246	 -1.311617	  0.776517
 -1.755624	 -1.309719	  0.749023
 -1.707536	 -1.302366	  0.737069
 -1.663088	 -1.292602	  0.712369
 -1.618916	 -1.294229	  0.690273
 -1.576532	 -1.280398	  0.675698
 -1.533701	 -1.279326	  0.653050
 -1.485893	 -1.272774	  0.635024
 -1.439451	 -1.267776	  0.612840
 -1.392249	 -1.261280	  0.593968
 -1.347380	 -1.258789	  0.573792
 -1.307471	 -1.247540	  0.556447
 -1.259182	 -1.241765	  0.535362
 -1.215446	 -1.232626	  0.512870
 -1.170531	 -1.228030	  0.496580
 -1.125541	 -1.217881	  0.478274
 -1.081877	 -1.215371	  0.457802
 -1.030627	 -1.205823	  0.439143
 -0.991222	 -1.188832	  0.428357
 -0.935589	 -1.119500	  0.466636
 -0.890605	 -1.033087	  0.453148
 -0.848427	 -1.109804	  0.449231
 -0.795667	 -0.963725	  0.451653
 -0.724084	 -1.019130	  0.483714
 -0.693561	 -1.002535	  0.424215
 -0.664758	 -0.959268	  0.394461
 -0.631828	 -0.954024	  0.386218
 -0.531939	 -0.977598	  0.386607
 -0.473771	 -0.937510	  0.356407
 -0.445016	 -0.919945	  0.341984
 -0.403815	 -0.932984	  0.334532
 -0.365828	 -0.944879	  0.278446
 -0.336394	 -0.946878	  0.247577
 -0.273541	 -0.929102	  0.253914
 -0.237481	 -0.971279	  0.176391
 -0.179766	 -0.940806	  0.208834
 -0.149924	 -1.001425	  0.149259
 -0.122619	 -1.010998	  0.091302
 -0.084527	 -1.075942	  0.038806
 -0.038833	 -1.072663	  0.008735
  0.006459	 -1.069779	 -0.008282
  0.049946	 -1.058994	 -0.026708
  0.094442	 -1.053715	 -0.046440
  0.142482	 -1.047355	 -0.065507
  0.190000	 -1.044175	 -0.089240
  0.235505	 -1.033699	 -0.108233
  0.279194	 -1.031276	 -0.124670
  0.320830	 -1.023737	 -0.141868
  0.371029	 -1.014408	 -0.163151
  0.416733	 -1.006208	 -0.184321
  0.458220	 -1.002532	 -0.202330
  0.493328	 -0.988539	 -0.232754
  0.475929	 -0.961428	 -0.385282
  0.498412	 -0.947045	 -0.445195
  0.561563	 -0.959306	 -0.441446
  0.588293	 -0.880985	 -0.495050
  0.643854	 -0.967946	 -0.520073
  0.673110	 -0.903423	 -0.563294
  0.744837	 -0.937611	 -0.542772
  0.782611	 -0.881240	 -0.588125
  0.805247	 -0.887244	 -0.643562
  0.871013	 -0.966130	 -0.623829
  0.910438	 -0.825759	 -0.645590
  0.962366	 -0.942017	 -0.661792
  1.020606	 -0.844219	 -0.626310
  1.068352	 -0.914764	 -0.671893
  1.103154	 -0.991990	 -0.652384
  1.189667	 -1.054753	 -0.644099
  1.230293	 -1.047953	 -0.704136
  1.251223	 -1.090238	 -0.787674
  1.325920	 -1.040268	 -0.729096
  1.382772	 -1.056777	 -0.746297
  1.422143	 -1.068834	 -0.808128
  1.445206	 -1.077746	 -0.887131
  1.474608	 -1.073812	 -0.877160
  1.534932	 -0.983293	 -0.856133
  1.597812	 -1.036414	 -0.879831
  1.655428	 -1.040599	 -0.870049
  1.696312	 -1.020021	 -0.872708
  1.733767	 -0.954495	 -0.916915
  1.769542	 -0.934011	 -0.897027
  1.845511	 -0.834664	 -0.811135
  1.905163	 -0.811818	 -0.829927
  1.948188	 -0.804069	 -0.847574
  1.995283	 -0.798024	 -0.866819
  2.045562	 -0.792261	 -0.887149
  2.089025	 -0.787620	 -0.906720
  2.133295	 -0.781569	 -0.926307
  2.178236	 -0.776376	 -0.947936
  2.220107	 -0.771118	 -0.968288
  2.267254	 -0.762870	 -0.990147
  2.315769	 -0.755892	 -1.009015
  2.358897	 -0.749905	 -1.028569
  2.402349	 -0.745035	 -1.050824
  2.445184	 -0.740734	 -1.070522
  2.492594	 -0.732599	 -1.083180
  2.536518	 -0.724427	 -1.103642
  2.582536	 -0.716379	 -1.125719
  2.632183	 -0.710573	 -1.140481
  2.668994	 -0.713666	 -1.169253
  2.695684	 -0.720802	 -1.180946
