  0.350397	  3.009462	 -0.035484
  0.346928	  2.979666	 -0.035133
  0.358944	  2.932763	 -0.026559
  0.379333	  2.888513	 -0.019373
  0.403841	  2.846589	 -0.013639
  0.429237	  2.804843	 -0.009020
  0.454507	  2.762485	 -0.004912
  0.478622	  2.719197	 -0.001653
  0.500921	  2.674858	 -0.000528
  0.521592	  2.629588	  0.000188
  0.541943	  2.584909	  0.004444
  0.561664	  2.539824	  0.012161
  0.581304	  2.494096	  0.020607
  0.600864	  2.447882	  0.029785
  0.619826	  2.402189	  0.039352
  0.638586	  2.356841	  0.048920
  0.657637	  2.311941	  0.057482
  0.676545	  2.267923	  0.065445
  0.696532	  2.223084	  0.072157
  0.718711	  2.178114	  0.077715
  0.743375	  2.134625	  0.079474
  0.770657	  2.093852	  0.079197
  0.800832	  2.056979	  0.075836
  0.833584	  2.024991	  0.068096
  0.867101	  1.996376	  0.058963
  0.908842	  1.967936	  0.045779
  0.963044	  1.938796	  0.026762
  1.028207	  1.908565	  0.001608
  1.099642	  1.877467	 -0.030683
  1.167896	  1.842721	 -0.066142
  1.215832	  1.805834	 -0.102067
  1.253492	  1.770476	 -0.127911
  1.279760	  1.721485	 -0.154024
  1.303702	  1.663745	 -0.172006
  1.316922	  1.608031	 -0.182564
  1.330068	  1.559851	 -0.189206
  1.350780	  1.509757	 -0.191864
  1.379195	  1.461226	 -0.195242
  1.403364	  1.418987	 -0.198723
  1.424168	  1.392858	 -0.195603
  1.443099	  1.375089	 -0.196261
  1.476935	  1.345181	 -0.199820
  1.526063	  1.294689	 -0.200275
  1.580484	  1.241396	 -0.197064
  1.620404	  1.200633	 -0.188760
  1.645872	  1.174311	 -0.177693
  1.667921	  1.153099	 -0.164708
  1.682880	  1.139731	 -0.147131
  1.695510	  1.130951	 -0.124697
  1.710898	  1.120142	 -0.091512
  1.730238	  1.111413	 -0.038986
  1.748147	  1.105787	  0.057681
  1.774112	  1.086404	  0.222757
  1.811300	  1.038773	  0.415923
  1.872186	  0.935026	  0.549645
  1.852139	  0.797774	  0.616576
  1.836815	  0.655946	  0.633522
  1.822328	  0.515232	  0.606615
  1.714773	  0.421781	  0.546334
  1.664702	  0.342802	  0.523846
  1.614973	  0.287060	  0.516050
  1.554570	  0.231693	  0.511238
  1.532176	  0.198270	  0.508528
  1.533996	  0.191489	  0.508346
  1.587570	  0.166424	  0.496518
  1.661075	  0.151407	  0.496356
  1.722370	  0.141220	  0.510968
  1.779999	  0.131674	  0.534360
  1.839060	  0.120671	  0.566840
  1.904036	  0.109267	  0.605259
  1.980519	  0.096758	  0.646283
  2.063301	  0.083177	  0.668581
  2.145536	  0.056165	  0.664158
  2.230315	  0.009598	  0.635945
  2.309347	 -0.050377	  0.585867
  2.368239	 -0.113700	  0.539478
  2.398142	 -0.195668	  0.544525
  2.390515	 -0.281716	  0.578264
  2.344568	 -0.352845	  0.595658
  2.292808	 -0.412062	  0.593118
  2.242405	 -0.467339	  0.576636
  2.198209	 -0.518728	  0.544586
  2.165273	 -0.571350	  0.504168
  2.146304	 -0.629104	  0.459446
  2.143000	 -0.685704	  0.424960
  2.152359	 -0.737401	  0.409347
  2.167947	 -0.785792	  0.408527
  2.186567	 -0.831817	  0.414385
  2.207126	 -0.876189	  0.421351
  2.228561	 -0.919866	  0.428140
  2.250382	 -0.963189	  0.434294
  2.272739	 -1.006014	  0.439488
  2.296381	 -1.048618	  0.443591
  2.322640	 -1.091700	  0.447741
  2.350521	 -1.134824	  0.453285
  2.377379	 -1.178417	  0.459660
  2.400530	 -1.222452	  0.466232
  2.421391	 -1.265941	  0.473134
  2.441025	 -1.309071	  0.480766
  2.460018	 -1.352193	  0.489353
  2.478873	 -1.396475	  0.498142
  2.497427	 -1.443378	  0.505349
  2.512240	 -1.493581	  0.510194
  2.519506	 -1.546731	  0.509618
  2.544701	 -1.562199	  0.514714
