  1.706798	 -0.930858	  1.571733
  1.706798	 -0.930858	  1.571733
  1.696300	 -0.912181	  1.565801
  1.681774	 -0.899584	  1.555488
  1.670219	 -0.892564	  1.547341
  1.653715	 -0.883009	  1.536201
  1.639397	 -0.875206	  1.525937
  1.624152	 -0.865376	  1.514682
  1.611405	 -0.852795	  1.506973
  1.602897	 -0.839486	  1.502919
  1.585569	 -0.810915	  1.497312
  1.571428	 -0.793856	  1.493927
  1.560835	 -0.786852	  1.491760
  1.546359	 -0.774718	  1.486385
  1.527689	 -0.764075	  1.479569
  1.506777	 -0.755065	  1.474877
  1.493973	 -0.748039	  1.473104
  1.477786	 -0.737225	  1.470312
  1.455040	 -0.722893	  1.464824
  1.445829	 -0.716203	  1.462013
  1.431110	 -0.703811	  1.458011
  1.414491	 -0.688776	  1.452623
  1.394209	 -0.675737	  1.451099
  1.376700	 -0.668323	  1.452636
  1.357147	 -0.661079	  1.451438
  1.343033	 -0.653749	  1.443884
  1.328824	 -0.641962	  1.432967
  1.313745	 -0.630625	  1.424257
  1.295840	 -0.621547	  1.418649
  1.278073	 -0.612577	  1.414454
  1.261447	 -0.603140	  1.409372
  1.244963	 -0.593716	  1.402778
  1.228254	 -0.584143	  1.397257
  1.211966	 -0.574397	  1.391706
  1.196037	 -0.564593	  1.384703
  1.180181	 -0.554672	  1.377463
  1.165906	 -0.543519	  1.368756
  1.151691	 -0.533291	  1.359048
  1.138753	 -0.522562	  1.348784
  1.126332	 -0.511035	  1.341323
  1.112210	 -0.497970	  1.336665
  1.094784	 -0.475288	  1.329800
  1.084406	 -0.459695	  1.319303
  1.078777	 -0.451745	  1.313630
  1.069665	 -0.441343	  1.301195
  1.055486	 -0.428959	  1.284847
  1.044021	 -0.417296	  1.268358
  1.034840	 -0.402917	  1.256012
  1.026531	 -0.388914	  1.246977
  1.020236	 -0.377117	  1.240402
  1.009359	 -0.361687	  1.226961
  0.998477	 -0.347258	  1.215966
  0.986891	 -0.333391	  1.206803
  0.974819	 -0.319978	  1.199091
  0.962420	 -0.307343	  1.190326
  0.950887	 -0.295123	  1.179361
  0.944119	 -0.286320	  1.162809
  0.937781	 -0.277639	  1.145942
  0.931495	 -0.269289	  1.128991
  0.929301	 -0.267959	  1.109247
  0.927395	 -0.267079	  1.089357
  0.925462	 -0.266217	  1.069470
  0.923455	 -0.265361	  1.049591
  0.918262	 -0.264163	  1.030324
  0.909867	 -0.262676	  1.012236
  0.901436	 -0.261212	  0.994168
  0.893478	 -0.259292	  0.975975
  0.885606	 -0.256180	  0.957828
  0.877371	 -0.251653	  0.940943
  0.871466	 -0.243894	  0.922659
  0.862489	 -0.237350	  0.904815
  0.852675	 -0.236118	  0.888775
  0.844509	 -0.235566	  0.871008
  0.834714	 -0.228909	  0.853280
  0.824511	 -0.217695	  0.834625
  0.815294	 -0.209655	  0.821094
  0.806822	 -0.202784	  0.807291
  0.798570	 -0.194872	  0.789386
  0.791491	 -0.186528	  0.771713
  0.784255	 -0.178480	  0.756722
  0.774192	 -0.169710	  0.739084
  0.763672	 -0.162550	  0.728705
  0.743316	 -0.150509	  0.721355
  0.731894	 -0.137209	  0.712388
  0.726832	 -0.122481	  0.702346
  0.724802	 -0.106135	  0.689599
  0.714942	 -0.091017	  0.675383
  0.698098	 -0.076889	  0.665711
  0.681379	 -0.059390	  0.665657
  0.671906	 -0.049055	  0.668093
  0.656758	 -0.032268	  0.679246
  0.641343	 -0.017575	  0.683594
  0.630154	 -0.006390	  0.683767
  0.613675	  0.010304	  0.683158
  0.601707	  0.023463	  0.687281
  0.590655	  0.037530	  0.695087
  0.580185	  0.050743	  0.707780
  0.570024	  0.060132	  0.721323
  0.556371	  0.073864	  0.735561
  0.538269	  0.092807	  0.746436
  0.527786	  0.102703	  0.751549
  0.517833	  0.111171	  0.756463
  0.498876	  0.123586	  0.755757
  0.486472	  0.138098	  0.756955
  0.473308	  0.155585	  0.773469
  0.456748	  0.167500	  0.784225
  0.437464	  0.177654	  0.788202
  0.422754	  0.185666	  0.787306
  0.405929	  0.198184	  0.785622
  0.388744	  0.210178	  0.789855
  0.371688	  0.220615	  0.793820
  0.354288	  0.230883	  0.795701
  0.337707	  0.241526	  0.795699
  0.322139	  0.253727	  0.794489
  0.307163	  0.266918	  0.792163
  0.292579	  0.280461	  0.788576
  0.275920	  0.293993	  0.784899
  0.259576	  0.305478	  0.783295
  0.243546	  0.315873	  0.783451
  0.226554	  0.328367	  0.781357
  0.207994	  0.337803	  0.774731
  0.186086	  0.344898	  0.768913
  0.165867	  0.346979	  0.767882
  0.149497	  0.349964	  0.770769
  0.128999	  0.357284	  0.774579
  0.109971	  0.366042	  0.776360
  0.093545	  0.377732	  0.778853
  0.079970	  0.391937	  0.780688
  0.065407	  0.407876	  0.781101
  0.049422	  0.420376	  0.782592
  0.033941	  0.430273	  0.784492
  0.017734	  0.443093	  0.785238
  0.001773	  0.455794	  0.783657
 -0.014819	  0.466321	  0.780817
 -0.030779	  0.478257	  0.777729
 -0.046948	  0.489442	  0.775640
 -0.061506	  0.503144	  0.775546
 -0.075746	  0.518415	  0.775991
 -0.090500	  0.533449	  0.774357
 -0.104916	  0.547046	  0.767488
 -0.120572	  0.559490	  0.753147
 -0.136208	  0.565083	  0.740172
 -0.152329	  0.570152	  0.731345
 -0.167113	  0.577762	  0.724819
 -0.181596	  0.587050	  0.715335
 -0.192751	  0.595235	  0.702336
 -0.209515	  0.606708	  0.686919
 -0.223900	  0.614217	  0.675659
 -0.235562	  0.618158	  0.668290
 -0.253481	  0.621502	  0.658727
 -0.268360	  0.627294	  0.641892
 -0.282912	  0.636141	  0.621913
 -0.294439	  0.647616	  0.609582
 -0.304253	  0.651910	  0.604314
 -0.320358	  0.664667	  0.594256
 -0.338440	  0.677557	  0.584296
 -0.349482	  0.687035	  0.580639
 -0.361968	  0.698915	  0.578047
 -0.375935	  0.718092	  0.574197
 -0.388593	  0.736572	  0.565880
 -0.397868	  0.749085	  0.557113
 -0.412884	  0.762428	  0.544436
 -0.425767	  0.774142	  0.537029
 -0.437655	  0.786789	  0.531464
 -0.449625	  0.797973	  0.525123
 -0.465435	  0.814389	  0.517990
 -0.477263	  0.827287	  0.515793
 -0.493924	  0.842864	  0.509729
 -0.506868	  0.857590	  0.503247
 -0.515029	  0.870624	  0.498822
 -0.528418	  0.887200	  0.491262
 -0.542345	  0.897854	  0.483222
 -0.562535	  0.909761	  0.470770
 -0.575726	  0.919072	  0.462052
 -0.582984	  0.925277	  0.457583
 -0.596257	  0.936669	  0.448835
 -0.618157	  0.949667	  0.440643
 -0.631376	  0.962072	  0.432120
 -0.648501	  0.974707	  0.423744
 -0.664856	  0.986019	  0.420587
 -0.678833	  0.997845	  0.412918
 -0.692025	  1.007903	  0.409771
 -0.708229	  1.019345	  0.403688
 -0.726643	  1.030718	  0.397339
 -0.736281	  1.037021	  0.390150
 -0.749624	  1.048544	  0.382134
 -0.774548	  1.064086	  0.367465
 -0.791299	  1.066452	  0.369398
 -0.800146	  1.074344	  0.356801
 -0.821105	  1.083659	  0.355625
 -0.832782	  1.098636	  0.350563
 -0.852028	  1.107078	  0.343271
 -0.869096	  1.120106	  0.339437
 -0.883393	  1.124159	  0.333206
 -0.899634	  1.139399	  0.332967
 -0.917446	  1.150356	  0.327475
 -0.933157	  1.158155	  0.326000
 -0.953004	  1.164692	  0.324151
 -0.974209	  1.176545	  0.319821
 -0.988911	  1.181931	  0.320071
 -1.012384	  1.188710	  0.316769
 -1.035866	  1.204031	  0.316069
 -1.044927	  1.209858	  0.319379
 -1.057830	  1.217765	  0.321019
 -1.084573	  1.232854	  0.333049
 -1.101424	  1.241221	  0.347933
 -1.114757	  1.247639	  0.356431
 -1.123705	  1.252249	  0.363151
 -1.140548	  1.265763	  0.374110
 -1.157821	  1.280482	  0.385911
 -1.166962	  1.288715	  0.388035
 -1.183363	  1.302814	  0.389890
 -1.201134	  1.315714	  0.393303
 -1.217528	  1.326755	  0.399093
 -1.235563	  1.334272	  0.405100
 -1.254274	  1.341097	  0.418406
 -1.272614	  1.347737	  0.430192
 -1.287790	  1.353950	  0.440754
 -1.294490	  1.358828	  0.442013
 -1.303930	  1.370488	  0.440502
 -1.319791	  1.399568	  0.431289
 -1.331088	  1.419290	  0.422737
 -1.339347	  1.428068	  0.421009
 -1.351272	  1.440169	  0.414307
 -1.367919	  1.459348	  0.410227
 -1.378255	  1.471554	  0.406790
 -1.390207	  1.478411	  0.404289
 -1.409627	  1.487340	  0.400483
 -1.426285	  1.498703	  0.394327
 -1.448109	  1.506368	  0.386770
 -1.468280	  1.512671	  0.378420
 -1.478396	  1.520069	  0.360071
 -1.482477	  1.524631	  0.341691
 -1.483162	  1.527253	  0.323467
 -1.484490	  1.528484	  0.298645
 -1.488349	  1.532836	  0.281335
 -1.491710	  1.540810	  0.267015
 -1.495749	  1.552127	  0.245927
 -1.498251	  1.558571	  0.225898
 -1.499136	  1.561602	  0.211684
 -1.499438	  1.567469	  0.189133
 -1.499900	  1.573824	  0.170282
 -1.498849	  1.580012	  0.154530
 -1.496602	  1.591074	  0.127752
 -1.494579	  1.597902	  0.107708
 -1.493677	  1.601267	  0.096341
 -1.498514	  1.606159	  0.075467
 -1.509921	  1.610015	  0.056090
 -1.520541	  1.617139	  0.039248
 -1.537768	  1.624578	  0.026932
 -1.554283	  1.636368	  0.013469
 -1.563017	  1.647651	  0.002134
 -1.568888	  1.656087	 -0.007072
 -1.585085	  1.669150	 -0.019474
 -1.597166	  1.680813	 -0.032398
 -1.602863	  1.691342	 -0.044931
 -1.605253	  1.711264	 -0.062240
 -1.616612	  1.731237	 -0.075843
 -1.627176	  1.742758	 -0.083201
 -1.637160	  1.749351	 -0.087594
 -1.656439	  1.759509	 -0.090447
 -1.670370	  1.775616	 -0.099086
 -1.682276	  1.789722	 -0.107617
 -1.695109	  1.802976	 -0.115633
 -1.710846	  1.818612	 -0.125124
 -1.724950	  1.832953	 -0.133525
