 -1.927562	  0.766292	  1.414389
 -1.914658	  0.758890	  1.417100
 -1.910491	  0.756500	  1.417975
 -1.893706	  0.746142	  1.421320
 -1.876968	  0.735746	  1.424641
 -1.860198	  0.725714	  1.428247
 -1.842863	  0.716684	  1.432744
 -1.825625	  0.706992	  1.436902
 -1.808497	  0.697123	  1.437400
 -1.790558	  0.685333	  1.432871
 -1.773135	  0.667122	  1.428452
 -1.759866	  0.650489	  1.427830
 -1.746603	  0.640399	  1.431816
 -1.730075	  0.632544	  1.443097
 -1.719132	  0.618765	  1.457847
 -1.705293	  0.592321	  1.468287
 -1.698217	  0.581788	  1.469515
 -1.689037	  0.569334	  1.468705
 -1.667715	  0.559468	  1.471910
 -1.650389	  0.547779	  1.479930
 -1.636927	  0.535916	  1.489052
 -1.622001	  0.523477	  1.496095
 -1.607016	  0.511863	  1.502954
 -1.592046	  0.501491	  1.510543
 -1.580214	  0.493310	  1.521463
 -1.568043	  0.489860	  1.538622
 -1.541572	  0.478159	  1.545475
 -1.525408	  0.461671	  1.544133
 -1.515775	  0.450030	  1.544018
 -1.500021	  0.432435	  1.545991
 -1.481620	  0.418855	  1.552165
 -1.470772	  0.411462	  1.556510
 -1.454128	  0.402286	  1.565212
 -1.432134	  0.389580	  1.576234
 -1.418528	  0.382892	  1.582358
 -1.397905	  0.377964	  1.589972
 -1.379778	  0.375561	  1.595140
 -1.364248	  0.374880	  1.598771
 -1.335790	  0.362247	  1.605180
 -1.321880	  0.353061	  1.608546
 -1.311374	  0.346385	  1.611248
 -1.300376	  0.339755	  1.621926
 -1.281001	  0.325361	  1.643851
 -1.260043	  0.311917	  1.645780
 -1.240240	  0.301958	  1.643714
 -1.229131	  0.294613	  1.644204
 -1.210703	  0.284293	  1.648671
 -1.190003	  0.273351	  1.652422
 -1.175398	  0.265389	  1.654597
 -1.158202	  0.258654	  1.656784
 -1.136297	  0.249506	  1.660202
 -1.119040	  0.240196	  1.662291
 -1.104041	  0.232893	  1.663953
 -1.084499	  0.225223	  1.666943
 -1.064935	  0.215216	  1.669984
 -1.048076	  0.205978	  1.673976
 -1.030775	  0.193581	  1.680645
 -1.019669	  0.181971	  1.686193
 -1.005631	  0.168234	  1.690592
 -0.985298	  0.160793	  1.688868
 -0.964885	  0.155087	  1.689936
 -0.946513	  0.146762	  1.692754
 -0.929051	  0.137217	  1.694789
 -0.911160	  0.128558	  1.696470
 -0.893271	  0.119883	  1.697874
 -0.874917	  0.112167	  1.699993
 -0.856586	  0.104902	  1.703169
 -0.837965	  0.098667	  1.706863
 -0.820376	  0.091452	  1.710908
 -0.805955	  0.080398	  1.719394
 -0.789785	  0.071649	  1.730624
 -0.767197	  0.064713	  1.737736
 -0.745866	  0.060119	  1.736471
 -0.729946	  0.058297	  1.736012
 -0.708546	  0.054354	  1.736571
 -0.683774	  0.043835	  1.734902
 -0.665995	  0.034987	  1.733194
 -0.651336	  0.027860	  1.732861
 -0.636217	  0.021659	  1.730543
 -0.616223	  0.015100	  1.726251
 -0.595273	  0.005835	  1.723499
 -0.573450	 -0.009046	  1.722047
 -0.561651	 -0.017486	  1.722024
 -0.545658	 -0.030200	  1.721826
 -0.527243	 -0.049170	  1.719879
 -0.514472	 -0.061252	  1.717948
 -0.499067	 -0.071903	  1.717428
 -0.484615	 -0.079265	  1.719009
 -0.462530	 -0.092305	  1.720654
 -0.451623	 -0.099853	  1.720926
 -0.437871	 -0.107334	  1.722843
 -0.418352	 -0.124521	  1.734097
 -0.396336	 -0.142804	  1.735300
 -0.378982	 -0.153940	  1.732209
 -0.367714	 -0.159015	  1.729677
 -0.346789	 -0.168959	  1.725272
 -0.328132	 -0.180099	  1.715788
 -0.318457	 -0.185917	  1.706867
 -0.303137	 -0.196632	  1.691276
 -0.283442	 -0.210559	  1.675382
 -0.265451	 -0.219306	  1.666986
 -0.256128	 -0.222839	  1.664397
 -0.241686	 -0.226469	  1.663545
 -0.226648	 -0.234725	  1.659690
 -0.186955	 -0.246810	  1.644750
 -0.173474	 -0.245963	  1.635276
 -0.163695	 -0.246016	  1.635399
 -0.144054	 -0.250719	  1.618215
 -0.122720	 -0.257533	  1.608814
 -0.114084	 -0.261017	  1.606050
 -0.093387	 -0.270285	  1.602701
 -0.068922	 -0.274107	  1.599121
 -0.054380	 -0.279255	  1.597858
 -0.028513	 -0.283053	  1.592026
 -0.012534	 -0.284438	  1.588206
  0.000199	 -0.290285	  1.589958
  0.019914	 -0.297876	  1.595013
  0.035087	 -0.308531	  1.603033
  0.043575	 -0.315259	  1.605615
  0.049926	 -0.321769	  1.611037
  0.059069	 -0.328270	  1.619165
  0.071141	 -0.330324	  1.631088
  0.089966	 -0.337126	  1.649142
  0.098285	 -0.343838	  1.659418
  0.103559	 -0.350448	  1.669060
  0.115597	 -0.358941	  1.685002
  0.128643	 -0.366948	  1.702171
  0.138350	 -0.372415	  1.721093
  0.145087	 -0.376463	  1.734394
  0.156869	 -0.389506	  1.748284
  0.166017	 -0.404460	  1.760877
  0.172654	 -0.416175	  1.776297
  0.179487	 -0.429134	  1.789984
  0.186056	 -0.442527	  1.803096
  0.192965	 -0.455177	  1.817093
  0.202508	 -0.464681	  1.831862
  0.212053	 -0.473824	  1.846880
  0.221597	 -0.482973	  1.861887
  0.231145	 -0.492151	  1.876873
  0.240721	 -0.501351	  1.891820
  0.252471	 -0.512420	  1.903592
  0.264615	 -0.523456	  1.915123
  0.276909	 -0.534841	  1.925975
  0.286319	 -0.545976	  1.937848
  0.296973	 -0.554001	  1.952412
  0.321170	 -0.566795	  1.956606
  0.338514	 -0.582706	  1.956709
  0.350665	 -0.593377	  1.959756
  0.362923	 -0.605873	  1.967603
  0.376649	 -0.618126	  1.978345
  0.388945	 -0.628153	  1.988064
  0.402139	 -0.640257	  1.998101
  0.423932	 -0.655074	  2.004562
  0.441870	 -0.661005	  2.002583
  0.462712	 -0.666086	  1.999605
  0.481833	 -0.673814	  2.000897
  0.496674	 -0.681216	  2.004064
  0.514511	 -0.693535	  2.010524
  0.533563	 -0.705058	  2.015435
  0.545348	 -0.710830	  2.018126
  0.567791	 -0.713716	  2.017695
  0.592617	 -0.723712	  2.016423
  0.606828	 -0.735706	  2.020589
  0.615582	 -0.752851	  2.031074
  0.625883	 -0.767881	  2.048974
  0.646907	 -0.777920	  2.054359
  0.668842	 -0.781233	  2.052062
  0.688104	 -0.779130	  2.050413
  0.708658	 -0.784604	  2.054961
  0.726818	 -0.793448	  2.058818
  0.742452	 -0.803427	  2.062766
  0.756899	 -0.814349	  2.072470
  0.771027	 -0.825926	  2.082581
  0.787281	 -0.833413	  2.091089
  0.804022	 -0.838487	  2.099255
  0.818944	 -0.845131	  2.109827
  0.829613	 -0.857750	  2.121455
  0.842192	 -0.875945	  2.135283
  0.856907	 -0.893739	  2.137296
  0.884961	 -0.915277	  2.129262
  0.904799	 -0.921761	  2.126877
  0.926659	 -0.922918	  2.130616
  0.940403	 -0.921963	  2.135014
