 -1.451021	  1.440117	 -1.226112
 -1.538688	  1.441782	 -1.211237
 -1.518973	  1.441408	 -1.214582
 -1.499258	  1.441033	 -1.217927
 -1.479544	  1.440668	 -1.221273
 -1.459978	  1.442414	 -1.225027
 -1.440480	  1.444321	 -1.228816
 -1.421262	  1.444761	 -1.232629
 -1.400903	  1.444008	 -1.237099
 -1.381061	  1.445552	 -1.241461
 -1.362190	  1.447528	 -1.245145
 -1.342358	  1.450206	 -1.248410
 -1.321934	  1.451638	 -1.252208
 -1.303487	  1.456417	 -1.254685
 -1.283686	  1.459053	 -1.257185
 -1.263107	  1.461046	 -1.260942
 -1.244840	  1.467658	 -1.263706
 -1.225654	  1.474106	 -1.265446
 -1.206748	  1.480209	 -1.266104
 -1.187062	  1.484876	 -1.267729
 -1.167648	  1.489375	 -1.269413
 -1.148232	  1.493873	 -1.271090
 -1.128707	  1.498195	 -1.271261
 -1.109167	  1.502444	 -1.270846
 -1.089628	  1.506692	 -1.270431
 -1.070089	  1.510940	 -1.270016
 -1.050550	  1.515191	 -1.269601
 -1.031148	  1.519996	 -1.269381
 -1.015562	  1.532268	 -1.271848
 -0.999996	  1.544577	 -1.274334
 -0.984430	  1.556886	 -1.276819
 -0.968864	  1.569196	 -1.279305
 -0.953298	  1.581505	 -1.281791
 -0.937758	  1.593833	 -1.284295
 -0.927803	  1.610139	 -1.290183
 -0.918965	  1.626904	 -1.296574
 -0.910132	  1.643669	 -1.302969
 -0.901301	  1.660436	 -1.309365
 -0.893014	  1.677381	 -1.316009
 -0.887210	  1.694932	 -1.323639
 -0.881419	  1.712485	 -1.331279
 -0.875634	  1.730037	 -1.338925
 -0.871054	  1.747618	 -1.347287
 -0.866502	  1.765197	 -1.355668
 -0.862031	  1.782849	 -1.363940
 -0.857784	  1.800691	 -1.371917
 -0.853540	  1.818527	 -1.379888
 -0.849338	  1.836262	 -1.387674
 -0.845118	  1.854345	 -1.395105
