  1.371233	  1.144504	 -2.447597
  1.357657	  1.133172	 -2.423363
  1.346848	  1.118667	 -2.377777
  1.327453	  1.098118	 -2.335164
  1.303053	  1.073289	 -2.297731
  1.283302	  1.053701	 -2.256494
  1.261770	  1.030797	 -2.219035
  1.240232	  1.005701	 -2.182206
  1.221571	  0.988528	 -2.138743
  1.203529	  0.969937	 -2.095156
  1.183901	  0.953998	 -2.052463
  1.163478	  0.940948	 -2.009915
  1.141513	  0.926463	 -1.967881
  1.117564	  0.909995	 -1.926038
  1.093994	  0.891599	 -1.882298
  1.075229	  0.871323	 -1.838765
  1.064196	  0.851475	 -1.796122
  1.062788	  0.833728	 -1.753152
  1.077761	  0.813623	 -1.697927
  1.130644	  0.787848	 -1.625210
  1.215416	  0.756065	 -1.557047
  1.286199	  0.717433	 -1.495097
  1.329906	  0.674252	 -1.426461
  1.338068	  0.643849	 -1.360815
  1.332383	  0.627631	 -1.309565
  1.331069	  0.616886	 -1.258946
  1.333743	  0.616916	 -1.198661
  1.288411	  0.625404	 -1.144451
  1.204485	  0.605347	 -1.113740
  1.132631	  0.572627	 -1.098003
  1.081911	  0.546793	 -1.087650
  1.029563	  0.520745	 -1.075769
  0.961685	  0.484824	 -1.054624
  0.877665	  0.439169	 -1.018654
  0.808069	  0.403680	 -0.988477
  0.767480	  0.382798	 -0.971053
  0.740436	  0.365715	 -0.955934
  0.715106	  0.344852	 -0.936287
  0.690689	  0.318563	 -0.910764
  0.666653	  0.288136	 -0.879355
  0.642950	  0.256882	 -0.844633
  0.620011	  0.229243	 -0.808263
  0.596883	  0.205233	 -0.771045
  0.574145	  0.183283	 -0.732207
  0.554116	  0.163203	 -0.690921
  0.536983	  0.143988	 -0.647912
  0.522839	  0.124672	 -0.603763
  0.510452	  0.104776	 -0.558609
  0.499034	  0.085456	 -0.513466
  0.487657	  0.066275	 -0.470856
  0.475656	  0.044465	 -0.429632
  0.461191	  0.018956	 -0.388980
  0.444184	 -0.007935	 -0.348627
  0.425905	 -0.034673	 -0.308556
  0.406362	 -0.061097	 -0.268513
  0.385977	 -0.087428	 -0.229528
  0.363589	 -0.114776	 -0.191582
  0.339375	 -0.141981	 -0.154798
  0.314106	 -0.166026	 -0.119797
  0.287429	 -0.187081	 -0.084178
  0.259705	 -0.206821	 -0.046406
  0.229872	 -0.224271	 -0.007994
  0.201332	 -0.240215	  0.029626
  0.176986	 -0.259497	  0.066566
  0.154420	 -0.281333	  0.103582
  0.132441	 -0.304568	  0.141101
  0.110975	 -0.328517	  0.178360
  0.088270	 -0.353014	  0.216449
  0.062980	 -0.373424	  0.253937
  0.036713	 -0.393069	  0.292147
  0.012553	 -0.413812	  0.330537
 -0.009848	 -0.435729	  0.369898
 -0.030587	 -0.458164	  0.411896
 -0.048458	 -0.478761	  0.456760
 -0.062367	 -0.494523	  0.504143
 -0.072517	 -0.505855	  0.551187
 -0.085121	 -0.516574	  0.596480
 -0.103820	 -0.528153	  0.640648
 -0.125833	 -0.540483	  0.684905
 -0.149097	 -0.558718	  0.727853
 -0.172418	 -0.579958	  0.768922
 -0.193966	 -0.601803	  0.809213
 -0.214184	 -0.623919	  0.849829
 -0.232596	 -0.646832	  0.890789
 -0.248183	 -0.673280	  0.930022
 -0.261389	 -0.700008	  0.967332
 -0.273564	 -0.725845	  1.005915
 -0.287232	 -0.750922	  1.046955
 -0.302416	 -0.774903	  1.089099
 -0.319319	 -0.798370	  1.131812
 -0.339493	 -0.822163	  1.172314
 -0.362728	 -0.846397	  1.210608
 -0.387666	 -0.871526	  1.247080
 -0.411834	 -0.897728	  1.281428
 -0.435369	 -0.924083	  1.315591
 -0.459402	 -0.950307	  1.351545
 -0.483627	 -0.974019	  1.386373
 -0.511662	 -0.996370	  1.423138
 -0.538697	 -1.013809	  1.460947
 -0.561936	 -1.033129	  1.500270
 -0.584790	 -1.057019	  1.539757
 -0.602586	 -1.081544	  1.582660
 -0.613580	 -1.104635	  1.627018
 -0.626781	 -1.125920	  1.670220
 -0.645788	 -1.145710	  1.711814
 -0.664556	 -1.165131	  1.753005
 -0.681382	 -1.184623	  1.795725
 -0.696387	 -1.203753	  1.839822
 -0.708290	 -1.222128	  1.885150
 -0.719195	 -1.240079	  1.930427
 -0.731921	 -1.257490	  1.974294
 -0.747726	 -1.275101	  2.018518
 -0.766056	 -1.293392	  2.062276
 -0.788492	 -1.313858	  2.104349
 -0.811905	 -1.335188	  2.143296
 -0.835176	 -1.357099	  2.181293
 -0.857832	 -1.380172	  2.219105
 -0.879271	 -1.404692	  2.256937
 -0.898167	 -1.432884	  2.294170
 -0.912005	 -1.466051	  2.330939
 -0.919983	 -1.489644	  2.375749
 -0.946988	 -1.520734	  2.406363
 -0.956458	 -1.535941	  2.430427
