 -1.628416	  1.210186	 -1.406431
 -1.661174	  1.221429	 -1.477062
 -1.642201	  1.214917	 -1.436153
 -1.573693	  1.225390	 -1.325346
 -1.502105	  1.261358	 -1.221082
 -1.476008	  1.280750	 -1.132407
 -1.483322	  1.299865	 -1.086471
 -1.498749	  1.317583	 -1.058223
 -1.520513	  1.336601	 -1.029573
 -1.546469	  1.357247	 -0.999157
 -1.574673	  1.377910	 -0.967674
 -1.602744	  1.397284	 -0.937500
 -1.633828	  1.416136	 -0.907928
 -1.667152	  1.436043	 -0.876606
 -1.699066	  1.453224	 -0.847223
 -1.732961	  1.468223	 -0.818561
 -1.768766	  1.485186	 -0.787613
 -1.804114	  1.503175	 -0.756714
 -1.838393	  1.520780	 -0.727224
 -1.890064	  1.544655	 -0.685085
 -1.910577	  1.553273	 -0.668888
