 -1.487438	  0.925543	  1.647482
 -1.494178	  0.924628	  1.656401
 -1.484055	  0.929061	  1.639514
 -1.473314	  0.931291	  1.623271
 -1.463080	  0.934247	  1.606615
 -1.453091	  0.937722	  1.589606
 -1.442796	  0.941970	  1.572729
 -1.432339	  0.947317	  1.556280
 -1.422365	  0.953335	  1.540559
 -1.412280	  0.959749	  1.524779
 -1.402679	  0.965821	  1.508858
 -1.393241	  0.971678	  1.492955
 -1.383883	  0.977931	  1.476895
 -1.374838	  0.984921	  1.460682
 -1.365901	  0.992031	  1.444643
 -1.357260	  0.999218	  1.429095
 -1.349636	  1.007399	  1.413646
 -1.342025	  1.015871	  1.397717
 -1.334388	  1.024279	  1.381770
 -1.326828	  1.033291	  1.366253
 -1.317839	  1.043275	  1.351119
 -1.309910	  1.053224	  1.338886
 -1.302132	  1.064481	  1.323896
 -1.293664	  1.076605	  1.306802
 -1.280027	  1.090034	  1.290695
 -1.267628	  1.102139	  1.277967
 -1.260138	  1.111306	  1.268408
 -1.259857	  1.122825	  1.249827
 -1.263532	  1.133243	  1.231871
 -1.261243	  1.144507	  1.216919
 -1.252249	  1.154632	  1.204172
 -1.246052	  1.163931	  1.188078
 -1.246961	  1.179497	  1.171442
 -1.245368	  1.202296	  1.150261
 -1.241910	  1.211573	  1.140033
 -1.236620	  1.217897	  1.130593
 -1.226056	  1.226393	  1.114058
 -1.217774	  1.237600	  1.093860
 -1.212324	  1.245241	  1.075511
 -1.208935	  1.252666	  1.065325
 -1.202350	  1.259945	  1.052779
 -1.186168	  1.266977	  1.027884
 -1.175948	  1.271477	  1.013746
 -1.168202	  1.273733	  1.005428
 -1.152715	  1.280082	  0.983005
 -1.142659	  1.282454	  0.961281
 -1.134857	  1.280082	  0.942311
 -1.128345	  1.276747	  0.925960
 -1.121648	  1.264834	  0.906823
 -1.113834	  1.255664	  0.895957
 -1.100826	  1.247894	  0.882473
 -1.087209	  1.244333	  0.860174
 -1.077766	  1.245082	  0.837662
 -1.074696	  1.246408	  0.827074
 -1.066120	  1.241696	  0.806150
 -1.056770	  1.229362	  0.790313
 -1.049037	  1.218815	  0.779256
 -1.040694	  1.206959	  0.762727
 -1.031168	  1.198381	  0.748378
 -1.022463	  1.196616	  0.732374
 -1.011714	  1.195346	  0.718773
 -0.996888	  1.191184	  0.709127
 -0.976884	  1.183051	  0.698937
 -0.961719	  1.173334	  0.690332
 -0.948445	  1.164808	  0.683469
 -0.934017	  1.153245	  0.674045
 -0.920719	  1.142445	  0.660821
 -0.911330	  1.135897	  0.654376
 -0.899579	  1.122799	  0.648062
 -0.883873	  1.106579	  0.642232
 -0.872693	  1.094810	  0.638473
 -0.859892	  1.081239	  0.635777
 -0.842969	  1.070080	  0.633761
 -0.827139	  1.062425	  0.631744
 -0.810023	  1.054205	  0.628752
 -0.794854	  1.046286	  0.626516
 -0.777524	  1.035245	  0.625647
 -0.760117	  1.022548	  0.624681
 -0.743145	  1.008607	  0.623559
 -0.728785	  0.996167	  0.622340
 -0.716274	  0.986572	  0.621957
 -0.697391	  0.978121	  0.622552
 -0.675579	  0.972516	  0.623434
 -0.652785	  0.965244	  0.621528
 -0.632695	  0.957467	  0.617882
 -0.616244	  0.951265	  0.614073
 -0.599294	  0.944240	  0.609887
 -0.580147	  0.932969	  0.605130
 -0.561571	  0.921079	  0.601129
 -0.549629	  0.911092	  0.599713
 -0.534559	  0.899022	  0.598845
 -0.514955	  0.888382	  0.596358
 -0.495065	  0.880401	  0.592483
 -0.477448	  0.873970	  0.588890
 -0.461454	  0.868056	  0.586298
 -0.442136	  0.859355	  0.580131
 -0.424456	  0.852335	  0.570508
 -0.409466	  0.846843	  0.560275
 -0.391562	  0.843892	  0.551003
 -0.374726	  0.841555	  0.544251
 -0.354539	  0.837620	  0.535957
 -0.330520	  0.831873	  0.525473
 -0.315192	  0.827038	  0.520636
 -0.296943	  0.817398	  0.512615
 -0.279405	  0.809900	  0.504868
 -0.265878	  0.807775	  0.497668
 -0.246244	  0.806416	  0.486164
 -0.223560	  0.805552	  0.479036
 -0.207862	  0.808977	  0.476978
 -0.187872	  0.815547	  0.474404
 -0.163924	  0.824470	  0.470848
 -0.147738	  0.831825	  0.469297
 -0.121625	  0.836397	  0.467828
 -0.099510	  0.838958	  0.462979
 -0.085973	  0.841044	  0.458857
 -0.064510	  0.838933	  0.451278
 -0.049506	  0.836881	  0.445725
 -0.035459	  0.838917	  0.438680
 -0.010285	  0.835309	  0.427830
  0.009776	  0.834734	  0.417543
  0.022892	  0.835138	  0.411632
  0.044689	  0.836262	  0.401937
  0.062013	  0.835933	  0.392255
  0.074653	  0.834454	  0.386724
  0.101278	  0.829943	  0.373713
  0.116815	  0.825477	  0.366513
  0.128669	  0.821511	  0.362801
  0.150826	  0.815510	  0.355161
  0.170727	  0.810049	  0.346823
  0.189369	  0.802149	  0.336405
  0.200257	  0.796687	  0.327789
  0.214367	  0.788596	  0.315720
  0.229902	  0.780297	  0.302930
  0.244728	  0.776655	  0.293565
  0.263507	  0.773956	  0.284657
  0.291365	  0.771132	  0.271142
  0.304505	  0.760248	  0.262941
  0.324174	  0.751372	  0.252939
  0.337846	  0.749260	  0.242317
  0.348562	  0.748859	  0.235091
  0.376309	  0.747393	  0.218400
  0.387530	  0.752734	  0.213390
  0.401472	  0.753024	  0.206801
  0.421328	  0.755953	  0.194504
  0.438322	  0.752369	  0.188185
  0.457655	  0.751551	  0.181322
  0.478727	  0.750977	  0.169986
  0.497335	  0.746523	  0.161055
  0.508306	  0.744750	  0.153086
  0.531885	  0.745530	  0.141651
  0.553004	  0.748336	  0.127772
  0.572198	  0.747463	  0.114328
  0.583873	  0.750241	  0.107766
  0.592083	  0.745330	  0.101800
  0.617974	  0.753404	  0.089004
  0.636154	  0.756055	  0.081712
  0.649883	  0.757156	  0.074573
  0.669877	  0.758753	  0.070416
  0.689983	  0.758614	  0.067055
  0.710708	  0.754344	  0.065594
  0.733718	  0.754338	  0.063543
  0.753645	  0.754622	  0.058583
  0.770858	  0.753576	  0.051509
  0.785689	  0.754400	  0.044653
  0.805933	  0.754438	  0.037597
  0.826732	  0.755334	  0.031376
  0.845919	  0.758577	  0.028822
  0.864741	  0.762946	  0.025347
  0.880593	  0.766612	  0.020109
  0.900699	  0.770004	  0.017461
  0.921472	  0.771731	  0.016863
  0.938274	  0.773872	  0.017823
  0.958817	  0.779654	  0.023262
  0.978767	  0.785239	  0.028119
  0.997565	  0.789542	  0.031417
  1.013020	  0.793520	  0.033655
  1.032615	  0.798838	  0.038939
  1.053112	  0.803623	  0.042450
  1.074904	  0.809033	  0.045142
  1.093274	  0.813594	  0.044467
  1.112965	  0.817603	  0.044814
  1.132872	  0.820556	  0.041991
  1.151952	  0.823338	  0.042356
  1.171350	  0.829134	  0.041689
  1.190133	  0.837849	  0.040414
  1.209412	  0.846400	  0.040266
  1.231229	  0.858331	  0.040532
  1.250430	  0.870865	  0.041022
  1.262520	  0.879650	  0.041606
  1.277821	  0.893074	  0.040088
  1.293302	  0.908699	  0.035140
  1.311175	  0.921604	  0.027886
  1.328368	  0.930693	  0.019438
  1.343753	  0.938169	  0.010985
  1.358525	  0.948084	  0.002455
  1.370138	  0.957942	 -0.003426
  1.382431	  0.970503	 -0.012100
  1.398367	  0.982344	 -0.018060
  1.415451	  0.994183	 -0.026911
  1.434161	  1.002264	 -0.037195
  1.445580	  1.006474	 -0.041791
  1.460927	  1.014907	 -0.050213
  1.477996	  1.022795	 -0.061954
  1.495531	  1.032241	 -0.071398
  1.513212	  1.044294	 -0.078588
  1.524773	  1.050651	 -0.083877
  1.541132	  1.061049	 -0.092206
  1.559008	  1.076385	 -0.100827
  1.570463	  1.086232	 -0.107962
  1.582507	  1.100099	 -0.121808
  1.592687	  1.113818	 -0.146892
  1.597457	  1.121012	 -0.155562
  1.601421	  1.129140	 -0.162299
  1.616590	  1.152633	 -0.178993
  1.626797	  1.166022	 -0.189378
  1.634050	  1.170757	 -0.195758
  1.651311	  1.184182	 -0.208171
  1.663158	  1.194253	 -0.216498
  1.674497	  1.205826	 -0.223342
  1.689334	  1.229773	 -0.237891
  1.692925	  1.239606	 -0.242502
  1.698056	  1.249100	 -0.247575
  1.704775	  1.275272	 -0.261260
  1.711185	  1.295501	 -0.278656
  1.714503	  1.299536	 -0.285608
  1.723526	  1.311803	 -0.303767
  1.734969	  1.330162	 -0.327100
  1.739696	  1.340976	 -0.335253
  1.748291	  1.357854	 -0.342126
  1.754554	  1.373599	 -0.344252
  1.750043	  1.395267	 -0.350407
  1.749218	  1.414386	 -0.360803
  1.751754	  1.431563	 -0.371643
  1.754151	  1.448084	 -0.382668
  1.754389	  1.463579	 -0.395057
  1.753227	  1.478295	 -0.407975
  1.752094	  1.493452	 -0.421201
  1.748477	  1.506000	 -0.433156
  1.744100	  1.518870	 -0.446814
  1.744192	  1.535967	 -0.470380
  1.741536	  1.548224	 -0.482954
  1.735610	  1.557227	 -0.493287
  1.724835	  1.572189	 -0.505730
  1.716460	  1.586022	 -0.519167
  1.708932	  1.599217	 -0.530775
  1.701923	  1.611183	 -0.543671
  1.694936	  1.619655	 -0.560406
  1.688044	  1.626332	 -0.583504
  1.681538	  1.634044	 -0.602773
  1.676071	  1.642455	 -0.613237
  1.665225	  1.654012	 -0.628481
  1.655466	  1.661783	 -0.642033
  1.643397	  1.669595	 -0.658356
  1.630603	  1.678487	 -0.676183
  1.621635	  1.682842	 -0.688902
  1.609954	  1.687856	 -0.708877
  1.594729	  1.689013	 -0.736374
  1.588541	  1.686507	 -0.745082
  1.577504	  1.685942	 -0.762130
  1.560867	  1.684006	 -0.790859
  1.552446	  1.678479	 -0.808207
  1.546817	  1.670044	 -0.826586
  1.541571	  1.656758	 -0.842367
  1.536448	  1.642528	 -0.857838
  1.532216	  1.627563	 -0.872263
  1.528636	  1.613421	 -0.886093
  1.527475	  1.594293	 -0.900526
  1.531622	  1.576401	 -0.911232
  1.539009	  1.560804	 -0.922546
  1.545509	  1.548349	 -0.933249
  1.555357	  1.536528	 -0.948902
  1.564668	  1.528484	 -0.964839
  1.574809	  1.526818	 -0.977439
  1.587590	  1.526641	 -0.995333
  1.602269	  1.521955	 -1.011554
  1.612552	  1.517231	 -1.021607
  1.630832	  1.512006	 -1.031345
  1.648873	  1.508310	 -1.042580
  1.665433	  1.506198	 -1.053959
  1.682362	  1.504230	 -1.064271
  1.699185	  1.502914	 -1.075106
  1.716021	  1.502277	 -1.085911
  1.732878	  1.501757	 -1.096660
  1.750003	  1.501747	 -1.106990
  1.767161	  1.501780	 -1.117292
  1.784452	  1.501820	 -1.127669
  1.801997	  1.501918	 -1.138167
  1.819211	  1.502228	 -1.148345
