  2.993463	  0.048315	 -0.466633
  2.963824	  0.047837	 -0.462013
  2.927617	  0.053752	 -0.493065
  2.885585	  0.061537	 -0.515576
  2.842354	  0.071084	 -0.537877
  2.796582	  0.081734	 -0.558253
  2.750126	  0.090916	 -0.573403
  2.705699	  0.099822	 -0.587614
  2.660955	  0.110378	 -0.600476
  2.615170	  0.129794	 -0.606533
  2.568132	  0.147940	 -0.622484
  2.522253	  0.158993	 -0.647740
  2.479948	  0.170487	 -0.671870
  2.439066	  0.182615	 -0.695286
  2.397907	  0.195419	 -0.718368
  2.354477	  0.208665	 -0.741729
  2.307820	  0.218886	 -0.763986
  2.260960	  0.225462	 -0.784069
  2.215182	  0.228961	 -0.801989
  2.169041	  0.229902	 -0.818383
  2.120914	  0.228260	 -0.833881
  2.072371	  0.227032	 -0.850592
  2.024606	  0.226847	 -0.868813
  1.978493	  0.228272	 -0.886725
  1.933252	  0.230688	 -0.902582
  1.886877	  0.238108	 -0.914565
  1.840577	  0.250261	 -0.927623
  1.793979	  0.257971	 -0.945206
  1.747654	  0.264451	 -0.964431
  1.702555	  0.270705	 -0.985109
  1.659180	  0.275726	 -1.006547
  1.614917	  0.281785	 -1.028990
  1.571546	  0.290036	 -1.052496
  1.529355	  0.299544	 -1.076682
  1.488637	  0.308592	 -1.100941
  1.447400	  0.316404	 -1.126376
  1.405218	  0.322458	 -1.152041
  1.362586	  0.326505	 -1.176543
  1.318164	  0.328899	 -1.200976
  1.272379	  0.327780	 -1.223182
  1.225843	  0.322812	 -1.241962
  1.181757	  0.314715	 -1.256935
  1.140620	  0.304601	 -1.268468
  1.103099	  0.292424	 -1.277548
  1.056952	  0.272046	 -1.288109
  0.987975	  0.237610	 -1.303289
  0.905562	  0.201964	 -1.319155
  0.829679	  0.180806	 -1.330102
  0.768548	  0.165330	 -1.334554
  0.714576	  0.144508	 -1.330881
  0.657994	  0.117719	 -1.316669
  0.602896	  0.120908	 -1.309002
  0.569845	  0.133056	 -1.308158
  0.540900	  0.156069	 -1.313803
  0.501093	  0.208448	 -1.331212
  0.426837	  0.299816	 -1.351412
  0.345879	  0.426388	 -1.315077
  0.247075	  0.542471	 -1.306548
  0.177410	  0.620284	 -1.280919
  0.143616	  0.682848	 -1.245612
  0.121647	  0.734648	 -1.224907
  0.104989	  0.783333	 -1.218336
  0.087460	  0.847910	 -1.231008
  0.073870	  0.915971	 -1.280592
  0.062994	  0.958189	 -1.365145
  0.051185	  0.971994	 -1.481761
  0.090315	  0.999505	 -1.621432
  0.148031	  1.055498	 -1.807096
  0.196862	  1.084400	 -2.011501
  0.196244	  1.051686	 -2.173347
  0.143645	  1.015222	 -2.232458
  0.113255	  1.000224	 -2.236523
  0.077327	  0.988997	 -2.222536
  0.004586	  0.964936	 -2.170946
 -0.093737	  0.934006	 -2.091686
 -0.186105	  0.870411	 -2.008627
 -0.278964	  0.760149	 -1.959579
 -0.376480	  0.665053	 -1.937044
 -0.469499	  0.620578	 -1.937507
 -0.542222	  0.616143	 -1.956596
 -0.597035	  0.624434	 -1.979230
 -0.644118	  0.635442	 -2.001558
 -0.687975	  0.646628	 -2.023938
 -0.729972	  0.657136	 -2.046975
 -0.770678	  0.666509	 -2.069985
 -0.811377	  0.674670	 -2.093318
 -0.854146	  0.681987	 -2.117828
 -0.898543	  0.689130	 -2.141304
 -0.943901	  0.695512	 -2.163445
 -0.987679	  0.701031	 -2.183725
 -1.031159	  0.706256	 -2.203668
 -1.076869	  0.712674	 -2.224652
 -1.122324	  0.722618	 -2.243729
 -1.168563	  0.736109	 -2.261093
 -1.213214	  0.751977	 -2.274919
 -1.256484	  0.765232	 -2.291915
 -1.301367	  0.774014	 -2.310851
 -1.346347	  0.783794	 -2.332625
 -1.393598	  0.791826	 -2.350808
 -1.439046	  0.804758	 -2.364293
 -1.482820	  0.814265	 -2.383400
 -1.529751	  0.815523	 -2.405357
 -1.583508	  0.815303	 -2.414080
 -1.599343	  0.823456	 -2.438221
