 -2.441554	  0.349479	  0.627835
 -2.445536	  0.345320	  0.640262
 -2.439740	  0.351427	  0.622121
 -2.434537	  0.357288	  0.603721
 -2.430732	  0.362487	  0.584823
 -2.427419	  0.367925	  0.567171
 -2.429201	  0.375586	  0.549938
 -2.434057	  0.387485	  0.525958
 -2.433012	  0.393790	  0.506631
 -2.429363	  0.400842	  0.492882
 -2.425422	  0.408729	  0.476573
 -2.423076	  0.411246	  0.452471
 -2.421700	  0.413384	  0.432937
 -2.419717	  0.415017	  0.412822
 -2.414313	  0.417631	  0.392667
 -2.410605	  0.420265	  0.376768
 -2.407134	  0.423549	  0.355995
 -2.402609	  0.425052	  0.330329
 -2.400441	  0.424033	  0.317720
 -2.397099	  0.418793	  0.290729
 -2.395981	  0.416784	  0.270551
 -2.396216	  0.419063	  0.251821
 -2.395118	  0.429286	  0.226295
 -2.395003	  0.435853	  0.208711
 -2.396271	  0.440774	  0.196708
 -2.393033	  0.456842	  0.179906
 -2.389089	  0.469198	  0.161287
 -2.387222	  0.478152	  0.142541
 -2.385622	  0.482328	  0.122722
 -2.384136	  0.486132	  0.103135
 -2.381481	  0.489832	  0.083661
 -2.377161	  0.493352	  0.064452
 -2.372857	  0.496863	  0.045238
 -2.367622	  0.500818	  0.026346
 -2.360890	  0.505479	  0.008098
 -2.354159	  0.510134	 -0.010151
 -2.347563	  0.515267	 -0.028322
 -2.341090	  0.520792	 -0.046420
 -2.334701	  0.526417	 -0.064519
 -2.328837	  0.532714	 -0.082574
 -2.322968	  0.539016	 -0.100628
 -2.317863	  0.547323	 -0.118094
 -2.312983	  0.556197	 -0.135343
 -2.308259	  0.566156	 -0.152033
 -2.303880	  0.577915	 -0.167613
 -2.299499	  0.589633	 -0.183213
 -2.295174	  0.600263	 -0.199589
 -2.290841	  0.610874	 -0.215978
 -2.285919	  0.620893	 -0.232580
 -2.280196	  0.629760	 -0.249674
 -2.274596	  0.638433	 -0.267045
 -2.268839	  0.644957	 -0.285400
 -2.262953	  0.649836	 -0.304073
 -2.256882	  0.653638	 -0.322826
 -2.250133	  0.656310	 -0.341799
 -2.243512	  0.658324	 -0.360709
 -2.236612	  0.658221	 -0.379431
 -2.229191	  0.657910	 -0.397366
 -2.220692	  0.652491	 -0.415103
 -2.209103	  0.644882	 -0.435981
 -2.199784	  0.643303	 -0.453345
 -2.193828	  0.644450	 -0.467421
 -2.185041	  0.641542	 -0.487018
 -2.174274	  0.643196	 -0.512274
 -2.171777	  0.656374	 -0.528996
 -2.169986	  0.671347	 -0.545808
 -2.165386	  0.677876	 -0.562882
 -2.156034	  0.675314	 -0.580797
 -2.145215	  0.676174	 -0.601236
 -2.138362	  0.686049	 -0.620472
 -2.134688	  0.696897	 -0.632113
 -2.129299	  0.709886	 -0.647336
 -2.125020	  0.723145	 -0.664042
 -2.125772	  0.739513	 -0.682890
 -2.125150	  0.750568	 -0.701047
 -2.122168	  0.756368	 -0.712303
 -2.110240	  0.758356	 -0.731705
 -2.099662	  0.757582	 -0.756631
 -2.097208	  0.766819	 -0.781929
 -2.100063	  0.776012	 -0.795435
 -2.102773	  0.787324	 -0.805900
 -2.105020	  0.800787	 -0.825103
 -2.103930	  0.810837	 -0.843389
 -2.098825	  0.822134	 -0.860327
 -2.094419	  0.829458	 -0.879348
 -2.092818	  0.835852	 -0.895836
 -2.091653	  0.842711	 -0.915848
 -2.083868	  0.844177	 -0.939775
 -2.079722	  0.842801	 -0.959587
 -2.079942	  0.840607	 -0.977029
 -2.080061	  0.838548	 -0.999547
 -2.075262	  0.841344	 -1.021722
 -2.068762	  0.847437	 -1.036550
 -2.064086	  0.858199	 -1.056284
 -2.064293	  0.865435	 -1.073170
 -2.066545	  0.868745	 -1.092091
 -2.067675	  0.871853	 -1.116511
 -2.062261	  0.874015	 -1.138569
 -2.052804	  0.876741	 -1.153341
 -2.044723	  0.881010	 -1.168501
 -2.039916	  0.886857	 -1.189184
 -2.037112	  0.892507	 -1.208550
 -2.034786	  0.898194	 -1.227586
 -2.032527	  0.903953	 -1.246458
 -2.030361	  0.909929	 -1.264534
 -2.028119	  0.916232	 -1.283382
