 0.0 0.0 0.0 0
 -0.40683229543866883 0.6279470954159599 0.6635012650679444 1000
 -0.7012261351001582 -0.5374080498908513 0.4688075248596234 1000
 -0.3765975386939383 0.8090658269920966 -0.4512524586561963 1000
 -0.2622232541371192 -0.6158247463265853 -0.7425690855412285 1000
 0.7390276659604278 -0.040534117079601306 -0.6723459632493223 1000
 0.8879631656164646 0.43390513196939506 0.15260652987014867 1000
 0.2213818333780432 -0.2728936860937299 -0.936637133547647 1000
 0.026543492150564812 -0.97517776265999 0.21793295812682523 1000
 0.0 0.0 0.0 0
 0.18123472157804238 -0.5140153929788623 0.8389232095223703 1000
 0.393820600606677 0.8345863882889912 -0.3853996562278344 1000
 -0.47151656756546373 0.03915834058563922 0.8812620216904062 1000
 0.8720277767315976 0.4514502725807914 -0.19001896746187175 1000
 0.305038086974872 0.8426851297589496 0.4432510999172504 1000
 0.8982649254700966 -0.178856863452043 -0.40084953045538013 1000
 -0.25727549047898113 0.9654962218502215 0.02784542317414368 1000
 -0.8049388677774975 0.18180632530220625 -0.564809595546312 1000
 0.0 0.0 0.0 0
 0.160110800340265 0.49804681178700927 -0.8521231747131367 1000
 -0.5583403341739486 0.7295601505148339 0.3958333715280913 1000
 -0.7287022989158902 -0.27999038220868977 0.6252882098883106 1000
 0.11345508764064152 -0.8311000835894792 0.544764714483248 1000
 0.596324265724057 0.7746061107269656 0.2088079101305975 1000
 0.5253699075300134 -0.6058814212005487 0.5967236912557672 1000
 -0.4638542609635442 -0.6248969915912047 0.6275125293460089 1000
 -0.9938687958754395 -0.08909423667361549 -0.06158760895382389 1000
 0.0 0.0 0.0 0
 -0.24774695543346745 -0.9572908752374488 0.14941427729827647 1000
 0.22724656478990168 0.04393933688899779 -0.9728095052295407 1000
 -0.18861547920098184 0.5084010996126318 0.8395102875596286 1000
 -0.7442843462535149 0.31074236449262116 0.5913467636095697 1000
 -0.10460308065157124 -0.11405797405986966 -0.9874608721724414 1000
 0.720869274108123 -0.6576571568529654 -0.2194437369507307 1000
 -0.5743086840110312 -0.17936932854968968 0.7988336369014206 1000
 -0.7177907422040157 0.4610322474434905 -0.5212654959072315 1000
 0.0 0.0 0.0 0
 -0.9766457788288267 0.12026088657037702 0.17825358862345791 1000
 -0.7811341534199933 0.6074069713027265 -0.142278619524083 1000
 -0.43552611772491706 -0.8995010963792814 0.01589900600451946 1000
 -0.8392265173152882 -0.05586825446652431 -0.5407648202108896 1000
 -0.002782635017760493 0.6464048066025923 -0.7632601672715686 1000
 0.8437907170357006 0.3771881757657959 -0.3819689855300412 1000
 -0.39689983118060396 0.4000332256470725 -0.8262099868600029 1000
 0.5624458996230417 0.4580930713419206 -0.6884644856386952 1000
 0.0 0.0 0.0 0
 -0.9542020239261927 -0.2964809275259505 0.02756006437781422 1000
 -0.04825088646990132 -0.5666838370803033 -0.8222057411298053 1000
 0.5978105606039189 -0.6901975786852322 0.40836728077488094 1000
 0.538059890884228 0.13901322680568406 0.8314787288889137 1000
 -0.09714083415206373 0.12099513555471092 0.9879791675497708 1000
 -0.4391242035955251 -0.8507251071936457 -0.28751647919198536 1000
 -0.22873997958675119 0.06305905877352722 -0.9711640318943289 1000
 -0.7507592292833778 -0.6240109056729487 0.215626921433884 1000
 0.0 0.0 0.0 0
 -0.24155213177879886 0.7039657578865316 0.6671932099147581 1000
 0.8548255959790684 -0.2922315057017947 0.4304868726619803 1000
 -0.610101343523928 0.13713174554672103 0.780368653261782 1000
 0.6747903957187785 -0.2024780361066641 0.7090145038996608 1000
 0.2110166619988583 0.7478782852422281 0.6293226825897853 1000
 0.44213862336831106 0.870494340243047 -0.21413089765560847 1000
 0.8981326114914091 -0.431965224021329 0.0798802692272891 1000
 0.4207619684590017 -0.8201442612617738 -0.38850451299551847 1000
 0.0 0.0 0.0 0
 -0.40218844992775876 0.5651175039969121 -0.7204072857911742 1000
 0.9326796594900241 0.27911457479098467 -0.22924595288209573 1000
 0.1690043221732086 -0.9689069453386812 -0.17932336814046299 1000
 0.5197010636841646 0.7445915480389339 0.41708899649179354 1000
