 -0.022713	 -1.124259	 -2.813614
 -0.022488	 -1.113128	 -2.785757
 -0.031623	 -1.091107	 -2.738819
 -0.049839	 -1.078634	 -2.691522
 -0.065853	 -1.066798	 -2.644116
 -0.088019	 -1.048593	 -2.603077
 -0.106362	 -1.034047	 -2.559146
 -0.122509	 -1.019605	 -2.512988
 -0.136219	 -1.004563	 -2.465774
 -0.147212	 -0.989054	 -2.418447
 -0.155495	 -0.972830	 -2.371510
 -0.164705	 -0.955516	 -2.326870
 -0.176753	 -0.936284	 -2.282632
 -0.189769	 -0.914813	 -2.238465
 -0.203517	 -0.891977	 -2.196229
 -0.219470	 -0.866208	 -2.157052
 -0.235682	 -0.838749	 -2.118038
 -0.253158	 -0.815264	 -2.075273
 -0.271244	 -0.796226	 -2.031782
 -0.289639	 -0.779514	 -1.987475
 -0.308386	 -0.764421	 -1.941044
 -0.326174	 -0.751529	 -1.896065
 -0.343298	 -0.740336	 -1.853193
 -0.361316	 -0.728468	 -1.808870
 -0.379102	 -0.715227	 -1.762995
 -0.395582	 -0.700846	 -1.717720
 -0.410980	 -0.685205	 -1.673017
 -0.426583	 -0.668292	 -1.627136
 -0.441071	 -0.649700	 -1.579804
 -0.453578	 -0.629779	 -1.535359
 -0.464213	 -0.607190	 -1.494166
 -0.472301	 -0.580271	 -1.455830
 -0.476191	 -0.549144	 -1.422792
 -0.475304	 -0.516301	 -1.398782
 -0.466240	 -0.471574	 -1.378537
 -0.426689	 -0.385665	 -1.355678
 -0.391266	 -0.261391	 -1.317296
 -0.398570	 -0.177202	 -1.253238
 -0.410340	 -0.156170	 -1.201985
 -0.417880	 -0.155906	 -1.174422
 -0.423186	 -0.166300	 -1.130896
 -0.464345	 -0.210505	 -1.054399
 -0.546463	 -0.280477	 -0.965860
 -0.596545	 -0.318681	 -0.893519
 -0.622235	 -0.332300	 -0.845119
 -0.642261	 -0.337398	 -0.803623
 -0.660950	 -0.337417	 -0.760360
 -0.678424	 -0.332822	 -0.714381
 -0.694408	 -0.325210	 -0.670467
 -0.710434	 -0.314782	 -0.627070
 -0.727610	 -0.300746	 -0.580419
 -0.742382	 -0.284533	 -0.532405
 -0.743516	 -0.263683	 -0.483605
 -0.770832	 -0.256527	 -0.442374
 -0.786251	 -0.244829	 -0.396096
 -0.798032	 -0.231555	 -0.347824
 -0.805878	 -0.214052	 -0.299067
 -0.811221	 -0.194261	 -0.252579
 -0.817704	 -0.174287	 -0.208033
 -0.825826	 -0.155112	 -0.163676
 -0.835586	 -0.135183	 -0.118585
 -0.846958	 -0.113851	 -0.074086
 -0.860109	 -0.092485	 -0.030463
 -0.874660	 -0.071665	  0.012973
 -0.890337	 -0.050819	  0.057438
 -0.906107	 -0.030495	  0.101720
 -0.921453	 -0.011606	  0.143787
 -0.937142	  0.006228	  0.187921
 -0.952306	  0.019578	  0.230983
 -0.969250	  0.030813	  0.274171
 -0.989141	  0.042934	  0.320400
 -1.006917	  0.060408	  0.366649
 -1.022365	  0.081848	  0.409882
 -1.037680	  0.104146	  0.451999
 -1.053580	  0.125022	  0.494337
 -1.069919	  0.143646	  0.537122
 -1.086760	  0.159219	  0.580892
 -1.103992	  0.172671	  0.627402
 -1.120028	  0.184985	  0.674945
 -1.133633	  0.196176	  0.721680
 -1.146066	  0.205732	  0.768870
 -1.158205	  0.215038	  0.816511
 -1.171422	  0.226532	  0.865168
 -1.184700	  0.240513	  0.912992
 -1.196698	  0.256462	  0.959442
 -1.207534	  0.272636	  1.005557
 -1.217860	  0.289828	  1.051462
 -1.228512	  0.309005	  1.097545
 -1.239205	  0.329904	  1.141100
 -1.249362	  0.351909	  1.183483
 -1.258829	  0.375125	  1.228049
 -1.267554	  0.399027	  1.273299
 -1.276792	  0.422417	  1.317463
 -1.286464	  0.444898	  1.359800
 -1.297070	  0.467588	  1.403388
 -1.308420	  0.489427	  1.447560
 -1.320597	  0.509702	  1.492079
 -1.333808	  0.527963	  1.537072
 -1.347714	  0.542643	  1.582636
 -1.361470	  0.554322	  1.628835
 -1.375056	  0.563939	  1.676417
 -1.389918	  0.574220	  1.723772
 -1.404730	  0.587735	  1.769393
 -1.418658	  0.603989	  1.813626
 -1.431975	  0.622117	  1.858995
 -1.444773	  0.641925	  1.904559
 -1.457332	  0.661414	  1.949287
 -1.469678	  0.680230	  1.992195
 -1.482673	  0.701153	  2.034490
 -1.496435	  0.720854	  2.077630
 -1.510253	  0.740591	  2.121635
 -1.524813	  0.760487	  2.165864
 -1.542619	  0.780204	  2.210601
 -1.566890	  0.797192	  2.251362
 -1.585691	  0.804683	  2.296237
 -1.601378	  0.821335	  2.339693
 -1.620285	  0.835728	  2.382485
 -1.636488	  0.844085	  2.406310
