 -0.230401	  0.931949	  2.317315
 -0.224299	  0.938538	  2.306260
 -0.221973	  0.941049	  2.302047
 -0.213321	  0.950277	  2.287145
 -0.206261	  0.961535	  2.270092
 -0.200528	  0.972178	  2.255091
 -0.192949	  0.982420	  2.240397
 -0.184474	  0.992121	  2.223448
 -0.176409	  0.998712	  2.206410
 -0.167436	  1.006101	  2.191026
 -0.159039	  1.014539	  2.174516
 -0.152519	  1.024689	  2.159760
 -0.145835	  1.037290	  2.143463
 -0.139147	  1.046511	  2.124250
 -0.132552	  1.050674	  2.108532
 -0.124470	  1.055813	  2.090266
 -0.117480	  1.062480	  2.071979
 -0.110998	  1.070335	  2.055282
 -0.104415	  1.077811	  2.038482
 -0.097790	  1.084625	  2.020362
 -0.091612	  1.091446	  2.002581
 -0.085828	  1.098700	  1.984851
 -0.080052	  1.105956	  1.967131
 -0.074459	  1.113092	  1.949304
 -0.068889	  1.120211	  1.931464
 -0.062949	  1.127348	  1.913750
 -0.056650	  1.134514	  1.896173
 -0.046017	  1.143299	  1.881696
 -0.033871	  1.152521	  1.868757
 -0.019760	  1.161908	  1.858138
 -0.005236	  1.171293	  1.848091
  0.009847	  1.180582	  1.838805
  0.024956	  1.189866	  1.829557
  0.040060	  1.199146	  1.820303
  0.054406	  1.207684	  1.809942
  0.068615	  1.215973	  1.797846
  0.081635	  1.225076	  1.785334
  0.093543	  1.236791	  1.773250
  0.108106	  1.247931	  1.764765
  0.122225	  1.254531	  1.755070
  0.136591	  1.261496	  1.742947
  0.150917	  1.271286	  1.726947
  0.163730	  1.280791	  1.717952
  0.175649	  1.288875	  1.706758
  0.187339	  1.296542	  1.691398
  0.196361	  1.303192	  1.673624
  0.210539	  1.314176	  1.664259
  0.221563	  1.326985	  1.652914
  0.231726	  1.332829	  1.635919
  0.244412	  1.338510	  1.622599
  0.254044	  1.345634	  1.607720
  0.261553	  1.353827	  1.586155
  0.267265	  1.360282	  1.572566
  0.273093	  1.368899	  1.555174
  0.278812	  1.377562	  1.537613
  0.280998	  1.385281	  1.518925
  0.283052	  1.392790	  1.500502
  0.285088	  1.400294	  1.482077
  0.284444	  1.407029	  1.463258
  0.283638	  1.413714	  1.444425
  0.282827	  1.420395	  1.425591
  0.281239	  1.426654	  1.406663
  0.278786	  1.432508	  1.387853
  0.275564	  1.439401	  1.369520
  0.272290	  1.447021	  1.352168
  0.271866	  1.454164	  1.329900
  0.271930	  1.457682	  1.311047
  0.268442	  1.459149	  1.292849
  0.265272	  1.462734	  1.273364
  0.265537	  1.470289	  1.253481
  0.266416	  1.477565	  1.233736
  0.267544	  1.483493	  1.215155
  0.266107	  1.488793	  1.197002
  0.264017	  1.493658	  1.177116
  0.268905	  1.494736	  1.155614
  0.274386	  1.500994	  1.138327
  0.274200	  1.508644	  1.117877
  0.275718	  1.514245	  1.099697
  0.280840	  1.521301	  1.081941
  0.285995	  1.529386	  1.062546
  0.286082	  1.545292	  1.049471
  0.288807	  1.560233	  1.034613
  0.293812	  1.573861	  1.018480
  0.296472	  1.583319	  1.003218
  0.301241	  1.596085	  0.989989
  0.304435	  1.612166	  0.972530
  0.311344	  1.623373	  0.960610
  0.318848	  1.636910	  0.950317
  0.325650	  1.652428	  0.938696
  0.333882	  1.667487	  0.922102
  0.342334	  1.678338	  0.913411
  0.351791	  1.692319	  0.903368
  0.365877	  1.705893	  0.888392
  0.373615	  1.715850	  0.875432
  0.382687	  1.729655	  0.866602
  0.396535	  1.745667	  0.860641
  0.409332	  1.757030	  0.852021
  0.416545	  1.775747	  0.838632
  0.425133	  1.789858	  0.827913
  0.432864	  1.804103	  0.821157
  0.441401	  1.823014	  0.812053
  0.450525	  1.834887	  0.804087
  0.462637	  1.850710	  0.796506
  0.472697	  1.867004	  0.789224
  0.484415	  1.880582	  0.780740
  0.498270	  1.892883	  0.771644
  0.508937	  1.908081	  0.762104
  0.517849	  1.925068	  0.754889
  0.527462	  1.941223	  0.751707
  0.538592	  1.957944	  0.748753
  0.549255	  1.974858	  0.744755
  0.559819	  1.991344	  0.740501
  0.570196	  2.008249	  0.737804
  0.580563	  2.025139	  0.735117
  0.590927	  2.042033	  0.732434
  0.600329	  2.059593	  0.730639
  0.608700	  2.077735	  0.729759
  0.617068	  2.095880	  0.728882
  0.625432	  2.114026	  0.728011
  0.633294	  2.132415	  0.727882
  0.641153	  2.150806	  0.727757
  0.649015	  2.169195	  0.727627
  0.657359	  2.187341	  0.726576
  0.666478	  2.204943	  0.723939
  0.675603	  2.222542	  0.721292
  0.684728	  2.240141	  0.718645
  0.693860	  2.257716	  0.715949
  0.704273	  2.271484	  0.705873
  0.720465	  2.292435	  0.689689
  0.725143	  2.298489	  0.685012
