  2.161433	 -0.027986	  1.186864
  2.206274	 -0.017787	  1.187154
  2.189072	 -0.021943	  1.187224
  2.168286	 -0.023601	  1.187781
  2.143137	 -0.031824	  1.186647
  2.130862	 -0.037223	  1.189252
  2.111421	 -0.043460	  1.196636
  2.091782	 -0.053029	  1.202768
  2.072934	 -0.058249	  1.201536
  2.053394	 -0.058728	  1.200855
  2.032503	 -0.061577	  1.201697
  2.013103	 -0.068745	  1.205172
  1.995066	 -0.076457	  1.209869
  1.977993	 -0.081304	  1.217353
  1.959306	 -0.082895	  1.225771
  1.939672	 -0.085535	  1.233965
  1.920902	 -0.090588	  1.239534
  1.901687	 -0.098514	  1.244061
  1.885979	 -0.109057	  1.249011
  1.869400	 -0.126377	  1.254064
  1.854821	 -0.138433	  1.256572
  1.838247	 -0.143904	  1.262893
  1.819742	 -0.147393	  1.273766
  1.801055	 -0.149769	  1.283260
  1.782766	 -0.151622	  1.287273
  1.760479	 -0.159135	  1.288913
  1.743691	 -0.170116	  1.290443
  1.725270	 -0.183109	  1.291810
  1.708405	 -0.193172	  1.290090
  1.687417	 -0.196436	  1.292147
  1.670016	 -0.198176	  1.298181
  1.649794	 -0.196783	  1.306083
  1.627418	 -0.202013	  1.311073
  1.610298	 -0.208163	  1.314427
  1.592511	 -0.211453	  1.321250
  1.573401	 -0.213154	  1.330627
  1.557204	 -0.219261	  1.335719
  1.537655	 -0.228212	  1.337303
  1.517536	 -0.231152	  1.341033
  1.498001	 -0.233087	  1.352786
  1.480322	 -0.234169	  1.363334
  1.462182	 -0.235734	  1.369027
  1.441603	 -0.237709	  1.371464
  1.421222	 -0.237675	  1.370653
  1.400156	 -0.234668	  1.374506
  1.380665	 -0.228609	  1.383741
  1.364560	 -0.226395	  1.390059
  1.343551	 -0.229460	  1.392476
  1.323861	 -0.231373	  1.392129
  1.303139	 -0.230231	  1.395116
  1.283262	 -0.226798	  1.398784
  1.264533	 -0.221873	  1.401015
  1.244772	 -0.218336	  1.403304
  1.224786	 -0.217302	  1.406708
  1.205115	 -0.217655	  1.410475
  1.185464	 -0.218075	  1.414155
  1.165831	 -0.219288	  1.417808
  1.146222	 -0.220853	  1.421413
  1.126615	 -0.222379	  1.425057
  1.107076	 -0.224969	  1.428449
  1.087558	 -0.227778	  1.431789
  1.068040	 -0.230589	  1.435129
  1.048678	 -0.234667	  1.438041
  1.029333	 -0.238850	  1.440916
  1.009988	 -0.243034	  1.443791
  0.990826	 -0.248369	  1.445873
  0.971664	 -0.253711	  1.447950
  0.952501	 -0.259062	  1.449986
  0.933330	 -0.264429	  1.451887
  0.914134	 -0.269732	  1.453719
  0.894882	 -0.274910	  1.455275
  0.875642	 -0.280181	  1.456905
  0.856424	 -0.285458	  1.458516
  0.837217	 -0.290960	  1.459320
  0.817964	 -0.296346	  1.459955
  0.798680	 -0.301650	  1.460295
  0.779366	 -0.306782	  1.460406
  0.759950	 -0.311532	  1.460531
  0.740372	 -0.315538	  1.460616
  0.720755	 -0.319393	  1.460605
  0.700957	 -0.322207	  1.460307
  0.681151	 -0.324952	  1.459993
  0.661368	 -0.327906	  1.460095
  0.641599	 -0.330927	  1.460306
  0.621853	 -0.334091	  1.460615
  0.602257	 -0.338001	  1.461444
  0.582659	 -0.341907	  1.462266
  0.563143	 -0.346126	  1.463416
  0.543689	 -0.350559	  1.464800
  0.524227	 -0.354960	  1.466192
  0.505049	 -0.360256	  1.468041
  0.485993	 -0.364205	  1.469417
  0.466663	 -0.365709	  1.470224
  0.444895	 -0.370699	  1.472971
  0.427407	 -0.377487	  1.478841
  0.408571	 -0.392695	  1.483260
  0.394507	 -0.403974	  1.481735
  0.378419	 -0.412213	  1.480873
  0.358434	 -0.416098	  1.482823
  0.338040	 -0.423652	  1.488021
  0.318155	 -0.435368	  1.491829
  0.305408	 -0.440822	  1.494546
  0.284543	 -0.447166	  1.500913
  0.266837	 -0.457290	  1.503766
  0.249688	 -0.469572	  1.502271
  0.231204	 -0.478180	  1.502754
  0.209581	 -0.485195	  1.508401
  0.191161	 -0.488754	  1.514940
  0.176128	 -0.493191	  1.518477
  0.156855	 -0.497982	  1.521472
  0.132652	 -0.502522	  1.525316
  0.113601	 -0.502639	  1.530031
  0.094375	 -0.502027	  1.535963
  0.078466	 -0.498312	  1.541212
  0.057395	 -0.495914	  1.543820
  0.034753	 -0.496701	  1.547290
  0.017396	 -0.495998	  1.556003
 -0.000718	 -0.491284	  1.563277
 -0.019431	 -0.489981	  1.567859
 -0.040734	 -0.493339	  1.575344
 -0.060380	 -0.498034	  1.578563
 -0.078747	 -0.496468	  1.579552
 -0.098108	 -0.490843	  1.583514
 -0.118911	 -0.490614	  1.591721
 -0.138769	 -0.496832	  1.598657
 -0.157515	 -0.501480	  1.598799
 -0.178051	 -0.501599	  1.598174
 -0.196317	 -0.498825	  1.597932
 -0.215889	 -0.502000	  1.600800
 -0.233665	 -0.511954	  1.607568
 -0.250793	 -0.519991	  1.615942
 -0.267427	 -0.527154	  1.622258
 -0.285097	 -0.535313	  1.627108
 -0.304429	 -0.539032	  1.632546
 -0.322445	 -0.542911	  1.635292
 -0.341201	 -0.550806	  1.630824
 -0.361563	 -0.562331	  1.624832
 -0.383629	 -0.570597	  1.631360
 -0.397650	 -0.573405	  1.641335
 -0.418957	 -0.576120	  1.645391
 -0.439217	 -0.576400	  1.650112
 -0.456420	 -0.578508	  1.655537
 -0.478326	 -0.583808	  1.658212
 -0.499427	 -0.588302	  1.662159
 -0.513000	 -0.589863	  1.667871
 -0.535830	 -0.592621	  1.677409
 -0.555008	 -0.595922	  1.680669
 -0.571780	 -0.599355	  1.681956
 -0.593120	 -0.600984	  1.692586
 -0.613620	 -0.602594	  1.701562
 -0.630525	 -0.605681	  1.699858
 -0.649354	 -0.609780	  1.697217
 -0.670857	 -0.613949	  1.699147
 -0.690510	 -0.616840	  1.702856
 -0.710044	 -0.619416	  1.706268
 -0.729739	 -0.621726	  1.708902
 -0.749431	 -0.624012	  1.711544
 -0.769252	 -0.626174	  1.713116
 -0.789120	 -0.628276	  1.714026
 -0.808989	 -0.630379	  1.714928
 -0.828857	 -0.632654	  1.715253
 -0.848724	 -0.634928	  1.715577
 -0.868550	 -0.637550	  1.715802
 -0.888320	 -0.640573	  1.715911
 -0.908090	 -0.643598	  1.716020
 -0.927619	 -0.647906	  1.716240
 -0.946916	 -0.653153	  1.716544
 -0.966213	 -0.658400	  1.716846
 -0.985257	 -0.664498	  1.717271
 -1.004067	 -0.671262	  1.717786
 -1.022387	 -0.678438	  1.717700
 -1.040868	 -0.687953	  1.716127
 -1.059241	 -0.697763	  1.715079
 -1.078863	 -0.701958	  1.718529
 -1.098191	 -0.703951	  1.722501
 -1.118102	 -0.706832	  1.725971
 -1.137554	 -0.711151	  1.728843
 -1.156845	 -0.715229	  1.732198
 -1.176081	 -0.718946	  1.736217
 -1.195319	 -0.722427	  1.740436
 -1.214543	 -0.725384	  1.745091
 -1.233769	 -0.728341	  1.749746
 -1.253041	 -0.731993	  1.753645
 -1.272318	 -0.735760	  1.757414
 -1.291609	 -0.739560	  1.761083
 -1.311003	 -0.743889	  1.763340
 -1.330419	 -0.748083	  1.765644
 -1.350090	 -0.748829	  1.769166
 -1.369759	 -0.749554	  1.772709
 -1.389058	 -0.751800	  1.777452
 -1.408335	 -0.754113	  1.782252
 -1.427612	 -0.756428	  1.787052
 -1.446749	 -0.760533	  1.791166
 -1.465884	 -0.764654	  1.795273
 -1.485019	 -0.768775	  1.799380
 -1.503949	 -0.774305	  1.802710
 -1.522859	 -0.779936	  1.805984
 -1.541769	 -0.785573	  1.809248
 -1.560690	 -0.791239	  1.812496
 -1.579459	 -0.797595	  1.815201
