 -0.057894	  1.631084	 -1.870762
 -0.042164	  1.665705	 -1.894417
 -0.049525	  1.650668	 -1.883477
 -0.056873	  1.635615	 -1.872549
 -0.064385	  1.620778	 -1.861439
 -0.072167	  1.606356	 -1.849977
 -0.079741	  1.591858	 -1.838465
 -0.087622	  1.577495	 -1.826963
 -0.095750	  1.563257	 -1.815464
 -0.104499	  1.549937	 -1.803403
 -0.114223	  1.538087	 -1.790476
 -0.123889	  1.526591	 -1.777195
 -0.133223	  1.514372	 -1.764338
 -0.142436	  1.501707	 -1.751709
 -0.152363	  1.488076	 -1.740531
 -0.161052	  1.472291	 -1.732418
 -0.171322	  1.454952	 -1.727270
 -0.187153	  1.440822	 -1.719398
 -0.202336	  1.429222	 -1.704045
 -0.210714	  1.422115	 -1.691164
 -0.220167	  1.415570	 -1.675552
 -0.232819	  1.405144	 -1.660438
 -0.245118	  1.393115	 -1.650325
 -0.255023	  1.383931	 -1.642121
 -0.268418	  1.370978	 -1.628636
 -0.281356	  1.355056	 -1.610053
 -0.285403	  1.346228	 -1.602687
 -0.295311	  1.333169	 -1.588086
 -0.307774	  1.315535	 -1.574822
 -0.313004	  1.307012	 -1.568996
 -0.324663	  1.290609	 -1.558897
 -0.333576	  1.274997	 -1.552375
 -0.343161	  1.256328	 -1.545961
 -0.352319	  1.232561	 -1.536197
 -0.359176	  1.222160	 -1.524320
 -0.364625	  1.210833	 -1.508464
 -0.372489	  1.200491	 -1.490013
 -0.381719	  1.194319	 -1.476991
 -0.399366	  1.184150	 -1.459643
 -0.412051	  1.170686	 -1.446018
 -0.423535	  1.156656	 -1.436794
 -0.428971	  1.146823	 -1.429558
 -0.437161	  1.129665	 -1.417361
 -0.439691	  1.113355	 -1.403418
 -0.438636	  1.100110	 -1.391509
 -0.439143	  1.088285	 -1.377160
 -0.441481	  1.075492	 -1.358486
 -0.441444	  1.058904	 -1.342142
 -0.440531	  1.049700	 -1.334729
 -0.437172	  1.027252	 -1.320590
 -0.435981	  1.007739	 -1.306679
 -0.438577	  0.999811	 -1.296817
 -0.443726	  0.986606	 -1.281361
 -0.452287	  0.968462	 -1.264111
 -0.459433	  0.959360	 -1.251434
 -0.468019	  0.950042	 -1.239461
 -0.478083	  0.936332	 -1.219906
 -0.487050	  0.926142	 -1.205244
 -0.489081	  0.918907	 -1.196832
 -0.494244	  0.904680	 -1.184046
 -0.500625	  0.890610	 -1.174687
 -0.505053	  0.872916	 -1.162694
 -0.514362	  0.859313	 -1.150229
 -0.525043	  0.846474	 -1.139778
 -0.535587	  0.832625	 -1.133202
 -0.548278	  0.816389	 -1.130419
 -0.560780	  0.803021	 -1.129770
 -0.577828	  0.793082	 -1.126916
 -0.600095	  0.783231	 -1.115628
 -0.614414	  0.774699	 -1.105526
 -0.623886	  0.765969	 -1.097829
 -0.639751	  0.745235	 -1.084087
 -0.652956	  0.734386	 -1.074783
 -0.658789	  0.725703	 -1.071223
 -0.672193	  0.708618	 -1.061956
 -0.680343	  0.692547	 -1.051999
 -0.687601	  0.684408	 -1.047318
 -0.700093	  0.664810	 -1.040256
 -0.708208	  0.650736	 -1.033773
 -0.716102	  0.632160	 -1.025574
 -0.722269	  0.615421	 -1.015299
 -0.732914	  0.608010	 -1.005858
 -0.737815	  0.591139	 -0.996979
 -0.749214	  0.565982	 -0.985670
 -0.756253	  0.554015	 -0.982953
 -0.753212	  0.539617	 -0.985588
 -0.777383	  0.519513	 -0.977078
 -0.772935	  0.489827	 -0.977566
 -0.791845	  0.467368	 -0.969496
 -0.777623	  0.470283	 -0.958256
 -0.798072	  0.437459	 -0.952433
 -0.806628	  0.418434	 -0.935666
 -0.802781	  0.398351	 -0.948579
 -0.813428	  0.375171	 -0.947381
 -0.818575	  0.359464	 -0.951514
 -0.821697	  0.348384	 -0.944794
 -0.829650	  0.325473	 -0.938725
 -0.837137	  0.308012	 -0.931302
 -0.841453	  0.295484	 -0.925621
 -0.851364	  0.276616	 -0.914344
 -0.858534	  0.256728	 -0.902048
 -0.861871	  0.245895	 -0.895919
 -0.866505	  0.233825	 -0.888345
 -0.876751	  0.208823	 -0.872320
 -0.885370	  0.189610	 -0.861775
 -0.891882	  0.178697	 -0.858337
 -0.895682	  0.166124	 -0.853479
 -0.904547	  0.145503	 -0.842100
 -0.913121	  0.123253	 -0.831515
 -0.918829	  0.110811	 -0.826695
 -0.929485	  0.092907	 -0.816768
 -0.936633	  0.080236	 -0.808366
 -0.945906	  0.062518	 -0.794323
 -0.953910	  0.051427	 -0.780695
 -0.963065	  0.043043	 -0.766814
 -0.980616	  0.027362	 -0.747444
 -0.990183	  0.018001	 -0.740578
 -0.997866	  0.010004	 -0.733295
 -1.011498	 -0.007442	 -0.723535
 -1.021001	 -0.027238	 -0.705785
 -1.029737	 -0.038805	 -0.689215
 -1.035908	 -0.042979	 -0.676074
 -1.047691	 -0.046049	 -0.658059
 -1.058016	 -0.042465	 -0.634565
 -1.064595	 -0.040648	 -0.610103
 -1.069660	 -0.041977	 -0.594022
 -1.075731	 -0.044560	 -0.577987
 -1.086733	 -0.050615	 -0.559169
 -1.098207	 -0.059280	 -0.541050
 -1.106360	 -0.066622	 -0.529054
 -1.119829	 -0.074928	 -0.511064
 -1.131473	 -0.080787	 -0.490048
 -1.137494	 -0.085321	 -0.476899
 -1.144747	 -0.087688	 -0.460102
 -1.151402	 -0.089881	 -0.436369
 -1.158162	 -0.082513	 -0.413833
 -1.164721	 -0.078048	 -0.399652
 -1.169223	 -0.075239	 -0.387844
 -1.179334	 -0.068603	 -0.353370
 -1.185103	 -0.067970	 -0.336351
 -1.191053	 -0.070271	 -0.324240
 -1.197377	 -0.075108	 -0.308907
 -1.203857	 -0.084712	 -0.286306
 -1.207456	 -0.091770	 -0.272249
 -1.213206	 -0.098534	 -0.258052
 -1.221733	 -0.106350	 -0.233232
 -1.225286	 -0.110012	 -0.221143
 -1.230077	 -0.114402	 -0.201501
 -1.235344	 -0.121492	 -0.177438
 -1.236936	 -0.125055	 -0.155718
 -1.235939	 -0.126299	 -0.137078
 -1.234758	 -0.134627	 -0.117900
 -1.233833	 -0.149544	 -0.102831
 -1.233530	 -0.165947	 -0.089693
 -1.233034	 -0.182833	 -0.078383
 -1.232897	 -0.198213	 -0.065650
 -1.232802	 -0.212771	 -0.049771
 -1.232867	 -0.223965	 -0.032332
 -1.232334	 -0.234669	 -0.014735
 -1.234290	 -0.246408	 -0.001024
 -1.238281	 -0.263029	  0.011914
 -1.241855	 -0.279955	  0.022984
 -1.245562	 -0.297565	  0.032920
 -1.249639	 -0.315562	  0.041996
 -1.254219	 -0.333612	  0.050017
 -1.258580	 -0.351955	  0.057727
 -1.259058	 -0.370447	  0.065638
 -1.256686	 -0.387599	  0.075913
 -1.253773	 -0.404758	  0.085875
 -1.250345	 -0.422492	  0.094570
 -1.246334	 -0.440644	  0.101991
 -1.241139	 -0.458646	  0.109218
 -1.234226	 -0.474837	  0.116546
 -1.223279	 -0.491665	  0.121087
 -1.213788	 -0.510194	  0.123438
 -1.209703	 -0.530460	  0.131637
 -1.213661	 -0.549359	  0.142616
 -1.218480	 -0.566212	  0.154126
 -1.227957	 -0.582341	  0.155084
 -1.233288	 -0.598140	  0.153696
 -1.240385	 -0.616600	  0.148970
 -1.248605	 -0.634262	  0.141932
 -1.256540	 -0.649727	  0.133389
 -1.265878	 -0.663298	  0.122305
 -1.279018	 -0.678833	  0.107051
 -1.295003	 -0.694228	  0.101394
 -1.305157	 -0.707525	  0.104974
 -1.311818	 -0.727440	  0.107153
 -1.323698	 -0.744239	  0.103075
 -1.337679	 -0.756840	  0.095860
 -1.353141	 -0.767124	  0.090615
 -1.371093	 -0.773410	  0.084471
 -1.389626	 -0.777017	  0.077730
 -1.408111	 -0.780543	  0.070958
 -1.426510	 -0.784870	  0.064441
 -1.444548	 -0.791304	  0.058690
 -1.462624	 -0.797789	  0.053137
 -1.480814	 -0.804342	  0.048030
 -1.499086	 -0.810679	  0.043188
 -1.517714	 -0.816116	  0.038913
 -1.535246	 -0.824882	  0.037368
 -1.553026	 -0.833154	  0.040070
 -1.570647	 -0.843153	  0.043797
 -1.589409	 -0.856198	  0.046571
 -1.603470	 -0.871996	  0.043520
 -1.618577	 -0.895720	  0.039025
 -1.623543	 -0.908202	  0.039748
 -1.628956	 -0.922165	  0.044158
 -1.635379	 -0.940501	  0.055055
 -1.643548	 -0.959427	  0.062308
 -1.650696	 -0.970852	  0.064271
 -1.663686	 -0.987921	  0.064553
 -1.674063	 -1.011346	  0.066925
 -1.677700	 -1.040350	  0.070568
 -1.681204	 -1.048932	  0.073491
 -1.687783	 -1.066983	  0.076920
 -1.695999	 -1.088067	  0.082066
 -1.702532	 -1.097674	  0.086690
 -1.713981	 -1.112536	  0.097901
 -1.727645	 -1.132716	  0.112273
 -1.734734	 -1.144671	  0.117885
 -1.744489	 -1.164857	  0.124697
 -1.755779	 -1.184349	  0.131201
 -1.758595	 -1.193671	  0.132430
 -1.764523	 -1.214321	  0.132769
 -1.775796	 -1.243622	  0.138525
 -1.783057	 -1.256968	  0.144048
 -1.792098	 -1.274621	  0.155866
 -1.797949	 -1.288195	  0.166945
 -1.803542	 -1.297734	  0.176947
 -1.819331	 -1.311948	  0.195054
 -1.836567	 -1.325844	  0.212074
 -1.843675	 -1.333601	  0.219497
 -1.853244	 -1.345283	  0.228149
 -1.862306	 -1.358511	  0.239600
 -1.875409	 -1.378583	  0.257762
 -1.880467	 -1.388050	  0.264396
 -1.887097	 -1.400980	  0.274471
 -1.894457	 -1.422927	  0.289704
 -1.898957	 -1.433785	  0.296089
 -1.907005	 -1.453224	  0.309820
 -1.917320	 -1.471028	  0.325753
 -1.921325	 -1.477092	  0.329451
 -1.932502	 -1.489561	  0.340696
 -1.946647	 -1.506578	  0.351097
 -1.957747	 -1.518714	  0.358553
 -1.968145	 -1.534335	  0.369200
 -1.968686	 -1.550053	  0.385780
 -1.977183	 -1.564510	  0.396679
