 -1.702414	 -0.595992	 -1.864121
 -1.699265	 -0.599144	 -1.874389
 -1.705984	 -0.597021	 -1.856158
 -1.710466	 -0.591906	 -1.835442
 -1.717114	 -0.585511	 -1.818564
 -1.724542	 -0.578917	 -1.801205
 -1.729975	 -0.572469	 -1.783003
 -1.737328	 -0.566601	 -1.765332
 -1.744805	 -0.559727	 -1.747983
 -1.751245	 -0.554114	 -1.730143
 -1.758137	 -0.548876	 -1.712330
 -1.765718	 -0.542651	 -1.694552
 -1.772645	 -0.536759	 -1.677009
 -1.779959	 -0.531434	 -1.659313
 -1.787615	 -0.525895	 -1.641458
 -1.795425	 -0.520353	 -1.624003
 -1.803447	 -0.515097	 -1.606505
 -1.811670	 -0.510220	 -1.588850
 -1.820008	 -0.505498	 -1.571316
 -1.828389	 -0.500919	 -1.553735
 -1.836760	 -0.496702	 -1.536067
 -1.845103	 -0.492822	 -1.518309
 -1.853448	 -0.488944	 -1.500551
 -1.861089	 -0.486688	 -1.482206
 -1.868594	 -0.484736	 -1.463771
 -1.876083	 -0.483011	 -1.445307
 -1.883513	 -0.481995	 -1.426766
 -1.890945	 -0.480984	 -1.408225
 -1.898121	 -0.478014	 -1.389794
 -1.905079	 -0.473720	 -1.371542
 -1.912040	 -0.469430	 -1.353289
 -1.918988	 -0.463684	 -1.335437
 -1.925936	 -0.457823	 -1.317622
 -1.933953	 -0.452376	 -1.300659
 -1.942664	 -0.447206	 -1.284937
 -1.955201	 -0.440600	 -1.266119
 -1.965354	 -0.435066	 -1.250571
 -1.973467	 -0.430955	 -1.234623
 -1.985564	 -0.425042	 -1.218898
 -1.996685	 -0.420503	 -1.203544
 -2.008205	 -0.418016	 -1.185656
 -2.019564	 -0.413154	 -1.167707
 -2.033849	 -0.410033	 -1.156789
 -2.048702	 -0.407814	 -1.144814
 -2.063661	 -0.402440	 -1.128427
 -2.074464	 -0.403021	 -1.113804
 -2.088061	 -0.400640	 -1.098525
 -2.101310	 -0.397401	 -1.083480
 -2.113229	 -0.396762	 -1.067735
 -2.125355	 -0.396278	 -1.050456
 -2.138329	 -0.391386	 -1.036903
 -2.151801	 -0.387755	 -1.022886
 -2.165940	 -0.383665	 -1.006717
 -2.175056	 -0.382115	 -0.991158
 -2.187538	 -0.378798	 -0.974810
 -2.199938	 -0.373273	 -0.958374
 -2.207969	 -0.368567	 -0.941618
 -2.216412	 -0.364832	 -0.924383
 -2.224984	 -0.359856	 -0.906448
 -2.233613	 -0.354332	 -0.889083
 -2.242191	 -0.348834	 -0.871873
 -2.249466	 -0.343182	 -0.854122
 -2.254463	 -0.337335	 -0.835659
 -2.259458	 -0.331487	 -0.817197
 -2.264455	 -0.325640	 -0.798735
 -2.267703	 -0.319868	 -0.779864
 -2.270663	 -0.314112	 -0.760940
 -2.273764	 -0.308357	 -0.742038
 -2.277955	 -0.302619	 -0.723343
 -2.282150	 -0.296908	 -0.704650
 -2.287556	 -0.291319	 -0.686230
 -2.293062	 -0.285789	 -0.667764
 -2.299511	 -0.279966	 -0.649786
 -2.306093	 -0.274362	 -0.631803
 -2.313783	 -0.269712	 -0.613891
 -2.322216	 -0.266029	 -0.596550
 -2.332490	 -0.263201	 -0.578960
 -2.341806	 -0.258734	 -0.561536
 -2.350000	 -0.253238	 -0.544352
 -2.357282	 -0.247558	 -0.527046
 -2.366789	 -0.243377	 -0.509602
 -2.376953	 -0.239624	 -0.492788
 -2.387195	 -0.235931	 -0.476012
 -2.397894	 -0.232581	 -0.459449
 -2.408594	 -0.229232	 -0.442887
 -2.418667	 -0.226526	 -0.425823
 -2.428280	 -0.224282	 -0.408429
 -2.437897	 -0.222038	 -0.391037
 -2.446523	 -0.219987	 -0.373110
 -2.454054	 -0.218150	 -0.354672
 -2.461590	 -0.216315	 -0.336237
 -2.468765	 -0.214206	 -0.317688
 -2.474764	 -0.211240	 -0.298841
 -2.480765	 -0.208274	 -0.279994
 -2.486645	 -0.205037	 -0.261154
 -2.492247	 -0.201095	 -0.242421
 -2.498191	 -0.196236	 -0.224838
 -2.504302	 -0.190340	 -0.206276
 -2.508435	 -0.186039	 -0.184997
 -2.512604	 -0.184229	 -0.165818
 -2.521051	 -0.181494	 -0.148589
 -2.528892	 -0.176899	 -0.130966
 -2.534127	 -0.172605	 -0.111627
 -2.541895	 -0.169397	 -0.093431
 -2.551172	 -0.165579	 -0.076144
 -2.557527	 -0.161756	 -0.057559
 -2.563896	 -0.157695	 -0.039087
 -2.573339	 -0.154005	 -0.021529
 -2.581801	 -0.150905	 -0.003285
 -2.586822	 -0.146422	  0.014871
 -2.596788	 -0.142438	  0.031536
 -2.612235	 -0.144479	  0.049311
 -2.611685	 -0.133063	  0.071798
 -2.619943	 -0.129099	  0.089577
