 -0.525195	 -1.248770	 -2.063567
 -0.526170	 -1.256244	 -2.095102
 -0.525390	 -1.251477	 -2.076795
 -0.524985	 -1.244637	 -2.062232
 -0.524493	 -1.232886	 -2.039990
 -0.522899	 -1.226294	 -2.017160
 -0.520343	 -1.217951	 -1.996125
 -0.520241	 -1.214136	 -1.988909
 -0.514682	 -1.199236	 -1.974174
 -0.512362	 -1.180190	 -1.963992
 -0.510836	 -1.161503	 -1.957598
 -0.507849	 -1.142184	 -1.953355
 -0.502346	 -1.122978	 -1.950806
 -0.495337	 -1.104215	 -1.949834
 -0.488127	 -1.085277	 -1.948720
 -0.479445	 -1.067405	 -1.947810
 -0.469027	 -1.050455	 -1.947098
 -0.457948	 -1.032096	 -1.946943
 -0.445406	 -1.016051	 -1.947431
 -0.429944	 -1.003326	 -1.947932
 -0.411473	 -0.993871	 -1.946244
 -0.393736	 -0.985229	 -1.943004
 -0.376515	 -0.976534	 -1.936575
 -0.360324	 -0.968323	 -1.927427
 -0.344051	 -0.960265	 -1.916390
 -0.329261	 -0.951673	 -1.905527
 -0.315856	 -0.942900	 -1.897155
 -0.300211	 -0.933669	 -1.886238
 -0.285883	 -0.928071	 -1.882220
 -0.258580	 -0.919622	 -1.884817
 -0.236704	 -0.920661	 -1.886135
 -0.214261	 -0.921428	 -1.894500
 -0.188592	 -0.919219	 -1.892742
 -0.174013	 -0.915327	 -1.885446
 -0.159087	 -0.911405	 -1.875314
 -0.140712	 -0.904648	 -1.861945
 -0.126107	 -0.899403	 -1.849917
 -0.112501	 -0.894279	 -1.836328
 -0.097859	 -0.889139	 -1.821777
 -0.084252	 -0.886161	 -1.803740
 -0.073234	 -0.884496	 -1.783532
 -0.062126	 -0.882684	 -1.774243
 -0.043474	 -0.882236	 -1.763353
 -0.026371	 -0.881714	 -1.750876
 -0.010449	 -0.880526	 -1.738835
  0.004978	 -0.878882	 -1.725980
  0.017921	 -0.875957	 -1.712208
  0.027929	 -0.875614	 -1.694108
  0.039394	 -0.876899	 -1.676324
  0.055380	 -0.875083	 -1.664210
  0.071306	 -0.871606	 -1.652370
  0.085606	 -0.868872	 -1.638723
  0.095654	 -0.868581	 -1.621494
  0.104151	 -0.869704	 -1.602111
  0.116772	 -0.869738	 -1.585152
  0.130715	 -0.866548	 -1.571683
  0.144468	 -0.860148	 -1.558696
  0.156272	 -0.855390	 -1.542661
  0.167072	 -0.852445	 -1.525952
  0.177819	 -0.849732	 -1.509302
  0.188545	 -0.847027	 -1.492640
  0.198236	 -0.844413	 -1.475349
  0.205395	 -0.842041	 -1.456830
  0.212493	 -0.839674	 -1.438282
  0.219586	 -0.837306	 -1.419733
  0.226682	 -0.834938	 -1.401185
  0.233767	 -0.832572	 -1.382661
  0.240287	 -0.829999	 -1.365177
  0.243409	 -0.828451	 -1.347162
  0.243783	 -0.834397	 -1.327011
  0.250431	 -0.838654	 -1.299810
  0.254134	 -0.837110	 -1.288131
  0.258930	 -0.835506	 -1.266006
  0.262302	 -0.836114	 -1.247315
  0.262152	 -0.838109	 -1.231500
  0.261680	 -0.844188	 -1.205125
  0.266652	 -0.846671	 -1.182559
  0.269600	 -0.844788	 -1.171026
  0.270289	 -0.841100	 -1.151021
  0.273351	 -0.846596	 -1.120801
  0.272663	 -0.857150	 -1.104944
  0.270438	 -0.865113	 -1.094125
  0.266744	 -0.871300	 -1.072937
  0.263285	 -0.876777	 -1.052377
  0.259210	 -0.882506	 -1.033538
  0.254892	 -0.888231	 -1.014843
  0.250454	 -0.894043	 -0.996210
  0.245944	 -0.899848	 -0.977588
  0.240689	 -0.905573	 -0.959158
  0.232381	 -0.910733	 -0.941554
  0.223800	 -0.915861	 -0.924275
  0.215769	 -0.921256	 -0.906741
  0.207645	 -0.926595	 -0.889224
  0.198286	 -0.931418	 -0.872150
  0.188103	 -0.935865	 -0.855441
  0.177490	 -0.939989	 -0.838853
  0.166540	 -0.942862	 -0.822214
  0.154909	 -0.944015	 -0.805772
  0.142378	 -0.943480	 -0.790208
  0.129935	 -0.940802	 -0.774892
  0.119286	 -0.935751	 -0.758697
  0.109912	 -0.927672	 -0.742924
  0.100375	 -0.919138	 -0.727499
  0.090756	 -0.908767	 -0.713365
  0.081031	 -0.898081	 -0.699629
  0.072113	 -0.886269	 -0.686151
  0.063625	 -0.874206	 -0.672618
  0.055522	 -0.862069	 -0.658939
  0.048114	 -0.849623	 -0.645148
  0.040781	 -0.837186	 -0.631312
  0.034329	 -0.825393	 -0.616517
  0.028172	 -0.813858	 -0.601458
  0.023418	 -0.804037	 -0.585987
  0.020843	 -0.795975	 -0.569110
  0.020304	 -0.787638	 -0.549431
  0.014265	 -0.773233	 -0.528464
  0.007312	 -0.763180	 -0.519719
 -0.001986	 -0.750338	 -0.506031
 -0.007850	 -0.743622	 -0.484847
 -0.009062	 -0.741425	 -0.459830
 -0.007474	 -0.739193	 -0.442321
 -0.010105	 -0.733034	 -0.428154
 -0.022150	 -0.721894	 -0.410425
 -0.030810	 -0.717289	 -0.385961
 -0.033125	 -0.714975	 -0.369383
 -0.029266	 -0.712086	 -0.348787
 -0.028048	 -0.702153	 -0.327680
 -0.029779	 -0.693594	 -0.315353
 -0.029222	 -0.688839	 -0.295273
 -0.026716	 -0.690692	 -0.273107
 -0.027446	 -0.689744	 -0.251572
 -0.028674	 -0.683697	 -0.232299
 -0.029907	 -0.675819	 -0.215026
 -0.030587	 -0.672340	 -0.194655
 -0.031414	 -0.670253	 -0.174668
 -0.032253	 -0.669434	 -0.154645
 -0.032758	 -0.669103	 -0.134582
 -0.033437	 -0.669610	 -0.114588
 -0.034155	 -0.671296	 -0.094760
 -0.032796	 -0.672328	 -0.075645
 -0.028206	 -0.671707	 -0.057189
 -0.022411	 -0.674171	 -0.030786
 -0.021190	 -0.677654	 -0.010136
 -0.025011	 -0.680610	  0.007238
 -0.028146	 -0.682419	  0.024712
 -0.028556	 -0.683765	  0.047364
 -0.035466	 -0.683806	  0.066324
 -0.040577	 -0.682842	  0.086545
 -0.045437	 -0.687068	  0.106085
 -0.047764	 -0.690420	  0.123844
 -0.052748	 -0.691156	  0.147333
 -0.058243	 -0.693456	  0.165615
 -0.062045	 -0.702328	  0.183270
 -0.066011	 -0.705919	  0.202728
 -0.076391	 -0.706949	  0.226061
 -0.083420	 -0.711228	  0.241118
 -0.084692	 -0.716056	  0.256012
 -0.084737	 -0.720762	  0.277521
 -0.087800	 -0.723327	  0.298295
 -0.089455	 -0.727884	  0.318023
 -0.091209	 -0.731573	  0.335743
 -0.093534	 -0.730787	  0.356122
 -0.095011	 -0.730422	  0.378453
 -0.096836	 -0.737812	  0.396475
 -0.099023	 -0.747997	  0.414842
 -0.105506	 -0.754586	  0.431205
 -0.108413	 -0.754473	  0.452014
 -0.112620	 -0.754228	  0.471610
 -0.116366	 -0.757372	  0.490181
 -0.116321	 -0.758728	  0.510539
 -0.118657	 -0.757247	  0.530736
 -0.122367	 -0.756423	  0.550223
 -0.124722	 -0.756057	  0.570272
 -0.124521	 -0.754839	  0.590327
 -0.124142	 -0.753568	  0.610293
 -0.123064	 -0.752238	  0.630243
 -0.122957	 -0.751106	  0.650117
 -0.124897	 -0.747884	  0.669376
 -0.127707	 -0.742350	  0.688845
 -0.129858	 -0.737911	  0.709305
 -0.133066	 -0.735833	  0.728864
 -0.135513	 -0.737543	  0.750858
 -0.134351	 -0.738673	  0.770616
 -0.128023	 -0.738200	  0.789822
 -0.123433	 -0.733973	  0.806552
 -0.119117	 -0.727079	  0.830826
 -0.112549	 -0.724825	  0.851674
 -0.108166	 -0.721638	  0.868128
 -0.105500	 -0.717043	  0.885133
 -0.103431	 -0.709091	  0.909929
 -0.102933	 -0.705475	  0.926139
 -0.102183	 -0.702364	  0.940398
 -0.099223	 -0.698985	  0.962658
 -0.093517	 -0.695490	  0.983696
 -0.087803	 -0.696364	  1.005297
 -0.086503	 -0.698939	  1.025444
 -0.088195	 -0.698134	  1.044482
 -0.090164	 -0.692747	  1.064074
 -0.089917	 -0.685995	  1.083533
 -0.086530	 -0.679229	  1.102708
 -0.081489	 -0.673749	  1.121618
 -0.076633	 -0.671548	  1.141393
 -0.073486	 -0.673603	  1.161899
 -0.073633	 -0.677940	  1.181483
 -0.075457	 -0.682343	  1.203403
 -0.076433	 -0.682686	  1.221895
 -0.075731	 -0.681315	  1.242447
 -0.073011	 -0.677211	  1.262488
 -0.068476	 -0.671718	  1.280903
 -0.065589	 -0.668063	  1.300947
 -0.063962	 -0.667552	  1.321038
 -0.062568	 -0.668086	  1.341002
 -0.061331	 -0.668895	  1.360609
 -0.061400	 -0.673784	  1.378429
 -0.060950	 -0.685017	  1.399888
 -0.058910	 -0.692686	  1.419447
 -0.057202	 -0.689187	  1.437991
 -0.055815	 -0.683245	  1.458184
 -0.054308	 -0.679289	  1.485906
 -0.054147	 -0.676760	  1.501978
 -0.054432	 -0.677464	  1.519677
 -0.053997	 -0.682275	  1.543850
 -0.054230	 -0.692362	  1.563018
 -0.054416	 -0.702168	  1.578843
 -0.053599	 -0.708647	  1.594660
 -0.052793	 -0.708805	  1.618140
 -0.055690	 -0.712849	  1.640425
 -0.057148	 -0.724838	  1.654852
 -0.056043	 -0.736545	  1.672260
 -0.055289	 -0.745293	  1.689981
 -0.053716	 -0.749183	  1.708613
 -0.055418	 -0.750496	  1.730722
 -0.060809	 -0.758910	  1.753258
 -0.062203	 -0.770241	  1.766836
 -0.062345	 -0.778845	  1.781540
 -0.066103	 -0.787669	  1.806435
 -0.067370	 -0.800023	  1.821097
 -0.065945	 -0.812355	  1.831788
 -0.066505	 -0.828744	  1.850916
 -0.070756	 -0.839097	  1.871063
 -0.072733	 -0.843373	  1.882795
 -0.074984	 -0.852044	  1.902733
 -0.082111	 -0.862088	  1.928547
 -0.086421	 -0.864958	  1.943282
 -0.087379	 -0.869355	  1.957182
 -0.088138	 -0.877367	  1.979064
 -0.090576	 -0.884382	  1.998613
 -0.092643	 -0.889367	  2.017883
 -0.093709	 -0.890972	  2.037755
 -0.092703	 -0.885936	  2.057054
 -0.091164	 -0.879158	  2.075799
 -0.088863	 -0.869903	  2.093370
 -0.086127	 -0.858222	  2.109367
 -0.083389	 -0.846361	  2.125233
 -0.081195	 -0.833160	  2.140094
 -0.079065	 -0.819837	  2.154859
 -0.077563	 -0.806162	  2.169374
 -0.076986	 -0.792001	  2.183488
 -0.076449	 -0.777823	  2.197584
 -0.076816	 -0.763282	  2.211309
 -0.077999	 -0.748446	  2.224664
 -0.079364	 -0.733543	  2.237926
 -0.081227	 -0.718574	  2.251063
 -0.084019	 -0.703713	  2.263781
 -0.090272	 -0.688374	  2.275524
 -0.095203	 -0.672921	  2.287987
 -0.099519	 -0.658713	  2.299350
 -0.113034	 -0.639191	  2.312732
 -0.096603	 -0.617720	  2.338433
 -0.098749	 -0.602612	  2.351361
