 -0.698159	  1.657561	  1.696858
 -0.701180	  1.662169	  1.703521
 -0.692717	  1.656923	  1.688085
 -0.687483	  1.642412	  1.672174
 -0.680333	  1.631218	  1.656593
 -0.672796	  1.621212	  1.640907
 -0.664927	  1.611397	  1.625401
 -0.656923	  1.601958	  1.609696
 -0.648609	  1.592746	  1.594053
 -0.639854	  1.584378	  1.578058
 -0.630498	  1.577463	  1.561715
 -0.620569	  1.571405	  1.545465
 -0.610865	  1.565542	  1.529151
 -0.601323	  1.560498	  1.511840
 -0.588849	  1.558384	  1.498283
 -0.566836	  1.569039	  1.486996
 -0.551574	  1.575687	  1.473601
 -0.541023	  1.577282	  1.460579
 -0.526295	  1.581027	  1.447727
 -0.510731	  1.586086	  1.435595
 -0.498095	  1.586982	  1.419003
 -0.482747	  1.589004	  1.401251
 -0.464975	  1.597270	  1.398055
 -0.445603	  1.607562	  1.399150
 -0.424501	  1.614145	  1.391705
 -0.411427	  1.612786	  1.378561
 -0.395785	  1.609464	  1.360306
 -0.380305	  1.610518	  1.349451
 -0.367724	  1.608774	  1.342983
 -0.348753	  1.605203	  1.334582
 -0.334910	  1.601908	  1.324766
 -0.320842	  1.596742	  1.312744
 -0.306846	  1.586749	  1.298894
 -0.295544	  1.581319	  1.285454
 -0.282536	  1.574254	  1.270318
 -0.271266	  1.565332	  1.256931
 -0.260022	  1.559443	  1.242590
 -0.245431	  1.550501	  1.225361
 -0.235240	  1.538167	  1.214419
 -0.227873	  1.526202	  1.204439
 -0.219034	  1.519342	  1.188411
 -0.212517	  1.512320	  1.169907
 -0.201417	  1.505272	  1.148193
 -0.186446	  1.500202	  1.134351
 -0.171190	  1.492800	  1.127759
 -0.154250	  1.482200	  1.120703
 -0.138910	  1.474148	  1.108346
 -0.128436	  1.469471	  1.093981
 -0.116043	  1.464106	  1.075861
 -0.101262	  1.456921	  1.060035
 -0.092709	  1.449172	  1.051792
 -0.080745	  1.434806	  1.039493
 -0.068350	  1.421971	  1.026911
 -0.060373	  1.412369	  1.017371
 -0.053469	  1.402404	  1.008777
 -0.047749	  1.389529	  0.999768
 -0.043147	  1.375469	  0.991451
 -0.046336	  1.357667	  0.981846
 -0.053439	  1.342807	  0.972483
 -0.061496	  1.326599	  0.962376
 -0.069312	  1.308702	  0.956924
 -0.075317	  1.291194	  0.954675
 -0.083898	  1.270429	  0.953575
 -0.097112	  1.251410	  0.949512
 -0.106029	  1.241581	  0.944905
 -0.119687	  1.226092	  0.937554
 -0.135190	  1.208958	  0.936245
 -0.146755	  1.195046	  0.936345
 -0.158282	  1.180110	  0.931135
 -0.165436	  1.162762	  0.923256
 -0.179019	  1.147771	  0.922201
 -0.192130	  1.126853	  0.921129
 -0.195935	  1.107847	  0.915290
 -0.198246	  1.088867	  0.907656
 -0.201556	  1.071108	  0.900664
 -0.212047	  1.053429	  0.900150
 -0.223157	  1.033380	  0.900386
 -0.228764	  1.013528	  0.896670
 -0.230151	  0.994862	  0.889117
 -0.231056	  0.976775	  0.880687
 -0.234956	  0.957670	  0.874524
 -0.238146	  0.939618	  0.871859
 -0.243985	  0.917728	  0.872247
 -0.251503	  0.894821	  0.865777
 -0.256489	  0.877613	  0.855435
 -0.254728	  0.864263	  0.845756
 -0.256743	  0.841781	  0.837795
 -0.262849	  0.820736	  0.826563
 -0.262471	  0.809033	  0.811714
 -0.259169	  0.796399	  0.797732
 -0.255458	  0.780512	  0.783719
 -0.253429	  0.765397	  0.769469
 -0.253760	  0.751324	  0.757864
 -0.256736	  0.734570	  0.746449
 -0.257744	  0.714399	  0.731575
 -0.252609	  0.701035	  0.714925
 -0.247460	  0.694953	  0.703846
 -0.240419	  0.680935	  0.683339
 -0.237647	  0.666612	  0.669255
 -0.234641	  0.654919	  0.658596
 -0.228630	  0.642573	  0.642575
 -0.221867	  0.636249	  0.624344
 -0.216593	  0.629716	  0.603902
 -0.214218	  0.615574	  0.582258
 -0.216098	  0.603490	  0.573406
 -0.214656	  0.588318	  0.561863
 -0.211059	  0.570837	  0.547536
 -0.206389	  0.555927	  0.534180
 -0.198453	  0.542374	  0.519997
 -0.190851	  0.532766	  0.504796
 -0.184187	  0.524522	  0.489501
 -0.177785	  0.514333	  0.470839
 -0.172763	  0.505377	  0.455342
 -0.165955	  0.494717	  0.438046
 -0.155384	  0.482244	  0.422033
 -0.145763	  0.473103	  0.408822
 -0.134954	  0.461603	  0.395565
 -0.126947	  0.449057	  0.383138
 -0.118748	  0.431374	  0.374051
 -0.107065	  0.409227	  0.364704
 -0.101096	  0.398118	  0.358961
 -0.091186	  0.386948	  0.344849
 -0.079883	  0.373410	  0.333662
 -0.070409	  0.356258	  0.325319
 -0.062917	  0.340244	  0.315550
 -0.055546	  0.324655	  0.305270
 -0.047912	  0.308975	  0.295443
 -0.040219	  0.293145	  0.286027
 -0.032661	  0.277241	  0.276503
 -0.024620	  0.261925	  0.266518
 -0.016933	  0.246717	  0.256017
 -0.009245	  0.231567	  0.245482
 -0.001544	  0.217063	  0.234079
  0.006027	  0.202647	  0.222475
  0.013606	  0.188293	  0.210827
  0.020432	  0.175308	  0.197381
  0.028842	  0.163196	  0.183623
  0.036372	  0.150488	  0.169775
  0.040707	  0.137750	  0.156324
  0.046283	  0.127321	  0.140625
  0.048321	  0.113058	  0.125190
  0.052081	  0.093705	  0.110695
  0.059127	  0.082054	  0.098929
  0.065400	  0.072175	  0.087500
  0.070942	  0.055157	  0.070770
  0.077918	  0.042278	  0.059561
  0.086455	  0.028624	  0.050195
  0.097005	  0.013324	  0.037048
  0.107483	  0.001830	  0.019222
  0.110397	 -0.003832	  0.003692
  0.113239	 -0.012030	 -0.018953
  0.120870	 -0.022101	 -0.038749
  0.132009	 -0.030804	 -0.051631
  0.143372	 -0.038836	 -0.059625
  0.152981	 -0.053293	 -0.071576
  0.163279	 -0.065461	 -0.089907
  0.165408	 -0.072197	 -0.106685
  0.163792	 -0.082212	 -0.130696
  0.165332	 -0.096948	 -0.148022
  0.173462	 -0.110932	 -0.158212
  0.187062	 -0.123914	 -0.163905
  0.197434	 -0.136075	 -0.173462
  0.200992	 -0.153142	 -0.194964
  0.201474	 -0.160855	 -0.210202
  0.201137	 -0.172768	 -0.229729
  0.209550	 -0.188089	 -0.245414
  0.218232	 -0.199493	 -0.253279
  0.234963	 -0.215315	 -0.258544
  0.253164	 -0.230862	 -0.269804
  0.264751	 -0.239312	 -0.288507
  0.266654	 -0.243999	 -0.303657
  0.267302	 -0.256938	 -0.320899
  0.268818	 -0.271874	 -0.335851
  0.274293	 -0.285264	 -0.350352
  0.280089	 -0.298126	 -0.364499
  0.285345	 -0.308908	 -0.379423
  0.288901	 -0.319268	 -0.393949
  0.297524	 -0.339122	 -0.404782
  0.309606	 -0.359320	 -0.417087
  0.316365	 -0.367479	 -0.431167
  0.319177	 -0.373653	 -0.443487
  0.325481	 -0.393308	 -0.457307
  0.335122	 -0.407829	 -0.473635
  0.341848	 -0.412795	 -0.490688
  0.345841	 -0.417996	 -0.506611
  0.350379	 -0.432211	 -0.522356
  0.357356	 -0.444669	 -0.537948
  0.364786	 -0.455128	 -0.553399
  0.371258	 -0.465634	 -0.569121
  0.379859	 -0.475186	 -0.584467
  0.390704	 -0.483792	 -0.599008
  0.402690	 -0.492055	 -0.613064
  0.414138	 -0.502141	 -0.627018
  0.423993	 -0.512623	 -0.640840
  0.431468	 -0.524287	 -0.657055
  0.435881	 -0.535352	 -0.674248
  0.438731	 -0.546223	 -0.692061
  0.441085	 -0.554466	 -0.710509
  0.445330	 -0.561347	 -0.728838
  0.452708	 -0.569151	 -0.745543
  0.462037	 -0.577747	 -0.760756
  0.472365	 -0.585802	 -0.776617
  0.481142	 -0.595375	 -0.792471
  0.487868	 -0.606527	 -0.806853
  0.494329	 -0.619841	 -0.820853
  0.500611	 -0.632522	 -0.834696
  0.506827	 -0.644860	 -0.849600
  0.513829	 -0.656283	 -0.864741
  0.522772	 -0.666141	 -0.879432
  0.532969	 -0.676069	 -0.893150
  0.542375	 -0.686934	 -0.908902
  0.547603	 -0.698661	 -0.925873
  0.549958	 -0.713348	 -0.939449
  0.554379	 -0.729758	 -0.950631
  0.562249	 -0.746473	 -0.958438
  0.571221	 -0.763339	 -0.965490
  0.578578	 -0.781336	 -0.972970
  0.582444	 -0.800003	 -0.983371
  0.586791	 -0.813254	 -0.996311
  0.597866	 -0.823551	 -1.009288
  0.613285	 -0.835371	 -1.023582
  0.625610	 -0.851455	 -1.036462
  0.630897	 -0.864714	 -1.042254
  0.633315	 -0.885761	 -1.045866
  0.630268	 -0.910634	 -1.050390
  0.623962	 -0.929513	 -1.064575
  0.621208	 -0.943842	 -1.081677
  0.626280	 -0.957157	 -1.093781
  0.635075	 -0.971679	 -1.103132
  0.644022	 -0.989180	 -1.113015
  0.654900	 -1.004756	 -1.119713
  0.661585	 -1.021663	 -1.129716
  0.666600	 -1.037589	 -1.140924
  0.671944	 -1.053107	 -1.152372
  0.678934	 -1.068369	 -1.163284
  0.687882	 -1.083287	 -1.173844
  0.694293	 -1.098666	 -1.185143
  0.696477	 -1.113716	 -1.198167
  0.701607	 -1.128944	 -1.211029
  0.710799	 -1.142859	 -1.221865
  0.719084	 -1.156958	 -1.233691
  0.726811	 -1.169738	 -1.246951
  0.736177	 -1.183126	 -1.257960
  0.745884	 -1.198659	 -1.267475
  0.754199	 -1.213882	 -1.278119
  0.759783	 -1.225574	 -1.297048
  0.764038	 -1.232793	 -1.317989
  0.770881	 -1.240176	 -1.334323
  0.780919	 -1.249854	 -1.347356
  0.791366	 -1.260946	 -1.361357
  0.798645	 -1.271787	 -1.376717
  0.805808	 -1.281598	 -1.392683
  0.815343	 -1.290156	 -1.406979
  0.826900	 -1.298711	 -1.423184
  0.833683	 -1.305986	 -1.440578
  0.838065	 -1.315084	 -1.457280
  0.846976	 -1.325574	 -1.471601
  0.858874	 -1.332922	 -1.489041
  0.865596	 -1.337423	 -1.507919
  0.866720	 -1.345069	 -1.523967
  0.871120	 -1.356785	 -1.539924
  0.880619	 -1.363471	 -1.563817
  0.889188	 -1.366143	 -1.579688
  0.899235	 -1.372237	 -1.597607
  0.904977	 -1.385289	 -1.608792
  0.911071	 -1.402109	 -1.620865
  0.917252	 -1.417730	 -1.633823
  0.923058	 -1.432176	 -1.646617
  0.928541	 -1.447183	 -1.658637
  0.933552	 -1.462798	 -1.670089
  0.938656	 -1.478391	 -1.681523
  0.943926	 -1.494032	 -1.692937
  0.950173	 -1.512218	 -1.705851
  0.961723	 -1.546018	 -1.730895
  0.967099	 -1.561512	 -1.742341
