 -1.543199	 -2.020130	 -1.648790
 -1.527920	 -2.000129	 -1.632466
 -1.498925	 -1.958834	 -1.612992
 -1.472523	 -1.913435	 -1.604041
 -1.440489	 -1.873836	 -1.594827
 -1.412629	 -1.837386	 -1.574574
 -1.398156	 -1.791604	 -1.562656
 -1.381196	 -1.746118	 -1.550081
 -1.359646	 -1.703949	 -1.531991
 -1.334888	 -1.663457	 -1.513475
 -1.308675	 -1.623467	 -1.495811
 -1.281819	 -1.582541	 -1.480152
 -1.254061	 -1.541290	 -1.466672
 -1.225408	 -1.500284	 -1.454994
 -1.196793	 -1.460248	 -1.444355
 -1.168062	 -1.420680	 -1.433607
 -1.139286	 -1.381881	 -1.422886
 -1.110582	 -1.343295	 -1.412284
 -1.081908	 -1.304384	 -1.401990
 -1.053678	 -1.264568	 -1.392700
 -1.026376	 -1.224549	 -1.384745
 -0.998806	 -1.184070	 -1.378089
 -0.967309	 -1.136697	 -1.372884
 -0.926680	 -1.073593	 -1.374448
 -0.885527	 -1.003823	 -1.414658
 -0.842641	 -0.939787	 -1.466536
 -0.818972	 -0.902324	 -1.529541
 -0.799808	 -0.868166	 -1.575650
 -0.776860	 -0.828211	 -1.615537
 -0.748941	 -0.779328	 -1.650686
 -0.714585	 -0.729011	 -1.667005
 -0.677044	 -0.690945	 -1.660482
 -0.644879	 -0.669058	 -1.638689
 -0.612695	 -0.657138	 -1.601315
 -0.570545	 -0.650582	 -1.540223
 -0.512418	 -0.645833	 -1.459897
 -0.440936	 -0.633981	 -1.382117
 -0.381162	 -0.609449	 -1.324879
 -0.344229	 -0.582468	 -1.290658
 -0.325240	 -0.558002	 -1.270054
 -0.312010	 -0.527120	 -1.251095
 -0.298444	 -0.473344	 -1.225476
 -0.289777	 -0.400705	 -1.195845
 -0.286628	 -0.331493	 -1.166417
 -0.284847	 -0.277795	 -1.144354
 -0.281713	 -0.234314	 -1.127824
 -0.275661	 -0.191718	 -1.113594
 -0.264918	 -0.146785	 -1.100503
 -0.249451	 -0.100941	 -1.088886
 -0.231083	 -0.056486	 -1.078925
 -0.210548	 -0.012500	 -1.069565
 -0.188511	  0.031091	 -1.060305
 -0.165568	  0.074157	 -1.050485
 -0.140614	  0.116484	 -1.039035
 -0.110246	  0.153541	 -1.020496
 -0.080291	  0.191314	 -1.002750
 -0.056078	  0.235941	 -0.993383
 -0.026942	  0.275216	 -0.975954
  0.004117	  0.311064	 -0.954433
  0.035439	  0.345993	 -0.932185
  0.065764	  0.379898	 -0.910540
  0.095469	  0.413832	 -0.889434
  0.124407	  0.448424	 -0.868885
  0.152885	  0.484460	 -0.848873
  0.180977	  0.521287	 -0.829620
  0.208903	  0.558705	 -0.810976
  0.236810	  0.595934	 -0.792949
  0.265092	  0.632234	 -0.775532
  0.295387	  0.667960	 -0.758988
  0.326924	  0.700323	 -0.744583
  0.360965	  0.729165	 -0.731983
  0.400046	  0.755043	 -0.720911
  0.454478	  0.781173	 -0.711772
  0.534436	  0.804800	 -0.712529
  0.631875	  0.816110	 -0.736885
  0.724999	  0.815980	 -0.789851
  0.789289	  0.810450	 -0.866117
  0.858555	  0.820794	 -0.931004
  0.910221	  0.836843	 -1.004834
  0.952682	  0.863375	 -1.070834
  0.988940	  0.904339	 -1.119520
  1.021219	  0.958513	 -1.148515
  1.053781	  1.031470	 -1.161801
  1.081785	  1.138087	 -1.157263
  1.086123	  1.277146	 -1.135670
  1.080370	  1.425061	 -1.115574
  1.081675	  1.554510	 -1.079438
  1.067839	  1.649633	 -1.011616
  1.038658	  1.713002	 -0.933699
  0.994877	  1.750195	 -0.866828
  0.946446	  1.769827	 -0.815893
  0.906980	  1.780009	 -0.764705
  0.881335	  1.795986	 -0.703893
  0.878237	  1.818788	 -0.644578
  0.916465	  1.822782	 -0.597759
  0.976681	  1.819056	 -0.556175
  1.035595	  1.834329	 -0.516477
  1.081267	  1.863207	 -0.487974
  1.116742	  1.895669	 -0.467032
  1.148592	  1.929565	 -0.448952
  1.178803	  1.965087	 -0.432122
  1.207199	  2.001950	 -0.415526
  1.233960	  2.039354	 -0.397619
  1.259646	  2.076730	 -0.378617
  1.285299	  2.113144	 -0.358798
  1.314123	  2.147492	 -0.339497
  1.345203	  2.183319	 -0.323647
  1.371468	  2.223657	 -0.309797
  1.400321	  2.262246	 -0.297224
  1.430138	  2.300646	 -0.284373
  1.458923	  2.340881	 -0.271121
  1.485164	  2.382462	 -0.257049
  1.507988	  2.424152	 -0.241655
  1.528996	  2.466331	 -0.229914
  1.546408	  2.508026	 -0.215570
  1.566329	  2.550036	 -0.209596
  1.581992	  2.575536	 -0.211692
