  0.321075	  0.508757	 -2.428337
  0.331046	  0.509184	 -2.440276
  0.323646	  0.499392	 -2.423030
  0.304175	  0.500264	 -2.409616
  0.284816	  0.504161	 -2.398830
  0.268367	  0.508720	 -2.388885
  0.253518	  0.514518	 -2.379657
  0.238399	  0.523976	 -2.372057
  0.221470	  0.534422	 -2.368689
  0.203693	  0.541015	 -2.366683
  0.185903	  0.544792	 -2.363368
  0.166268	  0.545374	 -2.356587
  0.143993	  0.545951	 -2.352878
  0.121328	  0.550412	 -2.354983
  0.102904	  0.560123	 -2.357791
  0.088397	  0.573539	 -2.358696
  0.072583	  0.585182	 -2.359163
  0.055099	  0.596150	 -2.361426
  0.040239	  0.611738	 -2.365123
  0.029798	  0.632962	 -2.370321
  0.019257	  0.649339	 -2.372554
  0.004443	  0.656189	 -2.374631
 -0.016626	  0.664339	 -2.375841
 -0.034794	  0.673898	 -2.373649
 -0.050763	  0.687030	 -2.374486
 -0.066104	  0.699884	 -2.375973
 -0.081411	  0.712657	 -2.377597
 -0.096721	  0.725414	 -2.379294
 -0.112030	  0.738170	 -2.380997
 -0.127340	  0.750926	 -2.382702
 -0.142643	  0.763689	 -2.384405
 -0.157766	  0.776668	 -2.386120
 -0.173153	  0.789254	 -2.387821
 -0.188299	  0.801944	 -2.389245
 -0.203248	  0.815205	 -2.390046
