 -1.764408	  0.661200	  1.462908
 -1.794035	  0.659134	  1.458041
 -1.775318	  0.660948	  1.468123
 -1.755220	  0.663017	  1.468225
 -1.735207	  0.663183	  1.467699
 -1.714607	  0.664764	  1.468322
 -1.695165	  0.668181	  1.471223
 -1.676670	  0.671626	  1.477147
 -1.657464	  0.673759	  1.483946
 -1.638545	  0.680643	  1.491540
 -1.620986	  0.687943	  1.492727
 -1.601093	  0.692225	  1.496141
 -1.582701	  0.693453	  1.500194
 -1.563047	  0.696470	  1.505010
 -1.544769	  0.702325	  1.509290
 -1.524251	  0.709128	  1.514442
 -1.506050	  0.715252	  1.520415
 -1.487664	  0.718725	  1.526389
 -1.468904	  0.722055	  1.531660
 -1.448915	  0.719590	  1.535215
 -1.429419	  0.720985	  1.538805
 -1.410905	  0.729306	  1.543437
 -1.392909	  0.735774	  1.548050
 -1.370640	  0.733768	  1.553377
 -1.350022	  0.732020	  1.559044
 -1.334954	  0.738090	  1.564033
 -1.315422	  0.743801	  1.569575
 -1.296696	  0.748274	  1.575000
 -1.277606	  0.751938	  1.580889
 -1.259043	  0.755581	  1.587381
 -1.240480	  0.759225	  1.593873
 -1.221968	  0.762682	  1.600606
 -1.203564	  0.765780	  1.607796
 -1.185159	  0.768880	  1.614985
 -1.166791	  0.771300	  1.622518
 -1.148585	  0.772275	  1.630736
 -1.130502	  0.773803	  1.638787
 -1.111989	  0.776287	  1.646545
 -1.092957	  0.776704	  1.654492
 -1.074909	  0.776249	  1.662336
 -1.057767	  0.776520	  1.670988
 -1.039336	  0.775775	  1.679797
 -1.020910	  0.775711	  1.687454
 -1.004181	  0.776011	  1.699564
 -0.986781	  0.781543	  1.709676
 -0.968160	  0.784634	  1.714098
 -0.947031	  0.786241	  1.716884
 -0.929251	  0.787692	  1.722296
 -0.910873	  0.793923	  1.726354
 -0.890740	  0.800793	  1.730092
 -0.871703	  0.803747	  1.733670
 -0.852613	  0.804716	  1.737986
 -0.833955	  0.807085	  1.741086
 -0.813902	  0.811614	  1.749055
 -0.794204	  0.814754	  1.755707
 -0.775647	  0.819284	  1.756555
 -0.755929	  0.823615	  1.754800
 -0.735863	  0.829277	  1.759738
 -0.717841	  0.833264	  1.762878
 -0.697099	  0.835802	  1.762503
 -0.678334	  0.835536	  1.758665
 -0.657191	  0.835664	  1.758908
 -0.637186	  0.836041	  1.760426
 -0.617342	  0.835357	  1.762820
 -0.597532	  0.834412	  1.765405
 -0.577723	  0.833468	  1.767990
 -0.558091	  0.832263	  1.771616
 -0.538556	  0.830935	  1.775594
 -0.518996	  0.829183	  1.778590
 -0.499584	  0.827726	  1.780864
 -0.478571	  0.827267	  1.785632
 -0.459919	  0.829349	  1.791408
 -0.441398	  0.831563	  1.799504
 -0.423198	  0.833175	  1.804374
 -0.404344	  0.835521	  1.807273
 -0.382324	  0.841257	  1.816798
 -0.366635	  0.844920	  1.825753
 -0.349846	  0.845477	  1.830495
 -0.328140	  0.852463	  1.839160
 -0.310782	  0.859787	  1.844959
 -0.294263	  0.863182	  1.848813
 -0.276261	  0.865643	  1.857969
 -0.252798	  0.872865	  1.862235
 -0.234692	  0.882021	  1.861742
 -0.221347	  0.889782	  1.863714
 -0.200859	  0.897556	  1.871774
 -0.182710	  0.897576	  1.878400
 -0.162104	  0.898682	  1.883218
 -0.143332	  0.903554	  1.889129
 -0.126368	  0.909706	  1.894644
 -0.105481	  0.915674	  1.901738
 -0.087830	  0.917764	  1.907179
 -0.070267	  0.920304	  1.912821
 -0.050112	  0.925433	  1.920823
 -0.031425	  0.929412	  1.926783
 -0.010809	  0.928452	  1.929454
  0.008030	  0.928742	  1.935313
  0.023299	  0.931195	  1.943329
  0.044424	  0.934157	  1.952568
  0.062585	  0.936678	  1.959677
  0.082170	  0.938342	  1.965395
  0.099973	  0.937996	  1.970952
  0.117382	  0.939710	  1.979318
  0.136074	  0.943755	  1.987937
  0.154283	  0.947782	  1.995602
  0.172152	  0.953147	  2.002804
  0.189999	  0.958634	  2.009973
  0.208082	  0.963799	  2.016778
  0.226299	  0.968775	  2.023364
  0.244801	  0.973012	  2.029666
  0.264003	  0.974794	  2.034971
  0.283290	  0.976443	  2.039999
  0.303048	  0.977107	  2.043027
  0.322807	  0.977770	  2.046053
  0.342471	  0.978099	  2.049692
  0.361354	  0.976839	  2.056160
  0.380237	  0.975579	  2.062629
  0.399017	  0.974507	  2.069183
  0.416971	  0.975378	  2.077675
  0.434333	  0.976966	  2.087837
  0.451602	  0.978215	  2.098007
  0.468737	  0.980298	  2.107694
  0.487818	  0.981454	  2.115404
  0.506143	  0.982709	  2.123268
  0.524834	  0.984050	  2.129622
  0.546084	  0.988250	  2.133386
  0.564134	  0.988337	  2.142000
