 -1.110846	  1.280011	 -1.695102
 -1.125189	  1.279943	 -1.701076
 -1.109064	  1.291853	 -1.689548
 -1.089779	  1.290406	 -1.684320
 -1.072190	  1.290239	 -1.677092
 -1.052539	  1.288921	 -1.667846
 -1.032392	  1.288217	 -1.661817
 -1.013478	  1.291112	 -1.670777
 -0.990084	  1.302926	 -1.684072
 -0.974219	  1.310005	 -1.689244
 -0.959725	  1.314436	 -1.694082
 -0.940176	  1.321257	 -1.698099
 -0.922204	  1.328067	 -1.704332
 -0.906433	  1.336305	 -1.711903
 -0.893967	  1.345400	 -1.719626
 -0.879606	  1.358237	 -1.725856
 -0.857066	  1.375121	 -1.732208
 -0.839401	  1.383694	 -1.742979
 -0.830272	  1.386281	 -1.749213
 -0.811749	  1.388691	 -1.760352
 -0.793553	  1.392256	 -1.772101
 -0.771270	  1.391338	 -1.781208
 -0.755145	  1.396998	 -1.791597
