 -2.061072	  1.243403	 -0.029304
 -2.090347	  1.263505	  0.002725
 -2.093881	  1.251207	 -0.016750
 -2.081675	  1.238950	 -0.035889
 -2.066171	  1.227151	 -0.048943
 -2.048116	  1.220780	 -0.056765
 -2.031828	  1.220517	 -0.063335
 -2.015200	  1.215439	 -0.077005
 -2.001223	  1.208325	 -0.090208
 -1.987504	  1.202104	 -0.103334
 -1.974196	  1.195729	 -0.116866
 -1.961242	  1.189434	 -0.129828
 -1.953895	  1.181557	 -0.145516
 -1.945366	  1.170708	 -0.162796
 -1.926887	  1.158711	 -0.174624
 -1.905489	  1.153725	 -0.182216
 -1.890318	  1.150288	 -0.192115
 -1.880395	  1.147159	 -0.206484
 -1.873856	  1.140778	 -0.226302
 -1.867660	  1.132372	 -0.244483
 -1.860667	  1.123101	 -0.260257
 -1.851828	  1.112727	 -0.274805
 -1.841612	  1.103236	 -0.290282
 -1.832019	  1.094118	 -0.307337
 -1.826357	  1.090137	 -0.328190
 -1.826617	  1.089750	 -0.348615
 -1.832262	  1.087964	 -0.365831
 -1.840927	  1.081020	 -0.383929
 -1.839128	  1.068022	 -0.401272
 -1.831455	  1.057075	 -0.427515
 -1.828929	  1.052841	 -0.439994
 -1.826106	  1.045341	 -0.455369
 -1.823379	  1.035504	 -0.475860
 -1.821560	  1.029984	 -0.493140
 -1.818014	  1.028229	 -0.513878
 -1.812903	  1.025087	 -0.536555
 -1.807938	  1.013308	 -0.555196
 -1.804866	  1.003758	 -0.566957
 -1.801781	  0.984901	 -0.577319
 -1.795681	  0.963985	 -0.597814
 -1.793098	  0.957000	 -0.604442
 -1.788887	  0.942312	 -0.619725
 -1.778804	  0.928420	 -0.641743
 -1.771863	  0.926259	 -0.657977
 -1.765712	  0.925412	 -0.678977
 -1.757030	  0.921299	 -0.695803
 -1.750154	  0.910394	 -0.713312
 -1.743858	  0.902271	 -0.731730
 -1.732653	  0.897659	 -0.752102
 -1.719410	  0.897630	 -0.768158
 -1.700079	  0.899186	 -0.781317
 -1.678393	  0.899425	 -0.789823
 -1.657153	  0.895443	 -0.794031
 -1.640020	  0.886358	 -0.798567
 -1.624680	  0.873238	 -0.803977
 -1.608885	  0.860967	 -0.805632
 -1.588513	  0.856876	 -0.803244
 -1.563951	  0.857882	 -0.804831
 -1.549657	  0.862184	 -0.805384
 -1.529016	  0.870476	 -0.805014
 -1.502138	  0.872037	 -0.807695
 -1.487144	  0.871510	 -0.809279
 -1.470821	  0.869505	 -0.808000
 -1.450312	  0.864468	 -0.809744
 -1.423872	  0.857346	 -0.814623
 -1.405161	  0.849885	 -0.818491
 -1.392226	  0.844569	 -0.820983
 -1.374484	  0.836336	 -0.821503
 -1.353257	  0.826871	 -0.817710
 -1.330368	  0.816268	 -0.815572
 -1.320941	  0.808655	 -0.814039
 -1.306161	  0.797359	 -0.809541
 -1.284336	  0.786833	 -0.805460
 -1.266491	  0.771890	 -0.802517
 -1.249623	  0.757964	 -0.797128
 -1.239767	  0.750673	 -0.793154
 -1.226408	  0.739657	 -0.791428
 -1.211570	  0.719612	 -0.788598
 -1.202189	  0.701831	 -0.788315
 -1.195903	  0.685398	 -0.790383
 -1.187198	  0.664636	 -0.791438
 -1.181381	  0.645496	 -0.791440
 -1.177860	  0.626838	 -0.792388
 -1.174191	  0.608812	 -0.795705
 -1.170435	  0.588959	 -0.798476
 -1.168469	  0.568301	 -0.796820
 -1.161666	  0.543851	 -0.799496
 -1.155170	  0.532910	 -0.802564
 -1.143777	  0.513938	 -0.805426
 -1.130529	  0.490868	 -0.801845
 -1.123867	  0.479727	 -0.801419
 -1.110586	  0.463231	 -0.798492
 -1.094734	  0.440072	 -0.793612
 -1.082459	  0.423446	 -0.790968
 -1.071923	  0.403398	 -0.791032
 -1.066692	  0.392882	 -0.795696
 -1.055508	  0.376044	 -0.804280
 -1.040689	  0.356610	 -0.813128
 -1.031824	  0.345376	 -0.821010
 -1.025024	  0.332459	 -0.825597
 -1.011788	  0.310499	 -0.832095
 -1.000800	  0.293269	 -0.844159
 -0.996585	  0.284477	 -0.849176
 -0.978294	  0.265777	 -0.854419
 -0.961245	  0.249623	 -0.859615
 -0.946805	  0.244556	 -0.862795
 -0.940699	  0.225660	 -0.869884
 -0.923699	  0.212712	 -0.878736
 -0.916231	  0.200746	 -0.884644
 -0.900384	  0.181004	 -0.884756
 -0.888980	  0.171814	 -0.885599
 -0.872217	  0.158034	 -0.889615
 -0.855376	  0.140714	 -0.893143
 -0.839654	  0.123595	 -0.897209
 -0.834857	  0.116944	 -0.900511
 -0.817517	  0.094442	 -0.911870
 -0.804220	  0.081365	 -0.918015
 -0.790239	  0.070243	 -0.920724
 -0.771519	  0.060766	 -0.926047
 -0.754902	  0.053844	 -0.931351
 -0.736434	  0.043905	 -0.937518
 -0.720922	  0.036517	 -0.944293
 -0.705014	  0.030457	 -0.953582
 -0.683895	  0.024796	 -0.962088
 -0.661582	  0.014669	 -0.965682
 -0.648400	  0.002950	 -0.968418
 -0.639399	 -0.008515	 -0.973040
 -0.629203	 -0.026285	 -0.982259
 -0.618895	 -0.043177	 -0.992393
 -0.611129	 -0.064523	 -1.003700
 -0.600142	 -0.083170	 -1.014230
 -0.583843	 -0.092661	 -1.026393
 -0.567846	 -0.093072	 -1.034022
 -0.543401	 -0.093555	 -1.033382
 -0.529886	 -0.101766	 -1.037210
 -0.513182	 -0.122546	 -1.048207
 -0.500331	 -0.135459	 -1.056996
 -0.489550	 -0.145913	 -1.067202
 -0.480936	 -0.155261	 -1.076838
 -0.473476	 -0.166542	 -1.090723
 -0.463738	 -0.179234	 -1.109236
 -0.452913	 -0.194498	 -1.124624
 -0.446539	 -0.205882	 -1.135847
 -0.435905	 -0.215496	 -1.142135
 -0.420303	 -0.224948	 -1.154433
 -0.406844	 -0.236372	 -1.167049
 -0.390636	 -0.249890	 -1.180268
 -0.386528	 -0.255267	 -1.190470
 -0.377241	 -0.261179	 -1.202760
 -0.363176	 -0.267857	 -1.223152
 -0.353710	 -0.281337	 -1.243961
 -0.349908	 -0.288015	 -1.252469
 -0.349417	 -0.301449	 -1.270933
 -0.347574	 -0.311010	 -1.294303
 -0.343398	 -0.317727	 -1.307152
 -0.338938	 -0.322526	 -1.322827
 -0.328759	 -0.329220	 -1.340903
 -0.312089	 -0.341648	 -1.363736
 -0.306514	 -0.349731	 -1.372910
 -0.300152	 -0.362680	 -1.387294
 -0.292941	 -0.372424	 -1.409628
 -0.285817	 -0.382264	 -1.428024
 -0.280096	 -0.393218	 -1.441192
 -0.279443	 -0.408858	 -1.456026
 -0.282022	 -0.418838	 -1.467854
 -0.277562	 -0.429230	 -1.484312
 -0.271511	 -0.440890	 -1.502471
 -0.275329	 -0.452480	 -1.521455
 -0.283524	 -0.468304	 -1.540760
 -0.280986	 -0.479402	 -1.556034
 -0.273817	 -0.486979	 -1.569158
 -0.259605	 -0.491793	 -1.583329
 -0.247193	 -0.498879	 -1.601835
 -0.242757	 -0.508504	 -1.619478
 -0.243266	 -0.515511	 -1.633475
 -0.244634	 -0.523994	 -1.654716
 -0.235583	 -0.537853	 -1.671113
 -0.212739	 -0.549508	 -1.682710
 -0.193832	 -0.555812	 -1.692472
 -0.181045	 -0.556584	 -1.701467
 -0.167024	 -0.555253	 -1.717303
 -0.153804	 -0.552164	 -1.738360
 -0.147941	 -0.550628	 -1.757087
 -0.142639	 -0.550028	 -1.776812
 -0.130167	 -0.550359	 -1.794830
 -0.115274	 -0.550285	 -1.805380
 -0.093670	 -0.550409	 -1.811009
 -0.072951	 -0.551373	 -1.820426
 -0.062008	 -0.550706	 -1.837790
 -0.056101	 -0.552327	 -1.855285
 -0.042504	 -0.551778	 -1.873012
 -0.029317	 -0.547981	 -1.889323
 -0.013325	 -0.544892	 -1.902603
  0.004467	 -0.544590	 -1.911323
  0.021569	 -0.544305	 -1.921841
  0.037851	 -0.540571	 -1.933217
  0.054239	 -0.536272	 -1.943988
  0.070982	 -0.532144	 -1.954221
  0.088171	 -0.528235	 -1.963878
  0.105714	 -0.524850	 -1.972626
  0.122953	 -0.521376	 -1.981761
  0.137065	 -0.517537	 -1.992195
  0.152108	 -0.509982	 -2.004693
  0.172465	 -0.495602	 -2.015040
  0.186764	 -0.489803	 -2.019842
  0.205219	 -0.488436	 -2.023965
  0.226775	 -0.483549	 -2.031213
  0.241617	 -0.473253	 -2.041697
  0.251219	 -0.461924	 -2.052951
  0.266480	 -0.450773	 -2.064559
  0.283829	 -0.442677	 -2.072474
  0.300557	 -0.434999	 -2.078786
  0.313902	 -0.424668	 -2.087296
  0.325875	 -0.411337	 -2.098287
  0.342150	 -0.396486	 -2.108896
  0.357429	 -0.385187	 -2.116372
  0.366866	 -0.379574	 -2.120944
  0.385484	 -0.373903	 -2.131227
  0.403566	 -0.368757	 -2.141764
  0.420202	 -0.363326	 -2.151182
  0.434180	 -0.358109	 -2.162118
  0.450271	 -0.358573	 -2.174378
  0.466262	 -0.361833	 -2.186052
  0.481823	 -0.367093	 -2.197458
  0.497383	 -0.372486	 -2.208806
  0.513040	 -0.378525	 -2.219685
  0.528674	 -0.384569	 -2.230587
  0.544025	 -0.390439	 -2.241932
  0.559153	 -0.396151	 -2.253760
  0.574256	 -0.401851	 -2.265643
  0.589525	 -0.407542	 -2.277283
  0.605293	 -0.413527	 -2.287980
  0.621252	 -0.419422	 -2.298416
  0.637146	 -0.425118	 -2.309220
  0.652780	 -0.430774	 -2.320353
  0.668088	 -0.437067	 -2.331574
  0.683180	 -0.443295	 -2.343144
  0.697887	 -0.450547	 -2.354657
  0.712954	 -0.458208	 -2.365268
  0.728057	 -0.466369	 -2.374460
  0.742553	 -0.474634	 -2.385485
