  1.003649	  1.636938	 -1.623962
  1.004071	  1.638343	 -1.624667
  1.004001	  1.620064	 -1.623119
  1.005706	  1.604307	 -1.610219
  1.000100	  1.587834	 -1.589533
  0.991492	  1.567510	 -1.576202
  0.984745	  1.552626	 -1.567736
  0.979983	  1.541107	 -1.563834
  0.972305	  1.517298	 -1.560605
  0.965933	  1.498278	 -1.557401
  0.960106	  1.476168	 -1.553021
  0.957990	  1.460628	 -1.550118
  0.955340	  1.440593	 -1.543661
  0.952161	  1.421903	 -1.533359
  0.945645	  1.401850	 -1.519427
  0.939452	  1.388486	 -1.512629
  0.933607	  1.374493	 -1.497295
  0.936916	  1.360933	 -1.486113
  0.939671	  1.341136	 -1.475828
  0.941601	  1.323198	 -1.466547
  0.945716	  1.305594	 -1.457731
  0.950467	  1.288391	 -1.448668
  0.955833	  1.271549	 -1.439342
  0.961858	  1.255308	 -1.429350
  0.968295	  1.239391	 -1.419052
  0.975092	  1.224088	 -1.408114
  0.981088	  1.209205	 -1.398638
  0.984981	  1.190577	 -1.391740
  0.990487	  1.172373	 -1.379561
  1.001862	  1.162134	 -1.358484
  1.015651	  1.152707	 -1.338879
  1.021839	  1.147000	 -1.328634
  1.023934	  1.135168	 -1.318355
  1.024814	  1.115927	 -1.306348
  1.035945	  1.097256	 -1.296156
  1.051874	  1.080923	 -1.285631
  1.059413	  1.069366	 -1.273502
  1.059923	  1.058440	 -1.254840
  1.059608	  1.047714	 -1.237693
  1.060629	  1.034963	 -1.221969
  1.061896	  1.023260	 -1.206678
  1.063241	  1.012389	 -1.190687
  1.064136	  0.999739	 -1.173792
  1.063603	  0.986435	 -1.157226
  1.067518	  0.974209	 -1.144250
  1.074685	  0.958479	 -1.132088
  1.086254	  0.943896	 -1.121955
  1.100769	  0.925971	 -1.106128
  1.110509	  0.914868	 -1.086918
  1.117927	  0.908852	 -1.073826
  1.120992	  0.893666	 -1.056005
  1.117600	  0.878500	 -1.042479
  1.110695	  0.861866	 -1.028304
  1.102737	  0.845577	 -1.016521
  1.097668	  0.828540	 -1.006492
  1.094477	  0.810582	 -0.997199
  1.090240	  0.792964	 -0.987050
  1.084527	  0.776867	 -0.976594
  1.079153	  0.761105	 -0.965494
  1.074407	  0.745529	 -0.953710
  1.067334	  0.730107	 -0.943429
  1.061130	  0.714460	 -0.932485
  1.054732	  0.698560	 -0.921954
  1.049098	  0.682701	 -0.911021
  1.042700	  0.667119	 -0.900254
  1.033962	  0.651110	 -0.893248
  1.023080	  0.632181	 -0.890211
  1.015556	  0.616224	 -0.886495
  1.008909	  0.600396	 -0.878709
  1.002375	  0.575778	 -0.868905
  0.997543	  0.560494	 -0.861596
  0.993717	  0.550579	 -0.858576
  0.978904	  0.525475	 -0.854748
  0.969317	  0.507651	 -0.853379
  0.962546	  0.494751	 -0.851584
  0.951981	  0.476708	 -0.848754
  0.942064	  0.457546	 -0.847893
  0.933368	  0.438054	 -0.846495
  0.924657	  0.417343	 -0.839556
  0.919944	  0.403056	 -0.834740
  0.915063	  0.379285	 -0.826616
  0.914006	  0.353813	 -0.815780
  0.913611	  0.347235	 -0.813944
  0.911809	  0.327137	 -0.809366
  0.906340	  0.309109	 -0.807984
  0.898861	  0.287379	 -0.803611
  0.891852	  0.269138	 -0.797795
  0.885718	  0.252173	 -0.790920
  0.875710	  0.239197	 -0.782723
  0.859978	  0.223927	 -0.776818
  0.846322	  0.200157	 -0.776020
  0.842969	  0.181788	 -0.769554
  0.842534	  0.168131	 -0.757805
  0.844058	  0.153354	 -0.741562
  0.843696	  0.132308	 -0.728007
  0.835114	  0.112946	 -0.721612
  0.817312	  0.097185	 -0.719619
  0.801290	  0.088230	 -0.715576
  0.785024	  0.077484	 -0.702481
  0.776310	  0.068452	 -0.687328
  0.768423	  0.058473	 -0.670501
  0.760639	  0.048245	 -0.653583
  0.754392	  0.036410	 -0.637330
  0.748915	  0.022315	 -0.624807
  0.748158	  0.004133	 -0.618206
  0.755852	 -0.023789	 -0.608098
  0.757538	 -0.041781	 -0.599124
  0.756058	 -0.052681	 -0.593176
  0.749999	 -0.072201	 -0.585322
  0.749265	 -0.098078	 -0.579359
  0.754653	 -0.114602	 -0.581884
  0.762044	 -0.128487	 -0.584199
  0.771999	 -0.152156	 -0.589893
  0.774929	 -0.173083	 -0.590787
  0.776727	 -0.188176	 -0.590168
  0.779523	 -0.209557	 -0.589870
  0.783796	 -0.229565	 -0.590645
  0.785139	 -0.248375	 -0.590518
  0.789000	 -0.271305	 -0.592215
  0.796239	 -0.287568	 -0.596714
  0.806841	 -0.302743	 -0.602795
  0.821058	 -0.327157	 -0.606599
  0.826277	 -0.346965	 -0.604944
  0.826749	 -0.360902	 -0.603033
  0.824875	 -0.379186	 -0.607953
  0.826236	 -0.402474	 -0.611396
  0.828993	 -0.422498	 -0.613197
  0.831734	 -0.442241	 -0.614930
  0.833539	 -0.462128	 -0.616019
  0.833124	 -0.482118	 -0.615615
  0.832696	 -0.502110	 -0.615205
  0.832260	 -0.522100	 -0.614781
  0.831420	 -0.542066	 -0.613977
  0.828509	 -0.561657	 -0.611267
  0.825772	 -0.580877	 -0.608757
  0.825689	 -0.598932	 -0.609627
  0.823956	 -0.619025	 -0.609950
  0.813913	 -0.641918	 -0.602884
  0.805684	 -0.659271	 -0.595437
  0.798761	 -0.679213	 -0.583892
  0.795583	 -0.697475	 -0.575697
  0.794013	 -0.707832	 -0.571940
  0.789856	 -0.733476	 -0.565846
  0.785875	 -0.749546	 -0.559129
  0.782417	 -0.764014	 -0.550864
  0.778166	 -0.782966	 -0.536597
  0.773430	 -0.799926	 -0.526998
  0.769693	 -0.813208	 -0.520445
  0.763997	 -0.839756	 -0.508111
  0.761819	 -0.854141	 -0.498976
  0.761896	 -0.862582	 -0.492483
  0.755668	 -0.886375	 -0.475186
  0.753212	 -0.906151	 -0.465773
  0.753576	 -0.920083	 -0.461648
  0.755838	 -0.940613	 -0.455068
  0.759704	 -0.960852	 -0.443068
  0.764503	 -0.976607	 -0.432118
  0.769438	 -0.987713	 -0.425425
  0.768636	 -1.006444	 -0.410948
  0.765563	 -1.023644	 -0.393265
  0.761359	 -1.039782	 -0.383719
  0.758480	 -1.061271	 -0.381518
  0.756528	 -1.083924	 -0.379289
  0.753406	 -1.102402	 -0.374194
  0.749733	 -1.120007	 -0.369224
  0.747114	 -1.138449	 -0.362539
  0.743822	 -1.161279	 -0.353690
  0.740614	 -1.174878	 -0.349742
  0.736389	 -1.192130	 -0.342779
  0.731310	 -1.213968	 -0.332707
  0.726254	 -1.232970	 -0.324735
  0.723569	 -1.244370	 -0.321482
  0.718296	 -1.261394	 -0.312271
  0.711113	 -1.284918	 -0.302266
  0.706059	 -1.303536	 -0.293367
  0.703283	 -1.317121	 -0.288386
  0.698866	 -1.335957	 -0.281144
  0.695195	 -1.355348	 -0.275106
  0.693266	 -1.378096	 -0.267204
  0.690677	 -1.394205	 -0.261244
  0.687871	 -1.408378	 -0.255716
  0.678090	 -1.428395	 -0.249499
  0.667813	 -1.446327	 -0.243187
  0.661855	 -1.464168	 -0.234834
  0.656803	 -1.481797	 -0.225910
  0.653023	 -1.499947	 -0.216609
  0.649436	 -1.516600	 -0.209656
  0.644497	 -1.536288	 -0.205754
  0.638743	 -1.556263	 -0.202573
  0.634051	 -1.575186	 -0.195077
  0.631933	 -1.592397	 -0.183797
  0.631517	 -1.610986	 -0.172037
  0.632896	 -1.629604	 -0.163026
  0.635498	 -1.646811	 -0.155331
  0.637820	 -1.666547	 -0.148662
  0.639547	 -1.684008	 -0.143486
  0.638784	 -1.704361	 -0.137569
  0.637682	 -1.723057	 -0.132028
  0.637071	 -1.741899	 -0.123912
  0.637347	 -1.759433	 -0.115156
  0.633967	 -1.778221	 -0.108757
  0.631487	 -1.797818	 -0.101320
  0.634931	 -1.813649	 -0.089841
  0.640528	 -1.832448	 -0.075733
  0.641858	 -1.851260	 -0.066636
  0.642467	 -1.863486	 -0.060946
  0.640369	 -1.883282	 -0.055013
  0.641242	 -1.908786	 -0.043622
  0.641891	 -1.919553	 -0.038252
  0.642692	 -1.940324	 -0.028538
  0.644496	 -1.959493	 -0.018034
  0.645871	 -1.973776	 -0.009029
  0.647377	 -1.991237	  0.003334
  0.649137	 -2.007724	  0.014616
  0.650251	 -2.024740	  0.025316
  0.648759	 -2.044876	  0.033850
  0.647460	 -2.059266	  0.038911
  0.643218	 -2.079661	  0.043083
  0.642054	 -2.105386	  0.054663
  0.642017	 -2.115295	  0.059913
  0.640674	 -2.136207	  0.070492
  0.639914	 -2.154806	  0.080837
  0.639837	 -2.168132	  0.089836
  0.639747	 -2.187935	  0.103594
  0.638900	 -2.204376	  0.113220
  0.639331	 -2.218649	  0.122550
  0.638365	 -2.246603	  0.135631
  0.636027	 -2.261442	  0.139211
  0.632851	 -2.276653	  0.142146
  0.626626	 -2.293249	  0.149918
  0.623095	 -2.313797	  0.159249
  0.620880	 -2.332250	  0.166922
  0.618677	 -2.350619	  0.174524
  0.616805	 -2.369219	  0.181630
  0.614967	 -2.387843	  0.188687
  0.613046	 -2.406431	  0.195814
  0.611042	 -2.424986	  0.203007
  0.609038	 -2.443575	  0.210214
  0.606681	 -2.462209	  0.217696
  0.603320	 -2.480208	  0.225742
