 -0.631672	 -2.093144	 -2.097770
 -0.625418	 -2.072420	 -2.077000
 -0.613560	 -2.029622	 -2.047523
 -0.608517	 -1.989406	 -2.014474
 -0.596739	 -1.951113	 -1.982692
 -0.589859	 -1.909761	 -1.954797
 -0.575707	 -1.871975	 -1.925128
 -0.571613	 -1.835601	 -1.890854
 -0.560550	 -1.795393	 -1.863047
 -0.559112	 -1.757185	 -1.830486
 -0.548660	 -1.719923	 -1.798233
 -0.543446	 -1.684108	 -1.763187
 -0.535099	 -1.645000	 -1.732533
 -0.535663	 -1.598644	 -1.710067
 -0.556279	 -1.544319	 -1.723611
 -0.585384	 -1.491869	 -1.754515
 -0.622162	 -1.435205	 -1.786391
 -0.651229	 -1.369659	 -1.816165
 -0.662024	 -1.304697	 -1.839754
 -0.662298	 -1.241563	 -1.856984
 -0.653418	 -1.182644	 -1.866739
 -0.637248	 -1.120950	 -1.871967
 -0.613191	 -1.048450	 -1.872251
 -0.576786	 -0.963372	 -1.861454
 -0.518829	 -0.879524	 -1.832258
 -0.443133	 -0.814052	 -1.789135
 -0.362482	 -0.766266	 -1.732714
 -0.293529	 -0.736129	 -1.675795
 -0.235591	 -0.712612	 -1.619670
 -0.186935	 -0.701508	 -1.562885
 -0.145322	 -0.694385	 -1.511562
 -0.106565	 -0.689645	 -1.453073
 -0.074271	 -0.683877	 -1.388357
 -0.048884	 -0.679102	 -1.318492
 -0.033187	 -0.669418	 -1.252953
 -0.030670	 -0.651483	 -1.199449
 -0.035326	 -0.639041	 -1.148847
 -0.042727	 -0.618739	 -1.106165
 -0.056954	 -0.594925	 -1.058959
 -0.078175	 -0.562229	 -1.006092
 -0.105473	 -0.519264	 -0.945984
 -0.136554	 -0.474789	 -0.884188
 -0.163914	 -0.429097	 -0.837330
 -0.183756	 -0.392893	 -0.802703
 -0.198906	 -0.364124	 -0.773719
 -0.211294	 -0.335105	 -0.745536
 -0.222347	 -0.303596	 -0.716432
 -0.230759	 -0.269540	 -0.686653
 -0.236427	 -0.233921	 -0.655999
 -0.238201	 -0.196405	 -0.623965
 -0.235543	 -0.157852	 -0.590921
 -0.229434	 -0.119348	 -0.558773
 -0.221381	 -0.080407	 -0.527735
 -0.212180	 -0.042031	 -0.497490
 -0.202986	 -0.004026	 -0.467443
 -0.194312	  0.033948	 -0.437413
 -0.186486	  0.072202	 -0.407000
 -0.179465	  0.111232	 -0.375957
 -0.173406	  0.150866	 -0.344779
 -0.168071	  0.190072	 -0.312851
 -0.163340	  0.228745	 -0.280945
 -0.158284	  0.266217	 -0.249383
 -0.152700	  0.303357	 -0.217626
 -0.146247	  0.340303	 -0.185516
 -0.138592	  0.377187	 -0.152920
 -0.129352	  0.414023	 -0.120502
 -0.119377	  0.451199	 -0.088773
 -0.109076	  0.489111	 -0.057805
 -0.098730	  0.528413	 -0.027279
 -0.088539	  0.569028	  0.002582
 -0.078685	  0.610066	  0.031166
 -0.069535	  0.650818	  0.059831
 -0.060412	  0.691012	  0.088492
 -0.051368	  0.730706	  0.117680
 -0.042163	  0.769812	  0.147466
 -0.032558	  0.808455	  0.177805
 -0.022765	  0.846861	  0.208547
 -0.012838	  0.885167	  0.239013
 -0.002722	  0.922944	  0.268471
  0.008025	  0.961029	  0.297366
  0.020166	  0.998963	  0.326078
  0.034386	  1.036685	  0.354727
  0.050425	  1.073947	  0.381903
  0.067325	  1.109447	  0.407158
  0.085386	  1.142130	  0.429960
  0.105891	  1.174751	  0.452711
  0.135202	  1.215696	  0.481315
  0.178351	  1.268066	  0.520542
  0.223431	  1.319690	  0.561170
  0.265362	  1.365017	  0.601210
  0.291093	  1.396922	  0.632156
  0.306576	  1.425298	  0.656981
  0.316727	  1.454945	  0.680978
  0.320191	  1.483920	  0.706047
  0.315981	  1.514663	  0.729205
  0.306174	  1.552368	  0.753418
  0.289862	  1.606664	  0.785826
  0.268482	  1.668772	  0.821672
  0.249047	  1.730531	  0.855694
  0.235717	  1.773909	  0.881046
  0.226681	  1.809536	  0.903895
  0.219505	  1.845974	  0.930253
  0.214829	  1.883490	  0.959148
  0.213016	  1.921653	  0.988516
  0.214878	  1.959851	  1.017945
  0.218827	  1.998632	  1.047476
  0.224184	  2.038801	  1.077802
  0.230204	  2.078819	  1.108455
  0.236284	  2.118854	  1.138787
  0.243380	  2.158740	  1.168143
  0.251132	  2.198339	  1.197217
  0.260026	  2.237586	  1.226762
  0.269270	  2.276050	  1.256682
  0.278200	  2.314052	  1.287895
  0.285786	  2.352046	  1.320075
  0.292665	  2.390014	  1.352847
  0.299073	  2.427870	  1.386122
  0.305716	  2.465177	  1.419144
  0.313657	  2.501767	  1.449982
  0.320965	  2.538354	  1.478051
  0.328064	  2.575829	  1.502491
  0.331344	  2.601587	  1.517516
