 0.0 0.0 0.0 0
 0.5392872465087999 -0.777093091254603 -0.3232206572564975 1000
 -0.6669594849643541 -0.5253878622163766 -0.5291291332480094 1000
 0.17379924178287728 0.17252366553583925 0.9692721023457629 1000
 0.16294977579736544 -0.9253492626799363 0.342847068859115 1000
 0.6196845842653456 0.7221824314363835 0.3060417483751512 1000
 0.1269980533494558 0.25115467045459705 -0.9595430297565044 1000
 -0.8276582503744935 -0.2676935319480522 0.49226821301015344 1000
 0.25511512380378865 -0.4896363567330627 0.8337256813675292 1000
 0.0 0.0 0.0 0
 -0.7875111350883911 0.6119151104834443 0.0688702379393881 1000
 -0.8904182832188272 0.046588763375788905 -0.4525856471837692 1000
 -0.47652426207812226 0.5589700284796617 -0.6787165350220572 1000
 0.49223869682956234 0.6011705758789325 -0.6296610231234956 1000
