  0.780021	  0.176831	 -2.922533
  0.772298	  0.175081	 -2.893597
  0.739332	  0.200245	 -2.853982
  0.705671	  0.218620	 -2.828477
  0.669661	  0.239758	 -2.801268
  0.636839	  0.261012	 -2.772007
  0.604343	  0.279218	 -2.737835
  0.570402	  0.293163	 -2.711607
  0.529965	  0.315363	 -2.678754
  0.500542	  0.331479	 -2.650959
  0.464125	  0.352046	 -2.616716
  0.427747	  0.372727	 -2.581636
  0.394273	  0.391911	 -2.552157
  0.360798	  0.407900	 -2.527162
  0.319329	  0.423696	 -2.500032
  0.288713	  0.444875	 -2.465864
  0.247012	  0.467145	 -2.432331
  0.217254	  0.482804	 -2.404582
  0.180304	  0.498656	 -2.371767
  0.142374	  0.523209	 -2.346593
  0.112278	  0.542224	 -2.311236
  0.076585	  0.556373	 -2.279756
  0.039989	  0.575682	 -2.254725
  0.007283	  0.594832	 -2.225564
 -0.030864	  0.613200	 -2.195377
 -0.066299	  0.631851	 -2.162567
 -0.100494	  0.651216	 -2.128543
 -0.130570	  0.673590	 -2.100291
 -0.164909	  0.691490	 -2.068700
 -0.198061	  0.712506	 -2.038538
 -0.236355	  0.733736	 -2.007534
 -0.269208	  0.750662	 -1.980473
 -0.304429	  0.769967	 -1.948550
 -0.334895	  0.787303	 -1.919758
 -0.375184	  0.808608	 -1.885566
 -0.408195	  0.825648	 -1.859229
 -0.447585	  0.847798	 -1.826465
 -0.484835	  0.869292	 -1.795104
 -0.515243	  0.884837	 -1.766626
 -0.549760	  0.904601	 -1.735072
 -0.583790	  0.921446	 -1.707454
 -0.619769	  0.943503	 -1.673590
 -0.657315	  0.961913	 -1.649393
 -0.690431	  0.981794	 -1.620641
 -0.737791	  0.996343	 -1.612248
 -0.861196	  1.032790	 -1.708276
 -1.016738	  1.056402	 -1.782827
 -0.997109	  1.164943	 -1.796399
 -1.073323	  1.037931	 -1.708105
 -1.259696	  1.050365	 -1.859681
 -1.410824	  1.061349	 -2.004104
 -1.348117	  1.094327	 -1.815237
 -1.437878	  1.195390	 -1.865426
 -1.604616	  1.046374	 -1.840885
 -1.703098	  1.053975	 -1.937976
 -1.499929	  1.250276	 -1.636552
 -1.565416	  1.256233	 -1.677553
 -1.585504	  1.101800	 -1.503246
 -1.492700	  1.188057	 -1.399968
 -1.466790	  1.199074	 -1.340296
 -1.385759	  1.264223	 -1.231799
 -1.329889	  1.317901	 -1.081832
 -1.355275	  1.340767	 -1.046736
 -1.392794	  1.358988	 -1.014590
 -1.428835	  1.374220	 -0.979947
 -1.456967	  1.393718	 -0.950028
 -1.494721	  1.418637	 -0.918804
 -1.526508	  1.432402	 -0.888017
 -1.564173	  1.451004	 -0.861908
 -1.600310	  1.475144	 -0.829099
 -1.638033	  1.494219	 -0.801620
 -1.675307	  1.513330	 -0.765780
 -1.704601	  1.525342	 -0.740122
 -1.740672	  1.547407	 -0.711825
 -1.776694	  1.568362	 -0.681703
 -1.812699	  1.587922	 -0.646271
 -1.845119	  1.603688	 -0.619376
 -1.881330	  1.622487	 -0.589837
 -1.919584	  1.642560	 -0.558265
 -1.955362	  1.661052	 -0.527088
 -1.985794	  1.678103	 -0.500733
 -2.025168	  1.698194	 -0.467421
 -2.060533	  1.718400	 -0.435602
 -2.095832	  1.734568	 -0.408757
 -2.127582	  1.751729	 -0.376774
 -2.159718	  1.776946	 -0.347460
 -2.196713	  1.796120	 -0.321693
 -2.232763	  1.808954	 -0.287207
 -2.271952	  1.830693	 -0.259288
 -2.304255	  1.852440	 -0.224983
 -2.342124	  1.863873	 -0.201074
 -2.365546	  1.882512	 -0.203084
