 0.0 0.0 0.0 0
 0.11042568608257808 -0.8033676149903155 0.31002097855619676 1000
 -0.8295825515362358 -0.3501813199383822 -0.2456848216141174 1000
 0.06853424648669956 0.6349539855165074 0.5760735184878236 1000
 -0.6271582509115577 0.6922961575782365 -0.11342791015884446 1000
 -0.9740588508275438 -0.17457986229574096 0.17980703117291114 1000
 0.1325294764684385 0.1839602878455932 0.6657428312892684 1000
 -0.4162609874725162 0.6275577655807771 0.547475009565535 1000
 -0.505613991144593 -0.5017900481833318 -0.47440076861467506 1000
 0.0 0.0 0.0 0
 0.4079597032428507 0.7281869593978886 -0.34583021083416476 1000
 -0.6817806241972438 0.5935026543534966 0.41425609532428925 1000
 0.5481914312042231 -0.5328991604080906 0.3320998425828618 1000
 -0.1505084557946405 -0.9819265349190445 -0.1562609611216065 1000
 0.922762789815246 0.3731479101722846 0.007173717061084495 1000
 0.3596966749749446 0.30753663901096595 0.5913489257108994 1000
 0.6671019155799822 0.6345840507070961 0.2590774339637182 1000
 0.061898400659589015 0.9213214169589645 -0.17849747804523936 1000
 0.0 0.0 0.0 0
 0.19905324987846693 -0.7977244245129147 -0.48183681661462047 1000
 -0.24802845037783877 0.20863297346918802 -0.5979247014660455 1000
 -0.8585192710482771 -0.29851683811071483 0.34002397390805106 1000
 -0.35793965928627847 0.7030758965118087 -0.31477289406265613 1000
 0.9929528761741062 0.07166950465037242 -0.03218717162164314 1000
 -0.184875341052338 -0.7840130284143791 0.3466368724903146 1000
 0.1155666704146443 -0.08580085325149166 -0.691352499780941 1000
 -0.8468103615898124 -0.5169776330349667 0.11730473111465187 1000
 0.0 0.0 0.0 0
 -0.07930552646638106 -0.8077731471735832 -0.4650857713592987 1000
 0.7521770087708958 -0.016414167444589123 -0.5237214780405486 1000
 -0.009791794919594421 -0.9890817227578903 0.005624463373768963 1000
 0.4916823067502786 -0.7425713825269944 -0.42833463290838614 1000
 0.7312412754176827 -0.4947767701856336 0.1995227912916942 1000
 -0.277447332950045 -0.026678141409813866 -0.6267319428684176 1000
 -0.23098195329536242 -0.9144783438242063 -0.28940007078604757 1000
 -0.3355881017286476 -0.5949121383754726 0.4729561492417235 1000
 0.0 0.0 0.0 0
 0.9131747272661311 -0.40720289443412144 -0.14338129531178204 1000
 -0.5268168437487342 -0.038212425728870125 0.6253866104242515 1000
 -0.5134648417355087 -0.6901211679068939 -0.360785052147048 1000
 -0.1990135244739764 0.632501021631177 -0.42848189505626416 1000
 0.6621331567099165 -0.060017475855302316 0.4353711234212611 1000
 -0.15588618597191445 0.9190193318222046 -0.1434924957705735 1000
 -0.22042205116627142 -0.2661660990898076 0.633633309673506 1000
 0.9097325195493836 0.35249158700953526 -0.20618887105267167 1000
 0.0 0.0 0.0 0
 -0.7002625763578689 0.44786523750603613 0.4898793895137468 1000
 0.4854196157904306 -0.7393772279291908 0.19805213160944038 1000
 0.2341013255050082 -0.8915160316537364 -0.37197958538703496 1000
 -0.7143041466138169 -0.6712740658013795 0.14064433969924334 1000
 -0.43196099799982024 0.36588469260513334 -0.48182949932669794 1000
 0.9556531286328295 -0.12216025473236791 0.07414625448687685 1000
 0.47388852636181766 0.3090209489000662 -0.5775535428648171 1000
 0.8115339689420178 0.20835007103704456 0.30974237679108124 1000
 0.0 0.0 0.0 0
 0.09649661229459211 -0.05274520470428497 0.6599947755413365 1000
 -0.8005789096277238 -0.17797404711598275 0.4508579855019555 1000
 0.25640324897496225 0.8343721273375301 0.3848681027586755 1000
 -0.5678274195369819 -0.5882865054870805 0.3917114500995522 1000
 -0.33546116050265967 0.542445096773152 0.6080560578429067 1000
 -0.6503218868588085 0.39054173419614735 -0.3404092095752686 1000
 0.542132508523208 0.35619069658907443 0.496063183334581 1000
 0.5548905737519972 -0.8014885235222265 0.019257647626785987 1000
 0.0 0.0 0.0 0
 0.7514659698701639 -0.596686058839737 -0.3237538913992276 1000
 -0.21827899962730418 -0.41270396028625644 -0.6182749288322064 1000
 0.7217358714231573 -0.2081082653030759 -0.5400341154564715 1000
 0.7126683484791462 0.5167144895820277 0.30018556379507005 1000
