 -1.553005	  0.788837	 -1.657243
 -1.538560	  0.800289	 -1.668963
 -1.550511	  0.793813	 -1.649256
 -1.561033	  0.785377	 -1.641816
 -1.576468	  0.772356	 -1.628866
 -1.589853	  0.754732	 -1.615113
 -1.595223	  0.745616	 -1.611221
 -1.607817	  0.730995	 -1.603334
 -1.622730	  0.716565	 -1.596395
 -1.635864	  0.703653	 -1.586966
 -1.648952	  0.691311	 -1.578199
 -1.662041	  0.678974	 -1.569454
 -1.675169	  0.666431	 -1.561068
 -1.688329	  0.653700	 -1.553022
 -1.701502	  0.640972	 -1.544993
 -1.715244	  0.628428	 -1.537679
 -1.728919	  0.616139	 -1.531113
 -1.743308	  0.604149	 -1.529705
 -1.760355	  0.587237	 -1.527424
 -1.775405	  0.573098	 -1.519631
 -1.790797	  0.565838	 -1.504060
 -1.803463	  0.563572	 -1.491205
 -1.818766	  0.559180	 -1.476722
 -1.834431	  0.547805	 -1.462419
 -1.843519	  0.536987	 -1.456499
 -1.858307	  0.522396	 -1.447841
 -1.876321	  0.506244	 -1.434563
 -1.890505	  0.496561	 -1.424314
