 -0.035071	 -1.992882	  1.531247
 -0.030706	 -1.977060	  1.529800
 -0.030164	 -1.975097	  1.529621
 -0.024341	 -1.957501	  1.522456
 -0.021905	 -1.936993	  1.513614
 -0.020572	 -1.917742	  1.508810
 -0.014695	 -1.901917	  1.502499
 -0.009215	 -1.883414	  1.493990
 -0.008166	 -1.862841	  1.487332
 -0.005112	 -1.846412	  1.480209
  0.000570	 -1.829523	  1.471944
  0.003478	 -1.807838	  1.465201
  0.003902	 -1.790217	  1.458068
  0.007341	 -1.774235	  1.449885
  0.011872	 -1.753241	  1.444053
  0.013181	 -1.734922	  1.438256
  0.015989	 -1.717128	  1.428261
  0.018778	 -1.697636	  1.421118
  0.015769	 -1.678409	  1.418418
  0.015002	 -1.659912	  1.410015
  0.019182	 -1.641431	  1.406648
  0.022697	 -1.620944	  1.409205
  0.022249	 -1.602413	  1.409706
  0.024713	 -1.582357	  1.406847
  0.032883	 -1.565202	  1.411496
  0.041465	 -1.549647	  1.421287
  0.048918	 -1.534449	  1.430835
  0.057226	 -1.521108	  1.442973
  0.065697	 -1.507773	  1.455457
  0.073670	 -1.494368	  1.466838
  0.082534	 -1.482461	  1.479843
  0.092375	 -1.469905	  1.492432
  0.102022	 -1.458158	  1.505370
  0.112939	 -1.446231	  1.517196
  0.124724	 -1.434329	  1.528788
  0.137573	 -1.422608	  1.538787
  0.150457	 -1.411427	  1.549260
  0.163555	 -1.399341	  1.558922
  0.176245	 -1.385615	  1.566052
  0.188007	 -1.369543	  1.571338
  0.198367	 -1.353019	  1.576719
  0.208756	 -1.337580	  1.583987
  0.218988	 -1.322287	  1.591046
  0.228526	 -1.306810	  1.597591
  0.237486	 -1.290635	  1.604291
  0.246692	 -1.273170	  1.608414
  0.255137	 -1.254852	  1.611501
  0.266205	 -1.238235	  1.612137
  0.276066	 -1.220536	  1.611345
  0.287720	 -1.206181	  1.608709
  0.297596	 -1.190457	  1.601352
  0.306196	 -1.174358	  1.593005
  0.313595	 -1.157823	  1.584231
  0.319689	 -1.139547	  1.578868
  0.325112	 -1.120663	  1.575136
  0.327152	 -1.101028	  1.571987
  0.321300	 -1.081969	  1.570511
  0.315409	 -1.062913	  1.569042
  0.309518	 -1.043857	  1.567573
  0.303627	 -1.024800	  1.566105
  0.297711	 -1.006376	  1.564021
  0.291781	 -0.987680	  1.560018
  0.288699	 -0.971963	  1.550130
  0.286138	 -0.960139	  1.543466
  0.282287	 -0.948577	  1.526964
  0.278571	 -0.938507	  1.510061
  0.276106	 -0.929005	  1.492380
  0.273739	 -0.919633	  1.474871
  0.271371	 -0.910261	  1.457362
  0.268921	 -0.900930	  1.439877
  0.265549	 -0.892193	  1.422331
  0.261854	 -0.887104	  1.403909
  0.259439	 -0.882901	  1.383868
  0.255995	 -0.880241	  1.364915
  0.256365	 -0.878476	  1.342254
  0.258459	 -0.872982	  1.325556
  0.258068	 -0.868107	  1.305311
  0.256994	 -0.865077	  1.285398
  0.257530	 -0.860031	  1.266356
  0.259454	 -0.854071	  1.246346
  0.260230	 -0.851132	  1.226451
  0.257185	 -0.848084	  1.208526
  0.257285	 -0.841463	  1.187349
  0.260291	 -0.838044	  1.167537
  0.260297	 -0.831765	  1.150056
  0.259221	 -0.823407	  1.131344
  0.260961	 -0.815112	  1.111703
  0.268228	 -0.804504	  1.095692
  0.271739	 -0.790793	  1.080031
  0.271145	 -0.775316	  1.069588
  0.270220	 -0.757140	  1.058801
  0.271477	 -0.738596	  1.050464
  0.275810	 -0.719109	  1.040148
  0.274468	 -0.702933	  1.032728
  0.270611	 -0.683376	  1.029281
  0.271377	 -0.660515	  1.023966
  0.271666	 -0.644592	  1.015602
  0.270790	 -0.626181	  1.008956
  0.272403	 -0.606212	  1.002362
  0.274081	 -0.588557	  0.991831
  0.274028	 -0.572771	  0.979226
  0.277404	 -0.552507	  0.972875
  0.278019	 -0.533919	  0.970103
  0.276746	 -0.515584	  0.963835
  0.278169	 -0.497279	  0.954414
  0.284275	 -0.477684	  0.945475
  0.289403	 -0.461620	  0.937982
  0.296171	 -0.443476	  0.935408
  0.302333	 -0.418085	  0.932528
  0.302933	 -0.404808	  0.926464
  0.307360	 -0.387520	  0.918449
  0.315442	 -0.367694	  0.908312
  0.317617	 -0.348752	  0.901757
  0.316621	 -0.328285	  0.897673
  0.319079	 -0.309716	  0.893284
  0.321693	 -0.292064	  0.884230
  0.324650	 -0.275398	  0.871653
  0.329148	 -0.255238	  0.867105
  0.339135	 -0.240374	  0.859942
  0.349923	 -0.224950	  0.849802
  0.353871	 -0.205218	  0.844300
  0.354863	 -0.187867	  0.838596
  0.358722	 -0.169405	  0.827950
  0.364698	 -0.146681	  0.822365
  0.369698	 -0.130431	  0.824572
  0.373544	 -0.110858	  0.822968
  0.377582	 -0.090784	  0.815567
  0.382020	 -0.073070	  0.812080
  0.389501	 -0.053450	  0.808201
  0.397248	 -0.034758	  0.803247
  0.402722	 -0.019367	  0.798449
  0.409469	  0.001264	  0.792813
  0.412472	  0.020381	  0.786454
  0.413552	  0.039475	  0.781075
  0.418871	  0.058144	  0.780223
  0.424009	  0.077350	  0.773878
  0.426770	  0.095929	  0.764525
  0.429509	  0.113278	  0.761214
  0.431652	  0.133417	  0.755420
  0.432849	  0.152456	  0.747661
  0.435450	  0.171280	  0.742566
  0.437196	  0.190893	  0.737574
  0.437916	  0.209507	  0.729231
  0.437948	  0.227365	  0.723016
  0.437663	  0.247414	  0.719164
  0.437490	  0.267371	  0.712496
  0.435322	  0.284389	  0.702931
  0.431940	  0.303027	  0.695081
  0.429264	  0.320834	  0.689752
  0.428613	  0.342312	  0.682461
  0.429050	  0.362183	  0.675990
  0.429727	  0.382809	  0.676773
  0.432089	  0.402584	  0.680187
  0.438651	  0.423625	  0.680380
  0.445576	  0.440494	  0.673630
  0.453294	  0.457732	  0.664701
  0.461472	  0.476051	  0.658435
  0.466889	  0.495096	  0.659592
  0.473786	  0.514925	  0.660649
  0.481573	  0.532639	  0.654905
  0.489708	  0.548152	  0.643498
  0.500893	  0.564441	  0.631991
  0.512503	  0.581324	  0.628050
  0.520118	  0.597320	  0.631215
  0.528719	  0.616187	  0.627168
  0.536019	  0.634217	  0.622701
  0.545354	  0.651792	  0.619138
  0.555779	  0.668532	  0.616167
  0.565166	  0.686618	  0.612948
  0.571005	  0.703886	  0.606672
  0.573039	  0.723630	  0.596651
  0.578670	  0.740826	  0.588430
  0.584972	  0.757766	  0.582575
  0.588141	  0.776882	  0.576472
  0.593058	  0.795411	  0.568505
  0.599894	  0.811768	  0.562307
  0.600916	  0.830727	  0.555171
  0.600944	  0.849409	  0.544873
  0.610275	  0.865916	  0.537153
  0.613335	  0.883632	  0.530588
  0.611240	  0.902692	  0.521129
  0.618993	  0.919954	  0.512058
  0.624091	  0.935489	  0.502297
  0.624468	  0.950693	  0.488418
  0.634878	  0.967077	  0.475804
  0.643555	  0.983127	  0.469093
  0.646025	  1.000443	  0.460308
  0.648929	  1.016857	  0.447561
  0.652870	  1.031332	  0.433255
  0.653678	  1.044115	  0.418532
  0.651948	  1.057150	  0.403318
  0.654424	  1.069753	  0.386800
  0.663759	  1.084901	  0.373549
  0.668345	  1.098147	  0.360845
  0.670272	  1.109576	  0.345576
  0.672774	  1.119981	  0.327387
  0.673132	  1.128212	  0.309477
  0.674334	  1.137188	  0.291370
  0.676829	  1.146217	  0.273488
  0.681361	  1.153969	  0.255587
  0.686345	  1.160112	  0.237266
  0.691966	  1.166720	  0.219217
  0.698506	  1.173381	  0.201338
  0.707723	  1.180978	  0.185039
  0.717134	  1.188541	  0.169059
  0.728116	  1.195237	  0.153643
  0.739755	  1.201760	  0.138641
  0.751844	  1.210025	  0.124801
  0.763771	  1.219404	  0.111551
  0.776123	  1.230390	  0.100060
  0.788266	  1.241241	  0.088389
  0.799725	  1.257516	  0.084646
  0.810211	  1.275097	  0.086429
  0.820361	  1.292297	  0.088468
  0.830850	  1.309845	  0.090633
  0.840345	  1.326445	  0.091226
  0.846730	  1.345658	  0.091448
  0.853820	  1.361896	  0.091071
  0.859204	  1.381195	  0.091521
  0.863321	  1.400706	  0.089068
  0.868125	  1.419929	  0.089468
  0.870423	  1.439721	  0.086154
  0.873344	  1.458065	  0.085277
  0.874860	  1.476986	  0.083435
  0.874507	  1.497455	  0.078964
  0.874477	  1.516267	  0.076036
  0.873329	  1.535822	  0.070612
  0.870403	  1.553904	  0.064779
  0.866948	  1.573115	  0.057072
  0.863106	  1.590945	  0.050179
  0.858621	  1.608817	  0.047961
  0.852713	  1.627295	  0.047910
  0.848113	  1.646919	  0.050514
  0.843929	  1.666443	  0.052469
  0.840789	  1.686034	  0.056365
  0.838166	  1.705547	  0.059883
  0.836420	  1.725584	  0.062817
  0.836025	  1.745845	  0.063197
  0.834435	  1.765624	  0.062503
  0.832008	  1.784835	  0.061859
  0.828001	  1.805580	  0.062306
  0.825613	  1.826105	  0.062522
  0.825288	  1.846829	  0.058334
  0.823434	  1.863903	  0.048978
  0.821599	  1.884207	  0.042874
  0.821987	  1.904538	  0.035852
  0.827165	  1.922682	  0.040588
  0.829804	  1.944072	  0.040113
  0.832580	  1.963304	  0.031441
  0.832392	  1.981615	  0.021887
  0.831224	  2.000599	  0.018708
  0.832387	  2.020814	  0.014252
  0.829657	  2.038939	  0.008061
  0.829881	  2.057827	 -0.000292
  0.837173	  2.076972	 -0.009490
  0.845864	  2.094348	 -0.013987
  0.852494	  2.113135	 -0.018810
  0.853140	  2.131852	 -0.026286
  0.849652	  2.150540	 -0.033726
  0.847514	  2.170494	 -0.037522
  0.852117	  2.191425	 -0.045395
  0.853538	  2.206911	 -0.052818
  0.855361	  2.225829	 -0.061476
  0.860182	  2.243818	 -0.070017
  0.865920	  2.262382	 -0.076720
  0.866747	  2.279684	 -0.086124
  0.869516	  2.298419	 -0.092570
  0.874152	  2.317352	 -0.095631
  0.879504	  2.337986	 -0.101473
  0.882316	  2.356985	 -0.107233
