 -1.568134	 -0.737392	 -2.008138
 -1.575113	 -0.747370	 -2.004965
 -1.564021	 -0.731510	 -2.010009
 -1.552789	 -0.715773	 -2.015127
 -1.541211	 -0.700353	 -2.020433
 -1.529592	 -0.684975	 -2.025770
 -1.517672	 -0.669915	 -2.031351
 -1.505750	 -0.654860	 -2.036937
 -1.493601	 -0.640135	 -2.042896
 -1.481595	 -0.625468	 -2.049191
 -1.469483	 -0.611128	 -2.056179
 -1.457325	 -0.596829	 -2.063196
 -1.444909	 -0.582762	 -2.069196
 -1.436233	 -0.568326	 -2.076527
 -1.427195	 -0.552076	 -2.087323
 -1.411062	 -0.540396	 -2.093264
 -1.382493	 -0.524667	 -2.097375
 -1.375615	 -0.520551	 -2.098881
 -1.361785	 -0.508470	 -2.102688
 -1.341939	 -0.490641	 -2.108025
 -1.325770	 -0.478388	 -2.115294
 -1.316415	 -0.472981	 -2.119333
 -1.300747	 -0.458412	 -2.125098
 -1.280262	 -0.441412	 -2.130411
 -1.271191	 -0.433939	 -2.133679
 -1.257588	 -0.422427	 -2.140270
 -1.237191	 -0.404819	 -2.145388
 -1.221258	 -0.394129	 -2.152181
 -1.210869	 -0.387934	 -2.157092
 -1.195250	 -0.372762	 -2.162876
 -1.175942	 -0.358743	 -2.169811
 -1.164779	 -0.351412	 -2.175253
 -1.151872	 -0.338346	 -2.185032
 -1.137158	 -0.320736	 -2.193096
 -1.123970	 -0.308765	 -2.199173
 -1.112345	 -0.299755	 -2.206715
 -1.096885	 -0.285427	 -2.213038
 -1.080165	 -0.273775	 -2.218798
 -1.064993	 -0.266264	 -2.224628
 -1.049413	 -0.253569	 -2.230429
 -1.034018	 -0.241736	 -2.235826
 -1.019524	 -0.229625	 -2.241729
 -1.006480	 -0.215466	 -2.248055
 -0.994681	 -0.200647	 -2.254528
 -0.982895	 -0.185850	 -2.261018
 -0.971436	 -0.170749	 -2.267394
 -0.960662	 -0.155176	 -2.273804
 -0.949776	 -0.139603	 -2.280191
 -0.938064	 -0.124585	 -2.286014
 -0.926175	 -0.110022	 -2.292071
 -0.912716	 -0.100299	 -2.299871
 -0.893141	 -0.099860	 -2.313367
 -0.876738	 -0.095935	 -2.323620
 -0.861833	 -0.086558	 -2.330862
 -0.843431	 -0.078504	 -2.339166
 -0.822488	 -0.060023	 -2.348345
 -0.815584	 -0.051618	 -2.351127
 -0.803775	 -0.041536	 -2.353023
 -0.784407	 -0.022738	 -2.361229
 -0.778146	 -0.003468	 -2.365411
 -0.765683	  0.012125	 -2.372372
 -0.749721	  0.022679	 -2.380349
 -0.734092	  0.032466	 -2.388141
 -0.718525	  0.042291	 -2.395958
 -0.703164	  0.052194	 -2.404039
 -0.688313	  0.062495	 -2.412649
 -0.673467	  0.072828	 -2.421231
 -0.658369	  0.083209	 -2.429256
 -0.643371	  0.093697	 -2.437261
 -0.628541	  0.104437	 -2.445391
 -0.614000	  0.115710	 -2.453298
 -0.599243	  0.127030	 -2.460510
 -0.584555	  0.138214	 -2.468214
 -0.570389	  0.149866	 -2.476210
 -0.556101	  0.161506	 -2.483993
 -0.541924	  0.173286	 -2.491698
 -0.528299	  0.185543	 -2.499733
 -0.514768	  0.197790	 -2.507919
 -0.501535	  0.210328	 -2.516145
 -0.488704	  0.223264	 -2.524393
 -0.475893	  0.236193	 -2.532671
 -0.463562	  0.249419	 -2.541212
 -0.451607	  0.262898	 -2.549927
 -0.439548	  0.276400	 -2.558454
 -0.427625	  0.290370	 -2.566397
 -0.415830	  0.304648	 -2.573907
 -0.404054	  0.318911	 -2.581535
 -0.392618	  0.333429	 -2.589196
 -0.381393	  0.348082	 -2.596899
 -0.370179	  0.362733	 -2.604619
 -0.358964	  0.377323	 -2.612453
 -0.347749	  0.391914	 -2.620287
 -0.336528	  0.406506	 -2.628121
 -0.325215	  0.421030	 -2.635935
