 -0.570319	  2.349340	 -0.329747
 -0.571974	  2.354069	 -0.336178
 -0.549146	  2.343483	 -0.328077
 -0.543434	  2.328289	 -0.309478
 -0.546222	  2.318512	 -0.294896
 -0.547883	  2.302793	 -0.272440
 -0.544172	  2.289294	 -0.255417
 -0.541248	  2.281072	 -0.245627
 -0.535670	  2.270790	 -0.234400
 -0.534965	  2.255534	 -0.216628
 -0.537318	  2.244176	 -0.202178
 -0.533859	  2.227363	 -0.187145
 -0.529011	  2.208722	 -0.173357
 -0.524643	  2.197160	 -0.164929
 -0.520714	  2.179146	 -0.151701
 -0.522932	  2.160416	 -0.141140
 -0.524293	  2.144244	 -0.134681
 -0.517602	  2.120818	 -0.121216
 -0.510153	  2.111187	 -0.113555
 -0.498174	  2.098728	 -0.103274
 -0.489520	  2.078630	 -0.087988
 -0.488683	  2.066468	 -0.079479
 -0.491406	  2.046073	 -0.067620
 -0.494455	  2.024507	 -0.057668
 -0.496006	  2.008846	 -0.050841
 -0.492602	  1.990901	 -0.044096
 -0.485633	  1.969655	 -0.039595
 -0.475247	  1.948870	 -0.034753
 -0.467774	  1.935272	 -0.029072
 -0.457054	  1.919288	 -0.018142
 -0.447432	  1.900141	 -0.007719
 -0.443356	  1.883810	 -0.001551
 -0.440728	  1.866620	  0.002476
 -0.435772	  1.850937	  0.011014
 -0.426446	  1.833899	  0.025406
 -0.419757	  1.818004	  0.038115
 -0.416186	  1.805422	  0.045954
 -0.412698	  1.785250	  0.055043
 -0.413889	  1.764500	  0.060481
 -0.415188	  1.740567	  0.069920
 -0.417567	  1.726141	  0.076163
 -0.424333	  1.708182	  0.080437
 -0.440228	  1.676309	  0.085645
 -0.445869	  1.658723	  0.084726
 -0.448049	  1.633903	  0.088469
 -0.446989	  1.616186	  0.098704
 -0.447357	  1.601158	  0.106811
 -0.440931	  1.584778	  0.119147
 -0.439458	  1.567614	  0.130468
 -0.439756	  1.555658	  0.136157
 -0.440202	  1.537290	  0.148343
 -0.442284	  1.517846	  0.154950
 -0.441977	  1.502841	  0.169171
 -0.435757	  1.488477	  0.162954
 -0.427406	  1.475130	  0.179750
 -0.422271	  1.462144	  0.178759
 -0.412978	  1.431058	  0.187125
 -0.406740	  1.421347	  0.188985
 -0.407931	  1.397827	  0.197544
 -0.391255	  1.387234	  0.202478
 -0.388845	  1.368959	  0.201875
 -0.381635	  1.347732	  0.210430
 -0.373500	  1.325924	  0.207213
 -0.368590	  1.316525	  0.217077
 -0.347608	  1.299095	  0.221776
 -0.326129	  1.286742	  0.232031
 -0.318363	  1.279498	  0.237308
 -0.298744	  1.270589	  0.242095
 -0.277171	  1.262200	  0.255898
 -0.269901	  1.256346	  0.262592
 -0.251989	  1.250522	  0.272716
 -0.232084	  1.238879	  0.284046
 -0.217709	  1.231238	  0.291180
 -0.195695	  1.222463	  0.300391
 -0.178726	  1.221190	  0.307164
 -0.164045	  1.218299	  0.312938
 -0.151647	  1.216488	  0.323373
 -0.134522	  1.209992	  0.339956
 -0.117410	  1.208289	  0.356904
 -0.102362	  1.206827	  0.368585
 -0.084413	  1.202300	  0.379256
 -0.068495	  1.196705	  0.391180
 -0.055152	  1.192991	  0.404347
 -0.043707	  1.192523	  0.418062
 -0.028326	  1.194244	  0.435341
 -0.016198	  1.193426	  0.448926
 -0.006009	  1.189096	  0.461610
  0.009933	  1.181067	  0.477073
  0.024185	  1.174680	  0.492712
  0.035374	  1.172433	  0.506184
  0.049754	  1.171196	  0.519246
  0.066336	  1.167154	  0.535890
  0.076997	  1.164486	  0.550766
  0.086759	  1.161718	  0.564075
  0.099785	  1.157529	  0.580093
  0.113582	  1.151112	  0.601126
  0.121455	  1.149633	  0.611325
  0.133010	  1.146963	  0.625454
  0.143496	  1.143182	  0.645723
  0.147500	  1.141422	  0.665013
  0.151259	  1.137732	  0.682351
  0.160480	  1.129956	  0.708963
  0.170985	  1.124223	  0.724738
  0.186601	  1.117882	  0.731648
  0.200136	  1.107557	  0.743163
  0.209515	  1.097714	  0.752879
  0.230878	  1.079753	  0.777870
  0.240479	  1.075756	  0.783009
  0.253109	  1.067985	  0.794089
  0.263998	  1.057820	  0.810528
  0.266759	  1.053941	  0.830500
  0.268169	  1.054394	  0.846221
  0.267980	  1.052269	  0.863991
  0.259288	  1.036655	  0.886516
  0.258499	  1.020776	  0.908184
  0.268360	  1.009478	  0.925675
  0.277335	  1.001216	  0.935754
  0.289654	  0.993892	  0.951294
  0.297179	  0.986064	  0.970581
  0.303732	  0.980836	  0.988170
  0.308190	  0.975801	  1.006147
  0.310937	  0.970141	  1.024464
  0.314920	  0.963792	  1.043029
  0.318892	  0.954144	  1.061175
  0.318696	  0.944417	  1.080177
  0.314806	  0.937683	  1.099040
  0.310936	  0.935029	  1.117425
  0.307664	  0.928865	  1.136648
  0.306113	  0.921759	  1.155333
  0.303331	  0.915669	  1.174248
  0.300845	  0.910900	  1.193592
  0.296133	  0.905083	  1.212313
  0.291694	  0.899029	  1.230935
  0.287785	  0.892542	  1.248881
  0.283669	  0.887529	  1.267525
  0.279824	  0.884317	  1.287294
  0.276232	  0.880059	  1.306763
  0.272605	  0.875730	  1.326528
  0.268211	  0.870140	  1.345354
  0.263939	  0.864011	  1.364437
  0.259924	  0.856824	  1.382643
  0.256598	  0.848944	  1.400175
  0.256811	  0.837698	  1.417032
  0.255949	  0.825162	  1.434309
  0.250062	  0.811753	  1.451175
  0.242944	  0.800910	  1.465722
  0.237484	  0.792967	  1.484997
  0.234601	  0.788748	  1.505223
  0.231471	  0.786024	  1.524203
  0.227963	  0.782604	  1.543181
  0.224641	  0.778100	  1.563153
  0.220194	  0.774193	  1.582581
  0.216611	  0.768964	  1.602044
  0.212578	  0.761342	  1.620756
  0.210939	  0.756630	  1.639908
  0.213101	  0.752048	  1.662951
  0.213313	  0.747163	  1.676097
  0.214489	  0.739350	  1.696274
  0.214339	  0.733823	  1.721552
  0.213395	  0.731909	  1.733825
  0.214864	  0.727710	  1.757465
  0.213984	  0.724159	  1.778324
  0.211688	  0.722606	  1.794375
  0.207543	  0.722357	  1.818540
  0.212658	  0.717991	  1.838101
  0.224782	  0.706701	  1.855444
  0.234631	  0.692784	  1.874839
  0.237870	  0.685307	  1.894112
  0.238074	  0.682837	  1.905908
  0.238107	  0.684682	  1.928266
  0.242147	  0.681968	  1.950269
  0.247557	  0.676131	  1.969503
  0.253867	  0.670446	  1.987608
  0.259293	  0.663977	  2.005998
  0.264955	  0.658332	  2.024557
  0.270220	  0.651734	  2.042963
  0.276419	  0.645540	  2.060841
  0.283825	  0.639524	  2.078422
  0.291310	  0.633241	  2.096102
  0.299581	  0.627929	  2.113632
  0.307413	  0.621295	  2.131041
  0.315363	  0.614428	  2.148167
  0.323680	  0.607941	  2.164937
  0.332848	  0.601558	  2.181770
  0.341799	  0.594449	  2.198251
  0.352514	  0.588528	  2.214132
  0.362739	  0.581606	  2.229871
  0.373589	  0.575040	  2.245209
  0.384103	  0.567390	  2.260072
  0.394460	  0.559037	  2.275021
  0.405643	  0.551580	  2.289495
  0.415204	  0.541926	  2.303479
  0.425863	  0.532611	  2.317357
  0.436306	  0.522726	  2.331132
  0.445584	  0.511832	  2.344427
  0.454415	  0.500051	  2.356698
  0.464544	  0.487968	  2.368722
  0.472713	  0.474024	  2.380571
  0.482617	  0.461464	  2.392680
  0.491518	  0.447761	  2.404542
  0.506835	  0.440751	  2.416492
  0.515143	  0.426028	  2.427179
