 0.0 0.0 0.0 0
 0.6283101849000683 -0.7773690922697322 -0.009980277279448585 1000
 -0.48936542767154745 -0.6708820958328997 -0.5579280345086626 1000
 -0.09068153645754747 0.36974204467092175 0.92440612251773 1000
 0.095764916345101 -0.8252604739583479 0.5569041487719937 1000
 0.4960414454459716 0.8164265460572676 0.29429335584221317 1000
 0.36549736306343633 0.07132492449739822 -0.928037947898207 1000
 -0.9189748800536468 -0.23554786567747674 0.3146559594305672 1000
 0.04326861742856727 -0.2970653863696671 0.9538375034390612 1000
 0.0 0.0 0.0 0
 -0.7963634349064116 0.5463099034326508 -0.2582784717228075 1000
 -0.7423118955309275 -0.11539673454171312 -0.6599285138637297 1000
 -0.299474189631164 0.3763571668588942 -0.8768406313000694 1000
 0.621115435783313 0.5073576629678961 -0.5974795538421881 1000
