  2.554893	 -0.755418	  1.443179
  2.529597	 -0.747939	  1.428891
  2.495333	 -0.716277	  1.424538
  2.451743	 -0.687924	  1.413147
  2.413751	 -0.664416	  1.401817
  2.370247	 -0.637354	  1.388654
  2.328531	 -0.612294	  1.375409
  2.287092	 -0.588211	  1.363702
  2.244585	 -0.563960	  1.351761
  2.201334	 -0.539808	  1.340523
  2.162670	 -0.517529	  1.329547
  2.122136	 -0.495140	  1.315639
  2.077843	 -0.471708	  1.297805
  2.035749	 -0.447872	  1.282149
  1.993295	 -0.422059	  1.269516
  1.954665	 -0.397233	  1.257471
  1.914633	 -0.370011	  1.243695
  1.873699	 -0.344040	  1.229284
  1.829559	 -0.316629	  1.214070
  1.790560	 -0.291890	  1.201322
  1.750114	 -0.266165	  1.187428
  1.707809	 -0.240046	  1.174703
  1.667019	 -0.214473	  1.163124
  1.625150	 -0.189031	  1.152146
  1.585520	 -0.164022	  1.140525
  1.542263	 -0.137944	  1.129967
  1.499441	 -0.111544	  1.119283
  1.459785	 -0.087938	  1.109372
  1.415226	 -0.061902	  1.098791
  1.375502	 -0.039461	  1.088751
  1.333236	 -0.016527	  1.078588
  1.289485	  0.008832	  1.067594
  1.249724	  0.033258	  1.057024
  1.210738	  0.058894	  1.045119
  1.167884	  0.087883	  1.032266
  1.127776	  0.115447	  1.021847
  1.083989	  0.141008	  1.009678
  1.044364	  0.162040	  0.996669
  1.001627	  0.186960	  0.982448
  0.957280	  0.214032	  0.971550
  0.916208	  0.239247	  0.956440
  0.875758	  0.261154	  0.943731
  0.833867	  0.286151	  0.932387
  0.792026	  0.313713	  0.919758
  0.755147	  0.337812	  0.909256
  0.713689	  0.362825	  0.897872
  0.671189	  0.386977	  0.884952
  0.626174	  0.413092	  0.869066
  0.585256	  0.436318	  0.853576
  0.545506	  0.460376	  0.839024
  0.501882	  0.485401	  0.823595
  0.463877	  0.510505	  0.811857
  0.422993	  0.535422	  0.798619
  0.381169	  0.562694	  0.785771
  0.340869	  0.587499	  0.774414
  0.297865	  0.612976	  0.762981
  0.256441	  0.637058	  0.753637
  0.215166	  0.660819	  0.744554
  0.174279	  0.684931	  0.735626
  0.132893	  0.711340	  0.725621
  0.089984	  0.739565	  0.714495
  0.050452	  0.765021	  0.702519
  0.007393	  0.790936	  0.690328
 -0.034830	  0.816855	  0.675473
 -0.078669	  0.843346	  0.662757
 -0.118410	  0.868457	  0.647565
 -0.156766	  0.890342	  0.634708
 -0.196945	  0.914723	  0.620253
 -0.237178	  0.939089	  0.608021
 -0.279336	  0.966383	  0.595471
 -0.323388	  0.995257	  0.583132
 -0.363423	  1.021299	  0.572129
 -0.405271	  1.048046	  0.562654
 -0.446355	  1.073570	  0.553534
 -0.488737	  1.098904	  0.542930
 -0.530653	  1.121989	  0.531400
 -0.575544	  1.146254	  0.518259
 -0.616257	  1.169572	  0.505824
 -0.656908	  1.195238	  0.492003
 -0.697303	  1.221527	  0.479021
 -0.737028	  1.248673	  0.465340
 -0.777224	  1.274091	  0.451083
 -0.818113	  1.301040	  0.438109
 -0.858869	  1.325524	  0.430865
 -0.897257	  1.348028	  0.434638
 -0.929747	  1.363886	  0.447050
 -1.000863	  1.391855	  0.501714
 -1.100800	  1.453046	  0.670334
 -1.148387	  1.479771	  0.717344
 -1.218930	  1.500926	  0.715211
 -1.259010	  1.515460	  0.710720
 -1.314542	  1.577312	  0.708017
 -1.328154	  1.597106	  0.700342
 -1.348597	  1.604057	  0.679173
 -1.381956	  1.616136	  0.593699
 -1.386345	  1.643640	  0.463665
 -1.407048	  1.663602	  0.293540
 -1.439705	  1.678110	  0.257775
 -1.482138	  1.702911	  0.241952
 -1.520501	  1.725120	  0.231234
 -1.563131	  1.748810	  0.219129
 -1.604929	  1.772369	  0.208055
 -1.651421	  1.796400	  0.195113
 -1.694132	  1.816803	  0.182395
 -1.737381	  1.839882	  0.168373
 -1.778390	  1.866755	  0.152356
 -1.817271	  1.892061	  0.140635
 -1.857559	  1.914993	  0.128180
 -1.897780	  1.938018	  0.113451
 -1.939189	  1.965761	  0.098178
 -1.980051	  1.990376	  0.086392
 -2.024078	  2.019673	  0.074350
 -2.063931	  2.041612	  0.061327
 -2.106643	  2.064628	  0.052632
 -2.151410	  2.090532	  0.033323
 -2.172924	  2.111437	  0.033657
