  0.327834	 -2.347047	  0.631431
  0.327328	 -2.349073	  0.632109
  0.331935	 -2.330617	  0.625933
  0.336547	 -2.312163	  0.619753
  0.341400	 -2.293766	  0.613603
  0.346550	 -2.275487	  0.607472
  0.354182	 -2.258216	  0.600809
  0.362615	 -2.241021	  0.593160
  0.366987	 -2.222805	  0.586037
  0.368739	 -2.203900	  0.580776
  0.375571	 -2.186134	  0.575718
  0.388872	 -2.170207	  0.571007
  0.401556	 -2.152734	  0.563961
  0.409947	 -2.135181	  0.557902
  0.416733	 -2.118978	  0.554887
  0.422290	 -2.098828	  0.553430
  0.427618	 -2.082815	  0.553090
  0.439999	 -2.067225	  0.550361
  0.451853	 -2.042715	  0.553174
  0.453335	 -2.019996	  0.553875
  0.457924	 -2.004216	  0.554943
  0.461542	 -1.985994	  0.555796
  0.465367	 -1.963929	  0.552295
  0.471218	 -1.946056	  0.547083
  0.478385	 -1.929859	  0.543585
  0.487684	 -1.909154	  0.538131
  0.490432	 -1.890341	  0.532859
  0.492663	 -1.872691	  0.528974
  0.499592	 -1.853074	  0.528342
  0.504712	 -1.829322	  0.524616
  0.502112	 -1.808374	  0.520571
  0.495187	 -1.791878	  0.521002
  0.490365	 -1.767462	  0.518869
  0.492582	 -1.747155	  0.510892
  0.501640	 -1.727431	  0.500036
  0.513078	 -1.711884	  0.489964
  0.518841	 -1.701226	  0.478545
  0.517745	 -1.681501	  0.467322
  0.512349	 -1.664918	  0.458270
  0.511953	 -1.646189	  0.447609
  0.514032	 -1.628287	  0.438307
  0.516269	 -1.610609	  0.429228
  0.523022	 -1.592907	  0.422881
  0.530517	 -1.575313	  0.417031
  0.538019	 -1.557723	  0.411169
  0.545787	 -1.540148	  0.405614
  0.554670	 -1.522782	  0.401217
  0.563281	 -1.505438	  0.396409
  0.571086	 -1.487885	  0.390996
  0.579504	 -1.471279	  0.384613
  0.584697	 -1.453855	  0.375155
  0.585881	 -1.433966	  0.368082
  0.586190	 -1.404466	  0.374861
  0.587932	 -1.389508	  0.375481
  0.592211	 -1.377518	  0.375067
  0.598398	 -1.358735	  0.370999
  0.600576	 -1.337751	  0.367005
  0.598774	 -1.322018	  0.367942
  0.589019	 -1.306250	  0.373408
  0.585115	 -1.288257	  0.373811
  0.580143	 -1.273568	  0.377470
  0.579023	 -1.270503	  0.378409
  0.564350	 -1.253038	  0.383761
  0.550618	 -1.237215	  0.394944
  0.545640	 -1.225129	  0.403403
  0.536320	 -1.209551	  0.414574
  0.522544	 -1.195235	  0.428668
  0.518523	 -1.178031	  0.441314
  0.517712	 -1.160572	  0.451225
  0.507559	 -1.145734	  0.460712
  0.488755	 -1.139727	  0.468078
  0.472964	 -1.127802	  0.476531
  0.460618	 -1.114869	  0.486493
  0.449292	 -1.101913	  0.496776
  0.438043	 -1.088932	  0.507024
  0.428856	 -1.074274	  0.517015
  0.425970	 -1.056238	  0.525097
  0.423310	 -1.038140	  0.533182
  0.420609	 -1.020023	  0.541209
  0.417955	 -1.001927	  0.549302
  0.415312	 -0.983836	  0.557409
  0.412610	 -0.965717	  0.565441
  0.410045	 -0.947626	  0.573577
  0.409326	 -0.929017	  0.580860
  0.413194	 -0.910016	  0.585762
  0.417206	 -0.891033	  0.590592
  0.421266	 -0.872058	  0.595462
  0.425417	 -0.853179	  0.600529
  0.428525	 -0.834238	  0.605049
  0.428287	 -0.813728	  0.605038
  0.430314	 -0.792067	  0.600976
  0.439006	 -0.770893	  0.598065
  0.452071	 -0.753437	  0.598684
  0.459521	 -0.739153	  0.601393
  0.459381	 -0.722391	  0.606352
  0.461512	 -0.706956	  0.597512
  0.474801	 -0.691212	  0.591870
  0.491191	 -0.680128	  0.592116
  0.505542	 -0.664622	  0.591949
  0.516858	 -0.648442	  0.584357
  0.526989	 -0.634267	  0.574407
  0.536640	 -0.621051	  0.565195
  0.540994	 -0.607521	  0.556735
  0.549334	 -0.585830	  0.549014
  0.571551	 -0.565044	  0.529890
  0.578966	 -0.560760	  0.520783
  0.587873	 -0.556779	  0.510667
  0.601150	 -0.545606	  0.492559
  0.612308	 -0.540221	  0.474780
  0.621378	 -0.537794	  0.458782
  0.632480	 -0.530179	  0.441285
  0.643393	 -0.526162	  0.422757
  0.651617	 -0.525180	  0.407328
  0.662928	 -0.519733	  0.391008
  0.679506	 -0.520190	  0.366663
  0.686956	 -0.525871	  0.352422
  0.691353	 -0.532314	  0.339533
  0.697824	 -0.537405	  0.317689
  0.707365	 -0.543416	  0.298627
  0.716693	 -0.547561	  0.280507
  0.726554	 -0.544019	  0.263293
  0.737028	 -0.540810	  0.246298
  0.749426	 -0.538637	  0.230449
  0.763188	 -0.534574	  0.216459
  0.776963	 -0.530242	  0.202628
  0.790818	 -0.526309	  0.188760
  0.801843	 -0.514861	  0.175908
  0.812539	 -0.501302	  0.158350
  0.816467	 -0.478449	  0.152185
  0.818286	 -0.457009	  0.155022
  0.823217	 -0.437740	  0.150686
  0.828493	 -0.419383	  0.140095
  0.832246	 -0.404468	  0.130549
  0.837018	 -0.380877	  0.125651
  0.842477	 -0.359341	  0.129015
  0.848550	 -0.340867	  0.132592
  0.848800	 -0.321257	  0.133153
  0.846555	 -0.305345	  0.130076
  0.846094	 -0.283387	  0.122251
  0.851006	 -0.260346	  0.119217
  0.860333	 -0.238195	  0.122798
  0.869668	 -0.220123	  0.125802
  0.875970	 -0.198318	  0.126635
  0.876968	 -0.185294	  0.125161
  0.881601	 -0.168284	  0.120757
  0.891372	 -0.148380	  0.118235
  0.902930	 -0.127867	  0.116629
  0.907141	 -0.109092	  0.113159
  0.906068	 -0.090358	  0.107165
  0.910540	 -0.070749	  0.102483
  0.917155	 -0.052073	  0.099653
  0.924783	 -0.034757	  0.096371
  0.936920	 -0.015261	  0.095703
  0.944760	  0.005017	  0.095517
  0.946190	  0.024505	  0.091131
  0.946275	  0.042623	  0.081855
  0.948483	  0.058683	  0.070613
  0.952182	  0.078346	  0.063245
  0.953762	  0.097578	  0.057589
  0.955496	  0.116820	  0.052314
  0.958527	  0.136105	  0.047808
  0.962695	  0.155304	  0.043949
  0.967017	  0.174486	  0.040271
  0.971557	  0.193673	  0.036837
  0.978820	  0.212312	  0.035758
  0.986430	  0.230801	  0.035054
  0.994150	  0.249255	  0.034508
  1.002329	  0.267531	  0.034575
  1.010722	  0.285685	  0.034956
  1.018992	  0.303875	  0.035069
  1.027045	  0.322150	  0.034597
  1.034950	  0.340462	  0.033880
  1.042395	  0.358746	  0.031033
  1.049693	  0.377061	  0.027746
  1.056903	  0.395210	  0.023947
  1.064816	  0.411349	  0.015457
  1.072538	  0.427489	  0.006529
  1.080204	  0.443565	 -0.002502
  1.087673	  0.458703	 -0.013149
  1.095062	  0.473890	 -0.023891
  1.101721	  0.490617	 -0.032656
  1.107786	  0.508226	 -0.039995
  1.113722	  0.526140	 -0.046653
  1.119661	  0.544230	 -0.052822
  1.125249	  0.562695	 -0.058113
  1.131242	  0.580913	 -0.062343
  1.141554	  0.596021	 -0.068528
  1.154329	  0.608206	 -0.078545
  1.168095	  0.623265	 -0.086522
  1.168902	  0.648138	 -0.080654
  1.169700	  0.678561	 -0.069497
  1.175487	  0.691790	 -0.066058
  1.183072	  0.707563	 -0.076475
  1.185485	  0.726578	 -0.089221
  1.188739	  0.748257	 -0.096932
  1.194238	  0.761506	 -0.097367
  1.203270	  0.777406	 -0.099226
  1.211739	  0.797461	 -0.102922
  1.225282	  0.819416	 -0.109520
  1.237153	  0.841643	 -0.117356
  1.245767	  0.857978	 -0.123823
  1.250510	  0.869697	 -0.135548
  1.252587	  0.884560	 -0.152075
  1.253017	  0.895997	 -0.166336
  1.253022	  0.912866	 -0.180382
  1.251816	  0.933947	 -0.194475
  1.256004	  0.949051	 -0.206173
  1.259045	  0.963848	 -0.212313
  1.266721	  0.993000	 -0.222147
  1.269050	  1.005401	 -0.228945
  1.269094	  1.015768	 -0.233421
  1.273477	  1.036445	 -0.244909
  1.275800	  1.056540	 -0.251222
  1.278560	  1.080248	 -0.262516
  1.279216	  1.097352	 -0.268845
  1.278631	  1.112917	 -0.276616
  1.275634	  1.128097	 -0.286258
  1.271787	  1.150544	 -0.298049
  1.271806	  1.165552	 -0.301586
  1.273891	  1.184616	 -0.307645
  1.277385	  1.207867	 -0.317216
  1.283963	  1.226981	 -0.327203
  1.292151	  1.244003	 -0.338791
  1.299923	  1.255639	 -0.347164
  1.309322	  1.271814	 -0.356255
  1.320334	  1.297759	 -0.360729
  1.331865	  1.318204	 -0.356877
  1.338405	  1.336050	 -0.349508
  1.342711	  1.355464	 -0.344117
  1.347592	  1.381725	 -0.340676
  1.349132	  1.397921	 -0.342791
  1.347994	  1.411944	 -0.344206
  1.350936	  1.436691	 -0.344639
  1.357884	  1.459165	 -0.342607
  1.364319	  1.476575	 -0.343112
  1.375235	  1.496410	 -0.348384
  1.383960	  1.512358	 -0.350324
  1.394145	  1.530133	 -0.349696
  1.403068	  1.552057	 -0.349026
  1.409112	  1.572604	 -0.350136
  1.411879	  1.586014	 -0.351141
  1.417263	  1.605817	 -0.353078
  1.419224	  1.628236	 -0.354992
  1.418056	  1.646233	 -0.355887
  1.417410	  1.664394	 -0.355456
  1.418961	  1.692431	 -0.352790
  1.422194	  1.713074	 -0.353487
  1.427849	  1.731379	 -0.356438
  1.441400	  1.749784	 -0.359349
  1.451337	  1.760338	 -0.358245
  1.459241	  1.779813	 -0.357688
  1.462757	  1.800840	 -0.361536
  1.468419	  1.820081	 -0.366793
  1.474130	  1.838595	 -0.371928
  1.479823	  1.857075	 -0.377065
  1.485573	  1.875894	 -0.382356
  1.492853	  1.900160	 -0.389646
  1.506662	  1.940289	 -0.401103
  1.512651	  1.958486	 -0.406846
