 -0.252750	  2.259875	  1.057331
 -0.253427	  2.273303	  1.073949
 -0.252791	  2.260724	  1.058413
 -0.252107	  2.247826	  1.043145
 -0.251361	  2.234508	  1.028243
 -0.250627	  2.221150	  1.013377
 -0.250221	  2.207137	  0.999133
 -0.249782	  2.192990	  0.984972
 -0.249704	  2.179092	  0.970564
 -0.249552	  2.165052	  0.956307
 -0.249501	  2.150658	  0.942452
 -0.249195	  2.136483	  0.928393
 -0.248643	  2.122650	  0.913944
 -0.248171	  2.108624	  0.899716
 -0.247180	  2.094955	  0.885287
 -0.246063	  2.081305	  0.870699
 -0.244405	  2.068210	  0.855675
 -0.242731	  2.055080	  0.840830
 -0.240484	  2.044630	  0.825470
 -0.237101	  2.040977	  0.804777
 -0.233468	  2.035994	  0.784396
 -0.229549	  2.019878	  0.770801
 -0.224873	  2.006617	  0.756767
 -0.220738	  2.000562	  0.736996
 -0.219713	  1.995472	  0.720147
 -0.220109	  1.987074	  0.701966
 -0.215774	  1.983865	  0.674823
 -0.211671	  1.984765	  0.659150
 -0.206913	  1.984661	  0.640295
 -0.202947	  1.976593	  0.620468
 -0.200770	  1.969727	  0.605987
 -0.197418	  1.958312	  0.589958
 -0.198330	  1.948653	  0.572314
 -0.204163	  1.937241	  0.559110
 -0.213205	  1.920048	  0.547691
 -0.221247	  1.904801	  0.534179
 -0.226549	  1.896958	  0.522660
 -0.234770	  1.887661	  0.503225
 -0.243992	  1.875396	  0.488456
 -0.252243	  1.860878	  0.473563
 -0.258399	  1.850644	  0.458078
 -0.267231	  1.842153	  0.441997
 -0.276239	  1.832215	  0.426795
 -0.283836	  1.822550	  0.414558
 -0.294835	  1.808719	  0.402440
 -0.303936	  1.800003	  0.391934
 -0.314941	  1.787800	  0.374351
 -0.317377	  1.772026	  0.366116
 -0.323428	  1.758086	  0.356319
 -0.324591	  1.750424	  0.354803
 -0.329564	  1.733210	  0.350893
 -0.334428	  1.716992	  0.342743
 -0.331705	  1.699862	  0.334068
 -0.324644	  1.674684	  0.327191
 -0.325057	  1.662095	  0.324309
 -0.327902	  1.643093	  0.317369
 -0.328617	  1.619982	  0.306258
 -0.323182	  1.598999	  0.294591
 -0.321472	  1.584616	  0.287899
 -0.322255	  1.566935	  0.279157
 -0.319603	  1.545738	  0.272511
 -0.319578	  1.528339	  0.273862
 -0.314111	  1.511419	  0.275867
 -0.308363	  1.487750	  0.267106
 -0.293020	  1.468682	  0.259992
 -0.290294	  1.456971	  0.247371
 -0.281123	  1.434707	  0.243077
 -0.262414	  1.426908	  0.230672
 -0.273074	  1.407507	  0.229074
 -0.267285	  1.398149	  0.217351
 -0.263609	  1.387031	  0.213561
 -0.260327	  1.379181	  0.197287
 -0.259645	  1.367580	  0.180336
 -0.245884	  1.359641	  0.165929
 -0.228088	  1.343325	  0.159568
 -0.212421	  1.339197	  0.163073
 -0.190490	  1.336627	  0.167497
 -0.157994	  1.338045	  0.169751
 -0.134809	  1.341355	  0.166461
 -0.124479	  1.342279	  0.164463
 -0.105572	  1.334528	  0.155902
 -0.087763	  1.328222	  0.145759
 -0.070286	  1.322916	  0.133936
 -0.052755	  1.317859	  0.122344
 -0.036494	  1.314272	  0.112295
 -0.020506	  1.312228	  0.102398
 -0.000440	  1.308379	  0.094432
  0.022366	  1.302967	  0.083495
  0.034537	  1.299927	  0.076852
  0.048297	  1.292298	  0.063605
  0.063671	  1.289014	  0.049742
  0.073074	  1.278330	  0.029359
  0.083234	  1.268389	  0.015057
  0.090988	  1.257384	  0.002980
  0.100977	  1.247596	 -0.010969
  0.111046	  1.238869	 -0.022665
  0.124302	  1.230271	 -0.038124
  0.137836	  1.220092	 -0.054578
  0.147136	  1.212137	 -0.066227
  0.157139	  1.205525	 -0.079856
  0.163739	  1.196690	 -0.095025
  0.167940	  1.183493	 -0.108700
  0.175411	  1.167394	 -0.126095
  0.179013	  1.156664	 -0.144846
  0.177878	  1.146911	 -0.159371
  0.173568	  1.139652	 -0.170492
  0.163299	  1.126844	 -0.184031
  0.154243	  1.111440	 -0.197381
  0.146431	  1.099272	 -0.211203
  0.139220	  1.089330	 -0.225497
  0.129901	  1.079552	 -0.241476
  0.121431	  1.069554	 -0.256335
  0.112573	  1.060746	 -0.266526
  0.101276	  1.050842	 -0.277633
  0.089771	  1.041599	 -0.289492
  0.076683	  1.030674	 -0.303079
  0.067811	  1.021489	 -0.315886
  0.057293	  1.010619	 -0.327461
  0.043892	  0.997373	 -0.337698
  0.030321	  0.982583	 -0.344011
  0.019556	  0.967235	 -0.347185
  0.008738	  0.950642	 -0.349541
 -0.002186	  0.933814	 -0.349169
 -0.013607	  0.918156	 -0.344763
 -0.026518	  0.901930	 -0.337739
 -0.036218	  0.884587	 -0.334354
 -0.046904	  0.864576	 -0.333633
 -0.056856	  0.848655	 -0.335410
 -0.066377	  0.831401	 -0.335759
 -0.075779	  0.811364	 -0.336932
 -0.080384	  0.792977	 -0.341360
 -0.084487	  0.775304	 -0.348858
 -0.088604	  0.755444	 -0.357024
 -0.094734	  0.729405	 -0.357518
 -0.100155	  0.713596	 -0.354813
 -0.106466	  0.699775	 -0.355361
 -0.118660	  0.682031	 -0.359157
 -0.123116	  0.662039	 -0.368932
 -0.124113	  0.647904	 -0.381624
 -0.127265	  0.628641	 -0.388431
 -0.132821	  0.617298	 -0.398783
 -0.143962	  0.605633	 -0.407979
 -0.153323	  0.589224	 -0.419576
 -0.155019	  0.576695	 -0.431018
 -0.153554	  0.554917	 -0.442608
 -0.159771	  0.545113	 -0.464387
 -0.171895	  0.539070	 -0.483397
 -0.182662	  0.545076	 -0.501423
 -0.193798	  0.545419	 -0.519588
 -0.202557	  0.551976	 -0.537822
 -0.206090	  0.567045	 -0.559690
 -0.197419	  0.577188	 -0.581469
 -0.190013	  0.581948	 -0.592710
 -0.185391	  0.585251	 -0.619514
 -0.185323	  0.588988	 -0.637694
 -0.185663	  0.593045	 -0.652062
 -0.186514	  0.602268	 -0.672808
 -0.186156	  0.610327	 -0.693851
 -0.184066	  0.618343	 -0.708893
 -0.177560	  0.628472	 -0.729682
 -0.169200	  0.633605	 -0.745785
 -0.164606	  0.635301	 -0.765533
 -0.163138	  0.638376	 -0.784322
 -0.163706	  0.640750	 -0.804848
 -0.161157	  0.642060	 -0.824529
 -0.155740	  0.638636	 -0.842443
 -0.147609	  0.638067	 -0.861456
 -0.139739	  0.644002	 -0.889085
 -0.137836	  0.648683	 -0.903650
 -0.134023	  0.654478	 -0.924438
 -0.130631	  0.657583	 -0.940850
 -0.129965	  0.650283	 -0.961768
 -0.127631	  0.641391	 -0.978767
 -0.123412	  0.635961	 -0.997651
 -0.120740	  0.629056	 -1.020247
 -0.114903	  0.619381	 -1.038019
 -0.106924	  0.611651	 -1.050050
 -0.101629	  0.603811	 -1.069252
 -0.098320	  0.592332	 -1.089860
 -0.088804	  0.584145	 -1.101901
 -0.073254	  0.576450	 -1.115803
 -0.056804	  0.570520	 -1.126852
 -0.046916	  0.563718	 -1.143337
 -0.039224	  0.556310	 -1.162063
 -0.027057	  0.547016	 -1.177542
 -0.013761	  0.539506	 -1.185964
  0.004975	  0.533994	 -1.193667
  0.025136	  0.527861	 -1.201003
  0.050373	  0.518389	 -1.209006
  0.057380	  0.515646	 -1.217747
  0.070556	  0.505901	 -1.233726
  0.087120	  0.496899	 -1.247892
  0.098115	  0.491813	 -1.259027
  0.113942	  0.486704	 -1.268796
  0.137696	  0.482439	 -1.280915
  0.155165	  0.480177	 -1.290260
  0.173032	  0.473596	 -1.297013
  0.185226	  0.466556	 -1.302115
  0.206332	  0.456342	 -1.314548
  0.221027	  0.450533	 -1.319999
  0.244791	  0.438648	 -1.320480
  0.261761	  0.434750	 -1.321204
  0.279170	  0.430642	 -1.321778
  0.299149	  0.420901	 -1.322340
  0.313498	  0.407750	 -1.326286
  0.326477	  0.400607	 -1.330203
  0.344722	  0.392173	 -1.336072
  0.357580	  0.370341	 -1.338901
  0.365350	  0.360057	 -1.340848
  0.383591	  0.342460	 -1.342427
  0.393453	  0.326260	 -1.345683
  0.399177	  0.312090	 -1.349061
  0.409538	  0.295098	 -1.353422
  0.418994	  0.277058	 -1.357719
  0.421511	  0.256273	 -1.361851
  0.424236	  0.237107	 -1.365853
  0.427386	  0.217855	 -1.369462
  0.427640	  0.197970	 -1.370926
  0.423836	  0.182286	 -1.377563
  0.416675	  0.169698	 -1.389228
  0.408237	  0.156903	 -1.398307
  0.407313	  0.151456	 -1.398713
  0.403582	  0.152545	 -1.405906
  0.396761	  0.140425	 -1.417108
  0.390962	  0.134299	 -1.436831
  0.381913	  0.122518	 -1.455991
  0.369813	  0.116777	 -1.471876
  0.359398	  0.121827	 -1.491030
  0.349789	  0.133165	 -1.504099
  0.337419	  0.140839	 -1.519653
  0.325486	  0.145288	 -1.535658
  0.313641	  0.148741	 -1.551456
  0.300501	  0.150751	 -1.566588
  0.286743	  0.151613	 -1.580967
  0.274098	  0.154482	 -1.596559
  0.261210	  0.157178	 -1.611772
  0.247962	  0.159006	 -1.626095
  0.236684	  0.166262	 -1.638827
  0.218964	  0.177811	 -1.653637
  0.199246	  0.181817	 -1.667193
  0.184695	  0.177307	 -1.676120
  0.169724	  0.171256	 -1.684371
  0.150580	  0.174953	 -1.698048
  0.134986	  0.181623	 -1.710231
  0.126779	  0.187481	 -1.716255
  0.109914	  0.198955	 -1.726516
  0.089991	  0.207109	 -1.738497
  0.073744	  0.212854	 -1.753146
  0.061522	  0.208260	 -1.773728
  0.050974	  0.194765	 -1.791778
  0.035713	  0.185013	 -1.805037
  0.020589	  0.184726	 -1.814437
  0.006432	  0.192209	 -1.825985
 -0.011192	  0.196671	 -1.839728
 -0.030528	  0.185535	 -1.855089
 -0.039434	  0.175124	 -1.866649
 -0.046496	  0.170967	 -1.881226
 -0.055911	  0.173631	 -1.901535
 -0.072211	  0.170473	 -1.917604
 -0.085043	  0.152474	 -1.933870
 -0.085935	  0.140133	 -1.945862
 -0.084080	  0.129073	 -1.963582
 -0.084889	  0.115929	 -1.980985
 -0.091193	  0.103227	 -1.995348
 -0.100160	  0.094651	 -2.009788
 -0.109263	  0.084067	 -2.027084
 -0.114133	  0.069049	 -2.042551
 -0.110378	  0.055842	 -2.056975
 -0.103873	  0.044315	 -2.072638
 -0.100883	  0.031997	 -2.088744
 -0.101598	  0.019123	 -2.103482
 -0.102009	  0.006178	 -2.116729
 -0.098723	 -0.008741	 -2.132338
 -0.093750	 -0.022276	 -2.148264
 -0.089538	 -0.035724	 -2.161855
 -0.088656	 -0.048863	 -2.172672
 -0.088136	 -0.071245	 -2.191439
 -0.088949	 -0.078033	 -2.200284
 -0.091252	 -0.089700	 -2.217704
 -0.090014	 -0.103816	 -2.235076
 -0.084851	 -0.117683	 -2.247656
 -0.079628	 -0.134194	 -2.261224
 -0.077527	 -0.148086	 -2.274462
 -0.078762	 -0.162052	 -2.287639
 -0.080589	 -0.182716	 -2.304717
 -0.081710	 -0.191755	 -2.312012
 -0.083721	 -0.208306	 -2.325887
 -0.084815	 -0.222863	 -2.341177
 -0.084529	 -0.236184	 -2.353989
 -0.083865	 -0.251704	 -2.373182
 -0.083117	 -0.261766	 -2.392195
 -0.083352	 -0.265748	 -2.404373
 -0.086542	 -0.276602	 -2.425062
 -0.087008	 -0.288071	 -2.440370
 -0.086083	 -0.299106	 -2.457769
 -0.084350	 -0.308811	 -2.475794
 -0.082413	 -0.317814	 -2.493677
 -0.080472	 -0.326658	 -2.511261
 -0.078035	 -0.335405	 -2.527852
 -0.074478	 -0.344842	 -2.545124
