 -0.712589	 -2.113931	  0.995593
 -0.733684	 -2.140264	  1.000746
 -0.724623	 -2.122062	  1.002522
 -0.712305	 -2.107439	  0.998072
 -0.702704	 -2.091211	  0.990933
 -0.687354	 -2.072157	  0.987643
 -0.674646	 -2.061411	  0.990986
 -0.665298	 -2.043523	  0.989072
 -0.654915	 -2.024835	  0.985345
 -0.641489	 -2.010535	  0.984801
 -0.630786	 -1.993890	  0.985670
 -0.624524	 -1.973246	  0.985423
 -0.615391	 -1.955856	  0.990815
 -0.602486	 -1.940636	  0.994273
 -0.591925	 -1.923205	  0.992951
 -0.582179	 -1.906354	  0.993509
 -0.572682	 -1.890887	  0.992254
 -0.563797	 -1.870629	  0.988533
 -0.554243	 -1.850266	  0.987382
 -0.546139	 -1.835280	  0.989675
 -0.534137	 -1.818931	  0.990618
 -0.522153	 -1.800256	  0.996882
 -0.515305	 -1.784456	  0.995382
 -0.505440	 -1.765651	  0.990251
 -0.492917	 -1.749288	  0.992247
 -0.485022	 -1.731874	  0.993820
 -0.478888	 -1.711691	  0.988331
 -0.470961	 -1.695301	  0.988421
 -0.461737	 -1.673727	  0.998471
 -0.454254	 -1.653446	  1.003826
 -0.450233	 -1.641349	  0.999908
 -0.444115	 -1.619844	  0.998642
 -0.438761	 -1.598994	  0.999205
 -0.430651	 -1.581245	  0.996705
 -0.424293	 -1.561607	  0.995954
 -0.423285	 -1.542602	  0.997937
 -0.423543	 -1.523887	  1.001265
 -0.422229	 -1.501340	  1.006708
 -0.422756	 -1.481544	  1.009106
 -0.423695	 -1.461651	  1.009765
 -0.422749	 -1.442632	  1.012459
 -0.424524	 -1.423872	  1.013929
 -0.431715	 -1.404617	  1.018146
 -0.437674	 -1.386663	  1.025215
 -0.445184	 -1.367241	  1.029874
 -0.449805	 -1.348780	  1.031138
 -0.453396	 -1.328828	  1.033170
 -0.460593	 -1.308406	  1.034184
 -0.469384	 -1.293591	  1.040374
 -0.477098	 -1.274846	  1.045209
 -0.485033	 -1.255951	  1.047155
 -0.491506	 -1.237573	  1.047816
 -0.496578	 -1.218775	  1.050347
 -0.498383	 -1.198894	  1.049795
 -0.496075	 -1.177674	  1.045411
 -0.487015	 -1.160397	  1.039228
 -0.482357	 -1.144785	  1.029949
 -0.472581	 -1.129824	  1.022537
 -0.458442	 -1.114965	  1.017039
 -0.447787	 -1.101590	  1.007912
 -0.435718	 -1.088751	  0.998881
 -0.420485	 -1.077187	  0.992111
 -0.405925	 -1.066777	  0.984036
 -0.390631	 -1.055657	  0.974194
 -0.373921	 -1.046526	  0.968971
 -0.356347	 -1.041573	  0.964171
 -0.336766	 -1.035598	  0.957709
 -0.319210	 -1.030086	  0.949805
 -0.299624	 -1.025828	  0.942545
 -0.284969	 -1.024594	  0.934267
 -0.265611	 -1.021989	  0.924965
 -0.246511	 -1.016827	  0.917869
 -0.230820	 -1.013429	  0.909663
 -0.212521	 -1.009567	  0.900129
 -0.194213	 -1.006938	  0.892520
 -0.177942	 -1.000536	  0.883528
 -0.160205	 -0.992870	  0.874426
 -0.142999	 -0.991971	  0.867248
 -0.126592	 -0.988345	  0.856802
 -0.111217	 -0.981184	  0.846604
 -0.092551	 -0.970817	  0.839007
 -0.079337	 -0.961645	  0.831073
 -0.062691	 -0.956107	  0.820860
 -0.044299	 -0.949845	  0.812971
 -0.030273	 -0.935397	  0.805689
 -0.013413	 -0.929583	  0.798144
  0.003016	 -0.918204	  0.787374
  0.013285	 -0.905225	  0.778991
  0.029474	 -0.893529	  0.772948
  0.047032	 -0.883109	  0.764283
  0.053395	 -0.868854	  0.754691
  0.064025	 -0.853847	  0.745624
  0.077801	 -0.839910	  0.737042
  0.085344	 -0.823962	  0.727758
  0.095483	 -0.808502	  0.719233
  0.109730	 -0.794403	  0.711499
  0.117850	 -0.779801	  0.704134
  0.125360	 -0.762370	  0.696039
  0.133149	 -0.744796	  0.689325
  0.141798	 -0.727720	  0.682939
  0.149349	 -0.710039	  0.677354
  0.156963	 -0.692500	  0.671439
  0.164413	 -0.674948	  0.665393
  0.171372	 -0.657199	  0.659344
  0.178166	 -0.639551	  0.652920
  0.184064	 -0.621995	  0.646180
  0.188273	 -0.604083	  0.639776
  0.197004	 -0.584200	  0.633584
  0.206610	 -0.568286	  0.627482
  0.217874	 -0.554407	  0.619955
  0.227264	 -0.537358	  0.613199
  0.239250	 -0.520104	  0.609134
  0.250588	 -0.506257	  0.604183
  0.261306	 -0.491050	  0.597140
  0.273539	 -0.475871	  0.590353
  0.282514	 -0.459309	  0.585581
  0.293113	 -0.440841	  0.582338
  0.306347	 -0.427286	  0.576955
  0.320510	 -0.415064	  0.570133
  0.336953	 -0.401819	  0.564286
  0.348385	 -0.385871	  0.565231
  0.360084	 -0.369837	  0.561128
  0.372466	 -0.353687	  0.559398
  0.384674	 -0.338379	  0.556689
  0.395666	 -0.319890	  0.557570
  0.408522	 -0.305105	  0.556532
  0.421489	 -0.292281	  0.551652
  0.435284	 -0.275319	  0.547432
  0.448603	 -0.255160	  0.549989
  0.453470	 -0.242325	  0.551776
  0.466127	 -0.224907	  0.550324
  0.482961	 -0.209607	  0.552828
  0.497316	 -0.196198	  0.555679
  0.510013	 -0.180756	  0.557370
  0.521055	 -0.164956	  0.558365
  0.533273	 -0.148900	  0.557977
  0.541568	 -0.129455	  0.555153
  0.552903	 -0.112694	  0.554064
  0.565117	 -0.099222	  0.552549
  0.579475	 -0.083739	  0.553413
  0.589748	 -0.065346	  0.552805
  0.599998	 -0.048703	  0.546224
  0.610788	 -0.035032	  0.544059
  0.623607	 -0.018521	  0.542777
  0.637628	 -0.001391	  0.538072
  0.648869	  0.011078	  0.535663
  0.661526	  0.026816	  0.530289
  0.673218	  0.041518	  0.525995
  0.685345	  0.057311	  0.520156
  0.696954	  0.072494	  0.514253
  0.707954	  0.088462	  0.509354
  0.718632	  0.104793	  0.504964
  0.729305	  0.121130	  0.500584
  0.739284	  0.138124	  0.497182
  0.748311	  0.155843	  0.495052
  0.757329	  0.173567	  0.492932
  0.766398	  0.191246	  0.491041
  0.774892	  0.209303	  0.491547
  0.782807	  0.227868	  0.490721
  0.790983	  0.245555	  0.488931
  0.801224	  0.263165	  0.489446
  0.810309	  0.283833	  0.491520
  0.816408	  0.300860	  0.493721
  0.820755	  0.320129	  0.499124
  0.825514	  0.340877	  0.504027
  0.827087	  0.363095	  0.502858
  0.825758	  0.379108	  0.503057
  0.828929	  0.400219	  0.507509
  0.830998	  0.420407	  0.511144
  0.834825	  0.439486	  0.514151
  0.839598	  0.458599	  0.518948
  0.842923	  0.479907	  0.521576
  0.842930	  0.498487	  0.524570
  0.845915	  0.516908	  0.531009
  0.848392	  0.536691	  0.536698
  0.847677	  0.556797	  0.542008
  0.844662	  0.574408	  0.549585
  0.840956	  0.591230	  0.560667
  0.837931	  0.608396	  0.571312
  0.835294	  0.625615	  0.581209
  0.832668	  0.642811	  0.591076
  0.830042	  0.660008	  0.600944
  0.827391	  0.677194	  0.610820
  0.822134	  0.692341	  0.622136
  0.817199	  0.707082	  0.635690
  0.812844	  0.721572	  0.649748
  0.806955	  0.736323	  0.660993
  0.800259	  0.750931	  0.671135
  0.792365	  0.768323	  0.683257
  0.783986	  0.784347	  0.691249
  0.773897	  0.799539	  0.696782
  0.762836	  0.815133	  0.704694
  0.755353	  0.829705	  0.717309
  0.748295	  0.846724	  0.729095
  0.743654	  0.864671	  0.737610
  0.738077	  0.879814	  0.743282
  0.731595	  0.898777	  0.751440
  0.722379	  0.916449	  0.756502
  0.711740	  0.932483	  0.760713
  0.702851	  0.951975	  0.763324
  0.700184	  0.970660	  0.768102
  0.707332	  0.986379	  0.769867
  0.714450	  0.998809	  0.768818
  0.732803	  1.007544	  0.768757
  0.749571	  1.018308	  0.766544
  0.766117	  1.027902	  0.759980
  0.783124	  1.039789	  0.752857
  0.801447	  1.047173	  0.750441
  0.819325	  1.051956	  0.745684
  0.838082	  1.055993	  0.740453
  0.857610	  1.061685	  0.736409
  0.876574	  1.068168	  0.734018
  0.894876	  1.075380	  0.730034
  0.913020	  1.082764	  0.725975
  0.931275	  1.089946	  0.722200
  0.949142	  1.097511	  0.717258
  0.966895	  1.104971	  0.711921
  0.985584	  1.111734	  0.707989
  1.003514	  1.118590	  0.702594
  1.021985	  1.125020	  0.697923
  1.040361	  1.131089	  0.693016
  1.059591	  1.137112	  0.690859
  1.078299	  1.142959	  0.686823
  1.097105	  1.148929	  0.683203
  1.114758	  1.157300	  0.680831
  1.131274	  1.166522	  0.674677
  1.146639	  1.178370	  0.669685
  1.161877	  1.189439	  0.662786
  1.176999	  1.200848	  0.656429
  1.191462	  1.212284	  0.649111
  1.204661	  1.225403	  0.642603
  1.216853	  1.237871	  0.633034
  1.228557	  1.251745	  0.625122
  1.234101	  1.259945	  0.611339
  1.237875	  1.267272	  0.599710
  1.240660	  1.274214	  0.581976
  1.243324	  1.274759	  0.563252
  1.247935	  1.277797	  0.546126
  1.252905	  1.274098	  0.526821
  1.259920	  1.273437	  0.507932
  1.264731	  1.269816	  0.488816
  1.271619	  1.269227	  0.469899
  1.276741	  1.265713	  0.450746
  1.284768	  1.265219	  0.432293
  1.294679	  1.261503	  0.415024
  1.307781	  1.259957	  0.398430
  1.321507	  1.255705	  0.384696
  1.337718	  1.255083	  0.373322
  1.354170	  1.251789	  0.363680
  1.373472	  1.248696	  0.351464
  1.386542	  1.242424	  0.337631
  1.398375	  1.244906	  0.322250
  1.412978	  1.246309	  0.306429
  1.422357	  1.254223	  0.290242
  1.427673	  1.261219	  0.280581
  1.438275	  1.274082	  0.267613
  1.438216	  1.291724	  0.257450
  1.434694	  1.309912	  0.249748
  1.429793	  1.327569	  0.242102
  1.424176	  1.345490	  0.234586
  1.421144	  1.363892	  0.226059
  1.418517	  1.380417	  0.215654
  1.418767	  1.398873	  0.207179
  1.420052	  1.418249	  0.200658
  1.427498	  1.437368	  0.194151
  1.431070	  1.456225	  0.185588
  1.424561	  1.474317	  0.180594
  1.422779	  1.495956	  0.176542
  1.429874	  1.514223	  0.168734
  1.442073	  1.527630	  0.155416
  1.447553	  1.541314	  0.144770
  1.451915	  1.559796	  0.137802
  1.458831	  1.577314	  0.128283
  1.470107	  1.592732	  0.117274
  1.483996	  1.605883	  0.111374
  1.498890	  1.619006	  0.106954
  1.513288	  1.635105	  0.106590
  1.524311	  1.649545	  0.096898
  1.533154	  1.667777	  0.094709
  1.545748	  1.686953	  0.092605
  1.559802	  1.699905	  0.089501
  1.567867	  1.717284	  0.086970
  1.576378	  1.735347	  0.084236
  1.583363	  1.752999	  0.078412
  1.589559	  1.770748	  0.071380
  1.596494	  1.788712	  0.064022
  1.609617	  1.807033	  0.070509
  1.618421	  1.824336	  0.065705
