 -1.884888	 -1.731919	 -0.369632
 -1.873678	 -1.771146	 -0.371699
 -1.876029	 -1.762918	 -0.371266
 -1.889043	 -1.715277	 -0.369047
 -1.901755	 -1.669634	 -0.366454
 -1.914875	 -1.628271	 -0.362748
 -1.930361	 -1.591760	 -0.355198
 -1.950012	 -1.555609	 -0.344504
 -1.974593	 -1.514683	 -0.331285
 -2.000079	 -1.469196	 -0.316697
 -2.024015	 -1.422323	 -0.301192
 -2.045606	 -1.375174	 -0.284715
 -2.065475	 -1.327637	 -0.269506
 -2.083626	 -1.280740	 -0.256356
 -2.101102	 -1.234271	 -0.245162
 -2.118350	 -1.186797	 -0.234983
 -2.134570	 -1.139749	 -0.224291
 -2.150803	 -1.093967	 -0.212322
 -2.167394	 -1.047457	 -0.199183
 -2.183837	 -1.000023	 -0.185884
 -2.199695	 -0.951889	 -0.172721
 -2.214742	 -0.903041	 -0.159941
 -2.228117	 -0.855045	 -0.148072
 -2.240433	 -0.809994	 -0.137805
 -2.253908	 -0.768939	 -0.130318
 -2.269958	 -0.729777	 -0.124440
 -2.289092	 -0.691535	 -0.119682
 -2.311242	 -0.653720	 -0.115622
 -2.335443	 -0.616812	 -0.111808
 -2.362206	 -0.579548	 -0.107215
 -2.392552	 -0.538716	 -0.100683
 -2.423807	 -0.494601	 -0.093091
 -2.454598	 -0.447398	 -0.084326
 -2.484071	 -0.394838	 -0.072908
 -2.507315	 -0.339145	 -0.056496
 -2.524645	 -0.285320	 -0.038205
 -2.538639	 -0.233302	 -0.022392
 -2.550468	 -0.183116	 -0.009821
 -2.561193	 -0.135758	 -0.000032
 -2.571928	 -0.091251	  0.007876
 -2.583652	 -0.049785	  0.013700
 -2.610694	  0.022877	  0.020241
 -2.616780	  0.037880	  0.021497
