  0.264699	 -2.252331	  1.092792
  0.297875	 -2.273474	  1.102806
  0.281421	 -2.263012	  1.098303
  0.265841	 -2.252172	  1.091961
  0.249782	 -2.241611	  1.086340
  0.234005	 -2.230635	  1.080828
  0.218765	 -2.219365	  1.074778
  0.204147	 -2.209189	  1.066835
  0.188400	 -2.201443	  1.057579
  0.173462	 -2.191939	  1.048190
  0.161887	 -2.177519	  1.038225
  0.149066	 -2.160163	  1.026954
  0.136664	 -2.151166	  1.019466
  0.118837	 -2.146418	  1.013675
  0.091557	 -2.137080	  1.014293
  0.074713	 -2.122298	  1.014918
  0.065256	 -2.106553	  1.007849
  0.059623	 -2.093681	  0.998566
  0.048849	 -2.079128	  0.980772
  0.034191	 -2.069161	  0.967258
  0.013522	 -2.058610	  0.959223
 -0.004158	 -2.048706	  0.963904
 -0.023350	 -2.035021	  0.964714
 -0.036564	 -2.020773	  0.965406
 -0.049939	 -2.001520	  0.965404
 -0.062260	 -1.989880	  0.967383
 -0.078522	 -1.974283	  0.970616
 -0.094187	 -1.959668	  0.971534
 -0.107363	 -1.949008	  0.969694
 -0.125738	 -1.933699	  0.965252
 -0.144729	 -1.927122	  0.966305
 -0.169452	 -1.921522	  0.972630
 -0.185245	 -1.916413	  0.975464
 -0.199636	 -1.909081	  0.978960
 -0.218671	 -1.892997	  0.981590
 -0.242166	 -1.882069	  0.981993
 -0.249769	 -1.878114	  0.982581
 -0.271753	 -1.877023	  0.979848
 -0.295158	 -1.876697	  0.969890
 -0.314919	 -1.871351	  0.959712
 -0.337108	 -1.863483	  0.956776
 -0.351627	 -1.857747	  0.955662
 -0.368944	 -1.848206	  0.954988
 -0.391669	 -1.835706	  0.955765
 -0.403862	 -1.831031	  0.954953
 -0.427586	 -1.819378	  0.950760
 -0.445407	 -1.809404	  0.945102
 -0.457081	 -1.802510	  0.942206
 -0.475193	 -1.797338	  0.934688
 -0.500292	 -1.791689	  0.922420
 -0.516367	 -1.786246	  0.915547
 -0.532381	 -1.783773	  0.910027
 -0.551334	 -1.782347	  0.904360
 -0.569076	 -1.772347	  0.899437
 -0.585742	 -1.764515	  0.895322
 -0.603792	 -1.759416	  0.893401
 -0.622271	 -1.753503	  0.891502
 -0.649119	 -1.745832	  0.886991
 -0.665986	 -1.735723	  0.884283
 -0.678245	 -1.727162	  0.881541
 -0.694285	 -1.716199	  0.875458
 -0.711212	 -1.707085	  0.864334
 -0.726291	 -1.700113	  0.855509
 -0.747416	 -1.693039	  0.843142
 -0.763403	 -1.690305	  0.834376
 -0.779772	 -1.688716	  0.828559
 -0.804068	 -1.677840	  0.822505
 -0.822503	 -1.666240	  0.818231
 -0.832869	 -1.658800	  0.816962
 -0.850511	 -1.645727	  0.820363
 -0.869254	 -1.630327	  0.823468
 -0.883149	 -1.615883	  0.824706
 -0.903692	 -1.599822	  0.819332
 -0.915446	 -1.589861	  0.812200
 -0.925475	 -1.579579	  0.803478
 -0.944664	 -1.561361	  0.800555
 -0.958960	 -1.548974	  0.805458
 -0.971143	 -1.539270	  0.807107
 -0.986239	 -1.519883	  0.814844
 -1.003017	 -1.502406	  0.818144
 -1.019218	 -1.491287	  0.817347
 -1.034252	 -1.482538	  0.814278
 -1.054999	 -1.475103	  0.810900
 -1.071598	 -1.467530	  0.810977
 -1.090146	 -1.458151	  0.811214
 -1.110664	 -1.446706	  0.809462
 -1.128838	 -1.437246	  0.806932
 -1.145141	 -1.429135	  0.806528
 -1.165968	 -1.418487	  0.804191
 -1.185763	 -1.412253	  0.796397
 -1.205025	 -1.412154	  0.785984
 -1.220130	 -1.413861	  0.780676
 -1.240558	 -1.411005	  0.776435
 -1.262223	 -1.412626	  0.771461
 -1.285070	 -1.403377	  0.754565
 -1.296508	 -1.391873	  0.746110
 -1.305497	 -1.378973	  0.739631
 -1.326338	 -1.360918	  0.726701
 -1.337548	 -1.355847	  0.723333
 -1.353459	 -1.350831	  0.716201
 -1.376576	 -1.339297	  0.702716
 -1.387179	 -1.333488	  0.694383
 -1.398307	 -1.327780	  0.680402
 -1.414465	 -1.314263	  0.664164
 -1.423342	 -1.304106	  0.655612
 -1.433660	 -1.289699	  0.645786
 -1.445500	 -1.276810	  0.636748
 -1.460933	 -1.261579	  0.629690
 -1.476556	 -1.248908	  0.617510
 -1.487348	 -1.239941	  0.608844
 -1.497838	 -1.230881	  0.599752
 -1.515549	 -1.212885	  0.584534
 -1.523881	 -1.206210	  0.579380
 -1.536652	 -1.194997	  0.570623
 -1.555084	 -1.179259	  0.562363
 -1.570434	 -1.169653	  0.558831
 -1.588212	 -1.156853	  0.554540
 -1.605137	 -1.145834	  0.550060
 -1.619978	 -1.138427	  0.544993
 -1.639237	 -1.129549	  0.541384
 -1.653088	 -1.119901	  0.539443
 -1.674277	 -1.105142	  0.542358
 -1.689921	 -1.098586	  0.542888
 -1.704316	 -1.089610	  0.538295
 -1.728457	 -1.075168	  0.530028
 -1.741111	 -1.068070	  0.527108
 -1.752930	 -1.060990	  0.526912
 -1.781189	 -1.050058	  0.528655
 -1.793071	 -1.045506	  0.527946
 -1.809760	 -1.039590	  0.524225
 -1.837471	 -1.031000	  0.520623
 -1.853050	 -1.021496	  0.517368
 -1.864106	 -1.015421	  0.513959
 -1.886047	 -1.007120	  0.507943
 -1.906221	 -0.997654	  0.503692
 -1.918136	 -0.990328	  0.498987
 -1.935923	 -0.976660	  0.489661
 -1.955137	 -0.963518	  0.483947
 -1.972089	 -0.959214	  0.481340
 -1.987400	 -0.958966	  0.476341
 -2.007085	 -0.952404	  0.466364
 -2.024346	 -0.943994	  0.458723
 -2.040869	 -0.935130	  0.451733
 -2.057382	 -0.926267	  0.444750
 -2.073661	 -0.916429	  0.438566
 -2.089779	 -0.906063	  0.432841
 -2.105895	 -0.895695	  0.427119
 -2.121492	 -0.883952	  0.422777
 -2.136992	 -0.872004	  0.418652
 -2.152441	 -0.859931	  0.414708
 -2.167596	 -0.847219	  0.411849
 -2.183772	 -0.836627	  0.411028
 -2.203132	 -0.828249	  0.414283
 -2.219741	 -0.817616	  0.414093
 -2.231423	 -0.801325	  0.405189
 -2.246469	 -0.780230	  0.396200
 -2.262155	 -0.770428	  0.398255
 -2.278289	 -0.766504	  0.404938
 -2.300143	 -0.757818	  0.410430
 -2.313024	 -0.741372	  0.404039
 -2.324634	 -0.724160	  0.395787
 -2.341171	 -0.709075	  0.393232
 -2.357284	 -0.698816	  0.394344
 -2.370976	 -0.691837	  0.395002
 -2.390106	 -0.678848	  0.394353
 -2.406067	 -0.666428	  0.392959
 -2.421718	 -0.654028	  0.391377
 -2.436770	 -0.641102	  0.388511
 -2.452468	 -0.628915	  0.386265
