  0.647970	  1.443071	  1.774264
  0.637682	  1.432328	  1.801066
  0.645196	  1.437786	  1.783218
  0.650372	  1.444538	  1.765097
  0.654842	  1.451391	  1.746895
  0.658123	  1.457312	  1.728044
  0.661510	  1.462849	  1.709119
  0.664111	  1.468053	  1.689985
  0.666694	  1.473245	  1.670844
  0.668697	  1.478300	  1.651598
  0.670564	  1.483317	  1.632328
  0.672046	  1.488259	  1.613004
  0.673162	  1.493200	  1.593657
  0.674186	  1.498178	  1.574313
  0.674496	  1.503399	  1.555008
  0.674816	  1.508605	  1.535700
  0.675353	  1.514209	  1.516507
  0.676561	  1.520746	  1.497642
  0.677778	  1.527276	  1.478777
  0.678990	  1.533852	  1.459929
  0.681639	  1.542089	  1.441895
  0.684427	  1.550515	  1.423971
  0.687210	  1.558935	  1.406044
  0.690683	  1.568128	  1.388624
  0.694703	  1.577942	  1.371668
  0.698715	  1.587736	  1.354703
  0.702487	  1.598071	  1.338293
  0.702765	  1.609894	  1.323423
  0.702116	  1.621646	  1.308379
  0.704949	  1.640548	  1.289481
  0.711671	  1.656219	  1.272157
  0.716384	  1.663770	  1.262485
  0.723039	  1.671067	  1.249239
  0.736532	  1.678046	  1.227527
  0.746631	  1.687062	  1.211793
  0.754980	  1.698219	  1.198932
  0.762995	  1.712349	  1.182465
  0.767375	  1.723206	  1.168215
  0.770911	  1.735845	  1.151779
  0.774373	  1.744858	  1.139047
  0.782438	  1.757320	  1.119043
  0.789228	  1.768258	  1.100221
  0.791461	  1.774160	  1.092030
  0.798872	  1.786595	  1.071089
  0.806466	  1.798185	  1.046592
  0.807130	  1.802144	  1.041722
  0.808338	  1.813658	  1.021876
  0.814126	  1.828633	  0.994790
  0.817174	  1.833735	  0.985213
  0.822747	  1.848153	  0.970368
  0.829014	  1.860894	  0.959737
  0.838033	  1.871587	  0.936632
  0.844858	  1.875843	  0.917431
  0.849637	  1.879046	  0.904073
  0.856014	  1.888248	  0.881031
  0.861284	  1.895442	  0.858684
  0.863411	  1.897615	  0.848830
  0.870399	  1.904741	  0.828944
  0.877952	  1.907111	  0.808488
  0.884480	  1.910267	  0.789362
  0.890672	  1.916524	  0.770975
  0.897151	  1.921272	  0.752664
  0.903487	  1.926051	  0.734189
  0.907857	  1.931672	  0.715364
  0.911435	  1.938022	  0.696774
  0.914176	  1.945486	  0.678329
  0.916543	  1.953386	  0.660091
  0.919006	  1.961228	  0.641859
  0.920583	  1.970971	  0.624465
  0.921840	  1.981328	  0.607401
  0.923113	  1.991708	  0.590363
  0.924442	  2.003221	  0.574216
  0.922617	  2.015903	  0.558891
  0.919129	  2.029033	  0.543901
  0.917673	  2.041507	  0.530021
  0.914848	  2.058954	  0.512962
  0.916024	  2.074825	  0.497140
  0.920794	  2.087098	  0.484768
  0.925314	  2.099066	  0.469917
  0.927264	  2.109054	  0.453117
  0.930835	  2.116916	  0.436803
  0.943378	  2.127120	  0.409826
  0.949923	  2.130773	  0.393217
  0.955446	  2.136673	  0.377492
  0.960477	  2.148828	  0.355758
  0.963877	  2.155849	  0.344121
  0.970089	  2.181566	  0.306561
  0.973229	  2.191515	  0.289497
