 -1.655296	  1.196872	  1.548467
 -1.662036	  1.195957	  1.557386
 -1.651136	  1.197177	  1.540645
 -1.639907	  1.198784	  1.524248
 -1.629760	  1.201184	  1.507192
 -1.619406	  1.205314	  1.490824
 -1.611148	  1.210958	  1.474119
 -1.603769	  1.219375	  1.454918
 -1.595035	  1.227881	  1.438227
 -1.582458	  1.234315	  1.425812
 -1.569751	  1.240093	  1.412877
 -1.560782	  1.249696	  1.396789
 -1.554772	  1.260352	  1.381422
 -1.549409	  1.268223	  1.366434
 -1.543987	  1.281621	  1.349878
 -1.540697	  1.298928	  1.331573
 -1.540267	  1.306689	  1.318598
 -1.540783	  1.315866	  1.298264
 -1.536361	  1.332504	  1.279920
 -1.532492	  1.342001	  1.272812
 -1.525866	  1.358221	  1.260101
 -1.523036	  1.373818	  1.243062
 -1.520736	  1.385615	  1.228184
 -1.514805	  1.399966	  1.215388
 -1.507748	  1.415017	  1.203052
 -1.501263	  1.427931	  1.191922
 -1.493569	  1.442033	  1.176633
 -1.489446	  1.452266	  1.159860
 -1.489199	  1.459897	  1.143700
 -1.489708	  1.469758	  1.120595
 -1.485997	  1.477765	  1.104405
 -1.480754	  1.486328	  1.088247
 -1.465879	  1.496791	  1.067449
 -1.454473	  1.502115	  1.056020
 -1.443261	  1.508666	  1.043040
 -1.434649	  1.518180	  1.028224
 -1.426699	  1.526125	  1.007470
 -1.416634	  1.532490	  0.984810
 -1.411765	  1.535010	  0.975841
 -1.396787	  1.538455	  0.960140
 -1.385911	  1.539285	  0.941297
 -1.378859	  1.538212	  0.924139
 -1.368982	  1.535290	  0.903644
 -1.357175	  1.534527	  0.889832
 -1.344007	  1.536221	  0.876215
 -1.334223	  1.536410	  0.855590
 -1.329457	  1.535071	  0.836836
 -1.320223	  1.532697	  0.813106
 -1.313639	  1.530026	  0.801192
 -1.304104	  1.521885	  0.783712
 -1.293940	  1.516716	  0.764057
 -1.284249	  1.516009	  0.748872
 -1.276459	  1.516160	  0.734491
 -1.269070	  1.514658	  0.712150
 -1.262669	  1.510506	  0.693069
 -1.252052	  1.503083	  0.669764
 -1.245177	  1.500678	  0.653944
 -1.239904	  1.501670	  0.642878
 -1.225345	  1.499416	  0.622357
 -1.213918	  1.499319	  0.608880
 -1.200642	  1.497812	  0.593285
 -1.188442	  1.489626	  0.579004
 -1.180463	  1.476137	  0.563871
 -1.170539	  1.462511	  0.550912
 -1.160213	  1.452274	  0.534237
 -1.153428	  1.447399	  0.521211
 -1.143703	  1.448005	  0.503071
 -1.119764	  1.442712	  0.474953
 -1.118239	  1.451599	  0.450386
 -1.102525	  1.433081	  0.451846
 -1.093408	  1.429960	  0.434072
 -1.078075	  1.415008	  0.428512
 -1.062217	  1.399909	  0.404251
 -1.050091	  1.386000	  0.416186
 -1.034964	  1.376914	  0.405548
 -1.012627	  1.366498	  0.410205
 -0.996461	  1.362581	  0.408998
 -0.978940	  1.348181	  0.402505
 -0.961494	  1.340375	  0.389763
 -0.952801	  1.334290	  0.370971
 -0.941902	  1.324873	  0.351604
 -0.932125	  1.312236	  0.333416
 -0.914730	  1.299240	  0.323793
 -0.898580	  1.285913	  0.312965
 -0.882914	  1.271510	  0.314575
 -0.877188	  1.260393	  0.304564
 -0.865496	  1.246533	  0.301169
 -0.848747	  1.231195	  0.297381
 -0.830138	  1.215983	  0.292013
 -0.814424	  1.203930	  0.292850
 -0.798140	  1.194818	  0.294370
 -0.781329	  1.183906	  0.292381
 -0.757326	  1.174932	  0.289065
 -0.740089	  1.163404	  0.282788
 -0.726983	  1.168189	  0.282710
 -0.704209	  1.152531	  0.278931
 -0.684668	  1.144135	  0.281492
 -0.674337	  1.137937	  0.284258
 -0.652420	  1.127707	  0.284228
 -0.630278	  1.120350	  0.285138
 -0.617973	  1.111125	  0.285537
 -0.596174	  1.099709	  0.283649
 -0.579951	  1.086107	  0.282059
 -0.568028	  1.080756	  0.283414
 -0.551165	  1.069161	  0.284108
 -0.529862	  1.058082	  0.287998
 -0.519860	  1.050980	  0.286756
 -0.499751	  1.037867	  0.280020
 -0.485519	  1.032798	  0.274376
 -0.464119	  1.022581	  0.266721
 -0.440209	  1.015650	  0.262106
 -0.428397	  1.008962	  0.260555
 -0.413079	  0.999962	  0.258363
 -0.390079	  0.989830	  0.253568
 -0.371965	  0.984471	  0.248893
 -0.353749	  0.981981	  0.242748
 -0.329479	  0.987680	  0.234514
 -0.315186	  0.987167	  0.230268
 -0.295066	  0.991586	  0.226719
 -0.277983	  0.994097	  0.223604
 -0.259387	  0.990654	  0.219461
 -0.229439	  0.983225	  0.212957
 -0.215815	  0.980816	  0.205846
 -0.202327	  0.977692	  0.202498
 -0.179730	  0.976742	  0.186697
 -0.157802	  0.975061	  0.175239
 -0.143696	  0.973994	  0.170828
 -0.128264	  0.974111	  0.165160
 -0.103491	  0.978195	  0.157671
 -0.092682	  0.979683	  0.152346
 -0.072955	  0.983763	  0.138954
 -0.053816	  0.984300	  0.125982
 -0.037510	  0.980180	  0.110773
 -0.030363	  0.977761	  0.104245
 -0.014958	  0.976398	  0.087850
  0.004577	  0.975334	  0.076694
  0.022140	  0.973022	  0.068432
  0.044364	  0.967670	  0.060658
  0.064914	  0.968691	  0.056790
  0.082436	  0.965044	  0.053612
  0.106170	  0.961204	  0.048319
  0.128187	  0.957133	  0.039113
  0.141607	  0.954068	  0.035639
  0.153377	  0.949667	  0.025802
  0.176289	  0.942549	  0.009371
  0.188247	  0.942777	 -0.001520
  0.210357	  0.938664	 -0.017223
  0.222528	  0.947601	 -0.036729
  0.232743	  0.935715	 -0.037196
  0.245863	  0.940528	 -0.050606
  0.274265	  0.931561	 -0.065358
  0.283026	  0.930871	 -0.070504
  0.299070	  0.928160	 -0.078069
  0.319306	  0.928080	 -0.093381
  0.333943	  0.922530	 -0.107534
  0.354200	  0.916793	 -0.130982
  0.369300	  0.907841	 -0.135233
  0.375732	  0.920958	 -0.144694
  0.395243	  0.916547	 -0.153905
  0.418999	  0.925016	 -0.169118
  0.437061	  0.924997	 -0.175083
  0.459546	  0.924506	 -0.182222
  0.475049	  0.923270	 -0.183711
  0.496136	  0.924318	 -0.185925
  0.512324	  0.923974	 -0.190508
  0.534889	  0.926564	 -0.198555
  0.552918	  0.927821	 -0.212808
  0.566068	  0.929800	 -0.222402
  0.578055	  0.934377	 -0.226170
  0.606409	  0.937233	 -0.242590
  0.627446	  0.940432	 -0.245992
  0.642155	  0.937205	 -0.254031
  0.663163	  0.940593	 -0.257571
  0.677090	  0.938260	 -0.263275
  0.699738	  0.942435	 -0.262708
  0.723372	  0.945608	 -0.268560
  0.742341	  0.949740	 -0.275240
  0.754983	  0.951496	 -0.276793
  0.773754	  0.955938	 -0.280958
  0.796832	  0.963371	 -0.282057
  0.819571	  0.971171	 -0.279916
  0.838581	  0.976985	 -0.278817
  0.851828	  0.977521	 -0.281328
  0.871350	  0.977661	 -0.283392
  0.894386	  0.975600	 -0.284464
  0.921877	  0.973605	 -0.276792
  0.934117	  0.974003	 -0.272604
  0.951567	  0.977433	 -0.270882
  0.973218	  0.985171	 -0.270346
  0.994082	  0.993986	 -0.271616
  1.013104	  1.001576	 -0.274909
  1.032251	  1.007446	 -0.273039
  1.052555	  1.012682	 -0.275439
  1.069085	  1.017024	 -0.269952
  1.083185	  1.023511	 -0.271135
  1.096712	  1.029428	 -0.267451
  1.116356	  1.040998	 -0.267612
  1.132944	  1.050696	 -0.269938
  1.150102	  1.060386	 -0.273432
  1.163118	  1.067233	 -0.278219
  1.180682	  1.075982	 -0.278752
  1.197777	  1.086595	 -0.287821
  1.215202	  1.094522	 -0.296614
  1.226088	  1.099331	 -0.305329
  1.241619	  1.105825	 -0.312188
  1.256552	  1.116467	 -0.329590
  1.264925	  1.122771	 -0.344263
  1.271729	  1.127065	 -0.356287
  1.280121	  1.140640	 -0.371921
  1.291438	  1.155274	 -0.381852
  1.309310	  1.172183	 -0.392783
  1.322204	  1.181697	 -0.398172
  1.341306	  1.192964	 -0.400678
  1.357720	  1.204761	 -0.404947
  1.372658	  1.216109	 -0.411772
  1.385236	  1.227011	 -0.423033
  1.393760	  1.238527	 -0.437822
  1.400001	  1.251584	 -0.453380
  1.405857	  1.265565	 -0.467798
  1.412361	  1.279814	 -0.478177
  1.421514	  1.296023	 -0.489958
  1.428883	  1.312076	 -0.497752
  1.435019	  1.327958	 -0.503048
  1.439924	  1.346587	 -0.509389
  1.444214	  1.364271	 -0.513765
  1.439724	  1.378184	 -0.526164
  1.432825	  1.390622	 -0.540425
  1.425890	  1.402203	 -0.555276
  1.416765	  1.407863	 -0.572235
  1.407348	  1.411498	 -0.589349
  1.394860	  1.412119	 -0.604821
  1.380495	  1.402132	 -0.617360
  1.374041	  1.384601	 -0.627926
  1.378786	  1.361074	 -0.645617
  1.381729	  1.350064	 -0.662331
  1.383480	  1.345029	 -0.675580
  1.385266	  1.334888	 -0.697831
  1.387482	  1.321721	 -0.716178
  1.390549	  1.311085	 -0.727160
  1.395279	  1.294875	 -0.741801
  1.400479	  1.279513	 -0.754985
  1.405687	  1.259755	 -0.765587
  1.409226	  1.245562	 -0.772860
  1.412606	  1.235842	 -0.787162
  1.422573	  1.220339	 -0.808206
  1.434665	  1.207581	 -0.825840
  1.443360	  1.201401	 -0.837216
  1.451794	  1.197468	 -0.849892
  1.466187	  1.192082	 -0.868566
  1.478231	  1.186907	 -0.882705
  1.488730	  1.180759	 -0.895795
  1.502231	  1.165903	 -0.911595
  1.519087	  1.157003	 -0.926253
  1.535573	  1.158839	 -0.936121
  1.552773	  1.161616	 -0.947548
  1.569122	  1.162953	 -0.959251
  1.582652	  1.163607	 -0.970859
  1.600217	  1.162573	 -0.986572
  1.615176	  1.159105	 -0.999174
  1.626721	  1.156147	 -1.010333
  1.646289	  1.150246	 -1.026931
  1.658671	  1.146187	 -1.035719
  1.672501	  1.141043	 -1.045817
  1.695521	  1.134781	 -1.062224
  1.708232	  1.133367	 -1.070971
  1.725464	  1.139211	 -1.082489
  1.741388	  1.144970	 -1.088980
  1.762470	  1.147045	 -1.098200
  1.781303	  1.146541	 -1.106295
  1.798601	  1.146414	 -1.113610
  1.817196	  1.139673	 -1.126150
  1.834410	  1.139984	 -1.136328
