 -0.201476	  1.521904	  2.612301
 -0.199481	  1.506836	  2.586436
 -0.173295	  1.493467	  2.547530
 -0.151098	  1.485219	  2.504748
 -0.133676	  1.467890	  2.462394
 -0.114634	  1.460956	  2.416600
 -0.092205	  1.445961	  2.373919
 -0.075168	  1.436344	  2.326755
 -0.053697	  1.433396	  2.280619
 -0.033187	  1.417538	  2.238001
 -0.011125	  1.407991	  2.194775
  0.011996	  1.396626	  2.150915
  0.031109	  1.378649	  2.107312
  0.055971	  1.357527	  2.069592
  0.078047	  1.342581	  2.028075
  0.107338	  1.331257	  1.988087
  0.133328	  1.314461	  1.947270
  0.160893	  1.298212	  1.907332
  0.187423	  1.281739	  1.866130
  0.213413	  1.265999	  1.825573
  0.239011	  1.250789	  1.785316
  0.264033	  1.236161	  1.744981
  0.288279	  1.222149	  1.704572
  0.312086	  1.208567	  1.663530
  0.335263	  1.195184	  1.620563
  0.356253	  1.182450	  1.577062
  0.375911	  1.169994	  1.533867
  0.394916	  1.157172	  1.490321
  0.413869	  1.143231	  1.444867
  0.432316	  1.129244	  1.398273
  0.450212	  1.117185	  1.353289
  0.468988	  1.107126	  1.309211
  0.488084	  1.098887	  1.264366
  0.506408	  1.091003	  1.217819
  0.523769	  1.073101	  1.173861
  0.536863	  1.052851	  1.128550
  0.552477	  1.034376	  1.084413
  0.570668	  1.016837	  1.041379
  0.590461	  1.000345	  0.998595
  0.611563	  0.985901	  0.955442
  0.634751	  0.974490	  0.911873
  0.659895	  0.966418	  0.867908
  0.684777	  0.960414	  0.824080
  0.707771	  0.954998	  0.780350
  0.728159	  0.949065	  0.734422
  0.742359	  0.942470	  0.686124
  0.747084	  0.937195	  0.640142
  0.740109	  0.938111	  0.595717
  0.712563	  0.948149	  0.542120
  0.648529	  0.957780	  0.476127
  0.594095	  0.997256	  0.401189
  0.542665	  1.051763	  0.304423
  0.485406	  1.060183	  0.188232
  0.455131	  1.058971	  0.063801
  0.454977	  1.069017	 -0.031324
  0.460551	  1.065091	 -0.079012
  0.471502	  1.057932	 -0.119440
  0.505087	  1.032927	 -0.192421
  0.577558	  0.967976	 -0.262179
  0.691119	  0.926608	 -0.318017
  0.779854	  0.882030	 -0.323852
  0.839621	  0.836829	 -0.313943
  0.887560	  0.793157	 -0.303623
  0.941847	  0.743037	 -0.294243
  1.013008	  0.688317	 -0.279929
  1.088260	  0.650553	 -0.266402
  1.135019	  0.636526	 -0.270841
  1.163860	  0.628435	 -0.290217
  1.189162	  0.620472	 -0.325584
  1.211835	  0.613052	 -0.368395
  1.232007	  0.604644	 -0.413366
  1.252543	  0.596795	 -0.458583
  1.275499	  0.589769	 -0.503188
  1.300653	  0.583068	 -0.546439
  1.328273	  0.575618	 -0.589350
  1.356686	  0.566824	 -0.631674
  1.384068	  0.556987	 -0.672942
  1.409635	  0.546586	 -0.712660
  1.435460	  0.534675	 -0.754809
  1.460780	  0.521096	 -0.797283
  1.484449	  0.506850	 -0.837984
  1.507703	  0.491700	 -0.879103
  1.530396	  0.474497	 -0.921463
  1.550632	  0.457183	 -0.962604
  1.571174	  0.441846	 -1.004520
  1.592683	  0.428484	 -1.047295
  1.614526	  0.416326	 -1.090726
  1.636069	  0.403982	 -1.134080
  1.657174	  0.391080	 -1.178324
  1.677617	  0.377473	 -1.222428
  1.697602	  0.362939	 -1.266567
  1.717146	  0.347943	 -1.308496
  1.738119	  0.332763	 -1.351404
  1.758527	  0.316452	 -1.394007
  1.777155	  0.298991	 -1.437648
  1.793931	  0.281593	 -1.483079
  1.809941	  0.265276	 -1.528249
  1.825794	  0.249694	 -1.571652
  1.843102	  0.235274	 -1.614995
  1.862187	  0.222657	 -1.658541
  1.884563	  0.209858	 -1.703420
  1.909131	  0.194944	 -1.747296
  1.933994	  0.179246	 -1.789613
  1.957827	  0.163479	 -1.831151
  1.979808	  0.147951	 -1.872242
  2.003970	  0.134420	 -1.913217
  2.038131	  0.124664	 -1.949779
  2.056723	  0.105650	 -1.993343
  2.073763	  0.092444	 -2.038869
  2.102114	  0.085760	 -2.080811
  2.113659	  0.064260	 -2.127984
  2.134796	  0.064903	 -2.149264
