 -0.119276	 -1.649411	  1.833337
 -0.118155	 -1.654707	  1.834003
 -0.127745	 -1.609393	  1.828303
 -0.141442	 -1.557418	  1.820242
 -0.157085	 -1.506294	  1.810633
 -0.173371	 -1.455284	  1.800722
 -0.191183	 -1.406547	  1.792284
 -0.207436	 -1.363207	  1.788367
 -0.220695	 -1.320143	  1.789050
 -0.234474	 -1.273661	  1.791490
 -0.247412	 -1.227455	  1.793493
 -0.258971	 -1.180063	  1.795175
 -0.271356	 -1.129873	  1.796167
 -0.285040	 -1.079448	  1.796040
 -0.299656	 -1.029827	  1.795078
 -0.314904	 -0.980783	  1.793463
 -0.329635	 -0.933286	  1.791099
 -0.340895	 -0.893063	  1.789015
 -0.345482	 -0.858829	  1.788423
 -0.344865	 -0.818309	  1.787515
 -0.343479	 -0.767840	  1.786627
 -0.344597	 -0.714270	  1.785231
 -0.347288	 -0.658471	  1.779859
 -0.353195	 -0.596490	  1.768430
 -0.365942	 -0.535503	  1.755454
 -0.380620	 -0.482103	  1.741764
 -0.396385	 -0.432909	  1.726630
 -0.412481	 -0.387705	  1.710607
 -0.427575	 -0.345268	  1.695211
 -0.440334	 -0.303222	  1.681487
 -0.451272	 -0.260608	  1.668922
 -0.460150	 -0.217783	  1.658819
 -0.467035	 -0.174003	  1.651393
 -0.472328	 -0.128304	  1.646475
 -0.476293	 -0.081044	  1.643562
 -0.479325	 -0.031616	  1.641682
 -0.482565	  0.020369	  1.640322
 -0.487466	  0.075216	  1.640042
 -0.497541	  0.134097	  1.640068
 -0.513942	  0.191101	  1.636639
 -0.531025	  0.239946	  1.627307
 -0.544209	  0.280653	  1.616061
 -0.553152	  0.319316	  1.604981
 -0.559285	  0.360773	  1.593272
 -0.564038	  0.406214	  1.581420
 -0.567947	  0.454127	  1.571460
 -0.571276	  0.502303	  1.563810
 -0.574179	  0.550333	  1.557055
 -0.576871	  0.599330	  1.551211
 -0.580444	  0.654589	  1.547376
 -0.588129	  0.715008	  1.547325
 -0.601458	  0.776611	  1.551582
 -0.620686	  0.836703	  1.560448
 -0.647343	  0.897765	  1.575610
 -0.689095	  0.967372	  1.603172
 -0.754772	  1.044028	  1.652670
 -0.832461	  1.107251	  1.708936
 -0.885582	  1.147363	  1.739810
 -0.826973	  1.417567	  1.507398
 -0.823259	  1.469822	  1.481991
 -0.828990	  1.528941	  1.471387
 -0.841315	  1.581574	  1.469247
 -0.851797	  1.626926	  1.469230
 -0.860298	  1.674290	  1.464281
 -0.870611	  1.725699	  1.462211
 -0.890513	  1.819773	  1.449023
 -0.892089	  1.825971	  1.448027
