 -1.543122	  0.172921	  1.938271
 -1.552931	  0.172919	  1.945633
 -1.536554	  0.164276	  1.934927
 -1.524003	  0.158259	  1.917685
 -1.506225	  0.154451	  1.904564
 -1.490215	  0.156709	  1.895247
 -1.475526	  0.158250	  1.881262
 -1.464077	  0.161950	  1.865445
 -1.450761	  0.161869	  1.849641
 -1.433384	  0.162803	  1.837352
 -1.416586	  0.166324	  1.827280
 -1.400183	  0.169809	  1.814741
 -1.387186	  0.176405	  1.801325
 -1.374316	  0.181039	  1.786533
 -1.360153	  0.182364	  1.772072
 -1.345680	  0.182540	  1.758222
 -1.330564	  0.180543	  1.745440
 -1.314938	  0.175571	  1.734723
 -1.298517	  0.167201	  1.726907
 -1.283140	  0.159551	  1.719242
 -1.266337	  0.151440	  1.710376
 -1.244221	  0.141251	  1.696695
 -1.232211	  0.140175	  1.683317
 -1.224071	  0.141391	  1.670441
 -1.207560	  0.136750	  1.654828
 -1.190270	  0.130005	  1.642868
 -1.178291	  0.125839	  1.634488
 -1.158660	  0.114973	  1.619991
 -1.146663	  0.105116	  1.611400
 -1.130061	  0.094008	  1.600014
 -1.110045	  0.094250	  1.585004
 -1.097107	  0.096537	  1.576299
 -1.081430	  0.104835	  1.563880
 -1.065487	  0.110341	  1.545896
 -1.055109	  0.109419	  1.531060
 -1.041548	  0.106887	  1.516814
 -1.026200	  0.106571	  1.502956
 -1.012441	  0.105326	  1.489824
 -0.997789	  0.104068	  1.473234
 -0.982298	  0.107552	  1.457848
 -0.969399	  0.112719	  1.448824
 -0.951764	  0.119119	  1.436209
 -0.937395	  0.125437	  1.420019
 -0.927014	  0.128955	  1.405943
 -0.914485	  0.128481	  1.394653
 -0.898004	  0.131134	  1.379487
 -0.883295	  0.135157	  1.366019
 -0.869633	  0.136432	  1.353171
 -0.853938	  0.139213	  1.340680
 -0.836919	  0.148632	  1.328536
 -0.821763	  0.153464	  1.316715
 -0.807903	  0.152016	  1.304292
 -0.791043	  0.152114	  1.288596
 -0.776674	  0.156646	  1.278724
 -0.760942	  0.161840	  1.269252
 -0.741938	  0.164895	  1.252211
 -0.732960	  0.167704	  1.243288
 -0.717845	  0.174399	  1.230197
 -0.697544	  0.179872	  1.214068
 -0.683852	  0.178268	  1.202157
 -0.669515	  0.174285	  1.189130
 -0.655095	  0.171049	  1.173618
 -0.643214	  0.167600	  1.157370
 -0.631415	  0.164959	  1.141236
 -0.618544	  0.163463	  1.125439
 -0.605383	  0.160516	  1.109925
 -0.593226	  0.159282	  1.096076
 -0.576973	  0.163915	  1.079683
 -0.562500	  0.166156	  1.064142
 -0.553731	  0.158958	  1.049799
 -0.542528	  0.149290	  1.033627
 -0.527956	  0.142251	  1.020417
 -0.512912	  0.135775	  1.010783
 -0.497653	  0.127131	  1.001039
 -0.481665	  0.116385	  0.986363
 -0.465614	  0.108758	  0.969674
 -0.457421	  0.105081	  0.962034
 -0.441489	  0.097731	  0.949570
 -0.424236	  0.090505	  0.931172
 -0.414724	  0.088439	  0.919034
 -0.400477	  0.087976	  0.902800
 -0.383608	  0.089087	  0.890911
 -0.365209	  0.087760	  0.881325
 -0.346849	  0.084249	  0.873637
 -0.329242	  0.080090	  0.864384
 -0.313378	  0.076990	  0.852213
 -0.297386	  0.074056	  0.840580
 -0.281050	  0.073314	  0.829079
 -0.265071	  0.072942	  0.817519
 -0.252384	  0.071542	  0.804772
 -0.236982	  0.072188	  0.786757
 -0.222391	  0.076795	  0.771414
 -0.204291	  0.078409	  0.762940
 -0.184805	  0.076522	  0.757689
 -0.166508	  0.076082	  0.747532
 -0.153404	  0.076635	  0.734553
 -0.141550	  0.077573	  0.719568
 -0.120808	  0.080783	  0.701226
 -0.109697	  0.081054	  0.694935
 -0.092649	  0.079529	  0.682120
 -0.077177	  0.077925	  0.668374
 -0.064388	  0.075183	  0.655405
 -0.051172	  0.073936	  0.639839
 -0.034487	  0.076645	  0.619372
 -0.024935	  0.078161	  0.608308
 -0.012537	  0.073798	  0.590523
  0.000462	  0.066837	  0.578203
  0.018073	  0.063071	  0.566196
  0.035344	  0.059172	  0.557521
  0.050835	  0.054460	  0.544642
  0.064103	  0.051215	  0.530496
  0.073693	  0.049318	  0.513504
  0.086210	  0.048110	  0.495106
  0.103289	  0.047241	  0.482504
  0.128424	  0.046115	  0.473949
  0.143394	  0.044335	  0.466753
  0.156180	  0.041249	  0.456468
  0.170909	  0.033490	  0.442835
  0.189606	  0.025486	  0.431332
  0.205700	  0.023487	  0.421624
  0.223049	  0.022031	  0.411045
  0.240571	  0.021438	  0.401194
  0.257266	  0.025706	  0.390811
  0.276699	  0.034682	  0.373710
  0.289150	  0.038232	  0.361895
  0.302618	  0.039047	  0.350158
  0.321851	  0.036094	  0.341364
  0.338643	  0.036864	  0.329840
  0.353506	  0.039541	  0.315218
  0.365312	  0.041541	  0.299872
  0.381682	  0.040528	  0.288079
  0.402800	  0.039821	  0.277499
  0.418272	  0.042222	  0.265987
  0.432359	  0.046798	  0.251039
  0.443111	  0.052724	  0.237780
  0.455560	  0.059403	  0.222759
  0.465643	  0.064125	  0.202605
  0.474260	  0.066377	  0.182456
  0.485471	  0.066829	  0.169531
  0.503298	  0.069456	  0.157801
  0.520095	  0.071829	  0.146045
  0.534938	  0.073251	  0.132292
  0.550091	  0.074093	  0.119251
  0.565309	  0.074778	  0.106349
  0.581489	  0.074395	  0.094590
  0.598327	  0.073426	  0.083839
  0.615042	  0.072870	  0.072886
  0.631975	  0.072176	  0.062510
  0.649609	  0.070305	  0.053263
  0.667339	  0.068063	  0.044235
  0.684949	  0.066023	  0.034893
  0.702399	  0.064442	  0.025226
  0.719561	  0.063232	  0.015083
  0.736450	  0.062064	  0.004389
  0.753368	  0.060683	 -0.006199
  0.769898	  0.058950	 -0.017325
  0.786380	  0.057133	 -0.028503
  0.802507	  0.055479	 -0.040209
  0.818269	  0.054055	 -0.052434
  0.833723	  0.053313	 -0.065102
  0.848586	  0.053591	 -0.078476
  0.863572	  0.054230	 -0.091694
  0.878871	  0.055708	 -0.104468
  0.894179	  0.057151	 -0.117260
  0.909587	  0.057954	 -0.129991
  0.925028	  0.058597	 -0.142689
  0.940518	  0.059156	 -0.155327
  0.956234	  0.058835	 -0.167692
  0.971954	  0.058491	 -0.180053
  0.987704	  0.057714	 -0.192353
  1.003488	  0.056216	 -0.204544
  1.019264	  0.054696	 -0.216743
  1.034455	  0.052253	 -0.229519
  1.049160	  0.049106	 -0.242704
  1.063848	  0.045931	 -0.255901
  1.078007	  0.041514	 -0.269317
  1.091920	  0.036608	 -0.282819
  1.105810	  0.031806	 -0.296394
  1.119280	  0.025245	 -0.309661
  1.132632	  0.018730	 -0.322759
  1.145159	  0.014572	 -0.337865
  1.157443	  0.007190	 -0.355259
  1.168576	 -0.002977	 -0.369254
  1.180302	 -0.017329	 -0.376061
  1.191810	 -0.032406	 -0.383876
  1.204879	 -0.046510	 -0.391074
  1.220089	 -0.061447	 -0.399945
  1.232026	 -0.075441	 -0.411253
  1.236727	 -0.088842	 -0.427199
  1.237536	 -0.103574	 -0.441544
  1.235870	 -0.119077	 -0.452886
  1.240954	 -0.136015	 -0.462773
  1.249685	 -0.153257	 -0.472010
  1.257207	 -0.169291	 -0.483907
  1.261750	 -0.184651	 -0.502430
  1.258062	 -0.195924	 -0.519379
  1.253987	 -0.212419	 -0.535108
  1.250425	 -0.230375	 -0.551785
  1.247334	 -0.240851	 -0.562606
  1.246399	 -0.252343	 -0.580079
  1.239502	 -0.257185	 -0.598273
  1.225078	 -0.270935	 -0.612968
  1.209594	 -0.282064	 -0.624032
  1.198217	 -0.288528	 -0.641029
  1.187176	 -0.291546	 -0.656885
  1.177096	 -0.298960	 -0.672997
  1.167511	 -0.306795	 -0.688465
  1.160365	 -0.314917	 -0.705267
  1.153747	 -0.323565	 -0.722099
  1.147052	 -0.331288	 -0.739023
  1.150011	 -0.344146	 -0.752683
  1.157608	 -0.359664	 -0.762971
  1.165205	 -0.374966	 -0.772919
  1.169330	 -0.390505	 -0.784387
  1.175996	 -0.403013	 -0.797887
  1.194787	 -0.413145	 -0.811724
  1.211649	 -0.416923	 -0.820530
  1.222096	 -0.418538	 -0.829460
  1.239029	 -0.419285	 -0.846703
  1.254073	 -0.418905	 -0.855496
  1.269885	 -0.416044	 -0.861314
  1.289318	 -0.408833	 -0.871002
  1.306434	 -0.402743	 -0.884499
  1.316946	 -0.396375	 -0.895375
  1.332111	 -0.385418	 -0.900812
  1.350383	 -0.374469	 -0.903589
  1.364228	 -0.365471	 -0.909330
  1.377788	 -0.355100	 -0.912118
  1.395671	 -0.346071	 -0.903703
  1.413074	 -0.340777	 -0.899944
  1.431597	 -0.335358	 -0.905170
  1.455415	 -0.329737	 -0.906126
  1.473694	 -0.325408	 -0.894229
  1.486217	 -0.319618	 -0.877637
  1.493769	 -0.311280	 -0.861337
  1.507192	 -0.305441	 -0.847147
  1.527746	 -0.299395	 -0.834860
  1.543685	 -0.291228	 -0.824591
  1.553328	 -0.277701	 -0.817525
  1.558207	 -0.258784	 -0.812908
  1.571163	 -0.231651	 -0.799047
  1.584177	 -0.223153	 -0.790372
  1.599747	 -0.212096	 -0.783366
  1.616628	 -0.202155	 -0.780641
  1.631536	 -0.192278	 -0.780169
  1.646687	 -0.179183	 -0.779721
  1.668749	 -0.161530	 -0.771907
  1.679165	 -0.155099	 -0.775571
  1.696011	 -0.143814	 -0.771584
  1.712049	 -0.130303	 -0.770707
  1.725322	 -0.114911	 -0.772928
  1.737060	 -0.099773	 -0.779727
  1.747074	 -0.085946	 -0.788259
  1.758643	 -0.072817	 -0.798558
  1.774006	 -0.065605	 -0.812631
  1.789345	 -0.059091	 -0.823414
  1.802918	 -0.051980	 -0.831782
  1.819188	 -0.043576	 -0.843768
  1.836958	 -0.039411	 -0.857960
  1.848304	 -0.036456	 -0.869098
  1.858759	 -0.034322	 -0.888544
  1.865305	 -0.030124	 -0.906100
  1.878527	 -0.023427	 -0.923955
  1.889973	 -0.021003	 -0.939899
  1.902627	 -0.020552	 -0.954139
  1.916771	 -0.015574	 -0.969784
  1.929546	 -0.015990	 -0.991859
  1.936695	 -0.022755	 -1.007826
  1.946724	 -0.030765	 -1.021394
  1.960031	 -0.037038	 -1.037449
  1.972224	 -0.042811	 -1.052796
  1.984943	 -0.046726	 -1.067861
  1.997805	 -0.050898	 -1.082653
  2.010610	 -0.055768	 -1.097245
  2.023278	 -0.060982	 -1.111767
  2.036520	 -0.066226	 -1.125847
  2.049818	 -0.071288	 -1.139905
  2.063554	 -0.076391	 -1.153516
  2.078104	 -0.081585	 -1.166216
  2.092685	 -0.086760	 -1.178888
  2.107947	 -0.090969	 -1.191108
  2.123438	 -0.094835	 -1.203152
  2.138940	 -0.098698	 -1.215200
  2.154729	 -0.102620	 -1.227510
  2.171778	 -0.106601	 -1.241943
  2.186088	 -0.109590	 -1.255592
