  1.533927	  0.437962	 -1.931109
  1.532283	  0.438268	 -1.926144
  1.525798	  0.439473	 -1.906555
  1.521273	  0.437179	 -1.884723
  1.516585	  0.438897	 -1.870398
  1.510089	  0.440701	 -1.849044
  1.505922	  0.437759	 -1.826872
  1.503985	  0.434370	 -1.812209
  1.502185	  0.429123	 -1.789060
  1.498407	  0.428718	 -1.770431
  1.493732	  0.430277	 -1.752315
  1.488895	  0.430186	 -1.729956
  1.487037	  0.427035	 -1.714527
  1.486064	  0.419627	 -1.690718
  1.482594	  0.416423	 -1.665079
  1.478245	  0.418286	 -1.651276
  1.470283	  0.426621	 -1.637954
  1.460516	  0.433701	 -1.617056
  1.453566	  0.436778	 -1.597310
  1.447192	  0.438844	 -1.578294
  1.441379	  0.439149	 -1.559271
  1.435432	  0.440531	 -1.540240
  1.429699	  0.441800	 -1.520918
  1.423692	  0.442486	 -1.501610
  1.417575	  0.441238	 -1.482796
  1.411715	  0.440365	 -1.463624
  1.405888	  0.439727	 -1.444407
  1.399750	  0.439608	 -1.425355
  1.393150	  0.439628	 -1.406464
  1.386134	  0.439653	 -1.387747
  1.379416	  0.439782	 -1.368995
  1.372720	  0.441559	 -1.350182
  1.366117	  0.444101	 -1.331428
  1.358810	  0.445750	 -1.313049
  1.353202	  0.451673	 -1.296615
  1.345652	  0.462955	 -1.275712
  1.336519	  0.462783	 -1.257961
  1.326201	  0.449395	 -1.237976
  1.317763	  0.444418	 -1.216624
  1.311786	  0.447243	 -1.202157
  1.305915	  0.455415	 -1.185660
  1.301122	  0.467778	 -1.163597
  1.297125	  0.470012	 -1.142751
  1.291507	  0.465335	 -1.118390
  1.282649	  0.455365	 -1.098462
  1.276656	  0.448845	 -1.087221
  1.269630	  0.443311	 -1.071044
  1.259394	  0.445695	 -1.049193
  1.251269	  0.447202	 -1.032063
  1.245111	  0.444754	 -1.013665
  1.237311	  0.441492	 -0.997601
  1.228053	  0.440926	 -0.974893
  1.220025	  0.438041	 -0.954366
  1.210931	  0.432476	 -0.939308
  1.202244	  0.427332	 -0.926615
  1.190566	  0.423715	 -0.907460
  1.184083	  0.425842	 -0.887893
  1.179856	  0.431614	 -0.866372
  1.178133	  0.432658	 -0.855202
  1.171243	  0.436460	 -0.830093
  1.165235	  0.433185	 -0.804186
  1.161943	  0.426268	 -0.791537
  1.157991	  0.423955	 -0.772622
  1.151636	  0.415225	 -0.747028
  1.141118	  0.411433	 -0.728213
  1.131876	  0.414671	 -0.711781
  1.126354	  0.417488	 -0.700394
  1.121782	  0.424815	 -0.677322
  1.118348	  0.425561	 -0.660439
  1.113680	  0.422835	 -0.639915
  1.107192	  0.423608	 -0.619757
  1.102944	  0.427261	 -0.604023
  1.098200	  0.435301	 -0.583191
  1.091401	  0.436662	 -0.556978
  1.088577	  0.435303	 -0.545706
  1.082374	  0.431327	 -0.523765
  1.076123	  0.427829	 -0.503664
  1.070510	  0.424450	 -0.485973
  1.063731	  0.425284	 -0.463803
  1.059180	  0.429208	 -0.447965
  1.053570	  0.439680	 -0.429319
  1.047334	  0.445053	 -0.409154
  1.042265	  0.446104	 -0.392913
  1.035454	  0.446303	 -0.369866
  1.029858	  0.449885	 -0.353209
  1.025108	  0.456016	 -0.337036
  1.019161	  0.467569	 -0.310498
  1.015444	  0.473992	 -0.291953
  1.013683	  0.476909	 -0.279484
  1.008650	  0.471857	 -0.257282
  1.004520	  0.470154	 -0.236700
  0.998233	  0.471124	 -0.216319
  0.991733	  0.470702	 -0.196804
  0.987664	  0.466353	 -0.178532
  0.982122	  0.458903	 -0.158935
  0.972252	  0.452885	 -0.142137
  0.963807	  0.453496	 -0.123308
  0.958753	  0.452952	 -0.098200
  0.959856	  0.448683	 -0.082941
  0.969132	  0.436147	 -0.065468
  0.978627	  0.419870	 -0.046330
  0.981398	  0.411341	 -0.021393
  0.978351	  0.410273	 -0.004085
  0.971803	  0.404128	  0.011071
  0.967009	  0.396181	  0.031831
  0.961885	  0.393949	  0.054861
  0.950697	  0.395106	  0.072882
  0.936764	  0.393039	  0.088638
  0.926875	  0.388131	  0.106210
  0.920202	  0.385188	  0.125221
  0.912531	  0.383789	  0.143622
  0.905750	  0.383086	  0.162533
  0.898330	  0.383109	  0.181104
  0.891909	  0.382917	  0.200060
  0.886372	  0.382919	  0.219284
  0.880810	  0.382985	  0.238493
  0.874149	  0.383502	  0.257343
  0.867451	  0.384044	  0.276181
  0.860427	  0.384575	  0.294897
  0.851964	  0.384992	  0.313008
  0.843645	  0.385386	  0.331029
  0.839380	  0.388463	  0.347942
  0.836827	  0.399641	  0.364602
  0.820757	  0.410164	  0.379099
  0.801213	  0.404355	  0.405287
  0.797223	  0.397863	  0.419676
  0.793874	  0.391881	  0.432740
  0.787993	  0.388460	  0.455678
  0.784545	  0.389771	  0.486071
  0.778721	  0.390991	  0.504238
  0.771789	  0.393522	  0.514936
  0.755900	  0.396990	  0.532965
  0.743615	  0.401441	  0.548337
  0.734176	  0.405844	  0.564780
  0.724709	  0.409599	  0.585401
  0.718987	  0.411605	  0.600860
  0.713079	  0.414575	  0.620602
  0.705069	  0.416235	  0.639652
  0.692899	  0.416635	  0.658281
  0.679086	  0.417440	  0.676058
  0.671774	  0.418552	  0.691461
  0.667359	  0.418470	  0.704036
  0.658942	  0.413782	  0.731295
  0.653489	  0.412467	  0.744669
  0.644086	  0.407867	  0.769824
  0.641496	  0.406156	  0.787137
  0.641110	  0.408400	  0.804706
  0.640468	  0.415096	  0.828432
  0.639544	  0.419118	  0.845138
  0.636018	  0.421331	  0.864481
  0.619816	  0.420505	  0.896783
  0.615898	  0.418291	  0.902722
  0.607716	  0.419123	  0.921500
  0.594495	  0.417692	  0.942729
  0.589742	  0.417806	  0.954870
  0.582665	  0.421531	  0.970820
  0.577581	  0.432692	  0.997406
  0.567453	  0.442439	  1.016824
  0.560708	  0.448378	  1.027840
  0.557784	  0.462462	  1.042529
  0.556481	  0.481380	  1.053969
  0.553484	  0.501111	  1.063425
  0.547860	  0.518791	  1.069762
  0.538876	  0.534403	  1.080182
  0.527875	  0.553213	  1.089015
  0.520642	  0.576661	  1.092506
  0.516710	  0.594358	  1.089788
  0.511558	  0.610767	  1.086699
  0.504244	  0.633250	  1.087229
  0.500070	  0.649993	  1.085687
  0.495665	  0.665382	  1.082469
  0.486300	  0.686609	  1.084230
  0.479343	  0.704163	  1.085907
  0.471473	  0.721808	  1.091020
  0.462610	  0.737263	  1.102859
  0.454263	  0.750101	  1.116332
  0.445753	  0.761337	  1.131496
  0.438362	  0.769938	  1.148162
  0.433782	  0.775685	  1.167504
  0.424379	  0.780816	  1.185386
  0.411781	  0.785897	  1.203642
  0.402483	  0.787414	  1.220894
  0.395905	  0.787918	  1.236596
  0.389365	  0.788880	  1.254581
  0.383498	  0.792392	  1.273999
  0.377913	  0.797254	  1.293843
  0.374177	  0.798109	  1.313509
  0.369958	  0.798933	  1.332450
  0.366657	  0.794703	  1.351953
  0.364448	  0.787256	  1.370859
  0.364836	  0.778760	  1.389523
  0.369442	  0.766994	  1.403643
  0.373961	  0.757974	  1.420138
  0.379226	  0.748775	  1.435821
  0.386319	  0.740647	  1.450578
  0.397609	  0.731091	  1.465212
  0.407916	  0.714753	  1.478614
  0.411165	  0.692111	  1.481458
  0.412856	  0.674597	  1.480662
  0.420140	  0.658195	  1.485210
  0.425991	  0.625524	  1.500326
  0.421538	  0.606668	  1.512693
  0.417624	  0.596920	  1.522314
  0.410660	  0.580339	  1.543799
  0.409422	  0.569835	  1.556529
  0.409967	  0.555582	  1.573876
  0.409706	  0.541139	  1.592121
  0.409055	  0.531132	  1.601942
  0.402691	  0.517122	  1.618743
  0.397445	  0.502020	  1.637865
  0.394449	  0.491251	  1.647381
  0.391081	  0.477460	  1.661240
  0.388388	  0.465724	  1.675864
  0.390156	  0.448327	  1.691486
  0.390895	  0.432043	  1.707008
  0.390067	  0.419246	  1.718432
  0.386659	  0.404704	  1.735249
  0.378685	  0.394965	  1.753100
  0.371053	  0.391914	  1.765634
  0.358692	  0.392370	  1.787324
  0.349447	  0.394759	  1.809449
  0.344605	  0.389940	  1.833042
  0.341261	  0.386909	  1.846271
  0.337138	  0.381017	  1.866230
  0.332462	  0.375333	  1.885591
  0.327591	  0.367998	  1.900805
  0.315547	  0.354178	  1.922724
  0.310457	  0.347109	  1.932157
  0.303072	  0.337837	  1.947647
  0.290761	  0.330284	  1.972792
  0.284135	  0.328953	  1.987524
  0.274656	  0.329443	  2.006224
  0.262208	  0.331819	  2.025391
  0.251684	  0.333195	  2.045696
  0.247154	  0.334582	  2.058298
  0.240695	  0.338524	  2.077526
  0.230024	  0.341369	  2.099771
  0.221541	  0.340520	  2.118073
  0.217206	  0.340369	  2.131891
  0.210985	  0.341803	  2.155374
  0.200855	  0.342999	  2.177010
  0.193169	  0.344121	  2.191462
  0.182656	  0.345659	  2.207630
  0.172283	  0.349680	  2.224858
  0.162841	  0.361819	  2.242088
  0.159440	  0.375767	  2.261574
  0.159268	  0.385921	  2.281939
  0.158658	  0.390556	  2.296943
  0.154448	  0.392208	  2.317890
  0.150480	  0.389785	  2.338368
  0.143541	  0.385924	  2.359629
  0.134869	  0.383328	  2.378854
  0.130132	  0.382272	  2.396868
  0.126335	  0.379383	  2.414734
  0.118544	  0.374986	  2.433518
  0.106314	  0.373873	  2.469598
  0.105227	  0.374455	  2.474940
