  2.296666	  0.712798	 -0.680190
  2.313671	  0.718790	 -0.681359
  2.294847	  0.712160	 -0.680062
  2.275988	  0.705639	 -0.678712
  2.257066	  0.699326	 -0.677256
  2.238142	  0.693024	 -0.675796
  2.219172	  0.686871	 -0.674276
  2.200185	  0.680781	 -0.672731
  2.181188	  0.674722	 -0.671176
  2.162035	  0.669224	 -0.669465
  2.142876	  0.663749	 -0.667748
  2.123676	  0.658427	 -0.666006
  2.104361	  0.653570	 -0.664183
  2.085041	  0.648731	 -0.662358
  2.065684	  0.644034	 -0.660557
  2.046288	  0.639531	 -0.658790
  2.026752	  0.635583	 -0.657218
  2.007070	  0.631900	 -0.656227
  1.987419	  0.627953	 -0.655254
  1.967975	  0.623102	 -0.653854
  1.948802	  0.617474	 -0.652135
  1.930062	  0.610626	 -0.649755
  1.911695	  0.603079	 -0.646803
  1.893190	  0.596028	 -0.644168
  1.874092	  0.590258	 -0.642994
  1.854892	  0.584813	 -0.641909
  1.835505	  0.580151	 -0.641222
  1.815916	  0.576417	 -0.641192
  1.796299	  0.572801	 -0.641227
  1.776516	  0.570070	 -0.641825
  1.756604	  0.568233	 -0.642748
  1.736687	  0.565602	 -0.643742
  1.717081	  0.561104	 -0.645037
  1.697978	  0.555365	 -0.646062
  1.679017	  0.549316	 -0.647140
  1.660782	  0.548606	 -0.648454
  1.638328	  0.554984	 -0.651717
  1.616694	  0.550515	 -0.654128
  1.596510	  0.534098	 -0.652480
  1.582816	  0.520248	 -0.649223
  1.569614	  0.504387	 -0.646862
  1.553904	  0.489629	 -0.646710
  1.538463	  0.479110	 -0.645733
  1.510843	  0.465942	 -0.640552
  1.498326	  0.459054	 -0.637890
  1.487304	  0.453248	 -0.635453
  1.462045	  0.447088	 -0.631786
  1.447152	  0.440403	 -0.629770
  1.430191	  0.432788	 -0.629972
  1.399834	  0.421061	 -0.627460
  1.386309	  0.415131	 -0.623302
  1.380168	  0.412832	 -0.620036
  1.367594	  0.404970	 -0.613777
  1.348604	  0.392171	 -0.603075
  1.318391	  0.380532	 -0.596531
  1.301827	  0.375130	 -0.595382
  1.291377	  0.370908	 -0.594433
  1.263712	  0.357177	 -0.597546
  1.233912	  0.348911	 -0.601631
  1.221153	  0.349880	 -0.602431
  1.206784	  0.345813	 -0.602813
  1.192273	  0.344869	 -0.600628
  1.169869	  0.336663	 -0.594062
  1.149868	  0.331094	 -0.590998
  1.134242	  0.329074	 -0.590770
  1.103763	  0.330295	 -0.593219
  1.084102	  0.330411	 -0.596870
  1.074443	  0.330901	 -0.598647
  1.052451	  0.331080	 -0.602891
  1.026872	  0.329122	 -0.603383
  1.014390	  0.327415	 -0.602532
  0.989710	  0.321725	 -0.600310
  0.965652	  0.316362	 -0.599313
  0.955519	  0.314261	 -0.598375
  0.930669	  0.307314	 -0.597830
  0.905408	  0.300255	 -0.600148
  0.893158	  0.296829	 -0.600978
  0.880395	  0.296843	 -0.599744
  0.858964	  0.294965	 -0.592964
  0.835929	  0.291770	 -0.587453
  0.814815	  0.288632	 -0.585297
  0.794014	  0.282562	 -0.584595
  0.777172	  0.275513	 -0.586414
  0.760693	  0.268312	 -0.587515
  0.741745	  0.259801	 -0.587014
  0.720624	  0.252714	 -0.590716
  0.701555	  0.245595	 -0.593561
  0.687935	  0.237153	 -0.595546
  0.673119	  0.222815	 -0.600085
  0.655900	  0.205742	 -0.605095
  0.630281	  0.195088	 -0.608764
  0.618210	  0.190703	 -0.607834
  0.598918	  0.187648	 -0.606689
  0.579485	  0.182089	 -0.604248
  0.562617	  0.171955	 -0.599134
  0.537242	  0.163011	 -0.588747
  0.516924	  0.157715	 -0.587467
  0.507659	  0.156106	 -0.587452
  0.484347	  0.151939	 -0.588156
  0.454077	  0.150412	 -0.583312
  0.438940	  0.147538	 -0.580680
  0.426538	  0.143166	 -0.579041
  0.406732	  0.137397	 -0.582287
  0.385578	  0.130093	 -0.583900
  0.366037	  0.122995	 -0.584024
  0.346279	  0.115985	 -0.583909
  0.328896	  0.108817	 -0.584112
  0.304897	  0.096767	 -0.582102
  0.291894	  0.091829	 -0.580782
  0.274601	  0.088007	 -0.580211
  0.250584	  0.084754	 -0.579194
  0.234654	  0.081190	 -0.577328
  0.213546	  0.072724	 -0.573349
  0.191637	  0.066192	 -0.572669
  0.181480	  0.063951	 -0.572316
  0.154003	  0.057925	 -0.571419
  0.128720	  0.048257	 -0.569312
  0.119185	  0.043405	 -0.567336
  0.107781	  0.035147	 -0.563285
  0.084695	  0.028011	 -0.555693
  0.064390	  0.025479	 -0.553145
  0.044620	  0.021809	 -0.553275
  0.025543	  0.016974	 -0.558043
  0.008866	  0.014988	 -0.568483
 -0.010387	  0.015603	 -0.577388
 -0.030603	  0.014053	 -0.584786
 -0.057135	  0.009317	 -0.587515
 -0.069169	  0.007628	 -0.589264
 -0.088922	  0.003300	 -0.591262
 -0.121697	  0.000320	 -0.594401
 -0.134339	 -0.001131	 -0.591964
 -0.153085	 -0.003320	 -0.590973
 -0.182074	 -0.006293	 -0.597572
 -0.188365	 -0.008068	 -0.597823
 -0.208940	 -0.017272	 -0.601021
 -0.232317	 -0.025139	 -0.601796
 -0.246445	 -0.029031	 -0.605462
 -0.267523	 -0.037196	 -0.606876
 -0.292739	 -0.041499	 -0.613357
 -0.304513	 -0.041906	 -0.617865
 -0.324644	 -0.044959	 -0.624241
 -0.347294	 -0.044805	 -0.632689
 -0.364370	 -0.043186	 -0.636355
 -0.382731	 -0.042351	 -0.641991
 -0.410331	 -0.043116	 -0.642067
 -0.430010	 -0.047392	 -0.638175
 -0.449500	 -0.056448	 -0.633628
 -0.464701	 -0.065470	 -0.630496
 -0.483881	 -0.074167	 -0.627376
 -0.503401	 -0.078268	 -0.624218
 -0.523104	 -0.078806	 -0.622054
 -0.542766	 -0.078728	 -0.619934
 -0.563170	 -0.079011	 -0.617571
 -0.583028	 -0.080356	 -0.615681
 -0.602444	 -0.083220	 -0.614144
 -0.621895	 -0.086555	 -0.613478
 -0.641310	 -0.089535	 -0.614849
 -0.659510	 -0.089879	 -0.617540
 -0.678636	 -0.089930	 -0.618298
 -0.709259	 -0.083665	 -0.615268
 -0.731936	 -0.076572	 -0.606220
 -0.741592	 -0.073269	 -0.600930
 -0.757637	 -0.070145	 -0.589076
 -0.777581	 -0.066661	 -0.581011
 -0.796194	 -0.065180	 -0.577709
 -0.815544	 -0.065798	 -0.576909
 -0.836182	 -0.067367	 -0.578067
 -0.856247	 -0.070137	 -0.578377
 -0.880241	 -0.074159	 -0.577332
 -0.897918	 -0.073062	 -0.576787
 -0.920883	 -0.070009	 -0.578383
 -0.940551	 -0.065915	 -0.579793
 -0.962274	 -0.059715	 -0.579143
 -0.983897	 -0.052987	 -0.574849
 -0.995334	 -0.046672	 -0.573212
 -1.015190	 -0.039490	 -0.571621
 -1.031747	 -0.032740	 -0.572006
 -1.052213	 -0.025920	 -0.575555
 -1.071674	 -0.020663	 -0.580069
 -1.088573	 -0.016836	 -0.582297
 -1.113337	 -0.013892	 -0.580523
 -1.137615	 -0.009616	 -0.577574
 -1.151759	 -0.007242	 -0.577345
 -1.167006	 -0.003419	 -0.578754
 -1.182942	  0.000836	 -0.580685
 -1.201775	  0.007276	 -0.587280
 -1.222112	  0.012401	 -0.596930
 -1.236323	  0.010724	 -0.606188
 -1.260893	  0.013200	 -0.614009
 -1.281200	  0.016268	 -0.617415
 -1.291473	  0.015874	 -0.620620
 -1.305551	  0.016287	 -0.624626
 -1.334226	  0.019349	 -0.634017
 -1.354418	  0.014788	 -0.645256
 -1.375775	  0.021295	 -0.652416
 -1.388879	  0.027829	 -0.660265
 -1.401417	  0.030502	 -0.673265
 -1.414702	  0.028375	 -0.691241
 -1.429510	  0.027942	 -0.708918
 -1.443290	  0.029282	 -0.723443
 -1.453720	  0.029733	 -0.733322
 -1.467560	  0.027603	 -0.752048
 -1.476016	  0.025390	 -0.766705
 -1.486648	  0.028413	 -0.780764
 -1.494613	  0.026041	 -0.797001
 -1.508493	  0.012036	 -0.830961
 -1.511841	  0.006372	 -0.839111
 -1.519186	 -0.005996	 -0.852996
 -1.526099	 -0.016858	 -0.863292
 -1.534684	 -0.034879	 -0.875404
 -1.546540	 -0.051461	 -0.883118
 -1.561014	 -0.067223	 -0.887824
 -1.575629	 -0.079105	 -0.890110
 -1.587331	 -0.087454	 -0.889347
 -1.595388	 -0.094508	 -0.886064
 -1.609180	 -0.109483	 -0.882999
 -1.616983	 -0.122475	 -0.878229
 -1.622356	 -0.138861	 -0.868149
 -1.628024	 -0.154014	 -0.849117
 -1.630131	 -0.162348	 -0.833261
 -1.630702	 -0.174347	 -0.813314
 -1.631700	 -0.183721	 -0.801129
 -1.630092	 -0.195106	 -0.786612
 -1.632352	 -0.208457	 -0.765294
 -1.637685	 -0.215514	 -0.748550
 -1.642209	 -0.223455	 -0.731950
 -1.644820	 -0.237196	 -0.714250
 -1.646560	 -0.248500	 -0.703221
 -1.647176	 -0.265084	 -0.689711
 -1.653057	 -0.278113	 -0.666855
 -1.661525	 -0.279290	 -0.644996
 -1.670078	 -0.277379	 -0.624372
 -1.675610	 -0.285073	 -0.605963
 -1.677007	 -0.298015	 -0.594569
 -1.679712	 -0.317422	 -0.583816
 -1.685658	 -0.331428	 -0.568536
 -1.691082	 -0.342798	 -0.552723
 -1.696237	 -0.353884	 -0.536996
 -1.703574	 -0.366421	 -0.523441
 -1.711808	 -0.379283	 -0.510584
 -1.720017	 -0.392220	 -0.497734
 -1.728270	 -0.405349	 -0.485103
 -1.736486	 -0.418325	 -0.472283
 -1.744723	 -0.431278	 -0.459478
 -1.752965	 -0.444402	 -0.446996
 -1.764818	 -0.457555	 -0.438195
 -1.778031	 -0.470896	 -0.431430
 -1.791245	 -0.484113	 -0.424319
 -1.804480	 -0.497468	 -0.417506
 -1.817718	 -0.510780	 -0.410595
 -1.830901	 -0.524060	 -0.403591
 -1.844383	 -0.537205	 -0.397296
 -1.861010	 -0.547901	 -0.395577
 -1.877901	 -0.558525	 -0.393923
 -1.894800	 -0.569165	 -0.392504
 -1.911777	 -0.579690	 -0.391932
 -1.928738	 -0.590208	 -0.391003
 -1.946432	 -0.599768	 -0.390732
 -1.964849	 -0.607920	 -0.392023
 -1.983017	 -0.616251	 -0.393917
 -2.001260	 -0.623768	 -0.398206
 -2.019827	 -0.629710	 -0.404047
 -2.038280	 -0.634681	 -0.408711
 -2.056871	 -0.637927	 -0.409723
 -2.076910	 -0.639121	 -0.409717
 -2.095568	 -0.643983	 -0.412810
 -2.118894	 -0.651400	 -0.421560
 -2.139014	 -0.657112	 -0.427582
 -2.154694	 -0.662105	 -0.428680
 -2.174290	 -0.670588	 -0.428790
 -2.193938	 -0.679481	 -0.430540
 -2.212705	 -0.687379	 -0.433009
 -2.224034	 -0.690412	 -0.435100
 -2.247934	 -0.688953	 -0.442499
 -2.277037	 -0.682856	 -0.451738
 -2.296786	 -0.682147	 -0.458034
 -2.311667	 -0.681990	 -0.461667
 -2.330242	 -0.681346	 -0.459019
 -2.353520	 -0.684485	 -0.451974
 -2.372119	 -0.691775	 -0.428189
 -2.391905	 -0.694278	 -0.426695
