  1.484740	  0.113523	  2.134398
  1.470301	  0.119386	  2.153802
  1.481904	  0.114674	  2.138208
  1.493017	  0.110441	  2.122128
  1.503733	  0.106587	  2.105686
  1.514689	  0.103003	  2.089343
  1.526621	  0.100578	  2.073476
  1.538755	  0.098530	  2.057710
  1.551737	  0.098210	  2.042499
  1.564781	  0.097785	  2.027344
  1.578783	  0.095562	  2.013238
  1.592785	  0.093338	  1.999131
  1.607267	  0.090025	  1.985741
  1.621923	  0.086279	  1.972657
  1.636636	  0.082488	  1.959651
  1.651446	  0.078617	  1.946780
  1.666274	  0.074743	  1.933930
  1.681331	  0.070830	  1.921361
  1.696388	  0.066916	  1.908793
  1.711598	  0.062827	  1.896467
  1.726869	  0.058668	  1.884240
  1.742140	  0.054432	  1.872038
  1.757408	  0.049987	  1.859909
  1.772676	  0.045543	  1.847780
  1.787828	  0.040776	  1.835626
  1.802927	  0.035866	  1.823464
  1.818010	  0.030930	  1.811293
  1.832834	  0.025579	  1.798979
  1.847658	  0.020228	  1.786666
  1.862410	  0.014619	  1.774381
  1.877069	  0.008693	  1.762134
  1.891739	  0.002716	  1.749925
  1.906748	 -0.005848	  1.739856
  1.921757	 -0.014413	  1.729787
  1.936265	 -0.024386	  1.720297
  1.950399	 -0.035235	  1.711214
  1.964534	 -0.046084	  1.702130
  1.977295	 -0.057744	  1.692070
  1.989611	 -0.069633	  1.681727
  2.001927	 -0.081521	  1.671384
  2.013618	 -0.093079	  1.659995
  2.024959	 -0.104443	  1.648068
  2.036300	 -0.115806	  1.636140
  2.047640	 -0.127170	  1.624213
  2.058981	 -0.138533	  1.612286
  2.074936	 -0.154923	  1.593901
  2.085782	 -0.166082	  1.581338
