 -2.212221	  0.881321	 -0.239181
 -2.232551	  0.911004	 -0.270977
 -2.224753	  0.898466	 -0.257486
 -2.216968	  0.885928	 -0.243989
 -2.209355	  0.873392	 -0.230392
 -2.202292	  0.860944	 -0.216423
 -2.195252	  0.848515	 -0.202425
 -2.188343	  0.836498	 -0.188010
 -2.181587	  0.825037	 -0.173079
 -2.174753	  0.813579	 -0.158189
 -2.167444	  0.802890	 -0.142952
 -2.159926	  0.792561	 -0.127567
 -2.152405	  0.782313	 -0.112102
 -2.144839	  0.771978	 -0.096739
 -2.137459	  0.761332	 -0.081501
 -2.130548	  0.750365	 -0.066214
 -2.123914	  0.739531	 -0.050718
 -2.117981	  0.728763	 -0.035266
 -2.110341	  0.716304	 -0.022477
 -2.104745	  0.704421	 -0.010014
 -2.103770	  0.687404	  0.009939
 -2.101272	  0.673537	  0.024388
 -2.087813	  0.663340	  0.034023
 -2.067744	  0.654322	  0.042546
 -2.052507	  0.644091	  0.054527
 -2.047369	  0.633095	  0.068074
 -2.045658	  0.615668	  0.085711
 -2.039185	  0.598631	  0.100300
 -2.030007	  0.588368	  0.110489
 -2.020519	  0.580652	  0.124431
 -2.012513	  0.573533	  0.142160
 -1.999381	  0.568241	  0.156978
 -1.982077	  0.559254	  0.170803
 -1.972666	  0.545228	  0.184537
 -1.969791	  0.534119	  0.196813
 -1.962302	  0.524111	  0.213132
 -1.950794	  0.512938	  0.226495
 -1.937573	  0.499770	  0.236894
 -1.928870	  0.487479	  0.251567
 -1.923276	  0.477792	  0.268377
 -1.918823	  0.469118	  0.285981
 -1.911780	  0.458222	  0.301653
 -1.904874	  0.447465	  0.317013
 -1.900903	  0.437217	  0.333704
 -1.897829	  0.427149	  0.349903
 -1.899269	  0.419054	  0.366807
 -1.902920	  0.415272	  0.387169
 -1.897085	  0.405551	  0.410254
 -1.893531	  0.395698	  0.423176
 -1.894472	  0.385760	  0.437125
 -1.895345	  0.376962	  0.462538
 -1.896108	  0.370936	  0.478155
 -1.900756	  0.366409	  0.492335
 -1.908734	  0.361804	  0.515226
 -1.913146	  0.357234	  0.537191
 -1.917293	  0.354803	  0.548518
 -1.930124	  0.353812	  0.566640
 -1.940094	  0.353524	  0.586247
 -1.946000	  0.349750	  0.602750
 -1.954533	  0.342842	  0.621501
 -1.964673	  0.341853	  0.640749
 -1.975629	  0.346319	  0.658893
 -1.989102	  0.350537	  0.668483
 -2.010744	  0.352631	  0.677191
 -2.033362	  0.347585	  0.690233
 -2.045985	  0.343069	  0.703330
 -2.055633	  0.343663	  0.717448
 -2.071889	  0.344966	  0.732412
 -2.087619	  0.339863	  0.748382
 -2.094255	  0.334930	  0.764532
 -2.101683	  0.336591	  0.783258
 -2.104185	  0.342953	  0.805992
 -2.105248	  0.343165	  0.827327
 -2.114319	  0.337885	  0.851411
 -2.121224	  0.340739	  0.862112
 -2.125580	  0.348920	  0.872392
 -2.131314	  0.357768	  0.885170
 -2.125346	  0.379031	  0.901029
 -2.112830	  0.395204	  0.907621
 -2.102568	  0.403165	  0.911538
 -2.084690	  0.411388	  0.923650
 -2.071748	  0.422804	  0.938425
 -2.062773	  0.435561	  0.950061
 -2.054475	  0.444518	  0.960462
 -2.039037	  0.459773	  0.973136
 -2.028762	  0.471775	  0.985544
 -2.018783	  0.485124	  0.996442
 -2.013946	  0.496001	  1.008101
 -2.006879	  0.516278	  1.021516
 -1.995840	  0.530945	  1.037311
 -1.990695	  0.537692	  1.043837
 -1.975736	  0.544991	  1.060461
 -1.963945	  0.554630	  1.076397
 -1.953194	  0.563287	  1.092531
 -1.943358	  0.577040	  1.108194
 -1.939600	  0.591473	  1.119785
 -1.936391	  0.604788	  1.132912
 -1.930951	  0.616956	  1.155076
 -1.927557	  0.622608	  1.168827
 -1.920414	  0.627524	  1.188648
 -1.912439	  0.635604	  1.204917
 -1.903507	  0.645976	  1.225000
 -1.894574	  0.651370	  1.245249
 -1.888104	  0.656992	  1.256225
 -1.876572	  0.666819	  1.275093
 -1.867880	  0.675015	  1.293338
 -1.863040	  0.671933	  1.307181
 -1.858052	  0.658872	  1.333635
 -1.851565	  0.657299	  1.355553
 -1.841761	  0.656685	  1.370663
 -1.835859	  0.646641	  1.387760
 -1.834574	  0.635010	  1.410886
 -1.833182	  0.628074	  1.422783
 -1.829174	  0.613634	  1.437035
 -1.826482	  0.600320	  1.454945
 -1.825684	  0.590280	  1.472440
 -1.822684	  0.580931	  1.489186
 -1.818478	  0.566389	  1.504792
 -1.812884	  0.548757	  1.515662
 -1.808121	  0.530677	  1.525528
 -1.806843	  0.512926	  1.534433
 -1.808827	  0.497229	  1.546811
 -1.810945	  0.478641	  1.559796
 -1.806573	  0.459481	  1.565882
 -1.799525	  0.440508	  1.572764
 -1.794346	  0.419888	  1.577957
 -1.791806	  0.399809	  1.582124
 -1.791279	  0.379679	  1.584190
 -1.789287	  0.360454	  1.588652
 -1.788342	  0.340633	  1.591632
 -1.786591	  0.320844	  1.596074
 -1.785652	  0.299262	  1.594146
 -1.782243	  0.277486	  1.597350
 -1.780173	  0.257443	  1.593774
 -1.778385	  0.238049	  1.590238
 -1.774608	  0.218348	  1.589831
 -1.772485	  0.198372	  1.586780
 -1.770581	  0.178904	  1.583548
 -1.768406	  0.159206	  1.580683
 -1.764950	  0.139313	  1.579889
 -1.763165	  0.119172	  1.575554
 -1.760290	  0.099627	  1.568209
 -1.755620	  0.079039	  1.563277
 -1.750652	  0.061164	  1.555093
 -1.747114	  0.043930	  1.545280
 -1.742054	  0.026257	  1.537828
 -1.737758	  0.008857	  1.529170
 -1.732253	 -0.007649	  1.521976
 -1.727615	 -0.023957	  1.518250
 -1.723321	 -0.030700	  1.522353
 -1.717121	 -0.042604	  1.520887
 -1.708824	 -0.052997	  1.530264
 -1.696465	 -0.061143	  1.541291
 -1.687197	 -0.072380	  1.557063
 -1.684663	 -0.081933	  1.566965
 -1.673757	 -0.087309	  1.581539
 -1.664368	 -0.100349	  1.598660
 -1.662122	 -0.108698	  1.609470
 -1.654337	 -0.120423	  1.628308
 -1.646972	 -0.135786	  1.642090
 -1.637169	 -0.148440	  1.652819
 -1.624268	 -0.160421	  1.667274
 -1.617584	 -0.163942	  1.680912
 -1.607710	 -0.173624	  1.696487
 -1.595076	 -0.184604	  1.708724
 -1.584059	 -0.193801	  1.724236
 -1.578046	 -0.200603	  1.742032
 -1.569918	 -0.209840	  1.758419
 -1.560569	 -0.222104	  1.772501
 -1.551378	 -0.230039	  1.790249
 -1.545799	 -0.235026	  1.811679
 -1.539378	 -0.241393	  1.828106
 -1.528052	 -0.251839	  1.842535
 -1.518645	 -0.267903	  1.849992
 -1.508886	 -0.282001	  1.863659
 -1.500420	 -0.295516	  1.879014
 -1.492524	 -0.307514	  1.892658
 -1.484302	 -0.319750	  1.906059
 -1.475939	 -0.331358	  1.919573
 -1.468491	 -0.344783	  1.932293
 -1.458493	 -0.353933	  1.945457
 -1.450116	 -0.366098	  1.957981
 -1.440746	 -0.376844	  1.970979
 -1.430653	 -0.387677	  1.984943
 -1.420977	 -0.395875	  2.000662
 -1.412970	 -0.407578	  2.014689
 -1.406001	 -0.417528	  2.030142
 -1.398510	 -0.427936	  2.045935
 -1.390396	 -0.437097	  2.062066
 -1.382212	 -0.446690	  2.078067
 -1.375959	 -0.458870	  2.092823
 -1.367390	 -0.467238	  2.108773
 -1.358254	 -0.479836	  2.122563
 -1.350561	 -0.491730	  2.136663
 -1.340232	 -0.502655	  2.149530
 -1.329238	 -0.513819	  2.162560
 -1.319932	 -0.527726	  2.174788
 -1.310338	 -0.540930	  2.187178
 -1.299335	 -0.553348	  2.200671
 -1.291351	 -0.567995	  2.212382
 -1.283034	 -0.581351	  2.223896
 -1.274383	 -0.593167	  2.236050
 -1.266155	 -0.604926	  2.247916
 -1.258221	 -0.617884	  2.260890
 -1.247638	 -0.626918	  2.274905
 -1.239307	 -0.637918	  2.287936
 -1.230452	 -0.647138	  2.301031
 -1.220792	 -0.658552	  2.315339
 -1.210818	 -0.671617	  2.329657
 -1.199752	 -0.685353	  2.345587
 -1.192779	 -0.700060	  2.357495
 -1.184831	 -0.711917	  2.369691
 -1.178410	 -0.726359	  2.381364
 -1.171147	 -0.739192	  2.394213
 -1.159007	 -0.749592	  2.411435
 -1.163549	 -0.787844	  2.420855
 -1.155189	 -0.799902	  2.434447
