 -2.350441	  0.648647	 -0.429986
 -2.352804	  0.649779	 -0.430191
 -2.336152	  0.639588	 -0.429526
 -2.319821	  0.626387	 -0.429540
 -2.304705	  0.616211	 -0.431177
 -2.284685	  0.610977	 -0.430340
 -2.252977	  0.603876	 -0.422801
 -2.240477	  0.602123	 -0.420198
 -2.228006	  0.597080	 -0.417557
 -2.204061	  0.587130	 -0.414882
 -2.184240	  0.584402	 -0.411796
 -2.166760	  0.583662	 -0.408592
 -2.144751	  0.580601	 -0.404809
 -2.123366	  0.580779	 -0.401536
 -2.107545	  0.580943	 -0.399389
 -2.085711	  0.578735	 -0.396258
 -2.060570	  0.579192	 -0.394566
 -2.046520	  0.583471	 -0.396159
 -2.023823	  0.590895	 -0.401923
 -2.000876	  0.593568	 -0.397708
 -1.987467	  0.594265	 -0.386495
 -1.967859	  0.598246	 -0.382256
 -1.944383	  0.598887	 -0.378742
 -1.927136	  0.597761	 -0.368716
 -1.910309	  0.598568	 -0.360956
 -1.888187	  0.599302	 -0.358287
 -1.868156	  0.598541	 -0.351361
 -1.853227	  0.597858	 -0.338072
 -1.835829	  0.597531	 -0.327184
 -1.817082	  0.596627	 -0.319514
 -1.798569	  0.595666	 -0.311987
 -1.780182	  0.592964	 -0.304569
 -1.761979	  0.589265	 -0.297153
 -1.743768	  0.585547	 -0.289768
 -1.725495	  0.581296	 -0.282840
 -1.707194	  0.575192	 -0.277568
 -1.688885	  0.569068	 -0.272344
 -1.670445	  0.562692	 -0.267961
 -1.651810	  0.555560	 -0.266613
 -1.633178	  0.548407	 -0.265323
 -1.614684	  0.540965	 -0.263724
 -1.596346	  0.533224	 -0.261770
 -1.578014	  0.525474	 -0.259822
 -1.559976	  0.516975	 -0.259081
 -1.543352	  0.508087	 -0.259809
 -1.530777	  0.496032	 -0.261395
 -1.512483	  0.477553	 -0.250123
 -1.491668	  0.469234	 -0.240164
 -1.475568	  0.468712	 -0.238970
 -1.453083	  0.472868	 -0.242442
 -1.426970	  0.467144	 -0.236595
 -1.413934	  0.458734	 -0.226191
 -1.404381	  0.449793	 -0.215811
 -1.388076	  0.435059	 -0.201591
 -1.374477	  0.418138	 -0.191019
 -1.363977	  0.409089	 -0.186091
 -1.343472	  0.403615	 -0.182421
 -1.325018	  0.404708	 -0.178905
 -1.305195	  0.406650	 -0.171438
 -1.280602	  0.396423	 -0.164030
 -1.270093	  0.384839	 -0.158831
 -1.255473	  0.367885	 -0.153376
 -1.231350	  0.343890	 -0.152400
 -1.215821	  0.335872	 -0.150532
 -1.196719	  0.331358	 -0.153265
 -1.186022	  0.331134	 -0.151245
 -1.163944	  0.333205	 -0.152044
 -1.143380	  0.332268	 -0.144760
 -1.121276	  0.331190	 -0.135843
 -1.101850	  0.330924	 -0.127697
 -1.083737	  0.327299	 -0.122461
 -1.064073	  0.321510	 -0.120443
 -1.039467	  0.313750	 -0.117747
 -1.028975	  0.310747	 -0.116430
 -1.006409	  0.301315	 -0.113571
 -0.985376	  0.291739	 -0.106778
 -0.974393	  0.285714	 -0.101694
 -0.956249	  0.275706	 -0.094094
 -0.932367	  0.262317	 -0.085950
 -0.916750	  0.254766	 -0.082118
 -0.903388	  0.250656	 -0.080588
 -0.879712	  0.245206	 -0.082669
 -0.857070	  0.242672	 -0.083660
 -0.835280	  0.241407	 -0.083349
 -0.820212	  0.242072	 -0.082142
 -0.799876	  0.248256	 -0.076990
 -0.780552	  0.248549	 -0.069545
 -0.758121	  0.244460	 -0.062702
 -0.739127	  0.236624	 -0.059942
 -0.724489	  0.226158	 -0.061322
 -0.703087	  0.214150	 -0.060804
 -0.684406	  0.208915	 -0.057329
 -0.667892	  0.207183	 -0.053448
 -0.646554	  0.203426	 -0.048360
 -0.629147	  0.200184	 -0.045028
 -0.606058	  0.196041	 -0.041269
 -0.586556	  0.183249	 -0.041107
 -0.573809	  0.174461	 -0.041785
 -0.555388	  0.161770	 -0.042685
 -0.537116	  0.157511	 -0.040026
 -0.517327	  0.156755	 -0.034212
 -0.497263	  0.153276	 -0.025207
 -0.476361	  0.143344	 -0.017792
 -0.460688	  0.133049	 -0.016125
 -0.440749	  0.122471	 -0.017116
 -0.424442	  0.117287	 -0.016553
 -0.408163	  0.114157	 -0.013389
 -0.385506	  0.109864	 -0.005880
 -0.364634	  0.104421	  0.001721
 -0.351582	  0.101410	  0.003998
 -0.331746	  0.096437	  0.007168
 -0.315412	  0.090003	  0.016125
 -0.300065	  0.083580	  0.027395
 -0.281021	  0.073714	  0.035916
 -0.260316	  0.065449	  0.035564
 -0.236106	  0.061681	  0.035594
 -0.216251	  0.058877	  0.040742
 -0.202830	  0.057685	  0.044137
 -0.183907	  0.054419	  0.053639
 -0.164401	  0.047409	  0.060506
 -0.148001	  0.043388	  0.061698
 -0.119768	  0.040130	  0.062530
 -0.102372	  0.035794	  0.067267
 -0.091767	  0.033901	  0.072312
 -0.072462	  0.028256	  0.082960
 -0.050302	  0.018889	  0.088284
 -0.035060	  0.009917	  0.090800
 -0.019117	 -0.004670	  0.093088
  0.003381	 -0.019423	  0.092870
  0.020879	 -0.026210	  0.093661
  0.032707	 -0.028784	  0.094186
  0.057253	 -0.036318	  0.097007
  0.078548	 -0.043368	  0.101862
  0.097575	 -0.045441	  0.106044
  0.114246	 -0.043289	  0.106972
  0.135624	 -0.044324	  0.105950
  0.156214	 -0.045645	  0.109335
  0.177231	 -0.045245	  0.115800
  0.196100	 -0.051197	  0.119470
  0.211334	 -0.061395	  0.120185
  0.227001	 -0.075889	  0.122869
  0.250507	 -0.092801	  0.130768
  0.265895	 -0.096785	  0.134537
  0.281416	 -0.098632	  0.136836
  0.305164	 -0.106581	  0.141359
  0.325194	 -0.110334	  0.146109
  0.342247	 -0.110871	  0.147758
  0.362446	 -0.115207	  0.149887
  0.383600	 -0.117789	  0.153707
  0.401928	 -0.117599	  0.153178
  0.420739	 -0.122399	  0.148875
  0.438645	 -0.133643	  0.150412
  0.456851	 -0.140868	  0.155760
  0.475575	 -0.145059	  0.158659
  0.494359	 -0.150638	  0.159901
  0.511305	 -0.161874	  0.159959
  0.528351	 -0.172877	  0.161480
  0.545123	 -0.183567	  0.160765
  0.562805	 -0.193448	  0.160850
  0.581607	 -0.201794	  0.159437
  0.601617	 -0.205015	  0.157430
  0.622442	 -0.200412	  0.161836
  0.646054	 -0.202003	  0.183232
  0.660792	 -0.216006	  0.195140
  0.676521	 -0.225213	  0.202462
  0.691239	 -0.239347	  0.205097
  0.707169	 -0.250667	  0.208622
  0.726615	 -0.257615	  0.217212
  0.739966	 -0.260744	  0.225394
  0.759419	 -0.265205	  0.234383
  0.779569	 -0.266051	  0.242287
  0.795497	 -0.266919	  0.248580
  0.813281	 -0.270522	  0.257815
  0.833832	 -0.275142	  0.272880
  0.846747	 -0.276085	  0.280665
  0.866855	 -0.272848	  0.290144
  0.892802	 -0.271286	  0.294626
  0.910987	 -0.274159	  0.297560
  0.924154	 -0.278508	  0.298211
  0.944945	 -0.285721	  0.300596
  0.966863	 -0.291950	  0.311176
  0.985596	 -0.293462	  0.316587
  1.005374	 -0.291656	  0.314781
  1.026782	 -0.291544	  0.310827
  1.048604	 -0.290720	  0.311061
  1.070303	 -0.289108	  0.317441
  1.088093	 -0.290167	  0.325444
  1.105155	 -0.298107	  0.329328
  1.125006	 -0.309281	  0.330793
  1.141157	 -0.322478	  0.331403
  1.159712	 -0.331022	  0.334081
  1.178497	 -0.337508	  0.337627
  1.196549	 -0.345730	  0.340706
  1.214300	 -0.354384	  0.343232
  1.232238	 -0.362664	  0.346009
  1.250548	 -0.369965	  0.349637
  1.270295	 -0.372994	  0.349426
  1.289793	 -0.371788	  0.345208
  1.309218	 -0.370497	  0.340798
  1.323886	 -0.367981	  0.327494
  1.337816	 -0.365367	  0.313386
  1.351739	 -0.362750	  0.299269
  1.365661	 -0.360133	  0.285151
  1.379577	 -0.357570	  0.271024
  1.392920	 -0.358734	  0.256189
  1.404941	 -0.364305	  0.241217
  1.416943	 -0.369942	  0.226245
  1.428946	 -0.375577	  0.211273
  1.441277	 -0.380858	  0.196565
  1.454997	 -0.384885	  0.182307
  1.468486	 -0.388875	  0.167766
  1.480036	 -0.395129	  0.154418
  1.495958	 -0.400930	  0.150748
  1.517271	 -0.403447	  0.152236
  1.542447	 -0.410248	  0.139950
  1.557140	 -0.420819	  0.129060
  1.566524	 -0.426342	  0.121491
  1.579420	 -0.435001	  0.116818
  1.596534	 -0.445533	  0.113124
  1.613923	 -0.457175	  0.110200
  1.629348	 -0.470828	  0.109249
  1.642705	 -0.484856	  0.113395
  1.656731	 -0.495751	  0.122860
  1.673454	 -0.503761	  0.134165
  1.691859	 -0.509321	  0.144208
  1.713222	 -0.515327	  0.148223
  1.734432	 -0.526696	  0.148846
  1.750328	 -0.539803	  0.144963
  1.764522	 -0.553620	  0.141532
  1.778697	 -0.568187	  0.139060
  1.791917	 -0.583693	  0.135891
  1.805837	 -0.599266	  0.132326
  1.818728	 -0.614389	  0.126746
  1.832431	 -0.628194	  0.121916
  1.846048	 -0.641924	  0.116828
  1.858888	 -0.656265	  0.112687
  1.869757	 -0.672032	  0.114916
  1.881467	 -0.687378	  0.123819
  1.891386	 -0.700714	  0.134141
  1.895644	 -0.713710	  0.132144
  1.902113	 -0.725933	  0.144846
  1.914488	 -0.738820	  0.156774
  1.919063	 -0.745264	  0.161913
  1.921013	 -0.756577	  0.170128
  1.923250	 -0.765356	  0.191944
  1.932861	 -0.772065	  0.207482
  1.940989	 -0.782678	  0.214694
  1.942026	 -0.778687	  0.233506
  1.945987	 -0.775073	  0.259908
  1.948018	 -0.774532	  0.286740
  1.947468	 -0.774352	  0.299938
  1.945444	 -0.770735	  0.311397
  1.950889	 -0.759301	  0.325978
  1.962860	 -0.762312	  0.343019
  1.971013	 -0.761669	  0.350357
  1.991041	 -0.765280	  0.356113
  2.008928	 -0.765190	  0.361218
  2.024262	 -0.766789	  0.362581
  2.043359	 -0.769052	  0.364892
  2.067480	 -0.775549	  0.372204
  2.080008	 -0.780109	  0.377050
  2.097108	 -0.792118	  0.385975
  2.114650	 -0.804581	  0.395614
  2.127552	 -0.811169	  0.401892
  2.141656	 -0.817370	  0.407314
  2.164005	 -0.826172	  0.410785
  2.185539	 -0.833650	  0.419975
  2.200907	 -0.838037	  0.429693
  2.215141	 -0.843601	  0.442566
  2.234615	 -0.848747	  0.454240
  2.254111	 -0.851838	  0.458460
  2.269266	 -0.852539	  0.458606
  2.287488	 -0.857587	  0.456166
  2.311750	 -0.866107	  0.461065
  2.323109	 -0.870833	  0.490230
  2.341898	 -0.875287	  0.495441
