  1.023265	 -1.078077	  2.015425
  1.024240	 -1.079274	  2.017933
  1.008636	 -1.060104	  1.977781
  0.992923	 -1.040006	  1.935413
  0.977270	 -1.020418	  1.892142
  0.961395	 -1.001431	  1.848160
  0.944847	 -0.983044	  1.803364
  0.927539	 -0.965552	  1.758379
  0.909231	 -0.948828	  1.713275
  0.890897	 -0.931928	  1.669797
  0.873802	 -0.911566	  1.628579
  0.857598	 -0.886178	  1.589871
  0.840969	 -0.855845	  1.551703
  0.821985	 -0.823416	  1.512365
  0.800023	 -0.793895	  1.471443
  0.779404	 -0.770991	  1.434942
  0.764048	 -0.751990	  1.399458
  0.749246	 -0.731214	  1.358893
  0.733278	 -0.707038	  1.315950
  0.716072	 -0.680813	  1.273935
  0.698318	 -0.653801	  1.233512
  0.680699	 -0.627419	  1.194808
  0.664066	 -0.602476	  1.157230
  0.648237	 -0.579264	  1.118523
  0.632307	 -0.557925	  1.076895
  0.614960	 -0.539161	  1.030586
  0.595765	 -0.524869	  0.981688
  0.575664	 -0.513500	  0.932587
  0.553905	 -0.502722	  0.883046
  0.530872	 -0.491055	  0.834987
  0.507518	 -0.478445	  0.789459
  0.484263	 -0.465147	  0.745698
  0.461609	 -0.450779	  0.703475
  0.439726	 -0.434559	  0.662133
  0.418670	 -0.416689	  0.621713
  0.399638	 -0.397359	  0.583954
  0.382488	 -0.375945	  0.547711
  0.365230	 -0.350125	  0.509077
  0.345477	 -0.320824	  0.467343
  0.321737	 -0.290745	  0.424937
  0.294341	 -0.261403	  0.383612
  0.265770	 -0.234997	  0.345341
  0.238620	 -0.210481	  0.310253
  0.212780	 -0.186650	  0.276238
  0.189019	 -0.164276	  0.243129
  0.168024	 -0.142528	  0.210806
  0.149032	 -0.120497	  0.177723
  0.131822	 -0.097721	  0.142650
  0.115550	 -0.075014	  0.105177
  0.100475	 -0.053542	  0.065326
  0.085753	 -0.032487	  0.022610
  0.070153	 -0.010903	 -0.022356
  0.053638	  0.011355	 -0.067175
  0.036183	  0.034796	 -0.110532
  0.018400	  0.059068	 -0.151511
  0.000591	  0.084285	 -0.190955
 -0.017579	  0.110576	 -0.230319
 -0.036445	  0.136835	 -0.270494
 -0.056427	  0.162880	 -0.312956
 -0.079047	  0.188018	 -0.357897
 -0.103810	  0.210461	 -0.402601
 -0.129972	  0.230128	 -0.446643
 -0.157600	  0.247446	 -0.490287
 -0.186290	  0.262576	 -0.532983
 -0.214413	  0.275566	 -0.573513
 -0.241827	  0.287359	 -0.612571
 -0.268658	  0.298642	 -0.650382
 -0.295136	  0.310626	 -0.686540
 -0.321221	  0.323824	 -0.720286
 -0.347761	  0.338505	 -0.753127
 -0.377639	  0.356809	 -0.789156
 -0.413256	  0.382469	 -0.830632
 -0.453835	  0.416177	 -0.875005
 -0.494833	  0.452883	 -0.918420
 -0.534096	  0.487515	 -0.959711
 -0.574058	  0.520379	 -1.001226
 -0.610684	  0.546321	 -1.032163
 -0.636922	  0.565641	 -1.060324
 -0.658499	  0.581243	 -1.084536
 -0.673746	  0.593268	 -1.106746
 -0.688221	  0.605000	 -1.131354
 -0.702679	  0.617094	 -1.162713
 -0.718819	  0.628578	 -1.205877
 -0.733647	  0.636456	 -1.251178
 -0.743084	  0.645065	 -1.291714
 -0.749124	  0.655290	 -1.336102
 -0.756498	  0.672560	 -1.380134
 -0.762885	  0.691276	 -1.427464
 -0.770047	  0.712063	 -1.484926
 -0.777568	  0.735335	 -1.546923
 -0.784537	  0.759189	 -1.606035
 -0.790162	  0.782103	 -1.658477
 -0.795453	  0.803767	 -1.704878
 -0.801235	  0.824657	 -1.747171
 -0.807707	  0.845733	 -1.787620
 -0.814853	  0.867569	 -1.827550
 -0.821808	  0.889902	 -1.866920
 -0.827753	  0.912496	 -1.905978
 -0.832802	  0.935893	 -1.946265
 -0.837834	  0.961172	 -1.988672
 -0.844509	  0.989822	 -2.035194
 -0.856362	  1.022840	 -2.090403
 -0.866367	  1.043601	 -2.126082
