 -1.613210	 -0.903106	  1.657947
 -1.630310	 -0.875284	  1.681061
 -1.621883	 -0.889779	  1.670135
 -1.612638	 -0.904312	  1.659951
 -1.603418	 -0.918920	  1.649868
 -1.593621	 -0.933581	  1.640695
 -1.584609	 -0.945637	  1.631098
 -1.574577	 -0.961689	  1.620926
 -1.563921	 -0.981103	  1.612648
 -1.552839	 -0.993104	  1.605555
 -1.537897	 -1.003619	  1.596753
 -1.523130	 -1.019010	  1.587872
 -1.518522	 -1.034002	  1.583016
 -1.515686	 -1.055433	  1.576902
 -1.505635	 -1.077577	  1.568316
 -1.494437	 -1.087041	  1.560592
 -1.480111	 -1.099160	  1.550164
 -1.470599	 -1.114882	  1.542161
 -1.466266	 -1.131704	  1.535694
 -1.459456	 -1.152783	  1.526514
 -1.449292	 -1.166119	  1.517185
 -1.438812	 -1.177009	  1.506293
 -1.430048	 -1.191854	  1.493278
 -1.424613	 -1.205343	  1.481875
 -1.418802	 -1.220508	  1.468526
 -1.408778	 -1.239465	  1.454574
 -1.403851	 -1.248039	  1.447310
 -1.398725	 -1.261603	  1.430812
 -1.393356	 -1.274865	  1.415481
 -1.385582	 -1.285727	  1.400512
 -1.375799	 -1.292756	  1.384972
 -1.364149	 -1.301625	  1.369446
 -1.354183	 -1.316416	  1.355594
 -1.348493	 -1.331986	  1.341854
 -1.347064	 -1.338572	  1.327508
 -1.344144	 -1.347112	  1.306789
 -1.339956	 -1.353686	  1.287594
 -1.332929	 -1.361017	  1.270035
 -1.325725	 -1.368270	  1.252787
 -1.318379	 -1.375014	  1.235397
 -1.310640	 -1.381447	  1.218180
 -1.302441	 -1.388422	  1.201375
 -1.294450	 -1.395840	  1.184541
 -1.286390	 -1.404821	  1.168613
 -1.278531	 -1.412091	  1.153453
 -1.269171	 -1.418525	  1.136618
 -1.257543	 -1.425799	  1.118998
 -1.246069	 -1.440338	  1.102115
 -1.240614	 -1.450998	  1.094069
 -1.229202	 -1.464365	  1.080507
 -1.215512	 -1.477618	  1.072657
 -1.207179	 -1.491697	  1.068833
 -1.199732	 -1.521617	  1.054616
 -1.202296	 -1.534340	  1.036263
 -1.203736	 -1.549923	  1.018252
 -1.203646	 -1.555570	  1.009197
 -1.195655	 -1.569836	  0.994471
 -1.179865	 -1.585996	  0.992529
 -1.167635	 -1.603093	  0.986474
 -1.161107	 -1.620390	  0.975535
 -1.151984	 -1.640967	  0.962621
 -1.145753	 -1.652457	  0.955733
 -1.137232	 -1.671840	  0.944407
 -1.132068	 -1.686965	  0.933366
 -1.126825	 -1.696561	  0.924516
 -1.117618	 -1.711027	  0.912011
 -1.106132	 -1.727111	  0.899295
 -1.097667	 -1.739119	  0.888167
 -1.088808	 -1.753087	  0.878486
 -1.075911	 -1.767924	  0.868754
 -1.064319	 -1.781377	  0.856604
 -1.055084	 -1.790265	  0.847936
 -1.043443	 -1.800710	  0.836672
 -1.032324	 -1.814035	  0.821071
 -1.020021	 -1.828515	  0.806453
 -1.015344	 -1.837686	  0.797018
 -1.005815	 -1.852119	  0.779690
 -0.994429	 -1.862232	  0.764791
 -0.978737	 -1.875118	  0.757764
 -0.966761	 -1.887070	  0.757776
 -0.953794	 -1.904663	  0.752045
 -0.943307	 -1.921312	  0.745832
 -0.933343	 -1.937631	  0.739937
 -0.923831	 -1.954200	  0.734025
 -0.915338	 -1.971308	  0.728092
 -0.906879	 -1.988444	  0.722188
 -0.899018	 -2.005611	  0.715592
 -0.891326	 -2.022757	  0.708756
 -0.883605	 -2.039789	  0.701660
 -0.875659	 -2.056251	  0.693544
 -0.867710	 -2.072707	  0.685419
 -0.859099	 -2.088236	  0.676214
 -0.850120	 -2.103171	  0.666399
 -0.841112	 -2.118048	  0.656551
 -0.831502	 -2.131316	  0.646434
 -0.819501	 -2.144744	  0.639278
 -0.803207	 -2.158102	  0.634906
 -0.789410	 -2.175208	  0.619694
 -0.784305	 -2.184578	  0.605812
 -0.775255	 -2.195078	  0.594020
 -0.762227	 -2.208117	  0.581907
 -0.753486	 -2.218788	  0.568921
 -0.743472	 -2.230030	  0.556313
 -0.731170	 -2.242554	  0.544123
 -0.722603	 -2.253337	  0.531062
 -0.712272	 -2.265229	  0.517851
 -0.700873	 -2.277170	  0.506347
 -0.691899	 -2.288313	  0.493262
 -0.680289	 -2.301227	  0.480728
 -0.664202	 -2.315582	  0.472126
 -0.654869	 -2.325038	  0.464263
 -0.648865	 -2.336451	  0.446282
 -0.642987	 -2.346866	  0.428869
 -0.634001	 -2.358204	  0.414454
 -0.625109	 -2.369349	  0.400427
 -0.616534	 -2.380533	  0.386539
 -0.609654	 -2.394312	  0.374790
 -0.598513	 -2.402611	  0.357633
 -0.589849	 -2.413552	  0.343307
