 -1.586119	 -0.569831	 -1.570693
 -1.593098	 -0.579809	 -1.567520
 -1.600077	 -0.589787	 -1.564347
 -1.588908	 -0.575738	 -1.569390
 -1.573564	 -0.557959	 -1.573710
 -1.565412	 -0.544338	 -1.577802
 -1.552452	 -0.529711	 -1.583962
 -1.537548	 -0.513907	 -1.588055
 -1.528953	 -0.498707	 -1.593381
 -1.516101	 -0.485209	 -1.599695
 -1.501318	 -0.468931	 -1.605330
 -1.490276	 -0.452401	 -1.610007
 -1.482186	 -0.438246	 -1.617272
 -1.470613	 -0.423922	 -1.624960
 -1.457595	 -0.409053	 -1.631695
 -1.444727	 -0.394998	 -1.637836
 -1.431608	 -0.381199	 -1.643958
 -1.418437	 -0.367447	 -1.650075
 -1.404505	 -0.354432	 -1.656115
 -1.390569	 -0.341419	 -1.662155
 -1.376365	 -0.328854	 -1.668081
 -1.362530	 -0.315730	 -1.673433
 -1.349809	 -0.302334	 -1.678463
 -1.333358	 -0.288452	 -1.687769
 -1.318546	 -0.279325	 -1.695712
 -1.302394	 -0.269412	 -1.698791
 -1.286553	 -0.257321	 -1.703682
 -1.271740	 -0.245488	 -1.711138
 -1.256243	 -0.235183	 -1.715710
 -1.237953	 -0.225474	 -1.718368
 -1.220949	 -0.215271	 -1.724968
 -1.209478	 -0.202016	 -1.732612
 -1.196906	 -0.187643	 -1.739336
 -1.180282	 -0.175649	 -1.750021
 -1.163789	 -0.167511	 -1.756098
 -1.148544	 -0.157789	 -1.758047
 -1.131275	 -0.146124	 -1.762569
 -1.116658	 -0.134006	 -1.769729
 -1.103544	 -0.120655	 -1.776169
 -1.088943	 -0.107881	 -1.782079
 -1.074482	 -0.095349	 -1.787980
 -1.060467	 -0.082397	 -1.793964
 -1.046455	 -0.069441	 -1.799947
 -1.033373	 -0.055649	 -1.806162
 -1.020422	 -0.041746	 -1.812405
 -1.007723	 -0.027637	 -1.818704
 -0.995935	 -0.012839	 -1.825192
 -0.984148	  0.001958	 -1.831679
 -0.972856	  0.017207	 -1.838001
 -0.961784	  0.032647	 -1.844248
 -0.950714	  0.048163	 -1.850307
 -0.939650	  0.063793	 -1.856076
 -0.928586	  0.079423	 -1.861845
 -0.916734	  0.094310	 -1.867939
 -0.905497	  0.109743	 -1.873739
 -0.893582	  0.125016	 -1.879995
 -0.879958	  0.137807	 -1.887071
 -0.866593	  0.150664	 -1.893800
 -0.853931	  0.165257	 -1.900517
 -0.839240	  0.177636	 -1.908382
 -0.824884	  0.187874	 -1.915366
 -0.808421	  0.199482	 -1.923498
 -0.793592	  0.211971	 -1.932069
 -0.777330	  0.217556	 -1.940213
 -0.761307	  0.224860	 -1.947440
 -0.744317	  0.233636	 -1.955368
 -0.727873	  0.242301	 -1.963272
 -0.711958	  0.251772	 -1.971008
 -0.696183	  0.261357	 -1.978709
 -0.680589	  0.271159	 -1.986502
 -0.665015	  0.280985	 -1.994306
 -0.649562	  0.290960	 -2.002161
 -0.634359	  0.301236	 -2.010116
 -0.619157	  0.311512	 -2.018071
 -0.604228	  0.322198	 -2.026005
 -0.589374	  0.332992	 -2.033932
 -0.574601	  0.343898	 -2.041859
 -0.560037	  0.355084	 -2.049781
 -0.545473	  0.366270	 -2.057704
 -0.531203	  0.377753	 -2.065736
 -0.517049	  0.389350	 -2.073809
 -0.502949	  0.401004	 -2.081893
 -0.489391	  0.413182	 -2.090040
 -0.475052	  0.424769	 -2.097766
 -0.460907	  0.436908	 -2.105929
 -0.448323	  0.449912	 -2.114399
 -0.436919	  0.463683	 -2.122890
 -0.424650	  0.477332	 -2.131198
 -0.412499	  0.490912	 -2.139449
 -0.400586	  0.504744	 -2.147616
 -0.388978	  0.518943	 -2.155593
 -0.377369	  0.533143	 -2.163569
 -0.366130	  0.547764	 -2.171307
 -0.354929	  0.562370	 -2.178997
 -0.343448	  0.576350	 -2.186176
 -0.330726	  0.589706	 -2.192075
 -0.316379	  0.606668	 -2.199510
 -0.309967	  0.620849	 -2.210330
 -0.298654	  0.635374	 -2.218144
 -0.287341	  0.649899	 -2.225958
