 -0.114070	  1.648486	 -1.882654
 -0.098340	  1.683107	 -1.906309
 -0.105664	  1.668022	 -1.895410
 -0.113057	  1.653027	 -1.884432
 -0.120607	  1.638241	 -1.873281
 -0.128440	  1.623844	 -1.861818
 -0.136272	  1.609447	 -1.850356
 -0.144862	  1.595413	 -1.838987
 -0.153512	  1.581408	 -1.827627
 -0.162753	  1.567812	 -1.816236
 -0.172377	  1.554494	 -1.804835
 -0.182050	  1.541288	 -1.793343
 -0.191942	  1.528612	 -1.781449
 -0.201834	  1.515937	 -1.769555
 -0.211986	  1.503592	 -1.757533
 -0.222259	  1.491404	 -1.745453
 -0.232616	  1.479226	 -1.733435
 -0.243264	  1.467085	 -1.721635
 -0.253912	  1.454944	 -1.709836
 -0.264686	  1.442598	 -1.698370
 -0.275503	  1.430181	 -1.687020
 -0.286294	  1.417678	 -1.675741
 -0.297009	  1.404917	 -1.664680
 -0.307724	  1.392156	 -1.653619
 -0.318140	  1.379153	 -1.642553
 -0.328452	  1.366069	 -1.631487
 -0.338657	  1.352912	 -1.620407
 -0.348574	  1.339567	 -1.609292
 -0.358492	  1.326221	 -1.598178
 -0.368322	  1.312743	 -1.587145
 -0.378118	  1.299216	 -1.576144
 -0.387884	  1.285655	 -1.565155
 -0.397500	  1.271936	 -1.554231
 -0.407116	  1.258218	 -1.543307
 -0.416538	  1.244405	 -1.532334
 -0.425803	  1.230516	 -1.521322
 -0.435068	  1.216627	 -1.510310
 -0.443793	  1.202704	 -1.498907
 -0.452473	  1.188779	 -1.487472
 -0.460890	  1.174883	 -1.475808
 -0.468618	  1.161080	 -1.463571
 -0.476346	  1.147276	 -1.451334
 -0.483188	  1.133682	 -1.438358
 -0.489485	  1.120236	 -1.424958
 -0.495782	  1.106790	 -1.411558
 -0.499710	  1.093722	 -1.396937
 -0.503293	  1.080727	 -1.382162
 -0.506877	  1.067733	 -1.367387
 -0.507276	  1.055145	 -1.351850
 -0.507336	  1.042620	 -1.336258
 -0.507396	  1.030095	 -1.320665
 -0.507097	  1.017816	 -1.304881
 -0.506660	  1.005634	 -1.289026
 -0.506223	  0.993451	 -1.273170
 -0.507276	  0.981144	 -1.257440
 -0.509196	  0.968798	 -1.241824
 -0.512127	  0.956206	 -1.226564
 -0.517035	  0.943242	 -1.212147
 -0.523757	  0.929037	 -1.199776
 -0.531213	  0.914723	 -1.187965
 -0.542526	  0.900966	 -1.178868
 -0.553839	  0.887208	 -1.169771
 -0.565152	  0.873451	 -1.160674
 -0.578816	  0.861595	 -1.152145
 -0.594298	  0.851665	 -1.144290
 -0.609780	  0.841736	 -1.136435
 -0.625263	  0.831806	 -1.128581
 -0.640745	  0.821877	 -1.120726
 -0.656098	  0.811771	 -1.112841
 -0.670368	  0.800324	 -1.104758
 -0.684638	  0.788878	 -1.096674
 -0.698908	  0.777431	 -1.088591
 -0.713178	  0.765984	 -1.080507
 -0.726783	  0.753669	 -1.072556
 -0.739115	  0.739913	 -1.064895
 -0.750833	  0.725472	 -1.057537
 -0.760751	  0.709334	 -1.051117
 -0.769730	  0.692465	 -1.045217
 -0.777397	  0.674863	 -1.039615
 -0.784630	  0.657044	 -1.034123
 -0.790816	  0.638751	 -1.028916
 -0.797002	  0.620458	 -1.023710
 -0.802829	  0.601987	 -1.018723
 -0.808405	  0.583397	 -1.013893
 -0.813981	  0.564808	 -1.009062
 -0.819465	  0.546149	 -1.004396
 -0.824822	  0.527398	 -0.999955
 -0.830179	  0.508648	 -0.995515
 -0.835576	  0.489911	 -0.991064
 -0.840999	  0.471183	 -0.986608
 -0.846524	  0.452515	 -0.982030
 -0.852302	  0.434001	 -0.977145
 -0.858147	  0.415526	 -0.972194
 -0.864511	  0.397372	 -0.966723
 -0.870876	  0.379219	 -0.961251
 -0.877795	  0.361483	 -0.955122
 -0.884800	  0.343816	 -0.948892
 -0.891952	  0.326329	 -0.942330
 -0.899257	  0.309041	 -0.935419
 -0.906562	  0.291753	 -0.928509
 -0.913829	  0.274806	 -0.920763
 -0.921095	  0.257861	 -0.913014
 -0.928370	  0.241087	 -0.904907
 -0.935652	  0.224690	 -0.896069
 -0.942933	  0.208293	 -0.887230
 -0.950339	  0.192338	 -0.877713
 -0.957797	  0.176593	 -0.867890
 -0.965255	  0.160848	 -0.858068
 -0.973080	  0.145745	 -0.847547
 -0.980915	  0.130664	 -0.837004
 -0.988918	  0.115890	 -0.826156
 -0.997221	  0.101706	 -0.814760
 -1.005524	  0.087522	 -0.803363
 -1.014229	  0.074292	 -0.791149
 -1.023009	  0.061256	 -0.778781
 -1.031920	  0.048761	 -0.765956
 -1.041047	  0.037333	 -0.752315
 -1.050173	  0.025904	 -0.738673
 -1.059454	  0.016072	 -0.723935
 -1.068802	  0.008060	 -0.708174
 -1.078150	  0.000049	 -0.692412
 -1.087498	 -0.007962	 -0.676651
 -1.096705	 -0.012065	 -0.659376
 -1.105555	 -0.013205	 -0.641477
 -1.114404	 -0.014345	 -0.623577
 -1.123254	 -0.015485	 -0.605678
 -1.132100	 -0.016576	 -0.587774
 -1.140881	 -0.016774	 -0.569806
 -1.149663	 -0.016972	 -0.551838
 -1.158445	 -0.017170	 -0.533870
 -1.167226	 -0.017368	 -0.515903
 -1.175672	 -0.017795	 -0.497778
 -1.183809	 -0.018429	 -0.479519
 -1.191946	 -0.019064	 -0.461260
 -1.199849	 -0.019765	 -0.442902
 -1.207052	 -0.020665	 -0.424266
 -1.213978	 -0.022437	 -0.405587
 -1.220587	 -0.025146	 -0.386906
 -1.226450	 -0.029605	 -0.368312
 -1.232279	 -0.034137	 -0.349725
 -1.237956	 -0.038758	 -0.331112
 -1.242591	 -0.043963	 -0.312366
 -1.247226	 -0.049168	 -0.293620
 -1.251861	 -0.054374	 -0.274873
 -1.256028	 -0.059927	 -0.256117
 -1.259615	 -0.065900	 -0.237370
 -1.263203	 -0.071873	 -0.218623
 -1.266687	 -0.078777	 -0.200178
 -1.270054	 -0.086627	 -0.182094
 -1.273586	 -0.095878	 -0.164717
 -1.277212	 -0.105994	 -0.147850
 -1.280976	 -0.117418	 -0.131871
 -1.284832	 -0.129829	 -0.116670
 -1.288689	 -0.142241	 -0.101468
 -1.292396	 -0.155296	 -0.086778
 -1.295777	 -0.169594	 -0.073208
 -1.299159	 -0.183891	 -0.059638
 -1.302540	 -0.198189	 -0.046068
 -1.305563	 -0.213148	 -0.033142
 -1.308108	 -0.228911	 -0.021098
 -1.310653	 -0.244675	 -0.009055
 -1.313199	 -0.260438	  0.002989
 -1.315156	 -0.276649	  0.014538
 -1.316103	 -0.293550	  0.025190
 -1.317050	 -0.310450	  0.035841
 -1.317996	 -0.327351	  0.046493
 -1.318943	 -0.344252	  0.057145
 -1.318699	 -0.361325	  0.067560
 -1.315831	 -0.378548	  0.077313
 -1.312962	 -0.395772	  0.087066
 -1.310094	 -0.412996	  0.096819
 -1.307226	 -0.430219	  0.106571
 -1.304357	 -0.447443	  0.116324
 -1.300356	 -0.464740	  0.125534
 -1.294791	 -0.482023	  0.133921
 -1.289226	 -0.499306	  0.142307
 -1.283661	 -0.516588	  0.150693
 -1.278096	 -0.533871	  0.159080
 -1.274565	 -0.552434	  0.165633
 -1.277448	 -0.572103	  0.167836
 -1.286133	 -0.589973	  0.165554
 -1.295831	 -0.606997	  0.161537
 -1.306069	 -0.623430	  0.156524
 -1.316308	 -0.639863	  0.151511
 -1.326616	 -0.656135	  0.146128
 -1.337061	 -0.672023	  0.139927
 -1.347507	 -0.687911	  0.133725
 -1.358262	 -0.703551	  0.127421
 -1.370411	 -0.717931	  0.120668
 -1.388135	 -0.723974	  0.113645
 -1.406616	 -0.727483	  0.106851
 -1.425097	 -0.730991	  0.100057
 -1.443577	 -0.734500	  0.093263
 -1.461632	 -0.740855	  0.087462
 -1.479654	 -0.747350	  0.081715
 -1.497675	 -0.753845	  0.075969
 -1.515697	 -0.760341	  0.070222
 -1.533719	 -0.766836	  0.064475
 -1.551740	 -0.773332	  0.058728
 -1.566759	 -0.786155	  0.055564
 -1.580693	 -0.800292	  0.053119
 -1.594628	 -0.814429	  0.050674
 -1.608562	 -0.828566	  0.048230
 -1.622497	 -0.842703	  0.045785
 -1.636444	 -0.856952	  0.044225
 -1.649994	 -0.871315	  0.047400
 -1.663545	 -0.885679	  0.050575
 -1.677095	 -0.900042	  0.053750
 -1.690244	 -0.914723	  0.057151
 -1.699285	 -0.931748	  0.062484
 -1.708325	 -0.948772	  0.067817
 -1.717366	 -0.965796	  0.073150
 -1.725691	 -0.982990	  0.079072
 -1.732981	 -1.000357	  0.085798
 -1.740271	 -1.017725	  0.092524
 -1.747397	 -1.034983	  0.099691
 -1.754422	 -1.052169	  0.107127
 -1.761505	 -1.069319	  0.114590
 -1.768835	 -1.086312	  0.122173
 -1.776166	 -1.103305	  0.129756
 -1.783849	 -1.119994	  0.137658
 -1.791579	 -1.136642	  0.145601
 -1.799514	 -1.153059	  0.153818
 -1.807638	 -1.169255	  0.162285
 -1.815804	 -1.185396	  0.170817
 -1.824322	 -1.201068	  0.179863
 -1.832840	 -1.216740	  0.188909
 -1.841566	 -1.232050	  0.198367
 -1.850380	 -1.247200	  0.208001
 -1.859278	 -1.262187	  0.217809
 -1.868348	 -1.276831	  0.227972
 -1.877418	 -1.291474	  0.238136
 -1.886713	 -1.305654	  0.248744
 -1.896012	 -1.319826	  0.259360
 -1.905336	 -1.333698	  0.270343
 -1.914672	 -1.347402	  0.281526
 -1.923906	 -1.361131	  0.292761
 -1.932564	 -1.374997	  0.304283
 -1.941222	 -1.388864	  0.315805
 -1.949637	 -1.403009	  0.327169
 -1.957737	 -1.417498	  0.338324
 -1.965837	 -1.431988	  0.349479
 -1.973920	 -1.446832	  0.360171
 -1.981997	 -1.461775	  0.370729
 -1.990122	 -1.476684	  0.381298
 -1.998392	 -1.491491	  0.391898
 -2.006663	 -1.506298	  0.402498
 -2.014126	 -1.519195	  0.412069
 -2.022623	 -1.533652	  0.422968
