 -1.532833	 -0.478633	 -1.835937
 -1.529684	 -0.481785	 -1.846205
 -1.526535	 -0.484937	 -1.856473
 -1.532145	 -0.479973	 -1.837795
 -1.537116	 -0.472031	 -1.818090
 -1.542890	 -0.467549	 -1.802895
 -1.548049	 -0.462706	 -1.782748
 -1.553231	 -0.456450	 -1.763559
 -1.562001	 -0.448881	 -1.748226
 -1.569760	 -0.442107	 -1.730394
 -1.575695	 -0.436557	 -1.712321
 -1.584597	 -0.430321	 -1.695981
 -1.593667	 -0.422675	 -1.677696
 -1.597802	 -0.419129	 -1.660106
 -1.605275	 -0.415723	 -1.642415
 -1.614183	 -0.408362	 -1.621710
 -1.620723	 -0.403211	 -1.606190
 -1.627920	 -0.400610	 -1.588434
 -1.633944	 -0.395786	 -1.567217
 -1.641682	 -0.389413	 -1.549815
 -1.651819	 -0.384909	 -1.536293
 -1.661986	 -0.380534	 -1.518273
 -1.670769	 -0.376054	 -1.500410
 -1.679122	 -0.372067	 -1.482678
 -1.687465	 -0.368187	 -1.464921
 -1.695769	 -0.364396	 -1.447126
 -1.703278	 -0.362444	 -1.428692
 -1.710784	 -0.360491	 -1.410257
 -1.718273	 -0.358755	 -1.391794
 -1.725703	 -0.357739	 -1.373253
 -1.733114	 -0.356571	 -1.354714
 -1.740078	 -0.352294	 -1.336461
 -1.747027	 -0.347738	 -1.318280
 -1.753647	 -0.342568	 -1.300251
 -1.760300	 -0.337717	 -1.281682
 -1.768270	 -0.332392	 -1.264587
 -1.776570	 -0.327740	 -1.248222
 -1.787310	 -0.321044	 -1.230120
 -1.797584	 -0.314518	 -1.214230
 -1.806818	 -0.311339	 -1.198220
 -1.817769	 -0.309019	 -1.179502
 -1.828509	 -0.302372	 -1.165051
 -1.841287	 -0.296262	 -1.151601
 -1.855232	 -0.288965	 -1.136303
 -1.864885	 -0.287605	 -1.120395
 -1.877676	 -0.285181	 -1.104710
 -1.890811	 -0.280862	 -1.089667
 -1.903338	 -0.279322	 -1.074686
 -1.916634	 -0.280234	 -1.058727
 -1.930250	 -0.274697	 -1.044461
 -1.944222	 -0.269308	 -1.032453
 -1.957642	 -0.262885	 -1.015927
 -1.968169	 -0.259383	 -0.999257
 -1.979344	 -0.259042	 -0.984662
 -1.993060	 -0.254877	 -0.969380
 -2.004740	 -0.252988	 -0.953376
 -2.015743	 -0.252953	 -0.936501
 -2.027617	 -0.249300	 -0.919680
 -2.039493	 -0.243659	 -0.904068
 -2.049753	 -0.240449	 -0.889778
 -2.060647	 -0.236574	 -0.872381
 -2.069517	 -0.231179	 -0.855051
 -2.078093	 -0.225681	 -0.837840
 -2.083627	 -0.219871	 -0.819521
 -2.088624	 -0.214024	 -0.801059
 -2.092360	 -0.208226	 -0.782286
 -2.095321	 -0.202470	 -0.763362
 -2.098325	 -0.196715	 -0.744445
 -2.102516	 -0.190976	 -0.725750
 -2.106710	 -0.185238	 -0.707056
 -2.111337	 -0.179450	 -0.688479
 -2.116775	 -0.173574	 -0.670152
 -2.122040	 -0.167739	 -0.651900
 -2.126517	 -0.162152	 -0.634130
 -2.131467	 -0.154679	 -0.614128
 -2.136809	 -0.146264	 -0.596165
 -2.146755	 -0.141738	 -0.579417
 -2.155980	 -0.141190	 -0.562778
 -2.166506	 -0.139941	 -0.544672
 -2.177630	 -0.133521	 -0.526409
 -2.183298	 -0.128266	 -0.510824
 -2.192248	 -0.123878	 -0.492361
 -2.201460	 -0.119897	 -0.475063
 -2.209244	 -0.116023	 -0.458087
 -2.220147	 -0.109535	 -0.438549
 -2.232628	 -0.106056	 -0.424798
 -2.243260	 -0.106012	 -0.410844
 -2.255952	 -0.102771	 -0.391389
 -2.265653	 -0.098253	 -0.374348
 -2.274425	 -0.093623	 -0.357186
 -2.282133	 -0.092695	 -0.341210
 -2.292413	 -0.092766	 -0.323346
 -2.300515	 -0.092827	 -0.302085
 -2.304733	 -0.088353	 -0.285104
 -2.313045	 -0.083783	 -0.267116
 -2.318843	 -0.078039	 -0.247900
 -2.323818	 -0.075958	 -0.228626
 -2.330544	 -0.075262	 -0.210459
 -2.334383	 -0.072596	 -0.190546
 -2.336582	 -0.065414	 -0.170946
 -2.345094	 -0.059082	 -0.154261
 -2.355934	 -0.053007	 -0.135318
 -2.360640	 -0.050117	 -0.115418
 -2.364760	 -0.049283	 -0.099248
 -2.374041	 -0.045300	 -0.080959
 -2.385583	 -0.042662	 -0.062610
 -2.390673	 -0.039769	 -0.044062
 -2.395706	 -0.034471	 -0.026413
 -2.405223	 -0.030394	 -0.006524
 -2.411686	 -0.029111	  0.012494
 -2.416856	 -0.023560	  0.028395
 -2.423361	 -0.017178	  0.048452
 -2.430043	 -0.014738	  0.068429
 -2.439650	 -0.011541	  0.082802
 -2.448849	 -0.006566	  0.102065
 -2.457107	 -0.002602	  0.119843
 -2.465365	  0.001362	  0.137621
