 -0.876726	  0.476383	 -2.256678
 -0.878708	  0.470606	 -2.273941
 -0.885228	  0.478830	 -2.257111
 -0.884751	  0.488070	 -2.233395
 -0.878689	  0.493363	 -2.214130
 -0.874924	  0.496574	 -2.199644
 -0.871245	  0.500538	 -2.180076
 -0.868803	  0.504138	 -2.161696
 -0.865660	  0.507154	 -2.139958
 -0.864594	  0.509517	 -2.118686
 -0.862746	  0.514672	 -2.095992
 -0.858479	  0.520812	 -2.079823
 -0.854491	  0.527796	 -2.066158
 -0.848774	  0.538039	 -2.046608
 -0.845868	  0.542490	 -2.025692
 -0.841716	  0.547351	 -1.999949
 -0.838593	  0.551539	 -1.986865
 -0.832380	  0.557759	 -1.969908
 -0.825593	  0.565380	 -1.954689
 -0.816562	  0.579064	 -1.936278
 -0.809843	  0.589313	 -1.917541
 -0.803954	  0.594262	 -1.903650
 -0.792860	  0.598244	 -1.884773
 -0.783768	  0.604548	 -1.865835
 -0.778561	  0.612294	 -1.848464
 -0.772393	  0.621479	 -1.830911
 -0.765854	  0.630264	 -1.815513
 -0.759999	  0.637065	 -1.799575
 -0.753108	  0.640508	 -1.780564
 -0.748047	  0.646072	 -1.758835
 -0.744438	  0.654713	 -1.742400
 -0.740570	  0.663744	 -1.727320
 -0.734309	  0.672340	 -1.709334
 -0.722891	  0.689295	 -1.686576
 -0.716074	  0.697448	 -1.675440
 -0.708115	  0.703970	 -1.663233
 -0.700668	  0.710313	 -1.649172
 -0.692575	  0.716411	 -1.628749
 -0.684910	  0.724556	 -1.610180
 -0.678440	  0.733747	 -1.590760
 -0.674637	  0.742357	 -1.573601
 -0.670565	  0.750942	 -1.555801
 -0.665203	  0.758784	 -1.539010
 -0.660697	  0.766344	 -1.524080
 -0.653707	  0.773834	 -1.507482
 -0.644912	  0.779688	 -1.489007
 -0.635565	  0.786700	 -1.471955
 -0.628863	  0.796488	 -1.459073
 -0.626724	  0.810036	 -1.442888
 -0.623956	  0.822371	 -1.426760
 -0.615144	  0.833152	 -1.411667
 -0.604678	  0.843172	 -1.397738
 -0.593951	  0.853047	 -1.384051
 -0.580798	  0.862023	 -1.371964
 -0.566847	  0.870648	 -1.360520
 -0.552880	  0.879265	 -1.349092
 -0.539078	  0.887585	 -1.337555
 -0.525505	  0.893179	 -1.326074
 -0.512411	  0.890041	 -1.317536
 -0.493699	  0.892635	 -1.306653
 -0.469854	  0.905306	 -1.286996
 -0.457946	  0.906611	 -1.278431
 -0.447023	  0.908394	 -1.269057
 -0.424386	  0.912682	 -1.254857
 -0.415258	  0.912096	 -1.250556
 -0.403163	  0.910719	 -1.242899
 -0.382745	  0.906049	 -1.221584
 -0.372689	  0.903361	 -1.213764
 -0.356754	  0.903853	 -1.202203
 -0.337853	  0.902417	 -1.192400
 -0.321848	  0.900240	 -1.181273
 -0.311758	  0.897525	 -1.172674
 -0.294137	  0.890950	 -1.160664
 -0.281266	  0.885380	 -1.151775
 -0.264835	  0.879769	 -1.138845
 -0.240770	  0.869555	 -1.126324
 -0.227676	  0.861760	 -1.120547
 -0.216064	  0.848274	 -1.116794
 -0.206786	  0.831097	 -1.108371
 -0.204539	  0.815445	 -1.093820
 -0.199314	  0.801866	 -1.078885
 -0.194459	  0.789236	 -1.064109
 -0.190491	  0.775401	 -1.050551
 -0.187251	  0.759680	 -1.041951
 -0.183846	  0.748275	 -1.029847
 -0.175775	  0.744292	 -1.008897
 -0.172808	  0.735177	 -1.003979
 -0.165051	  0.735166	 -0.998691
 -0.153021	  0.729835	 -0.987641
 -0.137676	  0.733239	 -0.976629
 -0.121831	  0.740966	 -0.967632
 -0.105489	  0.753923	 -0.961463
 -0.095480	  0.766902	 -0.959129
 -0.074985	  0.788265	 -0.947481
 -0.057822	  0.799623	 -0.935823
 -0.042809	  0.808499	 -0.926603
 -0.030565	  0.813332	 -0.918999
 -0.003854	  0.807835	 -0.903506
  0.006963	  0.805478	 -0.890534
  0.015243	  0.808014	 -0.860716
  0.020041	  0.800292	 -0.838604
  0.030972	  0.787360	 -0.819569
  0.038695	  0.771241	 -0.798402
  0.044410	  0.766091	 -0.788743
  0.044469	  0.760103	 -0.773758
  0.044205	  0.752321	 -0.749458
  0.043184	  0.744386	 -0.725606
  0.049075	  0.733737	 -0.703895
  0.053414	  0.726348	 -0.690615
  0.055601	  0.718774	 -0.676889
  0.054260	  0.711651	 -0.656474
  0.050532	  0.707332	 -0.637499
  0.047863	  0.703423	 -0.619321
  0.044361	  0.697920	 -0.598707
  0.039825	  0.689990	 -0.575009
  0.043195	  0.683582	 -0.559477
  0.050075	  0.682068	 -0.547257
  0.053962	  0.676242	 -0.530043
  0.060663	  0.669730	 -0.517573
  0.071331	  0.664640	 -0.506683
  0.083956	  0.656704	 -0.474732
  0.096152	  0.656359	 -0.452008
  0.103273	  0.662348	 -0.441246
  0.114694	  0.660693	 -0.430750
  0.120699	  0.660205	 -0.407554
  0.129774	  0.662174	 -0.390130
  0.133352	  0.664837	 -0.376076
  0.140355	  0.667761	 -0.356325
  0.144935	  0.668595	 -0.332084
  0.149136	  0.671084	 -0.312935
  0.151054	  0.676344	 -0.293203
  0.153710	  0.681168	 -0.263536
  0.153938	  0.682473	 -0.256866
  0.157839	  0.690482	 -0.238146
  0.167732	  0.698882	 -0.217366
  0.172752	  0.706524	 -0.199972
  0.178749	  0.712101	 -0.182570
  0.188050	  0.719049	 -0.158161
  0.196962	  0.723933	 -0.140815
  0.199945	  0.725711	 -0.125182
  0.215260	  0.722331	 -0.113626
  0.216693	  0.725966	 -0.092844
  0.219233	  0.727958	 -0.073003
  0.235563	  0.724759	 -0.045498
  0.246368	  0.726115	 -0.030009
  0.248168	  0.731352	 -0.011929
  0.260448	  0.734227	  0.004566
  0.269097	  0.733659	  0.024508
  0.276000	  0.737611	  0.047953
  0.290240	  0.733070	  0.063429
  0.294360	  0.737075	  0.080692
  0.307209	  0.738162	  0.102768
  0.310781	  0.740185	  0.111938
  0.318473	  0.750763	  0.133856
  0.327396	  0.756431	  0.147200
  0.336475	  0.762213	  0.163008
  0.341392	  0.768517	  0.185738
  0.343928	  0.780670	  0.205530
  0.343815	  0.789610	  0.221790
  0.344332	  0.801519	  0.243554
  0.343853	  0.806977	  0.258804
  0.343908	  0.811195	  0.279002
  0.352314	  0.811588	  0.310238
  0.356928	  0.809608	  0.324919
  0.359509	  0.809223	  0.338315
  0.365655	  0.811678	  0.361031
  0.372519	  0.817064	  0.383249
  0.379309	  0.816556	  0.393662
  0.389681	  0.818894	  0.416916
  0.399822	  0.826736	  0.443989
  0.400272	  0.830908	  0.454443
  0.406205	  0.832091	  0.469431
  0.406198	  0.846724	  0.499555
  0.407477	  0.854350	  0.510317
  0.411960	  0.860275	  0.524003
  0.414950	  0.874942	  0.551661
  0.415484	  0.881841	  0.569370
  0.418272	  0.884752	  0.581995
  0.415760	  0.890218	  0.612051
  0.413590	  0.896605	  0.630777
  0.414772	  0.899884	  0.639975
  0.410784	  0.902030	  0.664702
  0.411638	  0.911328	  0.693668
  0.414986	  0.913231	  0.703482
  0.423229	  0.921088	  0.722785
  0.428049	  0.933075	  0.748439
  0.429282	  0.936782	  0.762019
  0.427723	  0.940017	  0.776476
  0.423640	  0.947622	  0.802412
  0.420823	  0.960617	  0.823078
  0.418473	  0.970408	  0.833192
  0.415850	  0.981251	  0.843575
  0.408621	  0.993265	  0.867851
  0.405840	  1.001937	  0.892328
  0.409752	  1.003943	  0.909595
  0.421593	  1.007788	  0.934565
  0.434316	  1.010421	  0.954998
  0.437008	  1.018331	  0.971715
  0.434471	  1.029850	  0.985062
  0.429375	  1.040947	  1.001636
  0.431121	  1.047540	  1.021640
  0.428586	  1.055463	  1.037352
  0.425183	  1.064529	  1.053482
  0.424040	  1.074637	  1.067434
  0.425117	  1.084980	  1.082504
  0.423871	  1.098815	  1.098391
  0.425556	  1.113849	  1.114871
  0.429301	  1.124456	  1.131214
  0.432932	  1.134371	  1.148687
  0.436263	  1.141766	  1.166021
  0.439270	  1.148351	  1.184489
  0.440544	  1.159194	  1.199727
  0.441576	  1.178309	  1.215238
  0.446063	  1.195772	  1.233603
  0.450877	  1.204723	  1.243926
  0.457801	  1.218931	  1.255827
  0.465455	  1.231167	  1.274927
  0.471345	  1.238367	  1.290948
  0.476509	  1.247199	  1.308864
  0.478564	  1.257423	  1.329777
  0.476465	  1.261986	  1.347232
  0.468749	  1.267932	  1.366699
  0.457340	  1.286315	  1.380208
  0.443000	  1.303343	  1.392939
  0.443813	  1.308324	  1.412292
