  2.166807	  1.113524	  0.291536
  2.169120	  1.113494	  0.291449
  2.171433	  1.113464	  0.291362
  2.151434	  1.114381	  0.292250
  2.131369	  1.112103	  0.292543
  2.111527	  1.113426	  0.293164
  2.091441	  1.113898	  0.293397
  2.071714	  1.110796	  0.292814
  2.052438	  1.111740	  0.292237
  2.030842	  1.111641	  0.289450
  2.011686	  1.105105	  0.285223
  1.992723	  1.103609	  0.285729
  1.971291	  1.108794	  0.289634
  1.950708	  1.109152	  0.290928
  1.932484	  1.101563	  0.284559
  1.912724	  1.096118	  0.279549
  1.892913	  1.096389	  0.277431
  1.874828	  1.101228	  0.274259
  1.850963	  1.103128	  0.274521
  1.832229	  1.106880	  0.274409
  1.815558	  1.108047	  0.265488
  1.796013	  1.109453	  0.258174
  1.776011	  1.112212	  0.253448
  1.758534	  1.114969	  0.247145
  1.742063	  1.121884	  0.237845
  1.722257	  1.131478	  0.232365
  1.706347	  1.140922	  0.228394
  1.693105	  1.152735	  0.220317
  1.678575	  1.164278	  0.212070
  1.661438	  1.174353	  0.204312
  1.643312	  1.182533	  0.198116
  1.631160	  1.195438	  0.189101
  1.620855	  1.208852	  0.179344
  1.606772	  1.221658	  0.171105
  1.591529	  1.235250	  0.165605
  1.581181	  1.247762	  0.156770
  1.570941	  1.259674	  0.143738
  1.558606	  1.269544	  0.129767
  1.542369	  1.276900	  0.120882
  1.526103	  1.283646	  0.112626
  1.508117	  1.284923	  0.101240
  1.491285	  1.293166	  0.089191
  1.474570	  1.296016	  0.082956
  1.452002	  1.288356	  0.079070
  1.433430	  1.286254	  0.072373
  1.419084	  1.286643	  0.061959
  1.401786	  1.285962	  0.051662
  1.380868	  1.284299	  0.042755
  1.365488	  1.271971	  0.039301
  1.346839	  1.259565	  0.036631
  1.326838	  1.258204	  0.030832
  1.312950	  1.251672	  0.021957
  1.297408	  1.242490	  0.016346
  1.277686	  1.234741	  0.009861
  1.261202	  1.224467	  0.010945
  1.241559	  1.216462	  0.010344
  1.228363	  1.199644	  0.006035
  1.219628	  1.180653	  0.003638
  1.205900	  1.167457	  0.000157
  1.190675	  1.155490	 -0.001173
  1.177393	  1.137775	  0.001193
  1.166666	  1.121700	  0.010943
  1.153853	  1.107940	  0.007869
  1.135945	  1.097526	  0.005460
  1.118349	  1.086360	  0.008577
  1.106659	  1.070157	  0.010645
  1.097976	  1.046594	  0.012023
  1.087900	  1.035720	  0.026041
  1.074480	  1.031772	  0.044748
  1.059932	  1.019549	  0.052571
  1.044139	  1.007371	  0.051507
  1.026395	  0.995622	  0.058275
  1.013669	  0.982762	  0.067600
  1.000546	  0.970849	  0.076570
  0.986049	  0.963541	  0.088698
  0.975564	  0.956389	  0.106627
  0.965679	  0.941319	  0.119927
  0.955333	  0.932418	  0.129099
  0.937946	  0.924150	  0.137690
  0.919040	  0.916727	  0.143574
  0.904507	  0.908580	  0.158072
  0.895951	  0.906582	  0.180979
  0.885639	  0.906292	  0.193135
  0.870218	  0.902244	  0.207262
  0.853838	  0.898533	  0.217400
  0.837318	  0.896298	  0.229940
  0.821156	  0.895216	  0.242230
  0.804681	  0.893476	  0.253418
  0.792112	  0.889435	  0.267540
  0.779909	  0.890099	  0.283738
  0.763323	  0.891790	  0.297376
  0.743020	  0.888787	  0.303808
  0.727950	  0.884569	  0.314252
  0.707403	  0.883265	  0.323429
  0.689568	  0.877317	  0.329012
  0.674633	  0.875296	  0.339238
  0.656889	  0.874996	  0.350865
  0.638071	  0.873220	  0.357574
  0.617953	  0.866139	  0.363647
  0.601371	  0.863297	  0.367727
  0.583159	  0.859305	  0.376166
  0.563434	  0.852268	  0.380804
  0.544992	  0.847392	  0.381940
  0.526595	  0.844257	  0.390839
  0.506964	  0.837667	  0.394320
  0.488870	  0.830599	  0.392575
  0.470105	  0.822963	  0.396448
  0.449860	  0.816494	  0.400605
  0.430821	  0.812975	  0.397818
  0.415222	  0.802747	  0.399568
  0.398123	  0.787517	  0.403602
  0.379406	  0.778625	  0.404588
  0.359994	  0.775242	  0.406389
  0.338294	  0.776359	  0.405730
  0.316216	  0.773483	  0.399670
  0.300406	  0.763815	  0.395114
  0.280577	  0.751422	  0.394470
  0.262892	  0.746913	  0.394316
  0.243906	  0.745736	  0.394709
  0.224069	  0.741033	  0.394696
  0.202649	  0.735008	  0.386178
  0.185343	  0.734188	  0.376599
  0.167050	  0.732237	  0.373026
  0.148795	  0.729668	  0.373352
  0.120876	  0.725258	  0.372984
  0.105999	  0.718306	  0.371178
  0.087284	  0.712678	  0.367452
  0.067572	  0.708532	  0.362139
  0.049753	  0.708168	  0.361001
  0.028198	  0.707369	  0.362919
  0.006553	  0.708933	  0.361076
 -0.012393	  0.704140	  0.361910
 -0.032068	  0.694770	  0.360634
 -0.050865	  0.686025	  0.359121
 -0.067820	  0.682229	  0.359696
 -0.089610	  0.677057	  0.363314
 -0.109025	  0.670416	  0.365072
 -0.125746	  0.665624	  0.367384
 -0.146747	  0.658606	  0.370813
 -0.164116	  0.649076	  0.374355
 -0.181784	  0.639061	  0.373554
 -0.202391	  0.631518	  0.367430
 -0.218731	  0.630395	  0.363398
 -0.240559	  0.626734	  0.361053
 -0.261638	  0.623867	  0.359895
 -0.278753	  0.620021	  0.360897
 -0.298397	  0.613431	  0.362745
 -0.318413	  0.605876	  0.363108
 -0.337807	  0.600957	  0.361620
 -0.356664	  0.597119	  0.361179
 -0.376746	  0.592205	  0.361016
 -0.396730	  0.587527	  0.359429
 -0.415486	  0.584254	  0.358878
 -0.434840	  0.580073	  0.359443
 -0.456866	  0.576535	  0.357539
 -0.475793	  0.575833	  0.355556
 -0.495771	  0.576272	  0.355511
 -0.515371	  0.575820	  0.357086
 -0.535293	  0.574158	  0.359642
 -0.554558	  0.572269	  0.364227
 -0.576349	  0.569362	  0.364710
 -0.595481	  0.567045	  0.362439
 -0.615154	  0.564808	  0.362946
 -0.634910	  0.562479	  0.366367
 -0.654605	  0.560313	  0.366671
 -0.674796	  0.558052	  0.367379
 -0.694197	  0.555909	  0.371317
 -0.714000	  0.553845	  0.371873
 -0.734564	  0.551097	  0.372027
 -0.753396	  0.547890	  0.377586
 -0.772745	  0.543745	  0.382592
 -0.791767	  0.540554	  0.383023
 -0.811411	  0.537440	  0.385544
 -0.833600	  0.538470	  0.388349
 -0.853825	  0.540964	  0.390248
 -0.871910	  0.539709	  0.386803
 -0.892042	  0.535517	  0.385124
 -0.912448	  0.531405	  0.383488
 -0.932550	  0.529838	  0.382538
 -0.951939	  0.528436	  0.384451
 -0.973316	  0.528747	  0.390535
 -0.992639	  0.532099	  0.396514
 -1.011518	  0.533271	  0.399278
 -1.031824	  0.533497	  0.401129
 -1.051406	  0.535695	  0.398863
 -1.071895	  0.535158	  0.399657
 -1.090557	  0.531671	  0.403101
 -1.111601	  0.528170	  0.410198
 -1.131941	  0.525273	  0.414709
 -1.149132	  0.523113	  0.423773
 -1.164599	  0.525976	  0.434635
 -1.186140	  0.521796	  0.439270
 -1.207241	  0.520659	  0.441125
 -1.226799	  0.526058	  0.448269
 -1.241752	  0.530808	  0.454664
 -1.261667	  0.535427	  0.463568
 -1.277177	  0.534251	  0.474063
 -1.295907	  0.535039	  0.483334
 -1.314060	  0.537312	  0.491470
 -1.331042	  0.545116	  0.499159
 -1.347809	  0.552942	  0.506750
 -1.364581	  0.560764	  0.514261
 -1.381546	  0.568732	  0.520790
 -1.397205	  0.579224	  0.527012
 -1.411270	  0.589256	  0.534093
 -1.428499	  0.604203	  0.542050
 -1.441245	  0.616598	  0.547667
 -1.453877	  0.625364	  0.552488
 -1.472325	  0.641706	  0.559088
 -1.484669	  0.656722	  0.565489
 -1.495883	  0.669884	  0.573877
 -1.506212	  0.678478	  0.579121
 -1.521991	  0.694025	  0.586537
 -1.536351	  0.709185	  0.594289
 -1.547579	  0.722050	  0.596868
 -1.559884	  0.737156	  0.602863
 -1.572633	  0.752515	  0.610818
 -1.585761	  0.766349	  0.614078
 -1.599305	  0.781047	  0.618785
 -1.610666	  0.794042	  0.629681
 -1.622942	  0.806339	  0.637740
 -1.641109	  0.818332	  0.645446
 -1.651616	  0.830645	  0.654214
 -1.668486	  0.838493	  0.661611
 -1.687280	  0.844284	  0.668462
 -1.701695	  0.842852	  0.664688
 -1.717504	  0.837515	  0.666684
 -1.734120	  0.821801	  0.661112
 -1.741526	  0.808313	  0.655194
 -1.751336	  0.790965	  0.650988
 -1.759726	  0.772492	  0.644321
 -1.767978	  0.754880	  0.639730
 -1.775351	  0.736650	  0.635958
 -1.779261	  0.716500	  0.632952
 -1.780213	  0.695584	  0.630989
 -1.783378	  0.675467	  0.624456
 -1.790471	  0.657999	  0.617112
 -1.801758	  0.642032	  0.615325
 -1.813213	  0.625073	  0.616379
 -1.825845	  0.608781	  0.615353
 -1.838698	  0.592087	  0.607124
 -1.848194	  0.576199	  0.598667
 -1.855661	  0.560243	  0.596382
 -1.866576	  0.542879	  0.594597
 -1.877596	  0.525635	  0.589551
 -1.889407	  0.512422	  0.581391
 -1.897250	  0.496927	  0.571422
 -1.905069	  0.479715	  0.564935
 -1.917256	  0.461118	  0.559690
 -1.928743	  0.447972	  0.553883
 -1.939422	  0.433386	  0.547465
 -1.955236	  0.422136	  0.537915
 -1.967835	  0.409426	  0.530313
 -1.981142	  0.396602	  0.523554
 -1.996314	  0.386007	  0.516237
 -2.009897	  0.376200	  0.504420
 -2.023300	  0.364719	  0.492981
 -2.038512	  0.353702	  0.486700
 -2.052525	  0.343306	  0.481278
 -2.069899	  0.331993	  0.474672
 -2.086521	  0.322869	  0.468991
 -2.102230	  0.313978	  0.461277
 -2.120358	  0.310739	  0.449148
 -2.138651	  0.309750	  0.441508
 -2.157892	  0.306488	  0.435166
 -2.177906	  0.303616	  0.431788
 -2.197106	  0.299854	  0.430827
 -2.216824	  0.296453	  0.430204
 -2.236130	  0.292762	  0.429959
 -2.256525	  0.289652	  0.429778
 -2.275509	  0.287931	  0.429794
 -2.299227	  0.286855	  0.428689
 -2.316191	  0.285267	  0.429323
 -2.335951	  0.282556	  0.430876
 -2.357449	  0.278773	  0.432186
 -2.375968	  0.278304	  0.433986
 -2.394770	  0.275325	  0.438435
 -2.416085	  0.270911	  0.440652
 -2.435120	  0.275507	  0.445704
 -2.454614	  0.273200	  0.449536
 -2.474108	  0.270893	  0.453368
