 -2.109260	 -1.072723	 -0.820215
 -2.106884	 -1.073843	 -0.811110
 -2.104280	 -1.075071	 -0.801127
 -2.098336	 -1.076930	 -0.781903
 -2.090286	 -1.079501	 -0.764389
 -2.083422	 -1.083619	 -0.745591
 -2.077511	 -1.087987	 -0.726978
 -2.072597	 -1.093534	 -0.709076
 -2.067901	 -1.101680	 -0.690561
 -2.065415	 -1.109824	 -0.671581
 -2.064566	 -1.113569	 -0.653719
 -2.065639	 -1.123153	 -0.637622
 -2.064646	 -1.134126	 -0.620769
 -2.067373	 -1.145273	 -0.604299
 -2.073775	 -1.155476	 -0.588530
 -2.078496	 -1.168237	 -0.573763
 -2.082470	 -1.182429	 -0.560092
 -2.087692	 -1.195124	 -0.545410
 -2.094920	 -1.207430	 -0.531260
 -2.101209	 -1.220682	 -0.517135
 -2.109775	 -1.246829	 -0.494233
 -2.110446	 -1.249189	 -0.492146
