  0.959209	  0.058504	 -2.327112
  0.959221	  0.058495	 -2.327136
  0.950823	  0.064553	 -2.309659
  0.943528	  0.068841	 -2.293255
  0.935763	  0.070649	 -2.273868
  0.926298	  0.078624	 -2.253974
  0.918397	  0.090171	 -2.243909
  0.907366	  0.104528	 -2.228955
  0.898640	  0.111602	 -2.211529
  0.891139	  0.112389	 -2.194019
  0.880920	  0.118551	 -2.175028
  0.871870	  0.130471	 -2.164160
  0.860564	  0.146266	 -2.153660
  0.849748	  0.157470	 -2.138362
  0.842013	  0.157836	 -2.121870
  0.831638	  0.156732	 -2.098943
  0.820232	  0.168402	 -2.080068
  0.812416	  0.180836	 -2.074426
  0.798613	  0.193873	 -2.063885
  0.786524	  0.201231	 -2.049992
  0.776027	  0.209407	 -2.034259
  0.765933	  0.215220	 -2.015914
  0.755954	  0.216274	 -1.997167
  0.743554	  0.219279	 -1.981503
  0.730394	  0.224499	 -1.967346
  0.719740	  0.228161	 -1.954432
  0.707756	  0.231937	 -1.937589
  0.699002	  0.236313	 -1.924263
  0.683658	  0.243421	 -1.903771
  0.670853	  0.246742	 -1.883693
  0.659700	  0.243595	 -1.870883
  0.646780	  0.241185	 -1.857707
  0.631538	  0.233973	 -1.838942
  0.622258	  0.227694	 -1.826783
  0.611910	  0.222407	 -1.810327
  0.599686	  0.214983	 -1.795443
  0.587148	  0.203414	 -1.781408
  0.575544	  0.191296	 -1.769036
  0.565279	  0.180196	 -1.757651
  0.555361	  0.171232	 -1.743397
  0.544994	  0.163713	 -1.726881
  0.529216	  0.157308	 -1.712355
  0.509648	  0.148262	 -1.704211
  0.493230	  0.132555	 -1.699035
  0.486714	  0.117158	 -1.688828
  0.483958	  0.102761	 -1.672552
  0.480987	  0.090849	 -1.654602
  0.472832	  0.078104	 -1.639063
  0.461366	  0.063087	 -1.630641
  0.451805	  0.046278	 -1.624782
  0.445446	  0.031179	 -1.613836
  0.443812	  0.017821	 -1.598078
  0.442454	  0.002589	 -1.584166
  0.434265	 -0.014311	 -1.575870
  0.425896	 -0.026696	 -1.564561
  0.424836	 -0.033492	 -1.546476
  0.420213	 -0.033582	 -1.521926
  0.409376	 -0.026439	 -1.508247
  0.390821	 -0.022370	 -1.491115
  0.379044	 -0.013836	 -1.482205
  0.371763	 -0.006453	 -1.466752
  0.369744	  0.006782	 -1.448987
  0.368005	  0.012804	 -1.441008
  0.361043	  0.024068	 -1.421353
  0.353062	  0.034212	 -1.406769
  0.341638	  0.038840	 -1.392428
  0.326062	  0.049836	 -1.371805
  0.316356	  0.060059	 -1.353862
  0.311907	  0.068280	 -1.340189
  0.312708	  0.078053	 -1.324776
  0.315725	  0.088089	 -1.306476
  0.315240	  0.095817	 -1.285874
  0.315047	  0.104868	 -1.265560
  0.316681	  0.118835	 -1.244557
  0.318055	  0.134001	 -1.231300
  0.317943	  0.151618	 -1.221358
  0.314305	  0.172476	 -1.211803
  0.311347	  0.191892	 -1.201928
  0.309254	  0.205007	 -1.194812
  0.306280	  0.222774	 -1.186659
  0.305990	  0.240576	 -1.176057
  0.306210	  0.257124	 -1.160709
  0.301665	  0.268365	 -1.147242
  0.293139	  0.287528	 -1.130192
  0.288425	  0.299265	 -1.118469
  0.285471	  0.311552	 -1.111090
  0.276149	  0.329337	 -1.096479
  0.269890	  0.344743	 -1.086461
  0.263488	  0.360557	 -1.067608
  0.260159	  0.368544	 -1.055397
  0.257221	  0.373189	 -1.041624
  0.250591	  0.384710	 -1.022983
  0.244037	  0.396445	 -1.004141
  0.239270	  0.402131	 -0.987876
  0.230636	  0.407718	 -0.964860
  0.223356	  0.411179	 -0.951095
  0.213751	  0.413872	 -0.933463
  0.204002	  0.419776	 -0.915155
  0.195790	  0.430206	 -0.900157
  0.189456	  0.437423	 -0.886181
  0.182658	  0.448728	 -0.867536
  0.174862	  0.457803	 -0.850390
  0.166091	  0.465501	 -0.833638
  0.158670	  0.469719	 -0.819390
  0.148470	  0.478483	 -0.797693
  0.140852	  0.484213	 -0.782450
  0.130053	  0.486303	 -0.764381
  0.117934	  0.489631	 -0.748462
  0.109232	  0.491868	 -0.732881
  0.096914	  0.507170	 -0.717433
  0.085552	  0.518930	 -0.709246
  0.074360	  0.526322	 -0.695142
  0.068661	  0.529379	 -0.676755
  0.064096	  0.540568	 -0.652522
  0.063232	  0.549416	 -0.633272
  0.062339	  0.558058	 -0.615645
  0.054065	  0.566361	 -0.594476
  0.048928	  0.571404	 -0.579933
  0.032928	  0.573620	 -0.561514
  0.015913	  0.572194	 -0.551425
 -0.006764	  0.572331	 -0.533891
 -0.023595	  0.569532	 -0.516960
 -0.034631	  0.569924	 -0.506893
 -0.048885	  0.562386	 -0.485470
 -0.056060	  0.555747	 -0.471168
 -0.061373	  0.552168	 -0.451742
 -0.069365	  0.554990	 -0.427065
 -0.076792	  0.559503	 -0.408789
 -0.082717	  0.570620	 -0.393561
 -0.094611	  0.583608	 -0.377684
 -0.103370	  0.593346	 -0.366711
 -0.116364	  0.602006	 -0.347557
 -0.127645	  0.602368	 -0.330353
 -0.137735	  0.603649	 -0.318603
 -0.157071	  0.602222	 -0.301044
 -0.168663	  0.604534	 -0.284505
 -0.175821	  0.609024	 -0.273044
 -0.190019	  0.618599	 -0.251444
 -0.200015	  0.623168	 -0.243075
 -0.212557	  0.629433	 -0.230867
 -0.227327	  0.634727	 -0.207491
 -0.235047	  0.635796	 -0.193464
 -0.246819	  0.633222	 -0.170142
 -0.257962	  0.632902	 -0.156920
 -0.271226	  0.634747	 -0.145615
 -0.290207	  0.641512	 -0.129900
 -0.300433	  0.651320	 -0.112146
 -0.303448	  0.660996	 -0.100244
 -0.309343	  0.674315	 -0.078089
 -0.321390	  0.678281	 -0.060747
 -0.330308	  0.679008	 -0.048810
 -0.344594	  0.677387	 -0.034454
 -0.361180	  0.675758	 -0.012923
 -0.375489	  0.671843	  0.007072
 -0.381058	  0.668763	  0.016814
 -0.397188	  0.667848	  0.034063
 -0.413891	  0.675147	  0.044528
 -0.429241	  0.682175	  0.059040
 -0.439717	  0.691250	  0.070791
 -0.450568	  0.703083	  0.086140
 -0.456769	  0.716329	  0.112390
 -0.461051	  0.715929	  0.131488
 -0.466785	  0.715023	  0.145086
 -0.477109	  0.718066	  0.164357
 -0.484551	  0.719146	  0.184543
 -0.490176	  0.716525	  0.202523
 -0.497706	  0.714739	  0.220608
 -0.505931	  0.712227	  0.238485
 -0.513074	  0.707434	  0.257478
 -0.522704	  0.705599	  0.283100
 -0.529423	  0.710909	  0.296530
 -0.536682	  0.722356	  0.311418
 -0.544682	  0.737983	  0.333284
 -0.551377	  0.747123	  0.349761
 -0.560446	  0.748348	  0.365097
 -0.571534	  0.746526	  0.380018
 -0.584689	  0.740133	  0.398293
 -0.597958	  0.738590	  0.417710
 -0.605324	  0.743303	  0.434793
 -0.610924	  0.745936	  0.451524
 -0.614623	  0.743988	  0.468831
 -0.622768	  0.735826	  0.487423
 -0.630874	  0.725727	  0.497786
 -0.638569	  0.713740	  0.503753
 -0.654728	  0.701407	  0.516676
 -0.666682	  0.692579	  0.526598
 -0.678986	  0.683295	  0.535146
 -0.693847	  0.668309	  0.545926
 -0.704181	  0.656107	  0.555292
 -0.713771	  0.644622	  0.567418
 -0.727269	  0.631410	  0.581115
 -0.739296	  0.617942	  0.591567
 -0.749621	  0.610454	  0.600484
 -0.765742	  0.593977	  0.610485
 -0.783126	  0.586124	  0.621320
 -0.794073	  0.585726	  0.629990
 -0.813492	  0.581892	  0.645244
 -0.834868	  0.575589	  0.657367
 -0.849406	  0.569945	  0.667367
 -0.861190	  0.567586	  0.678859
 -0.875298	  0.567200	  0.696782
 -0.892871	  0.568085	  0.709658
 -0.909354	  0.566071	  0.716833
 -0.930985	  0.561048	  0.721476
 -0.950076	  0.560369	  0.726029
 -0.972749	  0.563208	  0.734101
 -0.992329	  0.567619	  0.745681
 -1.005154	  0.573601	  0.755298
 -1.018884	  0.579093	  0.768438
 -1.035611	  0.583657	  0.783770
 -1.049219	  0.588265	  0.797732
 -1.061919	  0.591108	  0.810013
 -1.077947	  0.594253	  0.823041
 -1.096447	  0.593734	  0.834697
 -1.113027	  0.585115	  0.844867
 -1.129360	  0.574948	  0.863519
 -1.142687	  0.566672	  0.873808
 -1.157457	  0.560601	  0.883804
 -1.171561	  0.560290	  0.895617
 -1.188255	  0.563942	  0.910456
 -1.199899	  0.569151	  0.924955
 -1.210304	  0.576236	  0.937656
 -1.224240	  0.578298	  0.957695
 -1.238065	  0.576764	  0.976367
 -1.248261	  0.576404	  0.984657
 -1.270202	  0.576860	  0.995594
 -1.287531	  0.582686	  1.010185
 -1.296964	  0.596454	  1.031961
 -1.295473	  0.606515	  1.050041
 -1.293984	  0.619065	  1.070146
 -1.298819	  0.628116	  1.084630
 -1.303007	  0.638134	  1.099045
 -1.311589	  0.647048	  1.118643
 -1.316534	  0.657598	  1.135313
 -1.322211	  0.665921	  1.152067
 -1.322787	  0.672992	  1.167675
 -1.326098	  0.687732	  1.182077
 -1.326996	  0.710198	  1.200841
 -1.323073	  0.721867	  1.218111
 -1.320252	  0.732474	  1.234513
 -1.318837	  0.739326	  1.243738
 -1.328368	  0.756520	  1.264243
 -1.326156	  0.769827	  1.277175
 -1.318576	  0.778897	  1.291580
 -1.316921	  0.794129	  1.308589
 -1.311604	  0.811124	  1.322024
 -1.302815	  0.823744	  1.329994
 -1.294805	  0.840672	  1.344161
 -1.279546	  0.852435	  1.354072
 -1.256705	  0.857035	  1.360554
 -1.234573	  0.866623	  1.367761
 -1.223022	  0.884743	  1.375912
 -1.219180	  0.899636	  1.380676
 -1.210069	  0.918402	  1.380867
 -1.200304	  0.938256	  1.379978
 -1.189080	  0.955537	  1.384520
 -1.181143	  0.973505	  1.391829
 -1.177025	  0.992896	  1.392996
 -1.169549	  1.012530	  1.397915
 -1.164017	  1.029611	  1.408571
 -1.162801	  1.048558	  1.413976
 -1.159764	  1.069252	  1.425376
 -1.155858	  1.087288	  1.440719
 -1.161168	  1.099881	  1.454598
 -1.173503	  1.110367	  1.468894
 -1.185467	  1.125513	  1.485670
 -1.186703	  1.136334	  1.501070
 -1.182735	  1.145949	  1.520604
 -1.182647	  1.148370	  1.549401
 -1.191762	  1.144424	  1.568691
 -1.204502	  1.143772	  1.585708
 -1.215108	  1.145997	  1.601376
 -1.226332	  1.146996	  1.618425
 -1.237954	  1.147030	  1.636277
 -1.248800	  1.151252	  1.656979
 -1.255630	  1.159736	  1.672108
 -1.263510	  1.166362	  1.685457
 -1.276474	  1.172134	  1.705198
 -1.285273	  1.176961	  1.725234
 -1.288522	  1.182719	  1.738913
 -1.298273	  1.192836	  1.755902
 -1.321783	  1.196062	  1.766148
 -1.332888	  1.199785	  1.782359
