 -1.223785	 -1.463133	  1.311587
 -1.252888	 -1.458105	  1.329905
 -1.233916	 -1.467185	  1.327742
 -1.216873	 -1.467362	  1.315870
 -1.201127	 -1.468112	  1.301415
 -1.184900	 -1.473473	  1.291820
 -1.164199	 -1.479352	  1.284577
 -1.144452	 -1.481025	  1.273646
 -1.132665	 -1.479969	  1.264186
 -1.115131	 -1.480170	  1.251192
 -1.101245	 -1.482762	  1.237182
 -1.086535	 -1.485838	  1.224649
 -1.069913	 -1.487934	  1.212950
 -1.052648	 -1.488829	  1.197426
 -1.037683	 -1.487193	  1.186936
 -1.020568	 -1.486109	  1.177912
 -1.003162	 -1.490678	  1.166653
 -0.986746	 -1.497587	  1.155908
 -0.970756	 -1.504786	  1.147205
 -0.953577	 -1.508433	  1.136350
 -0.937097	 -1.512104	  1.125618
 -0.920721	 -1.516214	  1.114897
 -0.904345	 -1.520325	  1.104177
 -0.888215	 -1.525142	  1.093389
 -0.872188	 -1.530419	  1.083592
 -0.855000	 -1.536162	  1.075709
 -0.838650	 -1.542634	  1.065295
 -0.823319	 -1.549087	  1.050265
 -0.809918	 -1.555577	  1.040687
 -0.792755	 -1.565217	  1.034008
 -0.775652	 -1.572826	  1.023249
 -0.761280	 -1.572921	  1.011140
 -0.742712	 -1.573118	  0.994165
 -0.727882	 -1.581391	  0.981737
 -0.715243	 -1.594170	  0.975328
 -0.701910	 -1.610273	  0.969573
 -0.687970	 -1.628801	  0.961854
 -0.675238	 -1.643923	  0.952233
 -0.662763	 -1.651807	  0.942914
 -0.647641	 -1.655883	  0.928855
 -0.633112	 -1.661763	  0.909391
 -0.624254	 -1.667193	  0.895626
 -0.612342	 -1.675225	  0.882171
 -0.597835	 -1.686379	  0.866656
 -0.589925	 -1.697477	  0.854215
 -0.582559	 -1.709401	  0.841261
 -0.570010	 -1.720840	  0.824894
 -0.561335	 -1.729664	  0.808369
 -0.553188	 -1.734854	  0.794219
 -0.545593	 -1.747143	  0.775902
 -0.537990	 -1.758744	  0.763449
 -0.529141	 -1.771747	  0.750611
 -0.517071	 -1.782543	  0.736693
 -0.504572	 -1.790872	  0.719620
 -0.496230	 -1.794848	  0.709231
 -0.486614	 -1.805509	  0.693328
 -0.476309	 -1.817824	  0.680286
 -0.463782	 -1.831455	  0.666026
 -0.452609	 -1.840123	  0.652924
 -0.438187	 -1.844242	  0.636729
 -0.426545	 -1.846551	  0.624366
 -0.414571	 -1.852639	  0.609304
 -0.400176	 -1.862014	  0.592129
 -0.388047	 -1.866814	  0.581120
 -0.374918	 -1.874769	  0.571007
 -0.362563	 -1.887681	  0.557908
 -0.349117	 -1.895340	  0.540024
 -0.336032	 -1.898795	  0.531336
 -0.318490	 -1.905814	  0.524199
 -0.299087	 -1.916375	  0.511916
 -0.286012	 -1.925424	  0.498766
 -0.276087	 -1.931255	  0.485811
 -0.263965	 -1.933336	  0.470662
 -0.244732	 -1.930717	  0.454698
 -0.228150	 -1.930410	  0.446400
 -0.209954	 -1.931601	  0.437155
 -0.193547	 -1.933610	  0.421855
 -0.184232	 -1.936142	  0.410640
 -0.167929	 -1.939051	  0.399894
 -0.148323	 -1.937306	  0.390980
 -0.129263	 -1.929078	  0.377714
 -0.116909	 -1.924612	  0.371512
 -0.097445	 -1.916241	  0.365458
 -0.080510	 -1.909786	  0.356399
 -0.065300	 -1.905144	  0.346508
 -0.045736	 -1.895882	  0.335031
 -0.029970	 -1.886097	  0.330358
 -0.013859	 -1.877534	  0.328596
  0.005422	 -1.867329	  0.323651
  0.022535	 -1.858534	  0.320934
  0.037651	 -1.850412	  0.321196
  0.053443	 -1.839195	  0.314842
  0.071359	 -1.823433	  0.301846
  0.086055	 -1.814771	  0.299094
  0.103470	 -1.808493	  0.298678
  0.124217	 -1.799344	  0.295744
  0.137810	 -1.786977	  0.288124
  0.151434	 -1.776833	  0.277121
  0.167673	 -1.769323	  0.269110
  0.188605	 -1.760920	  0.261307
  0.205450	 -1.757084	  0.253928
  0.225571	 -1.751105	  0.245821
  0.240593	 -1.747572	  0.242900
  0.260931	 -1.745696	  0.237388
  0.281215	 -1.747970	  0.229661
  0.299401	 -1.745782	  0.221636
  0.316556	 -1.743239	  0.213382
  0.336051	 -1.745602	  0.205006
  0.354574	 -1.744607	  0.197252
  0.370677	 -1.742213	  0.188409
  0.388966	 -1.746167	  0.179389
  0.408427	 -1.747452	  0.171141
  0.424341	 -1.745274	  0.162163
  0.442283	 -1.748586	  0.152484
  0.461274	 -1.751820	  0.143686
  0.477420	 -1.747808	  0.134610
  0.493341	 -1.745831	  0.122099
  0.511946	 -1.753692	  0.107628
  0.529386	 -1.758738	  0.100904
  0.547352	 -1.758881	  0.099308
  0.569999	 -1.758793	  0.094136
  0.583721	 -1.764938	  0.078655
  0.592737	 -1.773525	  0.060122
  0.609057	 -1.780560	  0.044297
  0.625917	 -1.781144	  0.037667
  0.648066	 -1.778234	  0.032458
  0.663531	 -1.780137	  0.019873
  0.673481	 -1.784664	  0.005125
  0.694138	 -1.788540	 -0.010316
  0.710257	 -1.790796	 -0.022167
  0.718502	 -1.792776	 -0.033436
  0.733324	 -1.795426	 -0.051007
  0.747387	 -1.797774	 -0.064584
  0.758632	 -1.801235	 -0.081293
  0.773731	 -1.804396	 -0.097484
  0.789161	 -1.804806	 -0.105895
  0.808223	 -1.804881	 -0.116524
  0.824031	 -1.807477	 -0.132146
  0.831088	 -1.811098	 -0.149811
  0.841950	 -1.813690	 -0.167078
  0.858792	 -1.814343	 -0.179878
  0.875598	 -1.813985	 -0.189310
  0.890823	 -1.814893	 -0.203560
  0.904749	 -1.816017	 -0.217925
  0.918537	 -1.817083	 -0.232373
  0.932327	 -1.818147	 -0.246820
  0.946473	 -1.819399	 -0.260902
  0.960701	 -1.820693	 -0.274898
  0.974939	 -1.821986	 -0.288884
  0.990015	 -1.823625	 -0.301922
  1.005173	 -1.825294	 -0.314862
  1.020335	 -1.826964	 -0.327798
  1.036041	 -1.828950	 -0.340020
  1.051774	 -1.830952	 -0.352204
  1.067513	 -1.832960	 -0.364380
  1.083599	 -1.835517	 -0.375986
  1.099686	 -1.838075	 -0.387590
  1.115792	 -1.840672	 -0.399161
  1.132095	 -1.843718	 -0.410337
  1.148399	 -1.846765	 -0.421513
  1.164736	 -1.849916	 -0.432611
  1.181186	 -1.853436	 -0.443428
  1.197637	 -1.856958	 -0.454244
  1.214081	 -1.860662	 -0.465008
  1.230514	 -1.864598	 -0.475705
  1.246947	 -1.868536	 -0.486403
  1.262995	 -1.872993	 -0.497476
  1.278897	 -1.877635	 -0.508682
  1.294811	 -1.882282	 -0.519897
  1.310836	 -1.887057	 -0.531229
  1.326517	 -1.892221	 -0.542518
