 -1.942463	  1.336224	  0.020858
 -1.971738	  1.356326	  0.052887
 -1.958941	  1.349661	  0.039572
 -1.948845	  1.341431	  0.024289
 -1.938005	  1.335139	  0.008413
 -1.927034	  1.329319	 -0.007072
 -1.916097	  1.322067	 -0.021720
 -1.899161	  1.313322	 -0.040778
 -1.884531	  1.309288	 -0.052745
 -1.875180	  1.307822	 -0.058652
 -1.860325	  1.304913	 -0.073502
 -1.843318	  1.301525	 -0.091709
 -1.827425	  1.296584	 -0.105182
 -1.817750	  1.287487	 -0.116469
 -1.810850	  1.276398	 -0.131560
 -1.798010	  1.272293	 -0.146412
 -1.773809	  1.264150	 -0.163351
 -1.763780	  1.256092	 -0.170547
 -1.753233	  1.242272	 -0.179928
 -1.743677	  1.225251	 -0.191513
 -1.733207	  1.210577	 -0.202202
 -1.720164	  1.199028	 -0.215740
 -1.707805	  1.196372	 -0.234078
 -1.697467	  1.199555	 -0.255146
 -1.690881	  1.200671	 -0.275271
 -1.686445	  1.195859	 -0.294745
 -1.683181	  1.188559	 -0.311927
 -1.683091	  1.180094	 -0.332337
 -1.683821	  1.173864	 -0.351512
 -1.685037	  1.167985	 -0.369639
 -1.687227	  1.160082	 -0.388833
 -1.689376	  1.145014	 -0.402492
 -1.690984	  1.127927	 -0.418219
 -1.691047	  1.123319	 -0.439756
 -1.688310	  1.119806	 -0.462771
 -1.685431	  1.114639	 -0.480094
 -1.682430	  1.107756	 -0.497795
 -1.680727	  1.099728	 -0.515706
 -1.679331	  1.092178	 -0.535007
 -1.676755	  1.086552	 -0.552531
 -1.672956	  1.078812	 -0.572438
 -1.671029	  1.067764	 -0.590374
 -1.666698	  1.056578	 -0.606950
 -1.659849	  1.049934	 -0.620800
 -1.648225	  1.039578	 -0.643054
 -1.634158	  1.027116	 -0.661716
 -1.625994	  1.018911	 -0.670683
 -1.613355	  1.013488	 -0.677193
 -1.594784	  1.001057	 -0.686427
 -1.582526	  0.993611	 -0.689851
 -1.563087	  0.985438	 -0.697120
 -1.544003	  0.981912	 -0.705197
 -1.534128	  0.981105	 -0.709339
 -1.513516	  0.977652	 -0.716623
 -1.492006	  0.977016	 -0.716997
 -1.471814	  0.979467	 -0.722659
 -1.449528	  0.980364	 -0.727140
 -1.428760	  0.977727	 -0.724367
 -1.418075	  0.975123	 -0.721044
 -1.394228	  0.972191	 -0.720390
 -1.372731	  0.967886	 -0.715566
 -1.355150	  0.960079	 -0.712958
 -1.336305	  0.952898	 -0.710705
 -1.316863	  0.948037	 -0.707568
 -1.298200	  0.941518	 -0.703658
 -1.280548	  0.932641	 -0.699195
 -1.263874	  0.922300	 -0.694853
 -1.247166	  0.912248	 -0.690751
 -1.230026	  0.902832	 -0.686303
 -1.214545	  0.891302	 -0.684178
 -1.199704	  0.877039	 -0.690271
 -1.186243	  0.862649	 -0.691284
 -1.170461	  0.847856	 -0.677327
 -1.155482	  0.835041	 -0.667377
 -1.142305	  0.820426	 -0.664170
 -1.132015	  0.806395	 -0.664393
 -1.121120	  0.784439	 -0.668220
 -1.111509	  0.761929	 -0.669030
 -1.105348	  0.750508	 -0.667590
 -1.097941	  0.731467	 -0.659610
 -1.089979	  0.714590	 -0.655005
 -1.080995	  0.697497	 -0.654215
 -1.067860	  0.673139	 -0.653987
 -1.061504	  0.660277	 -0.653334
 -1.055239	  0.641002	 -0.648798
 -1.048077	  0.611749	 -0.640349
 -1.044316	  0.599713	 -0.637288
 -1.037098	  0.581068	 -0.636040
 -1.027060	  0.559175	 -0.641109
 -1.022764	  0.546515	 -0.644484
 -1.013127	  0.520107	 -0.659036
 -1.007271	  0.504711	 -0.671852
 -1.001400	  0.491017	 -0.679652
 -0.995527	  0.471905	 -0.689249
 -0.988681	  0.452585	 -0.700659
 -0.980826	  0.440198	 -0.703277
 -0.966802	  0.418102	 -0.703733
 -0.957181	  0.399869	 -0.703246
 -0.941932	  0.383862	 -0.700424
 -0.926495	  0.368651	 -0.694500
 -0.916122	  0.358722	 -0.693997
 -0.899133	  0.343714	 -0.699185
 -0.884828	  0.328000	 -0.702257
 -0.875961	  0.316259	 -0.705980
 -0.855399	  0.298344	 -0.715568
 -0.842687	  0.282449	 -0.720812
 -0.835907	  0.269229	 -0.726665
 -0.830183	  0.257498	 -0.734117
 -0.813988	  0.242761	 -0.744094
 -0.799253	  0.226861	 -0.749579
 -0.785481	  0.217735	 -0.753531
 -0.773425	  0.212579	 -0.755628
 -0.749019	  0.195784	 -0.760099
 -0.732141	  0.179946	 -0.762837
 -0.723643	  0.171082	 -0.764547
 -0.707838	  0.160595	 -0.768949
 -0.686454	  0.150524	 -0.776826
 -0.668080	  0.138222	 -0.784363
 -0.659680	  0.127875	 -0.790920
 -0.647336	  0.113816	 -0.797048
 -0.627977	  0.098982	 -0.803319
 -0.607187	  0.086977	 -0.811066
 -0.597148	  0.081848	 -0.813702
 -0.586860	  0.071720	 -0.821581
 -0.570362	  0.055854	 -0.831297
 -0.558430	  0.044851	 -0.837249
 -0.545392	  0.028363	 -0.846756
 -0.533266	  0.011822	 -0.857368
 -0.520192	 -0.002051	 -0.864166
 -0.507434	 -0.013339	 -0.867924
 -0.490283	 -0.023000	 -0.871053
 -0.470596	 -0.033734	 -0.873037
 -0.452837	 -0.046048	 -0.878728
 -0.442196	 -0.054798	 -0.887650
 -0.428719	 -0.065985	 -0.901477
 -0.413291	 -0.078330	 -0.914027
 -0.398894	 -0.086873	 -0.922297
 -0.386048	 -0.096417	 -0.928725
 -0.370688	 -0.111775	 -0.937645
 -0.352374	 -0.124180	 -0.940413
 -0.341160	 -0.133479	 -0.943779
 -0.325647	 -0.154752	 -0.956353
 -0.316547	 -0.168180	 -0.965375
 -0.303204	 -0.181260	 -0.978136
 -0.294420	 -0.190006	 -0.986846
 -0.285491	 -0.201486	 -1.003508
 -0.277642	 -0.207621	 -1.015010
 -0.268616	 -0.216110	 -1.038622
 -0.262785	 -0.228472	 -1.062684
 -0.256976	 -0.238914	 -1.082186
 -0.253827	 -0.244972	 -1.100932
 -0.248170	 -0.251414	 -1.120838
 -0.246024	 -0.255804	 -1.132833
 -0.242208	 -0.265901	 -1.150613
 -0.236597	 -0.277896	 -1.171504
 -0.231478	 -0.284675	 -1.182051
 -0.222713	 -0.290867	 -1.198160
 -0.210532	 -0.301535	 -1.214965
 -0.205602	 -0.310991	 -1.227418
 -0.199718	 -0.324434	 -1.248661
 -0.191633	 -0.333619	 -1.270341
 -0.182561	 -0.338896	 -1.284527
 -0.175253	 -0.347041	 -1.296350
 -0.167692	 -0.363807	 -1.309794
 -0.160428	 -0.380593	 -1.322093
 -0.153795	 -0.393403	 -1.333970
 -0.146680	 -0.406117	 -1.349484
 -0.142382	 -0.415588	 -1.366716
 -0.140912	 -0.422146	 -1.384776
 -0.140315	 -0.428543	 -1.402122
 -0.141252	 -0.439935	 -1.423108
 -0.145570	 -0.455325	 -1.445265
 -0.146725	 -0.462600	 -1.458778
 -0.143749	 -0.475295	 -1.475899
 -0.137315	 -0.487082	 -1.489073
 -0.130970	 -0.497097	 -1.505675
 -0.128569	 -0.505214	 -1.523109
 -0.126244	 -0.511282	 -1.540547
 -0.120481	 -0.517860	 -1.558305
 -0.107282	 -0.531877	 -1.581537
 -0.097873	 -0.538582	 -1.596720
 -0.089468	 -0.542808	 -1.610714
 -0.080564	 -0.546251	 -1.625883
 -0.065106	 -0.546514	 -1.644694
 -0.051987	 -0.546745	 -1.658152
 -0.037826	 -0.549037	 -1.672675
 -0.021047	 -0.551564	 -1.690730
 -0.007115	 -0.551434	 -1.704900
  0.004859	 -0.550881	 -1.717084
  0.020013	 -0.551062	 -1.730760
  0.037615	 -0.550753	 -1.741406
  0.058131	 -0.549527	 -1.747798
  0.081347	 -0.549650	 -1.754424
  0.101301	 -0.549082	 -1.764024
  0.112974	 -0.547559	 -1.770684
  0.129799	 -0.542163	 -1.784793
  0.145614	 -0.537496	 -1.798427
  0.158742	 -0.534412	 -1.810203
  0.174914	 -0.529354	 -1.824129
  0.188259	 -0.523141	 -1.835581
  0.201796	 -0.515925	 -1.848713
  0.224570	 -0.506696	 -1.863192
  0.237372	 -0.502389	 -1.868575
  0.250226	 -0.498839	 -1.872863
  0.271861	 -0.492465	 -1.879722
  0.291180	 -0.485453	 -1.884930
  0.305805	 -0.477442	 -1.894652
  0.315071	 -0.467733	 -1.907682
  0.330228	 -0.453525	 -1.922089
  0.352691	 -0.446346	 -1.926285
  0.375277	 -0.440911	 -1.927934
  0.394814	 -0.437840	 -1.929699
  0.406173	 -0.429083	 -1.940553
  0.415419	 -0.414060	 -1.955133
  0.429374	 -0.402624	 -1.965232
  0.444599	 -0.392994	 -1.974097
  0.460193	 -0.383796	 -1.982790
  0.475349	 -0.373805	 -1.991482
  0.489229	 -0.363001	 -2.000431
  0.502350	 -0.354972	 -2.011239
  0.511996	 -0.352817	 -2.029933
  0.525439	 -0.351944	 -2.048331
  0.539664	 -0.354736	 -2.060427
  0.552767	 -0.363738	 -2.072945
  0.566817	 -0.367772	 -2.088202
  0.586021	 -0.369458	 -2.101903
  0.606604	 -0.376656	 -2.103151
  0.630595	 -0.383927	 -2.101578
  0.651353	 -0.389965	 -2.106946
  0.667217	 -0.396626	 -2.117120
  0.678549	 -0.401100	 -2.129544
  0.691847	 -0.406764	 -2.145191
  0.707093	 -0.412044	 -2.157646
  0.720947	 -0.417167	 -2.169173
  0.734623	 -0.421951	 -2.183435
  0.752686	 -0.428379	 -2.200275
  0.768607	 -0.434436	 -2.209596
  0.782072	 -0.438893	 -2.214899
  0.799429	 -0.448916	 -2.222731
  0.814880	 -0.458686	 -2.233391
  0.829531	 -0.464556	 -2.244717
  0.844028	 -0.472822	 -2.255742
