 -2.152055	  0.302955	  2.111345
 -2.130747	  0.299955	  2.090441
 -2.101117	  0.274089	  2.064311
 -2.082618	  0.243348	  2.028645
 -2.053041	  0.214969	  1.997431
 -2.030980	  0.185946	  1.963434
 -2.012252	  0.155989	  1.927604
 -1.995572	  0.124160	  1.891970
 -1.980220	  0.091241	  1.857775
 -1.964669	  0.057183	  1.825127
 -1.947012	  0.022920	  1.794808
 -1.924417	 -0.011502	  1.765648
 -1.898915	 -0.045175	  1.737276
 -1.871793	 -0.078187	  1.709166
 -1.845242	 -0.108762	  1.682961
 -1.817429	 -0.139848	  1.656120
 -1.794012	 -0.172263	  1.625055
 -1.776902	 -0.204946	  1.591021
 -1.758794	 -0.240084	  1.557974
 -1.743101	 -0.279034	  1.526554
 -1.723908	 -0.315501	  1.499562
 -1.703816	 -0.349413	  1.472771
 -1.685923	 -0.384136	  1.441101
 -1.668039	 -0.418246	  1.406730
 -1.656781	 -0.447058	  1.365492
 -1.638941	 -0.476369	  1.330937
 -1.628782	 -0.506374	  1.292263
 -1.611441	 -0.537506	  1.255685
 -1.594518	 -0.573930	  1.222196
 -1.578672	 -0.613095	  1.194140
 -1.569813	 -0.653766	  1.169790
 -1.571802	 -0.686824	  1.148961
 -1.580727	 -0.707589	  1.135298
 -1.597374	 -0.722566	  1.126200
 -1.665536	 -0.766660	  1.093816
 -1.752772	 -0.852435	  1.000798
 -1.792949	 -0.926288	  0.920299
 -1.798042	 -0.974809	  0.868311
 -1.786128	 -1.021086	  0.823475
 -1.749316	 -1.069725	  0.785363
 -1.699223	 -1.107637	  0.759596
 -1.661711	 -1.125790	  0.745313
 -1.619712	 -1.139374	  0.733493
 -1.574585	 -1.148129	  0.723836
 -1.507633	 -1.150591	  0.713281
 -1.386700	 -1.146182	  0.696145
 -1.267112	 -1.154926	  0.664673
 -1.195052	 -1.180967	  0.627984
 -1.152918	 -1.208349	  0.595026
 -1.122377	 -1.237151	  0.560881
 -1.098380	 -1.269161	  0.524704
 -1.080719	 -1.301675	  0.490737
 -1.065316	 -1.336403	  0.456747
 -1.051415	 -1.373633	  0.425105
 -1.038468	 -1.412835	  0.398649
 -1.027070	 -1.455117	  0.376897
 -1.016000	 -1.502221	  0.359919
 -0.991322	 -1.577491	  0.348422
 -0.933863	 -1.679674	  0.375128
 -0.884323	 -1.760418	  0.410169
 -0.847644	 -1.813763	  0.425818
 -0.809345	 -1.863933	  0.430343
 -0.759022	 -1.924255	  0.422740
 -0.722074	 -1.961978	  0.406504
 -0.706298	 -1.976920	  0.392704
 -0.698332	 -1.984420	  0.379157
 -0.685249	 -1.994247	  0.339460
 -0.674949	 -1.996363	  0.277777
 -0.672512	 -1.995523	  0.190563
 -0.679375	 -2.000374	  0.103492
 -0.690168	 -2.011804	  0.035780
 -0.705933	 -2.029800	 -0.036625
 -0.711252	 -2.061733	 -0.126576
 -0.696080	 -2.090031	 -0.188335
 -0.676423	 -2.113930	 -0.230137
 -0.654109	 -2.139376	 -0.266064
 -0.631272	 -2.165037	 -0.297846
 -0.607884	 -2.193712	 -0.327221
 -0.583699	 -2.226962	 -0.356744
 -0.560314	 -2.260855	 -0.386499
 -0.537256	 -2.293621	 -0.418355
 -0.515266	 -2.323534	 -0.451404
 -0.493550	 -2.352836	 -0.486185
 -0.472828	 -2.382345	 -0.521829
 -0.452445	 -2.412460	 -0.555802
 -0.428490	 -2.444325	 -0.587905
 -0.405288	 -2.473727	 -0.618753
 -0.388090	 -2.498511	 -0.657881
 -0.360779	 -2.531628	 -0.684955
 -0.347999	 -2.566311	 -0.719470
 -0.321826	 -2.592943	 -0.752801
 -0.305565	 -2.625747	 -0.788416
 -0.282700	 -2.660697	 -0.818483
 -0.260601	 -2.692001	 -0.849617
 -0.244868	 -2.726828	 -0.884783
 -0.221599	 -2.762381	 -0.913851
 -0.198756	 -2.792978	 -0.947541
 -0.186989	 -2.828368	 -0.982532
 -0.188858	 -2.856652	 -0.992357
