  0.887753	  1.618145	 -1.730803
  0.888175	  1.619550	 -1.731508
  0.881502	  1.605623	 -1.719970
  0.877369	  1.585473	 -1.713956
  0.873410	  1.566287	 -1.707334
  0.869911	  1.548588	 -1.701220
  0.865508	  1.529137	 -1.694432
  0.859349	  1.510763	 -1.684772
  0.854721	  1.496777	 -1.677955
  0.848804	  1.475772	 -1.667744
  0.842896	  1.458042	 -1.655719
  0.837533	  1.448681	 -1.647035
  0.828033	  1.430964	 -1.631044
  0.820245	  1.411140	 -1.618707
  0.817006	  1.400260	 -1.613127
  0.817732	  1.378508	 -1.608587
  0.820635	  1.360263	 -1.599758
  0.820056	  1.341461	 -1.589739
  0.819632	  1.323346	 -1.580963
  0.820045	  1.305238	 -1.572305
  0.821178	  1.287539	 -1.563835
  0.820151	  1.271726	 -1.552231
  0.821225	  1.256630	 -1.536881
  0.826676	  1.242209	 -1.522414
  0.832867	  1.225396	 -1.512308
  0.837001	  1.203105	 -1.511008
  0.843276	  1.179866	 -1.511893
  0.851706	  1.163099	 -1.504562
  0.859273	  1.151420	 -1.491728
  0.867100	  1.144625	 -1.475357
  0.880165	  1.131279	 -1.455253
  0.889586	  1.114451	 -1.444897
  0.894271	  1.105161	 -1.439834
  0.897715	  1.094362	 -1.423436
  0.907967	  1.081995	 -1.404609
  0.921885	  1.063435	 -1.391749
  0.928416	  1.045517	 -1.387046
  0.928343	  1.030410	 -1.380475
  0.924324	  1.013481	 -1.365331
  0.922203	  1.002075	 -1.347693
  0.929418	  0.992215	 -1.324756
  0.943337	  0.980290	 -1.309458
  0.952880	  0.970372	 -1.298954
  0.960517	  0.956101	 -1.289655
  0.961910	  0.939090	 -1.278015
  0.963020	  0.919689	 -1.265697
  0.968544	  0.902680	 -1.254130
  0.975834	  0.887422	 -1.241443
  0.979212	  0.874585	 -1.230043
  0.977425	  0.860158	 -1.217361
  0.974412	  0.842310	 -1.204336
  0.977240	  0.826629	 -1.191686
  0.981483	  0.811668	 -1.174506
  0.983738	  0.803378	 -1.159385
  0.982280	  0.793769	 -1.144431
  0.976315	  0.779458	 -1.130822
  0.973178	  0.762234	 -1.119212
  0.972132	  0.745169	 -1.108613
  0.970133	  0.729941	 -1.097600
  0.965891	  0.715301	 -1.085477
  0.960720	  0.698929	 -1.076894
  0.958451	  0.679670	 -1.067966
  0.962226	  0.661765	 -1.053832
  0.962719	  0.647165	 -1.036505
  0.958045	  0.636261	 -1.024375
  0.945738	  0.624761	 -1.013171
  0.925707	  0.606933	 -1.002815
  0.917092	  0.586348	 -0.996901
  0.914237	  0.571106	 -0.992760
  0.913037	  0.551445	 -0.987577
  0.912829	  0.533902	 -0.980115
  0.913276	  0.518257	 -0.972531
  0.907867	  0.489842	 -0.962101
  0.898106	  0.472115	 -0.957726
  0.889040	  0.459106	 -0.956343
  0.878546	  0.442350	 -0.956597
  0.866899	  0.420334	 -0.955942
  0.858978	  0.404156	 -0.954042
  0.854203	  0.387993	 -0.950715
  0.848067	  0.368543	 -0.943688
  0.841365	  0.348829	 -0.938804
  0.833966	  0.330477	 -0.936886
  0.824784	  0.313715	 -0.936485
  0.816188	  0.293925	 -0.936719
  0.812305	  0.272233	 -0.938349
  0.812380	  0.250692	 -0.937712
  0.811207	  0.232337	 -0.933376
  0.805206	  0.213651	 -0.925439
  0.795697	  0.197009	 -0.914633
  0.785166	  0.182580	 -0.903401
  0.774783	  0.167920	 -0.893757
  0.767288	  0.150783	 -0.885712
  0.759334	  0.134409	 -0.877132
  0.750110	  0.119310	 -0.867620
  0.740815	  0.104415	 -0.857934
  0.731291	  0.089995	 -0.847792
  0.721692	  0.075734	 -0.837261
  0.711338	  0.062952	 -0.825436
  0.701002	  0.050550	 -0.813580
  0.690544	  0.038582	 -0.801551
  0.680923	  0.026471	 -0.789055
  0.672206	  0.013749	 -0.776411
  0.664141	  0.001043	 -0.763816
  0.658653	 -0.011947	 -0.751669
  0.658145	 -0.025318	 -0.740504
  0.662789	 -0.042194	 -0.732783
  0.665228	 -0.059599	 -0.732835
  0.661253	 -0.089299	 -0.725565
  0.658985	 -0.100555	 -0.718104
  0.657667	 -0.112961	 -0.708929
  0.658690	 -0.132023	 -0.697886
  0.657571	 -0.154871	 -0.690828
  0.654442	 -0.175405	 -0.687679
  0.657040	 -0.199045	 -0.684998
  0.659958	 -0.210466	 -0.684602
  0.667884	 -0.229979	 -0.689006
  0.672908	 -0.248106	 -0.697033
  0.679680	 -0.263412	 -0.705601
  0.689943	 -0.287833	 -0.713684
  0.694016	 -0.302297	 -0.715716
  0.698033	 -0.321913	 -0.715402
  0.702438	 -0.343758	 -0.715542
  0.703818	 -0.363197	 -0.713858
  0.702884	 -0.387261	 -0.708891
  0.704086	 -0.405542	 -0.707681
  0.711170	 -0.422350	 -0.713041
  0.717337	 -0.440457	 -0.722752
  0.720086	 -0.461258	 -0.726873
  0.719950	 -0.481400	 -0.726542
  0.719932	 -0.501395	 -0.726106
  0.720110	 -0.521407	 -0.725671
  0.719922	 -0.541505	 -0.724878
  0.717978	 -0.561385	 -0.722062
  0.715253	 -0.580994	 -0.718782
  0.711579	 -0.599155	 -0.717126
  0.706161	 -0.617769	 -0.717359
  0.699561	 -0.636485	 -0.709815
  0.692950	 -0.658502	 -0.698779
  0.688218	 -0.672241	 -0.690632
  0.683274	 -0.690063	 -0.680037
  0.681206	 -0.709349	 -0.671922
  0.679396	 -0.727236	 -0.666431
  0.673731	 -0.749690	 -0.662444
  0.669601	 -0.761710	 -0.659366
  0.661651	 -0.783877	 -0.652770
  0.655449	 -0.807829	 -0.643966
  0.654370	 -0.816431	 -0.639827
  0.651785	 -0.839807	 -0.631152
  0.650083	 -0.860836	 -0.623195
  0.649904	 -0.875568	 -0.617244
  0.651296	 -0.891100	 -0.608263
  0.654725	 -0.907448	 -0.596492
  0.657926	 -0.923758	 -0.584664
  0.655699	 -0.946458	 -0.567236
  0.653030	 -0.956007	 -0.559095
  0.646214	 -0.968733	 -0.548498
  0.632502	 -0.993652	 -0.535281
  0.628427	 -1.010544	 -0.529015
  0.626672	 -1.022985	 -0.524290
  0.626788	 -1.047971	 -0.515622
  0.624575	 -1.071725	 -0.509423
  0.624709	 -1.083171	 -0.503606
  0.626357	 -1.104386	 -0.495409
  0.632318	 -1.130853	 -0.482077
  0.634428	 -1.135224	 -0.475095
  0.639772	 -1.149346	 -0.465381
  0.642513	 -1.173776	 -0.443704
  0.639854	 -1.186802	 -0.434179
  0.636081	 -1.203972	 -0.423431
  0.630331	 -1.221842	 -0.415748
  0.622516	 -1.240564	 -0.407091
  0.617795	 -1.259026	 -0.397642
  0.614454	 -1.277668	 -0.391300
  0.608670	 -1.292670	 -0.385817
  0.599671	 -1.314977	 -0.374146
  0.594777	 -1.334271	 -0.367024
  0.592953	 -1.348001	 -0.364807
  0.586904	 -1.370596	 -0.359211
  0.581433	 -1.386917	 -0.353992
  0.578820	 -1.403616	 -0.351022
  0.575634	 -1.429131	 -0.348466
  0.570788	 -1.448763	 -0.346680
  0.566820	 -1.465703	 -0.343057
  0.563295	 -1.488948	 -0.335333
  0.561517	 -1.506989	 -0.329404
  0.559031	 -1.519439	 -0.324771
  0.547633	 -1.538274	 -0.319154
  0.538318	 -1.557833	 -0.314624
  0.533901	 -1.577067	 -0.308629
  0.531038	 -1.595911	 -0.302117
  0.529599	 -1.614571	 -0.295328
  0.528034	 -1.632885	 -0.287569
  0.524410	 -1.650890	 -0.279320
  0.520192	 -1.668369	 -0.270304
  0.517455	 -1.685842	 -0.260628
  0.516111	 -1.703254	 -0.250444
  0.516754	 -1.721118	 -0.240831
  0.516138	 -1.738929	 -0.231578
  0.513796	 -1.757448	 -0.224452
  0.512381	 -1.775324	 -0.217167
  0.514772	 -1.791499	 -0.206565
  0.522849	 -1.807115	 -0.192632
  0.528362	 -1.825045	 -0.181478
  0.527250	 -1.841344	 -0.173678
  0.524867	 -1.861323	 -0.167166
  0.521020	 -1.889997	 -0.157681
  0.519695	 -1.899881	 -0.153419
  0.520274	 -1.919129	 -0.146284
  0.522288	 -1.936483	 -0.136663
  0.522771	 -1.953458	 -0.124452
  0.517848	 -1.968448	 -0.115686
  0.513934	 -1.989185	 -0.109781
  0.514311	 -2.015227	 -0.100107
  0.514401	 -2.026895	 -0.095479
  0.516469	 -2.043130	 -0.086975
  0.519324	 -2.060656	 -0.075006
  0.527198	 -2.078709	 -0.060101
  0.531700	 -2.097609	 -0.048276
  0.532754	 -2.112818	 -0.040534
  0.533207	 -2.125777	 -0.033211
  0.532748	 -2.154307	 -0.019687
  0.530203	 -2.171358	 -0.016013
  0.528143	 -2.183125	 -0.014224
  0.522309	 -2.203707	 -0.005795
  0.519050	 -2.223719	  0.003658
  0.517203	 -2.241486	  0.012857
  0.515266	 -2.258740	  0.022558
  0.512823	 -2.276235	  0.032208
  0.510184	 -2.294056	  0.041090
  0.507727	 -2.312094	  0.049554
  0.505296	 -2.330528	  0.056904
  0.503188	 -2.348951	  0.064629
  0.500713	 -2.367674	  0.071126
  0.498428	 -2.386415	  0.077823
  0.496380	 -2.405208	  0.084416
  0.494451	 -2.423882	  0.091328
  0.492442	 -2.442442	  0.098510
  0.490436	 -2.461000	  0.105706
  0.488397	 -2.479674	  0.112960
  0.485147	 -2.498491	  0.121177
  0.481786	 -2.516489	  0.129223
