  2.620102	  0.992078	 -1.154014
  2.594160	  0.982255	 -1.142589
  2.563054	  0.948645	 -1.139982
  2.536611	  0.911494	 -1.152945
  2.502184	  0.877081	 -1.159193
  2.468838	  0.841113	 -1.170636
  2.439765	  0.800024	 -1.179152
  2.408086	  0.760321	 -1.185220
  2.376547	  0.722041	 -1.191704
  2.345850	  0.684653	 -1.198959
  2.315291	  0.646899	 -1.206235
  2.284618	  0.608727	 -1.212594
  2.253810	  0.569457	 -1.217060
  2.223652	  0.528940	 -1.218119
  2.192960	  0.489769	 -1.218020
  2.160546	  0.451611	 -1.217710
  2.124656	  0.414598	 -1.217506
  2.089223	  0.376411	 -1.221934
  2.057474	  0.337354	 -1.230927
  2.029618	  0.297115	 -1.240098
  2.001743	  0.258399	 -1.250260
  1.974732	  0.219494	 -1.257935
  1.948158	  0.179232	 -1.268038
  1.921405	  0.138074	 -1.279980
  1.892115	  0.097153	 -1.292476
  1.859667	  0.059186	 -1.306854
  1.825494	  0.024309	 -1.322380
  1.790148	 -0.009186	 -1.336948
  1.754145	 -0.043405	 -1.349259
  1.719215	 -0.079245	 -1.357975
  1.685288	 -0.116738	 -1.364607
  1.652110	 -0.154418	 -1.368774
  1.619645	 -0.191887	 -1.370814
  1.587131	 -0.229760	 -1.372257
  1.553177	 -0.268197	 -1.374798
  1.518274	 -0.305445	 -1.377992
  1.484683	 -0.342369	 -1.383143
  1.458478	 -0.382867	 -1.393420
  1.458385	 -0.443916	 -1.418326
  1.513863	 -0.518601	 -1.475684
  1.531261	 -0.607267	 -1.529188
  1.510197	 -0.660633	 -1.549695
  1.484701	 -0.681040	 -1.553171
  1.446187	 -0.690147	 -1.547655
  1.363376	 -0.689447	 -1.524127
  1.255807	 -0.690714	 -1.484995
  1.174626	 -0.712193	 -1.457817
  1.125948	 -0.746421	 -1.451526
  1.092193	 -0.785844	 -1.453742
  1.063907	 -0.827304	 -1.461004
  1.037770	 -0.868868	 -1.471720
  1.011024	 -0.910037	 -1.484851
  0.982368	 -0.950533	 -1.499013
  0.951733	 -0.989435	 -1.513104
  0.919004	 -1.026527	 -1.526792
  0.883829	 -1.061194	 -1.539921
  0.847415	 -1.093090	 -1.551793
  0.809738	 -1.123985	 -1.562256
  0.770412	 -1.155427	 -1.570399
  0.731760	 -1.186855	 -1.576175
  0.693733	 -1.218203	 -1.580870
  0.655796	 -1.248521	 -1.585716
  0.617943	 -1.280540	 -1.590117
  0.583003	 -1.316506	 -1.594472
  0.551747	 -1.356458	 -1.600200
  0.521977	 -1.399478	 -1.605977
  0.492660	 -1.443260	 -1.611308
  0.464422	 -1.486134	 -1.615353
  0.437560	 -1.527263	 -1.618491
  0.410093	 -1.566434	 -1.623079
  0.381305	 -1.604993	 -1.628989
  0.351153	 -1.644433	 -1.635786
  0.321059	 -1.684261	 -1.641396
  0.289033	 -1.722119	 -1.642731
  0.254116	 -1.759554	 -1.644205
  0.218200	 -1.795613	 -1.649380
  0.190526	 -1.834438	 -1.664485
  0.153318	 -1.867226	 -1.662687
  0.126509	 -1.908278	 -1.674093
  0.094001	 -1.947874	 -1.677325
  0.062429	 -1.985689	 -1.692327
  0.026629	 -2.021595	 -1.690963
 -0.003194	 -2.060993	 -1.699805
 -0.037199	 -2.097131	 -1.712674
 -0.070233	 -2.136923	 -1.712795
 -0.098560	 -2.177241	 -1.725854
 -0.133314	 -2.213801	 -1.731969
 -0.168792	 -2.249207	 -1.738038
 -0.198999	 -2.288259	 -1.745177
 -0.229529	 -2.326934	 -1.752852
 -0.262529	 -2.365161	 -1.761861
 -0.298713	 -2.403710	 -1.770014
 -0.301700	 -2.427747	 -1.787714
