 -0.734614	 -2.259265	  0.270913
 -0.738627	 -2.287342	  0.292310
 -0.734317	 -2.273795	  0.282902
 -0.729935	 -2.260303	  0.269390
 -0.724865	 -2.246354	  0.255357
 -0.716349	 -2.225818	  0.237805
 -0.709508	 -2.210384	  0.224236
 -0.707029	 -2.202714	  0.217440
 -0.700172	 -2.190433	  0.205445
 -0.691636	 -2.177689	  0.191669
 -0.682942	 -2.164737	  0.179326
 -0.673811	 -2.150851	  0.170531
 -0.662697	 -2.139945	  0.162722
 -0.649830	 -2.127905	  0.147906
 -0.638425	 -2.120325	  0.133737
 -0.630334	 -2.116776	  0.121497
 -0.622466	 -2.115875	  0.111676
 -0.609101	 -2.107240	  0.095276
 -0.596028	 -2.104193	  0.085783
 -0.578869	 -2.102534	  0.079361
 -0.560089	 -2.101322	  0.067766
 -0.544476	 -2.101508	  0.056508
 -0.529250	 -2.103173	  0.045406
 -0.513618	 -2.102867	  0.032762
 -0.500735	 -2.104907	  0.018912
 -0.487646	 -2.108318	  0.003196
 -0.477091	 -2.111864	 -0.013029
 -0.466347	 -2.114372	 -0.030208
 -0.459227	 -2.115558	 -0.048318
 -0.453385	 -2.114110	 -0.069186
 -0.445882	 -2.112002	 -0.087262
 -0.437142	 -2.111760	 -0.104081
 -0.429269	 -2.116396	 -0.120883
 -0.421952	 -2.125509	 -0.138330
 -0.413959	 -2.134474	 -0.154480
 -0.408868	 -2.139375	 -0.173697
 -0.410339	 -2.140175	 -0.193694
 -0.412625	 -2.140453	 -0.213568
 -0.414993	 -2.140710	 -0.233424
 -0.416993	 -2.140856	 -0.253287
 -0.418140	 -2.140789	 -0.273313
 -0.419608	 -2.140815	 -0.293373
 -0.423672	 -2.140120	 -0.312933
 -0.431501	 -2.134368	 -0.329848
 -0.439406	 -2.125128	 -0.345504
 -0.447119	 -2.120079	 -0.363578
 -0.454336	 -2.120737	 -0.383356
 -0.458067	 -2.117624	 -0.404912
 -0.462031	 -2.107487	 -0.425577
 -0.471235	 -2.095949	 -0.439954
 -0.483865	 -2.087380	 -0.451491
 -0.496355	 -2.084445	 -0.466154
 -0.501742	 -2.078413	 -0.487480
 -0.510066	 -2.061678	 -0.507630
 -0.517167	 -2.048461	 -0.515858
 -0.528552	 -2.036885	 -0.524786
 -0.543246	 -2.029388	 -0.539230
 -0.554083	 -2.019172	 -0.553140
 -0.563415	 -2.001931	 -0.561444
 -0.570394	 -1.978384	 -0.565271
 -0.578069	 -1.961610	 -0.573739
 -0.586548	 -1.950565	 -0.588242
 -0.599318	 -1.947108	 -0.607677
 -0.612619	 -1.940530	 -0.626100
 -0.623107	 -1.920272	 -0.640419
 -0.625587	 -1.895782	 -0.643571
 -0.629102	 -1.879533	 -0.641103
 -0.644524	 -1.865630	 -0.642773
 -0.659571	 -1.854671	 -0.653111
 -0.673131	 -1.839427	 -0.655892
 -0.678769	 -1.810914	 -0.655978
 -0.680420	 -1.788117	 -0.659485
 -0.683721	 -1.771538	 -0.668192
 -0.695917	 -1.759154	 -0.682507
 -0.714419	 -1.752958	 -0.689693
 -0.730328	 -1.739990	 -0.696560
 -0.742613	 -1.724597	 -0.701974
 -0.754040	 -1.708929	 -0.704989
 -0.764998	 -1.691738	 -0.705375
 -0.777822	 -1.675407	 -0.703979
 -0.792196	 -1.660794	 -0.705225
 -0.802461	 -1.647493	 -0.708472
 -0.810797	 -1.629196	 -0.708609
 -0.825771	 -1.610817	 -0.708766
 -0.844041	 -1.595747	 -0.713910
 -0.856832	 -1.584163	 -0.722046
 -0.864950	 -1.572909	 -0.730999
 -0.873438	 -1.553528	 -0.738247
 -0.885218	 -1.536087	 -0.744356
 -0.899129	 -1.523094	 -0.751186
 -0.912858	 -1.509136	 -0.756351
 -0.927919	 -1.495670	 -0.758796
 -0.943117	 -1.483158	 -0.759021
 -0.957388	 -1.471348	 -0.752993
 -0.972849	 -1.462203	 -0.743637
 -0.988350	 -1.452830	 -0.733609
 -1.003970	 -1.439755	 -0.724466
 -1.017200	 -1.425647	 -0.717332
 -1.029102	 -1.409623	 -0.712326
 -1.040846	 -1.389198	 -0.710092
 -1.048693	 -1.371587	 -0.706537
 -1.055287	 -1.358468	 -0.698254
 -1.066106	 -1.347161	 -0.685060
 -1.078069	 -1.338338	 -0.672461
 -1.092171	 -1.326593	 -0.662890
 -1.106896	 -1.312178	 -0.652652
 -1.116672	 -1.297910	 -0.640320
 -1.120057	 -1.285937	 -0.624833
 -1.122430	 -1.278352	 -0.606493
 -1.128261	 -1.272956	 -0.587840
 -1.137599	 -1.265275	 -0.568682
 -1.144657	 -1.253041	 -0.550644
 -1.145879	 -1.242064	 -0.536251
 -1.146505	 -1.232791	 -0.521962
 -1.152994	 -1.225532	 -0.503612
 -1.167163	 -1.215996	 -0.485553
 -1.178161	 -1.207298	 -0.469116
 -1.180638	 -1.196531	 -0.453449
 -1.175253	 -1.187108	 -0.432721
 -1.162646	 -1.182823	 -0.414888
 -1.151293	 -1.171085	 -0.401216
 -1.149915	 -1.163024	 -0.389585
 -1.144211	 -1.154049	 -0.376221
 -1.128748	 -1.143112	 -0.370264
 -1.111414	 -1.133223	 -0.368714
 -1.094222	 -1.123749	 -0.369391
 -1.078418	 -1.114725	 -0.376451
 -1.064869	 -1.105624	 -0.387883
 -1.051777	 -1.096502	 -0.399929
 -1.038974	 -1.087189	 -0.412113
 -1.028072	 -1.076628	 -0.425041
 -1.019163	 -1.065037	 -0.438552
 -1.010081	 -1.054343	 -0.452242
 -0.998496	 -1.048655	 -0.468395
 -0.986172	 -1.041947	 -0.488586
 -0.977033	 -1.032504	 -0.501441
 -0.974224	 -1.010578	 -0.504719
 -0.970961	 -0.984181	 -0.512923
 -0.961694	 -0.966788	 -0.527311
 -0.956473	 -0.959408	 -0.536995
 -0.947416	 -0.947837	 -0.552730
 -0.935672	 -0.937710	 -0.565807
 -0.921825	 -0.930937	 -0.580796
 -0.909487	 -0.914571	 -0.600332
 -0.907412	 -0.902232	 -0.610175
 -0.906732	 -0.890464	 -0.621315
 -0.901227	 -0.873040	 -0.635362
 -0.895461	 -0.851302	 -0.642439
 -0.891393	 -0.832457	 -0.653588
 -0.870350	 -0.819078	 -0.671511
 -0.847245	 -0.812881	 -0.677259
 -0.831690	 -0.807782	 -0.679455
 -0.818743	 -0.792472	 -0.682654
 -0.808743	 -0.775499	 -0.691902
 -0.797701	 -0.760524	 -0.702722
 -0.785111	 -0.747752	 -0.709671
 -0.770770	 -0.734118	 -0.712442
 -0.756212	 -0.719007	 -0.713281
 -0.744021	 -0.702523	 -0.715162
 -0.734609	 -0.684028	 -0.720322
 -0.724566	 -0.669659	 -0.733183
 -0.711915	 -0.661903	 -0.752807
 -0.698100	 -0.658185	 -0.766760
 -0.681533	 -0.651169	 -0.773635
 -0.673591	 -0.632912	 -0.782491
 -0.671983	 -0.614043	 -0.790248
 -0.669719	 -0.600997	 -0.805194
 -0.678954	 -0.591044	 -0.821412
 -0.694827	 -0.579489	 -0.831324
 -0.701812	 -0.566446	 -0.842179
 -0.710673	 -0.555688	 -0.858090
 -0.728728	 -0.527064	 -0.859458
 -0.731621	 -0.508026	 -0.856590
 -0.734847	 -0.490980	 -0.849455
 -0.746066	 -0.462870	 -0.844661
 -0.754722	 -0.446888	 -0.849383
 -0.764716	 -0.436535	 -0.859180
 -0.773972	 -0.423121	 -0.868685
 -0.785103	 -0.410757	 -0.881373
 -0.791611	 -0.393533	 -0.893276
 -0.796620	 -0.370349	 -0.900464
 -0.804592	 -0.350317	 -0.899992
 -0.812430	 -0.334715	 -0.899742
 -0.827076	 -0.315766	 -0.900424
 -0.839710	 -0.298194	 -0.901312
 -0.848243	 -0.281861	 -0.903336
 -0.856007	 -0.263595	 -0.910377
 -0.862720	 -0.251763	 -0.915435
 -0.874676	 -0.236659	 -0.925094
 -0.884818	 -0.219945	 -0.934398
 -0.894697	 -0.200785	 -0.943899
 -0.893669	 -0.181094	 -0.954997
 -0.889712	 -0.155397	 -0.964986
 -0.889966	 -0.144681	 -0.969330
 -0.893517	 -0.131830	 -0.978655
 -0.903914	 -0.111305	 -0.992494
 -0.903395	 -0.089925	 -0.996785
 -0.907666	 -0.075043	 -0.996644
 -0.914124	 -0.059434	 -1.005876
 -0.911280	 -0.040178	 -1.011295
 -0.905200	 -0.022979	 -1.016357
 -0.911719	 -0.012085	 -1.034834
 -0.930410	 -0.000370	 -1.053046
 -0.943514	  0.017781	 -1.061322
 -0.952506	  0.030878	 -1.063066
 -0.959943	  0.051871	 -1.065699
 -0.963902	  0.083375	 -1.074125
 -0.968216	  0.098021	 -1.080653
 -0.974572	  0.111266	 -1.087033
 -0.980404	  0.126413	 -1.093685
 -0.982738	  0.146983	 -1.104719
 -0.985378	  0.160190	 -1.115301
 -0.991807	  0.179217	 -1.129923
 -0.999163	  0.192303	 -1.135809
 -1.004777	  0.208395	 -1.142353
 -1.011307	  0.224787	 -1.149961
 -1.020218	  0.252423	 -1.161019
 -1.023694	  0.266165	 -1.164872
 -1.030517	  0.281410	 -1.170383
 -1.038059	  0.297274	 -1.173712
 -1.052644	  0.319262	 -1.182676
 -1.059494	  0.328335	 -1.188895
 -1.066226	  0.342155	 -1.196704
 -1.072049	  0.363745	 -1.203661
 -1.078045	  0.385655	 -1.210703
 -1.084232	  0.406873	 -1.216568
 -1.089503	  0.420726	 -1.222705
 -1.094313	  0.435590	 -1.227257
 -1.102261	  0.456112	 -1.233192
 -1.106869	  0.473874	 -1.241917
 -1.106962	  0.489847	 -1.250153
 -1.106210	  0.514786	 -1.261997
 -1.104684	  0.529122	 -1.268660
 -1.104853	  0.540933	 -1.273929
 -1.106295	  0.558868	 -1.284917
 -1.100793	  0.575505	 -1.302101
 -1.097772	  0.589756	 -1.314118
 -1.097485	  0.596435	 -1.325254
 -1.097178	  0.609143	 -1.342416
 -1.097439	  0.619550	 -1.360059
 -1.093264	  0.628205	 -1.378432
 -1.085495	  0.634920	 -1.394467
 -1.073948	  0.644895	 -1.414078
 -1.063054	  0.649780	 -1.428387
 -1.050724	  0.657293	 -1.444202
 -1.042280	  0.663911	 -1.459353
 -1.038636	  0.668907	 -1.473114
 -1.035236	  0.671683	 -1.493226
 -1.026279	  0.668598	 -1.515519
 -1.013137	  0.664348	 -1.536351
 -1.004841	  0.662588	 -1.551519
 -0.993852	  0.663445	 -1.566616
 -0.980232	  0.667753	 -1.583830
 -0.962195	  0.675085	 -1.604886
 -0.953685	  0.676798	 -1.616947
 -0.946004	  0.676487	 -1.632887
 -0.937416	  0.675181	 -1.652967
 -0.930233	  0.672455	 -1.671180
 -0.925272	  0.665668	 -1.687472
 -0.918865	  0.657733	 -1.708450
 -0.911542	  0.649815	 -1.725217
 -0.905475	  0.643039	 -1.740252
 -0.896812	  0.634270	 -1.760165
 -0.885966	  0.629351	 -1.779429
 -0.877075	  0.628399	 -1.793288
 -0.865016	  0.628873	 -1.814177
 -0.850033	  0.630518	 -1.835929
 -0.842269	  0.632846	 -1.846352
 -0.836359	  0.633156	 -1.857675
 -0.825478	  0.639100	 -1.882421
 -0.816662	  0.648994	 -1.900851
 -0.810584	  0.655801	 -1.914338
 -0.806443	  0.668103	 -1.928893
 -0.804635	  0.688247	 -1.949599
 -0.805048	  0.698309	 -1.957689
 -0.804484	  0.709469	 -1.969678
 -0.803293	  0.729386	 -1.987565
 -0.799695	  0.746083	 -2.001603
 -0.790266	  0.760909	 -2.018929
 -0.787343	  0.768090	 -2.024565
 -0.780806	  0.783529	 -2.037069
 -0.781265	  0.802144	 -2.047788
 -0.782494	  0.818054	 -2.060236
 -0.781236	  0.831874	 -2.070223
 -0.778180	  0.847164	 -2.084640
 -0.775517	  0.860506	 -2.099339
 -0.770928	  0.884198	 -2.109421
 -0.768159	  0.912153	 -2.108508
 -0.765822	  0.928967	 -2.105031
 -0.763434	  0.945824	 -2.100185
 -0.761153	  0.974447	 -2.093937
 -0.763695	  0.992138	 -2.100364
 -0.770686	  1.008660	 -2.116628
 -0.784004	  1.031020	 -2.124510
 -0.792119	  1.052320	 -2.117049
 -0.795538	  1.064950	 -2.106275
 -0.799710	  1.084385	 -2.098144
 -0.810879	  1.104192	 -2.091563
 -0.823637	  1.121292	 -2.084697
 -0.830807	  1.138958	 -2.073467
 -0.830659	  1.151752	 -2.057742
 -0.831710	  1.165401	 -2.042870
 -0.835646	  1.181918	 -2.031256
 -0.840748	  1.198658	 -2.021252
 -0.845853	  1.215078	 -2.011072
 -0.850890	  1.229832	 -1.998737
 -0.855648	  1.241326	 -1.983196
 -0.860354	  1.252272	 -1.967163
 -0.865023	  1.263132	 -1.951383
 -0.869687	  1.275134	 -1.938330
 -0.870314	  1.295127	 -1.929814
 -0.863787	  1.317706	 -1.912014
 -0.868014	  1.324941	 -1.890142
 -0.881827	  1.323609	 -1.869976
 -0.893964	  1.323466	 -1.853030
 -0.900078	  1.330597	 -1.835419
 -0.902772	  1.335980	 -1.818093
 -0.908790	  1.345561	 -1.796827
 -0.913198	  1.359046	 -1.780262
 -0.917168	  1.369613	 -1.770552
 -0.926862	  1.394046	 -1.755069
 -0.925748	  1.407143	 -1.743745
 -0.920687	  1.417927	 -1.732531
 -0.910503	  1.434804	 -1.716383
 -0.910132	  1.450321	 -1.705941
 -0.913560	  1.462677	 -1.697968
 -0.920775	  1.478295	 -1.689194
 -0.930520	  1.506618	 -1.690920
 -0.935164	  1.519784	 -1.694644
 -0.941772	  1.535891	 -1.703889
 -0.943560	  1.553835	 -1.714197
 -0.945637	  1.569094	 -1.727776
 -0.950769	  1.585404	 -1.743412
 -0.953450	  1.607467	 -1.752092
 -0.950636	  1.630189	 -1.753690
 -0.951348	  1.664228	 -1.766250
 -0.952812	  1.681953	 -1.775398
