 -2.450940	  0.019575	 -0.111947
 -2.455603	  0.020934	 -0.110446
 -2.437258	  0.015585	 -0.116350
 -2.418914	  0.010236	 -0.122255
 -2.400414	  0.005171	 -0.127922
 -2.381885	  0.000162	 -0.133542
 -2.363210	 -0.004635	 -0.138855
 -2.344422	 -0.009258	 -0.143918
 -2.325511	 -0.013720	 -0.148660
 -2.306370	 -0.017847	 -0.152732
 -2.287138	 -0.021666	 -0.156675
 -2.267574	 -0.024108	 -0.160031
 -2.248009	 -0.026550	 -0.163386
 -2.228613	 -0.028147	 -0.167998
 -2.209342	 -0.029328	 -0.173213
 -2.190070	 -0.030509	 -0.178428
 -2.171205	 -0.032034	 -0.184892
 -2.152635	 -0.033770	 -0.192114
 -2.134065	 -0.035505	 -0.199335
 -2.115792	 -0.037823	 -0.207127
 -2.097750	 -0.040554	 -0.215316
 -2.079709	 -0.043284	 -0.223504
 -2.061821	 -0.047011	 -0.231637
 -2.043960	 -0.050880	 -0.239760
 -2.026095	 -0.055183	 -0.247655
 -2.008243	 -0.060081	 -0.255227
 -1.990390	 -0.064985	 -0.262792
 -1.972392	 -0.070915	 -0.269185
 -1.954393	 -0.076846	 -0.275579
 -1.936681	 -0.083200	 -0.282354
 -1.919903	 -0.090744	 -0.290202
 -1.903125	 -0.098288	 -0.298049
 -1.886347	 -0.105833	 -0.305897
 -1.869569	 -0.113377	 -0.313744
 -1.857694	 -0.120720	 -0.328064
 -1.851232	 -0.127015	 -0.345914
 -1.844771	 -0.133310	 -0.363764
 -1.838309	 -0.139605	 -0.381614
 -1.831848	 -0.145900	 -0.399464
 -1.825386	 -0.152195	 -0.417314
 -1.826126	 -0.159032	 -0.436095
 -1.828862	 -0.165860	 -0.454693
 -1.831599	 -0.172688	 -0.473291
 -1.834336	 -0.179515	 -0.491889
 -1.837072	 -0.186343	 -0.510488
 -1.839685	 -0.193273	 -0.529066
 -1.838887	 -0.202811	 -0.546627
 -1.838088	 -0.212349	 -0.564188
 -1.837289	 -0.221887	 -0.581749
 -1.836490	 -0.231425	 -0.599310
 -1.835691	 -0.240963	 -0.616871
 -1.834892	 -0.250501	 -0.634432
 -1.829379	 -0.260574	 -0.650807
 -1.822114	 -0.270692	 -0.666454
 -1.814848	 -0.280810	 -0.682101
 -1.799431	 -0.287692	 -0.692823
 -1.779904	 -0.285271	 -0.689241
 -1.760376	 -0.282851	 -0.685660
 -1.740849	 -0.280430	 -0.682079
 -1.721322	 -0.278010	 -0.678497
 -1.702378	 -0.273239	 -0.674210
 -1.684539	 -0.265737	 -0.669161
 -1.666700	 -0.258236	 -0.664113
 -1.648860	 -0.250734	 -0.659065
 -1.631021	 -0.243232	 -0.654017
 -1.614267	 -0.232423	 -0.652453
 -1.599568	 -0.219001	 -0.654404
 -1.584869	 -0.205579	 -0.656355
 -1.570171	 -0.192158	 -0.658307
 -1.555429	 -0.179464	 -0.662951
 -1.541689	 -0.169383	 -0.673419
 -1.527949	 -0.159303	 -0.683887
 -1.514208	 -0.149222	 -0.694355
 -1.500204	 -0.139962	 -0.705225
 -1.485278	 -0.136493	 -0.718077
 -1.470352	 -0.133023	 -0.730928
 -1.455087	 -0.130754	 -0.743650
 -1.439388	 -0.130521	 -0.756039
 -1.423689	 -0.130287	 -0.768428
 -1.407677	 -0.125995	 -0.779617
 -1.391741	 -0.120142	 -0.790189
 -1.375804	 -0.114290	 -0.800762
 -1.359867	 -0.108437	 -0.811334
 -1.344122	 -0.101882	 -0.821779
 -1.328736	 -0.094191	 -0.831984
 -1.313351	 -0.086500	 -0.842189
 -1.297966	 -0.078808	 -0.852394
 -1.282581	 -0.071117	 -0.862599
 -1.266301	 -0.064770	 -0.872328
 -1.249630	 -0.059086	 -0.881804
 -1.231814	 -0.055038	 -0.889940
 -1.212161	 -0.055386	 -0.893635
 -1.192382	 -0.058342	 -0.893829
 -1.173220	 -0.063112	 -0.890658
 -1.154394	 -0.068408	 -0.886470
 -1.135623	 -0.073793	 -0.882150
 -1.117619	 -0.080221	 -0.876274
 -1.099614	 -0.086648	 -0.870398
 -1.081779	 -0.093230	 -0.864186
 -1.064024	 -0.099883	 -0.857822
 -1.046323	 -0.106698	 -0.851480
 -1.028880	 -0.114240	 -0.845245
 -1.011438	 -0.121782	 -0.839011
 -0.993995	 -0.129325	 -0.832777
 -0.977091	 -0.137314	 -0.825676
 -0.960291	 -0.145382	 -0.818418
 -0.945058	 -0.145613	 -0.805461
 -0.932488	 -0.141133	 -0.790563
 -0.919918	 -0.136653	 -0.775666
 -0.907348	 -0.132173	 -0.760769
 -0.894778	 -0.127693	 -0.745872
 -0.882208	 -0.123213	 -0.730975
 -0.869638	 -0.118733	 -0.716078
 -0.857068	 -0.114253	 -0.701181
 -0.838951	 -0.109051	 -0.694493
 -0.820742	 -0.103847	 -0.688062
 -0.802533	 -0.098643	 -0.681631
 -0.784324	 -0.093440	 -0.675200
 -0.766116	 -0.088236	 -0.668769
 -0.747907	 -0.083032	 -0.662338
 -0.729698	 -0.077828	 -0.655907
 -0.711489	 -0.072625	 -0.649476
 -0.692305	 -0.068337	 -0.645788
 -0.672723	 -0.064709	 -0.643955
 -0.653140	 -0.061080	 -0.642122
 -0.633558	 -0.057451	 -0.640289
 -0.613975	 -0.053823	 -0.638457
 -0.594393	 -0.050194	 -0.636624
 -0.574810	 -0.046565	 -0.634791
 -0.554962	 -0.047200	 -0.637166
 -0.535218	 -0.048425	 -0.640111
 -0.515474	 -0.049650	 -0.643056
 -0.495730	 -0.050876	 -0.646002
 -0.475986	 -0.052101	 -0.648947
 -0.456590	 -0.054835	 -0.652986
 -0.438939	 -0.061404	 -0.659717
 -0.421289	 -0.067973	 -0.666447
 -0.403638	 -0.074542	 -0.673178
 -0.385987	 -0.081112	 -0.679908
 -0.370904	 -0.091263	 -0.688242
 -0.356237	 -0.101862	 -0.696759
 -0.341570	 -0.112461	 -0.705276
 -0.329843	 -0.126083	 -0.714046
 -0.318775	 -0.140243	 -0.722820
 -0.307707	 -0.154403	 -0.731595
 -0.298617	 -0.170041	 -0.740129
 -0.291325	 -0.186749	 -0.748355
 -0.284032	 -0.203456	 -0.756581
 -0.276739	 -0.220164	 -0.764808
 -0.270902	 -0.237315	 -0.773280
 -0.267273	 -0.254933	 -0.782022
 -0.263645	 -0.272552	 -0.790764
 -0.260017	 -0.290170	 -0.799506
 -0.256389	 -0.307789	 -0.808249
 -0.252872	 -0.325254	 -0.817337
 -0.249599	 -0.342367	 -0.827156
 -0.246326	 -0.359480	 -0.836976
 -0.243053	 -0.376594	 -0.846796
 -0.239780	 -0.393707	 -0.856615
 -0.236507	 -0.410820	 -0.866435
 -0.230961	 -0.427150	 -0.876563
 -0.223805	 -0.442756	 -0.886821
 -0.216648	 -0.458362	 -0.897080
 -0.209492	 -0.473968	 -0.907338
 -0.201999	 -0.489363	 -0.917676
 -0.190716	 -0.501719	 -0.928631
 -0.179432	 -0.514075	 -0.939586
 -0.166046	 -0.523934	 -0.950704
 -0.151430	 -0.532090	 -0.961652
 -0.135760	 -0.538625	 -0.972223
 -0.118977	 -0.543468	 -0.981963
 -0.101861	 -0.547805	 -0.991356
 -0.083905	 -0.550922	 -0.999593
 -0.065890	 -0.554006	 -1.007715
 -0.047261	 -0.556703	 -1.014475
 -0.028632	 -0.559400	 -1.021235
 -0.009889	 -0.562425	 -1.027523
  0.008906	 -0.565614	 -1.033570
  0.027688	 -0.568853	 -1.039631
  0.046264	 -0.572838	 -1.045881
  0.064840	 -0.576823	 -1.052130
  0.083324	 -0.581068	 -1.058481
  0.101467	 -0.586182	 -1.065164
  0.119611	 -0.591296	 -1.071847
  0.137712	 -0.596512	 -1.078564
  0.155781	 -0.601807	 -1.085309
  0.173853	 -0.607110	 -1.092037
  0.191990	 -0.612520	 -1.098502
  0.210126	 -0.617931	 -1.104967
  0.228283	 -0.623498	 -1.111239
  0.246458	 -0.629216	 -1.117320
  0.264633	 -0.634934	 -1.123401
  0.282531	 -0.641185	 -1.129772
  0.300377	 -0.647530	 -1.136193
  0.318152	 -0.653903	 -1.142784
  0.335604	 -0.660393	 -1.150085
  0.353057	 -0.666883	 -1.157386
  0.370398	 -0.673441	 -1.164887
  0.387666	 -0.680042	 -1.172519
  0.404933	 -0.686643	 -1.180151
  0.421865	 -0.693606	 -1.188205
  0.438783	 -0.700581	 -1.196274
  0.455546	 -0.707624	 -1.204605
  0.471993	 -0.714792	 -1.213443
  0.488440	 -0.721960	 -1.222281
  0.505267	 -0.728843	 -1.230616
  0.522134	 -0.735695	 -1.238896
  0.540198	 -0.740537	 -1.245986
  0.558513	 -0.744902	 -1.252732
  0.577397	 -0.748036	 -1.258524
  0.596315	 -0.751166	 -1.264210
  0.615495	 -0.754258	 -1.268960
  0.634675	 -0.757350	 -1.273709
  0.653944	 -0.760736	 -1.277862
  0.673246	 -0.764255	 -1.281743
  0.692548	 -0.767860	 -1.285539
  0.711844	 -0.771970	 -1.288826
  0.731139	 -0.776080	 -1.292112
  0.750403	 -0.780428	 -1.295271
  0.769628	 -0.785051	 -1.298280
  0.788852	 -0.789674	 -1.301289
  0.807887	 -0.794912	 -1.304490
  0.826826	 -0.800432	 -1.307778
  0.845766	 -0.805953	 -1.311066
  0.864390	 -0.812301	 -1.314651
  0.882925	 -0.818861	 -1.318313
  0.901460	 -0.825422	 -1.321975
  0.919575	 -0.832889	 -1.325988
  0.937665	 -0.840404	 -1.330020
  0.955688	 -0.848046	 -1.334118
  0.973262	 -0.856464	 -1.338624
  0.990836	 -0.864881	 -1.343129
  1.008271	 -0.873463	 -1.347859
  1.025099	 -0.882688	 -1.353490
  1.041927	 -0.891913	 -1.359121
  1.058572	 -0.901127	 -1.365290
  1.074667	 -0.910277	 -1.372854
  1.090763	 -0.919427	 -1.380418
  1.106592	 -0.928220	 -1.388912
  1.122252	 -0.936801	 -1.397917
  1.137911	 -0.945345	 -1.406962
  1.153501	 -0.953123	 -1.416783
  1.169091	 -0.960901	 -1.426605
  1.185149	 -0.967483	 -1.436545
  1.201405	 -0.973491	 -1.446527
  1.218039	 -0.978638	 -1.456366
  1.234959	 -0.983066	 -1.466068
  1.252095	 -0.987116	 -1.475551
  1.269476	 -0.990719	 -1.484768
  1.286917	 -0.994289	 -1.493881
  1.304615	 -0.997716	 -1.502543
  1.322313	 -1.001143	 -1.511205
  1.340132	 -1.005182	 -1.519340
  1.357979	 -1.009391	 -1.527325
  1.375919	 -1.013599	 -1.535102
  1.394026	 -1.017804	 -1.542481
  1.412179	 -1.021923	 -1.549795
  1.430878	 -1.024917	 -1.556226
  1.449578	 -1.027911	 -1.562657
  1.468610	 -1.030200	 -1.568362
  1.487648	 -1.032473	 -1.574053
  1.506686	 -1.034747	 -1.579743
  1.525724	 -1.037021	 -1.585433
  1.545389	 -1.040417	 -1.590788
  1.564377	 -1.044510	 -1.595551
