 -2.374339	  0.594430	 -0.420171
 -2.376702	  0.595562	 -0.420376
 -2.379065	  0.596694	 -0.420581
 -2.361483	  0.587284	 -0.419368
 -2.344031	  0.577335	 -0.418536
 -2.325982	  0.568404	 -0.418164
 -2.307363	  0.561475	 -0.417124
 -2.291225	  0.554112	 -0.416831
 -2.274319	  0.538737	 -0.417415
 -2.255539	  0.522903	 -0.413580
 -2.230999	  0.515207	 -0.407730
 -2.217933	  0.513357	 -0.405270
 -2.196026	  0.509905	 -0.403694
 -2.170670	  0.506573	 -0.398870
 -2.154074	  0.507349	 -0.395614
 -2.133627	  0.505847	 -0.393223
 -2.107973	  0.506648	 -0.388045
 -2.088253	  0.513760	 -0.385094
 -2.075503	  0.522253	 -0.386278
 -2.052310	  0.531134	 -0.393328
 -2.024414	  0.533329	 -0.391424
 -2.007316	  0.534239	 -0.384568
 -1.996987	  0.536146	 -0.378128
 -1.971859	  0.540400	 -0.374644
 -1.949534	  0.540371	 -0.368530
 -1.935542	  0.540250	 -0.362708
 -1.915810	  0.541488	 -0.357252
 -1.891696	  0.539472	 -0.352781
 -1.874091	  0.537562	 -0.343539
 -1.859006	  0.537934	 -0.330112
 -1.842233	  0.538721	 -0.318244
 -1.823701	  0.537839	 -0.309719
 -1.805562	  0.537058	 -0.301226
 -1.787340	  0.533916	 -0.293512
 -1.769167	  0.530255	 -0.285989
 -1.750927	  0.526434	 -0.278709
 -1.732584	  0.520839	 -0.272968
 -1.714275	  0.514684	 -0.267764
 -1.695947	  0.508434	 -0.262795
 -1.677304	  0.501387	 -0.261222
 -1.658640	  0.494324	 -0.259905
 -1.640045	  0.487115	 -0.258392
 -1.621654	  0.479504	 -0.256476
 -1.603108	  0.472302	 -0.254648
 -1.584314	  0.465361	 -0.254102
 -1.565699	  0.457853	 -0.254109
 -1.547493	  0.449254	 -0.253215
 -1.530152	  0.440296	 -0.248294
 -1.513072	  0.431985	 -0.242164
 -1.497187	  0.425149	 -0.236580
 -1.481467	  0.417772	 -0.226541
 -1.463885	  0.411611	 -0.217131
 -1.447129	  0.405272	 -0.209716
 -1.431558	  0.397834	 -0.201336
 -1.414872	  0.390070	 -0.189534
 -1.398655	  0.384032	 -0.179392
 -1.383203	  0.378005	 -0.171725
 -1.363280	  0.368286	 -0.168207
 -1.341207	  0.357506	 -0.167905
 -1.326619	  0.352139	 -0.168836
 -1.308738	  0.343795	 -0.168764
 -1.286761	  0.333455	 -0.165307
 -1.269565	  0.323349	 -0.162036
 -1.257245	  0.316509	 -0.158346
 -1.238971	  0.304540	 -0.154067
 -1.221686	  0.295672	 -0.147351
 -1.204181	  0.289031	 -0.141235
 -1.184349	  0.282189	 -0.137549
 -1.166010	  0.276523	 -0.135570
 -1.146813	  0.271757	 -0.131508
 -1.129695	  0.267134	 -0.124939
 -1.112798	  0.260221	 -0.117992
 -1.096664	  0.249578	 -0.113124
 -1.080317	  0.236936	 -0.109817
 -1.062284	  0.224510	 -0.109434
 -1.044607	  0.216427	 -0.105985
 -1.016932	  0.210882	 -0.097096
 -1.004557	  0.209181	 -0.093237
 -0.989506	  0.207158	 -0.087103
 -0.964028	  0.201026	 -0.083461
 -0.943334	  0.194169	 -0.084997
 -0.931253	  0.191948	 -0.085613
 -0.910750	  0.188872	 -0.085226
 -0.880200	  0.184906	 -0.079726
 -0.865062	  0.186589	 -0.075098
 -0.851287	  0.188199	 -0.069118
 -0.826228	  0.192981	 -0.062758
 -0.801810	  0.192801	 -0.057227
 -0.788828	  0.191131	 -0.052399
 -0.768131	  0.188132	 -0.048719
 -0.748890	  0.184287	 -0.047032
 -0.725567	  0.171241	 -0.044542
 -0.705568	  0.160928	 -0.043083
 -0.695096	  0.157743	 -0.041556
 -0.670924	  0.154325	 -0.041159
 -0.651009	  0.150538	 -0.039464
 -0.634770	  0.145323	 -0.037356
 -0.613633	  0.133343	 -0.035008
 -0.597161	  0.121465	 -0.035262
 -0.578336	  0.109983	 -0.034697
 -0.565761	  0.104721	 -0.032230
 -0.546256	  0.097845	 -0.028298
 -0.518767	  0.087410	 -0.026766
 -0.507891	  0.082638	 -0.027127
 -0.489213	  0.072396	 -0.027341
 -0.464364	  0.060716	 -0.022059
 -0.449996	  0.056677	 -0.017579
 -0.431422	  0.053434	 -0.013404
 -0.408749	  0.049937	 -0.009928
 -0.394870	  0.046172	 -0.007699
 -0.369520	  0.038027	 -0.002567
 -0.354880	  0.035208	  0.003384
 -0.337132	  0.034494	  0.014071
 -0.319675	  0.032070	  0.025931
 -0.304371	  0.028270	  0.035225
 -0.282699	  0.022141	  0.045393
 -0.266548	  0.016872	  0.050365
 -0.249731	  0.010696	  0.054410
 -0.228909	  0.002240	  0.059687
 -0.213080	 -0.004291	  0.063263
 -0.191440	 -0.012982	  0.068147
 -0.171409	 -0.016614	  0.070200
 -0.156637	 -0.017310	  0.071867
 -0.128935	 -0.021445	  0.072307
 -0.109747	 -0.028566	  0.074268
 -0.098217	 -0.033778	  0.077368
 -0.078350	 -0.039372	  0.084548
 -0.058638	 -0.043247	  0.091854
 -0.041477	 -0.046415	  0.095482
 -0.017998	 -0.053981	  0.098723
  0.000686	 -0.063567	  0.100447
  0.012030	 -0.071141	  0.099562
  0.032700	 -0.085209	  0.098102
  0.053784	 -0.094041	  0.100625
  0.070938	 -0.097879	  0.103132
  0.089873	 -0.098606	  0.105659
  0.111339	 -0.099335	  0.110042
  0.130432	 -0.100869	  0.114064
  0.149416	 -0.102073	  0.115858
  0.170522	 -0.105092	  0.116291
  0.195116	 -0.112418	  0.118773
  0.214093	 -0.119831	  0.123222
  0.224736	 -0.124000	  0.126189
  0.242661	 -0.131256	  0.131768
  0.263376	 -0.136150	  0.139184
  0.282472	 -0.142172	  0.143846
  0.301276	 -0.147727	  0.149713
  0.319628	 -0.153684	  0.154679
  0.338495	 -0.159110	  0.157096
  0.358069	 -0.164797	  0.157460
  0.377619	 -0.170073	  0.157259
  0.396943	 -0.173824	  0.158839
  0.414922	 -0.180106	  0.161914
  0.432887	 -0.188577	  0.164182
  0.451225	 -0.196067	  0.165862
  0.468434	 -0.205373	  0.167787
  0.484975	 -0.216536	  0.169543
  0.501757	 -0.227267	  0.171995
  0.518888	 -0.237566	  0.174295
  0.536187	 -0.247408	  0.177244
  0.553820	 -0.256552	  0.180898
  0.570266	 -0.265707	  0.185183
  0.586354	 -0.277536	  0.186744
  0.602589	 -0.290275	  0.186104
  0.621310	 -0.299099	  0.187100
  0.646737	 -0.299584	  0.193073
  0.667127	 -0.296182	  0.204888
  0.685479	 -0.299802	  0.216127
  0.698377	 -0.304048	  0.224256
  0.715904	 -0.309956	  0.233387
  0.736171	 -0.313930	  0.241587
  0.751664	 -0.317274	  0.246591
  0.770085	 -0.322900	  0.255304
  0.789942	 -0.325887	  0.264293
  0.806983	 -0.324288	  0.270266
  0.823210	 -0.318735	  0.275055
  0.841794	 -0.313623	  0.283294
  0.867198	 -0.318121	  0.298811
  0.885432	 -0.325115	  0.304767
  0.902687	 -0.331085	  0.307440
  0.917744	 -0.335486	  0.309278
  0.940350	 -0.340609	  0.310576
  0.960643	 -0.340196	  0.313136
  0.980455	 -0.337556	  0.315647
  1.004235	 -0.338064	  0.321801
  1.019654	 -0.343123	  0.329159
  1.037867	 -0.354021	  0.341194
  1.054448	 -0.363106	  0.346459
  1.073166	 -0.371526	  0.348673
  1.092838	 -0.377839	  0.350594
  1.110890	 -0.382109	  0.352352
  1.132311	 -0.386363	  0.351550
  1.150943	 -0.391796	  0.346881
  1.169491	 -0.400477	  0.348432
  1.187526	 -0.408639	  0.351943
  1.205782	 -0.416075	  0.355226
  1.224131	 -0.423146	  0.358883
  1.242563	 -0.430060	  0.362383
  1.261820	 -0.435241	  0.363821
  1.281420	 -0.439101	  0.364071
  1.300918	 -0.437929	  0.359884
  1.320358	 -0.436621	  0.355483
  1.336469	 -0.434329	  0.343920
  1.350424	 -0.431736	  0.329834
  1.364346	 -0.429119	  0.315716
  1.378269	 -0.426502	  0.301598
  1.392190	 -0.423937	  0.287472
  1.405414	 -0.425616	  0.272585
  1.417428	 -0.431201	  0.257607
  1.429428	 -0.436837	  0.242638
  1.441379	 -0.442460	  0.227891
  1.455849	 -0.448008	  0.217413
  1.475791	 -0.450101	  0.210384
  1.496502	 -0.449232	  0.198624
  1.511286	 -0.450266	  0.183223
  1.522103	 -0.457095	  0.175722
  1.538672	 -0.468139	  0.178183
  1.557191	 -0.479238	  0.179371
  1.567528	 -0.487443	  0.181163
  1.581882	 -0.497658	  0.182236
  1.596231	 -0.509802	  0.180863
  1.610277	 -0.524276	  0.181223
  1.622909	 -0.538293	  0.182351
  1.636053	 -0.551294	  0.183502
  1.653711	 -0.563228	  0.186100
  1.674068	 -0.573008	  0.189124
  1.693965	 -0.580800	  0.190084
  1.713388	 -0.590289	  0.188733
  1.730389	 -0.600512	  0.186625
  1.746286	 -0.612787	  0.184017
  1.761190	 -0.626668	  0.180557
  1.776433	 -0.641890	  0.175850
  1.790864	 -0.656157	  0.169499
  1.803232	 -0.670282	  0.162776
  1.816667	 -0.684441	  0.158670
  1.829907	 -0.699798	  0.156519
  1.840716	 -0.716312	  0.154638
  1.849527	 -0.731699	  0.156296
  1.856095	 -0.745580	  0.164518
  1.862121	 -0.758000	  0.178299
  1.868503	 -0.769426	  0.190637
  1.873767	 -0.777885	  0.207703
  1.875951	 -0.778921	  0.226505
  1.875146	 -0.778501	  0.245377
  1.879471	 -0.784076	  0.264638
  1.889394	 -0.789220	  0.285255
  1.893211	 -0.789761	  0.306263
  1.887998	 -0.783431	  0.335932
  1.885943	 -0.771546	  0.352316
  1.890738	 -0.745307	  0.363714
  1.894818	 -0.719537	  0.370282
  1.897149	 -0.696937	  0.382371
  1.905924	 -0.681038	  0.403897
  1.913155	 -0.679377	  0.420660
  1.927771	 -0.682157	  0.438606
  1.952417	 -0.692790	  0.452697
  1.968207	 -0.698241	  0.457608
  1.986521	 -0.704874	  0.465950
  2.006608	 -0.713577	  0.478039
  2.032861	 -0.727124	  0.489855
  2.045256	 -0.726743	  0.494080
  2.062330	 -0.732042	  0.497764
  2.079378	 -0.736542	  0.501694
  2.109899	 -0.737788	  0.509761
  2.132165	 -0.739307	  0.515162
  2.140306	 -0.746245	  0.518554
  2.154805	 -0.754179	  0.528605
  2.175812	 -0.760789	  0.537935
  2.188672	 -0.765435	  0.540978
  2.206489	 -0.772065	  0.538486
  2.227245	 -0.783824	  0.539019
  2.249113	 -0.790844	  0.546575
  2.262297	 -0.795954	  0.551336
  2.274208	 -0.803717	  0.556840
  2.290407	 -0.831105	  0.559730
  2.293374	 -0.836121	  0.560259
