 -0.806300	 -2.242192	  0.587115
 -0.813587	 -2.251810	  0.592911
 -0.820874	 -2.261428	  0.598707
 -0.811523	 -2.246504	  0.587919
 -0.799795	 -2.232540	  0.581300
 -0.789914	 -2.217994	  0.572269
 -0.779949	 -2.201589	  0.562669
 -0.768147	 -2.188044	  0.557246
 -0.758377	 -2.173236	  0.548125
 -0.748826	 -2.156896	  0.537954
 -0.737959	 -2.142884	  0.531705
 -0.729893	 -2.127825	  0.521547
 -0.721713	 -2.111257	  0.510764
 -0.710426	 -2.095947	  0.504831
 -0.700005	 -2.080553	  0.497951
 -0.694474	 -2.065592	  0.485996
 -0.690885	 -2.051671	  0.472205
 -0.686606	 -2.031853	  0.458120
 -0.681289	 -2.016809	  0.451383
 -0.674823	 -2.000832	  0.443779
 -0.666719	 -1.982208	  0.434383
 -0.666362	 -1.965971	  0.423511
 -0.664630	 -1.950381	  0.411901
 -0.656995	 -1.933496	  0.398829
 -0.650388	 -1.920938	  0.383415
 -0.646364	 -1.906577	  0.375081
 -0.638967	 -1.890712	  0.363698
 -0.635782	 -1.873817	  0.350384
 -0.631583	 -1.860757	  0.339385
 -0.620216	 -1.847198	  0.328350
 -0.611264	 -1.829667	  0.318909
 -0.605914	 -1.817520	  0.306644
 -0.595689	 -1.806719	  0.292025
 -0.586663	 -1.792797	  0.278056
 -0.574916	 -1.777689	  0.269469
 -0.561649	 -1.769161	  0.260519
 -0.547465	 -1.760218	  0.248367
 -0.533730	 -1.753095	  0.235086
 -0.515078	 -1.746656	  0.224364
 -0.497764	 -1.740198	  0.217173
 -0.479163	 -1.735689	  0.211657
 -0.461372	 -1.733368	  0.205087
 -0.442759	 -1.729429	  0.197300
 -0.424179	 -1.724865	  0.190569
 -0.404474	 -1.724040	  0.185355
 -0.385605	 -1.724843	  0.179647
 -0.365865	 -1.726199	  0.173630
 -0.346823	 -1.724674	  0.168690
 -0.324599	 -1.724806	  0.167306
 -0.306653	 -1.729439	  0.165234
 -0.287019	 -1.732852	  0.160168
 -0.268327	 -1.737156	  0.155122
 -0.248888	 -1.742275	  0.151234
 -0.230086	 -1.747692	  0.147281
 -0.211130	 -1.751729	  0.142400
 -0.192036	 -1.754170	  0.136820
 -0.173025	 -1.756268	  0.130992
 -0.155299	 -1.753989	  0.122033
 -0.137582	 -1.751659	  0.113050
 -0.120431	 -1.746437	  0.104192
 -0.103808	 -1.739495	  0.095502
 -0.087198	 -1.732527	  0.086817
 -0.072471	 -1.721838	  0.078550
 -0.063492	 -1.705418	  0.071583
 -0.066385	 -1.685914	  0.068545
 -0.069232	 -1.666288	  0.065496
 -0.072112	 -1.646797	  0.062375
 -0.076126	 -1.627998	  0.056997
 -0.079979	 -1.609273	  0.051113
 -0.084195	 -1.590606	  0.045303
 -0.089891	 -1.573101	  0.037420
 -0.096218	 -1.556154	  0.028886
 -0.102730	 -1.539276	  0.020283
 -0.111233	 -1.523439	  0.011383
 -0.119571	 -1.507696	  0.002224
 -0.129349	 -1.492384	 -0.006298
 -0.139467	 -1.477333	 -0.014763
 -0.149586	 -1.462210	 -0.023054
 -0.159500	 -1.447017	 -0.031483
 -0.169819	 -1.431975	 -0.039679
 -0.179639	 -1.416783	 -0.048192
 -0.189541	 -1.401558	 -0.056493
 -0.198796	 -1.386119	 -0.065167
 -0.207947	 -1.370646	 -0.073932
 -0.217267	 -1.355196	 -0.082555
 -0.226192	 -1.339519	 -0.091042
 -0.233250	 -1.322810	 -0.099341
 -0.240258	 -1.306016	 -0.107644
 -0.247393	 -1.289211	 -0.115799
 -0.254520	 -1.272415	 -0.124000
 -0.260899	 -1.255269	 -0.131936
 -0.265166	 -1.236720	 -0.137853
 -0.269356	 -1.218073	 -0.143793
 -0.273331	 -1.199433	 -0.149838
 -0.277456	 -1.180822	 -0.155756
 -0.280550	 -1.162399	 -0.162055
 -0.277077	 -1.144903	 -0.170084
 -0.273021	 -1.127177	 -0.178527
 -0.268971	 -1.109476	 -0.186911
 -0.265157	 -1.091846	 -0.195165
 -0.256834	 -1.076708	 -0.204563
 -0.245380	 -1.063850	 -0.214442
 -0.233308	 -1.051780	 -0.224398
 -0.219592	 -1.041000	 -0.234550
 -0.205939	 -1.030382	 -0.244164
 -0.195070	 -1.016905	 -0.252930
 -0.182415	 -0.999837	 -0.261514
 -0.168294	 -0.987307	 -0.267348
 -0.157348	 -0.974502	 -0.274588
 -0.146884	 -0.960531	 -0.283805
 -0.134802	 -0.942922	 -0.290433
 -0.121059	 -0.931460	 -0.296857
 -0.107206	 -0.918139	 -0.306288
 -0.096132	 -0.901868	 -0.311107
 -0.086426	 -0.887158	 -0.316656
 -0.078527	 -0.870111	 -0.325854
 -0.071162	 -0.849181	 -0.329926
 -0.061497	 -0.834154	 -0.334090
 -0.051296	 -0.817551	 -0.340101
 -0.044305	 -0.799450	 -0.346506
 -0.040218	 -0.782016	 -0.354112
 -0.034621	 -0.762164	 -0.360787
 -0.023485	 -0.746826	 -0.365249
 -0.010198	 -0.731796	 -0.372297
  0.001757	 -0.715828	 -0.383324
  0.004658	 -0.701227	 -0.395364
  0.007109	 -0.683087	 -0.401619
  0.014121	 -0.664999	 -0.408468
  0.022609	 -0.649509	 -0.423024
  0.031273	 -0.636327	 -0.435981
  0.041371	 -0.622373	 -0.441775
  0.052399	 -0.609054	 -0.452425
  0.061938	 -0.590651	 -0.458546
  0.070912	 -0.570746	 -0.462093
  0.077637	 -0.552869	 -0.468599
  0.082300	 -0.538573	 -0.483545
  0.086873	 -0.524809	 -0.495863
  0.091506	 -0.507856	 -0.509272
  0.092680	 -0.488916	 -0.512743
  0.096772	 -0.468791	 -0.518668
  0.100856	 -0.451078	 -0.527350
  0.105896	 -0.435995	 -0.538548
  0.111670	 -0.421523	 -0.555674
  0.116986	 -0.406097	 -0.570075
  0.120974	 -0.388360	 -0.574751
  0.124802	 -0.372234	 -0.582481
  0.131800	 -0.355657	 -0.594803
  0.140595	 -0.340443	 -0.603220
  0.147236	 -0.324219	 -0.613924
  0.154457	 -0.309137	 -0.625175
  0.163750	 -0.293284	 -0.632881
  0.171564	 -0.277415	 -0.642189
  0.178186	 -0.261913	 -0.652962
  0.189636	 -0.245901	 -0.659955
  0.196347	 -0.230248	 -0.668249
  0.205166	 -0.215642	 -0.679591
  0.208251	 -0.202059	 -0.692972
  0.214767	 -0.186850	 -0.705554
  0.226403	 -0.174325	 -0.715715
  0.240964	 -0.162184	 -0.724714
  0.253318	 -0.147923	 -0.733677
  0.255789	 -0.132653	 -0.747095
  0.262624	 -0.119173	 -0.760309
  0.274698	 -0.104464	 -0.772048
  0.284222	 -0.091233	 -0.779061
  0.291717	 -0.076634	 -0.791617
  0.300945	 -0.062474	 -0.803667
  0.314730	 -0.051135	 -0.812953
  0.326395	 -0.036698	 -0.822805
  0.333509	 -0.021949	 -0.834130
  0.340381	 -0.008686	 -0.846120
  0.348526	  0.008500	 -0.858076
  0.358173	  0.023363	 -0.866290
  0.366150	  0.036835	 -0.874624
  0.376755	  0.050775	 -0.884602
  0.386835	  0.068839	 -0.893142
  0.393004	  0.086086	 -0.900758
  0.397537	  0.100095	 -0.913382
  0.404989	  0.115031	 -0.925362
  0.412180	  0.132206	 -0.935851
  0.418995	  0.150482	 -0.940558
  0.428842	  0.167139	 -0.944310
  0.437964	  0.186399	 -0.946499
  0.443042	  0.204315	 -0.948735
  0.452954	  0.220616	 -0.951275
  0.465348	  0.239410	 -0.951283
  0.473860	  0.260426	 -0.952873
  0.475386	  0.275715	 -0.958724
  0.483872	  0.294473	 -0.960292
  0.491320	  0.316303	 -0.959722
  0.496808	  0.333881	 -0.959549
  0.503505	  0.351822	 -0.960089
  0.509138	  0.373007	 -0.962858
  0.512741	  0.391761	 -0.967281
  0.515482	  0.410862	 -0.973002
  0.519539	  0.429660	 -0.976112
  0.525517	  0.449372	 -0.978770
  0.532721	  0.467844	 -0.981716
  0.541147	  0.489335	 -0.980209
  0.544736	  0.508494	 -0.974831
  0.543575	  0.527663	 -0.967813
  0.543985	  0.546735	 -0.961740
  0.549736	  0.565089	 -0.958651
  0.556770	  0.584020	 -0.957036
  0.565694	  0.604837	 -0.954206
  0.570257	  0.624383	 -0.949388
  0.565150	  0.642957	 -0.945864
  0.566660	  0.663925	 -0.941866
  0.566892	  0.681696	 -0.936394
  0.565826	  0.700305	 -0.931503
  0.566093	  0.723289	 -0.927880
  0.569930	  0.744142	 -0.924108
  0.573220	  0.759845	 -0.923502
  0.575777	  0.779933	 -0.926691
  0.577931	  0.801186	 -0.931435
  0.581119	  0.820172	 -0.929231
  0.582329	  0.839176	 -0.930372
  0.579580	  0.860266	 -0.931879
  0.578684	  0.883278	 -0.931464
  0.582101	  0.897983	 -0.942025
  0.584404	  0.915221	 -0.953793
  0.594257	  0.929650	 -0.966926
  0.602848	  0.941821	 -0.979729
  0.607731	  0.960303	 -0.985022
  0.617419	  0.974773	 -0.995324
  0.626890	  0.987176	 -1.015290
  0.620926	  0.997285	 -1.031040
  0.619787	  1.007869	 -1.047911
  0.625785	  1.021138	 -1.064851
  0.629584	  1.030567	 -1.080559
  0.632327	  1.034692	 -1.101412
  0.633420	  1.041185	 -1.118966
  0.634310	  1.050675	 -1.136608
  0.637326	  1.055466	 -1.156299
  0.643252	  1.058891	 -1.173880
  0.643809	  1.064210	 -1.192678
  0.643491	  1.069638	 -1.217994
  0.650881	  1.073082	 -1.233865
  0.660476	  1.075791	 -1.250902
  0.665121	  1.078434	 -1.270758
  0.669624	  1.078057	 -1.290440
  0.662743	  1.072555	 -1.314579
  0.658803	  1.067541	 -1.335587
  0.662782	  1.067717	 -1.352060
  0.668899	  1.068796	 -1.372014
  0.675613	  1.071754	 -1.390837
  0.684438	  1.077350	 -1.409665
  0.694684	  1.082584	 -1.425926
  0.708862	  1.084325	 -1.444488
  0.714181	  1.081737	 -1.461804
  0.719215	  1.080181	 -1.482527
  0.726370	  1.082198	 -1.500257
  0.738574	  1.086892	 -1.521225
  0.749541	  1.090806	 -1.536129
  0.773837	  1.100869	 -1.545078
  0.788756	  1.113114	 -1.546189
  0.800190	  1.120509	 -1.561360
  0.809324	  1.132130	 -1.576035
  0.820602	  1.145709	 -1.586893
  0.833026	  1.160737	 -1.593721
  0.846708	  1.173219	 -1.603032
  0.859878	  1.184334	 -1.614655
  0.868700	  1.196553	 -1.625328
  0.878572	  1.211774	 -1.635701
  0.886367	  1.227417	 -1.645138
  0.896278	  1.241924	 -1.655379
  0.906281	  1.256256	 -1.665163
  0.916190	  1.270847	 -1.674502
  0.926033	  1.285524	 -1.683953
  0.935353	  1.300277	 -1.693752
  0.944890	  1.314600	 -1.703879
  0.954046	  1.328534	 -1.714504
  0.963099	  1.341564	 -1.725115
  0.973878	  1.358131	 -1.737695
  0.983335	  1.372845	 -1.747566
  0.989444	  1.387692	 -1.754212
  0.997889	  1.403832	 -1.764836
  1.006091	  1.420762	 -1.774242
  1.009552	  1.437680	 -1.778730
  1.010900	  1.444270	 -1.780478
