 -0.387584	  0.963202	 -2.252303
 -0.403906	  0.988157	 -2.276052
 -0.398687	  0.980180	 -2.268459
 -0.376738	  0.947356	 -2.238475
 -0.354469	  0.913917	 -2.210187
 -0.331052	  0.878624	 -2.183260
 -0.306390	  0.840612	 -2.157154
 -0.283264	  0.799866	 -2.131369
 -0.264047	  0.760392	 -2.106820
 -0.247098	  0.725053	 -2.085173
 -0.230835	  0.693151	 -2.066537
 -0.213097	  0.661797	 -2.050127
 -0.183822	  0.619980	 -2.033079
 -0.123826	  0.566760	 -2.018331
 -0.031591	  0.510210	 -2.027495
  0.078886	  0.434376	 -2.085631
  0.193947	  0.355890	 -2.164101
  0.270139	  0.286653	 -2.210870
  0.316375	  0.230632	 -2.224719
  0.350831	  0.175219	 -2.212732
  0.373855	  0.123878	 -2.180157
  0.383304	  0.086310	 -2.134285
  0.382546	  0.068498	 -2.082964
  0.373942	  0.063527	 -2.021820
  0.351854	  0.057485	 -1.949038
  0.301727	  0.007603	 -1.875225
  0.226970	  0.021132	 -1.755781
  0.126680	  0.052430	 -1.621050
  0.059822	  0.037819	 -1.515594
  0.027482	  0.010738	 -1.446153
  0.032072	 -0.024700	 -1.399914
  0.046170	 -0.059251	 -1.363236
  0.063328	 -0.092653	 -1.331741
  0.082437	 -0.127512	 -1.302418
  0.102059	 -0.163396	 -1.274928
  0.121877	 -0.199874	 -1.248686
  0.142282	 -0.237632	 -1.222654
  0.162646	 -0.277294	 -1.196522
  0.182077	 -0.316399	 -1.171478
  0.200481	 -0.353622	 -1.147744
  0.219941	 -0.393439	 -1.121577
  0.238530	 -0.431566	 -1.094392
  0.257118	 -0.467775	 -1.065552
  0.276311	 -0.506497	 -1.033997
  0.291981	 -0.551622	 -0.999961
  0.301297	 -0.596319	 -0.965075
  0.306916	 -0.636654	 -0.930349
  0.312171	 -0.672726	 -0.895370
  0.319077	 -0.704337	 -0.859293
  0.327844	 -0.734411	 -0.822187
  0.337459	 -0.765441	 -0.785399
  0.348464	 -0.797488	 -0.750198
  0.360964	 -0.830801	 -0.716597
  0.373290	 -0.866685	 -0.684281
  0.382678	 -0.905508	 -0.653024
  0.390652	 -0.944305	 -0.622266
  0.399158	 -0.981557	 -0.590394
  0.408226	 -1.017848	 -0.556685
  0.418708	 -1.052577	 -0.521851
  0.430959	 -1.085420	 -0.486434
  0.445197	 -1.116323	 -0.450975
  0.460657	 -1.146512	 -0.415673
  0.476653	 -1.176954	 -0.381003
  0.492598	 -1.208279	 -0.347227
  0.509154	 -1.240920	 -0.313659
  0.525910	 -1.272774	 -0.281812
  0.543883	 -1.305748	 -0.248792
  0.562856	 -1.339276	 -0.215410
  0.582344	 -1.372025	 -0.182688
  0.602392	 -1.404014	 -0.150657
  0.622864	 -1.435395	 -0.119446
  0.643964	 -1.466755	 -0.088377
  0.666093	 -1.498296	 -0.056464
  0.688385	 -1.528511	 -0.025454
  0.711146	 -1.557820	  0.006024
  0.735220	 -1.587572	  0.039684
  0.757962	 -1.619157	  0.072605
  0.778803	 -1.652885	  0.105428
  0.797840	 -1.689967	  0.138438
  0.814836	 -1.729571	  0.169611
  0.830976	 -1.768028	  0.199115
  0.846823	 -1.807202	  0.228017
  0.862151	 -1.850004	  0.256816
  0.874086	 -1.896720	  0.282616
  0.883283	 -1.942521	  0.305343
  0.891586	 -1.986426	  0.327453
  0.899992	 -2.030172	  0.351791
  0.908821	 -2.070451	  0.379358
  0.918277	 -2.108116	  0.407601
  0.932631	 -2.142079	  0.437998
  0.951353	 -2.172804	  0.470238
  0.972321	 -2.205130	  0.499832
  0.990729	 -2.237137	  0.526153
  1.015526	 -2.274462	  0.547913
