  2.316940	  0.677275	 -0.567376
  2.333945	  0.683267	 -0.568545
  2.315121	  0.676635	 -0.567250
  2.296262	  0.670115	 -0.565899
  2.277339	  0.663806	 -0.564441
  2.258416	  0.657499	 -0.562983
  2.239445	  0.651351	 -0.561461
  2.220457	  0.645263	 -0.559915
  2.201464	  0.639194	 -0.558363
  2.182307	  0.633711	 -0.556648
  2.163148	  0.628233	 -0.554931
  2.143954	  0.622891	 -0.553190
  2.124635	  0.618045	 -0.551367
  2.105316	  0.613205	 -0.549542
  2.085963	  0.608493	 -0.547738
  2.066575	  0.603918	 -0.545955
  2.047188	  0.599340	 -0.544178
  2.027848	  0.594395	 -0.542948
  2.008509	  0.589441	 -0.541725
  1.989208	  0.584411	 -0.540252
  1.969930	  0.579336	 -0.538645
  1.951015	  0.573242	 -0.536447
  1.932334	  0.566543	 -0.533932
  1.913536	  0.560071	 -0.531775
  1.894487	  0.554222	 -0.530537
  1.875397	  0.548367	 -0.529296
  1.856350	  0.542486	 -0.527916
  1.836717	  0.538660	 -0.527832
  1.817079	  0.535027	 -0.527893
  1.797655	  0.533148	 -0.528065
  1.778106	  0.536782	 -0.530888
  1.755964	  0.538628	 -0.537874
  1.736273	  0.536139	 -0.547672
  1.716167	  0.525682	 -0.550077
  1.700993	  0.516885	 -0.544893
  1.681637	  0.512000	 -0.541477
  1.661247	  0.508510	 -0.541912
  1.635122	  0.502303	 -0.538122
  1.623724	  0.495483	 -0.532852
  1.607285	  0.483725	 -0.531473
  1.584125	  0.474144	 -0.537830
  1.565540	  0.473891	 -0.541031
  1.544801	  0.470410	 -0.538100
  1.525225	  0.459813	 -0.535681
  1.511126	  0.452502	 -0.534932
  1.489570	  0.446763	 -0.533132
  1.469633	  0.435977	 -0.529511
  1.457999	  0.424289	 -0.526033
  1.441889	  0.412693	 -0.521972
  1.416703	  0.401708	 -0.515498
  1.403654	  0.396126	 -0.512889
  1.388267	  0.389415	 -0.511754
  1.368700	  0.380602	 -0.511666
  1.352753	  0.366200	 -0.508008
  1.338894	  0.349248	 -0.503151
  1.322856	  0.337842	 -0.499726
  1.304998	  0.329335	 -0.498101
  1.286755	  0.321790	 -0.499402
  1.269268	  0.311045	 -0.498607
  1.250507	  0.303740	 -0.494918
  1.228987	  0.300046	 -0.488679
  1.208919	  0.298898	 -0.482254
  1.190137	  0.294382	 -0.476133
  1.171065	  0.287931	 -0.478036
  1.151660	  0.281085	 -0.481066
  1.131866	  0.276575	 -0.482404
  1.109906	  0.282516	 -0.481066
  1.091293	  0.288280	 -0.481285
  1.071893	  0.291581	 -0.481497
  1.050836	  0.297606	 -0.483886
  1.030368	  0.297354	 -0.487503
  1.011907	  0.292539	 -0.488862
  0.992246	  0.291650	 -0.489828
  0.968895	  0.290290	 -0.492735
  0.951421	  0.284037	 -0.493286
  0.933547	  0.278194	 -0.491904
  0.907712	  0.272486	 -0.494324
  0.892347	  0.270341	 -0.496828
  0.874627	  0.267475	 -0.496840
  0.854292	  0.261708	 -0.496235
  0.834807	  0.254845	 -0.496512
  0.815959	  0.248133	 -0.496737
  0.797360	  0.240806	 -0.496366
  0.778778	  0.233434	 -0.495991
  0.760509	  0.225336	 -0.495380
  0.742182	  0.217297	 -0.494691
  0.724382	  0.209389	 -0.493817
  0.708403	  0.201123	 -0.492962
  0.688931	  0.188687	 -0.492709
  0.671739	  0.176746	 -0.492034
  0.653309	  0.173572	 -0.488293
  0.629548	  0.177024	 -0.485515
  0.600950	  0.178367	 -0.483053
  0.588208	  0.173495	 -0.482856
  0.575528	  0.161046	 -0.481707
  0.555542	  0.148064	 -0.480347
  0.537377	  0.135125	 -0.481931
  0.521863	  0.120706	 -0.484788
  0.504861	  0.110691	 -0.486937
  0.485870	  0.105693	 -0.486729
  0.463822	  0.099006	 -0.484471
  0.444841	  0.095288	 -0.483325
  0.425904	  0.091614	 -0.484933
  0.409499	  0.086259	 -0.482706
  0.391013	  0.079919	 -0.474306
  0.367533	  0.076921	 -0.467684
  0.344425	  0.074731	 -0.467165
  0.330913	  0.074695	 -0.470238
  0.308250	  0.073050	 -0.472930
  0.286627	  0.065026	 -0.470082
  0.273205	  0.053726	 -0.465149
  0.256743	  0.042895	 -0.462331
  0.232107	  0.038843	 -0.463064
  0.213362	  0.038218	 -0.465913
  0.190260	  0.033736	 -0.467803
  0.178157	  0.024080	 -0.463586
  0.160367	  0.010112	 -0.457203
  0.141649	  0.002081	 -0.456634
  0.121151	 -0.000081	 -0.455155
  0.101481	 -0.003065	 -0.448117
  0.080871	 -0.005197	 -0.445017
  0.066944	 -0.011669	 -0.446495
  0.042038	 -0.023600	 -0.444451
  0.017982	 -0.024062	 -0.440312
  0.000808	 -0.022426	 -0.443427
 -0.011733	 -0.018860	 -0.450879
 -0.037191	 -0.016916	 -0.466294
 -0.060941	 -0.013443	 -0.471271
 -0.079117	 -0.017352	 -0.470566
 -0.095195	 -0.026527	 -0.469096
 -0.112924	 -0.039775	 -0.467504
 -0.131398	 -0.049426	 -0.469431
 -0.154111	 -0.057624	 -0.475017
 -0.169834	 -0.060843	 -0.477895
 -0.188977	 -0.061300	 -0.479449
 -0.213919	 -0.060404	 -0.482015
 -0.231922	 -0.061150	 -0.484108
 -0.248625	 -0.063785	 -0.487378
 -0.273941	 -0.068809	 -0.493481
 -0.289744	 -0.070634	 -0.496498
 -0.305422	 -0.071280	 -0.499734
 -0.333693	 -0.069580	 -0.503551
 -0.353241	 -0.074425	 -0.509977
 -0.364739	 -0.078079	 -0.516737
 -0.383655	 -0.095055	 -0.518669
 -0.406716	 -0.104805	 -0.518123
 -0.422474	 -0.107836	 -0.518349
 -0.442288	 -0.111721	 -0.518315
 -0.464030	 -0.117744	 -0.514389
 -0.480159	 -0.121838	 -0.513815
 -0.504524	 -0.125120	 -0.514322
 -0.522967	 -0.124820	 -0.513013
 -0.539885	 -0.123299	 -0.508837
 -0.563971	 -0.124138	 -0.500695
 -0.582070	 -0.125093	 -0.501471
 -0.598922	 -0.126038	 -0.502466
 -0.627923	 -0.131201	 -0.494355
 -0.646093	 -0.129972	 -0.490674
 -0.657836	 -0.124724	 -0.489782
 -0.678991	 -0.113536	 -0.485578
 -0.700408	 -0.114012	 -0.478504
 -0.718654	 -0.115761	 -0.477398
 -0.738994	 -0.112223	 -0.475571
 -0.758975	 -0.108461	 -0.473017
 -0.778102	 -0.109689	 -0.473185
 -0.799431	 -0.109847	 -0.473805
 -0.819220	 -0.105818	 -0.470189
 -0.836499	 -0.099824	 -0.468229
 -0.856476	 -0.096416	 -0.469461
 -0.883235	 -0.099084	 -0.465266
 -0.900003	 -0.100659	 -0.461302
 -0.916216	 -0.096460	 -0.459184
 -0.934864	 -0.089339	 -0.461245
 -0.954458	 -0.083715	 -0.462202
 -0.978940	 -0.070701	 -0.455454
 -0.994862	 -0.063202	 -0.451805
 -1.011504	 -0.059067	 -0.452771
 -1.031060	 -0.055014	 -0.455826
 -1.051193	 -0.045571	 -0.454649
 -1.069763	 -0.037964	 -0.451983
 -1.088244	 -0.034942	 -0.450929
 -1.106682	 -0.031084	 -0.452957
 -1.124905	 -0.023511	 -0.456859
 -1.145379	 -0.015209	 -0.458148
 -1.164007	 -0.007603	 -0.457975
 -1.181643	 -0.002857	 -0.460975
 -1.200416	 -0.002493	 -0.466752
 -1.219663	 -0.002551	 -0.471914
 -1.239659	  0.003734	 -0.474450
 -1.257408	  0.009769	 -0.479969
 -1.275618	  0.013114	 -0.488061
 -1.292453	  0.017947	 -0.493038
 -1.312625	  0.021710	 -0.498374
 -1.332134	  0.025149	 -0.502705
 -1.354691	  0.029701	 -0.509995
 -1.369186	  0.030007	 -0.514552
 -1.388012	  0.028598	 -0.525369
 -1.407544	  0.024500	 -0.534847
 -1.424156	  0.024307	 -0.546822
 -1.439310	  0.027928	 -0.555761
 -1.456684	  0.032200	 -0.569500
 -1.473452	  0.034191	 -0.583016
 -1.485772	  0.035636	 -0.594489
 -1.501127	  0.035768	 -0.604570
 -1.520348	  0.036532	 -0.617105
 -1.539024	  0.036217	 -0.635252
 -1.548406	  0.031103	 -0.648882
 -1.563238	  0.022178	 -0.665504
 -1.570588	  0.012693	 -0.678804
 -1.581136	  0.005489	 -0.692534
 -1.589753	 -0.003259	 -0.710937
 -1.597951	 -0.006760	 -0.729650
 -1.607687	 -0.011373	 -0.749553
 -1.616589	 -0.021822	 -0.765815
 -1.624618	 -0.035023	 -0.776156
 -1.635916	 -0.048044	 -0.779785
 -1.645094	 -0.061597	 -0.777995
 -1.647352	 -0.072991	 -0.782690
 -1.652780	 -0.102640	 -0.779670
 -1.654575	 -0.118752	 -0.765928
 -1.656151	 -0.127577	 -0.754658
 -1.663878	 -0.140227	 -0.741688
 -1.673923	 -0.155856	 -0.728644
 -1.687113	 -0.167771	 -0.717593
 -1.698327	 -0.177029	 -0.705483
 -1.705415	 -0.187477	 -0.688153
 -1.712807	 -0.198386	 -0.669895
 -1.720726	 -0.209782	 -0.659185
 -1.730108	 -0.226142	 -0.649431
 -1.740299	 -0.241241	 -0.640262
 -1.749139	 -0.256348	 -0.629867
 -1.757033	 -0.272049	 -0.619263
 -1.767366	 -0.285016	 -0.607742
 -1.776638	 -0.298877	 -0.596387
 -1.786477	 -0.309363	 -0.582688
 -1.794368	 -0.322624	 -0.569375
 -1.803473	 -0.333437	 -0.555350
 -1.812165	 -0.345318	 -0.541832
 -1.819836	 -0.359199	 -0.529453
 -1.828440	 -0.371814	 -0.516367
 -1.837006	 -0.384683	 -0.503809
 -1.847645	 -0.397917	 -0.493608
 -1.858219	 -0.410389	 -0.483487
 -1.869068	 -0.424758	 -0.474952
 -1.882611	 -0.437676	 -0.467396
 -1.896389	 -0.450096	 -0.460310
 -1.911656	 -0.462618	 -0.457035
 -1.926278	 -0.475544	 -0.452569
 -1.943065	 -0.486252	 -0.449741
 -1.960576	 -0.495482	 -0.447970
 -1.978845	 -0.502426	 -0.447626
 -1.999268	 -0.509714	 -0.446144
 -2.017638	 -0.517616	 -0.448861
 -2.035321	 -0.525626	 -0.455102
 -2.053419	 -0.533523	 -0.458665
 -2.072024	 -0.538622	 -0.460917
 -2.092975	 -0.539550	 -0.465608
 -2.112220	 -0.543927	 -0.473939
 -2.130293	 -0.551804	 -0.478073
 -2.148324	 -0.557718	 -0.476066
 -2.168349	 -0.565654	 -0.475353
 -2.189125	 -0.571661	 -0.477540
 -2.207795	 -0.572847	 -0.482203
 -2.227696	 -0.572512	 -0.485369
 -2.248925	 -0.572289	 -0.487619
 -2.269060	 -0.575824	 -0.489232
 -2.288359	 -0.580961	 -0.487313
 -2.307829	 -0.584548	 -0.483007
 -2.326974	 -0.589375	 -0.478930
 -2.348829	 -0.596381	 -0.479139
 -2.368396	 -0.599913	 -0.481994
 -2.388718	 -0.585610	 -0.475563
 -2.408505	 -0.588113	 -0.474068
