  0.945983	 -0.440041	  2.320857
  0.962253	 -0.449308	  2.330848
  0.946920	 -0.440576	  2.321433
  0.931063	 -0.432327	  2.312459
  0.914627	 -0.424665	  2.304026
  0.898190	 -0.417002	  2.295593
  0.881294	 -0.410009	  2.287491
  0.864253	 -0.403241	  2.279504
  0.847212	 -0.396473	  2.271517
  0.829861	 -0.390744	  2.263385
  0.812494	 -0.385075	  2.255245
  0.795127	 -0.379406	  2.247105
  0.777533	 -0.375545	  2.238414
  0.759908	 -0.372126	  2.229602
  0.742282	 -0.368708	  2.220789
  0.724657	 -0.365289	  2.211977
  0.707366	 -0.365960	  2.201948
  0.690096	 -0.366744	  2.191893
  0.672826	 -0.367528	  2.181837
  0.655555	 -0.368313	  2.171781
  0.639098	 -0.370968	  2.160731
  0.623701	 -0.375518	  2.148804
  0.608305	 -0.380068	  2.136877
  0.592909	 -0.384618	  2.124951
  0.577512	 -0.389168	  2.113024
  0.563610	 -0.395364	  2.100050
  0.550629	 -0.402435	  2.086577
  0.537649	 -0.409507	  2.073105
  0.524668	 -0.416578	  2.059633
  0.511687	 -0.423649	  2.046160
  0.499454	 -0.431468	  2.032405
  0.487485	 -0.439538	  2.018563
  0.475516	 -0.447609	  2.004721
  0.463547	 -0.455679	  1.990878
  0.451575	 -0.463780	  1.977056
  0.439585	 -0.472168	  1.963423
  0.427594	 -0.480556	  1.949789
  0.415603	 -0.488944	  1.936156
  0.403613	 -0.497332	  1.922523
  0.391870	 -0.506048	  1.908879
  0.380249	 -0.514920	  1.895232
  0.368629	 -0.523792	  1.881585
  0.357008	 -0.532664	  1.867938
  0.345330	 -0.540848	  1.853915
  0.333647	 -0.548961	  1.839854
  0.321969	 -0.556903	  1.825693
  0.310425	 -0.562838	  1.810478
  0.298880	 -0.568774	  1.795263
  0.287291	 -0.571980	  1.779281
  0.275089	 -0.569508	  1.763629
  0.263241	 -0.561370	  1.749722
  0.250674	 -0.548224	  1.741400
  0.238156	 -0.534452	  1.734077
  0.225638	 -0.520680	  1.726754
  0.212889	 -0.506427	  1.720895
  0.200033	 -0.491916	  1.715982
  0.187018	 -0.477191	  1.712267
  0.173941	 -0.462379	  1.709170
  0.160740	 -0.447538	  1.706831
  0.147466	 -0.432690	  1.704996
  0.134000	 -0.417976	  1.703533
  0.120322	 -0.403421	  1.702491
  0.106587	 -0.388923	  1.701425
  0.092469	 -0.374811	  1.700183
  0.078350	 -0.360700	  1.698942
  0.064103	 -0.346731	  1.697580
  0.049454	 -0.333227	  1.695830
  0.034805	 -0.319723	  1.694081
  0.020156	 -0.306219	  1.692332
  0.005117	 -0.293102	  1.691001
 -0.009978	 -0.280044	  1.689732
 -0.025073	 -0.266985	  1.688462
 -0.040150	 -0.253914	  1.687102
 -0.055003	 -0.240730	  1.684744
 -0.069857	 -0.227547	  1.682387
 -0.084711	 -0.214363	  1.680029
 -0.099476	 -0.201128	  1.677420
 -0.113672	 -0.187639	  1.673353
 -0.127868	 -0.174151	  1.669286
 -0.142063	 -0.160662	  1.665219
 -0.156071	 -0.147254	  1.660319
 -0.170013	 -0.133877	  1.655153
 -0.183961	 -0.120515	  1.649965
 -0.198104	 -0.107666	  1.644061
 -0.212247	 -0.094817	  1.638156
 -0.226579	 -0.082338	  1.631919
 -0.241079	 -0.070218	  1.625373
 -0.255578	 -0.058098	  1.618826
 -0.270310	 -0.046598	  1.611705
 -0.285050	 -0.035119	  1.604565
 -0.299896	 -0.023883	  1.597262
 -0.314905	 -0.013034	  1.589708
 -0.329913	 -0.002186	  1.582153
 -0.345031	  0.008297	  1.574308
 -0.360195	  0.018616	  1.566335
 -0.375358	  0.028936	  1.558362
 -0.390609	  0.038831	  1.550024
 -0.405869	  0.048669	  1.541638
 -0.421148	  0.058473	  1.533246
 -0.436538	  0.068072	  1.524819
 -0.451928	  0.077672	  1.516392
 -0.467195	  0.087371	  1.507858
 -0.482348	  0.097162	  1.499226
 -0.497501	  0.106954	  1.490594
 -0.512305	  0.117074	  1.481738
 -0.527085	  0.127217	  1.472868
 -0.541711	  0.137512	  1.463919
 -0.556122	  0.148016	  1.454864
 -0.570533	  0.158519	  1.445808
 -0.584829	  0.169037	  1.436588
 -0.599109	  0.179556	  1.427345
 -0.613423	  0.189982	  1.418050
 -0.627882	  0.200002	  1.408535
 -0.642341	  0.210022	  1.399019
 -0.656875	  0.219782	  1.389351
 -0.671667	  0.228525	  1.379114
 -0.686458	  0.237267	  1.368878
 -0.701250	  0.246009	  1.358642
 -0.716175	  0.253224	  1.347452
 -0.731101	  0.260391	  1.336235
 -0.746028	  0.267559	  1.325019
 -0.761131	  0.273462	  1.313312
 -0.776268	  0.279044	  1.301491
 -0.791404	  0.284626	  1.289670
 -0.806839	  0.289042	  1.277744
 -0.822340	  0.293166	  1.265797
 -0.837841	  0.297289	  1.253851
 -0.853915	  0.300167	  1.242302
 -0.869988	  0.303045	  1.230754
 -0.886234	  0.305573	  1.219367
 -0.902731	  0.307567	  1.208236
 -0.919227	  0.309560	  1.197106
 -0.935935	  0.311197	  1.186235
 -0.952664	  0.312796	  1.175391
 -0.969483	  0.314366	  1.164684
 -0.986395	  0.315907	  1.154119
 -1.003309	  0.317460	  1.143559
 -1.020266	  0.319234	  1.133105
 -1.037224	  0.321009	  1.122650
 -1.054061	  0.323123	  1.112066
 -1.070798	  0.325507	  1.101380
 -1.087505	  0.327962	  1.090663
 -1.103514	  0.331871	  1.079330
 -1.119523	  0.335781	  1.067997
 -1.135065	  0.341030	  1.056557
 -1.150384	  0.346845	  1.045088
 -1.165418	  0.353885	  1.033935
 -1.180234	  0.361706	  1.023011
 -1.194777	  0.370681	  1.012621
 -1.209164	  0.380210	  1.002510
 -1.223295	  0.390941	  0.993283
 -1.237344	  0.401982	  0.984299
 -1.250657	  0.415063	  0.977111
 -1.263896	  0.428290	  0.970056
 -1.274889	  0.444454	  0.965828
 -1.285882	  0.460618	  0.961601
 -1.296038	  0.477522	  0.958267
 -1.304298	  0.495680	  0.956831
 -1.312557	  0.513839	  0.955396
 -1.320817	  0.531997	  0.953961
 -1.328801	  0.550299	  0.952836
 -1.336160	  0.568891	  0.952405
 -1.343519	  0.587483	  0.951973
 -1.350878	  0.606075	  0.951542
 -1.358236	  0.624667	  0.951110
 -1.365769	  0.643195	  0.951129
 -1.373390	  0.661684	  0.951383
 -1.381012	  0.680173	  0.951636
 -1.388633	  0.698662	  0.951890
 -1.397056	  0.716791	  0.952514
 -1.405784	  0.734770	  0.953280
 -1.414512	  0.752749	  0.954047
 -1.424171	  0.770237	  0.954971
 -1.434268	  0.787472	  0.955971
 -1.444583	  0.804579	  0.956949
 -1.456488	  0.820629	  0.957762
 -1.468394	  0.836679	  0.958575
 -1.481477	  0.851791	  0.959258
 -1.495407	  0.866130	  0.959839
 -1.509338	  0.880468	  0.960420
 -1.525074	  0.892793	  0.961098
 -1.541158	  0.904661	  0.961796
 -1.557241	  0.916529	  0.962494
 -1.574374	  0.926791	  0.963557
 -1.592089	  0.935985	  0.964847
 -1.609804	  0.945178	  0.966137
 -1.627519	  0.954372	  0.967427
 -1.646118	  0.961492	  0.969259
 -1.665085	  0.967478	  0.971367
 -1.684051	  0.973464	  0.973474
 -1.703018	  0.979449	  0.975582
 -1.721984	  0.985435	  0.977690
 -1.741422	  0.989774	  0.979521
 -1.761394	  0.989447	  0.980525
 -1.781366	  0.989121	  0.981530
 -1.801338	  0.988794	  0.982534
 -1.821310	  0.988468	  0.983539
 -1.841283	  0.988142	  0.984543
 -1.861255	  0.987815	  0.985547
 -1.881227	  0.987489	  0.986552
 -1.899427	  0.980145	  0.982704
 -1.917483	  0.972545	  0.978675
 -1.935538	  0.964945	  0.974645
 -1.953594	  0.957345	  0.970616
 -1.971650	  0.949745	  0.966587
 -1.989705	  0.942145	  0.962557
 -2.007761	  0.934545	  0.958528
 -2.025816	  0.926945	  0.954498
 -2.040486	  0.916759	  0.945495
 -2.053655	  0.905945	  0.935025
 -2.066824	  0.895130	  0.924555
 -2.079993	  0.884315	  0.914085
 -2.093163	  0.873501	  0.903616
 -2.106332	  0.862686	  0.893146
 -2.119501	  0.851872	  0.882676
 -2.131072	  0.841175	  0.870360
 -2.138921	  0.831199	  0.854904
 -2.146769	  0.821223	  0.839448
 -2.154618	  0.811247	  0.823993
 -2.162466	  0.801271	  0.808537
 -2.170315	  0.791295	  0.793081
 -2.176863	  0.782023	  0.776614
 -2.181286	  0.773994	  0.758839
 -2.185708	  0.765964	  0.741063
 -2.190131	  0.757935	  0.723288
 -2.194554	  0.749905	  0.705512
 -2.198471	  0.742315	  0.687428
 -2.200767	  0.736172	  0.668534
 -2.203064	  0.730028	  0.649640
 -2.205360	  0.723885	  0.630746
 -2.207656	  0.717741	  0.611852
 -2.209952	  0.711598	  0.592958
 -2.211401	  0.707478	  0.573440
 -2.212568	  0.704036	  0.553774
 -2.213735	  0.700593	  0.534107
 -2.214903	  0.697150	  0.514440
 -2.216070	  0.693707	  0.494773
 -2.217257	  0.691038	  0.474987
 -2.218478	  0.689921	  0.455056
 -2.219699	  0.688803	  0.435125
 -2.220921	  0.687686	  0.415193
 -2.222988	  0.687002	  0.395312
 -2.226523	  0.687080	  0.375627
 -2.233359	  0.688440	  0.356881
 -2.244507	  0.691505	  0.340562
 -2.260127	  0.695690	  0.328793
 -2.275747	  0.699876	  0.317025
 -2.291684	  0.704041	  0.305682
 -2.308120	  0.708166	  0.295058
 -2.324626	  0.712245	  0.284527
 -2.341342	  0.716188	  0.274279
 -2.358059	  0.720131	  0.264031
 -2.374961	  0.723856	  0.254010
 -2.391877	  0.727565	  0.244005
 -2.409088	  0.730925	  0.234387
 -2.426406	  0.734153	  0.224919
 -2.443709	  0.737306	  0.215497
 -2.461242	  0.739945	  0.206243
