  2.732468	  0.325667	 -1.268250
  2.705414	  0.322443	 -1.255693
  2.703784	  0.298782	 -1.213524
  2.694499	  0.260336	 -1.182205
  2.676801	  0.227910	 -1.148209
  2.667096	  0.195413	 -1.110958
  2.662453	  0.162806	 -1.077882
  2.650496	  0.130554	 -1.043354
  2.640316	  0.096087	 -1.003664
  2.630405	  0.068436	 -0.961779
  2.623183	  0.037029	 -0.922428
  2.616667	  0.001307	 -0.885462
  2.609303	 -0.032823	 -0.852127
  2.599988	 -0.064754	 -0.818490
  2.588588	 -0.095157	 -0.780968
  2.576610	 -0.125170	 -0.740830
  2.565067	 -0.155914	 -0.702140
  2.554417	 -0.189477	 -0.665296
  2.543052	 -0.221773	 -0.632240
  2.534437	 -0.256594	 -0.602055
  2.521830	 -0.291720	 -0.565740
  2.512053	 -0.329180	 -0.532481
  2.503455	 -0.363862	 -0.501776
  2.493416	 -0.399451	 -0.468781
  2.482721	 -0.433573	 -0.433963
  2.472448	 -0.467585	 -0.397529
  2.463752	 -0.500040	 -0.361651
  2.455994	 -0.533202	 -0.324178
  2.448706	 -0.565694	 -0.286431
  2.441566	 -0.597674	 -0.248161
  2.433879	 -0.629368	 -0.209555
  2.426240	 -0.658697	 -0.173036
  2.417870	 -0.688363	 -0.135793
  2.409485	 -0.716745	 -0.100250
  2.399419	 -0.748603	 -0.061339
  2.388253	 -0.779966	 -0.025568
  2.374268	 -0.814441	  0.009352
  2.363386	 -0.846747	  0.042416
  2.351260	 -0.879873	  0.081998
  2.339657	 -0.917575	  0.115691
  2.330182	 -0.952825	  0.150884
  2.316829	 -0.983413	  0.184423
  2.309018	 -1.017076	  0.221731
  2.299218	 -1.051077	  0.257338
  2.287179	 -1.086019	  0.293054
  2.274652	 -1.117768	  0.326620
  2.261184	 -1.151641	  0.362953
  2.249399	 -1.184032	  0.398136
  2.239127	 -1.214337	  0.431237
  2.228483	 -1.248146	  0.468327
  2.218217	 -1.281094	  0.505470
  2.207865	 -1.313416	  0.542500
  2.198049	 -1.343809	  0.577394
  2.187915	 -1.376261	  0.614486
  2.179430	 -1.407142	  0.650232
  2.172109	 -1.438956	  0.687089
  2.165538	 -1.470317	  0.720698
  2.155917	 -1.504967	  0.757152
  2.145542	 -1.535187	  0.794391
  2.140805	 -1.569909	  0.829893
  2.133466	 -1.602760	  0.866033
  2.124814	 -1.637852	  0.904481
  2.116024	 -1.668585	  0.938826
  2.105953	 -1.701967	  0.976730
  2.095486	 -1.734630	  1.016395
  2.085072	 -1.763189	  1.051372
  2.075401	 -1.794740	  1.088494
  2.064100	 -1.825939	  1.125945
  2.045102	 -1.866703	  1.154547
  2.065553	 -1.885370	  1.166093
