  0.760052	  2.301145	 -0.070003
  0.773075	  2.335943	 -0.054073
  0.786098	  2.370741	 -0.038143
  0.779277	  2.353901	 -0.045760
  0.775804	  2.336672	 -0.054122
  0.767588	  2.317674	 -0.064208
  0.759369	  2.302347	 -0.069135
  0.747646	  2.285975	 -0.072628
  0.733020	  2.269648	 -0.078186
  0.728122	  2.254004	 -0.086064
  0.724280	  2.235871	 -0.093394
  0.715835	  2.217342	 -0.101355
  0.706130	  2.204981	 -0.100197
  0.695126	  2.176150	 -0.105179
  0.687335	  2.159570	 -0.111189
  0.683070	  2.152313	 -0.113584
  0.674059	  2.128758	 -0.116608
  0.661326	  2.111379	 -0.117435
  0.649213	  2.094080	 -0.121798
  0.644710	  2.077233	 -0.125547
  0.638244	  2.056790	 -0.128280
  0.630412	  2.039986	 -0.129509
  0.621271	  2.021559	 -0.130829
  0.612966	  2.003194	 -0.131266
  0.604392	  1.986152	 -0.131094
  0.591706	  1.966048	 -0.135320
  0.583009	  1.950338	 -0.139132
  0.575225	  1.934096	 -0.140082
  0.563989	  1.915419	 -0.142279
  0.557023	  1.898058	 -0.148983
  0.548217	  1.881698	 -0.154148
  0.535566	  1.866478	 -0.158422
  0.525201	  1.851875	 -0.163309
  0.517146	  1.831829	 -0.169616
  0.506094	  1.814354	 -0.173600
  0.491936	  1.802071	 -0.179471
  0.476846	  1.792174	 -0.185635
  0.462328	  1.776672	 -0.185634
  0.453971	  1.757109	 -0.188637
  0.444044	  1.742065	 -0.185089
  0.431141	  1.726932	 -0.180142
  0.417400	  1.712900	 -0.174984
  0.402774	  1.700259	 -0.171103
  0.388869	  1.686229	 -0.166223
  0.376041	  1.671661	 -0.161699
  0.362653	  1.656326	 -0.159128
  0.350262	  1.641363	 -0.155147
  0.337571	  1.626166	 -0.152133
  0.325135	  1.610691	 -0.148475
  0.311433	  1.596418	 -0.146927
  0.297844	  1.582091	 -0.143421
  0.283427	  1.568353	 -0.139865
  0.267958	  1.555942	 -0.138680
  0.251521	  1.543668	 -0.137585
  0.234752	  1.532760	 -0.137586
  0.217979	  1.522214	 -0.138147
  0.202418	  1.512771	 -0.135792
  0.189755	  1.504023	 -0.130724
  0.179007	  1.491315	 -0.121408
  0.169473	  1.478243	 -0.109590
  0.161982	  1.467279	 -0.091811
  0.158191	  1.459018	 -0.073141
  0.150170	  1.449180	 -0.058467
  0.137775	  1.438547	 -0.048920
  0.123151	  1.424864	 -0.033497
  0.114376	  1.413520	 -0.020964
  0.108361	  1.401621	 -0.010287
  0.099700	  1.388233	  0.005636
  0.097210	  1.371656	  0.018508
  0.091484	  1.361492	  0.030089
  0.082283	  1.346037	  0.043490
  0.076923	  1.331242	  0.056313
  0.070792	  1.317883	  0.069537
  0.064478	  1.301798	  0.081071
  0.059461	  1.289473	  0.091967
  0.053883	  1.274385	  0.104820
  0.047223	  1.258697	  0.116378
  0.039726	  1.241172	  0.124046
  0.032128	  1.224227	  0.131510
  0.023768	  1.210120	  0.139076
  0.016870	  1.191473	  0.140447
  0.015281	  1.169305	  0.137568
  0.011984	  1.149658	  0.129742
  0.011175	  1.137771	  0.117733
  0.013750	  1.124519	  0.105365
  0.011617	  1.105089	  0.088279
  0.007260	  1.092404	  0.070060
  0.002017	  1.078097	  0.060662
 -0.001224	  1.063459	  0.046442
  0.002423	  1.052967	  0.032231
  0.007004	  1.038426	  0.017175
  0.011191	  1.024258	 -0.000973
  0.009883	  1.012312	 -0.015136
  0.013584	  1.005590	 -0.032969
  0.015871	  0.998078	 -0.055494
  0.018148	  0.987812	 -0.071284
  0.020754	  0.971975	 -0.083620
  0.026478	  0.959948	 -0.100057
  0.035885	  0.953004	 -0.118508
  0.043986	  0.947262	 -0.135001
  0.053580	  0.939070	 -0.151610
  0.064295	  0.929188	 -0.164570
  0.074215	  0.918118	 -0.178256
  0.084589	  0.906005	 -0.193317
  0.094090	  0.899892	 -0.209187
  0.104531	  0.895432	 -0.227809
  0.108822	  0.890053	 -0.244937
  0.118153	  0.882563	 -0.258937
  0.129816	  0.874765	 -0.279037
  0.135211	  0.872282	 -0.295720
  0.144663	  0.869437	 -0.315765
  0.158255	  0.861061	 -0.327740
  0.170912	  0.855348	 -0.342479
  0.177636	  0.854301	 -0.361895
  0.185731	  0.851450	 -0.379788
  0.190968	  0.847994	 -0.401607
  0.192963	  0.845733	 -0.416834
  0.198155	  0.842308	 -0.436087
  0.197313	  0.831276	 -0.454109
  0.191786	  0.814600	 -0.465975
  0.185931	  0.802685	 -0.475090
  0.180674	  0.784206	 -0.483700
  0.175681	  0.764802	 -0.491308
  0.164858	  0.749267	 -0.495395
  0.155443	  0.732343	 -0.499479
  0.149683	  0.712805	 -0.503665
  0.144797	  0.693658	 -0.507833
  0.142909	  0.673588	 -0.511945
  0.136759	  0.653777	 -0.513953
  0.126649	  0.637425	 -0.519882
  0.122132	  0.620850	 -0.525994
  0.111462	  0.600592	 -0.530801
  0.106257	  0.580673	 -0.534041
  0.104108	  0.566559	 -0.539596
  0.095222	  0.547779	 -0.546744
  0.091125	  0.528000	 -0.553538
  0.088503	  0.507298	 -0.554719
  0.080377	  0.490431	 -0.557987
  0.071776	  0.472991	 -0.563034
  0.067469	  0.450992	 -0.568701
  0.058989	  0.434358	 -0.572837
  0.051628	  0.419438	 -0.577485
  0.045322	  0.400057	 -0.583938
  0.037548	  0.381515	 -0.591747
  0.031234	  0.363441	 -0.598560
  0.023077	  0.348773	 -0.605161
  0.015716	  0.329738	 -0.614535
  0.012774	  0.311828	 -0.623391
  0.005372	  0.294755	 -0.628941
 -0.002087	  0.276922	 -0.628339
 -0.007028	  0.256009	 -0.631609
 -0.016320	  0.238533	 -0.635014
 -0.033825	  0.223655	 -0.639450
 -0.039168	  0.203341	 -0.648089
 -0.038499	  0.188691	 -0.655289
 -0.046401	  0.168460	 -0.661802
 -0.057329	  0.149433	 -0.667448
 -0.069408	  0.138534	 -0.674388
 -0.082289	  0.122803	 -0.682783
 -0.086213	  0.105369	 -0.690151
 -0.086265	  0.083521	 -0.695118
 -0.090104	  0.064465	 -0.707436
 -0.097442	  0.050084	 -0.717063
 -0.113031	  0.034530	 -0.721828
 -0.121211	  0.018331	 -0.727369
 -0.127550	 -0.001444	 -0.734832
 -0.133264	 -0.014309	 -0.740105
 -0.142313	 -0.031597	 -0.743661
 -0.151434	 -0.051962	 -0.751940
 -0.158576	 -0.069569	 -0.768441
 -0.162810	 -0.081763	 -0.782031
 -0.168253	 -0.097877	 -0.788320
 -0.173688	 -0.115215	 -0.790153
 -0.182587	 -0.141130	 -0.792211
 -0.190047	 -0.159585	 -0.789786
 -0.203280	 -0.177624	 -0.795867
 -0.211604	 -0.191767	 -0.801905
 -0.214180	 -0.210170	 -0.812113
 -0.212817	 -0.226893	 -0.823499
 -0.215797	 -0.244381	 -0.831267
 -0.224329	 -0.264878	 -0.836911
 -0.232178	 -0.281614	 -0.841453
 -0.234873	 -0.296980	 -0.852170
 -0.233500	 -0.317874	 -0.866549
 -0.239126	 -0.334613	 -0.874113
 -0.248542	 -0.349297	 -0.876935
 -0.255586	 -0.368862	 -0.881890
 -0.257479	 -0.392718	 -0.891059
 -0.251661	 -0.413030	 -0.892261
 -0.256519	 -0.427926	 -0.898146
 -0.267583	 -0.442477	 -0.913060
 -0.275213	 -0.460581	 -0.923958
 -0.277675	 -0.479924	 -0.926799
 -0.274239	 -0.499201	 -0.933748
 -0.275144	 -0.519374	 -0.935181
 -0.278792	 -0.541480	 -0.935710
 -0.279774	 -0.556404	 -0.948309
 -0.280060	 -0.572383	 -0.962835
 -0.278488	 -0.592483	 -0.971612
 -0.278962	 -0.615338	 -0.973115
 -0.277554	 -0.631746	 -0.973657
 -0.276029	 -0.649963	 -0.981603
 -0.276915	 -0.669846	 -0.991475
 -0.275732	 -0.688073	 -0.999790
 -0.271658	 -0.707093	 -1.006257
 -0.264579	 -0.725639	 -1.011626
 -0.261198	 -0.744265	 -1.020019
 -0.258285	 -0.763337	 -1.024823
 -0.253058	 -0.781717	 -1.027317
 -0.246085	 -0.801325	 -1.030371
 -0.238558	 -0.819350	 -1.031966
 -0.237585	 -0.833188	 -1.027591
 -0.242486	 -0.843588	 -1.020685
 -0.253355	 -0.855738	 -1.010147
 -0.264948	 -0.867993	 -0.998721
 -0.280867	 -0.876166	 -0.986456
 -0.296517	 -0.881872	 -0.975194
 -0.307540	 -0.890410	 -0.961042
 -0.320805	 -0.900147	 -0.945345
 -0.328380	 -0.909419	 -0.929798
 -0.330877	 -0.923538	 -0.913897
 -0.339237	 -0.933746	 -0.899595
 -0.352765	 -0.943596	 -0.887676
 -0.357397	 -0.956252	 -0.874543
 -0.367328	 -0.966915	 -0.860755
 -0.381624	 -0.976203	 -0.849406
 -0.390735	 -0.995254	 -0.847468
 -0.401873	 -1.006005	 -0.834157
 -0.414169	 -1.021772	 -0.838175
 -0.427308	 -1.038571	 -0.831415
 -0.437786	 -1.053910	 -0.831543
 -0.452749	 -1.065542	 -0.835254
 -0.463923	 -1.080616	 -0.837831
 -0.476976	 -1.094281	 -0.837539
 -0.491555	 -1.111099	 -0.838595
 -0.507308	 -1.125082	 -0.841454
 -0.520179	 -1.129631	 -0.854040
 -0.536268	 -1.139460	 -0.859683
 -0.550436	 -1.152994	 -0.864123
 -0.566953	 -1.163159	 -0.869320
 -0.583631	 -1.172590	 -0.875895
 -0.598424	 -1.183442	 -0.884175
 -0.615418	 -1.191478	 -0.891541
 -0.627381	 -1.193757	 -0.908618
 -0.643510	 -1.204430	 -0.914330
 -0.659493	 -1.206676	 -0.926432
 -0.672209	 -1.210532	 -0.941643
 -0.686028	 -1.212263	 -0.955955
 -0.699974	 -1.213911	 -0.970014
 -0.713085	 -1.216961	 -0.985060
 -0.728244	 -1.215374	 -0.997748
 -0.737524	 -1.218698	 -1.008785
 -0.751539	 -1.221351	 -1.023227
 -0.769144	 -1.216996	 -1.032245
 -0.786270	 -1.215387	 -1.041073
 -0.805979	 -1.211263	 -1.050109
 -0.825328	 -1.215469	 -1.059598
 -0.840618	 -1.213584	 -1.069874
 -0.858665	 -1.218929	 -1.081528
 -0.867692	 -1.234161	 -1.095110
 -0.879426	 -1.246415	 -1.106839
 -0.879841	 -1.261721	 -1.121535
 -0.875263	 -1.276946	 -1.136880
 -0.867753	 -1.293454	 -1.144556
 -0.864307	 -1.310856	 -1.156390
 -0.854014	 -1.326099	 -1.164672
 -0.848176	 -1.341675	 -1.177533
 -0.839495	 -1.357269	 -1.190406
 -0.836988	 -1.370714	 -1.205802
 -0.823299	 -1.383354	 -1.218796
 -0.804292	 -1.391901	 -1.226175
 -0.789458	 -1.403003	 -1.237397
 -0.775028	 -1.415691	 -1.238116
 -0.766790	 -1.434054	 -1.246189
 -0.761592	 -1.453476	 -1.252157
 -0.754642	 -1.469236	 -1.261162
 -0.753426	 -1.488267	 -1.269695
 -0.746757	 -1.505524	 -1.278573
 -0.743087	 -1.521544	 -1.286733
 -0.738808	 -1.538702	 -1.295441
 -0.734382	 -1.556714	 -1.305289
 -0.732145	 -1.572181	 -1.311824
 -0.735173	 -1.590973	 -1.320032
 -0.731736	 -1.609057	 -1.328840
 -0.736532	 -1.625928	 -1.334970
 -0.743956	 -1.644155	 -1.340674
 -0.745621	 -1.662671	 -1.348301
 -0.752031	 -1.679539	 -1.355891
 -0.753496	 -1.696546	 -1.362062
 -0.760783	 -1.715241	 -1.368055
 -0.769446	 -1.731898	 -1.374651
 -0.775859	 -1.749993	 -1.379946
 -0.785493	 -1.766573	 -1.386063
 -0.792566	 -1.784615	 -1.391049
 -0.801686	 -1.801458	 -1.396995
 -0.810611	 -1.818435	 -1.402720
 -0.817992	 -1.836347	 -1.408389
 -0.825364	 -1.854654	 -1.414281
 -0.831883	 -1.873092	 -1.419544
 -0.833842	 -1.880264	 -1.421025
 -0.839337	 -1.900383	 -1.425181
