  1.180550	 -1.653270	  1.511605
  1.193618	 -1.674444	  1.513698
  1.182702	 -1.661208	  1.513989
  1.171873	 -1.644795	  1.515966
  1.156040	 -1.620968	  1.515906
  1.148457	 -1.609250	  1.514938
  1.138862	 -1.591625	  1.509448
  1.129382	 -1.572731	  1.503491
  1.121341	 -1.557171	  1.498633
  1.110627	 -1.538260	  1.492130
  1.101262	 -1.522924	  1.486423
  1.092491	 -1.508590	  1.481332
  1.076813	 -1.487319	  1.477572
  1.065947	 -1.475813	  1.478286
  1.051586	 -1.462010	  1.481144
  1.033509	 -1.440154	  1.479734
  1.025755	 -1.429494	  1.477660
  1.015886	 -1.413793	  1.472017
  1.003468	 -1.394606	  1.465758
  0.994074	 -1.380598	  1.460490
  0.983540	 -1.364001	  1.453356
  0.973650	 -1.348043	  1.446534
  0.963706	 -1.331897	  1.440502
  0.951811	 -1.314545	  1.434803
  0.942933	 -1.300824	  1.429086
  0.932031	 -1.284809	  1.423310
  0.913741	 -1.261967	  1.419782
  0.904152	 -1.251438	  1.419898
  0.894119	 -1.241832	  1.421860
  0.880426	 -1.222546	  1.420485
  0.868341	 -1.204948	  1.417872
  0.857180	 -1.188351	  1.416032
  0.846074	 -1.171806	  1.414311
  0.834665	 -1.155474	  1.412555
  0.822707	 -1.139547	  1.410731
  0.810742	 -1.123630	  1.408872
  0.799045	 -1.107703	  1.405810
  0.787837	 -1.091849	  1.401032
  0.776814	 -1.075947	  1.395905
  0.764861	 -1.060474	  1.391212
  0.750443	 -1.046779	  1.388249
  0.735984	 -1.033916	  1.385935
  0.725728	 -1.019075	  1.379899
  0.722672	 -0.998420	  1.374006
  0.719403	 -0.973608	  1.375535
  0.703654	 -0.955161	  1.379757
  0.685945	 -0.942951	  1.382979
  0.674382	 -0.930668	  1.383756
  0.663771	 -0.914150	  1.385506
  0.651630	 -0.896212	  1.387907
  0.639323	 -0.881677	  1.388097
  0.628475	 -0.865907	  1.387889
  0.617228	 -0.847367	  1.390154
  0.604801	 -0.830954	  1.391517
  0.593774	 -0.817077	  1.390728
  0.582973	 -0.798924	  1.390698
  0.569389	 -0.780995	  1.391864
  0.556117	 -0.767785	  1.390908
  0.546063	 -0.754135	  1.388580
  0.534832	 -0.734971	  1.387050
  0.517790	 -0.716990	  1.387106
  0.501924	 -0.708758	  1.385750
  0.483491	 -0.701635	  1.379614
  0.461348	 -0.695248	  1.375243
  0.437713	 -0.681850	  1.373101
  0.426153	 -0.670257	  1.370490
  0.415630	 -0.657239	  1.367660
  0.401647	 -0.641113	  1.358191
  0.389617	 -0.626936	  1.347366
  0.379148	 -0.615027	  1.336843
  0.367791	 -0.597431	  1.325376
  0.354633	 -0.571717	  1.315702
  0.351544	 -0.565291	  1.313994
  0.347456	 -0.546061	  1.308708
  0.341710	 -0.522547	  1.298377
  0.336212	 -0.507274	  1.293379
  0.329281	 -0.487161	  1.290717
  0.321093	 -0.465768	  1.286869
  0.315019	 -0.446516	  1.288617
  0.311459	 -0.426731	  1.294399
  0.306182	 -0.405824	  1.293613
  0.298979	 -0.386229	  1.291963
  0.289659	 -0.368032	  1.292568
  0.279530	 -0.350033	  1.293450
  0.269414	 -0.332149	  1.294231
  0.260097	 -0.315748	  1.294211
  0.255437	 -0.296458	  1.289873
  0.245836	 -0.275607	  1.278213
  0.228664	 -0.262378	  1.265988
  0.213947	 -0.251374	  1.255425
  0.198827	 -0.238053	  1.248736
  0.185536	 -0.223214	  1.246385
  0.174709	 -0.206683	  1.246631
  0.165733	 -0.189842	  1.248194
  0.156663	 -0.171833	  1.247878
  0.146187	 -0.153798	  1.246700
  0.132335	 -0.138236	  1.246200
  0.116269	 -0.125056	  1.244160
  0.102109	 -0.112959	  1.237823
  0.091353	 -0.096316	  1.230937
  0.084425	 -0.079480	  1.226883
  0.081912	 -0.063044	  1.225490
  0.074293	 -0.035500	  1.227412
  0.059952	 -0.014506	  1.223872
  0.050021	 -0.005115	  1.216556
  0.029524	  0.008562	  1.198310
  0.014236	  0.020218	  1.189475
  0.006673	  0.027930	  1.189852
 -0.011542	  0.047199	  1.185295
 -0.029902	  0.065806	  1.182132
 -0.040222	  0.074085	  1.182080
 -0.050214	  0.083974	  1.180435
 -0.068825	  0.103349	  1.179792
 -0.077831	  0.116654	  1.178460
 -0.090273	  0.134430	  1.177047
 -0.103441	  0.149890	  1.176900
 -0.116693	  0.170071	  1.176086
 -0.128899	  0.189263	  1.173234
 -0.137499	  0.200159	  1.172513
 -0.145673	  0.210639	  1.169488
 -0.164544	  0.233382	  1.165780
 -0.176464	  0.246388	  1.167083
 -0.185118	  0.256852	  1.167090
 -0.204048	  0.284293	  1.173264
 -0.212051	  0.293728	  1.177005
 -0.222577	  0.303493	  1.181370
 -0.241017	  0.318878	  1.187211
 -0.258360	  0.335271	  1.192195
 -0.267364	  0.350342	  1.191563
 -0.276941	  0.368551	  1.189386
 -0.290582	  0.388079	  1.184791
 -0.303788	  0.403823	  1.183259
 -0.312337	  0.414604	  1.183171
 -0.329194	  0.433328	  1.179712
 -0.343812	  0.448547	  1.180037
 -0.352672	  0.460229	  1.183743
 -0.365770	  0.478377	  1.188310
 -0.376599	  0.491053	  1.186680
 -0.391768	  0.506937	  1.180815
 -0.409008	  0.528399	  1.179956
 -0.415783	  0.538273	  1.181956
 -0.429660	  0.557239	  1.182777
 -0.442934	  0.574971	  1.180334
 -0.450707	  0.585123	  1.177487
 -0.466453	  0.598262	  1.165128
 -0.481462	  0.611071	  1.156753
 -0.495021	  0.624383	  1.150238
 -0.508919	  0.636944	  1.143296
 -0.525243	  0.644618	  1.134717
 -0.541644	  0.652128	  1.126084
 -0.558049	  0.659635	  1.117452
 -0.574453	  0.667140	  1.108822
 -0.590949	  0.674442	  1.100292
 -0.610177	  0.675289	  1.095042
 -0.629623	  0.675105	  1.090385
 -0.649054	  0.674918	  1.085679
 -0.668380	  0.674830	  1.080523
 -0.687757	  0.674796	  1.075201
 -0.707453	  0.672783	  1.072406
 -0.725878	  0.671776	  1.067755
 -0.745819	  0.676306	  1.059633
 -0.767267	  0.684365	  1.055875
 -0.791590	  0.686271	  1.057672
 -0.809759	  0.678989	  1.057748
 -0.826048	  0.670300	  1.050178
 -0.844627	  0.671535	  1.043534
 -0.871567	  0.673016	  1.045813
 -0.894292	  0.664496	  1.050110
 -0.909638	  0.653833	  1.052783
 -0.927179	  0.645256	  1.051336
 -0.942580	  0.640545	  1.047731
 -0.960561	  0.638565	  1.044584
 -0.982724	  0.639279	  1.044805
 -1.006151	  0.641782	  1.042262
 -1.016699	  0.645407	  1.038584
 -1.033123	  0.653800	  1.030258
 -1.063484	  0.654274	  1.017925
 -1.087662	  0.644301	  1.012342
 -1.097301	  0.640598	  1.010393
 -1.111454	  0.632666	  1.006355
 -1.134245	  0.624282	  0.999939
 -1.153096	  0.621476	  0.997580
 -1.175468	  0.622637	  0.999693
 -1.194282	  0.629445	  0.997755
 -1.199212	  0.634575	  0.997247
 -1.206672	  0.646125	  0.995164
 -1.222671	  0.670304	  0.989958
 -1.235790	  0.682698	  0.986889
 -1.242019	  0.697844	  0.992122
 -1.248601	  0.712390	  0.997032
 -1.254709	  0.733127	  1.004685
 -1.256623	  0.746768	  1.013100
 -1.262666	  0.772406	  1.020314
 -1.266905	  0.795427	  1.025003
 -1.267113	  0.801818	  1.025366
 -1.265307	  0.823646	  1.026932
 -1.260070	  0.849482	  1.024793
 -1.256080	  0.868199	  1.025316
 -1.254564	  0.880328	  1.028059
 -1.251614	  0.905830	  1.035099
 -1.246297	  0.919620	  1.036954
 -1.239176	  0.935081	  1.038642
 -1.229142	  0.966189	  1.043133
 -1.228062	  0.978667	  1.046690
 -1.229417	  0.992329	  1.053720
 -1.230304	  1.016492	  1.064407
 -1.219805	  1.042793	  1.071396
 -1.207667	  1.054236	  1.072910
 -1.186680	  1.065680	  1.072038
 -1.165452	  1.080502	  1.066597
 -1.153482	  1.096608	  1.063235
 -1.142359	  1.114827	  1.067104
 -1.137787	  1.133612	  1.072196
 -1.130142	  1.147578	  1.078218
 -1.120205	  1.177176	  1.080221
 -1.117642	  1.200717	  1.076581
 -1.113501	  1.214089	  1.074198
 -1.107676	  1.230793	  1.071418
 -1.104845	  1.261999	  1.070927
 -1.107776	  1.282971	  1.068978
 -1.113880	  1.301458	  1.063103
 -1.119377	  1.324965	  1.056027
 -1.119481	  1.340041	  1.055525
 -1.114981	  1.359569	  1.059090
 -1.113156	  1.380747	  1.058979
 -1.118648	  1.400253	  1.053756
 -1.123836	  1.423629	  1.049133
 -1.124128	  1.442265	  1.049177
 -1.121116	  1.460824	  1.051703
 -1.120746	  1.479911	  1.051591
 -1.126260	  1.500295	  1.047861
 -1.131857	  1.522855	  1.045363
 -1.135733	  1.540533	  1.044320
 -1.142482	  1.554178	  1.040785
 -1.149297	  1.577998	  1.038153
 -1.148692	  1.598699	  1.041841
 -1.144470	  1.615161	  1.048121
 -1.142889	  1.646627	  1.053872
 -1.145583	  1.663306	  1.053718
 -1.147509	  1.680471	  1.054947
 -1.160327	  1.709907	  1.052272
 -1.178979	  1.726399	  1.042558
 -1.192205	  1.730977	  1.034654
 -1.210271	  1.739943	  1.027374
 -1.225265	  1.755718	  1.022822
 -1.237673	  1.771374	  1.019447
 -1.250558	  1.786197	  1.015593
 -1.263414	  1.801019	  1.011714
 -1.276398	  1.815729	  1.007840
 -1.290155	  1.829674	  1.003802
 -1.303994	  1.843560	  0.999828
 -1.317948	  1.857266	  0.995644
 -1.332435	  1.870171	  0.990781
 -1.346980	  1.883097	  0.986126
 -1.361585	  1.896084	  0.981438
 -1.376143	  1.909079	  0.975828
 -1.390597	  1.921797	  0.970412
