 -0.439115	  2.704466	  1.293808
 -0.434768	  2.677690	  1.280998
 -0.425403	  2.647294	  1.247060
 -0.417901	  2.616014	  1.214761
 -0.406264	  2.580659	  1.181221
 -0.397925	  2.550497	  1.139441
 -0.394663	  2.519796	  1.100311
 -0.386166	  2.487053	  1.065467
 -0.382429	  2.449007	  1.036881
 -0.368936	  2.414571	  1.001225
 -0.361375	  2.384531	  0.958465
 -0.350938	  2.352032	  0.925909
 -0.349142	  2.316649	  0.883998
 -0.343102	  2.284318	  0.847873
 -0.338061	  2.252145	  0.811511
 -0.334312	  2.220302	  0.778337
 -0.326736	  2.187986	  0.736785
 -0.321048	  2.155420	  0.700326
 -0.314590	  2.121942	  0.663719
 -0.306711	  2.089769	  0.627122
 -0.299265	  2.058770	  0.590554
 -0.292000	  2.029178	  0.555591
 -0.284086	  1.997586	  0.516320
 -0.275423	  1.965658	  0.479274
 -0.273049	  1.929712	  0.445105
 -0.286955	  1.896670	  0.422292
 -0.316932	  1.869642	  0.410279
 -0.547408	  1.774502	  0.363067
 -0.615038	  1.622943	  0.441250
 -0.744784	  1.421104	  0.460732
 -0.818569	  1.300383	  0.448184
 -0.831587	  1.278074	  0.435979
 -0.836366	  1.267019	  0.423622
 -0.771565	  1.259902	  0.347453
 -0.698115	  1.268529	  0.276255
 -0.428351	  1.353673	  0.200917
 -0.315186	  1.391983	  0.155309
 -0.103742	  1.372599	  0.072988
  0.052371	  1.342805	  0.032934
  0.147286	  1.333701	 -0.014528
  0.191707	  1.299222	 -0.021927
  0.215601	  1.265736	 -0.046647
  0.206683	  1.245015	 -0.062764
  0.216496	  1.231821	 -0.095553
  0.207978	  1.219227	 -0.135048
  0.186708	  1.188300	 -0.191448
  0.182143	  1.128673	 -0.255406
  0.178681	  1.085929	 -0.282935
  0.174690	  1.037001	 -0.293206
  0.140589	  0.940127	 -0.273004
  0.032609	  0.817937	 -0.248971
  0.023819	  0.762645	 -0.257861
  0.055510	  0.673263	 -0.287942
 -0.001497	  0.600898	 -0.334909
 -0.003346	  0.599146	 -0.337897
  0.004091	  0.596822	 -0.355670
  0.064185	  0.552415	 -0.419940
  0.062721	  0.542342	 -0.468338
  0.020327	  0.538482	 -0.550187
  0.003130	  0.576557	 -0.590643
  0.000426	  0.687685	 -0.762632
  0.001052	  0.680985	 -0.884795
  0.005585	  0.660199	 -0.931988
  0.019071	  0.634786	 -0.963525
  0.044986	  0.603904	 -0.984687
  0.093111	  0.561631	 -0.998421
  0.276862	  0.464001	 -0.996330
  0.335535	  0.430987	 -1.004069
  0.369904	  0.399630	 -1.020194
  0.398782	  0.359131	 -1.046142
  0.419171	  0.316999	 -1.085559
  0.418115	  0.290111	 -1.117786
  0.403577	  0.256630	 -1.166118
  0.384640	  0.230927	 -1.220874
  0.347705	  0.215532	 -1.269564
  0.190738	  0.217072	 -1.392502
  0.127080	  0.202086	 -1.441828
  0.116491	  0.172016	 -1.481399
  0.120779	  0.143050	 -1.516194
  0.129338	  0.106881	 -1.555360
  0.135653	  0.076207	 -1.588986
  0.141130	  0.040568	 -1.626631
  0.146369	  0.005736	 -1.661172
  0.152197	 -0.030272	 -1.697632
  0.159387	 -0.068577	 -1.735688
  0.165578	 -0.099661	 -1.766768
  0.172660	 -0.134878	 -1.802496
  0.180020	 -0.170351	 -1.839628
  0.187195	 -0.202889	 -1.874641
  0.193393	 -0.233435	 -1.908409
  0.200775	 -0.266249	 -1.944806
  0.208509	 -0.299342	 -1.982422
  0.215509	 -0.330563	 -2.018250
  0.222849	 -0.364236	 -2.056320
  0.232161	 -0.396981	 -2.091400
  0.243075	 -0.430786	 -2.129249
  0.248756	 -0.460250	 -2.168848
  0.256983	 -0.492358	 -2.206831
  0.264428	 -0.523566	 -2.239317
  0.274625	 -0.558750	 -2.277596
  0.282724	 -0.593497	 -2.317118
  0.289144	 -0.623290	 -2.350874
  0.296764	 -0.654297	 -2.385838
  0.304826	 -0.688538	 -2.426089
  0.312226	 -0.721908	 -2.466455
  0.318796	 -0.752900	 -2.505281
  0.324837	 -0.781303	 -2.537964
  0.329352	 -0.814311	 -2.571529
  0.338169	 -0.849695	 -2.606046
  0.342970	 -0.884898	 -2.643075
  0.343681	 -0.918444	 -2.685386
  0.349716	 -0.954310	 -2.723447
  0.357819	 -0.988223	 -2.758311
  0.362989	 -1.022480	 -2.796922
  0.366619	 -1.032704	 -2.824892
