  2.141005	  0.753664	 -1.120885
  2.158107	  0.741407	 -1.114358
  2.136696	  0.756752	 -1.122529
  2.098112	  0.785967	 -1.134344
  2.061889	  0.817009	 -1.144719
  2.022587	  0.842463	 -1.156533
  1.981081	  0.862283	 -1.171957
  1.937530	  0.879308	 -1.188847
  1.893967	  0.896184	 -1.206841
  1.850288	  0.914086	 -1.225018
  1.807442	  0.932592	 -1.243244
  1.765460	  0.951759	 -1.262343
  1.723641	  0.972527	 -1.281336
  1.681280	  0.995781	 -1.299969
  1.639505	  1.022402	 -1.318584
  1.597773	  1.052139	 -1.335290
  1.558804	  1.083238	 -1.349357
  1.523015	  1.114589	 -1.361843
  1.489351	  1.146399	 -1.374629
  1.457835	  1.180878	 -1.388860
  1.427306	  1.218510	 -1.404137
  1.397292	  1.258165	 -1.419540
  1.366545	  1.299917	 -1.434017
  1.332472	  1.341454	 -1.444980
  1.296044	  1.379453	 -1.453082
  1.258883	  1.414942	 -1.459307
  1.221483	  1.448890	 -1.464121
  1.183717	  1.481974	 -1.468294
  1.143554	  1.512890	 -1.473499
  1.100629	  1.540151	 -1.480422
  1.057164	  1.564799	 -1.488230
  1.014526	  1.587984	 -1.496511
  0.972441	  1.610030	 -1.506539
  0.930034	  1.631290	 -1.518435
  0.887082	  1.651651	 -1.531754
  0.844711	  1.670648	 -1.546087
  0.801508	  1.689521	 -1.562088
  0.758115	  1.709082	 -1.578406
  0.716586	  1.729115	 -1.593840
  0.676419	  1.750549	 -1.608526
  0.640341	  1.773448	 -1.622410
  0.577679	  1.832505	 -1.657742
  0.574682	  1.835709	 -1.659597
