 -2.115187	 -0.206953	 -1.435466
 -2.153169	 -0.233908	 -1.446907
 -2.114204	 -0.206322	 -1.435831
 -2.071128	 -0.176450	 -1.423619
 -2.026652	 -0.147358	 -1.410281
 -1.983042	 -0.120549	 -1.397408
 -1.939154	 -0.095503	 -1.384766
 -1.893762	 -0.070564	 -1.371809
 -1.847192	 -0.045509	 -1.357540
 -1.801131	 -0.020897	 -1.342380
 -1.755456	  0.004901	 -1.325604
 -1.709571	  0.032526	 -1.306549
 -1.664405	  0.060640	 -1.285287
 -1.623404	  0.086074	 -1.264523
 -1.587237	  0.109092	 -1.246224
 -1.551834	  0.132402	 -1.228797
 -1.512819	  0.158827	 -1.209787
 -1.470376	  0.188066	 -1.187917
 -1.425777	  0.219183	 -1.162844
 -1.380843	  0.250380	 -1.135038
 -1.337078	  0.280248	 -1.105619
 -1.295186	  0.308360	 -1.075449
 -1.255651	  0.334546	 -1.045357
 -1.218657	  0.358948	 -1.016217
 -1.183484	  0.381985	 -0.988352
 -1.148821	  0.404171	 -0.961393
 -1.113564	  0.426136	 -0.934607
 -1.077804	  0.447538	 -0.907966
 -1.042092	  0.467992	 -0.882050
 -1.006991	  0.487210	 -0.857609
 -0.973938	  0.504987	 -0.835658
 -0.941489	  0.522601	 -0.815334
 -0.909806	  0.540219	 -0.796667
 -0.879180	  0.557728	 -0.780085
 -0.848957	  0.575361	 -0.765700
 -0.814607	  0.595794	 -0.750979
 -0.773918	  0.620510	 -0.734041
 -0.730989	  0.646749	 -0.715175
 -0.689733	  0.671775	 -0.696483
 -0.646404	  0.696911	 -0.677019
 -0.597734	  0.721892	 -0.654510
 -0.547034	  0.743031	 -0.629907
 -0.496991	  0.758956	 -0.604922
 -0.447134	  0.770329	 -0.579544
 -0.395564	  0.778240	 -0.553274
 -0.340989	  0.782374	 -0.526589
 -0.284120	  0.783020	 -0.501479
 -0.225110	  0.782595	 -0.478217
 -0.168753	  0.783998	 -0.457128
 -0.119415	  0.788342	 -0.439141
 -0.077635	  0.794542	 -0.423982
 -0.042940	  0.802336	 -0.410942
 -0.010841	  0.811653	 -0.398675
  0.023254	  0.823409	 -0.385214
  0.059968	  0.837468	 -0.370450
  0.097776	  0.853262	 -0.355554
  0.135585	  0.870993	 -0.341552
  0.169588	  0.888324	 -0.330279
  0.196519	  0.902771	 -0.322635
  0.213902	  0.912380	 -0.318613
  0.224231	  0.917947	 -0.316788
  0.234366	  0.922741	 -0.316149
  0.253883	  0.930317	 -0.317134
  0.269087	  0.935545	 -0.318660
  0.290742	  0.942161	 -0.321827
  0.327287	  0.951592	 -0.328838
  0.391842	  0.964653	 -0.342641
  0.501489	  0.977304	 -0.364498
  0.677696	  0.979781	 -0.389240
  0.901650	  0.975363	 -0.391659
  1.121744	  1.036125	 -0.364136
  1.246453	  1.140739	 -0.340336
  1.308496	  1.387634	 -0.331211
  1.307458	  1.646164	 -0.294401
  1.256277	  1.838439	 -0.234824
  1.201230	  1.962831	 -0.184878
  1.136929	  2.043311	 -0.136235
  1.081477	  2.089922	 -0.093529
  1.038075	  2.121324	 -0.050081
  1.003205	  2.146677	  0.003832
  0.983062	  2.164590	  0.067266
  0.978021	  2.173434	  0.132687
  0.984247	  2.174194	  0.196185
  1.000574	  2.170369	  0.259114
  1.025216	  2.162551	  0.321427
  1.056967	  2.152257	  0.383018
  1.094108	  2.141353	  0.441196
  1.131904	  2.132308	  0.492014
  1.167786	  2.127922	  0.534158
  1.203081	  2.128710	  0.570648
  1.235496	  2.132499	  0.601340
  1.267791	  2.141038	  0.628184
  1.305426	  2.154910	  0.654163
  1.344647	  2.171127	  0.678417
