 -0.449961	 -1.552239	 -1.844035
 -0.455178	 -1.585984	 -1.877767
 -0.463704	 -1.570989	 -1.885683
 -0.474297	 -1.553866	 -1.893446
 -0.484684	 -1.537633	 -1.898357
 -0.490131	 -1.518170	 -1.905192
 -0.495374	 -1.502050	 -1.913584
 -0.502758	 -1.483853	 -1.920926
 -0.505461	 -1.464550	 -1.927725
 -0.507361	 -1.449011	 -1.935501
 -0.510953	 -1.428896	 -1.943955
 -0.515605	 -1.412040	 -1.950669
 -0.518872	 -1.393755	 -1.955574
 -0.522448	 -1.375127	 -1.963268
 -0.523570	 -1.356437	 -1.967511
 -0.526708	 -1.336983	 -1.973136
 -0.527457	 -1.317203	 -1.979772
 -0.523874	 -1.300272	 -1.984494
 -0.520654	 -1.280189	 -1.988182
 -0.520092	 -1.261279	 -1.992115
 -0.516759	 -1.241654	 -1.996253
 -0.510010	 -1.221760	 -1.999177
 -0.509729	 -1.203910	 -2.003360
 -0.507484	 -1.184785	 -2.003358
 -0.504891	 -1.163473	 -2.004344
 -0.500085	 -1.145102	 -2.005142
 -0.495397	 -1.126161	 -2.007275
 -0.488157	 -1.107612	 -2.008690
 -0.481183	 -1.088817	 -2.007938
 -0.470755	 -1.072705	 -2.002569
 -0.465093	 -1.054610	 -2.001869
 -0.455364	 -1.038297	 -1.997089
 -0.444859	 -1.021819	 -1.992141
 -0.433508	 -1.006180	 -1.987318
 -0.421535	 -0.994790	 -1.978560
 -0.413483	 -0.978933	 -1.974349
 -0.402298	 -0.965126	 -1.964830
 -0.391088	 -0.950323	 -1.956853
 -0.378474	 -0.939352	 -1.947183
 -0.366240	 -0.928784	 -1.938996
 -0.351051	 -0.918354	 -1.930514
 -0.335850	 -0.910733	 -1.920342
 -0.321368	 -0.904186	 -1.909552
 -0.306029	 -0.898908	 -1.895531
 -0.295928	 -0.892034	 -1.882101
 -0.285528	 -0.886178	 -1.866545
 -0.267272	 -0.875892	 -1.856310
 -0.251923	 -0.869122	 -1.846334
 -0.241066	 -0.860310	 -1.834072
 -0.226367	 -0.850390	 -1.824868
 -0.209258	 -0.842757	 -1.814585
 -0.196037	 -0.837092	 -1.801587
 -0.182006	 -0.831690	 -1.789129
 -0.166411	 -0.823719	 -1.775899
 -0.153281	 -0.819737	 -1.762550
 -0.141887	 -0.815902	 -1.748078
 -0.127538	 -0.813945	 -1.734453
 -0.113496	 -0.803286	 -1.717965
 -0.103641	 -0.795232	 -1.704068
 -0.091185	 -0.792567	 -1.689074
 -0.078033	 -0.789988	 -1.675308
 -0.063860	 -0.789396	 -1.659765
 -0.055626	 -0.783982	 -1.641909
 -0.043439	 -0.770333	 -1.628372
 -0.033137	 -0.762196	 -1.613480
 -0.026191	 -0.756788	 -1.596632
 -0.020672	 -0.751502	 -1.576220
 -0.005541	 -0.744046	 -1.561505
  0.006103	 -0.738099	 -1.544875
  0.013338	 -0.736745	 -1.530458
  0.019505	 -0.730436	 -1.513648
  0.029899	 -0.723720	 -1.496079
  0.039041	 -0.717261	 -1.479155
  0.047303	 -0.711599	 -1.461433
  0.055363	 -0.704754	 -1.445031
  0.062968	 -0.699783	 -1.427069
  0.070636	 -0.693618	 -1.409959
  0.078201	 -0.687384	 -1.392487
  0.083754	 -0.681949	 -1.373805
  0.090356	 -0.674158	 -1.356827
  0.094843	 -0.667934	 -1.338404
  0.099752	 -0.660136	 -1.320469
  0.103668	 -0.651798	 -1.302811
  0.106714	 -0.643703	 -1.285703
  0.110421	 -0.631495	 -1.267878
  0.113252	 -0.622033	 -1.250299
  0.115214	 -0.615031	 -1.233440
  0.115514	 -0.606840	 -1.215666
  0.116960	 -0.594844	 -1.197074
  0.117905	 -0.586441	 -1.180197
  0.117076	 -0.580692	 -1.163143
  0.114779	 -0.569753	 -1.143383
  0.112286	 -0.558985	 -1.125053
  0.111583	 -0.552165	 -1.108268
  0.108194	 -0.546258	 -1.091386
  0.102623	 -0.538231	 -1.074312
  0.099082	 -0.522045	 -1.054088
  0.095040	 -0.514734	 -1.039958
  0.093239	 -0.503940	 -1.024242
  0.096646	 -0.488912	 -1.007395
  0.094873	 -0.478322	 -0.990075
  0.086079	 -0.471444	 -0.971802
  0.080242	 -0.462346	 -0.956631
  0.075696	 -0.450742	 -0.939901
  0.073791	 -0.438283	 -0.925702
  0.065813	 -0.426387	 -0.911073
  0.059325	 -0.410530	 -0.896961
  0.054350	 -0.398262	 -0.882745
  0.051462	 -0.388710	 -0.865725
  0.048499	 -0.375923	 -0.850449
  0.045106	 -0.363036	 -0.834595
  0.043020	 -0.350900	 -0.818862
  0.036810	 -0.334251	 -0.805233
  0.028852	 -0.320837	 -0.794646
  0.023187	 -0.310428	 -0.777915
  0.017951	 -0.300342	 -0.762368
  0.010067	 -0.291351	 -0.745976
 -0.002577	 -0.275977	 -0.734021
 -0.011980	 -0.261860	 -0.721457
 -0.016409	 -0.247136	 -0.708060
 -0.019481	 -0.235405	 -0.696622
 -0.025204	 -0.221362	 -0.682082
 -0.028998	 -0.205135	 -0.669219
 -0.027921	 -0.189275	 -0.654407
 -0.029869	 -0.174968	 -0.642151
 -0.033394	 -0.162164	 -0.626804
 -0.037727	 -0.147417	 -0.614746
 -0.037865	 -0.129759	 -0.602184
 -0.036706	 -0.115454	 -0.587763
 -0.036411	 -0.103819	 -0.573057
 -0.037520	 -0.092134	 -0.557647
 -0.033497	 -0.072998	 -0.542026
 -0.029726	 -0.060270	 -0.526485
 -0.028153	 -0.048049	 -0.517851
 -0.027392	 -0.034459	 -0.501109
 -0.027396	 -0.015766	 -0.488801
 -0.026182	  0.000575	 -0.479315
 -0.021687	  0.017320	 -0.467988
 -0.019632	  0.032599	 -0.453637
 -0.017977	  0.048520	 -0.444979
 -0.013952	  0.064339	 -0.431268
 -0.014794	  0.076980	 -0.413710
 -0.013689	  0.093272	 -0.399328
 -0.010728	  0.105913	 -0.390949
 -0.006784	  0.124860	 -0.379087
 -0.005332	  0.139046	 -0.366755
 -0.003812	  0.154431	 -0.355789
 -0.004107	  0.176128	 -0.341992
 -0.004964	  0.186393	 -0.328283
 -0.001462	  0.199225	 -0.314611
  0.001594	  0.216780	 -0.303589
  0.001148	  0.231083	 -0.288738
  0.000319	  0.244266	 -0.272091
  0.001282	  0.260179	 -0.259814
  0.002045	  0.274130	 -0.246943
  0.006964	  0.286833	 -0.231730
  0.014235	  0.301089	 -0.217471
  0.019777	  0.313066	 -0.201722
  0.025540	  0.329402	 -0.190368
  0.031404	  0.343592	 -0.177511
  0.034883	  0.360260	 -0.167303
  0.038686	  0.373839	 -0.153349
  0.039865	  0.388256	 -0.138605
  0.040471	  0.398623	 -0.120862
  0.043480	  0.414218	 -0.107740
  0.047800	  0.426426	 -0.092792
  0.052196	  0.448452	 -0.085973
  0.053767	  0.468662	 -0.081204
  0.055651	  0.486263	 -0.071153
  0.058957	  0.501718	 -0.057319
  0.061529	  0.516996	 -0.041994
  0.062848	  0.531994	 -0.031728
  0.065673	  0.552138	 -0.026052
  0.072646	  0.570439	 -0.016341
  0.076544	  0.585801	 -0.002819
  0.086494	  0.593260	  0.012175
  0.093780	  0.607412	  0.026889
  0.097283	  0.623268	  0.039120
  0.100136	  0.635564	  0.053467
  0.105386	  0.651715	  0.066247
  0.109090	  0.671180	  0.075701
  0.106457	  0.687875	  0.085723
  0.108773	  0.701696	  0.098252
  0.125008	  0.717448	  0.111139
  0.132215	  0.731158	  0.121107
  0.127038	  0.748880	  0.134925
  0.125800	  0.762039	  0.148228
  0.135088	  0.780570	  0.157830
  0.137473	  0.798041	  0.169115
  0.139979	  0.810042	  0.184514
  0.151833	  0.823956	  0.201530
  0.159260	  0.838601	  0.207436
  0.161881	  0.856769	  0.216663
  0.166731	  0.876164	  0.220427
  0.173992	  0.893381	  0.231327
  0.176895	  0.909306	  0.243949
  0.184333	  0.921863	  0.257140
  0.190770	  0.937174	  0.265679
  0.195290	  0.958825	  0.277159
  0.194533	  0.974772	  0.290924
  0.200681	  0.986013	  0.302429
  0.210425	  0.999594	  0.313818
  0.217870	  1.014631	  0.325134
  0.223991	  1.032065	  0.336616
  0.232463	  1.048409	  0.348323
  0.243031	  1.057304	  0.358575
  0.252360	  1.071009	  0.372392
  0.265848	  1.087410	  0.378887
  0.276066	  1.100472	  0.387831
  0.286387	  1.117376	  0.397632
  0.293400	  1.131666	  0.408511
  0.301593	  1.145109	  0.421681
  0.305509	  1.159596	  0.434563
  0.311097	  1.178811	  0.442773
  0.322721	  1.194117	  0.447958
  0.335968	  1.209456	  0.453255
  0.345809	  1.227316	  0.461149
  0.350812	  1.240001	  0.475475
  0.352319	  1.253788	  0.490790
  0.352905	  1.270603	  0.508628
  0.363313	  1.284886	  0.513393
  0.372828	  1.299772	  0.523484
  0.382413	  1.314468	  0.531616
  0.390850	  1.329826	  0.542541
  0.400368	  1.344835	  0.551833
  0.408454	  1.361281	  0.562811
  0.412244	  1.375472	  0.575634
  0.415928	  1.391035	  0.587022
  0.420893	  1.406399	  0.599769
  0.425044	  1.420379	  0.612718
  0.431016	  1.437280	  0.621628
  0.431798	  1.453424	  0.632574
  0.438689	  1.465690	  0.649591
  0.447427	  1.474783	  0.665569
  0.445289	  1.496823	  0.676156
  0.440673	  1.516301	  0.682259
  0.435265	  1.532928	  0.694243
  0.439069	  1.544324	  0.708562
  0.447733	  1.556987	  0.721846
  0.452415	  1.576510	  0.736705
  0.447115	  1.591427	  0.750867
  0.442887	  1.607565	  0.756929
  0.441058	  1.623752	  0.771092
  0.441628	  1.640044	  0.780925
  0.439539	  1.660527	  0.788730
  0.437880	  1.678017	  0.800158
  0.442763	  1.693163	  0.808874
  0.445495	  1.710488	  0.822017
  0.444008	  1.727259	  0.834339
  0.441641	  1.744808	  0.840183
  0.441613	  1.761897	  0.849606
  0.441468	  1.781346	  0.859638
  0.436141	  1.800968	  0.866820
  0.431856	  1.816472	  0.877684
  0.430907	  1.830161	  0.891683
  0.431874	  1.846829	  0.902601
  0.432901	  1.863209	  0.916969
  0.429276	  1.876994	  0.931904
  0.423024	  1.894580	  0.939428
  0.421282	  1.911181	  0.945010
  0.418947	  1.929941	  0.956346
  0.414344	  1.947483	  0.969631
  0.414548	  1.961521	  0.979408
  0.412341	  1.977436	  0.992976
  0.410032	  1.993356	  1.005780
  0.409856	  2.010619	  1.013727
  0.413763	  2.028440	  1.025407
  0.408128	  2.044458	  1.039084
  0.405050	  2.057666	  1.051579
  0.405330	  2.074196	  1.064817
  0.411514	  2.092878	  1.072773
  0.412952	  2.113308	  1.079632
  0.412555	  2.128558	  1.090917
  0.411137	  2.143361	  1.106872
  0.414859	  2.156258	  1.120136
  0.418769	  2.172211	  1.134057
  0.426004	  2.193263	  1.142093
  0.428987	  2.209137	  1.153888
