 -0.968771	 -1.473964	  1.788441
 -0.974100	 -1.466747	  1.774763
 -0.975286	 -1.465141	  1.771719
 -0.982114	 -1.456567	  1.754999
 -0.990329	 -1.449088	  1.738377
 -0.998907	 -1.441870	  1.721816
 -1.007873	 -1.434558	  1.705502
 -1.016991	 -1.427200	  1.689295
 -1.026196	 -1.419690	  1.673212
 -1.035880	 -1.410983	  1.658041
 -1.045619	 -1.402178	  1.642955
 -1.055408	 -1.393260	  1.627977
 -1.065657	 -1.382984	  1.614228
 -1.075963	 -1.372579	  1.600609
 -1.086352	 -1.362055	  1.587149
 -1.097217	 -1.350837	  1.574660
 -1.108120	 -1.339540	  1.562271
 -1.118978	 -1.327934	  1.550133
 -1.129763	 -1.315884	  1.538368
 -1.140465	 -1.303884	  1.526492
 -1.150277	 -1.292924	  1.512963
 -1.159973	 -1.282237	  1.499163
 -1.168540	 -1.272856	  1.484336
 -1.179982	 -1.268965	  1.469410
 -1.188846	 -1.266517	  1.450450
 -1.187856	 -1.255359	  1.423534
 -1.190669	 -1.246151	  1.409234
 -1.199118	 -1.235777	  1.399309
 -1.213611	 -1.220897	  1.389162
 -1.220076	 -1.210356	  1.370676
 -1.226484	 -1.203509	  1.349318
 -1.231865	 -1.200636	  1.337721
 -1.256298	 -1.191445	  1.314063
 -1.271277	 -1.190195	  1.308034
 -1.286741	 -1.190969	  1.305483
 -1.310867	 -1.194957	  1.307821
 -1.333419	 -1.198880	  1.308631
 -1.351173	 -1.204220	  1.306977
 -1.371333	 -1.206675	  1.302439
 -1.393518	 -1.211007	  1.301554
 -1.411906	 -1.213807	  1.303930
 -1.435887	 -1.214885	  1.301273
 -1.458411	 -1.214999	  1.295484
 -1.474342	 -1.217411	  1.291828
 -1.489094	 -1.220561	  1.287416
 -1.511003	 -1.234988	  1.284520
 -1.523514	 -1.243144	  1.284650
 -1.544090	 -1.254532	  1.285854
 -1.568907	 -1.259459	  1.287282
 -1.585715	 -1.258277	  1.287267
 -1.606384	 -1.254610	  1.284713
 -1.623242	 -1.255816	  1.280810
 -1.642429	 -1.263351	  1.275517
 -1.670464	 -1.265962	  1.272657
 -1.686416	 -1.263714	  1.268640
 -1.703910	 -1.258383	  1.264380
 -1.725206	 -1.254999	  1.258602
 -1.767298	 -1.252344	  1.248315
 -1.768032	 -1.252255	  1.248067
