 0.0 0.0 0.0 0
 -0.33139587211484206 0.615855614291703 -0.7073619746980301 1000
 0.34178622427966027 -0.026363768499121393 -0.9209022704648077 1000
 0.7102609045507176 0.24963299396359812 0.6375307445343303 1000
 0.28791391975444613 -0.9562491008667573 -0.03168244082959604 1000
 0.2744275655590005 0.06334756907747618 0.9372216714421062 1000
 -0.729664094192964 0.3949737590048411 0.5436894906212424 1000
 -0.7130608651848136 -0.6548944119930351 -0.23044136828596837 1000
 -0.8530750604470221 0.2580858383125425 -0.44512447614569006 1000
 0.0 0.0 0.0 0
 0.005071144995623333 -0.8649528826986997 0.5050884422932119 1000
 0.9767973027023804 0.12366911543173698 0.16819303737349137 1000
 -0.26425882151337576 -0.9077150985302884 -0.3037048656726964 1000
 -0.028915977837193074 -0.3693841961434087 0.914908135084046 1000
 -0.5660725302930213 0.23757951581135844 -0.7744512262106877 1000
 0.0395797257842635 0.9996339194983453 -0.02302774497038973 1000
 -0.8514821370871728 -0.38147763139025204 -0.3435908374693208 1000
 -0.6061969117231231 0.1624369446910534 0.7625721352717356 1000
 0.0 0.0 0.0 0
 0.6733755419967441 -0.5348634677738979 0.5039973434373849 1000
 -0.7460090052029029 -0.4291519664565787 0.5078007080053101 1000
 0.5010601824967446 0.6993051209661123 0.4855322651672994 1000
 -0.3843347919263268 0.6788238264925044 0.6033219140011915 1000
 0.8967556693632677 -0.08695818000050962 -0.4267905545346957 1000
 -0.0934052846434589 -0.5569464141882695 -0.7991676368011409 1000
 0.3372514241212152 0.9354735780219856 0.08526631865359763 1000
 0.8093797286388441 -0.5164429643067544 0.2792864379098631 1000
 0.0 0.0 0.0 0
 -0.22137674045537156 -0.7929734086283948 -0.541832899017745 1000
 0.5858718604464904 0.6545515275067701 -0.48043480996551413 1000
 0.6468402771300799 -0.019951706141890346 0.7442921674960734 1000
 0.25422056021366135 -0.2591774554158579 -0.9089859356439166 1000
 0.3621825794407829 -0.7840262617085362 0.5028578757592925 1000
 0.8680588398782247 -0.3514489027969746 -0.3406351603246599 1000
 0.9423211539858877 -0.03691097350375144 0.32140159624842013 1000
 0.42816247829873955 -0.890817575856289 0.15889710256205436 1000
 0.0 0.0 0.0 0
 0.1982510508716494 -0.4625074368206496 0.8519231964480123 1000
 0.9110690748854007 -0.40954391210489544 -0.042359012717782696 1000
 0.5348146816808367 0.80687084227128 -0.2603472826248757 1000
 -0.17161091229055622 -0.18347166610866392 0.9511911302285813 1000
 -0.8547000222507873 -0.44357422020683424 0.27279322208742834 1000
 0.774438927494434 -0.1688125594381237 -0.5970234474923248 1000
 0.13159196601781747 -0.9830558167705946 0.13721993064829674 1000
 -0.7017691852940031 0.6814427209277525 -0.2110848369115849 1000
 0.0 0.0 0.0 0
 0.08219789493393698 0.11461264297279067 0.9668706027295391 1000
 -0.17695918304781663 0.7931662915449181 -0.5818582117182237 1000
 -0.6264548852693359 -0.41128428388240096 0.6573853954399485 1000
 0.7211500821534821 0.5596503659226937 0.3877847138595568 1000
 -0.9911598731985993 0.08721031852428923 -0.10173972512506013 1000
 -0.1692996201226321 0.9684697266888169 0.1647362266618167 1000
 -0.08845101654983586 0.4462439218560158 0.86494841584865 1000
 -0.032130047264958994 -0.5497829721466339 0.8252576772505156 1000
 0.0 0.0 0.0 0
 -0.4987424817749012 -0.8589613768875741 -0.10090635324413424 1000
 0.2554920385498217 0.9047186960254487 -0.3477493294957211 1000
 0.40215442349142516 -0.3656145854018684 0.825770835673141 1000
 -0.3758218001735767 -0.8083324017894388 -0.42924260738237163 1000
 -0.4080749131093342 -0.3344312842122684 -0.8246859586241796 1000
 0.4115449901135226 0.4128649196027494 -0.8037491241069787 1000
