  2.492041	  1.717424	  0.145210
  2.467367	  1.700420	  0.143773
  2.449628	  1.657737	  0.145414
  2.439303	  1.612123	  0.140266
  2.423791	  1.563805	  0.141302
  2.401228	  1.519528	  0.136153
  2.379297	  1.476004	  0.130478
  2.359760	  1.429252	  0.127387
  2.343205	  1.381992	  0.124885
  2.330397	  1.334188	  0.121041
  2.317180	  1.284384	  0.116987
  2.303731	  1.234734	  0.113745
  2.290104	  1.185109	  0.111525
  2.277750	  1.138466	  0.110028
  2.265645	  1.091548	  0.108505
  2.251906	  1.044591	  0.106747
  2.235811	  0.996481	  0.104400
  2.215394	  0.948156	  0.101314
  2.190495	  0.905064	  0.096921
  2.171377	  0.862633	  0.097926
  2.193788	  0.818296	  0.116826
  2.260693	  0.743861	  0.179284
  2.305805	  0.652487	  0.236184
  2.323427	  0.589976	  0.264416
  2.339021	  0.537000	  0.287928
  2.360540	  0.472764	  0.306461
  2.358794	  0.417874	  0.314920
  2.342204	  0.359570	  0.319916
  2.317816	  0.312219	  0.322071
  2.281712	  0.253174	  0.320249
  2.261261	  0.221556	  0.314742
  2.236710	  0.191060	  0.297798
  2.181355	  0.143541	  0.259255
  2.136440	  0.114885	  0.229270
  2.087943	  0.094846	  0.195528
  2.006603	  0.075531	  0.143545
  1.870716	  0.072324	  0.066955
  1.731126	  0.069973	 -0.004738
  1.652204	  0.034069	 -0.039028
  1.598018	 -0.018621	 -0.052154
  1.544366	 -0.085496	 -0.065466
  1.527414	 -0.108223	 -0.075001
  1.474667	 -0.172855	 -0.123378
  1.408487	 -0.240458	 -0.209368
  1.376855	 -0.283661	 -0.253841
  1.399510	 -0.289617	 -0.257665
  1.418422	 -0.292711	 -0.233801
  1.435356	 -0.315592	 -0.191552
  1.466039	 -0.362531	 -0.158124
  1.538932	 -0.446505	 -0.089569
  1.623170	 -0.570914	 -0.054301
  1.691088	 -0.708535	 -0.057770
  1.730125	 -0.789239	 -0.055919
  1.749576	 -0.830437	 -0.071443
  1.769388	 -0.869838	 -0.111771
  1.785527	 -0.898046	 -0.162411
  1.820764	 -0.937720	 -0.273532
  1.865137	 -1.001012	 -0.387190
  1.920391	 -1.110253	 -0.432223
  1.935293	 -1.176512	 -0.421013
  1.932730	 -1.236244	 -0.397237
  1.920114	 -1.302052	 -0.363304
  1.902589	 -1.350036	 -0.331227
  1.892326	 -1.389130	 -0.314655
  1.873383	 -1.421955	 -0.295243
  1.853746	 -1.453988	 -0.288151
  1.829619	 -1.484255	 -0.288117
  1.790067	 -1.513084	 -0.294910
  1.720687	 -1.546653	 -0.315497
  1.586127	 -1.592865	 -0.346900
  1.517001	 -1.617102	 -0.348925
  1.454584	 -1.654814	 -0.329997
  1.432103	 -1.698757	 -0.318204
  1.421072	 -1.739476	 -0.321854
  1.398629	 -1.759296	 -0.316690
  1.341935	 -1.779297	 -0.253989
  1.290954	 -1.813976	 -0.149913
  1.189066	 -1.840467	 -0.049496
  1.124527	 -1.888465	 -0.013275
  1.095887	 -1.936278	 -0.006287
  1.078632	 -1.982983	 -0.007230
  1.063141	 -2.028377	 -0.010349
  1.044068	 -2.076159	 -0.014465
  1.023301	 -2.124210	 -0.018995
  1.003624	 -2.169851	 -0.023143
  0.985250	 -2.213979	 -0.027028
  0.968373	 -2.257522	 -0.030768
  0.952123	 -2.303599	 -0.034972
  0.935632	 -2.350977	 -0.040174
  0.915372	 -2.397072	 -0.047306
  0.893546	 -2.442746	 -0.051903
  0.870665	 -2.489036	 -0.047330
  0.854689	 -2.537506	 -0.044574
  0.835007	 -2.583338	 -0.049417
  0.816534	 -2.631086	 -0.048777
  0.805162	 -2.680304	 -0.045752
  0.779188	 -2.723084	 -0.052968
  0.763520	 -2.771075	 -0.054642
  0.750868	 -2.818320	 -0.052990
  0.725611	 -2.862998	 -0.059796
  0.707702	 -2.914642	 -0.063382
  0.714779	 -2.943789	 -0.064016
