 -0.022713	 -1.124259	 -2.813614
 -0.022488	 -1.113128	 -2.785757
 -0.031464	 -1.090823	 -2.738626
 -0.050158	 -1.077198	 -2.691797
 -0.064524	 -1.060870	 -2.642864
 -0.081042	 -1.040040	 -2.603552
 -0.095419	 -1.025870	 -2.560235
 -0.108575	 -1.007956	 -2.513244
 -0.122532	 -0.992079	 -2.466121
 -0.133954	 -0.977073	 -2.420444
 -0.145497	 -0.958360	 -2.372691
 -0.156157	 -0.941636	 -2.332202
 -0.171479	 -0.924219	 -2.285843
 -0.183580	 -0.906704	 -2.238537
 -0.196194	 -0.892118	 -2.194231
 -0.213280	 -0.868970	 -2.150457
 -0.231542	 -0.852216	 -2.110659
 -0.243081	 -0.831446	 -2.061996
 -0.258506	 -0.817444	 -2.019031
 -0.274537	 -0.800867	 -1.977212
 -0.291844	 -0.781786	 -1.928130
 -0.306894	 -0.765288	 -1.883289
 -0.320223	 -0.751182	 -1.843380
 -0.334979	 -0.736246	 -1.797884
 -0.349797	 -0.720062	 -1.751369
 -0.364312	 -0.703522	 -1.706369
 -0.378739	 -0.686346	 -1.661633
 -0.392302	 -0.668743	 -1.617112
 -0.406697	 -0.649544	 -1.568936
 -0.419840	 -0.631959	 -1.523913
 -0.432661	 -0.615714	 -1.481138
 -0.446224	 -0.598882	 -1.437934
 -0.459941	 -0.577690	 -1.391810
 -0.467782	 -0.550477	 -1.354105
 -0.468282	 -0.516848	 -1.329857
 -0.443794	 -0.437862	 -1.307355
 -0.361776	 -0.229323	 -1.292295
 -0.338383	 -0.162325	 -1.241514
 -0.341004	 -0.125821	 -1.176316
 -0.355516	 -0.110302	 -1.140428
 -0.390051	 -0.120308	 -1.104906
 -0.443417	 -0.156828	 -1.066706
 -0.569264	 -0.320997	 -0.944991
 -0.605167	 -0.356997	 -0.891879
 -0.621695	 -0.365781	 -0.849548
 -0.637428	 -0.361897	 -0.803043
 -0.650829	 -0.349641	 -0.758758
 -0.664352	 -0.332767	 -0.711118
 -0.676594	 -0.316052	 -0.667182
 -0.688549	 -0.300699	 -0.626158
 -0.703773	 -0.283506	 -0.579377
 -0.719442	 -0.266086	 -0.529648
 -0.733513	 -0.250148	 -0.483159
 -0.745720	 -0.236431	 -0.442082
 -0.760824	 -0.220619	 -0.395390
 -0.774605	 -0.204938	 -0.351502
 -0.788694	 -0.187155	 -0.302909
 -0.799800	 -0.170100	 -0.259069
 -0.811787	 -0.153297	 -0.215332
 -0.824194	 -0.135397	 -0.170785
 -0.835930	 -0.117564	 -0.127849
 -0.848606	 -0.098302	 -0.082915
 -0.862685	 -0.079265	 -0.038510
 -0.876349	 -0.060986	  0.005475
 -0.891438	 -0.042895	  0.052820
 -0.906375	 -0.025116	  0.099182
 -0.920942	 -0.007790	  0.142465
 -0.936222	  0.010272	  0.187661
 -0.951019	  0.025739	  0.231407
 -0.965045	  0.038138	  0.272015
 -0.981653	  0.054877	  0.321024
 -0.996697	  0.073284	  0.365906
 -1.009784	  0.091294	  0.409444
 -1.023451	  0.111112	  0.454509
 -1.038009	  0.129445	  0.497163
 -1.053373	  0.146967	  0.540860
 -1.069253	  0.163600	  0.585819
 -1.084029	  0.178665	  0.631295
 -1.098926	  0.194012	  0.680297
 -1.113272	  0.208559	  0.725700
 -1.127736	  0.222411	  0.769932
 -1.141121	  0.236923	  0.815094
 -1.153408	  0.252986	  0.860974
 -1.166201	  0.269342	  0.906778
 -1.179113	  0.286154	  0.952996
 -1.191398	  0.303079	  0.998264
 -1.203740	  0.319480	  1.041799
 -1.217246	  0.338042	  1.090119
 -1.228760	  0.355460	  1.132973
 -1.240628	  0.372787	  1.175299
 -1.253890	  0.392678	  1.222868
 -1.266923	  0.411805	  1.265506
 -1.280126	  0.431931	  1.311702
 -1.291597	  0.451393	  1.353044
 -1.304757	  0.471492	  1.399338
 -1.317738	  0.490363	  1.443685
 -1.332541	  0.507071	  1.490010
 -1.346685	  0.522712	  1.536007
 -1.360266	  0.537389	  1.579905
 -1.374973	  0.552718	  1.625176
 -1.389698	  0.567495	  1.670347
 -1.404531	  0.582442	  1.717695
 -1.417506	  0.597322	  1.762329
 -1.430158	  0.613377	  1.806225
 -1.443696	  0.630758	  1.850596
 -1.457927	  0.649833	  1.898314
 -1.470556	  0.667595	  1.943329
 -1.484960	  0.686393	  1.986088
 -1.497319	  0.704116	  2.027954
 -1.512308	  0.719801	  2.072450
 -1.524926	  0.739053	  2.118470
 -1.536558	  0.756858	  2.161633
 -1.552981	  0.777263	  2.210021
 -1.572653	  0.794369	  2.249650
 -1.586437	  0.804356	  2.296368
 -1.601438	  0.821338	  2.339748
 -1.620285	  0.835728	  2.382485
 -1.636488	  0.844085	  2.406310
