 -0.753106	  0.771856	  2.252332
 -0.775245	  0.736031	  2.271694
 -0.765662	  0.752071	  2.264563
 -0.756058	  0.768181	  2.257623
 -0.746499	  0.784482	  2.251076
 -0.737129	  0.801103	  2.245078
 -0.727779	  0.817750	  2.239123
 -0.718833	  0.834833	  2.233819
 -0.709943	  0.851944	  2.228516
 -0.701097	  0.869109	  2.223315
 -0.692300	  0.886351	  2.218278
 -0.683512	  0.903587	  2.213203
 -0.674541	  0.920728	  2.208143
 -0.665567	  0.937874	  2.203091
 -0.656478	  0.954888	  2.197807
 -0.647286	  0.971759	  2.192252
 -0.638092	  0.988632	  2.186702
 -0.628738	  1.005089	  2.180245
 -0.619373	  1.021512	  2.173722
 -0.609947	  1.037749	  2.166831
 -0.600415	  1.053637	  2.159298
 -0.590876	  1.069528	  2.151781
 -0.580950	  1.084717	  2.143909
 -0.569459	  1.098802	  2.137795
 -0.559269	  1.113629	  2.128773
 -0.553138	  1.130634	  2.114399
 -0.544644	  1.147440	  2.102009
 -0.534805	  1.157400	  2.096896
 -0.524825	  1.171875	  2.084761
 -0.514554	  1.188455	  2.070958
 -0.504124	  1.198566	  2.065453
 -0.492713	  1.211599	  2.053286
 -0.481967	  1.227757	  2.039961
 -0.471134	  1.238155	  2.032543
 -0.459245	  1.247852	  2.021780
 -0.444682	  1.265893	  2.008075
 -0.436306	  1.277398	  2.000665
 -0.425655	  1.288281	  1.989038
 -0.415732	  1.298139	  1.975885
 -0.404490	  1.311114	  1.963173
 -0.394147	  1.324699	  1.952741
 -0.383802	  1.338300	  1.942349
 -0.373455	  1.352826	  1.933295
 -0.363132	  1.367747	  1.924882
 -0.353038	  1.383005	  1.916802
 -0.343413	  1.398851	  1.909324
 -0.334735	  1.414370	  1.902024
 -0.328832	  1.432183	  1.893380
 -0.323765	  1.450472	  1.883145
 -0.311793	  1.466060	  1.875121
 -0.298630	  1.478855	  1.870013
 -0.290566	  1.494360	  1.861016
 -0.280989	  1.511554	  1.851128
 -0.269578	  1.524219	  1.845004
 -0.261091	  1.540157	  1.835024
 -0.251940	  1.556303	  1.824933
 -0.240409	  1.569060	  1.817249
 -0.232837	  1.584813	  1.805942
 -0.226943	  1.602341	  1.792230
 -0.215844	  1.613758	  1.784790
 -0.202959	  1.625330	  1.777536
 -0.191773	  1.640604	  1.766484
 -0.182890	  1.654888	  1.755307
 -0.174277	  1.668916	  1.743967
 -0.166450	  1.682159	  1.733175
 -0.158637	  1.696851	  1.721462
 -0.152236	  1.712157	  1.709795
 -0.142382	  1.728708	  1.695982
 -0.134724	  1.738746	  1.687236
 -0.128368	  1.755106	  1.676032
 -0.119693	  1.772231	  1.663038
 -0.110595	  1.782467	  1.653427
 -0.104108	  1.799877	  1.641979
 -0.096303	  1.816898	  1.629873
 -0.086397	  1.826153	  1.620593
 -0.078785	  1.843508	  1.609601
 -0.070450	  1.860375	  1.598453
 -0.059904	  1.870067	  1.589116
 -0.051579	  1.886098	  1.579308
 -0.041039	  1.902222	  1.568049
 -0.029182	  1.913308	  1.558741
 -0.021321	  1.929838	  1.549312
 -0.013998	  1.947183	  1.538333
 -0.002943	  1.958058	  1.529713
  0.005285	  1.975029	  1.521242
  0.011888	  1.995019	  1.511101
  0.021826	  2.005363	  1.502899
  0.038259	  2.019241	  1.493545
  0.047197	  2.035075	  1.485214
