 -1.447497	  2.658459	  0.135079
 -1.433166	  2.632138	  0.133742
 -1.415673	  2.630345	  0.182343
 -1.411126	  2.624658	  0.233062
 -1.397779	  2.614401	  0.281090
 -1.394234	  2.617567	  0.330387
 -1.377885	  2.615456	  0.375919
 -1.368984	  2.613527	  0.423282
 -1.360245	  2.606963	  0.469285
 -1.349576	  2.600885	  0.517649
 -1.341215	  2.591697	  0.565985
 -1.331630	  2.585935	  0.612065
 -1.323310	  2.581729	  0.659120
 -1.315532	  2.577042	  0.706158
 -1.306770	  2.571440	  0.753909
 -1.298175	  2.562476	  0.800584
 -1.293063	  2.552925	  0.847244
 -1.285077	  2.539065	  0.894053
 -1.279462	  2.534697	  0.944578
 -1.268667	  2.531123	  0.990562
 -1.262929	  2.516903	  1.034510
 -1.275558	  2.542072	  1.044855
