  1.919999	  0.948010	 -1.299879
  1.904426	  0.954316	 -1.308603
  1.903496	  0.954693	 -1.309124
  1.887280	  0.962397	 -1.315576
  1.866786	  0.972332	 -1.319409
  1.848174	  0.979141	 -1.325176
  1.835081	  0.984353	 -1.335596
  1.818815	  0.992532	 -1.347065
  1.800789	  0.999190	 -1.357314
  1.785912	  1.007159	 -1.361659
  1.769657	  1.016266	 -1.371263
  1.752005	  1.025476	 -1.378493
  1.735655	  1.034722	 -1.382206
  1.720100	  1.045498	 -1.386981
  1.704990	  1.056950	 -1.393418
  1.687807	  1.070576	 -1.402019
  1.672499	  1.080590	 -1.408238
  1.657818	  1.089358	 -1.411318
  1.639642	  1.100341	 -1.415501
  1.625762	  1.112716	 -1.421991
  1.613056	  1.126730	 -1.429164
  1.598660	  1.140004	 -1.435273
  1.583784	  1.151614	 -1.438414
  1.569624	  1.165885	 -1.443836
  1.555396	  1.179177	 -1.450923
  1.542178	  1.191279	 -1.454835
  1.526768	  1.205735	 -1.458853
  1.510844	  1.219184	 -1.465018
  1.502855	  1.232775	 -1.472180
  1.492035	  1.249514	 -1.478880
  1.481322	  1.265536	 -1.484629
  1.469686	  1.280975	 -1.490601
  1.458242	  1.296433	 -1.496086
  1.446819	  1.311944	 -1.501465
  1.435396	  1.327456	 -1.506843
  1.423107	  1.342665	 -1.511043
  1.410679	  1.357816	 -1.515042
  1.398251	  1.372967	 -1.519042
  1.384982	  1.387546	 -1.522409
  1.371300	  1.401815	 -1.525450
  1.357621	  1.416085	 -1.528494
  1.343504	  1.430004	 -1.531132
  1.329145	  1.443717	 -1.533536
  1.314786	  1.457430	 -1.535941
  1.300113	  1.470873	 -1.537932
  1.285371	  1.484255	 -1.539829
  1.270595	  1.497603	 -1.541695
  1.255602	  1.510737	 -1.543352
  1.236507	  1.527245	 -1.545501
  1.225230	  1.536521	 -1.546856
