  2.194706	 -0.172711	  1.130758
  2.239547	 -0.162512	  1.131048
  2.222619	 -0.176515	  1.145340
  2.200529	 -0.182869	  1.147334
  2.186693	 -0.185560	  1.146221
  2.165661	 -0.190088	  1.145938
  2.143533	 -0.194265	  1.145987
  2.126933	 -0.197066	  1.145456
  2.109862	 -0.199923	  1.144433
  2.091316	 -0.204242	  1.145413
  2.065552	 -0.213876	  1.152999
  2.051245	 -0.219822	  1.159422
  2.032675	 -0.229519	  1.170518
  2.017807	 -0.236820	  1.178158
  1.999356	 -0.245276	  1.181248
  1.977686	 -0.249265	  1.182602
  1.958771	 -0.249909	  1.182574
  1.935571	 -0.251587	  1.186583
  1.917996	 -0.255645	  1.194522
  1.904624	 -0.261500	  1.200815
  1.885538	 -0.271319	  1.203992
  1.865101	 -0.279195	  1.203994
  1.849385	 -0.286526	  1.204527
  1.830584	 -0.297006	  1.204375
  1.807051	 -0.306554	  1.205288
  1.795331	 -0.311778	  1.206030
  1.774397	 -0.319259	  1.211075
  1.750789	 -0.328444	  1.218595
  1.733601	 -0.340836	  1.223333
  1.720976	 -0.346553	  1.226946
  1.697797	 -0.357566	  1.234115
  1.675432	 -0.357774	  1.248038
  1.664435	 -0.355008	  1.255665
  1.651761	 -0.357167	  1.259592
  1.628973	 -0.362277	  1.262684
  1.607997	 -0.367182	  1.267623
  1.591670	 -0.373584	  1.272073
  1.571929	 -0.379226	  1.269838
  1.549060	 -0.376970	  1.271312
  1.525692	 -0.373534	  1.282530
  1.508050	 -0.374444	  1.292177
  1.491737	 -0.377655	  1.301650
  1.474186	 -0.381219	  1.308385
  1.457389	 -0.381930	  1.310996
  1.437533	 -0.379822	  1.311591
  1.412443	 -0.376222	  1.314901
  1.394118	 -0.375402	  1.320363
  1.378700	 -0.376736	  1.327060
  1.357427	 -0.378975	  1.333453
  1.337214	 -0.378828	  1.336100
  1.319395	 -0.375850	  1.337084
  1.297434	 -0.369958	  1.339618
  1.272053	 -0.364746	  1.351411
  1.261813	 -0.364598	  1.357227
  1.242540	 -0.366098	  1.366912
  1.224454	 -0.367591	  1.366533
  1.203802	 -0.366639	  1.368716
  1.185358	 -0.358218	  1.374014
  1.166902	 -0.352389	  1.384847
  1.137297	 -0.357303	  1.398075
  1.122029	 -0.361182	  1.400648
  1.108932	 -0.363649	  1.403847
  1.082873	 -0.366471	  1.409397
  1.062274	 -0.372477	  1.412307
  1.047827	 -0.375759	  1.413397
  1.024481	 -0.379821	  1.417379
  1.001001	 -0.387515	  1.420316
  0.987551	 -0.392429	  1.418051
  0.969315	 -0.398019	  1.410445
  0.943288	 -0.413064	  1.405797
  0.926669	 -0.421317	  1.404858
  0.911977	 -0.427403	  1.403714
  0.892020	 -0.433465	  1.403711
  0.871485	 -0.439292	  1.404394
  0.853039	 -0.443652	  1.405381
  0.833802	 -0.448202	  1.406012
  0.813732	 -0.453637	  1.406534
  0.794426	 -0.458039	  1.407589
  0.775466	 -0.461901	  1.408271
  0.754762	 -0.466243	  1.409790
  0.732859	 -0.467836	  1.413720
  0.712023	 -0.466704	  1.417941
  0.697759	 -0.466555	  1.417598
  0.677294	 -0.473407	  1.411883
  0.656718	 -0.476845	  1.410960
  0.637812	 -0.475934	  1.411524
  0.614851	 -0.472687	  1.415883
  0.591553	 -0.478463	  1.418159
  0.574208	 -0.486254	  1.415582
  0.560202	 -0.493243	  1.411514
  0.540348	 -0.504210	  1.403605
  0.519512	 -0.515012	  1.402221
  0.501325	 -0.522024	  1.404335
  0.482554	 -0.526940	  1.412185
  0.461098	 -0.532143	  1.426185
  0.443971	 -0.539690	  1.431843
  0.428427	 -0.548123	  1.431798
  0.411586	 -0.561275	  1.428107
  0.394326	 -0.574657	  1.425745
  0.376024	 -0.584659	  1.429048
  0.362132	 -0.590216	  1.431581
  0.340718	 -0.597184	  1.429878
  0.317918	 -0.603105	  1.432752
  0.298076	 -0.609150	  1.441155
  0.284710	 -0.614199	  1.447734
  0.263457	 -0.621141	  1.454329
  0.246749	 -0.626569	  1.456722
  0.228639	 -0.633654	  1.459379
  0.204330	 -0.640214	  1.463546
  0.189945	 -0.641263	  1.467794
  0.174801	 -0.642143	  1.476323
  0.149830	 -0.642358	  1.490976
  0.133087	 -0.645365	  1.497764
  0.114410	 -0.650301	  1.502423
  0.092342	 -0.657732	  1.505937
  0.071945	 -0.658341	  1.506588
  0.054215	 -0.654982	  1.506482
  0.032741	 -0.647803	  1.505693
  0.012245	 -0.644188	  1.505732
 -0.010316	 -0.643682	  1.510042
 -0.024846	 -0.643430	  1.514465
 -0.046508	 -0.644797	  1.522477
 -0.065897	 -0.645336	  1.529274
 -0.080507	 -0.645077	  1.534020
 -0.102817	 -0.643736	  1.540449
 -0.120154	 -0.643814	  1.545100
 -0.142203	 -0.647561	  1.548798
 -0.166629	 -0.649450	  1.552166
 -0.179242	 -0.650365	  1.554346
 -0.200283	 -0.650127	  1.559376
 -0.220070	 -0.652591	  1.564807
 -0.237968	 -0.658016	  1.569740
 -0.257778	 -0.667304	  1.575261
 -0.273577	 -0.677601	  1.579620
 -0.288072	 -0.687166	  1.583669
 -0.312974	 -0.696548	  1.590378
 -0.329585	 -0.698846	  1.594778
 -0.339373	 -0.698733	  1.597919
 -0.365482	 -0.697692	  1.609634
 -0.390924	 -0.704422	  1.612929
 -0.403099	 -0.707830	  1.614869
 -0.422135	 -0.715191	  1.614218
 -0.451737	 -0.725320	  1.614670
 -0.458093	 -0.726303	  1.616264
 -0.472453	 -0.728658	  1.621731
 -0.510229	 -0.736993	  1.632050
 -0.521793	 -0.740459	  1.633611
 -0.536188	 -0.744149	  1.636042
 -0.557208	 -0.746115	  1.640189
 -0.576964	 -0.746586	  1.645219
 -0.596658	 -0.750030	  1.651296
 -0.613679	 -0.754918	  1.656011
 -0.630352	 -0.756614	  1.660801
 -0.653223	 -0.751969	  1.668879
 -0.674005	 -0.750571	  1.675886
 -0.696090	 -0.752999	  1.679800
 -0.716647	 -0.754758	  1.682187
 -0.736302	 -0.756841	  1.682296
 -0.757917	 -0.761367	  1.680892
 -0.777623	 -0.767723	  1.678607
 -0.793741	 -0.774132	  1.678442
 -0.809434	 -0.777334	  1.677760
 -0.832717	 -0.784295	  1.677279
 -0.856376	 -0.791392	  1.676581
 -0.875584	 -0.795299	  1.672585
 -0.891652	 -0.798347	  1.667806
 -0.910387	 -0.802836	  1.664417
 -0.930583	 -0.807622	  1.664017
 -0.950101	 -0.812476	  1.664863
 -0.970186	 -0.815672	  1.667788
 -0.990492	 -0.816996	  1.673107
 -1.010290	 -0.817871	  1.679892
 -1.029887	 -0.822165	  1.685934
 -1.049237	 -0.830947	  1.688781
 -1.063940	 -0.839087	  1.687357
 -1.084126	 -0.845557	  1.683022
 -1.104208	 -0.851278	  1.684871
 -1.122619	 -0.858056	  1.688376
 -1.140478	 -0.865579	  1.691275
 -1.159860	 -0.869623	  1.695368
 -1.179206	 -0.873373	  1.698738
 -1.198482	 -0.877000	  1.702131
 -1.217816	 -0.880239	  1.706369
 -1.237098	 -0.883934	  1.710221
 -1.256374	 -0.887696	  1.714005
 -1.275726	 -0.891748	  1.717020
 -1.295124	 -0.896079	  1.719249
 -1.314523	 -0.900348	  1.721540
 -1.334189	 -0.901502	  1.724928
 -1.353777	 -0.901937	  1.728863
 -1.373225	 -0.902736	  1.733540
 -1.392080	 -0.904883	  1.738470
 -1.408369	 -0.906093	  1.748300
 -1.424801	 -0.912773	  1.763233
 -1.445695	 -0.921754	  1.771579
 -1.466200	 -0.923199	  1.769292
 -1.492748	 -0.922583	  1.759639
 -1.510517	 -0.927409	  1.759540
 -1.526106	 -0.938415	  1.763482
 -1.544875	 -0.944771	  1.766188
