 -1.801298	  0.694152	  1.673510
 -1.830925	  0.692086	  1.668643
 -1.811236	  0.693459	  1.671875
 -1.791483	  0.694644	  1.674779
 -1.771726	  0.695818	  1.677660
 -1.752130	  0.698093	  1.680927
 -1.732749	  0.701068	  1.684446
 -1.714671	  0.705236	  1.690119
 -1.697473	  0.710075	  1.700877
 -1.678306	  0.712097	  1.710149
 -1.658995	  0.712748	  1.714969
 -1.640896	  0.718636	  1.722233
 -1.622533	  0.725019	  1.729293
 -1.603368	  0.726016	  1.730753
 -1.582669	  0.727154	  1.733405
 -1.560921	  0.730975	  1.737183
 -1.542838	  0.732723	  1.739211
 -1.521757	  0.734835	  1.741636
 -1.503470	  0.740331	  1.743171
 -1.487613	  0.745093	  1.745960
 -1.466571	  0.748943	  1.752046
 -1.438951	  0.753360	  1.760094
 -1.428072	  0.756350	  1.761959
 -1.410485	  0.767060	  1.767081
 -1.395001	  0.775632	  1.768878
 -1.372373	  0.781450	  1.773711
 -1.352960	  0.784853	  1.779286
 -1.333801	  0.787715	  1.785610
 -1.315457	  0.788057	  1.793229
 -1.296983	  0.789230	  1.801253
 -1.278618	  0.791536	  1.809132
 -1.260216	  0.794555	  1.816409
 -1.241975	  0.795824	  1.824507
 -1.223782	  0.796875	  1.832749
 -1.205637	  0.797779	  1.841100
 -1.187857	  0.797853	  1.850185
 -1.170372	  0.798254	  1.859671
 -1.154035	  0.801202	  1.868237
 -1.136374	  0.810687	  1.875136
 -1.116576	  0.817452	  1.879223
 -1.095412	  0.813614	  1.888424
 -1.076614	  0.809460	  1.898994
 -1.062747	  0.809506	  1.904131
 -1.043125	  0.812530	  1.909916
 -1.018053	  0.815444	  1.917717
 -1.004548	  0.817870	  1.923280
 -0.989753	  0.819148	  1.929344
 -0.965444	  0.821005	  1.937142
 -0.941344	  0.824978	  1.942507
 -0.930835	  0.827120	  1.946349
 -0.912409	  0.829104	  1.952026
 -0.887587	  0.831661	  1.958233
 -0.867632	  0.838466	  1.960328
 -0.855641	  0.842930	  1.960199
 -0.834316	  0.850773	  1.959395
 -0.806469	  0.858727	  1.959721
 -0.797179	  0.862025	  1.959466
 -0.779528	  0.868771	  1.955595
 -0.748504	  0.876070	  1.951151
 -0.733445	  0.877108	  1.951537
 -0.717287	  0.873957	  1.956877
 -0.696902	  0.872636	  1.967580
 -0.675370	  0.869887	  1.973621
 -0.655215	  0.869071	  1.976107
 -0.635376	  0.869971	  1.977586
 -0.616867	  0.869435	  1.981087
 -0.599656	  0.869682	  1.988003
 -0.581063	  0.871006	  1.991117
 -0.559871	  0.872190	  1.994128
 -0.532684	  0.873924	  2.003007
 -0.514516	  0.876063	  2.010653
 -0.502070	  0.877893	  2.015354
 -0.488363	  0.882231	  2.020865
 -0.469327	  0.887075	  2.026107
 -0.448789	  0.888885	  2.029648
 -0.423872	  0.890294	  2.033716
 -0.404097	  0.892942	  2.039258
 -0.391086	  0.896923	  2.043139
 -0.369630	  0.904014	  2.049833
 -0.351391	  0.908184	  2.057020
 -0.335400	  0.912454	  2.062140
 -0.311926	  0.919465	  2.070915
 -0.298133	  0.923268	  2.077162
 -0.281373	  0.926776	  2.084139
 -0.260550	  0.927939	  2.090341
 -0.242265	  0.928044	  2.094306
 -0.215637	  0.933661	  2.100225
 -0.199077	  0.939009	  2.105810
 -0.187517	  0.942472	  2.108998
 -0.166359	  0.945490	  2.116479
 -0.148707	  0.947780	  2.121932
 -0.123640	  0.947611	  2.124859
 -0.101382	  0.945431	  2.124935
 -0.086628	  0.944889	  2.126762
 -0.064798	  0.946637	  2.131596
 -0.043167	  0.955795	  2.139711
 -0.031458	  0.961823	  2.145678
 -0.009584	  0.972657	  2.160658
  0.007291	  0.979072	  2.171314
  0.018452	  0.982878	  2.176874
  0.037401	  0.979889	  2.179208
  0.059691	  0.982897	  2.187062
  0.077847	  0.988025	  2.194462
  0.095692	  0.993544	  2.201629
  0.113603	  0.998920	  2.208722
  0.131826	  1.003874	  2.215309
  0.150046	  1.008839	  2.221896
  0.168279	  1.013753	  2.228480
  0.187433	  1.015750	  2.233850
  0.206635	  1.017534	  2.239152
  0.225837	  1.019316	  2.244453
  0.245402	  1.020450	  2.248438
  0.265161	  1.021115	  2.251466
  0.284919	  1.021782	  2.254497
  0.304055	  1.020935	  2.260247
  0.322930	  1.019664	  2.266737
  0.341336	  1.019398	  2.274556
  0.359433	  1.019669	  2.283065
  0.377633	  1.022338	  2.290914
  0.395820	  1.025747	  2.298506
  0.414014	  1.029152	  2.306111
  0.432399	  1.032554	  2.313815
  0.451495	  1.033502	  2.322644
  0.469544	  1.033589	  2.331258
