  1.156635	 -1.240681	  1.728204
  1.170050	 -1.278615	  1.752335
  1.171227	 -1.260210	  1.740947
  1.166069	 -1.243470	  1.729489
  1.153888	 -1.227001	  1.722745
  1.141235	 -1.210386	  1.718343
  1.133645	 -1.197483	  1.712084
  1.122053	 -1.182732	  1.701200
  1.112208	 -1.167188	  1.688106
  1.105663	 -1.155115	  1.677652
  1.096201	 -1.137593	  1.669648
  1.088982	 -1.116079	  1.662708
  1.087369	 -1.100020	  1.651061
  1.086956	 -1.088325	  1.638306
  1.080622	 -1.070298	  1.626767
  1.073615	 -1.053401	  1.617406
  1.068018	 -1.036880	  1.608484
  1.058014	 -1.020855	  1.600973
  1.048205	 -1.004374	  1.591111
  1.043070	 -0.988477	  1.581490
  1.036237	 -0.972006	  1.574279
  1.025437	 -0.955612	  1.563784
  1.018575	 -0.939938	  1.550314
  1.020847	 -0.924885	  1.539582
  1.020260	 -0.906894	  1.529262
  1.015391	 -0.890018	  1.518607
  1.009051	 -0.874338	  1.507702
  1.003013	 -0.858689	  1.496769
  0.996847	 -0.843095	  1.485864
  0.991215	 -0.827153	  1.475188
  0.986298	 -0.810768	  1.464830
  0.981428	 -0.794337	  1.454524
  0.976959	 -0.777429	  1.444824
  0.972786	 -0.760215	  1.435538
  0.968541	 -0.742989	  1.426318
  0.962410	 -0.725876	  1.417996
  0.955561	 -0.708855	  1.410038
  0.948327	 -0.691947	  1.402195
  0.939369	 -0.675637	  1.394881
  0.930287	 -0.659358	  1.387638
  0.921047	 -0.642900	  1.381032
  0.911812	 -0.626219	  1.375025
  0.902778	 -0.609457	  1.368928
  0.894278	 -0.592887	  1.361651
  0.885637	 -0.576752	  1.353839
  0.877426	 -0.562193	  1.343214
  0.869293	 -0.550668	  1.329558
  0.861547	 -0.542893	  1.313282
  0.854490	 -0.537463	  1.295567
  0.848091	 -0.534105	  1.276978
  0.840878	 -0.530712	  1.259126
  0.833053	 -0.529602	  1.240250
  0.825487	 -0.525157	  1.219267
  0.824694	 -0.526472	  1.194262
  0.825719	 -0.532193	  1.180158
  0.821322	 -0.534963	  1.160545
  0.820973	 -0.539397	  1.136929
  0.821722	 -0.544737	  1.118201
  0.821377	 -0.551876	  1.099828
  0.821356	 -0.554116	  1.077147
  0.826847	 -0.563628	  1.059446
  0.831416	 -0.575687	  1.044630
  0.833668	 -0.586463	  1.026866
  0.835011	 -0.592850	  1.007248
  0.836301	 -0.598499	  0.988078
  0.837550	 -0.604131	  0.968972
  0.837406	 -0.609120	  0.950504
  0.834865	 -0.606611	  0.931134
  0.835584	 -0.597935	  0.911146
  0.845517	 -0.592878	  0.889135
  0.853954	 -0.599165	  0.870154
  0.855048	 -0.606410	  0.853790
  0.854311	 -0.606496	  0.830473
  0.860324	 -0.599814	  0.810123
  0.868075	 -0.592743	  0.793652
  0.876505	 -0.582212	  0.781852
  0.887490	 -0.568126	  0.766703
  0.897303	 -0.559417	  0.752919
  0.909006	 -0.552668	  0.740764
  0.920851	 -0.543662	  0.723134
  0.928771	 -0.532705	  0.710327
  0.938399	 -0.516077	  0.703054
  0.950847	 -0.500082	  0.703482
  0.965827	 -0.483187	  0.701901
  0.975001	 -0.468087	  0.697125
  0.982063	 -0.450297	  0.689166
  0.993565	 -0.430274	  0.682520
  1.004879	 -0.418702	  0.682050
  1.020084	 -0.406667	  0.684582
  1.033993	 -0.382374	  0.678951
  1.038790	 -0.362981	  0.674571
  1.042543	 -0.348989	  0.675170
  1.052219	 -0.329410	  0.677554
  1.057602	 -0.305265	  0.676938
  1.057714	 -0.288816	  0.679366
  1.062803	 -0.271194	  0.682980
  1.070558	 -0.247782	  0.682693
  1.070577	 -0.228842	  0.685519
  1.068473	 -0.212375	  0.691857
  1.065140	 -0.190226	  0.700024
  1.062627	 -0.169054	  0.703570
  1.066311	 -0.155026	  0.705365
  1.071936	 -0.133302	  0.709473
  1.072310	 -0.110902	  0.711071
  1.070855	 -0.091199	  0.713449
  1.071232	 -0.075631	  0.719557
  1.066481	 -0.055460	  0.722950
  1.062164	 -0.035746	  0.725649
  1.060391	 -0.015873	  0.737998
  1.057319	  0.001988	  0.748243
  1.052415	  0.019404	  0.752890
  1.046470	  0.036921	  0.756972
  1.039375	  0.056961	  0.763811
  1.031571	  0.074683	  0.766868
  1.024231	  0.089920	  0.770518
  1.014701	  0.111022	  0.777780
  1.005348	  0.128920	  0.778461
  0.994336	  0.146084	  0.776236
  0.984847	  0.158170	  0.779811
  0.971520	  0.175257	  0.787359
  0.959275	  0.190357	  0.793103
  0.947027	  0.204845	  0.799243
  0.931832	  0.215568	  0.805669
  0.914427	  0.225370	  0.811000
  0.897844	  0.235619	  0.815655
  0.885324	  0.250522	  0.822764
  0.875338	  0.268080	  0.832540
  0.864048	  0.281402	  0.842107
  0.848942	  0.290366	  0.851123
  0.831659	  0.298197	  0.858576
  0.814689	  0.308257	  0.864250
  0.799983	  0.321221	  0.868776
  0.786558	  0.335973	  0.872934
  0.774649	  0.351655	  0.873687
  0.763696	  0.368472	  0.870129
  0.753436	  0.385241	  0.865833
  0.743622	  0.402738	  0.863578
  0.733394	  0.419588	  0.863382
  0.721769	  0.435291	  0.862740
  0.710953	  0.452036	  0.859938
  0.704658	  0.470687	  0.853734
  0.701332	  0.490912	  0.846012
  0.696298	  0.507376	  0.839554
  0.684027	  0.521177	  0.831830
  0.668376	  0.533623	  0.822216
  0.655815	  0.547392	  0.812618
  0.649101	  0.564255	  0.806213
  0.643731	  0.583002	  0.801984
  0.634610	  0.602429	  0.803085
  0.629408	  0.622514	  0.802644
  0.626311	  0.640297	  0.792834
  0.613987	  0.662040	  0.775935
  0.608022	  0.670725	  0.771874
  0.598898	  0.685790	  0.765583
  0.589063	  0.708402	  0.752027
  0.580687	  0.723715	  0.738002
  0.575971	  0.730562	  0.728077
  0.569454	  0.746231	  0.715025
  0.563053	  0.763363	  0.709208
  0.553530	  0.784692	  0.706236
  0.546152	  0.805026	  0.700053
  0.543255	  0.822383	  0.695209
  0.544734	  0.839690	  0.689575
  0.541528	  0.864533	  0.678206
  0.529695	  0.881317	  0.663818
  0.518371	  0.889708	  0.648930
  0.511159	  0.895992	  0.637099
  0.509155	  0.912109	  0.623662
  0.509524	  0.931281	  0.612194
  0.504951	  0.949890	  0.598800
  0.495938	  0.961194	  0.589523
  0.485166	  0.976766	  0.579408
  0.479847	  0.993091	  0.569832
  0.479076	  1.008899	  0.559482
  0.476114	  1.026417	  0.543374
  0.468823	  1.038795	  0.530076
  0.461681	  1.053199	  0.519170
  0.458151	  1.074158	  0.513353
  0.454845	  1.097577	  0.511468
  0.451076	  1.115198	  0.506403
  0.445218	  1.133324	  0.494595
  0.438524	  1.144788	  0.483397
  0.430566	  1.158947	  0.470994
  0.425909	  1.176474	  0.456284
  0.422693	  1.191058	  0.442984
  0.412153	  1.208204	  0.433980
  0.401610	  1.225827	  0.428745
  0.391632	  1.244202	  0.424806
  0.385426	  1.257685	  0.421178
  0.373286	  1.276414	  0.414835
  0.364660	  1.296735	  0.408668
  0.359795	  1.314635	  0.399107
  0.358262	  1.326285	  0.388556
  0.349272	  1.341650	  0.374648
  0.335083	  1.356802	  0.366250
  0.321271	  1.371160	  0.361218
  0.308468	  1.385236	  0.355027
  0.296005	  1.399654	  0.348261
  0.282418	  1.413365	  0.342846
  0.268768	  1.426980	  0.337535
  0.255040	  1.440524	  0.332284
  0.239593	  1.452680	  0.328674
  0.223179	  1.463809	  0.326188
  0.206770	  1.474970	  0.323623
  0.190310	  1.485941	  0.321101
  0.174480	  1.496967	  0.317156
  0.157724	  1.509865	  0.311514
  0.140473	  1.522092	  0.308201
  0.119794	  1.525248	  0.312145
  0.098375	  1.523667	  0.322386
  0.074970	  1.529928	  0.328027
  0.063721	  1.537761	  0.325434
  0.044308	  1.549524	  0.317342
  0.020996	  1.560152	  0.316261
  0.002052	  1.562236	  0.322438
 -0.015165	  1.562450	  0.323972
 -0.037061	  1.566209	  0.322509
 -0.057116	  1.569619	  0.327830
 -0.074220	  1.567114	  0.335603
 -0.094874	  1.566696	  0.332410
 -0.117652	  1.567345	  0.327506
 -0.134166	  1.567591	  0.327700
 -0.157349	  1.569451	  0.327079
 -0.175607	  1.572643	  0.319253
 -0.189732	  1.576419	  0.311793
 -0.207858	  1.583159	  0.308979
 -0.230655	  1.590894	  0.308540
 -0.250927	  1.596029	  0.303999
 -0.265060	  1.604039	  0.296603
 -0.278745	  1.609756	  0.290192
 -0.308550	  1.616669	  0.280492
 -0.330987	  1.627195	  0.283046
 -0.338413	  1.629396	  0.292717
 -0.358019	  1.635440	  0.296146
 -0.379576	  1.643659	  0.305976
 -0.392108	  1.651945	  0.311177
 -0.409098	  1.659674	  0.319083
 -0.423591	  1.669254	  0.328309
 -0.437860	  1.678276	  0.334556
 -0.447291	  1.692420	  0.343565
 -0.464879	  1.706281	  0.346762
 -0.479229	  1.714083	  0.357426
 -0.492032	  1.723656	  0.365543
 -0.511041	  1.744402	  0.379818
 -0.512835	  1.748124	  0.395659
 -0.519592	  1.767470	  0.388025
 -0.524588	  1.768003	  0.424282
 -0.525404	  1.798035	  0.418979
 -0.531031	  1.815163	  0.441382
 -0.525825	  1.837095	  0.422204
 -0.529352	  1.849332	  0.437298
 -0.538267	  1.871361	  0.429918
 -0.543456	  1.887183	  0.430690
 -0.549958	  1.911523	  0.426756
 -0.555263	  1.923045	  0.427290
 -0.551160	  1.944390	  0.422001
 -0.540637	  1.961685	  0.415592
 -0.529896	  1.977247	  0.409749
 -0.518575	  1.992195	  0.401502
 -0.507396	  2.005933	  0.392088
 -0.496083	  2.016846	  0.382480
 -0.483876	  2.035327	  0.368661
 -0.475246	  2.045398	  0.352732
 -0.464981	  2.054450	  0.338274
 -0.453718	  2.060121	  0.320171
 -0.444156	  2.064421	  0.306578
 -0.429511	  2.069901	  0.291715
 -0.415745	  2.077448	  0.277808
 -0.401969	  2.083353	  0.268586
 -0.387369	  2.089008	  0.258349
 -0.373099	  2.092702	  0.243603
 -0.361324	  2.098626	  0.223192
 -0.348318	  2.106896	  0.205833
 -0.333362	  2.112195	  0.193812
 -0.320987	  2.114751	  0.185578
 -0.301320	  2.113930	  0.173417
 -0.288467	  2.121672	  0.156238
 -0.282740	  2.128046	  0.139333
 -0.273503	  2.129587	  0.122134
 -0.264589	  2.130854	  0.104210
 -0.253823	  2.139546	  0.082612
 -0.240568	  2.151142	  0.066039
 -0.233116	  2.155820	  0.055989
 -0.222572	  2.153908	  0.040328
 -0.207673	  2.151690	  0.021448
 -0.195404	  2.159099	  0.002279
 -0.193575	  2.168689	 -0.013492
 -0.190062	  2.171624	 -0.034649
 -0.187868	  2.167230	 -0.053667
 -0.176810	  2.161700	 -0.070502
 -0.164432	  2.157022	 -0.085649
 -0.152034	  2.152410	 -0.100649
 -0.139812	  2.148320	 -0.115757
 -0.131075	  2.152976	 -0.132953
 -0.124025	  2.160500	 -0.150067
 -0.117137	  2.168149	 -0.167216
 -0.110259	  2.175799	 -0.184373
 -0.103253	  2.183491	 -0.201454
 -0.096359	  2.191424	 -0.218390
 -0.094955	  2.202622	 -0.234614
 -0.102645	  2.216853	 -0.246088
 -0.110850	  2.231254	 -0.257271
 -0.119067	  2.245651	 -0.268458
 -0.127303	  2.260020	 -0.279668
 -0.135484	  2.274830	 -0.290338
 -0.143482	  2.290701	 -0.299600
 -0.151703	  2.306583	 -0.308568
 -0.160386	  2.322589	 -0.316811
 -0.169227	  2.338524	 -0.324622
 -0.177413	  2.352133	 -0.334740
 -0.186258	  2.360594	 -0.352353
 -0.195295	  2.364754	 -0.373388
 -0.196047	  2.396348	 -0.386423
 -0.186225	  2.430529	 -0.378964
 -0.183892	  2.467041	 -0.376696
 -0.228465	  2.472201	 -0.392287
 -0.236200	  2.488724	 -0.400481
