 -0.849078	 -2.025389	  1.210276
 -0.825847	 -2.030710	  1.201747
 -0.813266	 -2.033591	  1.197128
 -0.802385	 -2.034941	  1.191368
 -0.791630	 -2.037534	  1.182124
 -0.778197	 -2.043039	  1.163710
 -0.769275	 -2.049517	  1.149511
 -0.760132	 -2.062487	  1.133202
 -0.753715	 -2.071582	  1.119066
 -0.743730	 -2.078797	  1.102664
 -0.729582	 -2.086764	  1.089013
 -0.715036	 -2.096424	  1.081089
 -0.700783	 -2.107729	  1.075922
 -0.683392	 -2.123177	  1.062225
 -0.671934	 -2.132070	  1.047402
 -0.665090	 -2.138603	  1.036278
 -0.654063	 -2.149924	  1.016258
 -0.644140	 -2.156709	  1.001044
 -0.633468	 -2.164234	  0.986031
 -0.625554	 -2.171470	  0.972468
 -0.617862	 -2.181191	  0.954624
 -0.608300	 -2.190501	  0.939321
 -0.596121	 -2.199856	  0.926138
 -0.583505	 -2.208527	  0.912661
 -0.573976	 -2.216787	  0.899572
 -0.563621	 -2.227449	  0.882843
 -0.551557	 -2.235914	  0.868993
 -0.543057	 -2.243808	  0.856555
 -0.531496	 -2.255520	  0.838857
 -0.519687	 -2.265549	  0.825941
 -0.512575	 -2.276513	  0.816421
 -0.496192	 -2.291226	  0.805683
 -0.477656	 -2.299284	  0.798426
 -0.455885	 -2.306176	  0.789463
 -0.436603	 -2.312770	  0.775475
 -0.426567	 -2.319423	  0.765572
 -0.416301	 -2.326979	  0.754272
 -0.401191	 -2.337720	  0.737245
 -0.391011	 -2.343155	  0.726718
 -0.376524	 -2.352355	  0.710139
 -0.364385	 -2.360852	  0.695592
 -0.352645	 -2.366225	  0.686421
 -0.334491	 -2.370550	  0.672283
 -0.318391	 -2.372841	  0.657176
 -0.306613	 -2.371354	  0.646149
 -0.282640	 -2.371360	  0.624895
 -0.269634	 -2.375105	  0.613725
 -0.261772	 -2.378345	  0.607372
 -0.248052	 -2.386625	  0.593874
 -0.231003	 -2.393049	  0.578990
 -0.214983	 -2.397143	  0.566350
 -0.198636	 -2.399369	  0.553999
 -0.182086	 -2.399173	  0.542874
 -0.165451	 -2.399607	  0.531598
 -0.148908	 -2.399561	  0.520382
 -0.132274	 -2.398515	  0.509013
 -0.115747	 -2.397266	  0.497839
 -0.099267	 -2.396411	  0.486522
 -0.082808	 -2.395631	  0.475188
 -0.066148	 -2.393348	  0.464362
 -0.049408	 -2.390009	  0.453938
 -0.032666	 -2.386664	  0.443521
 -0.015924	 -2.383319	  0.433104
  0.000820	 -2.379950	  0.422701
  0.017756	 -2.374299	  0.413692
  0.034697	 -2.368556	  0.404748
  0.051639	 -2.362850	  0.395781
  0.068578	 -2.357140	  0.386806
  0.085522	 -2.351244	  0.377962
  0.102495	 -2.343492	  0.370786
  0.119631	 -2.336355	  0.363294
  0.136825	 -2.329119	  0.355846
  0.153824	 -2.321019	  0.348854
  0.170337	 -2.311601	  0.342746
  0.186982	 -2.301423	  0.337844
  0.203682	 -2.291659	  0.332754
  0.220560	 -2.282375	  0.327358
  0.237550	 -2.273317	  0.321792
  0.254417	 -2.263621	  0.316889
  0.270856	 -2.252978	  0.312801
  0.287325	 -2.242439	  0.308694
  0.304078	 -2.232350	  0.304486
  0.321266	 -2.222369	  0.300876
  0.338951	 -2.214593	  0.295341
  0.355294	 -2.209308	  0.286642
  0.367630	 -2.203480	  0.274661
  0.389150	 -2.205677	  0.259239
  0.409835	 -2.208310	  0.252845
  0.426791	 -2.208265	  0.252019
  0.451973	 -2.208543	  0.248651
  0.468585	 -2.211842	  0.237919
  0.479167	 -2.215934	  0.225662
  0.493960	 -2.220644	  0.208056
  0.511779	 -2.221963	  0.200289
  0.533091	 -2.222800	  0.197254
  0.555381	 -2.226030	  0.187893
  0.566892	 -2.229324	  0.176803
  0.578356	 -2.234254	  0.158778
  0.590862	 -2.237874	  0.143100
  0.601203	 -2.241449	  0.130057
  0.623843	 -2.246785	  0.110534
  0.638003	 -2.247927	  0.103370
  0.653960	 -2.250372	  0.097196
  0.680345	 -2.255630	  0.085651
  0.695420	 -2.257460	  0.079959
  0.705617	 -2.259781	  0.072482
  0.718948	 -2.260038	  0.053214
  0.731291	 -2.263378	  0.033664
  0.742504	 -2.266683	  0.018362
  0.756361	 -2.268912	  0.003501
  0.773228	 -2.269259	 -0.008947
  0.786872	 -2.270414	 -0.023428
  0.799228	 -2.273913	 -0.036712
  0.808699	 -2.284196	 -0.053089
  0.822416	 -2.293604	 -0.072613
  0.837744	 -2.294718	 -0.086597
  0.851525	 -2.295572	 -0.097277
  0.866511	 -2.300843	 -0.110875
  0.880921	 -2.302462	 -0.125375
  0.894656	 -2.304802	 -0.137398
  0.913937	 -2.310880	 -0.151987
  0.929858	 -2.308287	 -0.166062
  0.939215	 -2.298317	 -0.180972
  0.951159	 -2.291782	 -0.197991
  0.979364	 -2.289603	 -0.220376
  0.982363	 -2.289641	 -0.223239
