 -1.407490	  0.694870	 -1.775455
 -1.413283	  0.692996	 -1.778120
 -1.394467	  0.696236	 -1.769591
 -1.379157	  0.704380	 -1.765080
 -1.359473	  0.715162	 -1.759437
 -1.342821	  0.720432	 -1.751791
 -1.325276	  0.722066	 -1.741759
 -1.306670	  0.724939	 -1.732246
 -1.292070	  0.732920	 -1.727989
 -1.271795	  0.750703	 -1.721330
 -1.257826	  0.760220	 -1.712367
 -1.241759	  0.763395	 -1.702670
 -1.223709	  0.764085	 -1.695172
 -1.206653	  0.770574	 -1.688517
 -1.189614	  0.780934	 -1.681086
 -1.170530	  0.787824	 -1.673060
 -1.153863	  0.789969	 -1.665786
 -1.136170	  0.796219	 -1.656491
 -1.121858	  0.806766	 -1.647931
 -1.106539	  0.818441	 -1.639006
 -1.088627	  0.827392	 -1.630571
 -1.069979	  0.831735	 -1.624308
 -1.051611	  0.832963	 -1.620235
 -1.031958	  0.837209	 -1.614581
 -1.015594	  0.847126	 -1.607356
 -0.999845	  0.860545	 -1.597525
 -0.984996	  0.868478	 -1.589507
 -0.966702	  0.873109	 -1.583093
 -0.945605	  0.877203	 -1.576937
 -0.930772	  0.882573	 -1.572426
 -0.914538	  0.892574	 -1.565044
 -0.898212	  0.904289	 -1.556924
 -0.879653	  0.916768	 -1.551218
 -0.865458	  0.925038	 -1.545113
 -0.850667	  0.933063	 -1.537487
 -0.830202	  0.938956	 -1.529992
 -0.811267	  0.943197	 -1.522049
 -0.792863	  0.951209	 -1.519756
 -0.775504	  0.960449	 -1.521584
 -0.756775	  0.974285	 -1.525370
 -0.740870	  0.989717	 -1.521997
 -0.726436	  0.997798	 -1.512620
 -0.709287	  1.003597	 -1.504820
 -0.690194	  1.014287	 -1.499218
 -0.673969	  1.026972	 -1.501418
 -0.657662	  1.035505	 -1.504476
 -0.639560	  1.044538	 -1.503357
 -0.622611	  1.052659	 -1.499002
 -0.601374	  1.062184	 -1.496649
 -0.583081	  1.071888	 -1.499759
 -0.567846	  1.079910	 -1.501450
 -0.548478	  1.087355	 -1.496814
 -0.529128	  1.094931	 -1.497021
 -0.513286	  1.101788	 -1.498085
 -0.494924	  1.106664	 -1.492822
 -0.476627	  1.107731	 -1.486699
 -0.457353	  1.104545	 -1.476317
 -0.443822	  1.103672	 -1.469519
 -0.427948	  1.107102	 -1.458663
 -0.405890	  1.109653	 -1.447309
 -0.390066	  1.102971	 -1.441277
 -0.374806	  1.090324	 -1.437257
 -0.358796	  1.074674	 -1.427536
 -0.345780	  1.067726	 -1.417493
 -0.330952	  1.061680	 -1.407914
 -0.308280	  1.052422	 -1.396805
 -0.294232	  1.047656	 -1.387363
 -0.279760	  1.041782	 -1.372273
 -0.268996	  1.032655	 -1.358482
 -0.260633	  1.021541	 -1.345100
 -0.250345	  1.008996	 -1.326389
 -0.243955	  1.003289	 -1.309588
 -0.237062	  0.999788	 -1.289555
 -0.228974	  0.995988	 -1.270053
 -0.221532	  0.991033	 -1.254450
 -0.213041	  0.986871	 -1.237171
 -0.200264	  0.984615	 -1.219340
 -0.183441	  0.978982	 -1.205026
 -0.169626	  0.968924	 -1.192733
 -0.163111	  0.960057	 -1.180005
 -0.158698	  0.950319	 -1.160078
 -0.149130	  0.938251	 -1.144963
 -0.138091	  0.925222	 -1.135027
 -0.127215	  0.912777	 -1.123328
 -0.116576	  0.900535	 -1.111958
 -0.104165	  0.889604	 -1.099935
 -0.089782	  0.881298	 -1.089172
 -0.078048	  0.869207	 -1.082600
 -0.064673	  0.858129	 -1.073578
 -0.049342	  0.850793	 -1.063102
 -0.033145	  0.845711	 -1.052182
 -0.015435	  0.842202	 -1.040692
  0.001217	  0.837034	 -1.035390
  0.018007	  0.826336	 -1.030063
  0.035343	  0.816027	 -1.027252
  0.054242	  0.809562	 -1.020711
  0.070305	  0.804233	 -1.010913
  0.086540	  0.801416	 -0.999759
  0.100590	  0.798038	 -0.985633
  0.116436	  0.793673	 -0.972030
  0.135499	  0.789053	 -0.963471
  0.155960	  0.790665	 -0.959332
  0.175089	  0.794560	 -0.954699
  0.191872	  0.800940	 -0.948118
  0.209601	  0.807713	 -0.939648
  0.228640	  0.816460	 -0.929936
  0.241049	  0.824404	 -0.920186
  0.252437	  0.834745	 -0.906602
  0.266078	  0.842300	 -0.895476
  0.283467	  0.849433	 -0.887660
  0.302170	  0.861605	 -0.878072
  0.309301	  0.869709	 -0.871797
  0.317967	  0.885767	 -0.856492
  0.331392	  0.902535	 -0.850224
  0.348846	  0.916184	 -0.846922
  0.361036	  0.922244	 -0.847048
  0.382523	  0.937374	 -0.836034
  0.397274	  0.947130	 -0.829499
  0.411309	  0.957278	 -0.827717
  0.424486	  0.972801	 -0.822776
  0.432018	  0.989862	 -0.816615
  0.443243	  1.006959	 -0.811251
  0.455393	  1.022871	 -0.807965
  0.467318	  1.038828	 -0.806158
  0.479250	  1.054780	 -0.804370
  0.491218	  1.070707	 -0.802613
  0.503303	  1.086593	 -0.801787
  0.515500	  1.102362	 -0.801507
  0.528403	  1.118167	 -0.801062
  0.541393	  1.133504	 -0.801556
  0.553405	  1.148914	 -0.805221
  0.566252	  1.163761	 -0.808839
  0.579892	  1.178297	 -0.811474
  0.593785	  1.192533	 -0.814517
  0.608191	  1.206459	 -0.816680
  0.622697	  1.220288	 -0.818159
  0.637290	  1.234553	 -0.817955
  0.651872	  1.248793	 -0.816415
  0.666385	  1.262342	 -0.814963
  0.681623	  1.275134	 -0.812658
  0.697107	  1.287252	 -0.808677
  0.713226	  1.298952	 -0.806109
  0.728597	  1.309948	 -0.801538
  0.745762	  1.319479	 -0.798927
  0.762900	  1.328604	 -0.795287
  0.780868	  1.337831	 -0.793231
  0.799475	  1.345238	 -0.792555
  0.818282	  1.352025	 -0.792043
  0.837281	  1.358221	 -0.791251
  0.856513	  1.363576	 -0.790057
  0.875888	  1.368194	 -0.788245
  0.895334	  1.372298	 -0.786009
  0.914875	  1.375288	 -0.782982
  0.934427	  1.377982	 -0.779749
  0.953991	  1.379544	 -0.775901
  0.973547	  1.380871	 -0.771924
  0.993012	  1.381848	 -0.767436
  1.012442	  1.382711	 -0.762775
  1.031717	  1.384019	 -0.757603
  1.050916	  1.385529	 -0.752206
  1.069945	  1.387722	 -0.746456
  1.088867	  1.390288	 -0.740521
  1.107158	  1.393663	 -0.734251
  1.124146	  1.398491	 -0.725986
  1.139844	  1.403154	 -0.716300
  1.165239	  1.405320	 -0.708051
  1.184122	  1.409450	 -0.707453
  1.197117	  1.416148	 -0.703092
  1.213982	  1.421920	 -0.691771
  1.239085	  1.424633	 -0.684925
  1.256206	  1.429554	 -0.683274
  1.269631	  1.438095	 -0.676194
  1.289447	  1.444613	 -0.665769
  1.310883	  1.446629	 -0.661950
  1.327875	  1.453396	 -0.660240
  1.342714	  1.464488	 -0.653603
  1.361373	  1.472030	 -0.645746
  1.385399	  1.474535	 -0.644810
  1.400855	  1.476432	 -0.640796
  1.417859	  1.481587	 -0.630936
  1.435221	  1.486599	 -0.620145
  1.452924	  1.489676	 -0.611621
  1.471000	  1.492595	 -0.602785
  1.487820	  1.497469	 -0.593340
  1.504002	  1.502824	 -0.582569
  1.521747	  1.505697	 -0.574232
  1.540751	  1.507181	 -0.566629
  1.558911	  1.511999	 -0.558210
  1.573590	  1.517619	 -0.546912
  1.590853	  1.519525	 -0.537329
  1.611787	  1.522170	 -0.531495
  1.627594	  1.530004	 -0.522035
  1.640499	  1.534430	 -0.508509
  1.655676	  1.539327	 -0.494642
  1.677008	  1.548101	 -0.485602
  1.692177	  1.549079	 -0.482026
  1.708976	  1.551865	 -0.470246
  1.725653	  1.559118	 -0.457514
  1.745224	  1.561795	 -0.452605
  1.764738	  1.562792	 -0.447036
  1.782826	  1.566616	 -0.439407
