 -2.078552	 -0.372516	 -1.167051
 -2.116534	 -0.399471	 -1.178492
 -2.103415	 -0.384013	 -1.174407
 -2.086951	 -0.374446	 -1.170718
 -2.072031	 -0.363162	 -1.168632
 -2.053346	 -0.351183	 -1.165350
 -2.036684	 -0.338482	 -1.159382
 -2.020853	 -0.330442	 -1.152373
 -2.003744	 -0.326162	 -1.145147
 -1.983790	 -0.316761	 -1.137517
 -1.970956	 -0.304230	 -1.135478
 -1.956287	 -0.288173	 -1.134666
 -1.938771	 -0.275034	 -1.129673
 -1.922873	 -0.269973	 -1.123337
 -1.903269	 -0.263184	 -1.116482
 -1.884532	 -0.252681	 -1.111189
 -1.871703	 -0.246387	 -1.109995
 -1.854765	 -0.237966	 -1.109859
 -1.836162	 -0.220175	 -1.098480
 -1.819812	 -0.209479	 -1.087911
 -1.806052	 -0.205134	 -1.083345
 -1.787058	 -0.199680	 -1.081384
 -1.764752	 -0.191458	 -1.074301
 -1.748810	 -0.181672	 -1.065738
 -1.737488	 -0.174018	 -1.061537
 -1.716198	 -0.164543	 -1.057844
 -1.696943	 -0.156051	 -1.048383
 -1.684899	 -0.145535	 -1.039935
 -1.671056	 -0.134767	 -1.035298
 -1.650620	 -0.126339	 -1.029895
 -1.634166	 -0.117613	 -1.019561
 -1.622949	 -0.106207	 -1.009487
 -1.609961	 -0.093266	 -1.000815
 -1.594794	 -0.082137	 -0.992895
 -1.579756	 -0.072199	 -0.984701
 -1.564214	 -0.062397	 -0.976372
 -1.548312	 -0.052489	 -0.968993
 -1.533183	 -0.041993	 -0.961835
 -1.518591	 -0.030914	 -0.953833
 -1.505668	 -0.019022	 -0.945351
 -1.493999	 -0.005336	 -0.936634
 -1.480618	  0.009390	 -0.927852
 -1.465430	  0.019992	 -0.921408
 -1.445843	  0.025853	 -0.917352
 -1.421363	  0.033093	 -0.912920
 -1.404329	  0.038219	 -0.907369
 -1.387454	  0.043071	 -0.901944
 -1.371672	  0.051554	 -0.894306
 -1.351782	  0.065290	 -0.886509
 -1.334434	  0.074290	 -0.873185
 -1.319969	  0.081825	 -0.865277
 -1.310485	  0.088958	 -0.860181
 -1.293789	  0.101932	 -0.845868
 -1.278594	  0.113491	 -0.829213
 -1.265464	  0.122994	 -0.829065
 -1.255535	  0.140152	 -0.816498
 -1.243219	  0.153688	 -0.803303
 -1.239308	  0.163145	 -0.790243
 -1.225381	  0.168172	 -0.776874
 -1.202731	  0.181352	 -0.762734
 -1.186545	  0.183455	 -0.750439
 -1.175298	  0.192564	 -0.744800
 -1.166739	  0.194902	 -0.734750
 -1.146010	  0.208587	 -0.723407
 -1.129491	  0.218986	 -0.710724
 -1.117892	  0.225359	 -0.701108
 -1.106942	  0.235624	 -0.685113
 -1.095116	  0.242024	 -0.666942
 -1.081227	  0.248609	 -0.648817
 -1.071783	  0.253955	 -0.639852
 -1.056054	  0.265629	 -0.629556
 -1.036381	  0.278379	 -0.622113
 -1.023458	  0.286082	 -0.617454
 -1.008105	  0.295569	 -0.607673
 -0.991848	  0.302984	 -0.597960
 -0.975462	  0.315016	 -0.589247
 -0.962565	  0.328814	 -0.581891
 -0.953700	  0.338403	 -0.571648
 -0.938871	  0.344649	 -0.556366
 -0.919610	  0.352895	 -0.545560
 -0.901774	  0.357921	 -0.538640
 -0.884042	  0.360843	 -0.532732
 -0.863651	  0.366397	 -0.525392
 -0.848225	  0.377091	 -0.517637
 -0.837550	  0.390525	 -0.509123
 -0.823068	  0.404594	 -0.499602
 -0.806482	  0.411029	 -0.492554
 -0.786016	  0.412010	 -0.486371
 -0.765160	  0.418001	 -0.478063
 -0.753046	  0.428181	 -0.471333
 -0.739787	  0.443875	 -0.463782
 -0.720659	  0.456113	 -0.454102
 -0.705028	  0.462178	 -0.446896
 -0.691553	  0.466508	 -0.440864
 -0.671719	  0.473797	 -0.432338
 -0.656153	  0.485519	 -0.425189
 -0.642894	  0.499188	 -0.419179
 -0.626274	  0.514333	 -0.412715
 -0.614471	  0.523444	 -0.407199
 -0.599124	  0.534831	 -0.396748
 -0.582796	  0.546574	 -0.384310
 -0.565348	  0.554336	 -0.374352
 -0.550678	  0.558340	 -0.367986
 -0.532144	  0.561321	 -0.361761
 -0.505733	  0.564890	 -0.351477
 -0.491290	  0.562998	 -0.348020
 -0.471409	  0.558217	 -0.342917
 -0.449382	  0.555737	 -0.335052
 -0.433457	  0.557506	 -0.324834
 -0.417764	  0.560032	 -0.313150
 -0.399741	  0.561297	 -0.303381
 -0.383751	  0.562576	 -0.293653
 -0.365632	  0.564705	 -0.281931
 -0.345430	  0.564521	 -0.275505
 -0.328345	  0.563034	 -0.275157
 -0.305244	  0.564498	 -0.273814
 -0.284677	  0.567932	 -0.269718
 -0.263922	  0.572437	 -0.263373
 -0.250682	  0.575742	 -0.259433
 -0.232331	  0.582517	 -0.253257
 -0.203790	  0.589715	 -0.245034
 -0.187855	  0.586166	 -0.241320
 -0.175512	  0.582074	 -0.237674
 -0.146943	  0.583949	 -0.234535
 -0.129776	  0.585851	 -0.229037
 -0.112911	  0.587997	 -0.222771
 -0.094447	  0.596089	 -0.216505
 -0.077871	  0.598549	 -0.205184
 -0.061240	  0.601270	 -0.196072
 -0.041818	  0.604836	 -0.183986
 -0.027312	  0.607231	 -0.175565
 -0.009724	  0.611065	 -0.163515
  0.009236	  0.614058	 -0.150234
  0.023232	  0.614323	 -0.138241
  0.036661	  0.621399	 -0.125702
  0.051447	  0.635593	 -0.115629
  0.069790	  0.645858	 -0.111441
  0.087988	  0.653175	 -0.107828
  0.107026	  0.658357	 -0.103202
  0.126578	  0.661198	 -0.096251
  0.144777	  0.662629	 -0.089510
  0.162606	  0.669146	 -0.088884
  0.181196	  0.686370	 -0.088300
  0.188292	  0.695835	 -0.086876
  0.208713	  0.713486	 -0.076801
  0.220950	  0.730747	 -0.082972
  0.237253	  0.740347	 -0.075855
  0.248730	  0.759561	 -0.084319
  0.271945	  0.768405	 -0.076172
  0.288589	  0.776698	 -0.066088
  0.309723	  0.776804	 -0.057460
  0.315982	  0.783661	 -0.056209
  0.357895	  0.771658	 -0.062400
  0.385520	  0.762854	 -0.064612
  0.397348	  0.767150	 -0.067814
  0.415459	  0.762939	 -0.069746
  0.437101	  0.771977	 -0.072817
  0.458096	  0.778784	 -0.084295
  0.472641	  0.783744	 -0.083333
  0.488166	  0.791955	 -0.092880
  0.511869	  0.798826	 -0.090049
  0.530568	  0.802099	 -0.088425
  0.546201	  0.804356	 -0.089362
  0.569409	  0.807146	 -0.090582
  0.589562	  0.805690	 -0.092091
  0.609112	  0.805294	 -0.096887
  0.628591	  0.806520	 -0.102035
  0.646683	  0.809451	 -0.105435
  0.665308	  0.813374	 -0.104497
  0.689627	  0.810921	 -0.102656
  0.709119	  0.807661	 -0.103745
  0.727032	  0.803802	 -0.104848
  0.747531	  0.801478	 -0.107025
  0.766851	  0.802866	 -0.110751
  0.785023	  0.806332	 -0.112191
  0.806030	  0.808976	 -0.112744
  0.827235	  0.812054	 -0.114767
  0.846089	  0.813723	 -0.117914
  0.866436	  0.816576	 -0.120589
  0.886766	  0.818293	 -0.124956
  0.906931	  0.817719	 -0.129651
  0.927347	  0.819040	 -0.131939
  0.946708	  0.818824	 -0.131191
  0.969330	  0.820110	 -0.126673
  0.987476	  0.826534	 -0.120471
  1.002994	  0.830979	 -0.114052
  1.022399	  0.837800	 -0.106962
  1.041359	  0.844947	 -0.102669
  1.061050	  0.848959	 -0.099508
  1.080783	  0.851125	 -0.095570
  1.099227	  0.854395	 -0.092485
  1.116766	  0.863340	 -0.089318
  1.130728	  0.873819	 -0.085385
  1.147447	  0.880744	 -0.083975
  1.169412	  0.895945	 -0.086728
  1.189426	  0.912472	 -0.084397
  1.205767	  0.923920	 -0.085077
  1.217632	  0.927883	 -0.081803
  1.231355	  0.934911	 -0.083504
  1.248796	  0.950275	 -0.077427
  1.264189	  0.965748	 -0.070771
  1.278470	  0.981290	 -0.065986
  1.290655	  0.995134	 -0.064174
  1.302683	  1.008510	 -0.063052
  1.314192	  1.027264	 -0.062232
  1.326903	  1.039396	 -0.060620
  1.338115	  1.051512	 -0.060318
  1.343089	  1.071723	 -0.058000
  1.355043	  1.087285	 -0.050144
  1.364050	  1.097883	 -0.045583
  1.374172	  1.120338	 -0.039477
  1.382864	  1.137140	 -0.037940
  1.389894	  1.153891	 -0.037368
  1.394719	  1.172883	 -0.039611
  1.399442	  1.194820	 -0.042145
  1.400779	  1.213347	 -0.048316
  1.403511	  1.237187	 -0.054937
  1.408381	  1.251848	 -0.054056
  1.419853	  1.277208	 -0.050342
  1.426698	  1.293088	 -0.040103
  1.431614	  1.307784	 -0.032634
  1.437925	  1.328089	 -0.025617
  1.444555	  1.352133	 -0.025347
  1.445817	  1.371098	 -0.024565
  1.444330	  1.389639	 -0.027699
  1.445558	  1.417559	 -0.032428
  1.445897	  1.431585	 -0.031632
  1.447559	  1.446503	 -0.026853
  1.445816	  1.471562	 -0.018874
  1.445088	  1.492766	 -0.012644
  1.443035	  1.506070	 -0.008490
  1.439083	  1.530774	 -0.004936
  1.438144	  1.552947	 -0.005077
  1.437973	  1.569080	 -0.006260
  1.442966	  1.590876	 -0.006818
  1.444914	  1.610880	  0.000453
  1.440674	  1.630947	  0.008756
  1.434510	  1.648942	  0.014098
  1.427530	  1.667145	  0.019609
  1.423907	  1.684360	  0.029255
  1.419993	  1.702913	  0.041412
  1.415111	  1.722122	  0.050642
  1.409340	  1.737463	  0.055309
  1.403804	  1.755345	  0.061164
  1.395957	  1.777762	  0.066407
  1.389673	  1.792970	  0.069895
  1.380102	  1.810566	  0.069813
  1.366964	  1.834397	  0.076833
  1.357194	  1.849839	  0.083449
  1.351131	  1.858622	  0.088236
  1.340294	  1.877152	  0.095132
  1.331379	  1.893931	  0.103041
  1.323203	  1.907687	  0.115136
  1.312385	  1.921324	  0.127230
  1.298145	  1.934628	  0.136256
  1.281681	  1.948369	  0.141733
  1.269094	  1.962345	  0.145816
  1.262209	  1.976821	  0.151852
  1.261780	  1.988808	  0.165509
  1.264283	  1.990309	  0.182007
  1.265145	  1.991606	  0.186556
  1.262489	  1.994982	  0.201448
  1.270808	  1.994337	  0.218996
  1.284617	  1.990541	  0.235180
  1.294272	  1.988356	  0.247499
  1.306017	  1.988925	  0.264016
  1.314461	  1.988693	  0.282129
  1.327602	  1.986332	  0.298411
  1.335875	  1.982985	  0.315385
  1.344895	  1.981270	  0.331873
  1.356817	  1.981421	  0.348400
  1.368037	  1.980406	  0.364874
  1.378934	  1.980834	  0.381772
  1.390320	  1.982794	  0.398043
  1.402520	  1.983925	  0.413455
  1.416128	  1.987076	  0.427537
  1.429186	  1.990822	  0.441612
  1.444287	  1.995448	  0.453826
  1.459874	  2.000256	  0.466754
  1.477120	  2.003572	  0.476705
  1.495200	  2.003373	  0.482932
  1.511247	  2.010008	  0.492855
