 -1.742676	 -2.449636	  0.378504
 -1.725422	 -2.425382	  0.374756
 -1.711702	 -2.377878	  0.357368
 -1.707885	 -2.329022	  0.341914
 -1.691788	 -2.284670	  0.325508
 -1.689727	 -2.236710	  0.309421
 -1.675936	 -2.193896	  0.285353
 -1.671446	 -2.146508	  0.268554
 -1.664721	 -2.101422	  0.248979
 -1.652684	 -2.056234	  0.234109
 -1.649238	 -2.005588	  0.226704
 -1.649060	 -1.957245	  0.206942
 -1.639940	 -1.910488	  0.189229
 -1.634474	 -1.866641	  0.168964
 -1.631193	 -1.820438	  0.154954
 -1.630645	 -1.773672	  0.135978
 -1.624535	 -1.727214	  0.113176
 -1.614447	 -1.683769	  0.089014
 -1.602689	 -1.641064	  0.064981
 -1.590711	 -1.598679	  0.041631
 -1.578277	 -1.556305	  0.018026
 -1.565097	 -1.514093	 -0.004933
 -1.551886	 -1.472717	 -0.026173
 -1.538696	 -1.429777	 -0.045417
 -1.525897	 -1.384220	 -0.062621
 -1.513422	 -1.337610	 -0.079762
 -1.501877	 -1.290095	 -0.097059
 -1.490741	 -1.243933	 -0.113514
 -1.477798	 -1.200632	 -0.129514
 -1.462304	 -1.164658	 -0.143968
 -1.444344	 -1.136124	 -0.156810
 -1.415755	 -1.104262	 -0.173442
 -1.359548	 -1.062012	 -0.201733
 -1.282983	 -1.023729	 -0.234656
 -1.206459	 -0.990614	 -0.256976
 -1.149058	 -0.960959	 -0.263216
 -1.120440	 -0.935168	 -0.258246
 -1.105880	 -0.901664	 -0.242976
 -1.103391	 -0.834479	 -0.203952
 -1.124521	 -0.725113	 -0.144206
 -1.162708	 -0.585183	 -0.082771
 -1.195502	 -0.488889	 -0.058671
 -1.236541	 -0.350216	 -0.085066
 -1.188222	 -0.172676	 -0.185770
 -1.205532	 -0.064057	 -0.291297
 -1.270124	 -0.032204	 -0.391399
 -1.309343	 -0.025201	 -0.450562
 -1.413141	 -0.042010	 -0.529190
 -1.507724	 -0.132899	 -0.575580
 -1.544768	 -0.154661	 -0.582792
 -1.545107	 -0.156489	 -0.582487
 -1.531209	 -0.154024	 -0.571154
 -1.480251	 -0.112017	 -0.558733
 -1.417215	 -0.061161	 -0.533244
 -1.367393	  0.001990	 -0.544872
 -1.333418	  0.073766	 -0.571254
 -1.312656	  0.126348	 -0.594397
 -1.298941	  0.166555	 -0.613173
 -1.287839	  0.205514	 -0.631371
 -1.278444	  0.246822	 -0.650399
 -1.270027	  0.289842	 -0.670738
 -1.262540	  0.331661	 -0.691612
 -1.255415	  0.373685	 -0.712783
 -1.247398	  0.419332	 -0.734559
 -1.237801	  0.466646	 -0.755657
 -1.226250	  0.512648	 -0.775514
 -1.212846	  0.556738	 -0.794058
 -1.197702	  0.599790	 -0.811857
 -1.181565	  0.644056	 -0.829928
 -1.167116	  0.687270	 -0.847367
 -1.154938	  0.732350	 -0.865867
 -1.148894	  0.776423	 -0.883707
 -1.150279	  0.821253	 -0.897175
 -1.162388	  0.876690	 -0.903706
 -1.214015	  0.983743	 -0.898913
 -1.365619	  1.106509	 -0.888203
 -1.557123	  1.157953	 -0.887063
 -1.686755	  1.185979	 -0.896212
 -1.778908	  1.217722	 -0.912318
 -1.853263	  1.268245	 -0.941468
 -1.899926	  1.345159	 -0.986437
 -1.897182	  1.409027	 -1.025794
 -1.872905	  1.451066	 -1.060747
 -1.825708	  1.489346	 -1.103504
 -1.748081	  1.525109	 -1.149964
 -1.626620	  1.547146	 -1.195436
 -1.474983	  1.545115	 -1.225823
 -1.354503	  1.560037	 -1.251647
 -1.255579	  1.580876	 -1.271004
 -1.167126	  1.599368	 -1.280765
 -1.073972	  1.614882	 -1.273455
 -1.010761	  1.666638	 -1.283258
 -0.985304	  1.720858	 -1.303786
 -0.972991	  1.766446	 -1.323970
 -0.963461	  1.810528	 -1.344889
 -0.953592	  1.855642	 -1.364422
 -0.943501	  1.901572	 -1.382782
 -0.933083	  1.948299	 -1.400981
 -0.923159	  1.994102	 -1.418808
 -0.914750	  2.039089	 -1.436567
 -0.907640	  2.083818	 -1.454833
 -0.901618	  2.127847	 -1.473364
 -0.895444	  2.172134	 -1.491678
 -0.889063	  2.217721	 -1.510153
 -0.882640	  2.264706	 -1.528688
 -0.877011	  2.311511	 -1.546276
 -0.871215	  2.357059	 -1.562609
 -0.862140	  2.402980	 -1.575565
 -0.870761	  2.427009	 -1.591321
