 -0.910628	  2.853726	  0.455962
 -0.901612	  2.825472	  0.451448
 -0.866644	  2.796718	  0.437847
 -0.836287	  2.759152	  0.423014
 -0.802896	  2.728885	  0.400549
 -0.773076	  2.694529	  0.383006
 -0.746864	  2.655947	  0.368633
 -0.714423	  2.622912	  0.345582
 -0.683040	  2.588694	  0.326332
 -0.650627	  2.555985	  0.308019
 -0.623136	  2.524071	  0.286211
 -0.594696	  2.492139	  0.264296
 -0.563365	  2.459874	  0.242820
 -0.530761	  2.426066	  0.221732
 -0.498522	  2.392045	  0.202391
 -0.467249	  2.358694	  0.184975
 -0.435296	  2.323898	  0.168293
 -0.404573	  2.288340	  0.151494
 -0.378126	  2.251823	  0.130427
 -0.363705	  2.223406	  0.105086
 -0.358129	  2.204232	  0.075666
 -0.368336	  2.175923	 -0.000135
 -0.407192	  2.127195	 -0.119510
 -0.460585	  2.050727	 -0.227149
 -0.500278	  1.981290	 -0.283841
 -0.539251	  1.941528	 -0.324913
 -0.591649	  1.907263	 -0.355265
 -0.643279	  1.897251	 -0.383473
 -0.638993	  1.899620	 -0.385511
 -0.590557	  1.935263	 -0.367264
 -0.474908	  1.931994	 -0.260268
 -0.391304	  1.734722	  0.089866
 -0.354656	  1.421654	  0.232010
 -0.194986	  1.190573	  0.112296
  0.036852	  1.232499	 -0.045563
  0.058020	  1.266703	 -0.106397
  0.065259	  1.271279	 -0.111616
  0.059191	  1.259201	 -0.095743
  0.044664	  1.231935	 -0.078599
  0.041708	  1.211164	 -0.067216
  0.040649	  1.193155	 -0.056550
  0.050576	  1.154181	 -0.030534
  0.100947	  1.069932	  0.035214
  0.173158	  0.977074	  0.106087
  0.215477	  0.921444	  0.141009
  0.255296	  0.868377	  0.161692
  0.276985	  0.836258	  0.163682
  0.308286	  0.786962	  0.151985
  0.337770	  0.748349	  0.134149
  0.355963	  0.725342	  0.112705
  0.386460	  0.689838	  0.051195
  0.428824	  0.657433	 -0.043972
  0.450440	  0.645534	 -0.110150
  0.457386	  0.640867	 -0.160756
  0.464201	  0.638122	 -0.224529
  0.461422	  0.628259	 -0.323241
  0.469368	  0.605560	 -0.436743
  0.490357	  0.580635	 -0.505157
  0.530770	  0.541315	 -0.568738
  0.549072	  0.517472	 -0.594695
  0.573576	  0.487133	 -0.625486
  0.596490	  0.470388	 -0.642689
  0.626461	  0.453030	 -0.659601
  0.660274	  0.440761	 -0.668553
  0.745052	  0.442659	 -0.695311
  0.823525	  0.459088	 -0.708887
  0.934781	  0.492042	 -0.731991
  1.052939	  0.501656	 -0.757397
  1.111112	  0.484140	 -0.776433
  1.149200	  0.458159	 -0.792873
  1.181579	  0.424596	 -0.809256
  1.210555	  0.386987	 -0.824819
  1.238430	  0.347616	 -0.838692
  1.265682	  0.308994	 -0.850902
  1.295254	  0.268826	 -0.862951
  1.324396	  0.231895	 -0.875879
  1.355618	  0.195321	 -0.892747
  1.387748	  0.161556	 -0.911985
  1.417432	  0.130804	 -0.931443
  1.447619	  0.097635	 -0.953412
  1.478529	  0.063278	 -0.977557
  1.508948	  0.030902	 -1.000705
  1.537618	  0.000432	 -1.022109
  1.568334	 -0.032002	 -1.044089
  1.600713	 -0.067130	 -1.065507
  1.632468	 -0.102637	 -1.084481
  1.662813	 -0.136295	 -1.101185
  1.695160	 -0.171330	 -1.117957
  1.726557	 -0.204543	 -1.133661
  1.757709	 -0.237181	 -1.149363
  1.788573	 -0.270438	 -1.166343
  1.819729	 -0.305118	 -1.184897
  1.848844	 -0.338572	 -1.202973
  1.877443	 -0.373928	 -1.224051
  1.906831	 -0.413353	 -1.239276
  1.939144	 -0.451128	 -1.249936
  1.966477	 -0.484905	 -1.275064
  2.002303	 -0.515863	 -1.291991
  2.032502	 -0.550471	 -1.306975
  2.063696	 -0.583357	 -1.329228
  2.091968	 -0.619019	 -1.350377
  2.122081	 -0.652125	 -1.372657
  2.150496	 -0.688179	 -1.391691
  2.179539	 -0.728254	 -1.402488
  2.212330	 -0.759524	 -1.425326
  2.240353	 -0.800476	 -1.436799
  2.272554	 -0.834456	 -1.451222
  2.300939	 -0.866170	 -1.471159
  2.329153	 -0.904282	 -1.491502
  2.361541	 -0.940105	 -1.509571
  2.386811	 -0.976069	 -1.533109
  2.410679	 -0.985830	 -1.548440
