  0.621395	  0.187670	  2.319516
  0.626126	  0.193980	  2.323797
  0.601108	  0.160614	  2.301161
  0.564036	  0.114675	  2.275103
  0.519117	  0.063301	  2.255818
  0.461273	  0.005194	  2.249914
  0.370508	 -0.064160	  2.273522
  0.224834	 -0.149404	  2.392989
  0.163410	 -0.204319	  2.481049
