 -1.504604	  1.922460	 -0.142853
 -1.524816	  1.955849	 -0.167303
 -1.506498	  1.946859	 -0.158500
 -1.506064	  1.931704	 -0.149671
 -1.509162	  1.907814	 -0.130084
 -1.505629	  1.889112	 -0.112576
 -1.504284	  1.886249	 -0.110002
 -1.500210	  1.872513	 -0.096785
 -1.497766	  1.852467	 -0.076810
 -1.499933	  1.839834	 -0.061963
 -1.502057	  1.831596	 -0.049501
 -1.507040	  1.822115	 -0.033157
 -1.521851	  1.811147	 -0.015082
 -1.536440	  1.804768	 -0.005556
 -1.553094	  1.795820	  0.001292
 -1.572865	  1.785869	  0.012087
 -1.583369	  1.778967	  0.022428
 -1.591064	  1.772911	  0.035675
 -1.600645	  1.761121	  0.060485
 -1.610622	  1.753949	  0.073929
 -1.620724	  1.748075	  0.082570
 -1.638959	  1.741367	  0.095696
 -1.658370	  1.736641	  0.108290
 -1.673831	  1.733082	  0.119777
 -1.686160	  1.731407	  0.129785
 -1.702749	  1.728010	  0.147184
 -1.715284	  1.722595	  0.163978
 -1.723404	  1.715715	  0.178559
 -1.735560	  1.702183	  0.197588
 -1.741860	  1.692880	  0.210218
 -1.749681	  1.684082	  0.222948
 -1.762141	  1.667348	  0.246420
 -1.764783	  1.659498	  0.263284
 -1.764504	  1.654288	  0.280047
 -1.759050	  1.648246	  0.296084
 -1.750887	  1.641304	  0.318476
 -1.744426	  1.631437	  0.337379
 -1.745993	  1.616880	  0.349913
 -1.756510	  1.594095	  0.359448
 -1.761752	  1.574221	  0.375728
 -1.760675	  1.565050	  0.385586
 -1.754209	  1.553016	  0.401728
 -1.749616	  1.538259	  0.416001
 -1.748229	  1.523835	  0.425229
 -1.746878	  1.504704	  0.433936
 -1.743344	  1.486595	  0.441608
 -1.738042	  1.470697	  0.445216
 -1.731529	  1.453991	  0.447083
 -1.728260	  1.433942	  0.451697
 -1.720562	  1.409488	  0.464081
 -1.706847	  1.395973	  0.476241
 -1.688278	  1.385294	  0.483486
 -1.670686	  1.377300	  0.481101
 -1.651435	  1.366072	  0.474323
 -1.633599	  1.356797	  0.465673
 -1.618242	  1.349790	  0.456305
 -1.605003	  1.342001	  0.444057
 -1.591994	  1.333028	  0.430452
 -1.572727	  1.324234	  0.418239
 -1.555132	  1.314280	  0.411146
 -1.539648	  1.305238	  0.407387
 -1.525456	  1.296411	  0.406319
 -1.500797	  1.285293	  0.402898
 -1.480034	  1.281209	  0.395129
 -1.468235	  1.276960	  0.389317
 -1.451091	  1.268479	  0.380917
 -1.437366	  1.255449	  0.373849
 -1.425395	  1.243031	  0.370794
 -1.413976	  1.228760	  0.370387
 -1.395972	  1.208608	  0.371553
 -1.376785	  1.192164	  0.374079
 -1.368433	  1.186534	  0.373548
 -1.359955	  1.178586	  0.371954
 -1.339822	  1.153232	  0.369701
 -1.324254	  1.136577	  0.363990
 -1.315205	  1.126297	  0.362246
 -1.303891	  1.107731	  0.363365
 -1.294033	  1.090158	  0.366223
 -1.285798	  1.074069	  0.373662
 -1.282203	  1.055485	  0.384983
 -1.280993	  1.040195	  0.392031
 -1.276099	  1.019762	  0.401605
 -1.268199	  0.996840	  0.410158
 -1.264736	  0.986848	  0.412565
 -1.249710	  0.964438	  0.418135
 -1.238976	  0.946649	  0.419241
 -1.234809	  0.938418	  0.419435
 -1.223719	  0.909690	  0.420322
 -1.211538	  0.884030	  0.424600
 -1.208231	  0.877483	  0.429029
 -1.201809	  0.865298	  0.435043
 -1.189576	  0.838876	  0.445047
 -1.183636	  0.824157	  0.452790
 -1.178907	  0.811959	  0.460384
 -1.167319	  0.790288	  0.469608
 -1.159069	  0.772372	  0.478218
 -1.150308	  0.756589	  0.487471
 -1.142925	  0.743815	  0.494062
 -1.139067	  0.729041	  0.503108
 -1.134549	  0.711263	  0.517881
 -1.123809	  0.693249	  0.537052
 -1.116337	  0.685581	  0.548799
 -1.105416	  0.677523	  0.557359
 -1.092200	  0.663989	  0.565447
 -1.079516	  0.646926	  0.569935
 -1.068363	  0.626296	  0.576237
 -1.056913	  0.607045	  0.590870
 -1.046827	  0.594097	  0.598125
 -1.042182	  0.584737	  0.604386
 -1.029172	  0.569448	  0.617548
 -1.019567	  0.555389	  0.633889
 -1.012942	  0.545072	  0.643721
 -1.002420	  0.529552	  0.652740
 -0.990726	  0.512022	  0.659670
 -0.981322	  0.501042	  0.664865
 -0.967850	  0.488308	  0.673462
 -0.956638	  0.473946	  0.685516
 -0.951662	  0.458415	  0.697770
 -0.948174	  0.443866	  0.710233
 -0.942400	  0.429024	  0.726268
 -0.934314	  0.408735	  0.749647
 -0.934249	  0.402086	  0.759537
 -0.927720	  0.389846	  0.771518
 -0.925977	  0.372134	  0.789940
 -0.921841	  0.360851	  0.798259
 -0.911949	  0.341091	  0.806586
 -0.906048	  0.329606	  0.812831
 -0.900189	  0.308651	  0.819586
 -0.895394	  0.288010	  0.824683
 -0.889342	  0.272378	  0.836589
 -0.881829	  0.256620	  0.848306
 -0.878081	  0.239464	  0.861504
 -0.878774	  0.223437	  0.873571
 -0.882658	  0.206502	  0.886799
 -0.885811	  0.190472	  0.898626
 -0.887006	  0.176596	  0.911161
 -0.885108	  0.160895	  0.924951
 -0.878047	  0.143300	  0.934661
 -0.866345	  0.122540	  0.939449
 -0.853697	  0.103144	  0.938701
 -0.841816	  0.084750	  0.935342
 -0.827662	  0.067866	  0.935271
 -0.817531	  0.049505	  0.941803
 -0.815782	  0.031007	  0.950824
 -0.816708	  0.017780	  0.957777
 -0.817705	 -0.005659	  0.967037
 -0.813665	 -0.028045	  0.978542
 -0.808617	 -0.040706	  0.985392
 -0.799566	 -0.055869	  0.995014
 -0.789690	 -0.071784	  1.009366
 -0.781844	 -0.085795	  1.019281
 -0.772720	 -0.100842	  1.024931
 -0.762041	 -0.117267	  1.031167
 -0.751179	 -0.136229	  1.041985
 -0.743565	 -0.155641	  1.053951
 -0.739954	 -0.164581	  1.058338
 -0.730742	 -0.182490	  1.064154
 -0.718765	 -0.202813	  1.074764
 -0.710297	 -0.218131	  1.084753
 -0.704577	 -0.227853	  1.091527
 -0.693077	 -0.244705	  1.101744
 -0.683820	 -0.261642	  1.113866
 -0.677969	 -0.274758	  1.124087
 -0.670616	 -0.289184	  1.133286
 -0.658649	 -0.306695	  1.143482
 -0.650081	 -0.319247	  1.153159
 -0.640742	 -0.335167	  1.162969
 -0.630264	 -0.350890	  1.171753
 -0.622636	 -0.364036	  1.178488
 -0.613012	 -0.382450	  1.187930
 -0.606306	 -0.401249	  1.196729
 -0.603155	 -0.414728	  1.203843
 -0.595674	 -0.440213	  1.213916
 -0.589591	 -0.455658	  1.219067
 -0.585954	 -0.466878	  1.222991
 -0.574634	 -0.480115	  1.235350
 -0.558492	 -0.494864	  1.245545
 -0.546329	 -0.514777	  1.254111
 -0.540819	 -0.531804	  1.264079
 -0.538722	 -0.544900	  1.275780
 -0.535061	 -0.558718	  1.291560
 -0.527567	 -0.574721	  1.302914
 -0.519509	 -0.590129	  1.314045
 -0.513103	 -0.605088	  1.325137
 -0.506849	 -0.619964	  1.335891
 -0.498821	 -0.634438	  1.348128
 -0.493869	 -0.649478	  1.359837
 -0.492468	 -0.664423	  1.372536
 -0.489911	 -0.679072	  1.381439
 -0.484336	 -0.699852	  1.388626
 -0.480389	 -0.726626	  1.402431
 -0.480388	 -0.736525	  1.409107
 -0.481322	 -0.751869	  1.420652
 -0.481605	 -0.770381	  1.437182
 -0.480438	 -0.782052	  1.447831
 -0.477229	 -0.800172	  1.459552
 -0.473874	 -0.818495	  1.468869
 -0.471333	 -0.833233	  1.476502
 -0.468712	 -0.855820	  1.490481
 -0.466749	 -0.871909	  1.502303
 -0.464195	 -0.881224	  1.509968
 -0.455317	 -0.894183	  1.526296
 -0.447530	 -0.912143	  1.537644
 -0.443771	 -0.926475	  1.547581
 -0.433320	 -0.943525	  1.560459
 -0.422637	 -0.961888	  1.567688
 -0.416949	 -0.981245	  1.571405
 -0.416659	 -0.997636	  1.574294
 -0.420322	 -1.016793	  1.580860
 -0.415577	 -1.042185	  1.590894
 -0.403621	 -1.063253	  1.594063
 -0.396428	 -1.074680	  1.595211
 -0.386281	 -1.089993	  1.599808
 -0.368560	 -1.114281	  1.610763
 -0.363952	 -1.119747	  1.615339
 -0.356033	 -1.131130	  1.626351
 -0.343010	 -1.151029	  1.644048
 -0.333931	 -1.164697	  1.651934
 -0.326468	 -1.177442	  1.658715
 -0.315677	 -1.197306	  1.668915
 -0.306193	 -1.212690	  1.676998
 -0.298436	 -1.225606	  1.684073
 -0.289311	 -1.241508	  1.693423
 -0.281910	 -1.257211	  1.704056
 -0.275275	 -1.273468	  1.712228
 -0.264591	 -1.289004	  1.718963
 -0.251012	 -1.301898	  1.730477
 -0.241556	 -1.318395	  1.748095
 -0.238957	 -1.328222	  1.756848
 -0.234925	 -1.345686	  1.767927
 -0.230559	 -1.364875	  1.778502
 -0.224947	 -1.380451	  1.791111
 -0.217608	 -1.393735	  1.804259
 -0.204215	 -1.404281	  1.816491
 -0.187866	 -1.413050	  1.828425
 -0.173052	 -1.425535	  1.838611
 -0.162149	 -1.442282	  1.847483
 -0.154507	 -1.459399	  1.853882
 -0.148012	 -1.477547	  1.861771
 -0.143377	 -1.496159	  1.870264
 -0.139207	 -1.514976	  1.878112
 -0.136724	 -1.533566	  1.886260
 -0.134191	 -1.552239	  1.895158
 -0.132404	 -1.567458	  1.906620
 -0.131939	 -1.583832	  1.927503
 -0.125962	 -1.599759	  1.938021
