  1.616490	  1.259453	  2.231959
  1.600485	  1.246983	  2.209860
  1.632048	  1.246176	  2.170388
  1.654643	  1.240389	  2.126353
  1.669061	  1.233878	  2.080375
  1.692378	  1.228894	  2.037567
  1.724042	  1.225646	  2.000419
  1.747330	  1.219950	  1.955278
  1.771172	  1.214492	  1.909303
  1.794080	  1.208176	  1.865294
  1.815975	  1.201734	  1.822472
  1.837291	  1.195911	  1.779382
  1.858146	  1.190962	  1.735794
  1.878616	  1.187125	  1.691721
  1.899860	  1.184580	  1.645760
  1.925839	  1.182536	  1.601115
  1.949398	  1.179152	  1.556572
  1.973977	  1.175014	  1.513732
  1.999555	  1.169348	  1.472880
  2.025911	  1.162715	  1.432388
  2.051879	  1.156142	  1.390223
  2.076023	  1.149856	  1.345721
  2.096791	  1.143887	  1.299556
  2.116258	  1.140295	  1.253696
  2.135712	  1.139260	  1.210061
  2.156178	  1.139882	  1.166432
  2.178362	  1.140533	  1.121813
  2.201298	  1.136154	  1.078893
  2.225036	  1.129026	  1.034416
  2.249982	  1.122027	  0.989584
  2.275826	  1.115805	  0.947032
  2.300773	  1.110412	  0.905905
  2.324011	  1.106305	  0.864609
  2.345863	  1.103960	  0.820306
  2.366568	  1.102708	  0.775713
  2.386110	  1.102146	  0.731513
  2.404833	  1.102001	  0.685966
  2.422500	  1.101884	  0.639851
  2.442626	  1.099691	  0.591434
  2.465099	  1.094330	  0.543496
  2.486590	  1.086310	  0.499434
  2.512123	  1.069255	  0.461838
  2.540715	  1.058225	  0.421638
  2.561359	  1.049282	  0.376327
  2.586460	  1.043606	  0.333860
  2.609056	  1.038938	  0.288821
  2.630848	  1.034773	  0.243594
  2.650330	  1.032001	  0.196652
  2.669620	  1.029936	  0.151218
  2.690136	  1.032454	  0.107419
  2.714839	  1.037937	  0.065138
  2.742047	  1.039528	  0.021909
  2.763841	  1.040471	 -0.022463
  2.787977	  1.033943	 -0.068908
  2.810256	  1.021672	 -0.113169
  2.823109	  1.002207	 -0.160110
  2.851340	  1.012230	 -0.161711
