  0.380237	  1.856874	 -2.363966
  0.376472	  1.838490	 -2.340561
  0.384343	  1.859598	 -2.290457
  0.381253	  1.867041	 -2.238588
  0.376361	  1.873119	 -2.187159
  0.369353	  1.871791	 -2.135196
  0.364380	  1.872180	 -2.086455
  0.363052	  1.876466	 -2.038642
  0.356326	  1.876496	 -1.987625
  0.346355	  1.880198	 -1.937910
  0.338383	  1.883868	 -1.891449
  0.331010	  1.886706	 -1.842505
  0.324385	  1.889786	 -1.791432
  0.317720	  1.892878	 -1.739410
  0.311670	  1.896290	 -1.689335
  0.306905	  1.900827	 -1.639946
  0.304312	  1.906302	 -1.591308
  0.302876	  1.911748	 -1.542956
  0.301805	  1.915484	 -1.493186
  0.301237	  1.919345	 -1.442788
  0.300731	  1.924345	 -1.393750
  0.299327	  1.930214	 -1.343726
  0.295039	  1.937160	 -1.294384
  0.289118	  1.945578	 -1.245316
  0.282392	  1.953103	 -1.196864
  0.276362	  1.957703	 -1.149698
  0.270280	  1.959214	 -1.099411
  0.264547	  1.961209	 -1.048317
  0.257708	  1.965870	 -0.996449
  0.249800	  1.972176	 -0.946546
  0.241209	  1.980488	 -0.898442
  0.233589	  1.992751	 -0.853301
  0.229263	  2.011652	 -0.810965
  0.230288	  2.044455	 -0.766079
  0.249825	  2.119691	 -0.704051
  0.290708	  2.213721	 -0.653597
  0.312538	  2.273009	 -0.611105
  0.337624	  2.369762	 -0.559906
  0.328977	  2.404989	 -0.531929
  0.347552	  2.385700	 -0.485526
  0.327919	  2.404327	 -0.429711
  0.277979	  2.446878	 -0.376082
  0.291565	  2.542183	 -0.351346
  0.376010	  2.673820	 -0.346425
  0.495342	  2.840342	 -0.340605
  0.544801	  3.047321	 -0.277735
  0.540172	  3.007204	 -0.190053
  0.608852	  3.056628	 -0.129688
  0.524792	  3.168928	 -0.070039
  0.474185	  3.037165	  0.032486
  0.494226	  2.949072	  0.095074
  0.495300	  2.897858	  0.139167
  0.437713	  2.838808	  0.192357
  0.315191	  2.799453	  0.244132
  0.237547	  2.695368	  0.260481
  0.183451	  2.510129	  0.278884
  0.111444	  2.321612	  0.339976
  0.091063	  2.189257	  0.412975
  0.096634	  2.165074	  0.477878
  0.096745	  2.171902	  0.528042
  0.095762	  2.180795	  0.578564
  0.092979	  2.187547	  0.631488
  0.087896	  2.191695	  0.681917
  0.080339	  2.193991	  0.730852
  0.071651	  2.194975	  0.779707
  0.063917	  2.195848	  0.828406
  0.055719	  2.196892	  0.878651
  0.047733	  2.197432	  0.929036
  0.040418	  2.197345	  0.978409
  0.033315	  2.196728	  1.027012
  0.025843	  2.195694	  1.073044
  0.017455	  2.194452	  1.122219
  0.009497	  2.194904	  1.172329
  0.001881	  2.197294	  1.223169
 -0.004977	  2.201220	  1.273663
 -0.010797	  2.206236	  1.322454
 -0.015979	  2.211812	  1.369530
 -0.020735	  2.218220	  1.419043
 -0.024030	  2.225420	  1.469186
 -0.026305	  2.233754	  1.517336
 -0.029373	  2.244223	  1.569104
 -0.030152	  2.247036	  1.620788
 -0.030241	  2.248973	  1.670904
 -0.033201	  2.250373	  1.720205
 -0.040738	  2.256410	  1.769697
 -0.045889	  2.255829	  1.816938
 -0.052055	  2.260328	  1.864738
 -0.058185	  2.273965	  1.912567
 -0.063621	  2.269603	  1.960831
 -0.064257	  2.292299	  1.980439
