 -0.664972	  2.221220	  0.758364
 -0.665087	  2.221605	  0.758685
 -0.658008	  2.202025	  0.752038
 -0.651874	  2.187954	  0.737984
 -0.650375	  2.176823	  0.722950
 -0.650702	  2.162650	  0.708070
 -0.651327	  2.148385	  0.695486
 -0.648922	  2.137090	  0.679903
 -0.637606	  2.121779	  0.657141
 -0.629263	  2.106132	  0.644825
 -0.622696	  2.095021	  0.637591
 -0.617927	  2.078664	  0.631255
 -0.618327	  2.058218	  0.618462
 -0.622339	  2.043533	  0.603396
 -0.622172	  2.030027	  0.588834
 -0.615479	  2.013532	  0.572035
 -0.612463	  2.005716	  0.561655
 -0.603540	  1.992942	  0.551038
 -0.598289	  1.976197	  0.532479
 -0.593972	  1.960189	  0.516182
 -0.589143	  1.948690	  0.509074
 -0.579372	  1.937121	  0.504396
 -0.565000	  1.911315	  0.494822
 -0.554731	  1.893286	  0.489588
 -0.546067	  1.876845	  0.487456
 -0.539202	  1.864312	  0.485699
 -0.530051	  1.844687	  0.482156
 -0.523675	  1.824700	  0.474298
 -0.518231	  1.809272	  0.472726
 -0.511212	  1.790416	  0.470260
 -0.505345	  1.768629	  0.466836
 -0.503637	  1.753110	  0.468501
 -0.494403	  1.731484	  0.464413
 -0.489459	  1.711214	  0.455576
 -0.480886	  1.701781	  0.447719
 -0.474347	  1.677444	  0.446353
 -0.466192	  1.657627	  0.441336
 -0.458242	  1.640496	  0.438375
 -0.452624	  1.623374	  0.434781
 -0.450597	  1.610132	  0.436812
 -0.449705	  1.584641	  0.434065
 -0.444910	  1.563997	  0.430636
 -0.440596	  1.544500	  0.427985
 -0.436106	  1.524460	  0.428638
 -0.431664	  1.507425	  0.430078
 -0.429920	  1.488209	  0.430388
 -0.428830	  1.467338	  0.429833
 -0.427199	  1.446387	  0.426938
 -0.425329	  1.424332	  0.422807
 -0.424212	  1.405590	  0.415137
 -0.423813	  1.388839	  0.411631
 -0.421057	  1.368446	  0.408619
 -0.416095	  1.345542	  0.401748
 -0.416429	  1.333297	  0.395827
 -0.417317	  1.314555	  0.386399
 -0.415673	  1.290401	  0.374948
 -0.415811	  1.278953	  0.375086
 -0.418539	  1.254260	  0.374272
 -0.414624	  1.223264	  0.368055
 -0.411426	  1.206156	  0.367392
 -0.408274	  1.196721	  0.368708
 -0.405939	  1.167943	  0.362106
 -0.402584	  1.155380	  0.356664
 -0.399061	  1.140290	  0.347926
 -0.399156	  1.119726	  0.340627
 -0.398195	  1.103043	  0.331284
 -0.395540	  1.083675	  0.321381
 -0.391799	  1.062037	  0.311435
 -0.390627	  1.048353	  0.303179
 -0.387135	  1.029382	  0.292883
 -0.382511	  1.011112	  0.284295
 -0.381335	  0.994243	  0.276688
 -0.381419	  0.980245	  0.270735
 -0.381880	  0.961991	  0.259192
 -0.379878	  0.942376	  0.243135
 -0.378635	  0.926766	  0.229533
 -0.379534	  0.916661	  0.220950
 -0.377628	  0.901904	  0.205426
 -0.376999	  0.888370	  0.189032
 -0.379676	  0.875491	  0.176547
 -0.380485	  0.859284	  0.159557
 -0.378917	  0.851815	  0.147912
 -0.379173	  0.838153	  0.133989
 -0.377928	  0.825053	  0.120217
 -0.385291	  0.806010	  0.107415
 -0.391259	  0.782433	  0.095058
 -0.388898	  0.764091	  0.078908
 -0.377808	  0.762727	  0.065091
 -0.367873	  0.752239	  0.046648
 -0.358596	  0.749306	  0.031704
 -0.345908	  0.733510	  0.006045
 -0.346426	  0.726841	 -0.012616
 -0.347714	  0.721336	 -0.027615
 -0.352921	  0.720703	 -0.050030
 -0.351421	  0.717972	 -0.069316
 -0.345129	  0.710290	 -0.082764
 -0.328922	  0.702140	 -0.108578
 -0.321972	  0.698655	 -0.124082
 -0.315132	  0.696908	 -0.139211
 -0.311248	  0.692517	 -0.159798
 -0.308530	  0.690042	 -0.179454
 -0.304676	  0.688560	 -0.199301
 -0.300723	  0.689048	 -0.218198
 -0.296361	  0.687882	 -0.237641
 -0.292350	  0.686615	 -0.258030
 -0.289140	  0.686598	 -0.275049
 -0.283861	  0.686444	 -0.296519
 -0.276733	  0.687314	 -0.316965
 -0.268432	  0.688735	 -0.330223
 -0.257862	  0.685257	 -0.349511
 -0.251929	  0.682502	 -0.375923
 -0.249136	  0.671994	 -0.386167
 -0.246803	  0.664815	 -0.398788
 -0.243004	  0.652092	 -0.423474
 -0.239926	  0.639090	 -0.430798
 -0.236913	  0.626576	 -0.447226
 -0.235091	  0.609412	 -0.464303
 -0.231919	  0.601125	 -0.471493
 -0.232192	  0.582171	 -0.486366
 -0.230950	  0.560669	 -0.502506
 -0.229480	  0.548352	 -0.508290
 -0.230318	  0.537594	 -0.517531
 -0.231331	  0.519679	 -0.521913
 -0.231236	  0.488678	 -0.524104
 -0.225739	  0.469447	 -0.532369
 -0.224378	  0.454326	 -0.540572
 -0.228692	  0.435073	 -0.552001
 -0.230160	  0.421237	 -0.567574
 -0.227520	  0.407820	 -0.581904
 -0.216337	  0.394080	 -0.601297
 -0.203137	  0.381416	 -0.619116
 -0.199607	  0.372802	 -0.627586
 -0.190797	  0.356328	 -0.639074
 -0.182407	  0.339603	 -0.646883
 -0.175556	  0.315524	 -0.654630
 -0.172929	  0.295213	 -0.659899
 -0.167673	  0.280972	 -0.661863
 -0.163363	  0.262268	 -0.665455
 -0.155492	  0.233029	 -0.673348
 -0.150326	  0.222385	 -0.673557
 -0.138452	  0.204365	 -0.682465
 -0.128110	  0.189250	 -0.692061
 -0.125253	  0.178799	 -0.701548
 -0.116582	  0.159619	 -0.708692
 -0.103101	  0.139319	 -0.718549
 -0.096944	  0.127132	 -0.726005
 -0.091926	  0.108148	 -0.736311
 -0.087442	  0.094838	 -0.741946
 -0.075799	  0.076732	 -0.753836
 -0.068784	  0.060016	 -0.763262
 -0.062986	  0.043864	 -0.769676
 -0.053131	  0.025745	 -0.777916
 -0.044825	  0.014373	 -0.788202
 -0.037097	 -0.001944	 -0.804830
 -0.033328	 -0.013544	 -0.821260
 -0.027099	 -0.024524	 -0.841809
 -0.020592	 -0.032279	 -0.850291
 -0.010108	 -0.043551	 -0.867549
 -0.002009	 -0.050827	 -0.883089
 -0.000014	 -0.066465	 -0.906023
  0.001384	 -0.081481	 -0.921218
  0.000134	 -0.088186	 -0.931173
  0.003409	 -0.104849	 -0.950541
  0.009781	 -0.113340	 -0.965246
  0.005385	 -0.119251	 -0.985884
 -0.001588	 -0.125339	 -1.005393
 -0.005176	 -0.133281	 -1.025650
 -0.006989	 -0.138422	 -1.044097
 -0.009597	 -0.142733	 -1.063862
 -0.012614	 -0.149230	 -1.082451
 -0.011140	 -0.157994	 -1.098131
 -0.005541	 -0.171017	 -1.117640
 -0.000941	 -0.189300	 -1.130835
 -0.000065	 -0.208609	 -1.148711
 -0.002044	 -0.223547	 -1.160159
 -0.004749	 -0.231886	 -1.167775
 -0.011710	 -0.244304	 -1.186381
 -0.012170	 -0.259733	 -1.208426
 -0.004863	 -0.268958	 -1.223155
  0.003152	 -0.279798	 -1.235106
  0.011141	 -0.294346	 -1.244244
  0.021092	 -0.312992	 -1.257084
  0.024579	 -0.328104	 -1.269069
  0.023941	 -0.342133	 -1.281597
  0.026593	 -0.355690	 -1.295097
  0.033409	 -0.373984	 -1.307178
  0.042569	 -0.389974	 -1.315929
  0.046420	 -0.403153	 -1.325467
  0.044261	 -0.419369	 -1.350401
  0.046268	 -0.427550	 -1.369530
  0.049161	 -0.438596	 -1.385189
  0.059974	 -0.457740	 -1.393813
  0.066536	 -0.474381	 -1.399641
  0.078948	 -0.493095	 -1.402184
  0.089266	 -0.510747	 -1.408965
  0.099175	 -0.526490	 -1.424846
  0.104053	 -0.533303	 -1.433798
  0.114799	 -0.545421	 -1.443124
  0.126465	 -0.569106	 -1.459602
  0.129223	 -0.581970	 -1.474775
  0.130091	 -0.590063	 -1.489102
  0.134941	 -0.600699	 -1.505661
  0.141339	 -0.613686	 -1.519079
  0.147487	 -0.627520	 -1.533779
  0.155537	 -0.645839	 -1.547796
  0.160713	 -0.656983	 -1.552124
  0.165712	 -0.679238	 -1.559972
  0.166214	 -0.699100	 -1.569940
  0.170514	 -0.714608	 -1.581793
  0.178492	 -0.726733	 -1.593540
  0.183916	 -0.738883	 -1.601882
  0.183591	 -0.766729	 -1.615504
  0.181124	 -0.781798	 -1.628081
  0.179334	 -0.799091	 -1.637807
  0.179496	 -0.811178	 -1.644216
  0.181420	 -0.829477	 -1.656042
  0.184958	 -0.845128	 -1.667300
  0.188299	 -0.859944	 -1.678163
  0.192638	 -0.883326	 -1.691879
  0.194913	 -0.894989	 -1.699231
  0.200970	 -0.911824	 -1.710991
  0.205496	 -0.930840	 -1.722920
  0.208034	 -0.943087	 -1.730954
  0.212894	 -0.961277	 -1.743455
  0.220736	 -0.979150	 -1.756203
  0.227779	 -0.990895	 -1.766227
  0.234562	 -1.001771	 -1.778902
  0.240198	 -1.017459	 -1.793490
  0.245032	 -1.035714	 -1.804631
  0.249654	 -1.058029	 -1.812567
  0.248160	 -1.076312	 -1.814971
  0.246252	 -1.093168	 -1.820873
  0.250541	 -1.111954	 -1.832831
  0.256057	 -1.127965	 -1.844007
  0.261364	 -1.143531	 -1.855394
  0.266674	 -1.159091	 -1.866783
  0.271519	 -1.174486	 -1.878594
  0.275990	 -1.189739	 -1.890734
  0.280458	 -1.204987	 -1.902879
  0.284853	 -1.219864	 -1.915503
  0.289208	 -1.234532	 -1.928382
  0.293564	 -1.249196	 -1.941266
  0.298275	 -1.263443	 -1.954489
  0.303098	 -1.277553	 -1.967817
  0.307922	 -1.291655	 -1.981153
  0.312725	 -1.304894	 -1.995353
  0.317516	 -1.317782	 -2.009877
  0.322307	 -1.330672	 -2.024409
  0.327181	 -1.343748	 -2.039177
  0.332942	 -1.357562	 -2.056026
  0.338486	 -1.368922	 -2.071525
