 -0.361001	  1.786259	 -1.617018
 -0.353342	  1.810028	 -1.633173
 -0.358763	  1.793206	 -1.621737
 -0.392152	  1.716811	 -1.586685
 -0.406442	  1.618057	 -1.546676
 -0.394402	  1.509696	 -1.508982
 -0.366193	  1.413240	 -1.476368
 -0.329759	  1.332808	 -1.446317
 -0.292890	  1.271409	 -1.418653
 -0.260989	  1.228748	 -1.393504
 -0.237467	  1.203525	 -1.373403
 -0.219085	  1.187581	 -1.355828
 -0.197495	  1.173456	 -1.332429
 -0.165086	  1.155865	 -1.289578
 -0.110530	  1.105366	 -1.173462
 -0.009691	  0.997212	 -1.106273
  0.041619	  0.963111	 -1.067468
  0.110055	  0.946686	 -1.010315
  0.160504	  0.927256	 -0.966444
  0.186144	  0.914524	 -0.940928
  0.202153	  0.904165	 -0.922147
  0.214344	  0.894871	 -0.904665
  0.227661	  0.882361	 -0.881706
  0.243648	  0.863764	 -0.849073
  0.263114	  0.835955	 -0.803177
  0.285299	  0.798309	 -0.746448
  0.307380	  0.753259	 -0.684128
  0.325196	  0.704922	 -0.622127
  0.338146	  0.658265	 -0.564148
  0.347713	  0.615354	 -0.509960
  0.355989	  0.574873	 -0.457481
  0.365386	  0.534156	 -0.402442
  0.376647	  0.494635	 -0.344270
  0.388146	  0.463705	 -0.288656
  0.397056	  0.447439	 -0.242102
  0.407836	  0.461737	 -0.182910
  0.417530	  0.478407	 -0.158499
  0.437996	  0.507619	 -0.136347
  0.471528	  0.547505	 -0.121386
  0.517471	  0.595377	 -0.116903
  0.568912	  0.647026	 -0.124404
  0.618246	  0.698837	 -0.144607
  0.679540	  0.772468	 -0.193077
  0.772317	  0.890976	 -0.232550
  0.906256	  1.078685	 -0.201166
  1.131166	  1.153941	 -0.181675
  1.289394	  1.151980	 -0.232317
  1.399147	  1.167057	 -0.307314
  1.491808	  1.194131	 -0.349685
  1.551803	  1.220247	 -0.364609
  1.593428	  1.244854	 -0.358691
  1.626710	  1.268517	 -0.333787
  1.654568	  1.291767	 -0.292094
  1.679327	  1.312592	 -0.234091
  1.699324	  1.326144	 -0.165102
  1.713125	  1.330662	 -0.084599
  1.720123	  1.323807	  0.008540
  1.721477	  1.302255	  0.110009
  1.722436	  1.266168	  0.210801
  1.727454	  1.218226	  0.304345
  1.739266	  1.161100	  0.386249
  1.759359	  1.097257	  0.454717
  1.788514	  1.031840	  0.508642
  1.827579	  0.969839	  0.549960
  1.871855	  0.916715	  0.581539
  1.917968	  0.872683	  0.608367
  1.963698	  0.836734	  0.633521
  2.007602	  0.808594	  0.657057
  2.046441	  0.787662	  0.678311
  2.080592	  0.771607	  0.697939
  2.112864	  0.758006	  0.717716
  2.145229	  0.745458	  0.738949
  2.178612	  0.733137	  0.762397
  2.230381	  0.714047	  0.801187
  2.252751	  0.705657	  0.818274
