 0.0 0.0 0.0 0
 -0.8517114534668699 0.07028552078854142 -1.318274151870146 1000
 0.30355971174310103 0.8792733721228996 0.27877553503316443 1000
 0.40174307188348446 -0.8563656006062259 -0.08605537538050771 1000
 -0.07502946538977323 0.3401031223631031 0.7898912217500041 1000
 -0.8053676873163866 -0.48813116265739354 -0.7290434480036577 1000
 0.37376983733197944 -0.0913437392132773 -0.3857018258005658 1000
