  0.954407	 -0.867932	  2.144042
  0.952199	 -0.868132	  2.142350
  0.936561	 -0.869545	  2.130368
  0.923495	 -0.867596	  2.114051
  0.908805	 -0.863647	  2.102623
  0.886781	 -0.857401	  2.095362
  0.864503	 -0.854512	  2.088981
  0.846900	 -0.859148	  2.082398
  0.834667	 -0.864158	  2.078833
  0.814082	 -0.870730	  2.073336
  0.795045	 -0.877572	  2.066024
  0.774895	 -0.884685	  2.057225
  0.755836	 -0.891610	  2.049293
  0.740039	 -0.896107	  2.042231
  0.721389	 -0.900208	  2.031686
  0.706345	 -0.898770	  2.015996
  0.689696	 -0.898294	  2.002130
  0.672533	 -0.895739	  1.990350
  0.655214	 -0.893506	  1.982315
  0.637160	 -0.895355	  1.975771
  0.619261	 -0.902011	  1.967924
  0.605481	 -0.908307	  1.955942
  0.588498	 -0.913432	  1.942801
  0.570805	 -0.914519	  1.932174
  0.553539	 -0.916848	  1.923393
  0.536914	 -0.919919	  1.914657
  0.518502	 -0.922072	  1.904922
  0.499455	 -0.922748	  1.897119
  0.480700	 -0.925129	  1.891858
  0.462012	 -0.929463	  1.885755
  0.443578	 -0.932079	  1.876965
  0.425638	 -0.933386	  1.867560
  0.407750	 -0.933323	  1.857797
  0.390119	 -0.931551	  1.847888
  0.372791	 -0.928543	  1.838748
  0.354670	 -0.927776	  1.830458
  0.336518	 -0.927437	  1.821478
  0.317921	 -0.926565	  1.812855
  0.300083	 -0.924325	  1.803024
  0.282276	 -0.921026	  1.794274
  0.265241	 -0.916211	  1.785451
  0.247096	 -0.913928	  1.778235
  0.228966	 -0.912669	  1.770019
  0.211229	 -0.911753	  1.761257
  0.193295	 -0.910877	  1.752177
  0.175394	 -0.909361	  1.743012
  0.158209	 -0.906294	  1.734034
  0.141767	 -0.904046	  1.724028
  0.128687	 -0.904246	  1.712518
  0.112381	 -0.907734	  1.701445
  0.081266	 -0.906374	  1.692929
  0.064463	 -0.901470	  1.688687
  0.047718	 -0.895596	  1.684605
  0.028033	 -0.888769	  1.678801
  0.009337	 -0.881009	  1.671591
 -0.003238	 -0.877252	  1.665215
 -0.024010	 -0.876943	  1.655395
 -0.043980	 -0.877140	  1.645129
 -0.060747	 -0.874756	  1.633612
 -0.073223	 -0.869527	  1.626993
 -0.091739	 -0.858724	  1.617740
 -0.114034	 -0.854036	  1.606739
 -0.129300	 -0.856866	  1.601763
 -0.153278	 -0.859663	  1.593775
 -0.171864	 -0.856930	  1.590302
 -0.188426	 -0.852168	  1.591884
 -0.210621	 -0.848917	  1.589520
 -0.228856	 -0.851559	  1.582210
 -0.247720	 -0.854348	  1.576205
 -0.268917	 -0.852382	  1.573707
 -0.290673	 -0.848958	  1.571738
 -0.310284	 -0.842550	  1.564180
 -0.325620	 -0.840613	  1.550333
 -0.335309	 -0.842976	  1.541469
 -0.356785	 -0.852994	  1.525538
 -0.382425	 -0.858050	  1.518246
 -0.403635	 -0.854603	  1.519366
 -0.415824	 -0.851919	  1.519098
 -0.437133	 -0.843812	  1.521659
 -0.458554	 -0.840213	  1.516689
 -0.479516	 -0.840764	  1.506873
 -0.494574	 -0.842925	  1.498116
 -0.514901	 -0.849219	  1.484300
 -0.537337	 -0.855669	  1.472762
 -0.545396	 -0.857094	  1.469490
 -0.565222	 -0.862162	  1.467812
 -0.588229	 -0.862521	  1.466682
 -0.609091	 -0.863585	  1.464630
 -0.628672	 -0.863174	  1.461932
 -0.647843	 -0.868637	  1.460036
 -0.667850	 -0.877093	  1.458774
 -0.686313	 -0.881586	  1.457875
 -0.707232	 -0.884966	  1.459828
 -0.731903	 -0.885296	  1.456853
 -0.755628	 -0.873785	  1.460003
 -0.770543	 -0.865848	  1.461541
 -0.799221	 -0.855494	  1.460648
 -0.816552	 -0.848303	  1.462731
 -0.827101	 -0.844135	  1.466675
 -0.838393	 -0.833023	  1.480043
 -0.852991	 -0.815505	  1.495960
 -0.869580	 -0.803779	  1.502487
 -0.893413	 -0.789319	  1.501817
 -0.908230	 -0.767693	  1.502617
 -0.915777	 -0.753717	  1.504743
 -0.925996	 -0.736791	  1.511030
 -0.941061	 -0.724637	  1.525025
 -0.954860	 -0.721410	  1.545470
 -0.965361	 -0.718620	  1.566497
 -0.973976	 -0.711250	  1.581512
 -0.986564	 -0.697902	  1.587406
 -1.001539	 -0.681744	  1.587220
 -1.021606	 -0.669806	  1.583009
 -1.038706	 -0.662964	  1.584131
 -1.053891	 -0.655539	  1.593657
 -1.074761	 -0.652454	  1.599268
 -1.094111	 -0.655152	  1.598581
 -1.115147	 -0.657087	  1.596616
 -1.135299	 -0.658275	  1.594200
 -1.154886	 -0.656982	  1.589700
 -1.173952	 -0.655170	  1.583830
 -1.192905	 -0.652867	  1.577895
 -1.211904	 -0.650705	  1.572025
 -1.230914	 -0.648616	  1.566166
 -1.249426	 -0.645564	  1.559227
 -1.267715	 -0.642111	  1.551909
 -1.286003	 -0.638656	  1.544584
 -1.304300	 -0.635228	  1.537272
 -1.322758	 -0.631948	  1.530306
 -1.341303	 -0.628747	  1.523537
 -1.359844	 -0.625610	  1.516747
 -1.378119	 -0.625302	  1.508774
 -1.392756	 -0.633917	  1.498316
 -1.407309	 -0.642730	  1.487809
 -1.422025	 -0.651325	  1.477350
 -1.437944	 -0.658018	  1.467273
 -1.453917	 -0.664643	  1.457225
 -1.469890	 -0.671268	  1.447176
 -1.485861	 -0.677892	  1.437128
 -1.501720	 -0.684492	  1.426948
 -1.512426	 -0.689442	  1.410845
 -1.521603	 -0.694424	  1.393848
 -1.530714	 -0.700571	  1.377054
 -1.539800	 -0.706569	  1.360104
 -1.548939	 -0.711380	  1.342855
 -1.557855	 -0.714328	  1.325778
 -1.561086	 -0.720297	  1.309077
 -1.561920	 -0.727256	  1.288531
 -1.563487	 -0.719394	  1.260611
 -1.567743	 -0.716142	  1.244325
 -1.575943	 -0.713803	  1.229973
 -1.588802	 -0.712011	  1.209658
 -1.593055	 -0.713444	  1.187917
 -1.592876	 -0.717761	  1.169593
 -1.596038	 -0.719529	  1.150475
 -1.605346	 -0.718937	  1.131352
 -1.613572	 -0.718902	  1.116845
 -1.624401	 -0.716707	  1.102851
 -1.638415	 -0.713794	  1.081197
 -1.647383	 -0.716301	  1.060303
 -1.653767	 -0.720828	  1.044143
 -1.656924	 -0.727190	  1.025033
 -1.657700	 -0.726504	  1.000983
 -1.661525	 -0.724716	  0.978686
 -1.670872	 -0.726840	  0.960159
 -1.688326	 -0.730402	  0.947762
 -1.706748	 -0.732603	  0.937594
 -1.723905	 -0.734702	  0.928923
 -1.740319	 -0.737472	  0.919105
 -1.758225	 -0.739690	  0.908094
 -1.775631	 -0.743442	  0.898273
 -1.794590	 -0.749389	  0.889010
 -1.809723	 -0.752352	  0.881557
 -1.830495	 -0.755485	  0.874229
 -1.851093	 -0.756472	  0.865062
 -1.862392	 -0.756278	  0.859348
 -1.881970	 -0.761186	  0.851461
 -1.904893	 -0.772688	  0.846812
 -1.919100	 -0.777655	  0.843189
 -1.938976	 -0.788161	  0.841782
 -1.959395	 -0.784942	  0.836412
 -1.980008	 -0.781958	  0.828590
 -1.999499	 -0.782881	  0.823222
 -2.018905	 -0.784647	  0.818700
 -2.038224	 -0.786447	  0.813847
 -2.057309	 -0.788295	  0.808163
 -2.076390	 -0.790146	  0.802464
 -2.095450	 -0.791983	  0.796702
 -2.113776	 -0.793101	  0.788775
 -2.132085	 -0.794212	  0.780803
 -2.150387	 -0.795292	  0.772807
 -2.168339	 -0.796103	  0.764024
 -2.186231	 -0.796897	  0.755123
 -2.204226	 -0.797638	  0.746425
 -2.222378	 -0.798349	  0.738067
 -2.255449	 -0.799427	  0.723787
 -2.259110	 -0.799521	  0.722288
