 -0.303002	  1.546502	 -1.961211
 -0.308623	  1.529919	 -1.952972
 -0.308763	  1.529506	 -1.952767
 -0.313091	  1.513079	 -1.942962
 -0.319445	  1.496455	 -1.929433
 -0.321385	  1.479433	 -1.919937
 -0.314745	  1.462258	 -1.916714
 -0.304868	  1.436627	 -1.920462
 -0.302744	  1.410953	 -1.915622
 -0.303803	  1.398446	 -1.910428
 -0.305168	  1.381010	 -1.897732
 -0.301013	  1.363013	 -1.888223
 -0.293618	  1.345539	 -1.884026
 -0.283627	  1.327612	 -1.882959
 -0.276536	  1.310397	 -1.880856
 -0.266833	  1.290109	 -1.879417
 -0.254889	  1.270547	 -1.879266
 -0.245234	  1.252951	 -1.873871
 -0.238980	  1.236138	 -1.868676
 -0.233724	  1.219931	 -1.862279
 -0.226257	  1.203617	 -1.853477
 -0.220401	  1.184577	 -1.842421
 -0.218335	  1.163039	 -1.831110
 -0.214122	  1.147018	 -1.823710
 -0.204978	  1.129978	 -1.818714
 -0.191864	  1.112289	 -1.813940
 -0.179690	  1.100301	 -1.808521
 -0.166561	  1.084785	 -1.796993
 -0.156015	  1.069086	 -1.787260
 -0.145846	  1.054498	 -1.778519
 -0.133275	  1.042291	 -1.767804
 -0.119736	  1.032590	 -1.756327
 -0.105858	  1.022219	 -1.746521
 -0.091714	  1.008842	 -1.737859
 -0.077104	  0.996671	 -1.727650
 -0.063210	  0.986672	 -1.714914
 -0.051041	  0.978016	 -1.699099
 -0.041334	  0.968539	 -1.683601
 -0.032945	  0.957859	 -1.669725
 -0.023766	  0.947160	 -1.656942
 -0.007094	  0.939947	 -1.635613
  0.008370	  0.936057	 -1.616998
  0.013526	  0.932135	 -1.611518
  0.024572	  0.923599	 -1.599688
  0.035540	  0.911438	 -1.584629
  0.053586	  0.900782	 -1.569344
  0.066626	  0.897587	 -1.561644
  0.080741	  0.893509	 -1.555420
  0.097779	  0.882957	 -1.547032
  0.113512	  0.873658	 -1.536002
  0.124645	  0.867912	 -1.530098
  0.136623	  0.857385	 -1.522463
  0.151670	  0.840624	 -1.510329
  0.165508	  0.827773	 -1.499679
  0.177500	  0.816491	 -1.489359
  0.188758	  0.806580	 -1.480729
  0.201247	  0.798925	 -1.466870
  0.219681	  0.797082	 -1.446425
  0.238325	  0.794752	 -1.431914
  0.248268	  0.794410	 -1.423313
  0.263198	  0.788646	 -1.410479
  0.277391	  0.787242	 -1.395499
  0.294686	  0.780515	 -1.384279
  0.306783	  0.774442	 -1.374352
  0.319961	  0.767123	 -1.362422
  0.335108	  0.751304	 -1.346179
  0.342324	  0.745824	 -1.338829
  0.361042	  0.735117	 -1.319784
  0.378601	  0.722321	 -1.306905
  0.387061	  0.719508	 -1.300968
  0.400876	  0.714503	 -1.290358
  0.414575	  0.706774	 -1.276030
  0.430205	  0.698129	 -1.262031
  0.445658	  0.693162	 -1.243931
  0.456757	  0.689232	 -1.228560
  0.468300	  0.683526	 -1.216207
  0.477444	  0.673025	 -1.203915
  0.487970	  0.661434	 -1.189506
  0.499702	  0.649979	 -1.175669
  0.505845	  0.637856	 -1.145683
  0.500978	  0.635407	 -1.116569
  0.499600	  0.634047	 -1.104373
  0.501409	  0.630737	 -1.083247
  0.517940	  0.613342	 -1.065381
  0.533525	  0.600016	 -1.052681
  0.539780	  0.593460	 -1.045815
  0.550359	  0.584685	 -1.032912
  0.561181	  0.571287	 -1.012800
  0.564795	  0.563569	 -1.001950
  0.568484	  0.553514	 -0.989754
  0.571448	  0.538612	 -0.969963
  0.575382	  0.526145	 -0.955440
  0.579643	  0.513244	 -0.940715
  0.583346	  0.504110	 -0.924317
  0.587272	  0.495944	 -0.904821
  0.589829	  0.484384	 -0.884069
  0.592873	  0.473621	 -0.871583
  0.601102	  0.461426	 -0.861610
  0.604598	  0.440756	 -0.854425
  0.604510	  0.422169	 -0.840898
  0.609403	  0.411112	 -0.823002
  0.616136	  0.398496	 -0.800334
  0.617879	  0.389540	 -0.787154
  0.617727	  0.378020	 -0.771529
  0.616511	  0.365727	 -0.752516
  0.616088	  0.357770	 -0.733618
  0.617175	  0.353044	 -0.717248
  0.621136	  0.345331	 -0.699002
  0.626454	  0.334707	 -0.680009
  0.628846	  0.321975	 -0.659446
  0.629922	  0.311709	 -0.645820
  0.630536	  0.299471	 -0.634146
  0.635178	  0.279673	 -0.618467
  0.638881	  0.267066	 -0.606799
  0.643210	  0.257417	 -0.593344
  0.648010	  0.243416	 -0.574525
  0.655093	  0.230183	 -0.561219
  0.666058	  0.217656	 -0.542646
  0.674400	  0.211027	 -0.525299
  0.679428	  0.206725	 -0.514658
  0.686411	  0.192629	 -0.490932
  0.690000	  0.178982	 -0.476654
  0.692598	  0.167997	 -0.467158
  0.694761	  0.148212	 -0.446113
  0.694803	  0.140532	 -0.422310
  0.693590	  0.140978	 -0.405127
  0.691633	  0.142197	 -0.387407
  0.692253	  0.140120	 -0.365062
  0.694888	  0.138090	 -0.344535
  0.696778	  0.134921	 -0.325413
  0.696650	  0.124874	 -0.306526
  0.698666	  0.112415	 -0.285141
  0.703276	  0.108912	 -0.263162
  0.708425	  0.116824	 -0.244090
  0.713048	  0.128023	 -0.227277
  0.716744	  0.136115	 -0.207227
  0.720344	  0.141123	 -0.187767
  0.723862	  0.145814	 -0.168616
  0.727466	  0.150718	 -0.149593
  0.732084	  0.157810	 -0.131574
  0.738121	  0.168062	 -0.115581
  0.744460	  0.178869	 -0.100022
  0.751737	  0.190568	 -0.085672
  0.761184	  0.204129	 -0.074817
  0.771488	  0.217148	 -0.066598
  0.788217	  0.223290	 -0.066511
  0.816936	  0.230365	 -0.066118
  0.832992	  0.247804	 -0.060834
  0.839369	  0.268339	 -0.056657
  0.844180	  0.283368	 -0.054307
  0.858118	  0.300008	 -0.053083
  0.868756	  0.317735	 -0.053884
  0.878500	  0.336455	 -0.056566
  0.891553	  0.350865	 -0.059838
  0.902699	  0.364929	 -0.063342
  0.914808	  0.381602	 -0.066307
  0.934420	  0.397374	 -0.075970
  0.947695	  0.402729	 -0.082667
  0.964893	  0.407128	 -0.088428
  0.986378	  0.419762	 -0.095377
  1.004975	  0.436956	 -0.097223
  1.013875	  0.451833	 -0.101055
  1.017046	  0.471060	 -0.113808
  1.019308	  0.484690	 -0.129474
  1.029855	  0.499286	 -0.141156
  1.041672	  0.513990	 -0.148684
  1.053578	  0.529126	 -0.154073
  1.065395	  0.544103	 -0.159059
  1.077817	  0.556190	 -0.163007
  1.091991	  0.565905	 -0.172832
  1.102081	  0.584061	 -0.188952
  1.116499	  0.603918	 -0.188677
  1.128930	  0.617900	 -0.178705
  1.142460	  0.629203	 -0.166891
  1.157923	  0.641467	 -0.162970
  1.170809	  0.651663	 -0.167659
  1.181275	  0.657564	 -0.177590
  1.192121	  0.666406	 -0.183882
  1.206260	  0.672430	 -0.188543
  1.225040	  0.680717	 -0.189634
  1.243804	  0.686377	 -0.192573
  1.262906	  0.691725	 -0.196198
  1.281982	  0.694037	 -0.202780
  1.299931	  0.689915	 -0.212794
  1.311254	  0.687605	 -0.227643
  1.327553	  0.683739	 -0.241389
  1.344738	  0.691015	 -0.254496
  1.352304	  0.698980	 -0.261018
  1.364094	  0.711018	 -0.268469
  1.391536	  0.729606	 -0.285509
  1.411836	  0.735410	 -0.296971
  1.428633	  0.739151	 -0.302357
  1.453983	  0.747714	 -0.308737
  1.470889	  0.761406	 -0.316421
  1.480307	  0.768558	 -0.322456
  1.493301	  0.770736	 -0.331683
  1.517218	  0.769369	 -0.340068
  1.537212	  0.758130	 -0.347365
  1.555233	  0.746591	 -0.351201
  1.577080	  0.742649	 -0.359086
  1.594581	  0.745609	 -0.363505
  1.615484	  0.752907	 -0.365828
  1.635439	  0.760625	 -0.373561
  1.647824	  0.767598	 -0.384713
  1.659920	  0.774099	 -0.395515
  1.678694	  0.780026	 -0.404399
  1.697777	  0.786082	 -0.408385
  1.716551	  0.791780	 -0.409021
  1.735957	  0.797500	 -0.406989
  1.751798	  0.809300	 -0.404035
  1.766428	  0.831735	 -0.401430
  1.777646	  0.846626	 -0.404461
  1.787654	  0.858345	 -0.405374
  1.805684	  0.868621	 -0.400408
  1.823050	  0.875512	 -0.396322
  1.839229	  0.882047	 -0.393201
  1.855127	  0.889061	 -0.392837
  1.872003	  0.898098	 -0.389387
  1.887315	  0.908600	 -0.379054
  1.901821	  0.917698	 -0.368929
  1.914777	  0.926293	 -0.358037
  1.926988	  0.934997	 -0.346061
  1.937428	  0.943981	 -0.331511
  1.947380	  0.951795	 -0.316119
  1.955858	  0.959346	 -0.299968
  1.964290	  0.966312	 -0.283553
  1.972003	  0.972454	 -0.266209
  1.978054	  0.977922	 -0.248065
  1.985077	  0.982105	 -0.230017
  1.991166	  0.985384	 -0.211240
  1.995724	  0.987829	 -0.192294
  2.002170	  0.985554	 -0.174103
  2.009741	  0.977710	 -0.156286
  2.014155	  0.969440	 -0.137072
  2.014663	  0.966407	 -0.114548
  2.014648	  0.972381	 -0.091476
  2.017596	  0.978063	 -0.072412
  2.020416	  0.982085	 -0.053760
  2.019606	  0.980609	 -0.034884
  2.017230	  0.976023	 -0.016406
  2.016094	  0.967662	  0.002755
  2.016172	  0.958765	  0.020035
  2.017339	  0.950111	  0.038064
  2.018256	  0.942256	  0.055753
  2.021220	  0.934043	  0.072429
  2.024492	  0.926988	  0.088771
  2.030372	  0.919928	  0.105396
  2.038257	  0.911998	  0.121282
  2.043184	  0.900589	  0.136480
  2.047106	  0.882505	  0.147541
  2.052290	  0.860662	  0.154023
  2.057890	  0.846411	  0.157655
  2.068605	  0.831094	  0.168480
  2.078295	  0.823944	  0.182993
  2.094099	  0.810087	  0.203216
  2.110859	  0.800787	  0.214783
  2.122822	  0.794945	  0.221353
  2.142923	  0.787559	  0.229324
  2.160933	  0.782143	  0.236024
  2.175901	  0.776296	  0.239973
  2.198377	  0.760428	  0.248266
  2.209085	  0.749870	  0.254479
  2.219159	  0.738012	  0.260324
  2.238502	  0.722633	  0.268242
  2.259263	  0.715106	  0.275528
  2.274632	  0.710395	  0.280854
  2.290404	  0.703344	  0.285439
  2.308358	  0.694836	  0.295193
  2.323610	  0.691491	  0.309866
  2.340069	  0.692627	  0.332245
  2.353823	  0.694049	  0.345839
  2.377089	  0.685888	  0.359176
  2.382593	  0.682587	  0.361492
