 -1.838952	 -1.383054	  0.984472
 -1.881596	 -1.382199	  0.999239
 -1.862856	 -1.382704	  0.992275
 -1.844281	 -1.383702	  0.985059
 -1.825790	 -1.385714	  0.977565
 -1.807307	 -1.387666	  0.969885
 -1.788618	 -1.388559	  0.962713
 -1.770382	 -1.389433	  0.955886
 -1.751626	 -1.391600	  0.949550
 -1.733036	 -1.390123	  0.942978
 -1.714777	 -1.392804	  0.934645
 -1.693842	 -1.393734	  0.927026
 -1.674922	 -1.388580	  0.920421
 -1.655703	 -1.379608	  0.912214
 -1.641378	 -1.376004	  0.905818
 -1.621534	 -1.381475	  0.899210
 -1.602867	 -1.384496	  0.887140
 -1.581344	 -1.384341	  0.868461
 -1.570771	 -1.383451	  0.859252
 -1.558968	 -1.380841	  0.851175
 -1.536451	 -1.380156	  0.843656
 -1.518830	 -1.380951	  0.835612
 -1.499883	 -1.379012	  0.826362
 -1.481926	 -1.376685	  0.817717
 -1.465252	 -1.376139	  0.811656
 -1.445302	 -1.374920	  0.807028
 -1.423374	 -1.367464	  0.794697
 -1.409152	 -1.363151	  0.783846
 -1.397535	 -1.360632	  0.771909
 -1.381194	 -1.355194	  0.757957
 -1.362340	 -1.346985	  0.750015
 -1.342451	 -1.339223	  0.745455
 -1.323464	 -1.333982	  0.743860
 -1.305877	 -1.329413	  0.742766
 -1.286098	 -1.322460	  0.738263
 -1.265563	 -1.313526	  0.725736
 -1.255418	 -1.309766	  0.717642
 -1.239654	 -1.301277	  0.702789
 -1.226384	 -1.291082	  0.691808
 -1.213228	 -1.279473	  0.682637
 -1.188551	 -1.264290	  0.669522
 -1.179376	 -1.258526	  0.665656
 -1.164895	 -1.254074	  0.661610
 -1.138275	 -1.244279	  0.653520
 -1.120621	 -1.238782	  0.646431
 -1.107745	 -1.232290	  0.641103
 -1.093751	 -1.221025	  0.635333
 -1.077531	 -1.207506	  0.625389
 -1.061225	 -1.201923	  0.614091
 -1.048181	 -1.197224	  0.603492
 -1.033244	 -1.186886	  0.591586
 -1.015490	 -1.175019	  0.581244
 -1.004690	 -1.169371	  0.575862
 -0.989821	 -1.160730	  0.564143
 -0.976676	 -1.150767	  0.556388
 -0.964610	 -1.133357	  0.557311
 -0.940843	 -1.117902	  0.556582
 -0.922453	 -1.109244	  0.553165
 -0.908885	 -1.100642	  0.552687
 -0.890162	 -1.090022	  0.553196
 -0.869992	 -1.082924	  0.548350
 -0.856389	 -1.075636	  0.545791
 -0.834747	 -1.063874	  0.542434
 -0.819542	 -1.057331	  0.538649
 -0.804014	 -1.048709	  0.535561
 -0.784127	 -1.034654	  0.535960
 -0.772941	 -1.027920	  0.535567
 -0.757250	 -1.016448	  0.540327
 -0.735504	 -1.003745	  0.542068
 -0.719190	 -0.993893	  0.544103
 -0.704455	 -0.984686	  0.544992
 -0.686624	 -0.974750	  0.543847
 -0.669337	 -0.967410	  0.543910
 -0.648857	 -0.961450	  0.544580
 -0.616015	 -0.955469	  0.544161
 -0.607420	 -0.953845	  0.543426
 -0.590432	 -0.950603	  0.543366
 -0.567241	 -0.945973	  0.540792
 -0.552287	 -0.943953	  0.538495
 -0.526161	 -0.941700	  0.532857
 -0.506566	 -0.941771	  0.527325
 -0.494619	 -0.942322	  0.524070
 -0.474249	 -0.943006	  0.518568
 -0.447583	 -0.945378	  0.512003
 -0.434811	 -0.948307	  0.509743
 -0.423147	 -0.953560	  0.505498
 -0.392357	 -0.959362	  0.492286
 -0.380891	 -0.963482	  0.486674
 -0.372553	 -0.964858	  0.481904
 -0.345461	 -0.973337	  0.468250
 -0.328359	 -0.979360	  0.456271
 -0.317305	 -0.979606	  0.452369
 -0.299721	 -0.987859	  0.444678
 -0.277931	 -0.993905	  0.433381
 -0.263955	 -0.998164	  0.425458
 -0.248416	 -1.004005	  0.418594
 -0.229001	 -1.010051	  0.409141
 -0.210592	 -1.015787	  0.396979
 -0.199438	 -1.019779	  0.389258
 -0.184474	 -1.026599	  0.378089
 -0.169612	 -1.038897	  0.364371
 -0.154191	 -1.048403	  0.350695
 -0.144388	 -1.054693	  0.343229
 -0.128916	 -1.063844	  0.331511
 -0.113351	 -1.073652	  0.318559
 -0.100511	 -1.083199	  0.306534
 -0.082348	 -1.091264	  0.297544
 -0.061895	 -1.098762	  0.288738
 -0.046885	 -1.102052	  0.278615
 -0.033265	 -1.098418	  0.264093
 -0.018156	 -1.094102	  0.245817
  0.000016	 -1.093417	  0.230155
  0.014906	 -1.093349	  0.218672
  0.027085	 -1.092734	  0.208371
  0.046442	 -1.088332	  0.195744
  0.070264	 -1.087110	  0.190331
  0.086983	 -1.090861	  0.188082
  0.105597	 -1.097439	  0.178937
  0.122438	 -1.101858	  0.167120
  0.138696	 -1.104289	  0.155693
  0.155268	 -1.105988	  0.144380
  0.171101	 -1.107248	  0.132681
  0.187152	 -1.107947	  0.120668
  0.203234	 -1.108017	  0.108700
  0.219742	 -1.107759	  0.097330
  0.236362	 -1.107592	  0.086200
  0.253293	 -1.106558	  0.075605
  0.270295	 -1.105344	  0.065142
  0.287620	 -1.102740	  0.055500
  0.305075	 -1.099389	  0.046330
  0.322500	 -1.095905	  0.037169
  0.339136	 -1.089501	  0.028121
  0.355744	 -1.082990	  0.019078
  0.372342	 -1.076468	  0.010026
  0.388339	 -1.069491	  0.000283
  0.401290	 -1.060747	 -0.012181
  0.414170	 -1.051955	 -0.024704
  0.427049	 -1.043162	 -0.037227
  0.439866	 -1.034372	 -0.049802
  0.449743	 -1.025749	 -0.064893
  0.458804	 -1.017214	 -0.080547
  0.467846	 -1.008686	 -0.096216
  0.476601	 -1.000415	 -0.112175
  0.483906	 -0.993257	 -0.129341
  0.490637	 -0.985709	 -0.146619
  0.497086	 -0.978416	 -0.164125
  0.504563	 -0.972485	 -0.181114
  0.513187	 -0.965505	 -0.192813
  0.515419	 -0.958153	 -0.210258
  0.516246	 -0.959405	 -0.238842
  0.523457	 -0.958160	 -0.270090
  0.532186	 -0.959939	 -0.282828
  0.540641	 -0.960258	 -0.293515
  0.555415	 -0.961163	 -0.311682
  0.570429	 -0.958677	 -0.333930
  0.580614	 -0.959047	 -0.344720
  0.590728	 -0.957893	 -0.359196
  0.610550	 -0.955011	 -0.377633
  0.622244	 -0.952966	 -0.387115
  0.635066	 -0.950129	 -0.401069
  0.647829	 -0.948881	 -0.420566
  0.658362	 -0.947813	 -0.437472
  0.669215	 -0.945254	 -0.451338
  0.687611	 -0.942879	 -0.469177
  0.699545	 -0.943103	 -0.476134
  0.715477	 -0.946143	 -0.483333
  0.738753	 -0.950023	 -0.494629
  0.755396	 -0.950484	 -0.512563
  0.765319	 -0.948885	 -0.523130
  0.781769	 -0.944549	 -0.536176
  0.801015	 -0.937337	 -0.548200
  0.815362	 -0.933272	 -0.558003
  0.834057	 -0.928929	 -0.569394
  0.851190	 -0.927354	 -0.580490
  0.869236	 -0.927704	 -0.592425
  0.890396	 -0.931588	 -0.606122
  0.903633	 -0.933560	 -0.614603
  0.926981	 -0.940087	 -0.620817
  0.947305	 -0.946671	 -0.623441
  0.967159	 -0.953302	 -0.623440
  0.988831	 -0.962407	 -0.620677
  1.005932	 -0.969470	 -0.619205
  1.018132	 -0.977091	 -0.618537
  1.038725	 -0.985020	 -0.624016
  1.058529	 -0.989634	 -0.633139
  1.077181	 -0.998151	 -0.640662
  1.093359	 -1.008559	 -0.644036
  1.109692	 -1.019366	 -0.642843
  1.128456	 -1.030624	 -0.641678
  1.145715	 -1.041749	 -0.644064
  1.162306	 -1.050169	 -0.650724
  1.178749	 -1.056226	 -0.658983
  1.196640	 -1.062992	 -0.668734
  1.213479	 -1.071494	 -0.676541
  1.230390	 -1.080070	 -0.682303
  1.247396	 -1.086352	 -0.688332
  1.265004	 -1.092316	 -0.695316
  1.282983	 -1.099870	 -0.702731
  1.300120	 -1.108249	 -0.708753
  1.317699	 -1.116136	 -0.714171
  1.335496	 -1.123409	 -0.717042
  1.354896	 -1.129078	 -0.719473
  1.373153	 -1.134183	 -0.723765
  1.390566	 -1.140080	 -0.730807
  1.409266	 -1.148177	 -0.740634
  1.427911	 -1.154632	 -0.753300
  1.442261	 -1.157095	 -0.763016
  1.463915	 -1.153499	 -0.771035
  1.482775	 -1.150087	 -0.769711
  1.505016	 -1.148021	 -0.767671
  1.525611	 -1.145460	 -0.765576
  1.545587	 -1.141385	 -0.764546
  1.565275	 -1.136898	 -0.762626
  1.584101	 -1.132111	 -0.759066
  1.603176	 -1.126955	 -0.755056
  1.621439	 -1.120604	 -0.749675
  1.639404	 -1.113828	 -0.744000
  1.656403	 -1.105754	 -0.737188
  1.672647	 -1.096871	 -0.729621
  1.688871	 -1.087956	 -0.722049
  1.704532	 -1.078118	 -0.714440
  1.719488	 -1.067244	 -0.706820
  1.734426	 -1.056348	 -0.699197
  1.749368	 -1.045452	 -0.691581
  1.764323	 -1.034384	 -0.684253
  1.779329	 -1.022197	 -0.679144
  1.794327	 -1.009967	 -0.674094
  1.809325	 -0.997738	 -0.669044
  1.824307	 -0.985494	 -0.664009
  1.839025	 -0.972869	 -0.659404
  1.854102	 -0.959774	 -0.658601
  1.869640	 -0.947114	 -0.658604
  1.885637	 -0.935038	 -0.658265
  1.901687	 -0.923056	 -0.657766
  1.917512	 -0.910979	 -0.655895
  1.933116	 -0.899103	 -0.655252
  1.949338	 -0.887469	 -0.657183
  1.965521	 -0.875995	 -0.659924
  1.981680	 -0.864543	 -0.662706
  1.997869	 -0.853173	 -0.665595
  2.014606	 -0.843572	 -0.670806
  2.031383	 -0.834110	 -0.676191
  2.048160	 -0.824653	 -0.681586
  2.064985	 -0.815406	 -0.687183
  2.082059	 -0.807877	 -0.694372
  2.099138	 -0.800382	 -0.701591
  2.116219	 -0.792897	 -0.708818
  2.133374	 -0.786615	 -0.716954
  2.150532	 -0.780807	 -0.725432
  2.167689	 -0.775020	 -0.733924
  2.184826	 -0.770132	 -0.743003
  2.201932	 -0.765681	 -0.752360
  2.219037	 -0.761253	 -0.761730
  2.236079	 -0.757804	 -0.771611
  2.253103	 -0.754547	 -0.781590
  2.270129	 -0.751301	 -0.791575
  2.287149	 -0.748501	 -0.801731
  2.304142	 -0.745935	 -0.811961
