 -0.045536	  1.675711	 -1.712457
 -0.029806	  1.710332	 -1.736112
 -0.014076	  1.744953	 -1.759767
 -0.021478	  1.729971	 -1.748778
 -0.028827	  1.714917	 -1.737853
 -0.036476	  1.700267	 -1.726589
 -0.044251	  1.685847	 -1.715121
 -0.051876	  1.671385	 -1.703598
 -0.059823	  1.657056	 -1.692084
 -0.067995	  1.642785	 -1.680602
 -0.077050	  1.629035	 -1.669123
 -0.086942	  1.615825	 -1.657794
 -0.096557	  1.602902	 -1.645982
 -0.106044	  1.590886	 -1.633140
 -0.114429	  1.579021	 -1.619307
 -0.123163	  1.567052	 -1.605440
 -0.133009	  1.554541	 -1.592807
 -0.143837	  1.541783	 -1.581369
 -0.155627	  1.529594	 -1.571733
 -0.165474	  1.518296	 -1.558544
 -0.174594	  1.507437	 -1.545808
 -0.179670	  1.496602	 -1.530115
 -0.188145	  1.488122	 -1.507852
 -0.202389	  1.481275	 -1.489969
 -0.220996	  1.469256	 -1.480488
 -0.233372	  1.453569	 -1.477730
 -0.239500	  1.437060	 -1.472385
 -0.242600	  1.422078	 -1.461062
 -0.247085	  1.411932	 -1.442569
 -0.262251	  1.401842	 -1.419624
 -0.281798	  1.391014	 -1.409237
 -0.294513	  1.378864	 -1.405975
 -0.300578	  1.363727	 -1.398687
 -0.311382	  1.347576	 -1.386551
 -0.324658	  1.331128	 -1.379293
 -0.334611	  1.313291	 -1.378361
 -0.344149	  1.298947	 -1.369263
 -0.354970	  1.286276	 -1.357712
 -0.364383	  1.273156	 -1.345463
 -0.372074	  1.259181	 -1.334158
 -0.379980	  1.247956	 -1.323010
 -0.390987	  1.239542	 -1.307697
 -0.403910	  1.230236	 -1.291996
 -0.416545	  1.214641	 -1.278651
 -0.422065	  1.192542	 -1.269884
 -0.416759	  1.170502	 -1.255553
 -0.410767	  1.158443	 -1.242086
 -0.407625	  1.149423	 -1.228824
 -0.407362	  1.140205	 -1.210086
 -0.409855	  1.128933	 -1.192360
 -0.412830	  1.117112	 -1.176853
 -0.416451	  1.105220	 -1.160420
 -0.419524	  1.092079	 -1.144895
 -0.421874	  1.078232	 -1.130941
 -0.422502	  1.064442	 -1.117279
 -0.423505	  1.049495	 -1.104640
 -0.423629	  1.034346	 -1.091570
 -0.425525	  1.020521	 -1.078046
 -0.431242	  1.007278	 -1.064590
 -0.440377	  0.995415	 -1.049878
 -0.451393	  0.984555	 -1.036294
 -0.463296	  0.974252	 -1.023742
 -0.475806	  0.963879	 -1.013178
 -0.494528	  0.951562	 -1.008566
 -0.511806	  0.934959	 -1.005714
 -0.519442	  0.920511	 -1.001497
 -0.527374	  0.905906	 -0.995191
 -0.537749	  0.890681	 -0.985964
 -0.554736	  0.874742	 -0.974233
 -0.565031	  0.866297	 -0.967505
 -0.581003	  0.856202	 -0.959795
 -0.600445	  0.846899	 -0.950309
 -0.616438	  0.838613	 -0.939869
 -0.626359	  0.831038	 -0.935378
 -0.642673	  0.817605	 -0.926749
 -0.655359	  0.803670	 -0.916055
 -0.665260	  0.788716	 -0.906665
 -0.674166	  0.772359	 -0.898513
 -0.682768	  0.757069	 -0.890278
 -0.692396	  0.746762	 -0.884631
 -0.705067	  0.732524	 -0.877747
 -0.719622	  0.705851	 -0.867565
 -0.721433	  0.694526	 -0.861353
 -0.725551	  0.687065	 -0.856330
 -0.730918	  0.658901	 -0.845401
 -0.733500	  0.635336	 -0.842115
 -0.738985	  0.617817	 -0.837436
 -0.742412	  0.604905	 -0.833384
 -0.748716	  0.585108	 -0.828965
 -0.763109	  0.565045	 -0.825990
 -0.777092	  0.548288	 -0.814839
 -0.786283	  0.534685	 -0.804789
 -0.795982	  0.517219	 -0.794377
 -0.805545	  0.500630	 -0.786969
 -0.814933	  0.486186	 -0.781525
 -0.815533	  0.465369	 -0.774803
 -0.819928	  0.446428	 -0.772518
 -0.826301	  0.431372	 -0.770942
 -0.834707	  0.409016	 -0.767139
 -0.838115	  0.393741	 -0.764538
 -0.841519	  0.376823	 -0.759929
 -0.846689	  0.349560	 -0.753585
 -0.848416	  0.334002	 -0.752481
 -0.849419	  0.317645	 -0.751667
 -0.855411	  0.296866	 -0.747466
 -0.863580	  0.272421	 -0.742051
 -0.867331	  0.254189	 -0.733389
 -0.872285	  0.241060	 -0.724471
 -0.882461	  0.224385	 -0.712809
 -0.889991	  0.213264	 -0.701540
 -0.900926	  0.188290	 -0.687460
 -0.907699	  0.176624	 -0.682471
 -0.916616	  0.167481	 -0.674261
 -0.926013	  0.153399	 -0.659407
 -0.931098	  0.139135	 -0.646098
 -0.947355	  0.120660	 -0.625223
 -0.954722	  0.115295	 -0.615868
 -0.961248	  0.113289	 -0.606899
 -0.972323	  0.104610	 -0.585544
 -0.984654	  0.100290	 -0.563114
 -0.990027	  0.098710	 -0.553047
 -1.001402	  0.096470	 -0.531602
 -1.012693	  0.097176	 -0.509891
 -1.021307	  0.100473	 -0.490177
 -1.026055	  0.102076	 -0.478035
 -1.035792	  0.104730	 -0.459047
 -1.045035	  0.103841	 -0.444453
 -1.055174	  0.100648	 -0.425210
 -1.063595	  0.100672	 -0.406624
 -1.072656	  0.102233	 -0.385733
 -1.081762	  0.101733	 -0.363224
 -1.089198	  0.101002	 -0.347531
 -1.093873	  0.100483	 -0.337858
 -1.101876	  0.103306	 -0.311601
 -1.110357	  0.102806	 -0.289142
 -1.117876	  0.097832	 -0.276053
 -1.128583	  0.087863	 -0.250575
 -1.135819	  0.081551	 -0.232728
 -1.138273	  0.077614	 -0.222511
 -1.146323	  0.065461	 -0.194245
 -1.148259	  0.057751	 -0.176224
 -1.150114	  0.053101	 -0.164629
 -1.149645	  0.043402	 -0.141251
 -1.151284	  0.037862	 -0.118525
 -1.154734	  0.033393	 -0.105070
 -1.156486	  0.029714	 -0.088965
 -1.165354	  0.019210	 -0.066571
 -1.168640	  0.001217	 -0.054720
 -1.172717	 -0.015721	 -0.041822
 -1.176447	 -0.029369	 -0.027550
 -1.179842	 -0.042380	 -0.013243
 -1.183164	 -0.055099	  0.002378
 -1.185256	 -0.069798	  0.016631
 -1.186666	 -0.085465	  0.028970
 -1.188973	 -0.101363	  0.041421
 -1.194850	 -0.117609	  0.055240
 -1.198212	 -0.131661	  0.068036
 -1.199108	 -0.144118	  0.078423
 -1.195446	 -0.161127	  0.089130
 -1.191611	 -0.179440	  0.099747
 -1.192749	 -0.197844	  0.109342
 -1.198463	 -0.216245	  0.120469
 -1.202050	 -0.229332	  0.130853
 -1.200149	 -0.239815	  0.148531
 -1.197062	 -0.248523	  0.170430
 -1.204512	 -0.263421	  0.184338
 -1.214483	 -0.291395	  0.188172
 -1.216994	 -0.319758	  0.188440
 -1.213122	 -0.333355	  0.191056
 -1.200564	 -0.342472	  0.203042
 -1.179497	 -0.355772	  0.223705
 -1.168490	 -0.372711	  0.233255
 -1.161629	 -0.388390	  0.234090
 -1.159058	 -0.410992	  0.239561
 -1.164092	 -0.432684	  0.248894
 -1.173541	 -0.451067	  0.257179
 -1.174949	 -0.472564	  0.269808
 -1.171190	 -0.484081	  0.278560
 -1.159684	 -0.499082	  0.289741
 -1.150200	 -0.516581	  0.297014
 -1.145540	 -0.533964	  0.306873
 -1.147973	 -0.555330	  0.315393
 -1.155267	 -0.576264	  0.316420
 -1.162632	 -0.595220	  0.310605
 -1.170367	 -0.612185	  0.301305
 -1.178932	 -0.631375	  0.296259
 -1.186307	 -0.648832	  0.297322
 -1.194880	 -0.664135	  0.304265
 -1.207227	 -0.685010	  0.311364
 -1.221349	 -0.703923	  0.308076
 -1.231294	 -0.718893	  0.301751
 -1.239270	 -0.734072	  0.293988
 -1.247837	 -0.751778	  0.288035
 -1.258255	 -0.768965	  0.281351
 -1.268751	 -0.783563	  0.271640
 -1.279103	 -0.798421	  0.263955
 -1.291106	 -0.812444	  0.258905
 -1.304973	 -0.827266	  0.255347
 -1.316523	 -0.840983	  0.246990
 -1.328255	 -0.853223	  0.234498
 -1.341823	 -0.862912	  0.223866
 -1.359460	 -0.869429	  0.219644
 -1.381834	 -0.873862	  0.219329
 -1.396766	 -0.877698	  0.217236
 -1.416722	 -0.883476	  0.206459
 -1.430808	 -0.887569	  0.192948
 -1.445107	 -0.895938	  0.179303
 -1.459207	 -0.908267	  0.169224
 -1.474156	 -0.922409	  0.164393
 -1.490932	 -0.933996	  0.164204
 -1.507720	 -0.941952	  0.166852
 -1.526528	 -0.949776	  0.171620
 -1.544786	 -0.958760	  0.177126
 -1.558511	 -0.970691	  0.184679
 -1.567157	 -0.988445	  0.191178
 -1.572635	 -1.009731	  0.196155
 -1.577302	 -1.027868	  0.197564
 -1.584962	 -1.041507	  0.198401
 -1.598716	 -1.056745	  0.209527
 -1.604588	 -1.074344	  0.224002
 -1.608598	 -1.094580	  0.234898
 -1.609095	 -1.110670	  0.236244
 -1.609766	 -1.132955	  0.230743
 -1.614183	 -1.159874	  0.227572
 -1.620357	 -1.179992	  0.232732
 -1.630550	 -1.194378	  0.242504
 -1.646062	 -1.218469	  0.255441
 -1.650722	 -1.224518	  0.259329
 -1.659577	 -1.238295	  0.269288
 -1.673366	 -1.256341	  0.283196
 -1.686048	 -1.270236	  0.295556
 -1.700184	 -1.280798	  0.309251
 -1.709412	 -1.289668	  0.318230
 -1.717512	 -1.300193	  0.328856
 -1.728743	 -1.318269	  0.343760
 -1.735316	 -1.329014	  0.352222
 -1.747613	 -1.345115	  0.365618
 -1.758276	 -1.360996	  0.378375
 -1.759825	 -1.368966	  0.383502
 -1.765432	 -1.390636	  0.398895
 -1.771873	 -1.413607	  0.415506
 -1.775471	 -1.421044	  0.421885
 -1.783358	 -1.432655	  0.430763
 -1.798792	 -1.451678	  0.446340
 -1.804483	 -1.460323	  0.452475
 -1.813320	 -1.475558	  0.461455
 -1.825628	 -1.496743	  0.471673
 -1.834207	 -1.510189	  0.479984
 -1.842172	 -1.520440	  0.490409
 -1.854986	 -1.533529	  0.503843
 -1.863483	 -1.547986	  0.514742
 -1.871980	 -1.562443	  0.525641
