 -1.168271	  0.118038	  2.222937
 -1.169967	  0.120757	  2.225259
 -1.161397	  0.107015	  2.213524
 -1.151684	  0.093523	  2.202405
 -1.139364	  0.080891	  2.192990
 -1.127171	  0.068206	  2.183481
 -1.116701	  0.054918	  2.172812
 -1.106231	  0.041631	  2.162143
 -1.095912	  0.028231	  2.151468
 -1.087130	  0.013785	  2.140782
 -1.078347	 -0.000661	  2.130096
 -1.069815	 -0.015114	  2.119219
 -1.061993	 -0.029567	  2.107821
 -1.054172	 -0.044020	  2.096422
 -1.046807	 -0.058376	  2.084604
 -1.040104	 -0.072570	  2.072210
 -1.033400	 -0.086763	  2.059816
 -1.027364	 -0.100795	  2.046906
 -1.022049	 -0.114627	  2.033474
 -1.016733	 -0.128459	  2.020043
 -1.011399	 -0.141965	  2.006289
 -1.006058	 -0.155332	  1.992404
 -1.000612	 -0.168636	  1.978500
 -0.994668	 -0.181639	  1.964514
 -0.988724	 -0.194642	  1.950529
 -0.982208	 -0.207410	  1.936582
 -0.975535	 -0.220111	  1.922648
 -0.968520	 -0.232727	  1.908805
 -0.961079	 -0.245230	  1.895082
 -0.953516	 -0.257688	  1.881386
 -0.945044	 -0.269791	  1.867904
 -0.936572	 -0.281894	  1.854423
 -0.927188	 -0.293504	  1.841113
 -0.917573	 -0.304982	  1.827854
 -0.907663	 -0.316437	  1.814793
 -0.897433	 -0.327861	  1.801954
 -0.887220	 -0.339348	  1.789158
 -0.877179	 -0.351434	  1.776785
 -0.867139	 -0.363521	  1.764412
 -0.857137	 -0.375734	  1.752132
 -0.847154	 -0.388010	  1.739899
 -0.837144	 -0.400224	  1.727626
 -0.827031	 -0.412200	  1.715204
 -0.816918	 -0.424176	  1.702782
 -0.806742	 -0.435543	  1.689850
 -0.796540	 -0.446600	  1.676673
 -0.786338	 -0.457658	  1.663495
 -0.777074	 -0.467545	  1.648784
 -0.767886	 -0.477338	  1.633961
 -0.758806	 -0.487151	  1.619087
 -0.751547	 -0.497268	  1.603436
 -0.744288	 -0.507384	  1.587785
 -0.737339	 -0.517793	  1.572184
 -0.731238	 -0.528961	  1.556755
 -0.725137	 -0.540128	  1.541326
 -0.719164	 -0.552109	  1.526467
 -0.713243	 -0.564383	  1.511828
 -0.707285	 -0.576999	  1.497498
 -0.701271	 -0.590215	  1.483745
 -0.695257	 -0.603431	  1.469991
 -0.688972	 -0.617105	  1.456818
 -0.682684	 -0.630786	  1.443655
 -0.675831	 -0.644441	  1.430748
 -0.668637	 -0.658073	  1.418003
 -0.660697	 -0.671739	  1.405748
 -0.651816	 -0.685409	  1.394161
 -0.640739	 -0.698869	  1.384357
 -0.628794	 -0.712158	  1.375373
 -0.616125	 -0.725152	  1.366967
 -0.603378	 -0.738112	  1.358627
 -0.590712	 -0.751047	  1.350126
 -0.578132	 -0.763955	  1.341458
 -0.565552	 -0.776863	  1.332791
 -0.553866	 -0.789961	  1.323205
 -0.543632	 -0.803242	  1.312302
 -0.533399	 -0.816524	  1.301399
 -0.523165	 -0.829805	  1.290497
 -0.516195	 -0.843044	  1.277224
 -0.509593	 -0.856246	  1.263729
 -0.502992	 -0.869448	  1.250234
 -0.496844	 -0.882343	  1.236236
 -0.490940	 -0.895070	  1.221982
 -0.485036	 -0.907796	  1.207728
 -0.480408	 -0.920112	  1.192665
 -0.477084	 -0.931941	  1.176885
 -0.473761	 -0.943771	  1.161105
 -0.468581	 -0.955790	  1.145981
 -0.461006	 -0.967959	  1.132033
 -0.450147	 -0.979967	  1.120291
 -0.437822	 -0.991527	  1.109593
 -0.425192	 -1.002977	  1.099134
 -0.412666	 -1.014440	  1.088566
 -0.400271	 -1.025921	  1.077862
 -0.387876	 -1.037401	  1.067159
 -0.376918	 -1.049934	  1.056075
 -0.366396	 -1.062754	  1.044897
 -0.356250	 -1.075788	  1.033620
 -0.347869	 -1.089712	  1.021963
 -0.339489	 -1.103636	  1.010306
 -0.332205	 -1.117779	  0.998185
 -0.325743	 -1.132051	  0.985753
 -0.319281	 -1.146322	  0.973321
 -0.313185	 -1.160596	  0.960706
 -0.310478	 -1.174617	  0.946704
 -0.307770	 -1.188639	  0.932702
 -0.305062	 -1.202661	  0.918700
 -0.302355	 -1.216683	  0.904698
 -0.299647	 -1.230704	  0.890696
 -0.303068	 -1.242714	  0.875074
 -0.307352	 -1.254321	  0.859359
 -0.311635	 -1.265927	  0.843644
 -0.315918	 -1.277533	  0.827930
 -0.320201	 -1.289139	  0.812215
 -0.324377	 -1.299933	  0.795904
 -0.328386	 -1.309538	  0.778825
 -0.332394	 -1.319143	  0.761747
 -0.336402	 -1.328748	  0.744668
 -0.338482	 -1.338156	  0.727142
 -0.339650	 -1.347439	  0.709465
 -0.340358	 -1.356723	  0.691765
 -0.339124	 -1.365958	  0.674068
 -0.336229	 -1.375017	  0.656473
 -0.332378	 -1.384067	  0.639059
 -0.327848	 -1.393165	  0.621834
 -0.322430	 -1.402873	  0.605208
 -0.316517	 -1.412910	  0.588952
 -0.310591	 -1.423473	  0.573036
 -0.304656	 -1.434996	  0.557805
 -0.298345	 -1.446899	  0.543023
 -0.290529	 -1.460242	  0.530339
 -0.282183	 -1.474043	  0.518513
 -0.273037	 -1.488495	  0.508145
 -0.263862	 -1.502811	  0.497616
 -0.254572	 -1.516548	  0.486435
 -0.245282	 -1.530284	  0.475254
 -0.235775	 -1.543169	  0.463271
 -0.226079	 -1.555129	  0.450506
 -0.216321	 -1.567089	  0.437788
 -0.203246	 -1.578720	  0.428105
 -0.188797	 -1.589643	  0.419627
 -0.172112	 -1.598836	  0.413534
 -0.153693	 -1.605689	  0.409819
 -0.134431	 -1.610841	  0.408271
 -0.114911	 -1.615167	  0.407742
 -0.095392	 -1.619493	  0.407213
 -0.075743	 -1.623195	  0.406747
 -0.056045	 -1.626629	  0.406310
 -0.036347	 -1.630064	  0.405872
 -0.016649	 -1.633499	  0.405435
  0.003049	 -1.636933	  0.404997
  0.020720	 -1.644506	  0.399486
  0.038310	 -1.652176	  0.393849
  0.055900	 -1.659846	  0.388212
  0.073490	 -1.667516	  0.382575
  0.091079	 -1.675186	  0.376939
  0.104223	 -1.687533	  0.368291
  0.116066	 -1.700765	  0.359089
  0.127908	 -1.713996	  0.349886
  0.139751	 -1.727227	  0.340683
  0.149667	 -1.741435	  0.330693
  0.158292	 -1.756167	  0.320273
  0.166917	 -1.770899	  0.309852
  0.174782	 -1.785863	  0.299165
  0.181854	 -1.801037	  0.288224
  0.188927	 -1.816212	  0.277283
  0.195551	 -1.831353	  0.266020
  0.201998	 -1.846478	  0.254631
  0.208432	 -1.861584	  0.243213
  0.214691	 -1.876426	  0.231356
  0.220949	 -1.891267	  0.219500
  0.227098	 -1.906084	  0.207557
  0.233129	 -1.920875	  0.195522
  0.239161	 -1.935666	  0.183487
  0.244949	 -1.950579	  0.171483
  0.250730	 -1.965496	  0.159479
  0.256798	 -1.980463	  0.147682
  0.263085	 -1.995466	  0.136047
  0.269674	 -2.010457	  0.124563
  0.277196	 -2.025379	  0.113576
  0.284719	 -2.040301	  0.102588
  0.293402	 -2.055168	  0.092410
  0.302099	 -2.070033	  0.082241
  0.311495	 -2.084609	  0.072280
  0.321186	 -2.099056	  0.062411
  0.331077	 -2.113268	  0.052402
  0.341453	 -2.126879	  0.042054
  0.351830	 -2.140489	  0.031706
  0.362949	 -2.153049	  0.020816
  0.374282	 -2.165281	  0.009772
  0.385842	 -2.177194	 -0.001383
  0.398342	 -2.187654	 -0.012973
  0.410842	 -2.198115	 -0.024563
  0.423471	 -2.207962	 -0.036545
  0.436194	 -2.217278	 -0.048846
  0.448918	 -2.226593	 -0.061147
  0.461602	 -2.235233	 -0.073972
  0.474277	 -2.243752	 -0.086887
  0.486963	 -2.252169	 -0.099856
  0.499682	 -2.260270	 -0.112994
  0.512401	 -2.268370	 -0.126132
  0.525185	 -2.276776	 -0.139012
  0.537986	 -2.285268	 -0.151820
  0.550732	 -2.293975	 -0.164538
  0.563375	 -2.303057	 -0.177094
  0.576019	 -2.312140	 -0.189650
  0.588020	 -2.321872	 -0.202348
  0.599826	 -2.331792	 -0.215084
  0.611555	 -2.341798	 -0.227825
  0.622455	 -2.352665	 -0.240596
  0.633355	 -2.363532	 -0.253366
  0.643818	 -2.375026	 -0.265953
  0.653764	 -2.387211	 -0.278306
  0.663709	 -2.399397	 -0.290659
  0.673677	 -2.411638	 -0.303046
  0.683098	 -2.424589	 -0.315025
