 0.0 0.0 0.0 0
 0.7675249884278053 -0.14782427434969542 0.6244544627527957 1000
 -0.562106479215534 -0.7865414825114623 -0.2573592864316089 1000
 -0.29495519232460105 0.08920457612377614 0.9515923381991546 1000
 0.7162205064744195 0.5578160469012293 -0.4197814239875448 1000
 -0.10330841076707983 0.3867680480172688 -0.9162629804252114 1000
 -0.6649118205733854 0.2656877698061945 0.6982215120126248 1000
 0.12544232062945945 -0.8329306310500146 0.5380592793119727 1000
 0.6679830969013432 0.7431354064112365 0.052003365199728285 1000
 0.0 0.0 0.0 0
 -0.6156817399722786 0.20196940620011658 -0.761789573323158 1000
 0.32268962174892124 0.4391464219662954 -0.8385701092274503 1000
 0.01699676266189662 0.9833871124012222 0.17877051552814938 1000
 -0.856030017189217 -0.44439957695286986 0.26245690250998965 1000
 0.6482414168102885 0.34789608801863825 0.6774521219046533 1000
 0.06979135674816174 0.24725498240949023 0.966526326696243 1000
 -0.5612345220366811 -0.7020082528557214 0.4378632482827426 1000
 0.9608758952561612 -0.07865654664079033 0.2682828015103001 1000
 0.0 0.0 0.0 0
 -0.05149039817876275 -0.4835625617328699 0.8736583930723358 1000
 0.3163430085641072 -0.9427436897459807 -0.10325423176191251 1000
