 -1.142647	  1.385262	 -1.579551
 -1.156990	  1.385194	 -1.585525
 -1.171333	  1.385126	 -1.591499
 -1.152875	  1.385215	 -1.583798
 -1.134407	  1.385309	 -1.576120
 -1.115416	  1.386808	 -1.570055
 -1.096090	  1.391454	 -1.567894
 -1.076775	  1.396148	 -1.565671
 -1.057445	  1.400835	 -1.563550
 -1.038100	  1.405537	 -1.561639
 -1.019394	  1.412313	 -1.563699
 -1.001228	  1.419843	 -1.567367
 -0.983058	  1.427348	 -1.571041
 -0.964888	  1.434835	 -1.574748
 -0.946763	  1.442272	 -1.578559
 -0.931128	  1.449396	 -1.587097
 -0.919865	  1.458332	 -1.601122
 -0.905755	  1.466843	 -1.611340
 -0.878630	  1.473160	 -1.614543
 -0.857538	  1.476890	 -1.619108
 -0.841420	  1.482806	 -1.626173
 -0.828567	  1.487463	 -1.632351
 -0.809009	  1.495408	 -1.641888
 -0.790545	  1.503266	 -1.653065
 -0.780242	  1.506462	 -1.664353
 -0.764259	  1.514794	 -1.681004
 -0.748133	  1.520454	 -1.691394
 -0.732007	  1.526114	 -1.701784
