 -2.774803	 -1.057720	  0.602160
 -2.747330	 -1.047247	  0.596198
 -2.707543	 -1.014930	  0.616760
 -2.669923	 -0.990515	  0.641016
 -2.638791	 -0.957754	  0.660634
 -2.605508	 -0.930698	  0.686893
 -2.570378	 -0.897910	  0.703658
 -2.535814	 -0.870663	  0.729829
 -2.495199	 -0.849971	  0.752736
 -2.461185	 -0.821995	  0.775697
 -2.430082	 -0.787535	  0.792238
 -2.394349	 -0.766590	  0.816824
 -2.356060	 -0.742604	  0.835470
 -2.317978	 -0.718609	  0.860755
 -2.279755	 -0.694419	  0.884397
 -2.241843	 -0.669349	  0.906538
 -2.204354	 -0.641877	  0.927117
 -2.169030	 -0.610036	  0.944889
 -2.136181	 -0.575779	  0.961554
 -2.105062	 -0.542006	  0.978889
 -2.074326	 -0.509033	  0.997471
 -2.043505	 -0.476984	  1.017614
 -2.012768	 -0.445890	  1.039727
 -1.981986	 -0.414362	  1.064937
 -1.945275	 -0.385541	  1.094590
 -1.923646	 -0.376188	  1.172675
 -1.955918	 -0.388882	  1.323736
 -1.995461	 -0.411765	  1.488968
 -1.983574	 -0.400600	  1.544044
 -1.956220	 -0.380428	  1.474179
 -1.877271	 -0.292582	  1.339113
 -1.757723	 -0.216833	  1.265488
 -1.679982	 -0.175604	  1.271375
 -1.641581	 -0.143991	  1.295512
 -1.606753	 -0.115001	  1.318388
 -1.568636	 -0.087738	  1.336576
 -1.527730	 -0.062726	  1.353421
 -1.485437	 -0.039681	  1.371532
 -1.444511	 -0.018338	  1.390250
 -1.405507	  0.003075	  1.410595
 -1.369364	  0.027837	  1.432933
 -1.337007	  0.054326	  1.457244
 -1.307238	  0.083568	  1.483381
 -1.277911	  0.115670	  1.511177
 -1.248334	  0.148742	  1.539983
 -1.218308	  0.181596	  1.567862
 -1.188096	  0.212354	  1.592865
 -1.156451	  0.240239	  1.615903
 -1.122092	  0.266016	  1.638110
 -1.084444	  0.290344	  1.659633
 -1.045757	  0.312940	  1.679266
 -1.006124	  0.337946	  1.698079
 -0.970702	  0.363932	  1.716283
 -0.938568	  0.391531	  1.738248
 -0.907236	  0.420524	  1.765413
 -0.874612	  0.449123	  1.792999
 -0.838391	  0.475740	  1.817060
 -0.800136	  0.502390	  1.837090
 -0.760067	  0.529826	  1.854324
 -0.718596	  0.559727	  1.868777
 -0.678643	  0.590500	  1.879265
 -0.641651	  0.620637	  1.887654
 -0.604468	  0.650592	  1.899545
 -0.568811	  0.676984	  1.916338
 -0.534657	  0.700544	  1.937207
 -0.498821	  0.726563	  1.960110
 -0.462173	  0.758753	  1.984724
 -0.429472	  0.790743	  2.008355
 -0.397811	  0.822671	  2.031218
 -0.366364	  0.854299	  2.053660
 -0.335365	  0.884836	  2.075497
 -0.304887	  0.914421	  2.096377
 -0.273469	  0.944880	  2.116545
 -0.239887	  0.976799	  2.137799
 -0.206087	  1.008234	  2.158541
 -0.173849	  1.038155	  2.177826
 -0.139396	  1.068977	  2.197900
 -0.103918	  1.096001	  2.217529
 -0.066165	  1.119837	  2.238212
 -0.023245	  1.136455	  2.262674
  0.023017	  1.151321	  2.283296
  0.063432	  1.175610	  2.303926
  0.099855	  1.205691	  2.321457
  0.132966	  1.235776	  2.341039
  0.167214	  1.266125	  2.362702
  0.198013	  1.304765	  2.378351
  0.226347	  1.340494	  2.398245
  0.255479	  1.371062	  2.423311
  0.284296	  1.407159	  2.443047
  0.317552	  1.438119	  2.465138
  0.351692	  1.466975	  2.486352
  0.388163	  1.492341	  2.507479
  0.424677	  1.514139	  2.527770
  0.468160	  1.524448	  2.541040
  0.472842	  1.539693	  2.566450
