  1.461711	 -1.072467	  1.551540
  1.465929	 -1.068406	  1.556256
  1.455557	 -1.077415	  1.544771
  1.444492	 -1.088424	  1.529935
  1.431852	 -1.100635	  1.518621
  1.417688	 -1.114645	  1.510341
  1.406200	 -1.124423	  1.496788
  1.397879	 -1.132003	  1.483471
  1.387118	 -1.143885	  1.470831
  1.372634	 -1.155963	  1.458363
  1.357900	 -1.164662	  1.447818
  1.345251	 -1.171319	  1.434315
  1.335537	 -1.180690	  1.420420
  1.323300	 -1.190104	  1.406413
  1.307001	 -1.197914	  1.396065
  1.293922	 -1.208524	  1.386914
  1.281030	 -1.218852	  1.374988
  1.266774	 -1.228001	  1.363219
  1.252513	 -1.238669	  1.355261
  1.237755	 -1.250689	  1.347413
  1.223487	 -1.260275	  1.337323
  1.210538	 -1.270715	  1.327024
  1.196720	 -1.283787	  1.318780
  1.179835	 -1.294807	  1.311175
  1.166639	 -1.301569	  1.300210
  1.153694	 -1.313026	  1.289729
  1.142014	 -1.326289	  1.280069
  1.129106	 -1.338845	  1.270390
  1.116309	 -1.351169	  1.261121
  1.103534	 -1.363467	  1.251871
  1.090929	 -1.375980	  1.242677
  1.078554	 -1.388775	  1.233559
  1.066179	 -1.401572	  1.224441
  1.054222	 -1.414713	  1.215274
  1.042743	 -1.427819	  1.205869
  1.032355	 -1.440614	  1.195525
  1.020779	 -1.455405	  1.183865
  1.009490	 -1.468884	  1.174098
  0.996842	 -1.482077	  1.170143
  0.984517	 -1.497170	  1.163553
  0.972912	 -1.511934	  1.156009
  0.961983	 -1.526727	  1.148054
  0.951400	 -1.541717	  1.140213
  0.940784	 -1.555514	  1.131587
  0.929755	 -1.570552	  1.121889
  0.920338	 -1.585272	  1.112848
  0.911132	 -1.603991	  1.107481
  0.900550	 -1.619083	  1.103680
  0.888842	 -1.633447	  1.097542
  0.879378	 -1.653723	  1.091041
  0.872413	 -1.668011	  1.084823
  0.861513	 -1.684125	  1.078155
  0.851317	 -1.701465	  1.072839
  0.843369	 -1.718266	  1.065767
  0.835470	 -1.733789	  1.055727
  0.827851	 -1.750775	  1.047117
  0.818731	 -1.767207	  1.042013
  0.808873	 -1.782708	  1.034562
  0.802503	 -1.799886	  1.024629
  0.798824	 -1.818600	  1.017230
  0.790761	 -1.833870	  1.006321
  0.777754	 -1.847947	  0.999471
  0.769656	 -1.865289	  0.992930
  0.765169	 -1.881969	  0.979490
  0.757123	 -1.894572	  0.968301
  0.748744	 -1.908398	  0.956325
  0.739241	 -1.923168	  0.944867
  0.725626	 -1.936475	  0.938116
  0.712034	 -1.949577	  0.929841
  0.699231	 -1.961933	  0.920687
  0.688129	 -1.974639	  0.909394
  0.677522	 -1.987137	  0.898136
  0.667597	 -2.000579	  0.886710
  0.657353	 -2.014018	  0.875650
  0.646712	 -2.026322	  0.864581
  0.635632	 -2.038247	  0.852720
  0.625392	 -2.052261	  0.841669
  0.613874	 -2.064778	  0.831532
  0.602684	 -2.075345	  0.820092
  0.590011	 -2.087830	  0.807769
  0.578367	 -2.101862	  0.798096
  0.564154	 -2.109104	  0.788813
  0.550224	 -2.118561	  0.776940
  0.535241	 -2.131955	  0.767003
  0.523296	 -2.146152	  0.759258
  0.513382	 -2.155990	  0.749309
  0.499561	 -2.167617	  0.738643
  0.483867	 -2.177727	  0.730630
  0.468363	 -2.188807	  0.721898
  0.455453	 -2.200015	  0.712983
  0.445379	 -2.213497	  0.700240
  0.434171	 -2.225976	  0.687695
  0.415491	 -2.238401	  0.677714
  0.402130	 -2.249903	  0.668270
