  2.316940	  0.697178	 -0.465376
  2.333945	  0.703170	 -0.466545
  2.315121	  0.696540	 -0.465249
  2.296259	  0.690029	 -0.463893
  2.277337	  0.683718	 -0.462437
  2.258412	  0.677415	 -0.460977
  2.239437	  0.671281	 -0.459450
  2.220448	  0.665194	 -0.457902
  2.201431	  0.659209	 -0.456328
  2.182276	  0.653717	 -0.454615
  2.163116	  0.648244	 -0.452898
  2.143890	  0.643026	 -0.451137
  2.124573	  0.638176	 -0.449313
  2.105253	  0.633336	 -0.447488
  2.085885	  0.628683	 -0.445693
  2.066496	  0.624109	 -0.443913
  2.047115	  0.619475	 -0.442220
  2.027775	  0.614530	 -0.440986
  2.008441	  0.609576	 -0.439759
  1.989327	  0.604710	 -0.438313
  1.970544	  0.603581	 -0.439069
  1.949397	  0.605252	 -0.443408
  1.925099	  0.601074	 -0.445874
  1.906575	  0.594979	 -0.445216
  1.888349	  0.588129	 -0.443457
  1.867160	  0.580578	 -0.442371
  1.851443	  0.572931	 -0.439731
  1.836597	  0.562016	 -0.431811
  1.817800	  0.554947	 -0.425993
  1.797627	  0.551828	 -0.424190
  1.778019	  0.550612	 -0.422396
  1.759253	  0.555676	 -0.423594
  1.738705	  0.562031	 -0.430238
  1.715044	  0.562175	 -0.436378
  1.702413	  0.546251	 -0.428025
  1.682025	  0.515828	 -0.416414
  1.668118	  0.505896	 -0.414405
  1.641926	  0.499416	 -0.417066
  1.615414	  0.501935	 -0.423866
  1.605989	  0.503975	 -0.426475
  1.585584	  0.511537	 -0.431938
  1.553657	  0.505770	 -0.436200
  1.541014	  0.503032	 -0.436184
  1.516387	  0.488684	 -0.438642
  1.500343	  0.480391	 -0.440969
  1.488281	  0.471726	 -0.437679
  1.469402	  0.459721	 -0.431426
  1.456146	  0.452629	 -0.425770
  1.432768	  0.439700	 -0.421300
  1.414486	  0.432488	 -0.418806
  1.398582	  0.425362	 -0.415855
  1.385353	  0.408961	 -0.407966
  1.376152	  0.392800	 -0.403684
  1.355465	  0.382127	 -0.401967
  1.336568	  0.375549	 -0.399737
  1.319325	  0.365970	 -0.395812
  1.302304	  0.355648	 -0.392760
  1.284489	  0.346075	 -0.391062
  1.266395	  0.337194	 -0.390135
  1.247719	  0.330447	 -0.390157
  1.228139	  0.325819	 -0.389039
  1.208775	  0.320903	 -0.387261
  1.189429	  0.315707	 -0.385927
  1.170143	  0.310708	 -0.385300
  1.150714	  0.306508	 -0.386134
  1.130917	  0.303510	 -0.386908
  1.111075	  0.300666	 -0.386328
  1.091557	  0.299639	 -0.385075
  1.073080	  0.293903	 -0.382471
  1.053703	  0.294378	 -0.381127
  1.030798	  0.306555	 -0.387040
  1.006882	  0.313202	 -0.394620
  0.991799	  0.315467	 -0.398214
  0.972646	  0.317298	 -0.402328
  0.948207	  0.315531	 -0.403239
  0.931934	  0.309748	 -0.400350
  0.916071	  0.301192	 -0.395886
  0.885881	  0.288356	 -0.390792
  0.865561	  0.283045	 -0.389684
  0.854449	  0.280568	 -0.389664
  0.839446	  0.276076	 -0.389307
  0.815595	  0.273193	 -0.389870
  0.796561	  0.267333	 -0.389932
  0.777695	  0.254152	 -0.390285
  0.766550	  0.240918	 -0.391746
  0.750367	  0.229447	 -0.397262
  0.729639	  0.218912	 -0.394697
  0.712826	  0.205730	 -0.387937
  0.696990	  0.190631	 -0.382538
  0.680860	  0.178876	 -0.381328
  0.664809	  0.171097	 -0.382332
  0.642879	  0.164806	 -0.381304
  0.614235	  0.167859	 -0.378130
  0.597871	  0.171397	 -0.375950
  0.574026	  0.171760	 -0.373683
  0.554126	  0.167284	 -0.374178
  0.540486	  0.160627	 -0.376448
  0.523388	  0.149926	 -0.380138
  0.503434	  0.136804	 -0.383005
  0.485378	  0.125030	 -0.382470
  0.466849	  0.117800	 -0.381874
  0.451640	  0.112862	 -0.382546
  0.426273	  0.106571	 -0.382558
  0.400304	  0.101735	 -0.381624
  0.392465	  0.100133	 -0.380317
  0.371706	  0.101372	 -0.375368
  0.348604	  0.100507	 -0.367084
  0.334075	  0.096853	 -0.368406
  0.314674	  0.092010	 -0.375345
  0.283482	  0.087608	 -0.378813
  0.267310	  0.083022	 -0.378506
  0.249355	  0.081454	 -0.376472
  0.221714	  0.075271	 -0.374857
  0.210175	  0.066772	 -0.372767
  0.192374	  0.058253	 -0.369656
  0.171822	  0.050787	 -0.366952
  0.158407	  0.045568	 -0.365178
  0.138221	  0.040056	 -0.364914
  0.114781	  0.031662	 -0.367074
  0.101089	  0.026543	 -0.367519
  0.083614	  0.018931	 -0.364078
  0.062491	  0.005533	 -0.362599
  0.047206	 -0.000042	 -0.362068
  0.024432	 -0.002165	 -0.360302
 -0.003415	 -0.003387	 -0.361992
 -0.016308	 -0.004958	 -0.362102
 -0.031975	 -0.009652	 -0.361115
 -0.060190	 -0.014085	 -0.363996
 -0.080339	 -0.018659	 -0.368941
 -0.092215	 -0.022057	 -0.370623
 -0.105247	 -0.025064	 -0.370123
 -0.126001	 -0.030211	 -0.364595
 -0.148429	 -0.032907	 -0.359611
 -0.177077	 -0.034375	 -0.366010
 -0.198052	 -0.041480	 -0.373514
 -0.206111	 -0.044099	 -0.377251
 -0.227506	 -0.048530	 -0.379645
 -0.257201	 -0.059590	 -0.387042
 -0.263946	 -0.059096	 -0.389333
 -0.286824	 -0.060888	 -0.388229
 -0.312683	 -0.059949	 -0.395409
 -0.326723	 -0.062676	 -0.397310
 -0.345325	 -0.069528	 -0.394521
 -0.366138	 -0.073834	 -0.393705
 -0.388605	 -0.082341	 -0.397371
 -0.403845	 -0.089814	 -0.398212
 -0.425247	 -0.094885	 -0.402695
 -0.445563	 -0.100619	 -0.410069
 -0.457965	 -0.104374	 -0.411905
 -0.478981	 -0.105350	 -0.414599
 -0.501413	 -0.106648	 -0.411443
 -0.525044	 -0.104779	 -0.408651
 -0.546228	 -0.103053	 -0.407527
 -0.563119	 -0.102911	 -0.408034
 -0.583746	 -0.101832	 -0.406797
 -0.603145	 -0.099458	 -0.404904
 -0.623296	 -0.097505	 -0.402759
 -0.642666	 -0.094732	 -0.401824
 -0.664470	 -0.092737	 -0.401311
 -0.684405	 -0.095656	 -0.398007
 -0.702091	 -0.095895	 -0.395188
 -0.726554	 -0.094535	 -0.390607
 -0.753957	 -0.084569	 -0.385990
 -0.757270	 -0.079692	 -0.384007
 -0.772678	 -0.080969	 -0.378821
 -0.801068	 -0.081992	 -0.377844
 -0.823733	 -0.081892	 -0.379222
 -0.837319	 -0.080904	 -0.378729
 -0.859814	 -0.078618	 -0.373063
 -0.883306	 -0.071823	 -0.366346
 -0.896607	 -0.065567	 -0.362679
 -0.913922	 -0.056777	 -0.358727
 -0.932219	 -0.045822	 -0.355737
 -0.957848	 -0.039972	 -0.355217
 -0.971401	 -0.036848	 -0.356333
 -0.991746	 -0.028852	 -0.360316
 -1.015359	 -0.023802	 -0.362938
 -1.030253	 -0.018883	 -0.361390
 -1.046289	 -0.010469	 -0.363867
 -1.068154	 -0.002005	 -0.367525
 -1.091834	  0.004517	 -0.363913
 -1.104286	  0.009422	 -0.360826
 -1.120327	  0.015512	 -0.360543
 -1.141640	  0.019256	 -0.360449
 -1.161660	  0.024595	 -0.360079
 -1.183170	  0.030624	 -0.364649
 -1.200241	  0.035443	 -0.367507
 -1.222150	  0.040477	 -0.369338
 -1.236961	  0.044840	 -0.372476
 -1.255975	  0.046329	 -0.379621
 -1.273111	  0.047347	 -0.382081
 -1.294724	  0.049187	 -0.386292
 -1.314765	  0.054823	 -0.386398
 -1.335902	  0.063383	 -0.388567
 -1.360288	  0.071456	 -0.397268
 -1.376070	  0.074695	 -0.404325
 -1.392051	  0.076589	 -0.410887
 -1.411819	  0.075738	 -0.419545
 -1.428226	  0.077483	 -0.427674
 -1.440475	  0.075378	 -0.436671
 -1.458280	  0.075918	 -0.445132
 -1.484179	  0.070353	 -0.466569
 -1.497484	  0.063996	 -0.482273
 -1.506044	  0.063853	 -0.492182
 -1.523582	  0.062271	 -0.518450
 -1.532962	  0.061889	 -0.530413
 -1.542713	  0.062040	 -0.539670
 -1.559371	  0.059456	 -0.552879
 -1.576914	  0.057520	 -0.564457
 -1.594969	  0.060641	 -0.573785
 -1.609250	  0.064728	 -0.584391
 -1.621285	  0.064414	 -0.601409
 -1.631582	  0.055358	 -0.623336
 -1.640919	  0.044505	 -0.637763
 -1.651532	  0.031553	 -0.650351
 -1.661482	  0.020266	 -0.664797
 -1.669135	  0.015143	 -0.671610
 -1.682495	  0.004686	 -0.684225
 -1.698228	 -0.005814	 -0.693398
 -1.713561	 -0.014569	 -0.700695
 -1.732995	 -0.026809	 -0.705896
 -1.735239	 -0.029477	 -0.708432
 -1.736823	 -0.031122	 -0.711778
 -1.740886	 -0.037543	 -0.711833
 -1.740539	 -0.040689	 -0.713109
 -1.753462	 -0.058107	 -0.702293
 -1.759459	 -0.077546	 -0.692704
 -1.762713	 -0.094351	 -0.686533
 -1.767378	 -0.118913	 -0.674477
 -1.774611	 -0.134672	 -0.666305
 -1.793580	 -0.155975	 -0.655784
 -1.803284	 -0.161722	 -0.650687
 -1.819467	 -0.170156	 -0.635334
 -1.842530	 -0.175020	 -0.617925
 -1.851544	 -0.179055	 -0.610106
 -1.861260	 -0.191552	 -0.598008
 -1.871790	 -0.206423	 -0.584857
 -1.875291	 -0.220455	 -0.575823
 -1.878769	 -0.242640	 -0.565408
 -1.884111	 -0.260114	 -0.557259
 -1.885833	 -0.275233	 -0.549043
 -1.894762	 -0.296878	 -0.532777
 -1.904912	 -0.308823	 -0.521874
 -1.914095	 -0.319037	 -0.513326
 -1.930622	 -0.332139	 -0.503666
 -1.943997	 -0.340639	 -0.495494
 -1.956396	 -0.349568	 -0.489348
 -1.967669	 -0.360812	 -0.480632
 -1.981243	 -0.371663	 -0.474415
 -1.993393	 -0.381276	 -0.470146
 -2.006980	 -0.390499	 -0.468243
 -2.022406	 -0.400915	 -0.465810
 -2.038619	 -0.409712	 -0.464226
 -2.056274	 -0.416062	 -0.463812
 -2.073221	 -0.423217	 -0.461076
 -2.088662	 -0.430323	 -0.459485
 -2.111042	 -0.440076	 -0.461876
 -2.132390	 -0.446327	 -0.468753
 -2.147606	 -0.448832	 -0.475706
 -2.166193	 -0.450680	 -0.481939
 -2.185598	 -0.454479	 -0.486778
 -2.205557	 -0.459237	 -0.489160
 -2.225521	 -0.462864	 -0.492952
 -2.245800	 -0.462288	 -0.496116
 -2.269845	 -0.463058	 -0.498657
 -2.290189	 -0.466485	 -0.500937
 -2.304356	 -0.470704	 -0.497484
 -2.325377	 -0.478601	 -0.495944
 -2.345133	 -0.483613	 -0.490313
 -2.366075	 -0.486821	 -0.483595
 -2.384041	 -0.490285	 -0.478157
 -2.404264	 -0.493259	 -0.474793
 -2.424051	 -0.495762	 -0.473298
