  1.773239	  0.634219	  2.373666
  1.755682	  0.627940	  2.350165
  1.731008	  0.631508	  2.307590
  1.706412	  0.619051	  2.267245
  1.689150	  0.612023	  2.225182
  1.661562	  0.609658	  2.187242
  1.637618	  0.609118	  2.140959
  1.614093	  0.599022	  2.097000
  1.593380	  0.596657	  2.053975
  1.568663	  0.591734	  2.009845
  1.541210	  0.584227	  1.963936
  1.513830	  0.578945	  1.923180
  1.487503	  0.574295	  1.886018
  1.459528	  0.567194	  1.843240
  1.433998	  0.559756	  1.798116
  1.413334	  0.553121	  1.759329
  1.389100	  0.545336	  1.714720
  1.364775	  0.538180	  1.671536
  1.340472	  0.531560	  1.627817
  1.316365	  0.526207	  1.582467
  1.292770	  0.523293	  1.539577
  1.265700	  0.521694	  1.495048
  1.238514	  0.519040	  1.453540
  1.210781	  0.514340	  1.411537
  1.185775	  0.508822	  1.371695
  1.161263	  0.503083	  1.330112
  1.134018	  0.494475	  1.282331
  1.115035	  0.487198	  1.238780
  1.092122	  0.481084	  1.194965
  1.061117	  0.476117	  1.151884
  1.034048	  0.471924	  1.111028
  1.015094	  0.463514	  1.069773
  0.987101	  0.464905	  1.025859
  0.962920	  0.463157	  0.985843
  0.940716	  0.456517	  0.939139
  0.918242	  0.453355	  0.899080
  0.892271	  0.449173	  0.851330
  0.866069	  0.444369	  0.806839
  0.843523	  0.441845	  0.769278
  0.818069	  0.438177	  0.724642
  0.791856	  0.432323	  0.680380
  0.767146	  0.426107	  0.640512
  0.743896	  0.420306	  0.599247
  0.722763	  0.413003	  0.555128
  0.700193	  0.403910	  0.509142
  0.673403	  0.394149	  0.463177
  0.645636	  0.383524	  0.421417
  0.618674	  0.372330	  0.383214
  0.590903	  0.361013	  0.344511
  0.561454	  0.351620	  0.303262
  0.532316	  0.346002	  0.260596
  0.506866	  0.343363	  0.220628
  0.481938	  0.338577	  0.179862
  0.454753	  0.331577	  0.135396
  0.431070	  0.324883	  0.096139
  0.406047	  0.318653	  0.053103
  0.379809	  0.312894	  0.003682
  0.356596	  0.309869	 -0.043183
  0.335008	  0.308152	 -0.085649
  0.312367	  0.306933	 -0.127352
  0.286813	  0.305804	 -0.171266
  0.260837	  0.304762	 -0.212321
  0.232344	  0.302696	 -0.254146
  0.203131	  0.299205	 -0.297066
  0.176081	  0.295007	 -0.338070
  0.149231	  0.291199	 -0.380991
  0.125551	  0.287262	 -0.421035
  0.102444	  0.282265	 -0.460441
  0.076094	  0.275597	 -0.506988
  0.053529	  0.268586	 -0.548934
  0.027414	  0.262294	 -0.592684
  0.001164	  0.257575	 -0.633399
 -0.026506	  0.253309	 -0.674866
 -0.055595	  0.249285	 -0.718252
 -0.082218	  0.245370	 -0.759181
 -0.109428	  0.241175	 -0.802392
 -0.134437	  0.236058	 -0.842962
 -0.161930	  0.228803	 -0.886869
 -0.186415	  0.216027	 -0.925428
 -0.214984	  0.192890	 -0.957901
 -0.264184	  0.117187	 -0.981974
 -0.314131	 -0.050348	 -1.002859
 -0.338081	 -0.104008	 -1.018853
 -0.380096	 -0.177219	 -1.045000
 -0.407935	 -0.227578	 -1.060980
 -0.445292	 -0.317010	 -1.077975
 -0.449276	 -0.388208	 -1.114175
 -0.412810	 -0.440938	 -1.176582
 -0.409879	 -0.444499	 -1.183282
 -0.400525	 -0.468578	 -1.220196
 -0.374448	 -0.536394	 -1.337453
 -0.363612	 -0.539469	 -1.397196
 -0.361569	 -0.513226	 -1.508338
 -0.413407	 -0.457708	 -1.675661
 -0.551474	 -0.333142	 -1.810248
 -0.645171	 -0.107775	 -1.866983
 -0.754060	 -0.020702	 -1.759439
 -0.776630	 -0.009277	 -1.680924
 -0.696093	  0.073893	 -1.771487
 -0.692505	  0.091637	 -1.835428
 -0.712708	  0.089322	 -1.881261
 -0.738394	  0.082378	 -1.923279
 -0.764581	  0.076328	 -1.964813
 -0.791789	  0.070325	 -2.011339
 -0.815388	  0.064852	 -2.052904
 -0.837940	  0.059057	 -2.092646
 -0.864199	  0.052344	 -2.137765
 -0.888520	  0.046672	 -2.178794
 -0.913949	  0.041276	 -2.222350
 -0.936805	  0.037359	 -2.264741
 -0.960377	  0.033901	 -2.312684
 -0.982483	  0.029453	 -2.357005
 -1.004362	  0.023312	 -2.398633
 -1.031494	  0.015727	 -2.444285
 -1.059023	  0.009630	 -2.488286
 -1.083285	  0.005068	 -2.530104
 -1.106252	 -0.000542	 -2.572183
 -1.131624	 -0.006865	 -2.613575
 -1.157826	 -0.011341	 -2.657580
 -1.186516	 -0.019212	 -2.700305
 -1.221236	 -0.025671	 -2.740059
 -1.233448	 -0.025928	 -2.767460
