 -2.234649	  1.946492	  0.631200
 -2.212524	  1.927220	  0.624950
 -2.172352	  1.898000	  0.613870
 -2.142395	  1.865441	  0.595082
 -2.104660	  1.837517	  0.575203
 -2.073983	  1.798893	  0.559038
 -2.039585	  1.769004	  0.536085
 -2.006220	  1.740276	  0.520029
 -1.974380	  1.703960	  0.506814
 -1.942590	  1.675598	  0.482441
 -1.915720	  1.636576	  0.467443
 -1.886555	  1.603941	  0.448978
 -1.855241	  1.569028	  0.428587
 -1.820939	  1.532317	  0.407859
 -1.791608	  1.499974	  0.390100
 -1.759791	  1.464672	  0.371571
 -1.728498	  1.431158	  0.353556
 -1.696403	  1.399410	  0.333236
 -1.662682	  1.369226	  0.310496
 -1.626915	  1.341203	  0.287666
 -1.591635	  1.315666	  0.267638
 -1.555692	  1.286409	  0.247457
 -1.522357	  1.256595	  0.229208
 -1.489527	  1.227349	  0.210813
 -1.453606	  1.195857	  0.190225
 -1.415783	  1.162842	  0.170906
 -1.381173	  1.131547	  0.154435
 -1.346590	  1.099380	  0.138738
 -1.315234	  1.068255	  0.124191
 -1.284117	  1.033718	  0.108083
 -1.255513	  0.997829	  0.091789
 -1.226315	  0.958140	  0.074655
 -1.196808	  0.919001	  0.057032
 -1.166390	  0.882975	  0.040335
 -1.133102	  0.848282	  0.023853
 -1.099753	  0.816857	  0.008386
 -1.067070	  0.787711	 -0.007829
 -1.031288	  0.758132	 -0.026648
 -0.993185	  0.728019	 -0.046844
 -0.956122	  0.699230	 -0.064468
 -0.921051	  0.671405	 -0.079332
 -0.883211	  0.640490	 -0.093811
 -0.846208	  0.608601	 -0.106454
 -0.811832	  0.576834	 -0.118567
 -0.777936	  0.543158	 -0.132363
 -0.746656	  0.511154	 -0.146745
 -0.713231	  0.475920	 -0.165868
 -0.683387	  0.440767	 -0.187521
 -0.654205	  0.405356	 -0.209633
 -0.626398	  0.373700	 -0.229685
 -0.594213	  0.340838	 -0.251278
 -0.560892	  0.308234	 -0.273388
 -0.528834	  0.275871	 -0.294452
 -0.496201	  0.243430	 -0.313399
 -0.463350	  0.210048	 -0.331169
 -0.431861	  0.176349	 -0.347836
 -0.400866	  0.141723	 -0.364022
 -0.371549	  0.107299	 -0.379756
 -0.340109	  0.070202	 -0.396456
 -0.309027	  0.033777	 -0.413358
 -0.279576	  0.001218	 -0.429778
 -0.246318	 -0.031828	 -0.449124
 -0.210174	 -0.063829	 -0.470196
 -0.175112	 -0.091839	 -0.490517
 -0.139324	 -0.119039	 -0.510927
 -0.100832	 -0.147734	 -0.531995
 -0.063308	 -0.175890	 -0.551732
 -0.028574	 -0.203162	 -0.568933
  0.008581	 -0.234279	 -0.586751
  0.043381	 -0.265817	 -0.602179
  0.077730	 -0.300363	 -0.617822
  0.108783	 -0.335567	 -0.633324
  0.138413	 -0.370535	 -0.647872
  0.169835	 -0.405926	 -0.662516
  0.203663	 -0.441819	 -0.677786
  0.238057	 -0.477379	 -0.695238
  0.268164	 -0.508532	 -0.713230
  0.298123	 -0.539564	 -0.732787
  0.329608	 -0.571571	 -0.754438
  0.361088	 -0.602943	 -0.777062
  0.394162	 -0.635196	 -0.802011
  0.424697	 -0.665728	 -0.825778
  0.456598	 -0.699308	 -0.848069
  0.486553	 -0.732606	 -0.865697
  0.515772	 -0.765957	 -0.880021
  0.549103	 -0.802108	 -0.893611
  0.585126	 -0.838350	 -0.907534
  0.617506	 -0.869901	 -0.921337
  0.651664	 -0.904004	 -0.940067
  0.683021	 -0.935531	 -0.958825
  0.716979	 -0.969222	 -0.977645
  0.751412	 -1.001652	 -0.994952
  0.786935	 -1.033257	 -1.013373
  0.819655	 -1.064418	 -1.033434
  0.853556	 -1.096737	 -1.053618
  0.885846	 -1.125839	 -1.073354
  0.913971	 -1.155328	 -1.092125
  0.945802	 -1.185778	 -1.111251
  0.983472	 -1.218935	 -1.126908
  1.018215	 -1.249831	 -1.142639
  1.049583	 -1.284168	 -1.161457
  1.084018	 -1.321642	 -1.172354
  1.116582	 -1.349106	 -1.197301
  1.147961	 -1.383900	 -1.217239
  1.183241	 -1.419805	 -1.230368
  1.218424	 -1.448150	 -1.252394
  1.250296	 -1.478668	 -1.270724
  1.279193	 -1.516051	 -1.282603
  1.310527	 -1.549008	 -1.304629
  1.345604	 -1.578687	 -1.325727
  1.380481	 -1.613626	 -1.338263
  1.412282	 -1.642234	 -1.361555
  1.441056	 -1.678948	 -1.375932
  1.470282	 -1.716166	 -1.392978
  1.506782	 -1.746189	 -1.415986
  1.536916	 -1.779101	 -1.431753
  1.565902	 -1.813212	 -1.452502
  1.599358	 -1.844190	 -1.470528
  1.632580	 -1.875833	 -1.488537
  1.665597	 -1.910612	 -1.505695
  1.704000	 -1.942110	 -1.524661
  1.721040	 -1.961532	 -1.539908
