 -2.020861	 -0.352813	  2.229920
 -2.000853	 -0.349319	  2.207842
 -1.975036	 -0.374990	  2.179179
 -1.951324	 -0.409248	  2.153515
 -1.926927	 -0.442541	  2.125533
 -1.901412	 -0.476246	  2.092966
 -1.880801	 -0.506395	  2.065046
 -1.858811	 -0.538433	  2.034469
 -1.836299	 -0.571003	  2.002236
 -1.815383	 -0.602454	  1.970865
 -1.795193	 -0.633617	  1.940065
 -1.773851	 -0.667230	  1.907326
 -1.753113	 -0.698233	  1.876794
 -1.731200	 -0.729394	  1.846151
 -1.707815	 -0.761921	  1.813927
 -1.686155	 -0.793122	  1.782810
 -1.663947	 -0.826188	  1.750194
 -1.642807	 -0.859497	  1.718717
 -1.621599	 -0.894294	  1.688475
 -1.600924	 -0.927179	  1.661274
 -1.577647	 -0.962495	  1.632274
 -1.555620	 -0.995023	  1.605333
 -1.532015	 -1.028688	  1.577756
 -1.507843	 -1.062685	  1.550743
 -1.484877	 -1.096796	  1.524409
 -1.461925	 -1.133622	  1.495261
 -1.441755	 -1.168012	  1.466437
 -1.422404	 -1.201527	  1.436153
 -1.403906	 -1.232990	  1.406084
 -1.383608	 -1.265729	  1.372779
 -1.362078	 -1.297729	  1.336999
 -1.340532	 -1.327818	  1.301125
 -1.319807	 -1.355452	  1.267246
 -1.298525	 -1.383160	  1.234278
 -1.276116	 -1.412813	  1.201102
 -1.253444	 -1.444284	  1.168233
 -1.232707	 -1.474202	  1.137689
 -1.210868	 -1.507738	  1.104869
 -1.189935	 -1.541332	  1.073946
 -1.168661	 -1.576473	  1.043775
 -1.147349	 -1.611202	  1.015154
 -1.126527	 -1.644574	  0.987471
 -1.106401	 -1.677049	  0.959837
 -1.084184	 -1.711675	  0.928935
 -1.061432	 -1.745332	  0.897111
 -1.039053	 -1.776204	  0.867075
 -1.015541	 -1.807749	  0.836492
 -0.991400	 -1.839364	  0.807432
 -0.968419	 -1.869091	  0.780963
 -0.941741	 -1.902233	  0.753218
 -0.914418	 -1.938735	  0.730293
 -0.891328	 -1.977990	  0.702806
 -0.871734	 -2.013688	  0.675624
 -0.850823	 -2.047454	  0.649096
 -0.829584	 -2.080801	  0.623339
 -0.805952	 -2.116743	  0.594589
 -0.781547	 -2.151507	  0.564214
 -0.758556	 -2.183122	  0.535170
 -0.734362	 -2.215944	  0.505053
 -0.711048	 -2.248408	  0.473094
 -0.689407	 -2.277849	  0.442928
 -0.665808	 -2.309027	  0.409389
 -0.643771	 -2.338054	  0.376566
 -0.621400	 -2.368532	  0.342471
 -0.600422	 -2.397664	  0.309860
 -0.577721	 -2.429093	  0.275174
 -0.556949	 -2.458421	  0.243941
 -0.535815	 -2.489249	  0.212332
 -0.514468	 -2.522179	  0.178664
 -0.492783	 -2.554628	  0.148340
 -0.468991	 -2.586251	  0.120672
 -0.454152	 -2.616184	  0.084272
 -0.431417	 -2.647355	  0.054212
 -0.407178	 -2.685719	  0.030990
 -0.387169	 -2.715094	 -0.006423
 -0.365824	 -2.750842	 -0.037423
 -0.340079	 -2.779975	 -0.065200
 -0.322814	 -2.810579	 -0.099211
 -0.303305	 -2.845221	 -0.126009
 -0.279883	 -2.878507	 -0.153466
 -0.254145	 -2.911504	 -0.187711
 -0.232351	 -2.947940	 -0.218293
 -0.216403	 -2.981600	 -0.251463
 -0.218567	 -3.011416	 -0.253977
