  2.384062	  0.670040	  0.101533
  2.425462	  0.669499	  0.097070
  2.408122	  0.670873	  0.087724
  2.383337	  0.674149	  0.097141
  2.360114	  0.674848	  0.107810
  2.346613	  0.675901	  0.112365
  2.328794	  0.675932	  0.115331
  2.307952	  0.675040	  0.117114
  2.291341	  0.675038	  0.120578
  2.269172	  0.673667	  0.125396
  2.248695	  0.679047	  0.139147
  2.238427	  0.684958	  0.149004
  2.225178	  0.693946	  0.162191
  2.213463	  0.702767	  0.174937
  2.200180	  0.708263	  0.189802
  2.190859	  0.712391	  0.205055
  2.179811	  0.724577	  0.228165
  2.176535	  0.737103	  0.249607
  2.176784	  0.744106	  0.261199
  2.178016	  0.757028	  0.276645
  2.181024	  0.772577	  0.291062
  2.186420	  0.786157	  0.310655
  2.192399	  0.796426	  0.327511
  2.195291	  0.802002	  0.335991
  2.202640	  0.815240	  0.351991
  2.209934	  0.829298	  0.374897
  2.213126	  0.836179	  0.387707
  2.217590	  0.848045	  0.403611
  2.216768	  0.866002	  0.421823
  2.214321	  0.875779	  0.429720
  2.210140	  0.891908	  0.439410
  2.215229	  0.921103	  0.463068
  2.218204	  0.930502	  0.472606
  2.224457	  0.940086	  0.484389
  2.225936	  0.957809	  0.513399
  2.216768	  0.968020	  0.536917
  2.213543	  0.972191	  0.547692
  2.208447	  0.978987	  0.564636
  2.202600	  0.986116	  0.586079
  2.191095	  0.992103	  0.607545
  2.186159	  0.994325	  0.616615
  2.184314	  0.995004	  0.639365
  2.180499	  0.994377	  0.661317
  2.163067	  1.002566	  0.679443
  2.146765	  1.011538	  0.694173
  2.137218	  1.019854	  0.708285
  2.131516	  1.025702	  0.720267
  2.118649	  1.039012	  0.744914
  2.112152	  1.045528	  0.760655
  2.111586	  1.047249	  0.767556
  2.107732	  1.050817	  0.791173
  2.100691	  1.057856	  0.818960
  2.094654	  1.064595	  0.835020
  2.088007	  1.071981	  0.850916
  2.079965	  1.081699	  0.867834
  2.072303	  1.092998	  0.882311
  2.065307	  1.107397	  0.893592
  2.059525	  1.121759	  0.908794
  2.053735	  1.128087	  0.926333
  2.045696	  1.136225	  0.944279
  2.035395	  1.150070	  0.953909
  2.028376	  1.165259	  0.966677
  2.022636	  1.178984	  0.980559
  2.017139	  1.193884	  0.996120
  2.011560	  1.213310	  1.016490
  2.007962	  1.226896	  1.030720
