  0.493935	  0.165598	  2.492914
  0.498666	  0.171908	  2.497195
  0.488121	  0.157844	  2.487655
  0.477472	  0.143757	  2.478266
  0.465986	  0.129519	  2.470184
  0.454321	  0.115231	  2.462457
  0.441649	  0.100751	  2.457021
  0.426959	  0.087195	  2.456602
  0.411401	  0.075294	  2.460626
  0.395844	  0.063410	  2.464701
  0.380783	  0.053368	  2.473196
  0.366688	  0.045115	  2.484733
  0.352599	  0.036870	  2.496289
  0.338506	  0.028627	  2.507841
  0.324420	  0.020380	  2.519398
  0.310327	  0.012138	  2.530951
  0.296378	  0.003975	  2.542388
  0.285955	 -0.002647	  2.551970
  0.275768	 -0.011754	  2.566574
