  1.461453	  0.690178	  1.920846
  1.455139	  0.689716	  1.912293
  1.449769	  0.689324	  1.905019
  1.438644	  0.690726	  1.886906
  1.425616	  0.685738	  1.871539
  1.414675	  0.680488	  1.855848
  1.406187	  0.674992	  1.839673
  1.397728	  0.668012	  1.822401
  1.391934	  0.658766	  1.805669
  1.382335	  0.649939	  1.786007
  1.369832	  0.650295	  1.772146
  1.357094	  0.650886	  1.755527
  1.348522	  0.645448	  1.737376
  1.342171	  0.640354	  1.720384
  1.334634	  0.635006	  1.700577
  1.324580	  0.631606	  1.682257
  1.315565	  0.631532	  1.668362
  1.307672	  0.629317	  1.648593
  1.299752	  0.624851	  1.628694
  1.288061	  0.624546	  1.611641
  1.277844	  0.627549	  1.596445
  1.264406	  0.631688	  1.578671
  1.254924	  0.633547	  1.564459
  1.243627	  0.634600	  1.546524
  1.232265	  0.635212	  1.529989
  1.221228	  0.634018	  1.513960
  1.207779	  0.631736	  1.497478
  1.196289	  0.633325	  1.481870
  1.186941	  0.634321	  1.464779
  1.175207	  0.635969	  1.446630
  1.162820	  0.635528	  1.430435
  1.153373	  0.632995	  1.415509
  1.141974	  0.630662	  1.397837
  1.130074	  0.627513	  1.381508
  1.119052	  0.622433	  1.366201
  1.108108	  0.618940	  1.349427
  1.097957	  0.615826	  1.332435
  1.088251	  0.612439	  1.315279
  1.079136	  0.609250	  1.298207
  1.072628	  0.605429	  1.279932
  1.066446	  0.599096	  1.260188
  1.059644	  0.591116	  1.242777
  1.049852	  0.584555	  1.226334
  1.041272	  0.582126	  1.209693
  1.032846	  0.579229	  1.191128
  1.023649	  0.574406	  1.173161
  1.010075	  0.570542	  1.156974
  0.997212	  0.569935	  1.142026
  0.986480	  0.568920	  1.124917
  0.978549	  0.570438	  1.106183
  0.970842	  0.573060	  1.086833
  0.963595	  0.576047	  1.068120
  0.954836	  0.578969	  1.050589
  0.943778	  0.580019	  1.034895
  0.932672	  0.579686	  1.018037
  0.923278	  0.578658	  1.000384
  0.915437	  0.578354	  0.982206
  0.906801	  0.579631	  0.964739
  0.897723	  0.579392	  0.946495
  0.888122	  0.578218	  0.929240
  0.879432	  0.575877	  0.911174
  0.871143	  0.572873	  0.893420
  0.862536	  0.567874	  0.876772
  0.851227	  0.563053	  0.858699
  0.839042	  0.559778	  0.843196
  0.831921	  0.560601	  0.824835
  0.825674	  0.560198	  0.805513
  0.817154	  0.562077	  0.785424
  0.804754	  0.560748	  0.770960
  0.793203	  0.557460	  0.755122
  0.781972	  0.556569	  0.737824
  0.773141	  0.556303	  0.720386
  0.765767	  0.555619	  0.701759
  0.754293	  0.556870	  0.683610
  0.743241	  0.554980	  0.668426
  0.732032	  0.551630	  0.651534
  0.722141	  0.549829	  0.633962
  0.716746	  0.547787	  0.615114
  0.712044	  0.544591	  0.594989
  0.702578	  0.542900	  0.576184
  0.693433	  0.538961	  0.561118
  0.686090	  0.532343	  0.542770
  0.679885	  0.525165	  0.525431
  0.674913	  0.518330	  0.508455
  0.667173	  0.510584	  0.488805
  0.660447	  0.503331	  0.473161
  0.650473	  0.496688	  0.454492
  0.639828	  0.490922	  0.436936
  0.633840	  0.487666	  0.420882
  0.623682	  0.479149	  0.410531
  0.609088	  0.463708	  0.390120
  0.606468	  0.453250	  0.368543
  0.593838	  0.448595	  0.356298
  0.579758	  0.444087	  0.347610
  0.560729	  0.441322	  0.339771
  0.544425	  0.434283	  0.325247
  0.531957	  0.430299	  0.309282
  0.518242	  0.430086	  0.293441
  0.502297	  0.430129	  0.282198
  0.488585	  0.426671	  0.268932
  0.477801	  0.424448	  0.251988
  0.465522	  0.426143	  0.234250
  0.451868	  0.427998	  0.219821
  0.439120	  0.423794	  0.206013
  0.427938	  0.419058	  0.189670
  0.417782	  0.414646	  0.172572
  0.408714	  0.410800	  0.155269
  0.395094	  0.411917	  0.138962
  0.381332	  0.411331	  0.124591
  0.369867	  0.406771	  0.109882
  0.359655	  0.400948	  0.091581
  0.352170	  0.400381	  0.071513
  0.344653	  0.399896	  0.052908
  0.337643	  0.396835	  0.037767
  0.330027	  0.395170	  0.018146
  0.320819	  0.397344	 -0.000809
  0.310636	  0.400902	 -0.017007
  0.300391	  0.404464	 -0.034717
  0.292020	  0.405002	 -0.052347
  0.283768	  0.403248	 -0.070250
  0.276421	  0.402372	 -0.090909
  0.268861	  0.405510	 -0.107099
  0.260907	  0.407658	 -0.125378
  0.250376	  0.406485	 -0.144745
  0.238177	  0.405180	 -0.160421
  0.218513	  0.409747	 -0.172573
  0.207513	  0.417804	 -0.187151
  0.201679	  0.420458	 -0.204654
  0.187048	  0.426306	 -0.220846
  0.170945	  0.425154	 -0.235496
  0.160902	  0.421726	 -0.251564
  0.154886	  0.420250	 -0.270926
  0.144520	  0.425001	 -0.290527
  0.129796	  0.426754	 -0.301712
  0.114099	  0.426187	 -0.317321
  0.104756	  0.422617	 -0.334283
  0.095814	  0.419279	 -0.351554
  0.083731	  0.413734	 -0.367060
  0.071490	  0.409208	 -0.384503
  0.062193	  0.405304	 -0.399654
  0.052517	  0.407774	 -0.420558
  0.041071	  0.407587	 -0.436921
  0.029108	  0.406785	 -0.453192
  0.019957	  0.404598	 -0.468192
  0.009626	  0.402934	 -0.485389
 -0.003744	  0.402459	 -0.500622
 -0.016659	  0.403453	 -0.518112
 -0.025823	  0.404344	 -0.533590
 -0.037665	  0.400177	 -0.552265
 -0.053883	  0.395840	 -0.565292
 -0.065088	  0.395618	 -0.579772
 -0.074698	  0.395565	 -0.596131
 -0.079746	  0.392991	 -0.616699
 -0.092101	  0.385984	 -0.636104
 -0.107333	  0.382369	 -0.648124
 -0.116695	  0.381653	 -0.663240
 -0.128106	  0.380920	 -0.680922
 -0.143057	  0.378033	 -0.695552
 -0.155187	  0.371672	 -0.711037
 -0.163409	  0.365849	 -0.728358
 -0.171137	  0.362058	 -0.745876
 -0.181042	  0.356574	 -0.764659
 -0.193666	  0.351052	 -0.778105
 -0.209156	  0.345442	 -0.789471
 -0.221885	  0.338224	 -0.805653
 -0.232169	  0.337023	 -0.821837
 -0.244864	  0.334739	 -0.835452
 -0.259510	  0.323708	 -0.848648
 -0.270926	  0.320063	 -0.864870
 -0.280027	  0.314761	 -0.879824
 -0.289381	  0.307015	 -0.896019
 -0.302685	  0.301624	 -0.914562
 -0.315575	  0.292571	 -0.925273
 -0.327699	  0.280281	 -0.935511
 -0.338730	  0.268593	 -0.945728
 -0.349319	  0.252985	 -0.954337
 -0.358416	  0.237082	 -0.961569
 -0.366836	  0.221830	 -0.968901
 -0.379829	  0.204240	 -0.979859
 -0.389641	  0.190504	 -0.984981
 -0.397303	  0.174453	 -0.991050
 -0.404949	  0.156496	 -1.000256
 -0.414462	  0.138530	 -1.005224
 -0.417405	  0.120811	 -1.007203
 -0.420416	  0.101502	 -1.012243
 -0.429154	  0.080322	 -1.016860
 -0.433596	  0.064777	 -1.020936
 -0.436547	  0.044939	 -1.025232
 -0.442065	  0.023662	 -1.027523
 -0.448940	  0.007266	 -1.033836
 -0.453957	 -0.011066	 -1.040332
 -0.458523	 -0.030724	 -1.043674
 -0.465836	 -0.048298	 -1.048933
 -0.474843	 -0.065138	 -1.056650
 -0.483548	 -0.082586	 -1.062541
 -0.488133	 -0.101785	 -1.067758
 -0.493292	 -0.118746	 -1.075919
 -0.502933	 -0.134951	 -1.083433
 -0.509492	 -0.153436	 -1.088201
 -0.511984	 -0.172211	 -1.093372
 -0.522021	 -0.188452	 -1.104459
 -0.532618	 -0.203329	 -1.114917
 -0.535551	 -0.221359	 -1.120378
 -0.540317	 -0.239438	 -1.125489
 -0.548303	 -0.256684	 -1.136046
 -0.555263	 -0.273947	 -1.147909
 -0.553686	 -0.289808	 -1.155070
 -0.555062	 -0.308154	 -1.164925
 -0.557388	 -0.325500	 -1.174907
 -0.558627	 -0.341249	 -1.186925
 -0.559651	 -0.356077	 -1.200420
 -0.561708	 -0.372492	 -1.214289
 -0.559316	 -0.386943	 -1.228426
 -0.553158	 -0.396009	 -1.243840
 -0.547768	 -0.399318	 -1.262315
 -0.544118	 -0.401226	 -1.282244
 -0.543364	 -0.407936	 -1.303339
 -0.547117	 -0.407092	 -1.322998
 -0.544371	 -0.407526	 -1.341823
 -0.544091	 -0.404320	 -1.361198
 -0.547185	 -0.397912	 -1.380967
 -0.555915	 -0.390117	 -1.397390
 -0.567664	 -0.382671	 -1.414494
 -0.575409	 -0.377421	 -1.431845
 -0.578289	 -0.374139	 -1.450960
 -0.581800	 -0.371599	 -1.469927
 -0.586378	 -0.367132	 -1.489047
 -0.592006	 -0.361906	 -1.508078
 -0.598520	 -0.356705	 -1.526381
 -0.605541	 -0.351581	 -1.544412
 -0.612923	 -0.346058	 -1.562160
 -0.621134	 -0.339626	 -1.579224
 -0.629351	 -0.333186	 -1.596283
 -0.637568	 -0.326747	 -1.613343
 -0.645785	 -0.320308	 -1.630402
 -0.654002	 -0.313869	 -1.647461
 -0.662219	 -0.307429	 -1.664520
 -0.670438	 -0.300959	 -1.681562
 -0.678864	 -0.290504	 -1.696347
 -0.686166	 -0.273353	 -1.703096
 -0.694430	 -0.256959	 -1.710994
 -0.702284	 -0.242107	 -1.721132
 -0.707628	 -0.223294	 -1.732034
 -0.710682	 -0.203335	 -1.738838
 -0.716941	 -0.184854	 -1.736218
 -0.725078	 -0.165124	 -1.733383
 -0.735348	 -0.151057	 -1.724174
 -0.744224	 -0.133767	 -1.715519
 -0.749080	 -0.115629	 -1.707493
 -0.754624	 -0.098409	 -1.700196
 -0.761063	 -0.080942	 -1.694375
 -0.767554	 -0.061105	 -1.690203
 -0.768362	 -0.040660	 -1.688666
 -0.764741	 -0.020869	 -1.683229
 -0.764649	 -0.002355	 -1.679364
 -0.766648	  0.015669	 -1.676152
 -0.766010	  0.035831	 -1.677206
 -0.763385	  0.055446	 -1.681619
 -0.762192	  0.074612	 -1.686668
 -0.763922	  0.094256	 -1.691912
 -0.761026	  0.111532	 -1.703340
 -0.751186	  0.126634	 -1.709540
 -0.743176	  0.139393	 -1.722452
 -0.739068	  0.152561	 -1.738264
 -0.738530	  0.164615	 -1.753414
 -0.735018	  0.177553	 -1.769031
 -0.730889	  0.190060	 -1.784086
 -0.735086	  0.192377	 -1.803463
 -0.739213	  0.194549	 -1.822737
 -0.742022	  0.196303	 -1.841360
 -0.746996	  0.195548	 -1.862780
 -0.754093	  0.191391	 -1.881296
 -0.764169	  0.193638	 -1.897397
 -0.774316	  0.190659	 -1.914322
 -0.783344	  0.184929	 -1.932431
 -0.794288	  0.184125	 -1.948698
 -0.804937	  0.181538	 -1.965289
 -0.814219	  0.176302	 -1.982921
 -0.824849	  0.175286	 -1.999467
 -0.835284	  0.173163	 -2.016614
 -0.844264	  0.168820	 -2.034171
 -0.854670	  0.167689	 -2.051071
 -0.865084	  0.166039	 -2.068555
 -0.873612	  0.162073	 -2.085984
 -0.883827	  0.160870	 -2.102956
 -0.894042	  0.159675	 -2.120724
 -0.902508	  0.156223	 -2.138152
 -0.912730	  0.155421	 -2.155216
 -0.922998	  0.154625	 -2.173108
 -0.931277	  0.151417	 -2.190527
 -0.941180	  0.151077	 -2.208051
 -0.951343	  0.151339	 -2.226149
 -0.958121	  0.147750	 -2.243707
 -0.967324	  0.147804	 -2.261541
 -0.982873	  0.146167	 -2.294035
 -0.984836	  0.145626	 -2.298603
