 -1.723916	 -1.815318	  0.100071
 -1.723931	 -1.807945	  0.096939
 -1.723953	 -1.797373	  0.092448
 -1.722787	 -1.780612	  0.081770
 -1.722317	 -1.762432	  0.070166
 -1.721340	 -1.744706	  0.061356
 -1.717828	 -1.726279	  0.055144
 -1.712987	 -1.709876	  0.045700
 -1.709722	 -1.693404	  0.033382
 -1.707440	 -1.675867	  0.023637
 -1.701275	 -1.659061	  0.015868
 -1.695095	 -1.643803	  0.005297
 -1.691776	 -1.625734	 -0.007146
 -1.688402	 -1.608036	 -0.014549
 -1.680905	 -1.592408	 -0.022903
 -1.672792	 -1.577206	 -0.033263
 -1.667583	 -1.557131	 -0.042132
 -1.666978	 -1.540907	 -0.050960
 -1.662555	 -1.523883	 -0.062447
 -1.655439	 -1.509450	 -0.072062
 -1.647889	 -1.492320	 -0.081262
 -1.640578	 -1.475575	 -0.089653
 -1.633693	 -1.458417	 -0.097813
 -1.628167	 -1.440822	 -0.105457
 -1.623008	 -1.423532	 -0.112941
 -1.618443	 -1.406621	 -0.121108
 -1.615467	 -1.385401	 -0.129018
 -1.614107	 -1.366052	 -0.134058
 -1.608863	 -1.347786	 -0.139400
 -1.598681	 -1.331468	 -0.145483
 -1.593662	 -1.313766	 -0.152025
 -1.590413	 -1.296202	 -0.159663
 -1.581099	 -1.276247	 -0.166874
 -1.574141	 -1.258590	 -0.170562
 -1.570340	 -1.242482	 -0.177393
 -1.567113	 -1.221356	 -0.182959
 -1.558981	 -1.203629	 -0.188574
 -1.549025	 -1.188833	 -0.196706
 -1.541581	 -1.170942	 -0.203362
 -1.533325	 -1.154153	 -0.209898
 -1.522836	 -1.138551	 -0.217881
 -1.511983	 -1.123046	 -0.224643
 -1.503727	 -1.106773	 -0.230835
 -1.490099	 -1.093333	 -0.239341
 -1.476630	 -1.080925	 -0.246077
 -1.465590	 -1.066410	 -0.252377
 -1.453390	 -1.052188	 -0.259789
 -1.439804	 -1.039229	 -0.267494
 -1.425968	 -1.026829	 -0.274997
 -1.410803	 -1.015838	 -0.282004
 -1.394903	 -1.005718	 -0.288695
 -1.378989	 -0.995614	 -0.295377
 -1.363075	 -0.985510	 -0.302060
 -1.347148	 -0.975415	 -0.308721
 -1.330461	 -0.965906	 -0.314293
 -1.313183	 -0.956946	 -0.318895
 -1.295896	 -0.947994	 -0.323480
 -1.278803	 -0.938892	 -0.328296
 -1.261918	 -0.929252	 -0.333414
 -1.245381	 -0.918193	 -0.335878
 -1.228164	 -0.907591	 -0.336548
 -1.211531	 -0.897022	 -0.337485
 -1.195016	 -0.886280	 -0.337620
 -1.182140	 -0.872155	 -0.335591
 -1.174144	 -0.854818	 -0.326444
 -1.169860	 -0.838833	 -0.317112
 -1.169897	 -0.821910	 -0.309377
 -1.170715	 -0.802874	 -0.299713
 -1.169476	 -0.786126	 -0.287566
 -1.171780	 -0.768310	 -0.280578
 -1.173528	 -0.751137	 -0.271796
 -1.173770	 -0.732609	 -0.260062
 -1.176165	 -0.714440	 -0.252670
 -1.179662	 -0.696572	 -0.246603
 -1.181557	 -0.678765	 -0.237609
 -1.184156	 -0.660387	 -0.229275
 -1.187016	 -0.642138	 -0.221529
 -1.189873	 -0.623916	 -0.213796
 -1.192730	 -0.605694	 -0.206062
 -1.195685	 -0.587471	 -0.198442
 -1.203423	 -0.569187	 -0.196284
 -1.212362	 -0.551307	 -0.195752
 -1.221325	 -0.533435	 -0.195251
 -1.230287	 -0.515562	 -0.194750
 -1.239140	 -0.497657	 -0.194313
 -1.242601	 -0.478151	 -0.196898
 -1.245141	 -0.458551	 -0.199958
 -1.247668	 -0.438950	 -0.203026
 -1.250194	 -0.419349	 -0.206095
 -1.252721	 -0.399748	 -0.209163
 -1.255136	 -0.380162	 -0.212289
 -1.252094	 -0.361289	 -0.218088
 -1.246791	 -0.343242	 -0.224875
 -1.241446	 -0.325211	 -0.231682
 -1.236102	 -0.307181	 -0.238489
 -1.230757	 -0.289150	 -0.245296
 -1.225412	 -0.271120	 -0.252103
 -1.220093	 -0.253097	 -0.258944
 -1.216085	 -0.235528	 -0.267527
 -1.217305	 -0.221450	 -0.281628
 -1.218635	 -0.207445	 -0.295843
 -1.219966	 -0.193439	 -0.310059
 -1.221297	 -0.179434	 -0.324274
 -1.222778	 -0.165540	 -0.338522
 -1.231521	 -0.156864	 -0.354222
 -1.241409	 -0.149312	 -0.369879
 -1.251318	 -0.141781	 -0.385535
 -1.261257	 -0.134324	 -0.401196
 -1.272662	 -0.130505	 -0.417162
 -1.284240	 -0.129386	 -0.432798
 -1.295837	 -0.130096	 -0.449785
 -1.307361	 -0.135552	 -0.464575
 -1.322749	 -0.138550	 -0.478232
 -1.338859	 -0.142572	 -0.488461
 -1.356406	 -0.147992	 -0.496282
 -1.372647	 -0.156355	 -0.504563
 -1.387823	 -0.165470	 -0.513420
 -1.402349	 -0.176096	 -0.522145
 -1.417066	 -0.186840	 -0.530108
 -1.433616	 -0.186832	 -0.535003
 -1.446922	 -0.188706	 -0.541080
 -1.466185	 -0.178440	 -0.546338
 -1.482977	 -0.166062	 -0.546221
 -1.499795	 -0.157374	 -0.544133
 -1.516230	 -0.144820	 -0.542577
 -1.530882	 -0.132047	 -0.543153
 -1.547650	 -0.122673	 -0.542261
 -1.565604	 -0.106338	 -0.539387
 -1.577000	 -0.095787	 -0.543295
 -1.594605	 -0.084890	 -0.549841
 -1.612826	 -0.067793	 -0.547254
 -1.625386	 -0.055915	 -0.545095
 -1.637094	 -0.043778	 -0.542301
 -1.655093	 -0.030846	 -0.543582
 -1.670390	 -0.017276	 -0.541351
 -1.685028	 -0.004353	 -0.540061
 -1.701477	  0.006256	 -0.544108
 -1.717194	  0.021355	 -0.542510
 -1.730925	  0.036334	 -0.537924
 -1.747052	  0.046512	 -0.537084
 -1.763552	  0.056902	 -0.534198
 -1.780368	  0.070339	 -0.530097
 -1.792536	  0.084231	 -0.529381
 -1.809797	  0.093896	 -0.535108
 -1.827692	  0.106798	 -0.533448
 -1.842516	  0.120818	 -0.527183
 -1.860710	  0.119487	 -0.532671
 -1.869634	  0.130648	 -0.534409
 -1.888007	  0.142132	 -0.529720
 -1.907658	  0.149109	 -0.528334
 -1.926415	  0.153488	 -0.528674
 -1.945500	  0.155278	 -0.533252
 -1.963805	  0.158708	 -0.543167
 -1.981485	  0.161504	 -0.546427
 -2.001394	  0.166592	 -0.548805
 -2.021435	  0.170741	 -0.554582
 -2.039862	  0.177254	 -0.559339
 -2.058806	  0.180876	 -0.566069
 -2.076076	  0.183068	 -0.567791
 -2.095972	  0.185391	 -0.574065
 -2.115171	  0.192473	 -0.581517
 -2.132386	  0.200845	 -0.583243
 -2.151496	  0.202564	 -0.589395
 -2.171172	  0.206216	 -0.592942
 -2.190678	  0.212994	 -0.600411
 -2.208290	  0.221879	 -0.603784
 -2.226048	  0.227715	 -0.603418
 -2.246243	  0.230430	 -0.608743
 -2.265615	  0.234820	 -0.611024
 -2.284854	  0.239418	 -0.615973
 -2.303752	  0.244265	 -0.620544
 -2.322601	  0.249994	 -0.623713
 -2.341320	  0.253281	 -0.630492
 -2.360442	  0.258301	 -0.633647
 -2.376619	  0.268502	 -0.639812
 -2.397931	  0.278202	 -0.650022
 -2.407610	  0.287600	 -0.654106
