  2.926781	  0.773782	  0.126937
  2.897803	  0.766121	  0.125681
  2.866129	  0.788983	  0.101028
  2.833409	  0.794081	  0.063490
  2.793923	  0.796987	  0.032581
  2.751753	  0.804201	  0.003866
  2.716779	  0.819240	 -0.028929
  2.684308	  0.829730	 -0.061304
  2.646173	  0.843017	 -0.093126
  2.612919	  0.860681	 -0.126239
  2.580800	  0.886841	 -0.157084
  2.541966	  0.893627	 -0.184964
  2.510139	  0.910947	 -0.218915
  2.470984	  0.920350	 -0.248487
  2.430555	  0.939889	 -0.272795
  2.392055	  0.949660	 -0.303392
  2.357793	  0.966450	 -0.332899
  2.322246	  0.982110	 -0.364663
  2.284837	  0.997365	 -0.399261
  2.250474	  1.009680	 -0.431288
  2.215528	  1.018578	 -0.462074
  2.179621	  1.025189	 -0.495301
  2.145197	  1.031748	 -0.531114
  2.111489	  1.039938	 -0.566819
  2.077355	  1.049198	 -0.601272
  2.041970	  1.059085	 -0.633656
  2.003219	  1.070135	 -0.664134
  1.964188	  1.082210	 -0.690812
  1.923799	  1.096583	 -0.717898
  1.885594	  1.112180	 -0.745405
  1.847523	  1.127762	 -0.775579
  1.811644	  1.141878	 -0.808809
  1.778203	  1.154276	 -0.843177
  1.746499	  1.164943	 -0.876392
  1.713256	  1.174819	 -0.910868
  1.679950	  1.183380	 -0.944464
  1.642858	  1.193468	 -0.980155
  1.607390	  1.205770	 -1.014647
  1.574095	  1.220752	 -1.047347
  1.541006	  1.236505	 -1.079147
  1.505852	  1.253682	 -1.112359
  1.471261	  1.270969	 -1.144750
  1.438789	  1.287288	 -1.175077
  1.404483	  1.304378	 -1.207208
  1.369522	  1.321508	 -1.240695
  1.334960	  1.336732	 -1.273333
  1.301509	  1.349709	 -1.305054
  1.266938	  1.361285	 -1.338285
  1.229843	  1.372433	 -1.374246
  1.194295	  1.382968	 -1.408866
  1.161738	  1.393552	 -1.440565
  1.128722	  1.405322	 -1.473900
  1.093769	  1.417859	 -1.509290
  1.058215	  1.430127	 -1.543180
  1.022203	  1.441169	 -1.575842
  0.984960	  1.451583	 -1.608327
  0.947218	  1.461504	 -1.639592
  0.910539	  1.471241	 -1.668803
  0.874628	  1.481567	 -1.696554
  0.837201	  1.494208	 -1.724477
  0.799539	  1.509158	 -1.751204
  0.759016	  1.526362	 -1.778333
  0.719943	  1.542003	 -1.807549
  0.685855	  1.556392	 -1.837426
  0.650305	  1.572238	 -1.868271
  0.613162	  1.576776	 -1.905002
  0.578980	  1.584865	 -1.938604
  0.542395	  1.598266	 -1.973282
  0.502446	  1.612624	 -1.998376
  0.474621	  1.625444	 -2.035301
  0.439976	  1.637705	 -2.070065
  0.403235	  1.649410	 -2.105047
  0.368587	  1.661776	 -2.138327
  0.331915	  1.674043	 -2.170326
  0.294141	  1.685925	 -2.200655
  0.259082	  1.695373	 -2.227617
  0.221027	  1.703147	 -2.256270
  0.182446	  1.717356	 -2.289705
  0.148527	  1.732222	 -2.320646
  0.115726	  1.750141	 -2.353250
  0.078627	  1.765761	 -2.387272
  0.037281	  1.769019	 -2.422639
  0.037654	  1.786709	 -2.446866
