 -0.569250	 -1.543017	 -1.834817
 -0.574467	 -1.576762	 -1.868549
 -0.584992	 -1.577348	 -1.891995
 -0.590971	 -1.552012	 -1.894232
 -0.595257	 -1.526612	 -1.894048
 -0.601616	 -1.507115	 -1.899350
 -0.607783	 -1.491006	 -1.906410
 -0.612879	 -1.474946	 -1.913663
 -0.616948	 -1.460318	 -1.919438
 -0.618642	 -1.434853	 -1.930530
 -0.622419	 -1.413797	 -1.939272
 -0.623921	 -1.401770	 -1.943154
 -0.626514	 -1.380715	 -1.948506
 -0.627481	 -1.362598	 -1.954747
 -0.626381	 -1.347580	 -1.960346
 -0.622378	 -1.320885	 -1.967983
 -0.623146	 -1.305082	 -1.971635
 -0.627036	 -1.287180	 -1.975287
 -0.628516	 -1.264572	 -1.980121
 -0.627216	 -1.250227	 -1.983915
 -0.622537	 -1.229683	 -1.988993
 -0.618361	 -1.206103	 -1.994102
 -0.615587	 -1.191305	 -1.997901
 -0.614227	 -1.171802	 -2.000694
 -0.612139	 -1.150220	 -1.996471
 -0.611801	 -1.128776	 -1.996565
 -0.607942	 -1.105675	 -2.003749
 -0.600739	 -1.088612	 -2.011823
 -0.592558	 -1.075008	 -2.015902
 -0.584714	 -1.054675	 -2.014383
 -0.579504	 -1.033347	 -2.011209
 -0.574599	 -1.014346	 -2.004661
 -0.566896	 -0.996615	 -1.997161
 -0.556837	 -0.980735	 -1.989894
 -0.544265	 -0.968882	 -1.978070
 -0.534151	 -0.955572	 -1.967242
 -0.524237	 -0.937457	 -1.960570
 -0.510821	 -0.923042	 -1.953441
 -0.501808	 -0.908628	 -1.951639
 -0.489127	 -0.892846	 -1.947352
 -0.474317	 -0.880154	 -1.939604
 -0.461375	 -0.867638	 -1.931196
 -0.450530	 -0.854877	 -1.922288
 -0.439571	 -0.843314	 -1.910520
 -0.425663	 -0.833354	 -1.897750
 -0.408849	 -0.824389	 -1.884169
 -0.399376	 -0.818072	 -1.877524
 -0.382928	 -0.809747	 -1.867119
 -0.361192	 -0.801127	 -1.854812
 -0.349134	 -0.797452	 -1.846322
 -0.336902	 -0.791579	 -1.836653
 -0.315653	 -0.778155	 -1.818403
 -0.307007	 -0.772356	 -1.808770
 -0.296706	 -0.768887	 -1.798041
 -0.279563	 -0.762806	 -1.780065
 -0.265273	 -0.754822	 -1.769726
 -0.256804	 -0.748705	 -1.763771
 -0.242420	 -0.744330	 -1.756645
 -0.212684	 -0.734485	 -1.732163
 -0.197673	 -0.730429	 -1.717078
 -0.193349	 -0.730889	 -1.710714
 -0.184413	 -0.727310	 -1.698140
 -0.169668	 -0.718902	 -1.677658
 -0.155567	 -0.705064	 -1.648734
 -0.146950	 -0.701310	 -1.638932
 -0.141516	 -0.698100	 -1.633869
 -0.129883	 -0.685348	 -1.619910
 -0.118175	 -0.668522	 -1.597781
 -0.112166	 -0.665453	 -1.588608
 -0.098888	 -0.660004	 -1.572472
 -0.083899	 -0.653032	 -1.550306
 -0.075039	 -0.651561	 -1.533929
 -0.065783	 -0.647768	 -1.517618
 -0.050867	 -0.653814	 -1.497162
 -0.038882	 -0.656666	 -1.476279
 -0.034746	 -0.654729	 -1.464267
 -0.030349	 -0.646919	 -1.446534
 -0.022145	 -0.637704	 -1.429047
 -0.014120	 -0.632789	 -1.411376
 -0.008439	 -0.628225	 -1.391942
 -0.002378	 -0.622062	 -1.370346
  0.001482	 -0.617466	 -1.354681
  0.006526	 -0.610262	 -1.337950
  0.011515	 -0.601236	 -1.315479
  0.014808	 -0.593715	 -1.299734
  0.017850	 -0.586834	 -1.282707
  0.021986	 -0.575955	 -1.262223
  0.026037	 -0.564573	 -1.245027
  0.028777	 -0.554124	 -1.233379
  0.030891	 -0.540659	 -1.217643
  0.029617	 -0.529922	 -1.198752
  0.027132	 -0.520327	 -1.181093
  0.025255	 -0.511634	 -1.163231
  0.022878	 -0.503933	 -1.145167
  0.019191	 -0.496816	 -1.126955
  0.014278	 -0.489922	 -1.108197
  0.008347	 -0.483490	 -1.089303
  0.000893	 -0.475971	 -1.070342
 -0.003214	 -0.464457	 -1.053024
 -0.006790	 -0.450562	 -1.038281
 -0.011656	 -0.433553	 -1.026455
 -0.013786	 -0.417228	 -1.013927
 -0.012299	 -0.404427	 -1.001164
 -0.008655	 -0.389025	 -0.985199
 -0.008627	 -0.374796	 -0.971320
 -0.010769	 -0.361960	 -0.952094
 -0.010541	 -0.352152	 -0.931327
 -0.015061	 -0.344853	 -0.914651
 -0.023887	 -0.336701	 -0.900704
 -0.033119	 -0.324316	 -0.885877
 -0.041126	 -0.311314	 -0.871731
 -0.046502	 -0.298141	 -0.855106
 -0.052258	 -0.282431	 -0.834991
 -0.055226	 -0.274683	 -0.824595
 -0.059908	 -0.266976	 -0.818711
 -0.070383	 -0.249699	 -0.802303
 -0.081546	 -0.232608	 -0.788931
 -0.090201	 -0.215333	 -0.773271
 -0.094987	 -0.204024	 -0.764616
 -0.099686	 -0.187107	 -0.753505
 -0.108245	 -0.168525	 -0.741716
 -0.112300	 -0.160393	 -0.736012
 -0.110938	 -0.142143	 -0.722119
 -0.114636	 -0.123283	 -0.697489
 -0.113254	 -0.111431	 -0.678527
 -0.110831	 -0.106293	 -0.673093
 -0.111708	 -0.101973	 -0.665612
 -0.106870	 -0.083293	 -0.645051
 -0.106141	 -0.062571	 -0.624383
 -0.107996	 -0.049208	 -0.613985
 -0.108285	 -0.029021	 -0.602245
 -0.109094	 -0.011684	 -0.591244
 -0.111221	  0.007167	 -0.580016
 -0.110105	  0.019784	 -0.571216
 -0.107027	  0.033804	 -0.561637
 -0.103717	  0.054119	 -0.544935
 -0.101958	  0.063497	 -0.532705
 -0.097860	  0.074586	 -0.518788
 -0.093586	  0.090623	 -0.503716
 -0.091644	  0.101247	 -0.487262
 -0.086115	  0.118443	 -0.468497
 -0.086737	  0.137532	 -0.454948
 -0.087831	  0.147415	 -0.448596
 -0.089791	  0.161454	 -0.436080
 -0.086509	  0.177763	 -0.424025
 -0.079609	  0.193891	 -0.407461
 -0.075426	  0.208791	 -0.391226
 -0.077024	  0.220444	 -0.380148
 -0.078600	  0.236192	 -0.367028
 -0.077793	  0.252749	 -0.351948
 -0.073997	  0.266903	 -0.341833
 -0.065896	  0.287127	 -0.328853
 -0.063449	  0.300253	 -0.319981
 -0.063176	  0.319572	 -0.310535
 -0.063416	  0.333681	 -0.302310
 -0.064204	  0.350219	 -0.286565
 -0.061496	  0.364925	 -0.272221
 -0.057845	  0.377315	 -0.257190
 -0.054246	  0.386094	 -0.241020
 -0.050289	  0.397111	 -0.220917
 -0.045790	  0.413404	 -0.199377
 -0.043449	  0.423522	 -0.187209
 -0.040730	  0.433843	 -0.177700
 -0.039618	  0.453548	 -0.162663
 -0.036922	  0.470961	 -0.149064
 -0.033462	  0.481188	 -0.140596
 -0.026696	  0.496098	 -0.128188
 -0.019997	  0.516747	 -0.113282
 -0.014322	  0.535328	 -0.101550
 -0.011873	  0.546281	 -0.095523
 -0.009083	  0.562057	 -0.087509
 -0.006197	  0.584486	 -0.075987
 -0.002188	  0.600250	 -0.064667
  0.003343	  0.612690	 -0.052349
  0.008857	  0.628527	 -0.039591
  0.011773	  0.647895	 -0.026587
  0.013266	  0.661568	 -0.017114
  0.014879	  0.676546	 -0.005498
  0.015817	  0.693765	  0.005088
  0.017563	  0.710768	  0.013758
  0.021592	  0.729273	  0.025086
  0.027735	  0.749103	  0.041750
  0.029612	  0.764389	  0.054763
  0.030863	  0.773400	  0.064245
  0.032478	  0.781890	  0.072136
  0.035839	  0.799796	  0.087811
  0.041167	  0.831296	  0.113431
  0.043712	  0.836994	  0.118115
  0.040965	  0.846690	  0.125493
  0.046767	  0.862594	  0.138371
  0.054250	  0.882610	  0.156480
  0.064625	  0.900433	  0.170064
  0.067660	  0.908754	  0.175314
  0.080270	  0.931064	  0.186115
  0.088676	  0.941229	  0.190181
  0.094199	  0.957976	  0.203756
  0.102547	  0.978559	  0.220042
  0.108970	  0.993637	  0.227524
  0.113260	  1.004773	  0.232445
  0.123749	  1.023380	  0.243695
  0.130736	  1.037606	  0.254135
  0.137467	  1.053638	  0.266503
  0.145274	  1.068435	  0.281722
  0.149508	  1.074430	  0.290696
  0.155557	  1.088550	  0.307303
  0.162926	  1.105110	  0.322473
  0.171515	  1.121874	  0.334174
  0.178348	  1.141040	  0.347478
  0.183540	  1.153273	  0.350894
  0.189975	  1.172910	  0.357146
  0.200262	  1.196694	  0.363749
  0.208366	  1.206370	  0.369817
  0.221795	  1.220525	  0.382857
  0.229819	  1.229324	  0.393853
  0.233110	  1.242124	  0.406269
  0.237642	  1.267617	  0.425164
  0.246867	  1.281693	  0.435268
  0.254884	  1.290386	  0.439385
  0.266737	  1.305030	  0.445666
  0.281197	  1.322994	  0.452342
  0.295870	  1.341113	  0.460075
  0.303307	  1.361101	  0.468197
  0.305410	  1.378327	  0.477296
  0.308668	  1.391698	  0.487008
  0.313649	  1.404617	  0.498369
  0.320947	  1.418947	  0.513104
  0.328597	  1.437038	  0.529134
  0.331358	  1.448716	  0.538189
  0.332361	  1.463880	  0.548970
  0.334980	  1.477101	  0.558852
  0.345131	  1.497813	  0.576953
  0.349252	  1.515707	  0.589173
  0.348897	  1.525017	  0.594328
  0.349026	  1.548378	  0.612430
  0.349494	  1.557745	  0.621719
  0.352099	  1.567113	  0.630488
  0.357107	  1.591603	  0.653367
  0.357782	  1.608485	  0.668340
  0.358111	  1.617455	  0.678258
  0.358611	  1.632817	  0.687062
  0.358717	  1.650953	  0.699390
  0.359891	  1.664720	  0.708333
  0.360918	  1.681687	  0.720290
  0.362389	  1.697538	  0.732384
  0.367027	  1.717631	  0.748637
  0.368818	  1.729749	  0.757781
  0.369162	  1.745944	  0.766619
  0.366585	  1.769336	  0.780591
  0.361755	  1.786601	  0.787739
  0.357976	  1.803087	  0.792147
  0.355255	  1.822478	  0.801631
  0.355462	  1.839190	  0.811426
  0.356968	  1.855618	  0.825524
  0.359081	  1.871880	  0.842985
  0.357985	  1.882049	  0.848327
  0.354630	  1.897914	  0.861428
  0.350164	  1.924243	  0.882046
  0.347341	  1.935140	  0.888408
  0.344733	  1.946950	  0.893726
  0.336753	  1.970134	  0.900095
  0.332265	  1.991954	  0.913348
  0.333156	  2.003709	  0.921471
  0.336047	  2.019851	  0.933147
  0.337906	  2.033454	  0.942016
  0.336201	  2.053176	  0.950712
  0.331777	  2.081529	  0.970277
  0.327488	  2.092478	  0.978446
  0.329153	  2.103006	  0.986603
  0.324953	  2.116819	  1.000910
  0.323446	  2.134326	  1.016380
  0.328337	  2.153557	  1.027880
  0.334414	  2.167170	  1.034974
  0.336003	  2.181090	  1.047707
  0.335869	  2.195520	  1.063391
  0.337067	  2.210707	  1.078178
  0.339648	  2.230576	  1.093276
  0.340461	  2.252021	  1.106709
  0.343443	  2.267895	  1.118504
