  2.357386	  0.644050	  0.660412
  2.362213	  0.646073	  0.658313
  2.348676	  0.636411	  0.670135
  2.334318	  0.628287	  0.679805
  2.317461	  0.618806	  0.693234
  2.299668	  0.613124	  0.699246
  2.283130	  0.608555	  0.702077
  2.264178	  0.598384	  0.707806
  2.245153	  0.588813	  0.717149
  2.229981	  0.584990	  0.724798
  2.210523	  0.579753	  0.733793
  2.194780	  0.574332	  0.738292
  2.177295	  0.571917	  0.741337
  2.154186	  0.569108	  0.751965
  2.134878	  0.556817	  0.765337
  2.123499	  0.543431	  0.769642
  2.110858	  0.534246	  0.769510
  2.089784	  0.525420	  0.772169
  2.071158	  0.517564	  0.777326
  2.053305	  0.510075	  0.782416
  2.035371	  0.502677	  0.787278
  2.017517	  0.495199	  0.792244
  1.999373	  0.488243	  0.797110
  1.981239	  0.481193	  0.801972
  1.962725	  0.475193	  0.806008
  1.946576	  0.468328	  0.810831
  1.928632	  0.461009	  0.820436
  1.909638	  0.461825	  0.832754
  1.883337	  0.464801	  0.832067
  1.862922	  0.459295	  0.826548
  1.845723	  0.451069	  0.821602
  1.826263	  0.445250	  0.817562
  1.802917	  0.437859	  0.820691
  1.789650	  0.436089	  0.821947
  1.769657	  0.430409	  0.825390
  1.748964	  0.422551	  0.828025
  1.730865	  0.416487	  0.833425
  1.711750	  0.411994	  0.840557
  1.692835	  0.406153	  0.843018
  1.674698	  0.397800	  0.839640
  1.656637	  0.384384	  0.833239
  1.639530	  0.375316	  0.829043
  1.619061	  0.373811	  0.827019
  1.592571	  0.373709	  0.828008
  1.572751	  0.372534	  0.834810
  1.559906	  0.367799	  0.840798
  1.542966	  0.356172	  0.845453
  1.523275	  0.347026	  0.848454
  1.504306	  0.340342	  0.850370
  1.485513	  0.333752	  0.852247
  1.467001	  0.326276	  0.853396
  1.448942	  0.317686	  0.853603
  1.430891	  0.309076	  0.853792
  1.412935	  0.300276	  0.853837
  1.395139	  0.291162	  0.853606
  1.377398	  0.282128	  0.853492
  1.359735	  0.275682	  0.854605
  1.339808	  0.271652	  0.855871
  1.322356	  0.263419	  0.854396
  1.300796	  0.245710	  0.853684
  1.287119	  0.235422	  0.855233
  1.271883	  0.225523	  0.854798
  1.254077	  0.214223	  0.854492
  1.236564	  0.201154	  0.853629
  1.223965	  0.190680	  0.853576
  1.205623	  0.182586	  0.856255
  1.182821	  0.177094	  0.866014
  1.163611	  0.171991	  0.874430
  1.149838	  0.162986	  0.873030
  1.129216	  0.147450	  0.869834
  1.113021	  0.137077	  0.875273
  1.097686	  0.131055	  0.881929
  1.078090	  0.124594	  0.890471
  1.061659	  0.119931	  0.904878
  1.046365	  0.115599	  0.918748
  1.030091	  0.107688	  0.926654
  1.013713	  0.100185	  0.934206
  0.997550	  0.094801	  0.945765
  0.981594	  0.085601	  0.955849
  0.966233	  0.072506	  0.963548
  0.949726	  0.062126	  0.970310
  0.928772	  0.054964	  0.971197
  0.909527	  0.050750	  0.968424
  0.889864	  0.045581	  0.971879
  0.871980	  0.042773	  0.979349
  0.852436	  0.039311	  0.984988
  0.833243	  0.032368	  0.985750
  0.814751	  0.024643	  0.985715
  0.796254	  0.016959	  0.985233
  0.777989	  0.009100	  0.983163
  0.762635	 -0.001515	  0.975877
  0.747407	 -0.012174	  0.968474
  0.732220	 -0.023030	  0.961277
  0.717061	 -0.033974	  0.954175
  0.701999	 -0.044942	  0.946996
  0.692876	 -0.057253	  0.934752
  0.685194	 -0.069386	  0.919693
  0.677403	 -0.079867	  0.907138
  0.664231	 -0.093576	  0.895873
  0.655291	 -0.108354	  0.882117
  0.645359	 -0.122636	  0.872943
  0.636329	 -0.134885	  0.865625
  0.626543	 -0.149578	  0.852920
  0.619393	 -0.162646	  0.841745
  0.612960	 -0.178000	  0.829257
  0.609775	 -0.192008	  0.809228
  0.607495	 -0.199734	  0.794160
  0.597446	 -0.211953	  0.775636
  0.584639	 -0.224594	  0.763153
  0.575915	 -0.235269	  0.757019
  0.570273	 -0.255026	  0.749475
  0.566418	 -0.274837	  0.740738
  0.556750	 -0.287051	  0.733023
  0.543428	 -0.279490	  0.738697
  0.530785	 -0.273490	  0.740162
  0.510032	 -0.273723	  0.741202
  0.492987	 -0.278662	  0.745937
  0.478599	 -0.277123	  0.753428
  0.451624	 -0.273777	  0.757772
  0.428862	 -0.279134	  0.758176
  0.405906	 -0.282615	  0.759778
  0.389934	 -0.283566	  0.761167
  0.366014	 -0.284190	  0.765421
  0.351472	 -0.284651	  0.770575
  0.335696	 -0.282143	  0.778062
  0.313858	 -0.284513	  0.789372
  0.295107	 -0.286404	  0.804153
  0.283664	 -0.286031	  0.811988
  0.265682	 -0.284289	  0.825997
  0.243845	 -0.285390	  0.833166
  0.230264	 -0.285356	  0.838171
  0.206286	 -0.291394	  0.840311
  0.182226	 -0.302088	  0.841542
  0.167466	 -0.304676	  0.846169
  0.145661	 -0.306335	  0.848720
  0.121757	 -0.313749	  0.850718
  0.104371	 -0.324835	  0.850753
  0.092584	 -0.332330	  0.850428
  0.070007	 -0.336780	  0.852664
  0.048205	 -0.343088	  0.859789
  0.030717	 -0.353732	  0.862295
  0.018638	 -0.363699	  0.857062
 -0.001656	 -0.371183	  0.853308
 -0.021862	 -0.377610	  0.854020
 -0.039994	 -0.385381	  0.857438
 -0.058898	 -0.390627	  0.860911
 -0.077606	 -0.396998	  0.864737
 -0.095862	 -0.403465	  0.869844
 -0.114870	 -0.407644	  0.874678
 -0.133045	 -0.414030	  0.880703
 -0.151677	 -0.418788	  0.886135
 -0.170065	 -0.424323	  0.892003
 -0.188245	 -0.429745	  0.898235
 -0.206885	 -0.434178	  0.904244
 -0.223752	 -0.440647	  0.912318
 -0.239598	 -0.446009	  0.923672
 -0.254483	 -0.449623	  0.937087
 -0.273047	 -0.452481	  0.949070
 -0.292282	 -0.456206	  0.955133
 -0.312116	 -0.462085	  0.957887
 -0.329614	 -0.470781	  0.962058
 -0.345501	 -0.481028	  0.970379
 -0.361302	 -0.489254	  0.979436
 -0.379317	 -0.495571	  0.985530
 -0.397367	 -0.501467	  0.989421
 -0.415140	 -0.511943	  0.995376
 -0.429172	 -0.524392	  1.004592
 -0.444761	 -0.534920	  1.009933
 -0.464710	 -0.541509	  1.008908
 -0.492461	 -0.545882	  1.005178
 -0.506785	 -0.550430	  1.005848
 -0.522150	 -0.559436	  1.008765
 -0.536737	 -0.574402	  1.011198
 -0.557078	 -0.588192	  1.013752
 -0.582162	 -0.594721	  1.023183
 -0.594149	 -0.597164	  1.030704
 -0.604327	 -0.601691	  1.045971
 -0.621149	 -0.612393	  1.059098
 -0.637085	 -0.618301	  1.062911
 -0.657908	 -0.624106	  1.067247
 -0.674855	 -0.632420	  1.076598
 -0.689294	 -0.640242	  1.089478
 -0.703599	 -0.645956	  1.102310
 -0.716743	 -0.653328	  1.115510
 -0.729978	 -0.659961	  1.128827
 -0.743791	 -0.665929	  1.141406
 -0.761245	 -0.671658	  1.153215
 -0.777847	 -0.682354	  1.165750
 -0.788089	 -0.692556	  1.182438
 -0.794848	 -0.694342	  1.199489
 -0.806425	 -0.698217	  1.215320
 -0.817277	 -0.706943	  1.233468
 -0.823810	 -0.713051	  1.249526
 -0.828275	 -0.720706	  1.268482
 -0.834826	 -0.729066	  1.294946
 -0.838306	 -0.733187	  1.304726
 -0.851418	 -0.739701	  1.322600
 -0.862716	 -0.743786	  1.338821
 -0.868435	 -0.744902	  1.358787
 -0.872065	 -0.744920	  1.381469
 -0.876744	 -0.747232	  1.399998
 -0.883656	 -0.750310	  1.416650
 -0.891532	 -0.754975	  1.434468
 -0.901898	 -0.762417	  1.455730
 -0.907221	 -0.767450	  1.466686
 -0.919262	 -0.772939	  1.477738
 -0.930218	 -0.780200	  1.484864
 -0.946311	 -0.791542	  1.491365
 -0.962035	 -0.796525	  1.489425
 -0.974386	 -0.797147	  1.481800
 -0.988699	 -0.799758	  1.465377
 -1.003659	 -0.808003	  1.449520
 -1.014448	 -0.815556	  1.439620
 -1.030510	 -0.819909	  1.421859
 -1.039713	 -0.811659	  1.404988
 -1.050487	 -0.800917	  1.389861
 -1.063799	 -0.794376	  1.377493
 -1.077352	 -0.788750	  1.361659
 -1.091218	 -0.787015	  1.346560
 -1.106601	 -0.786953	  1.333440
 -1.121710	 -0.788270	  1.320397
 -1.137015	 -0.787522	  1.307644
 -1.152252	 -0.788488	  1.294548
 -1.167507	 -0.788794	  1.281587
 -1.182596	 -0.789695	  1.268566
 -1.197631	 -0.790900	  1.255279
 -1.214134	 -0.791446	  1.243570
 -1.232985	 -0.796364	  1.236311
 -1.252147	 -0.800255	  1.232039
 -1.271393	 -0.804288	  1.227900
 -1.290027	 -0.810367	  1.223587
 -1.309139	 -0.814188	  1.219417
 -1.327900	 -0.820177	  1.215052
 -1.345944	 -0.825273	  1.210775
 -1.361413	 -0.834570	  1.210141
 -1.383058	 -0.846542	  1.208152
 -1.404030	 -0.852262	  1.204264
 -1.422275	 -0.854341	  1.207811
 -1.440010	 -0.857763	  1.216860
 -1.459432	 -0.864680	  1.221547
 -1.477895	 -0.870803	  1.223905
 -1.495995	 -0.875051	  1.233077
 -1.519434	 -0.880468	  1.242519
 -1.536483	 -0.887393	  1.239872
 -1.548832	 -0.898512	  1.237242
 -1.565407	 -0.917465	  1.238286
 -1.584583	 -0.928920	  1.242555
 -1.601769	 -0.932916	  1.251046
 -1.620386	 -0.935487	  1.260801
 -1.646851	 -0.949586	  1.263003
 -1.662616	 -0.958351	  1.259022
 -1.670904	 -0.962472	  1.257340
 -1.700692	 -0.971027	  1.258543
 -1.713345	 -0.982188	  1.264235
 -1.727072	 -0.997198	  1.268313
 -1.746686	 -1.015876	  1.269852
 -1.761755	 -1.032673	  1.268339
 -1.767658	 -1.039991	  1.266809
 -1.782509	 -1.060381	  1.266185
 -1.798862	 -1.071418	  1.269462
