 -1.750482	  2.441323	 -0.395796
 -1.733150	  2.417152	 -0.391877
 -1.721680	  2.383562	 -0.358691
 -1.706385	  2.343419	 -0.332046
 -1.689246	  2.300212	 -0.308870
 -1.670454	  2.256547	 -0.287889
 -1.648790	  2.213580	 -0.267786
 -1.624631	  2.174900	 -0.248311
 -1.599136	  2.137809	 -0.227393
 -1.574050	  2.101684	 -0.205091
 -1.548694	  2.064805	 -0.180849
 -1.524727	  2.027555	 -0.155617
 -1.504753	  1.990065	 -0.129632
 -1.487615	  1.951782	 -0.101914
 -1.474872	  1.911768	 -0.071818
 -1.470333	  1.870754	 -0.039611
 -1.477995	  1.836147	 -0.007559
 -1.497635	  1.811364	  0.024795
 -1.546589	  1.787098	  0.077770
 -1.646838	  1.754260	  0.178348
 -1.712840	  1.709499	  0.275149
 -1.731703	  1.659639	  0.354038
 -1.722731	  1.616232	  0.411500
 -1.713120	  1.564604	  0.461038
 -1.710596	  1.502453	  0.493951
 -1.694334	  1.453389	  0.502723
 -1.636275	  1.406614	  0.498920
 -1.575038	  1.378941	  0.476499
 -1.500842	  1.350795	  0.441451
 -1.387714	  1.294604	  0.394174
 -1.316561	  1.232783	  0.380525
 -1.284976	  1.191363	  0.382386
 -1.265135	  1.154820	  0.389610
 -1.248583	  1.115344	  0.401550
 -1.233364	  1.073073	  0.416362
 -1.217422	  1.027507	  0.433147
 -1.199621	  0.981171	  0.450622
 -1.179584	  0.936034	  0.468738
 -1.158166	  0.892970	  0.487601
 -1.136784	  0.852831	  0.507279
 -1.115333	  0.814328	  0.528767
 -1.092882	  0.774753	  0.553468
 -1.071315	  0.737151	  0.578594
 -1.051232	  0.702471	  0.602591
 -1.029907	  0.665548	  0.629486
 -1.007317	  0.627948	  0.656685
 -0.983236	  0.589227	  0.681628
 -0.959695	  0.551670	  0.703421
 -0.936878	  0.513817	  0.725645
 -0.914570	  0.473884	  0.750552
 -0.894390	  0.433408	  0.777806
 -0.879051	  0.392368	  0.807633
 -0.870148	  0.353948	  0.837549
 -0.864834	  0.315738	  0.868916
 -0.860044	  0.275195	  0.901155
 -0.852926	  0.233982	  0.928943
 -0.841540	  0.190685	  0.952209
 -0.825857	  0.145687	  0.972490
 -0.809062	  0.102587	  0.989520
 -0.792636	  0.059920	  1.005849
 -0.775603	  0.017213	  1.023549
 -0.758438	 -0.025677	  1.043835
 -0.740226	 -0.068335	  1.066707
 -0.720252	 -0.110646	  1.091946
 -0.700889	 -0.149908	  1.116866
 -0.681754	 -0.188001	  1.141910
 -0.662781	 -0.225036	  1.166306
 -0.643232	 -0.262849	  1.189871
 -0.622740	 -0.302502	  1.212856
 -0.604091	 -0.341023	  1.233432
 -0.585706	 -0.381184	  1.253942
 -0.565676	 -0.423578	  1.276034
 -0.544134	 -0.464584	  1.298885
 -0.522683	 -0.504813	  1.323241
 -0.502510	 -0.544839	  1.348503
 -0.484149	 -0.586079	  1.374742
 -0.469876	 -0.627388	  1.401816
 -0.459500	 -0.667831	  1.429464
 -0.452384	 -0.707842	  1.457844
 -0.446610	 -0.748880	  1.484747
 -0.440677	 -0.791378	  1.511021
 -0.433269	 -0.833640	  1.536960
 -0.423627	 -0.877408	  1.563375
 -0.409428	 -0.920741	  1.587802
 -0.391261	 -0.962962	  1.608513
 -0.373047	 -1.004026	  1.627872
 -0.355860	 -1.044368	  1.647443
 -0.338034	 -1.085731	  1.668093
 -0.317369	 -1.127581	  1.690246
 -0.294721	 -1.168101	  1.713050
 -0.271578	 -1.206774	  1.736204
 -0.249426	 -1.242802	  1.759031
 -0.226739	 -1.280341	  1.783981
 -0.206154	 -1.318744	  1.811790
 -0.188008	 -1.356492	  1.840989
 -0.171700	 -1.394113	  1.869417
 -0.156643	 -1.432406	  1.894255
 -0.140706	 -1.473579	  1.917303
 -0.122688	 -1.515291	  1.942942
 -0.107073	 -1.556581	  1.969338
 -0.094263	 -1.596898	  1.994842
 -0.082807	 -1.637423	  2.020222
 -0.072710	 -1.679330	  2.045421
 -0.063800	 -1.722285	  2.069605
 -0.054493	 -1.766632	  2.092800
 -0.041948	 -1.811571	  2.116179
 -0.028297	 -1.854635	  2.136925
 -0.013166	 -1.897420	  2.157361
  0.003688	 -1.938850	  2.178013
  0.023092	 -1.980535	  2.199082
  0.050134	 -2.019454	  2.217947
  0.050635	 -2.039649	  2.240127
