 -0.267097	 -2.185916	 -1.093382
 -0.284380	 -2.217980	 -1.105337
 -0.276109	 -2.201074	 -1.098573
 -0.268467	 -2.184053	 -1.091387
 -0.260938	 -2.167008	 -1.084123
 -0.253052	 -2.150027	 -1.077091
 -0.245112	 -2.133058	 -1.070091
 -0.236778	 -2.116197	 -1.063291
 -0.227837	 -2.099522	 -1.056812
 -0.218862	 -2.082859	 -1.050347
 -0.209370	 -2.066462	 -1.043942
 -0.199731	 -2.050137	 -1.037568
 -0.190009	 -2.033874	 -1.031164
 -0.179844	 -2.017959	 -1.024569
 -0.169709	 -2.002039	 -1.017966
 -0.159858	 -1.986090	 -1.011014
 -0.150377	 -1.970044	 -1.003626
 -0.140741	 -1.954127	 -0.996050
 -0.130664	 -1.938511	 -0.988523
 -0.119915	 -1.922984	 -0.981880
 -0.109806	 -1.906842	 -0.975259
 -0.098872	 -1.891353	 -0.967669
 -0.086954	 -1.877220	 -0.959577
 -0.074257	 -1.863681	 -0.951759
 -0.061005	 -1.851377	 -0.944305
 -0.052263	 -1.836422	 -0.935528
 -0.045040	 -1.818120	 -0.928117
 -0.031425	 -1.800051	 -0.922990
 -0.015842	 -1.787343	 -0.917277
 -0.000079	 -1.777141	 -0.907802
  0.013834	 -1.770394	 -0.896831
  0.027918	 -1.757630	 -0.888686
  0.040956	 -1.744031	 -0.881357
  0.053717	 -1.731923	 -0.871734
  0.066831	 -1.719698	 -0.863107
  0.080280	 -1.707272	 -0.854663
  0.094126	 -1.696279	 -0.845332
  0.108013	 -1.684746	 -0.836565
  0.121978	 -1.673674	 -0.827584
  0.135960	 -1.661851	 -0.819367
  0.149789	 -1.649821	 -0.811353
  0.163881	 -1.638291	 -0.803077
  0.178237	 -1.627331	 -0.794488
  0.192580	 -1.616377	 -0.785869
  0.206252	 -1.605222	 -0.776455
  0.219727	 -1.594005	 -0.766833
  0.232568	 -1.582259	 -0.756984
  0.244056	 -1.569493	 -0.746739
  0.255386	 -1.556604	 -0.736483
  0.264489	 -1.541918	 -0.726433
  0.273375	 -1.527134	 -0.716376
  0.281907	 -1.513058	 -0.707229
  0.296274	 -1.504630	 -0.695203
  0.310674	 -1.492139	 -0.677162
  0.315989	 -1.474685	 -0.664893
  0.319573	 -1.450929	 -0.660594
  0.322830	 -1.427206	 -0.661898
  0.325737	 -1.409428	 -0.660729
  0.329693	 -1.389901	 -0.658419
  0.334662	 -1.370489	 -0.654611
  0.339806	 -1.351548	 -0.649902
  0.344405	 -1.334582	 -0.645452
  0.350136	 -1.314786	 -0.639799
  0.357409	 -1.297717	 -0.631948
  0.364994	 -1.281122	 -0.621480
  0.373538	 -1.264436	 -0.609026
  0.382111	 -1.248702	 -0.599155
  0.390697	 -1.234317	 -0.591154
  0.401374	 -1.219529	 -0.584704
  0.413731	 -1.207095	 -0.580851
  0.424818	 -1.189588	 -0.579596
  0.428939	 -1.165208	 -0.581172
  0.428497	 -1.138264	 -0.577796
  0.429346	 -1.123529	 -0.570446
  0.432459	 -1.102368	 -0.560671
  0.438012	 -1.084684	 -0.554409
  0.449669	 -1.067852	 -0.547100
  0.456878	 -1.052666	 -0.543026
  0.469251	 -1.031636	 -0.531630
  0.479410	 -1.016121	 -0.519607
  0.484322	 -1.004052	 -0.512405
  0.487830	 -0.988273	 -0.504338
  0.495644	 -0.967681	 -0.488970
  0.498257	 -0.958002	 -0.481791
  0.501476	 -0.939780	 -0.470578
  0.504541	 -0.920444	 -0.459403
  0.508838	 -0.902296	 -0.450094
  0.512327	 -0.885011	 -0.445164
  0.519403	 -0.869419	 -0.437399
  0.528409	 -0.851831	 -0.428576
  0.532730	 -0.834549	 -0.422378
  0.537672	 -0.814777	 -0.414233
  0.539816	 -0.790910	 -0.406879
  0.540535	 -0.781777	 -0.405070
  0.538426	 -0.759692	 -0.400254
  0.537459	 -0.731382	 -0.393687
  0.538020	 -0.718008	 -0.389774
  0.544767	 -0.692326	 -0.383163
  0.551772	 -0.672163	 -0.383348
  0.562843	 -0.654092	 -0.383180
  0.572588	 -0.641074	 -0.385062
  0.582870	 -0.621437	 -0.384266
  0.590810	 -0.604346	 -0.382949
  0.598815	 -0.584746	 -0.381503
  0.609581	 -0.563272	 -0.381852
  0.620234	 -0.548617	 -0.381861
  0.634440	 -0.535339	 -0.380532
  0.650038	 -0.523066	 -0.377808
  0.659705	 -0.511494	 -0.375607
  0.666930	 -0.498759	 -0.369680
  0.678205	 -0.484505	 -0.359240
  0.696805	 -0.474885	 -0.352470
  0.712519	 -0.465935	 -0.353809
  0.729039	 -0.456726	 -0.344925
  0.743515	 -0.449754	 -0.332274
  0.757106	 -0.445688	 -0.318209
  0.770401	 -0.442802	 -0.303552
  0.783731	 -0.439976	 -0.288913
  0.797025	 -0.437091	 -0.274275
  0.811305	 -0.436321	 -0.260404
  0.826245	 -0.437064	 -0.247121
  0.841222	 -0.437919	 -0.233884
  0.856168	 -0.438171	 -0.220591
  0.873194	 -0.436790	 -0.210346
  0.891151	 -0.434995	 -0.201699
  0.909134	 -0.433158	 -0.193166
  0.926926	 -0.426978	 -0.186462
  0.944351	 -0.419187	 -0.180473
  0.961142	 -0.410300	 -0.174188
  0.976174	 -0.399025	 -0.167291
  0.991353	 -0.387909	 -0.160381
  1.005662	 -0.376251	 -0.152278
  1.019112	 -0.364157	 -0.143381
  1.031284	 -0.351409	 -0.133756
  1.041596	 -0.337721	 -0.123310
  1.051971	 -0.328078	 -0.113491
  1.068919	 -0.323598	 -0.099989
  1.086069	 -0.311786	 -0.085301
  1.097260	 -0.295919	 -0.072217
  1.104101	 -0.279599	 -0.061971
  1.104029	 -0.250819	 -0.052948
  1.103840	 -0.234679	 -0.047387
  1.106566	 -0.218626	 -0.042024
  1.121577	 -0.206483	 -0.030961
  1.135841	 -0.198399	 -0.015292
  1.146253	 -0.188259	 -0.001473
  1.157740	 -0.172458	  0.007235
  1.170351	 -0.156363	  0.015233
  1.181777	 -0.141345	  0.023117
  1.192151	 -0.128401	  0.028827
  1.203161	 -0.112296	  0.036101
  1.214729	 -0.098561	  0.046630
  1.225787	 -0.085059	  0.061850
  1.230572	 -0.073128	  0.075184
  1.233171	 -0.057388	  0.087987
  1.237985	 -0.040302	  0.097860
  1.241268	 -0.024436	  0.111121
  1.243817	 -0.005737	  0.126670
  1.249390	  0.011383	  0.136855
  1.254385	  0.025577	  0.143098
  1.259316	  0.044883	  0.153228
  1.268058	  0.062735	  0.162917
  1.282316	  0.077588	  0.162888
  1.305336	  0.093328	  0.159830
  1.319219	  0.111527	  0.168994
  1.322464	  0.125543	  0.182666
  1.322636	  0.137807	  0.195466
  1.332573	  0.156979	  0.205879
  1.349873	  0.169639	  0.208392
  1.367365	  0.180587	  0.209667
  1.382922	  0.192283	  0.217582
  1.398193	  0.202714	  0.225758
  1.414697	  0.209352	  0.235725
  1.431846	  0.213441	  0.243617
  1.453631	  0.218098	  0.245617
  1.477765	  0.218870	  0.253228
  1.493276	  0.217568	  0.264659
  1.505957	  0.213002	  0.276996
  1.523303	  0.209486	  0.291193
  1.543370	  0.206124	  0.309192
  1.553321	  0.202705	  0.320719
  1.559380	  0.197593	  0.335482
  1.566014	  0.182929	  0.353500
  1.583563	  0.170901	  0.368625
  1.599452	  0.165726	  0.379525
  1.614607	  0.162026	  0.388807
  1.634142	  0.158895	  0.396013
  1.653370	  0.156239	  0.401579
  1.672239	  0.153662	  0.409068
  1.689539	  0.150489	  0.420540
  1.702527	  0.145206	  0.432394
  1.712942	  0.140553	  0.446142
  1.727729	  0.137932	  0.463740
  1.742345	  0.140747	  0.475411
  1.753935	  0.146792	  0.482075
  1.772796	  0.156837	  0.491733
  1.803949	  0.168866	  0.506086
  1.815830	  0.178811	  0.505882
  1.827933	  0.179703	  0.508624
  1.844601	  0.190823	  0.510626
  1.862711	  0.195683	  0.518726
  1.881896	  0.201848	  0.529435
  1.898285	  0.216826	  0.533001
  1.910709	  0.235285	  0.528242
  1.919377	  0.263033	  0.517436
  1.928670	  0.284977	  0.510869
  1.933824	  0.300014	  0.506564
  1.935444	  0.313997	  0.501140
  1.934398	  0.336049	  0.496842
  1.934155	  0.359798	  0.496438
  1.938680	  0.386627	  0.493416
  1.941417	  0.400538	  0.488885
  1.943577	  0.420727	  0.478537
  1.944558	  0.434248	  0.470081
  1.945740	  0.455245	  0.463441
  1.939039	  0.477902	  0.459288
  1.929547	  0.495489	  0.460356
  1.921887	  0.511087	  0.464781
  1.916134	  0.525284	  0.473588
  1.908823	  0.545227	  0.485955
  1.901808	  0.567276	  0.492502
  1.896672	  0.581760	  0.495119
  1.888135	  0.598927	  0.496058
  1.878276	  0.616018	  0.496142
  1.868724	  0.637739	  0.500696
  1.865437	  0.659070	  0.510034
  1.866680	  0.671401	  0.517930
  1.871134	  0.688117	  0.532612
  1.872009	  0.709168	  0.547916
  1.868953	  0.724334	  0.557920
  1.864183	  0.738251	  0.564318
  1.855756	  0.760147	  0.572724
  1.853602	  0.780535	  0.577142
  1.855200	  0.800854	  0.582002
  1.861307	  0.823309	  0.590225
  1.864040	  0.840524	  0.599984
  1.866462	  0.854518	  0.605174
  1.867145	  0.871392	  0.609573
  1.868436	  0.891890	  0.615964
  1.872468	  0.912100	  0.622382
  1.884502	  0.937636	  0.627472
  1.888174	  0.949944	  0.628795
  1.890168	  0.966474	  0.634848
  1.889326	  0.988318	  0.651643
  1.891324	  1.008765	  0.665272
  1.894488	  1.020111	  0.668801
  1.900212	  1.037424	  0.671477
  1.909676	  1.059225	  0.673351
  1.919393	  1.079861	  0.681860
  1.930419	  1.095193	  0.688727
  1.943017	  1.108706	  0.694614
  1.955302	  1.124423	  0.699935
  1.965905	  1.141321	  0.704514
  1.976101	  1.156360	  0.708332
  1.988295	  1.172567	  0.713193
  2.002483	  1.186666	  0.718930
  2.017767	  1.199640	  0.725117
  2.030027	  1.212666	  0.731118
  2.038771	  1.230727	  0.737779
  2.050673	  1.245637	  0.743783
