 -1.938151	  1.639592	  0.046092
 -1.944899	  1.639639	  0.042495
 -1.907298	  1.639377	  0.062540
 -1.855767	  1.635714	  0.089032
 -1.802422	  1.620889	  0.113254
 -1.761276	  1.597223	  0.132953
 -1.724430	  1.587583	  0.151677
 -1.681206	  1.583041	  0.169433
 -1.639610	  1.581126	  0.189292
 -1.597887	  1.582944	  0.211446
 -1.556499	  1.588665	  0.234507
 -1.514859	  1.597776	  0.256874
 -1.472775	  1.608859	  0.277421
 -1.429837	  1.621379	  0.297406
 -1.387613	  1.633982	  0.317003
 -1.345505	  1.647365	  0.337377
 -1.304038	  1.660906	  0.359066
 -1.261117	  1.672036	  0.383785
 -1.220251	  1.681510	  0.414112
 -1.181073	  1.689687	  0.447347
 -1.142571	  1.695978	  0.482657
 -1.104707	  1.700711	  0.517965
 -1.066065	  1.704928	  0.551560
 -1.026564	  1.708460	  0.583004
 -0.986025	  1.711362	  0.612467
 -0.949720	  1.715161	  0.638668
 -0.914275	  1.721389	  0.666086
 -0.882250	  1.729490	  0.693732
 -0.860493	  1.737521	  0.716736
 -0.848072	  1.745418	  0.735267
 -0.834205	  1.763731	  0.774720
 -0.833528	  1.808848	  0.872736
 -0.851620	  1.866486	  1.000845
 -0.847600	  1.911486	  1.109562
 -0.815874	  1.938815	  1.195828
 -0.777696	  1.960433	  1.250545
 -0.738385	  2.004661	  1.298116
 -0.664883	  2.038249	  1.331133
 -0.566722	  2.012977	  1.314778
 -0.476884	  1.963103	  1.288910
 -0.400572	  1.909467	  1.244191
 -0.310761	  1.867021	  1.194401
 -0.204733	  1.836233	  1.156696
 -0.139776	  1.825208	  1.145834
 -0.106754	  1.821057	  1.146821
 -0.076979	  1.819055	  1.153383
 -0.040798	  1.818075	  1.168216
  0.001115	  1.816651	  1.191202
  0.044602	  1.813485	  1.217382
  0.089271	  1.809400	  1.243180
  0.137689	  1.805709	  1.266825
  0.187494	  1.802454	  1.286803
  0.234366	  1.800294	  1.302418
  0.279088	  1.799436	  1.315511
  0.321729	  1.800355	  1.327649
  0.363525	  1.804676	  1.343322
  0.401527	  1.812002	  1.363046
  0.438644	  1.821489	  1.387038
  0.476771	  1.831505	  1.418844
  0.515532	  1.836717	  1.454960
  0.553156	  1.840624	  1.489906
  0.592377	  1.845924	  1.523542
  0.633115	  1.850744	  1.557334
  0.689654	  1.853722	  1.603910
  0.713002	  1.854007	  1.622698
