 -1.673626	 -0.643190	 -1.840805
 -1.670477	 -0.646342	 -1.851073
 -1.680298	 -0.650325	 -1.831656
 -1.686206	 -0.644469	 -1.811494
 -1.690808	 -0.635779	 -1.795815
 -1.696601	 -0.629265	 -1.776999
 -1.701978	 -0.621945	 -1.758898
 -1.708705	 -0.613844	 -1.742244
 -1.715647	 -0.607083	 -1.724356
 -1.721235	 -0.600269	 -1.706958
 -1.728597	 -0.594349	 -1.689041
 -1.735914	 -0.588645	 -1.671244
 -1.742708	 -0.582571	 -1.653701
 -1.750660	 -0.577710	 -1.635876
 -1.758294	 -0.572256	 -1.618271
 -1.766408	 -0.567349	 -1.600642
 -1.774627	 -0.562490	 -1.583061
 -1.782713	 -0.557456	 -1.565492
 -1.790905	 -0.552575	 -1.547929
 -1.799233	 -0.547925	 -1.530336
 -1.807594	 -0.543634	 -1.512679
 -1.815937	 -0.539754	 -1.494921
 -1.824275	 -0.535899	 -1.477157
 -1.831801	 -0.533890	 -1.458738
 -1.839308	 -0.531934	 -1.440304
 -1.846770	 -0.530548	 -1.421800
 -1.854198	 -0.529536	 -1.403258
 -1.861623	 -0.528501	 -1.384718
 -1.868681	 -0.524771	 -1.366381
 -1.875641	 -0.520480	 -1.348129
 -1.882601	 -0.516188	 -1.329877
 -1.889550	 -0.510521	 -1.312000
 -1.896452	 -0.504656	 -1.294169
 -1.904113	 -0.499045	 -1.276571
 -1.912148	 -0.493105	 -1.259452
 -1.919580	 -0.485163	 -1.242002
 -1.928400	 -0.478628	 -1.224977
 -1.936411	 -0.473472	 -1.211279
 -1.951017	 -0.463516	 -1.191355
 -1.964163	 -0.458283	 -1.176887
 -1.975420	 -0.460243	 -1.164993
 -1.993203	 -0.465816	 -1.143973
 -2.006369	 -0.460664	 -1.126873
 -2.013334	 -0.456077	 -1.116914
 -2.026867	 -0.441480	 -1.105240
 -2.044434	 -0.435848	 -1.088153
 -2.055489	 -0.437776	 -1.074697
 -2.069007	 -0.440516	 -1.059815
 -2.082777	 -0.440653	 -1.044088
 -2.092820	 -0.444398	 -1.026559
 -2.103385	 -0.448195	 -1.005983
 -2.116403	 -0.444203	 -0.994074
 -2.134994	 -0.436837	 -0.983642
 -2.151922	 -0.429527	 -0.965310
 -2.157115	 -0.428361	 -0.949439
 -2.162152	 -0.427270	 -0.932781
 -2.173047	 -0.421291	 -0.913934
 -2.184785	 -0.412930	 -0.898789
 -2.194856	 -0.406282	 -0.882615
 -2.203483	 -0.400744	 -0.865303
 -2.212068	 -0.395245	 -0.848093
 -2.219734	 -0.389634	 -0.830494
 -2.224726	 -0.383786	 -0.812030
 -2.229722	 -0.377938	 -0.793567
 -2.234701	 -0.372092	 -0.775102
 -2.237682	 -0.366346	 -0.756207
 -2.240722	 -0.359982	 -0.738926
 -2.245935	 -0.347948	 -0.722091
 -2.251392	 -0.333124	 -0.705832
 -2.256076	 -0.325604	 -0.684816
 -2.259697	 -0.324189	 -0.669674
 -2.267711	 -0.317201	 -0.650053
 -2.272991	 -0.308995	 -0.627625
 -2.276755	 -0.308230	 -0.609735
 -2.283252	 -0.307370	 -0.595331
 -2.294246	 -0.303549	 -0.577738
 -2.305292	 -0.297260	 -0.562678
 -2.317240	 -0.288776	 -0.541548
 -2.323856	 -0.283701	 -0.522229
 -2.327049	 -0.285048	 -0.506348
 -2.336254	 -0.286219	 -0.487441
 -2.348185	 -0.285604	 -0.470469
 -2.358358	 -0.281711	 -0.453062
 -2.367926	 -0.278157	 -0.436036
 -2.378217	 -0.274837	 -0.419101
 -2.388392	 -0.272446	 -0.402053
 -2.398067	 -0.270340	 -0.384654
 -2.407688	 -0.268116	 -0.367260
 -2.415939	 -0.266142	 -0.349148
 -2.423465	 -0.264304	 -0.330709
 -2.431003	 -0.262473	 -0.312275
 -2.437753	 -0.259947	 -0.293625
 -2.444008	 -0.256817	 -0.275002
 -2.451732	 -0.252215	 -0.258494
 -2.463643	 -0.245838	 -0.241244
 -2.474175	 -0.242629	 -0.222994
 -2.477705	 -0.242414	 -0.200708
 -2.477971	 -0.239613	 -0.181703
 -2.482902	 -0.234355	 -0.166028
 -2.494307	 -0.231379	 -0.144181
 -2.497950	 -0.229333	 -0.125300
 -2.498757	 -0.224032	 -0.108901
 -2.500358	 -0.216453	 -0.087277
 -2.507104	 -0.214044	 -0.064152
 -2.514034	 -0.212488	 -0.051798
 -2.520931	 -0.206428	 -0.033326
 -2.525908	 -0.202425	 -0.011739
 -2.535166	 -0.201215	  0.005622
 -2.545838	 -0.198330	  0.021911
 -2.553844	 -0.194081	  0.041226
 -2.563721	 -0.191336	  0.058990
 -2.575667	 -0.188654	  0.075026
 -2.580732	 -0.178564	  0.095713
 -2.588990	 -0.174600	  0.113491
