  1.528892	  2.019644	  0.055122
  1.531298	  2.022574	  0.053161
  1.520415	  2.009241	  0.063142
  1.509879	  1.996283	  0.074192
  1.499552	  1.983399	  0.085032
  1.490198	  1.971474	  0.092373
  1.473839	  1.954603	  0.102467
  1.462414	  1.941203	  0.114557
  1.455731	  1.930188	  0.125066
  1.451331	  1.917325	  0.140069
  1.441347	  1.901741	  0.152083
  1.428873	  1.888683	  0.156679
  1.412331	  1.872887	  0.161685
  1.400887	  1.856502	  0.172793
  1.396094	  1.845510	  0.184006
  1.390790	  1.830582	  0.198083
  1.383483	  1.814313	  0.207888
  1.375185	  1.798435	  0.216913
  1.359978	  1.776309	  0.231000
  1.356748	  1.770525	  0.234813
  1.347438	  1.754549	  0.244115
  1.339050	  1.736881	  0.254580
  1.335661	  1.721525	  0.265013
  1.337791	  1.705806	  0.282125
  1.340224	  1.690318	  0.299868
  1.332544	  1.672009	  0.307318
  1.323163	  1.653996	  0.306701
  1.324377	  1.631791	  0.305601
  1.328257	  1.611522	  0.308476
  1.332037	  1.592942	  0.315444
  1.336113	  1.574347	  0.321767
  1.341072	  1.555339	  0.326180
  1.346621	  1.536342	  0.329462
  1.352089	  1.517321	  0.332525
  1.357176	  1.498106	  0.334645
  1.361363	  1.478886	  0.336567
  1.366076	  1.460482	  0.341799
  1.371547	  1.442878	  0.352294
  1.380088	  1.424320	  0.363575
  1.390125	  1.403070	  0.366711
  1.394196	  1.377138	  0.353529
  1.385969	  1.358941	  0.344646
  1.378980	  1.348306	  0.339806
  1.373048	  1.332899	  0.336474
  1.371979	  1.312106	  0.333219
  1.369728	  1.286961	  0.329100
  1.364810	  1.275985	  0.327792
  1.355290	  1.267214	  0.327910
  1.338738	  1.245794	  0.336796
  1.331871	  1.232084	  0.341977
  1.318908	  1.218324	  0.351449
  1.296319	  1.202493	  0.355784
  1.270536	  1.186207	  0.343652
  1.259823	  1.179404	  0.324638
  1.256114	  1.174732	  0.306780
  1.243790	  1.165638	  0.291227
  1.227780	  1.157176	  0.281005
  1.212866	  1.147649	  0.271829
  1.198063	  1.136753	  0.263975
  1.183328	  1.125822	  0.256132
  1.168046	  1.115208	  0.249095
  1.152065	  1.105412	  0.243819
  1.134955	  1.097916	  0.241995
  1.118135	  1.098342	  0.242814
  1.102312	  1.106961	  0.239330
  1.082808	  1.110717	  0.232939
  1.055519	  1.083005	  0.233791
  1.035377	  1.057177	  0.231829
  1.025133	  1.052588	  0.232829
  1.015472	  1.048196	  0.233433
  1.006245	  1.041588	  0.236566
  0.985746	  1.044322	  0.239688
  0.969715	  1.044224	  0.247739
  0.957811	  1.040195	  0.253798
  0.948203	  1.036098	  0.262382
  0.937013	  1.030765	  0.273919
  0.923541	  1.024359	  0.288258
  0.912334	  1.019044	  0.301172
  0.898644	  1.012813	  0.310933
  0.888107	  1.007850	  0.326086
  0.884319	  1.004607	  0.346059
  0.882435	  1.002211	  0.365887
  0.880330	  0.999885	  0.385615
  0.881984	  0.995256	  0.404931
  0.885402	  0.989572	  0.423796
  0.889311	  0.983755	  0.442484
  0.894022	  0.978020	  0.460988
  0.901506	  0.980102	  0.479402
  0.908726	  0.982534	  0.497921
  0.914601	  0.985435	  0.516991
  0.913211	  0.990215	  0.536823
  0.910554	  0.995282	  0.556064
  0.906330	  1.000633	  0.574699
  0.900989	  1.003361	  0.593452
  0.898768	  1.008670	  0.614127
  0.881686	  1.018622	  0.629666
  0.847962	  1.017571	  0.641015
  0.831852	  1.002290	  0.647977
  0.822979	  0.993692	  0.652341
  0.807028	  0.975632	  0.660517
  0.788328	  0.961148	  0.669251
  0.781217	  0.956342	  0.673448
  0.765989	  0.948519	  0.682848
  0.747161	  0.938186	  0.697170
  0.728048	  0.927592	  0.709840
  0.716677	  0.921436	  0.716896
  0.706017	  0.913890	  0.723937
  0.688499	  0.895632	  0.733514
  0.677322	  0.880189	  0.740288
  0.663052	  0.863073	  0.745232
  0.651196	  0.851380	  0.752510
  0.634582	  0.839934	  0.761984
  0.629149	  0.835885	  0.766867
  0.607960	  0.824828	  0.781687
  0.591195	  0.816703	  0.791676
  0.575785	  0.807129	  0.802717
  0.556864	  0.790887	  0.810180
  0.539751	  0.775132	  0.810939
  0.523922	  0.762609	  0.806642
  0.513441	  0.755206	  0.804495
  0.499564	  0.744904	  0.811034
  0.482722	  0.730617	  0.822788
  0.467066	  0.707684	  0.830024
  0.460407	  0.696729	  0.833951
  0.454077	  0.689290	  0.839200
  0.436617	  0.669080	  0.857641
  0.427222	  0.656545	  0.866372
  0.420912	  0.650943	  0.871543
  0.407535	  0.634261	  0.885615
  0.390517	  0.612721	  0.896913
  0.379202	  0.601647	  0.899366
  0.366673	  0.588340	  0.904345
  0.350964	  0.567615	  0.908203
  0.345093	  0.559979	  0.913864
  0.335058	  0.543716	  0.926445
  0.325492	  0.526749	  0.939869
  0.319557	  0.515873	  0.947918
  0.315328	  0.501294	  0.962865
  0.309797	  0.482175	  0.972448
  0.302402	  0.465299	  0.980185
  0.294677	  0.451697	  0.992188
  0.285913	  0.440778	  1.006226
  0.277887	  0.429455	  1.019856
  0.271656	  0.418175	  1.034716
  0.266671	  0.406108	  1.049858
  0.260029	  0.391853	  1.064713
  0.254267	  0.372224	  1.076035
  0.244121	  0.349863	  1.079019
  0.230540	  0.328338	  1.077381
  0.215674	  0.314716	  1.079409
  0.201653	  0.307095	  1.082537
  0.182072	  0.297017	  1.092599
  0.164447	  0.284752	  1.101667
  0.154929	  0.275586	  1.106593
  0.145730	  0.257236	  1.113721
  0.141618	  0.236239	  1.121637
  0.137614	  0.217209	  1.130332
  0.131604	  0.199800	  1.140505
  0.122965	  0.188794	  1.149285
  0.103369	  0.175169	  1.155307
  0.087829	  0.157680	  1.160286
  0.075731	  0.143439	  1.166217
  0.064779	  0.132967	  1.171929
  0.051192	  0.118713	  1.181986
  0.038987	  0.103726	  1.190836
  0.024285	  0.091396	  1.198437
  0.013014	  0.086628	  1.203558
 -0.010604	  0.079328	  1.209824
 -0.041257	  0.058740	  1.214839
 -0.053200	  0.042811	  1.213849
 -0.056128	  0.037264	  1.215122
 -0.065130	  0.020958	  1.219759
 -0.082025	  0.001068	  1.229030
 -0.099486	 -0.013208	  1.232140
 -0.108078	 -0.020349	  1.237069
 -0.117496	 -0.032787	  1.241252
 -0.134783	 -0.049189	  1.242597
 -0.150878	 -0.067749	  1.251271
 -0.161632	 -0.084411	  1.259013
 -0.173202	 -0.103044	  1.266283
 -0.183557	 -0.117863	  1.280633
 -0.187374	 -0.122130	  1.283839
 -0.201333	 -0.140314	  1.286713
 -0.223963	 -0.157556	  1.294276
 -0.233784	 -0.165960	  1.300416
 -0.250105	 -0.180453	  1.310860
 -0.257584	 -0.186809	  1.316543
 -0.271157	 -0.203212	  1.332411
 -0.283481	 -0.214755	  1.344041
 -0.296880	 -0.228010	  1.354732
 -0.307293	 -0.246075	  1.364454
 -0.311214	 -0.257729	  1.369243
 -0.320153	 -0.280920	  1.375001
 -0.338444	 -0.303492	  1.389408
 -0.345986	 -0.310416	  1.398566
 -0.350915	 -0.317678	  1.408134
 -0.354375	 -0.330821	  1.425047
 -0.363854	 -0.341701	  1.442279
 -0.378839	 -0.348696	  1.460030
 -0.389241	 -0.357988	  1.472063
 -0.397535	 -0.363271	  1.480652
 -0.416916	 -0.372906	  1.492622
 -0.433563	 -0.385536	  1.507224
 -0.441585	 -0.394125	  1.514522
 -0.453545	 -0.407812	  1.523633
 -0.470075	 -0.431735	  1.531401
 -0.479194	 -0.441746	  1.534374
 -0.492083	 -0.456861	  1.539472
 -0.505669	 -0.472746	  1.548241
 -0.514606	 -0.481320	  1.554517
 -0.533027	 -0.493688	  1.566711
 -0.551066	 -0.510949	  1.575119
 -0.561041	 -0.518830	  1.579365
 -0.575274	 -0.530815	  1.587381
 -0.587814	 -0.538291	  1.591716
 -0.596015	 -0.560245	  1.597876
 -0.606996	 -0.587409	  1.612124
 -0.610505	 -0.594506	  1.618919
 -0.617331	 -0.605234	  1.634971
 -0.629165	 -0.617071	  1.652134
 -0.637970	 -0.635548	  1.665619
 -0.644427	 -0.652178	  1.671253
 -0.653321	 -0.669642	  1.676444
 -0.662898	 -0.687114	  1.682924
 -0.672674	 -0.704081	  1.687811
 -0.684862	 -0.719752	  1.692231
 -0.696083	 -0.733736	  1.699345
 -0.704742	 -0.747134	  1.707288
 -0.711942	 -0.759211	  1.720453
 -0.716251	 -0.772939	  1.739503
 -0.718861	 -0.797702	  1.759392
 -0.722045	 -0.818596	  1.770317
 -0.733543	 -0.840718	  1.764706
 -0.748424	 -0.852298	  1.757624
 -0.767086	 -0.864449	  1.762729
 -0.784604	 -0.873472	  1.771555
 -0.801673	 -0.882111	  1.779267
 -0.818261	 -0.891998	  1.786292
 -0.832417	 -0.904265	  1.793225
 -0.844905	 -0.916527	  1.803302
 -0.857926	 -0.928347	  1.813102
 -0.872047	 -0.939769	  1.821472
 -0.886191	 -0.951193	  1.829454
 -0.900232	 -0.961926	  1.838582
 -0.913458	 -0.971255	  1.850386
 -0.926984	 -0.980497	  1.861881
 -0.942263	 -0.989473	  1.871172
 -0.957601	 -0.998469	  1.880329
 -0.972932	 -1.007551	  1.889408
 -0.987445	 -1.018836	  1.897298
 -1.001781	 -1.030460	  1.905004
 -1.016076	 -1.042177	  1.912632
 -1.029244	 -1.054921	  1.920632
 -1.042043	 -1.067967	  1.928752
 -1.054756	 -1.081074	  1.936895
 -1.065599	 -1.095805	  1.944972
 -1.076199	 -1.110735	  1.953011
 -1.086757	 -1.125699	  1.961053
 -1.096067	 -1.141833	  1.968347
 -1.105033	 -1.158241	  1.975368
 -1.113834	 -1.174322	  1.982126
 -1.122508	 -1.189360	  1.987927
 -1.132094	 -1.205777	  1.994140
