 -2.384146	  0.442492	  0.677362
 -2.388128	  0.438333	  0.689789
 -2.382552	  0.444492	  0.671593
 -2.376661	  0.450592	  0.653485
 -2.372754	  0.455790	  0.634580
 -2.368927	  0.460952	  0.615671
 -2.366042	  0.466705	  0.597315
 -2.367194	  0.474672	  0.578860
 -2.370033	  0.481475	  0.559862
 -2.368369	  0.482319	  0.538661
 -2.364571	  0.482460	  0.516290
 -2.357174	  0.486735	  0.498910
 -2.350733	  0.496286	  0.482682
 -2.346210	  0.509818	  0.468523
 -2.343074	  0.524074	  0.455680
 -2.342029	  0.538284	  0.440631
 -2.336690	  0.561907	  0.415938
 -2.335320	  0.567980	  0.405057
 -2.336169	  0.577129	  0.384615
 -2.338291	  0.581254	  0.359339
 -2.345446	  0.579758	  0.334932
 -2.355231	  0.580217	  0.312720
 -2.354918	  0.581547	  0.285122
 -2.351631	  0.580795	  0.270094
 -2.349598	  0.581026	  0.255674
 -2.341081	  0.575523	  0.229103
 -2.334890	  0.568772	  0.204846
 -2.331473	  0.567924	  0.187299
 -2.329283	  0.570071	  0.173729
 -2.327039	  0.579627	  0.156222
 -2.325856	  0.584237	  0.133859
 -2.324025	  0.586437	  0.113378
 -2.319860	  0.590357	  0.093792
 -2.314355	  0.595588	  0.075607
 -2.309252	  0.598849	  0.056195
 -2.303821	  0.601493	  0.037031
 -2.299765	  0.606071	  0.018871
 -2.297901	  0.610544	 -0.001445
 -2.293365	  0.611508	 -0.022064
 -2.284338	  0.612936	 -0.043494
 -2.274625	  0.617955	 -0.061626
 -2.264294	  0.627042	 -0.078737
 -2.255588	  0.639602	 -0.092843
 -2.250649	  0.653548	 -0.107437
 -2.250652	  0.666432	 -0.122230
 -2.247495	  0.677553	 -0.139440
 -2.240892	  0.686326	 -0.156749
 -2.234069	  0.696872	 -0.170956
 -2.228693	  0.708176	 -0.185550
 -2.226006	  0.718993	 -0.202036
 -2.220949	  0.727279	 -0.220186
 -2.214410	  0.734860	 -0.237319
 -2.208263	  0.740411	 -0.255554
 -2.202357	  0.744797	 -0.274177
 -2.196171	  0.748559	 -0.292822
 -2.189307	  0.750540	 -0.311340
 -2.183297	  0.750808	 -0.328321
 -2.173567	  0.741913	 -0.345312
 -2.159043	  0.736587	 -0.368056
 -2.152370	  0.746136	 -0.387088
 -2.149102	  0.753712	 -0.401092
 -2.150671	  0.765257	 -0.415219
 -2.140140	  0.775579	 -0.449929
 -2.130191	  0.775231	 -0.468705
 -2.127847	  0.774462	 -0.472103
 -2.119243	  0.778525	 -0.493378
 -2.109638	  0.778651	 -0.515166
 -2.099576	  0.771521	 -0.534317
 -2.092012	  0.768382	 -0.552746
 -2.090825	  0.776009	 -0.568197
 -2.092423	  0.795740	 -0.586778
 -2.090436	  0.810064	 -0.605157
 -2.089910	  0.818755	 -0.615078
 -2.090219	  0.829652	 -0.628557
 -2.082419	  0.841464	 -0.658158
 -2.073461	  0.841788	 -0.673866
 -2.059727	  0.837965	 -0.693918
 -2.051147	  0.844959	 -0.717669
 -2.048963	  0.855665	 -0.734871
 -2.053537	  0.868468	 -0.742449
 -2.055555	  0.883100	 -0.759682
 -2.051542	  0.890875	 -0.778927
 -2.045868	  0.894725	 -0.798915
 -2.041219	  0.902814	 -0.817027
 -2.039368	  0.913366	 -0.832381
 -2.036739	  0.922029	 -0.850839
 -2.032338	  0.928845	 -0.869352
 -2.027553	  0.934936	 -0.888049
 -2.023164	  0.940459	 -0.907071
 -2.021978	  0.943406	 -0.926619
 -2.026213	  0.945110	 -0.946964
 -2.026798	  0.946981	 -0.969419
 -2.020883	  0.951195	 -0.989589
 -2.015287	  0.958081	 -1.004336
 -2.007394	  0.971934	 -1.020541
 -1.998168	  0.981485	 -1.041289
 -1.993755	  0.981299	 -1.063545
 -1.994035	  0.975949	 -1.079506
 -1.992957	  0.976019	 -1.100230
 -1.990145	  0.978584	 -1.120633
 -1.987071	  0.982574	 -1.140050
 -1.983046	  0.986744	 -1.159226
 -1.978545	  0.991843	 -1.177869
 -1.975410	  0.997794	 -1.196709
 -1.973180	  1.003845	 -1.215377
 -1.970937	  1.010148	 -1.234225
