  1.704431	 -0.050568	  1.817105
  1.702861	 -0.041884	  1.835293
  1.703814	 -0.049621	  1.817367
  1.706338	 -0.053950	  1.798085
  1.707875	 -0.058697	  1.776818
  1.708773	 -0.068115	  1.757410
  1.710007	 -0.079256	  1.742859
  1.714025	 -0.092264	  1.729050
  1.715109	 -0.104451	  1.712201
  1.708063	 -0.117198	  1.687342
  1.703989	 -0.122659	  1.673466
  1.702090	 -0.130422	  1.657548
  1.708748	 -0.141717	  1.638402
  1.717912	 -0.151920	  1.623679
  1.722859	 -0.163720	  1.607069
  1.726518	 -0.174856	  1.590688
  1.731913	 -0.187323	  1.576181
  1.737638	 -0.201674	  1.563362
  1.742708	 -0.215751	  1.550073
  1.742284	 -0.230991	  1.539206
  1.736900	 -0.250090	  1.528939
  1.739675	 -0.265630	  1.513380
  1.752746	 -0.273378	  1.495551
  1.763513	 -0.280031	  1.479627
  1.764323	 -0.295456	  1.465507
  1.761395	 -0.321717	  1.448549
  1.761318	 -0.329565	  1.443455
  1.759869	 -0.348065	  1.431681
  1.755768	 -0.371725	  1.416699
  1.758116	 -0.385754	  1.399825
  1.760010	 -0.392841	  1.389451
  1.760462	 -0.403074	  1.373800
  1.759531	 -0.420773	  1.355418
  1.762940	 -0.434682	  1.337770
  1.769247	 -0.445889	  1.316132
  1.774720	 -0.451329	  1.298896
  1.778875	 -0.455745	  1.282577
  1.783080	 -0.462579	  1.259952
  1.789365	 -0.466833	  1.240384
  1.793291	 -0.468878	  1.224039
  1.800879	 -0.471648	  1.204292
  1.816530	 -0.471547	  1.182609
  1.826411	 -0.477840	  1.165892
  1.832104	 -0.489506	  1.150064
  1.834371	 -0.500597	  1.140222
  1.846422	 -0.514191	  1.127408
  1.862192	 -0.526482	  1.116006
  1.876660	 -0.535964	  1.101575
  1.894942	 -0.539061	  1.089513
  1.917634	 -0.539022	  1.081088
  1.937324	 -0.536054	  1.082035
  1.957642	 -0.536433	  1.083327
  1.977754	 -0.539145	  1.080059
  1.997798	 -0.540487	  1.077916
  2.017811	 -0.541131	  1.078230
  2.037499	 -0.542921	  1.077748
  2.057627	 -0.546561	  1.077279
  2.077951	 -0.548184	  1.074792
  2.097004	 -0.548229	  1.070096
  2.115860	 -0.550199	  1.067465
  2.134781	 -0.547578	  1.059398
  2.157902	 -0.541909	  1.048693
  2.178392	 -0.542561	  1.047234
  2.195996	 -0.552846	  1.055541
  2.215841	 -0.551616	  1.053384
