 -0.774932	 -2.250697	  0.916556
 -0.774654	 -2.264919	  0.924270
 -0.775018	 -2.247360	  0.914705
 -0.775473	 -2.230019	  0.904776
 -0.776059	 -2.213120	  0.894107
 -0.776788	 -2.196302	  0.883313
 -0.777720	 -2.179742	  0.872149
 -0.778474	 -2.162807	  0.861614
 -0.779232	 -2.146202	  0.852881
 -0.785852	 -2.129910	  0.848866
 -0.792320	 -2.114101	  0.836991
 -0.791367	 -2.087886	  0.811315
 -0.794596	 -2.080215	  0.803039
 -0.799272	 -2.069087	  0.792031
 -0.801517	 -2.046867	  0.780522
 -0.801474	 -2.027386	  0.773881
 -0.799792	 -2.010994	  0.769403
 -0.793621	 -1.990689	  0.764017
 -0.790031	 -1.962783	  0.754812
 -0.792969	 -1.951448	  0.751402
 -0.798781	 -1.932964	  0.745776
 -0.802944	 -1.915959	  0.745310
 -0.810041	 -1.898543	  0.744645
 -0.818099	 -1.881801	  0.740009
 -0.827775	 -1.862468	  0.733389
 -0.833727	 -1.838652	  0.726758
 -0.835817	 -1.819875	  0.718181
 -0.840214	 -1.801115	  0.710490
 -0.844432	 -1.788672	  0.709682
 -0.849489	 -1.767633	  0.708508
 -0.850584	 -1.738494	  0.707862
 -0.850455	 -1.724415	  0.709289
 -0.850277	 -1.713118	  0.708991
 -0.854504	 -1.676919	  0.711013
 -0.861628	 -1.658917	  0.712250
 -0.865896	 -1.644922	  0.711207
 -0.869012	 -1.630106	  0.709065
 -0.871483	 -1.605864	  0.708883
 -0.871600	 -1.582074	  0.710430
 -0.871749	 -1.569878	  0.712556
 -0.869742	 -1.538090	  0.718714
 -0.865544	 -1.521974	  0.719726
 -0.862084	 -1.501470	  0.719831
 -0.860758	 -1.481341	  0.722529
 -0.858823	 -1.466071	  0.726648
 -0.857531	 -1.453027	  0.730884
 -0.854615	 -1.427476	  0.736931
 -0.851151	 -1.394942	  0.736929
 -0.849832	 -1.384353	  0.738058
 -0.846959	 -1.370898	  0.737532
 -0.839644	 -1.343940	  0.740104
 -0.836249	 -1.323067	  0.738278
 -0.833869	 -1.307801	  0.737913
 -0.828152	 -1.288352	  0.741468
 -0.821888	 -1.267760	  0.745600
 -0.813821	 -1.248287	  0.744844
 -0.804565	 -1.230701	  0.741139
 -0.796261	 -1.214436	  0.738761
 -0.789372	 -1.189856	  0.738654
 -0.787400	 -1.170649	  0.735717
 -0.784441	 -1.156845	  0.732555
 -0.777330	 -1.137160	  0.729287
 -0.763068	 -1.115128	  0.727010
 -0.755906	 -1.100719	  0.725003
 -0.749893	 -1.083050	  0.724493
 -0.742814	 -1.060611	  0.729125
 -0.737772	 -1.041439	  0.731216
 -0.732471	 -1.019275	  0.723344
 -0.724733	 -1.002677	  0.711934
 -0.713513	 -0.989811	  0.700122
 -0.701961	 -0.975422	  0.694686
 -0.690974	 -0.959832	  0.695149
 -0.679097	 -0.939008	  0.695144
 -0.672530	 -0.918562	  0.687585
 -0.668490	 -0.901116	  0.679505
 -0.664374	 -0.882374	  0.676626
 -0.658170	 -0.860447	  0.675482
 -0.644935	 -0.835088	  0.658760
 -0.635792	 -0.831088	  0.634399
 -0.629561	 -0.826826	  0.615883
 -0.620351	 -0.817055	  0.598468
 -0.617084	 -0.807546	  0.589154
 -0.614307	 -0.791350	  0.580674
 -0.608032	 -0.765013	  0.573425
 -0.600424	 -0.748452	  0.560013
 -0.593628	 -0.740756	  0.540806
 -0.590640	 -0.735039	  0.516241
 -0.589077	 -0.727433	  0.503318
 -0.589706	 -0.711290	  0.490819
 -0.588851	 -0.691699	  0.480116
 -0.588167	 -0.674187	  0.472882
 -0.588004	 -0.650183	  0.467967
 -0.587320	 -0.626653	  0.459890
 -0.586793	 -0.616853	  0.440380
 -0.581601	 -0.611746	  0.423928
 -0.572121	 -0.599093	  0.404509
 -0.566938	 -0.584597	  0.390891
 -0.564944	 -0.570721	  0.379143
 -0.558528	 -0.552850	  0.364744
 -0.561768	 -0.529976	  0.350270
 -0.569356	 -0.517935	  0.342505
 -0.576458	 -0.501579	  0.332921
 -0.575376	 -0.485088	  0.324949
 -0.566374	 -0.470697	  0.316727
 -0.553719	 -0.448287	  0.303184
 -0.551718	 -0.436678	  0.296321
 -0.551514	 -0.419403	  0.285428
 -0.551036	 -0.399124	  0.268078
 -0.558424	 -0.378649	  0.260591
 -0.568067	 -0.361631	  0.253912
 -0.576334	 -0.344823	  0.244854
 -0.577793	 -0.328365	  0.226764
 -0.575838	 -0.317749	  0.214695
 -0.574769	 -0.299929	  0.208568
 -0.575755	 -0.278046	  0.203352
 -0.575764	 -0.259756	  0.192944
 -0.575514	 -0.243709	  0.182878
 -0.579948	 -0.225048	  0.176352
 -0.585275	 -0.204397	  0.163711
 -0.587923	 -0.188709	  0.147607
 -0.586099	 -0.174465	  0.132639
 -0.581188	 -0.159395	  0.126000
 -0.579169	 -0.141035	  0.119005
 -0.577540	 -0.123663	  0.107484
 -0.576967	 -0.101139	  0.094878
 -0.576803	 -0.082756	  0.091434
 -0.574908	 -0.069222	  0.090215
 -0.571045	 -0.050939	  0.085309
 -0.569540	 -0.013835	  0.071613
 -0.569914	 -0.003542	  0.070245
 -0.569865	  0.007900	  0.068727
 -0.565484	  0.035956	  0.063631
 -0.562646	  0.058670	  0.055858
 -0.560645	  0.071524	  0.054259
 -0.555548	  0.093400	  0.051461
 -0.546494	  0.116872	  0.050977
 -0.540067	  0.131524	  0.051694
 -0.531415	  0.152909	  0.050533
 -0.529450	  0.173429	  0.045186
 -0.532294	  0.189913	  0.041308
 -0.541954	  0.210956	  0.033555
 -0.547136	  0.228273	  0.023477
 -0.545757	  0.244069	  0.013871
 -0.539012	  0.264421	  0.004545
 -0.537186	  0.283315	 -0.002977
 -0.539020	  0.297730	 -0.010890
 -0.547596	  0.312609	 -0.021248
 -0.558020	  0.332399	 -0.032890
 -0.561700	  0.352250	 -0.041259
 -0.559753	  0.368275	 -0.049211
 -0.553430	  0.386818	 -0.058922
 -0.550280	  0.406017	 -0.068043
 -0.550483	  0.421571	 -0.077666
 -0.554691	  0.434999	 -0.087340
 -0.558897	  0.454191	 -0.093908
 -0.557648	  0.480187	 -0.101454
 -0.555730	  0.500132	 -0.109280
 -0.556468	  0.522339	 -0.122430
 -0.557683	  0.539752	 -0.134561
 -0.559566	  0.546463	 -0.138132
 -0.562937	  0.564511	 -0.156151
 -0.568075	  0.579749	 -0.169912
 -0.572053	  0.592532	 -0.180226
 -0.578315	  0.608174	 -0.197554
 -0.581696	  0.619443	 -0.214016
 -0.581743	  0.628882	 -0.226653
 -0.581936	  0.648908	 -0.251477
 -0.582626	  0.657643	 -0.262558
 -0.582897	  0.666899	 -0.274009
 -0.584097	  0.684438	 -0.293520
 -0.587445	  0.700542	 -0.307281
 -0.588915	  0.711991	 -0.316486
 -0.594487	  0.729665	 -0.330537
 -0.602663	  0.744858	 -0.343787
 -0.608475	  0.754686	 -0.354844
 -0.616135	  0.768393	 -0.367554
 -0.626571	  0.781346	 -0.381970
 -0.636058	  0.792656	 -0.393019
 -0.644793	  0.805404	 -0.404711
 -0.654192	  0.817092	 -0.419815
 -0.663976	  0.827386	 -0.433278
 -0.673999	  0.840604	 -0.445802
 -0.681681	  0.856243	 -0.458624
 -0.689126	  0.870316	 -0.476482
 -0.696071	  0.877211	 -0.491846
 -0.704321	  0.882642	 -0.502866
 -0.720149	  0.892333	 -0.512688
 -0.731544	  0.903845	 -0.523284
 -0.740965	  0.916498	 -0.536733
 -0.753273	  0.932313	 -0.558214
 -0.760062	  0.942886	 -0.567260
 -0.767454	  0.956918	 -0.574931
 -0.776260	  0.974035	 -0.584369
 -0.782775	  0.988973	 -0.593064
 -0.788035	  1.007355	 -0.599309
 -0.792981	  1.022681	 -0.608032
 -0.798334	  1.039315	 -0.615262
 -0.805867	  1.058924	 -0.622574
 -0.809251	  1.078721	 -0.624301
 -0.809244	  1.090320	 -0.621240
 -0.812780	  1.111105	 -0.615157
 -0.816690	  1.135427	 -0.624647
 -0.808473	  1.160401	 -0.639301
 -0.803724	  1.178829	 -0.641175
 -0.800859	  1.195388	 -0.640355
 -0.799575	  1.213812	 -0.640147
 -0.799117	  1.234712	 -0.642479
 -0.796839	  1.251760	 -0.644793
 -0.790150	  1.273075	 -0.643413
 -0.779254	  1.297064	 -0.649449
 -0.772082	  1.313856	 -0.658779
 -0.771879	  1.323584	 -0.669009
 -0.776613	  1.339478	 -0.686382
 -0.775481	  1.355550	 -0.702038
 -0.769650	  1.376108	 -0.713697
 -0.764421	  1.396646	 -0.714962
 -0.767340	  1.418961	 -0.705396
 -0.772073	  1.442359	 -0.700916
 -0.773593	  1.468155	 -0.704952
 -0.768328	  1.488402	 -0.708496
 -0.764620	  1.500333	 -0.711974
 -0.764536	  1.513570	 -0.719232
 -0.761775	  1.537733	 -0.726917
 -0.749157	  1.559628	 -0.734072
 -0.732741	  1.577248	 -0.736540
 -0.729006	  1.586186	 -0.738585
 -0.727909	  1.608795	 -0.748272
 -0.715590	  1.638255	 -0.747644
 -0.697866	  1.652346	 -0.741421
 -0.687047	  1.661737	 -0.737452
 -0.677311	  1.673915	 -0.739950
 -0.666568	  1.691796	 -0.742386
 -0.653006	  1.710549	 -0.747032
 -0.642981	  1.722906	 -0.751112
 -0.628345	  1.736466	 -0.759843
 -0.611698	  1.746194	 -0.767763
 -0.588896	  1.753082	 -0.766922
 -0.561637	  1.766395	 -0.755924
 -0.552979	  1.780931	 -0.745415
 -0.544901	  1.795241	 -0.738725
 -0.534350	  1.817980	 -0.730632
 -0.523092	  1.839627	 -0.727211
 -0.517830	  1.867432	 -0.722077
 -0.515846	  1.884297	 -0.718073
 -0.512472	  1.897993	 -0.713571
 -0.495299	  1.918796	 -0.716335
 -0.484137	  1.941268	 -0.724632
 -0.480905	  1.951131	 -0.729222
 -0.474221	  1.972676	 -0.736579
 -0.466969	  1.993429	 -0.743125
 -0.462624	  2.009021	 -0.750978
 -0.459510	  2.026353	 -0.757371
 -0.454115	  2.050149	 -0.764491
 -0.452714	  2.070525	 -0.776828
 -0.455368	  2.080992	 -0.786605
 -0.452105	  2.098590	 -0.789213
 -0.443594	  2.118113	 -0.791788
 -0.441404	  2.138010	 -0.800545
 -0.440405	  2.156309	 -0.808844
 -0.439440	  2.173814	 -0.816997
 -0.437642	  2.184558	 -0.828770
 -0.427476	  2.191918	 -0.845798
 -0.418832	  2.221383	 -0.856096
 -0.422281	  2.264673	 -0.862678
 -0.423696	  2.275073	 -0.862468
 -0.425770	  2.286131	 -0.863560
 -0.430108	  2.301100	 -0.865789
 -0.426803	  2.319469	 -0.881505
 -0.424377	  2.337430	 -0.892223
 -0.421149	  2.358624	 -0.903273
 -0.414609	  2.391666	 -0.918605
 -0.410949	  2.409523	 -0.926834
