 -0.354994	 -2.194808	  1.004467
 -0.354716	 -2.209030	  1.012181
 -0.355173	 -2.191465	  1.002746
 -0.357592	 -2.174194	  0.994182
 -0.364044	 -2.157217	  0.985569
 -0.367341	 -2.136063	  0.976285
 -0.369045	 -2.118112	  0.972048
 -0.368300	 -2.099171	  0.958241
 -0.369545	 -2.087469	  0.942105
 -0.366963	 -2.069917	  0.932465
 -0.360502	 -2.051290	  0.925025
 -0.361328	 -2.034617	  0.914017
 -0.364562	 -2.019827	  0.901767
 -0.364278	 -2.003709	  0.889535
 -0.360369	 -1.986585	  0.876208
 -0.363302	 -1.972777	  0.861361
 -0.365443	 -1.956246	  0.849101
 -0.363408	 -1.936659	  0.840747
 -0.368734	 -1.916963	  0.840566
 -0.375793	 -1.897750	  0.834284
 -0.374762	 -1.878233	  0.828133
 -0.374347	 -1.861146	  0.820328
 -0.380293	 -1.843649	  0.811985
 -0.382586	 -1.822525	  0.802585
 -0.386443	 -1.802057	  0.807621
 -0.388736	 -1.782778	  0.804852
 -0.388168	 -1.764423	  0.793333
 -0.384623	 -1.743517	  0.786666
 -0.391481	 -1.724872	  0.789660
 -0.400762	 -1.707165	  0.787086
 -0.404565	 -1.686621	  0.784270
 -0.407026	 -1.667135	  0.781907
 -0.415572	 -1.649586	  0.773272
 -0.417480	 -1.630287	  0.768921
 -0.418044	 -1.610051	  0.770541
 -0.423603	 -1.588671	  0.770182
 -0.433077	 -1.571635	  0.771280
 -0.434739	 -1.551167	  0.774020
 -0.433231	 -1.530797	  0.776265
 -0.427944	 -1.512733	  0.777603
 -0.423502	 -1.490932	  0.778490
 -0.420770	 -1.472675	  0.778928
 -0.419119	 -1.452991	  0.782038
 -0.417148	 -1.431510	  0.783986
 -0.413462	 -1.413388	  0.786233
 -0.406620	 -1.396108	  0.789702
 -0.399282	 -1.376606	  0.791277
 -0.395102	 -1.355833	  0.790301
 -0.389275	 -1.337555	  0.790927
 -0.379244	 -1.319741	  0.791106
 -0.370262	 -1.300947	  0.788387
 -0.366563	 -1.282960	  0.786976
 -0.359234	 -1.264653	  0.786345
 -0.349505	 -1.244432	  0.780200
 -0.342417	 -1.229358	  0.776491
 -0.334651	 -1.210735	  0.773744
 -0.328212	 -1.191095	  0.766975
 -0.317310	 -1.174992	  0.759109
 -0.306457	 -1.162318	  0.753607
 -0.297374	 -1.144809	  0.746977
 -0.290476	 -1.127419	  0.739304
 -0.282571	 -1.112433	  0.730822
 -0.271860	 -1.096272	  0.720825
 -0.262057	 -1.083484	  0.710191
 -0.251375	 -1.065118	  0.700873
 -0.246443	 -1.051455	  0.692417
 -0.242500	 -1.034403	  0.681330
 -0.238574	 -1.018389	  0.669229
 -0.231824	 -1.000771	  0.658768
 -0.222546	 -0.986039	  0.649097
 -0.215638	 -0.975573	  0.635774
 -0.207089	 -0.962436	  0.621308
 -0.198671	 -0.947255	  0.609288
 -0.194001	 -0.932879	  0.597455
 -0.193154	 -0.918005	  0.583545
 -0.190006	 -0.901652	  0.571039
 -0.184122	 -0.887374	  0.558816
 -0.178275	 -0.875449	  0.544473
 -0.174549	 -0.862622	  0.529462
 -0.170666	 -0.843801	  0.518722
 -0.168154	 -0.828937	  0.507374
 -0.165363	 -0.816184	  0.492132
 -0.159988	 -0.802160	  0.477969
 -0.154573	 -0.784079	  0.467226
 -0.156023	 -0.768733	  0.455451
 -0.156223	 -0.755341	  0.441186
 -0.151842	 -0.739082	  0.428008
 -0.148399	 -0.721891	  0.415705
 -0.152740	 -0.709615	  0.403095
 -0.155446	 -0.695120	  0.388197
 -0.154803	 -0.681300	  0.373678
 -0.151369	 -0.664397	  0.361014
 -0.149532	 -0.646084	  0.352031
 -0.152249	 -0.629261	  0.341869
 -0.153422	 -0.615355	  0.328715
 -0.151823	 -0.599380	  0.315782
 -0.151108	 -0.578300	  0.307702
 -0.152944	 -0.559480	  0.300896
 -0.153311	 -0.544761	  0.290229
 -0.152726	 -0.529318	  0.278089
 -0.152217	 -0.512040	  0.266305
 -0.152136	 -0.494852	  0.255734
 -0.152059	 -0.477637	  0.245525
 -0.151399	 -0.460240	  0.235744
 -0.150743	 -0.442941	  0.225708
 -0.150313	 -0.425724	  0.215529
 -0.149903	 -0.408668	  0.205091
 -0.149488	 -0.391652	  0.194590
 -0.148933	 -0.374701	  0.183990
 -0.148169	 -0.357851	  0.173243
 -0.147278	 -0.340993	  0.162518
 -0.145773	 -0.324105	  0.151910
 -0.144264	 -0.307216	  0.141304
 -0.142434	 -0.290104	  0.131114
 -0.140672	 -0.273170	  0.120940
 -0.140149	 -0.256936	  0.110431
 -0.140331	 -0.239371	  0.097385
 -0.140346	 -0.224050	  0.085298
 -0.136863	 -0.203341	  0.079514
 -0.133250	 -0.184690	  0.075172
 -0.127786	 -0.163709	  0.070761
 -0.127747	 -0.145805	  0.066269
 -0.129124	 -0.125750	  0.061122
 -0.129734	 -0.106792	  0.054071
 -0.128439	 -0.087657	  0.050285
 -0.125589	 -0.068107	  0.045251
 -0.123409	 -0.048535	  0.039072
 -0.124805	 -0.031247	  0.033649
 -0.122370	 -0.010197	  0.028008
 -0.116036	  0.010092	  0.021436
 -0.114195	  0.025843	  0.018450
 -0.114950	  0.046310	  0.014549
 -0.113728	  0.065512	  0.008493
 -0.109751	  0.085427	  0.002098
 -0.108787	  0.104908	 -0.001004
 -0.109717	  0.123454	 -0.004236
 -0.109882	  0.142613	 -0.011137
 -0.107753	  0.163381	 -0.021182
 -0.106418	  0.181880	 -0.023818
 -0.108189	  0.200050	 -0.028210
 -0.111094	  0.219641	 -0.038616
 -0.114891	  0.237010	 -0.050872
 -0.113884	  0.255580	 -0.051789
 -0.111170	  0.277070	 -0.055669
 -0.111178	  0.294284	 -0.066474
 -0.112862	  0.311204	 -0.076315
 -0.116480	  0.327722	 -0.086450
 -0.120331	  0.345270	 -0.101037
 -0.120232	  0.359970	 -0.110398
 -0.120498	  0.377759	 -0.121635
 -0.122819	  0.394457	 -0.132080
 -0.128161	  0.412105	 -0.139773
 -0.133967	  0.430660	 -0.150250
 -0.137141	  0.443928	 -0.165076
 -0.138645	  0.457158	 -0.177734
 -0.143515	  0.475498	 -0.188394
 -0.139970	  0.492527	 -0.200849
 -0.134512	  0.509495	 -0.215717
 -0.132764	  0.525212	 -0.224524
 -0.135876	  0.539028	 -0.236537
 -0.143290	  0.552213	 -0.250057
 -0.148406	  0.572327	 -0.261204
 -0.146620	  0.588436	 -0.271842
 -0.146568	  0.604190	 -0.284137
 -0.150592	  0.620969	 -0.296654
 -0.155040	  0.634907	 -0.310410
 -0.160324	  0.646327	 -0.323068
 -0.160889	  0.663229	 -0.338388
 -0.157816	  0.679510	 -0.348141
 -0.159209	  0.695120	 -0.359035
 -0.165341	  0.710179	 -0.374331
 -0.172928	  0.728176	 -0.386486
 -0.172429	  0.742153	 -0.395074
 -0.171532	  0.755767	 -0.410428
 -0.172883	  0.773291	 -0.424331
 -0.180497	  0.788013	 -0.433421
 -0.184871	  0.802425	 -0.446430
 -0.187766	  0.818568	 -0.462539
 -0.194726	  0.829731	 -0.473148
 -0.204463	  0.842348	 -0.485452
 -0.214844	  0.858007	 -0.498140
 -0.222923	  0.870774	 -0.508754
 -0.232012	  0.881231	 -0.522217
 -0.244554	  0.892768	 -0.536541
 -0.252981	  0.904533	 -0.549582
 -0.259800	  0.915425	 -0.563660
 -0.270667	  0.925204	 -0.578136
 -0.278979	  0.936062	 -0.592707
 -0.284974	  0.948750	 -0.608309
 -0.293733	  0.960206	 -0.622437
 -0.305267	  0.968861	 -0.635406
 -0.314136	  0.978812	 -0.648636
 -0.322113	  0.992500	 -0.664790
 -0.329470	  1.003995	 -0.679125
 -0.341058	  1.013181	 -0.690941
 -0.352077	  1.024623	 -0.702356
 -0.360605	  1.039711	 -0.713891
 -0.360912	  1.059698	 -0.715524
 -0.361113	  1.079633	 -0.717331
 -0.361398	  1.099610	 -0.718558
 -0.361753	  1.119584	 -0.719478
 -0.362041	  1.139532	 -0.720723
 -0.361752	  1.159420	 -0.721713
 -0.360121	  1.178636	 -0.724352
 -0.357129	  1.196614	 -0.730267
 -0.353185	  1.214849	 -0.737506
 -0.350250	  1.233511	 -0.744359
 -0.346252	  1.251578	 -0.751785
 -0.343009	  1.269727	 -0.759089
 -0.337603	  1.287032	 -0.765721
 -0.330462	  1.304527	 -0.772477
 -0.323992	  1.322328	 -0.778602
 -0.316779	  1.340055	 -0.784691
 -0.308972	  1.357363	 -0.791099
 -0.301278	  1.374970	 -0.796915
 -0.299845	  1.394171	 -0.799847
 -0.298964	  1.414769	 -0.801491
 -0.290710	  1.432227	 -0.801040
 -0.282447	  1.450361	 -0.803918
 -0.273549	  1.465040	 -0.808892
 -0.261529	  1.481969	 -0.811903
 -0.250417	  1.498460	 -0.813870
 -0.239896	  1.514284	 -0.810464
 -0.228451	  1.532212	 -0.807443
 -0.217792	  1.549306	 -0.809412
 -0.205106	  1.563070	 -0.813250
 -0.192038	  1.579189	 -0.818066
 -0.182131	  1.596746	 -0.817070
 -0.170792	  1.612606	 -0.814225
 -0.160287	  1.630548	 -0.811127
 -0.152389	  1.649447	 -0.812674
 -0.142949	  1.667313	 -0.815061
 -0.131682	  1.681735	 -0.816602
 -0.119739	  1.698002	 -0.819390
 -0.108944	  1.714043	 -0.822671
 -0.096243	  1.733156	 -0.820992
 -0.086193	  1.749885	 -0.820508
 -0.080190	  1.769016	 -0.821230
 -0.075605	  1.788636	 -0.826610
 -0.065939	  1.805444	 -0.831718
 -0.057907	  1.823500	 -0.837942
 -0.052797	  1.841500	 -0.841855
 -0.047324	  1.859913	 -0.848151
 -0.043319	  1.877226	 -0.858271
 -0.039181	  1.896278	 -0.865016
 -0.033476	  1.914556	 -0.869674
 -0.029155	  1.932157	 -0.876442
 -0.027372	  1.952617	 -0.885265
 -0.024203	  1.971099	 -0.889570
 -0.019138	  1.988194	 -0.896071
 -0.016615	  2.006684	 -0.908639
 -0.018713	  2.024795	 -0.920579
 -0.021663	  2.041081	 -0.930007
 -0.018778	  2.057363	 -0.937517
 -0.014619	  2.077308	 -0.945029
 -0.013106	  2.098906	 -0.949163
 -0.013884	  2.115405	 -0.957256
 -0.012923	  2.131586	 -0.968510
 -0.011969	  2.148897	 -0.981073
 -0.010178	  2.167036	 -0.987665
 -0.006273	  2.185253	 -0.995742
 -0.002547	  2.203691	 -1.002703
  0.003069	  2.220265	 -1.014536
  0.002257	  2.253692	 -1.020507
  0.005917	  2.271550	 -1.028735
