 -0.201476	  1.521904	  2.612301
 -0.199481	  1.506836	  2.586436
 -0.173388	  1.493574	  2.547714
 -0.150973	  1.485050	  2.504401
 -0.134012	  1.468136	  2.463207
 -0.114504	  1.460912	  2.416287
 -0.092286	  1.445923	  2.374588
 -0.073225	  1.433393	  2.327473
 -0.050450	  1.428917	  2.282835
 -0.030162	  1.410527	  2.242083
 -0.008142	  1.401296	  2.198505
  0.014820	  1.390780	  2.154000
  0.032508	  1.373876	  2.109545
  0.056541	  1.355925	  2.070481
  0.076950	  1.342117	  2.027763
  0.104345	  1.330294	  1.986441
  0.127167	  1.311971	  1.944150
  0.155330	  1.297757	  1.902971
  0.179521	  1.284132	  1.860486
  0.203136	  1.269250	  1.818111
  0.226746	  1.254339	  1.776523
  0.250323	  1.240030	  1.736038
  0.273831	  1.226507	  1.695374
  0.295503	  1.214070	  1.654857
  0.317352	  1.200857	  1.610338
  0.337837	  1.188308	  1.566648
  0.357696	  1.175943	  1.523978
  0.377772	  1.163384	  1.481223
  0.398395	  1.149616	  1.436134
  0.418718	  1.135193	  1.389788
  0.437628	  1.121939	  1.346293
  0.456857	  1.109474	  1.303361
  0.476048	  1.100071	  1.259427
  0.496533	  1.091404	  1.212683
  0.517212	  1.072562	  1.170843
  0.533568	  1.056409	  1.124387
  0.550734	  1.041071	  1.080847
  0.570623	  1.025109	  1.038133
  0.590646	  1.010233	  0.995968
  0.610999	  0.996515	  0.952663
  0.631951	  0.984238	  0.909323
  0.655659	  0.973643	  0.864086
  0.680019	  0.964433	  0.820314
  0.702374	  0.955321	  0.778364
  0.724758	  0.945059	  0.733989
  0.744802	  0.933321	  0.687128
  0.756365	  0.921032	  0.642078
  0.754602	  0.911186	  0.599183
  0.732307	  0.905464	  0.542474
  0.663566	  0.912000	  0.453987
  0.590641	  0.937643	  0.383274
  0.520594	  0.986127	  0.297695
  0.458134	  1.025976	  0.179539
  0.424981	  1.041574	  0.065521
  0.417578	  1.035763	 -0.055647
  0.418946	  1.033686	 -0.083052
  0.430908	  1.033310	 -0.115347
  0.476491	  1.027587	 -0.192286
  0.574028	  0.985028	 -0.254405
  0.720989	  0.921565	 -0.271730
  0.776629	  0.887914	 -0.266173
  0.841552	  0.843331	 -0.257314
  0.888313	  0.810277	 -0.249774
  0.947416	  0.769667	 -0.248012
  1.022822	  0.712519	 -0.242658
  1.111936	  0.660418	 -0.229882
  1.156952	  0.644926	 -0.239243
  1.186318	  0.633094	 -0.271896
  1.209871	  0.621754	 -0.315465
  1.230736	  0.610140	 -0.359201
  1.251423	  0.599151	 -0.403070
  1.272709	  0.589099	 -0.447190
  1.294324	  0.580087	 -0.490362
  1.317493	  0.571208	 -0.533782
  1.341921	  0.561850	 -0.577212
  1.367469	  0.551288	 -0.620852
  1.392516	  0.540078	 -0.663125
  1.415577	  0.528834	 -0.703193
  1.439684	  0.516195	 -0.746645
  1.463516	  0.502344	 -0.790200
  1.485771	  0.488715	 -0.831332
  1.508156	  0.474671	 -0.873418
  1.530982	  0.459405	 -0.917244
  1.550953	  0.444832	 -0.957875
  1.571092	  0.430443	 -1.000341
  1.592162	  0.417342	 -1.043885
  1.613390	  0.404839	 -1.087654
  1.634302	  0.392270	 -1.131326
  1.654873	  0.379464	 -1.174755
  1.675922	  0.366055	 -1.219986
  1.696856	  0.351932	 -1.264300
  1.716848	  0.338104	 -1.305243
  1.738357	  0.323157	 -1.348420
  1.758610	  0.307357	 -1.390432
  1.778128	  0.290620	 -1.433393
  1.796442	  0.274148	 -1.479355
  1.813490	  0.258779	 -1.525210
  1.830557	  0.245113	 -1.567620
  1.849786	  0.231370	 -1.610887
  1.869403	  0.219105	 -1.653505
  1.891610	  0.206470	 -1.698523
  1.916493	  0.192272	 -1.742420
  1.941533	  0.177978	 -1.785116
  1.964928	  0.162778	 -1.827550
  1.984615	  0.147672	 -1.869860
  2.006643	  0.134800	 -1.911590
  2.038410	  0.124952	 -1.949191
  2.056968	  0.105389	 -1.993960
  2.073554	  0.092469	 -2.038594
  2.102135	  0.086338	 -2.079899
  2.113659	  0.064260	 -2.127984
  2.134796	  0.064903	 -2.149264
