  0.532181	 -2.376453	  0.696065
  0.531675	 -2.378479	  0.696743
  0.536897	 -2.361721	  0.682714
  0.541114	 -2.343252	  0.676763
  0.544889	 -2.323526	  0.677335
  0.548391	 -2.303070	  0.674782
  0.554111	 -2.285139	  0.667342
  0.562996	 -2.269813	  0.660126
  0.574479	 -2.253236	  0.651945
  0.580223	 -2.234421	  0.642670
  0.582933	 -2.216587	  0.641430
  0.587812	 -2.195799	  0.640815
  0.591605	 -2.174613	  0.636982
  0.596935	 -2.156633	  0.628068
  0.605687	 -2.138913	  0.623184
  0.616669	 -2.124223	  0.624137
  0.626997	 -2.105491	  0.624726
  0.635089	 -2.086853	  0.624339
  0.641743	 -2.067945	  0.623824
  0.648081	 -2.048975	  0.623627
  0.654376	 -2.030001	  0.623451
  0.659869	 -2.010816	  0.622161
  0.665394	 -1.991642	  0.620798
  0.670899	 -1.972478	  0.619255
  0.675532	 -1.953276	  0.616129
  0.680023	 -1.934079	  0.612994
  0.683546	 -1.914711	  0.609392
  0.687110	 -1.895733	  0.604460
  0.690558	 -1.876897	  0.599450
  0.691187	 -1.859101	  0.592382
  0.690700	 -1.842285	  0.581661
  0.691721	 -1.820645	  0.570251
  0.694450	 -1.803350	  0.565991
  0.696838	 -1.786581	  0.560234
  0.698317	 -1.765017	  0.550987
  0.701725	 -1.746497	  0.547336
  0.705997	 -1.730110	  0.544016
  0.707038	 -1.709589	  0.532957
  0.708293	 -1.689588	  0.525241
  0.711046	 -1.676089	  0.520474
  0.713004	 -1.655458	  0.508206
  0.717075	 -1.634035	  0.500821
  0.721162	 -1.619357	  0.498800
  0.730457	 -1.600596	  0.493828
  0.741593	 -1.582791	  0.490734
  0.751496	 -1.565453	  0.487690
  0.759457	 -1.547710	  0.482834
  0.767027	 -1.529922	  0.477704
  0.774577	 -1.512119	  0.472589
  0.780820	 -1.493692	  0.467944
  0.786797	 -1.475151	  0.463413
  0.792732	 -1.456595	  0.458913
  0.793496	 -1.436701	  0.457091
  0.791542	 -1.416818	  0.456710
  0.793538	 -1.397090	  0.454493
  0.801701	 -1.379523	  0.449751
  0.808900	 -1.361256	  0.445844
  0.814722	 -1.342315	  0.443058
  0.820485	 -1.323362	  0.440343
  0.824078	 -1.303736	  0.438927
  0.825673	 -1.283800	  0.438720
  0.827250	 -1.263864	  0.438520
  0.827824	 -1.243921	  0.438926
  0.818325	 -1.227497	  0.445158
  0.808749	 -1.211097	  0.451432
  0.798642	 -1.195074	  0.457462
  0.786768	 -1.180465	  0.463915
  0.775022	 -1.166855	  0.472924
  0.764946	 -1.152752	  0.481578
  0.753318	 -1.138904	  0.490561
  0.740870	 -1.126190	  0.499854
  0.728301	 -1.113475	  0.508821
  0.715539	 -1.100784	  0.517591
  0.703181	 -1.088052	  0.526900
  0.691658	 -1.075246	  0.537185
  0.680370	 -1.061933	  0.546517
  0.670006	 -1.046988	  0.555236
  0.660169	 -1.031741	  0.562962
  0.651850	 -1.016510	  0.572498
  0.644856	 -1.001511	  0.580322
  0.638903	 -0.984115	  0.586134
  0.635159	 -0.965589	  0.593062
  0.638626	 -0.946340	  0.597697
  0.643273	 -0.928686	  0.604148
  0.648977	 -0.912077	  0.614685
  0.652494	 -0.895309	  0.624382
  0.655314	 -0.876801	  0.632893
  0.664044	 -0.858963	  0.638586
  0.676241	 -0.842240	  0.640054
  0.686711	 -0.824798	  0.642009
  0.692050	 -0.807124	  0.637662
  0.697607	 -0.790798	  0.626195
  0.705668	 -0.775517	  0.614999
  0.715568	 -0.761352	  0.604755
  0.725586	 -0.747315	  0.594624
  0.735752	 -0.735440	  0.582830
  0.746947	 -0.725115	  0.568717
  0.757430	 -0.715939	  0.555802
  0.765888	 -0.709262	  0.541736
  0.777102	 -0.703571	  0.524525
  0.787975	 -0.698761	  0.509907
  0.797274	 -0.690707	  0.496136
  0.806797	 -0.686314	  0.478398
  0.815333	 -0.684827	  0.460505
  0.822075	 -0.685699	  0.440998
  0.830162	 -0.687948	  0.423328
  0.844651	 -0.689114	  0.408721
  0.862708	 -0.686142	  0.394088
  0.873423	 -0.682147	  0.375767
  0.874538	 -0.685020	  0.356118
  0.878365	 -0.690888	  0.335364
  0.890110	 -0.690779	  0.314378
  0.905200	 -0.684256	  0.302294
  0.921110	 -0.678825	  0.291834
  0.936222	 -0.675538	  0.279701
  0.950893	 -0.670932	  0.265446
  0.965902	 -0.665314	  0.253860
  0.977350	 -0.649353	  0.248059
  0.987765	 -0.633411	  0.242164
  0.998680	 -0.618678	  0.236751
  1.009906	 -0.603800	  0.234647
  1.021504	 -0.580818	  0.233873
  1.027064	 -0.563745	  0.226092
  1.028712	 -0.548007	  0.216454
  1.033534	 -0.528560	  0.207234
  1.040510	 -0.510661	  0.203887
  1.047341	 -0.490111	  0.205084
  1.053643	 -0.470228	  0.201156
  1.056082	 -0.453787	  0.193910
  1.059512	 -0.433631	  0.189560
  1.063751	 -0.414976	  0.186721
  1.067898	 -0.396755	  0.183557
  1.075382	 -0.370615	  0.182660
  1.078143	 -0.358528	  0.183110
  1.082166	 -0.337375	  0.183831
  1.086918	 -0.315422	  0.183678
  1.088948	 -0.296809	  0.182596
  1.088606	 -0.276127	  0.178300
  1.093493	 -0.256923	  0.169291
  1.101493	 -0.240211	  0.165849
  1.108894	 -0.221592	  0.165321
  1.114679	 -0.199484	  0.155930
  1.116006	 -0.182429	  0.148826
  1.121091	 -0.165350	  0.148997
  1.131409	 -0.145950	  0.147561
  1.140268	 -0.128082	  0.141087
  1.142608	 -0.108797	  0.134768
  1.144806	 -0.089249	  0.132745
  1.149336	 -0.069577	  0.129398
  1.156008	 -0.051674	  0.123726
  1.161098	 -0.032965	  0.119349
  1.161907	 -0.012875	  0.116483
  1.162586	  0.008178	  0.109193
  1.169251	  0.023198	  0.100883
  1.177833	  0.040824	  0.096346
  1.183896	  0.060216	  0.096821
  1.183245	  0.083835	  0.091361
  1.180942	  0.103041	  0.079543
  1.182836	  0.117822	  0.070922
  1.188715	  0.138482	  0.067144
  1.195830	  0.158677	  0.067915
  1.203699	  0.177173	  0.072255
  1.211780	  0.194849	  0.074764
  1.217752	  0.214336	  0.076571
  1.225417	  0.234808	  0.081211
  1.238674	  0.252267	  0.081892
  1.247911	  0.265894	  0.078003
  1.254908	  0.286003	  0.073909
  1.263725	  0.304166	  0.068573
  1.272971	  0.321217	  0.061917
  1.281777	  0.336307	  0.051317
  1.289288	  0.352690	  0.042358
  1.296888	  0.368971	  0.033230
  1.304738	  0.383243	  0.021654
  1.312269	  0.398037	  0.010430
  1.319170	  0.414165	  0.000811
  1.325213	  0.431774	 -0.006489
  1.331241	  0.449427	 -0.013695
  1.337163	  0.467474	 -0.019961
  1.343099	  0.485522	 -0.026195
  1.348698	  0.503952	 -0.031553
  1.353747	  0.522888	 -0.035546
  1.358935	  0.541759	 -0.039664
  1.364699	  0.560319	 -0.044364
  1.370175	  0.579082	 -0.048576
  1.377958	  0.596776	 -0.047517
  1.390324	  0.613838	 -0.046451
  1.401091	  0.632108	 -0.051491
  1.402893	  0.650383	 -0.058251
  1.402245	  0.672285	 -0.067748
  1.409478	  0.689411	 -0.073679
  1.419238	  0.703401	 -0.079294
  1.426522	  0.722341	 -0.089563
  1.434116	  0.737499	 -0.098146
  1.445824	  0.748353	 -0.103986
  1.463898	  0.768896	 -0.111490
  1.469010	  0.788362	 -0.115096
  1.469309	  0.810560	 -0.121656
  1.471104	  0.825985	 -0.130100
  1.476668	  0.841449	 -0.142993
  1.479390	  0.854897	 -0.157004
  1.484064	  0.871028	 -0.169593
  1.489884	  0.886272	 -0.180811
  1.490907	  0.903220	 -0.193614
  1.488289	  0.927736	 -0.203151
  1.491847	  0.943778	 -0.205780
  1.500310	  0.959919	 -0.209966
  1.507366	  0.978636	 -0.218932
  1.506691	  0.995715	 -0.231351
  1.505518	  1.011182	 -0.243321
  1.507424	  1.029908	 -0.253127
  1.513683	  1.048059	 -0.261331
  1.521712	  1.066066	 -0.266832
  1.524715	  1.089721	 -0.273341
  1.526551	  1.104440	 -0.274467
  1.524389	  1.123342	 -0.274933
  1.528850	  1.150833	 -0.274395
  1.533126	  1.170145	 -0.279872
  1.532625	  1.184291	 -0.287704
  1.530120	  1.204603	 -0.300304
  1.530589	  1.224623	 -0.304997
  1.537159	  1.242675	 -0.304774
  1.547229	  1.260821	 -0.307444
  1.554151	  1.278364	 -0.311548
  1.561933	  1.297293	 -0.315195
  1.570845	  1.314881	 -0.320170
  1.580406	  1.332758	 -0.324992
  1.589002	  1.351929	 -0.323912
  1.592330	  1.370860	 -0.321144
  1.594077	  1.390107	 -0.322792
  1.602605	  1.412605	 -0.328860
  1.609841	  1.428366	 -0.330219
  1.616929	  1.446162	 -0.327747
  1.625748	  1.467546	 -0.320791
  1.630683	  1.485245	 -0.316744
  1.632919	  1.506415	 -0.317496
  1.633194	  1.524054	 -0.324132
  1.639656	  1.544651	 -0.328802
  1.648431	  1.563204	 -0.331619
  1.652514	  1.581824	 -0.334304
  1.652337	  1.603361	 -0.334074
  1.655471	  1.625240	 -0.328959
  1.663235	  1.644558	 -0.325999
  1.668982	  1.659646	 -0.331743
  1.671236	  1.678329	 -0.340819
  1.677068	  1.700169	 -0.347396
  1.688113	  1.721484	 -0.344928
  1.693615	  1.738184	 -0.341894
  1.696085	  1.756236	 -0.345070
  1.698365	  1.774334	 -0.353135
  1.703201	  1.794090	 -0.360325
  1.708823	  1.812752	 -0.365686
  1.715104	  1.833195	 -0.371513
  1.728586	  1.874634	 -0.384353
  1.734575	  1.892831	 -0.390096
