  0.698724	 -2.187836	 -1.117274
  0.679395	 -2.224013	 -1.131358
  0.688375	 -2.207537	 -1.124437
  0.697402	 -2.191228	 -1.117190
  0.706429	 -2.174919	 -1.109942
  0.715522	 -2.158970	 -1.102008
  0.724623	 -2.143080	 -1.093965
  0.733732	 -2.127258	 -1.085799
  0.742869	 -2.111830	 -1.076939
  0.752006	 -2.096403	 -1.068078
  0.761142	 -2.081185	 -1.058862
  0.770270	 -2.066265	 -1.049162
  0.779398	 -2.051346	 -1.039462
  0.788443	 -2.036736	 -1.029227
  0.797444	 -2.022286	 -1.018732
  0.806445	 -2.007835	 -1.008236
  0.815214	 -1.993581	 -0.997284
  0.823966	 -1.979341	 -0.986301
  0.832651	 -1.965124	 -0.975236
  0.841108	 -1.950991	 -0.963889
  0.849565	 -1.936858	 -0.952543
  0.858037	 -1.922836	 -0.941071
  0.866519	 -1.908889	 -0.929515
  0.875256	 -1.895031	 -0.918043
  0.884656	 -1.881420	 -0.906802
  0.894225	 -1.867866	 -0.895633
  0.904540	 -1.854590	 -0.884801
  0.914885	 -1.841284	 -0.874033
  0.925547	 -1.827669	 -0.863985
  0.936209	 -1.814054	 -0.853938
  0.946615	 -1.799653	 -0.844755
  0.956978	 -1.785135	 -0.835708
  0.967234	 -1.770351	 -0.826978
  0.977394	 -1.755341	 -0.818523
  0.987589	 -1.740285	 -0.810192
  0.997901	 -1.725064	 -0.802319
  1.008310	 -1.709828	 -0.794605
  1.019391	 -1.694523	 -0.788050
  1.030901	 -1.679127	 -0.782530
  1.042965	 -1.663685	 -0.778532
  1.054898	 -1.648172	 -0.774410
  1.066222	 -1.632363	 -0.769736
  1.077546	 -1.616555	 -0.765062
  1.088716	 -1.600684	 -0.760230
  1.099017	 -1.584509	 -0.754550
  1.109317	 -1.568334	 -0.748870
  1.119644	 -1.552258	 -0.742959
  1.130081	 -1.536764	 -0.735818
  1.140517	 -1.521269	 -0.728676
  1.150951	 -1.505939	 -0.721185
  1.161353	 -1.491114	 -0.712699
  1.171755	 -1.476289	 -0.704213
  1.181926	 -1.461417	 -0.695531
  1.191747	 -1.446481	 -0.686561
  1.201568	 -1.431545	 -0.677591
  1.211351	 -1.416482	 -0.668792
  1.221121	 -1.401383	 -0.660043
  1.231393	 -1.386233	 -0.651982
  1.242426	 -1.371157	 -0.644842
  1.256817	 -1.357544	 -0.642088
  1.271403	 -1.344089	 -0.639590
  1.287631	 -1.332401	 -0.639633
  1.303994	 -1.320905	 -0.639943
  1.321151	 -1.310858	 -0.642109
  1.338308	 -1.300810	 -0.644275
  1.355465	 -1.290763	 -0.646441
  1.372774	 -1.280975	 -0.648584
  1.390140	 -1.271286	 -0.650716
  1.407506	 -1.261598	 -0.652849
  1.424873	 -1.251910	 -0.654982
  1.442255	 -1.242059	 -0.655885
  1.459596	 -1.232096	 -0.655673
  1.476936	 -1.222132	 -0.655461
  1.494276	 -1.212169	 -0.655249
  1.511154	 -1.201841	 -0.652337
  1.527423	 -1.191361	 -0.647289
  1.543693	 -1.180882	 -0.642240
  1.559839	 -1.170385	 -0.636846
  1.573379	 -1.160073	 -0.626341
  1.586919	 -1.149761	 -0.615837
  1.600458	 -1.139449	 -0.605333
  1.612722	 -1.129385	 -0.593154
  1.622302	 -1.120066	 -0.578275
  1.631883	 -1.110747	 -0.563397
  1.641463	 -1.101429	 -0.548518
  1.651043	 -1.092110	 -0.533639
  1.658748	 -1.083783	 -0.517168
  1.664416	 -1.076609	 -0.499380
  1.670084	 -1.069436	 -0.481592
  1.675752	 -1.062262	 -0.463804
  1.681420	 -1.055088	 -0.446016
  1.687088	 -1.047914	 -0.428228
  1.691850	 -1.041299	 -0.409965
  1.696197	 -1.034943	 -0.391506
  1.700544	 -1.028588	 -0.373048
  1.704891	 -1.022233	 -0.354589
  1.709238	 -1.015878	 -0.336131
  1.714679	 -1.008429	 -0.318385
  1.722043	 -0.999095	 -0.302303
  1.729408	 -0.989761	 -0.286220
  1.736773	 -0.980427	 -0.270138
  1.746366	 -0.968483	 -0.257281
  1.757125	 -0.955195	 -0.246904
  1.767884	 -0.941907	 -0.236528
  1.778643	 -0.928620	 -0.226151
  1.789403	 -0.915332	 -0.215774
  1.797567	 -0.899138	 -0.207342
  1.805357	 -0.882615	 -0.199198
  1.813147	 -0.866092	 -0.191055
  1.820936	 -0.849569	 -0.182912
  1.828726	 -0.833047	 -0.174768
  1.835630	 -0.816116	 -0.166664
  1.836738	 -0.797584	 -0.159224
  1.837846	 -0.779052	 -0.151784
  1.838954	 -0.760521	 -0.144345
  1.840062	 -0.741989	 -0.136905
  1.840688	 -0.722682	 -0.131725
  1.841161	 -0.703190	 -0.127271
  1.840614	 -0.683778	 -0.122488
  1.839397	 -0.664449	 -0.117496
  1.835880	 -0.645257	 -0.113103
  1.831951	 -0.626119	 -0.108825
  1.824574	 -0.607797	 -0.105678
  1.817160	 -0.589489	 -0.102544
  1.809747	 -0.571180	 -0.099410
  1.799800	 -0.554031	 -0.096768
  1.788929	 -0.537421	 -0.094330
  1.778058	 -0.520812	 -0.091892
  1.767187	 -0.504202	 -0.089454
  1.756316	 -0.487593	 -0.087016
  1.744255	 -0.471699	 -0.085629
  1.731942	 -0.455981	 -0.084476
  1.721866	 -0.438710	 -0.084915
  1.734743	 -0.427117	 -0.094905
  1.747620	 -0.415524	 -0.104894
  1.760497	 -0.403931	 -0.114884
  1.773374	 -0.392338	 -0.124873
  1.786251	 -0.380746	 -0.134863
  1.799128	 -0.369153	 -0.144852
  1.812005	 -0.357560	 -0.154842
  1.824882	 -0.345967	 -0.164831
  1.837759	 -0.334374	 -0.174821
  1.850635	 -0.322781	 -0.184810
  1.863512	 -0.311188	 -0.194800
  1.875890	 -0.297433	 -0.202387
  1.886847	 -0.281068	 -0.205873
  1.897803	 -0.264703	 -0.209359
  1.908760	 -0.248339	 -0.212845
  1.919424	 -0.231501	 -0.214511
  1.929057	 -0.214160	 -0.211961
  1.938689	 -0.196819	 -0.209412
  1.948321	 -0.179478	 -0.206863
  1.956167	 -0.162351	 -0.200145
  1.963316	 -0.145497	 -0.192094
  1.970465	 -0.128643	 -0.184042
  1.976963	 -0.113668	 -0.172486
  1.983334	 -0.099043	 -0.160423
  1.989798	 -0.086307	 -0.146423
  1.996511	 -0.074568	 -0.131687
  2.003522	 -0.063935	 -0.116267
  2.011418	 -0.055417	 -0.099985
  2.019885	 -0.047989	 -0.083458
  2.029134	 -0.042224	 -0.066689
  2.038480	 -0.036599	 -0.049925
  2.048360	 -0.031780	 -0.033217
  2.058241	 -0.026961	 -0.016510
  2.068121	 -0.022142	  0.000198
  2.077481	 -0.015550	  0.016598
  2.085776	 -0.006104	  0.032153
  2.094071	  0.003342	  0.047708
  2.102366	  0.012788	  0.063263
  2.110613	  0.022276	  0.078819
  2.118283	  0.032251	  0.094364
  2.125953	  0.042226	  0.109910
  2.133623	  0.052201	  0.125456
  2.141200	  0.062272	  0.140986
  2.147693	  0.073400	  0.156283
  2.154187	  0.084528	  0.171580
  2.160680	  0.095656	  0.186877
  2.167800	  0.105848	  0.202543
  2.175168	  0.115647	  0.218345
  2.182550	  0.125443	  0.234142
  2.190274	  0.135144	  0.249833
  2.197998	  0.144845	  0.265525
  2.205821	  0.154842	  0.280981
  2.213741	  0.165139	  0.296187
  2.221680	  0.175495	  0.311344
  2.229760	  0.186328	  0.326087
  2.237840	  0.197162	  0.340830
  2.246120	  0.208199	  0.355308
  2.254442	  0.219277	  0.369731
  2.263015	  0.230458	  0.383926
  2.271772	  0.241710	  0.397950
  2.280670	  0.253071	  0.411798
  2.290046	  0.264792	  0.425016
  2.299421	  0.276513	  0.438235
  2.309281	  0.288885	  0.450471
  2.319366	  0.301562	  0.462200
  2.329452	  0.314240	  0.473928
  2.339800	  0.327995	  0.484112
  2.350169	  0.341847	  0.494142
  2.360529	  0.355752	  0.504108
  2.370690	  0.370588	  0.512862
  2.380852	  0.385425	  0.521615
  2.390906	  0.400377	  0.530295
  2.400178	  0.416119	  0.538432
  2.409450	  0.431861	  0.546570
  2.418572	  0.447710	  0.554669
  2.426727	  0.464204	  0.562509
  2.434882	  0.480697	  0.570349
  2.443037	  0.497190	  0.578189
  2.451192	  0.513684	  0.586029
  2.463504	  0.539360	  0.598090
  2.471381	  0.556015	  0.605873
