  0.171263	 -2.200836	  0.953979
  0.184068	 -2.223192	  0.974710
  0.172422	 -2.210414	  0.962616
  0.165074	 -2.198804	  0.951426
  0.157111	 -2.187175	  0.936789
  0.148586	 -2.175929	  0.921203
  0.139416	 -2.164652	  0.907027
  0.130061	 -2.151753	  0.894656
  0.120418	 -2.138856	  0.883756
  0.109896	 -2.125582	  0.872653
  0.098469	 -2.114030	  0.860941
  0.086920	 -2.105201	  0.848287
  0.075908	 -2.098769	  0.832790
  0.065270	 -2.093348	  0.814486
  0.054876	 -2.088070	  0.800544
  0.042771	 -2.077103	  0.785495
  0.032563	 -2.065444	  0.776506
  0.020262	 -2.049839	  0.766368
  0.008895	 -2.034930	  0.758277
 -0.004000	 -2.022306	  0.746236
 -0.018746	 -2.017270	  0.734811
 -0.037450	 -2.016233	  0.725160
 -0.055611	 -2.009294	  0.710749
 -0.069027	 -1.999592	  0.699556
 -0.079026	 -1.989789	  0.690953
 -0.094598	 -1.976065	  0.677944
 -0.110066	 -1.969199	  0.667676
 -0.123769	 -1.964800	  0.658963
 -0.142614	 -1.959275	  0.649190
 -0.156890	 -1.952492	  0.640878
 -0.171050	 -1.943635	  0.630565
 -0.191003	 -1.933028	  0.617526
 -0.203352	 -1.926906	  0.611207
 -0.218551	 -1.919479	  0.606114
 -0.238116	 -1.908948	  0.601496
 -0.253978	 -1.898590	  0.597885
 -0.269155	 -1.886205	  0.593960
 -0.283607	 -1.870275	  0.588407
 -0.292963	 -1.853974	  0.583117
 -0.298775	 -1.839802	  0.577486
 -0.309694	 -1.824004	  0.569876
 -0.324599	 -1.809365	  0.563921
 -0.335020	 -1.793092	  0.558908
 -0.337995	 -1.779092	  0.556076
 -0.344021	 -1.758696	  0.553479
 -0.349436	 -1.738084	  0.552522
 -0.353789	 -1.717215	  0.551109
 -0.358328	 -1.698356	  0.550893
 -0.370339	 -1.679056	  0.552486
 -0.375897	 -1.660680	  0.552949
 -0.386375	 -1.643023	  0.557276
 -0.394717	 -1.629138	  0.558950
 -0.406107	 -1.613079	  0.561888
 -0.408378	 -1.590962	  0.563735
 -0.414126	 -1.567289	  0.570529
 -0.419743	 -1.550508	  0.572031
 -0.423659	 -1.537801	  0.571741
 -0.425669	 -1.516468	  0.572023
 -0.434685	 -1.491026	  0.574570
 -0.445193	 -1.468656	  0.572912
 -0.447723	 -1.454758	  0.572678
 -0.449691	 -1.437595	  0.571049
 -0.453359	 -1.416468	  0.564106
 -0.457383	 -1.400854	  0.562520
 -0.460061	 -1.380799	  0.565512
 -0.458112	 -1.355768	  0.568319
 -0.459719	 -1.333244	  0.570313
 -0.466044	 -1.315024	  0.569764
 -0.474297	 -1.297122	  0.569675
 -0.482812	 -1.280624	  0.569534
 -0.487566	 -1.269382	  0.569401
 -0.490104	 -1.240563	  0.566860
 -0.488465	 -1.219120	  0.564320
 -0.487973	 -1.207294	  0.560433
 -0.490974	 -1.186941	  0.554929
 -0.493416	 -1.169166	  0.550634
 -0.497028	 -1.142807	  0.538352
 -0.501101	 -1.124327	  0.528036
 -0.501924	 -1.116808	  0.521924
 -0.502961	 -1.102376	  0.508581
 -0.503807	 -1.082412	  0.490905
 -0.505487	 -1.067922	  0.477669
 -0.511623	 -1.056759	  0.466966
 -0.522718	 -1.039312	  0.450518
 -0.527009	 -1.027340	  0.443080
 -0.532491	 -1.015536	  0.434225
 -0.542557	 -0.999674	  0.420981
 -0.549291	 -0.986455	  0.410510
 -0.559786	 -0.975065	  0.400299
 -0.570367	 -0.957232	  0.388031
 -0.581146	 -0.944190	  0.378658
 -0.594965	 -0.932069	  0.367533
 -0.603514	 -0.922825	  0.357183
 -0.612629	 -0.915582	  0.345765
 -0.633412	 -0.902899	  0.323222
 -0.641997	 -0.896877	  0.309925
 -0.646491	 -0.892165	  0.299285
 -0.653988	 -0.883547	  0.275989
 -0.658474	 -0.875781	  0.265458
 -0.666737	 -0.869319	  0.244073
 -0.678137	 -0.863070	  0.218055
 -0.687448	 -0.858310	  0.206512
 -0.700586	 -0.850281	  0.192201
 -0.710820	 -0.838818	  0.175785
 -0.719118	 -0.828224	  0.158668
 -0.723137	 -0.822696	  0.149151
 -0.731186	 -0.813162	  0.129249
 -0.737774	 -0.805267	  0.109902
 -0.742917	 -0.793024	  0.090592
 -0.744784	 -0.772896	  0.073131
 -0.743772	 -0.755608	  0.063546
 -0.739450	 -0.730574	  0.057506
 -0.733665	 -0.710398	  0.052772
 -0.729438	 -0.695448	  0.050001
 -0.721542	 -0.652305	  0.061038
 -0.724395	 -0.636125	  0.063526
 -0.721988	 -0.624210	  0.062288
 -0.716864	 -0.603248	  0.058213
 -0.709807	 -0.584102	  0.048370
 -0.708211	 -0.571535	  0.041020
 -0.710673	 -0.548246	  0.026059
 -0.707667	 -0.526532	  0.014552
 -0.703888	 -0.515794	  0.008741
 -0.693453	 -0.499907	  0.003536
 -0.686197	 -0.479788	  0.001053
 -0.682309	 -0.459661	 -0.003454
 -0.679888	 -0.440140	 -0.007536
 -0.677367	 -0.420840	 -0.011811
 -0.673842	 -0.401838	 -0.016957
 -0.669333	 -0.383230	 -0.021253
 -0.663304	 -0.366526	 -0.024645
 -0.663389	 -0.347950	 -0.033922
 -0.674523	 -0.322460	 -0.044160
 -0.680715	 -0.303590	 -0.048812
 -0.683047	 -0.287723	 -0.050651
 -0.683631	 -0.266992	 -0.053592
 -0.683547	 -0.247398	 -0.059324
 -0.682936	 -0.230791	 -0.063933
 -0.679622	 -0.212193	 -0.067458
 -0.677287	 -0.187750	 -0.074358
 -0.678878	 -0.171163	 -0.079689
 -0.681228	 -0.150094	 -0.086459
 -0.680658	 -0.130254	 -0.093920
 -0.681270	 -0.115310	 -0.100705
 -0.687566	 -0.100088	 -0.110773
 -0.698921	 -0.085540	 -0.121083
 -0.711001	 -0.073752	 -0.130993
 -0.727653	 -0.056458	 -0.143981
 -0.740456	 -0.037035	 -0.157132
 -0.745658	 -0.026791	 -0.162549
 -0.753072	 -0.013885	 -0.167852
 -0.757891	  0.003909	 -0.177908
 -0.758011	  0.024641	 -0.192364
 -0.756913	  0.046156	 -0.206274
 -0.756002	  0.061132	 -0.213225
 -0.757910	  0.072771	 -0.221011
 -0.765999	  0.100888	 -0.238013
 -0.770912	  0.115648	 -0.244339
 -0.775016	  0.123802	 -0.247731
 -0.785886	  0.143089	 -0.257210
 -0.799650	  0.164197	 -0.275322
 -0.804710	  0.176132	 -0.283476
 -0.810768	  0.189455	 -0.292963
 -0.819455	  0.206963	 -0.301132
 -0.836347	  0.224335	 -0.319794
 -0.847652	  0.229641	 -0.329791
 -0.861090	  0.233502	 -0.341716
 -0.876323	  0.239566	 -0.352844
 -0.901732	  0.246369	 -0.360157
 -0.924481	  0.254313	 -0.370379
 -0.934157	  0.258759	 -0.379128
 -0.947286	  0.263214	 -0.394771
 -0.961138	  0.272586	 -0.413714
 -0.970608	  0.283761	 -0.425961
 -0.978361	  0.294950	 -0.437476
 -0.986980	  0.304857	 -0.452802
 -1.002197	  0.315718	 -0.471533
 -1.017084	  0.325390	 -0.482288
 -1.028090	  0.331304	 -0.488703
 -1.045822	  0.344881	 -0.497977
 -1.063442	  0.355401	 -0.507179
 -1.079739	  0.360019	 -0.516994
 -1.094992	  0.362732	 -0.528405
 -1.110826	  0.367150	 -0.541656
 -1.128108	  0.371698	 -0.553020
 -1.147455	  0.376337	 -0.561634
 -1.164665	  0.377625	 -0.568441
 -1.182809	  0.382865	 -0.576760
 -1.201108	  0.385887	 -0.588724
 -1.218600	  0.388834	 -0.602881
 -1.231399	  0.391480	 -0.620420
 -1.243084	  0.389023	 -0.643629
 -1.255919	  0.381196	 -0.661811
 -1.267860	  0.376133	 -0.672471
 -1.286315	  0.368610	 -0.688184
 -1.302220	  0.361334	 -0.697607
 -1.314849	  0.358761	 -0.701983
 -1.335007	  0.357807	 -0.710635
 -1.354164	  0.358786	 -0.721831
 -1.369996	  0.359199	 -0.733138
 -1.386381	  0.357895	 -0.745934
 -1.402297	  0.354427	 -0.758196
 -1.417600	  0.351875	 -0.770719
 -1.433024	  0.353134	 -0.783157
 -1.447274	  0.357727	 -0.797315
 -1.460225	  0.363102	 -0.808000
 -1.478585	  0.369381	 -0.816981
 -1.500187	  0.374140	 -0.823188
 -1.522936	  0.378072	 -0.829680
 -1.535708	  0.379194	 -0.835571
 -1.554022	  0.382638	 -0.844381
 -1.568226	  0.387214	 -0.852892
 -1.585741	  0.387610	 -0.865275
 -1.603519	  0.388308	 -0.875987
 -1.624560	  0.393635	 -0.884803
 -1.643442	  0.405823	 -0.893957
 -1.652043	  0.415904	 -0.902146
 -1.658339	  0.428960	 -0.914681
 -1.671544	  0.447301	 -0.927585
 -1.681305	  0.462530	 -0.936429
 -1.688037	  0.476432	 -0.944918
 -1.695867	  0.492779	 -0.953984
 -1.703314	  0.510577	 -0.962314
 -1.708924	  0.526495	 -0.969690
 -1.717050	  0.543224	 -0.982841
 -1.726974	  0.558764	 -0.997509
 -1.734479	  0.568660	 -1.008577
 -1.746903	  0.578413	 -1.019162
 -1.766576	  0.593491	 -1.030804
 -1.774739	  0.602343	 -1.035978
 -1.787922	  0.618524	 -1.042332
 -1.794966	  0.638427	 -1.051209
 -1.801574	  0.655410	 -1.059992
 -1.811410	  0.668810	 -1.071804
 -1.821839	  0.680056	 -1.087634
 -1.827586	  0.692333	 -1.104522
 -1.829974	  0.705865	 -1.115952
 -1.834708	  0.723736	 -1.126179
 -1.842207	  0.738732	 -1.137864
 -1.850948	  0.751683	 -1.150604
 -1.859841	  0.764891	 -1.162896
 -1.866270	  0.776243	 -1.175579
 -1.871718	  0.787570	 -1.192972
 -1.885434	  0.802468	 -1.207974
 -1.900399	  0.817348	 -1.215824
 -1.909482	  0.828578	 -1.222750
 -1.919575	  0.846258	 -1.235296
 -1.940018	  0.864448	 -1.244475
 -1.951030	  0.877296	 -1.255137
