 0.0 0.0 0.0 0
 0.26798597189111645 -0.7630528544185008 -0.5524246086883192 1000
 -0.8096835351003926 0.5296461237040153 -0.2312853294839187 1000
 -0.2600021539908723 -0.5244369472261434 -0.7566193219454402 1000
 -0.8233088569203707 -0.393769303547365 0.3874673813852725 1000
 0.53384344977128 -0.4319612262605666 -0.6848981784606893 1000
 -0.8302921839612905 -0.04161781287328106 -0.5139663272370849 1000
 0.4771690006393128 0.23334689883465876 0.7884949184708044 1000
 0.9352115212676395 -0.3540544917776444 -0.0039141297886050586 1000
 0.0 0.0 0.0 0
 0.6129551420689989 0.6119730282887165 0.46398600488912306 1000
 0.4648232582726243 0.7065694382093926 -0.5021576383411127 1000
 -0.4147305157016201 0.20523427405576608 0.8320290868837046 1000
 -0.43556558337842166 -0.8939184715184598 -0.0976383422971917 1000
 -0.7869311169404014 0.37351289263646703 -0.4521475197379818 1000
 0.5862299842042388 -0.505398757938301 0.5876648612908003 1000
 -0.7893434883282364 -0.4628660669021531 -0.37203697863181084 1000
 0.01372598871360417 0.6326079138116907 0.7243019446843761 1000
 0.0 0.0 0.0 0
 0.30395410620972796 0.8591662493428067 -0.38655431471401996 1000
 0.913183359287258 -0.28490990914805037 0.26444170040608905 1000
 -0.20080336107675734 0.2926540152544742 -0.8719916502959665 1000
 0.5137406259547544 0.4558882224943854 0.676616521246081 1000
 0.1209532072266227 -0.8932049447439802 0.40275763910453016 1000
 0.17907526138148327 -0.04057858026170444 -0.9202601757882528 1000
 0.6709441789307584 -0.5308098722450734 -0.4898058627154828 1000
 0.2668275116866906 -0.32521701180808193 -0.8504127649557173 1000
 0.0 0.0 0.0 0
 -0.6845757759212322 -0.6807976857660054 0.24877392093109368 1000
 0.7009648386814452 0.1659248161490292 0.6432898860357501 1000
 -0.2558922989720455 -0.12221284481660322 -0.8947504782373329 1000
 -0.025674497198266477 0.7159778526304453 -0.6513490493838877 1000
 -0.8525608085571594 0.5163715414404307 -0.06256573185976635 1000
 -0.14543600202784085 -0.15693557889426318 0.9140665357949684 1000
 -0.10849474138825949 -0.9315177820246302 0.32372466378940534 1000
 -0.8540157978820581 0.32952244834110567 0.382910962050006 1000
 0.0 0.0 0.0 0
 0.32833960452308736 -0.8137756282682234 0.44549622154334817 1000
 -0.355398471343234 0.9104250561855278 0.20155995697089776 1000
 0.777944535601594 0.6281179143141247 0.027561964592398153 1000
 -0.4586301345000568 0.6843142451685986 0.5340929813092167 1000
