 -2.198696	 -0.988081	 -0.692274
 -2.193080	 -0.992180	 -0.675261
 -2.191409	 -0.993400	 -0.670198
 -2.184204	 -0.996592	 -0.653477
 -2.180490	 -1.000307	 -0.635591
 -2.178170	 -1.009790	 -0.617207
 -2.175308	 -1.017721	 -0.599263
 -2.177068	 -1.024122	 -0.582215
 -2.181705	 -1.032930	 -0.564754
 -2.183954	 -1.045052	 -0.547032
 -2.185048	 -1.061112	 -0.533644
 -2.195436	 -1.080557	 -0.512304
 -2.198548	 -1.085381	 -0.506267
