  1.096603	 -2.543950	 -1.227469
  1.085745	 -2.518762	 -1.215316
  1.096068	 -2.505448	 -1.165486
  1.101343	 -2.490152	 -1.115699
  1.110708	 -2.485385	 -1.065830
  1.117206	 -2.476039	 -1.015925
  1.118162	 -2.462823	 -0.966548
  1.126625	 -2.455962	 -0.916776
  1.129013	 -2.445584	 -0.869171
  1.137843	 -2.433991	 -0.824666
  1.143568	 -2.425507	 -0.776291
  1.150345	 -2.409210	 -0.727650
  1.151863	 -2.405385	 -0.676481
  1.160445	 -2.400036	 -0.627820
  1.156012	 -2.391130	 -0.581389
  1.152246	 -2.381688	 -0.532153
  1.155391	 -2.369978	 -0.480372
  1.159909	 -2.360215	 -0.431314
  1.164767	 -2.351398	 -0.382311
  1.170465	 -2.342430	 -0.332767
  1.177161	 -2.333522	 -0.284630
  1.184898	 -2.324958	 -0.237518
  1.195654	 -2.316800	 -0.190659
  1.209700	 -2.308672	 -0.143494
  1.224667	 -2.299540	 -0.094287
  1.238421	 -2.288618	 -0.044859
  1.246329	 -2.275756	  0.004793
  1.246649	 -2.258808	  0.050987
  1.249885	 -2.243115	  0.095487
  1.249695	 -2.224459	  0.141938
  1.256473	 -2.212162	  0.191234
  1.265425	 -2.201821	  0.242039
  1.274427	 -2.193304	  0.290797
  1.282185	 -2.186624	  0.338517
  1.288342	 -2.182238	  0.388049
  1.293205	 -2.178919	  0.439850
  1.297127	 -2.174816	  0.489397
  1.301295	 -2.169434	  0.537095
  1.305115	 -2.161674	  0.585098
  1.306664	 -2.150179	  0.633471
  1.307166	 -2.136384	  0.683197
  1.312044	 -2.121184	  0.731067
  1.311739	 -2.106985	  0.778519
  1.312040	 -2.092165	  0.826311
  1.314017	 -2.079491	  0.873254
  1.317039	 -2.069146	  0.922370
  1.321900	 -2.060760	  0.973082
  1.327645	 -2.053614	  1.021501
  1.335043	 -2.046172	  1.071271
  1.345750	 -2.037269	  1.121715
  1.358039	 -2.027601	  1.170273
  1.370228	 -2.018517	  1.216887
  1.382086	 -2.010568	  1.262616
  1.393884	 -2.002439	  1.311611
  1.402388	 -1.992656	  1.359378
  1.407968	 -1.983822	  1.407311
  1.411554	 -1.975645	  1.456473
  1.413530	 -1.967665	  1.504079
  1.414926	 -1.958718	  1.553568
  1.415735	 -1.948404	  1.602211
  1.416273	 -1.936315	  1.652790
  1.416364	 -1.923948	  1.702185
  1.425506	 -1.910615	  1.748489
  1.434199	 -1.891205	  1.792157
  1.434883	 -1.887146	  1.838421
  1.449232	 -1.906017	  1.856805
