 0.0 0.0 0.0 0
 0.6135146194622711 -0.7247351252651965 -0.3123056354165006 1000
 0.9782871646830879 0.20369162722719952 -0.028929991597998903 1000
 -0.5146005022631936 -0.4151210014837893 -0.7508034877366809 1000
 0.10474079845946638 -0.786956153569319 0.608752312108509 1000
 -0.18950532391420494 0.39072244506955234 0.9012883573679639 1000
 -0.7834697382579818 -0.4986636969460032 0.37134443119846827 1000
 0.09366639300523318 -0.9728433096605786 0.2125335306958418 1000
 0.39176203976319146 0.10023557723811533 0.9146536684758473 1000
 0.0 0.0 0.0 0
 0.481505668570268 -0.779244972575669 0.400143179187455 1000
 -0.9710667801365376 -0.06892860689514227 -0.2275613228708958 1000
 -0.6584603358906639 -0.4682265485338351 0.5893495442492902 1000
 -0.6728510206748809 0.6149900808157903 -0.41054927167753985 1000
 -0.4512206640599119 0.7374144102855738 0.5031718392641934 1000
 -0.17373907438890182 -0.05557775099227591 -0.9829739811536864 1000
 0.6774036434320116 0.4480126570432851 0.5844355935379463 1000
 -0.7920501022852855 0.6096905238959799 -0.017061668772836297 1000
 0.0 0.0 0.0 0
 0.8609830234819843 0.49967159489660357 -0.09586725472915789 1000
 0.3577251612936853 0.9122877093269979 -0.19822674993124803 1000
 0.9122801595981345 0.17191891486055805 -0.3721945688974656 1000
 -0.5342377788641516 0.8261187443343408 0.17834465479444436 1000
 -0.7331170204478119 -0.6662834598529737 -0.13464689174308211 1000
 0.9052304565921312 -0.4225623927800842 0.040197570398858865 1000
 0.7654193546696586 0.035379251095385755 0.6422534702817982 1000
 0.08119391709688059 0.7194705656780515 -0.6900417762348661 1000
 0.0 0.0 0.0 0
