 -2.724290	 -1.325827	  0.036410
 -2.697317	 -1.312700	  0.036049
 -2.649708	 -1.318206	  0.066236
 -2.613989	 -1.319676	  0.103010
 -2.576189	 -1.323939	  0.127299
 -2.531765	 -1.334298	  0.153548
 -2.494632	 -1.342780	  0.184820
 -2.455947	 -1.349813	  0.213416
 -2.416878	 -1.357676	  0.242420
 -2.376713	 -1.366151	  0.273099
 -2.337755	 -1.374186	  0.304434
 -2.301455	 -1.380954	  0.335028
 -2.265238	 -1.387036	  0.366372
 -2.230191	 -1.391556	  0.397560
 -2.190759	 -1.395283	  0.430469
 -2.155401	 -1.397321	  0.463016
 -2.117362	 -1.399111	  0.496626
 -2.073847	 -1.409602	  0.524440
 -2.035214	 -1.420735	  0.554293
 -1.999605	 -1.429567	  0.583680
 -1.961527	 -1.438857	  0.614092
 -1.923721	 -1.448952	  0.642754
 -1.883488	 -1.460239	  0.672423
 -1.847183	 -1.469754	  0.699698
 -1.806715	 -1.478218	  0.730946
 -1.767145	 -1.484143	  0.760006
 -1.724967	 -1.489686	  0.788829
 -1.682251	 -1.495245	  0.817245
 -1.641452	 -1.500230	  0.843634
 -1.601455	 -1.504377	  0.869744
 -1.563503	 -1.507975	  0.897466
 -1.525886	 -1.515901	  0.926111
 -1.484959	 -1.526019	  0.957255
 -1.443667	 -1.528195	  0.979679
 -1.408603	 -1.539993	  1.010522
 -1.365548	 -1.545592	  1.044671
 -1.328835	 -1.551779	  1.072764
 -1.290105	 -1.559171	  1.103520
 -1.248082	 -1.566271	  1.136308
 -1.209607	 -1.571649	  1.165503
 -1.171776	 -1.576236	  1.193883
 -1.132896	 -1.580556	  1.222936
 -1.091154	 -1.585220	  1.254068
 -1.053856	 -1.589981	  1.282057
 -1.015384	 -1.595674	  1.310949
 -0.977907	 -1.602535	  1.339577
 -0.939936	 -1.610334	  1.369513
 -0.900958	 -1.618865	  1.401238
 -0.862616	 -1.627641	  1.432117
 -0.826855	 -1.635937	  1.459908
 -0.787129	 -1.644970	  1.489238
 -0.744847	 -1.655621	  1.515951
 -0.704562	 -1.665507	  1.541067
 -0.670160	 -1.675089	  1.577999
 -0.632261	 -1.682814	  1.613136
 -0.597568	 -1.689787	  1.644029
 -0.563391	 -1.695319	  1.674311
 -0.524268	 -1.701001	  1.707047
 -0.483367	 -1.705870	  1.738468
 -0.441644	 -1.709254	  1.767730
 -0.399800	 -1.712150	  1.794944
 -0.360101	 -1.715484	  1.820021
 -0.319374	 -1.720972	  1.846271
 -0.276854	 -1.728819	  1.873329
 -0.235853	 -1.738242	  1.898872
 -0.196436	 -1.747701	  1.923237
 -0.156350	 -1.757688	  1.948635
 -0.111152	 -1.768571	  1.979505
 -0.071070	 -1.777041	  2.010047
 -0.036605	 -1.783494	  2.035685
  0.003795	 -1.790336	  2.065185
  0.043304	 -1.797562	  2.096141
  0.079252	 -1.805540	  2.125925
  0.114839	 -1.814883	  2.155975
  0.154081	 -1.824944	  2.189131
  0.194574	 -1.833764	  2.221382
  0.230790	 -1.841284	  2.251169
  0.270469	 -1.848659	  2.283040
  0.306006	 -1.854614	  2.312039
  0.346738	 -1.855057	  2.332067
  0.350206	 -1.873607	  2.355388
