  1.405023	 -1.295942	  1.503609
  1.416049	 -1.296977	  1.496591
  1.401228	 -1.291907	  1.503136
  1.377220	 -1.283776	  1.514184
  1.360261	 -1.283870	  1.526230
  1.350824	 -1.286693	  1.536095
  1.330857	 -1.292139	  1.553260
  1.312133	 -1.289728	  1.562703
  1.297738	 -1.286265	  1.568485
  1.277837	 -1.281632	  1.575385
  1.258334	 -1.277298	  1.582375
  1.240599	 -1.271888	  1.587489
  1.222182	 -1.267451	  1.593082
  1.202522	 -1.263634	  1.599341
  1.184340	 -1.258682	  1.604509
  1.165479	 -1.254058	  1.609289
  1.146198	 -1.250987	  1.614727
  1.127761	 -1.245993	  1.620199
  1.108138	 -1.240393	  1.627135
  1.088204	 -1.238143	  1.637816
  1.075735	 -1.238681	  1.645504
  1.055708	 -1.235234	  1.651337
  1.037250	 -1.230307	  1.656506
  1.017887	 -1.227565	  1.665205
  0.999796	 -1.224930	  1.673566
  0.981771	 -1.222027	  1.681769
  0.963841	 -1.219016	  1.690037
  0.945622	 -1.216065	  1.697741
  0.927120	 -1.214862	  1.705141
  0.908598	 -1.215696	  1.712269
  0.889909	 -1.216588	  1.719390
  0.872717	 -1.218099	  1.727381
  0.854171	 -1.225446	  1.733213
  0.828805	 -1.229166	  1.741597
  0.809664	 -1.226452	  1.750303
  0.798313	 -1.216527	  1.759284
  0.782964	 -1.206280	  1.770153
  0.764598	 -1.203691	  1.779515
  0.745386	 -1.205247	  1.788913
  0.727633	 -1.204016	  1.798786
  0.713068	 -1.197262	  1.809867
  0.697312	 -1.192233	  1.822202
  0.681325	 -1.189177	  1.834019
  0.665506	 -1.185244	  1.845447
  0.650343	 -1.183303	  1.857777
  0.636115	 -1.183884	  1.872070
  0.619709	 -1.174153	  1.882921
  0.601382	 -1.158617	  1.887172
  0.583661	 -1.149548	  1.894093
  0.569088	 -1.144328	  1.903246
  0.554339	 -1.136961	  1.912090
  0.534817	 -1.128201	  1.922520
  0.520388	 -1.124002	  1.931861
  0.506180	 -1.117967	  1.940384
  0.485239	 -1.108709	  1.951290
  0.470107	 -1.105527	  1.961721
  0.456829	 -1.100876	  1.969290
  0.432604	 -1.093857	  1.981652
  0.414232	 -1.094249	  1.995018
  0.404488	 -1.096277	  2.004827
  0.392381	 -1.092854	  2.016923
  0.372151	 -1.090281	  2.030887
  0.355344	 -1.087450	  2.042913
  0.339505	 -1.078553	  2.052067
  0.323919	 -1.069373	  2.058786
  0.306133	 -1.064961	  2.068956
  0.289515	 -1.058892	  2.078941
  0.273594	 -1.049904	  2.086775
  0.256658	 -1.044488	  2.095425
  0.239517	 -1.040928	  2.105285
  0.222470	 -1.037369	  2.115131
  0.205353	 -1.035976	  2.125380
  0.188389	 -1.037125	  2.135912
  0.171427	 -1.038276	  2.146446
  0.154665	 -1.039174	  2.157320
  0.138260	 -1.039668	  2.168742
  0.122122	 -1.039952	  2.180503
  0.106450	 -1.039328	  2.192785
  0.091823	 -1.040829	  2.205998
  0.073476	 -1.037835	  2.214904
  0.057026	 -1.036520	  2.226202
