 -1.896603	  0.547290	 -1.444793
 -1.917770	  0.546239	 -1.454550
 -1.938937	  0.545188	 -1.464307
 -1.922542	  0.546049	 -1.450981
 -1.904192	  0.544943	 -1.444010
 -1.885748	  0.543261	 -1.436903
 -1.866825	  0.543446	 -1.428402
 -1.848693	  0.543743	 -1.419082
 -1.831836	  0.543830	 -1.413226
 -1.812314	  0.543763	 -1.405733
 -1.793747	  0.544856	 -1.398905
 -1.771295	  0.543124	 -1.394600
 -1.752703	  0.538951	 -1.390568
 -1.736634	  0.534815	 -1.382034
 -1.717959	  0.534812	 -1.374418
 -1.695799	  0.531956	 -1.370576
 -1.678186	  0.527642	 -1.365591
 -1.661594	  0.524359	 -1.356249
 -1.643370	  0.519140	 -1.348728
 -1.624151	  0.511074	 -1.344015
 -1.607477	  0.507434	 -1.332329
 -1.590380	  0.504455	 -1.321382
 -1.570809	  0.499952	 -1.319784
 -1.550256	  0.497817	 -1.317779
 -1.531065	  0.497035	 -1.308259
 -1.517582	  0.491347	 -1.294698
 -1.500512	  0.486623	 -1.284713
 -1.480780	  0.487057	 -1.278263
 -1.460328	  0.484243	 -1.271315
 -1.445561	  0.475356	 -1.260666
 -1.431162	  0.471943	 -1.249432
 -1.414277	  0.468154	 -1.239332
 -1.399218	  0.460508	 -1.228325
 -1.380302	  0.457814	 -1.214069
 -1.364851	  0.456203	 -1.205252
 -1.342896	  0.455747	 -1.200843
 -1.322882	  0.457667	 -1.195619
 -1.307416	  0.457833	 -1.183550
 -1.292239	  0.456424	 -1.169417
 -1.275725	  0.454752	 -1.157268
 -1.256447	  0.455504	 -1.152653
 -1.235998	  0.455492	 -1.148781
 -1.215797	  0.449748	 -1.143909
 -1.196188	  0.443433	 -1.135575
 -1.176643	  0.442010	 -1.130199
 -1.161408	  0.452884	 -1.119558
 -1.145190	  0.458099	 -1.106899
 -1.130164	  0.455800	 -1.091228
 -1.113123	  0.454064	 -1.079728
 -1.094752	  0.455861	 -1.072580
 -1.074472	  0.456153	 -1.069858
 -1.052728	  0.450888	 -1.065800
 -1.034199	  0.446840	 -1.060648
 -1.018343	  0.446949	 -1.051180
 -1.001830	  0.448922	 -1.038446
 -0.981261	  0.446714	 -1.024727
 -0.967431	  0.437909	 -1.016146
 -0.949113	  0.434993	 -1.007747
 -0.929098	  0.436395	 -0.998467
 -0.910791	  0.439920	 -0.994542
 -0.892630	  0.431603	 -0.991399
 -0.872924	  0.424630	 -0.989588
 -0.849630	  0.423906	 -0.983193
 -0.833569	  0.426335	 -0.974816
 -0.818048	  0.421990	 -0.961009
 -0.797376	  0.416469	 -0.954110
 -0.780628	  0.414168	 -0.948816
 -0.760640	  0.413326	 -0.946550
 -0.738486	  0.412399	 -0.942737
 -0.721214	  0.409443	 -0.939497
 -0.700863	  0.403874	 -0.940062
 -0.680231	  0.392076	 -0.934016
 -0.662742	  0.389129	 -0.922960
 -0.648380	  0.387574	 -0.916207
 -0.626482	  0.382313	 -0.914333
 -0.605819	  0.381023	 -0.912451
 -0.588537	  0.378772	 -0.903194
 -0.569676	  0.374941	 -0.894904
 -0.550283	  0.371488	 -0.890551
 -0.531045	  0.367687	 -0.887845
 -0.511390	  0.365047	 -0.880207
 -0.495691	  0.364451	 -0.867861
 -0.479892	  0.363434	 -0.855521
 -0.462968	  0.362299	 -0.843633
 -0.445183	  0.359572	 -0.834903
 -0.428367	  0.355453	 -0.825105
 -0.412587	  0.351377	 -0.813422
 -0.395028	  0.350053	 -0.802781
 -0.376569	  0.352822	 -0.795561
 -0.357044	  0.359192	 -0.784520
 -0.344332	  0.358122	 -0.771057
 -0.329255	  0.359050	 -0.758650
 -0.311202	  0.360289	 -0.747037
 -0.296026	  0.358693	 -0.734529
 -0.281329	  0.359716	 -0.723266
 -0.262620	  0.362017	 -0.709997
 -0.246971	  0.363592	 -0.701763
 -0.232677	  0.363181	 -0.686795
 -0.217595	  0.361917	 -0.668053
 -0.202351	  0.366972	 -0.662249
 -0.185965	  0.369159	 -0.651215
 -0.167625	  0.369955	 -0.637707
 -0.148539	  0.375341	 -0.631027
 -0.131028	  0.378780	 -0.625283
 -0.111363	  0.373559	 -0.614144
 -0.095456	  0.373426	 -0.601466
 -0.078111	  0.374998	 -0.596906
 -0.056361	  0.374716	 -0.591671
 -0.036664	  0.375997	 -0.583910
 -0.014828	  0.379784	 -0.578138
 -0.000182	  0.376619	 -0.569272
  0.016721	  0.369249	 -0.563940
  0.038153	  0.367137	 -0.561774
  0.059397	  0.368262	 -0.561741
  0.079488	  0.364704	 -0.559067
  0.097982	  0.358350	 -0.553443
  0.118227	  0.353993	 -0.551064
  0.136687	  0.355992	 -0.543707
  0.156331	  0.357158	 -0.538142
  0.175692	  0.356974	 -0.536041
  0.195712	  0.356681	 -0.534410
  0.215219	  0.354634	 -0.529549
  0.235128	  0.349311	 -0.525009
  0.253809	  0.341865	 -0.522380
  0.272244	  0.336656	 -0.521017
  0.292514	  0.334104	 -0.518665
  0.312144	  0.330048	 -0.515244
  0.331976	  0.329570	 -0.510972
  0.349548	  0.327497	 -0.502823
  0.368856	  0.326319	 -0.496098
  0.389603	  0.322392	 -0.495364
  0.407675	  0.314012	 -0.490426
  0.425532	  0.304273	 -0.482237
  0.442814	  0.305186	 -0.474158
  0.460720	  0.307036	 -0.464600
  0.479534	  0.307783	 -0.453536
  0.498529	  0.305075	 -0.446838
  0.515649	  0.298071	 -0.441854
  0.535785	  0.292328	 -0.437397
  0.556246	  0.290516	 -0.434277
  0.573894	  0.287526	 -0.426179
  0.590880	  0.287199	 -0.413826
  0.609309	  0.288079	 -0.406326
  0.627561	  0.286625	 -0.399689
  0.645692	  0.283085	 -0.391053
  0.666251	  0.281198	 -0.385220
  0.683741	  0.281758	 -0.379226
  0.703482	  0.283305	 -0.374492
  0.725463	  0.283909	 -0.373208
  0.744757	  0.277961	 -0.366870
  0.762219	  0.273834	 -0.356442
  0.776036	  0.268563	 -0.344698
  0.794786	  0.264334	 -0.336544
  0.813418	  0.261261	 -0.329532
  0.831926	  0.258576	 -0.322024
  0.850423	  0.255708	 -0.315156
  0.869208	  0.255111	 -0.307900
  0.888117	  0.253446	 -0.299781
  0.905481	  0.248148	 -0.290024
  0.921786	  0.240748	 -0.279153
  0.939032	  0.239232	 -0.272399
  0.958838	  0.238281	 -0.266787
  0.978153	  0.238101	 -0.261484
  0.997897	  0.235418	 -0.257328
  1.017024	  0.229769	 -0.252350
  1.033932	  0.225817	 -0.243094
  1.052371	  0.223633	 -0.234139
  1.070028	  0.223355	 -0.224615
  1.088307	  0.221843	 -0.216276
  1.106692	  0.218734	 -0.208881
  1.125297	  0.214985	 -0.202568
  1.144020	  0.212519	 -0.197149
  1.162203	  0.209924	 -0.189211
  1.179572	  0.206564	 -0.179511
  1.196566	  0.203100	 -0.169549
  1.212893	  0.199403	 -0.158607
  1.229219	  0.195706	 -0.147662
  1.245051	  0.191914	 -0.136044
  1.260606	  0.188075	 -0.124073
  1.275469	  0.183477	 -0.111506
  1.289388	  0.177943	 -0.098254
  1.301240	  0.170173	 -0.084142
  1.312078	  0.161469	 -0.069761
  1.320637	  0.150321	 -0.055535
  1.328081	  0.138160	 -0.041509
  1.335527	  0.126004	 -0.027481
  1.342737	  0.113394	 -0.013762
  1.348934	  0.098389	 -0.003039
  1.357041	  0.082303	  0.006891
  1.365152	  0.066284	  0.018614
  1.369083	  0.052540	  0.031464
  1.370707	  0.038772	  0.045710
  1.379041	  0.022946	  0.057812
  1.388726	  0.009042	  0.066853
  1.395495	 -0.005440	  0.078257
  1.404710	 -0.020433	  0.091878
  1.416288	 -0.031697	  0.098661
  1.430090	 -0.043926	  0.106802
  1.445724	 -0.056912	  0.117893
  1.458286	 -0.065529	  0.128461
  1.470749	 -0.072270	  0.139412
  1.487518	 -0.076364	  0.151528
  1.501757	 -0.077716	  0.165086
  1.516737	 -0.071664	  0.176575
  1.532941	 -0.064965	  0.186873
  1.547425	 -0.052229	  0.192283
  1.561799	 -0.039135	  0.196960
  1.575964	 -0.025876	  0.201905
  1.589430	 -0.011571	  0.204821
  1.603253	  0.003127	  0.205397
  1.616531	  0.018277	  0.206541
  1.628516	  0.033467	  0.209492
  1.643249	  0.047121	  0.209998
  1.658392	  0.060711	  0.209424
  1.671861	  0.074923	  0.211163
  1.687701	  0.086546	  0.212428
  1.705409	  0.096284	  0.212618
  1.722038	  0.107114	  0.214359
  1.740015	  0.115211	  0.217558
  1.758979	  0.119882	  0.221880
  1.778253	  0.124324	  0.225216
  1.797740	  0.127604	  0.228294
  1.817387	  0.129943	  0.231215
  1.836975	  0.132254	  0.234102
  1.856330	  0.134240	  0.235396
  1.874637	  0.134796	  0.236341
  1.898455	  0.139052	  0.236426
  1.915299	  0.144355	  0.233572
  1.935687	  0.150456	  0.227797
  1.950261	  0.159677	  0.224581
  1.969737	  0.166189	  0.227933
  1.990364	  0.169356	  0.228315
  2.011340	  0.172697	  0.221987
  2.028027	  0.180185	  0.218710
  2.049544	  0.182808	  0.221704
  2.070372	  0.188821	  0.211216
  2.089272	  0.185712	  0.212292
  2.107549	  0.179844	  0.219645
  2.130284	  0.176680	  0.217374
  2.146616	  0.172981	  0.220750
  2.164385	  0.168905	  0.229842
  2.186927	  0.162876	  0.233862
  2.205714	  0.153999	  0.232282
  2.221775	  0.148225	  0.236675
  2.239609	  0.145167	  0.246112
  2.258985	  0.143431	  0.252476
  2.280230	  0.136290	  0.255870
  2.296934	  0.131109	  0.263221
  2.314975	  0.124037	  0.272841
  2.332647	  0.120375	  0.277823
  2.351272	  0.119558	  0.282268
  2.371014	  0.118881	  0.289151
  2.389842	  0.117821	  0.296869
  2.408146	  0.116113	  0.304941
  2.426015	  0.115475	  0.313900
  2.443883	  0.114840	  0.322862
  2.461775	  0.114204	  0.331837
  2.474364	  0.114041	  0.338408
  2.480081	  0.113967	  0.341392
