  1.878685	 -1.382344	 -0.466501
  1.911933	 -1.373687	 -0.494380
  1.896295	 -1.379320	 -0.484016
  1.882070	 -1.382308	 -0.469961
  1.866250	 -1.382762	 -0.453998
  1.852500	 -1.383861	 -0.440849
  1.837929	 -1.388866	 -0.431055
  1.821172	 -1.394522	 -0.420101
  1.804503	 -1.393846	 -0.402955
  1.791485	 -1.391938	 -0.386029
  1.784619	 -1.394910	 -0.371927
  1.775741	 -1.404378	 -0.352474
  1.766938	 -1.407936	 -0.330075
  1.754166	 -1.407390	 -0.311239
  1.746476	 -1.406538	 -0.300445
  1.732604	 -1.410160	 -0.283795
  1.715534	 -1.410144	 -0.268348
  1.699052	 -1.408716	 -0.260618
  1.681651	 -1.408236	 -0.247694
  1.671101	 -1.408823	 -0.228800
  1.664153	 -1.410712	 -0.211465
  1.654726	 -1.412707	 -0.194729
  1.637110	 -1.417809	 -0.177694
  1.618904	 -1.424431	 -0.165279
  1.601985	 -1.432810	 -0.154583
  1.591967	 -1.439317	 -0.146746
  1.579980	 -1.445261	 -0.130142
  1.567987	 -1.447772	 -0.112386
  1.553906	 -1.453150	 -0.097678
  1.541715	 -1.460895	 -0.085259
  1.532343	 -1.470025	 -0.072590
  1.516775	 -1.479642	 -0.054791
  1.500713	 -1.485885	 -0.040123
  1.492965	 -1.492279	 -0.030862
  1.484894	 -1.505910	 -0.016533
  1.475486	 -1.519048	  0.001672
  1.468684	 -1.529421	  0.012973
  1.464642	 -1.540871	  0.027659
  1.458555	 -1.551726	  0.049067
  1.446754	 -1.562660	  0.062311
  1.438091	 -1.574795	  0.070687
  1.431778	 -1.588685	  0.086773
  1.430913	 -1.597599	  0.104624
  1.430295	 -1.607641	  0.123029
  1.428451	 -1.617979	  0.140255
  1.426514	 -1.628270	  0.157286
  1.424553	 -1.638640	  0.174278
  1.423999	 -1.648416	  0.191721
  1.425090	 -1.657410	  0.209551
  1.426184	 -1.666405	  0.227381
  1.427283	 -1.675400	  0.245211
  1.428980	 -1.684373	  0.263003
  1.431443	 -1.693305	  0.280727
  1.433865	 -1.702257	  0.298440
  1.430835	 -1.712391	  0.315403
  1.425349	 -1.722632	  0.331677
  1.415669	 -1.732247	  0.346290
  1.405945	 -1.741840	  0.360899
  1.396772	 -1.750207	  0.376577
  1.387637	 -1.758493	  0.392317
  1.378884	 -1.765887	  0.408188
  1.370807	 -1.769813	  0.424352
  1.363189	 -1.772404	  0.444547
  1.357104	 -1.777218	  0.466814
  1.345596	 -1.781874	  0.479875
  1.332050	 -1.783875	  0.492950
  1.318670	 -1.782301	  0.508571
  1.303323	 -1.782039	  0.523232
  1.283862	 -1.782575	  0.530278
  1.264215	 -1.780089	  0.531567
  1.244570	 -1.774557	  0.527980
  1.224961	 -1.770559	  0.526266
  1.205315	 -1.765119	  0.526912
  1.187439	 -1.758345	  0.531381
  1.170098	 -1.749325	  0.534760
  1.151946	 -1.739642	  0.536237
  1.134286	 -1.729769	  0.536264
  1.116589	 -1.720426	  0.535553
  1.098920	 -1.711084	  0.534855
  1.081460	 -1.701346	  0.534931
  1.064216	 -1.691305	  0.536668
  1.046636	 -1.681949	  0.538183
  1.029143	 -1.672362	  0.539772
  1.011703	 -1.662701	  0.541529
  0.994711	 -1.653635	  0.546993
  0.977801	 -1.644727	  0.552855
  0.960887	 -1.635788	  0.558703
  0.943981	 -1.626842	  0.564548
  0.927242	 -1.618542	  0.571685
  0.910858	 -1.611279	  0.580559
  0.894481	 -1.604039	  0.589492
  0.878112	 -1.596861	  0.598454
  0.862330	 -1.590330	  0.607456
  0.845916	 -1.584218	  0.618065
  0.831081	 -1.577586	  0.631028
  0.813955	 -1.573730	  0.642268
  0.795013	 -1.572952	  0.647429
  0.774983	 -1.571512	  0.655303
  0.761653	 -1.566874	  0.667920
  0.746271	 -1.562547	  0.680476
  0.726625	 -1.558121	  0.695347
  0.717748	 -1.555054	  0.705064
  0.702718	 -1.550024	  0.721117
  0.687326	 -1.546295	  0.734328
  0.671969	 -1.546018	  0.741997
  0.651585	 -1.544640	  0.752756
  0.634989	 -1.537250	  0.769541
  0.622710	 -1.533341	  0.781316
  0.608574	 -1.536349	  0.791399
  0.590138	 -1.537340	  0.805000
  0.577439	 -1.534071	  0.818610
  0.566408	 -1.531287	  0.833918
  0.547546	 -1.527728	  0.851742
  0.535564	 -1.528723	  0.859166
  0.522103	 -1.531904	  0.873619
  0.508223	 -1.533452	  0.890826
  0.489596	 -1.535810	  0.903873
  0.470347	 -1.541031	  0.912879
  0.458381	 -1.542367	  0.923130
  0.446387	 -1.542065	  0.940629
  0.435113	 -1.543863	  0.957956
  0.421100	 -1.548152	  0.972395
  0.407161	 -1.553131	  0.986019
  0.393510	 -1.557928	  0.999849
  0.379870	 -1.562750	  1.013640
  0.366089	 -1.567399	  1.026675
  0.350038	 -1.570359	  1.039292
  0.335305	 -1.573755	  1.052082
  0.322553	 -1.578953	  1.065031
  0.304248	 -1.590876	  1.082635
  0.296357	 -1.599843	  1.093926
  0.291186	 -1.611417	  1.108691
  0.281898	 -1.622289	  1.124033
  0.266554	 -1.631334	  1.137955
  0.256098	 -1.640294	  1.150467
  0.246094	 -1.645124	  1.163466
  0.228757	 -1.649571	  1.178533
  0.217142	 -1.657811	  1.192429
  0.208965	 -1.663836	  1.207188
  0.194265	 -1.665095	  1.222979
  0.177728	 -1.671682	  1.235896
  0.167405	 -1.675906	  1.248459
  0.156250	 -1.675962	  1.266964
  0.144299	 -1.677869	  1.285157
  0.135125	 -1.683055	  1.299808
  0.121744	 -1.689705	  1.316871
  0.105757	 -1.689221	  1.328559
  0.086939	 -1.684458	  1.340169
  0.073374	 -1.682917	  1.354184
  0.064178	 -1.685852	  1.372993
  0.051880	 -1.690767	  1.389467
  0.032853	 -1.693502	  1.397086
  0.011062	 -1.691212	  1.403302
 -0.006744	 -1.687482	  1.416923
 -0.016699	 -1.686581	  1.434213
 -0.025970	 -1.688651	  1.450939
 -0.043681	 -1.691950	  1.463117
 -0.062714	 -1.696278	  1.471134
 -0.079654	 -1.701400	  1.479878
 -0.095433	 -1.705300	  1.490511
 -0.112744	 -1.712343	  1.499629
 -0.129778	 -1.720625	  1.508888
 -0.145330	 -1.724476	  1.524073
 -0.156547	 -1.725099	  1.537166
 -0.172880	 -1.729147	  1.552615
 -0.189090	 -1.736129	  1.564728
 -0.200991	 -1.742116	  1.573100
 -0.216583	 -1.747579	  1.588119
 -0.231049	 -1.756302	  1.598553
 -0.243638	 -1.767816	  1.607835
 -0.258801	 -1.777792	  1.621059
 -0.277987	 -1.778684	  1.630659
 -0.292994	 -1.785150	  1.642191
