 -0.120427	 -0.842873	 -2.316306
 -0.115154	 -0.852136	 -2.336189
 -0.121330	 -0.843401	 -2.319561
 -0.128979	 -0.834064	 -2.303367
 -0.135820	 -0.824375	 -2.286512
 -0.141118	 -0.816401	 -2.269874
 -0.148152	 -0.808340	 -2.252762
 -0.154575	 -0.797630	 -2.235843
 -0.158402	 -0.787159	 -2.220602
 -0.164077	 -0.776593	 -2.204379
 -0.170293	 -0.763832	 -2.189254
 -0.174697	 -0.750322	 -2.175747
 -0.179852	 -0.737134	 -2.161437
 -0.186740	 -0.726928	 -2.145515
 -0.193683	 -0.716919	 -2.129648
 -0.200629	 -0.706927	 -2.113778
 -0.208096	 -0.698859	 -2.097071
 -0.215651	 -0.691035	 -2.080288
 -0.223260	 -0.683128	 -2.063566
 -0.230938	 -0.676114	 -2.046475
 -0.238989	 -0.669427	 -2.029883
 -0.251003	 -0.661926	 -2.014980
 -0.263960	 -0.655684	 -2.000704
 -0.267809	 -0.648405	 -1.980887
 -0.264220	 -0.642915	 -1.956133
 -0.266431	 -0.639480	 -1.935883
 -0.277133	 -0.636251	 -1.920767
 -0.288843	 -0.629648	 -1.906546
 -0.298953	 -0.626273	 -1.883808
 -0.309039	 -0.625438	 -1.866250
 -0.319175	 -0.623875	 -1.856135
 -0.334858	 -0.618626	 -1.837981
 -0.342254	 -0.616780	 -1.815954
 -0.344084	 -0.611991	 -1.795892
 -0.345056	 -0.603530	 -1.781384
 -0.349918	 -0.593995	 -1.762653
 -0.358626	 -0.590548	 -1.742796
 -0.368509	 -0.587381	 -1.724844
 -0.372944	 -0.576820	 -1.708511
 -0.372744	 -0.561895	 -1.691807
 -0.369558	 -0.548407	 -1.675618
 -0.367791	 -0.535969	 -1.656429
 -0.371929	 -0.528006	 -1.638535
 -0.380267	 -0.527069	 -1.619198
 -0.388915	 -0.525109	 -1.599011
 -0.392280	 -0.515731	 -1.583746
 -0.392107	 -0.500411	 -1.568747
 -0.396299	 -0.482502	 -1.555728
 -0.398398	 -0.473023	 -1.545866
 -0.396275	 -0.461137	 -1.538257
 -0.394681	 -0.451108	 -1.521921
 -0.391395	 -0.439232	 -1.510900
 -0.390891	 -0.422908	 -1.501068
 -0.391057	 -0.401411	 -1.493186
 -0.387489	 -0.378492	 -1.483620
 -0.383618	 -0.365280	 -1.478074
 -0.374016	 -0.351365	 -1.471323
 -0.357567	 -0.332743	 -1.460799
 -0.346480	 -0.315742	 -1.454290
 -0.341611	 -0.301635	 -1.450682
 -0.341426	 -0.278193	 -1.445937
 -0.342340	 -0.259953	 -1.439984
 -0.344968	 -0.238956	 -1.432074
 -0.339740	 -0.222780	 -1.420693
 -0.327106	 -0.209695	 -1.406612
 -0.317967	 -0.196585	 -1.392513
 -0.317341	 -0.182446	 -1.378799
 -0.318667	 -0.167078	 -1.367647
 -0.318676	 -0.148361	 -1.357799
 -0.320258	 -0.129829	 -1.348887
 -0.324711	 -0.114997	 -1.336306
 -0.333447	 -0.103076	 -1.317504
 -0.341630	 -0.097592	 -1.298493
 -0.342577	 -0.089930	 -1.274840
 -0.339377	 -0.086911	 -1.262617
 -0.332984	 -0.077943	 -1.244033
 -0.333337	 -0.070811	 -1.221766
 -0.338740	 -0.064311	 -1.201339
 -0.345148	 -0.062857	 -1.184732
 -0.352829	 -0.062555	 -1.168677
 -0.362009	 -0.063342	 -1.153691
 -0.378279	 -0.070358	 -1.125637
 -0.389009	 -0.073925	 -1.114321
 -0.396674	 -0.078513	 -1.104719
 -0.400138	 -0.087573	 -1.084314
 -0.409076	 -0.096800	 -1.063937
 -0.416269	 -0.101223	 -1.057083
 -0.425648	 -0.106439	 -1.037802
 -0.439889	 -0.111620	 -1.020283
 -0.453366	 -0.115881	 -1.008123
 -0.459086	 -0.123923	 -0.992187
 -0.464096	 -0.130739	 -0.977085
 -0.465554	 -0.139404	 -0.954041
 -0.473270	 -0.149119	 -0.925666
 -0.479626	 -0.152507	 -0.914444
 -0.488188	 -0.153862	 -0.901289
 -0.508435	 -0.167466	 -0.880834
 -0.516510	 -0.175287	 -0.868699
 -0.524426	 -0.180632	 -0.857897
 -0.533478	 -0.190313	 -0.844032
 -0.551199	 -0.205613	 -0.832141
 -0.571246	 -0.215051	 -0.816980
 -0.577570	 -0.216502	 -0.811230
 -0.585921	 -0.216424	 -0.790722
 -0.591524	 -0.219143	 -0.762881
 -0.592496	 -0.218235	 -0.747677
 -0.596121	 -0.218607	 -0.724520
 -0.603069	 -0.214331	 -0.707551
 -0.609543	 -0.208213	 -0.693487
 -0.622735	 -0.206544	 -0.678180
 -0.638144	 -0.212166	 -0.653407
 -0.646645	 -0.216884	 -0.634397
 -0.649706	 -0.218885	 -0.622045
 -0.652916	 -0.208947	 -0.603754
 -0.653550	 -0.195069	 -0.585181
 -0.656437	 -0.185137	 -0.563249
 -0.665234	 -0.181815	 -0.546291
 -0.673965	 -0.179574	 -0.529877
 -0.681463	 -0.176664	 -0.510905
 -0.690881	 -0.174511	 -0.492375
 -0.700332	 -0.172813	 -0.474243
 -0.706691	 -0.170685	 -0.457516
 -0.713401	 -0.168730	 -0.438085
 -0.721685	 -0.167297	 -0.415477
 -0.726676	 -0.163909	 -0.398542
 -0.731831	 -0.159486	 -0.383906
 -0.740259	 -0.151920	 -0.363448
 -0.746223	 -0.141617	 -0.340910
 -0.745363	 -0.133615	 -0.321787
 -0.742772	 -0.128258	 -0.310609
 -0.748802	 -0.119923	 -0.282069
 -0.749826	 -0.113465	 -0.266094
 -0.748824	 -0.108054	 -0.251777
 -0.749887	 -0.099039	 -0.229442
 -0.755570	 -0.087761	 -0.210699
 -0.760011	 -0.073853	 -0.201539
 -0.764442	 -0.053266	 -0.184931
 -0.768667	 -0.042208	 -0.167253
 -0.769304	 -0.037544	 -0.155136
 -0.772929	 -0.031563	 -0.130327
 -0.776073	 -0.029340	 -0.110992
 -0.775321	 -0.023922	 -0.092089
 -0.773974	 -0.011512	 -0.074561
 -0.780976	  0.002784	 -0.053655
 -0.787253	  0.008527	 -0.042597
 -0.797621	  0.016039	 -0.025536
 -0.806840	  0.018800	 -0.004903
 -0.815536	  0.019830	  0.013867
 -0.823261	  0.024008	  0.032068
 -0.831988	  0.033829	  0.050956
 -0.838428	  0.040167	  0.064321
 -0.844870	  0.049904	  0.082192
 -0.850001	  0.061933	  0.098865
 -0.851843	  0.071821	  0.114863
 -0.849543	  0.083637	  0.132046
 -0.853111	  0.099131	  0.152567
 -0.861119	  0.106634	  0.166092
 -0.867204	  0.109131	  0.183955
 -0.870508	  0.113515	  0.204847
 -0.875363	  0.120168	  0.223934
 -0.885207	  0.126561	  0.241197
 -0.900121	  0.130213	  0.256097
 -0.915610	  0.132547	  0.270774
 -0.926643	  0.133850	  0.287774
 -0.930077	  0.131273	  0.307311
 -0.937033	  0.129967	  0.329591
 -0.946897	  0.134637	  0.346557
 -0.961138	  0.152341	  0.365880
 -0.966094	  0.165747	  0.378414
 -0.964633	  0.176625	  0.391027
 -0.959931	  0.190226	  0.409383
 -0.962417	  0.207335	  0.425776
 -0.973179	  0.218557	  0.442484
 -0.982821	  0.219520	  0.460103
 -0.990509	  0.223644	  0.478857
 -0.997450	  0.231216	  0.495705
 -1.006453	  0.233810	  0.513278
 -1.017028	  0.234875	  0.531853
 -1.025140	  0.239210	  0.550154
 -1.029747	  0.243677	  0.568066
 -1.035604	  0.249036	  0.588949
 -1.043022	  0.258225	  0.605748
 -1.050431	  0.262201	  0.617220
 -1.062205	  0.258269	  0.639566
 -1.070068	  0.255286	  0.663928
 -1.069783	  0.265933	  0.682205
 -1.068113	  0.281928	  0.695366
 -1.071157	  0.291974	  0.713131
 -1.078195	  0.293325	  0.733254
 -1.086523	  0.293859	  0.752958
 -1.090657	  0.301545	  0.773108
 -1.090515	  0.312066	  0.787253
 -1.091919	  0.325469	  0.807449
 -1.097916	  0.332214	  0.824396
 -1.106347	  0.335463	  0.847716
 -1.111376	  0.334739	  0.865079
 -1.117061	  0.333139	  0.882548
 -1.124698	  0.335646	  0.902051
 -1.129736	  0.341449	  0.921680
 -1.131821	  0.351486	  0.939550
 -1.133704	  0.363459	  0.957205
 -1.136062	  0.372424	  0.976761
 -1.140319	  0.377137	  0.992978
 -1.146102	  0.382362	  1.009999
 -1.150993	  0.382761	  1.030939
 -1.155195	  0.384430	  1.056329
 -1.157961	  0.388020	  1.069696
 -1.161664	  0.397629	  1.091925
 -1.164288	  0.406593	  1.106284
 -1.168166	  0.418629	  1.121066
 -1.175819	  0.431484	  1.147654
 -1.177959	  0.433294	  1.155900
 -1.183980	  0.437441	  1.174420
 -1.192487	  0.448685	  1.198237
 -1.196843	  0.456449	  1.217237
 -1.201279	  0.460539	  1.228510
 -1.204802	  0.473003	  1.251014
 -1.207176	  0.485587	  1.270917
 -1.208737	  0.490896	  1.279387
 -1.209347	  0.505247	  1.297321
 -1.211314	  0.518016	  1.319025
 -1.211834	  0.526025	  1.330846
 -1.213033	  0.537810	  1.349511
 -1.215672	  0.550886	  1.372813
 -1.215395	  0.556317	  1.382312
 -1.213115	  0.569185	  1.401428
 -1.218588	  0.583932	  1.417921
 -1.227044	  0.594677	  1.433784
 -1.237205	  0.601536	  1.450079
 -1.244142	  0.608449	  1.467721
 -1.249221	  0.615964	  1.485712
 -1.253801	  0.623333	  1.503759
 -1.258366	  0.630541	  1.521882
 -1.263897	  0.636197	  1.540222
 -1.269192	  0.639202	  1.558543
 -1.273733	  0.640980	  1.575936
 -1.280421	  0.652409	  1.593968
 -1.289492	  0.664585	  1.617902
 -1.293434	  0.664490	  1.632862
 -1.296780	  0.660940	  1.649883
 -1.302597	  0.659745	  1.674031
 -1.307792	  0.665251	  1.690360
 -1.313822	  0.671929	  1.707830
 -1.320393	  0.675841	  1.728639
 -1.325880	  0.682650	  1.745515
 -1.332046	  0.690652	  1.763325
 -1.338110	  0.695270	  1.782299
 -1.343444	  0.703017	  1.799265
 -1.349344	  0.711477	  1.817091
 -1.354395	  0.716736	  1.835377
 -1.360190	  0.727789	  1.852170
 -1.366367	  0.743073	  1.868307
 -1.369770	  0.748020	  1.883068
 -1.374263	  0.750541	  1.906035
 -1.381608	  0.761077	  1.936311
 -1.386455	  0.769064	  1.953994
