 -0.025106	  0.925033	 -2.885236
 -0.024858	  0.915874	 -2.856669
  0.005549	  0.908289	 -2.805843
  0.033498	  0.899626	 -2.770512
  0.060174	  0.886506	 -2.725395
  0.084516	  0.878015	 -2.689978
  0.110911	  0.874600	 -2.652404
  0.138640	  0.862824	 -2.602197
  0.161185	  0.847161	 -2.563014
  0.185352	  0.843680	 -2.524220
  0.212676	  0.827550	 -2.482728
  0.241779	  0.815989	 -2.442757
  0.267426	  0.808150	 -2.402714
  0.294123	  0.795497	 -2.363214
  0.322020	  0.787268	 -2.316249
  0.343666	  0.776523	 -2.284624
  0.369820	  0.771098	 -2.236319
  0.399749	  0.757297	 -2.200422
  0.423819	  0.743703	 -2.160532
  0.453407	  0.735138	 -2.112474
  0.473596	  0.729492	 -2.076299
  0.503363	  0.712266	 -2.033105
  0.526929	  0.708823	 -1.990290
  0.559510	  0.699979	 -1.948657
  0.585561	  0.688677	 -1.915230
  0.612992	  0.677150	 -1.874019
  0.637099	  0.665706	 -1.832935
  0.665196	  0.657348	 -1.790807
  0.690344	  0.646630	 -1.750918
  0.714544	  0.640729	 -1.711279
  0.745745	  0.623685	 -1.669062
  0.775521	  0.621358	 -1.624144
  0.792927	  0.605603	 -1.585921
  0.833750	  0.598601	 -1.551992
  0.842979	  0.587161	 -1.502381
  0.879424	  0.576511	 -1.472727
  0.900557	  0.564327	 -1.425151
  0.930829	  0.552302	 -1.381888
  0.955985	  0.542265	 -1.337156
  0.979511	  0.533648	 -1.298501
  1.005024	  0.524280	 -1.255057
  1.030531	  0.517180	 -1.216832
  1.050198	  0.500954	 -1.177257
  1.082101	  0.490180	 -1.139588
  1.107353	  0.487628	 -1.090902
  1.133244	  0.469813	 -1.058773
  1.163982	  0.463162	 -1.012263
  1.184249	  0.448940	 -0.973481
  1.208494	  0.444548	 -0.927250
  1.237318	  0.432650	 -0.894633
  1.261600	  0.422704	 -0.851319
  1.291033	  0.414078	 -0.810294
  1.312339	  0.402793	 -0.763985
  1.339243	  0.389999	 -0.723104
  1.367955	  0.383084	 -0.682203
  1.393200	  0.368030	 -0.646176
  1.418976	  0.357963	 -0.602734
  1.450656	  0.350492	 -0.565287
  1.472062	  0.343166	 -0.520348
  1.502656	  0.339823	 -0.483152
  1.529760	  0.325879	 -0.435438
  1.551624	  0.314518	 -0.397658
  1.579353	  0.305192	 -0.353421
  1.606519	  0.288647	 -0.313645
  1.629159	  0.277023	 -0.280499
  1.657417	  0.263622	 -0.241010
  1.684080	  0.253338	 -0.200114
  1.706194	  0.242174	 -0.161606
  1.736077	  0.231905	 -0.115966
  1.763259	  0.222328	 -0.076429
  1.788712	  0.211883	 -0.035428
  1.811613	  0.202657	  0.002909
  1.843857	  0.194427	  0.048745
  1.867419	  0.185380	  0.084939
  1.891917	  0.176681	  0.129918
  1.923218	  0.165042	  0.170286
  1.942276	  0.155405	  0.211875
  1.974896	  0.143198	  0.253908
  2.001356	  0.132123	  0.290080
  2.023981	  0.130518	  0.333786
  2.055643	  0.118519	  0.373940
  2.077884	  0.109197	  0.418972
  2.103514	  0.093180	  0.454637
  2.131200	  0.088255	  0.500585
  2.158753	  0.075205	  0.541626
  2.185414	  0.064993	  0.583840
  2.211649	  0.050324	  0.619061
  2.230133	  0.042290	  0.657237
  2.255988	  0.038401	  0.698382
  2.282996	  0.021140	  0.743004
  2.310240	  0.012014	  0.782599
  2.342554	  0.009023	  0.823771
  2.362555	 -0.004332	  0.865554
  2.391251	 -0.014113	  0.907533
  2.420258	 -0.021884	  0.945012
  2.443798	 -0.032787	  0.989618
  2.466941	 -0.046517	  1.032182
  2.501637	 -0.052911	  1.074121
  2.519877	 -0.064497	  1.106312
  2.552175	 -0.072836	  1.149650
  2.574518	 -0.091758	  1.194336
  2.603527	 -0.099167	  1.233524
  2.632568	 -0.105344	  1.269810
  2.655360	 -0.115096	  1.319517
  2.675340	 -0.133218	  1.350855
  2.702093	 -0.134551	  1.364364
