  0.868932	 -0.578796	  2.317639
  0.885202	 -0.588063	  2.327630
  0.869855	 -0.579344	  2.318226
  0.853694	 -0.571397	  2.309530
  0.837257	 -0.563736	  2.301095
  0.820488	 -0.556553	  2.292899
  0.803449	 -0.549782	  2.284910
  0.786342	 -0.543220	  2.276894
  0.768981	 -0.537533	  2.268755
  0.751611	 -0.531888	  2.260608
  0.734043	 -0.527750	  2.251994
  0.716417	 -0.524327	  2.243184
  0.698801	 -0.521241	  2.234254
  0.681519	 -0.521949	  2.224226
  0.664250	 -0.522734	  2.214169
  0.647018	 -0.523604	  2.204071
  0.631564	 -0.528040	  2.192200
  0.616167	 -0.532589	  2.180274
  0.600778	 -0.537148	  2.168341
  0.585868	 -0.542265	  2.156040
  0.572850	 -0.549299	  2.142590
  0.559866	 -0.556368	  2.129121
  0.546865	 -0.563431	  2.115667
  0.533876	 -0.570469	  2.102366
  0.520342	 -0.578545	  2.090937
  0.504932	 -0.588794	  2.080711
  0.491895	 -0.597971	  2.066761
  0.483399	 -0.603324	  2.048726
  0.475630	 -0.608624	  2.029437
  0.464732	 -0.616361	  2.015397
  0.450992	 -0.624458	  2.003945
  0.439635	 -0.630744	  1.987258
  0.429727	 -0.641877	  1.970456
  0.417165	 -0.652330	  1.964295
  0.400272	 -0.663116	  1.955675
  0.385611	 -0.678033	  1.943331
  0.376582	 -0.687346	  1.929311
  0.364613	 -0.692437	  1.917986
  0.348704	 -0.702452	  1.905497
  0.339270	 -0.710322	  1.888358
  0.327904	 -0.716636	  1.873278
  0.315569	 -0.720337	  1.857738
  0.303233	 -0.727134	  1.841839
  0.294088	 -0.731544	  1.824040
  0.285069	 -0.732290	  1.805754
  0.275118	 -0.731812	  1.788699
  0.263339	 -0.731439	  1.771945
  0.251898	 -0.729570	  1.755652
  0.240463	 -0.727282	  1.739410
  0.228684	 -0.721417	  1.724368
  0.216886	 -0.713131	  1.710503
  0.205027	 -0.704787	  1.696749
  0.192825	 -0.694355	  1.684947
  0.180537	 -0.682588	  1.674471
  0.168317	 -0.670653	  1.664090
  0.155876	 -0.657333	  1.655880
  0.143466	 -0.643334	  1.649353
  0.131227	 -0.628030	  1.644728
  0.118630	 -0.613560	  1.641099
  0.106618	 -0.599624	  1.639897
  0.097178	 -0.579683	  1.638837
  0.088311	 -0.558632	  1.637476
  0.074027	 -0.545688	  1.635842
  0.057176	 -0.536869	  1.632865
  0.043700	 -0.520368	  1.632146
  0.032712	 -0.500645	  1.626165
  0.019996	 -0.491450	  1.619573
  0.002516	 -0.478266	  1.616704
 -0.014359	 -0.469442	  1.615465
 -0.033021	 -0.459668	  1.616355
 -0.052102	 -0.448072	  1.616292
 -0.064243	 -0.432408	  1.613112
 -0.073320	 -0.414315	  1.607900
 -0.088446	 -0.397349	  1.603151
 -0.103763	 -0.388822	  1.603354
 -0.122603	 -0.379751	  1.604526
 -0.140313	 -0.367638	  1.601777
 -0.152572	 -0.354611	  1.598433
 -0.166517	 -0.340522	  1.595285
 -0.182129	 -0.328283	  1.592062
 -0.196316	 -0.314528	  1.589126
 -0.215096	 -0.294411	  1.586498
 -0.226859	 -0.282690	  1.586453
 -0.238312	 -0.272156	  1.586057
 -0.250266	 -0.255470	  1.578606
 -0.258350	 -0.238095	  1.565900
 -0.271881	 -0.226082	  1.554495
 -0.291040	 -0.217190	  1.546956
 -0.306296	 -0.207747	  1.545486
 -0.321136	 -0.194425	  1.544969
 -0.337726	 -0.181706	  1.540430
 -0.353438	 -0.174492	  1.528387
 -0.368988	 -0.164548	  1.510917
 -0.382625	 -0.151960	  1.503430
 -0.396487	 -0.140772	  1.503759
 -0.416131	 -0.130313	  1.507147
 -0.433711	 -0.122324	  1.499301
 -0.444772	 -0.111045	  1.478701
 -0.452005	 -0.097075	  1.462997
 -0.463813	 -0.081985	  1.455199
 -0.477478	 -0.070559	  1.450954
 -0.495527	 -0.056880	  1.441935
 -0.507761	 -0.048686	  1.437452
 -0.530303	 -0.036486	  1.432966
 -0.549607	 -0.028921	  1.428736
 -0.565055	 -0.025414	  1.421813
 -0.582289	 -0.021658	  1.410347
 -0.600044	 -0.011388	  1.401173
 -0.610231	  0.001982	  1.392108
 -0.620375	  0.016325	  1.380552
 -0.634038	  0.026474	  1.371694
 -0.649883	  0.033027	  1.361034
 -0.665826	  0.040434	  1.348266
 -0.684939	  0.054039	  1.337176
 -0.692440	  0.060710	  1.332929
 -0.707932	  0.073425	  1.321615
 -0.722492	  0.082189	  1.311070
 -0.737424	  0.086900	  1.298691
 -0.753946	  0.092503	  1.284998
 -0.768926	  0.102418	  1.277073
 -0.782656	  0.116640	  1.270878
 -0.795540	  0.130844	  1.259184
 -0.810493	  0.135912	  1.246570
 -0.829060	  0.139664	  1.234835
 -0.844911	  0.145903	  1.222583
 -0.855616	  0.150156	  1.211781
 -0.873788	  0.153042	  1.198398
 -0.890020	  0.150318	  1.184232
 -0.904089	  0.148945	  1.169426
 -0.918789	  0.148837	  1.155784
 -0.935984	  0.146818	  1.146084
 -0.957555	  0.144672	  1.138404
 -0.978803	  0.148553	  1.131694
 -0.994012	  0.153868	  1.123042
 -1.008276	  0.154335	  1.111110
 -1.025075	  0.155941	  1.098298
 -1.042240	  0.158158	  1.087968
 -1.059419	  0.157600	  1.079304
 -1.079339	  0.156873	  1.070535
 -1.098519	  0.162181	  1.061865
 -1.110535	  0.165524	  1.049778
 -1.124454	  0.169084	  1.033659
 -1.139739	  0.176975	  1.020498
 -1.155892	  0.179606	  1.010926
 -1.173530	  0.178716	  1.002269
 -1.195612	  0.187409	  0.990452
 -1.205728	  0.201661	  0.979381
 -1.211812	  0.216172	  0.966094
 -1.223601	  0.225804	  0.952838
 -1.241800	  0.227322	  0.943663
 -1.264737	  0.230876	  0.935844
 -1.278968	  0.241735	  0.927838
 -1.288938	  0.256909	  0.917982
 -1.303556	  0.270914	  0.908301
 -1.316708	  0.277842	  0.900992
 -1.332592	  0.287975	  0.893119
 -1.348094	  0.301082	  0.886462
 -1.363213	  0.313135	  0.881212
 -1.377451	  0.328972	  0.875404
 -1.387874	  0.346700	  0.867190
 -1.393440	  0.364948	  0.857771
 -1.397262	  0.385573	  0.855137
 -1.405397	  0.403033	  0.856311
 -1.416663	  0.420433	  0.856610
 -1.428193	  0.437131	  0.856995
 -1.439314	  0.454278	  0.855586
 -1.448584	  0.472386	  0.852392
 -1.456169	  0.490799	  0.848925
 -1.461623	  0.510287	  0.846450
 -1.465353	  0.530353	  0.846755
 -1.470147	  0.549698	  0.847897
 -1.476354	  0.568386	  0.850417
 -1.484098	  0.586359	  0.855262
 -1.491769	  0.603309	  0.859140
 -1.499127	  0.621630	  0.862197
 -1.510747	  0.646066	  0.864498
 -1.518824	  0.664022	  0.864074
 -1.526271	  0.676555	  0.865825
 -1.534478	  0.694853	  0.865891
 -1.547030	  0.710100	  0.864888
 -1.560345	  0.726093	  0.860570
 -1.575927	  0.739249	  0.853636
 -1.591894	  0.754003	  0.847254
 -1.606587	  0.766759	  0.843104
 -1.618874	  0.781994	  0.842378
 -1.626512	  0.794994	  0.844406
 -1.641428	  0.810874	  0.854371
 -1.661042	  0.825145	  0.864194
 -1.677861	  0.832283	  0.868002
 -1.693138	  0.835623	  0.870076
 -1.713963	  0.840968	  0.875128
 -1.733466	  0.845686	  0.879932
 -1.752855	  0.848458	  0.884693
 -1.771823	  0.850080	  0.887412
 -1.790836	  0.852749	  0.884057
 -1.810546	  0.854997	  0.879809
 -1.830368	  0.857636	  0.876941
 -1.850656	  0.857811	  0.875089
 -1.869216	  0.852645	  0.869715
 -1.887599	  0.847671	  0.863466
 -1.906502	  0.841767	  0.857895
 -1.923252	  0.836153	  0.850034
 -1.938908	  0.826201	  0.842053
 -1.953695	  0.816520	  0.834564
 -1.969150	  0.803413	  0.827635
 -1.980105	  0.790451	  0.817451
 -1.985928	  0.778099	  0.802817
 -1.997139	  0.767982	  0.790474
 -2.010064	  0.755364	  0.774407
 -2.012171	  0.745045	  0.761048
 -2.012469	  0.735128	  0.743674
 -2.016638	  0.726870	  0.720712
 -2.022954	  0.722644	  0.703652
 -2.027111	  0.717863	  0.688403
 -2.029387	  0.706753	  0.669372
 -2.036551	  0.698494	  0.653378
 -2.044056	  0.692556	  0.634153
 -2.046587	  0.685796	  0.615255
 -2.044584	  0.681710	  0.597258
 -2.043883	  0.676724	  0.574455
 -2.046365	  0.666547	  0.555289
 -2.050846	  0.662076	  0.540431
 -2.057650	  0.662496	  0.520646
 -2.063170	  0.665346	  0.498068
 -2.063681	  0.667093	  0.476250
 -2.061740	  0.663321	  0.459512
 -2.064305	  0.661248	  0.440060
 -2.067638	  0.664049	  0.418500
 -2.065514	  0.663277	  0.399145
 -2.065111	  0.661432	  0.381471
 -2.067718	  0.658848	  0.363613
 -2.076423	  0.655658	  0.338814
 -2.082917	  0.654845	  0.322647
 -2.085979	  0.650489	  0.304650
 -2.095054	  0.646715	  0.289313
 -2.108988	  0.653267	  0.267936
 -2.114024	  0.661722	  0.253532
 -2.117976	  0.666638	  0.240865
 -2.130379	  0.666770	  0.221597
 -2.144873	  0.669326	  0.201045
 -2.153297	  0.672819	  0.188767
 -2.169696	  0.674951	  0.174802
 -2.190629	  0.676858	  0.167264
 -2.204989	  0.683569	  0.158302
 -2.220504	  0.690609	  0.146177
 -2.236079	  0.694822	  0.133480
 -2.252507	  0.697439	  0.121703
 -2.270313	  0.701548	  0.113666
 -2.288616	  0.708813	  0.107685
 -2.308169	  0.716456	  0.102606
 -2.325929	  0.719352	  0.095162
 -2.344481	  0.720072	  0.084621
 -2.358345	  0.720596	  0.071415
 -2.373248	  0.723890	  0.056902
 -2.390781	  0.726529	  0.047648
