  0.221715	  1.982669	 -1.280178
  0.248761	  2.000167	 -1.315155
  0.251980	  1.991952	 -1.294763
  0.233738	  1.980732	 -1.268338
  0.218156	  1.976073	 -1.258304
  0.211696	  1.975611	 -1.253485
  0.196697	  1.970849	 -1.237319
  0.177535	  1.960973	 -1.220259
  0.161199	  1.946076	 -1.209934
  0.152843	  1.936235	 -1.206079
  0.142368	  1.919566	 -1.193695
  0.138668	  1.907978	 -1.179274
  0.130771	  1.898368	 -1.160905
  0.122163	  1.889185	 -1.145021
  0.113977	  1.880894	 -1.128729
  0.106075	  1.873222	 -1.112010
  0.098237	  1.865471	 -1.095322
  0.090612	  1.857763	 -1.078495
  0.083236	  1.850398	 -1.061365
  0.076060	  1.843337	 -1.044060
  0.068766	  1.836896	 -1.026864
  0.063341	  1.828436	 -1.009903
  0.059924	  1.819030	 -0.991072
  0.055752	  1.811277	 -0.972140
  0.047126	  1.803726	 -0.953392
  0.035470	  1.797273	 -0.939061
  0.020643	  1.794053	 -0.920001
  0.005056	  1.800086	 -0.902953
 -0.011161	  1.806549	 -0.888935
 -0.027348	  1.807218	 -0.880574
 -0.046152	  1.800065	 -0.874202
 -0.063130	  1.792976	 -0.868753
 -0.083779	  1.790483	 -0.861378
 -0.102491	  1.791778	 -0.855003
 -0.119948	  1.791456	 -0.852956
 -0.140109	  1.789585	 -0.846117
 -0.155210	  1.788066	 -0.841421
 -0.172585	  1.785745	 -0.835018
 -0.198648	  1.781715	 -0.827061
 -0.215932	  1.776672	 -0.823456
 -0.231104	  1.769791	 -0.821504
 -0.251592	  1.762261	 -0.825038
 -0.277862	  1.759123	 -0.832512
 -0.292826	  1.759762	 -0.835756
 -0.313616	  1.766578	 -0.830917
 -0.334099	  1.768942	 -0.821597
 -0.354980	  1.766994	 -0.816821
 -0.372305	  1.761706	 -0.813810
 -0.389807	  1.752921	 -0.807858
 -0.409216	  1.748259	 -0.798730
 -0.429619	  1.748799	 -0.792802
 -0.444036	  1.747160	 -0.789881
 -0.458809	  1.742463	 -0.780386
 -0.475023	  1.743592	 -0.761035
 -0.487868	  1.748453	 -0.749281
 -0.500474	  1.753938	 -0.735911
 -0.514682	  1.757665	 -0.724654
 -0.530538	  1.764067	 -0.713639
 -0.538703	  1.769077	 -0.704275
 -0.549586	  1.776696	 -0.696838
 -0.564988	  1.793589	 -0.672464
 -0.574440	  1.802114	 -0.663516
 -0.580814	  1.810552	 -0.655665
 -0.588426	  1.824070	 -0.648283
 -0.589875	  1.842561	 -0.635908
 -0.593229	  1.862084	 -0.624335
 -0.600671	  1.876267	 -0.611605
 -0.607483	  1.885014	 -0.597130
 -0.608289	  1.894004	 -0.578684
 -0.605766	  1.903693	 -0.561154
 -0.603010	  1.914790	 -0.544506
 -0.600241	  1.926221	 -0.528385
 -0.591197	  1.932820	 -0.513268
 -0.580003	  1.942675	 -0.500664
 -0.562230	  1.950777	 -0.485013
 -0.547728	  1.950863	 -0.467198
 -0.544156	  1.951988	 -0.448138
 -0.544249	  1.958671	 -0.429981
 -0.536003	  1.967664	 -0.410469
 -0.516307	  1.972984	 -0.398443
 -0.497912	  1.973761	 -0.386361
 -0.478958	  1.969690	 -0.366865
 -0.470844	  1.955472	 -0.344499
 -0.471461	  1.944067	 -0.328678
 -0.479501	  1.935115	 -0.311494
 -0.490385	  1.937587	 -0.281428
 -0.504333	  1.936147	 -0.265907
 -0.513191	  1.930507	 -0.250294
 -0.510454	  1.936594	 -0.228170
 -0.521512	  1.938577	 -0.207749
 -0.535768	  1.939250	 -0.185366
 -0.537326	  1.939031	 -0.169082
 -0.549971	  1.924036	 -0.156703
 -0.561459	  1.913261	 -0.148824
 -0.574031	  1.906350	 -0.140359
 -0.591849	  1.883744	 -0.135136
 -0.602234	  1.876722	 -0.130356
 -0.617506	  1.864684	 -0.128375
 -0.633460	  1.844826	 -0.123654
 -0.637607	  1.829819	 -0.120330
 -0.644855	  1.808008	 -0.120394
 -0.658905	  1.783779	 -0.114317
 -0.673396	  1.768777	 -0.106866
 -0.680420	  1.761428	 -0.103353
 -0.695276	  1.748896	 -0.096938
 -0.710005	  1.728447	 -0.090386
 -0.719859	  1.712252	 -0.084291
 -0.728400	  1.700711	 -0.076768
 -0.741369	  1.686164	 -0.067501
 -0.752058	  1.671940	 -0.054055
 -0.757675	  1.655692	 -0.042248
 -0.759352	  1.637577	 -0.033309
 -0.762956	  1.617447	 -0.027003
 -0.764374	  1.600702	 -0.015950
 -0.769379	  1.583814	 -0.002464
 -0.773439	  1.572904	  0.010552
 -0.781419	  1.559877	  0.025965
 -0.792112	  1.543905	  0.040826
 -0.801529	  1.532983	  0.047884
 -0.812124	  1.516561	  0.054449
 -0.822002	  1.498964	  0.064835
 -0.823859	  1.486043	  0.080329
 -0.821183	  1.478428	  0.097342
 -0.823636	  1.469574	  0.118822
 -0.830869	  1.460152	  0.130818
 -0.843217	  1.447947	  0.137282
 -0.856842	  1.434040	  0.140656
 -0.871706	  1.418938	  0.146129
 -0.885282	  1.407618	  0.157803
 -0.893441	  1.399963	  0.172839
 -0.904740	  1.394089	  0.188548
 -0.913883	  1.381186	  0.206341
 -0.922687	  1.366797	  0.222126
 -0.931644	  1.356489	  0.233391
 -0.937799	  1.344509	  0.245831
 -0.951952	  1.335948	  0.266626
 -0.965428	  1.336138	  0.290524
 -0.970111	  1.332859	  0.301493
 -0.973105	  1.325434	  0.314558
 -0.984495	  1.316339	  0.338163
 -0.996392	  1.315795	  0.361115
 -1.004191	  1.308356	  0.369619
 -1.011841	  1.305735	  0.390601
 -1.023883	  1.298232	  0.400965
 -1.040039	  1.291810	  0.412062
 -1.064247	  1.285973	  0.422239
 -1.075391	  1.281839	  0.428569
 -1.096752	  1.274695	  0.433429
 -1.110779	  1.267126	  0.442117
 -1.125233	  1.260533	  0.452716
 -1.143440	  1.253940	  0.463448
 -1.159760	  1.250710	  0.470497
 -1.180593	  1.250808	  0.479521
 -1.198999	  1.250352	  0.484579
 -1.220174	  1.243886	  0.493615
 -1.234848	  1.237208	  0.501285
 -1.250868	  1.226130	  0.509120
 -1.270600	  1.218900	  0.519335
 -1.293893	  1.215770	  0.525442
 -1.305352	  1.213241	  0.530526
 -1.326529	  1.217795	  0.536301
 -1.345102	  1.219448	  0.543764
 -1.365569	  1.214237	  0.550769
 -1.386135	  1.205224	  0.555069
 -1.404160	  1.201256	  0.556520
 -1.419303	  1.207323	  0.559655
 -1.440971	  1.209380	  0.571032
 -1.463859	  1.206935	  0.578312
 -1.477999	  1.207092	  0.579657
 -1.497303	  1.208513	  0.584547
 -1.514971	  1.208396	  0.596197
 -1.531387	  1.205663	  0.608302
 -1.547360	  1.202364	  0.619956
 -1.563075	  1.198733	  0.631827
 -1.577230	  1.194397	  0.645333
 -1.588893	  1.189199	  0.660781
 -1.600256	  1.183996	  0.676380
 -1.611689	  1.178808	  0.691953
 -1.623002	  1.173594	  0.707607
 -1.632867	  1.167779	  0.724043
 -1.640089	  1.161103	  0.741498
 -1.646893	  1.154795	  0.758822
 -1.653323	  1.152493	  0.777210
 -1.655215	  1.153620	  0.799081
 -1.657337	  1.146751	  0.823990
 -1.660428	  1.137044	  0.837660
 -1.664062	  1.127947	  0.852429
 -1.664511	  1.121455	  0.875164
 -1.666503	  1.109906	  0.893856
 -1.667242	  1.100085	  0.905862
 -1.665261	  1.090253	  0.927171
 -1.665276	  1.074275	  0.942340
 -1.665454	  1.057109	  0.948298
 -1.660974	  1.038847	  0.960554
 -1.654310	  1.028033	  0.982133
 -1.646217	  1.029346	  0.997501
 -1.630388	  1.030444	  1.021487
 -1.622595	  1.021202	  1.041789
 -1.623728	  1.009025	  1.053557
 -1.622414	  0.992765	  1.066674
 -1.623746	  0.974867	  1.084332
 -1.624678	  0.958316	  1.101116
 -1.615812	  0.944586	  1.111673
 -1.602715	  0.932800	  1.120076
 -1.592166	  0.919637	  1.132797
 -1.578273	  0.909431	  1.147251
 -1.564334	  0.901710	  1.158484
 -1.551482	  0.892559	  1.169837
 -1.539902	  0.883960	  1.185540
 -1.524066	  0.876493	  1.196145
 -1.509546	  0.868432	  1.205129
 -1.496029	  0.860746	  1.219271
 -1.480851	  0.854330	  1.230719
 -1.465346	  0.847666	  1.241030
 -1.456464	  0.838907	  1.256440
 -1.462369	  0.828634	  1.272332
 -1.469150	  0.818410	  1.288395
 -1.476700	  0.809423	  1.304800
 -1.484803	  0.801699	  1.321478
 -1.493016	  0.794269	  1.338221
 -1.501252	  0.787778	  1.355458
 -1.509323	  0.781120	  1.372538
 -1.517680	  0.775375	  1.389856
 -1.525413	  0.769686	  1.407496
 -1.533356	  0.764815	  1.425229
 -1.541094	  0.759613	  1.442981
 -1.548833	  0.755490	  1.461125
 -1.556592	  0.751642	  1.479087
 -1.565333	  0.749950	  1.497243
 -1.574459	  0.748551	  1.513433
 -1.586387	  0.744630	  1.529926
 -1.596447	  0.740747	  1.549749
 -1.603880	  0.734538	  1.566579
 -1.610678	  0.725274	  1.580264
 -1.620443	  0.714760	  1.599328
 -1.629621	  0.713434	  1.615144
 -1.641987	  0.714907	  1.631449
 -1.654256	  0.712766	  1.650728
 -1.662389	  0.705362	  1.665551
 -1.670790	  0.695959	  1.678441
 -1.680735	  0.688060	  1.693892
