 -1.646039	  1.477303	 -1.107419
 -1.651687	  1.491701	 -1.106869
 -1.636609	  1.477836	 -1.109173
 -1.623724	  1.459534	 -1.107864
 -1.614683	  1.440713	 -1.105536
 -1.612663	  1.419377	 -1.104887
 -1.612650	  1.398708	 -1.107335
 -1.608790	  1.380031	 -1.110094
 -1.599871	  1.361876	 -1.109794
 -1.590817	  1.343843	 -1.107831
 -1.585912	  1.324048	 -1.106839
 -1.584055	  1.303873	 -1.108716
 -1.582071	  1.283061	 -1.109635
 -1.577488	  1.263291	 -1.106374
 -1.569475	  1.245922	 -1.102201
 -1.558288	  1.229419	 -1.100626
 -1.546378	  1.211404	 -1.099325
 -1.537741	  1.192539	 -1.096299
 -1.534744	  1.174397	 -1.096453
 -1.531946	  1.151322	 -1.101449
 -1.524978	  1.131578	 -1.101426
 -1.515123	  1.112128	 -1.095485
 -1.510200	  1.095662	 -1.086152
 -1.507391	  1.077278	 -1.076386
 -1.501245	  1.060696	 -1.069726
 -1.492635	  1.045153	 -1.060626
 -1.485352	  1.024058	 -1.050565
 -1.478111	  1.008624	 -1.043458
 -1.473197	  0.998097	 -1.038596
 -1.461203	  0.977558	 -1.030263
 -1.453108	  0.955330	 -1.021815
 -1.449908	  0.938338	 -1.017307
 -1.446165	  0.922171	 -1.015154
 -1.436440	  0.900309	 -1.010466
 -1.426564	  0.884868	 -1.008645
 -1.415247	  0.871982	 -1.006891
 -1.403784	  0.846486	 -1.000632
 -1.399268	  0.836375	 -0.997800
 -1.394033	  0.819320	 -0.987689
 -1.388431	  0.795033	 -0.977910
 -1.382051	  0.778522	 -0.975062
 -1.373601	  0.760143	 -0.972445
 -1.362822	  0.744675	 -0.971855
 -1.346058	  0.731874	 -0.966773
 -1.334852	  0.712342	 -0.959796
 -1.331193	  0.696288	 -0.955471
 -1.327856	  0.674868	 -0.952672
 -1.322076	  0.654723	 -0.946781
 -1.312576	  0.640969	 -0.940107
 -1.300008	  0.624656	 -0.934842
 -1.292819	  0.604028	 -0.934567
 -1.287255	  0.584911	 -0.935519
 -1.279393	  0.567385	 -0.935005
 -1.269390	  0.549931	 -0.933458
 -1.259028	  0.530701	 -0.935455
 -1.251571	  0.511931	 -0.940072
 -1.245600	  0.494509	 -0.943411
 -1.241832	  0.477673	 -0.943357
 -1.236133	  0.454802	 -0.942221
 -1.225615	  0.433903	 -0.943432
 -1.215094	  0.416776	 -0.946290
 -1.207643	  0.403008	 -0.948685
 -1.193185	  0.387797	 -0.952464
 -1.177100	  0.373311	 -0.955430
 -1.166347	  0.361193	 -0.958449
 -1.147103	  0.339512	 -0.961092
 -1.138161	  0.329364	 -0.967414
 -1.126508	  0.316609	 -0.981434
 -1.115789	  0.292454	 -0.992658
 -1.109861	  0.271718	 -0.996063
 -1.109031	  0.252646	 -0.996119
 -1.105996	  0.235081	 -0.992033
 -1.092073	  0.214814	 -0.983584
 -1.077719	  0.198897	 -0.974080
 -1.067214	  0.183229	 -0.967511
 -1.059478	  0.170482	 -0.963001
 -1.050716	  0.151006	 -0.959218
 -1.038558	  0.128994	 -0.956211
 -1.029765	  0.116127	 -0.955062
 -1.014557	  0.100458	 -0.949934
 -1.001415	  0.091142	 -0.944018
 -0.983038	  0.081909	 -0.934240
 -0.965647	  0.068426	 -0.925776
 -0.956483	  0.051505	 -0.922131
 -0.949371	  0.035939	 -0.921704
 -0.932526	  0.022367	 -0.919568
 -0.916217	  0.011150	 -0.917606
 -0.901377	 -0.000703	 -0.914065
 -0.880543	 -0.007717	 -0.907517
 -0.856585	 -0.010565	 -0.902486
 -0.839610	 -0.015369	 -0.902254
 -0.822948	 -0.023520	 -0.903654
 -0.804983	 -0.033098	 -0.903797
 -0.786680	 -0.043213	 -0.902707
 -0.770319	 -0.053631	 -0.902914
 -0.753171	 -0.066092	 -0.903861
 -0.736693	 -0.077080	 -0.903320
 -0.721993	 -0.085978	 -0.903285
 -0.705570	 -0.095802	 -0.904143
 -0.689283	 -0.106283	 -0.903287
 -0.672141	 -0.114669	 -0.903515
 -0.654672	 -0.123859	 -0.905443
 -0.636583	 -0.133510	 -0.916195
 -0.622471	 -0.140763	 -0.927841
 -0.603968	 -0.151892	 -0.935540
 -0.593089	 -0.170978	 -0.938702
 -0.586998	 -0.191917	 -0.940104
 -0.578525	 -0.210038	 -0.939797
 -0.568676	 -0.229126	 -0.939219
 -0.562077	 -0.245017	 -0.938645
 -0.556238	 -0.262000	 -0.936384
 -0.547707	 -0.290789	 -0.936465
 -0.545870	 -0.308490	 -0.930443
 -0.542795	 -0.321411	 -0.927244
 -0.538124	 -0.347307	 -0.915625
 -0.536309	 -0.365173	 -0.909641
 -0.541555	 -0.373796	 -0.902172
 -0.553830	 -0.398743	 -0.890498
 -0.557675	 -0.415773	 -0.882475
 -0.564657	 -0.428834	 -0.872250
 -0.563884	 -0.445047	 -0.865210
 -0.568722	 -0.459859	 -0.849665
 -0.576157	 -0.472271	 -0.835202
 -0.583448	 -0.479859	 -0.824714
 -0.596782	 -0.493759	 -0.809217
 -0.604882	 -0.504134	 -0.800028
 -0.618610	 -0.518462	 -0.790734
 -0.640066	 -0.530352	 -0.772454
 -0.650702	 -0.533388	 -0.754080
 -0.656842	 -0.534812	 -0.742501
 -0.667518	 -0.541662	 -0.725638
 -0.678786	 -0.549789	 -0.702105
 -0.681366	 -0.552239	 -0.683608
 -0.680553	 -0.553178	 -0.661087
 -0.674632	 -0.557432	 -0.641042
 -0.669008	 -0.568669	 -0.620321
 -0.665529	 -0.577271	 -0.601153
 -0.668555	 -0.581759	 -0.582737
 -0.673884	 -0.584761	 -0.564559
 -0.677944	 -0.587156	 -0.541769
 -0.680247	 -0.584274	 -0.519093
 -0.681079	 -0.582871	 -0.501672
 -0.681639	 -0.579526	 -0.481804
 -0.681288	 -0.582432	 -0.455862
 -0.679199	 -0.594458	 -0.436715
 -0.674308	 -0.609524	 -0.426683
 -0.667254	 -0.632369	 -0.412431
 -0.664743	 -0.647510	 -0.407389
 -0.659952	 -0.661483	 -0.399566
 -0.652822	 -0.679839	 -0.383595
 -0.644875	 -0.693807	 -0.378646
 -0.636446	 -0.703720	 -0.371186
 -0.624065	 -0.720267	 -0.360636
 -0.616011	 -0.740552	 -0.368040
 -0.612377	 -0.759568	 -0.370267
 -0.606527	 -0.779290	 -0.377994
 -0.614765	 -0.790854	 -0.396532
 -0.618473	 -0.797670	 -0.408936
 -0.615831	 -0.817275	 -0.428572
 -0.609731	 -0.827352	 -0.436169
 -0.604366	 -0.841888	 -0.453256
 -0.594378	 -0.857432	 -0.472634
 -0.588289	 -0.867604	 -0.486623
 -0.582837	 -0.876930	 -0.494966
 -0.584748	 -0.885539	 -0.512912
 -0.586171	 -0.893641	 -0.534450
 -0.587122	 -0.899931	 -0.552168
 -0.587267	 -0.905216	 -0.569394
 -0.586097	 -0.913106	 -0.592028
 -0.588197	 -0.921942	 -0.613003
 -0.592884	 -0.925187	 -0.628728
 -0.594396	 -0.924589	 -0.648542
 -0.593132	 -0.932140	 -0.674189
 -0.579533	 -0.951632	 -0.684457
 -0.559896	 -0.966255	 -0.687902
 -0.539340	 -0.972599	 -0.698284
 -0.529176	 -0.971511	 -0.717043
 -0.526138	 -0.970368	 -0.740927
 -0.518897	 -0.974651	 -0.761716
 -0.501839	 -0.987284	 -0.767895
 -0.485087	 -1.001676	 -0.772935
 -0.471234	 -1.011990	 -0.785683
 -0.459147	 -1.019229	 -0.795970
 -0.448801	 -1.024142	 -0.803451
 -0.428465	 -1.036974	 -0.818030
 -0.405913	 -1.054668	 -0.832721
 -0.396304	 -1.061207	 -0.836832
 -0.390042	 -1.065240	 -0.839144
 -0.368540	 -1.079403	 -0.848675
 -0.353731	 -1.088220	 -0.855662
 -0.341313	 -1.095409	 -0.861455
 -0.315150	 -1.113420	 -0.872298
 -0.301143	 -1.122384	 -0.877824
 -0.296440	 -1.126843	 -0.880346
 -0.273299	 -1.140428	 -0.878133
 -0.254281	 -1.154494	 -0.883032
 -0.243094	 -1.162048	 -0.891023
 -0.224540	 -1.174206	 -0.895449
 -0.207911	 -1.188550	 -0.894898
 -0.195487	 -1.199561	 -0.897381
 -0.180763	 -1.211657	 -0.907292
 -0.168714	 -1.225111	 -0.917234
 -0.156705	 -1.239455	 -0.924960
 -0.147252	 -1.254786	 -0.933506
 -0.140175	 -1.269907	 -0.943136
 -0.133470	 -1.284011	 -0.957795
 -0.126799	 -1.298444	 -0.971687
 -0.121097	 -1.318884	 -0.972373
 -0.111996	 -1.343293	 -0.962725
 -0.103831	 -1.363318	 -0.959521
 -0.100302	 -1.378774	 -0.966895
 -0.101827	 -1.395996	 -0.976079
 -0.097507	 -1.419819	 -0.981060
 -0.091726	 -1.440001	 -0.977667
 -0.090219	 -1.453781	 -0.969346
 -0.090313	 -1.473219	 -0.956587
 -0.085839	 -1.495137	 -0.949859
 -0.080890	 -1.516325	 -0.951208
 -0.080172	 -1.534001	 -0.953531
 -0.081061	 -1.557156	 -0.947951
 -0.082871	 -1.573415	 -0.933721
 -0.086452	 -1.588648	 -0.919774
 -0.093031	 -1.603133	 -0.907475
 -0.098645	 -1.619326	 -0.896056
 -0.103287	 -1.635429	 -0.885054
 -0.107800	 -1.651324	 -0.873909
 -0.115128	 -1.665242	 -0.861693
 -0.123725	 -1.678073	 -0.850271
 -0.135453	 -1.690621	 -0.838964
 -0.148098	 -1.702093	 -0.821501
 -0.153390	 -1.712760	 -0.805728
 -0.154332	 -1.728370	 -0.793505
 -0.156938	 -1.744489	 -0.785382
 -0.164023	 -1.760302	 -0.772033
 -0.170604	 -1.773906	 -0.758627
 -0.175388	 -1.786476	 -0.743787
 -0.180083	 -1.798997	 -0.728917
 -0.184362	 -1.811507	 -0.714333
 -0.179440	 -1.826683	 -0.703939
 -0.167837	 -1.840833	 -0.694675
 -0.158685	 -1.853905	 -0.683999
 -0.148461	 -1.869978	 -0.678103
 -0.136999	 -1.886373	 -0.672575
 -0.132805	 -1.901816	 -0.658357
 -0.130219	 -1.919179	 -0.642590
 -0.124365	 -1.935345	 -0.635733
 -0.114070	 -1.950584	 -0.634614
 -0.100714	 -1.972107	 -0.629934
 -0.095937	 -1.991842	 -0.622407
 -0.099063	 -2.009165	 -0.615453
 -0.098147	 -2.031748	 -0.609780
 -0.089117	 -2.054647	 -0.610403
 -0.082279	 -2.066398	 -0.614434
 -0.076209	 -2.086662	 -0.618173
 -0.070636	 -2.108464	 -0.618008
 -0.061320	 -2.126398	 -0.620723
 -0.049585	 -2.143883	 -0.625216
 -0.041815	 -2.163509	 -0.625194
 -0.043535	 -2.180830	 -0.619570
 -0.040947	 -2.202086	 -0.617201
 -0.033621	 -2.221629	 -0.616572
 -0.025514	 -2.239913	 -0.615662
 -0.016408	 -2.257581	 -0.613467
 -0.007265	 -2.275225	 -0.611210
  0.001979	 -2.292725	 -0.608353
  0.011455	 -2.309763	 -0.603903
  0.020939	 -2.326783	 -0.599388
  0.030443	 -2.343686	 -0.594493
  0.039989	 -2.360250	 -0.588625
  0.049524	 -2.376811	 -0.582724
  0.058783	 -2.393500	 -0.576746
  0.067742	 -2.410326	 -0.570695
  0.076696	 -2.427154	 -0.564640
  0.085681	 -2.444037	 -0.558565
  0.095641	 -2.462894	 -0.551824
  0.110005	 -2.491321	 -0.542044
  0.118438	 -2.508515	 -0.536280
