 -0.152114	  2.581162	  1.579673
 -0.150608	  2.555606	  1.564032
 -0.147635	  2.533628	  1.526996
 -0.144574	  2.503193	  1.490422
 -0.144061	  2.477799	  1.444906
 -0.146334	  2.447748	  1.403469
 -0.147583	  2.419773	  1.363536
 -0.150254	  2.393705	  1.325332
 -0.149720	  2.364551	  1.284810
 -0.149495	  2.333990	  1.244133
 -0.149919	  2.303689	  1.204704
 -0.151018	  2.275119	  1.167631
 -0.152648	  2.244791	  1.128893
 -0.153536	  2.212586	  1.088238
 -0.152947	  2.179880	  1.047867
 -0.152516	  2.147559	  1.010669
 -0.151920	  2.114815	  0.974517
 -0.151445	  2.080678	  0.938018
 -0.151106	  2.046268	  0.901497
 -0.149928	  2.013651	  0.864653
 -0.146314	  1.981564	  0.825218
 -0.137393	  1.953098	  0.782270
 -0.120796	  1.938386	  0.737337
 -0.102536	  1.942913	  0.696308
 -0.092745	  1.960464	  0.664406
 -0.091860	  1.971342	  0.625602
 -0.083020	  1.972527	  0.601559
 -0.088538	  1.963659	  0.560774
 -0.101601	  1.933916	  0.535423
 -0.240258	  1.750757	  0.381518
 -0.244886	  1.552482	  0.307867
 -0.257010	  1.467878	  0.296282
 -0.256663	  1.434562	  0.284092
 -0.265699	  1.365791	  0.276256
 -0.267929	  1.350584	  0.271876
 -0.266760	  1.350216	  0.271204
 -0.265322	  1.350299	  0.269675
 -0.263992	  1.348076	  0.269067
 -0.261122	  1.349745	  0.267346
 -0.181640	  1.365996	  0.243197
 -0.009865	  1.371034	  0.155782
  0.144437	  1.335809	  0.084458
  0.211448	  1.241765	  0.011319
  0.256752	  1.214582	 -0.028880
  0.285008	  1.194165	 -0.067426
  0.301467	  1.170429	 -0.115950
  0.303047	  1.144457	 -0.158352
  0.295414	  1.115396	 -0.192905
  0.280815	  1.082945	 -0.234849
  0.256986	  1.050348	 -0.280091
  0.225823	  1.022509	 -0.332269
  0.156344	  0.969096	 -0.375171
  0.055073	  0.878632	 -0.393200
  0.003262	  0.762952	 -0.381330
 -0.016678	  0.692474	 -0.382110
 -0.031279	  0.640692	 -0.390697
 -0.042844	  0.591789	 -0.408750
 -0.055330	  0.563179	 -0.427957
 -0.062640	  0.538458	 -0.462483
 -0.072818	  0.525544	 -0.501067
 -0.078741	  0.528308	 -0.542987
 -0.084113	  0.542516	 -0.589505
 -0.082894	  0.579422	 -0.656048
 -0.060980	  0.636130	 -0.773776
 -0.031136	  0.655404	 -0.887459
 -0.006788	  0.644485	 -0.959245
  0.039523	  0.604672	 -1.036571
  0.095842	  0.564949	 -1.086906
  0.157519	  0.533431	 -1.124264
  0.203318	  0.513944	 -1.147262
  0.257612	  0.496977	 -1.171186
  0.322185	  0.476805	 -1.198658
  0.414137	  0.435095	 -1.232307
  0.470584	  0.369743	 -1.244913
  0.520664	  0.286419	 -1.259745
  0.533732	  0.208234	 -1.258520
  0.529863	  0.143921	 -1.258170
  0.502986	  0.054052	 -1.271245
  0.450165	 -0.010025	 -1.316695
  0.437449	 -0.019417	 -1.331405
  0.393605	 -0.026020	 -1.393077
  0.368282	 -0.023788	 -1.443067
  0.333286	 -0.013891	 -1.535595
  0.307448	 -0.006287	 -1.583013
  0.265696	  0.007874	 -1.629037
  0.182859	  0.027672	 -1.687899
  0.074034	  0.064809	 -1.772977
 -0.010403	  0.059757	 -1.855284
 -0.042290	  0.021927	 -1.915058
 -0.048688	 -0.011623	 -1.959058
 -0.047261	 -0.041349	 -1.997792
 -0.042877	 -0.072211	 -2.036100
 -0.037797	 -0.104878	 -2.074116
 -0.033151	 -0.137935	 -2.110233
 -0.029288	 -0.172203	 -2.146025
 -0.026444	 -0.208133	 -2.182503
 -0.024877	 -0.241554	 -2.216943
 -0.023971	 -0.274989	 -2.254383
 -0.024027	 -0.306929	 -2.293741
 -0.024569	 -0.336336	 -2.333482
 -0.024929	 -0.364920	 -2.375336
 -0.024413	 -0.391436	 -2.418725
 -0.020747	 -0.416992	 -2.462881
 -0.013524	 -0.441592	 -2.504211
 -0.007085	 -0.467520	 -2.542734
 -0.003838	 -0.495734	 -2.582206
  0.001282	 -0.521182	 -2.625540
  0.003019	 -0.549132	 -2.670128
  0.002962	 -0.581258	 -2.711455
  0.000154	 -0.611031	 -2.750414
 -0.000970	 -0.642676	 -2.788502
  0.002597	 -0.673129	 -2.825833
  0.000540	 -0.707527	 -2.864584
 -0.005125	 -0.741594	 -2.906890
 -0.005177	 -0.749010	 -2.935959
