 -1.866085	  1.499122	 -0.219331
 -1.865889	  1.509157	 -0.228571
 -1.863580	  1.494728	 -0.213387
 -1.866474	  1.480402	 -0.201846
 -1.869885	  1.463871	 -0.188834
 -1.869592	  1.449827	 -0.174409
 -1.868191	  1.438440	 -0.158529
 -1.867635	  1.424871	 -0.142699
 -1.870969	  1.410745	 -0.130019
 -1.874625	  1.396909	 -0.115602
 -1.876094	  1.380466	 -0.100628
 -1.876484	  1.370246	 -0.087046
 -1.879447	  1.356612	 -0.071346
 -1.881939	  1.343254	 -0.056224
 -1.883034	  1.332573	 -0.040548
 -1.883398	  1.321127	 -0.021609
 -1.885684	  1.309875	 -0.007114
 -1.893663	  1.293444	  0.007395
 -1.898621	  1.276249	  0.018398
 -1.897904	  1.265303	  0.033338
 -1.899279	  1.254795	  0.050357
 -1.901012	  1.240946	  0.064679
 -1.903569	  1.228982	  0.080351
 -1.905348	  1.215317	  0.096324
 -1.907358	  1.199990	  0.109950
 -1.905190	  1.186855	  0.123173
 -1.903342	  1.171545	  0.138319
 -1.903132	  1.153212	  0.149820
 -1.905332	  1.141622	  0.161965
 -1.908506	  1.128590	  0.178433
 -1.911461	  1.115094	  0.194085
 -1.910087	  1.098922	  0.207138
 -1.908402	  1.082949	  0.219663
 -1.903828	  1.069021	  0.233162
 -1.899362	  1.056042	  0.247787
 -1.895216	  1.043593	  0.263061
 -1.891573	  1.033594	  0.280214
 -1.888454	  1.023388	  0.297211
 -1.884826	  1.013788	  0.314391
 -1.880426	  1.004958	  0.331788
 -1.876023	  0.996123	  0.349182
 -1.874393	  0.984111	  0.365089
 -1.873017	  0.971835	  0.380818
 -1.871674	  0.959533	  0.396530
 -1.872923	  0.945691	  0.410910
 -1.874175	  0.931842	  0.425281
 -1.875397	  0.917413	  0.438634
 -1.877339	  0.901850	  0.450182
 -1.878736	  0.886682	  0.465567
 -1.879381	  0.875285	  0.480574
 -1.884130	  0.859899	  0.495016
 -1.889692	  0.841669	  0.504604
 -1.895948	  0.826836	  0.516705
 -1.893356	  0.814538	  0.531118
 -1.890391	  0.795946	  0.542030
 -1.889708	  0.777966	  0.552239
 -1.894889	  0.764111	  0.566327
 -1.903489	  0.751104	  0.579610
 -1.909940	  0.736644	  0.592385
 -1.911062	  0.722279	  0.607891
 -1.909165	  0.703867	  0.619883
 -1.906207	  0.685553	  0.627927
 -1.898571	  0.671165	  0.640074
 -1.894124	  0.656164	  0.655732
 -1.894861	  0.640264	  0.667644
 -1.899556	  0.624023	  0.678743
 -1.903753	  0.610400	  0.691193
 -1.905729	  0.594679	  0.704875
 -1.906618	  0.578279	  0.717216
 -1.906072	  0.561043	  0.728937
 -1.904282	  0.545243	  0.740622
 -1.900194	  0.531475	  0.754832
 -1.895704	  0.519375	  0.770558
 -1.892158	  0.505552	  0.785137
 -1.889773	  0.491590	  0.798490
 -1.885726	  0.479619	  0.812811
 -1.879695	  0.467319	  0.830592
 -1.873521	  0.455510	  0.845308
 -1.871574	  0.442665	  0.858675
 -1.871164	  0.430213	  0.874955
 -1.870501	  0.419558	  0.892897
 -1.866715	  0.408092	  0.908351
 -1.864426	  0.391184	  0.922562
 -1.865357	  0.379404	  0.938099
 -1.867633	  0.371411	  0.955640
 -1.868634	  0.362345	  0.974160
 -1.865160	  0.351003	  0.992209
 -1.863098	  0.336246	  1.005641
 -1.864878	  0.325875	  1.022547
 -1.866332	  0.315339	  1.040071
 -1.867575	  0.302650	  1.053896
 -1.868473	  0.288806	  1.069460
 -1.869916	  0.276431	  1.085359
 -1.871496	  0.264899	  1.101589
 -1.874023	  0.253593	  1.117503
 -1.877831	  0.243090	  1.133159
 -1.880146	  0.231529	  1.153176
 -1.879436	  0.220100	  1.169282
 -1.880103	  0.207482	  1.181877
 -1.882516	  0.194716	  1.199267
 -1.881721	  0.181823	  1.215378
 -1.881317	  0.168122	  1.228349
 -1.881895	  0.152953	  1.243258
 -1.880254	  0.139033	  1.259116
 -1.876745	  0.123564	  1.271458
 -1.875238	  0.108708	  1.281176
 -1.874282	  0.092509	  1.294891
 -1.873235	  0.077624	  1.308530
 -1.872167	  0.062177	  1.321188
 -1.871098	  0.045568	  1.332279
 -1.870030	  0.028958	  1.343367
 -1.869321	  0.011917	  1.353813
 -1.868614	 -0.005126	  1.364255
 -1.867975	 -0.022001	  1.374971
 -1.868216	 -0.036444	  1.388802
 -1.868455	 -0.050885	  1.402637
 -1.868689	 -0.065329	  1.416471
 -1.871912	 -0.079330	  1.430384
 -1.877051	 -0.092870	  1.444178
 -1.882183	 -0.106412	  1.457972
 -1.885873	 -0.119376	  1.472738
 -1.889341	 -0.132033	  1.487726
 -1.890967	 -0.143603	  1.502313
 -1.892167	 -0.155738	  1.518166
