  0.740177	 -1.120855	  2.105041
  0.741152	 -1.122052	  2.107549
  0.734533	 -1.113921	  2.090517
  0.727914	 -1.105790	  2.073486
  0.721437	 -1.097660	  2.056399
  0.715225	 -1.089732	  2.039254
  0.709669	 -1.082946	  2.021320
  0.705788	 -1.077079	  2.002906
  0.701971	 -1.067933	  1.983784
  0.696235	 -1.057377	  1.967351
  0.689108	 -1.048730	  1.951515
  0.681766	 -1.042220	  1.934117
  0.674123	 -1.036684	  1.916825
  0.665880	 -1.031081	  1.898774
  0.658307	 -1.026977	  1.880446
  0.652553	 -1.021489	  1.861521
  0.646507	 -1.014336	  1.844325
  0.637223	 -1.006421	  1.829140
  0.627920	 -0.999821	  1.811967
  0.623527	 -0.991612	  1.791759
  0.618057	 -0.982415	  1.777112
  0.608203	 -0.974341	  1.761384
  0.599268	 -0.963955	  1.745356
  0.593804	 -0.953239	  1.728906
  0.588875	 -0.947896	  1.710901
  0.582758	 -0.941276	  1.691996
  0.578275	 -0.931092	  1.673895
  0.571929	 -0.917570	  1.660818
  0.564147	 -0.905806	  1.647628
  0.555832	 -0.893653	  1.633546
  0.548606	 -0.881068	  1.619074
  0.540400	 -0.868900	  1.605850
  0.532022	 -0.857845	  1.591229
  0.523741	 -0.847583	  1.576171
  0.515110	 -0.837994	  1.560890
  0.506478	 -0.828405	  1.545607
  0.498832	 -0.819314	  1.529518
  0.491714	 -0.810469	  1.513084
  0.484853	 -0.800855	  1.497541
  0.478125	 -0.790204	  1.481967
  0.471816	 -0.780629	  1.463548
  0.466734	 -0.773274	  1.446320
  0.459875	 -0.765966	  1.429487
  0.452756	 -0.755579	  1.414543
  0.447196	 -0.743734	  1.397413
  0.443666	 -0.736435	  1.378360
  0.435632	 -0.728340	  1.363989
  0.426527	 -0.717318	  1.349109
  0.416960	 -0.707703	  1.334009
  0.409975	 -0.698686	  1.316680
  0.404745	 -0.688803	  1.300048
  0.399194	 -0.676355	  1.286096
  0.392705	 -0.664083	  1.271216
  0.386255	 -0.653592	  1.255298
  0.378758	 -0.644543	  1.240202
  0.369246	 -0.635363	  1.223448
  0.360747	 -0.626927	  1.206807
  0.355354	 -0.615655	  1.192120
  0.351857	 -0.608172	  1.172686
  0.348441	 -0.601617	  1.152549
  0.340858	 -0.593524	  1.138418
  0.334234	 -0.586173	  1.121319
  0.329736	 -0.577226	  1.101765
  0.319508	 -0.575330	  1.085286
  0.307607	 -0.572160	  1.068425
  0.301121	 -0.568461	  1.049011
  0.295748	 -0.565533	  1.030579
  0.287559	 -0.559810	  1.013591
  0.279445	 -0.551117	  0.995711
  0.269110	 -0.548351	  0.976765
  0.261793	 -0.548608	  0.962161
  0.251355	 -0.543378	  0.945211
  0.240529	 -0.536592	  0.928449
  0.228999	 -0.531858	  0.910227
  0.223338	 -0.527774	  0.893733
  0.217791	 -0.519219	  0.874895
  0.206533	 -0.512767	  0.858762
  0.198372	 -0.508963	  0.841444
  0.195008	 -0.504480	  0.821856
  0.186143	 -0.499466	  0.803089
  0.175829	 -0.491169	  0.789660
  0.165511	 -0.480792	  0.773998
  0.157988	 -0.475409	  0.754942
  0.150142	 -0.472063	  0.738239
  0.139559	 -0.465139	  0.722080
  0.130246	 -0.455156	  0.707238
  0.124008	 -0.443348	  0.692917
  0.114046	 -0.432697	  0.676463
  0.104828	 -0.426239	  0.659607
  0.099848	 -0.417727	  0.645158
  0.093737	 -0.406105	  0.628506
  0.087014	 -0.395197	  0.612728
  0.078535	 -0.384767	  0.597924
  0.069421	 -0.375336	  0.583144
  0.059821	 -0.366794	  0.567228
  0.047847	 -0.358780	  0.554504
  0.035617	 -0.349511	  0.539690
  0.029624	 -0.338412	  0.520278
  0.025216	 -0.329388	  0.506286
  0.015217	 -0.316164	  0.494892
  0.007200	 -0.302847	  0.479895
 -0.000110	 -0.291197	  0.466423
 -0.010841	 -0.279668	  0.453959
 -0.022562	 -0.269238	  0.439633
 -0.031664	 -0.261994	  0.422702
 -0.042854	 -0.254402	  0.407937
 -0.054502	 -0.245528	  0.396424
 -0.066313	 -0.235359	  0.383237
 -0.076574	 -0.225330	  0.368636
 -0.086062	 -0.215502	  0.354028
 -0.095551	 -0.205673	  0.339421
 -0.104489	 -0.195731	  0.324546
 -0.113110	 -0.185729	  0.309525
 -0.121733	 -0.175725	  0.294505
 -0.129699	 -0.165673	  0.279159
 -0.137372	 -0.155594	  0.263808
 -0.145912	 -0.144778	  0.250467
 -0.155107	 -0.131579	  0.235962
 -0.162146	 -0.117839	  0.222262
 -0.165606	 -0.108740	  0.202789
 -0.171347	 -0.104782	  0.183844
 -0.179026	 -0.097730	  0.168282
 -0.184860	 -0.085112	  0.153700
 -0.190630	 -0.075335	  0.133010
 -0.197257	 -0.074405	  0.116037
 -0.204083	 -0.064469	  0.100092
 -0.208516	 -0.052253	  0.083031
 -0.211530	 -0.044768	  0.063368
 -0.220029	 -0.038429	  0.048621
 -0.231378	 -0.027189	  0.034844
 -0.238672	 -0.017711	  0.015522
 -0.239344	 -0.010118	 -0.002733
 -0.244387	 -0.002539	 -0.018918
 -0.250795	  0.006660	 -0.036662
 -0.259546	  0.018817	 -0.051083
 -0.266206	  0.029372	 -0.065158
 -0.277160	  0.038015	 -0.080786
 -0.288329	  0.046145	 -0.096974
 -0.292518	  0.055956	 -0.112239
 -0.295187	  0.068606	 -0.128255
 -0.304011	  0.079461	 -0.147500
 -0.312099	  0.085870	 -0.162192
 -0.317605	  0.095232	 -0.175843
 -0.320612	  0.106687	 -0.194811
 -0.329085	  0.115866	 -0.212153
 -0.339027	  0.125434	 -0.224991
 -0.348963	  0.136028	 -0.238398
 -0.360052	  0.143153	 -0.255749
 -0.372199	  0.144222	 -0.274494
 -0.377685	  0.150563	 -0.291485
 -0.383551	  0.159470	 -0.306874
 -0.399992	  0.166604	 -0.319420
 -0.415492	  0.177037	 -0.333743
 -0.424761	  0.185950	 -0.348062
 -0.428146	  0.192394	 -0.366592
 -0.436210	  0.196842	 -0.383766
 -0.445736	  0.203801	 -0.399897
 -0.460682	  0.207589	 -0.417624
 -0.474000	  0.211331	 -0.431041
 -0.482828	  0.218942	 -0.447351
 -0.492964	  0.224124	 -0.464152
 -0.502171	  0.227256	 -0.479065
 -0.514072	  0.231694	 -0.495712
 -0.526962	  0.238745	 -0.510906
 -0.539103	  0.246620	 -0.524673
 -0.549995	  0.251452	 -0.539625
 -0.561262	  0.255686	 -0.555139
 -0.572544	  0.259859	 -0.572353
 -0.586302	  0.264938	 -0.587351
 -0.601405	  0.271864	 -0.598399
 -0.613511	  0.281293	 -0.611297
 -0.622529	  0.289148	 -0.627033
 -0.633486	  0.295479	 -0.642828
 -0.645903	  0.301858	 -0.657381
 -0.658975	  0.310154	 -0.670740
 -0.671984	  0.319356	 -0.682937
 -0.681898	  0.329970	 -0.696081
 -0.690648	  0.342021	 -0.711090
 -0.700015	  0.353405	 -0.724190
 -0.712112	  0.362336	 -0.734843
 -0.725614	  0.371706	 -0.747277
 -0.737373	  0.385559	 -0.764472
 -0.748683	  0.394331	 -0.775792
 -0.765513	  0.402412	 -0.780411
 -0.778216	  0.415269	 -0.788774
 -0.787120	  0.427816	 -0.806074
 -0.801574	  0.434117	 -0.820097
 -0.814789	  0.442489	 -0.829654
 -0.827979	  0.454374	 -0.841151
 -0.837456	  0.462938	 -0.857232
 -0.852786	  0.470951	 -0.864895
 -0.870311	  0.481802	 -0.876711
 -0.882878	  0.492959	 -0.887643
 -0.890737	  0.505142	 -0.902504
 -0.898628	  0.508246	 -0.919442
 -0.908110	  0.514200	 -0.938508
 -0.919544	  0.521950	 -0.952837
 -0.929978	  0.525126	 -0.969336
 -0.940517	  0.532473	 -0.986224
 -0.948612	  0.544340	 -1.000204
 -0.958788	  0.553396	 -1.012118
 -0.972635	  0.563665	 -1.029055
 -0.979647	  0.566550	 -1.049750
 -0.983536	  0.567824	 -1.065091
 -0.989881	  0.575593	 -1.083220
 -0.989982	  0.582799	 -1.105238
 -0.994914	  0.590365	 -1.121930
 -1.005876	  0.599902	 -1.138245
 -1.015663	  0.601334	 -1.155387
 -1.022524	  0.600941	 -1.175379
 -1.031862	  0.603112	 -1.193218
 -1.033515	  0.611409	 -1.213542
 -1.030209	  0.613021	 -1.232675
 -1.030552	  0.610720	 -1.255098
 -1.032666	  0.609259	 -1.276263
 -1.037670	  0.618829	 -1.292413
 -1.043569	  0.628218	 -1.311039
 -1.051443	  0.635892	 -1.327815
 -1.056175	  0.643463	 -1.345586
 -1.059215	  0.650789	 -1.366170
 -1.055678	  0.659885	 -1.385167
 -1.052656	  0.668560	 -1.401729
 -1.056895	  0.677248	 -1.419633
 -1.063604	  0.684802	 -1.438941
 -1.069639	  0.688453	 -1.455682
 -1.072216	  0.694302	 -1.475717
 -1.073069	  0.700356	 -1.495005
 -1.074514	  0.707035	 -1.513769
 -1.076528	  0.713774	 -1.532603
 -1.078249	  0.720068	 -1.551559
 -1.080211	  0.726108	 -1.570418
 -1.083928	  0.733110	 -1.589263
 -1.088092	  0.741283	 -1.607504
 -1.089898	  0.751437	 -1.624209
 -1.090204	  0.759499	 -1.641909
 -1.090525	  0.767525	 -1.659432
 -1.094160	  0.782036	 -1.677593
 -1.096094	  0.790974	 -1.694592
 -1.098193	  0.796149	 -1.712794
 -1.100676	  0.803524	 -1.731856
 -1.105703	  0.812957	 -1.750028
 -1.109600	  0.822463	 -1.766605
 -1.109513	  0.831137	 -1.784079
 -1.112711	  0.840899	 -1.801193
 -1.115674	  0.848462	 -1.820104
 -1.116004	  0.859086	 -1.837895
 -1.117654	  0.871633	 -1.851721
 -1.123163	  0.885190	 -1.868939
 -1.127220	  0.895620	 -1.886827
 -1.127920	  0.899236	 -1.903295
 -1.133729	  0.909910	 -1.922520
 -1.137681	  0.923232	 -1.938053
 -1.135624	  0.934242	 -1.953817
 -1.134584	  0.946712	 -1.969877
 -1.137831	  0.958647	 -1.986369
 -1.141757	  0.964205	 -2.004761
 -1.143923	  0.971873	 -2.025376
 -1.148073	  0.983031	 -2.040730
 -1.153961	  0.991966	 -2.056177
 -1.158672	  1.001742	 -2.072977
