 -0.188112	  1.925223	  1.563811
 -0.178215	  1.920029	  1.591140
 -0.185577	  1.923893	  1.570812
 -0.200293	  1.933238	  1.524245
 -0.213039	  1.944385	  1.478272
 -0.224162	  1.957209	  1.432872
 -0.233434	  1.972214	  1.388239
 -0.240219	  1.993628	  1.341190
 -0.249967	  2.009108	  1.287057
 -0.264455	  2.013583	  1.233856
 -0.281824	  2.013288	  1.185325
 -0.300017	  2.012645	  1.139426
 -0.319942	  2.012498	  1.093577
 -0.341270	  2.012482	  1.047692
 -0.363055	  2.011244	  1.002594
 -0.385040	  2.009855	  0.958275
 -0.407737	  2.009883	  0.914682
 -0.432202	  2.012861	  0.870938
 -0.458481	  2.017454	  0.826818
 -0.483049	  2.022242	  0.782358
 -0.504438	  2.027606	  0.738961
 -0.524795	  2.036434	  0.696568
 -0.545914	  2.047269	  0.653091
 -0.569240	  2.057402	  0.609815
 -0.595046	  2.065078	  0.566495
 -0.622464	  2.069905	  0.523171
 -0.651958	  2.072982	  0.481382
 -0.681905	  2.075604	  0.440910
 -0.711573	  2.078048	  0.398427
 -0.738949	  2.079846	  0.352183
 -0.761734	  2.081190	  0.303119
 -0.777278	  2.082366	  0.255614
 -0.788138	  2.083833	  0.209221
 -0.798475	  2.086682	  0.163638
 -0.811001	  2.090301	  0.116984
 -0.826640	  2.093984	  0.068798
 -0.844447	  2.097598	  0.019512
 -0.863221	  2.100373	 -0.028560
 -0.882875	  2.102222	 -0.075330
 -0.903756	  2.103372	 -0.120723
 -0.926375	  2.104283	 -0.164598
 -0.949232	  2.106168	 -0.207284
 -0.971763	  2.109665	 -0.250059
 -0.993602	  2.115189	 -0.293538
 -1.014375	  2.123319	 -0.338203
 -1.033504	  2.134728	 -0.384941
 -1.048082	  2.146936	 -0.432211
 -1.060154	  2.158003	 -0.479086
 -1.071035	  2.170314	 -0.528022
 -1.079911	  2.176303	 -0.589491
 -1.090301	  2.181469	 -0.626754
