 -1.318990	 -1.554237	 -1.357717
 -1.328455	 -1.568414	 -1.362418
 -1.334953	 -1.547769	 -1.352015
 -1.323560	 -1.525457	 -1.342101
 -1.312041	 -1.510761	 -1.334920
 -1.301323	 -1.496672	 -1.334260
 -1.290802	 -1.480402	 -1.331242
 -1.272421	 -1.461548	 -1.322159
 -1.256527	 -1.452777	 -1.322534
 -1.237249	 -1.444565	 -1.325715
 -1.220430	 -1.432033	 -1.325792
 -1.209606	 -1.415073	 -1.321273
 -1.198203	 -1.395320	 -1.313159
 -1.187970	 -1.378341	 -1.307358
 -1.182210	 -1.366172	 -1.302207
 -1.172565	 -1.348355	 -1.293128
 -1.158020	 -1.330128	 -1.287221
 -1.146442	 -1.313730	 -1.286415
 -1.138012	 -1.298085	 -1.285285
 -1.128317	 -1.282842	 -1.283450
 -1.118082	 -1.264275	 -1.282343
 -1.109933	 -1.244641	 -1.282036
 -1.096016	 -1.223071	 -1.280467
 -1.085813	 -1.211261	 -1.277722
 -1.070750	 -1.196281	 -1.274412
 -1.060548	 -1.182383	 -1.273661
 -1.052124	 -1.167133	 -1.272727
 -1.040190	 -1.147462	 -1.272998
 -1.027913	 -1.129519	 -1.269270
 -1.015043	 -1.116732	 -1.262687
 -1.000717	 -1.102973	 -1.258253
 -0.987738	 -1.087301	 -1.258395
 -0.975616	 -1.071391	 -1.259467
 -0.963453	 -1.055587	 -1.260561
 -0.951804	 -1.039345	 -1.261657
 -0.940948	 -1.022889	 -1.264778
 -0.932036	 -1.006737	 -1.272414
 -0.923235	 -0.990606	 -1.280305
 -0.914435	 -0.974474	 -1.288199
 -0.905634	 -0.958343	 -1.296094
 -0.896813	 -0.942261	 -1.304058
 -0.887585	 -0.927123	 -1.313297
 -0.878012	 -0.913030	 -1.323760
 -0.868439	 -0.899158	 -1.334513
 -0.858905	 -0.885409	 -1.345468
 -0.848419	 -0.872633	 -1.356226
 -0.835204	 -0.862427	 -1.367782
 -0.824154	 -0.851587	 -1.380552
 -0.816754	 -0.842266	 -1.395839
 -0.808872	 -0.834295	 -1.413343
 -0.798762	 -0.825684	 -1.429287
 -0.789403	 -0.813390	 -1.443906
 -0.782923	 -0.799329	 -1.457131
 -0.776832	 -0.786161	 -1.471809
 -0.773859	 -0.772860	 -1.486819
 -0.772085	 -0.760055	 -1.501066
 -0.768510	 -0.746662	 -1.515807
 -0.764060	 -0.734678	 -1.530026
 -0.752649	 -0.724898	 -1.540972
 -0.734707	 -0.719500	 -1.533607
 -0.723161	 -0.710419	 -1.521676
 -0.715821	 -0.700303	 -1.509987
 -0.705681	 -0.692708	 -1.494298
 -0.693126	 -0.685757	 -1.478645
 -0.681716	 -0.679293	 -1.464657
 -0.672054	 -0.677711	 -1.448746
 -0.663641	 -0.678581	 -1.431858
 -0.656777	 -0.682337	 -1.412509
 -0.647299	 -0.688454	 -1.390458
 -0.634660	 -0.687739	 -1.373269
 -0.620737	 -0.680009	 -1.350176
 -0.612980	 -0.672145	 -1.331364
 -0.611745	 -0.667472	 -1.319349
 -0.598747	 -0.668169	 -1.302367
 -0.580901	 -0.670309	 -1.288195
 -0.565080	 -0.666815	 -1.274214
 -0.549304	 -0.661032	 -1.260919
 -0.534611	 -0.655302	 -1.246884
 -0.520551	 -0.649507	 -1.233794
 -0.506167	 -0.643452	 -1.220687
 -0.492933	 -0.637599	 -1.207372
 -0.479496	 -0.635142	 -1.192867
 -0.463306	 -0.637436	 -1.176331
 -0.436312	 -0.633639	 -1.161652
 -0.414039	 -0.622519	 -1.154938
 -0.402158	 -0.593835	 -1.147076
 -0.397836	 -0.567541	 -1.137358
 -0.394998	 -0.556397	 -1.133419
 -0.389310	 -0.533498	 -1.127068
 -0.385010	 -0.512569	 -1.123415
 -0.382715	 -0.492829	 -1.120536
 -0.385453	 -0.475731	 -1.113633
 -0.383644	 -0.457025	 -1.102737
 -0.379830	 -0.439819	 -1.093221
 -0.379564	 -0.422539	 -1.085106
 -0.377027	 -0.403928	 -1.076360
 -0.368812	 -0.388155	 -1.064969
 -0.362602	 -0.377762	 -1.054331
 -0.358432	 -0.359410	 -1.042883
 -0.357534	 -0.339074	 -1.036038
 -0.353097	 -0.314774	 -1.030546
 -0.350249	 -0.300670	 -1.025785
 -0.346060	 -0.281053	 -1.025407
 -0.345317	 -0.258435	 -1.023363
 -0.346156	 -0.234297	 -1.018422
 -0.339586	 -0.214055	 -1.017061
 -0.338278	 -0.193893	 -1.015264
 -0.336381	 -0.176434	 -1.013334
 -0.334775	 -0.154556	 -1.008946
 -0.333537	 -0.137564	 -1.000385
 -0.323626	 -0.117970	 -0.990798
 -0.314933	 -0.106031	 -0.985602
 -0.310545	 -0.090374	 -0.977742
 -0.303433	 -0.063791	 -0.969896
 -0.295381	 -0.043311	 -0.963654
 -0.295368	 -0.031508	 -0.963352
 -0.290429	 -0.014488	 -0.956678
 -0.285063	  0.016958	 -0.952147
 -0.282057	  0.029437	 -0.951125
 -0.273321	  0.047004	 -0.948321
 -0.261889	  0.069127	 -0.945981
 -0.248540	  0.087463	 -0.942612
 -0.242421	  0.096793	 -0.940654
 -0.229975	  0.108973	 -0.934323
 -0.212921	  0.131456	 -0.917693
 -0.204794	  0.147252	 -0.902819
 -0.195817	  0.156436	 -0.898430
 -0.186311	  0.167894	 -0.888898
 -0.172097	  0.181835	 -0.882692
 -0.156797	  0.200974	 -0.876037
 -0.143067	  0.220298	 -0.872860
 -0.137500	  0.228085	 -0.873042
 -0.129049	  0.243754	 -0.871732
 -0.113944	  0.264567	 -0.867242
 -0.100892	  0.283795	 -0.859576
 -0.086531	  0.300699	 -0.852474
 -0.078001	  0.306377	 -0.846298
 -0.069838	  0.318200	 -0.839415
 -0.054380	  0.336369	 -0.825028
 -0.041315	  0.352881	 -0.815533
 -0.035581	  0.360934	 -0.811250
 -0.021737	  0.373238	 -0.801909
 -0.005896	  0.386430	 -0.786280
  0.006165	  0.399665	 -0.775906
  0.012462	  0.411748	 -0.769362
  0.022450	  0.428974	 -0.764946
  0.032240	  0.442708	 -0.763603
  0.049045	  0.466780	 -0.757686
  0.060045	  0.481685	 -0.750271
  0.067144	  0.491067	 -0.745558
  0.084946	  0.512946	 -0.733188
  0.099852	  0.528123	 -0.719611
  0.104616	  0.533425	 -0.713182
  0.115434	  0.545700	 -0.703254
  0.125742	  0.559689	 -0.692397
  0.136291	  0.572947	 -0.685820
  0.152126	  0.592455	 -0.679134
  0.161914	  0.606165	 -0.674680
  0.172817	  0.622643	 -0.670361
  0.186172	  0.644050	 -0.664963
  0.195664	  0.657954	 -0.660363
  0.205349	  0.669302	 -0.654233
  0.218425	  0.682017	 -0.648127
  0.233138	  0.697749	 -0.641442
  0.250030	  0.713563	 -0.632562
  0.271337	  0.721550	 -0.625903
  0.283382	  0.724803	 -0.617538
  0.305400	  0.731529	 -0.605781
  0.318726	  0.741662	 -0.597931
  0.331704	  0.753719	 -0.590597
  0.349023	  0.768630	 -0.583628
  0.364117	  0.776079	 -0.579789
  0.383579	  0.782059	 -0.576280
  0.405021	  0.793974	 -0.571942
  0.417203	  0.806892	 -0.569260
  0.432697	  0.823224	 -0.564708
  0.453983	  0.832086	 -0.562743
  0.474108	  0.831628	 -0.564014
  0.497485	  0.831859	 -0.565996
  0.514537	  0.835194	 -0.568546
  0.534416	  0.833237	 -0.572095
  0.561263	  0.833130	 -0.576270
  0.579749	  0.844196	 -0.578417
  0.590973	  0.862306	 -0.579282
  0.606480	  0.879365	 -0.586146
  0.626267	  0.877720	 -0.592333
  0.656658	  0.870851	 -0.600023
  0.669977	  0.870849	 -0.602838
  0.690206	  0.871929	 -0.609180
  0.712699	  0.875505	 -0.618062
  0.729424	  0.875873	 -0.627750
  0.744515	  0.872090	 -0.636407
  0.764748	  0.864466	 -0.645639
  0.784285	  0.864389	 -0.656461
  0.798871	  0.868187	 -0.668418
  0.814823	  0.871299	 -0.683472
  0.831105	  0.869308	 -0.697824
  0.852113	  0.867145	 -0.706472
  0.873922	  0.868040	 -0.715854
  0.890907	  0.875432	 -0.733474
  0.897139	  0.883307	 -0.755381
  0.895867	  0.886197	 -0.774262
  0.898950	  0.882258	 -0.795333
  0.914097	  0.878612	 -0.813338
  0.930431	  0.877404	 -0.824506
  0.944721	  0.878377	 -0.833202
  0.961187	  0.885370	 -0.838915
  0.981288	  0.893637	 -0.846870
  0.999277	  0.897731	 -0.866817
  1.008398	  0.896980	 -0.880832
  1.018360	  0.902815	 -0.896923
  1.031535	  0.912758	 -0.911644
  1.045427	  0.921582	 -0.926161
  1.055192	  0.928853	 -0.941485
  1.060999	  0.935686	 -0.957244
  1.067880	  0.944897	 -0.972770
  1.078936	  0.952988	 -0.986438
  1.093519	  0.964962	 -0.993126
  1.106069	  0.981355	 -0.997807
  1.111012	  0.997778	 -0.993559
  1.114379	  1.020291	 -0.990305
  1.114405	  1.037786	 -0.992984
  1.120713	  1.054092	 -0.999269
  1.128957	  1.072443	 -1.003093
  1.135325	  1.091826	 -1.005338
  1.141917	  1.110844	 -1.010719
  1.148663	  1.130765	 -1.016965
  1.151922	  1.153239	 -1.019680
  1.151236	  1.170726	 -1.017366
  1.150282	  1.191046	 -1.013656
  1.146511	  1.219841	 -1.005667
  1.145896	  1.229480	 -1.002509
  1.144332	  1.249196	 -0.994446
  1.144000	  1.271282	 -0.990246
  1.143377	  1.288388	 -0.991100
  1.142269	  1.316574	 -0.990188
  1.140953	  1.332706	 -0.987222
  1.140019	  1.348409	 -0.982496
  1.139809	  1.369667	 -0.975174
  1.137675	  1.385758	 -0.969335
  1.135290	  1.406363	 -0.960135
  1.134018	  1.429384	 -0.956887
  1.134253	  1.441646	 -0.957689
  1.135379	  1.464357	 -0.955501
  1.133967	  1.482155	 -0.948714
  1.131804	  1.496568	 -0.940887
  1.131476	  1.514625	 -0.929181
  1.128276	  1.532359	 -0.919281
  1.123411	  1.543665	 -0.906528
  1.118227	  1.553496	 -0.888496
  1.117025	  1.566492	 -0.877710
  1.113148	  1.583582	 -0.867214
  1.108382	  1.596523	 -0.852754
  1.101952	  1.607628	 -0.838142
  1.095041	  1.618170	 -0.823220
  1.086532	  1.627413	 -0.807764
  1.077457	  1.636833	 -0.792282
  1.067957	  1.644737	 -0.776793
  1.056585	  1.652594	 -0.761673
  1.045325	  1.658124	 -0.746519
  1.033178	  1.663391	 -0.731623
  1.021679	  1.667527	 -0.716744
  1.009269	  1.672269	 -0.702981
  0.999834	  1.674816	 -0.687457
  0.990346	  1.677817	 -0.673411
  0.990758	  1.677597	 -0.661595
  0.991262	  1.678460	 -0.655836
  0.996637	  1.680196	 -0.643895
  1.012390	  1.681161	 -0.632339
  1.029741	  1.683014	 -0.620386
  1.047468	  1.686545	 -0.607739
  1.064639	  1.690444	 -0.596167
  1.081181	  1.693971	 -0.585729
  1.095873	  1.701037	 -0.575250
  1.110145	  1.714686	 -0.568614
  1.130465	  1.727198	 -0.563569
  1.152621	  1.735952	 -0.551431
  1.162685	  1.742319	 -0.540189
  1.175700	  1.750839	 -0.526920
  1.188855	  1.761343	 -0.515158
  1.199602	  1.771870	 -0.506166
  1.217336	  1.784710	 -0.497761
  1.236827	  1.800081	 -0.489061
  1.244547	  1.807613	 -0.485186
  1.258371	  1.822738	 -0.477044
  1.270337	  1.837371	 -0.467165
  1.280116	  1.850318	 -0.457270
  1.290809	  1.864528	 -0.451350
  1.315727	  1.880883	 -0.445638
  1.330653	  1.892062	 -0.438004
  1.341881	  1.900897	 -0.430022
  1.347041	  1.917345	 -0.421201
  1.356894	  1.935269	 -0.412493
  1.368062	  1.950830	 -0.404571
  1.378330	  1.966711	 -0.396729
  1.387986	  1.982294	 -0.388644
  1.398059	  1.998040	 -0.380279
  1.407073	  2.015210	 -0.371554
  1.401162	  2.038259	 -0.364617
  1.412938	  2.052112	 -0.356285
