  1.759141	 -0.837678	  1.567628
  1.775479	 -0.853211	  1.579071
  1.763039	 -0.840513	  1.571346
  1.748523	 -0.832059	  1.559080
  1.735184	 -0.819312	  1.548596
  1.724509	 -0.806204	  1.542613
  1.711261	 -0.789377	  1.533584
  1.699848	 -0.774263	  1.523345
  1.688919	 -0.762721	  1.518256
  1.673681	 -0.744205	  1.517318
  1.654568	 -0.730295	  1.517151
  1.639567	 -0.726705	  1.509190
  1.621665	 -0.722622	  1.497837
  1.600644	 -0.713634	  1.494046
  1.584386	 -0.700021	  1.493444
  1.572382	 -0.690090	  1.487893
  1.553281	 -0.682152	  1.483282
  1.533365	 -0.670766	  1.482546
  1.521167	 -0.657844	  1.478954
  1.505464	 -0.646888	  1.473623
  1.486089	 -0.636936	  1.470488
  1.470536	 -0.622878	  1.468599
  1.458362	 -0.605791	  1.463418
  1.447166	 -0.595800	  1.456253
  1.429515	 -0.586048	  1.448814
  1.412252	 -0.576176	  1.443022
  1.396460	 -0.565075	  1.437384
  1.380478	 -0.554424	  1.431811
  1.364501	 -0.543744	  1.426268
  1.348072	 -0.533507	  1.421235
  1.331354	 -0.523583	  1.416544
  1.314633	 -0.513665	  1.411847
  1.297919	 -0.504108	  1.406436
  1.281208	 -0.494557	  1.400998
  1.265040	 -0.484987	  1.394221
  1.248684	 -0.476942	  1.386886
  1.231979	 -0.470938	  1.378245
  1.216137	 -0.461808	  1.363753
  1.204351	 -0.451949	  1.351007
  1.191506	 -0.434050	  1.347157
  1.179737	 -0.415472	  1.347158
  1.169565	 -0.395472	  1.338456
  1.162704	 -0.384496	  1.326478
  1.150789	 -0.374440	  1.313899
  1.139076	 -0.361272	  1.302009
  1.129196	 -0.349632	  1.290278
  1.117543	 -0.339511	  1.278409
  1.105053	 -0.324148	  1.262177
  1.097977	 -0.310490	  1.253703
  1.087421	 -0.299412	  1.245999
  1.073811	 -0.285313	  1.236190
  1.062248	 -0.269645	  1.229598
  1.050522	 -0.254556	  1.223453
  1.039374	 -0.241439	  1.212871
  1.028778	 -0.229047	  1.201270
  1.019343	 -0.217660	  1.187816
  1.012862	 -0.208986	  1.171008
  1.006411	 -0.200336	  1.154169
  0.999993	 -0.191735	  1.137306
  0.997167	 -0.189238	  1.117678
  0.995300	 -0.188331	  1.097786
  0.993443	 -0.187429	  1.077893
  0.991585	 -0.186527	  1.058000
  0.989705	 -0.185625	  1.038110
  0.985028	 -0.184460	  1.018706
  0.976583	 -0.182980	  1.000641
  0.968143	 -0.181530	  0.982566
  0.959698	 -0.180075	  0.964493
  0.951147	 -0.178506	  0.946482
  0.942034	 -0.174768	  0.929160
  0.932193	 -0.172460	  0.913628
  0.919993	 -0.171000	  0.896462
  0.916545	 -0.168818	  0.876982
  0.915744	 -0.157080	  0.848601
  0.910958	 -0.149894	  0.832652
  0.900062	 -0.146627	  0.823093
  0.887444	 -0.139862	  0.807139
  0.871774	 -0.129246	  0.787923
  0.863597	 -0.123537	  0.776735
  0.852759	 -0.113572	  0.760515
  0.839557	 -0.100463	  0.744813
  0.828950	 -0.090533	  0.731075
  0.824849	 -0.085282	  0.719579
  0.814388	 -0.072237	  0.706764
  0.802219	 -0.056991	  0.696400
  0.791309	 -0.041340	  0.690439
  0.782500	 -0.025041	  0.688310
  0.771939	 -0.006891	  0.692377
  0.758242	  0.010800	  0.696868
  0.744878	  0.023289	  0.691846
  0.731190	  0.035639	  0.684221
  0.713341	  0.052847	  0.681694
  0.701749	  0.065665	  0.687955
  0.690420	  0.079664	  0.697563
  0.676622	  0.094053	  0.702984
  0.662453	  0.105739	  0.704414
  0.645473	  0.120258	  0.708256
  0.632233	  0.133236	  0.715615
  0.620339	  0.144601	  0.722675
  0.603417	  0.159184	  0.727747
  0.590552	  0.171151	  0.733803
  0.578726	  0.182564	  0.743285
  0.565725	  0.194432	  0.754324
  0.549896	  0.203939	  0.762873
  0.532253	  0.213029	  0.770457
  0.516997	  0.221932	  0.777352
  0.505426	  0.237043	  0.785662
  0.492531	  0.256909	  0.792261
  0.476348	  0.269888	  0.792776
  0.458891	  0.272217	  0.793132
  0.434931	  0.275071	  0.793984
  0.414450	  0.282345	  0.795223
  0.402129	  0.295015	  0.800017
  0.384238	  0.303375	  0.803921
  0.366612	  0.315882	  0.805509
  0.352163	  0.328143	  0.805680
  0.337345	  0.340710	  0.805624
  0.318678	  0.351144	  0.804079
  0.305833	  0.364176	  0.806194
  0.289554	  0.376129	  0.807137
  0.271681	  0.386891	  0.805289
  0.254986	  0.397686	  0.805854
  0.238097	  0.406869	  0.804370
  0.218796	  0.412344	  0.804026
  0.198635	  0.422274	  0.805295
  0.181329	  0.433142	  0.808293
  0.168484	  0.446094	  0.803982
  0.152563	  0.457959	  0.800171
  0.135695	  0.469383	  0.798548
  0.119491	  0.481437	  0.799112
  0.103492	  0.493606	  0.799679
  0.087597	  0.505919	  0.800326
  0.071778	  0.518319	  0.800852
  0.056299	  0.531262	  0.799938
  0.040832	  0.543947	  0.799568
  0.025182	  0.556622	  0.798865
  0.009531	  0.569227	  0.796326
 -0.006133	  0.581544	  0.794215
 -0.022125	  0.593441	  0.790998
 -0.038795	  0.604206	  0.787132
 -0.055219	  0.614745	  0.782058
 -0.072120	  0.624933	  0.777632
 -0.089007	  0.634051	  0.770216
 -0.105209	  0.641781	  0.764575
 -0.122533	  0.647291	  0.757889
 -0.147741	  0.655802	  0.744513
 -0.159030	  0.661546	  0.734146
 -0.168835	  0.668237	  0.719330
 -0.181100	  0.674973	  0.701825
 -0.193579	  0.680325	  0.687978
 -0.209782	  0.685829	  0.675034
 -0.222238	  0.696961	  0.661114
 -0.227812	  0.709599	  0.648402
 -0.237957	  0.726493	  0.637261
 -0.251853	  0.740368	  0.631897
 -0.267596	  0.754362	  0.627536
 -0.284422	  0.764793	  0.617006
 -0.295270	  0.771859	  0.606392
 -0.305913	  0.787398	  0.592338
 -0.319736	  0.803438	  0.582351
 -0.331275	  0.810853	  0.579482
 -0.353057	  0.822863	  0.579531
 -0.366506	  0.838722	  0.574878
 -0.374620	  0.854675	  0.567341
 -0.386194	  0.867216	  0.559795
 -0.403056	  0.878467	  0.552797
 -0.417194	  0.891290	  0.547939
 -0.430790	  0.905389	  0.541869
 -0.444449	  0.915358	  0.532852
 -0.459083	  0.925157	  0.518053
 -0.470706	  0.935620	  0.503037
 -0.480808	  0.948035	  0.492440
 -0.492266	  0.962532	  0.485408
 -0.506090	  0.973861	  0.478024
 -0.520155	  0.983334	  0.469755
 -0.535321	  0.997835	  0.464073
 -0.549296	  1.016343	  0.460007
 -0.559152	  1.031118	  0.455013
 -0.568133	  1.046106	  0.445411
 -0.578826	  1.060587	  0.434410
 -0.594150	  1.069408	  0.423012
 -0.613615	  1.077321	  0.420859
 -0.638042	  1.082721	  0.415087
 -0.654107	  1.090422	  0.412529
 -0.671880	  1.104904	  0.412204
 -0.685786	  1.115752	  0.409362
 -0.693901	  1.130695	  0.400963
 -0.715586	  1.149876	  0.396896
 -0.728010	  1.161005	  0.383714
 -0.738312	  1.168861	  0.382961
 -0.759002	  1.182007	  0.372507
 -0.769061	  1.190088	  0.365691
 -0.787895	  1.197684	  0.359319
 -0.807434	  1.212130	  0.351492
 -0.820399	  1.219359	  0.350034
 -0.836882	  1.230170	  0.351550
 -0.858025	  1.241001	  0.345190
 -0.878066	  1.246100	  0.341168
 -0.899846	  1.248905	  0.335893
 -0.917282	  1.254854	  0.335121
 -0.931682	  1.264904	  0.344561
 -0.951943	  1.281534	  0.350496
 -0.968617	  1.289108	  0.353546
 -0.982423	  1.301779	  0.362582
 -0.997688	  1.308424	  0.356251
 -1.014691	  1.319557	  0.367201
 -1.031406	  1.325973	  0.368442
 -1.051479	  1.332704	  0.378420
 -1.068930	  1.336386	  0.389106
 -1.083510	  1.347906	  0.389925
 -1.099672	  1.354963	  0.403404
 -1.114208	  1.366013	  0.408426
 -1.132082	  1.372604	  0.417491
 -1.152343	  1.385132	  0.420979
 -1.163121	  1.395687	  0.421159
 -1.183627	  1.411807	  0.424575
 -1.194741	  1.425799	  0.424861
 -1.208325	  1.437074	  0.436930
 -1.223087	  1.444666	  0.449680
 -1.241593	  1.452289	  0.460534
 -1.256187	  1.460706	  0.460047
 -1.274792	  1.471199	  0.451744
 -1.293645	  1.478668	  0.445797
 -1.309781	  1.486012	  0.448673
 -1.325218	  1.499579	  0.447650
 -1.339960	  1.515763	  0.446692
 -1.351919	  1.532092	  0.444129
 -1.363641	  1.548462	  0.437907
 -1.372984	  1.560292	  0.424801
 -1.379675	  1.570602	  0.404768
 -1.387322	  1.580462	  0.390140
 -1.396170	  1.588883	  0.376654
 -1.404218	  1.597444	  0.361910
 -1.408452	  1.605886	  0.344101
 -1.411400	  1.615036	  0.329542
 -1.416929	  1.629248	  0.313588
 -1.420518	  1.638801	  0.294932
 -1.424700	  1.640009	  0.279291
 -1.430549	  1.641153	  0.258012
 -1.431646	  1.643128	  0.237500
 -1.429683	  1.643848	  0.217448
 -1.427123	  1.645154	  0.195958
 -1.426594	  1.651218	  0.174655
 -1.431024	  1.657743	  0.161477
 -1.435890	  1.663160	  0.140214
 -1.439908	  1.670549	  0.120910
 -1.442085	  1.678735	  0.103319
 -1.444185	  1.682784	  0.083258
 -1.450989	  1.687137	  0.064925
 -1.460402	  1.696844	  0.050578
 -1.473323	  1.717878	  0.035095
 -1.482468	  1.728140	  0.026662
 -1.495118	  1.734756	  0.018559
 -1.508744	  1.745002	  0.003987
 -1.517122	  1.758809	 -0.010841
 -1.522556	  1.768367	 -0.022339
 -1.535112	  1.782125	 -0.036625
 -1.546347	  1.794914	 -0.046730
 -1.554805	  1.805912	 -0.055447
 -1.569968	  1.820845	 -0.070018
 -1.587768	  1.834403	 -0.077399
 -1.601172	  1.842091	 -0.078296
 -1.612472	  1.853630	 -0.083404
 -1.624082	  1.871453	 -0.093468
 -1.635168	  1.886999	 -0.102082
 -1.649723	  1.901970	 -0.110894
 -1.662629	  1.915189	 -0.118556
