 0.0 0.0 0.0 0
 -0.616 0.448 0.648 500
 -0.647 -0.711 0.276 500
 0.826 0.183 -0.533 500
 0.096 0.85 -0.518 500
 0.754 0.554 0.353 500
 0.714 -0.694 -0.088 500
 0.409 -0.095 -0.908 500
 0.451 0.883 0.131 500
 0.0 0.0 0.0 0
 0.352 -0.827 -0.438 500
 0.172 0.098 0.98 500
 0.181 -0.977 0.109 500
 0.907 -0.27 -0.324 500
 -0.406 -0.653 -0.64 500
 -0.863 -0.111 -0.494 500
 0.279 0.936 -0.215 500
 0.787 0.617 0.017 500
 0.0 0.0 0.0 0
 -0.27 0.211 -0.939 500
 0.066 0.811 0.581 500
 0.966 0.037 -0.255 500
 -0.137 0.247 0.959 500
 -0.742 0.559 0.371 500
 0.644 0.441 0.625 500
 0.188 -0.868 0.46 500
 0.397 0.828 0.395 500
 0.0 0.0 0.0 0
 0.724 -0.143 -0.675 500
 0.308 0.376 0.874 500
 -0.424 -0.778 0.463 500
 -0.078 -0.997 -0.004 500
 0.359 0.22 -0.907 500
 -0.887 -0.374 0.269 500
 0.919 -0.131 0.371 500
 -0.408 0.344 0.845 500
 0.0 0.0 0.0 0
 -0.871 0.091 0.483 500
 -0.201 -0.642 -0.739 500
 -0.287 0.706 -0.648 500
 0.07 0.011 -0.997 500
 -0.643 -0.387 0.661 500
 -0.997 -0.076 0.017 500
 0.266 0.458 -0.848 500
 -0.853 0.478 -0.208 500
 0.0 0.0 0.0 0
 -0.251 -0.954 -0.161 500
 -0.012 0.738 -0.675 500
 0.977 -0.182 -0.107 500
 -0.091 0.891 0.444 500
 -0.872 -0.457 -0.173 500
 0.187 -0.444 -0.876 500
 0.651 -0.628 0.427 500
 0.265 0.872 -0.411 500
 0.0 0.0 0.0 0
 -0.637 0.768 -0.064 500
 -0.958 -0.048 -0.284 500
 -0.64 -0.768 0.01 500
 0.82 -0.199 0.538 500
 -0.736 -0.082 0.672 500
 -0.315 -0.707 0.633 500
 0.586 -0.182 0.789 500
 -0.035 0.676 0.736 500
 0.0 0.0 0.0 0
 0.05 0.528 -0.848 500
 -0.551 -0.763 -0.339 500
 -0.777 -0.345 0.527 500
 0.226 0.498 0.837 500
