 -2.152055	  0.302955	  2.111345
 -2.130747	  0.299955	  2.090441
 -2.101407	  0.274386	  2.064648
 -2.083257	  0.242698	  2.028464
 -2.054670	  0.212624	  1.997291
 -2.033000	  0.183515	  1.964748
 -2.014094	  0.153287	  1.929134
 -1.996998	  0.121015	  1.894067
 -1.981327	  0.088223	  1.860731
 -1.965471	  0.054158	  1.828350
 -1.947800	  0.019868	  1.797914
 -1.925459	 -0.014575	  1.768230
 -1.900563	 -0.047895	  1.739219
 -1.873921	 -0.081009	  1.709767
 -1.848481	 -0.111018	  1.682881
 -1.821462	 -0.142076	  1.655026
 -1.798217	 -0.173993	  1.624063
 -1.780081	 -0.206293	  1.590767
 -1.762409	 -0.241188	  1.557508
 -1.745937	 -0.279736	  1.524933
 -1.727457	 -0.315553	  1.496927
 -1.708214	 -0.348258	  1.469394
 -1.689976	 -0.382657	  1.437534
 -1.670426	 -0.416952	  1.404253
 -1.657271	 -0.446794	  1.364567
 -1.638794	 -0.476401	  1.331158
 -1.627399	 -0.507145	  1.293399
 -1.608656	 -0.538004	  1.257677
 -1.591071	 -0.573823	  1.223685
 -1.573227	 -0.611975	  1.194440
 -1.558184	 -0.650908	  1.168103
 -1.554748	 -0.686428	  1.144415
 -1.563035	 -0.712554	  1.126562
 -1.578456	 -0.728523	  1.116077
 -1.643537	 -0.769411	  1.085779
 -1.742795	 -0.859102	  0.989482
 -1.779908	 -0.931086	  0.912074
 -1.787996	 -0.974883	  0.867066
 -1.783298	 -1.020350	  0.825185
 -1.754832	 -1.074636	  0.782518
 -1.706641	 -1.117040	  0.750293
 -1.671665	 -1.137047	  0.735104
 -1.626884	 -1.153193	  0.721636
 -1.580653	 -1.162144	  0.711959
 -1.516415	 -1.166147	  0.703297
 -1.387826	 -1.158940	  0.689865
 -1.263423	 -1.165873	  0.660379
 -1.195634	 -1.188882	  0.626770
 -1.155911	 -1.213667	  0.595629
 -1.126529	 -1.241292	  0.561513
 -1.103723	 -1.272650	  0.524652
 -1.087043	 -1.304587	  0.490650
 -1.071958	 -1.339518	  0.457418
 -1.057100	 -1.376588	  0.426049
 -1.042798	 -1.414814	  0.399539
 -1.029974	 -1.456110	  0.376638
 -1.017648	 -1.499345	  0.360109
 -0.991717	 -1.570702	  0.349717
 -0.929666	 -1.678371	  0.382660
 -0.877048	 -1.756374	  0.420677
 -0.840793	 -1.806281	  0.437618
 -0.804357	 -1.857031	  0.443472
 -0.751417	 -1.924843	  0.435950
 -0.714416	 -1.967816	  0.421162
 -0.697788	 -1.986304	  0.406965
 -0.688819	 -1.995421	  0.393435
 -0.673452	 -2.010232	  0.346244
 -0.665204	 -2.014090	  0.281891
 -0.663512	 -2.011995	  0.191177
 -0.668396	 -2.016292	  0.100784
 -0.678349	 -2.024605	  0.035890
 -0.696947	 -2.037408	 -0.033547
 -0.709842	 -2.058135	 -0.133155
 -0.695240	 -2.081469	 -0.194244
 -0.674706	 -2.105767	 -0.234707
 -0.650981	 -2.133296	 -0.269298
 -0.627779	 -2.160334	 -0.299311
 -0.604564	 -2.189059	 -0.328577
 -0.580444	 -2.222824	 -0.359094
 -0.557439	 -2.255936	 -0.389426
 -0.534722	 -2.288452	 -0.421811
 -0.513209	 -2.318441	 -0.454739
 -0.491668	 -2.348345	 -0.489085
 -0.471259	 -2.378129	 -0.524617
 -0.451476	 -2.408799	 -0.558256
 -0.427043	 -2.441955	 -0.589950
 -0.404446	 -2.471777	 -0.619654
 -0.387935	 -2.497529	 -0.658415
 -0.360688	 -2.531666	 -0.684987
 -0.347987	 -2.566373	 -0.719532
 -0.321869	 -2.592844	 -0.752695
 -0.305627	 -2.625678	 -0.788377
 -0.282523	 -2.660958	 -0.818721
 -0.260762	 -2.691698	 -0.849313
 -0.244857	 -2.726909	 -0.884889
 -0.221568	 -2.762440	 -0.913880
 -0.198751	 -2.792952	 -0.947499
 -0.186989	 -2.828368	 -0.982532
 -0.188858	 -2.856652	 -0.992357
