 -2.416094	  0.525190	 -0.354832
 -2.418457	  0.526322	 -0.355037
 -2.400069	  0.518526	 -0.353591
 -2.381912	  0.510311	 -0.352093
 -2.363613	  0.502533	 -0.350823
 -2.345063	  0.495185	 -0.349780
 -2.326473	  0.487904	 -0.348810
 -2.307868	  0.480804	 -0.346625
 -2.289195	  0.474055	 -0.344267
 -2.270372	  0.467890	 -0.341418
 -2.251216	  0.463165	 -0.338490
 -2.231985	  0.458733	 -0.335454
 -2.212307	  0.455598	 -0.332731
 -2.192513	  0.453577	 -0.330233
 -2.172705	  0.452226	 -0.327810
 -2.152865	  0.451797	 -0.324832
 -2.134373	  0.452208	 -0.322948
 -2.113085	  0.452894	 -0.325068
 -2.089805	  0.453319	 -0.327275
 -2.067765	  0.454827	 -0.319684
 -2.055911	  0.456448	 -0.313761
 -2.035287	  0.460540	 -0.315000
 -2.011773	  0.464754	 -0.313814
 -1.992021	  0.466102	 -0.305381
 -1.977188	  0.466735	 -0.301197
 -1.949723	  0.470641	 -0.295528
 -1.929765	  0.472454	 -0.284359
 -1.918234	  0.472901	 -0.278135
 -1.895288	  0.469456	 -0.275332
 -1.877127	  0.466257	 -0.271830
 -1.859208	  0.464950	 -0.258809
 -1.843619	  0.461851	 -0.245418
 -1.825012	  0.459021	 -0.236306
 -1.807430	  0.455353	 -0.227618
 -1.789510	  0.451535	 -0.219440
 -1.771140	  0.445867	 -0.213636
 -1.752773	  0.439892	 -0.208381
 -1.734462	  0.433722	 -0.203217
 -1.715654	  0.427036	 -0.201506
 -1.696846	  0.420256	 -0.200143
 -1.678307	  0.412942	 -0.198642
 -1.659981	  0.406529	 -0.196625
 -1.640014	  0.403758	 -0.195471
 -1.618886	  0.402448	 -0.197750
 -1.597178	  0.399161	 -0.200137
 -1.576487	  0.391982	 -0.198590
 -1.559659	  0.377627	 -0.195105
 -1.543876	  0.356279	 -0.189386
 -1.533131	  0.341227	 -0.177830
 -1.521644	  0.329763	 -0.170020
 -1.507202	  0.322855	 -0.158792
 -1.491379	  0.316024	 -0.149673
 -1.475431	  0.310745	 -0.138749
 -1.458182	  0.304406	 -0.130406
 -1.440301	  0.298319	 -0.123899
 -1.422304	  0.291098	 -0.120082
 -1.404648	  0.279352	 -0.117095
 -1.392520	  0.265518	 -0.108147
 -1.377790	  0.249846	 -0.098238
 -1.358710	  0.241559	 -0.091313
 -1.342436	  0.238267	 -0.085443
 -1.318030	  0.236726	 -0.084056
 -1.294824	  0.234978	 -0.085264
 -1.274916	  0.227570	 -0.083605
 -1.261298	  0.217558	 -0.083608
 -1.248417	  0.206903	 -0.084324
 -1.228749	  0.195112	 -0.080308
 -1.211518	  0.185187	 -0.075070
 -1.194724	  0.175564	 -0.068422
 -1.176616	  0.167889	 -0.064160
 -1.158388	  0.162932	 -0.061484
 -1.135944	  0.160960	 -0.065869
 -1.111126	  0.162315	 -0.071375
 -1.088031	  0.160958	 -0.068986
 -1.071803	  0.158483	 -0.062468
 -1.055842	  0.156044	 -0.054488
 -1.031814	  0.152436	 -0.048117
 -1.013434	  0.146132	 -0.046460
 -0.999283	  0.141846	 -0.045043
 -0.977553	  0.134741	 -0.041419
 -0.955919	  0.127745	 -0.037014
 -0.943375	  0.123091	 -0.033012
 -0.924323	  0.115369	 -0.028233
 -0.900866	  0.108171	 -0.024831
 -0.882227	  0.103915	 -0.021698
 -0.864570	  0.103788	 -0.019207
 -0.841500	  0.105206	 -0.014027
 -0.824083	  0.105889	 -0.006626
 -0.804929	  0.106263	  0.001088
 -0.785328	  0.103078	  0.009688
 -0.767568	  0.095119	  0.014466
 -0.746685	  0.087162	  0.019336
 -0.730261	  0.082209	  0.021309
 -0.711737	  0.078389	  0.026217
 -0.689763	  0.072572	  0.029961
 -0.672203	  0.069506	  0.030835
 -0.650283	  0.063281	  0.030193
 -0.631276	  0.051483	  0.029919
 -0.618640	  0.038978	  0.029907
 -0.599773	  0.025601	  0.031780
 -0.586557	  0.020468	  0.034587
 -0.567014	  0.018824	  0.040582
 -0.537430	  0.010954	  0.044066
 -0.526605	  0.004010	  0.041662
 -0.507896	 -0.007357	  0.035805
 -0.483199	 -0.018526	  0.035642
 -0.471598	 -0.023417	  0.038938
 -0.450820	 -0.029077	  0.044915
 -0.429404	 -0.034271	  0.049435
 -0.412233	 -0.034060	  0.051690
 -0.383829	 -0.035160	  0.057063
 -0.371853	 -0.035576	  0.062316
 -0.353752	 -0.038271	  0.074517
 -0.335196	 -0.043098	  0.085082
 -0.319799	 -0.049708	  0.092193
 -0.299511	 -0.056680	  0.100177
 -0.279021	 -0.061863	  0.110096
 -0.267639	 -0.065235	  0.115493
 -0.249919	 -0.074029	  0.123112
 -0.234404	 -0.084136	  0.131177
 -0.215065	 -0.094960	  0.139680
 -0.190569	 -0.100153	  0.141479
 -0.176347	 -0.103731	  0.141964
 -0.156679	 -0.104867	  0.141872
 -0.133177	 -0.111060	  0.145412
 -0.117751	 -0.116474	  0.148597
 -0.100771	 -0.120680	  0.151593
 -0.078388	 -0.126297	  0.154710
 -0.059809	 -0.132172	  0.156114
 -0.041880	 -0.137149	  0.158975
 -0.020638	 -0.139552	  0.162348
  0.000264	 -0.145029	  0.162079
  0.015511	 -0.153864	  0.162640
  0.033089	 -0.162257	  0.166155
  0.058408	 -0.166017	  0.167132
  0.073942	 -0.167445	  0.169887
  0.090546	 -0.172859	  0.174379
  0.106485	 -0.184037	  0.175299
  0.135079	 -0.198164	  0.174756
  0.152205	 -0.199495	  0.180906
  0.165345	 -0.198858	  0.185747
  0.185994	 -0.200088	  0.195732
  0.208656	 -0.206224	  0.199435
  0.225212	 -0.208978	  0.199383
  0.246667	 -0.207249	  0.201264
  0.268081	 -0.208454	  0.207391
  0.282103	 -0.217433	  0.210686
  0.301759	 -0.227850	  0.212918
  0.320492	 -0.235855	  0.216425
  0.339793	 -0.240852	  0.219783
  0.359191	 -0.245039	  0.222637
  0.377925	 -0.251661	  0.224988
  0.396095	 -0.259721	  0.227201
  0.413754	 -0.268819	  0.229518
  0.430446	 -0.279542	  0.231988
  0.447274	 -0.290054	  0.234473
  0.464471	 -0.299980	  0.236889
  0.481503	 -0.310159	  0.239236
  0.499043	 -0.319048	  0.241800
  0.517869	 -0.325863	  0.244698
  0.536019	 -0.334269	  0.247311
  0.552691	 -0.344126	  0.251683
  0.569973	 -0.352669	  0.256810
  0.588335	 -0.359644	  0.261311
  0.606466	 -0.365967	  0.266904
  0.624334	 -0.372488	  0.272887
  0.642354	 -0.378083	  0.279612
  0.660453	 -0.383161	  0.286564
  0.678554	 -0.387761	  0.293817
  0.696329	 -0.391035	  0.302330
  0.713283	 -0.395312	  0.309176
  0.732271	 -0.402333	  0.315077
  0.749723	 -0.408501	  0.324548
  0.768734	 -0.408379	  0.341674
  0.783848	 -0.405098	  0.352656
  0.802381	 -0.405850	  0.361387
  0.819496	 -0.410222	  0.364438
  0.839709	 -0.416588	  0.368232
  0.859807	 -0.421472	  0.369023
  0.876642	 -0.423542	  0.370565
  0.910301	 -0.420697	  0.378085
  0.923893	 -0.419706	  0.381383
  0.936330	 -0.419242	  0.384853
  0.960802	 -0.424396	  0.385672
  0.981901	 -0.428896	  0.387432
  0.995197	 -0.431478	  0.389126
  1.022758	 -0.434266	  0.389342
  1.045179	 -0.437058	  0.392764
  1.057488	 -0.440610	  0.397584
  1.072997	 -0.448195	  0.403086
  1.094478	 -0.456629	  0.406566
  1.113371	 -0.463463	  0.409272
  1.131283	 -0.471667	  0.412853
  1.149219	 -0.479769	  0.416418
  1.167391	 -0.487206	  0.420221
  1.185663	 -0.494318	  0.424166
  1.203943	 -0.501413	  0.428094
  1.223083	 -0.506896	  0.429966
  1.242365	 -0.512014	  0.431402
  1.261648	 -0.517125	  0.432830
  1.281412	 -0.520091	  0.432273
  1.300910	 -0.518843	  0.428014
  1.320407	 -0.517571	  0.423739
  1.339903	 -0.516300	  0.419463
  1.359383	 -0.515023	  0.415151
  1.376303	 -0.512882	  0.404724
  1.390244	 -0.510268	  0.390627
  1.404166	 -0.507651	  0.376509
  1.418088	 -0.505033	  0.362391
  1.432011	 -0.502416	  0.348273
  1.445915	 -0.499865	  0.334145
  1.458357	 -0.504280	  0.319137
  1.470362	 -0.509910	  0.304164
  1.482364	 -0.515546	  0.289192
  1.494367	 -0.521183	  0.274220
  1.506457	 -0.526833	  0.259412
  1.521712	 -0.534469	  0.249289
  1.537776	 -0.542752	  0.242130
  1.553749	 -0.552805	  0.244349
  1.570259	 -0.563372	  0.247869
  1.586862	 -0.573862	  0.251938
  1.603479	 -0.584328	  0.255506
  1.620111	 -0.594806	  0.259382
  1.636414	 -0.606250	  0.261742
  1.652171	 -0.618599	  0.262373
  1.667894	 -0.630939	  0.262807
  1.683624	 -0.643289	  0.263327
  1.699349	 -0.655631	  0.263800
  1.715073	 -0.667982	  0.264381
  1.730768	 -0.680361	  0.264961
  1.744966	 -0.694163	  0.262194
  1.758054	 -0.708182	  0.257743
  1.772760	 -0.718895	  0.252573
  1.789918	 -0.718118	  0.252886
  1.800259	 -0.713515	  0.261468
  1.817867	 -0.725322	  0.267415
  1.836978	 -0.732759	  0.276585
  1.853664	 -0.734041	  0.287854
  1.866509	 -0.730441	  0.300863
  1.880129	 -0.723266	  0.314045
  1.896416	 -0.720230	  0.326787
  1.914267	 -0.719493	  0.337319
  1.928537	 -0.719109	  0.350051
  1.939495	 -0.718064	  0.366250
  1.950904	 -0.721867	  0.381316
  1.962185	 -0.724885	  0.397860
  1.977174	 -0.732444	  0.408065
  1.991267	 -0.732910	  0.417470
  2.010669	 -0.738156	  0.417275
  2.032445	 -0.742297	  0.416574
  2.053969	 -0.748090	  0.418337
  2.071966	 -0.759214	  0.416349
  2.085951	 -0.768335	  0.422714
  2.103453	 -0.777210	  0.431994
  2.118063	 -0.778663	  0.443586
  2.146338	 -0.780832	  0.456230
  2.158664	 -0.781246	  0.464258
  2.178231	 -0.786664	  0.467130
  2.197394	 -0.794240	  0.467728
  2.214909	 -0.801491	  0.472093
  2.227589	 -0.809628	  0.483200
  2.243779	 -0.817713	  0.495207
  2.264437	 -0.823167	  0.507532
  2.288259	 -0.825755	  0.513993
  2.298346	 -0.825709	  0.517225
  2.316669	 -0.836031	  0.530610
  2.335457	 -0.840485	  0.535822
