  2.429852	 -0.484821	 -0.282162
  2.453809	 -0.478683	 -0.280047
  2.436344	 -0.483839	 -0.280603
  2.415125	 -0.489037	 -0.279421
  2.394786	 -0.494121	 -0.280112
  2.376390	 -0.500345	 -0.282553
  2.358029	 -0.505968	 -0.285281
  2.338725	 -0.510792	 -0.288044
  2.318298	 -0.517116	 -0.290665
  2.300690	 -0.523651	 -0.293551
  2.282563	 -0.530336	 -0.296495
  2.263706	 -0.536335	 -0.298844
  2.243779	 -0.543407	 -0.301140
  2.226404	 -0.552138	 -0.303647
  2.209427	 -0.560712	 -0.306090
  2.191349	 -0.568315	 -0.308891
  2.173295	 -0.575913	 -0.310317
  2.153782	 -0.584160	 -0.312483
  2.136233	 -0.591462	 -0.317322
  2.116621	 -0.600292	 -0.325271
  2.098079	 -0.611996	 -0.330735
  2.080681	 -0.625162	 -0.327836
  2.063810	 -0.636624	 -0.319372
  2.049803	 -0.648781	 -0.306977
  2.037013	 -0.664074	 -0.293480
  2.028306	 -0.679559	 -0.281672
  2.022305	 -0.696426	 -0.272709
  2.017005	 -0.714961	 -0.264857
  2.012778	 -0.733495	 -0.257231
  2.005557	 -0.748832	 -0.246108
  1.997641	 -0.763390	 -0.234649
  1.989854	 -0.778715	 -0.224074
  1.982183	 -0.794648	 -0.214417
  1.975835	 -0.811753	 -0.206449
  1.969088	 -0.828020	 -0.202210
  1.960666	 -0.843688	 -0.204078
  1.944267	 -0.860790	 -0.209886
  1.926096	 -0.884957	 -0.204169
  1.922379	 -0.890771	 -0.203773
  1.912710	 -0.903426	 -0.205977
  1.894157	 -0.926382	 -0.202754
  1.887973	 -0.932938	 -0.202867
  1.874776	 -0.946222	 -0.203573
  1.858397	 -0.961640	 -0.206794
  1.846042	 -0.970450	 -0.212747
  1.833017	 -0.980942	 -0.222100
  1.820483	 -0.992171	 -0.233127
  1.808473	 -0.999120	 -0.242111
  1.793693	 -1.003897	 -0.253860
  1.779933	 -1.009623	 -0.264592
  1.762798	 -1.017912	 -0.277869
  1.747494	 -1.024178	 -0.291499
  1.736726	 -1.025741	 -0.300816
  1.721209	 -1.027868	 -0.314426
  1.706342	 -1.029996	 -0.330133
  1.696452	 -1.031359	 -0.344420
  1.688393	 -1.032724	 -0.359467
  1.680296	 -1.032993	 -0.383386
  1.673430	 -1.034063	 -0.401209
  1.663733	 -1.037646	 -0.419361
  1.652307	 -1.041653	 -0.433042
  1.634845	 -1.045382	 -0.447192
  1.618173	 -1.047678	 -0.461282
  1.604218	 -1.048212	 -0.476075
  1.590528	 -1.046880	 -0.490042
  1.578176	 -1.045047	 -0.504662
  1.569043	 -1.042933	 -0.522056
  1.560568	 -1.038852	 -0.542591
  1.549844	 -1.034303	 -0.561315
  1.536703	 -1.029995	 -0.573604
  1.519591	 -1.025480	 -0.582068
  1.499484	 -1.021821	 -0.588405
  1.481249	 -1.018095	 -0.597496
  1.465635	 -1.013503	 -0.610008
  1.453862	 -1.008773	 -0.626320
  1.444615	 -1.002922	 -0.644666
  1.431676	 -0.994030	 -0.657089
  1.410405	 -0.985375	 -0.660273
  1.386281	 -0.985548	 -0.665162
  1.364917	 -0.988199	 -0.673200
  1.347606	 -0.990411	 -0.680235
  1.331065	 -0.992439	 -0.685550
  1.308450	 -0.994689	 -0.693669
  1.285607	 -0.998619	 -0.702832
  1.272865	 -0.999909	 -0.706601
  1.253959	 -1.000373	 -0.710617
  1.232154	 -1.000338	 -0.713757
  1.211985	 -1.002220	 -0.717836
  1.192537	 -1.004773	 -0.720925
  1.173395	 -1.006743	 -0.721885
  1.152993	 -1.008101	 -0.722428
  1.133075	 -1.010474	 -0.722545
  1.113270	 -1.014886	 -0.722147
  1.093643	 -1.018971	 -0.722456
  1.073871	 -1.022116	 -0.723859
  1.054914	 -1.025428	 -0.724726
  1.035043	 -1.030547	 -0.724867
  1.014841	 -1.036419	 -0.725115
  0.996616	 -1.041967	 -0.725588
  0.978856	 -1.047678	 -0.726874
  0.963345	 -1.054502	 -0.729585
  0.941109	 -1.065356	 -0.731963
  0.921292	 -1.075134	 -0.731857
  0.895610	 -1.083393	 -0.718258
  0.886400	 -1.086026	 -0.710244
  0.875086	 -1.091222	 -0.702365
  0.846571	 -1.101870	 -0.694756
  0.830303	 -1.108809	 -0.691846
  0.820894	 -1.114496	 -0.693753
  0.800536	 -1.126324	 -0.694027
  0.775463	 -1.137971	 -0.690143
  0.761730	 -1.142082	 -0.684929
  0.742486	 -1.144971	 -0.676515
  0.722669	 -1.150041	 -0.670474
  0.705415	 -1.153788	 -0.665730
  0.680728	 -1.155487	 -0.657646
  0.659364	 -1.158260	 -0.653350
  0.648163	 -1.160904	 -0.652216
  0.630124	 -1.169297	 -0.645888
  0.616225	 -1.180711	 -0.631467
  0.597599	 -1.183500	 -0.621676
  0.573462	 -1.186361	 -0.614158
  0.559972	 -1.188506	 -0.608903
  0.538744	 -1.189809	 -0.600197
  0.517399	 -1.190761	 -0.588565
  0.503985	 -1.193137	 -0.581187
  0.485641	 -1.198536	 -0.570378
  0.471734	 -1.204209	 -0.559694
  0.458004	 -1.210179	 -0.548126
  0.435964	 -1.220623	 -0.535745
  0.418611	 -1.226450	 -0.530766
  0.404864	 -1.231457	 -0.528102
  0.384588	 -1.237758	 -0.522537
  0.366339	 -1.243858	 -0.513797
  0.352351	 -1.247529	 -0.506207
  0.327659	 -1.253133	 -0.493636
  0.310226	 -1.255465	 -0.488348
  0.295727	 -1.255895	 -0.485930
  0.270695	 -1.255622	 -0.479872
  0.254261	 -1.255860	 -0.473091
  0.235744	 -1.258460	 -0.466031
  0.216933	 -1.266551	 -0.469283
  0.196417	 -1.273767	 -0.470096
  0.177867	 -1.281631	 -0.470688
  0.160057	 -1.290854	 -0.472256
  0.142212	 -1.299844	 -0.473547
  0.124670	 -1.309429	 -0.474544
  0.108114	 -1.320573	 -0.475842
  0.091630	 -1.331820	 -0.477174
  0.075708	 -1.343842	 -0.478456
  0.061237	 -1.357598	 -0.479539
  0.046897	 -1.371368	 -0.480560
  0.033560	 -1.385444	 -0.479033
  0.023634	 -1.402642	 -0.473546
  0.014902	 -1.421258	 -0.470594
  0.006181	 -1.440477	 -0.473470
 -0.005258	 -1.459517	 -0.481596
 -0.019205	 -1.473015	 -0.489768
 -0.035311	 -1.483427	 -0.493175
 -0.055729	 -1.493510	 -0.490407
 -0.074602	 -1.506600	 -0.483291
 -0.083485	 -1.524877	 -0.478884
 -0.088334	 -1.543696	 -0.477288
 -0.092397	 -1.564440	 -0.483279
 -0.096573	 -1.586734	 -0.490843
 -0.102712	 -1.608833	 -0.495482
 -0.109203	 -1.623337	 -0.497391
 -0.121780	 -1.641571	 -0.496508
 -0.131212	 -1.658520	 -0.494742
 -0.137686	 -1.675351	 -0.495916
 -0.142249	 -1.694311	 -0.500317
 -0.145519	 -1.714531	 -0.503149
 -0.150569	 -1.731021	 -0.501652
 -0.167182	 -1.749233	 -0.500757
 -0.182806	 -1.768853	 -0.503548
 -0.187933	 -1.783501	 -0.510148
 -0.190820	 -1.800011	 -0.522023
 -0.195393	 -1.817816	 -0.532826
 -0.201988	 -1.834012	 -0.540275
 -0.210340	 -1.849389	 -0.544295
 -0.224322	 -1.868308	 -0.546935
 -0.242983	 -1.884065	 -0.552966
 -0.257090	 -1.895454	 -0.561015
 -0.268260	 -1.904941	 -0.577872
 -0.275428	 -1.914011	 -0.590488
 -0.284196	 -1.923499	 -0.607686
 -0.294817	 -1.932710	 -0.625350
 -0.304660	 -1.937471	 -0.638368
 -0.317038	 -1.942020	 -0.651551
 -0.333501	 -1.948719	 -0.662097
 -0.350999	 -1.955214	 -0.673212
 -0.363778	 -1.955979	 -0.681771
 -0.382025	 -1.958244	 -0.695815
 -0.395012	 -1.956091	 -0.706082
 -0.411953	 -1.956338	 -0.717323
 -0.430929	 -1.963218	 -0.721204
 -0.451177	 -1.959330	 -0.728802
 -0.469208	 -1.954150	 -0.736186
 -0.487920	 -1.948104	 -0.739700
 -0.506685	 -1.941991	 -0.742929
 -0.525454	 -1.935834	 -0.745960
 -0.544380	 -1.929445	 -0.745475
 -0.563296	 -1.923008	 -0.744641
 -0.582210	 -1.916579	 -0.743720
 -0.601072	 -1.910305	 -0.741562
 -0.619922	 -1.904047	 -0.739213
 -0.638801	 -1.897750	 -0.737068
 -0.657781	 -1.891904	 -0.734517
 -0.676912	 -1.886925	 -0.731504
 -0.696092	 -1.881961	 -0.728692
 -0.714939	 -1.877120	 -0.725324
 -0.733341	 -1.872646	 -0.725311
 -0.755443	 -1.870464	 -0.729098
 -0.775091	 -1.868519	 -0.727391
 -0.794650	 -1.864734	 -0.716965
 -0.813030	 -1.863974	 -0.707325
 -0.833072	 -1.865818	 -0.700571
 -0.852410	 -1.864898	 -0.695253
 -0.871003	 -1.860873	 -0.691340
 -0.889608	 -1.858138	 -0.688737
 -0.911537	 -1.858324	 -0.685181
 -0.933369	 -1.859396	 -0.684022
 -0.951794	 -1.858229	 -0.683352
 -0.968483	 -1.852977	 -0.681112
 -0.988274	 -1.851624	 -0.679562
 -1.015313	 -1.856496	 -0.669803
 -1.032415	 -1.856308	 -0.657563
 -1.044085	 -1.853195	 -0.646301
 -1.061452	 -1.844868	 -0.636281
 -1.080499	 -1.837311	 -0.631067
 -1.099478	 -1.833550	 -0.625202
 -1.118224	 -1.831299	 -0.618318
 -1.137013	 -1.829543	 -0.611616
 -1.155810	 -1.827838	 -0.604977
 -1.174083	 -1.825773	 -0.597064
 -1.191779	 -1.823464	 -0.588006
 -1.209305	 -1.821219	 -0.578658
 -1.226928	 -1.819435	 -0.569369
 -1.244534	 -1.819393	 -0.559929
 -1.262078	 -1.819337	 -0.550929
 -1.278918	 -1.820862	 -0.544921
 -1.296646	 -1.832299	 -0.542929
 -1.318829	 -1.842868	 -0.532768
 -1.336548	 -1.838210	 -0.522518
 -1.353115	 -1.831682	 -0.511396
 -1.372975	 -1.833765	 -0.501454
 -1.391474	 -1.842716	 -0.494118
 -1.403232	 -1.850386	 -0.491349
 -1.423233	 -1.859853	 -0.494114
 -1.444169	 -1.864248	 -0.486235
 -1.462558	 -1.871143	 -0.482453
