 -0.173492	 -0.858059	 -2.348902
 -0.175149	 -0.855149	 -2.342657
 -0.178168	 -0.849845	 -2.331276
 -0.183238	 -0.840752	 -2.314200
 -0.188398	 -0.831458	 -2.297258
 -0.193796	 -0.821682	 -2.280668
 -0.199367	 -0.811557	 -2.264344
 -0.205310	 -0.800877	 -2.248513
 -0.211736	 -0.789483	 -2.233384
 -0.218250	 -0.777911	 -2.218429
 -0.224980	 -0.765903	 -2.203920
 -0.231711	 -0.753896	 -2.189410
 -0.238568	 -0.742949	 -2.174142
 -0.245509	 -0.732941	 -2.158277
 -0.252451	 -0.722935	 -2.142414
 -0.259578	 -0.713566	 -2.126245
 -0.267109	 -0.705778	 -2.109433
 -0.274641	 -0.697993	 -2.092621
 -0.282190	 -0.690472	 -2.075695
 -0.289786	 -0.683926	 -2.058391
 -0.297381	 -0.677382	 -2.041085
 -0.304926	 -0.671139	 -2.023647
 -0.312456	 -0.665519	 -2.006051
 -0.321092	 -0.659844	 -1.988968
 -0.329812	 -0.654841	 -1.971190
 -0.337082	 -0.650431	 -1.953202
 -0.342751	 -0.645552	 -1.934787
 -0.348218	 -0.641835	 -1.915932
 -0.353896	 -0.639606	 -1.897161
 -0.360717	 -0.636372	 -1.878077
 -0.369109	 -0.631937	 -1.859330
 -0.379229	 -0.626456	 -1.842845
 -0.391969	 -0.616646	 -1.827493
 -0.398458	 -0.608781	 -1.811286
 -0.403592	 -0.603730	 -1.793084
 -0.407828	 -0.599707	 -1.774382
 -0.413297	 -0.596053	 -1.754787
 -0.419982	 -0.591352	 -1.736219
 -0.428039	 -0.586350	 -1.718449
 -0.437815	 -0.581768	 -1.702043
 -0.447235	 -0.571527	 -1.683130
 -0.456741	 -0.561181	 -1.667927
 -0.461853	 -0.546521	 -1.651847
 -0.456385	 -0.539392	 -1.635631
 -0.454084	 -0.536822	 -1.613215
 -0.454246	 -0.528337	 -1.595271
 -0.465517	 -0.509790	 -1.578041
 -0.472143	 -0.500278	 -1.568409
 -0.474319	 -0.494921	 -1.549016
 -0.470692	 -0.480276	 -1.531927
 -0.470311	 -0.461478	 -1.523446
 -0.472082	 -0.448550	 -1.513473
 -0.468104	 -0.431949	 -1.500665
 -0.458692	 -0.414686	 -1.493384
 -0.458166	 -0.398745	 -1.482459
 -0.454277	 -0.379995	 -1.478073
 -0.449532	 -0.357714	 -1.472593
 -0.443743	 -0.340133	 -1.468011
 -0.433017	 -0.324302	 -1.461753
 -0.417764	 -0.309841	 -1.452956
 -0.413273	 -0.296209	 -1.443181
 -0.406635	 -0.277253	 -1.435532
 -0.400673	 -0.258291	 -1.428933
 -0.397428	 -0.240767	 -1.420027
 -0.400246	 -0.223463	 -1.411254
 -0.402595	 -0.205664	 -1.401936
 -0.393655	 -0.185500	 -1.393371
 -0.389145	 -0.170216	 -1.381224
 -0.388788	 -0.159146	 -1.367145
 -0.389189	 -0.145127	 -1.351633
 -0.389083	 -0.130507	 -1.337438
 -0.389788	 -0.116958	 -1.322863
 -0.392153	 -0.105334	 -1.307614
 -0.395800	 -0.095082	 -1.291012
 -0.400672	 -0.087192	 -1.273635
 -0.404872	 -0.080089	 -1.254111
 -0.407044	 -0.078236	 -1.233496
 -0.408363	 -0.073522	 -1.216642
 -0.416221	 -0.066837	 -1.199144
 -0.423989	 -0.065650	 -1.178977
 -0.427208	 -0.068079	 -1.160694
 -0.431281	 -0.071961	 -1.141650
 -0.441177	 -0.077609	 -1.120062
 -0.454806	 -0.084236	 -1.106319
 -0.454329	 -0.087655	 -1.089598
 -0.458574	 -0.097076	 -1.071967
 -0.466907	 -0.107702	 -1.054999
 -0.476041	 -0.114263	 -1.039934
 -0.489322	 -0.122235	 -1.025218
 -0.503164	 -0.131690	 -1.012770
 -0.511885	 -0.141172	 -1.000873
 -0.523098	 -0.150117	 -0.986402
 -0.536746	 -0.161488	 -0.973619
 -0.548023	 -0.171887	 -0.959704
 -0.554607	 -0.178153	 -0.947007
 -0.564894	 -0.186105	 -0.929627
 -0.575540	 -0.193892	 -0.910964
 -0.586246	 -0.200211	 -0.896072
 -0.596877	 -0.205022	 -0.879443
 -0.607578	 -0.210867	 -0.864495
 -0.621360	 -0.218626	 -0.851140
 -0.632169	 -0.221373	 -0.833991
 -0.639766	 -0.226362	 -0.816196
 -0.646101	 -0.224729	 -0.797120
 -0.654729	 -0.224117	 -0.777221
 -0.660288	 -0.219004	 -0.758562
 -0.665804	 -0.218549	 -0.737122
 -0.670478	 -0.219055	 -0.722298
 -0.679599	 -0.218263	 -0.702917
 -0.690461	 -0.217852	 -0.684897
 -0.699726	 -0.219480	 -0.668288
 -0.707032	 -0.217024	 -0.648301
 -0.714957	 -0.212989	 -0.629405
 -0.721299	 -0.207418	 -0.613587
 -0.725630	 -0.203220	 -0.593655
 -0.728471	 -0.197283	 -0.572472
 -0.731331	 -0.191012	 -0.554820
 -0.736847	 -0.183004	 -0.538429
 -0.743031	 -0.176086	 -0.519717
 -0.746532	 -0.169913	 -0.501785
 -0.754084	 -0.167560	 -0.482603
 -0.761921	 -0.164488	 -0.464282
 -0.767348	 -0.159726	 -0.447481
 -0.776598	 -0.158769	 -0.428383
 -0.783760	 -0.156360	 -0.407825
 -0.785937	 -0.149899	 -0.390288
 -0.789446	 -0.144102	 -0.372182
 -0.802145	 -0.142430	 -0.351640
 -0.806375	 -0.133543	 -0.333393
 -0.806181	 -0.125266	 -0.315223
 -0.802713	 -0.116452	 -0.297692
 -0.806051	 -0.110745	 -0.277510
 -0.809536	 -0.099950	 -0.260632
 -0.809146	 -0.090875	 -0.244136
 -0.811682	 -0.083791	 -0.222831
 -0.816162	 -0.072889	 -0.204594
 -0.816580	 -0.064105	 -0.193253
 -0.821492	 -0.054566	 -0.174211
 -0.826830	 -0.044418	 -0.155063
 -0.829597	 -0.036982	 -0.138917
 -0.835488	 -0.029521	 -0.121498
 -0.842128	 -0.021462	 -0.101850
 -0.846255	 -0.015285	 -0.086414
 -0.854447	 -0.006087	 -0.067583
 -0.862547	  0.001929	 -0.048986
 -0.865583	  0.010033	 -0.033539
 -0.875054	  0.015150	 -0.017619
 -0.882502	  0.021881	  0.002996
 -0.885349	  0.029087	  0.019714
 -0.892528	  0.036984	  0.034704
 -0.898247	  0.048840	  0.054569
 -0.895317	  0.059679	  0.072456
 -0.896092	  0.068560	  0.089179
 -0.900761	  0.074388	  0.107775
 -0.910842	  0.084041	  0.126675
 -0.917577	  0.096201	  0.138281
 -0.923259	  0.102813	  0.157406
 -0.930910	  0.107900	  0.177250
 -0.939826	  0.111173	  0.191972
 -0.948168	  0.116876	  0.210605
 -0.953686	  0.120943	  0.229253
 -0.958708	  0.124028	  0.248791
 -0.964576	  0.127693	  0.267156
 -0.972773	  0.135021	  0.285230
 -0.982213	  0.144153	  0.301560
 -0.991333	  0.151311	  0.317163
 -0.998567	  0.154964	  0.334501
 -1.005279	  0.160146	  0.353401
 -1.014196	  0.167321	  0.370600
 -1.022042	  0.179264	  0.385227
 -1.026766	  0.189883	  0.401030
 -1.030333	  0.200143	  0.418056
 -1.037110	  0.211572	  0.434456
 -1.045865	  0.219474	  0.450592
 -1.052625	  0.224279	  0.468185
 -1.059933	  0.230510	  0.486413
 -1.066398	  0.238612	  0.503340
 -1.072484	  0.245257	  0.520806
 -1.079999	  0.248833	  0.540113
 -1.088885	  0.254384	  0.557902
 -1.094042	  0.262242	  0.573445
 -1.099606	  0.264819	  0.592919
 -1.108010	  0.266711	  0.613233
 -1.115867	  0.272112	  0.629936
 -1.121349	  0.278509	  0.646620
 -1.125394	  0.283670	  0.665563
 -1.131195	  0.289048	  0.687716
 -1.135739	  0.294072	  0.703965
 -1.139589	  0.298227	  0.722159
 -1.142714	  0.304251	  0.743278
 -1.147708	  0.308062	  0.762205
 -1.154080	  0.308421	  0.779964
 -1.159268	  0.312778	  0.799140
 -1.163410	  0.318249	  0.816351
 -1.170320	  0.323845	  0.839853
 -1.175806	  0.325339	  0.857511
 -1.177747	  0.331784	  0.873231
 -1.180718	  0.341456	  0.893307
 -1.185852	  0.347301	  0.911436
 -1.192669	  0.348057	  0.931626
 -1.197767	  0.354026	  0.950199
 -1.201529	  0.361858	  0.965929
 -1.206207	  0.368591	  0.985103
 -1.212621	  0.371671	  1.005628
 -1.215870	  0.376512	  1.024157
 -1.218620	  0.382808	  1.042651
 -1.223069	  0.396327	  1.057883
 -1.227348	  0.405380	  1.076018
 -1.229997	  0.411721	  1.093028
 -1.235758	  0.422496	  1.109647
 -1.242084	  0.433604	  1.129891
 -1.247578	  0.438735	  1.145298
 -1.253288	  0.448977	  1.162917
 -1.252838	  0.456512	  1.180767
 -1.257470	  0.463821	  1.198447
 -1.262727	  0.476881	  1.216126
 -1.263004	  0.485131	  1.233121
 -1.266144	  0.490977	  1.252623
 -1.268391	  0.500764	  1.269843
 -1.267808	  0.510166	  1.287209
 -1.271235	  0.521448	  1.303692
 -1.275875	  0.530022	  1.322013
 -1.273870	  0.542408	  1.339104
 -1.280188	  0.555307	  1.353168
 -1.290859	  0.565086	  1.370608
 -1.293561	  0.571977	  1.386724
 -1.295849	  0.581504	  1.404966
 -1.298073	  0.589454	  1.422454
 -1.303857	  0.596350	  1.441006
 -1.308263	  0.608417	  1.458263
 -1.309548	  0.616615	  1.475781
 -1.311345	  0.622110	  1.494982
 -1.314365	  0.630205	  1.514313
 -1.321549	  0.637187	  1.531394
 -1.329326	  0.639823	  1.549322
 -1.336935	  0.643860	  1.567196
 -1.344076	  0.653132	  1.585755
 -1.349791	  0.658178	  1.604484
 -1.354296	  0.659270	  1.622596
 -1.359611	  0.662632	  1.643140
 -1.365520	  0.666489	  1.663426
 -1.370212	  0.668980	  1.678876
 -1.376154	  0.670363	  1.699814
 -1.382146	  0.674009	  1.719627
 -1.387664	  0.681770	  1.735652
 -1.393688	  0.686230	  1.755205
 -1.399526	  0.691997	  1.773780
 -1.405105	  0.700919	  1.790339
 -1.410477	  0.706755	  1.809038
 -1.415868	  0.713797	  1.828025
 -1.421017	  0.725066	  1.842842
 -1.426113	  0.735008	  1.860180
 -1.430547	  0.740372	  1.878214
 -1.441132	  0.756870	  1.917513
 -1.445979	  0.764858	  1.935197
