  2.080712	 -0.867266	  0.960886
  2.173963	 -0.839443	  0.992757
  2.155750	 -0.844878	  0.986533
  2.137537	 -0.850240	  0.980275
  2.119435	 -0.851137	  0.971843
  2.101525	 -0.850925	  0.962947
  2.083615	 -0.850698	  0.954049
  2.065705	 -0.850472	  0.945150
  2.047795	 -0.850245	  0.936251
  2.029885	 -0.850019	  0.927352
  2.011976	 -0.849792	  0.918454
  1.994109	 -0.849525	  0.909525
  1.976921	 -0.848148	  0.899676
  1.961857	 -0.846160	  0.888636
  1.946995	 -0.846494	  0.873717
  1.932342	 -0.842961	  0.858569
  1.913302	 -0.839126	  0.846825
  1.899598	 -0.841379	  0.839570
  1.884689	 -0.842141	  0.824900
  1.868490	 -0.842538	  0.810930
  1.851792	 -0.846795	  0.800808
  1.838353	 -0.853349	  0.786346
  1.832549	 -0.863313	  0.769195
  1.827735	 -0.872921	  0.752316
  1.822033	 -0.881542	  0.735019
  1.816229	 -0.890234	  0.717969
  1.814655	 -0.900299	  0.700732
  1.814899	 -0.911166	  0.683422
  1.816367	 -0.920340	  0.666048
  1.817945	 -0.932614	  0.649641
  1.820092	 -0.943224	  0.633186
  1.823059	 -0.954576	  0.617168
  1.825876	 -0.966210	  0.601972
  1.828735	 -0.977890	  0.586491
  1.831095	 -0.989329	  0.570310
  1.833709	 -0.998157	  0.553679
  1.836591	 -1.005931	  0.536214
  1.838929	 -1.012456	  0.517609
  1.842380	 -1.016745	  0.498574
  1.845716	 -1.020599	  0.479476
  1.849303	 -1.024754	  0.460569
  1.853568	 -1.029872	  0.441810
  1.858391	 -1.033990	  0.421899
  1.863477	 -1.040619	  0.402913
  1.868079	 -1.046867	  0.384291
  1.873102	 -1.055974	  0.367097
  1.879868	 -1.069053	  0.347248
  1.885379	 -1.088009	  0.332940
  1.887350	 -1.101139	  0.324680
  1.890457	 -1.115291	  0.310498
  1.895621	 -1.130153	  0.296862
  1.901772	 -1.146593	  0.285111
  1.909307	 -1.162007	  0.273993
  1.916887	 -1.176296	  0.261750
  1.924735	 -1.187450	  0.247732
  1.931598	 -1.199367	  0.232974
  1.936649	 -1.210894	  0.217486
  1.939578	 -1.223511	  0.202157
  1.941213	 -1.237367	  0.187392
  1.941543	 -1.253026	  0.174596
  1.944138	 -1.269839	  0.163616
  1.951650	 -1.286292	  0.152789
  1.959604	 -1.299780	  0.139940
  1.965330	 -1.311701	  0.125012
  1.968754	 -1.324078	  0.108934
  1.969677	 -1.337553	  0.094462
  1.970677	 -1.351778	  0.080157
  1.972539	 -1.366009	  0.065918
  1.975029	 -1.379768	  0.051595
  1.978794	 -1.393109	  0.037129
  1.983179	 -1.406279	  0.022638
  1.988021	 -1.419466	  0.008118
  1.993638	 -1.431524	 -0.006882
  2.000273	 -1.442409	 -0.022211
  2.005241	 -1.453568	 -0.038046
