  0.848214	 -2.351818	 -1.711837
  0.839816	 -2.328532	 -1.694888
  0.840941	 -2.275146	 -1.683592
  0.844477	 -2.224395	 -1.671183
  0.838189	 -2.177370	 -1.655814
  0.837208	 -2.127607	 -1.645797
  0.834145	 -2.077904	 -1.635952
  0.834039	 -2.030240	 -1.624506
  0.825845	 -1.982993	 -1.614947
  0.820384	 -1.935572	 -1.604519
  0.815712	 -1.887485	 -1.594297
  0.811552	 -1.837572	 -1.585750
  0.807651	 -1.786822	 -1.575903
  0.805925	 -1.737523	 -1.565520
  0.807389	 -1.689329	 -1.553444
  0.811062	 -1.640690	 -1.539694
  0.814806	 -1.593058	 -1.526155
  0.817772	 -1.547521	 -1.512046
  0.819970	 -1.499943	 -1.498570
  0.818843	 -1.450896	 -1.487499
  0.815057	 -1.401166	 -1.477573
  0.810493	 -1.352187	 -1.466868
  0.805287	 -1.303835	 -1.455453
  0.799510	 -1.257183	 -1.443988
  0.792713	 -1.209534	 -1.432973
  0.785889	 -1.160473	 -1.423364
  0.779807	 -1.110192	 -1.414842
  0.773821	 -1.059667	 -1.406970
  0.767930	 -1.010252	 -1.399745
  0.761775	 -0.959895	 -1.393330
  0.754842	 -0.908463	 -1.388198
  0.747231	 -0.861330	 -1.384955
  0.738144	 -0.821208	 -1.384380
  0.725177	 -0.784653	 -1.387413
  0.691783	 -0.730324	 -1.400777
  0.636380	 -0.692020	 -1.432870
  0.628402	 -0.698236	 -1.496102
  0.675229	 -0.643411	 -1.594400
  0.748607	 -0.588130	 -1.685630
  0.779990	 -0.571187	 -1.739450
  0.772986	 -0.542605	 -1.768695
  0.764048	 -0.465536	 -1.824232
  0.794827	 -0.341892	 -1.877490
  0.841344	 -0.159772	 -1.874683
  0.843999	  0.001255	 -1.767157
  0.799441	  0.111375	 -1.659052
  0.741079	  0.170706	 -1.572027
  0.674276	  0.169185	 -1.469717
  0.650150	  0.149551	 -1.406806
  0.647665	  0.146779	 -1.368340
  0.653520	  0.157747	 -1.320940
  0.661640	  0.176187	 -1.278230
  0.669277	  0.197950	 -1.242408
  0.678908	  0.237079	 -1.196691
  0.685773	  0.275030	 -1.166924
  0.690334	  0.314877	 -1.146680
  0.694253	  0.360674	 -1.131308
  0.696896	  0.406819	 -1.118706
  0.696998	  0.453990	 -1.104620
  0.695359	  0.500356	 -1.083364
  0.694489	  0.546939	 -1.070797
  0.695821	  0.599411	 -1.078105
  0.698594	  0.650701	 -1.080518
  0.701486	  0.702146	 -1.071112
  0.702522	  0.751758	 -1.056855
  0.702054	  0.799412	 -1.041426
  0.700819	  0.845840	 -1.026194
  0.699183	  0.893558	 -1.011628
  0.697219	  0.942596	 -0.999079
  0.695501	  0.992016	 -0.990624
  0.694610	  1.037389	 -0.989056
  0.694889	  1.082067	 -0.995254
  0.696581	  1.145357	 -1.019921
  0.698113	  1.277820	 -1.128108
  0.743228	  1.407525	 -1.378898
  0.835957	  1.477507	 -1.514038
  0.849398	  1.491457	 -1.525910
  0.867106	  1.523383	 -1.532940
  0.885975	  1.582860	 -1.526624
  0.898861	  1.640276	 -1.495660
  0.901218	  1.684730	 -1.453468
  0.885512	  1.739045	 -1.355583
  0.816828	  1.752801	 -1.215910
  0.766077	  1.766166	 -1.112565
  0.709383	  1.784173	 -0.992689
  0.657150	  1.794728	 -0.877223
  0.643486	  1.823015	 -0.828914
  0.645337	  1.870165	 -0.812124
  0.648543	  1.918431	 -0.800425
  0.650974	  1.966167	 -0.789511
  0.651478	  2.015122	 -0.778533
  0.647679	  2.062978	 -0.768091
  0.638820	  2.111331	 -0.756285
  0.625619	  2.159917	 -0.742907
  0.615071	  2.206878	 -0.731452
  0.609588	  2.255663	 -0.721720
  0.605417	  2.306056	 -0.711789
  0.602928	  2.355942	 -0.700591
  0.601862	  2.403057	 -0.688965
  0.600913	  2.449203	 -0.677372
  0.599318	  2.495362	 -0.665675
  0.597403	  2.543804	 -0.653094
  0.597126	  2.594093	 -0.640929
  0.596022	  2.645415	 -0.627773
  0.600868	  2.695539	 -0.617828
  0.602127	  2.745864	 -0.608751
  0.599895	  2.793664	 -0.596416
  0.593659	  2.840073	 -0.595410
  0.588917	  2.883206	 -0.583350
  0.594806	  2.912038	 -0.589184
