  1.388705	 -0.787605	  2.575282
  1.374955	 -0.779807	  2.549784
  1.336671	 -0.756692	  2.531315
  1.299364	 -0.741334	  2.503916
  1.266317	 -0.727522	  2.469897
  1.228686	 -0.714353	  2.439427
  1.188989	 -0.697510	  2.413074
  1.147953	 -0.682901	  2.387369
  1.108448	 -0.666694	  2.360715
  1.069852	 -0.648728	  2.333885
  1.031749	 -0.629426	  2.307619
  0.993710	 -0.609545	  2.281748
  0.955926	 -0.589445	  2.255773
  0.917351	 -0.569663	  2.230779
  0.876747	 -0.551135	  2.208746
  0.835534	 -0.534147	  2.187487
  0.793882	 -0.518739	  2.165850
  0.751849	 -0.506815	  2.142756
  0.708627	 -0.504023	  2.115672
  0.662277	 -0.516053	  2.078124
  0.611909	 -0.546795	  2.023188
  0.558809	 -0.590187	  1.959847
  0.505258	 -0.636117	  1.904450
  0.461042	 -0.671183	  1.857649
  0.421445	 -0.696773	  1.813545
  0.383987	 -0.714680	  1.769147
  0.352871	 -0.722259	  1.722687
  0.324505	 -0.716799	  1.674661
  0.291221	 -0.686857	  1.619250
  0.251863	 -0.639975	  1.573753
  0.212437	 -0.594621	  1.547312
  0.175976	 -0.553659	  1.534328
  0.136484	 -0.508943	  1.528565
  0.101432	 -0.469550	  1.527989
  0.073805	 -0.439792	  1.530225
  0.040305	 -0.406077	  1.534988
 -0.008310	 -0.359718	  1.539576
 -0.066174	 -0.303035	  1.536796
 -0.117019	 -0.250202	  1.527609
 -0.154187	 -0.210994	  1.516194
 -0.183660	 -0.182390	  1.505100
 -0.214151	 -0.155937	  1.492485
 -0.247590	 -0.129653	  1.477717
 -0.283100	 -0.104885	  1.461205
 -0.321854	 -0.080839	  1.442111
 -0.362275	 -0.057624	  1.420449
 -0.402555	 -0.035234	  1.396830
 -0.442312	 -0.013087	  1.372628
 -0.480885	  0.009671	  1.348737
 -0.518001	  0.033310	  1.325236
 -0.554768	  0.058095	  1.301559
 -0.591620	  0.083126	  1.277034
 -0.629437	  0.107390	  1.251326
 -0.668012	  0.128785	  1.224433
 -0.705600	  0.145986	  1.196867
 -0.743169	  0.159243	  1.168138
 -0.781859	  0.170185	  1.139382
 -0.821960	  0.179140	  1.112687
 -0.862340	  0.186918	  1.087306
 -0.903162	  0.194121	  1.061919
 -0.945709	  0.201019	  1.035966
 -0.989638	  0.207746	  1.008964
 -1.033123	  0.215934	  0.979988
 -1.074742	  0.227116	  0.949811
 -1.114917	  0.242477	  0.919932
 -1.153666	  0.262740	  0.891943
 -1.190120	  0.287282	  0.866632
 -1.224943	  0.316276	  0.844207
 -1.263664	  0.356507	  0.823189
 -1.309790	  0.425905	  0.805138
 -1.352425	  0.525691	  0.797033
 -1.388990	  0.629166	  0.796085
 -1.419442	  0.706475	  0.797935
 -1.445311	  0.757401	  0.799251
 -1.470046	  0.795779	  0.800337
 -1.497859	  0.829466	  0.801428
 -1.532783	  0.860874	  0.802449
 -1.580073	  0.892099	  0.804909
 -1.651125	  0.924404	  0.811401
 -1.747354	  0.947674	  0.824064
 -1.862154	  0.936323	  0.831912
 -1.955827	  0.889994	  0.809912
 -2.004618	  0.837636	  0.764370
 -2.023969	  0.806857	  0.720672
 -2.037256	  0.782526	  0.662223
 -2.045010	  0.756385	  0.567461
 -2.046087	  0.741720	  0.457031
 -2.048625	  0.738399	  0.365406
 -2.059248	  0.739794	  0.311475
 -2.076472	  0.744392	  0.274972
 -2.103672	  0.752727	  0.242306
 -2.139616	  0.764606	  0.213257
 -2.180611	  0.777231	  0.187127
 -2.222984	  0.790327	  0.162275
 -2.264889	  0.802323	  0.137168
 -2.305764	  0.811891	  0.111579
 -2.347747	  0.820885	  0.086822
 -2.392094	  0.829812	  0.061849
 -2.435811	  0.840875	  0.034390
 -2.476930	  0.854964	  0.004865
 -2.516296	  0.870085	 -0.024698
 -2.554562	  0.885291	 -0.053077
 -2.592132	  0.900574	 -0.080256
 -2.629489	  0.916544	 -0.106912
 -2.666604	  0.933925	 -0.133971
 -2.703184	  0.953069	 -0.162062
 -2.739685	  0.973114	 -0.191527
 -2.776617	  0.993101	 -0.221140
 -2.812186	  1.013794	 -0.252648
 -2.840308	  1.023931	 -0.255175
