 -1.016656	 -2.738118	  0.806240
 -1.006590	 -2.711007	  0.798257
 -0.980293	 -2.664618	  0.781803
 -0.963842	 -2.626248	  0.751913
 -0.947265	 -2.588238	  0.726707
 -0.923872	 -2.548811	  0.709518
 -0.900559	 -2.513060	  0.683168
 -0.887873	 -2.470705	  0.658895
 -0.864488	 -2.428962	  0.639692
 -0.847482	 -2.388267	  0.613019
 -0.828275	 -2.348338	  0.588590
 -0.805017	 -2.311503	  0.566232
 -0.780130	 -2.276236	  0.545449
 -0.754150	 -2.237960	  0.523230
 -0.729189	 -2.197711	  0.501015
 -0.707040	 -2.157361	  0.478515
 -0.688217	 -2.116428	  0.454428
 -0.672856	 -2.075392	  0.429162
 -0.660063	 -2.035256	  0.402840
 -0.648023	 -1.996362	  0.376308
 -0.634733	 -1.957142	  0.348885
 -0.618391	 -1.918237	  0.320647
 -0.598235	 -1.884024	  0.293025
 -0.572360	 -1.855023	  0.266094
 -0.522845	 -1.825761	  0.229787
 -0.412732	 -1.808996	  0.187756
 -0.291637	 -1.823297	  0.162073
 -0.229371	 -1.833492	  0.137902
 -0.181245	 -1.829408	  0.116113
 -0.136023	 -1.811788	  0.086482
 -0.044230	 -1.785234	  0.063186
 -0.008354	 -1.752886	  0.048522
 -0.020241	 -1.700362	  0.012693
 -0.027273	 -1.652190	 -0.001430
 -0.026183	 -1.598707	 -0.020780
 -0.034547	 -1.543087	 -0.049791
 -0.048729	 -1.503819	 -0.069417
 -0.074391	 -1.458878	 -0.093175
 -0.109924	 -1.404407	 -0.122936
 -0.152329	 -1.342652	 -0.152248
 -0.207583	 -1.254342	 -0.182980
 -0.232136	 -1.170731	 -0.201695
 -0.220563	 -1.116119	 -0.226652
 -0.195693	 -1.078981	 -0.251982
 -0.168515	 -1.046199	 -0.275921
 -0.139689	 -1.011437	 -0.296523
 -0.109444	 -0.971964	 -0.315507
 -0.081796	 -0.931020	 -0.334555
 -0.057003	 -0.890269	 -0.353412
 -0.034379	 -0.847297	 -0.373746
 -0.015124	 -0.805304	 -0.394066
  0.002291	 -0.763915	 -0.414603
  0.020220	 -0.725091	 -0.435511
  0.041652	 -0.686593	 -0.458723
  0.062136	 -0.648618	 -0.482353
  0.080401	 -0.609862	 -0.504359
  0.097536	 -0.569904	 -0.526181
  0.114517	 -0.528506	 -0.550232
  0.129808	 -0.486439	 -0.575881
  0.144153	 -0.443434	 -0.601521
  0.158640	 -0.400708	 -0.626723
  0.173726	 -0.359685	 -0.652277
  0.188605	 -0.322223	 -0.676880
  0.206114	 -0.284594	 -0.703364
  0.226990	 -0.246011	 -0.730432
  0.249725	 -0.209222	 -0.756027
  0.273801	 -0.173421	 -0.781317
  0.298030	 -0.137814	 -0.807241
  0.321187	 -0.102016	 -0.833585
  0.344080	 -0.065392	 -0.859871
  0.365248	 -0.029358	 -0.884720
  0.386376	  0.009672	 -0.910524
  0.406113	  0.049549	 -0.934698
  0.425080	  0.087571	 -0.955092
  0.447446	  0.126877	 -0.972853
  0.470457	  0.172042	 -0.987552
  0.491306	  0.222608	 -0.998883
  0.509300	  0.271758	 -1.009604
  0.524849	  0.316985	 -1.019801
  0.537466	  0.354081	 -1.026972
  0.549267	  0.387943	 -1.030224
  0.567794	  0.448361	 -1.027431
  0.585561	  0.558411	 -1.001341
  0.596420	  0.640210	 -0.970019
  0.607933	  0.724816	 -0.943462
  0.616193	  0.790335	 -0.932339
  0.623692	  0.841808	 -0.933551
  0.634061	  0.892364	 -0.946048
  0.646889	  0.937552	 -0.969962
  0.659678	  0.966647	 -0.999351
  0.677628	  1.001260	 -1.050928
  0.694719	  1.023602	 -1.107788
  0.706149	  1.034283	 -1.156895
  0.714159	  1.038849	 -1.210253
  0.721655	  1.036653	 -1.277288
  0.744187	  1.028115	 -1.382105
  0.799348	  1.027450	 -1.487353
  0.842448	  1.049797	 -1.541152
  0.871584	  1.081490	 -1.572381
  0.895289	  1.117639	 -1.597804
  0.918032	  1.156237	 -1.622738
  0.941352	  1.195901	 -1.648973
  0.963810	  1.233303	 -1.674954
  0.985455	  1.270512	 -1.700073
  1.006051	  1.307805	 -1.723864
  1.026553	  1.347369	 -1.747655
  1.045037	  1.385920	 -1.769485
  1.062852	  1.425914	 -1.791225
  1.080287	  1.468766	 -1.814060
  1.095007	  1.509550	 -1.835925
  1.111848	  1.551519	 -1.860564
  1.129780	  1.592975	 -1.884708
  1.147249	  1.638228	 -1.903510
  1.167141	  1.673721	 -1.935310
  1.182850	  1.714041	 -1.959683
  1.206386	  1.748986	 -1.981298
  1.221327	  1.786450	 -2.009563
  1.236755	  1.824699	 -2.034923
  1.249122	  1.842946	 -2.055272
