 -0.918689	  1.623352	  2.387810
 -0.909593	  1.607280	  2.364168
 -0.876205	  1.575271	  2.347790
 -0.850811	  1.549777	  2.320296
 -0.826221	  1.514131	  2.288833
 -0.793606	  1.486316	  2.266480
 -0.764585	  1.453470	  2.242678
 -0.736063	  1.415940	  2.213987
 -0.702969	  1.387810	  2.188931
 -0.673303	  1.351888	  2.167023
 -0.647544	  1.320554	  2.139608
 -0.622981	  1.288232	  2.116574
 -0.597477	  1.254711	  2.091219
 -0.571348	  1.222104	  2.067530
 -0.541919	  1.186570	  2.040157
 -0.515072	  1.154309	  2.013502
 -0.489323	  1.125225	  1.986687
 -0.461342	  1.096670	  1.957831
 -0.429921	  1.062977	  1.925869
 -0.405078	  1.034789	  1.900721
 -0.376824	  1.001486	  1.872437
 -0.348616	  0.966323	  1.846495
 -0.324622	  0.936129	  1.824959
 -0.297869	  0.903084	  1.800679
 -0.267991	  0.866859	  1.776317
 -0.240213	  0.832815	  1.753253
 -0.214214	  0.800469	  1.732326
 -0.184337	  0.763582	  1.709220
 -0.154613	  0.729462	  1.685168
 -0.128029	  0.698428	  1.660495
 -0.101547	  0.665252	  1.634790
 -0.076799	  0.634158	  1.610387
 -0.048772	  0.599941	  1.583480
 -0.019606	  0.566628	  1.556334
  0.007391	  0.535907	  1.531361
  0.038380	  0.501870	  1.503483
  0.065289	  0.471754	  1.478009
  0.091057	  0.443083	  1.444961
  0.098539	  0.432293	  1.416409
  0.082308	  0.412753	  1.330830
  0.072809	  0.399783	  1.274795
  0.088648	  0.408960	  1.163703
  0.070939	  0.368507	  1.065740
  0.052520	  0.333637	  1.013014
  0.062060	  0.329160	  0.986876
  0.068922	  0.315782	  0.961602
  0.105741	  0.263368	  0.872903
  0.147978	  0.198894	  0.829616
  0.210334	  0.117454	  0.764490
  0.220942	  0.096767	  0.764352
  0.233219	  0.086880	  0.764127
  0.277387	  0.040049	  0.772853
  0.348960	 -0.015333	  0.752729
  0.423859	 -0.072270	  0.730397
  0.470792	 -0.105540	  0.776799
  0.497798	 -0.116110	  0.812839
  0.535742	 -0.157594	  0.858461
  0.597532	 -0.190106	  0.914233
  0.668855	 -0.250075	  0.922487
  0.702921	 -0.283315	  0.903732
  0.730788	 -0.316258	  0.880834
  0.761913	 -0.350249	  0.854172
  0.792984	 -0.383826	  0.825722
  0.819075	 -0.410952	  0.802392
  0.849787	 -0.443602	  0.774446
  0.879486	 -0.475191	  0.747769
  0.908415	 -0.506978	  0.722767
  0.933193	 -0.535996	  0.700568
  0.961187	 -0.569833	  0.675848
  0.992337	 -0.606153	  0.648467
  1.021365	 -0.640071	  0.622778
  1.047858	 -0.673901	  0.596301
  1.071483	 -0.704320	  0.573107
  1.095569	 -0.736765	  0.552610
  1.110616	 -0.776231	  0.546170
  1.091042	 -0.888951	  0.609722
  1.100539	 -1.040334	  0.673997
  1.180085	 -1.053372	  0.719395
  1.089082	 -1.160213	  0.648408
  1.144566	 -1.243049	  0.751551
  1.413424	 -1.234798	  0.838354
  1.595173	 -1.305096	  0.938243
  1.521620	 -1.359434	  0.955879
  1.453282	 -1.435381	  0.737143
  1.395556	 -1.385093	  0.592450
  1.424885	 -1.379226	  0.491774
  1.476534	 -1.358117	  0.454302
  1.460509	 -1.366974	  0.369173
  1.459135	 -1.361511	  0.321648
  1.530497	 -1.277683	  0.167729
  1.576001	 -1.292145	  0.119766
  1.607360	 -1.318012	  0.090927
  1.636155	 -1.347271	  0.065394
  1.665382	 -1.380146	  0.040016
  1.694957	 -1.416313	  0.014793
  1.720749	 -1.448894	 -0.006736
  1.749221	 -1.482755	 -0.030298
  1.777809	 -1.516928	 -0.055295
  1.804288	 -1.550189	 -0.079525
  1.829248	 -1.583346	 -0.102578
  1.855190	 -1.617065	 -0.126815
  1.881998	 -1.649515	 -0.152516
  1.910949	 -1.681527	 -0.178969
  1.941586	 -1.713601	 -0.207340
  1.971363	 -1.745802	 -0.235636
  1.999921	 -1.778155	 -0.263363
  2.023438	 -1.805401	 -0.288006
  2.049292	 -1.840625	 -0.312950
  2.077682	 -1.877887	 -0.335021
  2.106463	 -1.910785	 -0.366715
  2.131128	 -1.945589	 -0.387791
  2.161819	 -1.971763	 -0.415119
  2.181084	 -2.010828	 -0.446589
  2.202895	 -2.030936	 -0.451055
