 0.0 0.0 0.0 0
 -0.8690712990659202 -0.2804578707418372 -0.18121196937719572 1000
 0.08966331107022635 0.9407999200191979 0.7452569276572126 1000
 -0.626507371729206 -0.34318113551685503 0.8074458214232374 1000
 0.3068108810652513 -0.5337178349602406 -1.1823485127508722 1000
 0.9546415841076075 0.0017848054316446649 -0.7023590738350988 1000
 -0.20147106483952879 -0.3196625562897013 0.8678557938784192 1000
 -0.8450058514606597 0.5285073805584901 0.68585486944786 1000
 0.01895542491102037 -0.8555734884208399 -0.9425547321855443 1000
 0.0 0.0 0.0 0
 0.9461803009237646 0.24218213847127945 -0.06529054401875645 1000
 0.7497458941466596 -0.17980951132750111 -1.0463816121844691 1000
 0.26852178117321496 -0.953539543165415 -0.4350904966941927 1000
 -0.07582275967882604 0.5223056442032136 1.1407785075600299 1000
 -0.6541969912890282 -0.715909284271334 -0.3145740324129419 1000
 -0.7112667572543698 -0.5823968759968184 0.4187275736198312 1000
 -0.44295650042180773 0.6183362135557767 1.1393554337327403 1000
 -0.6225412180700145 -0.26522443861310435 -0.6101503866819135 1000
 0.0 0.0 0.0 0
 -0.9017436402419943 0.13935027404498235 0.8604735650153671 1000
 -0.4410361238755236 0.8065407197197964 0.17541482359121763 1000
