 0.0 0.0 0.0 0
 0.9983376835332312 -0.04311312074354495 0.033371270698848515 1000
 0.30352185035641854 0.1747929163488386 0.8218363243631678 1000
 0.36572614598810144 0.6654801949343792 -0.5232752697978795 1000
 -0.7360136542070963 0.6045794851435324 0.2162797164574483 1000
 -0.802209851710534 -0.1384709035762135 -0.5510424256614577 1000
 -0.045718391820378096 -0.7251654057012278 -0.5974932278635162 1000
 -0.8776364627884381 0.3984551977349188 -0.28323949801243237 1000
 -0.4577984922508331 -0.26855726027144355 0.6890364469167074 1000
 0.0 0.0 0.0 0
 0.15485940790426606 -0.7309747106541162 0.5699881789525852 1000
 0.07101039481073976 0.03945131187053037 -0.8454081109139766 1000
 0.8151978106091794 -0.19877068165205186 0.5172822055591824 1000
 -0.2515767137630733 -0.492429679469877 -0.7336280235023993 1000
 0.657707634895836 -0.4207767320889511 -0.49335081557898175 1000
 -0.7812977808150973 -0.4485131010630007 -0.4275597062039277 1000
 0.7182100433699746 0.28640067134102576 -0.4890664826711982 1000
 0.10971044811486852 0.9939437625188942 0.013820952091861488 1000
 0.0 0.0 0.0 0
 -0.3295555948627806 0.47758764508349627 -0.7117821080916328 1000
 0.9542504575175089 0.254484808538723 -0.0687521050105526 1000
 0.5734997659320439 0.12471687980361723 0.7311387262424263 1000
 -0.1973398503193795 -0.5271705326635371 0.6863789801356849 1000
 0.3300615842478031 -0.5006939243862751 -0.665836613419605 1000
 -0.21641539637330298 -0.848865852541616 0.3868261881289889 1000
 0.24561616285358412 -0.11709957380730279 0.8361548425627395 1000
 0.36158567811121994 0.786397488730626 0.46007283475613775 1000
 0.0 0.0 0.0 0
 -0.3660426945103273 -0.013889541542716237 0.7693199047170124 1000
 -0.712923073306974 0.45257225250770367 -0.5000048967325997 1000
 0.9411835444900021 -0.3350481361778496 0.08285756191139612 1000
 0.9146371952645556 0.22443937340366 0.3512825009759517 1000
 -0.6656526898508042 0.6970041022238838 -0.2630262694482045 1000
 -0.8702056986964426 -0.4827894937370878 0.021291615283477644 1000
 0.6767303415514452 -0.09235779638140557 0.6679252016872133 1000
 0.2665516578843742 0.9310615106865856 -0.18343904552314239 1000
 0.0 0.0 0.0 0
 0.6365349435463185 0.6436933806363331 0.4126283457791298 1000
 0.6313196872209363 0.7538822788519575 -0.1028485243094551 1000
 -0.33232348691390023 0.22082396982424893 0.7621464167566497 1000
 -0.0021698009102276705 0.9780867102124446 0.18809405090669506 1000
 -0.1074208344116267 0.5615924465482095 -0.7013149116790649 1000
 -0.40875493022434345 -0.3567573117092029 -0.7484233975916841 1000
 -0.11643302371369102 0.8743734028530488 -0.400273676340988 1000
 -0.4311744043256543 0.06219967026748269 -0.7965596140386985 1000
 0.0 0.0 0.0 0
 0.2765841523549667 0.6760569607073096 0.6084511274073359 1000
 -0.8564599152896956 0.4979085926053569 0.06252673157459346 1000
 -0.42345221372208636 -0.7933046485781645 0.33647058962367316 1000
 0.38017351904021013 -0.9248614502070125 0.0007774390477877924 1000
 0.7626388407282123 -0.5428786372898433 0.3456074447085762 1000
 -0.4994021043607585 0.42264122020299527 0.616053824714643 1000
 -0.4913289338044082 0.8010134308041165 -0.31534548672940543 1000
 0.10867924680414091 0.36437625196181944 0.8004315611303884 1000
 0.0 0.0 0.0 0
 0.9708283917069143 -0.16285319364455997 -0.08435550280354312 1000
 -0.28686668795543535 -0.9586068514492604 -0.017168341671917747 1000
 0.871899627342885 -0.017844498767361938 0.47610258422638635 1000
 0.03164542158933259 -0.9891370722252097 0.11073653787309587 1000
 0.7651480632177752 -0.478512433669264 -0.32134226550871847 1000
 0.18235551923684912 -0.1026187449861806 -0.822961198042907 1000
 -0.6199147098427322 -0.7835302758052229 -0.0824150993516019 1000
 -0.9410226376990309 -0.16451119606346926 0.1880162095617104 1000
 0.0 0.0 0.0 0
 0.05461317865095755 0.8293873779808907 -0.46164466336819077 1000
 -0.4088944530159114 -0.532911561820045 -0.6658547335319315 1000
 -0.7787267505755184 -0.12288334909785498 0.4708750885161197 1000
 0.48309513387088254 -0.5785944350085979 -0.5337262186216782 1000
