  2.302358	  1.015828	  0.143444
  2.304039	  1.021068	  0.143563
  2.297933	  1.002028	  0.143132
  2.291801	  0.982997	  0.142701
  2.284265	  0.964478	  0.142261
  2.275599	  0.946459	  0.141815
  2.266878	  0.928469	  0.141371
  2.256226	  0.911550	  0.140956
  2.244975	  0.895168	  0.140638
  2.250297	  0.877132	  0.146862
  2.258881	  0.860131	  0.154388
  2.266849	  0.843954	  0.163070
  2.276043	  0.829034	  0.172976
  2.285601	  0.814543	  0.182802
  2.294298	  0.799319	  0.192325
  2.304029	  0.784991	  0.201963
  2.311547	  0.769195	  0.210627
  2.320275	  0.753224	  0.218820
  2.328312	  0.736490	  0.227130
  2.334778	  0.719173	  0.234799
  2.341124	  0.702936	  0.244527
  2.347183	  0.687481	  0.254586
  2.352223	  0.670586	  0.263910
  2.358708	  0.653735	  0.272691
  2.363578	  0.635991	  0.280569
  2.369667	  0.618869	  0.288606
  2.373373	  0.600766	  0.295533
  2.378866	  0.582995	  0.302187
  2.383865	  0.564808	  0.306899
  2.385695	  0.544031	  0.311446
  2.384695	  0.525235	  0.317792
  2.385556	  0.506785	  0.329647
  2.389558	  0.490552	  0.337268
  2.391560	  0.473102	  0.340117
  2.387145	  0.452848	  0.340670
  2.383438	  0.431778	  0.343040
  2.377152	  0.414712	  0.343579
  2.377239	  0.393748	  0.350663
  2.376852	  0.374374	  0.351589
  2.371797	  0.354409	  0.346966
  2.364973	  0.334896	  0.354936
  2.354434	  0.320074	  0.360798
  2.339433	  0.305592	  0.362121
  2.327684	  0.287530	  0.362823
  2.320763	  0.267633	  0.362908
  2.315139	  0.250808	  0.356320
  2.304563	  0.233311	  0.352356
  2.295543	  0.216112	  0.348927
  2.286920	  0.201272	  0.338648
  2.276662	  0.186636	  0.329694
  2.264719	  0.169887	  0.325106
  2.253907	  0.154604	  0.317358
  2.243799	  0.143212	  0.305931
  2.232265	  0.131660	  0.294594
  2.221464	  0.116670	  0.280495
  2.211360	  0.103076	  0.272146
  2.200277	  0.087852	  0.262886
  2.185080	  0.077014	  0.254053
  2.169304	  0.069431	  0.245055
  2.146215	  0.066890	  0.236713
  2.125061	  0.062886	  0.231983
  2.107662	  0.061415	  0.221518
  2.092150	  0.059270	  0.208023
  2.078695	  0.050398	  0.200735
  2.061618	  0.039596	  0.191047
  2.046603	  0.032206	  0.185485
  2.028655	  0.027959	  0.175779
  2.013071	  0.026468	  0.162116
  1.994044	  0.025685	  0.151662
  1.975342	  0.025818	  0.145609
  1.955062	  0.016817	  0.146333
  1.936320	  0.010995	  0.143022
  1.917786	  0.007473	  0.136079
  1.900035	  0.005513	  0.127345
  1.879466	  0.006095	  0.121578
  1.861523	  0.002262	  0.117541
  1.842422	 -0.000863	  0.111820
  1.824359	 -0.004612	  0.104156
  1.805632	 -0.007742	  0.096929
  1.786597	 -0.010755	  0.091022
  1.767835	 -0.013362	  0.085138
  1.750211	 -0.016347	  0.077412
  1.731904	 -0.021864	  0.066556
  1.715256	 -0.024563	  0.058214
  1.694899	 -0.028809	  0.055461
  1.672857	 -0.035964	  0.049180
  1.660243	 -0.045997	  0.037682
  1.647090	 -0.055876	  0.027097
  1.633204	 -0.069171	  0.019948
  1.619073	 -0.082417	  0.012936
  1.605513	 -0.092985	  0.004178
  1.587790	 -0.100811	 -0.006492
  1.573064	 -0.110559	 -0.014280
  1.560602	 -0.121327	 -0.022662
  1.544542	 -0.132204	 -0.033058
  1.531930	 -0.142238	 -0.044277
  1.520860	 -0.153720	 -0.055225
  1.509549	 -0.166073	 -0.067112
  1.497674	 -0.176730	 -0.079149
  1.485536	 -0.187642	 -0.090973
  1.472457	 -0.196409	 -0.104152
  1.463062	 -0.209218	 -0.117412
  1.452747	 -0.219785	 -0.130255
  1.443815	 -0.232292	 -0.143874
  1.436251	 -0.246340	 -0.157042
  1.429168	 -0.260899	 -0.168993
  1.426945	 -0.277140	 -0.178099
  1.436825	 -0.296988	 -0.178246
  1.444298	 -0.314389	 -0.178290
  1.452973	 -0.334844	 -0.176751
  1.458955	 -0.352162	 -0.173066
  1.466376	 -0.370081	 -0.166919
  1.478508	 -0.387433	 -0.164705
  1.490410	 -0.402394	 -0.165588
  1.500797	 -0.418407	 -0.161427
  1.513361	 -0.433402	 -0.153243
  1.527754	 -0.447567	 -0.147263
  1.538529	 -0.463124	 -0.143447
  1.548908	 -0.479925	 -0.139528
  1.559696	 -0.496198	 -0.134086
  1.570164	 -0.512534	 -0.128330
  1.579143	 -0.529772	 -0.123020
  1.587824	 -0.547326	 -0.118492
  1.598022	 -0.564431	 -0.115649
  1.606622	 -0.582932	 -0.119225
  1.619850	 -0.597370	 -0.113476
  1.630675	 -0.614580	 -0.114013
  1.641108	 -0.631583	 -0.115990
  1.651017	 -0.648986	 -0.118740
  1.659508	 -0.665471	 -0.128448
  1.666647	 -0.681175	 -0.134500
  1.675385	 -0.700174	 -0.134812
  1.682659	 -0.717274	 -0.141672
  1.688827	 -0.734900	 -0.149265
  1.698735	 -0.750930	 -0.157006
  1.702992	 -0.768374	 -0.168336
  1.714554	 -0.771821	 -0.190437
  1.725625	 -0.787230	 -0.195267
  1.731690	 -0.796721	 -0.211644
  1.746327	 -0.807053	 -0.224908
  1.757485	 -0.813978	 -0.240473
  1.764154	 -0.819082	 -0.256732
  1.771634	 -0.826527	 -0.274507
  1.779286	 -0.834991	 -0.291351
  1.787250	 -0.842261	 -0.307840
  1.794660	 -0.849866	 -0.325076
  1.800735	 -0.859778	 -0.340471
  1.807049	 -0.867860	 -0.356714
  1.812429	 -0.880575	 -0.371391
  1.817873	 -0.891853	 -0.386857
  1.823089	 -0.904233	 -0.401659
  1.828839	 -0.915847	 -0.417049
  1.834362	 -0.928042	 -0.431801
  1.839304	 -0.942960	 -0.442859
  1.843619	 -0.956740	 -0.452898
  1.847859	 -0.973132	 -0.461952
  1.851657	 -0.992101	 -0.467626
  1.855565	 -1.010823	 -0.473274
  1.859782	 -1.029384	 -0.479662
  1.863537	 -1.048214	 -0.484795
  1.867557	 -1.067117	 -0.490156
  1.869780	 -1.085646	 -0.490173
  1.871827	 -1.103842	 -0.492605
  1.871838	 -1.123968	 -0.491305
  1.870935	 -1.143989	 -0.489856
  1.871512	 -1.164239	 -0.488965
  1.871106	 -1.182317	 -0.481943
  1.877617	 -1.202631	 -0.477343
  1.879559	 -1.219878	 -0.467669
  1.876156	 -1.236665	 -0.459170
  1.869891	 -1.253238	 -0.448517
  1.867946	 -1.271736	 -0.441674
  1.864778	 -1.287988	 -0.431354
  1.859135	 -1.304751	 -0.420303
  1.854516	 -1.320911	 -0.409974
  1.847773	 -1.338545	 -0.402152
  1.838018	 -1.355263	 -0.395367
  1.833680	 -1.369974	 -0.383866
  1.823466	 -1.385745	 -0.376033
  1.812639	 -1.402124	 -0.371945
  1.799667	 -1.416595	 -0.369489
  1.785835	 -1.429167	 -0.365409
  1.771124	 -1.443159	 -0.362241
  1.755482	 -1.456666	 -0.359838
  1.738183	 -1.466108	 -0.364793
  1.720061	 -1.474844	 -0.367152
  1.704998	 -1.487206	 -0.367331
  1.688795	 -1.502007	 -0.369601
  1.675670	 -1.513071	 -0.370931
  1.659542	 -1.525631	 -0.369427
  1.639342	 -1.536142	 -0.373723
  1.623846	 -1.546585	 -0.378516
  1.609000	 -1.559452	 -0.377958
  1.592662	 -1.571223	 -0.377432
  1.575502	 -1.580980	 -0.377263
  1.558302	 -1.590675	 -0.375735
  1.540717	 -1.602853	 -0.376938
  1.521754	 -1.612703	 -0.379841
  1.506162	 -1.619133	 -0.379545
  1.487872	 -1.629618	 -0.377927
  1.471336	 -1.640864	 -0.376784
  1.454797	 -1.652575	 -0.375497
  1.438528	 -1.664103	 -0.374594
  1.423335	 -1.676548	 -0.372040
  1.409234	 -1.689803	 -0.368125
  1.394701	 -1.702590	 -0.363726
  1.382010	 -1.715166	 -0.356363
  1.369435	 -1.726646	 -0.348179
  1.356452	 -1.737095	 -0.337710
  1.344876	 -1.744348	 -0.323957
  1.332848	 -1.751875	 -0.311703
  1.321479	 -1.757716	 -0.296325
  1.310218	 -1.763356	 -0.280830
  1.300004	 -1.767595	 -0.264144
  1.289646	 -1.773084	 -0.248233
  1.280078	 -1.777408	 -0.231240
  1.270809	 -1.781756	 -0.214166
  1.261595	 -1.786877	 -0.196960
  1.252299	 -1.790902	 -0.179648
  1.241040	 -1.797213	 -0.164278
  1.230129	 -1.801727	 -0.147905
  1.217775	 -1.807290	 -0.132742
  1.206347	 -1.810755	 -0.117034
  1.194955	 -1.817188	 -0.101201
  1.181611	 -1.831194	 -0.090385
  1.171031	 -1.841798	 -0.074032
  1.157790	 -1.857735	 -0.070055
  1.142653	 -1.868999	 -0.063223
  1.130968	 -1.882982	 -0.058272
  1.120316	 -1.897529	 -0.048675
  1.108023	 -1.915000	 -0.044573
  1.097237	 -1.930955	 -0.045742
  1.084747	 -1.946318	 -0.041113
  1.077219	 -1.965265	 -0.039042
  1.068367	 -1.982985	 -0.040647
  1.059527	 -2.001889	 -0.042303
  1.053196	 -2.019704	 -0.043136
  1.044914	 -2.037749	 -0.044840
  1.035737	 -2.056849	 -0.048588
  1.029361	 -2.074696	 -0.048493
  1.020827	 -2.092549	 -0.051342
  1.010330	 -2.110885	 -0.055587
  1.005373	 -2.128334	 -0.055865
  0.996151	 -2.146480	 -0.057962
  0.985982	 -2.165851	 -0.062484
  0.981369	 -2.182668	 -0.062928
  0.973658	 -2.200944	 -0.063909
  0.964944	 -2.222797	 -0.068316
  0.959530	 -2.238885	 -0.069239
  0.952982	 -2.257576	 -0.070322
  0.946896	 -2.279731	 -0.071568
  0.940510	 -2.296646	 -0.076953
  0.934336	 -2.311306	 -0.083137
  0.928048	 -2.330040	 -0.086222
