 -0.547589	  1.457140	  1.889781
 -0.537519	  1.482195	  1.900589
 -0.544675	  1.464530	  1.898588
 -0.553171	  1.446377	  1.889027
 -0.559040	  1.431145	  1.877775
 -0.564030	  1.414577	  1.867080
 -0.568067	  1.397422	  1.857350
 -0.571932	  1.380428	  1.847749
 -0.575752	  1.363836	  1.837114
 -0.579720	  1.347458	  1.826336
 -0.583895	  1.330969	  1.815823
 -0.588023	  1.314400	  1.805402
 -0.592702	  1.297778	  1.795297
 -0.599751	  1.281221	  1.786554
 -0.606827	  1.264652	  1.777864
 -0.614268	  1.248055	  1.769527
 -0.622882	  1.231494	  1.762323
 -0.631492	  1.214918	  1.755162
 -0.639400	  1.197714	  1.748693
 -0.646961	  1.180188	  1.742743
 -0.653159	  1.162438	  1.736001
 -0.658179	  1.144541	  1.728648
 -0.662973	  1.126551	  1.721342
 -0.667332	  1.108384	  1.714198
 -0.671680	  1.090192	  1.707127
 -0.676444	  1.072786	  1.698678
 -0.680271	  1.055498	  1.689253
 -0.684768	  1.038504	  1.679430
 -0.690041	  1.021358	  1.672539
 -0.695153	  1.001955	  1.667315
 -0.705312	  0.986054	  1.657100
 -0.719402	  0.970460	  1.645653
 -0.728791	  0.957885	  1.637543
 -0.739204	  0.943057	  1.629019
 -0.750339	  0.927550	  1.620991
 -0.759882	  0.914003	  1.614702
 -0.769854	  0.900459	  1.607777
 -0.786353	  0.881807	  1.597809
 -0.797778	  0.870689	  1.593766
 -0.807438	  0.859330	  1.591290
 -0.823975	  0.834452	  1.582142
 -0.834913	  0.822811	  1.573294
 -0.840496	  0.812542	  1.565031
 -0.855034	  0.791968	  1.546848
 -0.863180	  0.774664	  1.533848
 -0.870243	  0.764618	  1.532838
 -0.880830	  0.753557	  1.528799
 -0.899614	  0.736630	  1.533343
 -0.914199	  0.718058	  1.532112
 -0.926868	  0.701726	  1.528829
 -0.935251	  0.685315	  1.519429
 -0.937086	  0.669324	  1.504942
 -0.943507	  0.649859	  1.494249
 -0.949372	  0.625707	  1.492292
 -0.951123	  0.602859	  1.492325
 -0.947862	  0.586642	  1.490960
 -0.940245	  0.569250	  1.485684
 -0.934061	  0.549714	  1.473835
 -0.932893	  0.531383	  1.461513
 -0.935319	  0.513412	  1.451246
 -0.940093	  0.495523	  1.441802
 -0.944448	  0.481351	  1.432973
 -0.952611	  0.462062	  1.421704
 -0.957609	  0.446943	  1.412692
 -0.961420	  0.430032	  1.403266
 -0.964297	  0.407533	  1.391700
 -0.965349	  0.388602	  1.385227
 -0.964809	  0.375745	  1.382519
 -0.960917	  0.356060	  1.373145
 -0.962799	  0.331405	  1.358296
 -0.968168	  0.315568	  1.351722
 -0.976258	  0.296516	  1.347262
 -0.982870	  0.283028	  1.344654
 -0.994292	  0.263913	  1.340583
 -1.004679	  0.246739	  1.335377
 -1.012895	  0.229669	  1.328815
 -1.020160	  0.212325	  1.321715
 -1.027324	  0.195161	  1.314196
 -1.034708	  0.178953	  1.307435
 -1.044118	  0.162424	  1.301188
 -1.056186	  0.145712	  1.296902
 -1.067532	  0.127961	  1.294750
 -1.076298	  0.107866	  1.292578
 -1.082357	  0.089688	  1.290206
 -1.083799	  0.070107	  1.286566
 -1.085249	  0.050801	  1.281388
 -1.089359	  0.029697	  1.277757
 -1.095874	  0.009054	  1.279380
 -1.102481	 -0.011212	  1.281617
 -1.108795	 -0.026265	  1.280379
 -1.119183	 -0.046262	  1.272754
 -1.128672	 -0.060677	  1.262137
 -1.139218	 -0.076937	  1.253732
 -1.146293	 -0.094983	  1.246669
 -1.150938	 -0.113030	  1.238556
 -1.155270	 -0.130165	  1.228681
 -1.159385	 -0.146566	  1.217597
 -1.164775	 -0.161985	  1.206508
 -1.172345	 -0.177798	  1.196686
 -1.179347	 -0.193742	  1.186631
 -1.184679	 -0.209724	  1.175933
 -1.189746	 -0.225571	  1.165359
 -1.196025	 -0.241842	  1.155303
 -1.202047	 -0.258071	  1.145316
 -1.209034	 -0.273886	  1.135194
 -1.216415	 -0.289558	  1.125184
 -1.224440	 -0.305388	  1.115964
 -1.232861	 -0.321313	  1.107276
 -1.241286	 -0.337241	  1.098604
 -1.249929	 -0.354575	  1.093624
 -1.258581	 -0.372020	  1.089061
 -1.267601	 -0.389304	  1.084607
 -1.278959	 -0.405301	  1.080751
 -1.290286	 -0.421308	  1.076865
 -1.295577	 -0.438230	  1.067670
 -1.300509	 -0.455119	  1.058161
 -1.305107	 -0.471690	  1.047953
 -1.309787	 -0.488337	  1.037946
 -1.313921	 -0.505906	  1.029340
 -1.317809	 -0.523752	  1.021205
 -1.321964	 -0.541409	  1.012851
 -1.327619	 -0.558367	  1.004041
 -1.332660	 -0.575108	  0.994849
 -1.334248	 -0.592247	  0.985101
 -1.333709	 -0.610179	  0.972855
 -1.339623	 -0.627234	  0.963745
 -1.353062	 -0.643278	  0.959129
 -1.372196	 -0.664234	  0.952660
 -1.376452	 -0.678095	  0.947200
 -1.378330	 -0.693180	  0.940693
 -1.379258	 -0.715787	  0.929528
 -1.383064	 -0.736581	  0.922585
 -1.385292	 -0.745491	  0.920468
 -1.396480	 -0.764729	  0.916471
 -1.403437	 -0.785391	  0.912241
 -1.403033	 -0.797042	  0.910024
 -1.398876	 -0.816455	  0.906421
 -1.393136	 -0.840904	  0.901003
 -1.396929	 -0.864715	  0.893924
 -1.403087	 -0.878798	  0.890648
 -1.413101	 -0.897724	  0.890678
 -1.420978	 -0.917862	  0.884403
 -1.427696	 -0.935756	  0.875537
 -1.434600	 -0.952998	  0.867035
 -1.440273	 -0.970594	  0.859230
 -1.447588	 -0.987208	  0.853357
 -1.454719	 -1.001259	  0.845086
 -1.471366	 -1.023409	  0.839901
 -1.483524	 -1.037622	  0.842236
 -1.497120	 -1.050798	  0.844117
 -1.521639	 -1.070071	  0.845776
 -1.532084	 -1.084883	  0.842162
 -1.535102	 -1.090898	  0.840192
 -1.547237	 -1.123255	  0.831510
 -1.552614	 -1.139585	  0.830635
 -1.557223	 -1.154441	  0.827754
 -1.564089	 -1.180877	  0.823772
 -1.568517	 -1.194890	  0.822330
 -1.576970	 -1.209196	  0.818819
 -1.592927	 -1.235046	  0.812950
 -1.597340	 -1.246559	  0.809881
 -1.603184	 -1.264389	  0.799976
 -1.608963	 -1.282880	  0.787502
 -1.610339	 -1.296352	  0.781762
 -1.614054	 -1.318148	  0.771960
 -1.620210	 -1.335141	  0.760531
 -1.629283	 -1.350055	  0.748211
 -1.639084	 -1.365567	  0.733323
 -1.644194	 -1.373253	  0.724571
 -1.655869	 -1.387032	  0.706880
 -1.663776	 -1.401282	  0.692202
 -1.666386	 -1.412005	  0.686385
 -1.670274	 -1.435610	  0.670696
 -1.676724	 -1.453303	  0.659042
 -1.681380	 -1.466084	  0.652678
 -1.689512	 -1.485163	  0.646114
 -1.700651	 -1.504173	  0.638300
 -1.708650	 -1.516370	  0.631813
 -1.719945	 -1.536976	  0.621435
 -1.730219	 -1.556269	  0.613868
 -1.736806	 -1.567003	  0.609806
 -1.744684	 -1.587654	  0.610445
 -1.751998	 -1.608177	  0.609452
 -1.761679	 -1.630175	  0.604007
 -1.756081	 -1.669543	  0.592552
 -1.761601	 -1.687891	  0.586816
