  1.465970	  1.212403	  1.588881
  1.469591	  1.214047	  1.590520
  1.473212	  1.215691	  1.592159
  1.456375	  1.208046	  1.584538
  1.439539	  1.200398	  1.576918
  1.422975	  1.192207	  1.569268
  1.406590	  1.183675	  1.561604
  1.390222	  1.175114	  1.553937
  1.374232	  1.165916	  1.546208
  1.358245	  1.156715	  1.538479
  1.342361	  1.147282	  1.530876
  1.327000	  1.137669	  1.522593
  1.311878	  1.127607	  1.513451
  1.296461	  1.116786	  1.506078
  1.280720	  1.106541	  1.500033
  1.264374	  1.096857	  1.493487
  1.248888	  1.086013	  1.485595
  1.232806	  1.075330	  1.480589
  1.216433	  1.066459	  1.475145
  1.198997	  1.056367	  1.468687
  1.183388	  1.044988	  1.461943
  1.166399	  1.035727	  1.460249
  1.148235	  1.027732	  1.456984
  1.129723	  1.020785	  1.452669
  1.111770	  1.013247	  1.447266
  1.094075	  1.005801	  1.441649
  1.076210	  0.998967	  1.435805
  1.058127	  0.992588	  1.430126
  1.039164	  0.988462	  1.425295
  1.020201	  0.984339	  1.420460
  1.002275	  0.978225	  1.414039
  0.984678	  0.971613	  1.407214
  0.966979	  0.966401	  1.399494
  0.949279	  0.962059	  1.391258
  0.931583	  0.957700	  1.383026
  0.914723	  0.949364	  1.376235
  0.898173	  0.940138	  1.369831
  0.881623	  0.930916	  1.363428
  0.864451	  0.923311	  1.356551
  0.847164	  0.916062	  1.349579
  0.829650	  0.909244	  1.342738
  0.811982	  0.902736	  1.335995
  0.794314	  0.896222	  1.329258
  0.776883	  0.887959	  1.323983
  0.759572	  0.879169	  1.319179
  0.742355	  0.870554	  1.313765
  0.725630	  0.862667	  1.306147
  0.708889	  0.854871	  1.298468
  0.692049	  0.847568	  1.290525
  0.675203	  0.840278	  1.282586
  0.657158	  0.834832	  1.275901
  0.638901	  0.829774	  1.269488
  0.620837	  0.824128	  1.263027
  0.604347	  0.814945	  1.256422
  0.587864	  0.805744	  1.249813
  0.571482	  0.796758	  1.242681
  0.555246	  0.788059	  1.234889
  0.539012	  0.779353	  1.227099
  0.524197	  0.767970	  1.219971
  0.511207	  0.754239	  1.213681
  0.499510	  0.740260	  1.207774
  0.485910	  0.725601	  1.202301
  0.468972	  0.710966	  1.197269
  0.453028	  0.702423	  1.191165
  0.437735	  0.695631	  1.182831
  0.421777	  0.683938	  1.175506
  0.407134	  0.672364	  1.168128
  0.387951	  0.667901	  1.158952
  0.371857	  0.659396	  1.152681
  0.355051	  0.649966	  1.147380
  0.334862	  0.645886	  1.139367
  0.316911	  0.646088	  1.133561
  0.297184	  0.645369	  1.127358
  0.278711	  0.642889	  1.117654
  0.261410	  0.637740	  1.108593
  0.245360	  0.633337	  1.102641
  0.227480	  0.632703	  1.093506
  0.209473	  0.633116	  1.084381
  0.186442	  0.630706	  1.076798
  0.172229	  0.629405	  1.068913
  0.153960	  0.629804	  1.059325
  0.134781	  0.624608	  1.049281
  0.118597	  0.615679	  1.039297
  0.106619	  0.606382	  1.028013
  0.089953	  0.601671	  1.017986
  0.070896	  0.599509	  1.008115
  0.051102	  0.597833	  0.998503
  0.037244	  0.594457	  0.988697
  0.020678	  0.589406	  0.977993
  0.003392	  0.582876	  0.969964
 -0.015462	  0.572789	  0.966180
 -0.034213	  0.564401	  0.961072
 -0.049734	  0.559787	  0.951780
 -0.062645	  0.552180	  0.940118
 -0.082047	  0.544841	  0.926283
 -0.101243	  0.542267	  0.921630
 -0.122017	  0.537612	  0.921707
 -0.138189	  0.527338	  0.919301
 -0.155101	  0.515348	  0.912015
 -0.169508	  0.507546	  0.901250
 -0.185785	  0.501866	  0.892042
 -0.203607	  0.494663	  0.884434
 -0.220533	  0.486867	  0.877053
 -0.237506	  0.479119	  0.870376
 -0.254907	  0.471007	  0.865442
 -0.271722	  0.462687	  0.861994
 -0.290835	  0.449253	  0.856944
 -0.304490	  0.441512	  0.849369
 -0.320633	  0.434056	  0.841981
 -0.339340	  0.423800	  0.831949
 -0.354866	  0.411985	  0.827288
 -0.369944	  0.403177	  0.824842
 -0.387432	  0.396360	  0.818816
 -0.405874	  0.388220	  0.813178
 -0.422616	  0.377582	  0.808690
 -0.438499	  0.365817	  0.801050
 -0.454410	  0.356560	  0.795251
 -0.472337	  0.348467	  0.791173
 -0.491079	  0.341909	  0.788871
 -0.509220	  0.333689	  0.786153
 -0.526451	  0.324274	  0.782021
 -0.543886	  0.314125	  0.779321
 -0.561986	  0.306317	  0.778748
 -0.580366	  0.298411	  0.777382
 -0.597597	  0.288744	  0.774006
 -0.614245	  0.278644	  0.769691
 -0.631795	  0.270673	  0.767118
 -0.652727	  0.263662	  0.765860
 -0.670824	  0.255645	  0.764788
 -0.686811	  0.242912	  0.758364
 -0.703225	  0.234942	  0.748042
 -0.717036	  0.227431	  0.738768
 -0.731986	  0.212356	  0.727011
 -0.745715	  0.200001	  0.722318
 -0.764258	  0.193914	  0.719824
 -0.784427	  0.188279	  0.716491
 -0.801862	  0.175941	  0.714461
 -0.813695	  0.163788	  0.704249
 -0.830451	  0.153105	  0.694346
 -0.846147	  0.150435	  0.684493
 -0.864925	  0.146301	  0.675632
 -0.882600	  0.138705	  0.667609
 -0.899976	  0.132660	  0.661399
 -0.920472	  0.125086	  0.659159
 -0.938741	  0.114966	  0.656492
 -0.952329	  0.106620	  0.649735
 -0.969531	  0.096784	  0.642147
 -0.987319	  0.090201	  0.631413
 -1.005567	  0.081616	  0.623728
 -1.022669	  0.078604	  0.613993
 -1.037560	  0.077182	  0.602669
 -1.055051	  0.072382	  0.591465
 -1.072053	  0.068633	  0.581326
 -1.087448	  0.068669	  0.569192
 -1.104987	  0.063355	  0.558995
 -1.121529	  0.059924	  0.549070
 -1.137211	  0.058300	  0.538101
 -1.154015	  0.052185	  0.527740
 -1.171391	  0.042634	  0.519545
 -1.185196	  0.035041	  0.511175
 -1.200490	  0.026757	  0.500285
 -1.213601	  0.015078	  0.490081
 -1.220404	 -0.001910	  0.481940
 -1.227152	 -0.018901	  0.473828
 -1.233900	 -0.035891	  0.465716
 -1.240602	 -0.052897	  0.457638
 -1.240075	 -0.072852	  0.456684
 -1.238876	 -0.092665	  0.456230
 -1.237647	 -0.112017	  0.454198
 -1.235781	 -0.132076	  0.451594
 -1.232882	 -0.153545	  0.451920
 -1.232050	 -0.173090	  0.457753
 -1.234826	 -0.192325	  0.461578
 -1.235690	 -0.213006	  0.460978
 -1.239813	 -0.232432	  0.457441
 -1.243395	 -0.252031	  0.458334
 -1.242330	 -0.273683	  0.456388
 -1.237642	 -0.291772	  0.457431
 -1.241204	 -0.311759	  0.456869
 -1.245740	 -0.331216	  0.453661
 -1.251752	 -0.350179	  0.450296
 -1.260347	 -0.367684	  0.448511
 -1.268447	 -0.386858	  0.446333
 -1.289716	 -0.382932	  0.437193
 -1.294180	 -0.403366	  0.438001
 -1.313974	 -0.402067	  0.432270
 -1.331964	 -0.386810	  0.429908
 -1.350139	 -0.391916	  0.425001
 -1.368597	 -0.388659	  0.418361
 -1.386759	 -0.379531	  0.413682
 -1.404174	 -0.366658	  0.405839
 -1.423203	 -0.359333	  0.404446
 -1.442671	 -0.354078	  0.403610
 -1.457251	 -0.347182	  0.403512
 -1.476222	 -0.336284	  0.399390
 -1.490798	 -0.320361	  0.396326
 -1.506408	 -0.307935	  0.389905
 -1.521410	 -0.296171	  0.386665
 -1.533787	 -0.283339	  0.386336
 -1.548381	 -0.269119	  0.381717
 -1.561390	 -0.255754	  0.374663
 -1.574085	 -0.242741	  0.368029
 -1.587760	 -0.235179	  0.361715
 -1.602290	 -0.238753	  0.355845
 -1.619827	 -0.244712	  0.346143
 -1.635815	 -0.251890	  0.337093
 -1.649818	 -0.259380	  0.329496
 -1.665132	 -0.264509	  0.318516
 -1.681534	 -0.270098	  0.307664
 -1.697312	 -0.277856	  0.300287
 -1.712941	 -0.292370	  0.290936
 -1.726149	 -0.301518	  0.283670
 -1.742793	 -0.309882	  0.275093
 -1.761486	 -0.315124	  0.268753
 -1.780764	 -0.320200	  0.263425
 -1.798773	 -0.328317	  0.258210
 -1.817512	 -0.332937	  0.252403
 -1.837859	 -0.335479	  0.249226
 -1.857752	 -0.337196	  0.247491
 -1.877505	 -0.338915	  0.246126
 -1.897318	 -0.341839	  0.245966
 -1.917644	 -0.345092	  0.245816
 -1.938034	 -0.346477	  0.244307
 -1.957605	 -0.343181	  0.243472
 -1.976793	 -0.337005	  0.249624
 -1.996163	 -0.331569	  0.256809
 -2.015382	 -0.328824	  0.262436
 -2.032827	 -0.321072	  0.266298
 -2.049383	 -0.312651	  0.272056
 -2.068802	 -0.305282	  0.278169
 -2.089464	 -0.301635	  0.281645
 -2.104540	 -0.291605	  0.283373
 -2.122855	 -0.282096	  0.288755
 -2.138106	 -0.269881	  0.296485
 -2.152522	 -0.257484	  0.305142
 -2.166017	 -0.245428	  0.313525
 -2.178537	 -0.232392	  0.322117
 -2.191832	 -0.220873	  0.330611
 -2.205680	 -0.212307	  0.336518
 -2.218613	 -0.213740	  0.331859
 -2.230721	 -0.212877	  0.329352
 -2.245717	 -0.221251	  0.318984
 -2.263013	 -0.226707	  0.310000
 -2.280855	 -0.231864	  0.301386
 -2.296159	 -0.238840	  0.290849
 -2.315551	 -0.242590	  0.284268
 -2.334613	 -0.247736	  0.276412
 -2.351513	 -0.254876	  0.268651
 -2.370521	 -0.258970	  0.264325
 -2.387454	 -0.266304	  0.256131
 -2.405640	 -0.272164	  0.250492
 -2.423822	 -0.277617	  0.245422
 -2.440728	 -0.285017	  0.237740
 -2.457177	 -0.292624	  0.229572
 -2.472075	 -0.297317	  0.224605
 -2.475040	 -0.298251	  0.223617
