  0.333855	 -2.119216	  1.144733
  0.367031	 -2.140359	  1.154747
  0.350890	 -2.129703	  1.149655
  0.334882	 -2.118897	  1.144462
  0.318936	 -2.108031	  1.139204
  0.303287	 -2.096889	  1.133639
  0.287639	 -2.085747	  1.128073
  0.272248	 -2.074417	  1.122176
  0.256976	 -2.063005	  1.116132
  0.241769	 -2.051558	  1.109991
  0.226902	 -2.039935	  1.103367
  0.212035	 -2.028312	  1.096744
  0.197488	 -2.016538	  1.089689
  0.183120	 -2.004685	  1.082404
  0.168812	 -1.992745	  1.075143
  0.154693	 -1.980538	  1.067957
  0.140575	 -1.968330	  1.060771
  0.125916	 -1.955900	  1.055239
  0.111230	 -1.943460	  1.049801
  0.096139	 -1.931027	  1.045597
  0.080887	 -1.918614	  1.041954
  0.065429	 -1.906324	  1.038787
  0.049586	 -1.894314	  1.036604
  0.033743	 -1.882305	  1.034422
  0.017512	 -1.870686	  1.033164
  0.001221	 -1.859137	  1.032062
 -0.015186	 -1.847738	  1.031129
 -0.031874	 -1.836727	  1.030621
 -0.048562	 -1.825715	  1.030114
 -0.065519	 -1.815119	  1.029682
 -0.082669	 -1.804835	  1.029307
 -0.099818	 -1.794552	  1.028931
 -0.117337	 -1.784914	  1.028468
 -0.134952	 -1.775455	  1.027980
 -0.152566	 -1.765995	  1.027493
 -0.170597	 -1.757392	  1.026553
 -0.188679	 -1.748904	  1.025553
 -0.206761	 -1.740416	  1.024553
 -0.225277	 -1.733072	  1.022765
 -0.243849	 -1.725897	  1.020865
 -0.262420	 -1.718721	  1.018964
 -0.281219	 -1.712392	  1.016407
 -0.300053	 -1.706215	  1.013733
 -0.318886	 -1.700039	  1.011060
 -0.337781	 -1.694392	  1.007728
 -0.356679	 -1.688782	  1.004353
 -0.375561	 -1.683177	  1.000877
 -0.394332	 -1.677613	  0.996795
 -0.413104	 -1.672049	  0.992712
 -0.431756	 -1.666330	  0.988311
 -0.450271	 -1.660443	  0.983562
 -0.468781	 -1.654548	  0.978804
 -0.486981	 -1.648151	  0.973527
 -0.505181	 -1.641755	  0.968251
 -0.523159	 -1.634910	  0.962781
 -0.541003	 -1.627805	  0.957201
 -0.558743	 -1.620465	  0.951596
 -0.576210	 -1.612539	  0.945932
 -0.593677	 -1.604613	  0.940269
 -0.610860	 -1.595944	  0.934829
 -0.628030	 -1.587243	  0.929399
 -0.645148	 -1.578267	  0.924261
 -0.662237	 -1.569151	  0.919273
 -0.679324	 -1.559958	  0.914422
 -0.696403	 -1.550618	  0.909833
 -0.713482	 -1.541277	  0.905245
 -0.730473	 -1.531544	  0.901173
 -0.747461	 -1.521801	  0.897113
 -0.764324	 -1.511639	  0.893595
 -0.781128	 -1.501306	  0.890304
 -0.797856	 -1.490769	  0.887278
 -0.814499	 -1.480026	  0.884524
 -0.831129	 -1.469239	  0.881860
 -0.847717	 -1.458325	  0.879465
 -0.864305	 -1.447412	  0.877069
 -0.880840	 -1.436390	  0.874810
 -0.897374	 -1.425365	  0.872555
 -0.913928	 -1.414318	  0.870573
 -0.930492	 -1.403258	  0.868749
 -0.947144	 -1.392296	  0.867167
 -0.964028	 -1.381613	  0.866261
 -0.980913	 -1.370931	  0.865356
 -0.998485	 -1.361382	  0.865211
 -1.016180	 -1.352062	  0.865215
 -1.033876	 -1.342742	  0.865220
 -1.052076	 -1.334498	  0.864324
 -1.070296	 -1.326302	  0.863390
 -1.088515	 -1.318105	  0.862456
 -1.106562	 -1.309988	  0.859557
 -1.124510	 -1.301918	  0.855984
 -1.142457	 -1.293847	  0.852411
 -1.159986	 -1.285606	  0.847430
 -1.176962	 -1.277234	  0.840970
 -1.193938	 -1.268862	  0.834510
 -1.210520	 -1.260327	  0.827285
 -1.226471	 -1.251585	  0.818971
 -1.242422	 -1.242843	  0.810656
 -1.257923	 -1.233801	  0.801826
 -1.273085	 -1.224551	  0.792631
 -1.288248	 -1.215302	  0.783437
 -1.302561	 -1.205376	  0.773608
 -1.316867	 -1.195445	  0.763773
 -1.330803	 -1.185219	  0.753712
 -1.344300	 -1.174664	  0.743397
 -1.357795	 -1.164105	  0.733082
 -1.370773	 -1.153024	  0.722652
 -1.383751	 -1.141942	  0.712222
 -1.396742	 -1.130579	  0.702117
 -1.409738	 -1.119044	  0.692217
 -1.422887	 -1.107419	  0.682626
 -1.436359	 -1.095609	  0.673737
 -1.449866	 -1.083800	  0.664899
 -1.464352	 -1.072091	  0.657614
 -1.478837	 -1.060382	  0.650328
 -1.494156	 -1.048991	  0.644364
 -1.509744	 -1.037728	  0.638871
 -1.525647	 -1.026664	  0.633907
 -1.542073	 -1.015981	  0.629896
 -1.558498	 -1.005299	  0.625884
 -1.575397	 -0.995080	  0.622718
 -1.592328	 -0.984896	  0.619614
 -1.609452	 -0.974966	  0.616764
 -1.626814	 -0.965363	  0.614239
 -1.644175	 -0.955760	  0.611714
 -1.661996	 -0.946948	  0.609535
 -1.679844	 -0.938185	  0.607378
 -1.697869	 -0.929783	  0.605257
 -1.716174	 -0.921991	  0.603200
 -1.734478	 -0.914198	  0.601142
 -1.752840	 -0.906682	  0.598624
 -1.771219	 -0.899259	  0.595953
 -1.789596	 -0.891838	  0.593273
 -1.807873	 -0.884566	  0.589659
 -1.826150	 -0.877293	  0.586045
 -1.844375	 -0.870048	  0.582124
 -1.862369	 -0.862918	  0.577088
 -1.880364	 -0.855788	  0.572052
 -1.898143	 -0.848497	  0.566505
 -1.915573	 -0.840979	  0.560209
 -1.933004	 -0.833461	  0.553912
 -1.950001	 -0.825585	  0.546907
 -1.966764	 -0.817533	  0.539546
 -1.983490	 -0.809355	  0.532242
 -2.000006	 -0.800497	  0.525259
 -2.016507	 -0.791571	  0.518328
 -2.032625	 -0.781205	  0.512604
 -2.048685	 -0.770657	  0.507054
 -2.064186	 -0.758710	  0.502932
 -2.079658	 -0.746672	  0.498970
 -2.094862	 -0.733970	  0.496232
 -2.110066	 -0.721268	  0.493494
 -2.125529	 -0.708751	  0.491438
 -2.141034	 -0.696267	  0.489500
 -2.156681	 -0.683933	  0.487757
 -2.172564	 -0.671860	  0.486350
 -2.188447	 -0.659788	  0.484943
 -2.204528	 -0.647934	  0.483995
 -2.220634	 -0.636110	  0.483108
 -2.236765	 -0.624312	  0.482346
 -2.252927	 -0.612547	  0.481744
 -2.269090	 -0.600781	  0.481143
 -2.285036	 -0.588746	  0.480200
 -2.300980	 -0.576710	  0.479255
 -2.316837	 -0.564588	  0.477983
 -2.332592	 -0.552377	  0.476350
 -2.348347	 -0.540166	  0.474716
 -2.364112	 -0.527940	  0.472898
 -2.379810	 -0.515754	  0.470653
