  0.974675	  1.573985	 -1.766781
  0.975097	  1.575390	 -1.767486
  0.978141	  1.554165	 -1.765555
  0.969407	  1.529975	 -1.756987
  0.961012	  1.518636	 -1.745736
  0.953988	  1.509990	 -1.733759
  0.942771	  1.491967	 -1.716977
  0.937407	  1.475783	 -1.709262
  0.932818	  1.461661	 -1.702130
  0.924997	  1.442982	 -1.689687
  0.919929	  1.425626	 -1.681896
  0.915843	  1.408185	 -1.675551
  0.910221	  1.388877	 -1.666431
  0.906159	  1.371767	 -1.660740
  0.902917	  1.348178	 -1.659049
  0.904089	  1.326454	 -1.656901
  0.911480	  1.306504	 -1.649227
  0.920624	  1.289307	 -1.635806
  0.921425	  1.277326	 -1.624407
  0.915852	  1.260528	 -1.611903
  0.909710	  1.244507	 -1.599058
  0.914656	  1.227861	 -1.582544
  0.926181	  1.210398	 -1.572726
  0.932154	  1.195229	 -1.569807
  0.936197	  1.176791	 -1.562556
  0.943042	  1.160196	 -1.550473
  0.952431	  1.147239	 -1.539311
  0.956770	  1.131960	 -1.531469
  0.956491	  1.110764	 -1.525186
  0.966609	  1.089005	 -1.515945
  0.979932	  1.076060	 -1.505602
  0.990012	  1.064326	 -1.492461
  0.992408	  1.056578	 -1.475856
  0.997754	  1.043043	 -1.459566
  1.004781	  1.029128	 -1.446402
  1.011879	  1.015513	 -1.433546
  1.019097	  1.001928	 -1.420723
  1.025990	  0.988560	 -1.407475
  1.032170	  0.975413	 -1.393668
  1.037518	  0.962591	 -1.379211
  1.043047	  0.949343	 -1.365611
  1.050330	  0.934699	 -1.353383
  1.056653	  0.921261	 -1.339291
  1.058917	  0.909216	 -1.324761
  1.057557	  0.894681	 -1.309492
  1.059767	  0.877161	 -1.297735
  1.068458	  0.860460	 -1.286210
  1.076888	  0.848341	 -1.271790
  1.077414	  0.839509	 -1.253973
  1.074290	  0.830674	 -1.234925
  1.074600	  0.821490	 -1.213537
  1.080416	  0.812045	 -1.195166
  1.087818	  0.798355	 -1.180782
  1.090088	  0.780554	 -1.173412
  1.090998	  0.759144	 -1.164927
  1.089043	  0.740888	 -1.154222
  1.083147	  0.728653	 -1.139942
  1.079837	  0.718342	 -1.122009
  1.072669	  0.705623	 -1.105570
  1.058237	  0.690942	 -1.100261
  1.043892	  0.660654	 -1.098299
  1.043261	  0.642119	 -1.095784
  1.047717	  0.623190	 -1.081834
  1.051781	  0.614114	 -1.068562
  1.047646	  0.598960	 -1.052314
  1.040920	  0.581537	 -1.038361
  1.036806	  0.566180	 -1.030756
  1.031996	  0.550584	 -1.024233
  1.021139	  0.534152	 -1.016374
  1.009604	  0.516802	 -1.005734
  1.003912	  0.499709	 -0.996830
  0.999571	  0.481452	 -0.991264
  0.993462	  0.464054	 -0.990419
  0.980738	  0.445888	 -0.989327
  0.968605	  0.427972	 -0.986890
  0.960750	  0.411496	 -0.983291
  0.952251	  0.392422	 -0.977371
  0.946234	  0.375219	 -0.970055
  0.946110	  0.355200	 -0.961523
  0.950534	  0.330818	 -0.955286
  0.948610	  0.310968	 -0.957312
  0.938433	  0.295193	 -0.960118
  0.925766	  0.277023	 -0.958659
  0.914762	  0.260546	 -0.954997
  0.908132	  0.241480	 -0.951483
  0.901788	  0.222977	 -0.947273
  0.895376	  0.204737	 -0.942207
  0.889306	  0.186394	 -0.937011
  0.883235	  0.168201	 -0.931272
  0.876242	  0.150989	 -0.923807
  0.868971	  0.133768	 -0.916662
  0.861675	  0.116644	 -0.909286
  0.854626	  0.099592	 -0.901530
  0.846865	  0.083427	 -0.892597
  0.837643	  0.069079	 -0.882088
  0.828420	  0.054733	 -0.871640
  0.819110	  0.040287	 -0.861403
  0.809760	  0.025781	 -0.851291
  0.800118	  0.011737	 -0.840775
  0.789488	 -0.000349	 -0.828869
  0.778905	 -0.012327	 -0.816849
  0.768382	 -0.024245	 -0.804704
  0.758402	 -0.036091	 -0.792058
  0.748851	 -0.048002	 -0.779171
  0.742909	 -0.061143	 -0.767228
  0.740550	 -0.077648	 -0.759057
  0.746587	 -0.098152	 -0.759325
  0.752236	 -0.123168	 -0.754552
  0.752753	 -0.132215	 -0.752187
  0.758625	 -0.147253	 -0.761217
  0.766657	 -0.166949	 -0.773267
  0.765468	 -0.194550	 -0.766193
  0.762471	 -0.215156	 -0.755807
  0.765499	 -0.233443	 -0.751933
  0.777442	 -0.246600	 -0.760731
  0.794649	 -0.266142	 -0.771962
  0.804953	 -0.286758	 -0.773832
  0.805695	 -0.301858	 -0.772930
  0.810602	 -0.321608	 -0.777721
  0.815943	 -0.344178	 -0.779998
  0.814184	 -0.364653	 -0.776527
  0.811109	 -0.385059	 -0.774929
  0.811393	 -0.405686	 -0.775887
  0.814145	 -0.425544	 -0.777573
  0.816867	 -0.445285	 -0.779319
  0.817489	 -0.465275	 -0.779583
  0.817055	 -0.485268	 -0.779172
  0.816611	 -0.505258	 -0.778763
  0.816182	 -0.525247	 -0.778326
  0.815732	 -0.545240	 -0.777899
  0.813475	 -0.565003	 -0.775797
  0.810567	 -0.584597	 -0.773034
  0.807639	 -0.604181	 -0.770301
  0.804751	 -0.623221	 -0.767274
  0.800880	 -0.639494	 -0.759875
  0.797551	 -0.662807	 -0.755803
  0.795499	 -0.684532	 -0.756909
  0.792005	 -0.700515	 -0.757180
  0.787478	 -0.719428	 -0.758460
  0.781025	 -0.751865	 -0.749592
  0.776195	 -0.761127	 -0.743099
  0.768713	 -0.773659	 -0.732009
  0.760799	 -0.794435	 -0.720337
  0.758796	 -0.810652	 -0.715771
  0.757962	 -0.831960	 -0.712312
  0.753306	 -0.853457	 -0.702886
  0.749373	 -0.864138	 -0.694466
  0.741477	 -0.879105	 -0.677041
  0.735158	 -0.897809	 -0.661196
  0.735097	 -0.909873	 -0.653200
  0.738767	 -0.927376	 -0.647236
  0.741038	 -0.956998	 -0.639976
  0.739679	 -0.971847	 -0.632825
  0.736048	 -0.988921	 -0.623239
  0.732009	 -1.004926	 -0.609933
  0.730451	 -1.015023	 -0.600835
  0.725120	 -1.034819	 -0.584095
  0.719290	 -1.056950	 -0.566099
  0.718748	 -1.066312	 -0.560932
  0.719604	 -1.081181	 -0.554605
  0.720415	 -1.106074	 -0.543831
  0.718655	 -1.125247	 -0.535112
  0.717371	 -1.136890	 -0.528329
  0.712435	 -1.157065	 -0.517857
  0.710020	 -1.174119	 -0.510142
  0.708771	 -1.191787	 -0.502345
  0.703664	 -1.212259	 -0.492975
  0.698980	 -1.228533	 -0.487623
  0.693241	 -1.248126	 -0.481910
  0.693444	 -1.271430	 -0.479101
  0.693036	 -1.288043	 -0.476629
  0.696496	 -1.307342	 -0.473158
  0.694172	 -1.328486	 -0.465218
  0.688184	 -1.345601	 -0.455879
  0.682607	 -1.363654	 -0.446274
  0.680812	 -1.378184	 -0.440440
  0.677987	 -1.394003	 -0.438097
  0.670786	 -1.423955	 -0.428583
  0.667279	 -1.435691	 -0.423987
  0.664611	 -1.455015	 -0.413516
  0.663114	 -1.476475	 -0.405082
  0.661508	 -1.494255	 -0.397374
  0.656648	 -1.505691	 -0.392715
  0.643722	 -1.526255	 -0.389901
  0.632805	 -1.544819	 -0.389334
  0.625034	 -1.564843	 -0.384359
  0.618399	 -1.582148	 -0.378492
  0.616128	 -1.602086	 -0.365005
  0.621204	 -1.619212	 -0.350061
  0.628105	 -1.638329	 -0.340050
  0.629781	 -1.654804	 -0.334923
  0.625457	 -1.675244	 -0.330485
  0.620183	 -1.693889	 -0.326467
  0.616079	 -1.714016	 -0.322623
  0.615570	 -1.733906	 -0.317972
  0.617785	 -1.753407	 -0.311609
  0.620631	 -1.771953	 -0.301877
  0.622903	 -1.788116	 -0.289385
  0.621991	 -1.804326	 -0.277536
  0.618607	 -1.821044	 -0.267047
  0.615195	 -1.838549	 -0.258048
  0.614132	 -1.857115	 -0.250724
  0.615652	 -1.876223	 -0.244408
  0.615966	 -1.895270	 -0.239011
  0.614528	 -1.915674	 -0.233342
  0.612875	 -1.936506	 -0.223565
  0.612321	 -1.951241	 -0.211704
  0.611636	 -1.964595	 -0.200136
  0.613387	 -1.979979	 -0.187365
  0.621406	 -1.998627	 -0.172307
  0.625840	 -2.017920	 -0.161758
  0.623868	 -2.034226	 -0.157542
  0.617317	 -2.053138	 -0.156283
  0.612573	 -2.075218	 -0.147755
  0.612836	 -2.090277	 -0.135384
  0.613515	 -2.105395	 -0.121668
  0.612968	 -2.120928	 -0.107837
  0.614911	 -2.133514	 -0.093971
  0.622684	 -2.152170	 -0.076883
  0.629984	 -2.175402	 -0.068818
  0.634049	 -2.190543	 -0.065271
  0.633869	 -2.206814	 -0.061491
  0.632204	 -2.229603	 -0.052382
  0.628828	 -2.246607	 -0.044926
  0.626818	 -2.265877	 -0.035507
  0.620119	 -2.283236	 -0.028799
  0.615207	 -2.301639	 -0.020921
  0.609538	 -2.319854	 -0.013512
  0.603366	 -2.337586	 -0.006799
  0.599348	 -2.355977	  0.000726
  0.596709	 -2.374187	  0.008678
  0.594487	 -2.392552	  0.016282
  0.592305	 -2.410939	  0.023839
  0.590480	 -2.429552	  0.030917
  0.588631	 -2.448182	  0.037954
  0.586678	 -2.466749	  0.045128
  0.584661	 -2.485310	  0.052302
  0.582667	 -2.503888	  0.059538
  0.580330	 -2.522502	  0.067272
  0.576969	 -2.540500	  0.075318
