 -1.551338	 -1.980086	  0.041242
 -1.552864	 -1.981847	  0.040485
 -1.540409	 -1.967470	  0.046663
 -1.527972	 -1.953073	  0.052829
 -1.516507	 -1.937613	  0.058251
 -1.505766	 -1.921770	  0.063819
 -1.495559	 -1.905904	  0.070637
 -1.485360	 -1.890301	  0.078003
 -1.476003	 -1.875111	  0.083981
 -1.471517	 -1.861650	  0.095229
 -1.470264	 -1.843025	  0.112328
 -1.462000	 -1.826862	  0.118798
 -1.447631	 -1.808509	  0.115975
 -1.437078	 -1.785321	  0.114108
 -1.435875	 -1.765662	  0.125516
 -1.439062	 -1.754425	  0.138165
 -1.445238	 -1.748270	  0.150683
 -1.445389	 -1.732409	  0.167081
 -1.443639	 -1.711793	  0.174663
 -1.446694	 -1.694334	  0.184966
 -1.450087	 -1.677214	  0.194629
 -1.457006	 -1.660584	  0.203487
 -1.465683	 -1.645217	  0.210867
 -1.480942	 -1.635181	  0.214060
 -1.504093	 -1.621970	  0.217116
 -1.512652	 -1.595756	  0.227863
 -1.515889	 -1.581239	  0.233190
 -1.521776	 -1.569615	  0.237251
 -1.532974	 -1.542593	  0.244910
 -1.534208	 -1.528266	  0.250904
 -1.532531	 -1.511682	  0.258734
 -1.536029	 -1.481421	  0.266245
 -1.540302	 -1.468077	  0.267519
 -1.546746	 -1.454636	  0.268027
 -1.552879	 -1.431940	  0.265815
 -1.556668	 -1.414515	  0.261496
 -1.563686	 -1.394482	  0.256735
 -1.569282	 -1.375868	  0.254966
 -1.570839	 -1.353222	  0.255024
 -1.568710	 -1.339583	  0.257225
 -1.551633	 -1.321232	  0.252938
 -1.540681	 -1.307478	  0.245869
 -1.528700	 -1.295758	  0.239046
 -1.510271	 -1.285492	  0.236917
 -1.492402	 -1.273374	  0.229864
 -1.475405	 -1.263144	  0.219329
 -1.462984	 -1.259549	  0.211761
 -1.441632	 -1.257979	  0.201837
 -1.418216	 -1.253980	  0.187855
 -1.412572	 -1.250068	  0.182675
 -1.396952	 -1.239138	  0.169819
 -1.375702	 -1.231857	  0.157056
 -1.355664	 -1.231274	  0.149370
 -1.341595	 -1.232251	  0.146433
 -1.315553	 -1.234105	  0.138393
 -1.291898	 -1.233001	  0.131704
 -1.281225	 -1.229644	  0.130482
 -1.269309	 -1.222965	  0.128416
 -1.244299	 -1.209968	  0.124382
 -1.221502	 -1.198116	  0.118889
 -1.212806	 -1.193520	  0.113350
 -1.194842	 -1.180412	  0.107078
 -1.171075	 -1.170151	  0.102202
 -1.162823	 -1.165981	  0.101075
 -1.137794	 -1.153170	  0.104677
 -1.119548	 -1.142325	  0.109992
 -1.111604	 -1.138964	  0.113150
 -1.094304	 -1.124028	  0.119284
 -1.078202	 -1.106826	  0.123959
 -1.074346	 -1.099552	  0.124879
 -1.066222	 -1.083132	  0.127211
 -1.057774	 -1.065815	  0.127139
 -1.052082	 -1.054005	  0.126612
 -1.045795	 -1.040921	  0.126613
 -1.035037	 -1.016905	  0.128687
 -1.026023	 -0.996998	  0.134880
 -1.018331	 -0.981860	  0.139906
 -1.005562	 -0.955751	  0.152651
 -0.999506	 -0.943615	  0.158470
 -0.989442	 -0.923067	  0.166349
 -0.981292	 -0.907619	  0.172212
 -0.972898	 -0.890689	  0.176958
 -0.971076	 -0.877814	  0.179651
 -0.966596	 -0.860524	  0.184491
 -0.965802	 -0.842560	  0.188095
 -0.963207	 -0.816321	  0.194283
 -0.959252	 -0.798374	  0.198183
 -0.953049	 -0.778197	  0.203053
 -0.944377	 -0.757775	  0.206451
 -0.939967	 -0.743787	  0.209895
 -0.937951	 -0.724455	  0.218583
 -0.934551	 -0.702663	  0.227497
 -0.924364	 -0.684393	  0.234297
 -0.910565	 -0.668024	  0.238945
 -0.900215	 -0.652457	  0.242849
 -0.897092	 -0.639297	  0.249105
 -0.900021	 -0.620348	  0.261754
 -0.896353	 -0.593435	  0.278882
 -0.887549	 -0.575642	  0.289440
 -0.882995	 -0.565790	  0.295128
 -0.875499	 -0.547900	  0.298527
 -0.870107	 -0.529457	  0.302479
 -0.867989	 -0.508602	  0.312684
 -0.859411	 -0.479878	  0.320376
 -0.839605	 -0.457276	  0.320530
 -0.821825	 -0.445098	  0.317547
 -0.812555	 -0.437662	  0.311323
 -0.794908	 -0.417450	  0.306270
 -0.772204	 -0.404730	  0.308813
 -0.761190	 -0.400424	  0.309575
 -0.743456	 -0.389837	  0.308013
 -0.723046	 -0.368809	  0.306819
 -0.716851	 -0.358132	  0.306575
 -0.709474	 -0.337365	  0.305571
 -0.701222	 -0.319739	  0.309159
 -0.687337	 -0.301287	  0.313372
 -0.673758	 -0.286400	  0.317086
 -0.660090	 -0.272068	  0.320846
 -0.645893	 -0.257561	  0.324323
 -0.631067	 -0.243766	  0.327851
 -0.614366	 -0.232083	  0.330360
 -0.594720	 -0.219763	  0.332370
 -0.584777	 -0.210180	  0.336850
 -0.579921	 -0.193218	  0.344922
 -0.563834	 -0.168243	  0.356011
 -0.550084	 -0.158127	  0.358367
 -0.536582	 -0.149188	  0.357429
 -0.518062	 -0.133610	  0.357077
 -0.507884	 -0.116981	  0.361170
 -0.503120	 -0.102457	  0.366172
 -0.495524	 -0.081870	  0.370623
 -0.486776	 -0.065111	  0.372540
 -0.478500	 -0.045330	  0.375080
 -0.469044	 -0.028301	  0.377574
 -0.462021	 -0.012891	  0.379898
 -0.451492	  0.010600	  0.383319
 -0.434941	  0.030004	  0.387092
 -0.425086	  0.040945	  0.388106
 -0.415956	  0.050526	  0.385090
 -0.403385	  0.071027	  0.381310
 -0.391958	  0.089688	  0.383548
 -0.384160	  0.106538	  0.389522
 -0.377600	  0.125494	  0.394735
 -0.370141	  0.143200	  0.400928
 -0.364885	  0.159026	  0.408642
 -0.360721	  0.175333	  0.417609
 -0.355197	  0.194206	  0.424621
 -0.345666	  0.213017	  0.428498
 -0.335279	  0.230191	  0.431505
 -0.324556	  0.247029	  0.435006
 -0.313507	  0.263996	  0.438673
 -0.302707	  0.280845	  0.441813
 -0.291610	  0.295187	  0.443926
 -0.279244	  0.309870	  0.442516
 -0.263363	  0.327208	  0.444339
 -0.248638	  0.344439	  0.448234
 -0.239880	  0.353420	  0.454793
 -0.227693	  0.370279	  0.470110
 -0.217404	  0.391497	  0.479103
 -0.210089	  0.406180	  0.480261
 -0.205553	  0.415502	  0.479564
 -0.194772	  0.439069	  0.476242
 -0.184562	  0.462321	  0.474117
 -0.169954	  0.484791	  0.478587
 -0.164377	  0.491665	  0.482383
 -0.155508	  0.508440	  0.486868
 -0.140162	  0.531930	  0.495164
 -0.130117	  0.542688	  0.500836
 -0.122226	  0.554004	  0.504258
 -0.113123	  0.576950	  0.512296
 -0.103361	  0.592903	  0.518600
 -0.093170	  0.603374	  0.524785
 -0.075941	  0.616366	  0.534076
 -0.057051	  0.644903	  0.538987
 -0.049858	  0.657009	  0.539839
 -0.043814	  0.667459	  0.540351
 -0.028210	  0.680497	  0.545995
 -0.008697	  0.695488	  0.556803
  0.003878	  0.710002	  0.563155
  0.010638	  0.722497	  0.567557
  0.020954	  0.740053	  0.574469
  0.028966	  0.752282	  0.581009
  0.038438	  0.780329	  0.595727
  0.042167	  0.795939	  0.599542
  0.046846	  0.807387	  0.604137
  0.059078	  0.833037	  0.614406
  0.070778	  0.852002	  0.614785
  0.077545	  0.866309	  0.615565
  0.081852	  0.882991	  0.613836
  0.083693	  0.897854	  0.614909
  0.089647	  0.922433	  0.618552
  0.094249	  0.945893	  0.632271
  0.097813	  0.958012	  0.639556
  0.105405	  0.976106	  0.648208
  0.111511	  0.992644	  0.654895
  0.113929	  1.007692	  0.661370
  0.118813	  1.036935	  0.672177
  0.123150	  1.048677	  0.674536
  0.131940	  1.062984	  0.673685
  0.145829	  1.092200	  0.670878
  0.154984	  1.108355	  0.672732
  0.165102	  1.121904	  0.673392
  0.181109	  1.140034	  0.676165
  0.201144	  1.157687	  0.681206
  0.219490	  1.174878	  0.681672
  0.225912	  1.183576	  0.683746
  0.230182	  1.193107	  0.685384
  0.243723	  1.212036	  0.686230
  0.262097	  1.235942	  0.686803
  0.271083	  1.245140	  0.688623
  0.284252	  1.260495	  0.694046
  0.295384	  1.273964	  0.700574
  0.309101	  1.289614	  0.707887
  0.325667	  1.305422	  0.716029
  0.345560	  1.322197	  0.721574
  0.355974	  1.332181	  0.721695
  0.364867	  1.340724	  0.720705
  0.381317	  1.358144	  0.719189
  0.397452	  1.372278	  0.712291
  0.411986	  1.386872	  0.707447
  0.428757	  1.401877	  0.706099
  0.444525	  1.417466	  0.708137
  0.454834	  1.429357	  0.713537
  0.466565	  1.442009	  0.722395
  0.479262	  1.456570	  0.733386
  0.495825	  1.475668	  0.743369
  0.507011	  1.494240	  0.747407
  0.512520	  1.505055	  0.748602
  0.518024	  1.525578	  0.748228
  0.524457	  1.547355	  0.746098
  0.530207	  1.559568	  0.743124
  0.538593	  1.580361	  0.738968
  0.542619	  1.601447	  0.738433
  0.545486	  1.624398	  0.738923
  0.547862	  1.650917	  0.744699
  0.552141	  1.667433	  0.750676
  0.555700	  1.683625	  0.755066
  0.562543	  1.704419	  0.760121
  0.570100	  1.724593	  0.764170
  0.576266	  1.741249	  0.767265
  0.582358	  1.755284	  0.769095
  0.583950	  1.777053	  0.772343
  0.581155	  1.802559	  0.776249
  0.583614	  1.821172	  0.778086
  0.592229	  1.841439	  0.777130
  0.606233	  1.859767	  0.774724
  0.622037	  1.874911	  0.774148
  0.637925	  1.888800	  0.776392
  0.651915	  1.905182	  0.781729
  0.660101	  1.924423	  0.788908
  0.664717	  1.942245	  0.798343
  0.667160	  1.955605	  0.805534
  0.672346	  1.976249	  0.810330
  0.680193	  1.992712	  0.813360
  0.689538	  2.011793	  0.813554
  0.698800	  2.030353	  0.813358
  0.707685	  2.047179	  0.814024
  0.715734	  2.066740	  0.814445
  0.723193	  2.087074	  0.816607
  0.730941	  2.106569	  0.820011
  0.740240	  2.124015	  0.825176
  0.748863	  2.141048	  0.829366
  0.758160	  2.158984	  0.834022
  0.770173	  2.174054	  0.840868
  0.782830	  2.187886	  0.847481
  0.795844	  2.203513	  0.853346
  0.813963	  2.215390	  0.864602
  0.823270	  2.232776	  0.867936
