 0.0 0.0 0.0 0
 0.23377085556125687 -0.6183844001319986 0.3293020861017 1000
 -0.5963135443056825 0.252728108669127 -0.4855829352672272 1000
 0.09162695450338626 0.9364501435512229 0.0604824318123337 1000
 0.8232190239647814 0.533294794537277 0.8614192921842676 1000
 -0.146227703814032 0.9600738883384372 -0.09581691921238206 1000
 -0.2608594046895938 0.1784255643285707 -0.39214931030584754 1000
 -0.9214306094045823 -0.23182273089514444 -0.8831247712407602 1000
 0.5333311010524786 0.5713220319157597 0.6324190749143282 1000
 0.0 0.0 0.0 0
 -0.42567829866725393 0.8387939920011249 -0.45969484886342094 1000
 0.3156580949737956 0.6332999837764232 0.22776593035616574 1000
 -0.11336089634114685 0.23835489075852007 0.026744325673550617 1000
 0.9567458408279151 0.29132973673199497 0.9665057241824802 1000
 -0.7514615985818702 0.5450127484322148 -0.6911357313022015 1000
 0.40355969140866776 0.814565982543051 0.35994670386354133 1000
 -0.7968822500339074 -0.361461322640053 -0.8730226952761153 1000
 -0.8240614159623214 0.04704473990948377 -0.7452620549559945 1000
 0.0 0.0 0.0 0
 -0.6121605802657624 -0.7668499877045069 -0.6543177387106103 1000
 0.38200038513763485 -0.07181194222273696 0.2515282925455008 1000
 0.7996294873394615 0.5708496545852477 0.7851315298923706 1000
 0.17915941411499897 0.983784617076469 0.19929537374411443 1000
 0.4966623669477678 -0.61813840310629 0.5727423169436859 1000
 -0.7419251234062312 0.3623582030174617 -0.657398841199099 1000
 -0.12921394317473983 -0.7707706734597212 -0.05507504844237961 1000
 -0.32252023286226184 -0.9300953951346281 -0.31459550499959343 1000
 0.0 0.0 0.0 0
 -0.945883141902689 0.3050983396967315 -0.9585074813671344 1000
 0.33697107165929135 -0.41290522823067594 0.4497493556835361 1000
 0.7328025852240335 0.6806398152389729 0.7452243821968184 1000
 -0.47212745499918063 -0.15076805911923458 -0.35324660692041493 1000
 -0.29233450980816766 -0.5982553368684258 -0.4086231311791581 1000
 -0.9523435981437087 -0.009107212859061797 -0.9115435837345152 1000
 0.7612242614165545 -0.2250876617151578 0.8445293661269241 1000
 -0.5116047316603894 -0.651359050800008 -0.44499347514195714 1000
 0.0 0.0 0.0 0
 -0.7020862027748473 -0.5855315834760657 -0.7710620198195027 1000
 -0.2994820770443438 0.6675860872825161 -0.19225989819913847 1000
 0.12430749819349388 -0.005180339860588468 -0.015614961102792368 1000
 0.407427055567904 -0.02636227675227565 0.5365251183718025 1000
 -0.4271772869030908 -0.9007308405382007 -0.45506125055327595 1000
 -0.35768490317825613 0.7543614686161954 -0.4228807874651001 1000
 0.9049685391921997 0.003921790430163663 0.966950896932935 1000
 -0.28140106222446515 -0.4210234463208754 -0.16775567998664043 1000
 0.0 0.0 0.0 0
 0.5884694999262249 -0.4729702347958561 0.48883206947888896 1000
 0.34264802502010033 -0.909693444327761 0.29423879916029183 1000
 0.2245295649425059 0.21782418646827006 0.36276669512277326 1000
 -0.6545530177285328 -0.39570395785691914 -0.5718517496634347 1000
 -0.6346362678148822 0.6966892269614384 -0.5766395010789156 1000
 0.714657839117024 0.18618879990255094 0.8144635902137592 1000
 0.8624746006260473 0.11517245418178773 0.7965097279827638 1000
 0.8398593584828011 -0.22765154942927845 0.7681908790156198 1000
 0.0 0.0 0.0 0
 -0.34417499058660467 0.9226202806399028 -0.3530333590176478 1000
 0.5237035428684341 -0.04494570030037531 0.4039811222054622 1000
 -0.16321922506930042 -0.959311446263954 -0.21271500775043217 1000
 -0.04520078410903183 -0.26491861833433133 -0.18573370587618795 1000
 -0.8588156647138696 -0.5116808484760468 -0.8709375486672579 1000
 0.023084592322474368 -0.0843117597213297 0.162261682482983 1000
