 -1.897944	 -1.496607	  0.820687
 -1.940588	 -1.495752	  0.835454
 -1.920335	 -1.497264	  0.837183
 -1.899898	 -1.500906	  0.823933
 -1.883642	 -1.499917	  0.813725
 -1.866706	 -1.495994	  0.807088
 -1.848171	 -1.493114	  0.800042
 -1.829716	 -1.496214	  0.794684
 -1.810352	 -1.503968	  0.789304
 -1.788074	 -1.509101	  0.775882
 -1.773848	 -1.507380	  0.765020
 -1.758748	 -1.504062	  0.754598
 -1.739258	 -1.502170	  0.746667
 -1.720119	 -1.501550	  0.741879
 -1.701884	 -1.499290	  0.735325
 -1.684005	 -1.494511	  0.724009
 -1.666893	 -1.492914	  0.712330
 -1.641896	 -1.498209	  0.702752
 -1.632744	 -1.500639	  0.700421
 -1.609775	 -1.503058	  0.694979
 -1.593426	 -1.499377	  0.684676
 -1.576564	 -1.494221	  0.671699
 -1.559447	 -1.490782	  0.661364
 -1.541375	 -1.488110	  0.652871
 -1.523539	 -1.485169	  0.644336
 -1.505726	 -1.482311	  0.635744
 -1.488016	 -1.478468	  0.627297
 -1.470357	 -1.473860	  0.619138
 -1.452727	 -1.468833	  0.611192
 -1.435264	 -1.463188	  0.603190
 -1.418109	 -1.459280	  0.594300
 -1.401744	 -1.454264	  0.584893
 -1.384369	 -1.442691	  0.579124
 -1.365731	 -1.431638	  0.576602
 -1.346965	 -1.425788	  0.571988
 -1.330870	 -1.424536	  0.562774
 -1.315741	 -1.421974	  0.547976
 -1.300025	 -1.412658	  0.535682
 -1.286056	 -1.398594	  0.530162
 -1.268345	 -1.382683	  0.525558
 -1.252456	 -1.373907	  0.523401
 -1.235572	 -1.366992	  0.514234
 -1.219483	 -1.363203	  0.501427
 -1.201237	 -1.358856	  0.487145
 -1.187104	 -1.351514	  0.478132
 -1.174388	 -1.343073	  0.467949
 -1.159215	 -1.329755	  0.455730
 -1.143943	 -1.320208	  0.447841
 -1.128537	 -1.312668	  0.440173
 -1.114113	 -1.305471	  0.430409
 -1.095079	 -1.294499	  0.419760
 -1.079586	 -1.285893	  0.414506
 -1.068544	 -1.278296	  0.411390
 -1.044683	 -1.262438	  0.399718
 -1.029969	 -1.256955	  0.389947
 -1.019445	 -1.253105	  0.383146
 -1.005761	 -1.243660	  0.369262
 -0.985386	 -1.238382	  0.360407
 -0.962363	 -1.233121	  0.358105
 -0.944774	 -1.222946	  0.361912
 -0.931999	 -1.208996	  0.363018
 -0.917287	 -1.194031	  0.358615
 -0.902077	 -1.187331	  0.350820
 -0.885188	 -1.182879	  0.340274
 -0.858087	 -1.171474	  0.329847
 -0.846218	 -1.160166	  0.330979
 -0.839020	 -1.150680	  0.333642
 -0.820823	 -1.131781	  0.343938
 -0.799038	 -1.116715	  0.349841
 -0.785055	 -1.103403	  0.354459
 -0.774000	 -1.097813	  0.350550
 -0.755371	 -1.087791	  0.352496
 -0.730901	 -1.079487	  0.348169
 -0.711608	 -1.072446	  0.347596
 -0.696474	 -1.067555	  0.345537
 -0.670626	 -1.060726	  0.339989
 -0.653722	 -1.055363	  0.339737
 -0.640684	 -1.052328	  0.342167
 -0.617272	 -1.039143	  0.341817
 -0.597309	 -1.036910	  0.339849
 -0.585474	 -1.036770	  0.340809
 -0.561806	 -1.027703	  0.345414
 -0.540419	 -1.016721	  0.346531
 -0.530687	 -1.011580	  0.345595
 -0.508086	 -1.001340	  0.341788
 -0.482658	 -1.004051	  0.330033
 -0.467597	 -1.011953	  0.318160
 -0.455706	 -1.025230	  0.303910
 -0.443691	 -1.039347	  0.291569
 -0.430235	 -1.051864	  0.279143
 -0.416250	 -1.057444	  0.272784
 -0.392449	 -1.060014	  0.269293
 -0.373767	 -1.062458	  0.264291
 -0.356497	 -1.069510	  0.254660
 -0.344493	 -1.076872	  0.244448
 -0.329887	 -1.086227	  0.232045
 -0.313101	 -1.093548	  0.221748
 -0.296340	 -1.098319	  0.212478
 -0.280126	 -1.104200	  0.201949
 -0.264399	 -1.110545	  0.191112
 -0.248306	 -1.115599	  0.180459
 -0.232316	 -1.121179	  0.169765
 -0.216386	 -1.126625	  0.158891
 -0.200389	 -1.131237	  0.147727
 -0.184398	 -1.135142	  0.136341
 -0.168431	 -1.138939	  0.124945
 -0.152491	 -1.142947	  0.113553
 -0.136569	 -1.145705	  0.101902
 -0.122946	 -1.147931	  0.089961
 -0.111162	 -1.149507	  0.074425
 -0.096349	 -1.152020	  0.058279
 -0.068708	 -1.159904	  0.046482
 -0.048679	 -1.162933	  0.042414
 -0.038808	 -1.163583	  0.043354
 -0.019263	 -1.162372	  0.036118
  0.000554	 -1.165708	  0.014383
  0.011267	 -1.167548	  0.000396
  0.023942	 -1.167384	 -0.014196
  0.045008	 -1.166467	 -0.028273
  0.056936	 -1.164450	 -0.033242
  0.080024	 -1.162764	 -0.035711
  0.102522	 -1.161308	 -0.043580
  0.119391	 -1.163446	 -0.062762
  0.127025	 -1.165869	 -0.073932
  0.143608	 -1.167775	 -0.087421
  0.160052	 -1.164627	 -0.097038
  0.176925	 -1.163835	 -0.110406
  0.194034	 -1.161724	 -0.120782
  0.211498	 -1.158380	 -0.129962
  0.228922	 -1.154796	 -0.139052
  0.246011	 -1.149691	 -0.148033
  0.262514	 -1.143075	 -0.157124
  0.279093	 -1.136967	 -0.166337
  0.294383	 -1.129451	 -0.176714
  0.307070	 -1.120438	 -0.189151
  0.319072	 -1.111637	 -0.202418
  0.328119	 -1.103302	 -0.218054
  0.336318	 -1.095448	 -0.234515
  0.343400	 -1.087813	 -0.251650
  0.350663	 -1.081746	 -0.269126
  0.354345	 -1.076203	 -0.287377
  0.352989	 -1.069240	 -0.306861
  0.359757	 -1.065264	 -0.324482
  0.383536	 -1.064280	 -0.347839
  0.392728	 -1.060630	 -0.362687
  0.402912	 -1.059880	 -0.373063
  0.413478	 -1.054750	 -0.387797
  0.426555	 -1.050307	 -0.413030
  0.435924	 -1.051742	 -0.425343
  0.445857	 -1.055297	 -0.436856
  0.463887	 -1.061211	 -0.460737
  0.471795	 -1.061049	 -0.474620
  0.482169	 -1.060500	 -0.491032
  0.492513	 -1.060196	 -0.510055
  0.499850	 -1.056391	 -0.530429
  0.505442	 -1.052563	 -0.543373
  0.513913	 -1.048286	 -0.563813
  0.527191	 -1.045827	 -0.585925
  0.542310	 -1.045589	 -0.602860
  0.551817	 -1.046460	 -0.611727
  0.570963	 -1.051528	 -0.626693
  0.588615	 -1.053076	 -0.644240
  0.595596	 -1.052966	 -0.655452
  0.610646	 -1.050561	 -0.674241
  0.630000	 -1.047142	 -0.684736
  0.651096	 -1.041677	 -0.685918
  0.678549	 -1.038766	 -0.692101
  0.694873	 -1.039038	 -0.703523
  0.703703	 -1.037979	 -0.715810
  0.721926	 -1.036912	 -0.734289
  0.743026	 -1.037634	 -0.742573
  0.757485	 -1.038312	 -0.746740
  0.779017	 -1.036944	 -0.753768
  0.804300	 -1.037791	 -0.757292
  0.821869	 -1.043004	 -0.753834
  0.842517	 -1.050391	 -0.753932
  0.867183	 -1.060879	 -0.759159
  0.879664	 -1.066879	 -0.762871
  0.895607	 -1.069578	 -0.768249
  0.916486	 -1.067831	 -0.768889
  0.940768	 -1.070055	 -0.772301
  0.958941	 -1.077997	 -0.779730
  0.974450	 -1.088892	 -0.784255
  0.992825	 -1.099067	 -0.785011
  1.010472	 -1.108683	 -0.787628
  1.024546	 -1.117089	 -0.796783
  1.043154	 -1.127237	 -0.809888
  1.058580	 -1.131392	 -0.817431
  1.076358	 -1.136349	 -0.821013
  1.099662	 -1.149609	 -0.826563
  1.114384	 -1.161771	 -0.832308
  1.122428	 -1.168185	 -0.836409
  1.141853	 -1.177890	 -0.843825
  1.157044	 -1.187300	 -0.847707
  1.177154	 -1.198581	 -0.852360
  1.197269	 -1.204933	 -0.860095
  1.213377	 -1.209488	 -0.865669
  1.231269	 -1.212614	 -0.869680
  1.256438	 -1.218735	 -0.878300
  1.266336	 -1.223610	 -0.884066
  1.284466	 -1.232636	 -0.893237
  1.303862	 -1.237049	 -0.900210
  1.322092	 -1.238510	 -0.902369
  1.345257	 -1.239411	 -0.905805
  1.362294	 -1.242374	 -0.912862
  1.378053	 -1.246967	 -0.920822
  1.401607	 -1.247770	 -0.929226
  1.416156	 -1.245469	 -0.929975
  1.436880	 -1.242663	 -0.927301
  1.460908	 -1.243741	 -0.929203
  1.477619	 -1.243711	 -0.935740
  1.494126	 -1.242152	 -0.939825
  1.523870	 -1.239766	 -0.941774
  1.534052	 -1.238671	 -0.943245
  1.552766	 -1.235032	 -0.944747
  1.582225	 -1.231071	 -0.944391
  1.594883	 -1.228384	 -0.942586
  1.610747	 -1.223344	 -0.936967
  1.636190	 -1.217297	 -0.930388
  1.651116	 -1.213951	 -0.929730
  1.669010	 -1.207807	 -0.926755
  1.690632	 -1.201137	 -0.917493
  1.705101	 -1.197695	 -0.912847
  1.725474	 -1.190670	 -0.911268
  1.743553	 -1.182659	 -0.911375
  1.760908	 -1.173146	 -0.903953
  1.777152	 -1.164202	 -0.896386
  1.793381	 -1.155298	 -0.888813
  1.809604	 -1.146382	 -0.881242
  1.824966	 -1.136089	 -0.873624
  1.839913	 -1.125202	 -0.866003
  1.854857	 -1.114311	 -0.858384
  1.869804	 -1.103417	 -0.850774
  1.884808	 -1.091948	 -0.844195
  1.899802	 -1.079723	 -0.839126
  1.914789	 -1.067496	 -0.834039
  1.929788	 -1.055264	 -0.828999
  1.945010	 -1.042910	 -0.825622
  1.959937	 -1.030040	 -0.821469
  1.975164	 -1.016485	 -0.817238
  1.991304	 -1.003461	 -0.817099
  2.008119	 -0.992574	 -0.821444
  2.024799	 -0.982923	 -0.825787
  2.041851	 -0.972431	 -0.830187
  2.058470	 -0.962911	 -0.836189
  2.074767	 -0.953513	 -0.842646
  2.091839	 -0.945885	 -0.849956
  2.108624	 -0.938150	 -0.857501
  2.125704	 -0.932042	 -0.865954
  2.142829	 -0.926212	 -0.874490
  2.159921	 -0.921457	 -0.883716
  2.177020	 -0.917003	 -0.893086
  2.194071	 -0.913424	 -0.902905
  2.211095	 -0.910166	 -0.912884
  2.228119	 -0.906961	 -0.922884
  2.245112	 -0.904396	 -0.933114
