 -1.875068	 -1.657118	  0.152070
 -1.887662	 -1.658800	  0.161534
 -1.871507	 -1.657763	  0.149727
 -1.855465	 -1.655584	  0.137821
 -1.839699	 -1.652003	  0.125963
 -1.824187	 -1.647833	  0.114091
 -1.808944	 -1.643556	  0.101843
 -1.794293	 -1.639025	  0.089588
 -1.781608	 -1.633938	  0.075619
 -1.771777	 -1.628905	  0.058648
 -1.757646	 -1.629464	  0.038091
 -1.742144	 -1.631000	  0.025339
 -1.723386	 -1.626021	  0.019412
 -1.703000	 -1.618923	  0.014945
 -1.680759	 -1.616674	  0.006553
 -1.665788	 -1.616004	 -0.006566
 -1.654927	 -1.613545	 -0.019031
 -1.641061	 -1.606989	 -0.031461
 -1.623439	 -1.597876	 -0.047286
 -1.611699	 -1.593815	 -0.062603
 -1.601819	 -1.593038	 -0.078843
 -1.585236	 -1.594650	 -0.095450
 -1.568517	 -1.594360	 -0.105645
 -1.554108	 -1.590950	 -0.114182
 -1.537877	 -1.585337	 -0.124222
 -1.517402	 -1.579734	 -0.136286
 -1.500439	 -1.577850	 -0.148087
 -1.486566	 -1.582713	 -0.157209
 -1.468109	 -1.586029	 -0.167971
 -1.449946	 -1.585177	 -0.178062
 -1.432520	 -1.583451	 -0.187774
 -1.414966	 -1.581832	 -0.197211
 -1.397431	 -1.579200	 -0.206251
 -1.380814	 -1.576137	 -0.215613
 -1.382176	 -1.573843	 -0.233449
 -1.383020	 -1.572415	 -0.254249
 -1.384593	 -1.571663	 -0.275520
 -1.388848	 -1.571177	 -0.295579
 -1.394164	 -1.569699	 -0.315136
 -1.398560	 -1.567512	 -0.333156
 -1.403053	 -1.564537	 -0.353531
 -1.406407	 -1.562149	 -0.373052
 -1.409508	 -1.560037	 -0.392271
 -1.412687	 -1.558109	 -0.411599
 -1.416529	 -1.556016	 -0.431429
 -1.419518	 -1.554002	 -0.451118
 -1.422176	 -1.551992	 -0.470770
 -1.421993	 -1.549969	 -0.490577
 -1.418056	 -1.547818	 -0.510059
 -1.416722	 -1.546463	 -0.527441
 -1.414086	 -1.544709	 -0.547501
 -1.407802	 -1.543265	 -0.564802
 -1.395355	 -1.543893	 -0.580726
 -1.376851	 -1.544778	 -0.596798
 -1.371104	 -1.543770	 -0.606138
 -1.361432	 -1.545620	 -0.609248
 -1.349476	 -1.545490	 -0.624275
 -1.327642	 -1.548443	 -0.632465
 -1.321464	 -1.546723	 -0.641569
 -1.301283	 -1.551898	 -0.640285
 -1.283743	 -1.560606	 -0.639471
 -1.260121	 -1.569646	 -0.633797
 -1.239295	 -1.569385	 -0.626484
 -1.221233	 -1.568005	 -0.619247
 -1.206026	 -1.568404	 -0.613889
 -1.185959	 -1.575367	 -0.605640
 -1.168104	 -1.582857	 -0.597109
 -1.151193	 -1.589013	 -0.589188
 -1.131240	 -1.590394	 -0.581800
 -1.114621	 -1.591066	 -0.574007
 -1.097084	 -1.590667	 -0.568991
 -1.074714	 -1.591412	 -0.566160
 -1.056409	 -1.596860	 -0.571870
 -1.048783	 -1.605894	 -0.579732
 -1.041571	 -1.604181	 -0.577682
 -1.028183	 -1.614734	 -0.591864
 -1.021386	 -1.617344	 -0.595898
 -1.020131	 -1.623450	 -0.614914
 -1.034353	 -1.626368	 -0.630773
 -1.043153	 -1.628556	 -0.648275
 -1.055045	 -1.631130	 -0.671230
 -1.059823	 -1.635214	 -0.685328
 -1.059402	 -1.644575	 -0.706187
 -1.061168	 -1.654141	 -0.725706
 -1.061638	 -1.665478	 -0.739596
 -1.067504	 -1.679775	 -0.762196
 -1.069425	 -1.690072	 -0.784447
 -1.068894	 -1.693909	 -0.796802
 -1.067979	 -1.701484	 -0.816347
 -1.061606	 -1.710781	 -0.836963
 -1.059406	 -1.720831	 -0.858101
 -1.052509	 -1.728277	 -0.875515
 -1.046200	 -1.731832	 -0.893591
 -1.037794	 -1.738316	 -0.920176
 -1.022621	 -1.742948	 -0.934681
 -1.001113	 -1.749117	 -0.938554
 -0.973825	 -1.757387	 -0.944905
 -0.955837	 -1.762310	 -0.957394
 -0.943779	 -1.764179	 -0.968203
 -0.935654	 -1.763119	 -0.976808
 -0.908438	 -1.763461	 -0.994768
 -0.889029	 -1.768654	 -1.004015
 -0.877081	 -1.769092	 -1.007302
 -0.858581	 -1.776085	 -1.016317
 -0.839934	 -1.780012	 -1.023510
 -0.819830	 -1.782080	 -1.028972
 -0.798080	 -1.783846	 -1.034791
 -0.782082	 -1.784665	 -1.040925
 -0.763747	 -1.785391	 -1.052567
 -0.740274	 -1.789133	 -1.060525
 -0.720920	 -1.785342	 -1.063342
 -0.703951	 -1.777679	 -1.065069
 -0.684084	 -1.764223	 -1.066271
 -0.664421	 -1.752999	 -1.068195
 -0.649096	 -1.745463	 -1.061905
 -0.620916	 -1.742526	 -1.057460
 -0.600610	 -1.738494	 -1.052870
 -0.588068	 -1.733252	 -1.050750
 -0.569067	 -1.723972	 -1.046945
 -0.553636	 -1.708283	 -1.040508
 -0.539763	 -1.698658	 -1.036451
 -0.522771	 -1.685932	 -1.031279
 -0.506863	 -1.671073	 -1.028999
 -0.493773	 -1.659812	 -1.026683
 -0.473844	 -1.649025	 -1.028604
 -0.455569	 -1.635702	 -1.028118
 -0.445773	 -1.618735	 -1.023459
 -0.435604	 -1.601575	 -1.018494
 -0.421879	 -1.587594	 -1.014783
 -0.408722	 -1.577984	 -1.014325
 -0.395786	 -1.571887	 -1.014266
 -0.384911	 -1.569103	 -1.014742
 -0.371156	 -1.564924	 -1.015257
 -0.354836	 -1.561090	 -1.017795
 -0.337732	 -1.559899	 -1.026093
 -0.320538	 -1.560692	 -1.035438
 -0.305039	 -1.561511	 -1.047896
 -0.286914	 -1.562346	 -1.058951
 -0.269634	 -1.563499	 -1.070039
 -0.251409	 -1.563867	 -1.078748
 -0.234629	 -1.564155	 -1.089683
 -0.216750	 -1.564377	 -1.100470
 -0.198016	 -1.562898	 -1.108648
 -0.180567	 -1.562245	 -1.118495
 -0.161132	 -1.560053	 -1.126628
 -0.142727	 -1.557018	 -1.134767
 -0.123864	 -1.554465	 -1.143024
 -0.106227	 -1.552001	 -1.150490
 -0.090094	 -1.549212	 -1.158416
 -0.073124	 -1.546650	 -1.166567
 -0.056877	 -1.544633	 -1.176159
 -0.041140	 -1.542979	 -1.186615
 -0.025440	 -1.541721	 -1.197947
 -0.010273	 -1.540071	 -1.209281
  0.006307	 -1.539106	 -1.220985
  0.021946	 -1.538549	 -1.233140
  0.037951	 -1.537916	 -1.246260
  0.054575	 -1.537689	 -1.257952
  0.070341	 -1.537237	 -1.269153
  0.086362	 -1.535914	 -1.281121
  0.101098	 -1.534403	 -1.293396
  0.116777	 -1.533307	 -1.305935
  0.132672	 -1.531062	 -1.317627
  0.147581	 -1.528700	 -1.331044
  0.164612	 -1.526784	 -1.343013
  0.180224	 -1.525496	 -1.355616
  0.197810	 -1.523750	 -1.366101
  0.214920	 -1.522538	 -1.377381
  0.233516	 -1.521346	 -1.389101
  0.249882	 -1.520168	 -1.399537
  0.266129	 -1.518862	 -1.408459
  0.281220	 -1.517929	 -1.418496
  0.295530	 -1.518470	 -1.431149
  0.311790	 -1.517835	 -1.442183
  0.326510	 -1.518697	 -1.455387
  0.341961	 -1.519702	 -1.467893
  0.357711	 -1.519664	 -1.478466
  0.374878	 -1.519502	 -1.486427
  0.397685	 -1.524185	 -1.500863
  0.411670	 -1.525662	 -1.513215
  0.421972	 -1.524680	 -1.524012
  0.436999	 -1.523820	 -1.537430
  0.459795	 -1.529180	 -1.552644
  0.471170	 -1.532565	 -1.560709
  0.486683	 -1.533858	 -1.575528
  0.497324	 -1.531499	 -1.590920
  0.508073	 -1.527159	 -1.609880
  0.521719	 -1.525048	 -1.628497
  0.533223	 -1.524949	 -1.640719
  0.548402	 -1.523841	 -1.649224
  0.570968	 -1.523560	 -1.661411
  0.589081	 -1.527189	 -1.676272
  0.599466	 -1.528119	 -1.690123
  0.608435	 -1.525328	 -1.705314
  0.622087	 -1.519434	 -1.721828
  0.637762	 -1.515976	 -1.736792
  0.653409	 -1.514486	 -1.750208
  0.670002	 -1.513215	 -1.761464
  0.685665	 -1.511891	 -1.774201
  0.702151	 -1.510871	 -1.786669
  0.720314	 -1.509680	 -1.798084
  0.736291	 -1.508665	 -1.810101
  0.753357	 -1.507125	 -1.819884
  0.769578	 -1.506072	 -1.831231
  0.789762	 -1.503811	 -1.840389
  0.813906	 -1.501189	 -1.835605
  0.829951	 -1.498627	 -1.847266
