 -1.275141	  0.772000	 -2.117412
 -1.280934	  0.770126	 -2.120077
 -1.263605	  0.776149	 -2.112133
 -1.246240	  0.782191	 -2.104294
 -1.228967	  0.788581	 -2.096664
 -1.212146	  0.791984	 -2.090046
 -1.191466	  0.795693	 -2.082266
 -1.173070	  0.801854	 -2.073102
 -1.157257	  0.809859	 -2.067017
 -1.141999	  0.817426	 -2.063503
 -1.116640	  0.824941	 -2.054573
 -1.104346	  0.826191	 -2.049294
 -1.088032	  0.829766	 -2.041692
 -1.063751	  0.840976	 -2.030997
 -1.053389	  0.847960	 -2.024781
 -1.037410	  0.861435	 -2.014762
 -1.019776	  0.870318	 -2.006303
 -1.006175	  0.874109	 -2.000900
 -0.983674	  0.879194	 -1.994826
 -0.965673	  0.884683	 -1.986337
 -0.951261	  0.891242	 -1.977364
 -0.930455	  0.903751	 -1.966416
 -0.921820	  0.908810	 -1.961835
 -0.901322	  0.916161	 -1.957819
 -0.879121	  0.923101	 -1.950193
 -0.867173	  0.927215	 -1.942581
 -0.847104	  0.938708	 -1.928876
 -0.832779	  0.946370	 -1.922632
 -0.817713	  0.954583	 -1.921331
 -0.794988	  0.962851	 -1.922936
 -0.774969	  0.971662	 -1.924948
 -0.759100	  0.978396	 -1.924467
 -0.739604	  0.986494	 -1.913216
 -0.723482	  0.996273	 -1.898487
 -0.708934	  1.007511	 -1.891915
 -0.697603	  1.019433	 -1.887372
 -0.681616	  1.029712	 -1.881723
 -0.659102	  1.037699	 -1.873343
 -0.637978	  1.046589	 -1.871925
 -0.621853	  1.055143	 -1.873448
 -0.608969	  1.065171	 -1.876029
 -0.589492	  1.080753	 -1.878946
 -0.574434	  1.089493	 -1.881276
 -0.557000	  1.097140	 -1.881286
 -0.532225	  1.107512	 -1.878437
 -0.515094	  1.116076	 -1.875519
 -0.506323	  1.120247	 -1.873327
 -0.482882	  1.126836	 -1.872432
 -0.462245	  1.132545	 -1.871140
 -0.443160	  1.138545	 -1.869657
 -0.424142	  1.144388	 -1.867441
 -0.405034	  1.147641	 -1.863447
 -0.386166	  1.148362	 -1.861399
 -0.365201	  1.145752	 -1.863029
 -0.341306	  1.147210	 -1.863100
 -0.323010	  1.148087	 -1.857668
 -0.307084	  1.143677	 -1.848534
 -0.290846	  1.135731	 -1.839985
 -0.268710	  1.132402	 -1.831162
 -0.251189	  1.132738	 -1.821148
 -0.238529	  1.130703	 -1.808933
 -0.226113	  1.122128	 -1.793009
 -0.212621	  1.113254	 -1.780527
 -0.195979	  1.105737	 -1.770948
 -0.177238	  1.100614	 -1.763419
 -0.162129	  1.098053	 -1.754625
 -0.147510	  1.094647	 -1.741610
 -0.127088	  1.090504	 -1.731156
 -0.106668	  1.083685	 -1.724238
 -0.091099	  1.078700	 -1.717004
 -0.074634	  1.073461	 -1.703198
 -0.062987	  1.070321	 -1.685681
 -0.055421	  1.067963	 -1.667274
 -0.045320	  1.064510	 -1.649164
 -0.033365	  1.054886	 -1.630932
 -0.026260	  1.044724	 -1.619906
 -0.012592	  1.030975	 -1.609843
  0.006761	  1.018317	 -1.597827
  0.020392	  1.011667	 -1.585026
  0.030329	  1.006437	 -1.573323
  0.040656	  1.000744	 -1.555732
  0.049454	  0.994593	 -1.537634
  0.058620	  0.990098	 -1.520952
  0.070915	  0.986651	 -1.503165
  0.082598	  0.981116	 -1.487479
  0.092613	  0.972725	 -1.472667
  0.098903	  0.960469	 -1.458895
  0.103349	  0.945158	 -1.445726
  0.109680	  0.931429	 -1.430857
  0.119517	  0.920829	 -1.418475
  0.130790	  0.914891	 -1.402333
  0.146380	  0.908086	 -1.385962
  0.157745	  0.901733	 -1.373129
  0.170591	  0.895373	 -1.362736
  0.190577	  0.887486	 -1.353369
  0.209814	  0.881170	 -1.347652
  0.226976	  0.881421	 -1.346730
  0.248360	  0.874530	 -1.343584
  0.262674	  0.866603	 -1.335520
  0.285672	  0.862214	 -1.321449
  0.297917	  0.863318	 -1.311496
  0.310848	  0.862820	 -1.297289
  0.327773	  0.866954	 -1.279472
  0.339779	  0.870519	 -1.269115
  0.355157	  0.871773	 -1.257405
  0.371296	  0.874842	 -1.251381
  0.393001	  0.876231	 -1.246546
  0.416613	  0.880411	 -1.243576
  0.440838	  0.892907	 -1.240337
  0.457856	  0.900351	 -1.240835
  0.470234	  0.911948	 -1.240893
  0.479345	  0.924399	 -1.229193
  0.492251	  0.943241	 -1.207766
  0.500422	  0.954735	 -1.192362
  0.505815	  0.963592	 -1.183261
  0.517433	  0.980462	 -1.177581
  0.529181	  0.998743	 -1.173334
  0.539535	  1.013699	 -1.169656
  0.551707	  1.029563	 -1.166737
  0.568540	  1.043569	 -1.168272
  0.588887	  1.059955	 -1.174887
  0.601951	  1.070115	 -1.177837
  0.614181	  1.081372	 -1.180971
  0.623546	  1.101023	 -1.182090
  0.629003	  1.121047	 -1.184612
  0.643416	  1.141775	 -1.193525
  0.668680	  1.153957	 -1.195191
  0.689763	  1.161559	 -1.190873
  0.699013	  1.163435	 -1.188510
  0.715075	  1.178706	 -1.185129
  0.728278	  1.194857	 -1.185806
  0.740060	  1.213050	 -1.181154
  0.753914	  1.227474	 -1.175217
  0.771549	  1.240209	 -1.170491
  0.784865	  1.250301	 -1.167118
  0.799266	  1.261986	 -1.164763
  0.819529	  1.271887	 -1.162677
  0.836481	  1.279574	 -1.158441
  0.850287	  1.290309	 -1.151218
  0.872196	  1.300183	 -1.142713
  0.894866	  1.301392	 -1.141685
  0.914044	  1.303308	 -1.148969
  0.928191	  1.308089	 -1.158129
  0.951957	  1.314596	 -1.164695
  0.977275	  1.317460	 -1.160873
  0.988533	  1.318146	 -1.155460
  1.008080	  1.320783	 -1.152281
  1.034961	  1.323636	 -1.149564
  1.049070	  1.324561	 -1.145191
  1.067873	  1.325761	 -1.142038
  1.092022	  1.327529	 -1.138681
  1.107802	  1.328474	 -1.130991
  1.124797	  1.329430	 -1.122785
  1.149263	  1.331127	 -1.114339
  1.169115	  1.331402	 -1.104117
  1.184262	  1.332282	 -1.094498
  1.195384	  1.332995	 -1.087183
  1.218830	  1.342370	 -1.091339
  1.240852	  1.353822	 -1.092762
  1.260786	  1.356857	 -1.083586
  1.276327	  1.358198	 -1.076126
  1.294625	  1.363057	 -1.070518
  1.314286	  1.366483	 -1.062242
  1.332388	  1.368560	 -1.053321
  1.350199	  1.373946	 -1.047260
  1.368223	  1.379420	 -1.041760
  1.387473	  1.383115	 -1.034535
  1.405819	  1.388368	 -1.028580
  1.422808	  1.393754	 -1.023211
  1.442475	  1.397975	 -1.015479
  1.460634	  1.404180	 -1.009624
  1.476880	  1.410037	 -1.005459
  1.497575	  1.413348	 -0.997356
  1.515554	  1.418201	 -0.990711
  1.531986	  1.423649	 -0.985957
  1.551133	  1.426762	 -0.978079
  1.570332	  1.432603	 -0.969048
  1.585827	  1.440338	 -0.963635
  1.603941	  1.443804	 -0.959372
  1.623827	  1.445273	 -0.957939
  1.644414	  1.449570	 -0.959884
  1.676259	  1.454522	 -0.956571
  1.693654	  1.456839	 -0.943987
  1.708680	  1.459471	 -0.933519
  1.720138	  1.466608	 -0.915667
  1.734066	  1.474808	 -0.898925
  1.743990	  1.476450	 -0.888481
  1.759182	  1.475311	 -0.880372
  1.784179	  1.480071	 -0.862861
  1.796854	  1.488559	 -0.852260
  1.809380	  1.497431	 -0.844182
  1.826662	  1.502145	 -0.838723
  1.846886	  1.501168	 -0.831100
  1.869012	  1.501872	 -0.822119
  1.884506	  1.506913	 -0.812616
  1.896667	  1.513505	 -0.801082
  1.915267	  1.519972	 -0.787723
  1.934697	  1.519550	 -0.783217
  1.952785	  1.523374	 -0.775588
