  1.129802	 -2.181299	  0.819633
  1.127881	 -2.185130	  0.819999
  1.136813	 -2.167316	  0.818296
  1.145744	 -2.149503	  0.816592
  1.153772	 -2.131200	  0.817346
  1.160293	 -2.112759	  0.821519
  1.166814	 -2.094319	  0.825692
  1.173604	 -2.075831	  0.829170
  1.180531	 -2.057329	  0.832284
  1.187559	 -2.038858	  0.835357
  1.194834	 -2.020467	  0.838330
  1.202108	 -2.002075	  0.841302
  1.209028	 -1.983421	  0.843334
  1.215811	 -1.964682	  0.845016
  1.222595	 -1.945943	  0.846697
  1.228386	 -1.926802	  0.847008
  1.233900	 -1.907577	  0.846946
  1.239414	 -1.888352	  0.846884
  1.243704	 -1.868836	  0.846036
  1.247423	 -1.849222	  0.844828
  1.251142	 -1.829608	  0.843620
  1.254805	 -1.809948	  0.843346
  1.258467	 -1.790288	  0.843111
  1.262637	 -1.770752	  0.844096
  1.267023	 -1.751298	  0.845610
  1.271866	 -1.731905	  0.846290
  1.277312	 -1.712666	  0.845841
  1.282948	 -1.693498	  0.844931
  1.289490	 -1.674877	  0.841695
  1.296033	 -1.656257	  0.838459
  1.303366	 -1.637764	  0.836406
  1.310703	 -1.619271	  0.834358
  1.317785	 -1.600671	  0.832390
  1.324681	 -1.581995	  0.830478
  1.331578	 -1.563319	  0.828567
  1.337141	 -1.544199	  0.826698
  1.342308	 -1.524968	  0.824843
  1.347476	 -1.505736	  0.822987
  1.350883	 -1.486113	  0.821163
  1.353590	 -1.466380	  0.819354
  1.356298	 -1.446647	  0.817545
  1.359270	 -1.427018	  0.815120
  1.362290	 -1.407411	  0.812581
  1.365888	 -1.387917	  0.809933
  1.370127	 -1.368568	  0.807166
  1.375522	 -1.349447	  0.804864
  1.381999	 -1.330616	  0.803013
  1.388884	 -1.311862	  0.802067
  1.396093	 -1.293207	  0.801875
  1.403286	 -1.274546	  0.801780
  1.410388	 -1.255855	  0.802233
  1.417490	 -1.237164	  0.802686
  1.424544	 -1.218449	  0.802704
  1.431559	 -1.199722	  0.802388
  1.438573	 -1.180995	  0.802072
  1.445157	 -1.162146	  0.800901
  1.451694	 -1.143287	  0.799639
  1.458152	 -1.124407	  0.798281
  1.463391	 -1.105312	  0.795466
  1.468629	 -1.086216	  0.792651
  1.473868	 -1.067121	  0.789837
  1.476926	 -1.048082	  0.784531
  1.476918	 -1.029944	  0.776104
  1.476910	 -1.011806	  0.767676
  1.476901	 -0.993669	  0.759248
  1.476893	 -0.975531	  0.750821
  1.474479	 -0.959338	  0.739334
  1.469144	 -0.946771	  0.724718
  1.463808	 -0.934205	  0.710102
  1.458473	 -0.921638	  0.695487
  1.453138	 -0.909072	  0.680871
  1.447802	 -0.896505	  0.666255
  1.442467	 -0.883939	  0.651640
  1.436025	 -0.871954	  0.636982
  1.426009	 -0.862302	  0.622611
  1.415993	 -0.852649	  0.608240
  1.405977	 -0.842997	  0.593870
  1.395961	 -0.833345	  0.579499
  1.385945	 -0.823692	  0.565129
  1.375929	 -0.814040	  0.550758
  1.365913	 -0.804388	  0.536388
  1.354036	 -0.794672	  0.523560
  1.340269	 -0.785056	  0.512698
  1.326502	 -0.775440	  0.501835
  1.312735	 -0.765824	  0.490972
  1.298968	 -0.756207	  0.480110
  1.285459	 -0.746806	  0.468746
  1.272296	 -0.737688	  0.456763
  1.259133	 -0.728570	  0.444780
  1.245969	 -0.719452	  0.432797
  1.232806	 -0.710334	  0.420814
  1.218734	 -0.701047	  0.410056
  1.203176	 -0.691592	  0.401777
  1.187618	 -0.682136	  0.393498
  1.172060	 -0.672680	  0.385220
  1.156502	 -0.663224	  0.376941
  1.140944	 -0.653768	  0.368662
  1.125386	 -0.644312	  0.360384
  1.110868	 -0.630629	  0.358982
  1.096448	 -0.616813	  0.357884
  1.082028	 -0.602998	  0.356786
  1.067609	 -0.589183	  0.355688
  1.053189	 -0.575367	  0.354589
  1.045023	 -0.557701	  0.359196
  1.037850	 -0.539803	  0.364507
  1.031896	 -0.521595	  0.370253
  1.029385	 -0.502953	  0.377050
  1.026874	 -0.484312	  0.383846
  1.024363	 -0.465671	  0.390643
  1.024474	 -0.446900	  0.397545
  1.024758	 -0.428132	  0.404450
  1.025042	 -0.409363	  0.411354
  1.025326	 -0.390595	  0.418259
  1.026376	 -0.371973	  0.425477
  1.032175	 -0.355017	  0.434359
  1.037974	 -0.338062	  0.443241
  1.043773	 -0.321107	  0.452123
  1.049573	 -0.304152	  0.461005
  1.055788	 -0.287649	  0.470440
  1.065758	 -0.277846	  0.484740
  1.075729	 -0.268043	  0.499040
  1.085699	 -0.258240	  0.513340
  1.095669	 -0.248437	  0.527640
  1.105666	 -0.238751	  0.542002
  1.116277	 -0.233277	  0.558047
  1.126889	 -0.227802	  0.574091
  1.137500	 -0.222328	  0.590136
  1.148111	 -0.216854	  0.606181
  1.158722	 -0.211379	  0.622226
  1.169090	 -0.206047	  0.638476
  1.178870	 -0.201055	  0.655192
  1.188650	 -0.196064	  0.671909
  1.198430	 -0.191073	  0.688625
  1.208209	 -0.186081	  0.705342
  1.223930	 -0.175378	  0.711530
  1.239690	 -0.163448	  0.708478
  1.255450	 -0.151519	  0.705426
  1.271209	 -0.139589	  0.702374
  1.286360	 -0.126536	  0.702120
  1.301406	 -0.113359	  0.702229
  1.316452	 -0.100183	  0.702337
  1.331497	 -0.087007	  0.702446
  1.346543	 -0.073831	  0.702554
  1.362175	 -0.061368	  0.703109
  1.378367	 -0.049663	  0.704019
  1.398013	 -0.047557	  0.700922
  1.417660	 -0.045451	  0.697825
  1.437306	 -0.043345	  0.694728
  1.457058	 -0.042231	  0.691792
  1.476868	 -0.042203	  0.689041
  1.496678	 -0.042174	  0.686290
  1.516487	 -0.042146	  0.683539
  1.536231	 -0.039994	  0.681177
  1.555841	 -0.036697	  0.679038
  1.575451	 -0.033400	  0.676899
  1.595061	 -0.030103	  0.674761
  1.614671	 -0.026806	  0.672622
  1.631870	 -0.016603	  0.672309
  1.646653	 -0.003152	  0.673040
  1.661435	  0.010299	  0.673771
  1.676218	  0.023750	  0.674503
  1.690438	  0.037789	  0.675342
  1.700205	  0.055176	  0.676869
  1.709971	  0.072562	  0.678396
  1.719713	  0.089962	  0.679925
  1.726786	  0.108587	  0.681676
  1.733859	  0.127213	  0.683427
  1.740454	  0.146033	  0.684941
  1.746299	  0.165126	  0.686086
  1.752076	  0.184248	  0.687069
  1.757231	  0.203566	  0.686595
  1.762387	  0.222885	  0.686120
  1.767203	  0.242202	  0.684216
  1.771995	  0.261516	  0.682211
  1.776506	  0.280815	  0.679531
  1.780850	  0.300094	  0.676455
  1.785149	  0.319384	  0.673383
  1.789208	  0.338729	  0.670339
  1.793267	  0.358075	  0.667294
  1.797336	  0.377467	  0.664576
  1.801415	  0.396896	  0.662152
  1.805494	  0.416325	  0.659727
  1.809753	  0.435797	  0.658078
  1.814043	  0.455272	  0.656566
  1.818401	  0.474749	  0.655272
  1.823026	  0.494203	  0.654878
  1.827651	  0.513657	  0.654485
  1.832733	  0.533000	  0.654322
  1.838215	  0.552234	  0.654363
  1.843768	  0.571447	  0.654431
  1.850174	  0.590389	  0.654826
  1.856579	  0.609332	  0.655220
  1.862825	  0.628323	  0.655797
  1.868976	  0.647341	  0.656481
  1.875103	  0.666367	  0.657170
  1.879883	  0.685762	  0.658154
  1.884663	  0.705158	  0.659137
  1.888927	  0.724676	  0.660070
  1.892682	  0.744300	  0.660953
  1.896389	  0.763936	  0.661786
  1.899369	  0.783713	  0.661876
  1.902350	  0.803489	  0.661966
  1.905240	  0.823256	  0.661004
  1.908095	  0.843004	  0.659648
  1.911365	  0.862606	  0.657394
  1.914906	  0.882083	  0.654545
  1.918714	  0.901422	  0.651154
  1.922785	  0.920605	  0.647224
  1.926967	  0.939724	  0.643103
  1.931485	  0.958631	  0.638403
  1.936003	  0.977539	  0.633703
  1.940975	  0.996223	  0.628584
  1.946008	  1.014874	  0.623408
  1.951246	  1.033451	  0.618170
  1.956690	  1.051952	  0.612868
  1.962179	  1.070451	  0.607612
  1.968026	  1.088941	  0.602717
  1.973872	  1.107430	  0.597823
  1.980081	  1.125926	  0.593422
  1.986801	  1.144399	  0.589738
  1.993520	  1.162873	  0.586054
  2.000820	  1.181257	  0.583100
  2.008707	  1.199506	  0.580911
  2.016593	  1.217755	  0.578721
  2.024769	  1.235923	  0.576971
  2.033090	  1.254046	  0.575444
  2.041411	  1.272168	  0.573917
  2.049811	  1.290558	  0.572543
  2.058008	  1.308781	  0.571687
