 -0.011320	  1.046634	 -2.272299
 -0.012501	  1.046208	 -2.270527
 -0.023905	  1.042089	 -2.253413
 -0.035195	  1.037342	 -2.238745
 -0.046876	  1.032182	 -2.226471
 -0.063493	  1.025208	 -2.216338
 -0.088032	  1.014360	 -2.209402
 -0.099600	  1.009228	 -2.209274
 -0.122949	  1.000400	 -2.210557
 -0.146543	  0.993756	 -2.198486
 -0.163150	  0.995185	 -2.182910
 -0.175278	  1.005428	 -2.163329
 -0.188226	  1.006790	 -2.137317
 -0.194937	  0.995719	 -2.112934
 -0.199328	  0.979805	 -2.097234
 -0.206318	  0.964640	 -2.088550
 -0.219392	  0.950396	 -2.080966
 -0.234618	  0.940587	 -2.071089
 -0.245968	  0.932408	 -2.057822
 -0.256513	  0.924192	 -2.041972
 -0.273960	  0.912948	 -2.026654
 -0.289880	  0.897060	 -2.016937
 -0.300402	  0.884092	 -2.013349
 -0.312170	  0.870527	 -2.008168
 -0.326335	  0.850326	 -2.000352
 -0.335442	  0.833025	 -1.996618
 -0.344052	  0.817820	 -1.997092
 -0.359974	  0.797052	 -1.998258
 -0.374872	  0.783363	 -1.996665
 -0.386578	  0.775906	 -1.996122
 -0.402171	  0.767414	 -1.996434
 -0.425201	  0.750682	 -1.995903
 -0.440406	  0.741209	 -1.993431
 -0.457657	  0.730868	 -1.991729
 -0.473990	  0.721315	 -1.993333
 -0.483236	  0.715444	 -1.995508
 -0.501370	  0.707751	 -1.999211
 -0.526144	  0.702865	 -2.004656
 -0.547924	  0.705535	 -2.013605
 -0.558078	  0.708897	 -2.017833
 -0.580961	  0.717298	 -2.030254
 -0.600024	  0.724520	 -2.042090
 -0.608871	  0.727609	 -2.045948
 -0.629014	  0.734474	 -2.058017
 -0.646338	  0.739458	 -2.067051
 -0.660226	  0.744040	 -2.070799
 -0.688041	  0.757288	 -2.080365
 -0.704748	  0.763043	 -2.086469
 -0.716045	  0.766445	 -2.092123
 -0.735478	  0.772058	 -2.104862
 -0.748622	  0.775955	 -2.114496
 -0.764652	  0.780534	 -2.126794
 -0.786723	  0.782801	 -2.139451
 -0.802719	  0.785183	 -2.147420
 -0.817928	  0.787305	 -2.155497
 -0.839313	  0.790303	 -2.167081
 -0.856224	  0.791796	 -2.175983
 -0.871249	  0.793384	 -2.184245
 -0.891406	  0.795756	 -2.195944
 -0.908939	  0.795735	 -2.205985
