 -1.613210	 -0.836698	  1.578010
 -1.630310	 -0.808876	  1.601124
 -1.621840	 -0.822738	  1.589387
 -1.612579	 -0.837297	  1.579228
 -1.603238	 -0.851953	  1.569330
 -1.593646	 -0.866728	  1.559827
 -1.583780	 -0.881599	  1.550797
 -1.573973	 -0.896187	  1.541752
 -1.560962	 -0.906036	  1.531563
 -1.543110	 -0.915185	  1.520583
 -1.529120	 -0.927211	  1.512345
 -1.516171	 -0.939683	  1.505323
 -1.506269	 -0.956476	  1.502262
 -1.498721	 -0.983600	  1.501004
 -1.494976	 -1.005455	  1.497853
 -1.487547	 -1.024630	  1.488768
 -1.479282	 -1.039969	  1.476716
 -1.471370	 -1.050568	  1.468556
 -1.461761	 -1.063264	  1.463043
 -1.449182	 -1.084111	  1.458091
 -1.441384	 -1.107903	  1.450720
 -1.438424	 -1.122281	  1.444774
 -1.433868	 -1.137647	  1.435832
 -1.422415	 -1.156058	  1.420939
 -1.411980	 -1.168361	  1.406274
 -1.406292	 -1.179911	  1.394585
 -1.400587	 -1.194970	  1.378584
 -1.390321	 -1.213478	  1.358195
 -1.380366	 -1.222706	  1.341029
 -1.377199	 -1.225702	  1.333735
 -1.369753	 -1.233907	  1.311657
 -1.367141	 -1.242414	  1.292622
 -1.363765	 -1.253826	  1.275427
 -1.354886	 -1.264352	  1.255922
 -1.348607	 -1.269301	  1.244152
 -1.340561	 -1.272690	  1.229780
 -1.328179	 -1.277525	  1.194813
 -1.324454	 -1.280877	  1.183282
 -1.321672	 -1.286283	  1.172544
 -1.314181	 -1.297363	  1.154305
 -1.305584	 -1.306071	  1.135126
 -1.297312	 -1.314459	  1.118770
 -1.289041	 -1.323861	  1.103155
 -1.280698	 -1.333019	  1.087459
 -1.271942	 -1.342367	  1.072017
 -1.262964	 -1.352625	  1.057197
 -1.254316	 -1.363520	  1.042671
 -1.245980	 -1.375170	  1.028545
 -1.237820	 -1.387481	  1.015012
 -1.229233	 -1.399146	  1.004337
 -1.213952	 -1.409010	  0.998650
 -1.204735	 -1.427763	  0.984910
 -1.203221	 -1.447902	  0.968022
 -1.212390	 -1.473708	  0.944813
 -1.208322	 -1.482910	  0.941795
 -1.199777	 -1.497732	  0.940167
 -1.190320	 -1.512207	  0.938428
 -1.173951	 -1.530008	  0.933087
 -1.165676	 -1.542385	  0.921887
 -1.157679	 -1.559891	  0.902944
 -1.153941	 -1.575921	  0.886440
 -1.151228	 -1.588684	  0.872959
 -1.147189	 -1.602930	  0.856928
 -1.139048	 -1.615435	  0.842122
 -1.132806	 -1.624790	  0.831078
 -1.122854	 -1.641120	  0.813790
 -1.113544	 -1.655069	  0.804651
 -1.102947	 -1.666236	  0.799303
 -1.087902	 -1.679219	  0.790678
 -1.071028	 -1.696442	  0.780294
 -1.060320	 -1.706879	  0.774713
 -1.047475	 -1.721776	  0.766783
 -1.035631	 -1.736608	  0.756361
 -1.027317	 -1.748149	  0.746688
 -1.015983	 -1.761701	  0.732653
 -1.002889	 -1.776477	  0.715965
 -0.998146	 -1.780223	  0.711726
 -0.982273	 -1.798196	  0.704088
 -0.965764	 -1.815011	  0.698083
 -0.959241	 -1.825970	  0.695132
 -0.949533	 -1.839540	  0.680763
 -0.938280	 -1.851412	  0.667677
 -0.927748	 -1.868108	  0.661257
 -0.918993	 -1.884218	  0.656029
 -0.912022	 -1.900810	  0.656900
 -0.908276	 -1.927352	  0.656055
 -0.903402	 -1.948515	  0.648510
 -0.896096	 -1.963745	  0.640594
 -0.886850	 -1.975554	  0.635389
 -0.875439	 -1.995446	  0.628631
 -0.865771	 -2.013070	  0.618231
 -0.857360	 -2.024162	  0.609838
 -0.847199	 -2.043102	  0.600868
 -0.836749	 -2.060367	  0.588583
 -0.825976	 -2.070696	  0.576106
 -0.816022	 -2.078075	  0.562668
 -0.806583	 -2.088790	  0.548681
 -0.791328	 -2.103451	  0.540189
 -0.773892	 -2.119570	  0.528212
 -0.764432	 -2.128001	  0.520300
 -0.754466	 -2.139559	  0.509060
 -0.742710	 -2.152899	  0.494703
 -0.732793	 -2.162661	  0.483032
 -0.722153	 -2.173858	  0.470101
 -0.711876	 -2.185775	  0.456944
 -0.702174	 -2.196537	  0.444753
 -0.692083	 -2.209575	  0.431045
 -0.684209	 -2.222206	  0.418104
 -0.678255	 -2.235299	  0.405104
 -0.671941	 -2.252993	  0.391590
 -0.664639	 -2.267770	  0.383909
 -0.651614	 -2.283119	  0.374221
 -0.640959	 -2.292737	  0.361747
 -0.631925	 -2.303027	  0.349319
 -0.628427	 -2.311744	  0.332103
 -0.612465	 -2.315533	  0.311069
 -0.599513	 -2.320848	  0.293489
 -0.590848	 -2.331788	  0.279163
