 -0.914193	  0.915687	  2.149570
 -0.908102	  0.936192	  2.170785
 -0.912140	  0.922578	  2.156702
 -0.914633	  0.908361	  2.142858
 -0.916919	  0.894068	  2.129056
 -0.919213	  0.879337	  2.115724
 -0.921522	  0.863916	  2.103200
 -0.923898	  0.848478	  2.090709
 -0.927328	  0.832842	  2.078720
 -0.930832	  0.817318	  2.066744
 -0.936261	  0.803227	  2.054756
 -0.942856	  0.788807	  2.042024
 -0.947813	  0.772846	  2.027841
 -0.950884	  0.757897	  2.015849
 -0.957297	  0.742324	  2.007013
 -0.965398	  0.726294	  1.996902
 -0.970715	  0.709936	  1.984891
 -0.975951	  0.697619	  1.970246
 -0.983969	  0.686938	  1.955665
 -0.990769	  0.674820	  1.940538
 -0.997490	  0.661260	  1.927558
 -1.005921	  0.648328	  1.915515
 -1.014706	  0.636848	  1.902053
 -1.017884	  0.622468	  1.885530
 -1.023920	  0.611816	  1.871183
 -1.033037	  0.601070	  1.856882
 -1.040365	  0.587969	  1.842240
 -1.044732	  0.574721	  1.826504
 -1.050438	  0.566162	  1.811753
 -1.057582	  0.555427	  1.795353
 -1.062948	  0.545924	  1.778143
 -1.066038	  0.537184	  1.760191
 -1.068354	  0.529254	  1.741806
 -1.071156	  0.522060	  1.723630
 -1.073134	  0.512782	  1.705726
 -1.074347	  0.503382	  1.688115
 -1.075551	  0.493976	  1.670505
 -1.075948	  0.483939	  1.653212
 -1.076232	  0.473816	  1.635965
 -1.076307	  0.463416	  1.618917
 -1.076398	  0.452006	  1.602969
 -1.076322	  0.441232	  1.585969
 -1.075086	  0.432212	  1.569339
 -1.074233	  0.420548	  1.550347
 -1.077087	  0.406450	  1.536830
 -1.078868	  0.392696	  1.520311
 -1.079058	  0.382231	  1.503138
 -1.073373	  0.374073	  1.487840
 -1.072634	  0.362256	  1.470321
 -1.077296	  0.346702	  1.456073
 -1.082278	  0.333566	  1.442041
 -1.083176	  0.323043	  1.426233
 -1.084062	  0.310512	  1.410101
 -1.088757	  0.293051	  1.398234
 -1.091986	  0.277185	  1.383764
 -1.092852	  0.268013	  1.369592
 -1.096565	  0.254585	  1.353860
 -1.102476	  0.241425	  1.339581
 -1.108509	  0.227969	  1.325913
 -1.113752	  0.213778	  1.312976
 -1.119002	  0.198563	  1.300602
 -1.123649	  0.183371	  1.288563
 -1.129113	  0.170393	  1.273487
 -1.134647	  0.158527	  1.257922
 -1.143968	  0.147048	  1.244569
 -1.153222	  0.134142	  1.232194
 -1.162691	  0.120421	  1.221172
 -1.172752	  0.108488	  1.208029
 -1.181933	  0.098386	  1.192676
 -1.188403	  0.088576	  1.177253
 -1.196211	  0.077817	  1.161401
 -1.203668	  0.065497	  1.148899
 -1.211392	  0.052921	  1.135069
 -1.219339	  0.041733	  1.120030
 -1.226956	  0.031417	  1.104667
 -1.234559	  0.021116	  1.089303
 -1.242234	  0.010943	  1.073889
 -1.250014	  0.000960	  1.058402
 -1.257793	 -0.009025	  1.042917
 -1.265427	 -0.019264	  1.027526
 -1.273045	 -0.029532	  1.012146
 -1.280445	 -0.040026	  0.996813
 -1.287529	 -0.050842	  0.981555
 -1.294607	 -0.061663	  0.966296
 -1.301041	 -0.072807	  0.950986
 -1.307394	 -0.083991	  0.935671
 -1.313377	 -0.095072	  0.920135
 -1.316931	 -0.105376	  0.903367
 -1.320473	 -0.115672	  0.886591
 -1.323975	 -0.125957	  0.869804
 -1.323172	 -0.134480	  0.851733
 -1.322468	 -0.143093	  0.833846
 -1.324009	 -0.153107	  0.817756
 -1.328876	 -0.164928	  0.800318
 -1.333952	 -0.174537	  0.784432
 -1.334328	 -0.180874	  0.763032
 -1.340095	 -0.186856	  0.745685
 -1.342415	 -0.196534	  0.730568
 -1.351159	 -0.208221	  0.716531
 -1.358023	 -0.221067	  0.701779
 -1.361265	 -0.232339	  0.684066
 -1.365047	 -0.243537	  0.669057
 -1.372585	 -0.255112	  0.654470
 -1.379722	 -0.266577	  0.640177
 -1.385263	 -0.277939	  0.624357
 -1.389997	 -0.288852	  0.608122
 -1.394700	 -0.298787	  0.592491
 -1.398113	 -0.311328	  0.573863
 -1.400689	 -0.320414	  0.556893
 -1.393342	 -0.337399	  0.543842
 -1.387839	 -0.354907	  0.532834
 -1.391781	 -0.372985	  0.520612
 -1.394170	 -0.386841	  0.508764
 -1.395235	 -0.401439	  0.493747
 -1.392096	 -0.412078	  0.478068
 -1.389988	 -0.423430	  0.461986
 -1.386006	 -0.436439	  0.442545
 -1.382843	 -0.448380	  0.432014
 -1.384986	 -0.462821	  0.415335
 -1.385315	 -0.477905	  0.397288
 -1.376222	 -0.491542	  0.391555
 -1.366661	 -0.507083	  0.377728
 -1.355721	 -0.521462	  0.368349
 -1.347714	 -0.537216	  0.357212
 -1.343115	 -0.552470	  0.350654
 -1.333907	 -0.571149	  0.344073
 -1.325844	 -0.588399	  0.338228
 -1.316249	 -0.604928	  0.331532
 -1.306625	 -0.621568	  0.326052
 -1.297840	 -0.639096	  0.323788
 -1.288846	 -0.657465	  0.323681
 -1.278176	 -0.675300	  0.325980
 -1.266276	 -0.691624	  0.325063
 -1.257649	 -0.708458	  0.323307
 -1.250827	 -0.727387	  0.322340
 -1.242260	 -0.745881	  0.319978
 -1.233784	 -0.764214	  0.317648
 -1.228830	 -0.782424	  0.312269
 -1.224749	 -0.801885	  0.308454
 -1.223568	 -0.821576	  0.304199
 -1.222974	 -0.840907	  0.299359
 -1.225753	 -0.860055	  0.294151
 -1.229232	 -0.878966	  0.288724
 -1.232858	 -0.898021	  0.283753
 -1.238146	 -0.916544	  0.278379
 -1.243450	 -0.935064	  0.273004
 -1.248815	 -0.953562	  0.267618
 -1.256062	 -0.971297	  0.261881
 -1.263330	 -0.989024	  0.256142
 -1.273019	 -1.005474	  0.250186
 -1.283739	 -1.021234	  0.244131
 -1.296711	 -1.035066	  0.237779
 -1.309695	 -1.048887	  0.231424
 -1.322994	 -1.062176	  0.224603
 -1.336559	 -1.074971	  0.217372
 -1.350125	 -1.087764	  0.210139
 -1.363688	 -1.100556	  0.202903
 -1.377518	 -1.112284	  0.194465
 -1.391504	 -1.123011	  0.185014
 -1.405489	 -1.133737	  0.175560
 -1.419474	 -1.144463	  0.166106
 -1.433457	 -1.155171	  0.156632
 -1.447095	 -1.163248	  0.144441
 -1.460666	 -1.171016	  0.131972
 -1.474238	 -1.178783	  0.119503
 -1.487809	 -1.186545	  0.107030
 -1.500986	 -1.192584	  0.093251
 -1.513837	 -1.197858	  0.078882
 -1.526427	 -1.203324	  0.064264
 -1.539220	 -1.207573	  0.049516
 -1.552152	 -1.210138	  0.035276
 -1.566769	 -1.212967	  0.022194
 -1.581645	 -1.215966	  0.004876
 -1.591413	 -1.220616	 -0.012500
 -1.598151	 -1.218911	 -0.029386
 -1.610383	 -1.217650	 -0.045519
 -1.620973	 -1.218277	 -0.064346
 -1.627349	 -1.214935	 -0.083215
 -1.637049	 -1.211630	 -0.099614
 -1.645871	 -1.207495	 -0.117105
 -1.653523	 -1.203898	 -0.135732
 -1.661214	 -1.200764	 -0.154017
 -1.667721	 -1.196179	 -0.172389
 -1.674104	 -1.191506	 -0.190758
 -1.680486	 -1.186834	 -0.209127
 -1.686867	 -1.182162	 -0.227497
 -1.692601	 -1.177640	 -0.246116
 -1.697351	 -1.173362	 -0.265067
 -1.702096	 -1.169084	 -0.284019
 -1.706841	 -1.164806	 -0.302971
 -1.711575	 -1.160546	 -0.321929
 -1.715006	 -1.159386	 -0.341596
 -1.718375	 -1.158361	 -0.361283
 -1.721745	 -1.157348	 -0.380971
 -1.725198	 -1.158908	 -0.400605
 -1.728648	 -1.165485	 -0.419172
 -1.732102	 -1.172092	 -0.437730
 -1.736414	 -1.180841	 -0.455189
 -1.741355	 -1.191180	 -0.471580
 -1.746488	 -1.201736	 -0.487773
 -1.752340	 -1.213073	 -0.503174
 -1.758198	 -1.224414	 -0.518572
 -1.764087	 -1.235589	 -0.534078
 -1.769985	 -1.246723	 -0.549610
 -1.775791	 -1.257927	 -0.565126
 -1.781404	 -1.269279	 -0.580606
 -1.787013	 -1.280633	 -0.596085
 -1.791672	 -1.292653	 -0.611377
 -1.795747	 -1.305055	 -0.626529
 -1.799813	 -1.317458	 -0.641681
 -1.802458	 -1.329924	 -0.657096
 -1.804764	 -1.342395	 -0.672561
 -1.807003	 -1.354833	 -0.688062
 -1.808653	 -1.366956	 -0.703882
 -1.810298	 -1.379078	 -0.719705
 -1.811507	 -1.390869	 -0.735814
 -1.812249	 -1.402296	 -0.752211
 -1.812990	 -1.413723	 -0.768609
 -1.814085	 -1.425301	 -0.784880
 -1.815194	 -1.436884	 -0.801146
 -1.815872	 -1.448389	 -0.817492
 -1.816037	 -1.459792	 -0.833921
 -1.817429	 -1.471708	 -0.849922
 -1.822450	 -1.484806	 -0.864175
 -1.827487	 -1.497921	 -0.878433
 -1.831941	 -1.511118	 -0.893306
 -1.834271	 -1.523503	 -0.908836
