 -0.893448	  2.435240	 -0.183430
 -0.895103	  2.439969	 -0.189861
 -0.891043	  2.428367	 -0.174084
 -0.886986	  2.416763	 -0.158308
 -0.883364	  2.404568	 -0.142876
 -0.879794	  2.392301	 -0.127488
 -0.876216	  2.379829	 -0.112268
 -0.872612	  2.366754	 -0.097599
 -0.868943	  2.353932	 -0.082690
 -0.864975	  2.341036	 -0.067842
 -0.860304	  2.327412	 -0.053824
 -0.856023	  2.312814	 -0.040733
 -0.852040	  2.297932	 -0.027913
 -0.849575	  2.282696	 -0.015454
 -0.846306	  2.267399	 -0.002828
 -0.841751	  2.252806	  0.009819
 -0.835991	  2.238619	  0.022678
 -0.830039	  2.224205	  0.034617
 -0.824273	  2.204622	  0.043883
 -0.822712	  2.187418	  0.052647
 -0.820429	  2.172041	  0.064530
 -0.818075	  2.155391	  0.076638
 -0.814445	  2.137970	  0.086053
 -0.807732	  2.121631	  0.094678
 -0.800123	  2.105168	  0.104467
 -0.793996	  2.086755	  0.111731
 -0.793146	  2.069912	  0.120826
 -0.791309	  2.052874	  0.131843
 -0.788703	  2.033254	  0.139686
 -0.783106	  2.016405	  0.145823
 -0.778352	  1.999388	  0.151859
 -0.774369	  1.977317	  0.156670
 -0.770763	  1.956512	  0.161390
 -0.765197	  1.939810	  0.166903
 -0.762328	  1.921666	  0.175618
 -0.759154	  1.905308	  0.185533
 -0.755685	  1.889468	  0.196318
 -0.754830	  1.871588	  0.207156
 -0.755924	  1.854191	  0.217083
 -0.756392	  1.836196	  0.227651
 -0.759093	  1.820948	  0.239382
 -0.755648	  1.802407	  0.251338
 -0.751758	  1.787240	  0.263176
 -0.745065	  1.770525	  0.273223
 -0.736984	  1.750133	  0.276341
 -0.731279	  1.730560	  0.282325
 -0.730275	  1.712435	  0.289128
 -0.730860	  1.695146	  0.299784
 -0.730679	  1.677051	  0.310256
 -0.733681	  1.661229	  0.321296
 -0.738924	  1.644115	  0.328194
 -0.746439	  1.621081	  0.335892
 -0.750087	  1.606209	  0.339725
 -0.752019	  1.585227	  0.339606
 -0.753007	  1.565586	  0.344773
 -0.758567	  1.548686	  0.354330
 -0.756896	  1.530540	  0.364652
 -0.758254	  1.510744	  0.366593
 -0.759385	  1.493242	  0.372328
 -0.757693	  1.472827	  0.380576
 -0.757202	  1.449169	  0.384596
 -0.764781	  1.430756	  0.387246
 -0.766594	  1.411717	  0.388522
 -0.767175	  1.391815	  0.387508
 -0.750991	  1.376515	  0.396064
 -0.743915	  1.353089	  0.400530
 -0.733058	  1.336844	  0.402766
 -0.730989	  1.318865	  0.394965
 -0.728068	  1.295208	  0.395542
 -0.721550	  1.279105	  0.398545
 -0.702314	  1.267155	  0.399730
 -0.692143	  1.247201	  0.404102
 -0.681277	  1.234380	  0.408041
 -0.670620	  1.219075	  0.411029
 -0.654375	  1.201079	  0.411299
 -0.643535	  1.187829	  0.418758
 -0.633672	  1.170331	  0.425144
 -0.617771	  1.156266	  0.431025
 -0.597611	  1.150978	  0.427697
 -0.579989	  1.138821	  0.427586
 -0.567497	  1.121638	  0.431559
 -0.556894	  1.110473	  0.440472
 -0.539535	  1.099373	  0.447432
 -0.524325	  1.089574	  0.454541
 -0.510831	  1.077310	  0.461534
 -0.494705	  1.066813	  0.470267
 -0.478913	  1.055466	  0.476920
 -0.465969	  1.048021	  0.488508
 -0.451346	  1.038901	  0.499077
 -0.435456	  1.032868	  0.508713
 -0.417792	  1.027106	  0.519840
 -0.403641	  1.024418	  0.535327
 -0.389738	  1.015320	  0.543593
 -0.373807	  1.007306	  0.553572
 -0.359621	  0.999404	  0.566081
 -0.344697	  0.997196	  0.581459
 -0.329389	  0.999562	  0.593288
 -0.314013	  1.002439	  0.606768
 -0.300529	  0.999664	  0.620752
 -0.284183	  0.994347	  0.634720
 -0.270041	  0.991300	  0.644390
 -0.254935	  0.987990	  0.658425
 -0.243418	  0.988007	  0.679068
 -0.232785	  0.990702	  0.694039
 -0.217211	  0.990832	  0.706762
 -0.201114	  0.984239	  0.717831
 -0.186695	  0.981283	  0.731544
 -0.174720	  0.975674	  0.748324
 -0.164676	  0.974234	  0.765616
 -0.151518	  0.971507	  0.778973
 -0.135164	  0.965510	  0.793137
 -0.122794	  0.962837	  0.806070
 -0.106602	  0.961636	  0.820886
 -0.095697	  0.953474	  0.840066
 -0.093524	  0.946993	  0.855286
 -0.087261	  0.938020	  0.875405
 -0.072440	  0.928137	  0.889393
 -0.064604	  0.919028	  0.903888
 -0.060480	  0.911597	  0.920108
 -0.051769	  0.902449	  0.938172
 -0.045892	  0.894824	  0.955515
 -0.042563	  0.886676	  0.973018
 -0.039110	  0.876499	  0.991433
 -0.040094	  0.869422	  1.009897
 -0.040931	  0.864813	  1.026645
 -0.043055	  0.857314	  1.047081
 -0.043792	  0.851224	  1.066760
 -0.046541	  0.844841	  1.083420
 -0.051430	  0.838511	  1.102174
 -0.052266	  0.830410	  1.124694
 -0.055456	  0.823633	  1.141195
 -0.057677	  0.816136	  1.157388
 -0.059227	  0.808158	  1.177769
 -0.065453	  0.801518	  1.195104
 -0.070999	  0.794668	  1.213094
 -0.074118	  0.787029	  1.231896
 -0.079633	  0.779939	  1.249457
 -0.085759	  0.772561	  1.267350
 -0.088673	  0.765029	  1.285381
 -0.094499	  0.758494	  1.301757
 -0.100771	  0.749379	  1.322213
 -0.098959	  0.740066	  1.339635
 -0.102137	  0.733434	  1.357132
 -0.109673	  0.723416	  1.375753
 -0.109415	  0.711581	  1.394044
 -0.112097	  0.709223	  1.409860
 -0.118153	  0.704577	  1.430231
 -0.120240	  0.696504	  1.449491
 -0.121253	  0.690676	  1.466833
 -0.126290	  0.687427	  1.489089
 -0.129855	  0.679809	  1.508807
 -0.131080	  0.672421	  1.526387
 -0.130341	  0.672004	  1.543428
 -0.129623	  0.670435	  1.565958
 -0.130907	  0.665039	  1.585888
 -0.134749	  0.660136	  1.604014
 -0.136799	  0.656708	  1.623680
 -0.136057	  0.649945	  1.644781
 -0.137242	  0.646785	  1.661751
 -0.140058	  0.641642	  1.682435
 -0.140774	  0.636191	  1.701773
 -0.137968	  0.633218	  1.720009
 -0.138227	  0.627197	  1.742174
 -0.139948	  0.621248	  1.762640
 -0.136809	  0.620050	  1.778656
 -0.132180	  0.618374	  1.799404
 -0.130837	  0.613804	  1.819176
 -0.129454	  0.608056	  1.837219
 -0.127933	  0.602647	  1.860457
 -0.124933	  0.599619	  1.876133
 -0.123408	  0.592593	  1.894964
 -0.121154	  0.584003	  1.915982
 -0.114858	  0.579502	  1.933368
 -0.107499	  0.580715	  1.954316
 -0.105996	  0.575515	  1.973397
 -0.103512	  0.568005	  1.990725
 -0.098447	  0.563448	  2.009427
 -0.094188	  0.557284	  2.028589
 -0.090206	  0.550875	  2.047013
 -0.084409	  0.547704	  2.066031
 -0.078910	  0.541614	  2.084586
 -0.073918	  0.534724	  2.102123
 -0.066873	  0.530954	  2.121448
 -0.060262	  0.525537	  2.139898
 -0.054882	  0.517673	  2.155953
 -0.046414	  0.514482	  2.174663
 -0.038866	  0.508231	  2.193377
 -0.033257	  0.500874	  2.208822
 -0.025314	  0.497708	  2.228410
 -0.018957	  0.493026	  2.248458
 -0.012528	  0.485472	  2.264236
  0.000796	  0.477360	  2.279366
  0.014874	  0.468874	  2.293661
  0.021514	  0.464088	  2.309204
  0.027406	  0.459607	  2.327823
  0.036037	  0.453486	  2.347024
  0.047267	  0.445319	  2.362259
  0.061444	  0.438039	  2.374544
  0.071296	  0.431859	  2.390099
  0.080551	  0.423842	  2.406201
  0.091386	  0.414907	  2.420917
  0.102544	  0.408205	  2.435432
  0.114018	  0.402910	  2.451487
  0.128223	  0.391868	  2.464986
  0.137631	  0.379291	  2.475773
  0.145518	  0.367386	  2.489226
  0.153670	  0.353992	  2.502396
  0.161841	  0.339386	  2.513896
  0.169041	  0.324230	  2.524158
  0.177349	  0.309507	  2.534845
