  0.251339	  2.209159	 -1.154258
  0.247819	  2.206325	 -1.149225
  0.240923	  2.200771	 -1.139363
  0.229877	  2.191429	 -1.125573
  0.219154	  2.181288	 -1.113463
  0.211095	  2.166779	 -1.102145
  0.206151	  2.151679	 -1.089688
  0.198852	  2.138523	 -1.074361
  0.189003	  2.127195	 -1.061597
  0.176611	  2.115920	 -1.049958
  0.166682	  2.106749	 -1.033984
  0.155548	  2.101953	 -1.016706
  0.140827	  2.101463	 -0.996348
  0.129474	  2.099821	 -0.982797
  0.119805	  2.098191	 -0.967032
  0.109064	  2.092032	 -0.943497
  0.098730	  2.081965	 -0.920168
  0.093754	  2.077816	 -0.911842
  0.089464	  2.074821	 -0.901897
  0.075255	  2.067330	 -0.883903
  0.061537	  2.058650	 -0.863807
  0.053766	  2.052042	 -0.848073
  0.046706	  2.048068	 -0.832337
  0.034720	  2.044224	 -0.815224
  0.026457	  2.040417	 -0.795696
  0.019165	  2.039854	 -0.773368
  0.004341	  2.040868	 -0.756483
 -0.013390	  2.039254	 -0.746162
 -0.029903	  2.036128	 -0.734706
 -0.050455	  2.036147	 -0.721431
 -0.071086	  2.030196	 -0.719513
 -0.093289	  2.021468	 -0.728027
 -0.115785	  2.019307	 -0.731327
 -0.137528	  2.020464	 -0.725704
 -0.154637	  2.023500	 -0.719060
 -0.179115	  2.024548	 -0.715526
 -0.201618	  2.020834	 -0.720326
 -0.214800	  2.016570	 -0.727393
 -0.234879	  2.012836	 -0.727231
 -0.253126	  2.012687	 -0.721368
 -0.273095	  2.015283	 -0.706138
 -0.294992	  2.014969	 -0.697418
 -0.316121	  2.010872	 -0.702716
 -0.337236	  2.007023	 -0.710927
 -0.354540	  2.004526	 -0.711970
 -0.369751	  2.004183	 -0.704323
 -0.381793	  2.007912	 -0.686359
 -0.387853	  2.005040	 -0.677289
 -0.388271	  2.006327	 -0.673002
 -0.397642	  2.006974	 -0.671667
 -0.391848	  2.015290	 -0.657811
 -0.387858	  2.024394	 -0.645157
 -0.377756	  2.032017	 -0.630733
 -0.368266	  2.038815	 -0.614104
 -0.359397	  2.043898	 -0.596696
 -0.349818	  2.045386	 -0.579549
 -0.340824	  2.047829	 -0.562388
 -0.330772	  2.048248	 -0.545151
 -0.322017	  2.049377	 -0.526913
 -0.310886	  2.050011	 -0.510402
 -0.300547	  2.050800	 -0.493159
 -0.291666	  2.051877	 -0.474833
 -0.284425	  2.052268	 -0.454903
 -0.275739	  2.051750	 -0.434612
 -0.268143	  2.050583	 -0.414380
 -0.265247	  2.049337	 -0.394261
 -0.261957	  2.048140	 -0.374699
 -0.256016	  2.046082	 -0.355629
 -0.254092	  2.044943	 -0.335498
 -0.248619	  2.043217	 -0.316368
 -0.246409	  2.041632	 -0.295921
 -0.246726	  2.038839	 -0.274552
 -0.242949	  2.035181	 -0.252581
 -0.242331	  2.031382	 -0.232313
 -0.235263	  2.023970	 -0.212743
 -0.237370	  2.014203	 -0.191561
 -0.239343	  2.007771	 -0.173333
 -0.243721	  2.007050	 -0.154992
 -0.241446	  1.995941	 -0.134799
 -0.250662	  1.982847	 -0.109274
 -0.264223	  1.980657	 -0.092048
 -0.276982	  1.983745	 -0.077502
 -0.287670	  1.983486	 -0.060276
 -0.295459	  1.975539	 -0.042819
 -0.302324	  1.965384	 -0.026815
 -0.310418	  1.954360	 -0.012537
 -0.324149	  1.944929	  0.005274
 -0.349314	  1.940032	  0.022081
 -0.365126	  1.935688	  0.031499
 -0.375369	  1.932279	  0.036573
 -0.392342	  1.920194	  0.044859
 -0.409233	  1.906665	  0.047214
 -0.422446	  1.895506	  0.049398
 -0.435535	  1.883376	  0.053261
 -0.453008	  1.867557	  0.061406
 -0.473970	  1.855135	  0.072795
 -0.481017	  1.847303	  0.075929
 -0.491673	  1.836771	  0.080820
 -0.512373	  1.820601	  0.090997
 -0.526741	  1.806583	  0.098357
 -0.536295	  1.798027	  0.105624
 -0.544920	  1.791108	  0.113540
 -0.560857	  1.771009	  0.128762
 -0.569846	  1.758263	  0.137582
 -0.580859	  1.746351	  0.148158
 -0.588943	  1.730929	  0.161276
 -0.608926	  1.722410	  0.161548
 -0.608171	  1.705143	  0.180514
 -0.619538	  1.691086	  0.183988
 -0.622154	  1.672450	  0.194892
 -0.626545	  1.648312	  0.200658
 -0.621072	  1.637601	  0.222051
 -0.640380	  1.618643	  0.213858
 -0.644987	  1.593798	  0.247240
 -0.656178	  1.584873	  0.242509
 -0.651142	  1.584849	  0.257551
 -0.659034	  1.567908	  0.279687
 -0.663587	  1.552596	  0.295008
 -0.670316	  1.540789	  0.307607
 -0.677271	  1.531517	  0.317343
 -0.686573	  1.519221	  0.332018
 -0.697712	  1.512280	  0.347364
 -0.704857	  1.502839	  0.357233
 -0.718567	  1.491401	  0.367926
 -0.724821	  1.479384	  0.380358
 -0.733894	  1.474553	  0.385676
 -0.740173	  1.471191	  0.404602
 -0.752875	  1.454043	  0.432611
 -0.760661	  1.449713	  0.438092
 -0.776125	  1.442732	  0.457453
 -0.784249	  1.439634	  0.468565
 -0.797168	  1.438477	  0.475428
 -0.822163	  1.436203	  0.499524
 -0.835968	  1.428929	  0.516756
 -0.843080	  1.419943	  0.527980
 -0.852707	  1.411316	  0.537766
 -0.864090	  1.397390	  0.549745
 -0.880637	  1.380371	  0.567736
 -0.886297	  1.368949	  0.579709
 -0.898183	  1.362140	  0.593038
 -0.908288	  1.355388	  0.603240
 -0.920539	  1.350103	  0.613908
 -0.936875	  1.342282	  0.626706
 -0.953147	  1.336410	  0.638429
 -0.973719	  1.330775	  0.648240
 -0.983835	  1.323720	  0.653718
 -0.996123	  1.310232	  0.663274
 -1.010988	  1.298851	  0.672446
 -1.036924	  1.286365	  0.689141
 -1.054723	  1.283840	  0.696539
 -1.069071	  1.283930	  0.700956
 -1.085138	  1.286419	  0.706839
 -1.113010	  1.293670	  0.717843
 -1.138360	  1.299397	  0.725540
 -1.155102	  1.299211	  0.727950
 -1.167531	  1.297329	  0.732159
 -1.186763	  1.292012	  0.736725
 -1.209711	  1.285886	  0.741892
 -1.230351	  1.285703	  0.749135
 -1.246874	  1.287382	  0.753315
 -1.263021	  1.286385	  0.756171
 -1.283866	  1.282991	  0.760429
 -1.304851	  1.279452	  0.766789
 -1.323669	  1.273384	  0.777848
 -1.343151	  1.266829	  0.788805
 -1.357425	  1.262909	  0.796771
 -1.369624	  1.260801	  0.800983
 -1.386428	  1.259669	  0.808035
 -1.403431	  1.258362	  0.822886
 -1.423633	  1.257284	  0.836591
 -1.435725	  1.252786	  0.850684
 -1.448713	  1.250334	  0.860357
 -1.461758	  1.245468	  0.878328
 -1.466338	  1.232451	  0.909439
 -1.467382	  1.220627	  0.927251
 -1.464946	  1.206049	  0.944288
 -1.459243	  1.190483	  0.959112
 -1.454093	  1.177479	  0.967822
 -1.448033	  1.164326	  0.976871
 -1.441849	  1.152423	  0.990248
 -1.436595	  1.142069	  1.002763
 -1.430732	  1.130837	  1.021492
 -1.424662	  1.121469	  1.040033
 -1.419211	  1.115212	  1.050290
 -1.405774	  1.105279	  1.064524
 -1.394670	  1.098783	  1.079301
 -1.386316	  1.094036	  1.089818
 -1.374446	  1.086059	  1.112513
 -1.363720	  1.079659	  1.130151
 -1.358531	  1.074498	  1.139248
 -1.344410	  1.064445	  1.159721
 -1.328228	  1.058118	  1.177239
 -1.321599	  1.056306	  1.185161
 -1.306174	  1.047674	  1.195279
 -1.287019	  1.035383	  1.206690
 -1.274952	  1.027484	  1.221050
 -1.265217	  1.022630	  1.238835
 -1.257139	  1.014805	  1.255751
 -1.241651	  0.998123	  1.267761
 -1.225922	  0.980746	  1.278654
 -1.220084	  0.970103	  1.295774
 -1.222520	  0.960185	  1.318863
 -1.225706	  0.949807	  1.340386
 -1.236543	  0.941832	  1.357176
 -1.247347	  0.933531	  1.375276
 -1.254046	  0.923455	  1.391656
 -1.263190	  0.914578	  1.406842
 -1.274150	  0.905969	  1.426833
 -1.280961	  0.897974	  1.445037
 -1.283064	  0.888921	  1.460037
 -1.286184	  0.877235	  1.477475
 -1.293331	  0.868369	  1.495819
 -1.301864	  0.861693	  1.513544
 -1.310748	  0.856581	  1.530697
 -1.319645	  0.851299	  1.548722
 -1.327960	  0.846552	  1.566154
 -1.337725	  0.844675	  1.581834
 -1.351701	  0.848569	  1.600283
 -1.363540	  0.849610	  1.619288
 -1.370404	  0.845515	  1.637319
 -1.376710	  0.842928	  1.656054
 -1.386462	  0.841376	  1.682836
 -1.390336	  0.840494	  1.696310
 -1.394582	  0.839978	  1.710175
 -1.407993	  0.841794	  1.727992
 -1.420439	  0.833664	  1.742525
 -1.426598	  0.813954	  1.768047
 -1.433935	  0.806038	  1.788562
 -1.439735	  0.804477	  1.800343
 -1.449762	  0.804509	  1.815324
 -1.470052	  0.799306	  1.831539
 -1.503348	  0.781040	  1.848031
 -1.513293	  0.773141	  1.863481
