 -2.356307	 -0.291401	  0.593293
 -2.368358	 -0.302783	  0.593664
 -2.380409	 -0.314165	  0.594035
 -2.365868	 -0.300441	  0.593588
 -2.351162	 -0.286892	  0.593274
 -2.335987	 -0.273866	  0.593333
 -2.320777	 -0.260886	  0.593477
 -2.305595	 -0.247965	  0.594402
 -2.290197	 -0.235932	  0.597490
 -2.273735	 -0.225820	  0.602905
 -2.256479	 -0.217298	  0.610161
 -2.238776	 -0.204262	  0.616407
 -2.224672	 -0.190039	  0.620377
 -2.211933	 -0.179202	  0.618152
 -2.199075	 -0.168641	  0.617900
 -2.187097	 -0.149061	  0.631148
 -2.173122	 -0.133581	  0.637687
 -2.158580	 -0.120727	  0.637648
 -2.145801	 -0.108454	  0.634418
 -2.130080	 -0.088839	  0.635254
 -2.116809	 -0.075969	  0.633141
 -2.101806	 -0.072377	  0.615812
 -2.076439	 -0.065783	  0.593366
 -2.058101	 -0.050803	  0.586748
 -2.047159	 -0.035715	  0.591011
 -2.040142	 -0.022208	  0.597440
 -2.024097	 -0.005601	  0.594036
 -2.011121	  0.009679	  0.588544
 -1.998625	  0.024440	  0.583355
 -1.985257	  0.039053	  0.580821
 -1.971150	  0.053195	  0.581378
 -1.956997	  0.067302	  0.582163
 -1.942890	  0.081422	  0.582974
 -1.929798	  0.096101	  0.584417
 -1.925569	  0.114190	  0.591011
 -1.921320	  0.132476	  0.598039
 -1.917785	  0.150947	  0.604977
 -1.915449	  0.168860	  0.612999
 -1.913629	  0.186211	  0.623666
 -1.915474	  0.203318	  0.633451
 -1.918767	  0.219696	  0.642882
 -1.921994	  0.234130	  0.657490
 -1.926336	  0.250592	  0.667728
 -1.929424	  0.265770	  0.679825
 -1.932791	  0.280181	  0.694876
 -1.938224	  0.297327	  0.704772
 -1.943504	  0.314902	  0.711452
 -1.946077	  0.331433	  0.722660
 -1.949598	  0.346834	  0.735023
 -1.952580	  0.361507	  0.747782
 -1.954357	  0.375701	  0.758594
 -1.953226	  0.392332	  0.768204
 -1.955191	  0.412367	  0.784177
 -1.962699	  0.427915	  0.798457
 -1.968496	  0.438671	  0.808155
 -1.975077	  0.455102	  0.820846
 -1.978609	  0.471248	  0.829812
 -1.979811	  0.488281	  0.840499
 -1.984542	  0.507600	  0.858809
 -1.985501	  0.516039	  0.866142
 -1.984124	  0.532326	  0.879449
 -1.980072	  0.549951	  0.896843
 -1.972876	  0.562798	  0.908918
 -1.966102	  0.575543	  0.923396
 -1.954204	  0.586260	  0.930466
 -1.939304	  0.601559	  0.935746
 -1.928847	  0.608196	  0.931217
 -1.914799	  0.612194	  0.923572
 -1.893624	  0.609890	  0.907981
 -1.882782	  0.606210	  0.898151
 -1.873933	  0.601202	  0.883975
 -1.861457	  0.598638	  0.872140
 -1.842476	  0.597454	  0.853394
 -1.827234	  0.591295	  0.840533
 -1.816557	  0.575089	  0.827416
 -1.807869	  0.566190	  0.821260
 -1.792934	  0.551633	  0.813229
 -1.773716	  0.547677	  0.799615
 -1.761406	  0.546705	  0.783230
 -1.752657	  0.545377	  0.768124
 -1.748963	  0.539794	  0.748898
 -1.743055	  0.529637	  0.727156
 -1.727975	  0.517107	  0.711194
 -1.714039	  0.511248	  0.701515
 -1.694053	  0.510481	  0.691748
 -1.675533	  0.509969	  0.678014
 -1.660636	  0.506192	  0.663062
 -1.650649	  0.504817	  0.654408
 -1.634658	  0.512079	  0.642950
 -1.612180	  0.521452	  0.637823
 -1.593412	  0.523009	  0.630748
 -1.572050	  0.518450	  0.616830
 -1.554401	  0.516650	  0.605118
 -1.541246	  0.515955	  0.595775
 -1.526760	  0.523117	  0.586665
 -1.510922	  0.534850	  0.577273
 -1.497447	  0.544759	  0.571524
 -1.478574	  0.562484	  0.562976
 -1.462391	  0.576227	  0.560322
 -1.451411	  0.584799	  0.558801
 -1.433600	  0.598463	  0.553823
 -1.419255	  0.612231	  0.548836
 -1.408856	  0.622255	  0.546961
 -1.391298	  0.636303	  0.545909
 -1.375218	  0.650472	  0.550227
 -1.359898	  0.666472	  0.556071
 -1.346845	  0.690560	  0.559844
 -1.340475	  0.702351	  0.560299
 -1.335225	  0.717648	  0.561948
 -1.325791	  0.736824	  0.561975
 -1.313078	  0.751677	  0.566181
 -1.299484	  0.764207	  0.573426
 -1.287275	  0.779795	  0.580600
 -1.275922	  0.800034	  0.586839
 -1.266565	  0.818154	  0.590225
 -1.254833	  0.837611	  0.588977
 -1.247035	  0.853419	  0.591650
 -1.241520	  0.865305	  0.594502
 -1.229654	  0.886255	  0.592467
 -1.214006	  0.906047	  0.593973
 -1.203052	  0.923319	  0.596805
 -1.195307	  0.934375	  0.603546
 -1.183575	  0.956029	  0.600513
 -1.176854	  0.971816	  0.599708
 -1.169227	  0.989032	  0.595425
 -1.163104	  0.999623	  0.585156
 -1.147221	  1.017132	  0.564181
 -1.136144	  1.029282	  0.551391
 -1.128849	  1.038326	  0.542007
 -1.117238	  1.051590	  0.529745
 -1.114184	  1.057190	  0.523670
 -1.106450	  1.068990	  0.507810
 -1.092317	  1.083691	  0.479654
 -1.092357	  1.091407	  0.470529
 -1.085258	  1.099064	  0.450011
 -1.085540	  1.108687	  0.441749
 -1.071604	  1.120436	  0.426200
 -1.060217	  1.134727	  0.397993
 -1.058450	  1.150846	  0.386626
 -1.050876	  1.156300	  0.373879
 -1.044827	  1.169674	  0.360018
 -1.037209	  1.177632	  0.349864
 -1.035054	  1.194270	  0.332646
 -1.023486	  1.216177	  0.318192
 -1.017585	  1.223106	  0.309077
 -1.011942	  1.230522	  0.294246
 -0.995091	  1.247796	  0.276866
 -0.989308	  1.255408	  0.267059
 -0.977135	  1.268843	  0.256974
 -0.958030	  1.288296	  0.250986
 -0.950123	  1.294766	  0.253113
 -0.932549	  1.307707	  0.252298
 -0.911428	  1.320386	  0.258977
 -0.889905	  1.334070	  0.268535
 -0.881997	  1.339336	  0.277021
 -0.873387	  1.346412	  0.289451
 -0.864385	  1.355659	  0.302295
 -0.855994	  1.369503	  0.320305
 -0.837857	  1.390271	  0.340714
 -0.831556	  1.388994	  0.344882
 -0.825083	  1.404673	  0.338775
 -0.817026	  1.418671	  0.338604
 -0.793302	  1.435637	  0.357801
 -0.784872	  1.435686	  0.350356
 -0.775120	  1.459710	  0.349467
 -0.765984	  1.464959	  0.347051
 -0.760134	  1.482253	  0.338069
 -0.771626	  1.481404	  0.328649
 -0.763754	  1.495039	  0.324815
 -0.765256	  1.511637	  0.319049
 -0.772155	  1.525081	  0.305376
 -0.770174	  1.541078	  0.292873
 -0.767953	  1.565038	  0.273485
 -0.766674	  1.583375	  0.259494
 -0.762867	  1.595107	  0.253887
 -0.762095	  1.609295	  0.247804
 -0.757627	  1.629912	  0.241847
 -0.749367	  1.648751	  0.236483
 -0.744283	  1.667150	  0.229326
 -0.738093	  1.683628	  0.222905
 -0.730903	  1.700567	  0.218248
 -0.723860	  1.719579	  0.210702
 -0.720693	  1.734114	  0.200342
 -0.711452	  1.745698	  0.191572
 -0.699020	  1.762604	  0.182096
 -0.687640	  1.770700	  0.175546
 -0.673633	  1.783259	  0.160521
 -0.662833	  1.795554	  0.148657
 -0.644680	  1.811089	  0.139552
 -0.638658	  1.818175	  0.132903
 -0.618309	  1.818247	  0.125663
 -0.595611	  1.823393	  0.117082
 -0.573887	  1.829283	  0.118106
 -0.544188	  1.836194	  0.114300
 -0.532199	  1.843031	  0.110132
 -0.518137	  1.842594	  0.112692
 -0.490364	  1.851878	  0.118067
 -0.470938	  1.854919	  0.119271
 -0.465639	  1.854158	  0.124460
 -0.443427	  1.855765	  0.123650
 -0.418965	  1.859651	  0.123565
 -0.402943	  1.861903	  0.125957
 -0.380289	  1.870544	  0.127960
 -0.358958	  1.880311	  0.135035
 -0.341224	  1.889639	  0.146503
 -0.324721	  1.895139	  0.155823
 -0.313265	  1.897852	  0.159302
 -0.295111	  1.901098	  0.160100
 -0.261463	  1.897102	  0.170670
 -0.249974	  1.892398	  0.177189
 -0.239021	  1.887418	  0.181871
 -0.216824	  1.885231	  0.189190
 -0.198196	  1.887583	  0.208841
 -0.189658	  1.889317	  0.228141
 -0.177466	  1.889272	  0.246970
 -0.160543	  1.883740	  0.260130
 -0.143449	  1.877013	  0.273536
 -0.128209	  1.879812	  0.284330
 -0.111413	  1.885274	  0.299426
 -0.097685	  1.890898	  0.311073
 -0.082482	  1.895475	  0.325008
 -0.064041	  1.895128	  0.340680
 -0.044130	  1.894928	  0.351307
 -0.032251	  1.896163	  0.358897
 -0.014142	  1.903919	  0.364757
  0.003406	  1.912347	  0.370110
  0.021689	  1.921455	  0.377008
  0.041412	  1.932946	  0.380564
  0.058303	  1.946093	  0.385110
  0.076413	  1.959438	  0.384195
  0.097894	  1.969818	  0.381071
  0.118477	  1.972726	  0.379708
  0.139093	  1.977726	  0.377349
  0.157958	  1.985921	  0.381140
  0.172880	  1.998028	  0.386606
  0.186746	  2.012851	  0.389772
  0.200268	  2.026074	  0.395810
  0.211794	  2.041865	  0.400387
  0.221543	  2.059330	  0.408841
  0.231644	  2.074692	  0.412314
  0.249696	  2.084747	  0.406475
  0.283854	  2.088945	  0.405706
  0.304441	  2.097168	  0.407112
  0.318283	  2.106117	  0.409199
  0.329953	  2.125903	  0.414729
  0.337061	  2.147146	  0.417313
  0.349385	  2.164834	  0.418119
  0.362536	  2.181964	  0.416599
  0.374553	  2.197805	  0.416260
  0.385606	  2.214388	  0.416017
  0.395794	  2.231582	  0.413816
  0.406432	  2.246658	  0.415720
  0.416952	  2.259123	  0.420213
  0.433285	  2.268743	  0.422191
  0.457916	  2.289430	  0.412860
  0.467592	  2.304592	  0.400526
  0.471348	  2.320293	  0.391865
  0.477444	  2.343894	  0.388887
  0.491666	  2.357949	  0.388468
  0.505888	  2.372004	  0.388049
