  0.018172	  1.852326	  1.616392
  0.022474	  1.855444	  1.622942
  0.026776	  1.858562	  1.629492
  0.022494	  1.848262	  1.616229
  0.012135	  1.835970	  1.597257
  0.000946	  1.828993	  1.581297
 -0.007869	  1.824922	  1.568799
 -0.019954	  1.819296	  1.550085
 -0.029466	  1.813057	  1.533642
 -0.036621	  1.805113	  1.517538
 -0.045237	  1.796670	  1.500701
 -0.056204	  1.788792	  1.485900
 -0.068730	  1.778235	  1.469416
 -0.079417	  1.764704	  1.453021
 -0.085231	  1.758468	  1.445708
 -0.097116	  1.749027	  1.433257
 -0.114312	  1.745010	  1.419839
 -0.126217	  1.734075	  1.403511
 -0.133731	  1.724258	  1.387323
 -0.142189	  1.719350	  1.371294
 -0.152143	  1.719470	  1.355970
 -0.166220	  1.721621	  1.337270
 -0.180776	  1.716308	  1.323387
 -0.195498	  1.709302	  1.309146
 -0.207788	  1.703186	  1.297511
 -0.219946	  1.695568	  1.283890
 -0.231544	  1.687339	  1.267898
 -0.241089	  1.679600	  1.255306
 -0.259269	  1.672887	  1.233397
 -0.274337	  1.669236	  1.216187
 -0.280612	  1.665822	  1.209446
 -0.291546	  1.661132	  1.195314
 -0.308107	  1.658637	  1.175712
 -0.324964	  1.656557	  1.162321
 -0.339170	  1.658477	  1.150987
 -0.353084	  1.658297	  1.140746
 -0.368421	  1.656868	  1.126868
 -0.387057	  1.658912	  1.110231
 -0.398929	  1.662139	  1.099050
 -0.411153	  1.671210	  1.085777
 -0.429083	  1.677435	  1.075171
 -0.447537	  1.678530	  1.065227
 -0.465040	  1.678817	  1.055442
 -0.483098	  1.678253	  1.046941
 -0.501855	  1.676733	  1.040214
 -0.520635	  1.675224	  1.033506
 -0.539416	  1.673712	  1.026801
 -0.558227	  1.672301	  1.020191
 -0.577736	  1.673203	  1.015971
 -0.597418	  1.675386	  1.013180
 -0.617055	  1.677510	  1.010401
 -0.635760	  1.676248	  1.006232
 -0.651858	  1.668549	  0.998624
 -0.663805	  1.658742	  0.989583
 -0.673162	  1.647412	  0.979561
 -0.679247	  1.634647	  0.967605
 -0.682647	  1.622262	  0.953501
 -0.685022	  1.610353	  0.937137
 -0.686706	  1.600080	  0.919685
 -0.688625	  1.590635	  0.902085
 -0.690451	  1.585024	  0.884437
 -0.690457	  1.583910	  0.866918
 -0.686664	  1.577442	  0.851904
 -0.685584	  1.556525	  0.840235
 -0.687017	  1.512000	  0.822033
 -0.682900	  1.500589	  0.807421
 -0.680513	  1.494865	  0.798845
 -0.675024	  1.484269	  0.788055
 -0.675324	  1.470819	  0.762277
 -0.676945	  1.461284	  0.744952
 -0.675783	  1.455718	  0.732095
 -0.671886	  1.448548	  0.716148
 -0.667984	  1.435521	  0.700761
 -0.664162	  1.420267	  0.683645
 -0.660612	  1.404410	  0.671678
 -0.658679	  1.394428	  0.663070
 -0.656056	  1.381045	  0.648215
 -0.653744	  1.366213	  0.633337
 -0.654029	  1.346934	  0.611741
 -0.657156	  1.335498	  0.597359
 -0.660236	  1.321863	  0.579085
 -0.661185	  1.315510	  0.569880
 -0.659365	  1.306851	  0.547078
 -0.661961	  1.289247	  0.531462
 -0.661732	  1.291609	  0.519265
 -0.664130	  1.264654	  0.496196
 -0.666656	  1.253656	  0.484726
 -0.668481	  1.240025	  0.475714
 -0.671478	  1.225387	  0.455531
 -0.670877	  1.217253	  0.435634
 -0.669142	  1.205707	  0.420557
 -0.664950	  1.192032	  0.404115
 -0.659852	  1.184195	  0.388793
 -0.656449	  1.168954	  0.376473
 -0.653237	  1.161254	  0.355638
 -0.653979	  1.136262	  0.345160
 -0.647074	  1.130013	  0.323708
 -0.651289	  1.112691	  0.318649
 -0.651035	  1.097871	  0.302054
 -0.651163	  1.082424	  0.288573
 -0.654195	  1.069444	  0.279907
 -0.659459	  1.047496	  0.265174
 -0.664037	  1.030348	  0.252141
 -0.669152	  1.013251	  0.238052
 -0.672880	  0.999349	  0.231410
 -0.676538	  0.986945	  0.225274
 -0.683233	  0.965057	  0.212792
 -0.686820	  0.947065	  0.199268
 -0.687712	  0.933862	  0.191568
 -0.688860	  0.914633	  0.178581
 -0.690633	  0.898850	  0.170819
 -0.693292	  0.877314	  0.167329
 -0.697664	  0.845456	  0.168725
 -0.700720	  0.830546	  0.166385
 -0.705042	  0.816767	  0.162636
 -0.711425	  0.803051	  0.151469
 -0.723966	  0.784475	  0.144221
 -0.736146	  0.767427	  0.140235
 -0.745438	  0.747783	  0.133016
 -0.756152	  0.722693	  0.131405
 -0.762584	  0.706103	  0.134139
 -0.769354	  0.691129	  0.140721
 -0.778683	  0.674917	  0.147832
 -0.788645	  0.657366	  0.153659
 -0.798690	  0.641106	  0.158878
 -0.811276	  0.623711	  0.165993
 -0.823276	  0.607362	  0.171595
 -0.829378	  0.597283	  0.173907
 -0.838489	  0.578251	  0.175821
 -0.849585	  0.559619	  0.174785
 -0.863147	  0.541809	  0.172695
 -0.875618	  0.527027	  0.171592
 -0.886304	  0.514887	  0.171971
 -0.899614	  0.502148	  0.172640
 -0.914308	  0.486744	  0.173866
 -0.927269	  0.472664	  0.171549
 -0.940787	  0.460133	  0.167905
 -0.955868	  0.449280	  0.166275
 -0.977941	  0.441323	  0.163382
 -0.994056	  0.435678	  0.155171
 -1.010596	  0.431574	  0.144107
 -1.025706	  0.429598	  0.127912
 -1.036403	  0.428864	  0.115250
 -1.045356	  0.428728	  0.102644
 -1.058668	  0.426839	  0.081132
 -1.069509	  0.423910	  0.064448
 -1.077449	  0.421832	  0.049330
 -1.083899	  0.417737	  0.033689
 -1.093207	  0.413177	  0.013897
 -1.104019	  0.411094	 -0.009929
 -1.109285	  0.410078	 -0.024610
 -1.113953	  0.412377	 -0.043361
 -1.117067	  0.415287	 -0.059325
 -1.117269	  0.423440	 -0.082834
 -1.118122	  0.431508	 -0.101557
 -1.120824	  0.438743	 -0.115515
 -1.125110	  0.447334	 -0.135456
 -1.128015	  0.454074	 -0.151903
 -1.132377	  0.460460	 -0.172173
 -1.136049	  0.467319	 -0.190375
 -1.136509	  0.476892	 -0.208109
 -1.133704	  0.487198	 -0.225526
 -1.131969	  0.498124	 -0.242952
 -1.132041	  0.508685	 -0.262059
 -1.134346	  0.517813	 -0.279577
 -1.138971	  0.523803	 -0.295287
 -1.147329	  0.528544	 -0.314595
 -1.157725	  0.536230	 -0.336049
 -1.163321	  0.543796	 -0.350861
 -1.167817	  0.552563	 -0.364136
 -1.172558	  0.567690	 -0.381869
 -1.177416	  0.579804	 -0.401774
 -1.177026	  0.585978	 -0.420501
 -1.175856	  0.589731	 -0.434349
 -1.181339	  0.593702	 -0.453148
 -1.189334	  0.600646	 -0.466933
 -1.199779	  0.611949	 -0.487011
 -1.209464	  0.619227	 -0.508028
 -1.216922	  0.624381	 -0.523698
 -1.223752	  0.627281	 -0.537472
 -1.234338	  0.630140	 -0.558465
 -1.243018	  0.633080	 -0.573185
 -1.257762	  0.637175	 -0.592119
 -1.270247	  0.639934	 -0.607843
 -1.278269	  0.641888	 -0.617060
 -1.292736	  0.646464	 -0.636240
 -1.308080	  0.647989	 -0.656877
 -1.317782	  0.646612	 -0.671148
 -1.327159	  0.644285	 -0.687488
 -1.340255	  0.640301	 -0.706602
 -1.350725	  0.638542	 -0.717874
 -1.364339	  0.634873	 -0.730749
 -1.377086	  0.629339	 -0.745999
 -1.385927	  0.625822	 -0.771765
 -1.394828	  0.621406	 -0.791968
 -1.405730	  0.616340	 -0.804018
 -1.417810	  0.609632	 -0.814816
 -1.436141	  0.600202	 -0.833051
 -1.445383	  0.596178	 -0.845376
 -1.453168	  0.592277	 -0.858074
 -1.466834	  0.582524	 -0.880429
 -1.476860	  0.576036	 -0.895893
 -1.483508	  0.570731	 -0.908351
 -1.492343	  0.562492	 -0.931048
 -1.496194	  0.558045	 -0.946099
 -1.500766	  0.552855	 -0.965486
 -1.506125	  0.546817	 -0.990811
 -1.509890	  0.542263	 -1.006074
 -1.515972	  0.536659	 -1.021711
 -1.526864	  0.527588	 -1.040267
 -1.535018	  0.519831	 -1.055274
 -1.542257	  0.510237	 -1.072387
 -1.549703	  0.500366	 -1.088708
 -1.558105	  0.491662	 -1.103826
 -1.565048	  0.482757	 -1.121679
 -1.568873	  0.474047	 -1.143307
 -1.570237	  0.468887	 -1.155856
 -1.573463	  0.460429	 -1.175401
 -1.578696	  0.450451	 -1.196770
 -1.583579	  0.439777	 -1.215443
 -1.587066	  0.434142	 -1.230340
 -1.592031	  0.427909	 -1.249928
 -1.596224	  0.423344	 -1.264533
 -1.603470	  0.417093	 -1.286555
 -1.610162	  0.411541	 -1.309092
 -1.614586	  0.407976	 -1.321329
 -1.618505	  0.403331	 -1.339909
 -1.623916	  0.393904	 -1.358191
 -1.629163	  0.386453	 -1.376956
 -1.635349	  0.380796	 -1.394487
 -1.642954	  0.374881	 -1.411904
 -1.650763	  0.368423	 -1.428891
 -1.659158	  0.362245	 -1.445706
 -1.667656	  0.355983	 -1.462545
 -1.676275	  0.349969	 -1.479080
 -1.685084	  0.345031	 -1.495823
 -1.693429	  0.340539	 -1.513027
 -1.702479	  0.336504	 -1.530123
 -1.712327	  0.333050	 -1.546089
 -1.720291	  0.331454	 -1.561648
 -1.729944	  0.332953	 -1.583065
 -1.741127	  0.330089	 -1.599739
 -1.756347	  0.318929	 -1.614628
 -1.771163	  0.308237	 -1.627088
 -1.783559	  0.301268	 -1.639163
 -1.794486	  0.295829	 -1.653648
 -1.805044	  0.288191	 -1.670603
 -1.813464	  0.276154	 -1.685797
 -1.824426	  0.269711	 -1.701235
 -1.835388	  0.263268	 -1.716673
