 -1.638388	  0.017002	  1.948387
 -1.651276	  0.019728	  1.950481
 -1.631968	  0.015648	  1.947389
 -1.612393	  0.012034	  1.946753
 -1.592983	  0.008489	  1.948386
 -1.572939	  0.005145	  1.950488
 -1.553619	  0.001078	  1.951309
 -1.534303	 -0.004488	  1.950643
 -1.513423	 -0.008098	  1.952252
 -1.494278	 -0.010641	  1.953925
 -1.474500	 -0.012717	  1.952948
 -1.454935	 -0.014112	  1.950505
 -1.434885	 -0.017768	  1.948799
 -1.414529	 -0.018680	  1.949062
 -1.394321	 -0.020021	  1.948909
 -1.374817	 -0.018751	  1.947241
 -1.354605	 -0.018233	  1.944655
 -1.334744	 -0.018227	  1.942050
 -1.314741	 -0.018233	  1.940648
 -1.294779	 -0.018077	  1.939420
 -1.274862	 -0.017455	  1.938419
 -1.255087	 -0.016024	  1.936458
 -1.235992	 -0.013847	  1.933310
 -1.214545	 -0.013279	  1.933666
 -1.194868	 -0.013974	  1.936725
 -1.174227	 -0.011134	  1.937712
 -1.155899	 -0.007107	  1.935077
 -1.135216	 -0.005240	  1.934835
 -1.114553	 -0.001743	  1.936016
 -1.096862	  0.003359	  1.933254
 -1.076733	  0.006814	  1.931312
 -1.055337	  0.011466	  1.931696
 -1.037315	  0.014038	  1.932918
 -1.017898	  0.015076	  1.933091
 -0.997422	  0.016273	  1.933224
 -0.977247	  0.016055	  1.934913
 -0.957327	  0.015813	  1.936663
 -0.937505	  0.014544	  1.939003
 -0.917793	  0.012566	  1.941748
 -0.898104	  0.010442	  1.944537
 -0.878653	  0.007034	  1.947702
 -0.859208	  0.003593	  1.950876
 -0.839921	 -0.000526	  1.954191
 -0.820763	 -0.005143	  1.957607
 -0.801590	 -0.009626	  1.961036
 -0.782096	 -0.013562	  1.963235
 -0.762740	 -0.016901	  1.965639
 -0.742534	 -0.018244	  1.967973
 -0.722853	 -0.020429	  1.968837
 -0.704070	 -0.023897	  1.968898
 -0.683013	 -0.025424	  1.969036
 -0.663052	 -0.027514	  1.969087
 -0.643687	 -0.033271	  1.967940
 -0.623180	 -0.036874	  1.965822
 -0.602849	 -0.035932	  1.967342
 -0.584676	 -0.035565	  1.970460
 -0.564217	 -0.035808	  1.972323
 -0.544000	 -0.035844	  1.973430
 -0.523962	 -0.036547	  1.973097
 -0.503983	 -0.037335	  1.972589
 -0.484036	 -0.038102	  1.971376
 -0.464246	 -0.038822	  1.968589
 -0.444462	 -0.039490	  1.965759
 -0.425480	 -0.036801	  1.961182
 -0.408452	 -0.029891	  1.955622
 -0.403287	 -0.012631	  1.953573
 -0.398375	  0.007105	  1.950843
 -0.392212	  0.026075	  1.948201
 -0.384871	  0.044355	  1.945601
 -0.377906	  0.062700	  1.942643
 -0.372241	  0.081687	  1.938935
 -0.366462	  0.100471	  1.935269
 -0.360999	  0.119343	  1.931538
 -0.354794	  0.137706	  1.927948
 -0.343403	  0.152439	  1.922249
 -0.329222	  0.164945	  1.915989
 -0.314914	  0.177366	  1.909942
 -0.300972	  0.190870	  1.905161
 -0.287965	  0.205212	  1.901417
 -0.274412	  0.220890	  1.893646
 -0.261936	  0.233582	  1.885171
 -0.246970	  0.244190	  1.877446
 -0.231719	  0.254602	  1.873058
 -0.215324	  0.266068	  1.866018
 -0.199401	  0.274613	  1.854229
 -0.183715	  0.278115	  1.841605
 -0.167651	  0.282188	  1.830728
 -0.150824	  0.283754	  1.821143
 -0.133285	  0.286187	  1.810318
 -0.117210	  0.287361	  1.800323
 -0.102199	  0.290202	  1.788132
 -0.084137	  0.291850	  1.773764
 -0.067128	  0.292508	  1.764455
 -0.049981	  0.285399	  1.758567
 -0.031950	  0.277381	  1.751087
 -0.016174	  0.271280	  1.740547
 -0.002798	  0.265041	  1.731564
  0.014167	  0.254614	  1.726016
  0.029976	  0.248038	  1.719307
  0.043784	  0.241176	  1.704894
  0.057422	  0.227093	  1.698388
  0.073133	  0.214400	  1.697375
  0.088628	  0.201721	  1.694752
  0.099485	  0.187689	  1.689187
  0.111244	  0.171772	  1.682898
  0.123663	  0.156807	  1.677013
  0.135992	  0.142547	  1.670776
  0.148367	  0.127515	  1.666160
  0.156553	  0.109803	  1.663608
  0.160028	  0.090349	  1.662409
  0.163191	  0.070608	  1.661757
  0.166540	  0.050912	  1.660699
  0.169721	  0.031181	  1.660045
  0.173187	  0.011568	  1.658860
  0.177562	 -0.007811	  1.657104
  0.181570	 -0.027805	  1.655695
  0.184328	 -0.047533	  1.655385
  0.187428	 -0.066920	  1.653117
  0.192742	 -0.085781	  1.648225
  0.198295	 -0.104244	  1.642884
  0.203712	 -0.122829	  1.637863
  0.209243	 -0.141226	  1.632566
  0.214605	 -0.159496	  1.627856
  0.220594	 -0.176473	  1.622713
  0.230459	 -0.195467	  1.612303
  0.238162	 -0.210908	  1.603035
  0.246086	 -0.224685	  1.595887
  0.257742	 -0.240089	  1.585975
  0.265310	 -0.256170	  1.577653
  0.273004	 -0.273187	  1.570539
  0.283124	 -0.288805	  1.562500
  0.295748	 -0.301976	  1.556535
  0.311536	 -0.315366	  1.554849
  0.326023	 -0.327856	  1.549299
  0.340187	 -0.340058	  1.551166
  0.355099	 -0.352299	  1.555790
  0.371588	 -0.365169	  1.559216
  0.388749	 -0.376860	  1.559738
  0.407229	 -0.385078	  1.563189
  0.423615	 -0.390261	  1.571118
  0.441516	 -0.397545	  1.579642
  0.458152	 -0.403042	  1.588683
  0.475381	 -0.401468	  1.599432
  0.491698	 -0.396504	  1.609882
  0.506704	 -0.390465	  1.621419
  0.517022	 -0.379892	  1.634634
  0.526525	 -0.368782	  1.648213
  0.532667	 -0.356226	  1.662416
  0.538934	 -0.343432	  1.676471
  0.544995	 -0.330813	  1.690759
  0.551114	 -0.318217	  1.705036
  0.559135	 -0.307012	  1.719497
  0.568922	 -0.298357	  1.734621
  0.578991	 -0.289568	  1.749519
  0.588697	 -0.281053	  1.764711
  0.597861	 -0.272919	  1.780482
  0.607190	 -0.264732	  1.796480
  0.615340	 -0.256626	  1.812052
  0.626427	 -0.250067	  1.827760
  0.640077	 -0.247207	  1.845181
  0.653966	 -0.245613	  1.858303
  0.668943	 -0.241023	  1.870642
  0.682095	 -0.235102	  1.882946
  0.695673	 -0.230768	  1.898197
  0.708696	 -0.227212	  1.912969
  0.721825	 -0.225891	  1.927796
  0.734831	 -0.230470	  1.942082
  0.748060	 -0.235124	  1.956345
  0.760999	 -0.239973	  1.970818
  0.773999	 -0.244776	  1.985241
  0.787251	 -0.249401	  1.999471
  0.800119	 -0.254289	  2.013981
  0.813253	 -0.259033	  2.028289
  0.825988	 -0.265536	  2.042179
  0.838564	 -0.275103	  2.054306
  0.850879	 -0.284970	  2.066628
  0.863391	 -0.294715	  2.078841
  0.876214	 -0.304241	  2.090829
  0.888983	 -0.313827	  2.102836
  0.906541	 -0.320352	  2.109590
  0.925471	 -0.318310	  2.103698
  0.941772	 -0.313002	  2.093601
  0.950043	 -0.302456	  2.077376
  0.957819	 -0.292551	  2.061735
  0.960781	 -0.280585	  2.044945
  0.958039	 -0.265986	  2.028318
  0.963166	 -0.255214	  2.013782
  0.972628	 -0.243959	  1.998011
  0.987696	 -0.234208	  1.986741
  0.998719	 -0.224211	  1.973376
  1.006765	 -0.213255	  1.958712
  1.017770	 -0.202224	  1.946022
  1.027479	 -0.191303	  1.931819
  1.036465	 -0.182229	  1.917327
  1.048761	 -0.173042	  1.904431
  1.060301	 -0.165085	  1.889751
  1.069166	 -0.156904	  1.872937
  1.080789	 -0.148825	  1.858227
  1.095444	 -0.142281	  1.848222
  1.113422	 -0.138902	  1.837819
  1.130990	 -0.136955	  1.828017
  1.148853	 -0.135392	  1.819208
  1.168684	 -0.136757	  1.817237
  1.188581	 -0.138392	  1.816110
  1.208386	 -0.140775	  1.817521
  1.228186	 -0.143190	  1.818967
  1.247816	 -0.146833	  1.820134
  1.267343	 -0.151019	  1.821194
  1.286830	 -0.154796	  1.823632
  1.306146	 -0.158039	  1.827672
  1.325746	 -0.160514	  1.830742
  1.345737	 -0.160848	  1.831018
  1.365733	 -0.161148	  1.831248
  1.385721	 -0.161535	  1.831457
  1.405169	 -0.166091	  1.830611
  1.424608	 -0.170714	  1.829747
  1.444046	 -0.175338	  1.828869
  1.463423	 -0.179942	  1.827043
  1.482780	 -0.184507	  1.824983
  1.502577	 -0.187240	  1.825617
  1.522399	 -0.189553	  1.826836
  1.541766	 -0.192631	  1.826768
  1.561365	 -0.197573	  1.826948
  1.581570	 -0.199947	  1.826040
  1.602903	 -0.196980	  1.823004
  1.622335	 -0.194404	  1.820793
  1.641519	 -0.196972	  1.820522
  1.661633	 -0.195964	  1.819148
  1.681846	 -0.194099	  1.817703
  1.701594	 -0.195879	  1.817889
  1.721632	 -0.195939	  1.817328
  1.741959	 -0.195144	  1.816486
  1.762446	 -0.199258	  1.818329
  1.780549	 -0.201900	  1.819514
  1.801482	 -0.200372	  1.818203
  1.821357	 -0.202501	  1.818881
