 -1.820067	 -1.953295	  1.432793
 -1.802046	 -1.933955	  1.418607
 -1.785210	 -1.915385	  1.375926
 -1.767573	 -1.899417	  1.331224
 -1.757179	 -1.882876	  1.284157
 -1.748067	 -1.862871	  1.239130
 -1.740786	 -1.842582	  1.194573
 -1.735817	 -1.823099	  1.149690
 -1.732664	 -1.804390	  1.104182
 -1.729461	 -1.785731	  1.060787
 -1.724599	 -1.765259	  1.015656
 -1.717959	 -1.745163	  0.969420
 -1.710258	 -1.729785	  0.923824
 -1.699975	 -1.719198	  0.875080
 -1.682814	 -1.711831	  0.829039
 -1.659249	 -1.709972	  0.785474
 -1.640113	 -1.699947	  0.737545
 -1.626166	 -1.684192	  0.690922
 -1.616481	 -1.665152	  0.645925
 -1.609075	 -1.645295	  0.599798
 -1.601996	 -1.626614	  0.550511
 -1.597411	 -1.606577	  0.502638
 -1.594795	 -1.586543	  0.458843
 -1.589377	 -1.567571	  0.415519
 -1.577061	 -1.547898	  0.370951
 -1.562674	 -1.525898	  0.328878
 -1.551042	 -1.502530	  0.287845
 -1.542214	 -1.479094	  0.244009
 -1.533503	 -1.456396	  0.199490
 -1.523441	 -1.435094	  0.154351
 -1.512309	 -1.416963	  0.109099
 -1.501021	 -1.401554	  0.064051
 -1.490258	 -1.388389	  0.019646
 -1.479512	 -1.375861	 -0.027574
 -1.470092	 -1.363905	 -0.075313
 -1.463942	 -1.352565	 -0.122945
 -1.459651	 -1.339868	 -0.172377
 -1.456309	 -1.324500	 -0.220804
 -1.453446	 -1.308768	 -0.266090
 -1.450534	 -1.293019	 -0.311374
 -1.444567	 -1.271341	 -0.358273
 -1.435499	 -1.244156	 -0.402302
 -1.423904	 -1.217605	 -0.444354
 -1.410749	 -1.194784	 -0.487485
 -1.396288	 -1.174875	 -0.531860
 -1.382579	 -1.157556	 -0.576859
 -1.370921	 -1.142595	 -0.623195
 -1.360252	 -1.130145	 -0.668130
 -1.350230	 -1.119978	 -0.710955
 -1.340143	 -1.112297	 -0.753293
 -1.325672	 -1.111194	 -0.804704
 -1.293609	 -1.154119	 -0.868847
 -1.271036	 -1.227866	 -0.912466
 -1.251782	 -1.286000	 -0.955716
 -1.224246	 -1.322078	 -0.986875
 -1.221654	 -1.336832	 -1.020272
 -1.225659	 -1.339492	 -1.085599
 -1.212529	 -1.315603	 -1.188225
 -1.179230	 -1.285022	 -1.290476
 -1.150613	 -1.259462	 -1.362545
 -1.129359	 -1.234539	 -1.415805
 -1.117524	 -1.213183	 -1.447096
 -1.106648	 -1.177638	 -1.483853
 -1.096646	 -1.127789	 -1.524493
 -1.092911	 -1.074505	 -1.560743
 -1.094882	 -1.031659	 -1.581267
 -1.103422	 -0.968001	 -1.599106
 -1.120191	 -0.882093	 -1.617594
 -1.138327	 -0.809973	 -1.642636
 -1.150588	 -0.757013	 -1.673894
 -1.154394	 -0.718104	 -1.709637
 -1.150571	 -0.687709	 -1.749491
 -1.140472	 -0.663773	 -1.791284
 -1.127368	 -0.642537	 -1.834718
 -1.114155	 -0.623625	 -1.878743
 -1.101837	 -0.606562	 -1.922980
 -1.090276	 -0.590631	 -1.968308
 -1.079234	 -0.575627	 -2.015510
 -1.069302	 -0.562603	 -2.062531
 -1.059437	 -0.551025	 -2.109923
 -1.050048	 -0.539970	 -2.155096
 -1.039937	 -0.527610	 -2.202688
 -1.029569	 -0.514238	 -2.251867
 -1.021071	 -0.498476	 -2.300693
 -1.014944	 -0.481120	 -2.346735
 -1.010289	 -0.461796	 -2.392025
 -1.006745	 -0.439733	 -2.437420
 -1.003411	 -0.416806	 -2.480604
 -0.998228	 -0.394799	 -2.523287
 -0.991270	 -0.373678	 -2.564972
 -0.982925	 -0.351759	 -2.607251
 -0.972111	 -0.326962	 -2.650574
 -0.961304	 -0.305881	 -2.695322
 -0.952455	 -0.286004	 -2.739885
 -0.939540	 -0.271645	 -2.787220
 -0.935944	 -0.260095	 -2.838373
 -0.945303	 -0.262696	 -2.866756
