  0.920282	  1.001294	  2.131600
  0.936253	  1.014612	  2.139741
  0.921943	  1.002690	  2.132454
  0.907048	  0.991314	  2.125477
  0.891320	  0.980798	  2.118993
  0.875638	  0.970205	  2.112527
  0.860892	  0.958160	  2.106412
  0.846663	  0.945457	  2.100403
  0.833369	  0.931687	  2.094604
  0.820247	  0.917808	  2.088671
  0.807466	  0.903733	  2.082461
  0.794687	  0.889659	  2.076247
  0.781713	  0.875790	  2.069977
  0.768686	  0.861977	  2.063690
  0.755600	  0.848216	  2.057415
  0.741814	  0.835088	  2.051285
  0.728018	  0.821969	  2.045156
  0.714080	  0.809011	  2.039006
  0.699313	  0.797068	  2.032740
  0.684536	  0.785137	  2.026474
  0.669723	  0.773269	  2.020170
  0.654819	  0.761564	  2.013777
  0.639917	  0.749854	  2.007388
  0.625561	  0.737745	  2.000550
  0.611363	  0.725391	  1.993814
  0.597328	  0.714815	  1.985812
  0.583047	  0.708835	  1.974076
  0.568394	  0.695690	  1.961030
  0.559481	  0.676687	  1.952136
  0.552762	  0.660488	  1.942554
  0.546699	  0.647574	  1.930186
  0.539183	  0.634813	  1.915408
  0.526486	  0.620114	  1.906491
  0.509390	  0.609012	  1.902794
  0.489996	  0.602129	  1.897523
  0.471647	  0.592398	  1.889713
  0.459261	  0.573829	  1.879437
  0.453023	  0.559001	  1.868844
  0.447872	  0.545615	  1.855226
  0.437728	  0.535226	  1.841697
  0.425914	  0.524363	  1.829161
  0.415736	  0.513171	  1.815142
  0.407671	  0.501769	  1.800213
  0.398868	  0.489483	  1.783658
  0.389492	  0.476228	  1.773934
  0.379268	  0.461154	  1.767275
  0.368081	  0.445871	  1.759840
  0.359728	  0.427582	  1.748619
  0.351333	  0.410782	  1.741700
  0.337119	  0.391650	  1.737601
  0.322472	  0.379150	  1.733791
  0.310372	  0.371379	  1.729170
  0.286059	  0.366763	  1.716244
  0.268683	  0.357949	  1.703424
  0.257521	  0.346533	  1.693033
  0.243541	  0.331330	  1.681485
  0.235579	  0.320144	  1.675925
  0.224733	  0.300674	  1.668650
  0.207527	  0.283064	  1.659694
  0.197380	  0.275617	  1.656581
  0.179026	  0.265931	  1.655931
  0.162904	  0.251242	  1.651756
  0.153945	  0.235487	  1.654881
  0.145741	  0.214732	  1.664513
  0.127939	  0.187861	  1.662437
  0.115932	  0.176618	  1.655321
  0.106724	  0.165047	  1.648594
  0.091287	  0.150027	  1.633524
  0.079053	  0.140499	  1.623627
  0.057964	  0.126183	  1.613352
  0.042789	  0.119499	  1.606077
  0.032595	  0.113825	  1.604835
  0.015244	  0.102102	  1.603193
 -0.005859	  0.086768	  1.599279
 -0.018627	  0.079931	  1.594034
 -0.045432	  0.065036	  1.580939
 -0.056259	  0.054359	  1.575988
 -0.062697	  0.047333	  1.573498
 -0.079782	  0.028409	  1.568156
 -0.099271	  0.012035	  1.560375
 -0.108519	  0.004773	  1.555825
 -0.120112	 -0.001938	  1.550007
 -0.146165	 -0.011079	  1.538820
 -0.165648	 -0.017496	  1.530131
 -0.179444	 -0.025624	  1.520388
 -0.191839	 -0.034977	  1.507020
 -0.204103	 -0.047221	  1.493535
 -0.217597	 -0.061166	  1.481766
 -0.226896	 -0.072370	  1.475757
 -0.241316	 -0.088995	  1.469772
 -0.250552	 -0.098974	  1.463765
 -0.268132	 -0.119530	  1.453511
 -0.283726	 -0.141754	  1.450406
 -0.288609	 -0.143140	  1.450316
 -0.302123	 -0.165506	  1.447757
 -0.314064	 -0.183572	  1.441061
 -0.321780	 -0.194348	  1.435939
 -0.337704	 -0.212843	  1.422879
 -0.347857	 -0.222702	  1.416619
 -0.363368	 -0.236827	  1.410254
 -0.377923	 -0.248141	  1.404186
 -0.392660	 -0.261717	  1.398096
 -0.407516	 -0.272207	  1.389006
 -0.417218	 -0.281590	  1.372841
 -0.418538	 -0.299329	  1.366775
 -0.427139	 -0.314852	  1.355900
 -0.450606	 -0.327633	  1.330021
 -0.458232	 -0.334741	  1.323443
 -0.466184	 -0.342874	  1.317770
 -0.480433	 -0.360987	  1.307185
 -0.491253	 -0.370302	  1.296671
 -0.501338	 -0.380211	  1.283853
 -0.517056	 -0.392220	  1.268023
 -0.529222	 -0.399713	  1.256030
 -0.539928	 -0.408083	  1.242817
 -0.551572	 -0.417831	  1.228955
 -0.563369	 -0.426568	  1.215375
 -0.576060	 -0.434660	  1.200838
 -0.589807	 -0.441817	  1.186741
 -0.600953	 -0.448106	  1.174727
 -0.611684	 -0.459287	  1.156677
 -0.624052	 -0.469384	  1.141193
 -0.642818	 -0.474175	  1.134572
 -0.664148	 -0.475930	  1.129795
 -0.681629	 -0.477343	  1.118330
 -0.695934	 -0.480727	  1.103648
 -0.710696	 -0.482964	  1.089841
 -0.726020	 -0.483666	  1.076995
 -0.741389	 -0.485406	  1.064113
 -0.756080	 -0.485124	  1.050148
 -0.769922	 -0.484585	  1.035689
 -0.783852	 -0.484371	  1.021312
 -0.798295	 -0.484775	  1.007385
 -0.813011	 -0.483537	  0.993728
 -0.827569	 -0.481168	  0.980163
 -0.841985	 -0.478357	  0.966659
 -0.856548	 -0.475856	  0.953143
 -0.871318	 -0.472918	  0.939965
 -0.886418	 -0.468441	  0.927633
 -0.901522	 -0.463931	  0.915325
 -0.916630	 -0.459431	  0.903015
 -0.931861	 -0.454801	  0.890907
 -0.947442	 -0.449792	  0.879412
 -0.963039	 -0.444802	  0.867932
 -0.979232	 -0.441014	  0.856825
 -0.996028	 -0.438772	  0.846227
 -1.013895	 -0.442601	  0.838130
 -1.031770	 -0.446506	  0.830054
 -1.049647	 -0.450426	  0.821994
 -1.067421	 -0.456008	  0.814845
 -1.082866	 -0.463316	  0.806657
 -1.094881	 -0.474572	  0.792664
 -1.107594	 -0.483062	  0.776680
 -1.128993	 -0.485731	  0.764535
 -1.148838	 -0.486752	  0.758721
 -1.167554	 -0.491210	  0.757630
 -1.182531	 -0.503712	  0.752927
 -1.192763	 -0.521494	  0.746921
 -1.201440	 -0.538774	  0.739290
 -1.211273	 -0.555501	  0.734374
 -1.222936	 -0.571146	  0.734249
 -1.243290	 -0.587762	  0.723879
 -1.254833	 -0.599437	  0.710665
 -1.262182	 -0.607259	  0.703158
 -1.269152	 -0.619799	  0.690820
 -1.276144	 -0.634582	  0.676269
 -1.279848	 -0.647802	  0.665721
 -1.282185	 -0.667018	  0.660049
 -1.282735	 -0.687283	  0.658041
 -1.284060	 -0.706317	  0.651969
 -1.289225	 -0.729622	  0.641398
 -1.294847	 -0.739794	  0.636636
 -1.304106	 -0.765734	  0.636198
 -1.307336	 -0.788665	  0.642071
 -1.309949	 -0.802079	  0.646047
 -1.314920	 -0.817149	  0.645745
 -1.316203	 -0.841494	  0.634246
 -1.311512	 -0.861792	  0.622319
 -1.307256	 -0.881245	  0.615627
 -1.309709	 -0.903937	  0.615793
 -1.318732	 -0.921758	  0.620670
 -1.328376	 -0.939821	  0.625018
 -1.336881	 -0.958265	  0.629191
 -1.345426	 -0.976157	  0.630037
 -1.359221	 -0.990507	  0.625815
 -1.372096	 -1.003843	  0.621750
 -1.376526	 -1.032221	  0.614714
 -1.381416	 -1.052833	  0.614950
 -1.385628	 -1.067931	  0.613084
 -1.391868	 -1.086732	  0.611966
 -1.404043	 -1.110474	  0.613582
 -1.410847	 -1.121005	  0.614772
 -1.422502	 -1.135825	  0.616303
 -1.430162	 -1.155720	  0.616342
 -1.436997	 -1.173655	  0.617969
 -1.448718	 -1.198446	  0.620100
 -1.454651	 -1.214865	  0.620408
 -1.460482	 -1.228125	  0.619072
 -1.470346	 -1.251891	  0.607819
 -1.481981	 -1.269277	  0.602298
 -1.489360	 -1.279916	  0.601131
 -1.501470	 -1.296861	  0.600077
 -1.514794	 -1.312228	  0.595986
 -1.532546	 -1.328375	  0.593161
 -1.543501	 -1.340602	  0.591880
 -1.555112	 -1.353383	  0.590083
 -1.572567	 -1.367720	  0.584095
 -1.586242	 -1.384127	  0.579005
 -1.594965	 -1.397872	  0.576561
 -1.606883	 -1.414802	  0.574252
 -1.621416	 -1.429102	  0.568532
 -1.634479	 -1.441995	  0.564142
 -1.645127	 -1.459157	  0.557862
 -1.655505	 -1.476911	  0.546782
 -1.665804	 -1.488977	  0.536654
 -1.679857	 -1.498071	  0.528523
 -1.692287	 -1.510709	  0.520537
 -1.704263	 -1.522999	  0.508495
 -1.724795	 -1.529065	  0.495999
 -1.746675	 -1.535285	  0.489994
 -1.760763	 -1.546271	  0.490697
 -1.770126	 -1.566268	  0.487402
 -1.779195	 -1.585503	  0.480522
 -1.791775	 -1.601691	  0.474541
 -1.806555	 -1.612462	  0.473207
 -1.823484	 -1.625382	  0.467977
 -1.836902	 -1.636313	  0.457826
 -1.849614	 -1.648656	  0.447993
 -1.862238	 -1.661714	  0.439130
 -1.875756	 -1.675876	  0.429732
 -1.894325	 -1.694987	  0.417225
 -1.906961	 -1.707965	  0.408744
