  2.188052	 -0.141990	  1.079651
  2.232893	 -0.131791	  1.079941
  2.213482	 -0.136579	  1.080465
  2.194111	 -0.141496	  1.081231
  2.174754	 -0.146451	  1.082118
  2.155494	 -0.151612	  1.083671
  2.136234	 -0.156773	  1.085224
  2.117057	 -0.162003	  1.087432
  2.097961	 -0.167285	  1.090161
  2.078865	 -0.172567	  1.092890
  2.060014	 -0.178004	  1.096772
  2.041209	 -0.183465	  1.100841
  2.022496	 -0.189117	  1.105071
  2.004056	 -0.195290	  1.109743
  1.985615	 -0.201464	  1.114415
  1.967307	 -0.208105	  1.118965
  1.949053	 -0.214926	  1.123468
  1.930772	 -0.221759	  1.127839
  1.912418	 -0.228625	  1.131837
  1.894064	 -0.235492	  1.135834
  1.875686	 -0.242041	  1.140235
  1.857301	 -0.248437	  1.144825
  1.838915	 -0.254824	  1.149428
  1.820534	 -0.260997	  1.154329
  1.802152	 -0.267169	  1.159230
  1.783731	 -0.273233	  1.164118
  1.765276	 -0.279204	  1.168994
  1.746830	 -0.285179	  1.173894
  1.728446	 -0.291183	  1.178991
  1.710062	 -0.297187	  1.184089
  1.691769	 -0.303206	  1.189487
  1.673533	 -0.309235	  1.195063
  1.655305	 -0.315243	  1.200689
  1.637139	 -0.321107	  1.206657
  1.618973	 -0.326970	  1.212625
  1.600729	 -0.332481	  1.218691
  1.582434	 -0.337741	  1.224824
  1.564139	 -0.343000	  1.230958
  1.545280	 -0.346569	  1.236581
  1.526342	 -0.349847	  1.242113
  1.507348	 -0.352928	  1.247566
  1.487856	 -0.353576	  1.251996
  1.468363	 -0.354223	  1.256427
  1.448842	 -0.354405	  1.260772
  1.429297	 -0.353878	  1.264980
  1.409752	 -0.353351	  1.269189
  1.390169	 -0.352524	  1.273166
  1.370581	 -0.351654	  1.277111
  1.350989	 -0.350644	  1.281000
  1.331393	 -0.349459	  1.284823
  1.311797	 -0.348275	  1.288645
  1.292261	 -0.346624	  1.292593
  1.272725	 -0.344967	  1.296543
  1.253160	 -0.343661	  1.300484
  1.233570	 -0.342770	  1.304412
  1.213980	 -0.341880	  1.308341
  1.194347	 -0.342254	  1.312138
  1.174715	 -0.342636	  1.315934
  1.155092	 -0.343703	  1.319650
  1.135489	 -0.345227	  1.323311
  1.115894	 -0.346971	  1.326917
  1.096376	 -0.349780	  1.330257
  1.076858	 -0.352590	  1.333597
  1.057465	 -0.356462	  1.336580
  1.038120	 -0.360647	  1.339455
  1.018836	 -0.365290	  1.342018
  0.999675	 -0.370632	  1.344094
  0.980513	 -0.375973	  1.346171
  0.961345	 -0.381348	  1.348094
  0.942177	 -0.386725	  1.350011
  0.922992	 -0.392103	  1.351749
  0.903789	 -0.397480	  1.353269
  0.884585	 -0.402860	  1.354778
  0.865360	 -0.408324	  1.355515
  0.846135	 -0.413788	  1.356253
  0.826839	 -0.419038	  1.356535
  0.807506	 -0.424161	  1.356553
  0.788096	 -0.428985	  1.356586
  0.768474	 -0.432849	  1.356663
  0.748851	 -0.436714	  1.356740
  0.729074	 -0.439690	  1.356584
  0.709257	 -0.442382	  1.356353
  0.689450	 -0.445149	  1.356222
  0.669681	 -0.448171	  1.356433
  0.649911	 -0.451193	  1.356644
  0.630249	 -0.454800	  1.357261
  0.610652	 -0.458709	  1.358090
  0.591076	 -0.462701	  1.359007
  0.571631	 -0.467159	  1.360425
  0.552186	 -0.471618	  1.361844
  0.532924	 -0.476718	  1.363561
  0.513789	 -0.482218	  1.365463
  0.494709	 -0.487896	  1.367386
  0.476100	 -0.494927	  1.369457
  0.457492	 -0.501958	  1.371527
  0.439218	 -0.509708	  1.373980
  0.421148	 -0.517855	  1.376646
  0.403094	 -0.526033	  1.379327
  0.385213	 -0.534531	  1.382156
  0.367331	 -0.543030	  1.384986
  0.349343	 -0.551254	  1.387956
  0.331264	 -0.559225	  1.391053
  0.313184	 -0.567197	  1.394150
  0.294785	 -0.574225	  1.397623
  0.276335	 -0.581087	  1.401160
  0.257823	 -0.587751	  1.404750
  0.239036	 -0.593432	  1.408596
  0.220249	 -0.599114	  1.412441
  0.201288	 -0.604088	  1.416407
  0.182218	 -0.608553	  1.420455
  0.163148	 -0.613019	  1.424503
  0.143828	 -0.616084	  1.428668
  0.124494	 -0.619052	  1.432840
  0.105118	 -0.621568	  1.437109
  0.085676	 -0.622782	  1.441642
  0.066235	 -0.623995	  1.446175
  0.046850	 -0.624473	  1.451073
  0.027512	 -0.624526	  1.456179
  0.008164	 -0.624524	  1.461244
 -0.011271	 -0.624012	  1.465934
 -0.030707	 -0.623500	  1.470624
 -0.050264	 -0.623070	  1.474785
 -0.069877	 -0.622680	  1.478681
 -0.089528	 -0.622291	  1.482382
 -0.109268	 -0.621908	  1.485574
 -0.129008	 -0.621525	  1.488765
 -0.148799	 -0.621416	  1.491649
 -0.168596	 -0.621344	  1.494491
 -0.188323	 -0.622130	  1.497688
 -0.207862	 -0.624219	  1.501412
 -0.227401	 -0.626308	  1.505136
 -0.245778	 -0.632047	  1.510553
 -0.263997	 -0.638130	  1.516124
 -0.282149	 -0.644745	  1.521295
 -0.300189	 -0.652010	  1.525963
 -0.318229	 -0.659274	  1.530632
 -0.336660	 -0.665986	  1.534537
 -0.355102	 -0.672682	  1.538419
 -0.373717	 -0.679040	  1.542032
 -0.392534	 -0.684972	  1.545307
 -0.411351	 -0.690904	  1.548583
 -0.430441	 -0.695979	  1.551714
 -0.449551	 -0.700987	  1.554833
 -0.468727	 -0.705550	  1.558222
 -0.487978	 -0.709410	  1.562030
 -0.507229	 -0.713270	  1.565837
 -0.526530	 -0.716640	  1.569849
 -0.545843	 -0.719878	  1.573916
 -0.565175	 -0.723019	  1.577967
 -0.584552	 -0.725920	  1.581979
 -0.603929	 -0.728822	  1.585992
 -0.623326	 -0.731653	  1.589960
 -0.642724	 -0.734480	  1.593926
 -0.662138	 -0.737216	  1.597879
 -0.681569	 -0.739849	  1.601816
 -0.701000	 -0.742481	  1.605754
 -0.720658	 -0.744795	  1.608617
 -0.740350	 -0.747052	  1.611291
 -0.760131	 -0.749249	  1.613265
 -0.779999	 -0.751349	  1.614175
 -0.799868	 -0.753464	  1.615039
 -0.819736	 -0.755739	  1.615363
 -0.839603	 -0.758013	  1.615688
 -0.859398	 -0.760867	  1.615846
 -0.879168	 -0.763890	  1.615955
 -0.898800	 -0.767706	  1.616132
 -0.918097	 -0.772954	  1.616436
 -0.937393	 -0.778202	  1.616739
 -0.956270	 -0.784792	  1.617240
 -0.975081	 -0.791565	  1.617768
 -0.993919	 -0.798247	  1.618463
 -1.012799	 -0.804773	  1.619439
 -1.031679	 -0.811299	  1.620416
 -1.050820	 -0.816868	  1.622032
 -1.070023	 -0.822157	  1.623833
 -1.089237	 -0.827390	  1.625696
 -1.108550	 -0.831753	  1.628517
 -1.127863	 -0.836116	  1.631338
 -1.147156	 -0.840219	  1.634647
 -1.166393	 -0.843934	  1.638665
 -1.185630	 -0.847650	  1.642684
 -1.204859	 -0.850737	  1.647231
 -1.224084	 -0.853695	  1.651888
 -1.243338	 -0.856990	  1.656178
 -1.262615	 -0.860755	  1.659949
 -1.281914	 -0.864593	  1.663531
 -1.301310	 -0.868920	  1.665781
 -1.320706	 -0.873247	  1.668031
 -1.340362	 -0.875284	  1.671113
 -1.360034	 -0.876003	  1.674648
 -1.379706	 -0.876723	  1.678183
 -1.399012	 -0.878944	  1.682912
 -1.418289	 -0.881258	  1.687712
 -1.437525	 -0.884373	  1.692212
 -1.456660	 -0.888494	  1.696319
 -1.475780	 -0.892757	  1.700350
 -1.494690	 -0.898390	  1.703618
 -1.513600	 -0.904024	  1.706887
 -1.532510	 -0.909657	  1.710155
 -1.551674	 -0.915928	  1.713072
 -1.570443	 -0.922284	  1.715778
