  0.862373	  1.187193	  1.879833
  0.878344	  1.200511	  1.887974
  0.894315	  1.213829	  1.896115
  0.879999	  1.201914	  1.888831
  0.864848	  1.190790	  1.881998
  0.849118	  1.180277	  1.875515
  0.833396	  1.169748	  1.869042
  0.818495	  1.157926	  1.862866
  0.803760	  1.145866	  1.856748
  0.789075	  1.133741	  1.850651
  0.775758	  1.120001	  1.844838
  0.762476	  1.106218	  1.839038
  0.749388	  1.092321	  1.833077
  0.736596	  1.078256	  1.826868
  0.723780	  1.064215	  1.820660
  0.710473	  1.050662	  1.814554
  0.696392	  1.037653	  1.808815
  0.682286	  1.024687	  1.803025
  0.668682	  1.012871	  1.796767
  0.651867	  1.005505	  1.790010
  0.632725	  0.999721	  1.785989
  0.612842	  0.987339	  1.786823
  0.597991	  0.965226	  1.788722
  0.586316	  0.944834	  1.779313
  0.580567	  0.933796	  1.765397
  0.573326	  0.924363	  1.747057
  0.561024	  0.915674	  1.732606
  0.546670	  0.904429	  1.723746
  0.532295	  0.892656	  1.716353
  0.521723	  0.881500	  1.704171
  0.511997	  0.868197	  1.688362
  0.499342	  0.853273	  1.677731
  0.489201	  0.839098	  1.675261
  0.475575	  0.822165	  1.672948
  0.461322	  0.809333	  1.664909
  0.448448	  0.797592	  1.652370
  0.440820	  0.785508	  1.637783
  0.435396	  0.772129	  1.625232
  0.427629	  0.754977	  1.614958
  0.418734	  0.740983	  1.604129
  0.411348	  0.733158	  1.588743
  0.405251	  0.724993	  1.569539
  0.396034	  0.715902	  1.557527
  0.375844	  0.711139	  1.551609
  0.340463	  0.682549	  1.535940
  0.338363	  0.678174	  1.533417
  0.336077	  0.669844	  1.527031
  0.325893	  0.645263	  1.510140
  0.315365	  0.628955	  1.502650
  0.308111	  0.616711	  1.497067
  0.295814	  0.598330	  1.489592
  0.282019	  0.584920	  1.484450
  0.266849	  0.571693	  1.474800
  0.247587	  0.555850	  1.465042
  0.238717	  0.549085	  1.461959
  0.223433	  0.537568	  1.454717
  0.209585	  0.525716	  1.448591
  0.199291	  0.510908	  1.446600
  0.180325	  0.486749	  1.440547
  0.171409	  0.476323	  1.435658
  0.157639	  0.461319	  1.428423
  0.146792	  0.450880	  1.424541
  0.131788	  0.441010	  1.416337
  0.111416	  0.429782	  1.405272
  0.097645	  0.422174	  1.399820
  0.078546	  0.410254	  1.394184
  0.059490	  0.393648	  1.389850
  0.050662	  0.384748	  1.388268
  0.036281	  0.366742	  1.383094
  0.022708	  0.348410	  1.377943
  0.015048	  0.340381	  1.374615
  0.003237	  0.328586	  1.370318
 -0.014770	  0.313926	  1.362877
 -0.035041	  0.293944	  1.350567
 -0.040445	  0.286593	  1.346551
 -0.048222	  0.274346	  1.340777
 -0.066296	  0.251254	  1.331942
 -0.083591	  0.237587	  1.324301
 -0.089262	  0.232915	  1.320883
 -0.111599	  0.223895	  1.311562
 -0.127065	  0.219732	  1.306505
 -0.150088	  0.209342	  1.296861
 -0.166748	  0.199283	  1.290231
 -0.180380	  0.190260	  1.285315
 -0.195324	  0.175987	  1.280569
 -0.211178	  0.161057	  1.276300
 -0.222326	  0.150154	  1.272164
 -0.235799	  0.135714	  1.266658
 -0.250401	  0.124478	  1.261545
 -0.267282	  0.107492	  1.254928
 -0.280135	  0.093087	  1.248540
 -0.293574	  0.080089	  1.241365
 -0.305553	  0.068417	  1.232924
 -0.317161	  0.056930	  1.226074
 -0.328801	  0.042668	  1.219580
 -0.339167	  0.026519	  1.212758
 -0.349565	  0.010330	  1.201959
 -0.361760	 -0.005624	  1.188794
 -0.375641	 -0.019105	  1.177527
 -0.386100	 -0.027089	  1.170475
 -0.395820	 -0.035515	  1.164610
 -0.408963	 -0.049648	  1.153817
 -0.421842	 -0.064802	  1.144098
 -0.431442	 -0.080763	  1.132903
 -0.440628	 -0.098079	  1.125587
 -0.453204	 -0.115532	  1.117010
 -0.465168	 -0.126552	  1.110084
 -0.481781	 -0.134961	  1.101480
 -0.497160	 -0.139729	  1.093468
 -0.520160	 -0.145817	  1.079338
 -0.536748	 -0.157731	  1.063606
 -0.541128	 -0.160878	  1.055959
 -0.552514	 -0.169633	  1.038284
 -0.566106	 -0.173780	  1.021267
 -0.578618	 -0.175930	  1.007754
 -0.594194	 -0.178807	  0.989658
 -0.608163	 -0.185549	  0.972546
 -0.618100	 -0.192327	  0.962710
 -0.629641	 -0.201947	  0.954690
 -0.649445	 -0.212007	  0.939266
 -0.667472	 -0.209459	  0.922463
 -0.676859	 -0.207780	  0.914453
 -0.692661	 -0.209102	  0.901674
 -0.715481	 -0.206748	  0.882105
 -0.725278	 -0.201332	  0.872813
 -0.737087	 -0.192131	  0.864102
 -0.754889	 -0.180949	  0.851840
 -0.772599	 -0.175595	  0.837687
 -0.784632	 -0.174126	  0.827998
 -0.801907	 -0.172706	  0.816165
 -0.818966	 -0.169967	  0.803810
 -0.833428	 -0.168597	  0.792067
 -0.850328	 -0.166856	  0.778710
 -0.866277	 -0.164855	  0.767606
 -0.881673	 -0.164887	  0.757881
 -0.899256	 -0.165349	  0.746535
 -0.916126	 -0.164736	  0.734841
 -0.932134	 -0.166803	  0.726391
 -0.950669	 -0.169991	  0.717088
 -0.968938	 -0.174055	  0.705589
 -0.983753	 -0.173292	  0.697754
 -1.000048	 -0.165678	  0.690298
 -1.019190	 -0.166105	  0.680746
 -1.037369	 -0.169628	  0.672018
 -1.054885	 -0.172546	  0.663044
 -1.069990	 -0.176860	  0.653283
 -1.079319	 -0.184759	  0.638554
 -1.088850	 -0.195768	  0.624456
 -1.111439	 -0.203488	  0.618190
 -1.142876	 -0.212508	  0.616368
 -1.163608	 -0.218214	  0.616014
 -1.178372	 -0.220598	  0.613373
 -1.192753	 -0.222542	  0.607191
 -1.211660	 -0.228676	  0.595497
 -1.225174	 -0.237794	  0.582636
 -1.237618	 -0.248124	  0.570396
 -1.249502	 -0.257336	  0.563473
 -1.265270	 -0.273790	  0.556735
 -1.277932	 -0.284400	  0.550216
 -1.295870	 -0.297869	  0.541289
 -1.304679	 -0.305981	  0.534745
 -1.323438	 -0.322329	  0.519321
 -1.332930	 -0.333497	  0.511533
 -1.340213	 -0.341695	  0.503599
 -1.350642	 -0.351015	  0.486600
 -1.359561	 -0.362918	  0.467912
 -1.364001	 -0.381665	  0.453580
 -1.367623	 -0.391512	  0.446460
 -1.377992	 -0.408348	  0.431390
 -1.389197	 -0.430781	  0.420031
 -1.396209	 -0.444708	  0.413557
 -1.403260	 -0.456150	  0.405417
 -1.412107	 -0.479715	  0.394901
 -1.415802	 -0.495168	  0.393975
 -1.420645	 -0.515672	  0.388112
 -1.424396	 -0.534330	  0.383175
 -1.427903	 -0.550926	  0.379205
 -1.432334	 -0.571674	  0.374120
 -1.433141	 -0.592442	  0.369913
 -1.436342	 -0.618678	  0.369804
 -1.437693	 -0.635246	  0.369968
 -1.438563	 -0.654607	  0.369345
 -1.440345	 -0.670676	  0.366684
 -1.442828	 -0.690367	  0.357885
 -1.447972	 -0.708924	  0.349527
 -1.453230	 -0.728512	  0.343680
 -1.460056	 -0.749634	  0.343258
 -1.469311	 -0.770988	  0.345991
 -1.475920	 -0.788136	  0.347136
 -1.478729	 -0.808151	  0.347621
 -1.476541	 -0.828415	  0.347971
 -1.473574	 -0.848309	  0.345620
 -1.477142	 -0.867472	  0.342703
 -1.485834	 -0.885959	  0.340100
 -1.497200	 -0.903975	  0.341293
 -1.504882	 -0.922760	  0.346385
 -1.508301	 -0.944531	  0.350805
 -1.509490	 -0.965171	  0.350412
 -1.513331	 -0.983666	  0.346118
 -1.518094	 -0.996233	  0.341714
 -1.527790	 -1.013139	  0.332705
 -1.537345	 -1.031668	  0.325351
 -1.546966	 -1.050611	  0.318220
 -1.552498	 -1.069715	  0.313190
 -1.559375	 -1.094476	  0.314911
 -1.566841	 -1.118640	  0.320794
 -1.573523	 -1.128638	  0.322997
 -1.591714	 -1.141189	  0.323157
 -1.608386	 -1.158093	  0.323425
 -1.618671	 -1.175896	  0.324222
 -1.628643	 -1.189414	  0.325634
 -1.643523	 -1.203176	  0.326393
 -1.660199	 -1.216817	  0.323667
 -1.676083	 -1.228450	  0.319853
 -1.693861	 -1.240968	  0.316316
 -1.713248	 -1.257592	  0.306377
 -1.719141	 -1.267121	  0.301335
 -1.727814	 -1.283651	  0.291875
 -1.739071	 -1.298879	  0.282177
 -1.753666	 -1.309845	  0.274850
 -1.767603	 -1.319402	  0.269315
 -1.785589	 -1.334609	  0.263203
 -1.800342	 -1.353179	  0.253307
 -1.806147	 -1.361232	  0.250316
 -1.817855	 -1.376570	  0.241516
 -1.829915	 -1.391602	  0.232628
 -1.840334	 -1.407480	  0.224616
 -1.849528	 -1.425289	  0.214668
 -1.861154	 -1.440822	  0.200637
 -1.872603	 -1.449652	  0.189270
 -1.882091	 -1.455696	  0.182721
 -1.904182	 -1.464557	  0.173169
 -1.925382	 -1.486920	  0.169381
 -1.938018	 -1.499897	  0.160900
 -1.950654	 -1.512874	  0.152419
