 -2.088274	  1.132832	 -0.882668
 -2.091874	  1.132092	 -0.884594
 -2.074521	  1.135659	 -0.875313
 -2.057159	  1.139202	 -0.866041
 -2.039446	  1.141858	 -0.857143
 -2.021611	  1.144099	 -0.848493
 -2.004617	  1.147002	 -0.840422
 -1.988511	  1.152920	 -0.834017
 -1.969152	  1.162762	 -0.828988
 -1.941547	  1.159833	 -0.813923
 -1.929896	  1.154214	 -0.804788
 -1.918482	  1.147560	 -0.794335
 -1.897536	  1.144934	 -0.781027
 -1.880065	  1.146896	 -0.773852
 -1.861694	  1.152080	 -0.767189
 -1.842549	  1.155293	 -0.758765
 -1.827299	  1.158642	 -0.752179
 -1.807064	  1.164968	 -0.743641
 -1.788029	  1.165674	 -0.733800
 -1.774498	  1.164864	 -0.726734
 -1.749139	  1.165515	 -0.714365
 -1.734439	  1.164124	 -0.704754
 -1.722265	  1.163174	 -0.695921
 -1.702905	  1.164498	 -0.682907
 -1.685386	  1.169265	 -0.676284
 -1.667964	  1.174368	 -0.673460
 -1.639487	  1.182389	 -0.668282
 -1.620313	  1.188835	 -0.661896
 -1.609709	  1.191458	 -0.658309
 -1.593894	  1.201570	 -0.649243
 -1.585466	  1.215742	 -0.638915
 -1.577106	  1.233633	 -0.632019
 -1.572020	  1.252304	 -0.626312
 -1.567491	  1.268776	 -0.619891
 -1.559104	  1.282767	 -0.612693
 -1.547468	  1.300361	 -0.607043
 -1.532424	  1.313122	 -0.604376
 -1.519773	  1.329938	 -0.602307
 -1.512568	  1.348955	 -0.599875
 -1.506568	  1.367941	 -0.597409
 -1.501085	  1.387081	 -0.594874
 -1.496638	  1.406480	 -0.592450
 -1.492957	  1.426071	 -0.589741
 -1.489170	  1.445612	 -0.586811
 -1.484428	  1.464477	 -0.582754
 -1.478358	  1.483124	 -0.579851
 -1.471983	  1.501901	 -0.578325
 -1.463242	  1.515378	 -0.573353
 -1.459686	  1.518101	 -0.560817
 -1.447106	  1.524390	 -0.541474
 -1.428974	  1.528319	 -0.533829
 -1.408069	  1.530783	 -0.525787
 -1.379430	  1.528488	 -0.518801
 -1.370689	  1.527540	 -0.517557
 -1.350833	  1.528651	 -0.515094
 -1.323778	  1.527235	 -0.507995
 -1.308282	  1.522984	 -0.502517
 -1.292246	  1.515303	 -0.491167
 -1.277760	  1.508616	 -0.481588
 -1.260755	  1.503003	 -0.472814
 -1.236649	  1.499480	 -0.460781
 -1.220647	  1.500286	 -0.450564
 -1.208100	  1.502757	 -0.441398
 -1.193636	  1.501927	 -0.429561
 -1.173105	  1.499497	 -0.419962
 -1.155190	  1.497314	 -0.411395
 -1.137239	  1.495133	 -0.404902
 -1.118133	  1.493035	 -0.402506
 -1.100305	  1.491307	 -0.404183
 -1.081955	  1.489943	 -0.402599
 -1.063572	  1.488682	 -0.402587
 -1.041342	  1.486915	 -0.401112
 -1.022083	  1.485224	 -0.398615
 -1.001794	  1.483234	 -0.394600
 -0.984948	  1.482577	 -0.384186
 -0.962422	  1.480280	 -0.369467
 -0.943660	  1.476916	 -0.361891
 -0.929433	  1.474446	 -0.360113
 -0.908930	  1.470651	 -0.360542
 -0.890550	  1.467019	 -0.354451
 -0.872377	  1.464459	 -0.341418
 -0.854556	  1.465165	 -0.328551
 -0.831216	  1.465700	 -0.319551
 -0.809842	  1.463078	 -0.317094
 -0.793477	  1.461215	 -0.318219
 -0.772791	  1.459365	 -0.314005
 -0.754710	  1.453487	 -0.302236
 -0.742187	  1.446930	 -0.289319
 -0.729541	  1.442878	 -0.274601
 -0.713945	  1.437654	 -0.259091
 -0.702029	  1.427535	 -0.245195
 -0.691339	  1.420401	 -0.231171
 -0.680453	  1.417386	 -0.218059
 -0.663572	  1.413497	 -0.203761
 -0.648462	  1.405468	 -0.191279
 -0.630096	  1.403285	 -0.185414
 -0.618838	  1.399245	 -0.176457
 -0.604511	  1.395681	 -0.166228
 -0.590683	  1.384106	 -0.149392
 -0.566143	  1.383952	 -0.134995
 -0.554291	  1.374452	 -0.118651
 -0.531131	  1.380330	 -0.106365
 -0.510001	  1.382574	 -0.094411
 -0.492986	  1.376874	 -0.081250
 -0.473603	  1.382961	 -0.072178
 -0.453969	  1.390570	 -0.068393
 -0.434058	  1.397315	 -0.064505
 -0.414206	  1.403712	 -0.063821
 -0.393731	  1.409319	 -0.063739
 -0.375363	  1.413895	 -0.064447
 -0.354941	  1.418793	 -0.064553
 -0.335452	  1.423679	 -0.065450
 -0.313841	  1.428381	 -0.069410
 -0.298245	  1.431094	 -0.071654
 -0.284416	  1.434213	 -0.074924
 -0.259704	  1.440410	 -0.078807
 -0.241477	  1.446010	 -0.084402
 -0.221870	  1.453986	 -0.086297
 -0.202254	  1.463938	 -0.083114
 -0.183991	  1.474544	 -0.074719
 -0.168327	  1.483062	 -0.065772
 -0.152137	  1.488775	 -0.062182
 -0.130788	  1.499798	 -0.056378
 -0.107737	  1.511730	 -0.037222
 -0.099913	  1.516390	 -0.028087
 -0.089869	  1.521308	 -0.012701
 -0.072733	  1.524637	  0.002669
 -0.055584	  1.524229	  0.016685
 -0.039483	  1.520022	  0.029411
 -0.022183	  1.512870	  0.038105
 -0.002273	  1.506904	  0.045719
  0.017080	  1.502913	  0.053029
  0.036767	  1.497878	  0.058926
  0.053032	  1.498288	  0.063181
  0.076822	  1.493723	  0.069579
  0.092414	  1.494236	  0.073282
  0.111244	  1.496294	  0.079050
  0.133116	  1.494922	  0.084581
  0.153445	  1.495918	  0.089728
  0.167846	  1.501113	  0.093600
  0.187225	  1.507180	  0.098533
  0.209132	  1.506851	  0.104342
  0.223119	  1.514022	  0.108448
  0.243299	  1.521589	  0.113904
  0.261312	  1.528057	  0.119527
  0.276490	  1.538899	  0.125431
  0.291221	  1.549192	  0.133111
  0.306486	  1.560361	  0.144728
  0.321624	  1.570194	  0.156638
  0.335756	  1.579717	  0.168851
  0.350065	  1.587777	  0.181311
  0.366870	  1.593508	  0.198858
  0.373200	  1.593759	  0.212679
  0.390619	  1.599937	  0.221797
  0.414797	  1.604286	  0.239112
  0.425346	  1.603706	  0.244979
  0.443499	  1.603551	  0.261564
  0.457115	  1.595888	  0.279134
  0.487437	  1.603284	  0.276585
  0.500008	  1.590967	  0.289649
  0.520869	  1.586131	  0.295297
  0.531560	  1.579931	  0.302413
  0.551250	  1.577295	  0.304799
  0.572962	  1.571380	  0.308278
  0.585311	  1.565391	  0.314447
  0.603675	  1.558316	  0.324899
  0.618614	  1.552761	  0.334163
  0.633645	  1.549516	  0.346335
  0.646224	  1.547140	  0.363890
  0.649614	  1.542969	  0.381712
  0.657329	  1.540275	  0.398494
  0.658081	  1.537659	  0.408911
  0.663089	  1.533224	  0.429538
  0.666597	  1.528949	  0.444120
  0.673462	  1.525150	  0.460608
  0.680917	  1.519032	  0.479721
  0.684136	  1.510678	  0.498301
  0.691448	  1.505011	  0.516549
  0.699427	  1.498468	  0.533310
  0.703935	  1.488209	  0.551300
  0.714428	  1.481848	  0.570927
  0.721926	  1.471473	  0.585743
  0.733012	  1.464101	  0.605063
  0.742298	  1.455002	  0.619076
  0.749959	  1.447011	  0.632759
  0.760218	  1.438318	  0.651328
  0.765350	  1.431907	  0.662802
  0.776176	  1.424382	  0.676202
  0.783417	  1.415230	  0.694234
  0.793093	  1.407438	  0.705727
  0.795777	  1.396457	  0.723374
  0.799064	  1.385784	  0.742748
  0.822973	  1.397533	  0.755069
  0.824021	  1.401253	  0.747048
  0.838253	  1.411063	  0.741814
  0.853257	  1.424863	  0.739064
  0.861371	  1.430030	  0.737603
  0.875816	  1.443005	  0.735019
  0.891065	  1.455460	  0.726780
  0.907596	  1.465563	  0.718694
  0.924223	  1.475089	  0.710683
  0.940255	  1.484614	  0.702386
  0.956140	  1.493582	  0.693847
  0.973557	  1.500948	  0.686891
  0.991168	  1.505970	  0.681747
  1.008812	  1.513670	  0.672415
  1.025414	  1.517516	  0.667047
  1.043292	  1.522698	  0.658103
  1.059308	  1.527682	  0.649409
  1.076588	  1.530339	  0.642877
  1.096503	  1.532044	  0.636200
  1.115591	  1.533655	  0.629392
  1.134970	  1.534987	  0.622241
  1.153099	  1.536695	  0.616196
  1.172954	  1.538341	  0.609389
  1.194377	  1.540140	  0.607194
  1.214943	  1.540587	  0.609205
  1.233448	  1.539285	  0.606625
  1.257661	  1.532747	  0.614273
  1.286735	  1.536046	  0.624358
  1.299096	  1.539539	  0.628216
  1.313743	  1.543013	  0.630975
  1.336795	  1.546339	  0.634187
  1.355533	  1.553790	  0.638511
  1.379855	  1.562264	  0.643197
  1.398620	  1.559743	  0.652423
  1.413121	  1.552968	  0.661039
  1.432181	  1.546169	  0.673462
  1.450409	  1.548151	  0.682013
  1.467237	  1.557409	  0.686540
  1.490036	  1.567810	  0.694963
  1.509547	  1.567839	  0.710167
  1.519990	  1.564301	  0.720399
  1.533500	  1.558613	  0.728532
  1.555715	  1.554743	  0.734030
  1.575379	  1.553734	  0.738568
  1.594944	  1.553521	  0.742588
  1.613991	  1.554380	  0.748807
  1.633059	  1.554946	  0.754879
  1.651972	  1.555388	  0.761130
  1.671066	  1.555834	  0.768370
  1.690056	  1.556928	  0.774351
  1.709327	  1.558381	  0.781420
  1.728146	  1.559710	  0.788080
  1.746414	  1.560681	  0.796352
  1.765479	  1.561472	  0.802439
  1.784657	  1.563228	  0.809417
  1.803765	  1.566318	  0.818370
  1.821351	  1.569997	  0.830463
  1.832006	  1.572912	  0.851428
  1.851190	  1.576271	  0.855975
