 -0.960801	  2.295758	 -0.034058
 -0.960035	  2.312946	 -0.035522
 -0.967481	  2.294009	 -0.034046
 -0.964870	  2.273395	 -0.032269
 -0.964479	  2.254483	 -0.030588
 -0.971415	  2.234441	 -0.026935
 -0.978761	  2.213303	 -0.023394
 -0.978011	  2.193431	 -0.024038
 -0.969048	  2.174171	 -0.028389
 -0.961238	  2.147977	 -0.032430
 -0.962029	  2.132954	 -0.032199
 -0.965546	  2.114421	 -0.030501
 -0.967716	  2.092426	 -0.029673
 -0.967336	  2.074538	 -0.031163
 -0.965083	  2.050128	 -0.033967
 -0.965087	  2.030031	 -0.034520
 -0.968092	  2.014223	 -0.032580
 -0.969967	  1.990934	 -0.029908
 -0.962606	  1.969820	 -0.032433
 -0.951948	  1.951489	 -0.036261
 -0.940454	  1.936071	 -0.039570
 -0.932750	  1.916412	 -0.041419
 -0.924394	  1.898320	 -0.043236
 -0.910464	  1.884207	 -0.046187
 -0.896762	  1.870079	 -0.049603
 -0.884182	  1.855456	 -0.052866
 -0.873123	  1.838672	 -0.055467
 -0.856550	  1.823177	 -0.061403
 -0.838807	  1.814223	 -0.070176
 -0.816680	  1.811061	 -0.072014
 -0.803006	  1.804827	 -0.067905
 -0.795413	  1.787219	 -0.060726
 -0.774455	  1.766522	 -0.049470
 -0.764055	  1.758540	 -0.044035
 -0.754200	  1.745154	 -0.038702
 -0.741276	  1.729436	 -0.026764
 -0.733807	  1.716482	 -0.028793
 -0.726803	  1.704638	 -0.022853
 -0.729357	  1.686990	 -0.011271
 -0.732295	  1.670544	 -0.000906
 -0.729864	  1.650864	  0.016997
 -0.727786	  1.641999	  0.029308
 -0.726696	  1.630354	  0.043100
 -0.721613	  1.616045	  0.057835
 -0.717005	  1.601156	  0.070838
 -0.711699	  1.580058	  0.078535
 -0.703225	  1.562043	  0.087079
 -0.696917	  1.542653	  0.093923
 -0.697963	  1.524723	  0.096850
 -0.704015	  1.509030	  0.104018
 -0.710412	  1.489533	  0.115820
 -0.717729	  1.468937	  0.118983
 -0.724111	  1.449793	  0.127027
 -0.725047	  1.431957	  0.132615
 -0.722190	  1.413685	  0.130358
 -0.731935	  1.390551	  0.136755
 -0.735097	  1.377036	  0.137717
 -0.747643	  1.360063	  0.143202
 -0.764923	  1.347513	  0.147777
 -0.776292	  1.331774	  0.153328
 -0.783450	  1.318976	  0.155900
 -0.798822	  1.304119	  0.158180
 -0.816125	  1.287701	  0.165380
 -0.830143	  1.273447	  0.169822
 -0.840189	  1.263928	  0.177113
 -0.856324	  1.252280	  0.190373
 -0.868266	  1.243637	  0.197508
 -0.880182	  1.232147	  0.202873
 -0.900963	  1.215556	  0.207417
 -0.914937	  1.202774	  0.209121
 -0.923604	  1.189922	  0.207517
 -0.934649	  1.174286	  0.203887
 -0.943198	  1.160669	  0.198594
 -0.952047	  1.145566	  0.195100
 -0.968435	  1.134291	  0.186146
 -0.976465	  1.122578	  0.184797
 -0.994314	  1.112988	  0.178328
 -1.006702	  1.103182	  0.164138
 -1.008010	  1.089308	  0.146423
 -1.011975	  1.067406	  0.129248
 -1.016610	  1.059182	  0.122189
 -1.023984	  1.043207	  0.112918
 -1.031135	  1.019281	  0.098715
 -1.035922	  1.004712	  0.092513
 -1.038926	  0.994171	  0.084467
 -1.040711	  0.974288	  0.070464
 -1.041865	  0.957979	  0.063483
 -1.045806	  0.941028	  0.047170
 -1.053872	  0.920792	  0.036988
 -1.061087	  0.907980	  0.029183
 -1.072774	  0.891122	  0.027429
 -1.074972	  0.868944	  0.029441
 -1.072971	  0.845914	  0.031545
 -1.072183	  0.830396	  0.030576
 -1.073668	  0.811496	  0.025828
 -1.075793	  0.785075	  0.023438
 -1.073890	  0.768596	  0.025492
 -1.070315	  0.750371	  0.029021
 -1.067690	  0.724252	  0.033494
 -1.068881	  0.710643	  0.036648
 -1.070949	  0.690988	  0.043315
 -1.068896	  0.668304	  0.050985
 -1.064829	  0.651974	  0.053911
 -1.063549	  0.631897	  0.055659
 -1.068336	  0.613638	  0.055849
 -1.076487	  0.586847	  0.056678
 -1.076055	  0.569498	  0.056556
 -1.072625	  0.551547	  0.059433
 -1.068565	  0.528961	  0.064703
 -1.067673	  0.508996	  0.068040
 -1.072093	  0.498091	  0.069841
 -1.079720	  0.471377	  0.074725
 -1.077902	  0.447130	  0.079353
 -1.080318	  0.438858	  0.083744
 -1.078744	  0.419117	  0.091979
 -1.077630	  0.396465	  0.098011
 -1.077077	  0.378028	  0.099705
 -1.076009	  0.359511	  0.096888
 -1.075245	  0.329155	  0.095452
 -1.072458	  0.308544	  0.097067
 -1.073260	  0.297228	  0.096175
 -1.074462	  0.275174	  0.096791
 -1.079210	  0.255073	  0.099228
 -1.085163	  0.236666	  0.104434
 -1.087293	  0.214757	  0.110579
 -1.088557	  0.195283	  0.114347
 -1.094814	  0.177906	  0.112765
 -1.103527	  0.158154	  0.111429
 -1.111347	  0.139240	  0.112209
 -1.117874	  0.119998	  0.115040
 -1.123106	  0.100934	  0.119354
 -1.122354	  0.079580	  0.123974
 -1.119665	  0.059378	  0.125630
 -1.118505	  0.039008	  0.123005
 -1.118792	  0.018681	  0.116593
 -1.119945	 -0.001659	  0.108210
 -1.120976	 -0.022205	  0.101631
 -1.120331	 -0.042934	  0.100338
 -1.118158	 -0.061189	  0.104765
 -1.116593	 -0.082231	  0.110279
 -1.117475	 -0.100002	  0.116766
 -1.116743	 -0.119683	  0.123782
 -1.111880	 -0.139316	  0.128847
 -1.106161	 -0.160131	  0.129313
 -1.101932	 -0.180118	  0.126037
 -1.098846	 -0.199440	  0.122965
 -1.099347	 -0.217297	  0.122374
 -1.100003	 -0.237950	  0.121398
 -1.096778	 -0.261464	  0.119812
 -1.090976	 -0.280326	  0.118670
 -1.087235	 -0.296143	  0.117578
 -1.085353	 -0.317920	  0.116073
 -1.082987	 -0.338253	  0.119150
 -1.078952	 -0.356866	  0.125444
 -1.076142	 -0.376818	  0.130777
 -1.076210	 -0.397328	  0.132336
 -1.079520	 -0.418238	  0.128384
 -1.086765	 -0.442064	  0.121667
 -1.092594	 -0.458631	  0.120974
 -1.095056	 -0.477185	  0.125169
 -1.094429	 -0.497251	  0.132795
 -1.092937	 -0.517203	  0.141060
 -1.090801	 -0.536821	  0.147425
 -1.089052	 -0.555961	  0.147543
 -1.086092	 -0.578140	  0.141159
 -1.082443	 -0.597700	  0.131300
 -1.081402	 -0.619172	  0.119197
 -1.083377	 -0.640027	  0.111965
 -1.089621	 -0.655972	  0.108468
 -1.099273	 -0.674627	  0.109486
 -1.108135	 -0.692752	  0.109723
 -1.114832	 -0.713098	  0.110937
 -1.115911	 -0.733472	  0.109732
 -1.112961	 -0.756076	  0.106178
 -1.111360	 -0.776905	  0.104030
 -1.115235	 -0.794209	  0.105529
 -1.125677	 -0.813581	  0.109365
 -1.136943	 -0.832536	  0.113503
 -1.145208	 -0.853017	  0.112742
 -1.147815	 -0.872067	  0.108195
 -1.146812	 -0.890430	  0.105046
 -1.146932	 -0.910788	  0.104560
 -1.148339	 -0.931472	  0.104914
 -1.150481	 -0.951619	  0.105762
 -1.151445	 -0.971647	  0.107274
 -1.149360	 -0.991883	  0.108084
 -1.144204	 -1.011227	  0.104977
 -1.138474	 -1.031035	  0.101716
 -1.134262	 -1.051081	  0.104086
 -1.135997	 -1.069223	  0.109350
 -1.139279	 -1.088417	  0.113404
 -1.137406	 -1.110935	  0.117096
 -1.134285	 -1.131249	  0.120675
 -1.134146	 -1.143500	  0.124372
 -1.134764	 -1.172984	  0.127410
 -1.134239	 -1.190868	  0.123058
 -1.134259	 -1.204570	  0.121472
 -1.130748	 -1.231419	  0.124377
 -1.135355	 -1.257126	  0.134606
 -1.136042	 -1.268188	  0.139409
 -1.143351	 -1.279433	  0.146424
 -1.156938	 -1.298920	  0.162409
 -1.161675	 -1.314956	  0.173512
 -1.168964	 -1.326047	  0.188711
 -1.173836	 -1.346245	  0.204413
 -1.180338	 -1.359206	  0.212977
 -1.198374	 -1.371194	  0.219958
 -1.213478	 -1.378420	  0.226059
 -1.231343	 -1.384502	  0.237715
 -1.249884	 -1.391522	  0.251010
 -1.264095	 -1.397331	  0.264661
 -1.274894	 -1.402208	  0.281850
 -1.282766	 -1.403611	  0.296470
 -1.294984	 -1.406215	  0.313555
 -1.306247	 -1.410941	  0.330003
 -1.318047	 -1.414103	  0.346032
 -1.330919	 -1.414931	  0.360647
 -1.346376	 -1.415454	  0.373960
 -1.361723	 -1.416139	  0.387001
 -1.373861	 -1.419035	  0.402625
 -1.385036	 -1.415301	  0.425746
 -1.388486	 -1.415293	  0.448058
 -1.389613	 -1.425911	  0.465533
 -1.392084	 -1.441266	  0.477767
 -1.399044	 -1.454550	  0.489482
 -1.404550	 -1.468247	  0.503979
 -1.409004	 -1.480936	  0.517921
 -1.414569	 -1.497183	  0.528470
 -1.418294	 -1.517706	  0.535806
 -1.420360	 -1.536883	  0.544293
 -1.423903	 -1.552099	  0.558643
 -1.430301	 -1.559820	  0.573377
 -1.440570	 -1.573155	  0.586197
 -1.449528	 -1.588941	  0.595075
 -1.453758	 -1.604005	  0.606771
 -1.455348	 -1.622122	  0.618395
 -1.443912	 -1.639991	  0.620032
 -1.446124	 -1.654939	  0.618968
 -1.449544	 -1.671482	  0.620294
 -1.442234	 -1.690569	  0.622609
 -1.430332	 -1.708218	  0.623977
 -1.419004	 -1.724659	  0.624901
 -1.414219	 -1.743523	  0.620557
 -1.411159	 -1.762492	  0.615032
 -1.408467	 -1.781279	  0.609249
 -1.414757	 -1.794388	  0.595737
 -1.423298	 -1.804742	  0.580937
 -1.431948	 -1.815019	  0.566117
 -1.440599	 -1.825290	  0.551295
 -1.449244	 -1.835521	  0.536443
 -1.457774	 -1.845758	  0.521547
 -1.462163	 -1.856675	  0.505527
 -1.454130	 -1.866800	  0.490410
 -1.445729	 -1.876873	  0.475315
 -1.437347	 -1.886975	  0.460227
 -1.429026	 -1.897087	  0.445123
 -1.421534	 -1.906835	  0.429762
 -1.417736	 -1.914969	  0.411461
 -1.413233	 -1.921578	  0.391322
 -1.404712	 -1.930548	  0.374870
 -1.397186	 -1.941769	  0.362077
 -1.381907	 -1.954717	  0.345825
 -1.363834	 -1.964441	  0.333204
 -1.352510	 -1.972692	  0.329138
 -1.338367	 -1.985735	  0.320183
 -1.325201	 -1.996715	  0.308479
 -1.313222	 -2.007444	  0.299644
 -1.296223	 -2.021097	  0.289630
 -1.281385	 -2.028310	  0.275006
 -1.274326	 -2.030807	  0.257810
 -1.267334	 -2.037812	  0.237053
 -1.251996	 -2.047745	  0.223035
 -1.234412	 -2.057811	  0.219651
 -1.219283	 -2.069347	  0.215123
 -1.210727	 -2.085164	  0.206740
 -1.211219	 -2.103902	  0.207200
 -1.212124	 -2.123813	  0.208829
 -1.214306	 -2.143575	  0.211180
 -1.215411	 -2.163369	  0.213932
 -1.216751	 -2.183261	  0.216626
 -1.221342	 -2.207810	  0.219245
 -1.216538	 -2.255171	  0.228784
 -1.217471	 -2.274877	  0.232073
