  0.242845	  0.257045	  3.009295
  0.240441	  0.254500	  2.979500
  0.245409	  0.254267	  2.933596
  0.246164	  0.247948	  2.884452
  0.243783	  0.245019	  2.835480
  0.241556	  0.243256	  2.787724
  0.238964	  0.239435	  2.738364
  0.236872	  0.234614	  2.687798
  0.236179	  0.228855	  2.635033
  0.237164	  0.222821	  2.584607
  0.239762	  0.216162	  2.535696
  0.242671	  0.209174	  2.487460
  0.244958	  0.202817	  2.440830
  0.246655	  0.196633	  2.392161
  0.249137	  0.189554	  2.341575
  0.252980	  0.183774	  2.293267
  0.256407	  0.185143	  2.245899
  0.253997	  0.207281	  2.206117
  0.243403	  0.269321	  2.167645
  0.208954	  0.415279	  2.102498
  0.155790	  0.544223	  2.017600
  0.116556	  0.585614	  1.955114
  0.091341	  0.588706	  1.909801
  0.070389	  0.573127	  1.870897
  0.050544	  0.546181	  1.838503
  0.028892	  0.498646	  1.802531
  0.001237	  0.397879	  1.742618
 -0.000398	  0.299440	  1.671116
 -0.001797	  0.270109	  1.637893
 -0.008792	  0.250418	  1.601069
 -0.025201	  0.230545	  1.541175
 -0.042947	  0.217070	  1.478198
 -0.054225	  0.209171	  1.427458
 -0.060018	  0.203583	  1.383214
 -0.061690	  0.197086	  1.335891
 -0.062303	  0.190022	  1.271457
 -0.062565	  0.184273	  1.221453
 -0.058520	  0.177590	  1.179187
 -0.047982	  0.167867	  1.129342
 -0.032308	  0.157162	  1.088747
 -0.006863	  0.142281	  1.050110
  0.045278	  0.114788	  0.996900
  0.104882	  0.089495	  0.949258
  0.162295	  0.074888	  0.897085
  0.202643	  0.075364	  0.836028
  0.221479	  0.077537	  0.788974
  0.232969	  0.077800	  0.745153
  0.240237	  0.074867	  0.698369
  0.244740	  0.070093	  0.651208
  0.249286	  0.064347	  0.602861
  0.254666	  0.059030	  0.551448
  0.258961	  0.055531	  0.501563
  0.261818	  0.053060	  0.451251
  0.263870	  0.051036	  0.403470
  0.266284	  0.049358	  0.355329
  0.269957	  0.048085	  0.304514
  0.274382	  0.047066	  0.256577
  0.281057	  0.044960	  0.208152
  0.290145	  0.039763	  0.157043
  0.301456	  0.031209	  0.107251
  0.313137	  0.019007	  0.058513
  0.317260	  0.006205	  0.008795
  0.315682	 -0.004575	 -0.040948
  0.312933	 -0.011993	 -0.091385
  0.310629	 -0.017568	 -0.140484
  0.308723	 -0.023013	 -0.189274
  0.307393	 -0.029585	 -0.238746
  0.306839	 -0.037405	 -0.286249
  0.305765	 -0.046222	 -0.334931
  0.303164	 -0.054372	 -0.385122
  0.298584	 -0.060982	 -0.436461
  0.292887	 -0.065660	 -0.487697
  0.288411	 -0.068395	 -0.535840
  0.287928	 -0.070402	 -0.583209
  0.291941	 -0.072624	 -0.632992
  0.297867	 -0.075332	 -0.683980
  0.304869	 -0.078445	 -0.733834
  0.312359	 -0.081045	 -0.784889
  0.318634	 -0.082805	 -0.834467
  0.323950	 -0.084539	 -0.881875
  0.328327	 -0.087311	 -0.930980
  0.331264	 -0.090562	 -0.983104
  0.331605	 -0.093480	 -1.032104
  0.329288	 -0.097627	 -1.082282
  0.324492	 -0.103887	 -1.132859
  0.321869	 -0.110429	 -1.183182
  0.319547	 -0.116346	 -1.232775
  0.316909	 -0.121110	 -1.278753
  0.314627	 -0.125236	 -1.327654
  0.313160	 -0.128982	 -1.377001
  0.312810	 -0.133177	 -1.425586
  0.313928	 -0.138460	 -1.474542
  0.317067	 -0.145628	 -1.525265
  0.321792	 -0.153969	 -1.574974
  0.327950	 -0.162937	 -1.624354
  0.335377	 -0.171567	 -1.671387
  0.343783	 -0.179257	 -1.721401
  0.350111	 -0.183753	 -1.774150
  0.352305	 -0.185465	 -1.825936
  0.351031	 -0.186232	 -1.874991
  0.347435	 -0.186459	 -1.925194
  0.341724	 -0.186532	 -1.976541
  0.334929	 -0.186991	 -2.025613
  0.327825	 -0.188733	 -2.075488
  0.321267	 -0.191476	 -2.125068
  0.316468	 -0.194286	 -2.172964
  0.314271	 -0.197056	 -2.220900
  0.313377	 -0.199063	 -2.270246
  0.312129	 -0.199570	 -2.320719
  0.309774	 -0.199457	 -2.371542
  0.305768	 -0.199260	 -2.420920
  0.298244	 -0.199688	 -2.472959
  0.291670	 -0.201570	 -2.524556
  0.289288	 -0.205913	 -2.574401
  0.290186	 -0.213154	 -2.621622
  0.292974	 -0.221998	 -2.669011
  0.298024	 -0.229111	 -2.720498
  0.309954	 -0.231656	 -2.770869
  0.319807	 -0.241269	 -2.818573
  0.316496	 -0.237740	 -2.867904
  0.317972	 -0.242902	 -2.918911
  0.317456	 -0.254506	 -2.972280
  0.320631	 -0.257051	 -3.002003
