 -0.712589	 -2.093970	  1.097581
 -0.733684	 -2.120303	  1.102734
 -0.717311	 -2.105894	  1.105848
 -0.702596	 -2.088072	  1.104104
 -0.695184	 -2.073400	  1.098992
 -0.687906	 -2.062151	  1.095595
 -0.667006	 -2.039399	  1.091675
 -0.656447	 -2.027566	  1.090709
 -0.643873	 -2.012956	  1.090962
 -0.630181	 -1.996596	  1.092276
 -0.620604	 -1.980785	  1.092065
 -0.609247	 -1.963470	  1.090671
 -0.596568	 -1.945268	  1.090766
 -0.590373	 -1.927693	  1.091686
 -0.583212	 -1.909015	  1.092250
 -0.579911	 -1.886383	  1.095466
 -0.577553	 -1.865915	  1.098633
 -0.574357	 -1.845959	  1.100147
 -0.567041	 -1.823813	  1.100880
 -0.558971	 -1.807191	  1.101304
 -0.551977	 -1.792195	  1.101096
 -0.541608	 -1.767846	  1.101150
 -0.533256	 -1.751328	  1.102630
 -0.528417	 -1.738699	  1.104250
 -0.517217	 -1.714268	  1.105952
 -0.506684	 -1.698136	  1.104230
 -0.498644	 -1.688201	  1.100578
 -0.483142	 -1.668166	  1.090271
 -0.467352	 -1.645263	  1.088445
 -0.458646	 -1.633598	  1.090082
 -0.455836	 -1.619989	  1.093701
 -0.453373	 -1.592803	  1.097544
 -0.447452	 -1.574764	  1.099477
 -0.443259	 -1.559011	  1.101117
 -0.439459	 -1.538430	  1.102782
 -0.431247	 -1.520221	  1.103724
 -0.421323	 -1.495563	  1.107241
 -0.424478	 -1.472951	  1.111709
 -0.431677	 -1.457851	  1.114700
 -0.441329	 -1.444225	  1.119837
 -0.451863	 -1.422621	  1.127441
 -0.457085	 -1.403182	  1.129148
 -0.457630	 -1.384720	  1.127579
 -0.460973	 -1.360652	  1.127377
 -0.469473	 -1.343527	  1.131846
 -0.478999	 -1.329114	  1.139468
 -0.488786	 -1.310736	  1.145614
 -0.493487	 -1.291652	  1.146521
 -0.494589	 -1.272340	  1.145822
 -0.499911	 -1.247859	  1.142089
 -0.509954	 -1.228906	  1.139599
 -0.517397	 -1.216198	  1.141440
 -0.520234	 -1.198280	  1.146688
 -0.521003	 -1.176262	  1.146416
 -0.520896	 -1.156175	  1.143058
 -0.516582	 -1.137679	  1.137018
 -0.511889	 -1.120738	  1.132286
 -0.499377	 -1.103497	  1.129196
 -0.484765	 -1.087674	  1.126690
 -0.474897	 -1.071315	  1.115050
 -0.469185	 -1.058682	  1.103998
 -0.457184	 -1.045223	  1.095211
 -0.444638	 -1.032518	  1.086309
 -0.433497	 -1.020461	  1.074852
 -0.418171	 -1.009500	  1.065890
 -0.401076	 -1.002559	  1.062636
 -0.380810	 -0.996795	  1.061506
 -0.358308	 -0.984971	  1.055767
 -0.347996	 -0.977353	  1.049757
 -0.336939	 -0.969521	  1.038621
 -0.317032	 -0.966421	  1.026444
 -0.291332	 -0.961608	  1.018099
 -0.281533	 -0.959038	  1.014773
 -0.260939	 -0.956131	  1.006262
 -0.241995	 -0.951750	  0.998073
 -0.226075	 -0.942952	  0.989570
 -0.209203	 -0.934365	  0.979857
 -0.192672	 -0.933049	  0.971076
 -0.177542	 -0.931388	  0.962233
 -0.152353	 -0.922867	  0.952245
 -0.138180	 -0.921503	  0.947545
 -0.122536	 -0.922912	  0.939820
 -0.103469	 -0.921625	  0.928407
 -0.081974	 -0.911702	  0.918078
 -0.069539	 -0.904708	  0.911359
 -0.055376	 -0.896391	  0.903647
 -0.039516	 -0.885705	  0.896334
 -0.019129	 -0.874006	  0.886932
 -0.005043	 -0.862481	  0.878292
  0.009160	 -0.852826	  0.870858
  0.025465	 -0.844530	  0.862395
  0.039970	 -0.833945	  0.854689
  0.057053	 -0.823534	  0.846889
  0.074663	 -0.810098	  0.836830
  0.082057	 -0.792522	  0.829008
  0.091000	 -0.777637	  0.821638
  0.098109	 -0.757123	  0.810440
  0.103060	 -0.742311	  0.803250
  0.109085	 -0.724686	  0.796930
  0.111895	 -0.703959	  0.789316
  0.111412	 -0.684175	  0.782846
  0.116972	 -0.664056	  0.777865
  0.128625	 -0.646030	  0.776038
  0.144497	 -0.631386	  0.774408
  0.158452	 -0.618759	  0.769070
  0.170159	 -0.600639	  0.762233
  0.179654	 -0.580523	  0.756089
  0.185851	 -0.568815	  0.750504
  0.193393	 -0.552783	  0.740327
  0.202720	 -0.534298	  0.730838
  0.207583	 -0.517105	  0.724076
  0.212567	 -0.498502	  0.719562
  0.218173	 -0.477827	  0.715234
  0.225566	 -0.461313	  0.712605
  0.238548	 -0.444005	  0.709956
  0.253426	 -0.428544	  0.702902
  0.263104	 -0.417580	  0.698703
  0.278416	 -0.403617	  0.688755
  0.289720	 -0.386960	  0.681553
  0.298914	 -0.371854	  0.677850
  0.310472	 -0.353253	  0.674867
  0.321008	 -0.336714	  0.674002
  0.332503	 -0.323425	  0.672592
  0.351921	 -0.306305	  0.666203
  0.362541	 -0.299325	  0.663196
  0.381853	 -0.286804	  0.655377
  0.399375	 -0.270964	  0.652545
  0.411444	 -0.256530	  0.653579
  0.421623	 -0.241965	  0.653995
  0.428949	 -0.221993	  0.652943
  0.436850	 -0.202059	  0.650730
  0.444920	 -0.184104	  0.647637
  0.456177	 -0.165941	  0.644135
  0.472301	 -0.154485	  0.643484
  0.493689	 -0.143866	  0.647208
  0.515090	 -0.133488	  0.655619
  0.528000	 -0.118160	  0.656944
  0.534013	 -0.104558	  0.655406
  0.547150	 -0.081105	  0.653263
  0.556488	 -0.061821	  0.651917
  0.562972	 -0.051180	  0.649334
  0.573067	 -0.028836	  0.642583
  0.584010	 -0.012452	  0.641258
  0.595016	  0.001163	  0.645161
  0.610287	  0.020094	  0.646846
  0.622674	  0.036460	  0.640144
  0.631517	  0.049048	  0.631900
  0.642657	  0.063633	  0.626343
  0.653770	  0.079376	  0.617454
  0.664548	  0.093961	  0.603446
  0.677425	  0.101921	  0.595198
  0.693507	  0.109110	  0.586609
  0.707479	  0.136530	  0.575490
  0.715276	  0.158047	  0.582045
  0.719980	  0.179071	  0.591639
  0.726721	  0.196844	  0.593651
  0.737152	  0.218509	  0.591275
  0.738724	  0.226044	  0.595482
  0.751910	  0.244720	  0.594269
  0.765502	  0.269767	  0.593784
  0.773680	  0.286767	  0.592121
  0.781307	  0.300803	  0.591269
  0.790428	  0.321553	  0.594086
  0.793988	  0.342098	  0.600139
  0.792377	  0.359774	  0.605701
  0.788788	  0.384403	  0.609042
  0.790519	  0.402928	  0.608807
  0.796634	  0.420649	  0.609911
  0.801605	  0.441160	  0.614149
  0.801083	  0.459331	  0.619679
  0.797685	  0.478442	  0.627084
  0.796676	  0.499250	  0.633035
  0.799939	  0.515793	  0.637922
  0.802569	  0.535023	  0.644965
  0.800273	  0.561444	  0.651896
  0.798199	  0.572303	  0.654642
  0.795278	  0.589390	  0.665766
  0.793228	  0.605189	  0.679919
  0.790029	  0.622534	  0.691509
  0.784375	  0.637549	  0.703524
  0.778589	  0.652491	  0.715578
  0.772554	  0.667557	  0.727304
  0.766073	  0.682883	  0.738390
  0.759365	  0.698319	  0.749350
  0.751715	  0.713876	  0.759016
  0.746572	  0.728093	  0.771250
  0.741408	  0.744036	  0.786351
  0.733527	  0.760095	  0.796353
  0.722993	  0.776591	  0.802333
  0.712979	  0.792102	  0.806608
  0.705114	  0.806252	  0.818429
  0.696705	  0.822860	  0.828418
  0.688644	  0.843514	  0.832240
  0.681410	  0.861288	  0.836365
  0.676311	  0.877098	  0.843250
  0.673070	  0.898791	  0.849543
  0.665875	  0.918354	  0.852205
  0.656323	  0.931902	  0.853654
  0.647783	  0.952369	  0.856317
  0.649908	  0.972341	  0.859333
  0.659954	  0.986268	  0.864002
  0.667761	  0.993261	  0.867756
  0.675575	  0.999402	  0.871181
  0.691120	  1.011602	  0.877435
  0.705305	  1.019903	  0.881935
  0.727485	  1.024873	  0.890422
  0.746938	  1.029499	  0.897252
  0.767167	  1.033291	  0.901728
  0.791317	  1.029357	  0.901522
  0.807607	  1.017486	  0.896683
  0.827862	  0.997575	  0.899649
  0.843206	  0.982724	  0.909618
  0.862320	  0.970580	  0.916661
  0.878866	  0.969336	  0.915435
  0.901040	  0.974730	  0.911903
  0.924194	  0.979253	  0.908035
  0.943972	  0.983824	  0.902602
  0.963599	  0.985389	  0.898613
  0.983413	  0.986136	  0.895693
  1.003291	  0.986691	  0.893179
  1.023070	  0.988372	  0.890825
  1.042937	  0.989465	  0.888299
  1.062663	  0.991477	  0.885772
  1.081865	  0.996958	  0.882271
  1.100333	  1.003858	  0.878510
  1.118647	  1.010935	  0.874774
  1.136999	  1.017955	  0.871015
  1.155284	  1.025175	  0.867276
  1.173556	  1.032358	  0.863540
  1.191860	  1.039524	  0.859795
  1.210121	  1.046844	  0.856046
  1.227972	  1.054976	  0.851840
  1.243544	  1.066062	  0.845583
  1.258824	  1.077340	  0.839264
  1.274106	  1.088578	  0.832946
  1.289387	  1.099845	  0.826640
  1.304390	  1.111480	  0.820392
  1.319625	  1.122812	  0.814086
  1.334792	  1.134240	  0.807746
  1.349495	  1.146106	  0.801034
  1.361764	  1.159375	  0.792253
  1.373742	  1.172704	  0.783387
  1.385879	  1.185800	  0.774461
  1.398440	  1.198201	  0.765753
  1.413063	  1.209533	  0.758938
  1.430100	  1.222178	  0.753721
  1.445024	  1.237998	  0.747663
  1.457578	  1.255290	  0.739723
  1.465824	  1.273024	  0.727470
  1.469425	  1.287007	  0.712763
  1.471231	  1.299583	  0.691507
  1.471688	  1.307734	  0.669838
  1.470347	  1.308972	  0.648403
  1.471043	  1.308126	  0.628994
  1.474672	  1.310251	  0.608755
  1.479961	  1.308847	  0.589926
  1.486070	  1.306475	  0.571022
  1.492247	  1.304236	  0.552325
  1.503008	  1.301874	  0.536177
  1.517524	  1.299709	  0.523024
  1.532687	  1.297101	  0.510160
  1.547592	  1.294909	  0.497029
  1.562811	  1.293290	  0.484123
  1.578258	  1.292711	  0.471411
  1.593763	  1.292086	  0.458816
  1.607888	  1.294469	  0.445474
  1.608151	  1.311341	  0.435928
  1.605010	  1.328992	  0.428935
  1.600610	  1.349776	  0.420879
  1.592015	  1.369239	  0.418716
  1.582724	  1.386169	  0.417425
  1.575127	  1.403358	  0.413306
  1.569553	  1.420618	  0.405968
  1.565656	  1.437760	  0.397190
  1.563562	  1.456288	  0.387704
  1.561105	  1.472725	  0.378986
  1.558449	  1.488013	  0.370900
  1.557820	  1.505885	  0.362140
  1.559949	  1.522021	  0.354225
  1.561916	  1.536710	  0.347816
  1.566485	  1.552755	  0.340498
  1.571005	  1.567300	  0.333897
  1.576598	  1.583233	  0.326505
  1.585003	  1.598932	  0.319709
  1.594610	  1.614685	  0.314047
  1.605083	  1.631371	  0.309774
  1.616033	  1.647943	  0.304752
  1.626609	  1.664279	  0.300782
  1.638453	  1.681183	  0.297198
  1.649224	  1.697679	  0.292860
  1.658476	  1.715000	  0.288174
  1.669449	  1.732646	  0.285177
  1.679193	  1.749133	  0.280941
  1.687651	  1.765784	  0.275778
  1.696602	  1.783647	  0.270071
  1.704086	  1.802115	  0.264460
  1.701596	  1.825392	  0.263463
  1.710401	  1.842695	  0.258659
