 -0.943574	  0.957265	  2.117820
 -0.937483	  0.977770	  2.139035
 -0.941510	  0.964151	  2.124953
 -0.944207	  0.950007	  2.111074
 -0.946495	  0.935717	  2.097270
 -0.948775	  0.921355	  2.083541
 -0.951089	  0.905952	  2.070998
 -0.953433	  0.890504	  2.058523
 -0.956633	  0.874771	  2.046627
 -0.960418	  0.858913	  2.035038
 -0.964731	  0.843438	  2.023361
 -0.971454	  0.830499	  2.012074
 -0.981645	  0.819077	  1.998613
 -0.987568	  0.804424	  1.979775
 -0.987324	  0.788384	  1.964310
 -0.989837	  0.772718	  1.956087
 -0.997165	  0.756039	  1.949049
 -1.005699	  0.739172	  1.938428
 -1.012413	  0.726224	  1.924941
 -1.019646	  0.717815	  1.909349
 -1.026702	  0.709087	  1.891363
 -1.032229	  0.695368	  1.874672
 -1.038596	  0.680866	  1.865489
 -1.048575	  0.665409	  1.856633
 -1.056857	  0.648380	  1.842866
 -1.061771	  0.637857	  1.826491
 -1.066998	  0.631928	  1.808831
 -1.072936	  0.624238	  1.790493
 -1.078535	  0.614114	  1.773937
 -1.082594	  0.606964	  1.756893
 -1.083789	  0.602802	  1.735180
 -1.083348	  0.595278	  1.714842
 -1.084578	  0.581076	  1.698916
 -1.091036	  0.568664	  1.689471
 -1.097204	  0.556422	  1.671951
 -1.099303	  0.546386	  1.653826
 -1.100231	  0.536714	  1.636318
 -1.101113	  0.526860	  1.619188
 -1.104143	  0.516389	  1.602112
 -1.107313	  0.505676	  1.585279
 -1.108927	  0.492889	  1.569928
 -1.109619	  0.478828	  1.556120
 -1.107419	  0.465517	  1.540386
 -1.102043	  0.454477	  1.523586
 -1.094720	  0.449021	  1.504351
 -1.090368	  0.442024	  1.476635
 -1.090889	  0.433310	  1.460592
 -1.094260	  0.424102	  1.449872
 -1.102606	  0.405450	  1.439375
 -1.113209	  0.385260	  1.426766
 -1.116683	  0.371191	  1.411687
 -1.117089	  0.363346	  1.397044
 -1.111759	  0.356402	  1.374078
 -1.107890	  0.344763	  1.354388
 -1.108197	  0.330170	  1.339243
 -1.111717	  0.315432	  1.329250
 -1.118342	  0.298757	  1.317981
 -1.125332	  0.284976	  1.304235
 -1.132023	  0.271641	  1.290651
 -1.137590	  0.256826	  1.278722
 -1.141857	  0.240416	  1.267385
 -1.145144	  0.224801	  1.255646
 -1.147175	  0.209673	  1.240470
 -1.151370	  0.197849	  1.222939
 -1.158017	  0.186714	  1.205498
 -1.166486	  0.176624	  1.192707
 -1.177571	  0.163628	  1.180542
 -1.190367	  0.151545	  1.168779
 -1.202009	  0.141410	  1.159447
 -1.212741	  0.128128	  1.146068
 -1.221239	  0.116118	  1.131785
 -1.228999	  0.105050	  1.116969
 -1.236629	  0.094676	  1.101751
 -1.244282	  0.084230	  1.086409
 -1.251741	  0.073774	  1.071047
 -1.259160	  0.063599	  1.055488
 -1.266932	  0.053824	  1.039827
 -1.274819	  0.044190	  1.024139
 -1.282321	  0.034712	  1.008236
 -1.289538	  0.024915	  0.992401
 -1.297000	  0.014709	  0.976858
 -1.304084	  0.003921	  0.961575
 -1.311167	 -0.006893	  0.946314
 -1.317934	 -0.017872	  0.931029
 -1.324288	 -0.029058	  0.915715
 -1.330621	 -0.040241	  0.900391
 -1.335144	 -0.050876	  0.884071
 -1.338694	 -0.061168	  0.867294
 -1.342267	 -0.071436	  0.850511
 -1.343618	 -0.080608	  0.832814
 -1.343889	 -0.089073	  0.814646
 -1.344479	 -0.097007	  0.796602
 -1.347634	 -0.103161	  0.778177
 -1.350139	 -0.109108	  0.757909
 -1.351083	 -0.116343	  0.738745
 -1.352299	 -0.127716	  0.721741
 -1.356399	 -0.141052	  0.707921
 -1.364221	 -0.154119	  0.694258
 -1.372527	 -0.166218	  0.680670
 -1.382064	 -0.176482	  0.666299
 -1.393078	 -0.185468	  0.651652
 -1.403278	 -0.194122	  0.635994
 -1.410926	 -0.203835	  0.617940
 -1.415373	 -0.212183	  0.599632
 -1.416885	 -0.220948	  0.579648
 -1.415372	 -0.233241	  0.561320
 -1.414476	 -0.246435	  0.547374
 -1.416931	 -0.258867	  0.531337
 -1.419626	 -0.270956	  0.517700
 -1.422592	 -0.279591	  0.501551
 -1.422971	 -0.290435	  0.486053
 -1.423313	 -0.312619	  0.474694
 -1.426238	 -0.341015	  0.462469
 -1.419305	 -0.357937	  0.454865
 -1.414061	 -0.372174	  0.445456
 -1.411764	 -0.386304	  0.427818
 -1.404762	 -0.395161	  0.408820
 -1.403445	 -0.396936	  0.390361
 -1.400890	 -0.409592	  0.370978
 -1.393660	 -0.427850	  0.359648
 -1.391766	 -0.449858	  0.350067
 -1.393138	 -0.460517	  0.341666
 -1.396781	 -0.476510	  0.322977
 -1.390514	 -0.494598	  0.310860
 -1.379081	 -0.511330	  0.304628
 -1.367587	 -0.525625	  0.300568
 -1.356650	 -0.543038	  0.293696
 -1.346968	 -0.559376	  0.287219
 -1.337359	 -0.575666	  0.280746
 -1.329394	 -0.591807	  0.275119
 -1.324182	 -0.611049	  0.272608
 -1.315902	 -0.630479	  0.273667
 -1.300556	 -0.647881	  0.275396
 -1.287421	 -0.661875	  0.269854
 -1.279164	 -0.676469	  0.264850
 -1.270509	 -0.696658	  0.264417
 -1.260660	 -0.714331	  0.262571
 -1.252669	 -0.730375	  0.256221
 -1.245034	 -0.749572	  0.249837
 -1.239699	 -0.768106	  0.248056
 -1.238452	 -0.786473	  0.245650
 -1.238731	 -0.804350	  0.238601
 -1.235012	 -0.824077	  0.228914
 -1.226293	 -0.846592	  0.224886
 -1.222096	 -0.865556	  0.226999
 -1.224848	 -0.888253	  0.226251
 -1.233214	 -0.904978	  0.222118
 -1.242744	 -0.923857	  0.215800
 -1.254227	 -0.939095	  0.210290
 -1.264261	 -0.956577	  0.204214
 -1.272477	 -0.974049	  0.198286
 -1.282859	 -0.990050	  0.192224
 -1.295168	 -1.004500	  0.185918
 -1.308183	 -1.018286	  0.179540
 -1.321378	 -1.031758	  0.172878
 -1.334939	 -1.044565	  0.165665
 -1.348502	 -1.057429	  0.158558
 -1.362084	 -1.070364	  0.151561
 -1.376037	 -1.082119	  0.143252
 -1.390139	 -1.093069	  0.134086
 -1.404182	 -1.103846	  0.124738
 -1.418055	 -1.114193	  0.114749
 -1.431731	 -1.123106	  0.103415
 -1.445389	 -1.133607	  0.093612
 -1.457734	 -1.148376	  0.084188
 -1.468217	 -1.161473	  0.068314
 -1.479565	 -1.169208	  0.049431
 -1.491850	 -1.168580	  0.034646
 -1.505941	 -1.170464	  0.023523
 -1.521663	 -1.173437	  0.014093
 -1.543343	 -1.164025	 -0.001916
 -1.561587	 -1.158279	 -0.023545
 -1.570845	 -1.157921	 -0.036045
 -1.578558	 -1.159046	 -0.048595
 -1.590534	 -1.159546	 -0.069116
 -1.599852	 -1.162065	 -0.088204
 -1.606754	 -1.167396	 -0.108811
 -1.614093	 -1.166713	 -0.125017
 -1.623505	 -1.159281	 -0.142166
 -1.628509	 -1.154375	 -0.161435
 -1.629908	 -1.151390	 -0.181545
 -1.635654	 -1.146441	 -0.200964
 -1.641716	 -1.141651	 -0.219439
 -1.647993	 -1.136977	 -0.237852
 -1.653010	 -1.132637	 -0.256719
 -1.657754	 -1.128356	 -0.275671
 -1.662500	 -1.124078	 -0.294623
 -1.667243	 -1.119808	 -0.313578
 -1.671476	 -1.116764	 -0.332884
 -1.674855	 -1.115719	 -0.352567
 -1.678224	 -1.114694	 -0.372255
 -1.681597	 -1.113688	 -0.391941
 -1.685026	 -1.114300	 -0.411624
 -1.688471	 -1.120822	 -0.430201
 -1.691921	 -1.127420	 -0.448763
 -1.695383	 -1.134050	 -0.467309
 -1.699840	 -1.143164	 -0.484541
 -1.704773	 -1.153494	 -0.500940
 -1.709737	 -1.163854	 -0.517311
 -1.715440	 -1.175039	 -0.532876
 -1.721298	 -1.186382	 -0.548272
 -1.727171	 -1.197650	 -0.563717
 -1.733071	 -1.208786	 -0.579248
 -1.738965	 -1.219922	 -0.594780
 -1.744619	 -1.231245	 -0.610266
 -1.750230	 -1.242599	 -0.625744
 -1.755552	 -1.254161	 -0.641171
 -1.759638	 -1.266554	 -0.656327
 -1.763702	 -1.278954	 -0.671480
 -1.766986	 -1.291398	 -0.686636
 -1.770239	 -1.305916	 -0.699213
 -1.772329	 -1.324771	 -0.710161
 -1.771242	 -1.342585	 -0.724079
 -1.770695	 -1.351786	 -0.743011
 -1.772786	 -1.357054	 -0.761616
 -1.776207	 -1.364154	 -0.780884
 -1.777591	 -1.375295	 -0.798196
 -1.778758	 -1.386880	 -0.814481
 -1.779869	 -1.398464	 -0.830748
 -1.780501	 -1.409959	 -0.847102
 -1.780663	 -1.421361	 -0.863533
 -1.780918	 -1.432802	 -0.879916
 -1.785701	 -1.445825	 -0.894301
 -1.790736	 -1.458931	 -0.908550
 -1.795761	 -1.472123	 -0.922936
 -1.798877	 -1.485421	 -0.939081
 -1.801207	 -1.497806	 -0.954611
