 -2.231990	  0.393284	 -0.926200
 -2.247461	  0.403871	 -0.945347
 -2.238430	  0.397592	 -0.927413
 -2.226089	  0.390915	 -0.913625
 -2.212918	  0.381950	 -0.902803
 -2.198279	  0.372809	 -0.889711
 -2.181450	  0.368645	 -0.874347
 -2.172971	  0.365928	 -0.862239
 -2.159477	  0.358715	 -0.846966
 -2.142742	  0.353433	 -0.833220
 -2.129533	  0.349928	 -0.820927
 -2.118776	  0.343315	 -0.807981
 -2.104992	  0.335688	 -0.793480
 -2.089923	  0.329104	 -0.781396
 -2.075252	  0.322333	 -0.769611
 -2.061466	  0.314208	 -0.757637
 -2.047765	  0.305968	 -0.745651
 -2.035262	  0.295873	 -0.733790
 -2.022955	  0.285534	 -0.721835
 -2.010680	  0.275011	 -0.710059
 -1.998118	  0.264536	 -0.698597
 -1.985393	  0.255721	 -0.686836
 -1.970606	  0.248679	 -0.674140
 -1.956862	  0.242829	 -0.661740
 -1.945163	  0.229667	 -0.646133
 -1.937847	  0.214626	 -0.633766
 -1.926717	  0.201462	 -0.625916
 -1.911827	  0.192218	 -0.616902
 -1.896952	  0.181831	 -0.606054
 -1.884308	  0.173802	 -0.593076
 -1.870963	  0.170454	 -0.578203
 -1.856480	  0.167733	 -0.563763
 -1.840863	  0.160821	 -0.551448
 -1.828324	  0.153134	 -0.543456
 -1.809304	  0.145249	 -0.529472
 -1.798882	  0.143666	 -0.516731
 -1.787000	  0.146707	 -0.495190
 -1.775768	  0.151910	 -0.472151
 -1.771941	  0.149979	 -0.461304
 -1.763971	  0.141848	 -0.447167
 -1.750310	  0.124755	 -0.433076
 -1.732454	  0.115299	 -0.420564
 -1.715361	  0.112708	 -0.405923
 -1.702135	  0.119039	 -0.394086
 -1.686314	  0.128982	 -0.380620
 -1.672006	  0.133135	 -0.368584
 -1.657020	  0.138761	 -0.358389
 -1.639968	  0.147634	 -0.347036
 -1.624295	  0.148882	 -0.335841
 -1.607514	  0.144623	 -0.329214
 -1.585499	  0.138271	 -0.321627
 -1.567153	  0.138716	 -0.305756
 -1.555836	  0.143585	 -0.293281
 -1.543037	  0.148453	 -0.284356
 -1.525695	  0.151958	 -0.273655
 -1.507614	  0.156163	 -0.262387
 -1.490362	  0.156673	 -0.252781
 -1.473972	  0.154380	 -0.243480
 -1.457762	  0.151367	 -0.235976
 -1.441552	  0.145313	 -0.225878
 -1.428235	  0.137358	 -0.213526
 -1.414339	  0.132500	 -0.199962
 -1.402603	  0.129696	 -0.181149
 -1.394139	  0.120694	 -0.169778
 -1.387108	  0.105302	 -0.155201
 -1.381040	  0.093229	 -0.142090
 -1.371141	  0.087109	 -0.129029
 -1.365549	  0.071792	 -0.119833
 -1.364803	  0.052469	 -0.104837
 -1.362059	  0.040344	 -0.087666
 -1.354085	  0.030651	 -0.076105
 -1.346055	  0.017132	 -0.064348
 -1.343250	 -0.000431	 -0.052663
 -1.343174	 -0.017992	 -0.042640
 -1.342408	 -0.035193	 -0.032462
 -1.340466	 -0.051997	 -0.021796
 -1.338502	 -0.068801	 -0.011130
 -1.336801	 -0.085395	 -0.000279
 -1.335480	 -0.101586	  0.010491
 -1.333724	 -0.119252	  0.019211
 -1.327009	 -0.138806	  0.030858
 -1.321377	 -0.152428	  0.043575
 -1.318521	 -0.163896	  0.059539
 -1.315690	 -0.175864	  0.075772
 -1.301398	 -0.188230	  0.090642
 -1.286103	 -0.199491	  0.099424
 -1.277700	 -0.214471	  0.107897
 -1.271134	 -0.229620	  0.118479
 -1.261024	 -0.242507	  0.130630
 -1.250354	 -0.254338	  0.142842
 -1.237637	 -0.265217	  0.153419
 -1.225839	 -0.278232	  0.161809
 -1.211694	 -0.290742	  0.166301
 -1.190053	 -0.299991	  0.174861
 -1.177196	 -0.308764	  0.190290
 -1.168108	 -0.312969	  0.208604
 -1.156480	 -0.316239	  0.223531
 -1.138082	 -0.326816	  0.233707
 -1.121789	 -0.335947	  0.241473
 -1.108222	 -0.341662	  0.248101
 -1.092492	 -0.352944	  0.259899
 -1.080061	 -0.362357	  0.269941
 -1.066003	 -0.367019	  0.284389
 -1.052085	 -0.375775	  0.301188
 -1.039920	 -0.393654	  0.306869
 -1.029899	 -0.413452	  0.309198
 -1.018298	 -0.431831	  0.313855
 -1.007779	 -0.441650	  0.325986
 -0.996607	 -0.452585	  0.340907
 -0.987142	 -0.460090	  0.356955
 -0.978016	 -0.470582	  0.372015
 -0.969014	 -0.482522	  0.385516
 -0.960353	 -0.493966	  0.399448
 -0.951803	 -0.505206	  0.413610
 -0.943241	 -0.516434	  0.427772
 -0.933446	 -0.526423	  0.442062
 -0.923414	 -0.536160	  0.456364
 -0.913322	 -0.545829	  0.470628
 -0.895796	 -0.547431	  0.480048
 -0.877528	 -0.547449	  0.488187
 -0.859256	 -0.547455	  0.496318
 -0.840985	 -0.547422	  0.504425
 -0.822238	 -0.542348	  0.509162
 -0.803613	 -0.536575	  0.513473
 -0.785135	 -0.530652	  0.518287
 -0.766740	 -0.524764	  0.523707
 -0.748651	 -0.519076	  0.528994
 -0.731578	 -0.513678	  0.536595
 -0.714828	 -0.508288	  0.544702
 -0.693472	 -0.502902	  0.549051
 -0.668965	 -0.500494	  0.546864
 -0.652603	 -0.500066	  0.548789
 -0.635885	 -0.494867	  0.557358
 -0.617084	 -0.487443	  0.563683
 -0.592780	 -0.484307	  0.564130
 -0.576621	 -0.486694	  0.568701
 -0.559845	 -0.484788	  0.578398
 -0.540292	 -0.484421	  0.586495
 -0.516998	 -0.487236	  0.588095
 -0.497031	 -0.486415	  0.589585
 -0.482021	 -0.483025	  0.597540
 -0.463924	 -0.480749	  0.607830
 -0.445889	 -0.482036	  0.618491
 -0.428604	 -0.483715	  0.628434
 -0.413271	 -0.488063	  0.640512
 -0.398255	 -0.492767	  0.652852
 -0.385776	 -0.500385	  0.666495
 -0.373643	 -0.508313	  0.680275
 -0.362869	 -0.516607	  0.694942
 -0.354774	 -0.525421	  0.710965
 -0.346739	 -0.534239	  0.727006
 -0.340234	 -0.543603	  0.742796
 -0.343163	 -0.554530	  0.759153
 -0.346120	 -0.564625	  0.775920
 -0.353815	 -0.572936	  0.790286
 -0.363062	 -0.582382	  0.804995
 -0.372607	 -0.593819	  0.818239
 -0.378056	 -0.606152	  0.831863
 -0.381698	 -0.617948	  0.848495
 -0.387330	 -0.635317	  0.866256
 -0.396031	 -0.647312	  0.876048
 -0.404997	 -0.660607	  0.885406
 -0.412807	 -0.675512	  0.900498
 -0.417194	 -0.691545	  0.909195
 -0.419419	 -0.706423	  0.920511
 -0.423615	 -0.723273	  0.935363
 -0.430515	 -0.737908	  0.947110
 -0.435906	 -0.752020	  0.956054
 -0.435657	 -0.767386	  0.968573
 -0.432242	 -0.790909	  0.981978
 -0.430393	 -0.806469	  0.992628
 -0.420590	 -0.817855	  1.003870
 -0.401400	 -0.833959	  1.015153
 -0.394231	 -0.847169	  1.024583
 -0.395828	 -0.862667	  1.040031
 -0.400092	 -0.878163	  1.055341
 -0.395560	 -0.893763	  1.067938
 -0.374433	 -0.902098	  1.083851
 -0.357836	 -0.904489	  1.094831
 -0.343096	 -0.913080	  1.109465
 -0.334892	 -0.923251	  1.123906
 -0.331391	 -0.936911	  1.135639
 -0.325332	 -0.960021	  1.147059
 -0.319713	 -0.970547	  1.159292
 -0.310725	 -0.979010	  1.176014
 -0.297718	 -0.991969	  1.190857
 -0.284149	 -1.005640	  1.197388
 -0.270162	 -1.017494	  1.201639
 -0.255831	 -1.032368	  1.214337
 -0.245908	 -1.038399	  1.226954
 -0.230277	 -1.048365	  1.236645
 -0.214392	 -1.060625	  1.247007
 -0.204151	 -1.067022	  1.260534
 -0.190840	 -1.077338	  1.271220
 -0.176571	 -1.090404	  1.283168
 -0.165469	 -1.098268	  1.296003
 -0.152550	 -1.107282	  1.307583
 -0.138926	 -1.120264	  1.318220
 -0.127313	 -1.127584	  1.332099
 -0.114704	 -1.135741	  1.343888
 -0.100497	 -1.151155	  1.354901
 -0.089626	 -1.159946	  1.368403
 -0.077629	 -1.163368	  1.383110
 -0.063423	 -1.167338	  1.397391
 -0.049800	 -1.173955	  1.411778
 -0.037096	 -1.181163	  1.425519
 -0.025132	 -1.187829	  1.440095
 -0.013484	 -1.194274	  1.455014
 -0.002332	 -1.199299	  1.470090
  0.006004	 -1.201610	  1.487367
  0.014163	 -1.208585	  1.509129
  0.020157	 -1.217455	  1.526662
  0.030724	 -1.224674	  1.538786
  0.040339	 -1.228376	  1.554993
  0.050250	 -1.236996	  1.574214
  0.060966	 -1.246605	  1.587280
  0.074482	 -1.254995	  1.599433
  0.087690	 -1.261867	  1.612306
  0.099149	 -1.269817	  1.627893
  0.111160	 -1.277814	  1.641753
  0.123192	 -1.285808	  1.655586
  0.134588	 -1.294084	  1.669786
  0.145769	 -1.302451	  1.684103
  0.156933	 -1.310812	  1.698435
  0.166903	 -1.318103	  1.714166
  0.175930	 -1.324583	  1.730794
  0.184960	 -1.331051	  1.747425
  0.194844	 -1.337183	  1.763693
  0.205691	 -1.343374	  1.779305
  0.218566	 -1.352609	  1.791496
  0.232220	 -1.361799	  1.802858
  0.246223	 -1.370949	  1.813820
  0.260324	 -1.380010	  1.824725
  0.274684	 -1.388737	  1.835545
  0.289457	 -1.395698	  1.846376
  0.305864	 -1.400037	  1.857613
  0.322590	 -1.406595	  1.869252
  0.336120	 -1.413033	  1.881450
  0.349491	 -1.422271	  1.894947
  0.362963	 -1.433835	  1.904895
  0.375799	 -1.444987	  1.914130
  0.388777	 -1.454907	  1.925261
  0.403090	 -1.463895	  1.937537
  0.417192	 -1.475009	  1.944281
  0.430709	 -1.483411	  1.956393
