 -1.863984	  1.503071	  0.512077
 -1.874489	  1.516476	  0.519971
 -1.884994	  1.529881	  0.527865
 -1.887558	  1.509066	  0.518221
 -1.876916	  1.491551	  0.503250
 -1.863932	  1.480236	  0.492514
 -1.851704	  1.469138	  0.487674
 -1.841573	  1.450533	  0.487527
 -1.832376	  1.430372	  0.475884
 -1.819580	  1.419406	  0.460440
 -1.804930	  1.409326	  0.450073
 -1.789717	  1.398172	  0.448924
 -1.776033	  1.382147	  0.450378
 -1.764735	  1.363257	  0.448434
 -1.754903	  1.345452	  0.441631
 -1.742174	  1.331345	  0.426297
 -1.727843	  1.326172	  0.408280
 -1.713569	  1.322866	  0.395795
 -1.697107	  1.318655	  0.387907
 -1.676323	  1.316682	  0.380398
 -1.654075	  1.311684	  0.369723
 -1.638672	  1.297870	  0.360859
 -1.629101	  1.281133	  0.351676
 -1.618734	  1.266672	  0.340040
 -1.607406	  1.253074	  0.329135
 -1.598104	  1.243829	  0.322853
 -1.578170	  1.227314	  0.315875
 -1.559397	  1.217400	  0.307437
 -1.540774	  1.209035	  0.296107
 -1.531885	  1.204744	  0.290198
 -1.513976	  1.200326	  0.282013
 -1.497605	  1.189982	  0.271848
 -1.485814	  1.178883	  0.258041
 -1.473501	  1.169229	  0.244655
 -1.462488	  1.161589	  0.234111
 -1.438682	  1.149913	  0.223917
 -1.422713	  1.139729	  0.218319
 -1.408889	  1.129188	  0.213409
 -1.397754	  1.118352	  0.211976
 -1.383518	  1.101029	  0.205603
 -1.370522	  1.090071	  0.201382
 -1.356738	  1.073254	  0.199858
 -1.338529	  1.053010	  0.196186
 -1.328085	  1.045648	  0.193679
 -1.311978	  1.029287	  0.192868
 -1.299942	  1.011783	  0.189858
 -1.293955	  1.001945	  0.185912
 -1.276908	  0.979841	  0.177601
 -1.266816	  0.961537	  0.171535
 -1.261312	  0.950733	  0.166841
 -1.253948	  0.927156	  0.157116
 -1.250198	  0.915583	  0.151169
 -1.245598	  0.890567	  0.145958
 -1.239133	  0.865878	  0.145752
 -1.223908	  0.849615	  0.137446
 -1.211431	  0.845849	  0.126873
 -1.193770	  0.838275	  0.116997
 -1.176773	  0.829688	  0.107496
 -1.154986	  0.818883	  0.100094
 -1.140001	  0.799767	  0.095946
 -1.132967	  0.786357	  0.093466
 -1.125567	  0.768255	  0.089995
 -1.115181	  0.750237	  0.085319
 -1.105653	  0.736066	  0.082081
 -1.086153	  0.717362	  0.075146
 -1.067597	  0.710511	  0.068849
 -1.049753	  0.704497	  0.062717
 -1.033790	  0.696210	  0.058157
 -1.018073	  0.684967	  0.052526
 -0.999572	  0.673219	  0.042684
 -0.983680	  0.664164	  0.034224
 -0.971067	  0.658516	  0.031253
 -0.956971	  0.653775	  0.028515
 -0.930545	  0.643985	  0.026233
 -0.911250	  0.632708	  0.022787
 -0.899775	  0.622596	  0.018346
 -0.885591	  0.603877	  0.016992
 -0.870437	  0.580327	  0.015076
 -0.855470	  0.568795	  0.012718
 -0.846045	  0.561986	  0.011798
 -0.825322	  0.550766	  0.012137
 -0.814943	  0.538795	  0.015835
 -0.803907	  0.518215	  0.016441
 -0.787995	  0.505845	  0.010044
 -0.765683	  0.497226	 -0.010378
 -0.750084	  0.482968	 -0.030199
 -0.741463	  0.469811	 -0.038996
 -0.735220	  0.460936	 -0.042948
 -0.720429	  0.443858	 -0.053962
 -0.709587	  0.426330	 -0.064766
 -0.705226	  0.416146	 -0.070165
 -0.694537	  0.394812	 -0.080315
 -0.684919	  0.377509	 -0.090327
 -0.679947	  0.367896	 -0.095438
 -0.668757	  0.346525	 -0.107800
 -0.656161	  0.330466	 -0.119513
 -0.650714	  0.322996	 -0.124270
 -0.638550	  0.304320	 -0.136144
 -0.624606	  0.287200	 -0.149070
 -0.618311	  0.279900	 -0.154026
 -0.605066	  0.265179	 -0.163540
 -0.586998	  0.247630	 -0.177681
 -0.580381	  0.243595	 -0.181463
 -0.563243	  0.230722	 -0.191023
 -0.549044	  0.211952	 -0.203909
 -0.544589	  0.205510	 -0.209709
 -0.534214	  0.192058	 -0.222751
 -0.509363	  0.169363	 -0.240056
 -0.503896	  0.164876	 -0.242891
 -0.492355	  0.155472	 -0.245388
 -0.472479	  0.136673	 -0.247857
 -0.461009	  0.122305	 -0.249435
 -0.446744	  0.106511	 -0.249827
 -0.430481	  0.088220	 -0.250733
 -0.421803	  0.073468	 -0.251460
 -0.416482	  0.062766	 -0.253083
 -0.410247	  0.036868	 -0.261569
 -0.398523	  0.012216	 -0.277179
 -0.385836	 -0.001448	 -0.286552
 -0.372241	 -0.013005	 -0.295573
 -0.364613	 -0.019653	 -0.299523
 -0.349826	 -0.035943	 -0.305960
 -0.337642	 -0.050801	 -0.310277
 -0.324198	 -0.068411	 -0.313984
 -0.304270	 -0.087408	 -0.321460
 -0.293990	 -0.095301	 -0.326078
 -0.277715	 -0.105290	 -0.338706
 -0.262246	 -0.120670	 -0.351120
 -0.252623	 -0.128069	 -0.358686
 -0.231904	 -0.140226	 -0.371616
 -0.217944	 -0.145276	 -0.382349
 -0.206764	 -0.149265	 -0.394313
 -0.191495	 -0.154658	 -0.407789
 -0.176494	 -0.160532	 -0.419731
 -0.161305	 -0.167009	 -0.433392
 -0.139084	 -0.173947	 -0.446978
 -0.124793	 -0.179975	 -0.453352
 -0.111647	 -0.190505	 -0.461052
 -0.098886	 -0.203036	 -0.467757
 -0.083786	 -0.213318	 -0.472906
 -0.064546	 -0.227118	 -0.473040
 -0.043227	 -0.239000	 -0.474234
 -0.026486	 -0.247637	 -0.476766
 -0.013160	 -0.255910	 -0.480756
  0.011297	 -0.269598	 -0.493344
  0.020779	 -0.276986	 -0.503339
  0.029399	 -0.285457	 -0.510983
  0.044625	 -0.306629	 -0.526136
  0.055941	 -0.329810	 -0.534633
  0.061571	 -0.343877	 -0.538257
  0.071962	 -0.360920	 -0.544018
  0.092635	 -0.374760	 -0.550052
  0.102824	 -0.381900	 -0.553115
  0.127571	 -0.400187	 -0.556438
  0.136761	 -0.412826	 -0.555982
  0.142672	 -0.422796	 -0.555566
  0.155651	 -0.444494	 -0.559939
  0.169693	 -0.460335	 -0.566794
  0.180431	 -0.471184	 -0.571754
  0.195847	 -0.488860	 -0.578217
  0.205932	 -0.502780	 -0.584166
  0.213784	 -0.515178	 -0.589516
  0.230051	 -0.534482	 -0.594669
  0.248649	 -0.550079	 -0.602921
  0.258327	 -0.558125	 -0.608110
  0.269959	 -0.564733	 -0.613128
  0.288875	 -0.573238	 -0.624724
  0.310340	 -0.591502	 -0.640901
  0.317455	 -0.605957	 -0.646509
  0.320776	 -0.619158	 -0.649761
  0.331499	 -0.639998	 -0.654268
  0.346519	 -0.656085	 -0.665509
  0.358164	 -0.667458	 -0.675896
  0.374907	 -0.679305	 -0.688163
  0.388706	 -0.686798	 -0.698621
  0.400506	 -0.695031	 -0.711911
  0.410033	 -0.705423	 -0.725958
  0.419960	 -0.718393	 -0.738058
  0.427393	 -0.729760	 -0.745391
  0.433815	 -0.748608	 -0.752600
  0.444903	 -0.768769	 -0.763264
  0.455314	 -0.785645	 -0.776361
  0.458968	 -0.795021	 -0.785482
  0.470090	 -0.805797	 -0.801074
  0.485844	 -0.814425	 -0.814381
  0.497521	 -0.832038	 -0.825936
  0.513516	 -0.853116	 -0.829460
  0.530802	 -0.866649	 -0.826228
  0.542868	 -0.876880	 -0.821546
  0.557987	 -0.891874	 -0.820764
  0.571603	 -0.908116	 -0.824800
  0.584444	 -0.919827	 -0.826482
  0.602988	 -0.932665	 -0.825829
  0.619587	 -0.945988	 -0.828734
  0.631439	 -0.957804	 -0.837598
  0.642625	 -0.969159	 -0.850507
  0.657942	 -0.983423	 -0.868707
  0.667544	 -0.997738	 -0.881297
  0.674897	 -1.012842	 -0.889885
  0.681809	 -1.029184	 -0.892837
  0.697239	 -1.041036	 -0.897103
  0.716072	 -1.050706	 -0.904856
  0.731076	 -1.063790	 -0.910369
  0.745144	 -1.076730	 -0.914619
  0.759144	 -1.090283	 -0.920576
  0.771608	 -1.103915	 -0.928581
  0.784209	 -1.116379	 -0.937879
  0.797131	 -1.128553	 -0.947098
  0.810447	 -1.140674	 -0.956008
  0.824048	 -1.152574	 -0.964890
  0.838519	 -1.163354	 -0.973512
  0.852314	 -1.173493	 -0.982891
  0.864724	 -1.184109	 -0.996368
  0.877738	 -1.194435	 -1.007904
  0.887719	 -1.207538	 -1.017440
  0.897944	 -1.219983	 -1.033110
  0.915677	 -1.230534	 -1.045735
  0.934316	 -1.240686	 -1.050423
  0.947251	 -1.250437	 -1.048860
  0.962749	 -1.266037	 -1.051295
  0.979132	 -1.280126	 -1.055410
  0.993948	 -1.293753	 -1.056278
  1.007954	 -1.307427	 -1.060688
  1.021306	 -1.321146	 -1.066363
  1.034344	 -1.335286	 -1.071889
  1.047572	 -1.349676	 -1.076124
  1.060807	 -1.364066	 -1.080337
  1.074032	 -1.378459	 -1.084565
  1.087267	 -1.389824	 -1.094342
  1.100467	 -1.401046	 -1.104334
  1.113632	 -1.412342	 -1.114285
  1.126010	 -1.425950	 -1.122108
  1.138619	 -1.439655	 -1.129394
  1.152156	 -1.453452	 -1.134524
  1.165719	 -1.467249	 -1.139599
  1.179506	 -1.480262	 -1.145967
  1.193504	 -1.491568	 -1.154705
  1.207512	 -1.502875	 -1.163420
  1.221215	 -1.514899	 -1.171645
  1.234562	 -1.527661	 -1.179322
  1.246793	 -1.542481	 -1.184863
  1.258649	 -1.557840	 -1.189717
  1.270695	 -1.572695	 -1.195566
  1.283102	 -1.585717	 -1.204318
  1.295516	 -1.598741	 -1.213052
  1.308411	 -1.611675	 -1.221201
  1.322266	 -1.624366	 -1.228054
  1.336142	 -1.637070	 -1.234911
  1.350344	 -1.650083	 -1.241912
  1.365777	 -1.664655	 -1.248842
  1.379477	 -1.678364	 -1.253778
  1.393177	 -1.692073	 -1.258714
