 -0.132350	  1.894907	  1.705841
 -0.128048	  1.898025	  1.712391
 -0.138249	  1.890631	  1.696858
 -0.148450	  1.883237	  1.681326
 -0.158030	  1.875511	  1.665560
 -0.167408	  1.867683	  1.649725
 -0.176787	  1.859854	  1.633890
 -0.185381	  1.851760	  1.617745
 -0.193947	  1.843658	  1.601591
 -0.202411	  1.835513	  1.585404
 -0.210564	  1.827242	  1.569122
 -0.218717	  1.818970	  1.552840
 -0.227155	  1.810705	  1.536699
 -0.235714	  1.802444	  1.520621
 -0.244782	  1.794346	  1.504741
 -0.254469	  1.786458	  1.489122
 -0.264642	  1.779044	  1.473581
 -0.275447	  1.772279	  1.458170
 -0.286817	  1.766242	  1.442864
 -0.298712	  1.760926	  1.427690
 -0.311031	  1.756408	  1.412596
 -0.323650	  1.752492	  1.397582
 -0.336394	  1.748913	  1.382589
 -0.349476	  1.746323	  1.367684
 -0.362558	  1.743733	  1.352780
 -0.375894	  1.741732	  1.338010
 -0.389502	  1.740407	  1.323413
 -0.403110	  1.739082	  1.308816
 -0.417618	  1.738273	  1.295074
 -0.432310	  1.737447	  1.281528
 -0.447914	  1.736064	  1.269095
 -0.463979	  1.734527	  1.257282
 -0.480429	  1.732856	  1.246030
 -0.497096	  1.731551	  1.235051
 -0.514475	  1.731620	  1.225154
 -0.531854	  1.731688	  1.215257
 -0.549269	  1.731723	  1.205422
 -0.568063	  1.730167	  1.198763
 -0.586858	  1.728611	  1.192103
 -0.605726	  1.727229	  1.185616
 -0.625414	  1.729444	  1.182884
 -0.645103	  1.731658	  1.180152
 -0.664791	  1.733873	  1.177420
 -0.684259	  1.733552	  1.172850
 -0.702716	  1.729930	  1.166051
 -0.721173	  1.726309	  1.159252
 -0.739630	  1.722687	  1.152453
 -0.758087	  1.719066	  1.145654
 -0.773631	  1.711066	  1.135939
 -0.786017	  1.700214	  1.124589
 -0.798403	  1.689362	  1.113238
 -0.810788	  1.678510	  1.101888
 -0.823174	  1.667658	  1.090538
 -0.831941	  1.654916	  1.077858
 -0.837243	  1.641009	  1.064498
 -0.842545	  1.627103	  1.051137
 -0.847847	  1.613196	  1.037777
 -0.853149	  1.599289	  1.024417
 -0.851627	  1.584795	  1.010720
 -0.850021	  1.570305	  0.997029
 -0.848414	  1.555814	  0.983338
 -0.846703	  1.541478	  0.969498
 -0.843477	  1.529658	  0.953690
 -0.840251	  1.517839	  0.937882
 -0.837024	  1.506019	  0.922074
 -0.836376	  1.494960	  0.905423
 -0.837162	  1.484416	  0.888446
 -0.837947	  1.473873	  0.871469
 -0.838733	  1.463329	  0.854492
 -0.839519	  1.452505	  0.837693
 -0.840305	  1.441592	  0.820951
 -0.841091	  1.430678	  0.804210
 -0.841877	  1.419765	  0.787468
 -0.842663	  1.408852	  0.770726
 -0.840399	  1.396884	  0.754863
 -0.837725	  1.384799	  0.739153
 -0.835052	  1.372713	  0.723443
 -0.832320	  1.360065	  0.708194
 -0.829333	  1.344590	  0.695881
 -0.826260	  1.329316	  0.683340
 -0.822953	  1.314633	  0.670170
 -0.821392	  1.300389	  0.656217
 -0.820338	  1.286297	  0.642064
 -0.819650	  1.272981	  0.627157
 -0.819138	  1.260054	  0.611905
 -0.818627	  1.247126	  0.596653
 -0.818286	  1.234521	  0.581129
 -0.818029	  1.222075	  0.565476
 -0.817771	  1.209629	  0.549823
 -0.817710	  1.197244	  0.534119
 -0.817809	  1.184910	  0.518375
 -0.817907	  1.172576	  0.502631
 -0.818128	  1.160057	  0.487036
 -0.818385	  1.147485	  0.471483
 -0.818653	  1.134711	  0.456097
 -0.818939	  1.121625	  0.440975
 -0.819275	  1.108345	  0.426024
 -0.819759	  1.094496	  0.411602
 -0.820265	  1.080572	  0.397254
 -0.821080	  1.065612	  0.384005
 -0.821895	  1.050652	  0.370756
 -0.822930	  1.035045	  0.358293
 -0.824274	  1.018585	  0.347012
 -0.825619	  1.002125	  0.335731
 -0.826963	  0.985664	  0.324451
 -0.828884	  0.968208	  0.314880
 -0.830876	  0.950641	  0.305531
 -0.832868	  0.933073	  0.296181
 -0.834860	  0.915505	  0.286832
 -0.838360	  0.897190	  0.279600
 -0.842026	  0.878812	  0.272615
 -0.845692	  0.860433	  0.265629
 -0.850682	  0.841669	  0.260836
 -0.857091	  0.822849	  0.258659
 -0.863500	  0.804029	  0.256483
 -0.872100	  0.786006	  0.257581
 -0.881620	  0.768615	  0.260219
 -0.891139	  0.751225	  0.262856
 -0.901627	  0.734409	  0.265546
 -0.913594	  0.718624	  0.268302
 -0.925562	  0.702838	  0.271058
 -0.937529	  0.687052	  0.273814
 -0.949573	  0.671301	  0.276428
 -0.962587	  0.656127	  0.277062
 -0.975601	  0.640954	  0.277696
 -0.988615	  0.625780	  0.278330
 -1.001629	  0.610607	  0.278964
 -1.015159	  0.595959	  0.277420
 -1.028937	  0.581778	  0.274408
 -1.042715	  0.567597	  0.271397
 -1.056493	  0.553417	  0.268385
 -1.070713	  0.541590	  0.260774
 -1.084925	  0.530032	  0.252748
 -1.099140	  0.518596	  0.244553
 -1.112865	  0.510799	  0.232272
 -1.126591	  0.503002	  0.219991
 -1.139915	  0.496816	  0.206419
 -1.152486	  0.492856	  0.191376
 -1.165058	  0.488895	  0.176334
 -1.176746	  0.486785	  0.160243
 -1.187705	  0.486020	  0.143530
 -1.198665	  0.485254	  0.126818
 -1.208867	  0.485226	  0.109616
 -1.217527	  0.486608	  0.091641
 -1.226187	  0.487990	  0.073666
 -1.234403	  0.489666	  0.055509
 -1.240304	  0.492789	  0.036656
 -1.246206	  0.495913	  0.017804
 -1.251014	  0.500269	 -0.001115
 -1.255098	  0.505406	 -0.020007
 -1.258584	  0.511764	 -0.038647
 -1.261605	  0.519027	 -0.057035
 -1.264626	  0.526290	 -0.075423
 -1.266529	  0.534721	 -0.093459
 -1.268301	  0.543285	 -0.111446
 -1.270073	  0.551849	 -0.129432
 -1.271844	  0.560413	 -0.147419
 -1.273349	  0.568897	 -0.165468
 -1.274778	  0.577358	 -0.183533
 -1.276208	  0.585819	 -0.201599
 -1.277637	  0.594280	 -0.219665
 -1.279066	  0.602741	 -0.237730
 -1.281820	  0.610719	 -0.255862
 -1.284793	  0.618612	 -0.273997
 -1.287766	  0.626506	 -0.292131
 -1.290739	  0.634399	 -0.310266
 -1.294593	  0.642235	 -0.328259
 -1.300363	  0.649888	 -0.345813
 -1.306132	  0.657541	 -0.363367
 -1.311902	  0.665194	 -0.380921
 -1.319654	  0.672102	 -0.398014
 -1.328245	  0.678658	 -0.414843
 -1.336837	  0.685214	 -0.431671
 -1.346493	  0.690628	 -0.448328
 -1.357018	  0.695029	 -0.464755
 -1.367544	  0.699431	 -0.481182
 -1.378705	  0.702824	 -0.497427
 -1.390644	  0.704866	 -0.513342
 -1.402583	  0.706909	 -0.529257
 -1.414636	  0.708452	 -0.545143
 -1.427047	  0.708098	 -0.560822
 -1.439459	  0.707744	 -0.576501
 -1.451868	  0.707315	 -0.592180
 -1.464179	  0.705266	 -0.607808
 -1.476490	  0.703217	 -0.623436
 -1.488763	  0.700924	 -0.639060
 -1.500823	  0.697462	 -0.654635
 -1.512884	  0.693999	 -0.670209
 -1.524755	  0.689909	 -0.685776
 -1.536389	  0.685086	 -0.701313
 -1.548023	  0.680264	 -0.716850
 -1.559023	  0.674779	 -0.732627
 -1.569577	  0.668847	 -0.748546
 -1.580131	  0.662915	 -0.764466
 -1.590052	  0.656605	 -0.780645
 -1.599571	  0.650064	 -0.796973
 -1.609089	  0.643523	 -0.813301
 -1.618008	  0.636839	 -0.829907
 -1.626698	  0.630102	 -0.846614
 -1.635387	  0.623365	 -0.863320
 -1.643347	  0.616546	 -0.880354
 -1.651230	  0.609719	 -0.897420
 -1.659046	  0.602879	 -0.914512
 -1.666125	  0.595898	 -0.931865
 -1.673204	  0.588916	 -0.949219
 -1.680077	  0.581924	 -0.966651
 -1.686300	  0.574901	 -0.984313
 -1.692523	  0.567879	 -1.001976
 -1.698434	  0.560810	 -1.019727
 -1.703889	  0.553678	 -1.037597
 -1.709344	  0.546545	 -1.055468
 -1.714427	  0.539339	 -1.073419
 -1.719293	  0.532092	 -1.091414
 -1.724158	  0.524845	 -1.109408
 -1.728735	  0.517637	 -1.127494
 -1.733306	  0.510431	 -1.145582
 -1.737934	  0.503193	 -1.163643
 -1.742623	  0.495922	 -1.181675
 -1.747321	  0.488642	 -1.199701
 -1.752217	  0.481154	 -1.217588
 -1.757114	  0.473665	 -1.235475
 -1.762096	  0.466141	 -1.253324
 -1.767143	  0.458591	 -1.271143
 -1.772367	  0.451060	 -1.288919
 -1.778262	  0.443605	 -1.306516
 -1.784212	  0.436162	 -1.324100
 -1.791468	  0.429017	 -1.341314
 -1.798725	  0.421872	 -1.358527
 -1.806849	  0.415144	 -1.375519
 -1.815030	  0.408445	 -1.392495
 -1.823947	  0.402338	 -1.409323
 -1.833066	  0.396398	 -1.426103
 -1.842960	  0.391267	 -1.442710
 -1.853246	  0.386565	 -1.459205
 -1.864034	  0.382325	 -1.475504
 -1.875273	  0.378519	 -1.491603
 -1.886673	  0.374726	 -1.507593
 -1.898513	  0.370976	 -1.523269
 -1.910354	  0.367226	 -1.538944
 -1.921966	  0.362392	 -1.554494
 -1.933474	  0.357118	 -1.569978
 -1.944981	  0.351844	 -1.585462
 -1.956339	  0.346092	 -1.601010
 -1.967301	  0.339649	 -1.616447
