 -1.367429	 -1.829116	  0.815754
 -1.401690	 -1.850496	  0.804382
 -1.384709	 -1.844672	  0.803272
 -1.361131	 -1.834460	  0.806570
 -1.344699	 -1.824543	  0.810729
 -1.332037	 -1.812261	  0.816909
 -1.319598	 -1.795423	  0.825024
 -1.307001	 -1.778966	  0.833992
 -1.289669	 -1.769581	  0.838392
 -1.269365	 -1.769058	  0.835635
 -1.247573	 -1.763742	  0.832872
 -1.230130	 -1.752938	  0.828571
 -1.215896	 -1.739594	  0.826161
 -1.199431	 -1.725071	  0.828200
 -1.178622	 -1.714784	  0.830770
 -1.162415	 -1.710398	  0.830085
 -1.144657	 -1.703321	  0.825338
 -1.126526	 -1.693979	  0.822816
 -1.108657	 -1.683514	  0.827841
 -1.092427	 -1.670834	  0.834355
 -1.078599	 -1.662832	  0.836403
 -1.056827	 -1.658138	  0.840300
 -1.032528	 -1.651214	  0.848028
 -1.020373	 -1.641249	  0.850050
 -1.006425	 -1.625490	  0.850903
 -0.991981	 -1.609064	  0.858040
 -0.979154	 -1.595150	  0.870674
 -0.972048	 -1.580107	  0.887262
 -0.966153	 -1.570921	  0.892287
 -0.948588	 -1.557833	  0.892688
 -0.926124	 -1.540360	  0.897100
 -0.913927	 -1.526849	  0.907614
 -0.902329	 -1.518073	  0.919920
 -0.889840	 -1.511701	  0.926709
 -0.872203	 -1.500674	  0.932884
 -0.856847	 -1.491493	  0.941176
 -0.838985	 -1.475818	  0.950548
 -0.826847	 -1.463641	  0.953037
 -0.811123	 -1.454518	  0.955786
 -0.792679	 -1.445557	  0.960156
 -0.775255	 -1.435170	  0.964390
 -0.758685	 -1.424707	  0.968427
 -0.742068	 -1.414299	  0.972378
 -0.725203	 -1.404163	  0.976007
 -0.708361	 -1.394009	  0.979618
 -0.691371	 -1.384126	  0.983310
 -0.674095	 -1.374760	  0.987034
 -0.656810	 -1.365389	  0.990745
 -0.639446	 -1.356498	  0.994696
 -0.622896	 -1.347521	  0.997750
 -0.606800	 -1.337788	  0.999218
 -0.583976	 -1.326083	  1.002620
 -0.568358	 -1.319652	  1.011100
 -0.556641	 -1.312771	  1.022938
 -0.543889	 -1.304217	  1.039790
 -0.527649	 -1.295386	  1.050638
 -0.516100	 -1.284472	  1.057517
 -0.502050	 -1.272481	  1.068360
 -0.492591	 -1.262097	  1.082015
 -0.487837	 -1.251477	  1.097645
 -0.480741	 -1.239843	  1.117005
 -0.469762	 -1.230114	  1.126282
 -0.462503	 -1.214438	  1.135631
 -0.453466	 -1.198294	  1.149306
 -0.448351	 -1.186832	  1.166425
 -0.447402	 -1.174984	  1.179940
 -0.446397	 -1.158304	  1.190822
 -0.443060	 -1.142764	  1.206874
 -0.436146	 -1.131875	  1.221518
 -0.431293	 -1.117657	  1.230682
 -0.422164	 -1.101446	  1.240092
 -0.405731	 -1.094648	  1.254164
 -0.395668	 -1.087715	  1.268056
 -0.377848	 -1.072806	  1.272382
 -0.362921	 -1.059364	  1.271800
 -0.349043	 -1.048630	  1.276356
 -0.332296	 -1.042473	  1.282610
 -0.312356	 -1.032913	  1.284348
 -0.294012	 -1.024848	  1.282780
 -0.276399	 -1.022262	  1.279580
 -0.251367	 -1.012820	  1.274528
 -0.239851	 -1.002558	  1.272459
 -0.226548	 -0.986753	  1.274355
 -0.205661	 -0.970767	  1.272383
 -0.190321	 -0.962099	  1.265714
 -0.177492	 -0.957705	  1.258249
 -0.157406	 -0.957735	  1.248695
 -0.140282	 -0.958576	  1.239846
 -0.118472	 -0.958582	  1.230007
 -0.104042	 -0.955461	  1.223267
 -0.088716	 -0.953810	  1.210124
 -0.071503	 -0.952797	  1.197073
 -0.053225	 -0.956728	  1.186711
 -0.038577	 -0.960933	  1.176761
 -0.016778	 -0.961824	  1.166140
  0.002513	 -0.967071	  1.158799
  0.014731	 -0.972005	  1.150178
  0.031850	 -0.974737	  1.136454
  0.046642	 -0.972690	  1.122455
  0.060421	 -0.966575	  1.108044
  0.077376	 -0.959367	  1.097097
  0.098662	 -0.953615	  1.090578
  0.116131	 -0.951830	  1.084197
  0.133504	 -0.947566	  1.076892
  0.150619	 -0.940371	  1.069195
  0.168373	 -0.934129	  1.062500
  0.187632	 -0.931631	  1.055898
  0.208084	 -0.927863	  1.050780
  0.223584	 -0.917634	  1.050161
  0.239887	 -0.906826	  1.049841
  0.262806	 -0.897213	  1.051431
  0.278618	 -0.892584	  1.051985
  0.296814	 -0.884282	  1.052689
  0.315366	 -0.875822	  1.055372
  0.333215	 -0.870979	  1.055108
  0.354741	 -0.868702	  1.053562
  0.377002	 -0.861506	  1.061994
  0.391202	 -0.851384	  1.069827
  0.405209	 -0.835268	  1.068532
  0.421566	 -0.821744	  1.068373
  0.437995	 -0.812360	  1.073102
  0.454955	 -0.801693	  1.074888
  0.472342	 -0.791281	  1.075013
  0.489097	 -0.782860	  1.079274
  0.506237	 -0.772775	  1.081727
  0.525295	 -0.759902	  1.084302
  0.539235	 -0.749215	  1.092629
  0.553486	 -0.736017	  1.101647
  0.570663	 -0.722953	  1.102226
  0.586398	 -0.717080	  1.096586
  0.608288	 -0.707971	  1.094825
  0.622388	 -0.695752	  1.099235
  0.636354	 -0.681638	  1.106001
  0.653301	 -0.669540	  1.110625
  0.671295	 -0.664292	  1.110536
  0.693138	 -0.657671	  1.110895
  0.712152	 -0.647891	  1.112334
  0.727842	 -0.639658	  1.115643
  0.743744	 -0.632467	  1.121809
  0.762987	 -0.625474	  1.129686
  0.781439	 -0.618051	  1.137226
  0.799548	 -0.608947	  1.140711
  0.813369	 -0.597997	  1.144160
  0.832568	 -0.590790	  1.148615
  0.851473	 -0.579877	  1.149703
  0.866467	 -0.569790	  1.151580
  0.885099	 -0.559676	  1.153988
  0.905781	 -0.548681	  1.153562
  0.917613	 -0.533329	  1.151949
  0.928283	 -0.518786	  1.152763
  0.944473	 -0.505103	  1.153078
  0.962105	 -0.494199	  1.149113
  0.980238	 -0.483337	  1.144043
  0.995034	 -0.470775	  1.145908
  1.009654	 -0.457734	  1.149651
  1.027903	 -0.445206	  1.149939
  1.040396	 -0.432787	  1.153788
  1.055167	 -0.419627	  1.159381
  1.072547	 -0.406453	  1.164131
  1.089829	 -0.398420	  1.159082
  1.110583	 -0.390996	  1.151886
  1.127190	 -0.380955	  1.154077
  1.142797	 -0.369381	  1.160511
  1.159264	 -0.359910	  1.167688
  1.177252	 -0.350789	  1.171574
  1.194973	 -0.342510	  1.175913
  1.212633	 -0.334184	  1.180271
  1.229950	 -0.325658	  1.185522
  1.247224	 -0.317936	  1.189842
  1.265853	 -0.311350	  1.190990
  1.286254	 -0.302219	  1.193187
  1.305718	 -0.289852	  1.199510
  1.318379	 -0.280452	  1.210602
  1.331293	 -0.272153	  1.229457
  1.342464	 -0.264737	  1.241373
  1.357116	 -0.255752	  1.250011
  1.368041	 -0.242931	  1.261671
  1.379356	 -0.222737	  1.273140
  1.389457	 -0.208329	  1.276047
  1.403350	 -0.196555	  1.276891
  1.419586	 -0.180795	  1.280802
  1.431093	 -0.168332	  1.292234
  1.442844	 -0.161613	  1.304500
  1.459515	 -0.152072	  1.314439
  1.476032	 -0.141681	  1.322398
  1.491961	 -0.130641	  1.327776
  1.508772	 -0.120196	  1.331689
  1.525511	 -0.113466	  1.334976
  1.545043	 -0.095090	  1.337075
  1.553542	 -0.075038	  1.337262
  1.561784	 -0.054447	  1.336637
  1.570105	 -0.040228	  1.335151
  1.586972	 -0.027345	  1.336166
  1.605138	 -0.017617	  1.339049
  1.622303	 -0.006834	  1.341197
  1.639023	  0.004909	  1.342947
  1.656427	  0.014556	  1.342687
  1.673897	  0.024741	  1.341994
  1.691462	  0.034509	  1.340219
  1.709243	  0.043287	  1.336916
  1.727188	  0.051210	  1.333100
  1.745424	  0.058794	  1.329151
  1.763186	  0.067205	  1.324968
  1.780599	  0.078174	  1.321289
  1.796687	  0.091977	  1.320964
  1.811408	  0.107773	  1.322622
  1.826308	  0.119878	  1.327269
  1.843889	  0.131561	  1.331340
  1.862255	  0.136950	  1.334675
  1.881240	  0.142296	  1.338406
  1.900462	  0.148525	  1.341434
  1.918843	  0.156700	  1.345284
  1.936430	  0.165433	  1.349245
  1.954152	  0.173743	  1.353378
  1.972023	  0.181621	  1.357685
  1.989868	  0.189564	  1.361986
  2.007709	  0.197517	  1.366287
  2.025675	  0.205549	  1.370593
  2.045200	  0.214252	  1.375067
  2.063093	  0.222219	  1.379112
