 -2.442390	 -0.888723	  1.557499
 -2.418208	 -0.879924	  1.542078
 -2.376768	 -0.860010	  1.518850
 -2.344510	 -0.847675	  1.482034
 -2.311264	 -0.832382	  1.448761
 -2.276112	 -0.816865	  1.416455
 -2.241385	 -0.802209	  1.384028
 -2.212403	 -0.789807	  1.345487
 -2.182133	 -0.766494	  1.312916
 -2.146367	 -0.754551	  1.278577
 -2.112142	 -0.735182	  1.247476
 -2.075637	 -0.723567	  1.217455
 -2.042610	 -0.714390	  1.182969
 -2.003153	 -0.699143	  1.154620
 -1.964001	 -0.689056	  1.123192
 -1.926188	 -0.679114	  1.092497
 -1.889094	 -0.665001	  1.062272
 -1.855892	 -0.644574	  1.029226
 -1.826705	 -0.628115	  0.996031
 -1.822683	 -0.675793	  0.947766
 -1.789377	 -0.776060	  0.860604
 -1.700888	 -0.850433	  0.779682
 -1.628728	 -0.880963	  0.734038
 -1.575824	 -0.890883	  0.704539
 -1.534269	 -0.895557	  0.681963
 -1.503889	 -0.887542	  0.669142
 -1.477672	 -0.876917	  0.657695
 -1.442033	 -0.833765	  0.647875
 -1.409368	 -0.726800	  0.635666
 -1.395300	 -0.584141	  0.601523
 -1.380670	 -0.505134	  0.567144
 -1.364734	 -0.466689	  0.542943
 -1.344086	 -0.436563	  0.518000
 -1.316969	 -0.410486	  0.490321
 -1.285593	 -0.389407	  0.463036
 -1.250360	 -0.371113	  0.435524
 -1.211433	 -0.353577	  0.406864
 -1.173470	 -0.337270	  0.380235
 -1.136274	 -0.320627	  0.355459
 -1.099016	 -0.302568	  0.332583
 -1.058294	 -0.283651	  0.308268
 -1.016890	 -0.268838	  0.279578
 -0.977021	 -0.258270	  0.248813
 -0.939197	 -0.250122	  0.215565
 -0.903580	 -0.243132	  0.178963
 -0.869408	 -0.235409	  0.140828
 -0.835739	 -0.226509	  0.103811
 -0.802687	 -0.216551	  0.067159
 -0.770530	 -0.205648	  0.030169
 -0.740119	 -0.193631	 -0.006916
 -0.708968	 -0.179281	 -0.043245
 -0.676859	 -0.163443	 -0.076801
 -0.643424	 -0.147404	 -0.108489
 -0.608903	 -0.130212	 -0.140325
 -0.575496	 -0.112832	 -0.171688
 -0.543015	 -0.096169	 -0.203527
 -0.512120	 -0.080701	 -0.237081
 -0.480952	 -0.065117	 -0.273619
 -0.450475	 -0.049552	 -0.310777
 -0.420429	 -0.033640	 -0.348024
 -0.390264	 -0.016622	 -0.384635
 -0.359412	  0.001976	 -0.420320
 -0.327265	  0.021773	 -0.455703
 -0.294819	  0.040992	 -0.489112
 -0.261669	  0.058917	 -0.521389
 -0.227279	  0.074930	 -0.551644
 -0.191099	  0.088933	 -0.581575
 -0.153217	  0.101125	 -0.610595
 -0.114889	  0.111400	 -0.638795
 -0.074689	  0.121155	 -0.667687
 -0.034483	  0.131824	 -0.697768
  0.004103	  0.143473	 -0.727822
  0.041643	  0.155661	 -0.758462
  0.078664	  0.167733	 -0.789073
  0.115417	  0.179067	 -0.819740
  0.150869	  0.189842	 -0.849570
  0.187370	  0.200699	 -0.879671
  0.225265	  0.211334	 -0.910548
  0.262223	  0.221393	 -0.939180
  0.300622	  0.230529	 -0.966001
  0.342081	  0.239573	 -0.990984
  0.384039	  0.248196	 -1.014529
  0.421743	  0.254931	 -1.034343
  0.449931	  0.258292	 -1.047329
  0.466805	  0.258689	 -1.053806
  0.487240	  0.256760	 -1.059448
  0.542480	  0.247581	 -1.072821
  0.611753	  0.231984	 -1.089491
  0.658421	  0.222809	 -1.108059
  0.706430	  0.208767	 -1.121480
  0.773597	  0.212119	 -1.155240
  0.865904	  0.225592	 -1.213714
  0.954467	  0.225033	 -1.278859
  1.030362	  0.217606	 -1.343689
  1.082277	  0.188494	 -1.386861
  1.119593	  0.195496	 -1.427754
  1.158914	  0.219319	 -1.474206
  1.190293	  0.263981	 -1.516582
  1.207292	  0.325293	 -1.560872
  1.198389	  0.384976	 -1.597827
  1.171456	  0.453768	 -1.643111
  1.146152	  0.504390	 -1.684759
  1.135207	  0.546954	 -1.727950
  1.144985	  0.588617	 -1.771796
  1.163279	  0.620190	 -1.804888
  1.185398	  0.645347	 -1.833140
  1.212343	  0.668642	 -1.862483
  1.242195	  0.690428	 -1.893038
  1.273947	  0.710989	 -1.925699
  1.305747	  0.729689	 -1.960321
  1.336252	  0.745994	 -1.995473
  1.366163	  0.760939	 -2.031087
  1.396364	  0.775951	 -2.066567
  1.426725	  0.791480	 -2.101435
  1.459652	  0.808088	 -2.136399
  1.495302	  0.823743	 -2.169582
  1.531451	  0.838346	 -2.200785
  1.567164	  0.852369	 -2.231230
  1.601858	  0.865805	 -2.260985
  1.636719	  0.878561	 -2.291819
  1.672529	  0.888029	 -2.326812
  1.689254	  0.896909	 -2.350080
