  0.618392	 -2.931339	 -0.453587
  0.612269	 -2.902316	 -0.449096
  0.595078	 -2.854325	 -0.438991
  0.579625	 -2.808039	 -0.422004
  0.553886	 -2.766694	 -0.410801
  0.535228	 -2.723625	 -0.395582
  0.512577	 -2.679082	 -0.383480
  0.492885	 -2.633050	 -0.374828
  0.473998	 -2.587416	 -0.368622
  0.453686	 -2.540284	 -0.366736
  0.434047	 -2.492601	 -0.368963
  0.415706	 -2.446726	 -0.369222
  0.397798	 -2.402394	 -0.365572
  0.380595	 -2.357142	 -0.355165
  0.364645	 -2.311313	 -0.341714
  0.349289	 -2.265234	 -0.327067
  0.334245	 -2.216203	 -0.310613
  0.321955	 -2.167240	 -0.295982
  0.311193	 -2.119304	 -0.283885
  0.298891	 -2.072137	 -0.274271
  0.285300	 -2.026433	 -0.265720
  0.270687	 -1.981071	 -0.256532
  0.256026	 -1.935455	 -0.245113
  0.243219	 -1.888384	 -0.231368
  0.230975	 -1.840781	 -0.217432
  0.218200	 -1.794100	 -0.203330
  0.204875	 -1.750254	 -0.189531
  0.191884	 -1.707018	 -0.174920
  0.182266	 -1.661104	 -0.157602
  0.174327	 -1.610760	 -0.142740
  0.161983	 -1.560027	 -0.133249
  0.146825	 -1.511007	 -0.127603
  0.129764	 -1.462799	 -0.124949
  0.110576	 -1.415412	 -0.125229
  0.088055	 -1.368672	 -0.128630
  0.063996	 -1.324143	 -0.131527
  0.039652	 -1.281391	 -0.131704
  0.014556	 -1.237774	 -0.128201
 -0.009847	 -1.196329	 -0.119658
 -0.034846	 -1.156803	 -0.106345
 -0.061122	 -1.116489	 -0.091143
 -0.086216	 -1.073169	 -0.077289
 -0.108391	 -1.026922	 -0.065826
 -0.126384	 -0.980110	 -0.057740
 -0.140545	 -0.930977	 -0.051570
 -0.150463	 -0.879303	 -0.044647
 -0.157353	 -0.829515	 -0.037137
 -0.162843	 -0.781970	 -0.029019
 -0.168094	 -0.734261	 -0.019730
 -0.174352	 -0.685276	 -0.008578
 -0.183750	 -0.635789	  0.005666
 -0.197331	 -0.586349	  0.022113
 -0.213802	 -0.540543	  0.038368
 -0.232768	 -0.497670	  0.053691
 -0.254303	 -0.456137	  0.067944
 -0.278747	 -0.414198	  0.081326
 -0.303774	 -0.372468	  0.094077
 -0.329477	 -0.330055	  0.106959
 -0.355260	 -0.288115	  0.119595
 -0.379484	 -0.248091	  0.130737
 -0.402757	 -0.205008	  0.141523
 -0.422198	 -0.161005	  0.152171
 -0.438970	 -0.113330	  0.164156
 -0.452609	 -0.066350	  0.176598
 -0.464647	 -0.018599	  0.189053
 -0.475735	  0.029632	  0.200404
 -0.486738	  0.077912	  0.209545
 -0.499357	  0.124807	  0.214726
 -0.514890	  0.171535	  0.218495
 -0.532624	  0.218505	  0.224487
 -0.552323	  0.266135	  0.232683
 -0.572472	  0.310744	  0.242781
 -0.592602	  0.354295	  0.253759
 -0.611762	  0.399373	  0.264516
 -0.628258	  0.444015	  0.273711
 -0.644696	  0.490870	  0.281512
 -0.661746	  0.537208	  0.286909
 -0.680421	  0.584013	  0.290570
 -0.701427	  0.631057	  0.292916
 -0.724376	  0.676170	  0.296103
 -0.748281	  0.719718	  0.301344
 -0.772304	  0.762062	  0.309033
 -0.797179	  0.804285	  0.318874
 -0.820548	  0.846365	  0.331798
 -0.840938	  0.887774	  0.345933
 -0.860066	  0.932695	  0.359946
 -0.878576	  0.980682	  0.372247
 -0.896601	  1.027884	  0.381962
 -0.914448	  1.073703	  0.389708
 -0.931545	  1.117000	  0.395090
 -0.949096	  1.161979	  0.398824
 -0.966519	  1.209494	  0.401535
 -0.982035	  1.257670	  0.403626
 -0.995826	  1.308439	  0.406074
 -1.008077	  1.358317	  0.409268
 -1.020510	  1.407255	  0.413979
 -1.033900	  1.453054	  0.421241
 -1.049921	  1.498558	  0.431064
 -1.067763	  1.545432	  0.443002
 -1.084266	  1.593005	  0.456513
 -1.099907	  1.640443	  0.471533
 -1.114954	  1.684235	  0.486453
 -1.130114	  1.727181	  0.501758
 -1.147690	  1.772585	  0.518288
 -1.165664	  1.817718	  0.534640
 -1.182556	  1.860254	  0.549336
 -1.202480	  1.904976	  0.562357
 -1.220602	  1.948430	  0.571566
 -1.237339	  1.993158	  0.580088
 -1.253102	  2.037794	  0.592139
 -1.272212	  2.083712	  0.606036
 -1.289067	  2.129623	  0.618837
 -1.304005	  2.175314	  0.633025
 -1.318012	  2.221362	  0.646759
 -1.331607	  2.266433	  0.658748
 -1.347058	  2.311488	  0.669408
 -1.367764	  2.355688	  0.677822
 -1.390171	  2.401690	  0.682745
 -1.410894	  2.448849	  0.682941
 -1.425621	  2.497484	  0.684013
 -1.427790	  2.547705	  0.686015
 -1.442068	  2.573182	  0.692875
