  0.914512	  1.059123	 -2.076958
  0.919003	  1.064478	 -2.082531
  0.908954	  1.052497	 -2.070062
  0.898890	  1.040513	 -2.057609
  0.887778	  1.028412	 -2.046318
  0.877045	  1.017967	 -2.034523
  0.862952	  1.007201	 -2.021289
  0.851244	  0.998040	 -2.009413
  0.840449	  0.976496	 -2.002562
  0.827425	  0.960695	 -2.008433
  0.809741	  0.944912	 -2.008332
  0.799186	  0.933041	 -2.001276
  0.792318	  0.925654	 -1.988221
  0.778745	  0.916137	 -1.984421
  0.782797	  0.913673	 -1.962064
  0.788251	  0.908488	 -1.941041
  0.786879	  0.909578	 -1.924134
  0.786093	  0.905987	 -1.904362
  0.789559	  0.898906	 -1.883087
  0.788504	  0.894340	 -1.865131
  0.787553	  0.889479	 -1.846304
  0.788225	  0.884584	 -1.824796
  0.787347	  0.882708	 -1.805850
  0.786779	  0.879583	 -1.786933
  0.787199	  0.875648	 -1.765667
  0.785866	  0.874742	 -1.745835
  0.783423	  0.874490	 -1.726785
  0.782015	  0.872252	 -1.706545
  0.782072	  0.869217	 -1.686497
  0.781659	  0.865892	 -1.666765
  0.781457	  0.862625	 -1.647038
  0.781247	  0.859366	 -1.627307
  0.781043	  0.856215	 -1.607599
  0.780938	  0.853997	 -1.587816
  0.779430	  0.852760	 -1.567653
  0.776867	  0.853082	 -1.547862
  0.774063	  0.853465	 -1.528139
  0.770308	  0.852185	 -1.508236
  0.767353	  0.852485	 -1.488510
  0.760670	  0.849702	 -1.469381
  0.750366	  0.847460	 -1.451220
  0.737634	  0.842841	 -1.435700
  0.724669	  0.837765	 -1.421195
  0.712005	  0.833650	 -1.406450
  0.697806	  0.827567	 -1.392889
  0.681747	  0.818571	 -1.381239
  0.665289	  0.808364	 -1.371506
  0.650820	  0.799108	 -1.363928
  0.635637	  0.783804	 -1.358890
  0.622507	  0.770196	 -1.350733
  0.606844	  0.759029	 -1.343840
  0.591026	  0.746791	 -1.339055
  0.574348	  0.733929	 -1.337318
  0.560377	  0.718991	 -1.334618
  0.549605	  0.701888	 -1.334730
  0.536728	  0.686418	 -1.331902
  0.526815	  0.669343	 -1.332209
  0.514942	  0.652756	 -1.329272
  0.505562	  0.635905	 -1.329594
  0.494809	  0.618838	 -1.327627
  0.484639	  0.601386	 -1.325627
  0.475318	  0.584200	 -1.325133
  0.465316	  0.567414	 -1.322200
  0.455984	  0.550284	 -1.318048
  0.449855	  0.534643	 -1.310692
  0.436989	  0.510952	 -1.307422
  0.428261	  0.495359	 -1.308066
  0.417206	  0.480543	 -1.307586
  0.407273	  0.465183	 -1.303628
  0.395163	  0.446483	 -1.300752
  0.383790	  0.429269	 -1.299216
  0.376367	  0.414593	 -1.297055
  0.366144	  0.395250	 -1.295256
  0.352640	  0.378932	 -1.288965
  0.342604	  0.367724	 -1.280745
  0.330988	  0.348990	 -1.276876
  0.320127	  0.329069	 -1.273413
  0.312119	  0.311218	 -1.264346
  0.301807	  0.301960	 -1.257712
  0.289480	  0.285611	 -1.257683
  0.281104	  0.263747	 -1.256474
  0.274488	  0.247422	 -1.251598
  0.265532	  0.231981	 -1.242861
  0.255971	  0.214117	 -1.233111
  0.248372	  0.196765	 -1.227401
  0.242349	  0.179795	 -1.223523
  0.238118	  0.161645	 -1.214257
  0.224855	  0.145042	 -1.204897
  0.213771	  0.131766	 -1.202669
  0.204928	  0.115272	 -1.195914
  0.194606	  0.099916	 -1.188435
  0.185836	  0.084954	 -1.177983
  0.180790	  0.065295	 -1.165218
  0.177676	  0.050104	 -1.156177
  0.171585	  0.034662	 -1.146114
  0.162797	  0.019221	 -1.135632
  0.147801	  0.005549	 -1.131185
  0.135293	 -0.011272	 -1.122517
  0.126211	 -0.023880	 -1.108024
  0.123123	 -0.036304	 -1.097016
  0.117449	 -0.054129	 -1.086051
  0.113564	 -0.070824	 -1.074776
  0.107815	 -0.083356	 -1.060661
  0.099911	 -0.100665	 -1.051481
  0.091318	 -0.113017	 -1.038770
  0.082783	 -0.122439	 -1.022165
  0.078869	 -0.138386	 -1.011325
  0.071617	 -0.158585	 -1.003948
  0.064947	 -0.174198	 -0.992770
  0.056456	 -0.182334	 -0.977496
  0.045391	 -0.191393	 -0.959830
  0.034448	 -0.201416	 -0.947420
  0.026531	 -0.216241	 -0.935908
  0.020538	 -0.230792	 -0.923660
  0.015787	 -0.244315	 -0.910036
  0.009876	 -0.256752	 -0.893192
  0.000396	 -0.266794	 -0.881733
 -0.009909	 -0.277216	 -0.868214
 -0.021076	 -0.288654	 -0.853199
 -0.030190	 -0.304015	 -0.839637
 -0.035661	 -0.313023	 -0.828119
 -0.044706	 -0.322648	 -0.810825
 -0.050817	 -0.334210	 -0.794432
 -0.060771	 -0.344973	 -0.782787
 -0.073073	 -0.354411	 -0.769107
 -0.085250	 -0.364316	 -0.754422
 -0.088912	 -0.372487	 -0.737293
 -0.095569	 -0.381052	 -0.718062
 -0.100276	 -0.391683	 -0.699056
 -0.101068	 -0.405301	 -0.683140
 -0.109650	 -0.414776	 -0.673117
 -0.124093	 -0.427949	 -0.659917
 -0.133911	 -0.441773	 -0.647302
 -0.139703	 -0.454777	 -0.637767
 -0.151741	 -0.468819	 -0.626711
 -0.166551	 -0.483211	 -0.611222
 -0.168757	 -0.491066	 -0.595282
 -0.173658	 -0.496811	 -0.576198
 -0.181652	 -0.503495	 -0.555283
 -0.184868	 -0.510242	 -0.536780
 -0.193006	 -0.525200	 -0.524844
 -0.202147	 -0.535906	 -0.508001
 -0.210978	 -0.545289	 -0.492782
 -0.219287	 -0.563009	 -0.487307
 -0.228834	 -0.577639	 -0.473429
 -0.244257	 -0.583597	 -0.461254
 -0.257980	 -0.591505	 -0.447540
 -0.271747	 -0.603959	 -0.437811
 -0.281661	 -0.614405	 -0.426183
 -0.290426	 -0.621020	 -0.411061
 -0.299721	 -0.633798	 -0.388569
 -0.306303	 -0.643526	 -0.370117
 -0.310836	 -0.657759	 -0.367601
 -0.322180	 -0.674070	 -0.356324
 -0.335788	 -0.684537	 -0.341681
 -0.342060	 -0.692656	 -0.325161
 -0.346597	 -0.705084	 -0.308938
 -0.357872	 -0.716265	 -0.296400
 -0.371105	 -0.724026	 -0.282895
 -0.383064	 -0.733397	 -0.267904
 -0.390403	 -0.747269	 -0.257223
 -0.398708	 -0.760332	 -0.242131
 -0.402634	 -0.773653	 -0.227891
 -0.406303	 -0.786955	 -0.213530
 -0.411740	 -0.799510	 -0.198284
 -0.417888	 -0.812249	 -0.184164
 -0.423606	 -0.825088	 -0.170012
 -0.428789	 -0.837251	 -0.155000
 -0.434211	 -0.850113	 -0.140657
 -0.439371	 -0.862405	 -0.126521
 -0.444258	 -0.873413	 -0.111925
 -0.452480	 -0.889620	 -0.096249
 -0.456776	 -0.902332	 -0.082483
 -0.459233	 -0.913215	 -0.068692
 -0.466650	 -0.926693	 -0.054047
 -0.470552	 -0.940229	 -0.039387
 -0.472239	 -0.951955	 -0.023583
 -0.478431	 -0.965500	 -0.009909
 -0.483853	 -0.979062	  0.003983
 -0.483834	 -0.991459	  0.020633
 -0.484454	 -1.004914	  0.036564
 -0.490423	 -1.018990	  0.050000
 -0.498403	 -1.031633	  0.061148
 -0.503680	 -1.045494	  0.076158
 -0.508257	 -1.059505	  0.089836
 -0.512737	 -1.073364	  0.103455
 -0.516971	 -1.086271	  0.118188
 -0.521156	 -1.098851	  0.132901
 -0.525968	 -1.113371	  0.146996
 -0.529886	 -1.125087	  0.161935
 -0.534895	 -1.140231	  0.175741
 -0.539193	 -1.152740	  0.190255
 -0.543622	 -1.165379	  0.204752
 -0.548520	 -1.180146	  0.218310
 -0.553591	 -1.194954	  0.231140
 -0.557979	 -1.208257	  0.245130
 -0.562666	 -1.221791	  0.259371
 -0.567624	 -1.237782	  0.270293
 -0.571777	 -1.252407	  0.283663
 -0.576528	 -1.266975	  0.297506
 -0.580915	 -1.282918	  0.308251
 -0.585339	 -1.298829	  0.318844
 -0.589621	 -1.314330	  0.331549
 -0.593960	 -1.330159	  0.342988
 -0.597608	 -1.346162	  0.354705
 -0.600252	 -1.364210	  0.363069
 -0.601706	 -1.381787	  0.372501
 -0.606818	 -1.399016	  0.386164
 -0.610385	 -1.412493	  0.398558
 -0.619337	 -1.427608	  0.409104
 -0.629865	 -1.443999	  0.419859
 -0.644226	 -1.454156	  0.432210
 -0.650635	 -1.466155	  0.444573
 -0.654648	 -1.481469	  0.456536
 -0.659603	 -1.493224	  0.473928
 -0.666141	 -1.508094	  0.487636
 -0.670792	 -1.523205	  0.499732
 -0.682049	 -1.529718	  0.516116
 -0.695334	 -1.537730	  0.529588
 -0.702127	 -1.552745	  0.542785
 -0.712458	 -1.566724	  0.555549
 -0.723123	 -1.577957	  0.560931
 -0.736713	 -1.591332	  0.570349
 -0.753333	 -1.601438	  0.585609
 -0.760811	 -1.607653	  0.600477
 -0.767824	 -1.623824	  0.611923
 -0.782503	 -1.634147	  0.624628
 -0.795203	 -1.644245	  0.633414
 -0.803195	 -1.651132	  0.651166
 -0.816243	 -1.652829	  0.672146
 -0.826978	 -1.664235	  0.684413
 -0.843654	 -1.674690	  0.690333
 -0.866583	 -1.678852	  0.702066
 -0.874246	 -1.680124	  0.714008
 -0.884627	 -1.684258	  0.732165
 -0.893339	 -1.688499	  0.752106
 -0.905031	 -1.698248	  0.768912
 -0.919958	 -1.702715	  0.780100
 -0.931783	 -1.710780	  0.791883
 -0.943612	 -1.715274	  0.809938
 -0.954300	 -1.717523	  0.825159
 -0.966270	 -1.727037	  0.838918
 -0.976339	 -1.738311	  0.851850
 -0.986506	 -1.745535	  0.866118
 -0.995058	 -1.755117	  0.882610
 -1.006384	 -1.766425	  0.894821
 -1.015934	 -1.778069	  0.907867
 -1.024802	 -1.790396	  0.921112
 -1.033969	 -1.800928	  0.936843
 -1.040247	 -1.813639	  0.951713
 -1.046324	 -1.825221	  0.963361
 -1.054673	 -1.836966	  0.977659
 -1.066845	 -1.851249	  0.989782
 -1.073016	 -1.864697	  1.003272
 -1.079031	 -1.875754	  1.017514
 -1.087290	 -1.887403	  1.031441
 -1.095428	 -1.900120	  1.045506
 -1.103064	 -1.912752	  1.059136
 -1.110926	 -1.926080	  1.071884
 -1.118518	 -1.938739	  1.085421
 -1.126346	 -1.952249	  1.097949
 -1.133861	 -1.964878	  1.111541
 -1.141649	 -1.977882	  1.125369
 -1.154912	 -2.001897	  1.142168
 -1.162621	 -2.015090	  1.155073
