  0.894987	  1.851583	  2.225205
  0.886125	  1.833251	  2.203174
  0.853083	  1.832128	  2.169542
  0.821279	  1.832822	  2.135606
  0.786086	  1.826341	  2.100697
  0.751930	  1.828819	  2.062525
  0.719594	  1.823624	  2.025510
  0.687291	  1.817614	  1.989449
  0.654846	  1.819329	  1.952855
  0.620133	  1.821695	  1.915880
  0.585208	  1.823500	  1.880059
  0.548795	  1.826287	  1.845874
  0.510816	  1.830313	  1.813035
  0.473151	  1.833484	  1.780497
  0.435497	  1.835333	  1.746482
  0.399929	  1.835105	  1.712561
  0.364806	  1.832748	  1.677764
  0.331284	  1.825866	  1.642159
  0.300468	  1.816880	  1.603061
  0.270378	  1.809234	  1.563705
  0.237516	  1.802140	  1.526228
  0.203035	  1.794371	  1.490281
  0.166381	  1.785202	  1.456185
  0.127634	  1.775659	  1.423791
  0.089854	  1.767987	  1.392776
  0.054579	  1.764819	  1.362258
  0.019034	  1.766214	  1.330285
 -0.019549	  1.770717	  1.295921
 -0.056396	  1.774967	  1.260938
 -0.091481	  1.777947	  1.225266
 -0.124927	  1.780952	  1.191469
 -0.158464	  1.786262	  1.160708
 -0.189966	  1.794788	  1.136259
 -0.216785	  1.806386	  1.120240
 -0.265626	  1.834629	  1.102090
 -0.388382	  1.905503	  1.093196
 -0.505091	  1.980099	  1.103396
 -0.570872	  2.033778	  1.107408
 -0.642717	  2.080139	  1.095089
 -0.700821	  2.110632	  1.058532
 -0.774339	  2.090108	  1.051166
 -0.790623	  2.118042	  1.009922
 -0.801867	  2.090074	  0.960732
 -0.822250	  2.025235	  0.917449
 -0.804865	  1.967274	  0.869271
 -0.742408	  1.881853	  0.784248
 -0.714098	  1.784511	  0.672822
 -0.739589	  1.747389	  0.597366
 -0.763908	  1.734959	  0.554324
 -0.790865	  1.729768	  0.515098
 -0.819551	  1.729312	  0.475988
 -0.848298	  1.732844	  0.437184
 -0.874155	  1.739989	  0.403514
 -0.900121	  1.752360	  0.373136
 -0.944704	  1.779800	  0.332095
 -1.038958	  1.839683	  0.296782
 -1.134835	  1.874159	  0.318225
 -1.195770	  1.880056	  0.328891
 -1.228946	  1.952504	  0.313068
 -1.284828	  1.954961	  0.324518
 -1.364676	  1.947063	  0.344063
 -1.398229	  1.990411	  0.282429
 -1.411886	  1.970197	  0.203566
 -1.438176	  1.960408	  0.160889
 -1.467742	  1.950516	  0.126802
 -1.484002	  1.928477	  0.084616
 -1.495416	  1.890497	  0.032127
 -1.503716	  1.838582	 -0.023450
 -1.506730	  1.788869	 -0.070823
 -1.506058	  1.727212	 -0.129892
 -1.511871	  1.645244	 -0.205999
 -1.542019	  1.614866	 -0.263226
 -1.578189	  1.612663	 -0.302627
 -1.611835	  1.611106	 -0.339810
 -1.641907	  1.608660	 -0.377099
 -1.670981	  1.607466	 -0.414644
 -1.701791	  1.608161	 -0.454535
 -1.733449	  1.603656	 -0.494751
 -1.766692	  1.598540	 -0.531691
 -1.802506	  1.596030	 -0.566739
 -1.838724	  1.593766	 -0.602849
 -1.873162	  1.591812	 -0.638981
 -1.906169	  1.589886	 -0.674536
 -1.940692	  1.587529	 -0.712512
 -1.973526	  1.584957	 -0.749406
 -2.005736	  1.582097	 -0.786136
 -2.038759	  1.578422	 -0.823734
 -2.071078	  1.573780	 -0.859761
 -2.103783	  1.568607	 -0.895715
 -2.136819	  1.563207	 -0.931691
 -2.170013	  1.558051	 -0.966909
 -2.204023	  1.553607	 -1.001497
 -2.240541	  1.549969	 -1.037627
 -2.280823	  1.547890	 -1.069892
 -2.320254	  1.544653	 -1.109263
 -2.343457	  1.560100	 -1.120356
