 0.0 0.0 0.0 0
 -0.144402296244808 0.9581758754669462 -0.24716182656789396 1000
 0.8648339974313892 0.1951760063334121 0.46261159025534965 1000
 0.45718813197901337 -0.859547654462184 -0.22656752125160765 1000
 0.42055678964842236 -0.0467763528560564 -0.9064843956153344 1000
 0.9990945114585629 -0.013913259030199743 0.03145756501278731 1000
 0.12380842657976324 -0.15582570627065814 0.9797845797791949 1000
 -0.1511658142077404 -0.9835835417782365 -0.09425132867970948 1000
 0.7926748432230394 -0.485635982668007 -0.36925504093973965 1000
 0.0 0.0 0.0 0
 -0.5475823969509362 -0.3457665514315906 -0.7625247605557293 1000
 -0.10659513545012031 -0.7469600684361185 0.6569156211114784 1000
 0.5798698421977151 0.8146482739439594 -0.01616031774824714 1000
 0.28161410732398273 0.6152237311749045 0.7360918795607956 1000
 0.9421923258680523 -0.2347353526678715 -0.2381657726946493 1000
 -0.1346243600828429 0.9527746533755803 0.27063950479803844 1000
 -0.11850460010532034 0.08774399506892902 0.9887955557562045 1000
 -0.5472934693016459 0.6892353435203433 0.47551077769295874 1000
 0.0 0.0 0.0 0
 -0.8943339577313665 -0.2915982386307814 0.33988856891042374 1000
 0.6129020224666255 0.5578778176467847 0.5588751662348047 1000
 0.3492166205562672 0.0767825728403605 0.9339529904846788 1000
 -0.29905194721447115 0.689486871614483 0.6592744396216998 1000
 -0.3719187339128555 0.3842445478615114 -0.8454227243239686 1000
 -0.977004557686102 -0.10542608100425505 0.1826292301485941 1000
 0.17331692506873753 -0.984643447616141 -0.01861516992446896 1000
 -0.12480455767895268 -0.5697060332031268 0.8122714189939951 1000
 0.0 0.0 0.0 0
 -0.8276367411466695 0.2775803796505668 0.48803438151135153 1000
 0.002476063058788225 0.8724221375795226 -0.48947163653566794 1000
 -0.7603978182837188 -0.6468339995814691 -0.05172943973019781 1000
 -0.8406949672733423 0.046097422267278976 -0.5388181508278891 1000
 0.04004361412633231 0.6366208984446878 0.7696754774781249 1000
 -0.7788566601654221 -0.27372169559967785 0.5644446264019184 1000
 -0.4961283041739257 0.7153165882161889 -0.49160032996353387 1000
 -0.12304615347507117 -0.08488816054187351 -0.9885168912642847 1000
 0.0 0.0 0.0 0
 0.459127571248941 0.4997526124606517 -0.7342160442661287 1000
 -0.5323249955524604 -0.7677195241600261 -0.3553517009014812 1000
 -0.5802104706275011 0.12833157523051963 0.8046588199809077 1000
 0.2743418256887793 0.8166091942838506 -0.5082312332873958 1000
 0.9536950693610878 0.2949997861331428 -0.059956991733655596 1000
 -0.5297900138513061 -0.08934850051147802 -0.8433530617006041 1000
 -0.9579198427568647 -0.10150362591724632 -0.26692431282727885 1000
 0.09640789468496538 -0.3023337488709841 -0.9480405171383915 1000
 0.0 0.0 0.0 0
 0.3820937408489908 -0.8774958424798337 0.2907222379430764 1000
 0.5600872262253758 0.7980617606412337 -0.2212006447128456 1000
 0.9482195107491928 -0.05445471666433391 -0.3134556480071276 1000
 -0.8996180937986504 0.3262772055481347 -0.291469501748952 1000
 -0.13707939819877707 -0.9513949893862563 -0.27490146009104044 1000
 -0.31707304773949085 0.530065147053054 0.785848345596537 1000
 0.6717052762903084 -0.5582301815865774 0.48850392646280427 1000
 -0.5701028057202698 -0.672086908131265 0.4722763797062398 1000
 0.0 0.0 0.0 0
 0.4382862346709476 -0.514008956533463 0.7367095554567914 1000
 0.7865906405515589 -0.60348354917796 0.12922759019752922 1000
 0.40241220631518937 -0.7498808194853972 -0.5256958938173765 1000
 -0.12943509379131662 0.8060095404238411 -0.5776635502097922 1000
 0.48195001244698193 0.48809155831198553 0.7266084338947155 1000
 -0.8790602130608712 0.3618673207118342 0.3118800795405403 1000
