 -2.295401	 -0.066190	 -0.887358
 -2.298143	 -0.067045	 -0.888809
 -2.300885	 -0.067900	 -0.890260
 -2.283843	 -0.062584	 -0.881244
 -2.266742	 -0.057295	 -0.872376
 -2.249456	 -0.052206	 -0.863492
 -2.232648	 -0.047133	 -0.853867
 -2.216594	 -0.041875	 -0.843220
 -2.200733	 -0.037331	 -0.831885
 -2.184663	 -0.032953	 -0.820801
 -2.169444	 -0.029922	 -0.808186
 -2.154252	 -0.026932	 -0.795527
 -2.139889	 -0.025084	 -0.781733
 -2.125760	 -0.023556	 -0.767661
 -2.111070	 -0.023294	 -0.754093
 -2.096256	 -0.023332	 -0.740655
 -2.081663	 -0.022979	 -0.726984
 -2.067230	 -0.022351	 -0.713153
 -2.052795	 -0.021718	 -0.699325
 -2.037943	 -0.019718	 -0.686081
 -2.022891	 -0.016936	 -0.673208
 -2.007835	 -0.014153	 -0.660340
 -1.992161	 -0.011218	 -0.648267
 -1.976242	 -0.008261	 -0.636467
 -1.959704	 -0.005390	 -0.625637
 -1.942584	 -0.002640	 -0.615619
 -1.925583	  0.000097	 -0.605442
 -1.908206	  0.002717	 -0.595894
 -1.890739	  0.005308	 -0.586505
 -1.873007	  0.008014	 -0.577657
 -1.854945	  0.010871	 -0.569558
 -1.836983	  0.013503	 -0.561339
 -1.819654	  0.013986	 -0.551886
 -1.801637	  0.015125	 -0.540916
 -1.785420	  0.016569	 -0.530047
 -1.767275	  0.018102	 -0.523344
 -1.751305	  0.014192	 -0.514521
 -1.730372	  0.014159	 -0.502269
 -1.713945	  0.017318	 -0.492714
 -1.695566	  0.030413	 -0.482524
 -1.678631	  0.045949	 -0.475699
 -1.666573	  0.046857	 -0.469700
 -1.646201	  0.044366	 -0.457483
 -1.629228	  0.040733	 -0.447334
 -1.611559	  0.042313	 -0.435902
 -1.594908	  0.044634	 -0.425010
 -1.578285	  0.046954	 -0.414135
 -1.561870	  0.049843	 -0.403080
 -1.545488	  0.052816	 -0.391998
 -1.529111	  0.055825	 -0.380921
 -1.512950	  0.060357	 -0.370045
 -1.496791	  0.064897	 -0.359170
 -1.480633	  0.069446	 -0.348297
 -1.464662	  0.075386	 -0.337827
 -1.448703	  0.081397	 -0.327378
 -1.432923	  0.087214	 -0.316990
 -1.417702	  0.092598	 -0.306591
 -1.400421	  0.099146	 -0.294247
 -1.385475	  0.105309	 -0.282047
 -1.370637	  0.112231	 -0.273630
 -1.353450	  0.120564	 -0.265483
 -1.338414	  0.128686	 -0.254360
 -1.324908	  0.133965	 -0.241238
 -1.309616	  0.138065	 -0.227406
 -1.293549	  0.144477	 -0.217138
 -1.276321	  0.153322	 -0.211941
 -1.257298	  0.163402	 -0.205389
 -1.241515	  0.168237	 -0.196686
 -1.224844	  0.170271	 -0.186570
 -1.208958	  0.173387	 -0.169912
 -1.195868	  0.180785	 -0.159728
 -1.180182	  0.183746	 -0.150645
 -1.162146	  0.187091	 -0.140318
 -1.142522	  0.189630	 -0.132259
 -1.126866	  0.192629	 -0.119918
 -1.113258	  0.197773	 -0.105830
 -1.097815	  0.200993	 -0.093247
 -1.079583	  0.204137	 -0.085058
 -1.060683	  0.204559	 -0.078284
 -1.041898	  0.204020	 -0.071099
 -1.023413	  0.207674	 -0.063804
 -1.004107	  0.216358	 -0.051985
 -0.991576	  0.220523	 -0.041456
 -0.975762	  0.222069	 -0.030293
 -0.955563	  0.220307	 -0.017528
 -0.940427	  0.219778	 -0.010558
 -0.921339	  0.225030	 -0.003100
 -0.903782	  0.233718	  0.007460
 -0.888572	  0.236907	  0.020011
 -0.871506	  0.238203	  0.029982
 -0.852062	  0.239029	  0.038717
 -0.835639	  0.239621	  0.047840
 -0.819648	  0.240580	  0.057731
 -0.800603	  0.246537	  0.067042
 -0.782233	  0.246215	  0.072781
 -0.764180	  0.248881	  0.081445
 -0.746720	  0.254598	  0.090607
 -0.728605	  0.256449	  0.098302
 -0.709989	  0.257774	  0.106649
 -0.692985	  0.262621	  0.115745
 -0.676695	  0.265176	  0.124829
 -0.657022	  0.265257	  0.135634
 -0.640962	  0.268578	  0.146356
 -0.625337	  0.274816	  0.156608
 -0.607262	  0.278066	  0.163790
 -0.585646	  0.283817	  0.170093
 -0.573205	  0.285367	  0.182343
 -0.557472	  0.288861	  0.197270
 -0.539937	  0.291764	  0.208714
 -0.524154	  0.290641	  0.216030
 -0.506878	  0.292958	  0.229057
 -0.489323	  0.296675	  0.242167
 -0.474637	  0.294433	  0.249510
 -0.455307	  0.295222	  0.260518
 -0.438435	  0.301137	  0.273079
 -0.426160	  0.302031	  0.284556
 -0.410031	  0.299597	  0.298357
 -0.394187	  0.296709	  0.311156
 -0.378222	  0.296065	  0.323685
 -0.362371	  0.298495	  0.335665
 -0.346541	  0.301085	  0.347610
 -0.330708	  0.303687	  0.359549
 -0.314716	  0.308734	  0.370193
 -0.299368	  0.316382	  0.379784
 -0.283473	  0.324205	  0.389724
 -0.265683	  0.330493	  0.399618
 -0.248735	  0.334094	  0.409823
 -0.229615	  0.332006	  0.420000
 -0.212644	  0.334974	  0.426418
 -0.195080	  0.340337	  0.433416
 -0.176066	  0.341685	  0.439159
 -0.156046	  0.339797	  0.449571
 -0.140552	  0.343464	  0.462856
 -0.125198	  0.349066	  0.472014
 -0.105818	  0.350465	  0.477085
 -0.085772	  0.346848	  0.487048
 -0.068555	  0.348114	  0.498317
 -0.053394	  0.353156	  0.505401
 -0.034712	  0.356258	  0.514954
 -0.017045	  0.360605	  0.526902
 -0.003380	  0.359795	  0.539199
  0.014772	  0.359909	  0.548893
  0.032916	  0.362343	  0.558198
  0.050017	  0.362764	  0.568259
  0.067544	  0.361098	  0.578192
  0.085217	  0.361487	  0.588827
  0.102777	  0.364790	  0.595148
  0.121952	  0.366535	  0.600150
  0.140819	  0.371073	  0.608373
  0.158741	  0.380541	  0.623178
  0.172172	  0.383586	  0.630082
  0.191576	  0.383378	  0.636617
  0.211246	  0.383553	  0.643312
  0.229286	  0.387206	  0.652649
  0.245809	  0.392859	  0.663556
  0.260851	  0.398878	  0.675887
  0.274770	  0.402222	  0.688736
  0.290557	  0.406323	  0.700873
  0.305506	  0.411897	  0.712100
  0.319959	  0.417538	  0.726296
  0.331261	  0.423254	  0.743699
  0.342375	  0.430901	  0.756128
  0.357722	  0.439081	  0.765677
  0.372363	  0.447987	  0.777269
  0.386505	  0.453810	  0.796882
  0.395102	  0.459849	  0.808170
  0.409529	  0.468323	  0.820125
  0.421698	  0.476607	  0.833482
  0.432490	  0.485322	  0.849757
  0.444828	  0.496228	  0.863892
  0.464260	  0.499456	  0.872545
  0.479689	  0.506012	  0.885144
  0.493311	  0.508515	  0.895378
  0.510353	  0.513956	  0.904335
  0.527536	  0.515579	  0.916441
  0.542061	  0.521858	  0.931261
  0.560888	  0.528290	  0.937147
  0.579159	  0.529504	  0.944713
  0.595420	  0.527302	  0.956871
  0.611620	  0.525199	  0.969285
  0.629726	  0.523002	  0.977532
  0.648700	  0.522461	  0.983531
  0.668292	  0.525596	  0.990908
  0.685844	  0.526875	  0.999388
  0.705049	  0.527341	  1.006706
  0.723181	  0.525047	  1.013457
  0.741283	  0.523613	  1.020424
  0.758080	  0.522923	  1.027879
  0.776463	  0.526329	  1.036112
  0.794558	  0.531177	  1.043846
  0.811990	  0.534467	  1.053150
  0.828942	  0.536168	  1.063625
  0.845584	  0.538395	  1.074489
  0.861700	  0.541270	  1.085915
  0.877212	  0.544539	  1.098090
  0.892568	  0.549684	  1.109789
  0.909130	  0.557627	  1.118737
  0.924212	  0.563792	  1.128063
  0.930216	  0.560668	  1.145121
  0.930204	  0.553096	  1.163685
  0.930239	  0.544569	  1.181860
  0.928207	  0.534184	  1.198742
  0.925051	  0.522053	  1.214256
  0.920401	  0.510516	  1.230075
  0.915525	  0.499103	  1.245891
  0.911622	  0.486711	  1.260881
  0.906099	  0.475623	  1.276990
  0.902661	  0.463161	  1.291851
  0.899781	  0.452404	  1.308056
  0.898139	  0.441588	  1.324685
  0.897248	  0.429738	  1.340773
  0.896139	  0.418296	  1.357152
  0.895054	  0.406803	  1.373501
  0.893936	  0.395370	  1.389892
  0.893006	  0.383500	  1.405971
  0.891098	  0.373038	  1.422956
  0.891667	  0.362417	  1.439962
  0.896261	  0.355107	  1.458455
  0.903852	  0.350276	  1.476556
  0.910951	  0.347792	  1.495046
  0.918849	  0.343542	  1.512972
  0.926715	  0.339302	  1.530891
  0.933614	  0.336678	  1.549498
  0.941875	  0.331945	  1.567059
  0.951488	  0.329381	  1.584725
  0.964181	  0.328855	  1.601359
  0.978101	  0.328861	  1.615668
  0.990902	  0.333798	  1.629483
  1.005215	  0.335002	  1.643014
  1.019851	  0.334032	  1.656870
  1.035922	  0.331979	  1.670641
  1.051844	  0.333470	  1.682810
  1.067226	  0.338262	  1.693285
  1.083360	  0.341207	  1.703835
  1.099962	  0.346214	  1.714852
  1.118304	  0.354312	  1.725954
  1.136266	  0.359545	  1.735077
  1.150053	  0.360057	  1.746667
  1.165018	  0.361590	  1.758564
  1.181202	  0.368123	  1.769910
  1.198239	  0.372951	  1.780001
  1.213858	  0.380642	  1.790167
  1.229463	  0.390428	  1.798896
  1.245299	  0.401426	  1.805322
  1.260297	  0.413417	  1.810934
  1.275726	  0.424982	  1.816518
  1.289620	  0.438138	  1.822558
  1.304372	  0.450977	  1.825570
  1.316134	  0.466915	  1.824605
  1.326394	  0.485887	  1.821200
  1.336145	  0.502983	  1.816958
  1.349007	  0.516464	  1.810663
  1.359502	  0.531647	  1.806368
  1.368140	  0.550401	  1.800150
  1.379525	  0.562452	  1.790743
  1.392705	  0.573289	  1.786252
  1.407508	  0.583564	  1.772105
  1.416739	  0.595019	  1.759864
  1.425202	  0.613168	  1.750986
  1.439445	  0.620439	  1.740471
  1.450555	  0.631909	  1.731096
  1.460655	  0.640645	  1.716116
  1.475491	  0.645921	  1.699855
  1.486649	  0.647590	  1.686517
  1.497795	  0.650862	  1.670836
  1.511283	  0.655676	  1.655792
  1.525747	  0.659814	  1.642201
  1.539883	  0.663307	  1.628899
  1.552606	  0.666365	  1.613857
  1.568479	  0.672880	  1.608789
  1.585361	  0.679700	  1.608283
  1.604112	  0.683056	  1.615557
  1.621295	  0.683043	  1.623668
  1.638965	  0.683440	  1.632698
  1.657320	  0.686774	  1.641668
  1.675290	  0.689481	  1.650365
  1.693053	  0.693022	  1.659029
  1.710794	  0.697062	  1.667851
  1.720012	  0.702745	  1.672635
  1.727788	  0.707538	  1.676670
