 -2.088274	  1.035825	 -0.845391
 -2.091874	  1.035085	 -0.847317
 -2.074521	  1.038652	 -0.838036
 -2.057152	  1.042179	 -0.828771
 -2.039373	  1.044644	 -0.819955
 -2.021568	  1.046689	 -0.811254
 -2.004402	  1.046260	 -0.801470
 -1.987111	  1.043389	 -0.790669
 -1.970325	  1.044240	 -0.782343
 -1.950292	  1.051812	 -0.776717
 -1.926940	  1.056814	 -0.768943
 -1.912916	  1.054324	 -0.760576
 -1.896736	  1.050029	 -0.749070
 -1.877867	  1.047628	 -0.737754
 -1.860865	  1.052053	 -0.731487
 -1.842427	  1.055648	 -0.723245
 -1.824373	  1.055850	 -0.713503
 -1.807273	  1.059682	 -0.706174
 -1.786921	  1.064991	 -0.697668
 -1.771692	  1.063281	 -0.687902
 -1.755924	  1.063786	 -0.678189
 -1.732463	  1.069051	 -0.669004
 -1.719156	  1.071195	 -0.663550
 -1.698840	  1.070628	 -0.654891
 -1.676531	  1.068216	 -0.642758
 -1.663571	  1.072159	 -0.633436
 -1.650336	  1.080505	 -0.623437
 -1.630679	  1.085848	 -0.614259
 -1.611779	  1.092208	 -0.607353
 -1.597550	  1.098329	 -0.597884
 -1.580267	  1.104368	 -0.584660
 -1.561576	  1.112314	 -0.577380
 -1.547774	  1.123294	 -0.575894
 -1.534102	  1.139105	 -0.571738
 -1.519945	  1.152639	 -0.564062
 -1.507101	  1.166916	 -0.557900
 -1.495948	  1.182914	 -0.552906
 -1.485654	  1.199562	 -0.548005
 -1.477335	  1.217403	 -0.542911
 -1.471272	  1.236373	 -0.538731
 -1.465213	  1.255155	 -0.538385
 -1.458392	  1.274129	 -0.540578
 -1.454712	  1.294352	 -0.544367
 -1.454683	  1.315962	 -0.546163
 -1.455990	  1.337924	 -0.541517
 -1.447388	  1.354201	 -0.532301
 -1.432881	  1.368174	 -0.525253
 -1.418906	  1.388059	 -0.516235
 -1.415477	  1.406329	 -0.510924
 -1.414120	  1.423870	 -0.510531
 -1.410527	  1.444945	 -0.508380
 -1.406757	  1.463928	 -0.505354
 -1.403546	  1.481347	 -0.502517
 -1.404032	  1.504223	 -0.496484
 -1.404732	  1.525520	 -0.493617
 -1.407414	  1.546399	 -0.495105
 -1.404243	  1.556750	 -0.495345
 -1.410476	  1.578669	 -0.494803
 -1.425396	  1.591772	 -0.494319
 -1.442624	  1.596997	 -0.492545
 -1.459591	  1.592569	 -0.494421
 -1.478327	  1.588408	 -0.497530
 -1.496624	  1.579841	 -0.498385
 -1.506217	  1.562685	 -0.496183
 -1.517003	  1.546139	 -0.495003
 -1.528814	  1.529957	 -0.493049
 -1.539405	  1.514694	 -0.492564
 -1.545063	  1.489118	 -0.492053
 -1.548438	  1.469783	 -0.487387
 -1.556084	  1.453414	 -0.479662
 -1.566128	  1.439465	 -0.474051
 -1.576680	  1.421467	 -0.469668
 -1.583223	  1.404178	 -0.467135
 -1.588825	  1.383997	 -0.461125
 -1.586431	  1.367181	 -0.445530
 -1.580055	  1.352865	 -0.434647
 -1.576361	  1.334833	 -0.429287
 -1.572688	  1.314915	 -0.424732
 -1.566730	  1.295130	 -0.414060
 -1.567097	  1.280358	 -0.400597
 -1.570267	  1.264476	 -0.388202
 -1.569068	  1.249099	 -0.377022
 -1.563221	  1.232735	 -0.364662
 -1.558686	  1.216989	 -0.356085
 -1.556123	  1.203378	 -0.342823
 -1.552926	  1.192187	 -0.325930
 -1.549292	  1.181414	 -0.309461
 -1.545807	  1.170773	 -0.292874
 -1.542269	  1.160124	 -0.276313
 -1.538591	  1.149633	 -0.259688
 -1.534863	  1.139197	 -0.243049
 -1.530261	  1.129340	 -0.226506
 -1.523716	  1.118152	 -0.210987
 -1.517937	  1.104378	 -0.196897
 -1.511704	  1.093062	 -0.183537
 -1.502419	  1.087751	 -0.167040
 -1.490706	  1.086027	 -0.150311
 -1.480003	  1.082832	 -0.134333
 -1.469118	  1.076069	 -0.119662
 -1.457692	  1.066741	 -0.105155
 -1.448406	  1.057570	 -0.089854
 -1.440373	  1.052850	 -0.068595
 -1.429714	  1.054287	 -0.051369
 -1.413397	  1.053801	 -0.038632
 -1.397041	  1.050258	 -0.029300
 -1.378046	  1.047276	 -0.023397
 -1.356321	  1.045720	 -0.015471
 -1.339535	  1.044115	 -0.005043
 -1.324964	  1.040204	  0.005458
 -1.307990	  1.034771	  0.016874
 -1.287343	  1.031537	  0.022872
 -1.271328	  1.030679	  0.023427
 -1.254620	  1.027645	  0.025296
 -1.236455	  1.021358	  0.033086
 -1.215130	  1.014964	  0.037330
 -1.195850	  1.010537	  0.033066
 -1.176814	  1.006843	  0.023717
 -1.159054	  1.005924	  0.017343
 -1.136439	  1.007537	  0.015288
 -1.116589	  1.007631	  0.024811
 -1.098994	  0.999805	  0.035890
 -1.080995	  0.993084	  0.037646
 -1.062964	  0.989272	  0.039550
 -1.042840	  0.984201	  0.047271
 -1.027333	  0.979454	  0.056609
 -1.015505	  0.971891	  0.067577
 -0.998728	  0.960757	  0.082370
 -0.983483	  0.957336	  0.090363
 -0.965016	  0.955258	  0.097930
 -0.945567	  0.947171	  0.110707
 -0.936918	  0.941949	  0.122105
 -0.925159	  0.935893	  0.140940
 -0.909589	  0.925024	  0.155006
 -0.890756	  0.915728	  0.156676
 -0.870190	  0.908602	  0.161274
 -0.852673	  0.905402	  0.170185
 -0.835391	  0.904278	  0.178152
 -0.816465	  0.902897	  0.179985
 -0.794897	  0.900631	  0.181484
 -0.772110	  0.898149	  0.184243
 -0.755235	  0.898966	  0.186803
 -0.735260	  0.897533	  0.191428
 -0.716546	  0.894881	  0.198806
 -0.699034	  0.893159	  0.207568
 -0.678035	  0.892761	  0.212321
 -0.661948	  0.893232	  0.209923
 -0.633207	  0.894406	  0.203542
 -0.613325	  0.895597	  0.201884
 -0.600507	  0.899014	  0.199429
 -0.582591	  0.911285	  0.194953
 -0.569007	  0.920753	  0.191577
 -0.553357	  0.928952	  0.184530
 -0.539162	  0.934205	  0.172200
 -0.521108	  0.934276	  0.154581
 -0.506987	  0.937219	  0.136683
 -0.497663	  0.945067	  0.123873
 -0.482333	  0.957035	  0.118801
 -0.460824	  0.968770	  0.117170
 -0.445882	  0.974999	  0.115533
 -0.421167	  0.981772	  0.113194
 -0.402001	  0.990864	  0.102546
 -0.387482	  0.996170	  0.097299
 -0.378597	  1.005727	  0.078524
 -0.362606	  1.014851	  0.071081
 -0.339603	  1.023771	  0.075097
 -0.321024	  1.031045	  0.071013
 -0.305183	  1.038491	  0.066030
 -0.280470	  1.050549	  0.061993
 -0.263510	  1.057161	  0.063666
 -0.248963	  1.064251	  0.075520
 -0.231968	  1.072840	  0.095407
 -0.212771	  1.077069	  0.106801
 -0.195573	  1.080867	  0.112471
 -0.179644	  1.089539	  0.120670
 -0.167504	  1.101506	  0.132058
 -0.154049	  1.107434	  0.144129
 -0.135637	  1.105117	  0.157338
 -0.116354	  1.103098	  0.170857
 -0.097536	  1.108111	  0.181541
 -0.086287	  1.111472	  0.187666
 -0.065757	  1.117967	  0.194445
 -0.047319	  1.126642	  0.204249
 -0.031920	  1.137820	  0.211841
 -0.019842	  1.151927	  0.216872
 -0.004440	  1.163710	  0.223830
  0.020016	  1.170016	  0.233055
  0.032279	  1.173372	  0.238475
  0.049487	  1.178235	  0.241387
  0.073570	  1.188486	  0.243368
  0.092258	  1.193649	  0.247601
  0.106757	  1.197233	  0.248909
  0.126096	  1.203438	  0.251194
  0.149276	  1.208282	  0.257656
  0.169814	  1.209676	  0.273480
  0.181357	  1.207549	  0.284577
  0.200265	  1.204883	  0.293022
  0.220485	  1.202399	  0.299998
  0.239259	  1.203962	  0.309463
  0.260907	  1.207280	  0.320355
  0.280815	  1.207439	  0.324658
  0.295320	  1.201733	  0.326107
  0.314173	  1.192469	  0.333985
  0.336692	  1.192054	  0.344540
  0.352371	  1.195335	  0.354649
  0.365835	  1.191933	  0.364937
  0.384368	  1.187256	  0.374621
  0.405183	  1.189472	  0.385090
  0.420803	  1.194688	  0.395729
  0.434923	  1.194233	  0.408140
  0.450294	  1.191356	  0.422202
  0.465266	  1.184272	  0.441042
  0.475335	  1.175721	  0.459139
  0.477659	  1.167764	  0.475383
  0.477144	  1.156622	  0.496181
  0.481385	  1.145826	  0.514592
  0.486212	  1.139365	  0.528611
  0.491207	  1.132373	  0.547307
  0.498181	  1.125036	  0.565948
  0.508133	  1.121304	  0.581529
  0.518989	  1.116984	  0.599685
  0.519829	  1.110307	  0.618266
  0.518833	  1.104637	  0.636525
  0.515989	  1.097081	  0.656642
  0.519141	  1.090828	  0.674823
  0.524943	  1.089549	  0.693392
  0.531076	  1.086407	  0.715091
  0.530994	  1.078536	  0.733900
  0.528283	  1.075885	  0.752399
  0.527654	  1.076712	  0.771932
  0.526455	  1.078675	  0.793471
  0.530979	  1.083625	  0.811735
  0.544029	  1.086826	  0.830833
  0.557058	  1.087254	  0.846262
  0.569264	  1.087465	  0.860852
  0.578498	  1.086250	  0.880013
  0.583562	  1.087180	  0.897358
  0.596582	  1.092683	  0.913345
  0.613954	  1.095178	  0.924775
  0.627634	  1.091301	  0.937505
  0.642174	  1.087578	  0.954968
  0.656130	  1.092344	  0.974338
  0.663682	  1.099574	  0.984304
  0.681348	  1.108630	  0.997921
  0.697259	  1.107700	  1.007521
  0.716240	  1.108136	  1.017808
  0.735410	  1.109277	  1.026840
  0.754261	  1.108171	  1.033847
  0.772931	  1.106359	  1.040600
  0.791855	  1.105545	  1.047237
  0.811521	  1.104398	  1.050171
  0.831389	  1.102629	  1.050958
  0.851378	  1.101331	  1.051596
  0.871316	  1.100059	  1.052247
  0.891195	  1.101528	  1.051375
  0.909882	  1.107578	  1.048031
  0.928789	  1.114038	  1.045346
  0.947319	  1.121077	  1.042597
  0.963644	  1.132055	  1.038664
  0.978627	  1.143996	  1.032736
  0.993651	  1.155287	  1.026046
  1.009455	  1.165632	  1.018702
  1.025516	  1.173059	  1.008953
  1.041474	  1.180109	  0.999204
  1.057416	  1.187492	  0.989657
  1.071971	  1.195596	  0.978588
  1.085258	  1.204133	  0.966316
  1.098502	  1.212639	  0.954002
  1.111724	  1.221670	  0.942075
  1.125591	  1.230955	  0.930954
  1.139792	  1.240020	  0.920201
  1.153958	  1.248895	  0.909122
  1.167917	  1.258365	  0.898466
  1.184979	  1.266275	  0.890373
  1.204081	  1.272884	  0.889097
  1.225214	  1.274669	  0.891918
  1.243006	  1.276038	  0.895525
  1.261298	  1.277434	  0.894722
  1.278988	  1.281361	  0.899366
  1.301152	  1.279593	  0.910917
  1.316483	  1.273352	  0.916869
  1.336046	  1.271967	  0.923239
  1.353681	  1.272737	  0.927039
  1.373047	  1.275050	  0.936458
  1.390418	  1.277527	  0.947924
  1.409071	  1.276071	  0.956763
  1.427503	  1.272827	  0.961715
  1.446890	  1.271165	  0.968063
  1.465676	  1.270404	  0.975368
  1.484255	  1.269731	  0.982750
  1.502960	  1.269171	  0.989808
  1.521953	  1.268736	  0.996057
  1.540954	  1.268345	  1.002284
  1.559891	  1.269167	  1.008656
  1.578746	  1.270822	  1.015118
  1.597585	  1.272444	  1.021633
  1.616353	  1.273716	  1.028424
  1.635098	  1.274941	  1.035281
  1.653307	  1.275409	  1.043532
  1.671266	  1.275589	  1.052332
  1.689013	  1.276203	  1.061529
  1.706297	  1.277720	  1.071473
  1.723597	  1.279321	  1.081366
  1.741790	  1.282301	  1.089082
  1.760587	  1.286739	  1.094244
  1.779406	  1.291229	  1.099313
  1.798244	  1.295717	  1.104383
  1.817250	  1.300052	  1.109401
  1.836435	  1.303411	  1.113948
