 -1.115488	 -2.095564	  0.712675
 -1.143053	 -2.094304	  0.727357
 -1.123669	 -2.100797	  0.721698
 -1.106116	 -2.100655	  0.711425
 -1.088356	 -2.101877	  0.702268
 -1.071686	 -2.101299	  0.690780
 -1.054652	 -2.101365	  0.679636
 -1.038840	 -2.101115	  0.667462
 -1.024437	 -2.101872	  0.653632
 -1.010963	 -2.103310	  0.638952
 -0.995094	 -2.103778	  0.624554
 -0.978779	 -2.104186	  0.613724
 -0.962860	 -2.104083	  0.600885
 -0.948869	 -2.104850	  0.587149
 -0.935333	 -2.103539	  0.571756
 -0.919707	 -2.101994	  0.559153
 -0.904634	 -2.099727	  0.545595
 -0.893154	 -2.097879	  0.529507
 -0.881145	 -2.096651	  0.512687
 -0.869258	 -2.097352	  0.497840
 -0.854896	 -2.098300	  0.483663
 -0.840346	 -2.095655	  0.469912
 -0.828116	 -2.090651	  0.454599
 -0.813418	 -2.088342	  0.437843
 -0.798714	 -2.091626	  0.424334
 -0.780792	 -2.093826	  0.416077
 -0.762131	 -2.093164	  0.408362
 -0.743138	 -2.092864	  0.399479
 -0.727370	 -2.091790	  0.388583
 -0.713150	 -2.087552	  0.373922
 -0.696112	 -2.085753	  0.363540
 -0.674981	 -2.083840	  0.356828
 -0.659133	 -2.082000	  0.347111
 -0.641340	 -2.084441	  0.336449
 -0.625073	 -2.090904	  0.326520
 -0.607623	 -2.092679	  0.316630
 -0.591094	 -2.093794	  0.304172
 -0.573921	 -2.093684	  0.295899
 -0.556147	 -2.090507	  0.285219
 -0.539922	 -2.089971	  0.273424
 -0.522719	 -2.093329	  0.263286
 -0.505062	 -2.096770	  0.254767
 -0.488173	 -2.099257	  0.245427
 -0.470230	 -2.101427	  0.232577
 -0.454143	 -2.103059	  0.222618
 -0.436871	 -2.107285	  0.211598
 -0.423074	 -2.109418	  0.197085
 -0.411018	 -2.110795	  0.182525
 -0.395426	 -2.115888	  0.171636
 -0.372974	 -2.125978	  0.157423
 -0.359756	 -2.131032	  0.152108
 -0.344585	 -2.128579	  0.141259
 -0.328171	 -2.127077	  0.128658
 -0.306228	 -2.131233	  0.119998
 -0.291204	 -2.138176	  0.113894
 -0.274876	 -2.140640	  0.101721
 -0.257953	 -2.142474	  0.089770
 -0.241287	 -2.143695	  0.079529
 -0.225671	 -2.144069	  0.068440
 -0.205957	 -2.148041	  0.056040
 -0.190311	 -2.149779	  0.047076
 -0.175071	 -2.148231	  0.036291
 -0.156336	 -2.148648	  0.025603
 -0.138686	 -2.151942	  0.014962
 -0.124367	 -2.153859	  0.003730
 -0.109115	 -2.155142	 -0.009115
 -0.092420	 -2.156624	 -0.021308
 -0.076166	 -2.157998	 -0.032923
 -0.059933	 -2.159370	 -0.044524
 -0.043675	 -2.160644	 -0.056102
 -0.027410	 -2.161887	 -0.067674
 -0.010997	 -2.163103	 -0.079038
  0.005647	 -2.164276	 -0.090066
  0.022337	 -2.165352	 -0.101032
  0.039460	 -2.165473	 -0.111366
  0.056584	 -2.165596	 -0.121699
  0.073318	 -2.165539	 -0.132652
  0.089539	 -2.165265	 -0.144348
  0.105762	 -2.164991	 -0.156041
  0.121589	 -2.164824	 -0.168268
  0.135629	 -2.165097	 -0.182509
  0.149670	 -2.165371	 -0.196749
  0.163709	 -2.165646	 -0.210989
  0.175884	 -2.166343	 -0.226480
  0.187111	 -2.167866	 -0.241931
  0.202850	 -2.167399	 -0.258020
  0.217255	 -2.166048	 -0.271169
  0.228018	 -2.165312	 -0.287216
  0.239232	 -2.164778	 -0.304440
  0.252853	 -2.163867	 -0.318975
  0.266097	 -2.164107	 -0.333295
  0.277794	 -2.163842	 -0.350672
  0.293750	 -2.162208	 -0.363635
  0.309467	 -2.163889	 -0.373907
  0.328440	 -2.165043	 -0.383428
  0.343583	 -2.164428	 -0.396186
  0.358226	 -2.165215	 -0.409532
  0.375472	 -2.164152	 -0.423492
  0.394849	 -2.162727	 -0.429399
  0.411981	 -2.164443	 -0.434389
  0.431531	 -2.166467	 -0.442050
  0.450498	 -2.167887	 -0.449617
  0.469022	 -2.168841	 -0.457167
  0.487465	 -2.169736	 -0.464851
  0.505867	 -2.170589	 -0.472638
  0.524268	 -2.171422	 -0.480430
  0.542645	 -2.171868	 -0.488310
  0.561022	 -2.172314	 -0.496186
  0.579970	 -2.173082	 -0.502542
  0.598989	 -2.173895	 -0.508677
  0.617794	 -2.174724	 -0.515435
  0.636210	 -2.175579	 -0.523190
  0.654627	 -2.176434	 -0.530940
  0.672975	 -2.177274	 -0.538856
  0.690145	 -2.177902	 -0.549093
  0.707315	 -2.178530	 -0.559330
  0.724487	 -2.179157	 -0.569565
  0.740938	 -2.179731	 -0.580924
  0.757138	 -2.180286	 -0.592639
  0.773338	 -2.180842	 -0.604354
  0.789307	 -2.181792	 -0.616358
  0.805234	 -2.182810	 -0.628412
  0.821098	 -2.183818	 -0.640549
  0.836580	 -2.184764	 -0.653175
  0.852061	 -2.185709	 -0.665802
  0.867361	 -2.186530	 -0.678656
  0.882410	 -2.187183	 -0.691814
  0.897459	 -2.187837	 -0.704971
  0.912162	 -2.188135	 -0.718525
  0.926736	 -2.188303	 -0.732221
  0.941281	 -2.188473	 -0.745887
  0.954539	 -2.188125	 -0.759263
  0.968369	 -2.187500	 -0.773697
