 -0.834950	 -2.861781	 -0.542189
 -0.826684	 -2.833446	 -0.536821
 -0.824339	 -2.786996	 -0.555848
 -0.837012	 -2.746964	 -0.583547
 -0.839488	 -2.704174	 -0.610260
 -0.851955	 -2.665709	 -0.641156
 -0.858565	 -2.624131	 -0.669455
 -0.864644	 -2.580752	 -0.693581
 -0.868516	 -2.537173	 -0.717133
 -0.874472	 -2.498148	 -0.747795
 -0.880256	 -2.456460	 -0.774371
 -0.887156	 -2.416564	 -0.803649
 -0.894406	 -2.377261	 -0.833292
 -0.901794	 -2.337606	 -0.862941
 -0.909246	 -2.297940	 -0.892401
 -0.916663	 -2.258160	 -0.921815
 -0.924241	 -2.218213	 -0.951426
 -0.932252	 -2.178810	 -0.981303
 -0.940864	 -2.139209	 -1.011236
 -0.950066	 -2.099332	 -1.039960
 -0.959797	 -2.059348	 -1.067210
 -0.970251	 -2.018538	 -1.093152
 -0.981450	 -1.976428	 -1.118856
 -0.992932	 -1.934060	 -1.144365
 -1.003940	 -1.891651	 -1.169464
 -1.013426	 -1.849572	 -1.193751
 -1.021806	 -1.808000	 -1.217772
 -1.029654	 -1.766728	 -1.242830
 -1.037124	 -1.725864	 -1.269389
 -1.042874	 -1.685038	 -1.297819
 -1.046942	 -1.643864	 -1.327531
 -1.050920	 -1.602061	 -1.357194
 -1.054915	 -1.559979	 -1.385978
 -1.058806	 -1.517544	 -1.413872
 -1.062714	 -1.474143	 -1.440474
 -1.067270	 -1.430890	 -1.465930
 -1.072448	 -1.387421	 -1.489705
 -1.078424	 -1.344951	 -1.513177
 -1.084876	 -1.302684	 -1.536761
 -1.091866	 -1.259574	 -1.561056
 -1.098989	 -1.216692	 -1.586629
 -1.106175	 -1.174211	 -1.612854
 -1.112023	 -1.133139	 -1.640243
 -1.117412	 -1.092386	 -1.668887
 -1.122059	 -1.052036	 -1.698718
 -1.126596	 -1.012811	 -1.728045
 -1.131027	 -0.973773	 -1.756693
 -1.135734	 -0.934148	 -1.784647
 -1.140165	 -0.893707	 -1.812355
 -1.144145	 -0.852239	 -1.840167
 -1.147792	 -0.810193	 -1.866933
 -1.152336	 -0.767387	 -1.893369
 -1.157837	 -0.724259	 -1.918837
 -1.164198	 -0.680839	 -1.943857
 -1.171122	 -0.637645	 -1.967999
 -1.177982	 -0.594532	 -1.992088
 -1.185606	 -0.552020	 -2.016317
 -1.192655	 -0.509507	 -2.040884
 -1.200424	 -0.467143	 -2.066272
 -1.208084	 -0.425152	 -2.091776
 -1.216231	 -0.383795	 -2.118044
 -1.224074	 -0.342894	 -2.145631
 -1.232553	 -0.301721	 -2.173223
 -1.241041	 -0.261573	 -2.201221
 -1.250200	 -0.220819	 -2.229140
 -1.259803	 -0.179963	 -2.256912
 -1.270122	 -0.138443	 -2.283920
 -1.279894	 -0.096936	 -2.310696
 -1.288358	 -0.056251	 -2.337653
 -1.296169	 -0.015844	 -2.364651
 -1.303577	  0.024520	 -2.391819
 -1.310730	  0.065554	 -2.418628
 -1.318153	  0.107271	 -2.444783
 -1.327336	  0.150076	 -2.470664
 -1.333993	  0.192065	 -2.499292
 -1.338182	  0.233067	 -2.527878
 -1.343314	  0.276219	 -2.552031
 -1.343076	  0.316046	 -2.582777
 -1.352244	  0.355975	 -2.611334
 -1.363134	  0.391929	 -2.643531
 -1.376766	  0.395849	 -2.669966
