  0.768486	 -1.163470	  2.073695
  0.769461	 -1.164667	  2.076203
  0.762722	 -1.156555	  2.059209
  0.755976	 -1.148451	  2.042214
  0.749314	 -1.140372	  2.025183
  0.742734	 -1.132649	  2.007996
  0.736850	 -1.125672	  1.990210
  0.730955	 -1.118109	  1.972559
  0.724750	 -1.109086	  1.955602
  0.718631	 -1.099414	  1.938978
  0.712766	 -1.090775	  1.922012
  0.706833	 -1.084588	  1.904041
  0.700203	 -1.080088	  1.885687
  0.694087	 -1.075285	  1.867091
  0.687751	 -1.070080	  1.848596
  0.680770	 -1.064797	  1.830394
  0.673244	 -1.058417	  1.812843
  0.665756	 -1.050604	  1.796292
  0.658450	 -1.044141	  1.778764
  0.650763	 -1.037174	  1.761379
  0.643619	 -1.029929	  1.745301
  0.638354	 -1.025264	  1.725526
  0.634181	 -1.018828	  1.705224
  0.628128	 -1.008190	  1.687758
  0.619644	 -0.995595	  1.675341
  0.610951	 -0.984037	  1.661035
  0.604499	 -0.974038	  1.644330
  0.597859	 -0.962719	  1.628878
  0.591034	 -0.950434	  1.614420
  0.583847	 -0.937345	  1.601359
  0.576601	 -0.924840	  1.587314
  0.569299	 -0.912476	  1.573325
  0.560989	 -0.901078	  1.559227
  0.552779	 -0.890054	  1.544674
  0.543779	 -0.879750	  1.530069
  0.535400	 -0.869659	  1.515180
  0.528966	 -0.858173	  1.502385
  0.522102	 -0.841786	  1.491146
  0.513075	 -0.830662	  1.469294
  0.503568	 -0.828161	  1.449367
  0.496400	 -0.826650	  1.436526
  0.484371	 -0.824896	  1.420362
  0.475018	 -0.816309	  1.393008
  0.473537	 -0.805965	  1.377322
  0.472090	 -0.796283	  1.364117
  0.465508	 -0.783503	  1.348337
  0.457290	 -0.771839	  1.333657
  0.452154	 -0.759673	  1.319665
  0.448937	 -0.745891	  1.303557
  0.444213	 -0.733536	  1.286620
  0.436448	 -0.725178	  1.272674
  0.425381	 -0.718502	  1.258608
  0.412207	 -0.712288	  1.244466
  0.400054	 -0.707848	  1.226900
  0.393634	 -0.700419	  1.208212
  0.391768	 -0.685397	  1.188257
  0.388580	 -0.673538	  1.171308
  0.384832	 -0.666625	  1.158227
  0.376305	 -0.658349	  1.137642
  0.366617	 -0.648251	  1.118234
  0.361812	 -0.643845	  1.109923
  0.354019	 -0.636975	  1.092554
  0.348666	 -0.627013	  1.065696
  0.344564	 -0.622411	  1.048221
  0.341086	 -0.618064	  1.038535
  0.332660	 -0.613128	  1.019306
  0.323533	 -0.605536	  1.001188
  0.314612	 -0.598674	  0.980791
  0.307546	 -0.594114	  0.966656
  0.294921	 -0.589447	  0.954003
  0.273605	 -0.587239	  0.936937
  0.263766	 -0.583807	  0.924075
  0.256260	 -0.579193	  0.905880
  0.248049	 -0.569906	  0.877946
  0.243330	 -0.567136	  0.864924
  0.238854	 -0.564376	  0.848214
  0.232820	 -0.563127	  0.826082
  0.226440	 -0.560231	  0.809005
  0.216945	 -0.550823	  0.789209
  0.210086	 -0.539370	  0.771544
  0.205417	 -0.534240	  0.764671
  0.198452	 -0.526986	  0.742872
  0.186967	 -0.522145	  0.723628
  0.173961	 -0.513415	  0.708309
  0.160060	 -0.502364	  0.695449
  0.150157	 -0.496220	  0.688226
  0.135084	 -0.487862	  0.675792
  0.117222	 -0.470835	  0.659244
  0.102717	 -0.458386	  0.640533
  0.095404	 -0.453540	  0.629436
  0.094015	 -0.447540	  0.612596
  0.100323	 -0.431281	  0.594674
  0.102886	 -0.417815	  0.574252
  0.095487	 -0.407135	  0.560190
  0.090418	 -0.397065	  0.549808
  0.079351	 -0.383050	  0.530457
  0.066597	 -0.370345	  0.505964
  0.064655	 -0.367054	  0.500219
  0.062661	 -0.358091	  0.490327
  0.054485	 -0.339861	  0.467821
  0.042207	 -0.329752	  0.453141
  0.031377	 -0.323181	  0.442247
  0.017392	 -0.315485	  0.425802
  0.006223	 -0.303268	  0.409677
 -0.002046	 -0.292876	  0.398387
 -0.008022	 -0.285807	  0.389909
 -0.021656	 -0.272751	  0.374789
 -0.036005	 -0.265607	  0.358092
 -0.048241	 -0.261623	  0.341658
 -0.056374	 -0.255323	  0.324294
 -0.066668	 -0.245416	  0.309902
 -0.077139	 -0.236360	  0.295344
 -0.086201	 -0.226973	  0.280051
 -0.094642	 -0.218089	  0.264408
 -0.102628	 -0.208295	  0.249122
 -0.107481	 -0.199160	  0.233024
 -0.113776	 -0.196036	  0.213018
 -0.119223	 -0.186265	  0.196705
 -0.122054	 -0.165621	  0.182856
 -0.129896	 -0.152442	  0.168670
 -0.143447	 -0.143064	  0.153851
 -0.152730	 -0.134062	  0.139491
 -0.157742	 -0.125109	  0.123930
 -0.161594	 -0.116411	  0.104078
 -0.164345	 -0.110468	  0.086879
 -0.168120	 -0.102807	  0.066348
 -0.174132	 -0.093302	  0.049195
 -0.185707	 -0.083367	  0.033055
 -0.194520	 -0.075194	  0.020879
 -0.198150	 -0.067366	  0.006176
 -0.198134	 -0.059262	 -0.016119
 -0.200124	 -0.054038	 -0.041253
 -0.210290	 -0.050569	 -0.062518
 -0.217242	 -0.045978	 -0.071580
 -0.229910	 -0.038392	 -0.087490
 -0.237353	 -0.026623	 -0.101978
 -0.244758	 -0.013283	 -0.113655
 -0.261023	  0.006324	 -0.132371
 -0.268056	  0.017429	 -0.145098
 -0.272684	  0.023692	 -0.154663
 -0.281399	  0.033058	 -0.174069
 -0.289594	  0.042361	 -0.191399
 -0.298152	  0.048210	 -0.206438
 -0.308376	  0.055240	 -0.222184
 -0.320397	  0.063805	 -0.240807
 -0.328375	  0.073720	 -0.254082
 -0.335364	  0.085181	 -0.270757
 -0.338425	  0.096654	 -0.288550
 -0.340341	  0.103493	 -0.299597
 -0.347665	  0.111576	 -0.319157
 -0.361904	  0.118879	 -0.339503
 -0.369290	  0.124591	 -0.349314
 -0.382231	  0.133877	 -0.368307
 -0.395222	  0.139631	 -0.384228
 -0.406232	  0.148129	 -0.400695
 -0.413097	  0.154555	 -0.413716
 -0.419419	  0.161791	 -0.425255
 -0.438545	  0.170803	 -0.442431
 -0.451591	  0.184660	 -0.459050
 -0.460182	  0.190001	 -0.474740
 -0.467395	  0.189728	 -0.487649
 -0.477404	  0.193600	 -0.504814
 -0.487231	  0.195753	 -0.525618
 -0.497121	  0.197120	 -0.540752
 -0.507753	  0.203103	 -0.557514
 -0.519635	  0.205752	 -0.574571
 -0.535500	  0.205410	 -0.588464
 -0.551552	  0.205640	 -0.600855
 -0.569025	  0.213318	 -0.617084
 -0.577352	  0.217699	 -0.628508
 -0.589641	  0.228763	 -0.646841
 -0.599024	  0.241545	 -0.666408
 -0.603373	  0.246514	 -0.674367
 -0.612592	  0.258609	 -0.687306
 -0.629137	  0.271965	 -0.697323
 -0.645063	  0.283555	 -0.706212
 -0.658636	  0.294353	 -0.717581
 -0.669506	  0.301655	 -0.730233
 -0.679759	  0.308282	 -0.744541
 -0.694986	  0.318400	 -0.759953
 -0.707086	  0.328066	 -0.772536
 -0.712970	  0.337476	 -0.782604
 -0.727715	  0.349711	 -0.797841
 -0.742613	  0.359707	 -0.811159
 -0.754195	  0.367065	 -0.822315
 -0.768407	  0.376720	 -0.835307
 -0.778551	  0.384468	 -0.844476
 -0.792309	  0.397925	 -0.852796
 -0.805475	  0.408083	 -0.866131
 -0.820217	  0.418224	 -0.873730
 -0.831475	  0.424936	 -0.889491
 -0.850210	  0.437360	 -0.900808
 -0.861468	  0.433357	 -0.916031
 -0.875024	  0.445248	 -0.925996
 -0.889300	  0.449130	 -0.949932
 -0.893032	  0.462056	 -0.970931
 -0.906572	  0.466053	 -0.987027
 -0.902094	  0.475167	 -0.998590
 -0.912728	  0.483395	 -1.012276
 -0.921377	  0.493871	 -1.035429
 -0.926451	  0.498111	 -1.056337
 -0.940496	  0.504174	 -1.068447
 -0.942831	  0.507993	 -1.089750
 -0.956684	  0.518444	 -1.097917
 -0.960494	  0.526399	 -1.122372
 -0.966083	  0.536031	 -1.136046
 -0.972314	  0.545742	 -1.151030
 -0.978552	  0.554400	 -1.169034
 -0.982889	  0.559045	 -1.185537
 -0.991037	  0.565689	 -1.205910
 -1.000966	  0.567667	 -1.231796
 -1.004728	  0.567822	 -1.244182
 -1.009663	  0.568362	 -1.264526
 -1.009727	  0.569373	 -1.285817
 -1.011299	  0.571787	 -1.308489
 -1.014045	  0.576211	 -1.323773
 -1.019643	  0.582950	 -1.342111
 -1.026037	  0.587442	 -1.355460
 -1.032334	  0.589514	 -1.379199
 -1.031796	  0.593590	 -1.408407
 -1.030442	  0.599384	 -1.427091
 -1.031027	  0.604949	 -1.436681
 -1.029694	  0.616541	 -1.454423
 -1.032629	  0.627413	 -1.473189
 -1.040105	  0.637164	 -1.491511
 -1.047534	  0.645306	 -1.508788
 -1.052254	  0.653819	 -1.527626
 -1.053180	  0.661503	 -1.545060
 -1.051768	  0.670482	 -1.564034
 -1.051837	  0.677825	 -1.577764
 -1.057010	  0.692046	 -1.600619
 -1.059990	  0.702534	 -1.620743
 -1.059952	  0.705781	 -1.632078
 -1.058689	  0.707634	 -1.648669
 -1.056105	  0.717398	 -1.682127
 -1.056805	  0.728264	 -1.694785
 -1.059760	  0.738973	 -1.705592
 -1.063646	  0.757193	 -1.721060
 -1.065416	  0.769940	 -1.738604
 -1.069677	  0.776538	 -1.758173
 -1.074436	  0.781623	 -1.774178
 -1.078187	  0.786276	 -1.794765
 -1.081818	  0.792535	 -1.814846
 -1.083311	  0.801374	 -1.832486
 -1.083618	  0.808340	 -1.847995
 -1.084116	  0.818564	 -1.870553
 -1.085700	  0.827617	 -1.888887
 -1.088123	  0.831919	 -1.899911
 -1.092409	  0.838975	 -1.925999
 -1.100185	  0.852784	 -1.946272
 -1.104061	  0.861867	 -1.954772
 -1.108104	  0.881984	 -1.970146
 -1.109520	  0.898532	 -1.985054
 -1.109669	  0.907469	 -1.997113
 -1.109032	  0.920157	 -2.013717
 -1.109573	  0.932372	 -2.035652
 -1.116433	  0.939972	 -2.058671
 -1.121442	  0.944219	 -2.074897
 -1.122945	  0.951058	 -2.087257
 -1.127656	  0.960834	 -2.104057
