 -2.418642	  0.452910	  0.453989
 -2.416821	  0.452298	  0.452111
 -2.399481	  0.446476	  0.434234
 -2.386783	  0.433905	  0.413125
 -2.382303	  0.427391	  0.406485
 -2.375590	  0.411561	  0.391674
 -2.367125	  0.400608	  0.376736
 -2.347979	  0.393891	  0.359989
 -2.338433	  0.390861	  0.352640
 -2.323027	  0.384621	  0.338716
 -2.304378	  0.369496	  0.320698
 -2.297731	  0.362126	  0.312598
 -2.290060	  0.355029	  0.303626
 -2.273686	  0.340771	  0.285053
 -2.255741	  0.332589	  0.271404
 -2.244413	  0.329025	  0.263720
 -2.237610	  0.322361	  0.249471
 -2.228825	  0.315203	  0.228138
 -2.217015	  0.308439	  0.211976
 -2.205030	  0.301584	  0.197416
 -2.193172	  0.294513	  0.183239
 -2.187581	  0.286402	  0.169055
 -2.198662	  0.277380	  0.156644
 -2.209411	  0.267780	  0.142711
 -2.220355	  0.259147	  0.128030
 -2.230660	  0.252074	  0.112091
 -2.240700	  0.245593	  0.095831
 -2.250500	  0.239422	  0.079438
 -2.259681	  0.232938	  0.062890
 -2.269066	  0.224748	  0.047864
 -2.280821	  0.214652	  0.035560
 -2.294370	  0.202288	  0.023558
 -2.306050	  0.187776	  0.008545
 -2.312510	  0.176693	 -0.011922
 -2.305253	  0.164708	 -0.038483
 -2.299664	  0.156071	 -0.064455
 -2.297721	  0.152482	 -0.074511
 -2.292282	  0.151404	 -0.094296
 -2.289788	  0.149372	 -0.115345
 -2.286635	  0.146710	 -0.135555
 -2.285098	  0.141987	 -0.157532
 -2.283672	  0.136950	 -0.174192
 -2.280824	  0.132460	 -0.189457
 -2.272363	  0.127544	 -0.213766
 -2.267110	  0.116893	 -0.232072
 -2.264018	  0.109630	 -0.241445
 -2.258351	  0.098960	 -0.255382
 -2.247806	  0.092890	 -0.275667
 -2.240601	  0.085983	 -0.299292
 -2.235939	  0.078058	 -0.318108
 -2.226743	  0.066726	 -0.334834
 -2.209298	  0.053774	 -0.342406
 -2.189286	  0.040744	 -0.340789
 -2.170459	  0.030497	 -0.340157
 -2.150998	  0.022929	 -0.341878
 -2.130664	  0.017470	 -0.343287
 -2.110638	  0.014698	 -0.342024
 -2.090203	  0.011793	 -0.340849
 -2.069787	  0.010379	 -0.341584
 -2.050264	  0.009891	 -0.346394
 -2.031599	  0.013874	 -0.351824
 -2.012148	  0.020647	 -0.357373
 -1.992389	  0.029326	 -0.356921
 -1.972755	  0.034634	 -0.351660
 -1.952227	  0.034283	 -0.343293
 -1.935241	  0.030765	 -0.339973
 -1.912878	  0.026700	 -0.340097
 -1.892453	  0.023750	 -0.341613
 -1.871397	  0.025709	 -0.342372
 -1.851722	  0.028527	 -0.341598
 -1.829609	  0.026897	 -0.341686
 -1.807082	  0.025712	 -0.346431
 -1.785440	  0.032812	 -0.351695
 -1.769530	  0.039674	 -0.350924
 -1.750862	  0.045776	 -0.344292
 -1.730000	  0.058594	 -0.344693
 -1.714841	  0.075991	 -0.352973
 -1.700327	  0.083097	 -0.360307
 -1.684693	  0.086932	 -0.368790
 -1.669945	  0.088536	 -0.379214
 -1.656630	  0.088348	 -0.388834
 -1.641146	  0.093814	 -0.401424
 -1.626400	  0.100352	 -0.415939
 -1.612527	  0.107396	 -0.427982
 -1.598606	  0.108706	 -0.438965
 -1.583683	  0.098840	 -0.452357
 -1.573140	  0.089705	 -0.462665
 -1.562121	  0.080745	 -0.471137
 -1.544090	  0.065033	 -0.488999
 -1.532339	  0.057607	 -0.505321
 -1.518351	  0.051384	 -0.524771
 -1.510113	  0.051162	 -0.535224
 -1.499240	  0.050288	 -0.548148
 -1.481835	  0.046187	 -0.567179
 -1.472246	  0.039660	 -0.574959
 -1.461649	  0.032962	 -0.581717
 -1.442442	  0.022954	 -0.591193
 -1.423993	  0.010179	 -0.601748
 -1.411963	 -0.000494	 -0.613110
 -1.393421	 -0.008342	 -0.629631
 -1.379957	 -0.014690	 -0.643721
 -1.367562	 -0.021036	 -0.661469
 -1.362972	 -0.028080	 -0.674343
 -1.345906	 -0.032284	 -0.693478
 -1.334176	 -0.039643	 -0.702382
 -1.319580	 -0.044850	 -0.713860
 -1.309175	 -0.051128	 -0.725860
 -1.290579	 -0.056887	 -0.745265
 -1.266633	 -0.059754	 -0.765401
 -1.258556	 -0.058136	 -0.773785
 -1.255285	 -0.058034	 -0.777156
 -1.232440	 -0.074033	 -0.790949
 -1.213155	 -0.086301	 -0.810738
 -1.206361	 -0.088180	 -0.830172
 -1.200684	 -0.087333	 -0.848028
 -1.190973	 -0.080841	 -0.869414
 -1.181265	 -0.075258	 -0.903269
 -1.178489	 -0.078193	 -0.914295
 -1.173194	 -0.082075	 -0.932079
 -1.158739	 -0.080919	 -0.951664
 -1.145384	 -0.077904	 -0.963284
 -1.131964	 -0.068830	 -0.974847
 -1.111870	 -0.062372	 -1.001665
 -1.104574	 -0.063424	 -1.010751
 -1.094636	 -0.060819	 -1.021195
 -1.077005	 -0.055809	 -1.033924
 -1.065082	 -0.055777	 -1.052581
 -1.053334	 -0.055578	 -1.068610
 -1.041576	 -0.050978	 -1.085164
 -1.030266	 -0.045981	 -1.101224
 -1.018036	 -0.038178	 -1.115660
 -1.005913	 -0.026674	 -1.127387
 -0.994313	 -0.013775	 -1.137369
 -0.983094	 -0.000378	 -1.146997
 -0.971784	  0.010321	 -1.157760
 -0.958627	  0.014737	 -1.174530
 -0.940860	  0.022449	 -1.190507
 -0.929637	  0.029483	 -1.200045
 -0.916145	  0.034180	 -1.213236
 -0.896828	  0.042295	 -1.228306
 -0.887156	  0.045639	 -1.234271
 -0.877810	  0.049380	 -1.240580
 -0.858684	  0.057402	 -1.253568
 -0.841190	  0.067071	 -1.264711
 -0.829441	  0.077668	 -1.268516
 -0.813236	  0.087075	 -1.276772
 -0.801341	  0.092561	 -1.290615
 -0.799543	  0.093020	 -1.307821
 -0.802361	  0.089970	 -1.327465
 -0.805880	  0.087098	 -1.346993
 -0.809415	  0.083343	 -1.366288
 -0.812935	  0.078014	 -1.385268
 -0.816124	  0.071829	 -1.404045
 -0.819551	  0.064749	 -1.422422
 -0.822974	  0.057136	 -1.440448
 -0.825374	  0.047843	 -1.457647
 -0.826566	  0.035725	 -1.473289
 -0.827463	  0.022974	 -1.488763
 -0.828476	  0.009643	 -1.503705
 -0.829446	 -0.004306	 -1.518049
 -0.830516	 -0.018657	 -1.531842
 -0.828612	 -0.033674	 -1.544194
 -0.820410	 -0.049316	 -1.553690
 -0.812116	 -0.065312	 -1.562507
 -0.803462	 -0.081384	 -1.570694
 -0.794887	 -0.097614	 -1.577688
 -0.781026	 -0.110936	 -1.581237
 -0.764793	 -0.122494	 -1.581794
 -0.748384	 -0.132644	 -1.580590
 -0.730052	 -0.137486	 -1.575975
 -0.711276	 -0.140953	 -1.569940
 -0.692993	 -0.144664	 -1.562688
 -0.674966	 -0.147254	 -1.554291
 -0.657453	 -0.148679	 -1.544363
 -0.640874	 -0.150651	 -1.533472
 -0.624171	 -0.152235	 -1.522387
 -0.607932	 -0.154639	 -1.511016
 -0.590226	 -0.156568	 -1.501800
 -0.570885	 -0.160665	 -1.499118
 -0.552660	 -0.165900	 -1.502730
 -0.534000	 -0.163257	 -1.503763
 -0.506911	 -0.159229	 -1.500531
 -0.486363	 -0.168851	 -1.504542
 -0.470189	 -0.179774	 -1.513589
 -0.456451	 -0.183289	 -1.521778
 -0.435719	 -0.193579	 -1.536774
 -0.424397	 -0.207524	 -1.551734
 -0.418791	 -0.217756	 -1.564750
 -0.411159	 -0.229783	 -1.584516
 -0.398777	 -0.237214	 -1.601911
 -0.389699	 -0.241861	 -1.611357
 -0.371395	 -0.246371	 -1.620343
 -0.353787	 -0.251147	 -1.630924
 -0.339911	 -0.256237	 -1.640519
 -0.318306	 -0.266824	 -1.658037
 -0.302291	 -0.272894	 -1.677596
 -0.296260	 -0.275925	 -1.685479
 -0.284976	 -0.277541	 -1.700600
 -0.272862	 -0.280075	 -1.719355
 -0.263529	 -0.283928	 -1.739587
 -0.253662	 -0.288208	 -1.758445
 -0.243748	 -0.291236	 -1.771453
 -0.230837	 -0.296377	 -1.786720
 -0.218433	 -0.302521	 -1.802275
 -0.208480	 -0.310551	 -1.815247
 -0.196131	 -0.321537	 -1.828511
 -0.183868	 -0.331757	 -1.841187
 -0.170491	 -0.342949	 -1.854721
 -0.156735	 -0.352528	 -1.865060
 -0.139598	 -0.362139	 -1.873983
 -0.125918	 -0.370400	 -1.880420
 -0.109656	 -0.382987	 -1.892281
 -0.097342	 -0.391506	 -1.908163
 -0.090220	 -0.395094	 -1.927421
 -0.085634	 -0.398130	 -1.950311
 -0.081100	 -0.403025	 -1.971458
 -0.072557	 -0.407734	 -1.990032
 -0.058995	 -0.415958	 -2.003418
 -0.041149	 -0.420508	 -2.010649
 -0.017937	 -0.424763	 -2.016029
  0.002289	 -0.433501	 -2.023493
  0.019255	 -0.446551	 -2.034223
  0.030879	 -0.457884	 -2.048304
  0.038827	 -0.461854	 -2.069053
  0.041356	 -0.460117	 -2.092382
  0.047262	 -0.456385	 -2.114931
  0.058124	 -0.453872	 -2.133993
  0.071436	 -0.453717	 -2.149751
  0.083865	 -0.457771	 -2.162865
  0.096208	 -0.468440	 -2.175328
  0.109686	 -0.475632	 -2.188818
  0.127437	 -0.472165	 -2.204415
  0.152556	 -0.472183	 -2.218851
  0.163310	 -0.473981	 -2.223892
  0.175761	 -0.472031	 -2.237255
  0.194208	 -0.463822	 -2.260127
  0.205686	 -0.460959	 -2.267388
  0.221359	 -0.458694	 -2.282212
  0.235301	 -0.464245	 -2.298163
  0.248841	 -0.468971	 -2.311936
  0.265451	 -0.474273	 -2.324402
  0.279085	 -0.481417	 -2.335100
  0.294574	 -0.490582	 -2.347653
  0.307401	 -0.500355	 -2.361437
  0.319346	 -0.509133	 -2.376066
  0.344242	 -0.526934	 -2.401816
  0.356522	 -0.531957	 -2.416781
