 -0.332013	  1.692238	 -1.741596
 -0.324354	  1.716007	 -1.757751
 -0.330888	  1.699404	 -1.748739
 -0.337968	  1.682621	 -1.740552
 -0.345321	  1.665730	 -1.732791
 -0.352148	  1.648646	 -1.725080
 -0.355914	  1.630569	 -1.717537
 -0.358721	  1.612232	 -1.710079
 -0.361417	  1.593869	 -1.702628
 -0.363857	  1.575457	 -1.695229
 -0.364848	  1.556815	 -1.688127
 -0.363923	  1.537908	 -1.681608
 -0.362805	  1.518954	 -1.675267
 -0.360760	  1.500366	 -1.668871
 -0.362074	  1.481553	 -1.663699
 -0.364116	  1.459922	 -1.661900
 -0.361544	  1.437737	 -1.662211
 -0.357202	  1.418410	 -1.658013
 -0.349174	  1.406690	 -1.641474
 -0.332396	  1.392206	 -1.620102
 -0.322651	  1.376027	 -1.610824
 -0.315686	  1.359529	 -1.607294
 -0.309194	  1.338600	 -1.605618
 -0.304130	  1.318944	 -1.603360
 -0.298322	  1.300676	 -1.598952
 -0.291831	  1.282981	 -1.591963
 -0.282985	  1.269568	 -1.583945
 -0.271205	  1.255474	 -1.574718
 -0.260733	  1.240377	 -1.566413
 -0.248844	  1.224227	 -1.554418
 -0.236050	  1.208868	 -1.547081
 -0.224704	  1.194779	 -1.538821
 -0.216708	  1.184285	 -1.531886
 -0.203937	  1.167977	 -1.525752
 -0.191963	  1.153028	 -1.520821
 -0.179112	  1.141548	 -1.509914
 -0.165581	  1.131364	 -1.495774
 -0.156262	  1.125421	 -1.482623
 -0.142843	  1.115051	 -1.465608
 -0.132930	  1.106813	 -1.455123
 -0.123007	  1.098640	 -1.442164
 -0.108015	  1.086051	 -1.424983
 -0.099248	  1.080600	 -1.413654
 -0.090056	  1.075547	 -1.399294
 -0.080734	  1.069665	 -1.380078
 -0.071404	  1.066214	 -1.362169
 -0.062384	  1.061435	 -1.343599
 -0.048018	  1.051607	 -1.326413
 -0.039709	  1.044772	 -1.315335
 -0.031953	  1.038739	 -1.304791
 -0.019504	  1.025115	 -1.290182
 -0.007310	  1.010747	 -1.277320
  0.006749	  0.994924	 -1.268194
  0.020943	  0.984678	 -1.260214
  0.034595	  0.976423	 -1.252425
  0.048758	  0.966209	 -1.242821
  0.060305	  0.955729	 -1.233058
  0.073301	  0.944136	 -1.222441
  0.088135	  0.934903	 -1.211769
  0.102907	  0.926314	 -1.204368
  0.116743	  0.921091	 -1.194454
  0.128470	  0.918707	 -1.183301
  0.140248	  0.919385	 -1.167966
  0.154085	  0.916348	 -1.152191
  0.167324	  0.910041	 -1.136639
  0.178159	  0.903138	 -1.121809
  0.192278	  0.894618	 -1.104266
  0.207116	  0.884061	 -1.091880
  0.220309	  0.872934	 -1.083339
  0.233917	  0.860979	 -1.075613
  0.250449	  0.851975	 -1.065643
  0.265816	  0.840572	 -1.053515
  0.278571	  0.830415	 -1.044153
  0.290831	  0.821381	 -1.032685
  0.299251	  0.812562	 -1.017538
  0.309556	  0.802113	 -1.000893
  0.318117	  0.797570	 -0.990864
  0.333104	  0.789987	 -0.972696
  0.340740	  0.779433	 -0.955723
  0.345229	  0.772625	 -0.944963
  0.355568	  0.760300	 -0.926727
  0.362544	  0.748473	 -0.906953
  0.364469	  0.743311	 -0.890377
  0.372189	  0.735594	 -0.878191
  0.382171	  0.726860	 -0.864373
  0.390963	  0.711979	 -0.839219
  0.394678	  0.706038	 -0.826093
  0.400839	  0.701888	 -0.812585
  0.409894	  0.688936	 -0.796143
  0.418807	  0.675742	 -0.772842
  0.422526	  0.666961	 -0.760134
  0.424640	  0.658303	 -0.747162
  0.423623	  0.644069	 -0.728971
  0.426366	  0.626067	 -0.710268
  0.427170	  0.615627	 -0.701483
  0.427016	  0.596757	 -0.683872
  0.427405	  0.581425	 -0.669377
  0.426745	  0.570964	 -0.658727
  0.429107	  0.555697	 -0.642634
  0.434725	  0.543684	 -0.629918
  0.443415	  0.529930	 -0.610244
  0.448866	  0.522120	 -0.592654
  0.451077	  0.513482	 -0.577801
  0.451974	  0.501121	 -0.560832
  0.455994	  0.490832	 -0.546107
  0.458615	  0.483265	 -0.534087
  0.461354	  0.464305	 -0.509468
  0.463823	  0.452639	 -0.498987
  0.466701	  0.440199	 -0.489277
  0.468287	  0.422466	 -0.472674
  0.467806	  0.410055	 -0.458319
  0.467795	  0.402863	 -0.440317
  0.469294	  0.392978	 -0.411730
  0.474763	  0.387578	 -0.392049
  0.480052	  0.382577	 -0.379333
  0.486883	  0.377734	 -0.361219
  0.491425	  0.370974	 -0.347485
  0.497435	  0.356576	 -0.318694
  0.501959	  0.344794	 -0.302537
  0.504692	  0.338841	 -0.291276
  0.509516	  0.330223	 -0.275600
  0.512609	  0.324809	 -0.255969
  0.513312	  0.331759	 -0.231094
  0.518543	  0.342263	 -0.213799
  0.529255	  0.350051	 -0.200486
  0.542867	  0.353787	 -0.180878
  0.552287	  0.360996	 -0.163348
  0.558264	  0.372338	 -0.149066
  0.561765	  0.379171	 -0.141043
  0.567439	  0.390683	 -0.128455
  0.576683	  0.404890	 -0.117386
  0.587554	  0.416368	 -0.108931
  0.601824	  0.429983	 -0.102034
  0.617109	  0.442166	 -0.098152
  0.633029	  0.457309	 -0.096128
  0.642096	  0.469586	 -0.095147
  0.652048	  0.488946	 -0.098341
  0.667404	  0.505701	 -0.099071
  0.681226	  0.516087	 -0.100004
  0.696482	  0.524264	 -0.104541
  0.711262	  0.533096	 -0.119666
  0.726421	  0.545660	 -0.138826
  0.739541	  0.558279	 -0.153563
  0.748697	  0.564749	 -0.158778
  0.760653	  0.573922	 -0.163784
  0.777888	  0.589186	 -0.167131
  0.794872	  0.608718	 -0.166581
  0.808753	  0.634865	 -0.169791
  0.815775	  0.647233	 -0.175920
  0.826167	  0.668438	 -0.181013
  0.834981	  0.685364	 -0.184628
  0.843020	  0.698351	 -0.185709
  0.853587	  0.711354	 -0.182893
  0.867360	  0.731432	 -0.176338
  0.882611	  0.754117	 -0.182716
  0.891656	  0.767019	 -0.186983
  0.901196	  0.779026	 -0.189680
  0.910127	  0.792544	 -0.193252
  0.922401	  0.811682	 -0.195722
  0.933260	  0.826797	 -0.198260
  0.944492	  0.843628	 -0.194027
  0.959124	  0.858707	 -0.194616
  0.973967	  0.868125	 -0.197412
  0.988773	  0.880326	 -0.197903
  1.001456	  0.897432	 -0.197690
  1.016778	  0.904982	 -0.197348
  1.029952	  0.917746	 -0.197861
  1.048767	  0.928891	 -0.198803
  1.060090	  0.942064	 -0.199700
  1.076435	  0.949200	 -0.203034
  1.091446	  0.957796	 -0.204525
  1.108868	  0.965809	 -0.202635
  1.128569	  0.969603	 -0.203829
  1.148605	  0.972628	 -0.206052
  1.163537	  0.975962	 -0.207972
  1.184003	  0.978486	 -0.213185
  1.200640	  0.980864	 -0.217011
  1.213505	  0.980036	 -0.223775
  1.230761	  0.984090	 -0.227942
  1.255661	  0.987111	 -0.232570
  1.278906	  0.986638	 -0.240801
  1.290682	  0.986271	 -0.237811
  1.310146	  0.987878	 -0.247724
  1.326451	  0.987385	 -0.256587
  1.346571	  0.988225	 -0.271253
  1.359363	  0.989303	 -0.275784
  1.380613	  0.992681	 -0.283154
  1.403550	  0.994324	 -0.296758
  1.413445	  0.997270	 -0.301940
  1.432363	  1.004895	 -0.311528
  1.449889	  1.006799	 -0.321861
  1.467027	  1.008326	 -0.328231
  1.488694	  1.010941	 -0.333318
  1.510449	  1.016189	 -0.342370
  1.523520	  1.020999	 -0.350305
  1.540272	  1.027361	 -0.358979
  1.556900	  1.032832	 -0.366830
  1.576452	  1.039155	 -0.374111
  1.594719	  1.046444	 -0.379309
  1.611918	  1.056032	 -0.382096
  1.629188	  1.068494	 -0.384909
  1.643524	  1.081276	 -0.385342
  1.660645	  1.089567	 -0.385242
  1.682368	  1.094622	 -0.383410
  1.702674	  1.103284	 -0.380129
  1.719983	  1.114944	 -0.374447
  1.734084	  1.129379	 -0.364238
  1.744990	  1.144131	 -0.350756
  1.750637	  1.152712	 -0.336381
  1.758208	  1.160236	 -0.318481
  1.767107	  1.169877	 -0.293542
  1.769243	  1.174980	 -0.280004
  1.771180	  1.181071	 -0.261617
  1.782847	  1.189875	 -0.232157
  1.786780	  1.194809	 -0.221038
  1.788834	  1.197425	 -0.209589
  1.792004	  1.200480	 -0.186045
  1.796171	  1.198867	 -0.163248
  1.802062	  1.199571	 -0.145760
  1.810051	  1.203359	 -0.127733
  1.818890	  1.205947	 -0.109891
  1.822401	  1.205218	 -0.089723
  1.822058	  1.202746	 -0.070440
  1.820697	  1.199752	 -0.050982
  1.818937	  1.196926	 -0.031606
  1.818500	  1.194326	 -0.011041
  1.819375	  1.190739	  0.007745
  1.822200	  1.187347	  0.027073
  1.825682	  1.181865	  0.045790
  1.828379	  1.174056	  0.062386
  1.830625	  1.165764	  0.080572
  1.833878	  1.158467	  0.103661
  1.836290	  1.154858	  0.123067
  1.839765	  1.151732	  0.139215
  1.842722	  1.146068	  0.160209
  1.843369	  1.136388	  0.176650
  1.845110	  1.125393	  0.189447
  1.842657	  1.109264	  0.209880
  1.841018	  1.097364	  0.225750
  1.840901	  1.089879	  0.238359
  1.841855	  1.077537	  0.256443
  1.843053	  1.069065	  0.272801
  1.844061	  1.056291	  0.288545
  1.845326	  1.040976	  0.307531
  1.846300	  1.033653	  0.320971
  1.849340	  1.023414	  0.336429
  1.856170	  1.010518	  0.352661
  1.864017	  0.995723	  0.365418
  1.872498	  0.981375	  0.376972
  1.883125	  0.967771	  0.388397
  1.891944	  0.954265	  0.400291
  1.898814	  0.941535	  0.410589
  1.908392	  0.929193	  0.417656
  1.924719	  0.913383	  0.424343
  1.945568	  0.899073	  0.431708
  1.961257	  0.884591	  0.441329
  1.971879	  0.871574	  0.449081
  1.983993	  0.857043	  0.459841
  1.990820	  0.841563	  0.468603
  1.997091	  0.828377	  0.474641
  2.011346	  0.809347	  0.482713
  2.029215	  0.791785	  0.492417
  2.041900	  0.779696	  0.495048
  2.057292	  0.771456	  0.497214
  2.070799	  0.762099	  0.503231
  2.088424	  0.754920	  0.512637
  2.111373	  0.740171	  0.520818
  2.125061	  0.730448	  0.526209
  2.134648	  0.723354	  0.534284
  2.156289	  0.716829	  0.543928
  2.172886	  0.711893	  0.557518
  2.193098	  0.712620	  0.570553
  2.211461	  0.715671	  0.578167
  2.229178	  0.720105	  0.590890
  2.242682	  0.719254	  0.605978
  2.257453	  0.716874	  0.619882
  2.272069	  0.717999	  0.632867
  2.289056	  0.718662	  0.652480
  2.304605	  0.711725	  0.668886
  2.318408	  0.699465	  0.677921
  2.335806	  0.676929	  0.677139
  2.351038	  0.671217	  0.688774
