 -1.500896	 -0.628330	 -1.792394
 -1.497747	 -0.631482	 -1.802662
 -1.504244	 -0.626267	 -1.785388
 -1.509964	 -0.618711	 -1.765989
 -1.514582	 -0.614095	 -1.748540
 -1.518682	 -0.609592	 -1.728536
 -1.524552	 -0.602743	 -1.709794
 -1.533003	 -0.595446	 -1.694346
 -1.539886	 -0.589051	 -1.676182
 -1.546379	 -0.583206	 -1.658286
 -1.555800	 -0.576412	 -1.641657
 -1.564045	 -0.569692	 -1.623807
 -1.568388	 -0.566019	 -1.605958
 -1.577626	 -0.560863	 -1.588036
 -1.586324	 -0.553682	 -1.569295
 -1.591528	 -0.550895	 -1.553177
 -1.599055	 -0.547956	 -1.533136
 -1.605420	 -0.543099	 -1.512523
 -1.614519	 -0.536788	 -1.498521
 -1.623647	 -0.531712	 -1.482595
 -1.632945	 -0.526977	 -1.464177
 -1.641444	 -0.522495	 -1.446434
 -1.649787	 -0.518615	 -1.428676
 -1.658130	 -0.514740	 -1.410917
 -1.665774	 -0.512478	 -1.392575
 -1.673280	 -0.510525	 -1.374140
 -1.680739	 -0.509173	 -1.355632
 -1.688169	 -0.508159	 -1.337091
 -1.695584	 -0.507023	 -1.318552
 -1.702547	 -0.502745	 -1.300299
 -1.709508	 -0.498456	 -1.282047
 -1.716470	 -0.493773	 -1.263892
 -1.723415	 -0.487912	 -1.246076
 -1.730359	 -0.482051	 -1.228259
 -1.738040	 -0.476396	 -1.210680
 -1.746810	 -0.471069	 -1.193513
 -1.755578	 -0.465742	 -1.176344
 -1.765175	 -0.460644	 -1.159554
 -1.775639	 -0.455806	 -1.143211
 -1.786085	 -0.450996	 -1.126866
 -1.797119	 -0.447215	 -1.110647
 -1.808645	 -0.443543	 -1.094590
 -1.819907	 -0.440524	 -1.079101
 -1.832253	 -0.437903	 -1.063169
 -1.845995	 -0.432570	 -1.047586
 -1.859592	 -0.426231	 -1.034697
 -1.871997	 -0.420789	 -1.021879
 -1.886312	 -0.415726	 -1.007236
 -1.901468	 -0.412570	 -0.992185
 -1.909719	 -0.413461	 -0.975960
 -1.919748	 -0.411360	 -0.958650
 -1.934811	 -0.409414	 -0.940834
 -1.948767	 -0.405252	 -0.929575
 -1.963860	 -0.399009	 -0.916808
 -1.975939	 -0.396325	 -0.901239
 -1.987673	 -0.394835	 -0.884297
 -1.996460	 -0.393045	 -0.867154
 -2.007732	 -0.390191	 -0.850189
 -2.018567	 -0.386209	 -0.833806
 -2.029216	 -0.382155	 -0.817246
 -2.038752	 -0.377279	 -0.800268
 -2.047044	 -0.371705	 -0.782846
 -2.053130	 -0.365999	 -0.764545
 -2.058105	 -0.360271	 -0.745972
 -2.061386	 -0.354528	 -0.727011
 -2.064166	 -0.349159	 -0.708280
 -2.066934	 -0.344834	 -0.689337
 -2.069973	 -0.342108	 -0.669559
 -2.074230	 -0.335939	 -0.647992
 -2.078443	 -0.329550	 -0.631704
 -2.083548	 -0.322555	 -0.614018
 -2.088956	 -0.316641	 -0.594278
 -2.095757	 -0.307482	 -0.578245
 -2.103621	 -0.297537	 -0.562356
 -2.109245	 -0.290982	 -0.545130
 -2.115288	 -0.289212	 -0.523513
 -2.123717	 -0.284653	 -0.504221
 -2.133428	 -0.281000	 -0.489364
 -2.142480	 -0.278252	 -0.472041
 -2.152740	 -0.276281	 -0.455848
 -2.164333	 -0.272701	 -0.438238
 -2.171020	 -0.267837	 -0.420586
 -2.178458	 -0.260791	 -0.401327
 -2.189419	 -0.253971	 -0.384461
 -2.200797	 -0.255048	 -0.370897
 -2.213050	 -0.254490	 -0.353466
 -2.223636	 -0.249388	 -0.336230
 -2.231696	 -0.244458	 -0.320241
 -2.238802	 -0.242304	 -0.301342
 -2.244969	 -0.239694	 -0.282515
 -2.257305	 -0.234237	 -0.263472
 -2.267067	 -0.231600	 -0.247129
 -2.271288	 -0.230941	 -0.230302
 -2.274982	 -0.227429	 -0.210417
 -2.281256	 -0.222869	 -0.190625
 -2.286202	 -0.218117	 -0.172867
 -2.292059	 -0.218048	 -0.150385
 -2.299316	 -0.216068	 -0.134451
 -2.305361	 -0.210064	 -0.116147
 -2.309640	 -0.205379	 -0.096264
 -2.316439	 -0.202678	 -0.077317
 -2.325823	 -0.198651	 -0.060698
 -2.332375	 -0.194334	 -0.041993
 -2.338113	 -0.190346	 -0.023022
 -2.347007	 -0.186868	 -0.005745
 -2.355504	 -0.183496	  0.012676
 -2.360571	 -0.179272	  0.030796
 -2.366185	 -0.172557	  0.049699
 -2.373895	 -0.166006	  0.067938
 -2.380917	 -0.162264	  0.086923
 -2.387770	 -0.160661	  0.103314
 -2.400049	 -0.158109	  0.120599
 -2.410050	 -0.156567	  0.139666
 -2.414756	 -0.150705	  0.159837
 -2.423015	 -0.146741	  0.177616
