 -0.863141	  2.083504	  2.023586
 -0.854595	  2.062875	  2.003550
 -0.828869	  2.036879	  1.974688
 -0.820147	  2.005817	  1.936178
 -0.802399	  1.969707	  1.906623
 -0.787103	  1.938800	  1.870571
 -0.770967	  1.902031	  1.841378
 -0.751114	  1.871139	  1.807748
 -0.737906	  1.842190	  1.769573
 -0.724071	  1.810510	  1.732796
 -0.708376	  1.779486	  1.695754
 -0.692545	  1.748923	  1.659292
 -0.676200	  1.718220	  1.622113
 -0.659082	  1.688058	  1.584593
 -0.640974	  1.660798	  1.548319
 -0.621985	  1.643250	  1.514984
 -0.598231	  1.641061	  1.478977
 -0.552553	  1.668962	  1.432218
 -0.494575	  1.717233	  1.396355
 -0.451281	  1.750913	  1.367574
 -0.383464	  1.782348	  1.325068
 -0.341855	  1.787819	  1.295726
 -0.321004	  1.786937	  1.281287
 -0.256601	  1.763047	  1.238741
 -0.168413	  1.718895	  1.164828
 -0.081945	  1.661601	  1.080408
 -0.001765	  1.603120	  1.013578
  0.046523	  1.559082	  0.979046
  0.069062	  1.526646	  0.958695
  0.076767	  1.493382	  0.938375
  0.071166	  1.436758	  0.902591
  0.035268	  1.355230	  0.852453
 -0.021665	  1.255871	  0.798542
 -0.074413	  1.165458	  0.760437
 -0.109611	  1.115875	  0.754378
 -0.151160	  1.062347	  0.756529
 -0.187659	  1.000939	  0.756905
 -0.210778	  0.938350	  0.747511
 -0.217790	  0.889975	  0.730378
 -0.216200	  0.846234	  0.704841
 -0.209496	  0.806598	  0.672153
 -0.199515	  0.772176	  0.635964
 -0.187382	  0.740994	  0.598539
 -0.173568	  0.711463	  0.560896
 -0.158072	  0.681705	  0.522583
 -0.141250	  0.652429	  0.485113
 -0.123255	  0.623979	  0.450033
 -0.103663	  0.594016	  0.414697
 -0.083723	  0.563295	  0.381399
 -0.062795	  0.530526	  0.347481
 -0.042977	  0.497500	  0.315010
 -0.025196	  0.465027	  0.285143
 -0.008089	  0.430822	  0.255539
  0.009312	  0.392447	  0.225267
  0.027054	  0.354023	  0.193815
  0.043493	  0.319531	  0.162202
  0.059734	  0.286181	  0.130006
  0.075602	  0.252613	  0.094874
  0.089537	  0.220347	  0.058853
  0.102922	  0.189312	  0.025207
  0.118301	  0.157502	 -0.008883
  0.135493	  0.126197	 -0.043859
  0.153440	  0.095799	 -0.079562
  0.172664	  0.066002	 -0.116100
  0.192196	  0.037092	 -0.152040
  0.211302	  0.007659	 -0.187687
  0.229221	 -0.023261	 -0.221873
  0.245811	 -0.053951	 -0.255198
  0.262493	 -0.086150	 -0.290448
  0.279271	 -0.118097	 -0.326728
  0.295487	 -0.149221	 -0.363210
  0.310012	 -0.179872	 -0.398504
  0.324704	 -0.211949	 -0.434260
  0.339782	 -0.244056	 -0.469357
  0.354657	 -0.275702	 -0.504367
  0.370257	 -0.307047	 -0.540927
  0.387190	 -0.336811	 -0.577304
  0.405222	 -0.365856	 -0.614113
  0.423649	 -0.393906	 -0.650388
  0.441695	 -0.421096	 -0.686384
  0.460590	 -0.449513	 -0.723788
  0.480653	 -0.478755	 -0.760400
  0.500297	 -0.506842	 -0.794460
  0.519241	 -0.536114	 -0.830339
  0.535050	 -0.565600	 -0.866120
  0.549566	 -0.595891	 -0.901960
  0.564619	 -0.628083	 -0.938791
  0.580116	 -0.661555	 -0.972595
  0.597550	 -0.695852	 -1.005806
  0.615835	 -0.731191	 -1.038783
  0.634207	 -0.767739	 -1.069399
  0.650494	 -0.805013	 -1.098663
  0.665419	 -0.840891	 -1.127477
  0.680734	 -0.876871	 -1.158225
  0.695439	 -0.913681	 -1.189779
  0.709783	 -0.950431	 -1.221192
  0.724852	 -0.986827	 -1.252358
  0.741516	 -1.023235	 -1.285053
  0.759119	 -1.057395	 -1.318511
  0.776703	 -1.088597	 -1.352179
  0.795289	 -1.118757	 -1.388441
  0.814020	 -1.146827	 -1.426130
  0.832420	 -1.173833	 -1.463946
  0.849836	 -1.198993	 -1.499991
  0.868139	 -1.224593	 -1.537199
  0.886835	 -1.251548	 -1.575933
  0.905023	 -1.279893	 -1.613912
  0.923274	 -1.309466	 -1.649199
  0.940578	 -1.341629	 -1.683315
  0.955780	 -1.377831	 -1.717928
  0.969449	 -1.413803	 -1.749491
  0.984734	 -1.449730	 -1.781182
  1.001378	 -1.485758	 -1.815879
  1.017802	 -1.519771	 -1.849523
  1.035201	 -1.552172	 -1.882209
  1.052054	 -1.583397	 -1.914983
  1.068340	 -1.614602	 -1.948689
  1.084566	 -1.646653	 -1.983769
  1.100625	 -1.678178	 -2.019795
  1.116957	 -1.708608	 -2.057783
  1.132041	 -1.739532	 -2.096559
  1.137608	 -1.772730	 -2.136182
  1.148984	 -1.790458	 -2.157544
