  2.256118	  0.883358	 -0.395822
  2.273123	  0.889350	 -0.396991
  2.244306	  0.879195	 -0.395009
  2.198739	  0.864008	 -0.391498
  2.152853	  0.849297	 -0.387761
  2.106768	  0.836116	 -0.383632
  2.059186	  0.824192	 -0.379138
  2.007873	  0.812089	 -0.374421
  1.958782	  0.799514	 -0.371321
  1.916558	  0.788398	 -0.367757
  1.866871	  0.770399	 -0.360430
  1.808501	  0.752550	 -0.356939
  1.753920	  0.742338	 -0.357136
  1.697454	  0.735270	 -0.359024
  1.642188	  0.723342	 -0.362787
  1.593930	  0.710055	 -0.366175
  1.551003	  0.696060	 -0.367986
  1.509682	  0.681185	 -0.367749
  1.461314	  0.662338	 -0.364240
  1.401467	  0.635735	 -0.356642
  1.333955	  0.601051	 -0.345920
  1.268068	  0.563692	 -0.335312
  1.213750	  0.532772	 -0.328025
  1.176998	  0.514465	 -0.324678
  1.155514	  0.506927	 -0.323441
  1.135282	  0.503011	 -0.322605
  1.101445	  0.501095	 -0.321878
  1.051861	  0.502060	 -0.322132
  0.994731	  0.503722	 -0.323743
  0.938244	  0.501944	 -0.326124
  0.886049	  0.496055	 -0.328016
  0.834395	  0.485600	 -0.329649
  0.785138	  0.471320	 -0.331269
  0.741201	  0.455846	 -0.332038
  0.698839	  0.439096	 -0.331235
  0.654907	  0.420047	 -0.329383
  0.609305	  0.400082	 -0.327091
  0.562519	  0.380530	 -0.324950
  0.515266	  0.361792	 -0.323011
  0.468097	  0.344022	 -0.321649
  0.424050	  0.327719	 -0.320293
  0.383235	  0.313215	 -0.318173
  0.341355	  0.299264	 -0.314540
  0.295529	  0.284544	 -0.309788
  0.247372	  0.269720	 -0.304938
  0.198598	  0.255428	 -0.300421
  0.149054	  0.241793	 -0.295953
  0.096876	  0.228923	 -0.291704
  0.040222	  0.216495	 -0.288752
 -0.020400	  0.204600	 -0.288684
 -0.081665	  0.193107	 -0.292016
 -0.141981	  0.181587	 -0.298541
 -0.200199	  0.169952	 -0.307734
 -0.254525	  0.158685	 -0.318374
 -0.303785	  0.148341	 -0.329155
 -0.349394	  0.139178	 -0.339235
 -0.387402	  0.131910	 -0.346681
 -0.421004	  0.125515	 -0.350759
 -0.454268	  0.118718	 -0.351820
 -0.490100	  0.111516	 -0.350416
 -0.527697	  0.105054	 -0.347161
 -0.564344	  0.100918	 -0.342908
 -0.598927	  0.099613	 -0.338148
 -0.634903	  0.101078	 -0.332455
 -0.680193	  0.105967	 -0.325499
 -0.738243	  0.114841	 -0.318398
 -0.802725	  0.126247	 -0.312902
 -0.867631	  0.140768	 -0.307196
 -0.935260	  0.160701	 -0.301456
 -1.005298	  0.184263	 -0.298398
 -1.074924	  0.208047	 -0.300733
 -1.143925	  0.230381	 -0.310384
 -1.215723	  0.251443	 -0.329255
 -1.296919	  0.270863	 -0.360540
 -1.389489	  0.286605	 -0.407972
 -1.491066	  0.294039	 -0.472835
 -1.593152	  0.287626	 -0.552570
 -1.685131	  0.262328	 -0.640393
 -1.759348	  0.217459	 -0.726121
 -1.811465	  0.165296	 -0.800265
 -1.846004	  0.118229	 -0.853458
 -1.867587	  0.083482	 -0.881523
 -1.880881	  0.061735	 -0.864320
 -1.901418	  0.020950	 -0.805625
 -1.922096	 -0.034749	 -0.707671
 -1.944348	 -0.099911	 -0.597004
 -1.974277	 -0.169628	 -0.499859
 -2.014185	 -0.232712	 -0.437935
 -2.056076	 -0.274852	 -0.416043
 -2.088458	 -0.295098	 -0.414187
 -2.119848	 -0.306981	 -0.418414
 -2.158278	 -0.317106	 -0.426618
 -2.198565	 -0.326299	 -0.434283
 -2.239104	 -0.334277	 -0.439451
 -2.280834	 -0.341524	 -0.442264
 -2.322762	 -0.347839	 -0.442759
 -2.402557	 -0.358272	 -0.438572
 -2.417966	 -0.360221	 -0.437408
