  0.789658	 -0.665490	 -2.318246
  0.798194	 -0.692770	 -2.332719
  0.792413	 -0.675784	 -2.323888
  0.785780	 -0.658909	 -2.315454
  0.779040	 -0.642050	 -2.307068
  0.771895	 -0.625290	 -2.298821
  0.764733	 -0.608540	 -2.290565
  0.757846	 -0.591881	 -2.281936
  0.751856	 -0.575960	 -2.271747
  0.746887	 -0.560833	 -2.259257
  0.742476	 -0.545762	 -2.246127
  0.735805	 -0.532242	 -2.233688
  0.726096	 -0.518150	 -2.222712
  0.717938	 -0.503590	 -2.210470
  0.714931	 -0.483227	 -2.198830
  0.713975	 -0.462383	 -2.192549
  0.708411	 -0.442620	 -2.192034
  0.698545	 -0.424420	 -2.190803
  0.689936	 -0.407620	 -2.185335
  0.683975	 -0.390332	 -2.177036
  0.676618	 -0.374236	 -2.169575
  0.667350	 -0.353806	 -2.168026
  0.663865	 -0.330949	 -2.166046
  0.664588	 -0.315092	 -2.158265
  0.664606	 -0.298531	 -2.145542
  0.663234	 -0.278921	 -2.133950
  0.660147	 -0.259496	 -2.129329
  0.652491	 -0.241467	 -2.129910
  0.644639	 -0.220766	 -2.129743
  0.641966	 -0.201310	 -2.123931
  0.640814	 -0.185683	 -2.112308
  0.641301	 -0.169149	 -2.098764
  0.641201	 -0.146359	 -2.090927
  0.636833	 -0.129431	 -2.090928
  0.629135	 -0.109506	 -2.088931
  0.622768	 -0.088769	 -2.076438
  0.624620	 -0.073598	 -2.059572
  0.631874	 -0.059803	 -2.045017
  0.643767	 -0.042118	 -2.035199
  0.645670	 -0.025626	 -2.034741
  0.644338	 -0.005910	 -2.028742
  0.649394	  0.011624	 -2.020093
  0.658683	  0.027616	 -2.011970
  0.662688	  0.047275	 -2.000297
  0.666448	  0.063411	 -1.988890
  0.674355	  0.075331	 -1.978625
  0.686183	  0.088103	 -1.965101
  0.693332	  0.102897	 -1.952136
  0.700056	  0.116436	 -1.945201
  0.710217	  0.135604	 -1.938619
  0.722783	  0.151871	 -1.931174
  0.733411	  0.161171	 -1.924996
  0.748831	  0.175775	 -1.913679
  0.760277	  0.192013	 -1.902352
  0.766401	  0.201895	 -1.893550
  0.772483	  0.216774	 -1.885424
  0.777009	  0.238808	 -1.879097
  0.782632	  0.262007	 -1.872566
  0.793747	  0.278107	 -1.874082
  0.807953	  0.287494	 -1.871857
  0.828636	  0.296327	 -1.873838
  0.845190	  0.314051	 -1.874921
  0.851519	  0.334692	 -1.882954
  0.851985	  0.350350	 -1.887049
  0.859839	  0.363432	 -1.895155
  0.873365	  0.372720	 -1.912597
  0.883436	  0.380173	 -1.929265
  0.890112	  0.390762	 -1.945238
  0.896192	  0.401506	 -1.960929
  0.898781	  0.414056	 -1.976176
  0.899994	  0.427332	 -1.991095
  0.901142	  0.440616	 -2.005975
  0.902016	  0.453728	 -2.020283
  0.898409	  0.469609	 -2.029047
  0.892576	  0.492130	 -2.036705
  0.890906	  0.509224	 -2.048763
  0.890978	  0.521758	 -2.065035
  0.888430	  0.534722	 -2.076022
  0.884688	  0.551795	 -2.086689
  0.882307	  0.566279	 -2.099106
  0.878317	  0.583305	 -2.112311
  0.869929	  0.599579	 -2.117086
  0.856237	  0.614691	 -2.116076
  0.844946	  0.632571	 -2.117136
  0.838494	  0.648455	 -2.123729
  0.829540	  0.662638	 -2.132174
  0.813771	  0.681048	 -2.132375
  0.799040	  0.695763	 -2.126792
  0.788122	  0.706293	 -2.124846
  0.771123	  0.711517	 -2.121708
  0.751247	  0.717220	 -2.113930
  0.733824	  0.724592	 -2.105973
  0.716887	  0.731878	 -2.098181
  0.699962	  0.739155	 -2.090399
  0.683072	  0.746373	 -2.082533
  0.666972	  0.752547	 -2.073246
  0.655433	  0.759406	 -2.060670
  0.641752	  0.770615	 -2.044625
  0.624407	  0.772083	 -2.030473
  0.607239	  0.765807	 -2.019456
  0.591699	  0.764011	 -2.007371
  0.577432	  0.766410	 -1.994598
  0.561164	  0.765412	 -1.982659
  0.544443	  0.764848	 -1.968449
  0.533279	  0.766276	 -1.955403
  0.519703	  0.765092	 -1.942757
  0.501576	  0.764034	 -1.925997
  0.489651	  0.769543	 -1.911392
  0.480409	  0.773423	 -1.897496
  0.466893	  0.768605	 -1.881434
  0.452832	  0.764256	 -1.866407
  0.439396	  0.762226	 -1.851577
  0.426037	  0.760269	 -1.836816
  0.412779	  0.758302	 -1.821983
  0.401464	  0.756147	 -1.805693
  0.394890	  0.753685	 -1.787009
  0.388583	  0.751203	 -1.768194
  0.382277	  0.748721	 -1.749377
  0.375971	  0.746240	 -1.730560
  0.369666	  0.743758	 -1.711743
  0.363360	  0.741277	 -1.692926
  0.357054	  0.738795	 -1.674109
  0.350749	  0.736314	 -1.655292
  0.344367	  0.733803	 -1.636518
  0.337689	  0.731051	 -1.618125
  0.330211	  0.726411	 -1.602060
  0.322195	  0.716822	 -1.586867
  0.318671	  0.706230	 -1.571510
  0.312365	  0.702554	 -1.542851
  0.309419	  0.701743	 -1.527495
  0.308563	  0.695940	 -1.505245
  0.305426	  0.689174	 -1.488291
  0.300085	  0.680593	 -1.475065
  0.298134	  0.667251	 -1.461703
  0.303203	  0.661526	 -1.444301
  0.305246	  0.659619	 -1.425539
  0.309834	  0.662272	 -1.412360
  0.318246	  0.667692	 -1.395027
  0.326449	  0.671109	 -1.375869
  0.337555	  0.671414	 -1.360443
  0.356562	  0.670431	 -1.341915
  0.369604	  0.669961	 -1.326358
  0.376718	  0.669511	 -1.314752
  0.384696	  0.678810	 -1.295281
  0.386243	  0.685571	 -1.278389
  0.394402	  0.691507	 -1.258974
  0.405241	  0.699660	 -1.239453
  0.418378	  0.706752	 -1.226169
  0.429326	  0.712072	 -1.217121
  0.441560	  0.713185	 -1.208975
  0.467943	  0.720714	 -1.200648
  0.486483	  0.731121	 -1.183874
  0.489711	  0.738484	 -1.163031
  0.489623	  0.748235	 -1.137577
  0.490916	  0.759613	 -1.119720
  0.491661	  0.771194	 -1.106014
  0.496120	  0.786090	 -1.092960
  0.497796	  0.803052	 -1.082420
  0.506904	  0.821773	 -1.070035
  0.512438	  0.834192	 -1.064588
  0.521304	  0.849094	 -1.057963
  0.529988	  0.867998	 -1.041753
  0.534538	  0.883117	 -1.025460
  0.534018	  0.897458	 -1.017399
  0.533903	  0.912483	 -1.007238
  0.536568	  0.932236	 -0.996413
  0.540323	  0.951085	 -0.986886
  0.543496	  0.963251	 -0.979484
  0.544148	  0.983179	 -0.968976
  0.545013	  1.006348	 -0.958091
  0.546299	  1.017555	 -0.952186
  0.549996	  1.035768	 -0.943032
  0.554227	  1.052377	 -0.934151
  0.560098	  1.070122	 -0.928112
  0.563133	  1.090206	 -0.926535
  0.563466	  1.110521	 -0.923212
  0.564878	  1.127953	 -0.918498
  0.566768	  1.147727	 -0.913363
  0.565318	  1.169004	 -0.908180
  0.562684	  1.189088	 -0.909042
  0.562228	  1.207379	 -0.916906
  0.561623	  1.226739	 -0.926458
  0.559812	  1.245302	 -0.930717
  0.558187	  1.264060	 -0.933839
  0.557637	  1.282543	 -0.941920
  0.552566	  1.303017	 -0.951911
  0.544174	  1.320997	 -0.954616
  0.537568	  1.340713	 -0.954324
  0.538778	  1.357298	 -0.955652
  0.535892	  1.378843	 -0.956950
  0.529709	  1.397952	 -0.954565
  0.523918	  1.416963	 -0.952037
  0.518219	  1.436002	 -0.950102
  0.511656	  1.454921	 -0.949375
  0.504993	  1.473769	 -0.948623
  0.498260	  1.492583	 -0.947782
  0.490979	  1.511180	 -0.946735
  0.483089	  1.529516	 -0.945493
  0.475155	  1.547829	 -0.944215
  0.466925	  1.565974	 -0.942517
  0.458818	  1.584136	 -0.940549
  0.451156	  1.602459	 -0.938292
  0.443701	  1.620795	 -0.935608
  0.436909	  1.639192	 -0.932466
  0.430795	  1.658233	 -0.928975
  0.425052	  1.677205	 -0.925306
  0.417994	  1.695543	 -0.920915
  0.409504	  1.712630	 -0.915314
  0.401035	  1.729735	 -0.909584
  0.391881	  1.746429	 -0.904051
  0.383078	  1.763298	 -0.897477
  0.375263	  1.779734	 -0.889140
  0.368254	  1.796257	 -0.880271
  0.362761	  1.812797	 -0.870475
  0.357735	  1.829347	 -0.860405
  0.352939	  1.846010	 -0.850505
  0.349862	  1.862395	 -0.840101
  0.349252	  1.879737	 -0.829126
  0.348609	  1.896613	 -0.818328
  0.344779	  1.911381	 -0.805686
  0.337314	  1.927294	 -0.792351
  0.327729	  1.942348	 -0.783602
  0.313505	  1.966132	 -0.781846
  0.309662	  1.984951	 -0.780549
  0.308877	  2.001303	 -0.774351
  0.306687	  2.016853	 -0.760592
  0.300145	  2.031999	 -0.747760
  0.288200	  2.052999	 -0.742220
  0.282540	  2.072452	 -0.740713
  0.280896	  2.089386	 -0.736562
  0.278435	  2.107967	 -0.727386
  0.272336	  2.126060	 -0.718981
  0.266745	  2.144402	 -0.712820
  0.264927	  2.162829	 -0.708039
  0.264322	  2.182919	 -0.703822
  0.256639	  2.204489	 -0.701711
  0.246442	  2.222190	 -0.696704
  0.239104	  2.235896	 -0.688502
  0.234618	  2.254283	 -0.679082
  0.227505	  2.273579	 -0.673680
  0.218615	  2.291597	 -0.671246
  0.210411	  2.311413	 -0.667879
  0.209041	  2.327781	 -0.660683
  0.207235	  2.347802	 -0.651405
  0.207084	  2.368087	 -0.637356
  0.203026	  2.385804	 -0.629009
