 -0.341933	 -1.613898	  1.880404
 -0.342522	 -1.611851	  1.880057
 -0.347389	 -1.594925	  1.877187
 -0.353266	 -1.576157	  1.873555
 -0.359202	 -1.557416	  1.869876
 -0.365335	 -1.538738	  1.866209
 -0.371360	 -1.520021	  1.862545
 -0.377697	 -1.501382	  1.859128
 -0.384367	 -1.482808	  1.855889
 -0.391184	 -1.464208	  1.853352
 -0.398108	 -1.445573	  1.852371
 -0.404457	 -1.426556	  1.852050
 -0.410391	 -1.407482	  1.853006
 -0.416183	 -1.388316	  1.854007
 -0.421960	 -1.369188	  1.854531
 -0.427439	 -1.350472	  1.854796
 -0.429961	 -1.331402	  1.857603
 -0.431328	 -1.311856	  1.864627
 -0.433323	 -1.290880	  1.869637
 -0.432451	 -1.269812	  1.869194
 -0.431647	 -1.248283	  1.863021
 -0.435541	 -1.226886	  1.854123
 -0.442374	 -1.208029	  1.847159
 -0.451041	 -1.190137	  1.844615
 -0.455952	 -1.172418	  1.846688
 -0.460012	 -1.152139	  1.851951
 -0.464817	 -1.132445	  1.855744
 -0.470691	 -1.112294	  1.855798
 -0.478351	 -1.093160	  1.853816
 -0.487426	 -1.075017	  1.851763
 -0.497171	 -1.058553	  1.850279
 -0.503773	 -1.039410	  1.851726
 -0.509033	 -1.019884	  1.853349
 -0.514506	 -1.000169	  1.851282
 -0.523781	 -0.982603	  1.849640
 -0.533166	 -0.964853	  1.849129
 -0.540813	 -0.946129	  1.849078
 -0.545547	 -0.926658	  1.848568
 -0.548235	 -0.906827	  1.848455
 -0.550667	 -0.886982	  1.848069
 -0.552709	 -0.867093	  1.847802
 -0.552790	 -0.847188	  1.848145
 -0.552679	 -0.827165	  1.848155
 -0.552361	 -0.807164	  1.847847
 -0.551808	 -0.787174	  1.847548
 -0.551211	 -0.767180	  1.847406
 -0.551466	 -0.747174	  1.847125
 -0.551985	 -0.727189	  1.846497
 -0.552698	 -0.707229	  1.845237
 -0.553522	 -0.687304	  1.843534
 -0.554541	 -0.667418	  1.841501
 -0.556166	 -0.647749	  1.838263
 -0.557399	 -0.628118	  1.834721
 -0.559433	 -0.608633	  1.830390
 -0.559963	 -0.590296	  1.824591
 -0.556540	 -0.570312	  1.818300
 -0.558154	 -0.549828	  1.813114
 -0.568776	 -0.534523	  1.806083
 -0.587749	 -0.516350	  1.801705
 -0.600076	 -0.494905	  1.798866
 -0.603142	 -0.479031	  1.794865
 -0.602744	 -0.462837	  1.790393
 -0.603176	 -0.439573	  1.783005
 -0.609575	 -0.420503	  1.776840
 -0.619250	 -0.405540	  1.771721
 -0.630794	 -0.388954	  1.765834
 -0.636022	 -0.371174	  1.759126
 -0.636164	 -0.353916	  1.752294
 -0.632846	 -0.332283	  1.745156
 -0.637488	 -0.307268	  1.738835
 -0.643076	 -0.294379	  1.735309
 -0.652916	 -0.277195	  1.731990
 -0.660836	 -0.257894	  1.727111
 -0.666526	 -0.240866	  1.723196
 -0.673103	 -0.223218	  1.720697
 -0.679473	 -0.193340	  1.715731
 -0.680397	 -0.181909	  1.713910
 -0.680697	 -0.162351	  1.712561
 -0.680458	 -0.141730	  1.711325
 -0.680619	 -0.123376	  1.710867
 -0.683399	 -0.099438	  1.711597
 -0.686842	 -0.080172	  1.714098
 -0.689767	 -0.062690	  1.714255
 -0.692980	 -0.041696	  1.714773
 -0.689000	 -0.017178	  1.712986
 -0.686152	 -0.000947	  1.710055
 -0.683848	  0.020348	  1.706390
 -0.686319	  0.037972	  1.706222
 -0.690936	  0.056791	  1.709090
 -0.697756	  0.076579	  1.713830
 -0.705292	  0.099168	  1.713368
 -0.710171	  0.115525	  1.708432
 -0.713884	  0.135716	  1.700224
 -0.716223	  0.157178	  1.693888
 -0.718503	  0.179037	  1.689606
 -0.721717	  0.192185	  1.686824
 -0.732593	  0.210658	  1.684256
 -0.743645	  0.228242	  1.680850
 -0.750432	  0.247800	  1.676782
 -0.757874	  0.265401	  1.670086
 -0.765851	  0.282507	  1.662459
 -0.772051	  0.299875	  1.653172
 -0.775373	  0.318132	  1.643168
 -0.776753	  0.336788	  1.633722
 -0.775801	  0.356582	  1.627409
 -0.773497	  0.378078	  1.623842
 -0.772706	  0.398243	  1.623194
 -0.775157	  0.417501	  1.622430
 -0.779867	  0.436486	  1.620522
 -0.784857	  0.454845	  1.619954
 -0.790005	  0.474000	  1.619488
 -0.795906	  0.498414	  1.615648
 -0.800787	  0.518552	  1.610650
 -0.803055	  0.534185	  1.607791
 -0.807820	  0.552249	  1.605621
 -0.813467	  0.581102	  1.601912
 -0.815715	  0.596628	  1.599904
 -0.814548	  0.609576	  1.599335
 -0.817208	  0.634760	  1.604643
 -0.818741	  0.658251	  1.611279
 -0.818279	  0.677224	  1.613527
 -0.818053	  0.691132	  1.613475
 -0.817538	  0.706687	  1.614842
 -0.818661	  0.724296	  1.616170
 -0.826731	  0.749815	  1.620925
 -0.832935	  0.769609	  1.619976
 -0.837413	  0.779926	  1.620614
 -0.846218	  0.798411	  1.620178
 -0.858853	  0.821472	  1.623847
 -0.867116	  0.831656	  1.630330
 -0.874974	  0.843133	  1.637483
 -0.894065	  0.862578	  1.655778
 -0.902296	  0.870337	  1.661190
 -0.911270	  0.880036	  1.668998
 -0.929924	  0.892686	  1.684806
 -0.943698	  0.904182	  1.696312
 -0.952227	  0.913826	  1.701883
 -0.963917	  0.925865	  1.707275
 -0.979217	  0.942053	  1.715410
 -0.992303	  0.955169	  1.724571
 -1.005099	  0.967474	  1.734055
 -1.017637	  0.979462	  1.743476
 -1.030413	  0.992053	  1.753225
 -1.042359	  1.005844	  1.762396
 -1.053021	  1.019695	  1.769873
 -1.061932	  1.033098	  1.776144
 -1.066231	  1.051726	  1.776892
 -1.072967	  1.077995	  1.775687
 -1.079380	  1.093804	  1.775042
 -1.086361	  1.106351	  1.772001
 -1.094199	  1.127427	  1.759559
 -1.098214	  1.141438	  1.753562
 -1.099253	  1.158171	  1.747134
 -1.094412	  1.179333	  1.740603
 -1.090801	  1.190719	  1.737342
 -1.082907	  1.212265	  1.737960
 -1.069678	  1.237649	  1.738797
 -1.068133	  1.258905	  1.730501
 -1.072693	  1.270032	  1.721370
 -1.071696	  1.283793	  1.706467
 -1.064472	  1.302603	  1.698928
 -1.056680	  1.316220	  1.683917
 -1.051525	  1.330879	  1.659880
 -1.049514	  1.339897	  1.648282
 -1.045609	  1.353452	  1.633920
 -1.040296	  1.367849	  1.619756
 -1.037151	  1.381615	  1.609068
 -1.032949	  1.399195	  1.594361
 -1.027392	  1.411587	  1.577307
 -1.023512	  1.417657	  1.564786
 -1.018173	  1.428264	  1.544374
 -1.015559	  1.449995	  1.526123
 -1.015485	  1.460767	  1.520455
 -1.014489	  1.472955	  1.515284
 -1.012657	  1.495305	  1.507871
 -1.016557	  1.516513	  1.506363
 -1.021125	  1.536030	  1.505595
 -1.025629	  1.555516	  1.505432
 -1.030130	  1.575002	  1.505374
 -1.034470	  1.594521	  1.505012
 -1.037996	  1.614104	  1.502989
 -1.041534	  1.633680	  1.500987
 -1.045480	  1.653210	  1.499955
 -1.049574	  1.672490	  1.500692
 -1.052802	  1.696331	  1.504683
 -1.053982	  1.712535	  1.507523
