 0.0 0.0 0.0 0
 -0.6066518245620535 -0.7531100999279029 0.25515630727480687 1000
 -0.32472355575129525 -0.2670736263125817 -0.9069929936159833 1000
 0.8772213255666383 0.41600790283710076 0.2397105979054487 1000
 0.11178167932769748 0.17271720795813011 -0.9790013392441442 1000
 0.28989035694780224 0.7067395352345155 -0.6451998219816687 1000
 0.46178272200419257 -0.19799035962736525 0.8643752282157474 1000
 0.29803206858914455 0.9543698847164654 -0.022737837160911434 1000
 -0.35486958964067034 -0.38508134898042046 0.8522111997713255 1000
 0.0 0.0 0.0 0
 0.8162135127998027 0.5750832440977023 -0.058495844989787715 1000
 -0.2998738174739342 0.8316646176445834 0.4664318356970274 1000
 0.17729640852956333 -0.045798703338817914 0.9828160877269976 1000
 0.22477528917463813 -0.9673222694903683 0.11887681155070276 1000
 0.47470802116872324 0.0542945779523589 -0.8786093520120591 1000
 -0.3466289711604759 -0.8750037291161901 0.33711397239656415 1000
 -0.98771179483027 -0.15469507532759044 0.0009187070033413874 1000
 -0.2554176955018526 0.4952170989544146 0.8300535077497696 1000
 0.0 0.0 0.0 0
 -0.8021395451085247 -0.4262788341485212 0.4169706293374471 1000
 0.012329961251921873 -0.831883611361398 -0.5538760052609653 1000
 -0.4743376491288844 -0.3925481392647756 -0.787144048429921 1000
 -0.4563113395394503 -0.5574101508877717 0.6936950951931147 1000
 -0.8226110055064103 0.5281595319743623 0.20908286014007768 1000
 -0.13413760589864007 0.9045865534196087 -0.4051459861040396 1000
 -0.720776804253861 -0.17477883830248445 -0.6706997511041922 1000
 -0.926432409973836 -0.37513949390001294 -0.012463942655214832 1000
 0.0 0.0 0.0 0
 0.6796768067983953 -0.7337754059715873 0.011273503961472503 1000
 -0.42917016020964327 -0.6889268860132681 -0.5834566987478084 1000
 0.7790454670728032 0.27828406217541535 -0.5621264457152568 1000
 -0.35538948573477275 0.4443333899220775 -0.8220244230128014 1000
 -0.6841030427235264 -0.7290444547956858 -0.004605417253026878 1000
 0.7702209773112381 -0.4139206513950274 0.4842213754662611 1000
 0.2526969104278257 0.42870207813435374 0.8673268124896856 1000
 0.9215512582895414 -0.3319509431394284 -0.2004216797000934 1000
 0.0 0.0 0.0 0
 0.4077687002830168 -0.5317252665020967 -0.7427017759725457 1000
 -0.5200260493431449 0.7728730188603241 -0.36378593255139796 1000
 0.193026316167613 -0.7796067895099839 -0.5953604748525858 1000
 -0.7203591960095556 0.5701765707110488 0.39428581883787683 1000
