  0.052662	  1.273883	  2.130726
  0.041445	  1.284266	  2.146657
  0.051607	  1.274862	  2.132224
  0.061752	  1.265671	  2.117649
  0.071491	  1.259783	  2.101209
  0.081225	  1.253936	  2.084745
  0.090996	  1.248108	  2.068301
  0.103105	  1.243842	  2.052970
  0.115406	  1.239700	  2.037753
  0.127034	  1.234428	  2.022361
  0.137982	  1.228109	  2.006863
  0.148901	  1.221476	  1.991476
  0.159772	  1.214217	  1.976340
  0.170637	  1.206932	  1.961208
  0.181394	  1.199832	  1.945919
  0.192147	  1.192761	  1.930598
  0.202839	  1.185800	  1.915184
  0.213339	  1.179223	  1.899494
  0.224010	  1.172603	  1.883996
  0.235876	  1.166967	  1.869500
  0.250205	  1.161108	  1.855972
  0.263965	  1.152756	  1.841836
  0.275724	  1.144685	  1.828298
  0.284924	  1.140711	  1.810985
  0.294918	  1.138395	  1.793032
  0.305841	  1.131621	  1.777856
  0.316492	  1.115286	  1.764257
  0.328848	  1.102819	  1.751388
  0.342074	  1.100510	  1.735351
  0.353275	  1.098463	  1.717875
  0.357740	  1.096049	  1.700189
  0.366100	  1.089951	  1.680075
  0.369709	  1.088999	  1.659819
  0.375375	  1.086652	  1.640401
  0.385195	  1.080819	  1.623352
  0.394201	  1.075371	  1.605969
  0.401326	  1.071057	  1.587951
  0.408221	  1.066334	  1.569734
  0.415499	  1.061092	  1.551809
  0.422810	  1.055832	  1.533955
  0.429698	  1.050342	  1.515996
  0.436548	  1.044821	  1.498034
  0.443292	  1.039366	  1.480014
  0.449831	  1.034041	  1.461878
  0.456369	  1.028721	  1.443740
  0.463154	  1.023926	  1.425549
  0.470103	  1.019481	  1.407329
  0.477058	  1.015048	  1.389109
  0.484477	  1.011462	  1.370886
  0.491964	  1.008002	  1.352666
  0.499377	  1.004689	  1.334389
  0.506515	  1.001923	  1.315911
  0.513645	  0.999164	  1.297431
  0.520395	  0.996460	  1.278800
  0.526872	  0.993763	  1.260073
  0.533064	  0.988463	  1.241812
  0.538971	  0.981395	  1.224063
  0.543009	  0.972559	  1.206584
  0.546754	  0.963460	  1.189172
  0.551493	  0.954661	  1.171849
  0.557250	  0.946203	  1.154665
  0.563047	  0.937752	  1.137490
  0.570214	  0.929677	  1.120656
  0.577527	  0.921643	  1.103864
  0.584999	  0.913893	  1.087010
  0.592875	  0.906895	  1.070103
  0.601495	  0.898600	  1.054703
  0.613088	  0.890115	  1.041424
  0.627939	  0.885256	  1.023972
  0.636762	  0.883802	  1.004441
  0.638736	  0.879245	  0.985974
  0.642261	  0.872840	  0.965821
  0.650847	  0.870128	  0.947686
  0.663124	  0.867157	  0.933282
  0.677095	  0.863092	  0.918818
  0.690163	  0.864409	  0.898953
  0.695341	  0.863318	  0.882523
  0.702433	  0.859723	  0.863597
  0.711209	  0.858557	  0.845038
  0.720623	  0.856546	  0.828304
  0.726863	  0.852771	  0.810391
  0.734294	  0.854892	  0.786826
  0.745509	  0.857407	  0.774838
  0.761004	  0.855995	  0.759756
  0.774331	  0.856755	  0.741215
  0.775723	  0.856282	  0.715744
  0.770953	  0.854392	  0.697487
  0.770947	  0.856776	  0.680059
  0.770422	  0.864602	  0.652286
  0.765794	  0.864559	  0.633938
  0.764700	  0.861160	  0.621387
  0.759786	  0.855423	  0.599648
  0.750129	  0.852576	  0.579431
  0.745774	  0.848010	  0.557588
  0.733644	  0.844011	  0.542644
  0.715809	  0.849228	  0.531656
  0.694139	  0.858922	  0.522505
  0.676343	  0.863122	  0.511666
  0.667087	  0.867065	  0.496905
  0.661396	  0.870739	  0.474751
  0.651652	  0.874463	  0.456957
  0.639467	  0.882784	  0.443397
  0.626725	  0.891541	  0.429605
  0.614656	  0.894632	  0.416847
  0.599853	  0.896925	  0.396962
  0.595771	  0.903324	  0.379637
  0.593685	  0.913982	  0.363095
  0.587218	  0.928117	  0.343206
  0.579183	  0.935025	  0.328862
  0.573409	  0.941561	  0.315237
  0.568558	  0.947365	  0.292033
  0.562789	  0.950333	  0.273677
  0.555422	  0.947799	  0.256419
  0.545913	  0.947538	  0.239700
  0.539051	  0.952022	  0.223189
  0.533772	  0.958929	  0.200363
  0.525337	  0.963041	  0.182558
  0.516995	  0.965458	  0.165398
  0.505317	  0.966037	  0.147293
  0.496626	  0.966493	  0.126900
  0.492020	  0.966952	  0.112972
  0.488296	  0.969077	  0.093996
  0.478212	  0.965907	  0.069215
  0.481116	  0.959844	  0.042471
  0.478592	  0.955553	  0.030587
  0.487582	  0.958409	  0.010816
  0.493138	  0.965365	 -0.006701
  0.495537	  0.977631	 -0.026468
  0.505962	  0.980322	 -0.045127
  0.508641	  0.982091	 -0.065209
  0.516854	  0.970133	 -0.082649
  0.521530	  0.962930	 -0.100261
  0.529855	  0.946464	 -0.106071
  0.532886	  0.945376	 -0.127586
  0.543723	  0.931904	 -0.142882
  0.541961	  0.930931	 -0.160574
  0.552552	  0.919749	 -0.179360
  0.570418	  0.908126	 -0.190410
  0.574336	  0.896766	 -0.202588
  0.592244	  0.890114	 -0.205132
  0.609217	  0.877065	 -0.212409
  0.624847	  0.862897	 -0.220772
  0.637085	  0.854188	 -0.230631
  0.652959	  0.845808	 -0.236509
  0.668689	  0.838961	 -0.247133
  0.686808	  0.832290	 -0.256491
  0.699426	  0.827316	 -0.267249
  0.709104	  0.809243	 -0.268462
  0.732353	  0.803232	 -0.279328
  0.745136	  0.785791	 -0.268659
  0.764154	  0.786891	 -0.273730
  0.781608	  0.773719	 -0.278701
  0.793428	  0.759845	 -0.280968
  0.808894	  0.743186	 -0.290771
  0.822107	  0.723171	 -0.289575
  0.832622	  0.710286	 -0.286747
  0.846876	  0.697029	 -0.277117
  0.865430	  0.687744	 -0.268379
  0.880509	  0.680392	 -0.260687
  0.897180	  0.668643	 -0.259167
  0.913135	  0.654635	 -0.263599
  0.930952	  0.637337	 -0.263901
  0.945957	  0.629063	 -0.254202
  0.962983	  0.627075	 -0.238199
  0.979842	  0.623096	 -0.224816
  0.997338	  0.609197	 -0.220099
  1.012531	  0.591531	 -0.224145
  1.031550	  0.578937	 -0.228177
  1.045131	  0.575057	 -0.223286
  1.066701	  0.570962	 -0.220657
  1.087257	  0.566866	 -0.222164
  1.106445	  0.560496	 -0.221289
  1.125100	  0.555127	 -0.224981
  1.142667	  0.550124	 -0.233252
  1.160100	  0.545114	 -0.241692
  1.176517	  0.540690	 -0.252219
  1.189979	  0.537706	 -0.266429
  1.204929	  0.534792	 -0.278535
  1.220896	  0.530661	 -0.292960
  1.233353	  0.525491	 -0.309830
  1.239968	  0.522195	 -0.330247
  1.244244	  0.525940	 -0.347847
  1.251795	  0.530132	 -0.367369
  1.257603	  0.529279	 -0.389370
  1.265741	  0.523327	 -0.403625
  1.275051	  0.519013	 -0.421938
  1.283003	  0.517887	 -0.440863
  1.291514	  0.516692	 -0.457456
  1.305593	  0.510958	 -0.474454
  1.315586	  0.505906	 -0.491584
  1.323863	  0.505571	 -0.508058
  1.330043	  0.508890	 -0.529224
  1.335009	  0.511063	 -0.551775
  1.343279	  0.509692	 -0.567476
  1.358791	  0.508637	 -0.584080
  1.374065	  0.507425	 -0.598981
  1.388901	  0.503187	 -0.611654
  1.402557	  0.497239	 -0.623237
  1.417678	  0.492950	 -0.638869
  1.430973	  0.490161	 -0.654658
  1.439597	  0.485008	 -0.667860
  1.446947	  0.476622	 -0.686210
  1.456445	  0.472294	 -0.710504
  1.469469	  0.468570	 -0.725376
  1.483337	  0.463649	 -0.735685
  1.493985	  0.457491	 -0.746062
  1.501676	  0.452393	 -0.767368
  1.504952	  0.443851	 -0.786373
  1.512925	  0.431719	 -0.800917
  1.531347	  0.422549	 -0.815247
  1.542677	  0.418741	 -0.830133
  1.550193	  0.413192	 -0.846415
  1.560813	  0.402250	 -0.862575
  1.568982	  0.396563	 -0.876813
  1.576336	  0.396089	 -0.896002
  1.588387	  0.397161	 -0.915324
  1.599798	  0.392485	 -0.933367
  1.605922	  0.378962	 -0.950764
  1.610215	  0.362910	 -0.963829
  1.618624	  0.351644	 -0.981168
  1.626520	  0.353794	 -0.995955
  1.638210	  0.355197	 -1.018074
  1.646693	  0.349980	 -1.035603
  1.651083	  0.341730	 -1.050662
  1.655575	  0.335633	 -1.070128
  1.665716	  0.328727	 -1.088879
  1.678952	  0.320966	 -1.102913
  1.693142	  0.317307	 -1.120993
  1.701594	  0.317644	 -1.134102
  1.712650	  0.314078	 -1.152169
  1.720547	  0.306808	 -1.169912
  1.725888	  0.300955	 -1.187777
  1.735932	  0.294156	 -1.204291
  1.745168	  0.286375	 -1.222607
  1.748884	  0.281456	 -1.243282
  1.752149	  0.276809	 -1.257644
  1.760433	  0.267931	 -1.275698
  1.768486	  0.260284	 -1.293094
  1.776181	  0.254006	 -1.310328
  1.781471	  0.249003	 -1.328972
  1.786584	  0.245134	 -1.349439
  1.794568	  0.239935	 -1.367422
  1.803506	  0.233434	 -1.381660
  1.813852	  0.225247	 -1.398354
  1.822681	  0.216774	 -1.414820
  1.828892	  0.203709	 -1.432941
  1.832942	  0.197708	 -1.448235
  1.838999	  0.194108	 -1.467594
  1.845231	  0.187434	 -1.486042
  1.853634	  0.179138	 -1.501290
  1.863833	  0.169940	 -1.517691
  1.869154	  0.160025	 -1.537668
  1.872392	  0.157997	 -1.553914
  1.879907	  0.154620	 -1.573360
  1.887898	  0.149714	 -1.591336
  1.899447	  0.149690	 -1.611937
  1.910292	  0.130471	 -1.651876
  1.917409	  0.125176	 -1.669801
