  2.926781	  0.773782	  0.126937
  2.897803	  0.766121	  0.125681
  2.867763	  0.788456	  0.102216
  2.832949	  0.795311	  0.062975
  2.795811	  0.804848	  0.033230
  2.754380	  0.816191	  0.005782
  2.719824	  0.834691	 -0.027874
  2.690591	  0.842032	 -0.059871
  2.648900	  0.854654	 -0.093653
  2.617052	  0.866413	 -0.125903
  2.579767	  0.888255	 -0.158299
  2.542828	  0.893391	 -0.184268
  2.510046	  0.911039	 -0.219050
  2.471662	  0.919960	 -0.249067
  2.433930	  0.939003	 -0.278377
  2.396727	  0.944394	 -0.312968
  2.364490	  0.961672	 -0.341732
  2.331718	  0.972958	 -0.374947
  2.289718	  0.988301	 -0.412246
  2.257738	  0.998230	 -0.443188
  2.222228	  1.012198	 -0.471662
  2.184805	  1.020371	 -0.501705
  2.149089	  1.032427	 -0.536176
  2.113653	  1.045177	 -0.567031
  2.079290	  1.058820	 -0.600632
  2.047042	  1.071431	 -0.631792
  2.006694	  1.085472	 -0.667521
  1.974015	  1.095494	 -0.695100
  1.934864	  1.109303	 -0.728593
  1.901482	  1.120705	 -0.757110
  1.861117	  1.134474	 -0.789656
  1.825363	  1.147285	 -0.821172
  1.790330	  1.159630	 -0.854398
  1.759470	  1.169410	 -0.885117
  1.723210	  1.183837	 -0.919414
  1.690399	  1.193286	 -0.950792
  1.649042	  1.208824	 -0.983742
  1.611928	  1.220981	 -1.015509
  1.578078	  1.233689	 -1.045670
  1.544528	  1.246358	 -1.075173
  1.506447	  1.260808	 -1.109961
  1.470389	  1.275514	 -1.144011
  1.439201	  1.287721	 -1.173318
  1.401903	  1.301365	 -1.205731
  1.363768	  1.313574	 -1.239109
  1.326602	  1.325335	 -1.271702
  1.294735	  1.333872	 -1.302818
  1.261337	  1.344881	 -1.333770
  1.221294	  1.360384	 -1.369468
  1.182582	  1.373753	 -1.401455
  1.148673	  1.384474	 -1.429846
  1.115063	  1.396583	 -1.461830
  1.078062	  1.411680	 -1.497885
  1.043637	  1.424704	 -1.531163
  1.010279	  1.436363	 -1.561019
  0.973475	  1.447677	 -1.595226
  0.936456	  1.459312	 -1.625895
  0.900813	  1.471815	 -1.656948
  0.868535	  1.483355	 -1.685302
  0.832063	  1.496469	 -1.718609
  0.797273	  1.508082	 -1.748773
  0.757678	  1.523115	 -1.779473
  0.721121	  1.534692	 -1.815015
  0.688820	  1.550110	 -1.843926
  0.653883	  1.565535	 -1.872779
  0.614099	  1.571584	 -1.910540
  0.581458	  1.582721	 -1.938258
  0.541005	  1.598798	 -1.974513
  0.502214	  1.612731	 -1.998786
  0.474543	  1.623534	 -2.034586
  0.437341	  1.633994	 -2.068242
  0.396811	  1.646937	 -2.101653
  0.367691	  1.662527	 -2.135252
  0.330337	  1.675851	 -2.166016
  0.290098	  1.689799	 -2.197936
  0.258821	  1.698441	 -2.222864
  0.223407	  1.707364	 -2.254144
  0.183859	  1.724163	 -2.293738
  0.150320	  1.733576	 -2.320937
  0.116662	  1.749795	 -2.352458
  0.079260	  1.766221	 -2.387064
  0.037281	  1.769019	 -2.422639
  0.037654	  1.786709	 -2.446866
