 -1.677040	 -0.066285	  1.818890
 -1.689928	 -0.063559	  1.820984
 -1.670604	 -0.067644	  1.817851
 -1.651242	 -0.071647	  1.815006
 -1.631529	 -0.074891	  1.814840
 -1.611781	 -0.077957	  1.815187
 -1.591992	 -0.080238	  1.816318
 -1.572157	 -0.081771	  1.818876
 -1.552306	 -0.084032	  1.821082
 -1.532500	 -0.087038	  1.821859
 -1.512759	 -0.090485	  1.821593
 -1.493066	 -0.093900	  1.820921
 -1.473235	 -0.096590	  1.820054
 -1.453405	 -0.099084	  1.819219
 -1.433537	 -0.101062	  1.818066
 -1.413663	 -0.102866	  1.816673
 -1.393767	 -0.104360	  1.815156
 -1.373888	 -0.105422	  1.813113
 -1.354014	 -0.106173	  1.811028
 -1.334074	 -0.106483	  1.809398
 -1.314103	 -0.106367	  1.808179
 -1.294137	 -0.106129	  1.807000
 -1.274168	 -0.105357	  1.806106
 -1.254239	 -0.104449	  1.805241
 -1.234387	 -0.103810	  1.803890
 -1.214504	 -0.102183	  1.802059
 -1.195427	 -0.099797	  1.799970
 -1.177016	 -0.094866	  1.792982
 -1.155378	 -0.086150	  1.786616
 -1.134040	 -0.078801	  1.785738
 -1.118738	 -0.075862	  1.787111
 -1.099147	 -0.072734	  1.786155
 -1.076063	 -0.067738	  1.786011
 -1.058490	 -0.066341	  1.788316
 -1.038869	 -0.063786	  1.788254
 -1.016780	 -0.058420	  1.789400
 -0.998678	 -0.056856	  1.795644
 -0.979403	 -0.053167	  1.805058
 -0.954699	 -0.049536	  1.808855
 -0.936539	 -0.051030	  1.810693
 -0.920062	 -0.053901	  1.815186
 -0.894927	 -0.063480	  1.818468
 -0.874301	 -0.071928	  1.819396
 -0.859632	 -0.074024	  1.820783
 -0.835511	 -0.076474	  1.824105
 -0.815533	 -0.083449	  1.825773
 -0.802059	 -0.090978	  1.825977
 -0.781024	 -0.100476	  1.827916
 -0.762370	 -0.106101	  1.831804
 -0.743293	 -0.108156	  1.835157
 -0.721911	 -0.107879	  1.838343
 -0.704007	 -0.107547	  1.841291
 -0.683535	 -0.108305	  1.845314
 -0.664031	 -0.108212	  1.849760
 -0.646377	 -0.105519	  1.853672
 -0.620922	 -0.104467	  1.859043
 -0.599032	 -0.109666	  1.859709
 -0.587269	 -0.114330	  1.858576
 -0.561802	 -0.124393	  1.855205
 -0.534030	 -0.123510	  1.853208
 -0.520154	 -0.119783	  1.852165
 -0.506421	 -0.112889	  1.849509
 -0.481889	 -0.114175	  1.845819
 -0.462080	 -0.118648	  1.841828
 -0.441747	 -0.117488	  1.838555
 -0.423056	 -0.113748	  1.832249
 -0.407882	 -0.108254	  1.827170
 -0.399173	 -0.092463	  1.824769
 -0.394091	 -0.072465	  1.821436
 -0.386697	 -0.055029	  1.817586
 -0.376420	 -0.040169	  1.814592
 -0.361513	 -0.025896	  1.807626
 -0.349509	 -0.009750	  1.797122
 -0.344552	  0.007143	  1.789720
 -0.342116	  0.024329	  1.785582
 -0.341370	  0.045426	  1.783960
 -0.336082	  0.066378	  1.783371
 -0.328131	  0.088339	  1.776394
 -0.317589	  0.105290	  1.767430
 -0.304930	  0.118023	  1.763633
 -0.287664	  0.128440	  1.761034
 -0.258237	  0.135307	  1.750000
 -0.235971	  0.135905	  1.743127
 -0.225456	  0.137734	  1.741103
 -0.212367	  0.140148	  1.736450
 -0.195559	  0.153342	  1.733665
 -0.172741	  0.173015	  1.720946
 -0.160117	  0.179053	  1.709994
 -0.145561	  0.177709	  1.699755
 -0.129564	  0.166579	  1.691361
 -0.118571	  0.156776	  1.685222
 -0.104982	  0.147271	  1.675456
 -0.091736	  0.133618	  1.668023
 -0.074915	  0.120545	  1.659560
 -0.066265	  0.114806	  1.657381
 -0.047984	  0.103600	  1.652690
 -0.034123	  0.098557	  1.644720
 -0.023918	  0.088115	  1.638296
 -0.011891	  0.073941	  1.630115
 -0.004921	  0.061057	  1.626399
  0.002797	  0.042145	  1.618347
  0.012808	  0.021236	  1.611302
  0.018019	  0.009249	  1.607646
  0.027057	 -0.011434	  1.602937
  0.033945	 -0.030003	  1.596420
  0.037129	 -0.046304	  1.589482
  0.040312	 -0.069104	  1.582863
  0.041206	 -0.082059	  1.582168
  0.045392	 -0.104461	  1.584417
  0.051355	 -0.129571	  1.589533
  0.055835	 -0.140502	  1.589791
  0.071822	 -0.156854	  1.586467
  0.090136	 -0.172724	  1.574172
  0.096011	 -0.194901	  1.561219
  0.098685	 -0.213099	  1.549679
  0.101186	 -0.226128	  1.543831
  0.106009	 -0.237674	  1.538864
  0.113638	 -0.254973	  1.533921
  0.125000	 -0.271721	  1.525978
  0.133947	 -0.283770	  1.516676
  0.145714	 -0.300004	  1.506008
  0.161773	 -0.318517	  1.492953
  0.169954	 -0.327420	  1.486221
  0.180069	 -0.336960	  1.480822
  0.196307	 -0.357256	  1.475463
  0.204099	 -0.377480	  1.471437
  0.207568	 -0.389102	  1.468869
  0.218104	 -0.411690	  1.465318
  0.228496	 -0.430225	  1.461631
  0.238014	 -0.446128	  1.456439
  0.251405	 -0.457007	  1.454275
  0.271898	 -0.472972	  1.451525
  0.292032	 -0.483987	  1.454966
  0.309399	 -0.492753	  1.459349
  0.328290	 -0.497345	  1.462777
  0.348420	 -0.502801	  1.469434
  0.365778	 -0.509998	  1.478884
  0.382893	 -0.518761	  1.491039
  0.397188	 -0.528932	  1.500173
  0.407373	 -0.537760	  1.506642
  0.424320	 -0.554304	  1.512948
  0.444345	 -0.569119	  1.521739
  0.460408	 -0.577758	  1.531555
  0.474167	 -0.577268	  1.542758
  0.492713	 -0.570606	  1.555354
  0.510128	 -0.563962	  1.564766
  0.527975	 -0.562796	  1.575390
  0.544995	 -0.559302	  1.585191
  0.561324	 -0.554607	  1.595867
  0.577595	 -0.548886	  1.605824
  0.593389	 -0.542774	  1.615993
  0.605655	 -0.533331	  1.627858
  0.616166	 -0.522734	  1.641233
  0.626417	 -0.512090	  1.654714
  0.636492	 -0.501384	  1.668275
  0.645554	 -0.490107	  1.682071
  0.651973	 -0.477586	  1.696275
  0.658031	 -0.464964	  1.710555
  0.664084	 -0.452309	  1.724786
  0.670057	 -0.440263	  1.739458
  0.678400	 -0.431401	  1.755293
  0.687350	 -0.423491	  1.771409
  0.696622	 -0.415959	  1.787518
  0.707352	 -0.408939	  1.803027
  0.719743	 -0.401875	  1.816828
  0.733091	 -0.395567	  1.829569
  0.746872	 -0.390529	  1.843408
  0.760202	 -0.386652	  1.857894
  0.773356	 -0.384828	  1.872716
  0.786704	 -0.388711	  1.886983
  0.800240	 -0.393227	  1.900956
  0.814112	 -0.397869	  1.914544
  0.828435	 -0.403170	  1.927317
  0.842642	 -0.410250	  1.939527
  0.855896	 -0.419594	  1.951310
  0.868122	 -0.429147	  1.963716
  0.879187	 -0.438179	  1.976431
  0.891714	 -0.445394	  1.985299
  0.905622	 -0.446532	  1.985533
  0.917080	 -0.438636	  1.976636
  0.929299	 -0.431840	  1.964644
  0.934371	 -0.423469	  1.938468
  0.933796	 -0.410902	  1.916754
  0.935500	 -0.402545	  1.901402
  0.939626	 -0.389646	  1.890583
  0.950066	 -0.376581	  1.878427
  0.956759	 -0.365678	  1.860751
  0.958120	 -0.355169	  1.841099
  0.958634	 -0.344251	  1.820906
  0.964804	 -0.330041	  1.807932
  0.979584	 -0.313107	  1.797138
  0.994088	 -0.302055	  1.786512
  1.010572	 -0.295202	  1.771663
  1.028709	 -0.290398	  1.760494
  1.045876	 -0.285730	  1.753319
  1.061618	 -0.278937	  1.742729
  1.079053	 -0.275179	  1.732439
  1.096759	 -0.272382	  1.723382
  1.114867	 -0.270669	  1.715092
  1.134830	 -0.272449	  1.711658
  1.154698	 -0.274323	  1.709375
  1.174730	 -0.276104	  1.708391
  1.194679	 -0.278772	  1.708949
  1.214471	 -0.281414	  1.710187
  1.233987	 -0.285041	  1.711566
  1.253553	 -0.288907	  1.713300
  1.273242	 -0.292808	  1.715508
  1.292799	 -0.296543	  1.718688
  1.312149	 -0.299739	  1.722363
  1.331714	 -0.301141	  1.724308
  1.351478	 -0.301543	  1.724714
  1.371146	 -0.303193	  1.724379
  1.390366	 -0.307466	  1.723652
  1.409779	 -0.312056	  1.722678
  1.429138	 -0.316269	  1.721443
  1.448661	 -0.320720	  1.719612
  1.468598	 -0.324368	  1.718973
  1.488572	 -0.327172	  1.719325
  1.508351	 -0.329574	  1.720230
  1.527978	 -0.331868	  1.720058
  1.547795	 -0.334102	  1.719551
  1.567640	 -0.336130	  1.718314
  1.587510	 -0.337631	  1.716766
  1.607509	 -0.339390	  1.715675
  1.627864	 -0.341900	  1.715747
  1.648073	 -0.341563	  1.714495
  1.667436	 -0.339733	  1.712915
  1.688023	 -0.342730	  1.714615
  1.708229	 -0.342555	  1.714367
  1.726958	 -0.340526	  1.712645
  1.747393	 -0.344017	  1.715449
  1.767699	 -0.342895	  1.716776
  1.787540	 -0.337605	  1.714274
  1.807415	 -0.339734	  1.714952
