 -1.774948	  0.684281	  1.517279
 -1.804575	  0.682215	  1.512412
 -1.785088	  0.683154	  1.516480
 -1.765525	  0.684007	  1.521134
 -1.746106	  0.685801	  1.525991
 -1.726367	  0.689172	  1.528755
 -1.706894	  0.692742	  1.531456
 -1.687434	  0.695130	  1.532779
 -1.667960	  0.698771	  1.536111
 -1.648847	  0.702960	  1.540244
 -1.629787	  0.706015	  1.544229
 -1.610104	  0.707049	  1.548457
 -1.589513	  0.710322	  1.555001
 -1.572558	  0.715836	  1.560033
 -1.554940	  0.723913	  1.564030
 -1.533457	  0.728014	  1.570266
 -1.516180	  0.732092	  1.576538
 -1.498577	  0.736584	  1.579877
 -1.478035	  0.738417	  1.583213
 -1.456886	  0.739541	  1.589954
 -1.439127	  0.744375	  1.595586
 -1.422768	  0.750844	  1.598166
 -1.402122	  0.758327	  1.602964
 -1.382667	  0.761698	  1.608991
 -1.362777	  0.760690	  1.614885
 -1.345139	  0.762153	  1.619220
 -1.326368	  0.767135	  1.624437
 -1.307187	  0.771524	  1.630242
 -1.288482	  0.775152	  1.636487
 -1.269919	  0.778796	  1.642980
 -1.251357	  0.782438	  1.649473
 -1.232951	  0.785544	  1.656653
 -1.214547	  0.788643	  1.663843
 -1.196144	  0.791705	  1.671052
 -1.177936	  0.792682	  1.679269
 -1.159728	  0.793658	  1.687486
 -1.141554	  0.794676	  1.695703
 -1.123954	  0.795380	  1.704587
 -1.105874	  0.797487	  1.713346
 -1.087356	  0.799593	  1.720239
 -1.067196	  0.796441	  1.727948
 -1.050462	  0.794661	  1.736330
 -1.033581	  0.794913	  1.746398
 -1.014279	  0.799081	  1.752179
 -0.992814	  0.801305	  1.757811
 -0.977882	  0.804920	  1.764058
 -0.960221	  0.808747	  1.772037
 -0.940489	  0.813075	  1.780166
 -0.919466	  0.815323	  1.782611
 -0.901800	  0.818841	  1.785224
 -0.884120	  0.825836	  1.790800
 -0.863763	  0.831389	  1.795461
 -0.843231	  0.832316	  1.794376
 -0.823289	  0.835564	  1.797206
 -0.806237	  0.840850	  1.804180
 -0.787715	  0.845974	  1.810184
 -0.767530	  0.850277	  1.811349
 -0.747548	  0.853867	  1.810049
 -0.727752	  0.855843	  1.809154
 -0.707699	  0.858257	  1.809997
 -0.687789	  0.859606	  1.811318
 -0.667857	  0.859996	  1.812921
 -0.647925	  0.860386	  1.814525
 -0.628042	  0.860059	  1.816657
 -0.608232	  0.859114	  1.819242
 -0.588706	  0.857645	  1.821629
 -0.568853	  0.854502	  1.824236
 -0.550123	  0.850804	  1.827637
 -0.529124	  0.850683	  1.835013
 -0.510601	  0.852617	  1.841987
 -0.491393	  0.855379	  1.844491
 -0.471426	  0.856708	  1.846448
 -0.452014	  0.857826	  1.851823
 -0.433745	  0.858546	  1.860268
 -0.414595	  0.859747	  1.866905
 -0.394739	  0.865741	  1.871113
 -0.378654	  0.871689	  1.877560
 -0.359901	  0.874302	  1.885150
 -0.341814	  0.880201	  1.894109
 -0.323076	  0.888218	  1.899948
 -0.305253	  0.889516	  1.903446
 -0.284609	  0.892660	  1.910636
 -0.267029	  0.900863	  1.919226
 -0.251151	  0.910263	  1.920180
 -0.230371	  0.916589	  1.924065
 -0.211957	  0.919320	  1.927580
 -0.192917	  0.924362	  1.932488
 -0.174038	  0.929407	  1.938018
 -0.154786	  0.930662	  1.942320
 -0.134060	  0.931450	  1.947152
 -0.117137	  0.937137	  1.953810
 -0.098706	  0.942515	  1.960161
 -0.078732	  0.947094	  1.967375
 -0.060432	  0.946662	  1.972103
 -0.041543	  0.948642	  1.977630
 -0.022299	  0.951511	  1.984286
 -0.003705	  0.950724	  1.989939
  0.016458	  0.950867	  1.996705
  0.033743	  0.954662	  2.004306
  0.050908	  0.958706	  2.012345
  0.072619	  0.962491	  2.021760
  0.087236	  0.963727	  2.027251
  0.106482	  0.966706	  2.035219
  0.124520	  0.970597	  2.042665
  0.142795	  0.975769	  2.050086
  0.160641	  0.981258	  2.057256
  0.178645	  0.986533	  2.064186
  0.196863	  0.991506	  2.070772
  0.215082	  0.996477	  2.077357
  0.234092	  0.999073	  2.083001
  0.253295	  1.000856	  2.088303
  0.272657	  1.002377	  2.093074
  0.292416	  1.003041	  2.096101
  0.312174	  1.003705	  2.099128
  0.331773	  1.003844	  2.103111
  0.350656	  1.002583	  2.109579
  0.369539	  1.001323	  2.116048
  0.388415	  1.000079	  2.122539
  0.406512	  1.000335	  2.131048
  0.424607	  1.000599	  2.139563
  0.442813	  1.003210	  2.147419
  0.460996	  1.006613	  2.155020
  0.479180	  1.010016	  2.162621
  0.497402	  1.013420	  2.170240
  0.516627	  1.014501	  2.179094
  0.534677	  1.014587	  2.187708
