 -0.064015	 -2.049676	  1.390202
 -0.067126	 -2.072197	  1.396959
 -0.064500	 -2.053207	  1.391261
 -0.061476	 -2.034362	  1.385281
 -0.058268	 -2.015591	  1.379171
 -0.055088	 -1.997103	  1.372604
 -0.051274	 -1.980073	  1.364443
 -0.045804	 -1.960581	  1.357439
 -0.039880	 -1.941934	  1.353503
 -0.037739	 -1.922005	  1.347005
 -0.036356	 -1.905730	  1.337621
 -0.031358	 -1.887427	  1.330740
 -0.028739	 -1.867744	  1.323494
 -0.029254	 -1.850788	  1.315148
 -0.027974	 -1.831504	  1.307853
 -0.026548	 -1.811807	  1.303293
 -0.023592	 -1.794426	  1.292386
 -0.021104	 -1.777846	  1.283284
 -0.016126	 -1.757634	  1.276163
 -0.015849	 -1.739699	  1.269709
 -0.020207	 -1.720657	  1.262371
 -0.021481	 -1.700406	  1.255464
 -0.016229	 -1.683164	  1.253829
 -0.012645	 -1.663278	  1.251405
 -0.011781	 -1.640742	  1.244792
 -0.008482	 -1.624451	  1.243106
 -0.003758	 -1.603956	  1.241478
  0.001566	 -1.583474	  1.238948
  0.002876	 -1.564352	  1.237941
  0.005468	 -1.544299	  1.240104
  0.009884	 -1.525225	  1.246930
  0.014986	 -1.507776	  1.254745
  0.020501	 -1.489240	  1.260955
  0.025946	 -1.470838	  1.266625
  0.033279	 -1.454783	  1.276022
  0.041436	 -1.440317	  1.287167
  0.049596	 -1.425856	  1.298316
  0.057757	 -1.411396	  1.309465
  0.065920	 -1.396938	  1.320616
  0.074629	 -1.383158	  1.332201
  0.084806	 -1.371523	  1.344889
  0.094992	 -1.359899	  1.357584
  0.105177	 -1.348276	  1.370278
  0.115364	 -1.336651	  1.382970
  0.126446	 -1.324922	  1.394784
  0.138469	 -1.313131	  1.405575
  0.150494	 -1.301339	  1.416362
  0.162516	 -1.289533	  1.427133
  0.174014	 -1.275184	  1.434996
  0.185393	 -1.260488	  1.442382
  0.196699	 -1.245503	  1.449268
  0.206964	 -1.228494	  1.451538
  0.217211	 -1.211474	  1.453726
  0.225032	 -1.194698	  1.446185
  0.232361	 -1.178263	  1.437464
  0.238273	 -1.159800	  1.432558
  0.243692	 -1.140915	  1.428832
  0.245273	 -1.121223	  1.425768
  0.239421	 -1.102164	  1.424292
  0.233535	 -1.083131	  1.422765
  0.229348	 -1.068398	  1.409944
  0.226976	 -1.058998	  1.392458
  0.224610	 -1.049639	  1.374944
  0.222578	 -1.042749	  1.356281
  0.221054	 -1.039385	  1.336627
  0.219532	 -1.036039	  1.316967
  0.218012	 -1.032694	  1.297308
  0.216932	 -1.029217	  1.277642
  0.217161	 -1.025741	  1.258200
  0.218680	 -1.023207	  1.238657
  0.219468	 -1.020623	  1.218033
  0.218138	 -1.017464	  1.197608
  0.217226	 -1.009905	  1.179967
  0.218257	 -1.001715	  1.161432
  0.217391	 -0.993767	  1.141553
  0.218668	 -0.991896	  1.122919
  0.221613	 -0.988079	  1.102635
  0.222926	 -0.981897	  1.083244
  0.223982	 -0.971895	  1.066516
  0.225228	 -0.960503	  1.049109
  0.226292	 -0.952198	  1.030738
  0.229742	 -0.945377	  1.013618
  0.232116	 -0.934684	  0.995449
  0.230635	 -0.922323	  0.978971
  0.232156	 -0.909415	  0.963992
  0.235861	 -0.895598	  0.952253
  0.238937	 -0.879516	  0.938949
  0.240942	 -0.863278	  0.927247
  0.242642	 -0.846342	  0.916746
  0.244314	 -0.829380	  0.906283
  0.244751	 -0.811258	  0.897836
  0.245175	 -0.793129	  0.889400
  0.245422	 -0.774755	  0.881543
  0.245574	 -0.755977	  0.874697
  0.245629	 -0.737174	  0.867777
  0.246653	 -0.718501	  0.861267
  0.248058	 -0.699807	  0.853871
  0.249339	 -0.681322	  0.845719
  0.251942	 -0.664082	  0.836355
  0.255109	 -0.647740	  0.826193
  0.254612	 -0.627847	  0.817824
  0.252073	 -0.608065	  0.811673
  0.251311	 -0.590422	  0.804006
  0.250389	 -0.572360	  0.795370
  0.251195	 -0.553149	  0.788811
  0.252561	 -0.533488	  0.784763
  0.257079	 -0.514784	  0.778357
  0.263812	 -0.497461	  0.771088
  0.267428	 -0.478712	  0.764725
  0.272327	 -0.460667	  0.757480
  0.277947	 -0.444760	  0.745414
  0.280187	 -0.428028	  0.733010
  0.279329	 -0.406369	  0.728297
  0.284096	 -0.388718	  0.725768
  0.290159	 -0.371560	  0.716911
  0.296187	 -0.352542	  0.710283
  0.303561	 -0.332842	  0.706992
  0.311649	 -0.316850	  0.699610
  0.312871	 -0.300473	  0.687458
  0.315178	 -0.280164	  0.679131
  0.322461	 -0.259699	  0.677925
  0.326037	 -0.243062	  0.675519
  0.331054	 -0.222929	  0.669886
  0.338019	 -0.206608	  0.662473
  0.345541	 -0.189266	  0.655410
  0.350415	 -0.169705	  0.648883
  0.352325	 -0.150653	  0.642753
  0.357800	 -0.129541	  0.642428
  0.365323	 -0.112771	  0.641188
  0.368521	 -0.093010	  0.636786
  0.371734	 -0.072882	  0.632290
  0.379625	 -0.055270	  0.628761
  0.383549	 -0.035848	  0.621587
  0.385002	 -0.016792	  0.614753
  0.389576	 -0.000470	  0.610574
  0.395600	  0.019115	  0.605988
  0.400620	  0.038511	  0.601743
  0.406327	  0.057797	  0.598664
  0.410411	  0.077328	  0.594355
  0.411102	  0.096190	  0.588283
  0.411354	  0.115047	  0.581072
  0.412301	  0.133834	  0.574226
  0.412646	  0.152539	  0.568782
  0.412860	  0.173038	  0.564227
  0.414470	  0.192948	  0.560734
  0.415419	  0.212155	  0.552580
  0.413518	  0.228818	  0.544869
  0.411745	  0.248378	  0.539665
  0.410342	  0.267852	  0.533760
  0.408820	  0.286242	  0.527008
  0.408119	  0.305501	  0.521738
  0.408379	  0.325215	  0.517559
  0.410085	  0.344807	  0.513916
  0.413015	  0.364306	  0.510578
  0.415723	  0.383822	  0.507096
  0.419901	  0.403021	  0.503236
  0.424845	  0.422091	  0.499571
  0.430187	  0.441050	  0.496059
  0.437155	  0.459501	  0.492793
  0.443615	  0.478095	  0.490629
  0.449999	  0.497155	  0.489010
  0.455530	  0.515935	  0.486483
  0.464014	  0.535711	  0.479265
  0.473594	  0.551323	  0.471633
  0.485186	  0.566766	  0.468290
  0.495205	  0.583338	  0.467487
  0.507196	  0.601386	  0.463728
  0.517881	  0.617245	  0.454893
  0.523039	  0.633563	  0.450795
  0.532007	  0.651864	  0.446694
  0.540967	  0.669825	  0.439647
  0.546347	  0.687185	  0.432146
  0.550076	  0.705362	  0.425402
  0.557426	  0.723363	  0.418912
  0.562351	  0.740744	  0.410541
  0.565491	  0.757601	  0.400717
  0.571766	  0.773855	  0.391665
  0.575107	  0.794286	  0.383159
  0.576019	  0.812457	  0.377477
  0.580331	  0.829707	  0.368858
  0.585520	  0.845473	  0.355987
  0.586016	  0.861875	  0.345885
  0.591156	  0.877207	  0.334405
  0.599845	  0.890932	  0.320344
  0.599744	  0.906748	  0.309169
  0.602426	  0.922695	  0.298319
  0.607477	  0.940801	  0.286600
  0.605694	  0.955959	  0.273534
  0.610921	  0.970815	  0.259498
  0.616045	  0.980590	  0.244477
  0.617856	  0.992394	  0.225731
  0.621580	  0.995432	  0.207514
  0.628790	  0.998943	  0.187701
  0.630171	  1.007959	  0.170349
  0.635140	  1.017142	  0.153635
  0.643067	  1.026470	  0.139022
  0.652174	  1.035399	  0.121522
  0.655942	  1.043417	  0.103163
  0.658397	  1.053085	  0.083527
  0.668368	  1.063039	  0.069949
  0.679722	  1.069938	  0.055993
  0.693073	  1.075439	  0.041325
  0.704678	  1.081075	  0.026362
  0.717500	  1.086949	  0.014020
  0.733670	  1.100639	  0.005677
  0.744495	  1.112070	 -0.005334
  0.756516	  1.115340	 -0.019771
  0.771509	  1.124597	 -0.035523
  0.777830	  1.138643	 -0.049418
  0.787410	  1.153711	 -0.061090
  0.797033	  1.171915	 -0.073408
  0.810378	  1.182937	 -0.065073
  0.825684	  1.188930	 -0.070598
  0.842027	  1.199634	 -0.073380
  0.854582	  1.216111	 -0.072892
  0.866217	  1.233318	 -0.072675
  0.876820	  1.249941	 -0.070956
  0.886690	  1.266853	 -0.067834
  0.897422	  1.283329	 -0.064304
  0.908478	  1.299951	 -0.060911
  0.918127	  1.317155	 -0.059496
  0.925859	  1.335114	 -0.057245
  0.932434	  1.353998	 -0.057692
  0.936709	  1.373541	 -0.058067
  0.940871	  1.393012	 -0.058442
  0.944176	  1.412607	 -0.060802
  0.946538	  1.432486	 -0.063768
  0.946600	  1.452140	 -0.067096
  0.943738	  1.470726	 -0.071944
  0.939059	  1.489900	 -0.080384
  0.936601	  1.506611	 -0.090879
  0.934839	  1.524217	 -0.097536
  0.932246	  1.542798	 -0.101929
  0.925096	  1.563554	 -0.094299
  0.919914	  1.576921	 -0.101755
  0.911992	  1.595794	 -0.094748
  0.908139	  1.613590	 -0.089937
  0.902949	  1.631904	 -0.089615
  0.896288	  1.652008	 -0.087475
  0.889716	  1.670646	 -0.087574
  0.885506	  1.690447	 -0.084844
  0.879862	  1.708558	 -0.084251
  0.875987	  1.728614	 -0.083977
  0.870209	  1.747408	 -0.085448
  0.865210	  1.767241	 -0.085686
  0.860789	  1.785795	 -0.084463
  0.862591	  1.809941	 -0.086673
  0.863491	  1.827358	 -0.084992
  0.864348	  1.847966	 -0.087818
  0.869358	  1.867936	 -0.099070
  0.871016	  1.884696	 -0.103635
  0.872456	  1.904949	 -0.103961
  0.871136	  1.925531	 -0.105458
  0.867304	  1.945382	 -0.109407
  0.861886	  1.965217	 -0.122696
  0.866042	  1.982391	 -0.129046
  0.875093	  2.002820	 -0.130241
  0.881925	  2.019468	 -0.138140
  0.883198	  2.037247	 -0.147868
  0.883659	  2.054281	 -0.155302
  0.887760	  2.075765	 -0.165842
  0.894565	  2.091602	 -0.175655
  0.890373	  2.109872	 -0.176019
  0.887093	  2.133397	 -0.181216
  0.888438	  2.149516	 -0.188530
  0.891675	  2.168760	 -0.196509
  0.895812	  2.186434	 -0.202615
  0.899688	  2.205478	 -0.209972
  0.903057	  2.223811	 -0.217352
  0.906082	  2.242283	 -0.224397
  0.908522	  2.261092	 -0.230743
  0.910959	  2.279902	 -0.237086
  0.913421	  2.298928	 -0.243495
  0.916266	  2.322587	 -0.251011
  0.918290	  2.341709	 -0.256510
