 0.0 0.0 0.0 0
 -0.10511076736335748 0.7319232905622849 0.7196348093136475 1000
 0.414783939464636 0.862221916228127 -0.4416258519204264 1000
 -0.1876921340109169 0.9800918219878022 0.06158168182903173 1000
 0.8428071818272835 -0.5095802611002063 -0.2600796820552632 1000
 0.6033864814084542 0.41069857718115826 0.3775423153010804 1000
 0.4954873737059772 -0.8689736872476566 -0.2776228573578189 1000
 -0.5376057217402083 -0.8228215108461497 0.049661518969185525 1000
 -0.7899931874333969 -0.5065465253076826 0.03073941628233845 1000
 0.0 0.0 0.0 0
 -0.9336510399149748 0.3503073020728944 0.5242650448901229 1000
 0.023914678821775226 -0.9938490295514721 -0.15300413810684804 1000
 0.6286626483554758 -0.0711823867131803 0.4342659347728105 1000
 -0.8939421986042277 -0.4471588822953056 0.3976940805412913 1000
 -0.3876957125968371 0.30174319817699063 1.0260678770065939 1000
 0.7517521372944005 0.29466003801034313 -0.9112742338420582 1000
 0.6654540036400948 0.6667702593871179 0.026560669451019925 1000
 -0.8601915968801321 0.24991785181929183 -0.002374907070731347 1000
 0.0 0.0 0.0 0
 -0.07928119915160557 0.9544106901107847 -0.19840623066235735 1000
 -0.4738423774457732 0.5427808969350425 0.907273030755987 1000
 -0.5247402680495881 0.48474614435338925 -0.3971559427100314 1000
 0.8688935498607568 0.33290579605846177 -0.055002872509016476 1000
 -0.06716085918240577 0.2511165798331346 -0.8773226406921926 1000
 0.7121215921444074 -0.36746284086054903 -0.9242547448357373 1000
 0.2698185993919305 -0.8550096518523187 -0.5826833451688711 1000
 -0.8386204355555656 -0.3171591301404694 0.8117449859864789 1000
 0.0 0.0 0.0 0
