  2.418986	  0.662321	  0.037854
  2.410329	  0.662430	  0.038769
  2.399131	  0.662570	  0.039953
  2.379330	  0.662412	  0.040959
  2.358730	  0.661699	  0.041553
  2.338798	  0.661054	  0.042969
  2.319698	  0.661868	  0.045331
  2.299085	  0.662164	  0.047083
  2.278152	  0.663239	  0.053545
  2.261191	  0.667647	  0.063705
  2.247005	  0.674651	  0.074744
  2.229682	  0.681238	  0.088824
  2.212348	  0.682319	  0.096842
  2.194676	  0.684590	  0.103230
  2.176695	  0.689366	  0.115558
  2.163692	  0.696681	  0.130316
  2.154909	  0.706585	  0.142864
  2.144530	  0.715886	  0.158583
  2.138235	  0.727689	  0.176015
  2.136731	  0.739957	  0.190233
  2.135477	  0.752110	  0.207484
  2.130837	  0.760296	  0.225795
  2.132782	  0.771637	  0.241245
  2.138831	  0.786790	  0.255032
  2.142134	  0.798778	  0.270980
  2.142349	  0.806612	  0.290553
  2.147273	  0.817415	  0.306424
  2.154000	  0.831020	  0.319667
  2.153835	  0.843180	  0.336172
  2.150847	  0.854104	  0.354416
  2.147864	  0.864923	  0.370727
  2.149702	  0.877495	  0.385688
  2.153162	  0.888094	  0.402470
  2.158314	  0.898488	  0.416969
  2.158926	  0.913717	  0.435480
  2.151991	  0.922739	  0.452012
  2.153326	  0.934636	  0.466197
  2.158449	  0.951290	  0.482649
  2.152520	  0.960033	  0.501345
  2.144443	  0.964344	  0.518346
  2.137925	  0.969108	  0.535903
  2.135080	  0.979273	  0.555955
  2.132199	  0.990157	  0.574064
  2.121315	  0.996157	  0.592254
  2.113108	  1.001111	  0.604717
  2.107081	  1.007455	  0.624632
  2.101097	  1.012297	  0.644379
  2.093185	  1.020352	  0.660081
  2.084139	  1.029454	  0.675979
  2.081359	  1.034658	  0.695518
  2.080510	  1.039837	  0.716560
  2.076041	  1.045067	  0.735875
  2.063929	  1.051282	  0.752106
  2.056569	  1.060145	  0.768087
  2.049452	  1.067720	  0.785631
  2.041377	  1.074770	  0.801142
  2.032948	  1.086147	  0.816321
  2.023855	  1.095372	  0.834125
  2.016040	  1.104099	  0.849205
  2.007948	  1.114949	  0.861168
  1.998743	  1.129647	  0.875344
  1.992251	  1.139440	  0.892004
  1.988502	  1.147655	  0.908978
  1.983017	  1.160056	  0.924823
  1.977317	  1.174480	  0.936902
  1.971928	  1.188847	  0.949884
  1.966295	  1.204422	  0.965946
  1.961146	  1.221500	  0.983855
