  1.007943	  1.811405	  1.409690
  1.045387	  1.787466	  1.435187
  1.043256	  1.788830	  1.433736
  0.999632	  1.815254	  1.408836
  0.955411	  1.840496	  1.386914
  0.910489	  1.864280	  1.367471
  0.865481	  1.885588	  1.350570
  0.820784	  1.904088	  1.335024
  0.774055	  1.920946	  1.317800
  0.727704	  1.934031	  1.298851
  0.688052	  1.941608	  1.277414
  0.653781	  1.946520	  1.249639
  0.620756	  1.950893	  1.215178
  0.588769	  1.955311	  1.177757
  0.554068	  1.963234	  1.141469
  0.518012	  1.976410	  1.109161
  0.480256	  1.994315	  1.079951
  0.441299	  2.014010	  1.052803
  0.401605	  2.033541	  1.026969
  0.362039	  2.051625	  1.002182
  0.321577	  2.068566	  0.976545
  0.281057	  2.083992	  0.949317
  0.240550	  2.098186	  0.921525
  0.201865	  2.111850	  0.895267
  0.165306	  2.126103	  0.870517
  0.129576	  2.142603	  0.845963
  0.091357	  2.162027	  0.820982
  0.050289	  2.183352	  0.795797
  0.010109	  2.203369	  0.770634
 -0.027382	  2.221086	  0.743650
 -0.064002	  2.237457	  0.713522
 -0.101103	  2.251900	  0.681939
 -0.138909	  2.261271	  0.648627
 -0.179420	  2.269720	  0.613968
 -0.222107	  2.278694	  0.584384
 -0.263947	  2.287758	  0.559616
 -0.304686	  2.298675	  0.535893
 -0.346628	  2.313002	  0.513100
 -0.389263	  2.329281	  0.493043
 -0.433624	  2.345652	  0.473533
 -0.478810	  2.359558	  0.451483
 -0.522342	  2.370464	  0.426499
 -0.563085	  2.378699	  0.398444
 -0.603011	  2.384455	  0.367505
 -0.643718	  2.388010	  0.335076
 -0.681846	  2.389892	  0.303725
 -0.751978	  2.395001	  0.248455
 -0.760302	  2.395800	  0.241981
