  0.830407	 -0.686271	  2.280695
  0.846677	 -0.695538	  2.290686
  0.829807	 -0.685931	  2.280326
  0.798135	 -0.671166	  2.264076
  0.762937	 -0.657187	  2.247579
  0.728925	 -0.646084	  2.231638
  0.700356	 -0.640543	  2.217353
  0.669360	 -0.641950	  2.199306
  0.627704	 -0.654261	  2.167037
  0.580444	 -0.680007	  2.117987
  0.530709	 -0.713542	  2.060467
  0.481345	 -0.748074	  2.004340
  0.436403	 -0.782385	  1.951564
  0.390805	 -0.814050	  1.896685
  0.344398	 -0.837913	  1.835522
  0.295123	 -0.850352	  1.767271
  0.240490	 -0.840236	  1.690223
  0.184702	 -0.801916	  1.624737
  0.133807	 -0.752632	  1.581810
  0.090351	 -0.704822	  1.556387
  0.051845	 -0.661357	  1.541670
  0.016206	 -0.620989	  1.533232
 -0.015837	 -0.585144	  1.528803
 -0.045342	 -0.553749	  1.526557
 -0.078298	 -0.520809	  1.523660
 -0.121615	 -0.480877	  1.518487
 -0.175202	 -0.434519	  1.513981
 -0.228385	 -0.387315	  1.505540
 -0.270663	 -0.347145	  1.493428
 -0.301225	 -0.317820	  1.482103
 -0.327153	 -0.294265	  1.471278
 -0.354128	 -0.271718	  1.459099
 -0.383238	 -0.249048	  1.444997
 -0.415743	 -0.225553	  1.428635
 -0.451255	 -0.201386	  1.409964
 -0.488300	 -0.177504	  1.389607
 -0.527894	 -0.152806	  1.367926
 -0.569047	 -0.126215	  1.344483
 -0.609133	 -0.098707	  1.320425
 -0.647031	 -0.071084	  1.296610
 -0.682166	 -0.045202	  1.273868
 -0.714486	 -0.022804	  1.252599
 -0.744721	 -0.004934	  1.231675
 -0.773197	  0.008740	  1.210277
 -0.801768	  0.019275	  1.187964
 -0.831600	  0.027211	  1.164973
 -0.863473	  0.032917	  1.142073
 -0.898822	  0.037189	  1.118222
 -0.937719	  0.040906	  1.093010
 -0.980683	  0.044820	  1.066168
 -1.027629	  0.049732	  1.037226
 -1.080013	  0.057195	  1.003783
 -1.134632	  0.070532	  0.965117
 -1.187758	  0.090700	  0.925343
 -1.237727	  0.117079	  0.888500
 -1.284433	  0.148016	  0.855676
 -1.334286	  0.187193	  0.823798
 -1.396381	  0.248760	  0.790555
 -1.461907	  0.345105	  0.765358
 -1.512191	  0.455655	  0.756620
 -1.550843	  0.553308	  0.754354
 -1.580152	  0.624411	  0.755330
 -1.602134	  0.669692	  0.757260
 -1.618483	  0.697600	  0.758879
 -1.633017	  0.717193	  0.759871
 -1.649896	  0.734567	  0.760575
 -1.678453	  0.755640	  0.761813
 -1.725822	  0.780224	  0.765263
 -1.780585	  0.797506	  0.771349
 -1.847260	  0.769441	  0.756470
 -1.875467	  0.733588	  0.700924
 -1.888528	  0.709874	  0.648427
 -1.898438	  0.683362	  0.566890
 -1.904437	  0.665664	  0.465793
 -1.910562	  0.660061	  0.365847
 -1.926192	  0.660402	  0.278799
 -1.954864	  0.666405	  0.203996
 -1.997923	  0.678269	  0.138485
 -2.049792	  0.694170	  0.086475
 -2.101110	  0.707920	  0.047810
 -2.148432	  0.719797	  0.017219
 -2.192433	  0.730177	 -0.009755
 -2.236585	  0.739858	 -0.035871
 -2.288682	  0.749568	 -0.064353
 -2.326767	  0.755300	 -0.084455
