  2.094084	 -0.406085	  2.151931
  2.073350	 -0.402064	  2.130625
  2.061270	 -0.444639	  2.112155
  2.037713	 -0.483071	  2.093956
  2.008770	 -0.518125	  2.075631
  1.977434	 -0.551705	  2.057106
  1.945956	 -0.584991	  2.037848
  1.914685	 -0.618235	  2.018118
  1.883681	 -0.651322	  1.998042
  1.852950	 -0.684278	  1.978141
  1.821766	 -0.717373	  1.959502
  1.789113	 -0.750790	  1.942499
  1.755870	 -0.784593	  1.925678
  1.722912	 -0.818867	  1.907459
  1.690891	 -0.853227	  1.887637
  1.660527	 -0.887294	  1.865908
  1.631405	 -0.921320	  1.842936
  1.603693	 -0.955425	  1.818766
  1.576790	 -0.989250	  1.794034
  1.550562	 -1.023281	  1.768418
  1.524378	 -1.057077	  1.741941
  1.497552	 -1.089863	  1.714447
  1.469957	 -1.121012	  1.686100
  1.441832	 -1.150699	  1.657659
  1.413494	 -1.179511	  1.629079
  1.385094	 -1.207512	  1.600734
  1.356276	 -1.235237	  1.572852
  1.326756	 -1.263040	  1.546008
  1.296366	 -1.290866	  1.519975
  1.264298	 -1.318771	  1.494830
  1.230251	 -1.347616	  1.471061
  1.196167	 -1.377192	  1.448214
  1.163140	 -1.407811	  1.425439
  1.131044	 -1.438869	  1.402183
  1.099893	 -1.470691	  1.378860
  1.069316	 -1.502999	  1.355467
  1.039372	 -1.535946	  1.332554
  1.009950	 -1.569556	  1.310265
  0.981289	 -1.604152	  1.288527
  0.953903	 -1.639521	  1.267664
  0.927113	 -1.676496	  1.247684
  0.900782	 -1.714324	  1.228559
  0.875216	 -1.753152	  1.210071
  0.850351	 -1.792565	  1.191212
  0.825853	 -1.832276	  1.171609
  0.801408	 -1.871488	  1.150704
  0.776733	 -1.909640	  1.128934
  0.751503	 -1.946284	  1.105957
  0.725979	 -1.980982	  1.082185
  0.700029	 -2.014595	  1.057703
  0.673372	 -2.047386	  1.032585
  0.646170	 -2.079786	  1.007071
  0.617899	 -2.111890	  0.981124
  0.588729	 -2.143429	  0.954956
  0.558844	 -2.174955	  0.928298
  0.527541	 -2.205195	  0.901826
  0.495186	 -2.234555	  0.875963
  0.463140	 -2.264341	  0.851340
  0.431364	 -2.294279	  0.827753
  0.399945	 -2.324233	  0.804856
  0.368706	 -2.354301	  0.782331
  0.337477	 -2.384573	  0.759931
  0.306202	 -2.415153	  0.737725
  0.274568	 -2.446243	  0.715637
  0.242589	 -2.477323	  0.693209
  0.210310	 -2.507942	  0.670501
  0.177087	 -2.538322	  0.647684
  0.143762	 -2.568417	  0.624360
  0.110733	 -2.598658	  0.601062
  0.078861	 -2.629689	  0.578952
  0.047971	 -2.660687	  0.555915
  0.020898	 -2.696819	  0.536124
 -0.000145	 -2.732457	  0.509279
 -0.027802	 -2.767734	  0.488337
 -0.056769	 -2.802819	  0.467673
 -0.081773	 -2.835031	  0.437973
 -0.117319	 -2.866175	  0.418829
 -0.145249	 -2.904615	  0.398181
 -0.173876	 -2.938183	  0.369359
 -0.206750	 -2.972830	  0.345744
 -0.208817	 -3.002558	  0.349201
