 0.0 0.0 0.0 0
 0.7889199933983554 0.5926065748283124 -0.058413095537587056 1000
 0.03908940558178693 0.11206686360879248 -1.1586696238467382 1000
 -0.530971023054014 -0.38957739157457316 0.7950502134001591 1000
 0.45704360245832015 -0.41618982027395474 0.9840453708604459 1000
 -0.1926515881016283 0.5080735445110706 0.9685367647370392 1000
 -0.9969666834872128 -0.05014894672335499 -0.21376428067410388 1000
 -0.4144240092483568 -0.8449908975320433 0.3170114025863288 1000
 0.24064100109234726 0.27711690769360087 1.1359898294189081 1000
 0.0 0.0 0.0 0
 -0.8263148986349017 -0.459347666020967 -0.5179918239613028 1000
 -0.01987231630086997 0.9993576025342392 0.04467427497080331 1000
 -0.7688233672611723 0.04088414508720507 -0.8650354908165353 1000
 -0.8777341251657582 -0.21492759124137373 0.36597187744641846 1000
 -0.14882487670808978 -0.7503782518877855 -0.7967691208376966 1000
 0.5573018165300381 -0.620684382145051 -0.5783826429148846 1000
 0.3889773384815013 -0.0833573470155364 1.1355406505546688 1000
 -0.19245156432419488 0.18773558101150983 1.1070536247460947 1000
 0.0 0.0 0.0 0
 0.2974440146550672 -0.9437656896542336 0.19047384727290156 1000
 0.5063382368582354 0.6585370196054124 0.7452797511607523 1000
 -0.7189477728797321 -0.1094707206493652 0.6946783015226317 1000
 0.31011302650077893 0.9485384496082496 -0.0021733454947467645 1000
 0.9435294686136224 0.3121784232977407 0.016242920784825948 1000
 -0.17021333917624026 0.7496113330589596 0.7421977657553032 1000
 -0.6864367167302624 0.39799203717818915 -0.8110605108436472 1000
 0.2581402885371965 0.5242733711995968 1.0038307931879717 1000
 0.0 0.0 0.0 0
 -0.6730616200649202 -0.574903128480435 0.4322336184694019 1000
 0.053453842932900834 0.9406857087557733 0.4227812092972875 1000
 -0.16449460630422694 0.32187285744805705 -1.1132650247124027 1000
 -0.591219213132029 -0.10939936483941914 -1.031315145736697 1000
 -0.17115671331798826 -0.8213690090520208 0.5952836543648838 1000
 0.44010107468846 0.10269609007563815 -0.9785995002540367 1000
 -0.7632875682621661 0.48463395631910494 0.3959713498590699 1000
 0.5730358872268397 0.8066181599245785 -0.06067689900600928 1000
 0.0 0.0 0.0 0
 0.7413081355106517 0.35979310638814455 -0.5455717601252906 1000
 -0.3014686920772184 -0.8175316133479742 -0.6388455339748995 1000
 0.6468283052807825 -0.6126955268526507 0.6193111293243235 1000
 -0.09299199545479066 -0.9711624343486983 0.2198772511302565 1000
 0.2655379790436394 0.5225759712767784 -0.9004013765465358 1000
 0.705712271703462 -0.133126456464379 -0.7136316913579316 1000
 0.057190588301654126 -0.7540434764401701 0.7607056790409545 1000
 0.9473067300421377 -0.2817855152208355 -0.038891895557643205 1000
 0.0 0.0 0.0 0
 -0.43969994314559924 -0.28476418169691126 -1.0734170608267528 1000
 0.45831369533246685 -0.5969119138784719 0.8307025832320847 1000
 -0.8630566180780168 0.01719678468480805 0.4615383653343946 1000
 0.6708209198866502 0.5086650204834273 0.7465375832519818 1000
 0.3537111511958929 -0.33845524760686885 -0.9779223209112106 1000
 -0.4724668989347059 -0.8782451517619054 -0.17369835426325295 1000
 -0.8818824230991393 0.45444286486526736 -0.2738437071069624 1000
 0.3485652139450914 -0.28450862968153046 1.0958764862967076 1000
 0.0 0.0 0.0 0
 0.9797523168600678 -0.08157908470887167 0.3608456290359854 1000
 0.6802082549108506 -0.4214348277563767 -0.6115397386181816 1000
 -0.015963433728680636 -0.1543792831385039 -1.1665004170160211 1000
 -0.7248030384767388 0.6285585635936484 0.23829468312537694 1000
 0.5352979314914937 0.5489498523245011 -0.6610580914960958 1000
 -0.192638521645271 0.5116676065056917 -1.0018200961493509 1000
 -0.5247628140927804 0.8439566089472316 0.06439545003718669 1000
 0.5020834783024846 0.7840164604590666 0.5222991348956345 1000
 0.0 0.0 0.0 0
 0.266285159656265 -0.7783359273670443 0.6918883565593659 1000
 -0.09657230984667672 -0.48499566045665937 -1.0472596406646246 1000
 0.38798144937100243 0.37535714827220723 -0.9224039178957123 1000
 0.19329968653617025 0.9040373699719801 0.4967682019841534 1000
