 -1.750482	  2.441323	 -0.395796
 -1.733150	  2.417152	 -0.391877
 -1.722853	  2.383407	 -0.357941
 -1.708048	  2.343210	 -0.330981
 -1.690872	  2.299910	 -0.307951
 -1.671547	  2.256056	 -0.287315
 -1.649188	  2.213524	 -0.267850
 -1.623906	  2.175183	 -0.248846
 -1.597210	  2.138490	 -0.228386
 -1.570917	  2.102659	 -0.206367
 -1.544678	  2.066349	 -0.182437
 -1.518981	  2.030143	 -0.157296
 -1.496981	  1.993246	 -0.130468
 -1.479658	  1.955417	 -0.101252
 -1.469006	  1.915286	 -0.068951
 -1.468763	  1.875343	 -0.035139
 -1.480360	  1.842995	 -0.002750
 -1.503095	  1.819038	  0.030537
 -1.555081	  1.794426	  0.085295
 -1.646483	  1.763522	  0.179083
 -1.710911	  1.717002	  0.275286
 -1.729650	  1.666318	  0.354661
 -1.722115	  1.618474	  0.413311
 -1.713095	  1.565753	  0.462234
 -1.708008	  1.505429	  0.493967
 -1.689114	  1.453411	  0.504794
 -1.637429	  1.406601	  0.500869
 -1.572843	  1.376498	  0.479075
 -1.494632	  1.343797	  0.444661
 -1.395191	  1.286443	  0.408064
 -1.329099	  1.227416	  0.395635
 -1.296604	  1.187004	  0.396290
 -1.275956	  1.152440	  0.401686
 -1.258803	  1.114239	  0.410827
 -1.242779	  1.071782	  0.422869
 -1.226203	  1.025996	  0.436642
 -1.207403	  0.978296	  0.451578
 -1.186257	  0.932303	  0.467658
 -1.163807	  0.888537	  0.485194
 -1.141364	  0.848150	  0.504147
 -1.119054	  0.809859	  0.525257
 -1.095797	  0.770448	  0.549774
 -1.073662	  0.733325	  0.574580
 -1.053026	  0.698556	  0.598583
 -1.031488	  0.661748	  0.625207
 -1.008480	  0.624364	  0.652370
 -0.984028	  0.586257	  0.677251
 -0.960100	  0.549221	  0.699261
 -0.936754	  0.511499	  0.722282
 -0.914269	  0.472128	  0.747864
 -0.893815	  0.432295	  0.775927
 -0.877619	  0.392165	  0.806521
 -0.868292	  0.354156	  0.837591
 -0.863343	  0.316642	  0.869970
 -0.859486	  0.277170	  0.903062
 -0.852949	  0.235568	  0.931474
 -0.841856	  0.191767	  0.954442
 -0.826595	  0.146565	  0.974088
 -0.810520	  0.102455	  0.990824
 -0.794823	  0.059356	  1.006422
 -0.777795	  0.016373	  1.023614
 -0.760025	 -0.026624	  1.043702
 -0.741091	 -0.069209	  1.066591
 -0.720810	 -0.110910	  1.091568
 -0.701218	 -0.150412	  1.116386
 -0.681954	 -0.188599	  1.141111
 -0.662635	 -0.226060	  1.165178
 -0.642715	 -0.263886	  1.188012
 -0.621534	 -0.303144	  1.210224
 -0.601809	 -0.341512	  1.230717
 -0.582808	 -0.381260	  1.251019
 -0.562506	 -0.423609	  1.272856
 -0.540727	 -0.464655	  1.295722
 -0.518497	 -0.504508	  1.320233
 -0.497509	 -0.544402	  1.345855
 -0.478927	 -0.585237	  1.372343
 -0.465100	 -0.626902	  1.400198
 -0.455938	 -0.667505	  1.428658
 -0.450296	 -0.707469	  1.457767
 -0.445767	 -0.748523	  1.485612
 -0.440918	 -0.791136	  1.511763
 -0.434299	 -0.833848	  1.537460
 -0.425849	 -0.877575	  1.563375
 -0.412751	 -0.921448	  1.587780
 -0.394935	 -0.964206	  1.608222
 -0.376591	 -1.005921	  1.627360
 -0.359119	 -1.046649	  1.646596
 -0.340628	 -1.088152	  1.666855
 -0.318901	 -1.129594	  1.688536
 -0.295198	 -1.169531	  1.711041
 -0.271258	 -1.207649	  1.734186
 -0.248269	 -1.243316	  1.757337
 -0.224504	 -1.280003	  1.782467
 -0.202673	 -1.317515	  1.810893
 -0.183861	 -1.354307	  1.841164
 -0.167578	 -1.391614	  1.870075
 -0.152455	 -1.430506	  1.894993
 -0.136767	 -1.471803	  1.918073
 -0.119181	 -1.512925	  1.943849
 -0.103723	 -1.553982	  1.970813
 -0.091583	 -1.594756	  1.996928
 -0.081399	 -1.635727	  2.022649
 -0.072711	 -1.678011	  2.047992
 -0.065025	 -1.721337	  2.072264
 -0.056815	 -1.766291	  2.095166
 -0.045261	 -1.811424	  2.117985
 -0.031793	 -1.855090	  2.138710
 -0.016879	 -1.898236	  2.158473
  0.000011	 -1.940293	  2.178461
  0.020065	 -1.982251	  2.198993
  0.050134	 -2.019454	  2.217947
  0.050635	 -2.039649	  2.240127
