  2.896702	  0.238248	 -0.856304
  2.868022	  0.235889	 -0.847826
  2.837800	  0.276669	 -0.850568
  2.798814	  0.307163	 -0.861794
  2.756735	  0.334677	 -0.867865
  2.719210	  0.364722	 -0.883151
  2.679576	  0.390243	 -0.899803
  2.634912	  0.409003	 -0.909535
  2.598593	  0.433265	 -0.931511
  2.559034	  0.457910	 -0.944375
  2.518115	  0.482566	 -0.955508
  2.477352	  0.509113	 -0.967609
  2.434754	  0.535590	 -0.975645
  2.394131	  0.564030	 -0.984325
  2.354428	  0.593190	 -0.994098
  2.314685	  0.622051	 -1.004813
  2.274614	  0.650534	 -1.016761
  2.234731	  0.678390	 -1.029600
  2.195738	  0.705438	 -1.043080
  2.157519	  0.732052	 -1.056642
  2.120088	  0.758831	 -1.070047
  2.082999	  0.786676	 -1.081498
  2.046581	  0.817085	 -1.092760
  2.005681	  0.844015	 -1.105096
  1.962723	  0.866688	 -1.119167
  1.919020	  0.886100	 -1.135592
  1.875607	  0.905117	 -1.153071
  1.832428	  0.924560	 -1.170653
  1.789227	  0.944407	 -1.188611
  1.746857	  0.964369	 -1.206944
  1.705057	  0.985094	 -1.224594
  1.662709	  1.007915	 -1.242015
  1.621930	  1.033847	 -1.259106
  1.582634	  1.063005	 -1.274250
  1.545321	  1.093916	 -1.287373
  1.510204	  1.125523	 -1.299454
  1.475740	  1.157947	 -1.312279
  1.441974	  1.192469	 -1.326786
  1.408472	  1.228827	 -1.342325
  1.376362	  1.265885	 -1.357843
  1.344584	  1.302313	 -1.371312
  1.310845	  1.337200	 -1.381662
  1.275498	  1.370418	 -1.390353
  1.239168	  1.402925	 -1.397705
  1.202380	  1.435097	 -1.403844
  1.164541	  1.466805	 -1.409639
  1.124269	  1.497625	 -1.416361
  1.081826	  1.525894	 -1.424493
  1.038826	  1.551053	 -1.433512
  0.995848	  1.574857	 -1.442772
  0.952732	  1.598001	 -1.453020
  0.909361	  1.620588	 -1.464790
  0.865765	  1.642573	 -1.478058
  0.822863	  1.663580	 -1.492571
  0.779309	  1.684624	 -1.508687
  0.736405	  1.705656	 -1.525351
  0.695794	  1.726891	 -1.540812
  0.656028	  1.749602	 -1.555530
  0.617092	  1.775374	 -1.570262
  0.579650	  1.804982	 -1.588056
  0.545876	  1.838515	 -1.606564
  0.509162	  1.870791	 -1.621722
  0.470208	  1.900911	 -1.634955
  0.430504	  1.928867	 -1.648773
  0.390057	  1.954335	 -1.663525
  0.349827	  1.978710	 -1.678008
  0.309767	  2.002807	 -1.692403
  0.269490	  2.027310	 -1.707171
  0.229496	  2.052458	 -1.722385
  0.190033	  2.079140	 -1.735434
  0.150761	  2.105963	 -1.747200
  0.110556	  2.132296	 -1.756134
  0.067272	  2.155195	 -1.765959
  0.030327	  2.187119	 -1.776172
 -0.010744	  2.212381	 -1.786420
 -0.050041	  2.238501	 -1.798704
 -0.086353	  2.268732	 -1.812048
 -0.126933	  2.295045	 -1.826297
 -0.168151	  2.322430	 -1.841327
 -0.211920	  2.345935	 -1.857870
 -0.214040	  2.369394	 -1.876448
