  1.855892	  1.438055	  0.552945
  1.893617	  1.441127	  0.545317
  1.869674	  1.439178	  0.550158
  1.815796	  1.445268	  0.559079
  1.769869	  1.444575	  0.565626
  1.717477	  1.452324	  0.591050
  1.663743	  1.459342	  0.602153
  1.617030	  1.464790	  0.607285
  1.574807	  1.464888	  0.609110
  1.527263	  1.462215	  0.609772
  1.476394	  1.460846	  0.612565
  1.423724	  1.465094	  0.628065
  1.364344	  1.485846	  0.685395
  1.312592	  1.537956	  0.776166
  1.273256	  1.573453	  0.806986
  1.215410	  1.588129	  0.880193
  1.156730	  1.690714	  0.910155
  1.058978	  1.682372	  0.895090
  0.992289	  1.682239	  0.884045
  0.942152	  1.680877	  0.876290
  0.900593	  1.678534	  0.869793
  0.866544	  1.673816	  0.862947
  0.825622	  1.664340	  0.851976
  0.769319	  1.646261	  0.831334
  0.727732	  1.629206	  0.807471
  0.702616	  1.615902	  0.784732
  0.665127	  1.591817	  0.740480
  0.597047	  1.554937	  0.678896
  0.512217	  1.523619	  0.635258
  0.440660	  1.504594	  0.614165
  0.384091	  1.492396	  0.603861
  0.332114	  1.483584	  0.597065
  0.281946	  1.475890	  0.592283
  0.236477	  1.468151	  0.588323
  0.199523	  1.460557	  0.583177
  0.176851	  1.454975	  0.576413
  0.162931	  1.451422	  0.568357
  0.143629	  1.445802	  0.549770
  0.114769	  1.430068	  0.507319
  0.084649	  1.401183	  0.456790
  0.054685	  1.370351	  0.419344
  0.007091	  1.330505	  0.384770
 -0.083733	  1.274850	  0.349926
 -0.212957	  1.228133	  0.327194
 -0.339781	  1.211903	  0.338980
 -0.444290	  1.226607	  0.386484
 -0.542910	  1.263230	  0.461117
 -0.598617	  1.293197	  0.516182
 -0.632139	  1.317179	  0.557500
 -0.671095	  1.349030	  0.609795
 -0.717559	  1.379338	  0.660863
 -0.757777	  1.398467	  0.694723
 -0.785443	  1.409436	  0.714208
 -0.810103	  1.418378	  0.729417
 -0.841091	  1.428976	  0.745411
 -0.882175	  1.441616	  0.761357
 -0.929616	  1.454724	  0.774547
 -0.978702	  1.466670	  0.784619
 -1.026541	  1.476560	  0.791441
 -1.073461	  1.484406	  0.795191
 -1.119591	  1.489647	  0.795986
 -1.163506	  1.490938	  0.795929
 -1.209699	  1.486178	  0.796939
 -1.259420	  1.476060	  0.797473
 -1.309224	  1.463934	  0.797218
 -1.358466	  1.451302	  0.796676
 -1.406577	  1.439359	  0.796304
 -1.455734	  1.428655	  0.796508
 -1.506782	  1.420238	  0.797666
 -1.560266	  1.415056	  0.800092
 -1.610681	  1.411596	  0.803259
 -1.664140	  1.409061	  0.808083
 -1.717339	  1.408154	  0.809369
 -1.772437	  1.407262	  0.808373
 -1.861614	  1.412656	  0.806431
 -1.875244	  1.413439	  0.806384
