  2.256118	  0.883358	 -0.395822
  2.273123	  0.889350	 -0.396991
  2.254353	  0.882651	 -0.395663
  2.235710	  0.875711	 -0.394056
  2.216765	  0.868918	 -0.392336
  2.197850	  0.862600	 -0.390839
  2.178742	  0.857352	 -0.389746
  2.159608	  0.851465	 -0.388311
  2.140501	  0.845765	 -0.386654
  2.121343	  0.840286	 -0.384938
  2.102144	  0.834960	 -0.383195
  2.082825	  0.830116	 -0.381371
  2.063506	  0.825277	 -0.379546
  2.044133	  0.820641	 -0.377754
  2.024745	  0.816068	 -0.375972
  2.005361	  0.811444	 -0.374264
  1.986023	  0.806492	 -0.373041
  1.966685	  0.801538	 -0.371819
  1.947382	  0.796513	 -0.370358
  1.928106	  0.791434	 -0.368729
  1.909066	  0.785677	 -0.366648
  1.890438	  0.778936	 -0.363905
  1.871810	  0.772193	 -0.361166
  1.852824	  0.766105	 -0.359593
  1.833730	  0.760265	 -0.358448
  1.814633	  0.754434	 -0.357310
  1.795123	  0.750048	 -0.356988
  1.775464	  0.746369	 -0.357058
  1.755805	  0.742699	 -0.357132
  1.735987	  0.740086	 -0.357736
  1.716255	  0.737189	 -0.358400
  1.696551	  0.733651	 -0.359235
  1.677362	  0.728570	 -0.360875
  1.658124	  0.724852	 -0.362587
  1.639667	  0.721105	 -0.365264
  1.617660	  0.715830	 -0.369083
  1.599648	  0.708481	 -0.370878
  1.582751	  0.701692	 -0.366999
  1.564316	  0.696935	 -0.364867
  1.541388	  0.690601	 -0.366742
  1.526965	  0.684167	 -0.363684
  1.505158	  0.675957	 -0.355615
  1.488018	  0.667119	 -0.356237
  1.472477	  0.645797	 -0.364982
  1.457796	  0.632000	 -0.370129
  1.436071	  0.635740	 -0.366660
  1.412316	  0.640028	 -0.355239
  1.396378	  0.635464	 -0.349966
  1.375707	  0.627413	 -0.350656
  1.360124	  0.616699	 -0.349868
  1.343286	  0.603631	 -0.341948
  1.323719	  0.597968	 -0.336575
  1.303307	  0.593438	 -0.341150
  1.285672	  0.583711	 -0.342368
  1.271384	  0.569698	 -0.339032
  1.256265	  0.557732	 -0.333410
  1.237016	  0.549665	 -0.331029
  1.218130	  0.540098	 -0.331163
  1.203686	  0.529062	 -0.328168
  1.185161	  0.521364	 -0.325315
  1.164802	  0.516605	 -0.326165
  1.147652	  0.507934	 -0.326421
  1.128571	  0.500033	 -0.324013
  1.108971	  0.496176	 -0.321097
  1.088600	  0.495818	 -0.320454
  1.068399	  0.496374	 -0.321293
  1.049001	  0.498938	 -0.321748
  1.030064	  0.501773	 -0.321339
  1.007272	  0.501731	 -0.321764
  0.986929	  0.499069	 -0.323890
  0.969807	  0.500887	 -0.326580
  0.948960	  0.497988	 -0.327795
  0.928022	  0.493758	 -0.329783
  0.909698	  0.496937	 -0.329512
  0.889807	  0.494402	 -0.327978
  0.869528	  0.489932	 -0.328423
  0.849459	  0.490367	 -0.329690
  0.828833	  0.489601	 -0.330978
  0.808613	  0.484732	 -0.331995
  0.791832	  0.477084	 -0.331219
  0.771972	  0.471720	 -0.330703
  0.752022	  0.464922	 -0.331402
  0.733849	  0.458098	 -0.332055
  0.715757	  0.447632	 -0.333076
  0.698610	  0.437304	 -0.333276
  0.681145	  0.428580	 -0.332076
  0.661426	  0.423840	 -0.329110
  0.640849	  0.417446	 -0.326773
  0.624725	  0.407549	 -0.327326
  0.606612	  0.398155	 -0.328382
  0.588358	  0.390385	 -0.327092
  0.571025	  0.381164	 -0.326531
  0.553125	  0.369854	 -0.326892
  0.534570	  0.363277	 -0.326779
  0.515180	  0.357787	 -0.327420
  0.495379	  0.351788	 -0.324661
  0.478617	  0.345452	 -0.321874
  0.458011	  0.339621	 -0.317962
  0.439435	  0.329251	 -0.317501
  0.422034	  0.319108	 -0.321881
  0.403745	  0.312415	 -0.325984
  0.383769	  0.309308	 -0.324971
  0.364642	  0.301988	 -0.323053
  0.345644	  0.296211	 -0.321652
  0.325007	  0.295031	 -0.317715
  0.304445	  0.292823	 -0.312576
  0.284623	  0.289113	 -0.309389
  0.267814	  0.279049	 -0.308879
  0.250808	  0.270082	 -0.308138
  0.229942	  0.264769	 -0.305386
  0.209568	  0.262611	 -0.302465
  0.192430	  0.257384	 -0.298703
  0.171708	  0.250863	 -0.302498
  0.152903	  0.243988	 -0.302128
  0.135050	  0.237652	 -0.295554
  0.115688	  0.234026	 -0.293469
  0.095648	  0.234163	 -0.295181
  0.075647	  0.230634	 -0.293633
  0.052469	  0.224270	 -0.295163
  0.035759	  0.216736	 -0.294867
  0.019730	  0.207625	 -0.286927
 -0.001768	  0.204990	 -0.285301
 -0.020571	  0.201617	 -0.289075
 -0.039098	  0.194930	 -0.288081
 -0.060190	  0.193358	 -0.293424
 -0.079458	  0.191354	 -0.300655
 -0.098761	  0.188966	 -0.298369
 -0.120829	  0.185945	 -0.294295
 -0.138599	  0.183396	 -0.297646
 -0.156377	  0.179276	 -0.302447
 -0.179878	  0.178576	 -0.304687
 -0.197673	  0.172928	 -0.305623
 -0.214372	  0.165840	 -0.313415
 -0.232344	  0.162732	 -0.323609
 -0.254111	  0.156363	 -0.324641
 -0.272800	  0.151208	 -0.326750
 -0.293425	  0.148435	 -0.332717
 -0.310734	  0.147396	 -0.334578
 -0.330432	  0.143143	 -0.333730
 -0.351520	  0.139981	 -0.334149
 -0.371442	  0.137616	 -0.337313
 -0.391352	  0.129788	 -0.335661
 -0.411990	  0.124961	 -0.340545
 -0.427846	  0.129169	 -0.349552
 -0.450665	  0.132541	 -0.351846
 -0.468188	  0.123789	 -0.349024
 -0.487371	  0.118215	 -0.348205
 -0.508126	  0.119679	 -0.349012
 -0.528515	  0.114777	 -0.349210
 -0.547846	  0.110935	 -0.346933
 -0.566575	  0.109538	 -0.340655
 -0.583926	  0.101561	 -0.335889
 -0.604482	  0.096790	 -0.332537
 -0.625241	  0.099457	 -0.331745
 -0.644569	  0.100165	 -0.329859
 -0.664815	  0.100769	 -0.328371
 -0.683820	  0.108325	 -0.326103
 -0.700813	  0.115215	 -0.321197
 -0.725293	  0.116949	 -0.315732
 -0.741622	  0.115355	 -0.316462
 -0.761026	  0.119325	 -0.313425
 -0.782029	  0.126870	 -0.308194
 -0.800835	  0.128007	 -0.306128
 -0.821454	  0.129038	 -0.306545
 -0.839367	  0.138407	 -0.306695
 -0.857315	  0.147986	 -0.306072
 -0.878466	  0.152392	 -0.308747
 -0.899055	  0.153156	 -0.307859
 -0.917872	  0.154189	 -0.302122
 -0.937547	  0.158677	 -0.301573
 -0.955926	  0.164740	 -0.301770
 -0.975685	  0.171448	 -0.299610
 -0.994678	  0.177698	 -0.298757
 -1.012608	  0.185589	 -0.299002
 -1.031356	  0.193406	 -0.297568
 -1.051316	  0.199502	 -0.301628
 -1.071746	  0.202825	 -0.306093
 -1.087997	  0.208923	 -0.301718
 -1.107989	  0.216667	 -0.302669
 -1.125653	  0.224324	 -0.307825
 -1.143079	  0.231621	 -0.315079
 -1.161544	  0.239591	 -0.320326
 -1.178801	  0.248297	 -0.325688
 -1.198492	  0.252763	 -0.328312
 -1.217309	  0.255353	 -0.333316
 -1.236342	  0.256630	 -0.338465
 -1.255015	  0.259452	 -0.347127
 -1.269917	  0.265388	 -0.357566
 -1.289763	  0.272074	 -0.370376
 -1.305756	  0.273970	 -0.373055
 -1.324883	  0.273372	 -0.379034
 -1.345355	  0.270945	 -0.385938
 -1.363819	  0.274109	 -0.396372
 -1.378567	  0.276999	 -0.408271
 -1.396266	  0.281964	 -0.416183
 -1.413437	  0.290586	 -0.424741
 -1.428128	  0.298114	 -0.436908
 -1.448038	  0.297820	 -0.446467
 -1.466988	  0.292128	 -0.453534
 -1.485009	  0.287562	 -0.466318
 -1.496684	  0.288909	 -0.476183
 -1.514882	  0.290992	 -0.488748
 -1.530924	  0.290865	 -0.501059
 -1.547181	  0.286430	 -0.512286
 -1.564080	  0.282198	 -0.523974
 -1.579155	  0.283942	 -0.536027
 -1.592335	  0.283527	 -0.550078
 -1.610416	  0.283016	 -0.565893
 -1.621613	  0.277178	 -0.577653
 -1.634245	  0.272520	 -0.590855
 -1.648734	  0.269676	 -0.605348
 -1.663457	  0.267240	 -0.619533
 -1.677023	  0.264444	 -0.633763
 -1.689355	  0.259133	 -0.649003
 -1.700621	  0.250993	 -0.663961
 -1.712523	  0.243157	 -0.677091
 -1.726616	  0.238237	 -0.689848
 -1.740779	  0.234279	 -0.703267
 -1.753235	  0.223616	 -0.719068
 -1.761129	  0.211788	 -0.732960
 -1.771729	  0.204271	 -0.746899
 -1.781853	  0.193766	 -0.761110
 -1.793184	  0.183514	 -0.773713
 -1.805109	  0.173297	 -0.786291
 -1.815680	  0.161964	 -0.799153
 -1.824356	  0.152273	 -0.814354
 -1.833302	  0.139357	 -0.828661
 -1.845739	  0.126104	 -0.836597
 -1.856234	  0.111236	 -0.846052
 -1.863419	  0.096321	 -0.857404
 -1.865253	  0.083279	 -0.860965
 -1.873450	  0.073435	 -0.867325
 -1.886352	  0.062914	 -0.857146
 -1.895623	  0.051048	 -0.841798
 -1.901867	  0.038520	 -0.828294
 -1.906106	  0.025236	 -0.815630
 -1.911607	  0.013189	 -0.797595
 -1.914241	  0.004566	 -0.777293
 -1.917500	 -0.004458	 -0.762347
 -1.918565	 -0.016162	 -0.746068
 -1.920201	 -0.026484	 -0.727791
 -1.925956	 -0.035674	 -0.712320
 -1.933377	 -0.044882	 -0.694294
 -1.939419	 -0.052222	 -0.675418
 -1.946814	 -0.058721	 -0.657243
 -1.949190	 -0.069293	 -0.642426
 -1.949111	 -0.082456	 -0.626187
 -1.951021	 -0.094223	 -0.609823
 -1.953634	 -0.104496	 -0.593089
 -1.961046	 -0.115211	 -0.577597
 -1.962914	 -0.126778	 -0.561780
 -1.966853	 -0.138533	 -0.545877
 -1.971543	 -0.149825	 -0.529823
 -1.977785	 -0.161373	 -0.515081
 -1.981272	 -0.173812	 -0.500766
 -1.986414	 -0.187185	 -0.486685
 -1.993981	 -0.199935	 -0.475364
 -1.999647	 -0.215671	 -0.461283
 -2.010278	 -0.234536	 -0.454350
 -2.022416	 -0.241792	 -0.446677
 -2.033525	 -0.250835	 -0.434322
 -2.049256	 -0.262742	 -0.426324
 -2.068032	 -0.274648	 -0.424837
 -2.078239	 -0.283794	 -0.419813
 -2.095356	 -0.290829	 -0.419907
 -2.116225	 -0.296909	 -0.422072
 -2.134341	 -0.299592	 -0.428481
 -2.150864	 -0.307573	 -0.430833
 -2.171896	 -0.312293	 -0.431571
 -2.193365	 -0.321071	 -0.434496
 -2.205688	 -0.326965	 -0.440281
 -2.225757	 -0.334301	 -0.445346
 -2.248066	 -0.340992	 -0.445026
 -2.267649	 -0.340638	 -0.447331
 -2.285889	 -0.339714	 -0.445283
 -2.307255	 -0.345320	 -0.445593
 -2.327057	 -0.350202	 -0.446427
 -2.345510	 -0.351844	 -0.444886
 -2.365610	 -0.355108	 -0.442302
 -2.386768	 -0.357947	 -0.441066
 -2.405916	 -0.358697	 -0.438318
 -2.425702	 -0.361200	 -0.436824
