  1.071623	 -2.086019	  0.869010
  1.072213	 -2.084355	  0.869381
  1.078164	 -2.067575	  0.873122
  1.085012	 -2.049085	  0.876460
  1.091939	 -2.030585	  0.879582
  1.098985	 -2.012120	  0.882649
  1.106247	 -1.993724	  0.885626
  1.113494	 -1.975315	  0.888549
  1.120451	 -1.956687	  0.890674
  1.127251	 -1.937961	  0.892428
  1.133979	 -1.919199	  0.894094
  1.139826	 -1.900073	  0.894576
  1.145345	 -1.880849	  0.894666
  1.150722	 -1.861582	  0.894568
  1.154796	 -1.842014	  0.893624
  1.158591	 -1.822419	  0.892406
  1.162358	 -1.802810	  0.891470
  1.166036	 -1.783162	  0.891106
  1.169808	 -1.763532	  0.891144
  1.174099	 -1.744055	  0.892485
  1.178478	 -1.724594	  0.893919
  1.183553	 -1.705254	  0.894117
  1.188993	 -1.686014	  0.893686
  1.194516	 -1.666811	  0.893082
  1.200864	 -1.648060	  0.890317
  1.207415	 -1.629436	  0.887131
  1.214304	 -1.610862	  0.884421
  1.221653	 -1.592370	  0.882414
  1.228958	 -1.573859	  0.880417
  1.235890	 -1.555191	  0.878547
  1.242735	 -1.536505	  0.876567
  1.248836	 -1.517555	  0.874647
  1.254085	 -1.498340	  0.872818
  1.259071	 -1.479062	  0.870996
  1.262111	 -1.459373	  0.869217
  1.264792	 -1.439644	  0.867337
  1.267544	 -1.419956	  0.865203
  1.270218	 -1.400539	  0.862412
  1.270156	 -1.382579	  0.860785
  1.266850	 -1.361970	  0.865510
  1.272702	 -1.335906	  0.869829
  1.282107	 -1.315132	  0.864495
  1.289893	 -1.301942	  0.860041
  1.299512	 -1.284571	  0.852262
  1.307880	 -1.267416	  0.847692
  1.316381	 -1.250142	  0.843762
  1.326457	 -1.223353	  0.843681
  1.329166	 -1.213868	  0.844950
  1.335787	 -1.191722	  0.847932
  1.343897	 -1.171379	  0.846902
  1.349807	 -1.160354	  0.844502
  1.364094	 -1.135570	  0.835500
  1.372488	 -1.112708	  0.833957
  1.376246	 -1.099838	  0.834241
  1.376540	 -1.084338	  0.840541
  1.379954	 -1.060411	  0.840319
  1.385092	 -1.040498	  0.837149
  1.388134	 -1.021464	  0.831827
  1.388303	 -1.003274	  0.823580
  1.388297	 -0.985137	  0.815155
  1.388286	 -0.967005	  0.806725
  1.388066	 -0.949052	  0.798047
  1.384394	 -0.934303	  0.785163
  1.379147	 -0.921629	  0.770627
  1.373813	 -0.909062	  0.756012
  1.368478	 -0.896495	  0.741397
  1.363142	 -0.883928	  0.726781
  1.357803	 -0.871367	  0.712168
  1.352099	 -0.859042	  0.697554
  1.342455	 -0.849142	  0.683178
  1.332446	 -0.839486	  0.668808
  1.322434	 -0.829832	  0.654435
  1.312429	 -0.820175	  0.640061
  1.302500	 -0.810490	  0.625658
  1.292893	 -0.800636	  0.611117
  1.282171	 -0.790365	  0.597531
  1.269624	 -0.779714	  0.585809
  1.256754	 -0.769450	  0.574337
  1.242946	 -0.761035	  0.562489
  1.228911	 -0.753428	  0.550648
  1.217480	 -0.743936	  0.538437
  1.207895	 -0.732942	  0.523624
  1.194693	 -0.723793	  0.510287
  1.183071	 -0.713736	  0.500300
  1.170343	 -0.700392	  0.485898
  1.154731	 -0.691428	  0.469688
  1.135616	 -0.685544	  0.460107
  1.118608	 -0.680769	  0.457870
  1.099827	 -0.670676	  0.458014
  1.083217	 -0.658410	  0.453968
  1.069197	 -0.644090	  0.450227
  1.055225	 -0.629640	  0.447043
  1.041181	 -0.615133	  0.445620
  1.027849	 -0.600688	  0.447018
  1.018028	 -0.584689	  0.453010
  1.009942	 -0.567791	  0.460495
  1.005001	 -0.550364	  0.469575
  1.002274	 -0.532494	  0.478847
  1.000982	 -0.513922	  0.485762
  0.999397	 -0.496119	  0.493136
  0.998504	 -0.477323	  0.503143
  0.999323	 -0.457864	  0.509082
  1.000320	 -0.438927	  0.513268
  1.001410	 -0.420454	  0.521268
  1.004908	 -0.402043	  0.527548
  1.010647	 -0.384165	  0.533598
  1.017269	 -0.366690	  0.541208
  1.023354	 -0.349842	  0.550147
  1.031951	 -0.337127	  0.562371
  1.045375	 -0.326689	  0.573162
  1.061505	 -0.318468	  0.584424
  1.075180	 -0.313054	  0.600159
  1.083178	 -0.307587	  0.618099
  1.089392	 -0.299364	  0.633830
  1.101834	 -0.293198	  0.649176
  1.112084	 -0.288803	  0.666821
  1.116991	 -0.281994	  0.685063
  1.126835	 -0.276172	  0.701502
  1.138181	 -0.272245	  0.718056
  1.146503	 -0.267484	  0.735683
  1.155021	 -0.261921	  0.752911
  1.164344	 -0.256410	  0.769686
  1.173650	 -0.249873	  0.785962
  1.186853	 -0.239832	  0.797034
  1.200458	 -0.229745	  0.807667
  1.214147	 -0.219624	  0.818115
  1.228966	 -0.208596	  0.825337
  1.244679	 -0.196715	  0.822885
  1.260432	 -0.184797	  0.819822
  1.276192	 -0.172874	  0.816743
  1.291934	 -0.160902	  0.813789
  1.307333	 -0.148204	  0.812533
  1.322417	 -0.135065	  0.812489
  1.337479	 -0.121907	  0.812507
  1.352525	 -0.108731	  0.812628
  1.367639	 -0.095649	  0.812804
  1.383728	 -0.083903	  0.813446
  1.401109	 -0.074544	  0.812974
  1.419960	 -0.069672	  0.810185
  1.439400	 -0.067175	  0.806835
  1.458977	 -0.065193	  0.803277
  1.478721	 -0.064322	  0.800296
  1.498553	 -0.064157	  0.797646
  1.518415	 -0.063932	  0.795370
  1.538278	 -0.063506	  0.793277
  1.558001	 -0.060425	  0.791328
  1.577639	 -0.057116	  0.789612
  1.597343	 -0.054064	  0.787866
  1.616908	 -0.050683	  0.785872
  1.635989	 -0.046142	  0.785057
  1.651451	 -0.033912	  0.786230
  1.666722	 -0.021237	  0.786704
  1.680822	 -0.010433	  0.788527
  1.694619	 -0.001505	  0.798729
  1.704762	  0.023889	  0.810410
  1.713839	  0.047513	  0.811893
  1.718943	  0.059148	  0.812558
  1.725324	  0.073515	  0.814397
  1.736930	  0.100222	  0.815251
  1.742613	  0.112726	  0.815017
  1.747298	  0.124484	  0.816322
  1.758274	  0.156312	  0.818842
  1.767284	  0.176501	  0.815260
  1.774078	  0.187346	  0.810636
  1.785064	  0.197632	  0.809568
  1.798308	  0.221357	  0.811975
  1.803259	  0.243889	  0.803494
  1.806720	  0.262053	  0.794848
  1.808673	  0.280622	  0.789769
  1.813169	  0.299567	  0.787292
  1.816393	  0.320053	  0.785208
  1.818223	  0.348468	  0.784812
  1.819149	  0.357304	  0.784743
  1.823382	  0.376600	  0.785550
  1.832594	  0.400040	  0.786799
  1.841603	  0.420439	  0.787530
  1.844243	  0.438326	  0.783999
  1.851252	  0.456947	  0.780442
  1.860489	  0.477117	  0.776231
  1.867265	  0.494851	  0.772998
  1.872396	  0.513406	  0.774770
  1.874629	  0.526197	  0.778557
  1.882414	  0.545333	  0.785044
  1.891300	  0.566019	  0.786720
  1.898333	  0.585253	  0.787797
  1.901950	  0.604430	  0.788579
  1.904046	  0.624910	  0.791913
  1.905449	  0.646037	  0.793966
  1.907377	  0.666600	  0.793405
  1.911126	  0.687224	  0.790571
  1.916713	  0.709088	  0.784381
  1.921116	  0.728212	  0.778923
  1.923078	  0.745364	  0.779285
  1.923468	  0.765987	  0.784548
  1.923753	  0.783693	  0.789381
  1.924741	  0.804803	  0.794148
  1.926197	  0.825475	  0.794729
  1.922952	  0.847495	  0.790052
  1.916958	  0.870164	  0.776386
  1.920540	  0.890006	  0.766016
  1.926401	  0.905980	  0.761497
  1.931500	  0.924505	  0.759178
  1.932518	  0.944049	  0.756474
  1.933208	  0.966953	  0.752886
  1.938893	  0.990673	  0.749280
  1.946073	  1.008015	  0.744266
  1.957048	  1.027981	  0.737008
  1.962788	  1.039540	  0.731515
  1.970491	  1.057246	  0.726765
  1.974423	  1.079318	  0.722410
  1.977944	  1.095692	  0.718136
  1.984078	  1.113860	  0.712996
  1.992225	  1.134092	  0.705042
  2.001645	  1.151676	  0.698646
  2.011606	  1.166606	  0.695565
  2.022889	  1.184362	  0.695344
  2.034107	  1.201798	  0.698163
  2.045148	  1.221159	  0.700541
  2.054974	  1.239447	  0.700610
  2.062491	  1.256295	  0.697789
