 -0.293875	 -2.155092	 -1.137345
 -0.311158	 -2.187156	 -1.149300
 -0.305967	 -2.177526	 -1.145710
 -0.287213	 -2.134990	 -1.127567
 -0.266931	 -2.091580	 -1.109648
 -0.243217	 -2.047467	 -1.092524
 -0.216796	 -2.002902	 -1.075005
 -0.188168	 -1.958518	 -1.056416
 -0.157977	 -1.915182	 -1.036541
 -0.126770	 -1.873403	 -1.015337
 -0.095156	 -1.834114	 -0.993175
 -0.063559	 -1.797892	 -0.971636
 -0.031540	 -1.762654	 -0.950321
  0.001270	 -1.728464	 -0.928311
  0.034320	 -1.695841	 -0.906690
  0.068187	 -1.664342	 -0.886310
  0.102897	 -1.632194	 -0.865791
  0.141568	 -1.598427	 -0.843685
  0.181602	 -1.567914	 -0.819750
  0.214142	 -1.540882	 -0.796534
  0.237820	 -1.514394	 -0.775310
  0.255266	 -1.485218	 -0.755604
  0.270337	 -1.452348	 -0.737550
  0.284752	 -1.416417	 -0.722014
  0.299006	 -1.377136	 -0.708367
  0.314733	 -1.332279	 -0.694985
  0.332864	 -1.283315	 -0.679732
  0.352736	 -1.234535	 -0.662675
  0.372952	 -1.187631	 -0.644552
  0.392924	 -1.142171	 -0.625403
  0.412024	 -1.098022	 -0.605512
  0.430303	 -1.054180	 -0.584710
  0.447653	 -1.011152	 -0.563084
  0.462954	 -0.971249	 -0.542177
  0.475316	 -0.935400	 -0.523461
  0.485404	 -0.901046	 -0.506686
  0.495187	 -0.861382	 -0.489672
  0.506644	 -0.808794	 -0.471398
  0.521673	 -0.741315	 -0.455063
  0.540548	 -0.671287	 -0.446145
  0.560126	 -0.611573	 -0.446136
  0.580768	 -0.561814	 -0.450481
  0.608116	 -0.514646	 -0.452249
  0.648665	 -0.467632	 -0.443056
  0.701483	 -0.427270	 -0.413696
  0.761106	 -0.398203	 -0.360792
  0.821797	 -0.384807	 -0.293634
  0.876902	 -0.386451	 -0.244078
  0.914969	 -0.383246	 -0.226109
  0.946462	 -0.369047	 -0.215281
  0.981268	 -0.341219	 -0.198513
  1.012829	 -0.308335	 -0.176228
  1.039767	 -0.274842	 -0.153306
  1.064374	 -0.240117	 -0.129483
  1.087558	 -0.203681	 -0.104176
  1.110525	 -0.166036	 -0.076729
  1.132794	 -0.129386	 -0.048123
  1.154242	 -0.094212	 -0.019869
  1.175426	 -0.059937	  0.007239
  1.196762	 -0.026642	  0.032681
  1.218490	  0.006258	  0.055560
  1.238825	  0.040435	  0.076437
  1.258374	  0.076687	  0.096301
  1.278652	  0.114999	  0.114813
  1.303461	  0.157842	  0.133165
  1.342059	  0.208494	  0.156187
  1.404363	  0.253926	  0.192955
  1.483589	  0.270984	  0.245639
  1.564822	  0.252764	  0.306735
  1.643904	  0.216127	  0.367411
  1.718861	  0.190097	  0.417947
  1.776664	  0.191754	  0.448316
  1.825559	  0.234184	  0.461550
  1.856137	  0.296871	  0.453841
  1.868407	  0.335596	  0.444375
  1.873556	  0.371032	  0.433907
  1.872891	  0.405323	  0.425151
  1.866889	  0.445642	  0.419156
  1.854349	  0.500682	  0.419377
  1.833547	  0.575526	  0.434223
  1.810326	  0.664446	  0.470548
  1.795787	  0.753922	  0.515197
  1.792723	  0.835095	  0.552774
  1.797878	  0.904091	  0.581964
  1.808303	  0.963406	  0.605694
  1.823427	  1.019313	  0.627286
  1.844958	  1.074949	  0.647908
  1.871967	  1.127872	  0.666662
  1.902031	  1.176245	  0.682905
  1.933819	  1.221584	  0.697457
  1.972677	  1.271756	  0.715421
  1.995459	  1.300296	  0.726914
