 -2.001599	  0.746578	  1.429514
 -2.039737	  0.761261	  1.421448
 -2.021759	  0.753428	  1.425377
 -2.004004	  0.745117	  1.429339
 -1.986366	  0.736536	  1.433245
 -1.969152	  0.727055	  1.436958
 -1.951937	  0.717575	  1.440670
 -1.935065	  0.707386	  1.444067
 -1.918316	  0.696963	  1.447357
 -1.901676	  0.686336	  1.450545
 -1.885429	  0.675023	  1.453380
 -1.869181	  0.663710	  1.456216
 -1.853336	  0.651855	  1.459114
 -1.837601	  0.639860	  1.462028
 -1.822006	  0.627858	  1.465600
 -1.806517	  0.615859	  1.469617
 -1.791216	  0.603733	  1.473957
 -1.776118	  0.591479	  1.478636
 -1.761301	  0.578913	  1.483383
 -1.747111	  0.565694	  1.488272
 -1.732942	  0.552456	  1.493170
 -1.719052	  0.538972	  1.498196
 -1.705162	  0.525488	  1.503222
 -1.690934	  0.512627	  1.508891
 -1.676587	  0.500006	  1.514798
 -1.661980	  0.487819	  1.520971
 -1.646873	  0.476556	  1.527674
 -1.631766	  0.465293	  1.534376
 -1.616176	  0.454629	  1.540951
 -1.600378	  0.444238	  1.547467
 -1.584580	  0.433846	  1.553982
 -1.568348	  0.424021	  1.560304
 -1.552080	  0.414244	  1.566610
 -1.535729	  0.404594	  1.572897
 -1.519143	  0.395314	  1.579126
 -1.502558	  0.386035	  1.585355
 -1.485844	  0.376883	  1.591431
 -1.469057	  0.367807	  1.597416
 -1.452270	  0.358732	  1.603401
 -1.435363	  0.349614	  1.608971
 -1.418455	  0.340495	  1.614536
 -1.401526	  0.331333	  1.619963
 -1.384556	  0.322081	  1.625103
 -1.367587	  0.312828	  1.630243
 -1.350464	  0.303656	  1.635008
 -1.333249	  0.294536	  1.639533
 -1.316034	  0.285417	  1.644058
 -1.298657	  0.276372	  1.648087
 -1.281256	  0.267340	  1.652038
 -1.263889	  0.258214	  1.655924
 -1.246614	  0.248843	  1.659638
 -1.229340	  0.239473	  1.663352
 -1.212260	  0.229694	  1.666910
 -1.195236	  0.219805	  1.670425
 -1.178256	  0.209829	  1.673914
 -1.161401	  0.199620	  1.677331
 -1.144545	  0.189411	  1.680748
 -1.127634	  0.179371	  1.684381
 -1.110705	  0.169385	  1.688083
 -1.093727	  0.159508	  1.691850
 -1.076618	  0.149930	  1.695791
 -1.059509	  0.140352	  1.699732
 -1.042272	  0.130961	  1.703569
 -1.025005	  0.121617	  1.707379
 -1.007675	  0.112351	  1.711097
 -0.989962	  0.103604	  1.714217
 -0.972249	  0.094856	  1.717338
 -0.954374	  0.086385	  1.720295
 -0.936182	  0.078499	  1.722910
 -0.917989	  0.070614	  1.725526
 -0.899720	  0.062961	  1.728294
 -0.881415	  0.055419	  1.731134
 -0.863136	  0.047816	  1.733975
 -0.844977	  0.039934	  1.736824
 -0.826818	  0.032051	  1.739672
 -0.808668	  0.024055	  1.742249
 -0.790525	  0.015990	  1.744654
 -0.772382	  0.007924	  1.747059
 -0.754337	 -0.000448	  1.749126
 -0.736292	 -0.008822	  1.751191
 -0.718379	 -0.017469	  1.753276
 -0.700601	 -0.026386	  1.755382
 -0.682832	 -0.035322	  1.757482
 -0.665300	 -0.044745	  1.759435
 -0.647767	 -0.054168	  1.761387
 -0.630314	 -0.063793	  1.763053
 -0.612970	 -0.073666	  1.764361
 -0.595626	 -0.083539	  1.765669
 -0.578315	 -0.093538	  1.766261
 -0.561029	 -0.103593	  1.766507
 -0.543742	 -0.113649	  1.766752
 -0.526452	 -0.123662	  1.765872
 -0.509172	 -0.133656	  1.764635
 -0.491892	 -0.143650	  1.763397
 -0.474649	 -0.153421	  1.760717
 -0.457423	 -0.163146	  1.757767
 -0.440200	 -0.172863	  1.754773
 -0.423185	 -0.182255	  1.750053
 -0.406171	 -0.191647	  1.745333
 -0.389240	 -0.201024	  1.740289
 -0.372700	 -0.210310	  1.733949
 -0.356160	 -0.219596	  1.727609
 -0.339620	 -0.228882	  1.721269
 -0.323181	 -0.237946	  1.714369
 -0.306741	 -0.247009	  1.707470
 -0.290302	 -0.256072	  1.700571
 -0.273862	 -0.265135	  1.693671
 -0.256880	 -0.273055	  1.686679
 -0.239716	 -0.280545	  1.679659
 -0.222551	 -0.288035	  1.672640
 -0.205386	 -0.295524	  1.665620
 -0.188222	 -0.303014	  1.658600
 -0.170752	 -0.309640	  1.651466
 -0.152869	 -0.314848	  1.644180
 -0.134986	 -0.320056	  1.636894
 -0.117103	 -0.325263	  1.629608
 -0.099221	 -0.330471	  1.622322
 -0.080986	 -0.334923	  1.615416
 -0.062452	 -0.338646	  1.608888
 -0.043917	 -0.342369	  1.602360
 -0.025188	 -0.346109	  1.596425
 -0.006197	 -0.349868	  1.591404
  0.013159	 -0.354891	  1.591735
  0.031935	 -0.360481	  1.595763
  0.046177	 -0.366677	  1.608363
  0.056642	 -0.372636	  1.624331
  0.067106	 -0.378595	  1.640300
  0.075800	 -0.385529	  1.656923
  0.084177	 -0.392624	  1.673641
  0.091902	 -0.401064	  1.690045
  0.098323	 -0.411833	  1.705627
  0.104743	 -0.422602	  1.721209
  0.111163	 -0.433371	  1.736791
  0.117547	 -0.445169	  1.751626
  0.123922	 -0.457125	  1.766337
  0.130298	 -0.469081	  1.781048
  0.136673	 -0.481036	  1.795759
  0.143049	 -0.492992	  1.810470
  0.152236	 -0.502511	  1.825470
  0.161781	 -0.511671	  1.840468
  0.171327	 -0.520832	  1.855467
  0.180873	 -0.529992	  1.870466
  0.190418	 -0.539153	  1.885465
  0.200579	 -0.548907	  1.899664
  0.212940	 -0.560787	  1.909964
  0.225300	 -0.572667	  1.920264
  0.237661	 -0.584546	  1.930564
  0.250021	 -0.596426	  1.940864
  0.262474	 -0.608312	  1.951046
  0.277243	 -0.620083	  1.957627
  0.292012	 -0.631855	  1.964208
  0.306781	 -0.643626	  1.970789
  0.321550	 -0.655397	  1.977370
  0.337697	 -0.666040	  1.982469
  0.354243	 -0.676288	  1.987076
  0.370788	 -0.686536	  1.991683
  0.387521	 -0.696559	  1.996105
  0.405034	 -0.705532	  1.999677
  0.422548	 -0.714505	  2.003249
  0.440097	 -0.723426	  2.006777
  0.457811	 -0.732097	  2.010097
  0.475525	 -0.740768	  2.013418
  0.493138	 -0.749405	  2.017315
  0.510709	 -0.758027	  2.021429
  0.528243	 -0.766681	  2.025631
  0.545731	 -0.775374	  2.029944
  0.563219	 -0.784067	  2.034258
  0.580833	 -0.792744	  2.038058
  0.598460	 -0.801420	  2.041805
  0.616086	 -0.810134	  2.045464
  0.633707	 -0.818953	  2.048887
  0.651329	 -0.827772	  2.052310
  0.668713	 -0.836947	  2.055996
  0.686049	 -0.846194	  2.059734
  0.703218	 -0.855609	  2.063803
  0.720262	 -0.865145	  2.068112
  0.737233	 -0.874673	  2.072719
  0.754067	 -0.884182	  2.077837
  0.770872	 -0.893668	  2.083091
  0.787520	 -0.903021	  2.089037
  0.804168	 -0.912375	  2.094984
  0.820586	 -0.922037	  2.101074
  0.836965	 -0.931750	  2.107188
  0.853309	 -0.941656	  2.113081
  0.869586	 -0.951884	  2.118601
  0.885862	 -0.962112	  2.124120
  0.902095	 -0.972617	  2.129234
  0.918314	 -0.983197	  2.134234
  0.934520	 -0.993812	  2.139203
  0.950689	 -1.004529	  2.144074
  0.966857	 -1.015246	  2.148945
  0.983025	 -1.025963	  2.153816
  0.999982	 -1.037210	  2.158927
  1.016135	 -1.047946	  2.163806
