 -0.375263	 -1.098127	 -2.103907
 -0.376238	 -1.105601	 -2.135442
 -0.375540	 -1.100630	 -2.116082
 -0.374703	 -1.095148	 -2.096866
 -0.361187	 -1.080836	 -2.093336
 -0.347238	 -1.066582	 -2.091832
 -0.332913	 -1.052735	 -2.090079
 -0.316325	 -1.042108	 -2.086629
 -0.299738	 -1.031480	 -2.083178
 -0.283150	 -1.020853	 -2.079728
 -0.266562	 -1.010225	 -2.076278
 -0.248994	 -1.002538	 -2.070599
 -0.231324	 -0.995365	 -2.064571
 -0.213655	 -0.988192	 -2.058542
 -0.195985	 -0.981019	 -2.052514
 -0.178316	 -0.973847	 -2.046486
 -0.160618	 -0.969080	 -2.038481
 -0.142992	 -0.965027	 -2.029943
 -0.125366	 -0.960975	 -2.021406
 -0.107740	 -0.956922	 -2.012868
 -0.090113	 -0.952870	 -2.004330
 -0.072487	 -0.948818	 -1.995792
 -0.055736	 -0.946578	 -1.985097
 -0.039105	 -0.944544	 -1.974176
 -0.022474	 -0.942510	 -1.963254
 -0.005844	 -0.940476	 -1.952333
  0.010787	 -0.938442	 -1.941412
  0.027418	 -0.936408	 -1.930490
  0.043890	 -0.934472	 -1.919314
  0.058727	 -0.933451	 -1.905941
  0.073564	 -0.932429	 -1.892569
  0.088401	 -0.931408	 -1.879196
  0.103238	 -0.930387	 -1.865824
  0.118075	 -0.929366	 -1.852451
  0.132912	 -0.928344	 -1.839079
  0.147749	 -0.927323	 -1.825707
  0.161659	 -0.926261	 -1.811375
  0.174549	 -0.925160	 -1.796123
  0.187440	 -0.924060	 -1.780871
  0.200330	 -0.922960	 -1.765619
  0.213221	 -0.921860	 -1.750367
  0.226112	 -0.920759	 -1.735115
  0.239002	 -0.919659	 -1.719863
  0.251893	 -0.918559	 -1.704611
  0.263828	 -0.916711	 -1.688669
  0.274580	 -0.914008	 -1.672024
  0.285332	 -0.911304	 -1.655378
  0.296084	 -0.908600	 -1.638732
  0.306837	 -0.905897	 -1.622086
  0.317589	 -0.903193	 -1.605441
  0.328341	 -0.900489	 -1.588795
  0.339093	 -0.897785	 -1.572149
  0.349845	 -0.895082	 -1.555503
  0.357614	 -0.892647	 -1.537236
  0.364709	 -0.890279	 -1.518687
  0.371804	 -0.887912	 -1.500138
  0.378900	 -0.885544	 -1.481590
  0.385995	 -0.883176	 -1.463041
  0.393090	 -0.880809	 -1.444492
  0.400185	 -0.878441	 -1.425944
  0.407281	 -0.876074	 -1.407395
  0.414376	 -0.873706	 -1.388846
  0.418632	 -0.873884	 -1.369305
  0.421193	 -0.875512	 -1.349537
  0.423755	 -0.877140	 -1.329769
  0.426316	 -0.878768	 -1.310000
  0.428877	 -0.880396	 -1.290232
  0.431438	 -0.882024	 -1.270463
  0.433999	 -0.883653	 -1.250695
  0.436560	 -0.885281	 -1.230927
  0.439121	 -0.886909	 -1.211158
  0.438777	 -0.891589	 -1.191716
  0.438136	 -0.896569	 -1.172357
  0.437496	 -0.901548	 -1.152997
  0.436855	 -0.906528	 -1.133638
  0.436215	 -0.911508	 -1.114278
  0.435575	 -0.916488	 -1.094919
  0.434934	 -0.921468	 -1.075559
  0.434214	 -0.926468	 -1.056208
  0.429816	 -0.932335	 -1.037600
  0.425417	 -0.938202	 -1.018993
  0.421019	 -0.944068	 -1.000385
  0.416621	 -0.949935	 -0.981778
  0.412223	 -0.955802	 -0.963171
  0.407825	 -0.961668	 -0.944563
  0.403426	 -0.967535	 -0.925956
  0.395992	 -0.972845	 -0.908164
  0.387759	 -0.977978	 -0.890675
  0.379526	 -0.983112	 -0.873186
  0.371293	 -0.988246	 -0.855697
  0.363060	 -0.993379	 -0.838208
  0.354827	 -0.998513	 -0.820719
  0.344660	 -1.002800	 -0.804038
  0.333729	 -1.006719	 -0.787755
  0.322798	 -1.010639	 -0.771471
  0.311867	 -1.014558	 -0.755188
  0.300544	 -1.017421	 -0.738952
  0.288861	 -1.019205	 -0.722818
  0.277177	 -1.020916	 -0.706676
  0.265612	 -1.019525	 -0.690418
  0.254230	 -1.016992	 -0.674169
  0.243351	 -1.012104	 -0.658114
  0.232858	 -1.005607	 -0.642376
  0.222838	 -0.997509	 -0.627079
  0.212890	 -0.989153	 -0.611873
  0.203695	 -0.978517	 -0.597649
  0.194500	 -0.967881	 -0.583425
  0.185640	 -0.956708	 -0.569401
  0.177333	 -0.944708	 -0.555726
  0.169027	 -0.932708	 -0.542051
  0.161527	 -0.920306	 -0.528269
  0.154175	 -0.907883	 -0.514426
  0.147637	 -0.896074	 -0.499668
  0.141931	 -0.885399	 -0.483747
  0.137153	 -0.876104	 -0.466695
  0.132789	 -0.867579	 -0.449137
  0.128572	 -0.859340	 -0.431408
  0.124664	 -0.851776	 -0.413310
  0.120772	 -0.844232	 -0.395201
  0.117285	 -0.837155	 -0.376823
  0.113906	 -0.830148	 -0.358398
  0.111248	 -0.823617	 -0.339682
  0.108948	 -0.817365	 -0.320824
  0.107280	 -0.811612	 -0.301742
  0.105996	 -0.806377	 -0.282482
  0.105009	 -0.801545	 -0.263100
  0.104189	 -0.797388	 -0.243554
  0.103505	 -0.793784	 -0.223893
  0.102873	 -0.790712	 -0.204140
  0.102353	 -0.788798	 -0.184239
  0.101833	 -0.786884	 -0.164338
  0.101232	 -0.786581	 -0.144349
  0.100623	 -0.786441	 -0.124359
  0.099900	 -0.786730	 -0.104374
  0.098867	 -0.788189	 -0.084454
  0.097833	 -0.789648	 -0.064534
  0.096593	 -0.791406	 -0.044650
  0.094742	 -0.794044	 -0.024911
  0.092891	 -0.796682	 -0.005173
  0.091041	 -0.799320	  0.014566
  0.088382	 -0.802548	  0.034124
  0.085547	 -0.805904	  0.053635
  0.082712	 -0.809260	  0.073147
  0.079802	 -0.812641	  0.092643
  0.076119	 -0.816279	  0.111962
  0.072436	 -0.819917	  0.131280
  0.068754	 -0.823555	  0.150599
  0.064873	 -0.827221	  0.169873
  0.060494	 -0.830958	  0.189026
  0.056115	 -0.834695	  0.208180
  0.051735	 -0.838431	  0.227334
  0.047220	 -0.842192	  0.246451
  0.042656	 -0.845962	  0.265555
  0.038091	 -0.849731	  0.284658
  0.033724	 -0.853334	  0.303840
  0.029425	 -0.856881	  0.323048
  0.025337	 -0.860258	  0.342333
  0.021634	 -0.863328	  0.361746
  0.018355	 -0.866097	  0.381280
  0.015584	 -0.868505	  0.400940
  0.013572	 -0.870337	  0.420754
  0.011807	 -0.871974	  0.440608
  0.010802	 -0.872907	  0.460561
  0.009837	 -0.873785	  0.480519
  0.009371	 -0.874000	  0.500512
  0.008906	 -0.874215	  0.520506
  0.008868	 -0.873822	  0.540502
  0.008873	 -0.873370	  0.560497
  0.009135	 -0.872530	  0.580477
  0.009541	 -0.871472	  0.600445
  0.010010	 -0.870270	  0.620403
  0.010649	 -0.868677	  0.640330
  0.011288	 -0.867084	  0.660256
  0.012023	 -0.865133	  0.680147
  0.012780	 -0.863102	  0.700029
  0.013599	 -0.860949	  0.719896
  0.014523	 -0.858587	  0.739734
  0.015447	 -0.856225	  0.759573
  0.016624	 -0.853732	  0.779382
  0.017808	 -0.851235	  0.799190
  0.019139	 -0.848584	  0.818969
  0.020562	 -0.845836	  0.838728
  0.022017	 -0.843019	  0.858475
  0.023586	 -0.839952	  0.878176
  0.025155	 -0.836884	  0.897877
  0.026895	 -0.833575	  0.917525
  0.028676	 -0.830208	  0.937159
  0.030503	 -0.826764	  0.956775
  0.032404	 -0.823192	  0.976361
  0.034306	 -0.819621	  0.995948
  0.036301	 -0.815989	  1.015514
  0.038302	 -0.812354	  1.035079
  0.040436	 -0.808757	  1.054636
  0.042684	 -0.805193	  1.074187
  0.044967	 -0.801689	  1.093745
  0.047415	 -0.798470	  1.113332
  0.049862	 -0.795251	  1.132919
  0.052243	 -0.792616	  1.152601
  0.054601	 -0.790171	  1.172311
  0.056904	 -0.788028	  1.192062
  0.059061	 -0.786647	  1.211897
  0.061219	 -0.785267	  1.231733
  0.063116	 -0.784743	  1.251635
  0.064933	 -0.784482	  1.271551
  0.066665	 -0.784424	  1.291476
  0.068079	 -0.785130	  1.311413
  0.069493	 -0.785836	  1.331351
  0.070715	 -0.787180	  1.351268
  0.071846	 -0.788822	  1.371169
  0.072945	 -0.790622	  1.391057
  0.073829	 -0.793502	  1.410829
  0.074713	 -0.796382	  1.430601
  0.075402	 -0.799722	  1.450308
  0.075726	 -0.803918	  1.469860
  0.076049	 -0.808114	  1.489412
  0.076311	 -0.812734	  1.508869
  0.076445	 -0.818242	  1.528095
  0.076578	 -0.823750	  1.547322
  0.076694	 -0.829333	  1.566526
  0.076553	 -0.835983	  1.585388
  0.076413	 -0.842633	  1.604249
  0.076272	 -0.849283	  1.623111
  0.075837	 -0.856289	  1.641839
  0.075093	 -0.863663	  1.660414
  0.074350	 -0.871038	  1.678990
  0.073607	 -0.878413	  1.697566
  0.072324	 -0.886257	  1.715919
  0.070854	 -0.894261	  1.734188
  0.069384	 -0.902265	  1.752458
  0.067881	 -0.910293	  1.770714
  0.065542	 -0.918891	  1.788620
  0.063203	 -0.927489	  1.806525
  0.060863	 -0.936087	  1.824430
  0.058313	 -0.944896	  1.842204
  0.055628	 -0.953840	  1.859890
  0.052943	 -0.962783	  1.877576
  0.050224	 -0.971359	  1.895439
  0.047484	 -0.979696	  1.913410
  0.044744	 -0.988034	  1.931382
  0.041975	 -0.995130	  1.949874
  0.039200	 -1.001901	  1.968488
  0.036623	 -1.008116	  1.987322
  0.034653	 -1.012626	  2.006707
  0.032769	 -1.016876	  2.026159
  0.032205	 -1.017168	  2.046149
  0.031660	 -1.017395	  2.066141
  0.032698	 -1.012235	  2.085436
  0.033737	 -1.007076	  2.104731
  0.035972	 -0.998095	  2.122461
  0.038292	 -0.988847	  2.140042
  0.040875	 -0.978052	  2.156679
  0.043631	 -0.966223	  2.172568
  0.046387	 -0.954393	  2.188457
  0.048671	 -0.941419	  2.203506
  0.050804	 -0.928098	  2.218271
  0.052937	 -0.914778	  2.233036
  0.054444	 -0.901103	  2.247553
  0.055009	 -0.886937	  2.261659
  0.055574	 -0.872770	  2.275765
  0.056139	 -0.858603	  2.289872
  0.055523	 -0.843968	  2.303489
  0.054342	 -0.829133	  2.316850
  0.053162	 -0.814297	  2.330211
  0.051981	 -0.799462	  2.343572
  0.049759	 -0.784463	  2.356614
  0.047383	 -0.769444	  2.369605
  0.045007	 -0.754424	  2.382597
  0.042631	 -0.739405	  2.395588
  0.040255	 -0.724385	  2.408579
  0.037879	 -0.709366	  2.421570
  0.033055	 -0.676271	  2.449960
  0.030909	 -0.661163	  2.462888
