 -2.672784	  0.491366	  1.340033
 -2.646320	  0.486501	  1.326765
 -2.595178	  0.501078	  1.339275
 -2.547855	  0.505045	  1.361079
 -2.497827	  0.514236	  1.367721
 -2.449585	  0.523254	  1.379283
 -2.402303	  0.530441	  1.394660
 -2.354890	  0.536907	  1.410376
 -2.307143	  0.543470	  1.426262
 -2.260287	  0.550084	  1.442501
 -2.214068	  0.556485	  1.459713
 -2.168584	  0.562084	  1.478049
 -2.123555	  0.566720	  1.497194
 -2.078027	  0.571926	  1.515861
 -2.032040	  0.578047	  1.533663
 -1.985327	  0.585075	  1.550663
 -1.938796	  0.592893	  1.566195
 -1.890807	  0.601368	  1.581115
 -1.842242	  0.608861	  1.593945
 -1.793622	  0.612262	  1.603860
 -1.744520	  0.615421	  1.612864
 -1.695880	  0.622961	  1.622056
 -1.647523	  0.633418	  1.633115
 -1.599020	  0.644203	  1.646702
 -1.550385	  0.654412	  1.660423
 -1.502532	  0.663409	  1.673188
 -1.455045	  0.671412	  1.685254
 -1.407778	  0.679078	  1.697572
 -1.361752	  0.686921	  1.710545
 -1.316029	  0.694902	  1.724691
 -1.270554	  0.703439	  1.740312
 -1.223829	  0.711481	  1.757556
 -1.176509	  0.714887	  1.777019
 -1.129710	  0.714191	  1.798338
 -1.082799	  0.715283	  1.819641
 -1.035596	  0.719676	  1.839180
 -0.988573	  0.727057	  1.856356
 -0.941465	  0.736208	  1.871019
 -0.894560	  0.746467	  1.883168
 -0.847258	  0.758109	  1.892783
 -0.798607	  0.770874	  1.899386
 -0.748891	  0.782391	  1.903302
 -0.699190	  0.788270	  1.907305
 -0.649915	  0.789327	  1.912683
 -0.600438	  0.787717	  1.920538
 -0.550406	  0.785595	  1.932336
 -0.499486	  0.787437	  1.946553
 -0.450016	  0.794249	  1.961549
 -0.402038	  0.803700	  1.976647
 -0.355232	  0.814628	  1.991550
 -0.308767	  0.826914	  2.006256
 -0.261977	  0.839949	  2.020683
 -0.216457	  0.852493	  2.034051
 -0.171056	  0.863398	  2.046527
 -0.124952	  0.871757	  2.059312
 -0.076833	  0.877244	  2.073247
 -0.029200	  0.881228	  2.088626
  0.018555	  0.885371	  2.106217
  0.063925	  0.890748	  2.124534
  0.108590	  0.899734	  2.141620
  0.154126	  0.913467	  2.158555
  0.202404	  0.924567	  2.176021
  0.252231	  0.928368	  2.190281
  0.302166	  0.931257	  2.196822
  0.349689	  0.928993	  2.213613
  0.395635	  0.932261	  2.233496
  0.440240	  0.947024	  2.248986
  0.485186	  0.947222	  2.270029
  0.532707	  0.953121	  2.284668
  0.580746	  0.959081	  2.296923
  0.627778	  0.966752	  2.313391
  0.676213	  0.978127	  2.323717
  0.724587	  0.989391	  2.333719
  0.773706	  0.997256	  2.343388
  0.823381	  1.003070	  2.353043
  0.872390	  1.008158	  2.363793
  0.919837	  1.013689	  2.376103
  0.966105	  1.020328	  2.389792
  1.012427	  1.027746	  2.404049
  1.059548	  1.035043	  2.418007
  1.105966	  1.040524	  2.434553
  1.153149	  1.048009	  2.451559
  1.200138	  1.053401	  2.469949
  1.246168	  1.063029	  2.483103
  1.291886	  1.063874	  2.489820
  1.304805	  1.074513	  2.514718
