 0.0 0.0 0.0 0
 -0.8004815937994493 0.09861721291943201 -0.451976462597535 1000
 0.00839685599307477 -0.5584093058407602 0.42718156637695703 1000
 0.6189693272350193 0.6875400263388007 0.6546474351533088 1000
 0.9448973379162184 -0.26233704534290175 -0.28889713297410313 1000
 0.23039220968473867 -0.7757738673810216 -0.8703644638218055 1000
 0.8388240111042589 -0.46828526884683785 0.008693208867560254 1000
 0.8444724979590224 0.10725866870858254 -0.38738244655509146 1000
 0.21562418899886998 0.8451965119966773 0.823325316765521 1000
 0.0 0.0 0.0 0
 -0.19942977815809693 0.4086633468526717 0.9479406209519922 1000
 0.3400090508067131 -0.9126988535772566 -0.2509214183682231 1000
 0.5038680375344988 -0.7760646071191314 -0.6947717743015528 1000
 -0.3639660094627926 -0.7630190107482822 0.07738471737563722 1000
 -0.7723980152208222 -0.4304535926414262 0.18232207525104605 1000
 -0.03887234858553118 -0.96029355218247 -0.6976428355502232 1000
 -0.4542525020544872 -0.605622780981715 -0.8454383219692454 1000
 -0.09803489778894398 0.3074739983714163 -0.6473508977139911 1000
 0.0 0.0 0.0 0
 -0.04244143663362244 0.9671063839636613 0.25806211302764803 1000
 0.9164038373800476 -0.11207567491717282 0.27181646185245667 1000
 0.207960362065517 0.6682423776397615 -0.27611160802221063 1000
 0.33021570707703296 -0.16715430704827378 -0.861753253930047 1000
 0.2599672093804213 -0.8984724673318456 -0.7329046220874325 1000
 0.32464681771904347 0.9054176943441206 0.21192250895705622 1000
 -0.42545587243991356 0.9044732684913028 0.4493557972292685 1000
 -0.5867604144856657 -0.8083733477527786 -0.42724537282575814 1000
 0.0 0.0 0.0 0
 -0.9186454601793863 0.3873394820155481 0.11888397204085221 1000
 -0.03124491943182145 -0.09621493331763459 0.7903675989647182 1000
 0.6477624900625016 0.5168590823605385 0.7236795564894036 1000
 -0.4109782121201415 -0.21104767190403115 0.6424419146434776 1000
 0.49385597385637126 -0.5633766027577402 0.28582995042244974 1000
 -0.3987151095810556 -0.9146455370386863 -0.3937411602849401 1000
 -0.4440413120322107 0.675341628159849 0.821487523249888 1000
 0.11404812995001795 0.3574774870388026 -0.6065412033660613 1000
 0.0 0.0 0.0 0
 -0.4490338841668706 -0.3769842289573545 -0.8663787099238085 1000
 -0.8986882625423154 -0.09298883316732785 -0.40891160882220484 1000
 -0.3779472661275711 -0.56671027761308 0.3397501147980356 1000
 0.6788570006162874 0.0656573738759986 0.6492596195302165 1000
 -0.42598549731269175 0.8794522491024512 0.6033986386530004 1000
 -0.8316784704098668 -0.5497622294094167 -0.20918497348169413 1000
 -0.6787762690819603 0.619639669621453 -0.0327856158580383 1000
 -0.20322463684624548 -0.12379635657757981 -0.8778482812609989 1000
 0.0 0.0 0.0 0
 -0.5793969700663724 -0.7820604864786598 -0.5744755776565094 1000
 0.21412747452332356 -0.970182791513319 -0.3781239039932363 1000
 0.9203627010862776 -0.28184513756322166 0.09335738071778332 1000
 0.7159785597544399 0.5709621743199901 -0.059344522126134336 1000
 -0.018034422778840153 -0.5756182951790489 -0.9674014746991619 1000
 0.6659187533998948 -0.34367829046745024 0.39283281342739707 1000
 0.4459693036778468 0.8077255720848516 0.06949428835742502 1000
 -0.8511333219252281 0.05406067664463864 0.463849123585368 1000
 0.0 0.0 0.0 0
