 -0.177995	 -1.661645	  1.834875
 -0.176874	 -1.666941	  1.835541
 -0.181092	 -1.647985	  1.832491
 -0.187016	 -1.629971	  1.825743
 -0.194628	 -1.613099	  1.817719
 -0.202591	 -1.595410	  1.811506
 -0.211129	 -1.577316	  1.806310
 -0.219718	 -1.558990	  1.803185
 -0.229969	 -1.541055	  1.801935
 -0.239483	 -1.522952	  1.803694
 -0.248289	 -1.503015	  1.806296
 -0.254229	 -1.483610	  1.805993
 -0.255572	 -1.463436	  1.801585
 -0.253538	 -1.443106	  1.796521
 -0.250465	 -1.421998	  1.792713
 -0.251082	 -1.399408	  1.790541
 -0.257121	 -1.380401	  1.789520
 -0.263885	 -1.363311	  1.789616
 -0.277069	 -1.347447	  1.791126
 -0.292406	 -1.332473	  1.796382
 -0.303287	 -1.313479	  1.802673
 -0.306381	 -1.290212	  1.804612
 -0.306193	 -1.271605	  1.804119
 -0.307623	 -1.251661	  1.801911
 -0.312764	 -1.231985	  1.801275
 -0.317980	 -1.212010	  1.802226
 -0.323897	 -1.192531	  1.802883
 -0.330565	 -1.174573	  1.802322
 -0.337298	 -1.154613	  1.802135
 -0.342069	 -1.134788	  1.803198
 -0.344947	 -1.115114	  1.806482
 -0.346245	 -1.098104	  1.810605
 -0.348081	 -1.076387	  1.814367
 -0.353279	 -1.052566	  1.815415
 -0.361504	 -1.033511	  1.815902
 -0.370428	 -1.020512	  1.815211
 -0.385158	 -1.003575	  1.808850
 -0.388861	 -0.984168	  1.802440
 -0.385706	 -0.959101	  1.802711
 -0.385504	 -0.934265	  1.801469
 -0.389407	 -0.921616	  1.798583
 -0.405217	 -0.906759	  1.796328
 -0.422799	 -0.885953	  1.792938
 -0.425850	 -0.858830	  1.794299
 -0.422346	 -0.844033	  1.796765
 -0.415202	 -0.824822	  1.795907
 -0.411054	 -0.803979	  1.790584
 -0.410143	 -0.783448	  1.790398
 -0.408446	 -0.763458	  1.791923
 -0.406754	 -0.743415	  1.793342
 -0.405493	 -0.723308	  1.794451
 -0.404431	 -0.703064	  1.793740
 -0.404781	 -0.682957	  1.792049
 -0.405941	 -0.662864	  1.790018
 -0.407868	 -0.642686	  1.787135
 -0.410049	 -0.622996	  1.783742
 -0.412515	 -0.603572	  1.779476
 -0.416390	 -0.584104	  1.775448
 -0.420785	 -0.564922	  1.770622
 -0.425214	 -0.546950	  1.763573
 -0.430642	 -0.528503	  1.757704
 -0.435695	 -0.509815	  1.752904
 -0.440174	 -0.490842	  1.748278
 -0.444670	 -0.472511	  1.742552
 -0.451902	 -0.454606	  1.739520
 -0.460895	 -0.433997	  1.736093
 -0.465849	 -0.414086	  1.730323
 -0.468515	 -0.397345	  1.721865
 -0.469746	 -0.383034	  1.710556
 -0.474855	 -0.363477	  1.702382
 -0.479394	 -0.339677	  1.698019
 -0.484333	 -0.321774	  1.693575
 -0.488656	 -0.307556	  1.690912
 -0.492275	 -0.289732	  1.686389
 -0.499240	 -0.275175	  1.681798
 -0.515569	 -0.257666	  1.679347
 -0.530763	 -0.234414	  1.673932
 -0.532749	 -0.215478	  1.667857
 -0.531735	 -0.194525	  1.660279
 -0.529424	 -0.173687	  1.655907
 -0.527892	 -0.159419	  1.654715
 -0.525272	 -0.143282	  1.655966
 -0.524758	 -0.110508	  1.660108
 -0.526818	 -0.093591	  1.660138
 -0.530016	 -0.080472	  1.656594
 -0.530695	 -0.060891	  1.650099
 -0.531304	 -0.037443	  1.644709
 -0.531488	 -0.018200	  1.641572
 -0.534033	  0.004828	  1.638645
 -0.538508	  0.024578	  1.637776
 -0.541430	  0.040268	  1.638399
 -0.544923	  0.062905	  1.642233
 -0.549284	  0.082360	  1.642454
 -0.552905	  0.098746	  1.639333
 -0.554945	  0.118292	  1.632678
 -0.556114	  0.144205	  1.626698
 -0.555605	  0.166272	  1.626434
 -0.557471	  0.181812	  1.630517
 -0.567735	  0.198656	  1.635432
 -0.580695	  0.216851	  1.635109
 -0.590259	  0.235491	  1.631205
 -0.599156	  0.253406	  1.627664
 -0.607524	  0.271686	  1.624512
 -0.612553	  0.288929	  1.621533
 -0.615176	  0.310796	  1.622218
 -0.618872	  0.332695	  1.619139
 -0.624443	  0.350201	  1.612386
 -0.632972	  0.365705	  1.606039
 -0.637662	  0.381773	  1.594121
 -0.636062	  0.404338	  1.582611
 -0.631795	  0.425401	  1.574510
 -0.630703	  0.440528	  1.568395
 -0.630181	  0.459065	  1.558476
 -0.631298	  0.480283	  1.550490
 -0.630543	  0.501115	  1.547943
 -0.626531	  0.522157	  1.549015
 -0.625731	  0.538360	  1.552467
 -0.623427	  0.564954	  1.556240
 -0.622133	  0.584740	  1.557339
 -0.623772	  0.601269	  1.556002
 -0.628242	  0.624313	  1.553318
 -0.627959	  0.642383	  1.551615
 -0.625741	  0.661008	  1.548655
 -0.627719	  0.686728	  1.546501
 -0.630725	  0.702654	  1.544960
 -0.631981	  0.722882	  1.539313
 -0.636133	  0.745517	  1.532733
 -0.637747	  0.768707	  1.528794
 -0.642050	  0.792360	  1.536999
 -0.646247	  0.808501	  1.545284
 -0.660082	  0.824892	  1.554901
 -0.672785	  0.837571	  1.560073
 -0.680439	  0.855718	  1.562286
 -0.690748	  0.878825	  1.560481
 -0.701492	  0.896271	  1.565561
 -0.715437	  0.911345	  1.579512
 -0.727231	  0.923693	  1.589995
 -0.737125	  0.936518	  1.596919
 -0.748918	  0.951123	  1.605142
 -0.760484	  0.966014	  1.613206
 -0.771600	  0.978819	  1.620475
 -0.784832	  0.993707	  1.629287
 -0.797268	  1.007905	  1.637224
 -0.809720	  1.019160	  1.643780
 -0.824059	  1.033273	  1.653903
 -0.836713	  1.044662	  1.666586
 -0.847156	  1.050030	  1.677926
 -0.863610	  1.057198	  1.695723
 -0.884564	  1.070714	  1.707710
 -0.893375	  1.078784	  1.710596
 -0.902749	  1.089372	  1.713634
 -0.915616	  1.108260	  1.723129
 -0.927656	  1.123081	  1.729936
 -0.937354	  1.135866	  1.733172
 -0.941972	  1.151020	  1.730980
 -0.940812	  1.170050	  1.723650
 -0.939398	  1.188519	  1.715095
 -0.937742	  1.206184	  1.705106
 -0.934206	  1.222494	  1.695100
 -0.929337	  1.239603	  1.690311
 -0.926199	  1.264037	  1.681112
 -0.920323	  1.278594	  1.659844
 -0.915386	  1.287607	  1.643834
 -0.911983	  1.295087	  1.632546
 -0.904729	  1.313852	  1.607640
 -0.901613	  1.322725	  1.596632
 -0.898066	  1.331052	  1.587033
 -0.892471	  1.351432	  1.571440
 -0.888174	  1.368080	  1.559348
 -0.885121	  1.381331	  1.549101
 -0.882497	  1.395709	  1.538909
 -0.880748	  1.412442	  1.526777
 -0.879283	  1.426284	  1.516013
 -0.879049	  1.438576	  1.509469
 -0.879395	  1.456036	  1.499840
 -0.880470	  1.468407	  1.492508
 -0.881413	  1.482846	  1.487931
 -0.884254	  1.498650	  1.488695
 -0.886432	  1.517928	  1.487453
 -0.888889	  1.534484	  1.485371
 -0.891760	  1.552576	  1.483469
 -0.895701	  1.571882	  1.482169
 -0.899571	  1.591439	  1.480461
 -0.904025	  1.611726	  1.479480
 -0.908218	  1.633473	  1.478035
 -0.912505	  1.653372	  1.477678
 -0.916333	  1.671807	  1.476850
 -0.920171	  1.690555	  1.475419
 -0.924805	  1.710794	  1.474715
 -0.928768	  1.731545	  1.472905
 -0.933727	  1.751591	  1.472938
 -0.936871	  1.771900	  1.471569
 -0.934007	  1.791700	  1.465570
 -0.922562	  1.812056	  1.433328
 -0.927432	  1.831208	  1.430250
