  1.889822	 -1.667631	 -0.104424
  1.882948	 -1.681959	 -0.103077
  1.898217	 -1.669302	 -0.108704
  1.911006	 -1.650469	 -0.112088
  1.919214	 -1.631522	 -0.112679
  1.920851	 -1.614651	 -0.109498
  1.926415	 -1.595691	 -0.107704
  1.938434	 -1.569858	 -0.112277
  1.944616	 -1.552605	 -0.115123
  1.947715	 -1.541434	 -0.117498
  1.954257	 -1.514813	 -0.121626
  1.962520	 -1.495818	 -0.124851
  1.967392	 -1.485362	 -0.127170
  1.976274	 -1.461589	 -0.131568
  1.987748	 -1.442220	 -0.134430
  1.994722	 -1.432256	 -0.135986
  2.006695	 -1.410153	 -0.138699
  2.019577	 -1.392385	 -0.140791
  2.030506	 -1.384190	 -0.142008
  2.050596	 -1.367774	 -0.144022
  2.064626	 -1.348465	 -0.148947
  2.069465	 -1.337201	 -0.154779
  2.078988	 -1.326013	 -0.155389
  2.087845	 -1.302253	 -0.147623
  2.097746	 -1.272691	 -0.148064
  2.105562	 -1.260347	 -0.148708
  2.116810	 -1.243899	 -0.150975
  2.129427	 -1.227087	 -0.152518
  2.141607	 -1.211477	 -0.153272
  2.150466	 -1.197504	 -0.151811
  2.162124	 -1.173231	 -0.147683
  2.168864	 -1.159723	 -0.142369
  2.176263	 -1.147362	 -0.137618
  2.191232	 -1.120982	 -0.132963
  2.201228	 -1.101526	 -0.135846
  2.204049	 -1.095795	 -0.137040
  2.215734	 -1.071648	 -0.141419
  2.228667	 -1.046131	 -0.140251
  2.235055	 -1.035673	 -0.138129
  2.240004	 -1.022071	 -0.136024
  2.247432	 -0.999531	 -0.131443
  2.256034	 -0.980494	 -0.127995
  2.262301	 -0.961397	 -0.125332
  2.267064	 -0.942155	 -0.123855
  2.274761	 -0.924120	 -0.124465
  2.285915	 -0.906743	 -0.124151
  2.298172	 -0.889879	 -0.121497
  2.307096	 -0.871153	 -0.117721
  2.311859	 -0.851978	 -0.114542
  2.315776	 -0.832722	 -0.112990
  2.322374	 -0.815576	 -0.114668
  2.333666	 -0.799888	 -0.116404
  2.340134	 -0.777679	 -0.120189
  2.338636	 -0.751484	 -0.123088
  2.340470	 -0.733977	 -0.120068
  2.345302	 -0.717466	 -0.112411
  2.353020	 -0.698228	 -0.104882
  2.360966	 -0.679069	 -0.103132
  2.369488	 -0.663431	 -0.100977
  2.376825	 -0.646287	 -0.093765
  2.383906	 -0.621346	 -0.090636
  2.389660	 -0.605908	 -0.094407
  2.399250	 -0.589184	 -0.101828
  2.410269	 -0.569407	 -0.107947
  2.418824	 -0.547941	 -0.106082
  2.426965	 -0.532283	 -0.099238
  2.438518	 -0.518702	 -0.092813
  2.452593	 -0.500715	 -0.089492
  2.459576	 -0.483481	 -0.087376
  2.463693	 -0.465696	 -0.082826
  2.470822	 -0.445626	 -0.079130
  2.477329	 -0.426633	 -0.077879
  2.486237	 -0.407424	 -0.075773
  2.496413	 -0.382881	 -0.073012
  2.505339	 -0.365115	 -0.070849
