  1.706036	 -0.331905	 -1.778592
  1.712482	 -0.333615	 -1.797336
  1.705971	 -0.331895	 -1.778505
  1.697936	 -0.330109	 -1.760283
  1.687898	 -0.328252	 -1.743086
  1.677844	 -0.326436	 -1.725894
  1.668241	 -0.325491	 -1.708376
  1.658623	 -0.324582	 -1.690866
  1.647831	 -0.324096	 -1.674036
  1.636584	 -0.323785	 -1.657501
  1.625251	 -0.323314	 -1.641029
  1.613289	 -0.321385	 -1.625120
  1.601341	 -0.319449	 -1.609216
  1.590218	 -0.318486	 -1.593366
  1.577813	 -0.318581	 -1.580695
  1.561205	 -0.314815	 -1.565245
  1.547759	 -0.311992	 -1.541209
  1.544360	 -0.315552	 -1.525006
  1.541505	 -0.320990	 -1.509688
  1.533012	 -0.324063	 -1.482771
  1.523797	 -0.322215	 -1.467508
  1.516637	 -0.322135	 -1.454251
  1.508674	 -0.324152	 -1.431448
  1.498699	 -0.322320	 -1.414625
  1.488281	 -0.319973	 -1.398661
  1.480362	 -0.319403	 -1.379963
  1.471306	 -0.317912	 -1.363433
  1.460261	 -0.316364	 -1.342915
  1.456947	 -0.318905	 -1.324011
  1.459536	 -0.324872	 -1.305729
  1.460009	 -0.329922	 -1.282104
  1.451776	 -0.327942	 -1.264742
  1.439248	 -0.322192	 -1.245551
  1.433408	 -0.320812	 -1.222740
  1.437686	 -0.326508	 -1.204398
  1.443148	 -0.332501	 -1.187156
  1.451152	 -0.331885	 -1.166960
  1.458227	 -0.329281	 -1.148058
  1.464973	 -0.326727	 -1.129397
  1.471636	 -0.324180	 -1.110720
  1.477720	 -0.321443	 -1.092026
  1.481871	 -0.318637	 -1.072654
  1.484687	 -0.319941	 -1.053004
  1.494383	 -0.319398	 -1.032498
  1.507448	 -0.312694	 -1.013802
  1.520075	 -0.301293	 -1.001959
  1.530539	 -0.288047	 -0.992304
  1.539453	 -0.274294	 -0.977753
  1.546601	 -0.266143	 -0.959388
  1.553839	 -0.258879	 -0.942273
  1.563090	 -0.255807	 -0.924335
  1.573550	 -0.255274	 -0.906207
  1.583427	 -0.254037	 -0.888723
  1.587675	 -0.251340	 -0.870160
  1.584454	 -0.247055	 -0.851769
  1.579231	 -0.244880	 -0.840476
  1.573883	 -0.244819	 -0.828486
  1.566516	 -0.243324	 -0.804054
  1.562499	 -0.241536	 -0.791042
  1.558944	 -0.237467	 -0.778845
  1.542183	 -0.241063	 -0.763352
  1.526799	 -0.247848	 -0.748412
  1.510972	 -0.253345	 -0.741145
  1.490348	 -0.255385	 -0.738473
  1.469312	 -0.253477	 -0.737420
  1.449309	 -0.252746	 -0.729164
  1.431986	 -0.257444	 -0.719121
  1.414276	 -0.265804	 -0.711873
  1.393622	 -0.273992	 -0.708932
  1.370840	 -0.274049	 -0.708568
  1.351588	 -0.265702	 -0.707661
  1.337479	 -0.257478	 -0.701450
  1.317737	 -0.251587	 -0.699775
  1.297485	 -0.248361	 -0.701979
  1.278247	 -0.244699	 -0.705623
  1.259125	 -0.239419	 -0.710074
  1.240036	 -0.235922	 -0.713953
  1.220460	 -0.235099	 -0.719714
  1.198856	 -0.231877	 -0.720930
  1.172731	 -0.229902	 -0.708966
  1.157978	 -0.232254	 -0.703251
  1.142943	 -0.233803	 -0.695676
  1.121972	 -0.236264	 -0.678342
  1.109781	 -0.242731	 -0.665917
  1.100921	 -0.248204	 -0.653506
  1.080982	 -0.254402	 -0.636758
  1.065735	 -0.259499	 -0.624111
  1.047797	 -0.262054	 -0.613048
  1.033553	 -0.258718	 -0.593449
  1.039358	 -0.258579	 -0.563106
  1.047384	 -0.261582	 -0.537314
  1.048098	 -0.265346	 -0.524493
  1.033669	 -0.267812	 -0.508977
  1.015965	 -0.268927	 -0.491712
  1.004407	 -0.265875	 -0.468932
  1.001139	 -0.265019	 -0.451551
  0.995055	 -0.266925	 -0.437167
  0.982998	 -0.267317	 -0.416097
  0.983383	 -0.268251	 -0.395244
  0.984160	 -0.275099	 -0.375171
  0.982844	 -0.283153	 -0.355658
  0.975265	 -0.284002	 -0.336361
  0.966339	 -0.286889	 -0.318869
  0.958522	 -0.293137	 -0.299635
  0.946441	 -0.286513	 -0.280894
  0.933279	 -0.274764	 -0.268062
  0.921097	 -0.263422	 -0.249743
  0.911821	 -0.259849	 -0.231352
  0.907035	 -0.262629	 -0.217562
  0.899296	 -0.268948	 -0.195984
  0.891882	 -0.268611	 -0.173460
  0.885052	 -0.267851	 -0.159467
  0.874249	 -0.269602	 -0.142705
  0.863200	 -0.273124	 -0.126711
  0.853646	 -0.274784	 -0.108053
  0.845305	 -0.271656	 -0.082705
  0.841789	 -0.268138	 -0.070800
  0.833959	 -0.266023	 -0.052367
  0.823410	 -0.265176	 -0.033065
  0.814357	 -0.264513	 -0.014777
  0.805557	 -0.263883	  0.003181
  0.796629	 -0.262124	  0.020986
  0.787369	 -0.258922	  0.038287
  0.775293	 -0.256017	  0.053675
  0.761225	 -0.254390	  0.069476
  0.749324	 -0.254464	  0.088075
  0.740949	 -0.254648	  0.106668
  0.733772	 -0.248814	  0.124409
  0.728911	 -0.236932	  0.142332
  0.730280	 -0.224839	  0.161604
  0.733763	 -0.216750	  0.185436
  0.730538	 -0.213449	  0.203980
  0.720292	 -0.211732	  0.222791
  0.709052	 -0.214225	  0.239398
  0.699514	 -0.217386	  0.256365
  0.688421	 -0.219143	  0.273215
  0.676695	 -0.223422	  0.289719
  0.668913	 -0.229620	  0.312340
  0.665416	 -0.228651	  0.328974
  0.659528	 -0.224538	  0.347546
  0.650882	 -0.225264	  0.370243
  0.640813	 -0.230966	  0.385236
  0.628152	 -0.236269	  0.398684
  0.618136	 -0.239753	  0.417945
  0.610511	 -0.242876	  0.439245
  0.600579	 -0.245829	  0.452099
  0.584115	 -0.249029	  0.462710
  0.569529	 -0.251867	  0.477068
  0.562733	 -0.257707	  0.494807
  0.556220	 -0.259945	  0.520199
  0.542630	 -0.253672	  0.536976
  0.526693	 -0.244862	  0.546700
  0.516993	 -0.241108	  0.562499
  0.511892	 -0.241824	  0.582406
  0.503743	 -0.243806	  0.598913
  0.485904	 -0.239032	  0.622934
  0.476156	 -0.233832	  0.634382
  0.467189	 -0.228117	  0.645442
  0.452578	 -0.221127	  0.665539
  0.442510	 -0.217233	  0.681417
  0.437201	 -0.213836	  0.696218
  0.430641	 -0.214139	  0.722640
  0.426145	 -0.216491	  0.740507
  0.420083	 -0.215996	  0.757354
  0.409563	 -0.213157	  0.777420
  0.392171	 -0.209768	  0.793080
  0.376265	 -0.207803	  0.804428
  0.358950	 -0.206777	  0.811650
  0.340773	 -0.205040	  0.824106
  0.324277	 -0.203606	  0.836767
  0.310506	 -0.205217	  0.850241
  0.299365	 -0.207901	  0.863914
  0.283225	 -0.206495	  0.878738
  0.261544	 -0.205689	  0.890941
  0.242359	 -0.211140	  0.893751
  0.224761	 -0.219336	  0.890613
  0.204594	 -0.226866	  0.889051
  0.185967	 -0.231191	  0.892879
  0.167335	 -0.237045	  0.893557
  0.148346	 -0.245296	  0.891151
  0.129622	 -0.252338	  0.891221
  0.110952	 -0.257750	  0.892244
  0.092794	 -0.265618	  0.890378
  0.073778	 -0.275359	  0.889498
  0.053987	 -0.283858	  0.895256
  0.038887	 -0.288079	  0.901313
  0.018318	 -0.295047	  0.901974
  0.000959	 -0.303214	  0.896083
 -0.018315	 -0.310961	  0.896807
 -0.036929	 -0.317465	  0.900688
 -0.055387	 -0.323998	  0.904773
 -0.073789	 -0.330575	  0.908941
 -0.091816	 -0.332605	  0.917316
 -0.109666	 -0.333840	  0.926320
 -0.126612	 -0.334519	  0.937061
 -0.141076	 -0.333740	  0.951103
 -0.150662	 -0.332579	  0.969029
 -0.152145	 -0.332428	  0.989188
 -0.153182	 -0.333705	  1.009030
 -0.152375	 -0.332766	  1.029102
 -0.150245	 -0.331203	  1.048940
 -0.148542	 -0.329721	  1.068687
 -0.147807	 -0.330133	  1.088251
 -0.145528	 -0.332240	  1.108145
 -0.139387	 -0.334212	  1.128650
 -0.131003	 -0.333103	  1.150559
 -0.121922	 -0.328911	  1.167823
 -0.117274	 -0.325645	  1.184530
 -0.111038	 -0.318303	  1.210136
 -0.106395	 -0.315329	  1.226632
 -0.101207	 -0.310868	  1.238719
 -0.089741	 -0.300267	  1.252554
 -0.074209	 -0.275320	  1.268441
 -0.065907	 -0.262949	  1.282810
 -0.058394	 -0.250027	  1.292314
 -0.051341	 -0.235058	  1.306949
 -0.036747	 -0.225555	  1.324077
 -0.026898	 -0.216542	  1.339314
 -0.019048	 -0.208958	  1.359955
 -0.013223	 -0.202208	  1.374565
 -0.010097	 -0.197640	  1.384215
 -0.007121	 -0.189496	  1.406801
 -0.002886	 -0.182430	  1.434567
 -0.004360	 -0.181404	  1.454321
 -0.005243	 -0.178094	  1.473147
 -0.005640	 -0.171703	  1.490583
 -0.005244	 -0.160860	  1.507308
 -0.004381	 -0.153299	  1.526177
  0.000846	 -0.148553	  1.549061
  0.002106	 -0.145776	  1.572238
  0.003789	 -0.142115	  1.591952
 -0.002818	 -0.140758	  1.613613
 -0.008269	 -0.140304	  1.627233
 -0.012439	 -0.140406	  1.648847
 -0.019777	 -0.144377	  1.671049
 -0.029544	 -0.145276	  1.690594
 -0.038168	 -0.147006	  1.703052
 -0.053003	 -0.156390	  1.723631
 -0.065621	 -0.160803	  1.738680
 -0.075530	 -0.159755	  1.751061
 -0.090139	 -0.156566	  1.769432
 -0.104611	 -0.160401	  1.786394
 -0.111366	 -0.166616	  1.801688
 -0.116454	 -0.171250	  1.821446
 -0.124693	 -0.172653	  1.840106
 -0.137334	 -0.173029	  1.856592
 -0.152493	 -0.174774	  1.871690
 -0.164386	 -0.176579	  1.886272
 -0.175559	 -0.176873	  1.904204
 -0.182219	 -0.175349	  1.923166
 -0.189158	 -0.174356	  1.942898
 -0.193063	 -0.171152	  1.962235
 -0.199661	 -0.166931	  1.981115
 -0.208348	 -0.162406	  1.998734
 -0.218027	 -0.158558	  2.015832
 -0.227910	 -0.154891	  2.032834
 -0.237842	 -0.151377	  2.049835
 -0.247726	 -0.148508	  2.066984
 -0.257554	 -0.146174	  2.084245
 -0.267370	 -0.143771	  2.101504
 -0.277063	 -0.140534	  2.118695
 -0.286732	 -0.137268	  2.135895
 -0.295232	 -0.133201	  2.153530
 -0.301448	 -0.127715	  2.171726
 -0.307929	 -0.122724	  2.189964
 -0.316681	 -0.121933	  2.207912
 -0.324368	 -0.121849	  2.226372
 -0.330320	 -0.122674	  2.245446
 -0.336250	 -0.123465	  2.264527
 -0.342752	 -0.121693	  2.283353
 -0.349340	 -0.119556	  2.302115
 -0.356385	 -0.117850	  2.320748
 -0.365847	 -0.118605	  2.338344
 -0.375392	 -0.119500	  2.355887
 -0.386558	 -0.123457	  2.371986
 -0.397782	 -0.127571	  2.388024
 -0.408990	 -0.130890	  2.404242
 -0.419873	 -0.132262	  2.420957
 -0.430706	 -0.133571	  2.437720
 -0.441550	 -0.134881	  2.454500
 -0.452796	 -0.136101	  2.472070
 -0.465378	 -0.134936	  2.494730
 -0.474985	 -0.133873	  2.512239
