  1.453718	 -1.439115	  1.601233
  1.464744	 -1.440150	  1.594215
  1.448336	 -1.440710	  1.605988
  1.437202	 -1.445169	  1.615369
  1.414454	 -1.448021	  1.632949
  1.397208	 -1.442556	  1.641861
  1.380116	 -1.435832	  1.648538
  1.361703	 -1.430041	  1.655900
  1.344851	 -1.424315	  1.662558
  1.325638	 -1.418023	  1.670136
  1.307026	 -1.413152	  1.676990
  1.291930	 -1.408887	  1.682302
  1.271116	 -1.403751	  1.689854
  1.250311	 -1.400019	  1.696605
  1.237868	 -1.396771	  1.701388
  1.217522	 -1.391596	  1.707650
  1.193253	 -1.388448	  1.715520
  1.181167	 -1.385699	  1.720253
  1.161866	 -1.380742	  1.728020
  1.135963	 -1.376730	  1.739702
  1.122631	 -1.377056	  1.747984
  1.110272	 -1.378363	  1.756938
  1.089270	 -1.376767	  1.760639
  1.068438	 -1.372846	  1.767603
  1.049805	 -1.369455	  1.774253
  1.031339	 -1.367022	  1.781543
  1.012881	 -1.365502	  1.789133
  0.994641	 -1.364572	  1.797392
  0.976609	 -1.363333	  1.805933
  0.958879	 -1.362450	  1.813792
  0.940757	 -1.361180	  1.821365
  0.922101	 -1.360167	  1.829033
  0.903794	 -1.358429	  1.837181
  0.885471	 -1.357530	  1.845215
  0.867172	 -1.356165	  1.853368
  0.848971	 -1.354079	  1.861597
  0.830964	 -1.351212	  1.869893
  0.813177	 -1.348173	  1.878615
  0.795888	 -1.344012	  1.887668
  0.779117	 -1.341004	  1.898187
  0.762325	 -1.338600	  1.908820
  0.745940	 -1.335887	  1.919966
  0.729792	 -1.332926	  1.931388
  0.713674	 -1.329744	  1.942794
  0.697739	 -1.325297	  1.954033
  0.681807	 -1.320853	  1.965276
  0.665894	 -1.315863	  1.976316
  0.650020	 -1.310302	  1.987138
  0.634147	 -1.304756	  1.997967
  0.618157	 -1.298698	  2.008338
  0.602168	 -1.292720	  2.018760
  0.586167	 -1.286908	  2.029304
  0.569984	 -1.280725	  2.039346
  0.553785	 -1.274044	  2.048921
  0.537580	 -1.267850	  2.058897
  0.521286	 -1.261759	  2.068799
  0.504972	 -1.255332	  2.078382
  0.488614	 -1.249484	  2.088294
  0.472345	 -1.243656	  2.098358
  0.456154	 -1.238105	  2.108716
  0.439842	 -1.232893	  2.119088
  0.423205	 -1.227663	  2.128904
  0.406430	 -1.222664	  2.138619
  0.389430	 -1.218448	  2.148273
  0.372574	 -1.213575	  2.157827
  0.355931	 -1.207586	  2.167183
  0.339336	 -1.201547	  2.176574
  0.322749	 -1.195203	  2.185772
  0.306174	 -1.188807	  2.194959
  0.289334	 -1.183801	  2.204516
  0.272312	 -1.180249	  2.214400
  0.255200	 -1.178782	  2.224649
  0.238238	 -1.179935	  2.235180
  0.221442	 -1.180877	  2.245997
  0.205023	 -1.181364	  2.257407
  0.188606	 -1.181852	  2.268819
  0.172416	 -1.181332	  2.280549
  0.156255	 -1.180750	  2.292289
  0.140099	 -1.180062	  2.303927
  0.123649	 -1.178746	  2.315226
