  0.140465	  0.466901	 -2.505195
  0.172513	  0.447615	 -2.530880
  0.158647	  0.457458	 -2.520351
  0.144780	  0.467286	 -2.509816
  0.130913	  0.477054	 -2.499221
  0.116935	  0.486060	 -2.488109
  0.102947	  0.495002	 -2.476958
  0.089161	  0.503406	 -2.465153
  0.075656	  0.511154	 -2.452610
  0.061823	  0.518667	 -2.440288
  0.047698	  0.525298	 -2.427679
  0.033936	  0.531366	 -2.414343
  0.020698	  0.537036	 -2.400404
  0.008883	  0.541934	 -2.384924
 -0.003049	  0.546315	 -2.369419
 -0.015522	  0.551661	 -2.354393
 -0.028447	  0.558367	 -2.340256
 -0.040356	  0.566742	 -2.326586
 -0.052091	  0.575247	 -2.312560
 -0.063739	  0.583812	 -2.298631
 -0.075492	  0.592537	 -2.284852
 -0.086286	  0.602189	 -2.271113
 -0.097265	  0.611109	 -2.256947
 -0.108224	  0.619602	 -2.242500
 -0.118940	  0.628252	 -2.228021
 -0.129772	  0.636711	 -2.213485
 -0.140765	  0.644451	 -2.198702
 -0.151527	  0.652775	 -2.184150
 -0.162042	  0.661886	 -2.170086
 -0.169412	  0.672412	 -2.158237
 -0.171683	  0.687489	 -2.144558
 -0.186812	  0.695858	 -2.124370
 -0.200199	  0.704796	 -2.111593
 -0.209592	  0.714478	 -2.102398
 -0.226458	  0.727429	 -2.091638
 -0.243349	  0.738796	 -2.075182
 -0.248026	  0.742258	 -2.066164
 -0.257386	  0.749757	 -2.044313
 -0.271624	  0.755348	 -2.025673
 -0.279413	  0.757758	 -2.017073
 -0.296511	  0.763721	 -1.998269
 -0.309969	  0.773304	 -1.980949
 -0.316210	  0.779379	 -1.972804
 -0.331063	  0.797137	 -1.959390
 -0.341840	  0.809683	 -1.951410
 -0.351068	  0.819719	 -1.943471
 -0.366355	  0.833947	 -1.926839
 -0.379161	  0.840582	 -1.910769
 -0.396951	  0.845251	 -1.897026
 -0.412042	  0.847836	 -1.888952
 -0.428545	  0.848970	 -1.876058
 -0.443480	  0.852765	 -1.862734
 -0.459104	  0.859014	 -1.851789
 -0.472931	  0.864472	 -1.843364
 -0.488280	  0.871039	 -1.833054
 -0.513738	  0.880390	 -1.820133
 -0.534207	  0.887637	 -1.814315
 -0.541375	  0.890581	 -1.812979
 -0.557760	  0.895862	 -1.806416
 -0.582573	  0.905348	 -1.791574
 -0.597898	  0.910708	 -1.784247
 -0.609084	  0.915588	 -1.781288
 -0.628695	  0.922758	 -1.776585
 -0.651783	  0.932546	 -1.771216
 -0.670299	  0.941535	 -1.763073
 -0.681122	  0.945758	 -1.757710
 -0.698699	  0.955527	 -1.748857
 -0.715399	  0.963621	 -1.738266
 -0.731390	  0.970989	 -1.726890
 -0.752217	  0.980534	 -1.719452
 -0.767460	  0.988113	 -1.717893
 -0.791921	  0.998820	 -1.722891
 -0.808975	  1.009365	 -1.733000
 -0.822415	  1.018424	 -1.742010
 -0.837063	  1.028332	 -1.750592
 -0.852706	  1.038643	 -1.754578
 -0.870409	  1.049147	 -1.759382
 -0.880804	  1.056648	 -1.763135
 -0.893957	  1.067490	 -1.767971
 -0.911256	  1.081317	 -1.773330
 -0.929049	  1.091217	 -1.778400
 -0.955970	  1.098821	 -1.785957
 -0.970775	  1.102604	 -1.793686
 -0.985453	  1.105263	 -1.804033
 -0.998881	  1.109308	 -1.817270
 -1.011604	  1.115523	 -1.832187
 -1.027350	  1.116543	 -1.843081
 -1.050597	  1.115885	 -1.851508
 -1.072759	  1.111798	 -1.862037
 -1.087974	  1.105775	 -1.874639
 -1.099142	  1.101505	 -1.889606
 -1.109414	  1.099461	 -1.904518
 -1.123066	  1.098811	 -1.919805
 -1.136930	  1.094952	 -1.931990
 -1.144543	  1.076026	 -1.942247
 -1.158501	  1.071215	 -1.955738
