 -1.767840	 -0.484565	 -1.652335
 -1.774819	 -0.494543	 -1.649162
 -1.775842	 -0.473432	 -1.659813
 -1.759715	 -0.454947	 -1.664723
 -1.751137	 -0.446510	 -1.667040
 -1.738678	 -0.426068	 -1.674369
 -1.724619	 -0.408398	 -1.680954
 -1.714804	 -0.401417	 -1.683122
 -1.694264	 -0.388522	 -1.686081
 -1.677201	 -0.364991	 -1.691528
 -1.672572	 -0.355553	 -1.694045
 -1.666750	 -0.338043	 -1.701039
 -1.650031	 -0.325106	 -1.709969
 -1.633365	 -0.312870	 -1.715642
 -1.620389	 -0.298774	 -1.722099
 -1.607464	 -0.284832	 -1.728347
 -1.594342	 -0.271037	 -1.734476
 -1.581247	 -0.257214	 -1.740600
 -1.567657	 -0.243855	 -1.746674
 -1.553771	 -0.230786	 -1.752683
 -1.540026	 -0.217733	 -1.758436
 -1.524507	 -0.206714	 -1.759337
 -1.505392	 -0.195677	 -1.757574
 -1.490524	 -0.180736	 -1.765586
 -1.479814	 -0.165527	 -1.777758
 -1.471906	 -0.153880	 -1.786023
 -1.462166	 -0.139966	 -1.795447
 -1.435077	 -0.123185	 -1.808969
 -1.423913	 -0.119168	 -1.813487
 -1.410398	 -0.115251	 -1.819880
 -1.390612	 -0.107057	 -1.830040
 -1.373009	 -0.097824	 -1.833801
 -1.356196	 -0.085431	 -1.836292
 -1.340723	 -0.066942	 -1.837681
 -1.325389	 -0.048478	 -1.839778
 -1.316018	 -0.039869	 -1.841028
 -1.295450	 -0.032972	 -1.848887
 -1.271239	 -0.025677	 -1.863042
 -1.261068	 -0.019844	 -1.871695
 -1.250137	 -0.012472	 -1.882696
 -1.229317	  0.001180	 -1.896680
 -1.214149	  0.016962	 -1.901787
 -1.206964	  0.028684	 -1.901842
 -1.192377	  0.046834	 -1.904217
 -1.181312	  0.065316	 -1.906135
 -1.170741	  0.082347	 -1.909588
 -1.159031	  0.097550	 -1.915923
 -1.147716	  0.112787	 -1.922258
 -1.136644	  0.128227	 -1.928505
 -1.125575	  0.143770	 -1.934498
 -1.114511	  0.159400	 -1.940267
 -1.103446	  0.175029	 -1.946037
 -1.091663	  0.190005	 -1.952109
 -1.079706	  0.204812	 -1.958255
 -1.067750	  0.219623	 -1.964397
 -1.055349	  0.233955	 -1.970780
 -1.041809	  0.246913	 -1.977763
 -1.028261	  0.259860	 -1.984749
 -1.014726	  0.272821	 -1.991738
 -1.000608	  0.285006	 -1.998961
 -0.985648	  0.295914	 -2.006529
 -0.970694	  0.306826	 -2.014101
 -0.955740	  0.317737	 -2.021672
 -0.940217	  0.327649	 -2.029462
 -0.924550	  0.337025	 -2.037556
 -0.908649	  0.345682	 -2.046098
 -0.892296	  0.353680	 -2.054538
 -0.875661	  0.361877	 -2.062141
 -0.859415	  0.370892	 -2.068739
 -0.844232	  0.376869	 -2.078579
 -0.828453	  0.379795	 -2.091074
 -0.809968	  0.383530	 -2.100539
 -0.788689	  0.388305	 -2.101426
 -0.762631	  0.397258	 -2.100018
 -0.743892	  0.409516	 -2.106325
 -0.729082	  0.422245	 -2.116300
 -0.718115	  0.430961	 -2.124382
 -0.707859	  0.443788	 -2.133950
 -0.695313	  0.459611	 -2.142809
 -0.681147	  0.482832	 -2.155351
 -0.674118	  0.495499	 -2.164175
 -0.666356	  0.511607	 -2.175158
 -0.659074	  0.525082	 -2.184558
 -0.646945	  0.542612	 -2.196815
 -0.631281	  0.557376	 -2.206353
 -0.621057	  0.561956	 -2.208982
 -0.601298	  0.571991	 -2.216156
 -0.579225	  0.583445	 -2.227143
 -0.570455	  0.591333	 -2.231880
 -0.559152	  0.609043	 -2.242146
 -0.548483	  0.628082	 -2.251379
 -0.541482	  0.641925	 -2.258498
 -0.538233	  0.660077	 -2.267464
 -0.526985	  0.677030	 -2.273273
 -0.511689	  0.688455	 -2.278912
 -0.504737	  0.703741	 -2.290877
 -0.485183	  0.718652	 -2.291241
 -0.473870	  0.733176	 -2.299056
