  1.573500	  0.620505	  1.831005
  1.583271	  0.623006	  1.844372
  1.569014	  0.623469	  1.827186
  1.558970	  0.619751	  1.813760
  1.548837	  0.618097	  1.795437
  1.538349	  0.614625	  1.777878
  1.527224	  0.607096	  1.762509
  1.518052	  0.599770	  1.746525
  1.509689	  0.594212	  1.729247
  1.501899	  0.589927	  1.711408
  1.493505	  0.584297	  1.693660
  1.485470	  0.576876	  1.676723
  1.474925	  0.571262	  1.659651
  1.463565	  0.568019	  1.642805
  1.454385	  0.568811	  1.626020
  1.445338	  0.567908	  1.607430
  1.438028	  0.567812	  1.589109
  1.429037	  0.567084	  1.570879
  1.420049	  0.566241	  1.553452
  1.411222	  0.564357	  1.536753
  1.397617	  0.564559	  1.517338
  1.386422	  0.567209	  1.501922
  1.378961	  0.572860	  1.485097
  1.370559	  0.577884	  1.466475
  1.358050	  0.575944	  1.450746
  1.344511	  0.571610	  1.435671
  1.329738	  0.569029	  1.419956
  1.321245	  0.572546	  1.403755
  1.312544	  0.575589	  1.384883
  1.300204	  0.574702	  1.367814
  1.287443	  0.569282	  1.353709
  1.273996	  0.564151	  1.338368
  1.261653	  0.563510	  1.321533
  1.252607	  0.562905	  1.306397
  1.242385	  0.559713	  1.288567
  1.231933	  0.556652	  1.271150
  1.222215	  0.553264	  1.253980
  1.212527	  0.549868	  1.236817
  1.204209	  0.545570	  1.219144
  1.196236	  0.541056	  1.201366
  1.188328	  0.536558	  1.183555
  1.180497	  0.532078	  1.165705
  1.172655	  0.527602	  1.147861
  1.162999	  0.523614	  1.130807
  1.152558	  0.519859	  1.114168
  1.142109	  0.516122	  1.097530
  1.130929	  0.514959	  1.080989
  1.119697	  0.514135	  1.064465
  1.111116	  0.514985	  1.046423
  1.102610	  0.515900	  1.028346
  1.092895	  0.518069	  1.010999
  1.083110	  0.520310	  0.993701
  1.073388	  0.522034	  0.976309
  1.063834	  0.522570	  0.958747
  1.054290	  0.523088	  0.941179
  1.045711	  0.522068	  0.923142
  1.037409	  0.520633	  0.905004
  1.029127	  0.518880	  0.886884
  1.020898	  0.516317	  0.868836
  1.012669	  0.513747	  0.850790
  1.004188	  0.510970	  0.832891
  0.995599	  0.508106	  0.815058
  0.987003	  0.505244	  0.797228
  0.977466	  0.502994	  0.779793
  0.967855	  0.500794	  0.762392
  0.958091	  0.498733	  0.745060
  0.947994	  0.496782	  0.728256
  0.937989	  0.493663	  0.712473
  0.925487	  0.491794	  0.695154
  0.911912	  0.493236	  0.676899
  0.903875	  0.494699	  0.660335
  0.896425	  0.493386	  0.643381
  0.886601	  0.492457	  0.625203
  0.878433	  0.491045	  0.607651
  0.871143	  0.489290	  0.587076
  0.863233	  0.488716	  0.568845
  0.851941	  0.484584	  0.554877
  0.841046	  0.478497	  0.537021
  0.831192	  0.476978	  0.517717
  0.827183	  0.472865	  0.501562
  0.818728	  0.465862	  0.483756
  0.809364	  0.459776	  0.466577
  0.803525	  0.454391	  0.448444
  0.799369	  0.447397	  0.430586
  0.790973	  0.436625	  0.413309
  0.777846	  0.428957	  0.398768
  0.768997	  0.425642	  0.383357
  0.758767	  0.419741	  0.366137
  0.747846	  0.412404	  0.350987
  0.737847	  0.404813	  0.336297
  0.726282	  0.396511	  0.320016
  0.711916	  0.387942	  0.307359
  0.702058	  0.381383	  0.294857
  0.689632	  0.372787	  0.280104
  0.676707	  0.365923	  0.266500
  0.664299	  0.361890	  0.252344
  0.648571	  0.358096	  0.237048
  0.635373	  0.351456	  0.225262
  0.623939	  0.343954	  0.211200
  0.611175	  0.343157	  0.195170
  0.593634	  0.346291	  0.181676
  0.579753	  0.343955	  0.169313
  0.568907	  0.340694	  0.152768
  0.559058	  0.340624	  0.133166
  0.546027	  0.337664	  0.119669
  0.531985	  0.333892	  0.105698
  0.522208	  0.331354	  0.088230
  0.512319	  0.330529	  0.070538
  0.502920	  0.329323	  0.053169
  0.492646	  0.325733	  0.036472
  0.484312	  0.323402	  0.017979
  0.477585	  0.319648	 -0.000234
  0.467591	  0.316762	 -0.017927
  0.456499	  0.313651	 -0.034405
  0.444000	  0.312820	 -0.050913
  0.436179	  0.316637	 -0.069969
  0.431823	  0.318206	 -0.089701
  0.424319	  0.321544	 -0.107651
  0.410919	  0.325565	 -0.123159
  0.399198	  0.329519	 -0.140543
  0.392521	  0.328923	 -0.157533
  0.384842	  0.326987	 -0.177112
  0.379318	  0.327219	 -0.198598
  0.367699	  0.328135	 -0.212794
  0.356202	  0.326925	 -0.230752
  0.343846	  0.328899	 -0.247022
  0.330246	  0.335863	 -0.259183
  0.319370	  0.344084	 -0.274534
  0.307086	  0.347873	 -0.292154
  0.291395	  0.347549	 -0.304097
  0.272441	  0.346360	 -0.323685
  0.267632	  0.344398	 -0.337224
  0.258003	  0.340946	 -0.350801
  0.247568	  0.335976	 -0.373143
  0.238926	  0.341505	 -0.391667
  0.227266	  0.341847	 -0.407287
  0.218160	  0.339382	 -0.424105
  0.207622	  0.339645	 -0.442459
  0.195332	  0.339589	 -0.457167
  0.184471	  0.337087	 -0.474880
  0.174773	  0.336900	 -0.491720
  0.164059	  0.336950	 -0.508057
  0.152948	  0.334700	 -0.526207
  0.142769	  0.330954	 -0.542479
  0.128625	  0.329663	 -0.555455
  0.115316	  0.329369	 -0.573384
  0.110508	  0.325339	 -0.593582
  0.103876	  0.319263	 -0.610641
  0.090994	  0.316700	 -0.627476
  0.081096	  0.314760	 -0.645459
  0.067793	  0.316207	 -0.659737
  0.050362	  0.321045	 -0.673329
  0.039760	  0.324355	 -0.689262
  0.032594	  0.320999	 -0.708779
  0.020836	  0.314149	 -0.726457
  0.009968	  0.313945	 -0.745994
 -0.002951	  0.316066	 -0.762081
 -0.015315	  0.309725	 -0.769874
 -0.031799	  0.306304	 -0.786791
 -0.044695	  0.296980	 -0.798536
 -0.057587	  0.286916	 -0.811683
 -0.069517	  0.278196	 -0.827368
 -0.080363	  0.270234	 -0.841394
 -0.095212	  0.263779	 -0.857448
 -0.106902	  0.265427	 -0.874322
 -0.116030	  0.263428	 -0.887501
 -0.127382	  0.254504	 -0.907587
 -0.134183	  0.250306	 -0.926359
 -0.142902	  0.249337	 -0.939717
 -0.161445	  0.243487	 -0.954176
 -0.177807	  0.240203	 -0.966391
 -0.190454	  0.232695	 -0.981428
 -0.198010	  0.218788	 -0.996309
 -0.206883	  0.200736	 -1.001134
 -0.219726	  0.187991	 -1.011079
 -0.228715	  0.171498	 -1.018776
 -0.236214	  0.155281	 -1.026350
 -0.244708	  0.138527	 -1.033682
 -0.250235	  0.120987	 -1.039871
 -0.261412	  0.102011	 -1.046505
 -0.272437	  0.087551	 -1.049999
 -0.277879	  0.069981	 -1.054161
 -0.283666	  0.047988	 -1.058286
 -0.290202	  0.029854	 -1.063502
 -0.293034	  0.013588	 -1.070241
 -0.298027	 -0.005893	 -1.073254
 -0.305302	 -0.024876	 -1.074679
 -0.309619	 -0.043906	 -1.084921
 -0.313940	 -0.061440	 -1.091391
 -0.320174	 -0.079957	 -1.098253
 -0.324453	 -0.097178	 -1.103510
 -0.329880	 -0.116437	 -1.111175
 -0.342366	 -0.132320	 -1.115300
 -0.349063	 -0.149073	 -1.118885
 -0.348094	 -0.171240	 -1.124417
 -0.353220	 -0.192195	 -1.129344
 -0.363225	 -0.205786	 -1.135370
 -0.364914	 -0.225233	 -1.144665
 -0.368711	 -0.246222	 -1.149326
 -0.378514	 -0.261527	 -1.154904
 -0.380868	 -0.276762	 -1.165267
 -0.384974	 -0.295164	 -1.177325
 -0.393715	 -0.312991	 -1.186292
 -0.392305	 -0.326233	 -1.200152
 -0.398174	 -0.343306	 -1.208285
 -0.392682	 -0.343791	 -1.231074
 -0.393840	 -0.361576	 -1.244590
 -0.399745	 -0.356467	 -1.266310
 -0.392985	 -0.370303	 -1.284607
 -0.383831	 -0.376073	 -1.303791
 -0.380791	 -0.362361	 -1.325207
 -0.383805	 -0.361443	 -1.343144
 -0.394121	 -0.360906	 -1.360868
 -0.409774	 -0.355680	 -1.379154
 -0.415132	 -0.354313	 -1.398092
 -0.410288	 -0.347769	 -1.418625
 -0.403722	 -0.343776	 -1.437243
 -0.403709	 -0.336454	 -1.459541
 -0.411885	 -0.329600	 -1.478787
 -0.424632	 -0.327366	 -1.493262
 -0.436411	 -0.325415	 -1.509670
 -0.443259	 -0.321286	 -1.529880
 -0.445866	 -0.316929	 -1.548380
 -0.452222	 -0.312570	 -1.567766
 -0.459477	 -0.304921	 -1.584364
 -0.465546	 -0.297659	 -1.602275
 -0.470242	 -0.291358	 -1.620315
 -0.477995	 -0.288703	 -1.639423
 -0.491831	 -0.289222	 -1.658328
 -0.505480	 -0.284523	 -1.673567
 -0.515234	 -0.278194	 -1.689198
 -0.522764	 -0.266921	 -1.706158
 -0.526601	 -0.255556	 -1.719492
 -0.534274	 -0.246324	 -1.737236
 -0.542791	 -0.229767	 -1.746405
 -0.551665	 -0.213752	 -1.756213
 -0.556120	 -0.194892	 -1.764555
 -0.559894	 -0.176624	 -1.769541
 -0.566571	 -0.159130	 -1.774208
 -0.574258	 -0.141265	 -1.781634
 -0.580979	 -0.120577	 -1.783262
 -0.587001	 -0.100434	 -1.776975
 -0.593865	 -0.084756	 -1.767883
 -0.603125	 -0.070722	 -1.756793
 -0.610807	 -0.053713	 -1.748085
 -0.614841	 -0.033965	 -1.744315
 -0.615735	 -0.012865	 -1.743689
 -0.615503	  0.006165	 -1.741741
 -0.617191	  0.022059	 -1.738382
 -0.615440	  0.042071	 -1.741487
 -0.612042	  0.060704	 -1.749706
 -0.607840	  0.073271	 -1.764671
 -0.603652	  0.085845	 -1.779648
 -0.599452	  0.098397	 -1.794643
 -0.595298	  0.110941	 -1.809639
 -0.596170	  0.117784	 -1.828374
 -0.600434	  0.120010	 -1.847780
 -0.604713	  0.122194	 -1.867195
 -0.608997	  0.124409	 -1.886593
 -0.612789	  0.125875	 -1.905960
 -0.618447	  0.123626	 -1.924222
 -0.629271	  0.121947	 -1.942667
 -0.640680	  0.123517	 -1.959250
 -0.650712	  0.120951	 -1.977478
 -0.658418	  0.115384	 -1.992841
 -0.670209	  0.113343	 -2.009822
 -0.680021	  0.110155	 -2.028169
 -0.688660	  0.105249	 -2.043739
 -0.699598	  0.101851	 -2.062245
 -0.709011	  0.099322	 -2.080067
 -0.717990	  0.096216	 -2.095356
 -0.727975	  0.091754	 -2.113990
 -0.737362	  0.088837	 -2.132690
 -0.746534	  0.088564	 -2.147075
 -0.755506	  0.083848	 -2.165526
 -0.765283	  0.081740	 -2.184210
 -0.775341	  0.081789	 -2.200070
 -0.784365	  0.077546	 -2.218277
 -0.793927	  0.075810	 -2.236654
 -0.804097	  0.076394	 -2.252584
 -0.812763	  0.073077	 -2.271457
 -0.821405	  0.070608	 -2.290199
 -0.830752	  0.072476	 -2.305887
 -0.838846	  0.069598	 -2.325246
 -0.846947	  0.067208	 -2.344362
 -0.860521	  0.069370	 -2.369119
 -0.868556	  0.068279	 -2.387401
