 -0.266189	  3.016574	 -0.101608
 -0.263553	  2.986707	 -0.100602
 -0.271088	  2.951177	 -0.072012
 -0.287594	  2.911032	 -0.052861
 -0.306194	  2.869703	 -0.031341
 -0.315146	  2.826231	 -0.006013
 -0.329209	  2.783024	  0.014378
 -0.342921	  2.740268	  0.040713
 -0.361881	  2.697084	  0.063238
 -0.380607	  2.658684	  0.086481
 -0.396007	  2.618116	  0.107660
 -0.418548	  2.577960	  0.127398
 -0.438740	  2.537109	  0.148438
 -0.460443	  2.497261	  0.170106
 -0.482393	  2.458730	  0.193299
 -0.502707	  2.419612	  0.217008
 -0.522996	  2.380248	  0.239861
 -0.543183	  2.340604	  0.262031
 -0.563122	  2.301243	  0.284174
 -0.582451	  2.263345	  0.306185
 -0.602175	  2.225890	  0.328443
 -0.622787	  2.187557	  0.351440
 -0.644131	  2.148236	  0.375357
 -0.665482	  2.108185	  0.399811
 -0.685502	  2.068247	  0.423520
 -0.704978	  2.027224	  0.448042
 -0.721751	  1.987071	  0.473456
 -0.735357	  1.947284	  0.500874
 -0.745628	  1.907960	  0.529406
 -0.752921	  1.868719	  0.557754
 -0.758767	  1.825898	  0.587009
 -0.765140	  1.780811	  0.613043
 -0.774311	  1.734252	  0.635140
 -0.785915	  1.688232	  0.653921
 -0.800253	  1.644643	  0.670592
 -0.818968	  1.604347	  0.688101
 -0.843076	  1.565569	  0.707278
 -0.870398	  1.528586	  0.725102
 -0.898720	  1.495829	  0.740193
 -0.939376	  1.456494	  0.756402
 -1.017528	  1.394892	  0.770833
 -1.111334	  1.340317	  0.761458
 -1.184673	  1.311111	  0.746100
 -1.249543	  1.287948	  0.734974
 -1.311385	  1.264467	  0.729825
 -1.350795	  1.245570	  0.730265
 -1.389344	  1.220190	  0.735916
 -1.429805	  1.178424	  0.753156
 -1.454448	  1.125406	  0.788285
 -1.454845	  1.066679	  0.838568
 -1.434989	  1.017653	  0.886683
 -1.411478	  0.987479	  0.919155
 -1.380355	  0.961718	  0.952288
 -1.341579	  0.939188	  0.987970
 -1.275622	  0.904822	  1.043754
 -1.210608	  0.831573	  1.111451
 -1.197697	  0.755458	  1.157648
 -1.200890	  0.703242	  1.183376
 -1.207558	  0.658705	  1.203926
 -1.217349	  0.616018	  1.222495
 -1.230581	  0.571967	  1.239712
 -1.246082	  0.526019	  1.255689
 -1.261429	  0.481175	  1.271351
 -1.277309	  0.437439	  1.287368
 -1.295219	  0.393635	  1.304463
 -1.314219	  0.352121	  1.322542
 -1.334181	  0.311712	  1.342692
 -1.354494	  0.270894	  1.367584
 -1.372144	  0.232271	  1.394957
 -1.388147	  0.193489	  1.423789
 -1.403919	  0.155970	  1.451764
 -1.419034	  0.119476	  1.477902
 -1.434041	  0.082073	  1.502876
 -1.450824	  0.039910	  1.527692
 -1.467791	 -0.005119	  1.551438
 -1.483672	 -0.049024	  1.572601
 -1.498930	 -0.090889	  1.589410
 -1.513981	 -0.134284	  1.603190
 -1.531262	 -0.175884	  1.621384
 -1.541687	 -0.217799	  1.648525
 -1.556814	 -0.255663	  1.678212
 -1.570449	 -0.298573	  1.696162
 -1.591177	 -0.341723	  1.712041
 -1.617282	 -0.379082	  1.736034
 -1.631258	 -0.422522	  1.761474
 -1.646062	 -0.465820	  1.783918
 -1.659312	 -0.508306	  1.807265
 -1.674160	 -0.549450	  1.829934
 -1.688325	 -0.589246	  1.852332
 -1.703590	 -0.631435	  1.876522
 -1.719721	 -0.673607	  1.900758
 -1.736247	 -0.713782	  1.923567
 -1.752705	 -0.753157	  1.945904
 -1.769130	 -0.792225	  1.968873
 -1.785932	 -0.831121	  1.991909
 -1.803619	 -0.871653	  2.014819
 -1.823931	 -0.912713	  2.035173
 -1.842368	 -0.956236	  2.049705
 -1.858113	 -0.998147	  2.076124
 -1.881873	 -1.045014	  2.089617
 -1.900692	 -1.055464	  2.110513
