 -2.445582	  0.104742	  0.444648
 -2.464242	  0.094684	  0.449554
 -2.447090	  0.103938	  0.445063
 -2.429931	  0.113186	  0.440584
 -2.411140	  0.119557	  0.440584
 -2.391900	  0.125949	  0.442051
 -2.373351	  0.132046	  0.443410
 -2.354744	  0.137122	  0.444750
 -2.335846	  0.145103	  0.448750
 -2.317231	  0.156557	  0.449172
 -2.299984	  0.164788	  0.446790
 -2.281424	  0.171245	  0.442932
 -2.263192	  0.177073	  0.439327
 -2.244445	  0.185127	  0.436217
 -2.227070	  0.194533	  0.433095
 -2.209715	  0.203970	  0.429972
 -2.192655	  0.214069	  0.427340
 -2.176173	  0.225259	  0.425562
 -2.159693	  0.236449	  0.423786
 -2.142694	  0.246880	  0.422304
 -2.125307	  0.256664	  0.420951
 -2.107935	  0.266504	  0.419596
 -2.090319	  0.275764	  0.418400
 -2.073081	  0.284073	  0.416529
 -2.053888	  0.290979	  0.413927
 -2.032882	  0.297952	  0.412776
 -2.015900	  0.306101	  0.412488
 -2.001298	  0.319551	  0.411856
 -1.984467	  0.332771	  0.411424
 -1.965939	  0.341627	  0.411766
 -1.949749	  0.349637	  0.409125
 -1.932418	  0.361249	  0.407106
 -1.915005	  0.370421	  0.404276
 -1.896904	  0.377534	  0.398873
 -1.877517	  0.386873	  0.395775
 -1.861713	  0.399234	  0.393351
 -1.849530	  0.412387	  0.388669
 -1.835390	  0.426825	  0.382805
 -1.823241	  0.442354	  0.378106
 -1.811148	  0.457558	  0.373153
 -1.796066	  0.469482	  0.367567
 -1.777841	  0.475343	  0.361786
 -1.759610	  0.481192	  0.356004
 -1.741817	  0.488629	  0.350707
 -1.724654	  0.497737	  0.346007
 -1.707584	  0.507113	  0.342121
 -1.690471	  0.516879	  0.339008
 -1.674634	  0.528269	  0.339229
 -1.659837	  0.540648	  0.341500
 -1.644280	  0.553727	  0.343084
 -1.629087	  0.564538	  0.334577
 -1.614263	  0.575203	  0.326428
 -1.599499	  0.585714	  0.318162
 -1.584773	  0.595653	  0.310193
 -1.569594	  0.606292	  0.303325
 -1.554533	  0.618072	  0.295233
 -1.538183	  0.630965	  0.292080
 -1.522104	  0.642139	  0.291194
 -1.505185	  0.652032	  0.290453
 -1.488532	  0.661507	  0.287844
 -1.469538	  0.672359	  0.286304
 -1.453092	  0.683984	  0.284494
 -1.436775	  0.695672	  0.284833
 -1.420454	  0.703428	  0.281531
 -1.402569	  0.713759	  0.276413
 -1.385468	  0.725821	  0.275958
 -1.367958	  0.733624	  0.278225
 -1.348441	  0.739953	  0.276601
 -1.330017	  0.746709	  0.272510
 -1.312445	  0.755502	  0.268187
 -1.295163	  0.764529	  0.264510
 -1.277096	  0.772469	  0.261100
 -1.259588	  0.781511	  0.257969
 -1.240788	  0.789460	  0.254723
 -1.221964	  0.794199	  0.252599
 -1.200708	  0.795594	  0.250034
 -1.180515	  0.799044	  0.245410
 -1.163540	  0.806045	  0.243966
 -1.143419	  0.813928	  0.244397
 -1.124244	  0.821972	  0.243721
 -1.108654	  0.828558	  0.242624
 -1.088133	  0.837285	  0.243384
 -1.068117	  0.844082	  0.247860
 -1.051593	  0.847061	  0.248334
 -1.031735	  0.854307	  0.249749
 -1.012472	  0.859865	  0.253567
 -0.992954	  0.862319	  0.257746
 -0.972399	  0.864940	  0.264101
 -0.956495	  0.874810	  0.269002
 -0.939612	  0.883510	  0.275475
 -0.923590	  0.892958	  0.283141
 -0.905763	  0.904775	  0.285134
 -0.888018	  0.913217	  0.285475
 -0.869045	  0.919300	  0.295096
 -0.855526	  0.929171	  0.306855
 -0.838552	  0.942236	  0.313746
 -0.817701	  0.947846	  0.311457
 -0.803956	  0.960698	  0.311373
 -0.786519	  0.970184	  0.320759
 -0.766235	  0.977263	  0.315020
 -0.749813	  0.990818	  0.311047
 -0.735026	  1.002937	  0.312073
 -0.719665	  1.011528	  0.320219
 -0.700036	  1.025233	  0.320787
 -0.687687	  1.038044	  0.325937
 -0.672632	  1.048655	  0.332598
 -0.654298	  1.063703	  0.330368
 -0.639511	  1.076824	  0.327019
 -0.626289	  1.090027	  0.323995
 -0.607332	  1.099022	  0.318163
 -0.585366	  1.108620	  0.315731
 -0.575895	  1.116330	  0.324093
 -0.559974	  1.131533	  0.325836
 -0.545642	  1.151073	  0.326731
 -0.530641	  1.163310	  0.325956
 -0.511424	  1.170072	  0.326397
 -0.495814	  1.182926	  0.326016
 -0.480052	  1.193784	  0.324361
 -0.462550	  1.203609	  0.322422
 -0.447137	  1.222402	  0.322243
 -0.436145	  1.239105	  0.318266
 -0.421870	  1.251900	  0.319892
 -0.404181	  1.258753	  0.318254
 -0.384947	  1.263572	  0.316478
 -0.363883	  1.267048	  0.311348
 -0.346528	  1.273697	  0.311200
 -0.325519	  1.287166	  0.306922
 -0.313733	  1.295731	  0.301172
 -0.297288	  1.305058	  0.299057
 -0.276741	  1.318686	  0.293042
 -0.261982	  1.327338	  0.291055
 -0.242629	  1.334213	  0.288786
 -0.222889	  1.338641	  0.279910
 -0.206384	  1.347306	  0.275011
 -0.189899	  1.358737	  0.279853
 -0.170613	  1.366698	  0.281575
 -0.153547	  1.381203	  0.285327
 -0.140582	  1.397305	  0.291725
 -0.125669	  1.409651	  0.292354
 -0.105716	  1.415978	  0.297030
 -0.085043	  1.415955	  0.305929
 -0.070967	  1.425818	  0.313785
 -0.056448	  1.434918	  0.322746
 -0.037753	  1.441547	  0.330306
 -0.023508	  1.446561	  0.341940
 -0.005904	  1.456272	  0.350446
  0.005909	  1.463165	  0.365257
  0.018272	  1.466993	  0.379598
  0.031420	  1.474675	  0.391888
  0.050866	  1.472393	  0.406180
  0.064776	  1.464589	  0.420814
  0.077257	  1.461676	  0.436024
  0.091350	  1.466177	  0.445391
  0.113757	  1.471489	  0.449574
  0.132905	  1.471169	  0.458303
  0.149846	  1.465357	  0.470681
  0.168759	  1.458515	  0.475062
  0.187096	  1.449978	  0.482486
  0.206398	  1.457481	  0.475395
  0.228636	  1.460929	  0.466171
  0.246802	  1.466591	  0.455759
  0.261898	  1.470143	  0.457068
  0.281401	  1.479759	  0.455807
  0.300187	  1.488226	  0.455646
  0.315262	  1.500700	  0.456812
  0.329763	  1.515443	  0.454424
  0.342830	  1.529690	  0.453736
  0.357006	  1.543780	  0.451291
  0.369037	  1.559460	  0.446074
  0.378742	  1.577179	  0.442180
  0.388054	  1.594586	  0.439022
  0.396512	  1.612090	  0.438393
  0.405109	  1.630332	  0.435731
  0.412027	  1.643800	  0.422654
  0.416983	  1.652381	  0.405293
  0.421935	  1.660930	  0.387903
  0.426887	  1.669477	  0.370513
  0.431839	  1.678024	  0.353123
  0.436791	  1.686573	  0.335733
  0.441723	  1.695193	  0.318373
  0.446167	  1.706059	  0.302183
  0.450604	  1.716934	  0.285995
  0.455039	  1.727810	  0.269807
  0.459475	  1.738686	  0.253619
  0.463913	  1.749561	  0.237432
  0.468349	  1.760437	  0.221244
  0.472799	  1.771316	  0.205065
  0.481325	  1.783841	  0.192025
  0.495616	  1.796953	  0.187174
  0.509925	  1.810066	  0.182347
  0.524234	  1.823179	  0.177521
  0.538542	  1.836293	  0.172693
  0.552851	  1.849406	  0.167866
  0.567167	  1.862514	  0.163050
  0.583475	  1.874042	  0.162010
  0.600712	  1.884024	  0.163791
  0.617954	  1.894001	  0.165581
  0.635196	  1.903976	  0.167373
  0.652117	  1.913563	  0.169880
  0.669081	  1.922257	  0.172353
  0.688721	  1.932237	  0.175996
  0.705603	  1.941782	  0.179710
  0.720451	  1.952096	  0.185895
  0.737304	  1.962757	  0.192831
  0.755909	  1.974777	  0.197423
  0.768929	  1.986466	  0.192122
  0.785276	  1.998773	  0.189945
  0.802888	  2.011677	  0.193980
  0.814873	  2.026110	  0.185831
  0.827961	  2.039870	  0.180546
  0.847748	  2.052122	  0.180068
  0.866409	  2.061634	  0.175737
  0.876440	  2.069730	  0.165009
  0.890153	  2.084718	  0.156128
  0.900042	  2.100321	  0.148036
  0.914783	  2.111225	  0.137706
  0.937580	  2.121159	  0.131357
  0.954997	  2.131341	  0.132084
  0.968703	  2.138563	  0.131180
  0.984760	  2.149435	  0.121194
  1.000238	  2.162325	  0.114351
  1.014958	  2.178036	  0.112324
  1.029992	  2.189493	  0.109800
  1.046920	  2.195996	  0.103083
  1.063917	  2.205511	  0.096038
  1.085543	  2.213584	  0.094260
  1.103776	  2.218168	  0.093077
  1.120672	  2.224204	  0.083889
  1.138803	  2.232070	  0.080822
