  0.407655	 -2.429320	 -0.368164
  0.411241	 -2.438197	 -0.368885
  0.396891	 -2.402670	 -0.366001
  0.379708	 -2.357378	 -0.355513
  0.363804	 -2.311488	 -0.342026
  0.348613	 -2.265310	 -0.327312
  0.333791	 -2.216305	 -0.310796
  0.321698	 -2.167299	 -0.296056
  0.311021	 -2.119335	 -0.283949
  0.298742	 -2.072167	 -0.274330
  0.285114	 -2.026461	 -0.265785
  0.270403	 -1.981153	 -0.256591
  0.255638	 -1.935574	 -0.245128
  0.242874	 -1.888458	 -0.231338
  0.230753	 -1.840860	 -0.217318
  0.218086	 -1.794209	 -0.203136
  0.204834	 -1.750377	 -0.189234
  0.192022	 -1.707114	 -0.174466
  0.182685	 -1.661203	 -0.156979
  0.175071	 -1.610874	 -0.141824
  0.163068	 -1.559892	 -0.132295
  0.147997	 -1.510680	 -0.126781
  0.130935	 -1.462347	 -0.124330
  0.111668	 -1.414881	 -0.124877
  0.089060	 -1.368196	 -0.128616
  0.064805	 -1.323721	 -0.131888
  0.040207	 -1.281026	 -0.132342
  0.014843	 -1.237557	 -0.128985
 -0.009871	 -1.196240	 -0.120366
 -0.035237	 -1.156871	 -0.106845
 -0.061791	 -1.116716	 -0.091584
 -0.087057	 -1.073455	 -0.077696
 -0.109301	 -1.027220	 -0.066263
 -0.127272	 -0.980355	 -0.058235
 -0.141291	 -0.931068	 -0.052128
 -0.150965	 -0.879330	 -0.045270
 -0.157596	 -0.829453	 -0.037804
 -0.162825	 -0.781776	 -0.029671
 -0.167815	 -0.734051	 -0.020331
 -0.173825	 -0.685054	 -0.009095
 -0.182966	 -0.635440	  0.005203
 -0.196369	 -0.585935	  0.021714
 -0.212793	 -0.540050	  0.038080
 -0.231804	 -0.497160	  0.053511
 -0.253478	 -0.455693	  0.067861
 -0.278059	 -0.413823	  0.081372
 -0.303219	 -0.372138	  0.094260
 -0.329065	 -0.329855	  0.107233
 -0.354984	 -0.288048	  0.119938
 -0.379368	 -0.248135	  0.131148
 -0.402817	 -0.205158	  0.141999
 -0.422403	 -0.161235	  0.152718
 -0.439243	 -0.113615	  0.164778
 -0.452890	 -0.066587	  0.177319
 -0.464838	 -0.018816	  0.189822
 -0.475781	  0.029455	  0.201207
 -0.486636	  0.077789	  0.210355
 -0.499140	  0.124794	  0.215518
 -0.514595	  0.171539	  0.219310
 -0.532333	  0.218519	  0.225277
 -0.552021	  0.266074	  0.233437
 -0.572231	  0.310688	  0.243510
 -0.592416	  0.354229	  0.254480
 -0.611593	  0.399271	  0.265236
 -0.628122	  0.443946	  0.274442
 -0.644530	  0.490798	  0.282246
 -0.661583	  0.537179	  0.287603
 -0.680309	  0.584005	  0.291132
 -0.701450	  0.631034	  0.293324
 -0.724447	  0.676109	  0.296476
 -0.748583	  0.719521	  0.301626
 -0.772960	  0.761625	  0.309190
 -0.798057	  0.803696	  0.319036
 -0.821669	  0.845712	  0.331728
 -0.842221	  0.887277	  0.345629
 -0.861223	  0.932427	  0.359439
 -0.879675	  0.980453	  0.371457
 -0.897635	  1.027688	  0.380885
 -0.915436	  1.073546	  0.388410
 -0.932420	  1.116860	  0.393700
 -0.949844	  1.161845	  0.397338
 -0.967099	  1.209454	  0.399974
 -0.982416	  1.257693	  0.402092
 -0.995983	  1.308444	  0.404626
 -1.008206	  1.358400	  0.407850
 -1.020577	  1.407361	  0.412593
 -1.033913	  1.453241	  0.419853
 -1.049990	  1.498841	  0.429705
 -1.067970	  1.545730	  0.441711
 -1.084585	  1.593262	  0.455310
 -1.100305	  1.640653	  0.470507
 -1.115384	  1.684440	  0.485617
 -1.130546	  1.727318	  0.501086
 -1.148034	  1.772663	  0.517762
 -1.165936	  1.817726	  0.534217
 -1.182789	  1.860181	  0.549033
 -1.202785	  1.904859	  0.562166
 -1.220978	  1.948291	  0.571471
 -1.237763	  1.992943	  0.580119
 -1.266779	  2.069511	  0.601992
 -1.272649	  2.083442	  0.606270
