 -0.285304	 -1.452676	 -2.022649
 -0.286279	 -1.460150	 -2.054184
 -0.286817	 -1.455492	 -2.034696
 -0.286303	 -1.450025	 -2.015441
 -0.285426	 -1.444567	 -1.996255
 -0.284826	 -1.438727	 -1.977117
 -0.284056	 -1.431265	 -1.958550
 -0.283081	 -1.423827	 -1.940020
 -0.281852	 -1.416240	 -1.921592
 -0.281055	 -1.405696	 -1.904576
 -0.280178	 -1.394947	 -1.887708
 -0.278774	 -1.384281	 -1.870895
 -0.277503	 -1.371128	 -1.855849
 -0.276402	 -1.356814	 -1.841881
 -0.275213	 -1.342265	 -1.828156
 -0.273647	 -1.326001	 -1.816484
 -0.271726	 -1.308387	 -1.807092
 -0.269708	 -1.290685	 -1.797946
 -0.266694	 -1.271788	 -1.791843
 -0.263292	 -1.252650	 -1.786958
 -0.257930	 -1.233620	 -1.784010
 -0.243006	 -1.221687	 -1.778562
 -0.225698	 -1.214236	 -1.771788
 -0.208445	 -1.207986	 -1.764025
 -0.190927	 -1.203816	 -1.755727
 -0.173415	 -1.199961	 -1.746957
 -0.156307	 -1.197302	 -1.737216
 -0.139222	 -1.194954	 -1.727394
 -0.122365	 -1.192565	 -1.716769
 -0.105695	 -1.190559	 -1.705908
 -0.090283	 -1.189270	 -1.693268
 -0.075441	 -1.188243	 -1.679910
 -0.060638	 -1.187143	 -1.666511
 -0.045753	 -1.186235	 -1.653182
 -0.031007	 -1.185062	 -1.639742
 -0.016704	 -1.184034	 -1.625862
 -0.003730	 -1.183069	 -1.610710
  0.009115	 -1.181897	 -1.595431
  0.022058	 -1.180883	 -1.580213
  0.034895	 -1.179690	 -1.564925
  0.047831	 -1.178684	 -1.549702
  0.060652	 -1.177509	 -1.534428
  0.072696	 -1.175705	 -1.518641
  0.083504	 -1.173094	 -1.502084
  0.094273	 -1.170444	 -1.485431
  0.105015	 -1.167716	 -1.468784
  0.115815	 -1.165075	 -1.452158
  0.126527	 -1.162329	 -1.435493
  0.137158	 -1.159509	 -1.418828
  0.146495	 -1.157049	 -1.401368
  0.153656	 -1.154721	 -1.382887
  0.160696	 -1.152275	 -1.364348
  0.165636	 -1.150743	 -1.346447
  0.164269	 -1.153730	 -1.326900
  0.166832	 -1.158640	 -1.303268
  0.176690	 -1.155927	 -1.285767
  0.182754	 -1.154239	 -1.268691
  0.183674	 -1.157406	 -1.248815
  0.185542	 -1.159388	 -1.229506
  0.188397	 -1.160872	 -1.209289
  0.187438	 -1.165624	 -1.190755
  0.180628	 -1.174103	 -1.176223
  0.172445	 -1.190211	 -1.158822
  0.172456	 -1.202093	 -1.138097
  0.173706	 -1.207219	 -1.120303
  0.170997	 -1.208231	 -1.099951
  0.166208	 -1.210411	 -1.079128
  0.158866	 -1.213444	 -1.062005
  0.152782	 -1.219013	 -1.045716
  0.144242	 -1.223968	 -1.026324
  0.134933	 -1.225694	 -1.008066
  0.124702	 -1.226185	 -0.991764
  0.111651	 -1.226995	 -0.975678
  0.098719	 -1.227233	 -0.962030
  0.082794	 -1.223093	 -0.948363
  0.065375	 -1.218575	 -0.931648
  0.054085	 -1.217383	 -0.917982
  0.044008	 -1.215208	 -0.903523
  0.031437	 -1.215062	 -0.880873
  0.024844	 -1.216549	 -0.866180
  0.019597	 -1.223322	 -0.851679
  0.007535	 -1.226754	 -0.829582
 -0.003257	 -1.226338	 -0.813257
 -0.012138	 -1.224220	 -0.801905
 -0.024761	 -1.221313	 -0.784843
 -0.035232	 -1.220561	 -0.766596
 -0.045602	 -1.216303	 -0.749655
 -0.054854	 -1.209301	 -0.733576
 -0.064764	 -1.201413	 -0.718020
 -0.074725	 -1.193628	 -0.702528
 -0.084709	 -1.185588	 -0.687209
 -0.094089	 -1.175691	 -0.672628
 -0.102905	 -1.165572	 -0.657941
 -0.110454	 -1.156361	 -0.641999
 -0.119321	 -1.147728	 -0.625323
 -0.129422	 -1.137680	 -0.610296
 -0.139465	 -1.126055	 -0.596944
 -0.147314	 -1.111886	 -0.585926
 -0.152516	 -1.098334	 -0.572823
 -0.154728	 -1.086120	 -0.557021
 -0.156530	 -1.073434	 -0.541715
 -0.159148	 -1.064363	 -0.523590
 -0.166387	 -1.060418	 -0.500430
 -0.175910	 -1.055416	 -0.484986
 -0.183922	 -1.045632	 -0.471955
 -0.191694	 -1.031847	 -0.461229
 -0.206020	 -1.018714	 -0.447035
 -0.220854	 -1.008951	 -0.433389
 -0.230486	 -0.998238	 -0.416327
 -0.228002	 -0.989823	 -0.398635
 -0.223912	 -0.981094	 -0.380155
 -0.222645	 -0.966245	 -0.358254
 -0.228679	 -0.955805	 -0.342201
 -0.236797	 -0.947384	 -0.329361
 -0.246147	 -0.943298	 -0.305604
 -0.249278	 -0.942926	 -0.286849
 -0.245593	 -0.944388	 -0.265620
 -0.242746	 -0.938567	 -0.246150
 -0.240738	 -0.929764	 -0.225538
 -0.239277	 -0.927112	 -0.207686
 -0.243455	 -0.931520	 -0.188123
 -0.252292	 -0.937138	 -0.167698
 -0.256700	 -0.936980	 -0.145713
 -0.251581	 -0.932530	 -0.126099
 -0.249584	 -0.930949	 -0.104884
 -0.249266	 -0.930133	 -0.084881
 -0.248162	 -0.929214	 -0.071449
 -0.246956	 -0.930015	 -0.043906
 -0.249235	 -0.935838	 -0.022820
 -0.253084	 -0.942281	 -0.009517
 -0.262962	 -0.951306	  0.009401
 -0.267540	 -0.956550	  0.025887
 -0.266472	 -0.961674	  0.047976
 -0.265344	 -0.962116	  0.068670
 -0.266715	 -0.962143	  0.087819
 -0.270901	 -0.965610	  0.107120
 -0.273891	 -0.968251	  0.126956
 -0.274520	 -0.968904	  0.146844
 -0.274342	 -0.972428	  0.168536
 -0.276527	 -0.980876	  0.187575
 -0.281563	 -0.990072	  0.203147
 -0.286326	 -0.997597	  0.222128
 -0.286487	 -1.001189	  0.246228
 -0.286275	 -1.000746	  0.264244
 -0.287536	 -1.002885	  0.282671
 -0.292971	 -1.006561	  0.301063
 -0.300844	 -1.006022	  0.320765
 -0.312601	 -1.000241	  0.342820
 -0.320550	 -0.997619	  0.362264
 -0.322514	 -0.997773	  0.380552
 -0.321708	 -1.000251	  0.397743
 -0.319491	 -1.004741	  0.419979
 -0.319148	 -1.005304	  0.442635
 -0.318479	 -1.005974	  0.458580
 -0.318339	 -1.005348	  0.477542
 -0.319173	 -1.008766	  0.502015
 -0.320134	 -1.013843	  0.519651
 -0.322978	 -1.015286	  0.538178
 -0.327093	 -1.010944	  0.556564
 -0.323073	 -1.008761	  0.578014
 -0.317260	 -1.013886	  0.600161
 -0.314824	 -1.014863	  0.618864
 -0.318165	 -1.011778	  0.640565
 -0.323079	 -1.006599	  0.659405
 -0.325193	 -1.002379	  0.677422
 -0.322920	 -1.001059	  0.696704
 -0.321002	 -1.000437	  0.719793
 -0.322153	 -0.996977	  0.737762
 -0.325310	 -0.993573	  0.761250
 -0.323332	 -0.992410	  0.776274
 -0.317255	 -0.992173	  0.797066
 -0.307620	 -0.990639	  0.819982
 -0.301414	 -0.988765	  0.835112
 -0.304925	 -0.989715	  0.855918
 -0.312838	 -0.984110	  0.874810
 -0.313909	 -0.972775	  0.900047
 -0.312531	 -0.970025	  0.915824
 -0.311842	 -0.968809	  0.932323
 -0.310069	 -0.962376	  0.958354
 -0.307206	 -0.961211	  0.977234
 -0.305809	 -0.960407	  0.991133
 -0.303666	 -0.956006	  1.017250
 -0.300182	 -0.954948	  1.037084
 -0.296968	 -0.953939	  1.050362
 -0.292187	 -0.949452	  1.073002
 -0.287243	 -0.946143	  1.094665
 -0.284633	 -0.944230	  1.107109
 -0.277528	 -0.941403	  1.133830
 -0.272851	 -0.941371	  1.155769
 -0.272807	 -0.941487	  1.170190
 -0.278540	 -0.941515	  1.189823
 -0.285872	 -0.935141	  1.212798
 -0.284616	 -0.925779	  1.234623
 -0.280166	 -0.925025	  1.253403
 -0.274143	 -0.924772	  1.270652
 -0.269840	 -0.928203	  1.288633
 -0.268710	 -0.929395	  1.307230
 -0.269055	 -0.933896	  1.327721
 -0.271714	 -0.934927	  1.350877
 -0.272732	 -0.936732	  1.368952
 -0.270034	 -0.936116	  1.386476
 -0.266237	 -0.940630	  1.408653
 -0.262884	 -0.942454	  1.426242
 -0.259783	 -0.944568	  1.443261
 -0.256621	 -0.944974	  1.469756
 -0.259797	 -0.942083	  1.494286
 -0.261494	 -0.939621	  1.508575
 -0.259574	 -0.940747	  1.524322
 -0.253740	 -0.951677	  1.542836
 -0.256579	 -0.971229	  1.564554
 -0.264261	 -0.980730	  1.580795
 -0.270905	 -0.988994	  1.599934
 -0.275366	 -0.994313	  1.616479
 -0.276710	 -0.999879	  1.633826
 -0.276768	 -1.008963	  1.653329
 -0.275753	 -1.015764	  1.672932
 -0.278919	 -1.020853	  1.689084
 -0.283389	 -1.029663	  1.707631
 -0.286153	 -1.040037	  1.726231
 -0.290611	 -1.049282	  1.744801
 -0.292265	 -1.054300	  1.764568
 -0.292948	 -1.056417	  1.786077
 -0.283066	 -1.062722	  1.810427
 -0.278085	 -1.064722	  1.820443
 -0.276364	 -1.076909	  1.840219
 -0.280891	 -1.090385	  1.858962
 -0.292275	 -1.099942	  1.875472
 -0.299690	 -1.106980	  1.892940
 -0.300972	 -1.111945	  1.914496
 -0.300376	 -1.115921	  1.930130
 -0.301275	 -1.121933	  1.947444
 -0.303270	 -1.127220	  1.969588
 -0.308771	 -1.131744	  1.988060
 -0.311592	 -1.133565	  2.007425
 -0.312181	 -1.133906	  2.027579
 -0.312754	 -1.134212	  2.047574
 -0.313310	 -1.134344	  2.067550
 -0.313606	 -1.133553	  2.087383
 -0.312592	 -1.128793	  2.106632
 -0.311568	 -1.123693	  2.125946
 -0.310534	 -1.118529	  2.145241
 -0.309518	 -1.113221	  2.164461
 -0.308034	 -1.106579	  2.183152
 -0.305711	 -1.097670	  2.200804
 -0.303392	 -1.088467	  2.218400
 -0.301080	 -1.079125	  2.235936
 -0.298766	 -1.069336	  2.253133
 -0.295985	 -1.057985	  2.269240
 -0.293247	 -1.046096	  2.285094
 -0.290502	 -1.034341	  2.301009
 -0.288065	 -1.021652	  2.316227
 -0.285909	 -1.008458	  2.331070
 -0.283805	 -0.995104	  2.345775
 -0.282567	 -0.981318	  2.360172
 -0.282010	 -0.967158	  2.374260
 -0.281479	 -0.952997	  2.388338
 -0.282434	 -0.938248	  2.401762
 -0.283581	 -0.923497	  2.415200
 -0.284932	 -0.908543	  2.428407
 -0.287240	 -0.893663	  2.441532
 -0.289644	 -0.878595	  2.454467
 -0.292015	 -0.863535	  2.467408
 -0.294376	 -0.848594	  2.480506
 -0.296833	 -0.833342	  2.493540
 -0.299093	 -0.817738	  2.508161
 -0.301239	 -0.802630	  2.521089
