 -0.685695	 -2.285921	  0.756919
 -0.685953	 -2.282385	  0.755107
 -0.686781	 -2.271045	  0.749297
 -0.688019	 -2.252450	  0.742681
 -0.684882	 -2.228585	  0.728073
 -0.688651	 -2.210229	  0.712408
 -0.691876	 -2.203310	  0.705712
 -0.698129	 -2.186093	  0.692000
 -0.701007	 -2.169276	  0.681329
 -0.700583	 -2.151835	  0.672295
 -0.698742	 -2.129084	  0.658350
 -0.698826	 -2.118478	  0.649050
 -0.700972	 -2.107643	  0.638442
 -0.705099	 -2.088291	  0.626810
 -0.706608	 -2.058947	  0.619712
 -0.707208	 -2.044204	  0.617364
 -0.707504	 -2.022308	  0.612755
 -0.708526	 -1.999512	  0.605657
 -0.709103	 -1.982352	  0.599890
 -0.712467	 -1.970519	  0.595003
 -0.715943	 -1.953139	  0.584302
 -0.721710	 -1.931956	  0.576162
 -0.727879	 -1.915265	  0.573693
 -0.735095	 -1.898868	  0.571742
 -0.745233	 -1.872823	  0.573033
 -0.751325	 -1.853050	  0.574151
 -0.754965	 -1.839597	  0.571632
 -0.758772	 -1.819042	  0.567028
 -0.762220	 -1.796933	  0.561760
 -0.764684	 -1.786274	  0.556838
 -0.767096	 -1.768162	  0.547093
 -0.763426	 -1.737727	  0.540992
 -0.763145	 -1.717850	  0.539846
 -0.764541	 -1.701931	  0.541078
 -0.763746	 -1.676951	  0.542288
 -0.764362	 -1.663239	  0.542951
 -0.772089	 -1.638887	  0.546714
 -0.778023	 -1.620145	  0.549709
 -0.782685	 -1.602569	  0.550715
 -0.785327	 -1.588290	  0.550522
 -0.790112	 -1.559045	  0.549307
 -0.789703	 -1.541902	  0.550653
 -0.785152	 -1.525420	  0.558791
 -0.781669	 -1.506193	  0.563528
 -0.777329	 -1.478441	  0.567560
 -0.776926	 -1.458505	  0.569936
 -0.778044	 -1.441155	  0.570523
 -0.776467	 -1.425973	  0.572085
 -0.771792	 -1.404596	  0.568723
 -0.765829	 -1.384188	  0.568005
 -0.762743	 -1.362949	  0.568646
 -0.758603	 -1.348488	  0.571611
 -0.753397	 -1.331647	  0.575814
 -0.750225	 -1.308880	  0.579703
 -0.748115	 -1.284319	  0.581028
 -0.744597	 -1.266478	  0.581064
 -0.738213	 -1.247217	  0.582482
 -0.728832	 -1.228266	  0.584108
 -0.722638	 -1.208049	  0.582874
 -0.719281	 -1.191249	  0.579498
 -0.712816	 -1.170803	  0.574598
 -0.702490	 -1.149851	  0.567387
 -0.694122	 -1.133750	  0.563405
 -0.686588	 -1.118968	  0.561523
 -0.679617	 -1.102304	  0.558178
 -0.671296	 -1.080889	  0.555364
 -0.660928	 -1.060494	  0.550155
 -0.654127	 -1.045331	  0.543140
 -0.648389	 -1.031308	  0.539282
 -0.639295	 -1.009497	  0.528885
 -0.629414	 -0.989263	  0.512834
 -0.623078	 -0.980636	  0.503900
 -0.616466	 -0.969949	  0.491686
 -0.606196	 -0.953917	  0.475149
 -0.600945	 -0.942485	  0.465467
 -0.595025	 -0.929375	  0.454706
 -0.590228	 -0.911142	  0.438052
 -0.585520	 -0.898607	  0.425809
 -0.581636	 -0.889130	  0.415628
 -0.574951	 -0.868302	  0.392084
 -0.571801	 -0.857585	  0.381573
 -0.568245	 -0.845375	  0.373332
 -0.566197	 -0.826126	  0.361487
 -0.565388	 -0.807085	  0.351848
 -0.564110	 -0.788659	  0.340251
 -0.562911	 -0.774260	  0.327617
 -0.562334	 -0.763231	  0.314427
 -0.561783	 -0.750196	  0.291428
 -0.561687	 -0.738960	  0.274192
 -0.562277	 -0.728299	  0.262815
 -0.563518	 -0.707418	  0.246707
 -0.565092	 -0.691291	  0.232579
 -0.565351	 -0.679316	  0.225062
 -0.560850	 -0.658166	  0.221891
 -0.554967	 -0.638367	  0.213273
 -0.550001	 -0.620574	  0.203437
 -0.545983	 -0.605897	  0.194342
 -0.537795	 -0.585815	  0.181795
 -0.536397	 -0.564223	  0.168725
 -0.539986	 -0.552650	  0.162129
 -0.545594	 -0.536498	  0.153392
 -0.548199	 -0.516852	  0.142251
 -0.553014	 -0.499864	  0.133712
 -0.551995	 -0.480955	  0.125477
 -0.549305	 -0.462932	  0.115712
 -0.546183	 -0.445765	  0.105846
 -0.543951	 -0.428672	  0.094336
 -0.541055	 -0.412634	  0.082440
 -0.539465	 -0.397712	  0.069076
 -0.538225	 -0.382782	  0.055927
 -0.537378	 -0.366515	  0.045349
 -0.536413	 -0.348429	  0.037236
 -0.533738	 -0.329954	  0.029143
 -0.530886	 -0.312423	  0.021003
 -0.523131	 -0.296124	  0.012640
 -0.514681	 -0.278129	  0.005413
 -0.509901	 -0.256220	 -0.001074
 -0.510353	 -0.237006	 -0.010825
 -0.512960	 -0.224415	 -0.018696
 -0.518787	 -0.205175	 -0.036306
 -0.526474	 -0.183662	 -0.048455
 -0.529702	 -0.175086	 -0.053384
 -0.535997	 -0.157875	 -0.064321
 -0.538077	 -0.135922	 -0.080112
 -0.536173	 -0.118554	 -0.088491
 -0.536517	 -0.102641	 -0.090539
 -0.538848	 -0.079695	 -0.091086
 -0.539177	 -0.049407	 -0.089738
 -0.536196	 -0.031771	 -0.090800
 -0.532905	 -0.014792	 -0.092840
 -0.530609	  0.005693	 -0.093336
 -0.524468	  0.028072	 -0.095249
 -0.517657	  0.045547	 -0.099773
 -0.511740	  0.061092	 -0.104004
 -0.506108	  0.086144	 -0.115048
 -0.506140	  0.102092	 -0.122735
 -0.508349	  0.115767	 -0.127854
 -0.519223	  0.137239	 -0.132557
 -0.529854	  0.162356	 -0.137936
 -0.531462	  0.178735	 -0.143734
 -0.529978	  0.194738	 -0.151229
 -0.527866	  0.210168	 -0.163112
 -0.522885	  0.227659	 -0.178338
 -0.516229	  0.245166	 -0.189429
 -0.512515	  0.264343	 -0.199808
 -0.515055	  0.282582	 -0.209194
 -0.519220	  0.294509	 -0.214974
 -0.527574	  0.310662	 -0.226794
 -0.535289	  0.328655	 -0.246035
 -0.536225	  0.343130	 -0.258319
 -0.536693	  0.357876	 -0.266662
 -0.532695	  0.378531	 -0.275135
 -0.527891	  0.393317	 -0.284192
 -0.527897	  0.407290	 -0.295782
 -0.538001	  0.430152	 -0.321166
 -0.540744	  0.440096	 -0.332582
 -0.544893	  0.451669	 -0.339712
 -0.548099	  0.467489	 -0.352572
 -0.550152	  0.490646	 -0.364213
 -0.551467	  0.504933	 -0.369105
 -0.550935	  0.523199	 -0.381529
 -0.549971	  0.537906	 -0.395959
 -0.550067	  0.548734	 -0.406979
 -0.554640	  0.565045	 -0.420317
 -0.562832	  0.580919	 -0.436103
 -0.569308	  0.593863	 -0.448871
 -0.575907	  0.609397	 -0.463642
 -0.580117	  0.619366	 -0.473147
 -0.584129	  0.631414	 -0.484148
 -0.588052	  0.649911	 -0.500981
 -0.596901	  0.661826	 -0.515251
 -0.605519	  0.669164	 -0.524911
 -0.618836	  0.680119	 -0.538700
 -0.631028	  0.691807	 -0.553276
 -0.638408	  0.701538	 -0.564368
 -0.649754	  0.716307	 -0.578744
 -0.659343	  0.729368	 -0.588052
 -0.669041	  0.740574	 -0.597598
 -0.685372	  0.756668	 -0.612573
 -0.697379	  0.769144	 -0.627060
 -0.701302	  0.775011	 -0.637571
 -0.704215	  0.788244	 -0.650423
 -0.708990	  0.802437	 -0.666639
 -0.721166	  0.813907	 -0.682786
 -0.734173	  0.824396	 -0.696256
 -0.740150	  0.833276	 -0.703479
 -0.747774	  0.853809	 -0.713478
 -0.754309	  0.874443	 -0.723190
 -0.758824	  0.885510	 -0.729909
 -0.767754	  0.903021	 -0.739187
 -0.777744	  0.922870	 -0.751230
 -0.781738	  0.937712	 -0.759005
 -0.789960	  0.948873	 -0.775568
 -0.798460	  0.962969	 -0.789975
 -0.802308	  0.980199	 -0.798777
 -0.804280	  0.998724	 -0.803852
 -0.808224	  1.012356	 -0.808758
 -0.808248	  1.035745	 -0.807421
 -0.809272	  1.063018	 -0.804839
 -0.810249	  1.074083	 -0.804495
 -0.813264	  1.095452	 -0.809956
 -0.805599	  1.112580	 -0.811692
 -0.804913	  1.131828	 -0.814613
 -0.811652	  1.152765	 -0.823248
 -0.809227	  1.174286	 -0.833194
 -0.800252	  1.195186	 -0.834460
 -0.793291	  1.209305	 -0.831804
 -0.787807	  1.230038	 -0.824401
 -0.784026	  1.252668	 -0.824892
 -0.779051	  1.272845	 -0.829321
 -0.774971	  1.292495	 -0.834659
 -0.771750	  1.311194	 -0.841487
 -0.769265	  1.330357	 -0.848192
 -0.766014	  1.348352	 -0.856521
 -0.763335	  1.364731	 -0.865576
 -0.763068	  1.379355	 -0.874972
 -0.756846	  1.395855	 -0.882513
 -0.741065	  1.420180	 -0.891074
 -0.734530	  1.438090	 -0.898183
 -0.731392	  1.449919	 -0.902943
 -0.731648	  1.465763	 -0.907814
 -0.724752	  1.490516	 -0.911835
 -0.719016	  1.508625	 -0.913509
 -0.714717	  1.524434	 -0.911540
 -0.709113	  1.541789	 -0.909835
 -0.700762	  1.559479	 -0.909976
 -0.696105	  1.577749	 -0.914222
 -0.700447	  1.600474	 -0.919695
 -0.700867	  1.624130	 -0.918363
 -0.689374	  1.641857	 -0.914040
 -0.677184	  1.657275	 -0.909999
 -0.668629	  1.674251	 -0.906581
 -0.664674	  1.694699	 -0.899202
 -0.661264	  1.715985	 -0.891501
 -0.655173	  1.732534	 -0.886674
 -0.646228	  1.743817	 -0.884409
 -0.621526	  1.773913	 -0.880229
 -0.606703	  1.790179	 -0.884119
 -0.588032	  1.796609	 -0.892227
 -0.572554	  1.802827	 -0.897499
 -0.551725	  1.812762	 -0.902725
 -0.539876	  1.827344	 -0.906582
 -0.530516	  1.849192	 -0.912398
 -0.525328	  1.865788	 -0.914944
 -0.514921	  1.884884	 -0.912704
 -0.503795	  1.900786	 -0.913582
 -0.498936	  1.921483	 -0.920718
 -0.499407	  1.942736	 -0.932752
 -0.497492	  1.956823	 -0.940322
 -0.485782	  1.973585	 -0.939048
 -0.475136	  1.990583	 -0.942286
 -0.470941	  2.009160	 -0.949275
 -0.468320	  2.028031	 -0.955934
 -0.466350	  2.047175	 -0.960298
 -0.464786	  2.066318	 -0.966256
 -0.463760	  2.084832	 -0.973969
 -0.462879	  2.103029	 -0.982241
 -0.462211	  2.121173	 -0.990627
 -0.461544	  2.139307	 -0.999024
 -0.460632	  2.157046	 -1.008030
 -0.459847	  2.174310	 -1.017947
 -0.456619	  2.188727	 -1.028437
 -0.444716	  2.200033	 -1.041575
 -0.431694	  2.224428	 -1.056201
 -0.426469	  2.242597	 -1.062876
