 -0.034274	 -2.098239	  1.242023
 -0.037385	 -2.120760	  1.248780
 -0.043692	 -2.099053	  1.251662
 -0.043776	 -2.077484	  1.248622
 -0.035154	 -2.057338	  1.241928
 -0.030111	 -2.042094	  1.233283
 -0.026448	 -2.023621	  1.222997
 -0.020284	 -2.006542	  1.212640
 -0.016398	 -1.991254	  1.203932
 -0.012319	 -1.973578	  1.195290
  0.000606	 -1.954234	  1.188154
  0.010211	 -1.937358	  1.181870
  0.009047	 -1.921157	  1.171756
 -0.000229	 -1.902521	  1.164648
 -0.005281	 -1.877133	  1.159848
  0.001872	 -1.856992	  1.153523
  0.011711	 -1.844305	  1.148014
  0.020739	 -1.825585	  1.138697
  0.019233	 -1.806772	  1.126882
  0.012855	 -1.789301	  1.122065
  0.010911	 -1.768072	  1.117805
  0.012693	 -1.749269	  1.111422
  0.014703	 -1.730569	  1.107420
  0.013217	 -1.709514	  1.104544
  0.012455	 -1.688030	  1.093668
  0.015588	 -1.674661	  1.088416
  0.019851	 -1.653769	  1.086340
  0.023820	 -1.633078	  1.085944
  0.026854	 -1.612895	  1.086238
  0.029709	 -1.593097	  1.086360
  0.032564	 -1.573301	  1.086444
  0.035418	 -1.553506	  1.086517
  0.038686	 -1.533804	  1.087442
  0.044093	 -1.515390	  1.093046
  0.049525	 -1.496989	  1.098694
  0.054958	 -1.478588	  1.104343
  0.060390	 -1.460187	  1.109991
  0.065822	 -1.441787	  1.115640
  0.071267	 -1.423394	  1.121299
  0.077668	 -1.406014	  1.128827
  0.085809	 -1.391527	  1.139947
  0.093969	 -1.377067	  1.151096
  0.102130	 -1.362606	  1.162246
  0.110291	 -1.348146	  1.173395
  0.118451	 -1.333686	  1.184544
  0.126621	 -1.319237	  1.195700
  0.135750	 -1.306018	  1.207610
  0.145925	 -1.294379	  1.220298
  0.156110	 -1.282756	  1.232992
  0.166295	 -1.271132	  1.245687
  0.176498	 -1.259507	  1.258364
  0.188110	 -1.247737	  1.269614
  0.200144	 -1.235918	  1.280339
  0.210245	 -1.219269	  1.284711
  0.216072	 -1.200671	  1.280777
  0.223102	 -1.184090	  1.275542
  0.231113	 -1.169161	  1.265707
  0.233115	 -1.162392	  1.251171
  0.235253	 -1.156125	  1.238722
  0.236953	 -1.153689	  1.220159
  0.239400	 -1.154887	  1.199512
  0.239474	 -1.157325	  1.177512
  0.237607	 -1.148431	  1.157351
  0.236768	 -1.134146	  1.140856
  0.235978	 -1.121541	  1.122616
  0.235933	 -1.115949	  1.103516
  0.238433	 -1.114637	  1.085128
  0.240966	 -1.112869	  1.062783
  0.241673	 -1.105332	  1.043524
  0.242183	 -1.094615	  1.027130
  0.243032	 -1.084938	  1.007966
  0.245185	 -1.081124	  0.989446
  0.250066	 -1.078218	  0.969568
  0.251803	 -1.068208	  0.946822
  0.249092	 -1.056049	  0.931081
  0.250673	 -1.042063	  0.915583
  0.253858	 -1.027773	  0.903702
  0.257196	 -1.014565	  0.886749
  0.259138	 -0.999541	  0.871517
  0.261064	 -0.984343	  0.858125
  0.263948	 -0.970139	  0.844281
  0.265375	 -0.952840	  0.832706
  0.268321	 -0.936978	  0.819100
  0.269639	 -0.919313	  0.809112
  0.271448	 -0.902398	  0.798643
  0.274095	 -0.884464	  0.788008
  0.278204	 -0.867911	  0.775820
  0.280999	 -0.851166	  0.764619
  0.280426	 -0.830834	  0.755707
  0.280245	 -0.813436	  0.746458
  0.275576	 -0.792190	  0.741928
  0.273503	 -0.773357	  0.737184
  0.273538	 -0.753955	  0.732243
  0.274826	 -0.735042	  0.726712
  0.276342	 -0.717117	  0.718629
  0.277096	 -0.699417	  0.709503
  0.276808	 -0.682759	  0.698393
  0.277341	 -0.666550	  0.685610
  0.280386	 -0.647833	  0.676025
  0.280742	 -0.626576	  0.672333
  0.279347	 -0.607254	  0.671561
  0.281242	 -0.589003	  0.665787
  0.287581	 -0.570010	  0.658327
  0.292216	 -0.550962	  0.652843
  0.295428	 -0.534254	  0.646735
  0.302219	 -0.517245	  0.636664
  0.308989	 -0.499590	  0.626705
  0.311583	 -0.481546	  0.619855
  0.314242	 -0.463037	  0.612503
  0.318700	 -0.444721	  0.606592
  0.321684	 -0.424368	  0.602748
  0.323424	 -0.404161	  0.599371
  0.327801	 -0.385782	  0.593100
  0.333497	 -0.369141	  0.583941
  0.337054	 -0.351896	  0.575446
  0.340381	 -0.330959	  0.570605
  0.346520	 -0.311776	  0.566899
  0.352729	 -0.295168	  0.561514
  0.355687	 -0.275752	  0.555339
  0.360042	 -0.254266	  0.551432
  0.368340	 -0.235866	  0.547489
  0.377157	 -0.219062	  0.541759
  0.381798	 -0.204922	  0.534414
  0.386019	 -0.184970	  0.526702
  0.389726	 -0.164903	  0.523598
  0.396102	 -0.145686	  0.524027
  0.403076	 -0.122815	  0.524280
  0.404539	 -0.104813	  0.519550
  0.403743	 -0.087387	  0.509508
  0.404862	 -0.069815	  0.500697
  0.410991	 -0.047609	  0.493759
  0.420137	 -0.030141	  0.489665
  0.428379	 -0.015324	  0.486991
  0.435561	  0.004662	  0.485187
  0.439429	  0.025184	  0.480342
  0.440444	  0.043151	  0.472065
  0.439532	  0.060849	  0.462011
  0.441114	  0.079821	  0.453408
  0.441449	  0.098437	  0.449049
  0.440492	  0.116831	  0.441674
  0.441064	  0.138104	  0.430924
  0.443148	  0.155908	  0.427357
  0.442865	  0.175175	  0.427268
  0.445093	  0.199461	  0.424926
  0.447542	  0.216976	  0.416332
  0.446077	  0.234732	  0.405841
  0.441078	  0.251704	  0.401386
  0.438406	  0.272472	  0.396898
  0.439614	  0.291907	  0.391618
  0.440096	  0.311828	  0.390232
  0.440293	  0.331520	  0.388677
  0.444603	  0.351496	  0.388911
  0.453444	  0.367837	  0.386834
  0.462995	  0.387404	  0.379224
  0.468222	  0.404932	  0.370471
  0.468689	  0.423184	  0.366610
  0.474067	  0.441887	  0.365347
  0.484571	  0.460180	  0.361295
  0.493060	  0.477132	  0.355250
  0.498948	  0.494144	  0.351432
  0.506609	  0.512120	  0.350054
  0.518072	  0.529294	  0.347134
  0.528288	  0.545713	  0.341825
  0.534993	  0.562653	  0.337182
  0.543752	  0.580775	  0.334144
  0.555155	  0.600445	  0.332326
  0.562545	  0.619381	  0.327878
  0.565887	  0.634861	  0.321629
  0.570464	  0.653477	  0.314127
  0.574762	  0.673791	  0.306915
  0.575866	  0.692474	  0.298878
  0.578281	  0.709209	  0.293348
  0.584725	  0.728336	  0.288570
  0.591496	  0.748768	  0.284204
  0.596852	  0.768335	  0.275315
  0.605735	  0.785576	  0.270044
  0.611235	  0.799931	  0.250438
  0.615095	  0.815882	  0.241026
  0.609712	  0.824504	  0.222225
  0.611359	  0.841788	  0.212209
  0.619019	  0.857844	  0.196961
  0.623703	  0.874284	  0.188162
  0.626358	  0.882732	  0.169344
  0.626437	  0.884565	  0.148269
  0.628369	  0.885147	  0.130577
  0.634518	  0.891279	  0.105824
  0.641910	  0.902904	  0.090059
  0.640313	  0.903805	  0.075202
  0.649803	  0.910383	  0.053896
  0.659614	  0.914299	  0.032586
  0.667704	  0.922391	  0.020722
  0.678935	  0.930195	  0.008457
  0.691006	  0.944612	 -0.002987
  0.702460	  0.956291	 -0.019571
  0.713493	  0.964183	 -0.032864
  0.725323	  0.970924	 -0.050248
  0.739079	  0.981593	 -0.061916
  0.749372	  0.985394	 -0.075062
  0.765103	  0.994330	 -0.088266
  0.778547	  1.004721	 -0.102807
  0.789680	  1.011444	 -0.118162
  0.802403	  1.022037	 -0.125803
  0.814690	  1.032692	 -0.138328
  0.826587	  1.046647	 -0.147225
  0.839068	  1.063048	 -0.160037
  0.851532	  1.077290	 -0.162581
  0.863246	  1.091893	 -0.158912
  0.879527	  1.103833	 -0.158422
  0.895088	  1.123181	 -0.161366
  0.905930	  1.138116	 -0.165974
  0.915620	  1.153525	 -0.162663
  0.925451	  1.168879	 -0.160000
  0.940601	  1.183820	 -0.160965
  0.952930	  1.202421	 -0.167265
  0.964688	  1.220465	 -0.173566
  0.975703	  1.234221	 -0.176241
  0.986785	  1.251376	 -0.171037
  0.990459	  1.271293	 -0.165562
  0.991116	  1.293244	 -0.160575
  0.993292	  1.308735	 -0.159225
  1.001509	  1.326541	 -0.158523
  1.009768	  1.343235	 -0.158908
  1.017279	  1.360959	 -0.159955
  1.023013	  1.381030	 -0.163243
  1.025959	  1.398127	 -0.165158
  1.030549	  1.417269	 -0.166157
  1.029734	  1.435692	 -0.169369
  1.025545	  1.452853	 -0.178651
  1.022834	  1.469901	 -0.185347
  1.020997	  1.487026	 -0.192725
  1.021241	  1.505204	 -0.198763
  1.022946	  1.525292	 -0.203879
  1.022181	  1.545594	 -0.210754
  1.015292	  1.566064	 -0.214883
  1.008552	  1.586538	 -0.219289
  0.999112	  1.606665	 -0.218970
  0.989958	  1.624158	 -0.215809
  0.980820	  1.641540	 -0.212971
  0.971930	  1.659486	 -0.210554
  0.965541	  1.677670	 -0.209366
  0.958198	  1.695316	 -0.206039
  0.955036	  1.714403	 -0.205536
  0.949805	  1.731748	 -0.201699
  0.943193	  1.748738	 -0.198525
  0.938629	  1.766225	 -0.200546
  0.937892	  1.787803	 -0.204489
  0.943331	  1.806702	 -0.205899
  0.946198	  1.823689	 -0.204943
  0.946141	  1.842068	 -0.211020
  0.943884	  1.863358	 -0.214896
  0.946569	  1.877851	 -0.215399
  0.954058	  1.903743	 -0.224636
  0.950090	  1.919884	 -0.228895
  0.947387	  1.938371	 -0.238486
  0.942944	  1.955363	 -0.243472
  0.944758	  1.978146	 -0.246449
  0.946833	  1.999673	 -0.245924
  0.947538	  2.015816	 -0.246003
  0.951101	  2.035730	 -0.251546
  0.957538	  2.052969	 -0.259400
  0.962540	  2.070531	 -0.267458
  0.965621	  2.090808	 -0.282524
  0.967032	  2.105817	 -0.294710
  0.968526	  2.123116	 -0.301447
  0.970628	  2.143806	 -0.299696
  0.971289	  2.167311	 -0.300769
  0.972608	  2.186976	 -0.307132
  0.977148	  2.202479	 -0.313880
  0.982956	  2.221351	 -0.319988
  0.986509	  2.241560	 -0.328037
  0.986415	  2.258351	 -0.337408
  0.982616	  2.281258	 -0.342489
  0.984640	  2.300380	 -0.347989
