 -1.451021	  1.440117	 -1.226112
 -1.538688	  1.441782	 -1.211237
 -1.518973	  1.441406	 -1.214583
 -1.499261	  1.441011	 -1.217939
 -1.479574	  1.440568	 -1.221369
 -1.460043	  1.441249	 -1.225441
 -1.440765	  1.441748	 -1.229401
 -1.422591	  1.437073	 -1.232936
 -1.400373	  1.430118	 -1.239426
 -1.378902	  1.428753	 -1.245274
 -1.362187	  1.434718	 -1.248509
 -1.341450	  1.437180	 -1.251770
 -1.318706	  1.434615	 -1.256502
 -1.301503	  1.438359	 -1.258227
 -1.282107	  1.437964	 -1.259629
 -1.257885	  1.438233	 -1.265061
 -1.238501	  1.450705	 -1.268804
 -1.222618	  1.464872	 -1.269957
 -1.205851	  1.475768	 -1.268736
 -1.186238	  1.481418	 -1.269642
 -1.167557	  1.488259	 -1.269898
 -1.148234	  1.493726	 -1.271105
 -1.128705	  1.498183	 -1.271269
 -1.109167	  1.502443	 -1.270848
 -1.089628	  1.506692	 -1.270431
 -1.070089	  1.510940	 -1.270016
 -1.050556	  1.515203	 -1.269606
 -1.031238	  1.520169	 -1.269476
 -1.015561	  1.532271	 -1.271849
 -0.999996	  1.544577	 -1.274334
 -0.984430	  1.556886	 -1.276819
 -0.968864	  1.569196	 -1.279305
 -0.953300	  1.581505	 -1.281791
 -0.937886	  1.593923	 -1.284379
 -0.927824	  1.610148	 -1.290200
 -0.918965	  1.626904	 -1.296574
 -0.910132	  1.643669	 -1.302969
 -0.901308	  1.660435	 -1.309373
 -0.893039	  1.677363	 -1.316074
 -0.887037	  1.694805	 -1.323772
 -0.880972	  1.712184	 -1.331618
 -0.874883	  1.729521	 -1.339554
 -0.869912	  1.746936	 -1.348111
 -0.865271	  1.764504	 -1.356494
 -0.860738	  1.782163	 -1.364754
 -0.856542	  1.800085	 -1.372682
 -0.852817	  1.818143	 -1.380296
 -0.849338	  1.836262	 -1.387674
 -0.845118	  1.854345	 -1.395105
