 -1.667987	 -0.516494	 -1.533129
 -1.674966	 -0.526472	 -1.529956
 -1.667169	 -0.511514	 -1.536082
 -1.658510	 -0.491257	 -1.544539
 -1.646130	 -0.474671	 -1.549183
 -1.634750	 -0.463359	 -1.552983
 -1.623697	 -0.445721	 -1.560687
 -1.610624	 -0.428072	 -1.565962
 -1.599248	 -0.418106	 -1.569256
 -1.587767	 -0.401585	 -1.576836
 -1.575775	 -0.379413	 -1.583066
 -1.562559	 -0.367096	 -1.584318
 -1.549466	 -0.358957	 -1.587904
 -1.533830	 -0.345782	 -1.596329
 -1.520369	 -0.330941	 -1.603098
 -1.507337	 -0.317035	 -1.609239
 -1.494222	 -0.303229	 -1.615351
 -1.481037	 -0.289473	 -1.621401
 -1.467537	 -0.276459	 -1.626912
 -1.455685	 -0.261964	 -1.628516
 -1.440107	 -0.246273	 -1.630692
 -1.421251	 -0.236892	 -1.639698
 -1.403264	 -0.226830	 -1.652840
 -1.395242	 -0.218411	 -1.660201
 -1.386891	 -0.200896	 -1.663218
 -1.371583	 -0.180967	 -1.672580
 -1.354537	 -0.171248	 -1.683131
 -1.338862	 -0.165437	 -1.686384
 -1.320313	 -0.156208	 -1.688398
 -1.303581	 -0.146764	 -1.692831
 -1.288569	 -0.141331	 -1.695667
 -1.261165	 -0.130235	 -1.704045
 -1.248085	 -0.112443	 -1.711461
 -1.243021	 -0.102831	 -1.714596
 -1.235678	 -0.081480	 -1.722815
 -1.215807	 -0.066363	 -1.735814
 -1.203330	 -0.060928	 -1.741624
 -1.186665	 -0.055025	 -1.748480
 -1.171000	 -0.042826	 -1.756460
 -1.153092	 -0.030803	 -1.766885
 -1.133509	 -0.020451	 -1.775172
 -1.121138	 -0.010820	 -1.777871
 -1.108049	 -0.001866	 -1.779124
 -1.091410	  0.014759	 -1.784244
 -1.081430	  0.033076	 -1.786445
 -1.070923	  0.050352	 -1.790365
 -1.059084	  0.065512	 -1.796790
 -1.047577	  0.080575	 -1.803184
 -1.036505	  0.096015	 -1.809431
 -1.025435	  0.111506	 -1.815553
 -1.014371	  0.127136	 -1.821322
 -1.003307	  0.142766	 -1.827090
 -0.991625	  0.157839	 -1.833121
 -0.979669	  0.172647	 -1.839267
 -0.967718	  0.187461	 -1.845410
 -0.955126	  0.201584	 -1.851891
 -0.941576	  0.214529	 -1.858878
 -0.928028	  0.227477	 -1.865864
 -0.914469	  0.240415	 -1.872848
 -0.899758	  0.251710	 -1.880326
 -0.884806	  0.262624	 -1.887897
 -0.869852	  0.273536	 -1.895468
 -0.854518	  0.283807	 -1.903173
 -0.838899	  0.293562	 -1.910977
 -0.823273	  0.303303	 -1.918784
 -0.807527	  0.312853	 -1.926586
 -0.791740	  0.322335	 -1.934387
 -0.775956	  0.331842	 -1.942165
 -0.760181	  0.341426	 -1.949866
 -0.744407	  0.351010	 -1.957567
 -0.728787	  0.360782	 -1.965347
 -0.713183	  0.370570	 -1.973136
 -0.697596	  0.380380	 -1.980926
 -0.682172	  0.390408	 -1.988788
 -0.666657	  0.400353	 -1.996605
 -0.651466	  0.410840	 -2.004396
 -0.636630	  0.421309	 -2.012600
 -0.621461	  0.430517	 -2.022120
 -0.606808	  0.441727	 -2.030417
 -0.591651	  0.450385	 -2.036767
 -0.573119	  0.455032	 -2.046038
 -0.556800	  0.464250	 -2.056609
 -0.539668	  0.481268	 -2.065559
 -0.527120	  0.496612	 -2.073807
 -0.520655	  0.504594	 -2.079821
 -0.505693	  0.518234	 -2.089882
 -0.490819	  0.533984	 -2.099635
 -0.482781	  0.549077	 -2.105316
 -0.472696	  0.565787	 -2.110569
 -0.460913	  0.581799	 -2.117702
 -0.451054	  0.596766	 -2.126157
 -0.437679	  0.611311	 -2.135160
 -0.423702	  0.621233	 -2.141025
 -0.412411	  0.631627	 -2.145709
 -0.405926	  0.652959	 -2.162926
 -0.394983	  0.667412	 -2.176501
 -0.384248	  0.683017	 -2.183834
 -0.372431	  0.699211	 -2.181003
 -0.361118	  0.713736	 -2.188818
