  1.619348	 -1.851971	 -0.562209
  1.635050	 -1.870635	 -0.548922
  1.623764	 -1.857173	 -0.558483
  1.612678	 -1.843508	 -0.567988
  1.601650	 -1.829787	 -0.577479
  1.590721	 -1.815973	 -0.586952
  1.579966	 -1.802001	 -0.596393
  1.569253	 -1.788023	 -0.605871
  1.558776	 -1.774127	 -0.615723
  1.548260	 -1.760311	 -0.625627
  1.537759	 -1.746592	 -0.635512
  1.526320	 -1.733098	 -0.644716
  1.512578	 -1.719986	 -0.652868
  1.499134	 -1.706209	 -0.661859
  1.490772	 -1.691095	 -0.672990
  1.486408	 -1.676099	 -0.684708
  1.480861	 -1.660279	 -0.696055
  1.471201	 -1.645140	 -0.705438
  1.461572	 -1.629825	 -0.714003
  1.452186	 -1.614210	 -0.722112
  1.442927	 -1.598652	 -0.730540
  1.432802	 -1.584250	 -0.740001
  1.421987	 -1.570793	 -0.750103
  1.410756	 -1.558202	 -0.760790
  1.398908	 -1.545987	 -0.771487
  1.387895	 -1.534790	 -0.783909
  1.376760	 -1.523188	 -0.795909
  1.366095	 -1.510174	 -0.806862
  1.356475	 -1.496186	 -0.817373
  1.346711	 -1.482217	 -0.827868
  1.337181	 -1.468030	 -0.838306
  1.327927	 -1.453650	 -0.848690
  1.318668	 -1.439270	 -0.859058
  1.310000	 -1.424612	 -0.869544
  1.301527	 -1.409868	 -0.880072
  1.293189	 -1.395091	 -0.890633
  1.285244	 -1.380261	 -0.901440
  1.277012	 -1.365649	 -0.912335
  1.268918	 -1.351785	 -0.922992
  1.258608	 -1.341595	 -0.937781
  1.249770	 -1.327457	 -0.952345
  1.248297	 -1.301977	 -0.956671
  1.248494	 -1.279306	 -0.960020
  1.244237	 -1.263320	 -0.967445
  1.238302	 -1.248906	 -0.976227
  1.234703	 -1.228081	 -0.984159
  1.228286	 -1.210153	 -0.996724
  1.218208	 -1.203740	 -1.011691
  1.202245	 -1.200571	 -1.034265
  1.193004	 -1.184840	 -1.053712
  1.189437	 -1.169696	 -1.061339
  1.181012	 -1.156555	 -1.066594
  1.169612	 -1.139125	 -1.081116
  1.166660	 -1.120974	 -1.093324
  1.163472	 -1.103480	 -1.099045
  1.154147	 -1.086662	 -1.102155
  1.144702	 -1.068710	 -1.110340
  1.140799	 -1.048879	 -1.114200
  1.133856	 -1.030470	 -1.119305
  1.124246	 -1.014451	 -1.127368
  1.113869	 -0.999220	 -1.135043
  1.103190	 -0.984135	 -1.142757
  1.092561	 -0.969151	 -1.150722
  1.081724	 -0.954383	 -1.158717
  1.069972	 -0.940545	 -1.166467
  1.055073	 -0.933071	 -1.176667
  1.041153	 -0.933369	 -1.190405
  1.028046	 -0.933385	 -1.205580
  1.015450	 -0.932754	 -1.221162
  1.002984	 -0.931998	 -1.236295
  0.989311	 -0.931171	 -1.251627
  0.976860	 -0.928015	 -1.270352
  0.969307	 -0.919112	 -1.292027
  0.965905	 -0.907118	 -1.308055
  0.959679	 -0.896684	 -1.322656
  0.951318	 -0.888117	 -1.339062
  0.949101	 -0.881618	 -1.354087
  0.941637	 -0.871367	 -1.377863
  0.931843	 -0.868170	 -1.396819
  0.924021	 -0.869276	 -1.415889
  0.919002	 -0.866832	 -1.438589
  0.917137	 -0.862811	 -1.452797
  0.916918	 -0.853315	 -1.470376
  0.918429	 -0.844515	 -1.494094
  0.925161	 -0.840267	 -1.514372
  0.927551	 -0.836250	 -1.528129
  0.927394	 -0.826683	 -1.559537
  0.928422	 -0.821484	 -1.577901
  0.928339	 -0.817762	 -1.591120
  0.928473	 -0.813224	 -1.607062
  0.929899	 -0.810171	 -1.634755
  0.933848	 -0.806635	 -1.648223
  0.939969	 -0.802401	 -1.663801
  0.946980	 -0.795400	 -1.683871
  0.949633	 -0.788238	 -1.705361
  0.947588	 -0.779507	 -1.727497
  0.944596	 -0.772543	 -1.747916
  0.942787	 -0.770984	 -1.760669
  0.947313	 -0.768121	 -1.782859
  0.953123	 -0.764801	 -1.803174
  0.956043	 -0.760502	 -1.825474
  0.957371	 -0.758593	 -1.842100
  0.960853	 -0.756100	 -1.862039
  0.965061	 -0.750486	 -1.879330
  0.971281	 -0.740146	 -1.902843
  0.975680	 -0.730109	 -1.921576
  0.978608	 -0.724498	 -1.930906
  0.984005	 -0.715517	 -1.951875
  0.990461	 -0.709249	 -1.971606
  0.999952	 -0.708195	 -1.992085
  1.006510	 -0.708090	 -2.008707
  1.009886	 -0.696617	 -2.034348
  1.009157	 -0.678640	 -2.050187
  1.008302	 -0.661778	 -2.063509
  1.013051	 -0.642128	 -2.071261
  1.018098	 -0.622805	 -2.078136
  1.026591	 -0.603907	 -2.082766
  1.034556	 -0.585546	 -2.086295
  1.038218	 -0.566676	 -2.093813
  1.040690	 -0.547788	 -2.100681
  1.042254	 -0.528241	 -2.105727
  1.041706	 -0.508270	 -2.108660
  1.041266	 -0.488358	 -2.110697
  1.040406	 -0.468421	 -2.113188
  1.040797	 -0.448226	 -2.113931
  1.039638	 -0.427937	 -2.112952
  1.036966	 -0.408336	 -2.107518
  1.034623	 -0.389532	 -2.101175
  1.031312	 -0.370577	 -2.095646
  1.028971	 -0.351830	 -2.088940
  1.025908	 -0.332880	 -2.082846
  1.023034	 -0.314726	 -2.074190
  1.016840	 -0.299346	 -2.062092
  1.011498	 -0.285422	 -2.048593
  1.006081	 -0.271466	 -2.035355
  1.001565	 -0.257709	 -2.021552
  0.997596	 -0.244057	 -2.007464
  0.992774	 -0.230491	 -1.993321
  0.986187	 -0.219155	 -1.977907
  0.979772	 -0.209219	 -1.961747
  0.973904	 -0.200314	 -1.946060
  0.964686	 -0.191831	 -1.930067
  0.957679	 -0.184698	 -1.908650
  0.951738	 -0.177935	 -1.895519
  0.944373	 -0.164455	 -1.883956
  0.935136	 -0.146222	 -1.868557
  0.923983	 -0.135164	 -1.847122
  0.917208	 -0.132093	 -1.833360
  0.909816	 -0.131999	 -1.817912
  0.897822	 -0.128300	 -1.795797
  0.891323	 -0.120481	 -1.781035
  0.887891	 -0.110173	 -1.767445
  0.881082	 -0.089493	 -1.754484
  0.869463	 -0.074679	 -1.748052
  0.856449	 -0.060671	 -1.737382
  0.848083	 -0.052071	 -1.728452
  0.836478	 -0.043347	 -1.720875
  0.820803	 -0.031999	 -1.713407
  0.802570	 -0.024465	 -1.701910
  0.786965	 -0.018986	 -1.692020
  0.774142	 -0.014707	 -1.685839
  0.759045	 -0.005141	 -1.674877
  0.740339	  0.006627	 -1.671818
  0.726680	  0.017902	 -1.678105
  0.713053	  0.032767	 -1.686416
  0.710642	  0.047338	 -1.696930
  0.705658	  0.063442	 -1.707577
  0.708903	  0.079713	 -1.721782
  0.713981	  0.091436	 -1.734057
  0.719892	  0.100691	 -1.747909
  0.728499	  0.109735	 -1.764536
  0.732868	  0.123196	 -1.780268
  0.733282	  0.138329	 -1.798124
  0.734622	  0.150928	 -1.820034
  0.734841	  0.156803	 -1.827661
  0.737437	  0.171824	 -1.847884
  0.737455	  0.182155	 -1.859228
  0.739622	  0.195464	 -1.878762
  0.742703	  0.210685	 -1.900543
  0.742769	  0.218641	 -1.910658
  0.743614	  0.228574	 -1.922311
  0.748007	  0.242235	 -1.940008
  0.756178	  0.256448	 -1.955033
  0.764577	  0.270919	 -1.969616
  0.779767	  0.279391	 -1.986278
  0.793660	  0.281323	 -2.002245
  0.802434	  0.282228	 -2.013179
  0.816644	  0.287937	 -2.029379
  0.829169	  0.293462	 -2.046197
  0.842211	  0.292588	 -2.062626
  0.855887	  0.289337	 -2.077973
  0.870627	  0.287216	 -2.089517
  0.888458	  0.291526	 -2.100728
  0.903161	  0.295280	 -2.115035
  0.914715	  0.289948	 -2.134139
  0.924283	  0.285867	 -2.150601
  0.932854	  0.284775	 -2.165629
  0.944043	  0.285132	 -2.184569
  0.952998	  0.285218	 -2.200752
  0.961525	  0.285693	 -2.217974
  0.970590	  0.288024	 -2.238290
  0.979075	  0.287304	 -2.254690
  0.987980	  0.282657	 -2.269006
  0.996203	  0.281564	 -2.284153
  0.999616	  0.283557	 -2.303759
