 -1.774948	  0.492960	  1.598496
 -1.804575	  0.490894	  1.593629
 -1.785937	  0.493082	  1.598833
 -1.765273	  0.493425	  1.599897
 -1.745374	  0.494589	  1.602636
 -1.725716	  0.496288	  1.605799
 -1.706427	  0.499566	  1.609908
 -1.687157	  0.502935	  1.614222
 -1.667877	  0.506386	  1.618278
 -1.648776	  0.510461	  1.622184
 -1.629515	  0.514373	  1.625780
 -1.610439	  0.518397	  1.630004
 -1.591973	  0.523237	  1.635856
 -1.573839	  0.528558	  1.642484
 -1.555409	  0.533537	  1.648419
 -1.539178	  0.539598	  1.655106
 -1.520659	  0.540250	  1.664051
 -1.496643	  0.537723	  1.668609
 -1.475814	  0.538539	  1.670256
 -1.460896	  0.538902	  1.672134
 -1.438846	  0.539966	  1.677402
 -1.416608	  0.546840	  1.682091
 -1.403627	  0.554756	  1.684808
 -1.380257	  0.565665	  1.690255
 -1.360412	  0.571345	  1.694763
 -1.348740	  0.575340	  1.696565
 -1.325600	  0.584695	  1.701781
 -1.307326	  0.588883	  1.707305
 -1.289950	  0.589535	  1.713482
 -1.268916	  0.593227	  1.721285
 -1.252984	  0.598230	  1.729768
 -1.237578	  0.591822	  1.744387
 -1.217881	  0.582240	  1.755180
 -1.195417	  0.585936	  1.758314
 -1.178910	  0.590977	  1.761767
 -1.160324	  0.592118	  1.769317
 -1.140972	  0.591755	  1.777753
 -1.123786	  0.594452	  1.783921
 -1.104265	  0.597607	  1.791761
 -1.085752	  0.598136	  1.799914
 -1.068257	  0.599430	  1.806659
 -1.048880	  0.603118	  1.812562
 -1.029544	  0.605889	  1.819974
 -1.011948	  0.607524	  1.827443
 -0.994568	  0.609889	  1.833789
 -0.974493	  0.614526	  1.839382
 -0.955998	  0.618702	  1.845952
 -0.938348	  0.622998	  1.852427
 -0.920804	  0.626827	  1.858990
 -0.901972	  0.633202	  1.865939
 -0.884601	  0.640282	  1.873681
 -0.867199	  0.646127	  1.881633
 -0.848691	  0.650296	  1.888631
 -0.828221	  0.652123	  1.895915
 -0.806431	  0.646917	  1.900607
 -0.780686	  0.639078	  1.901495
 -0.763981	  0.637850	  1.899320
 -0.742987	  0.644540	  1.894556
 -0.726648	  0.655219	  1.893990
 -0.708627	  0.666279	  1.895126
 -0.687673	  0.670525	  1.894154
 -0.662277	  0.668039	  1.894307
 -0.650439	  0.666840	  1.896289
 -0.630697	  0.668721	  1.901527
 -0.611118	  0.673455	  1.904950
 -0.585301	  0.671722	  1.903653
 -0.563198	  0.666788	  1.906248
 -0.551027	  0.662154	  1.910425
 -0.531805	  0.664569	  1.919315
 -0.512133	  0.670751	  1.923727
 -0.488422	  0.672920	  1.923044
 -0.467099	  0.669515	  1.926263
 -0.450731	  0.665900	  1.932978
 -0.434114	  0.667849	  1.944217
 -0.415131	  0.674091	  1.952046
 -0.395417	  0.677867	  1.954094
 -0.377727	  0.678136	  1.955426
 -0.356198	  0.679459	  1.961653
 -0.333905	  0.685929	  1.972766
 -0.316201	  0.692515	  1.982328
 -0.306077	  0.696732	  1.987709
 -0.287799	  0.703548	  1.997166
 -0.267242	  0.710088	  2.003220
 -0.248737	  0.713899	  2.006138
 -0.228171	  0.716704	  2.009559
 -0.210615	  0.721462	  2.013438
 -0.190346	  0.729948	  2.019007
 -0.172959	  0.741737	  2.027077
 -0.158467	  0.752867	  2.034049
 -0.138736	  0.756864	  2.041610
 -0.121539	  0.754858	  2.044510
 -0.097434	  0.746251	  2.044806
 -0.076074	  0.740145	  2.048689
 -0.057236	  0.744349	  2.056135
 -0.039181	  0.757025	  2.066828
 -0.024894	  0.765256	  2.075869
 -0.008120	  0.764746	  2.081609
  0.014293	  0.758645	  2.085428
  0.036598	  0.757558	  2.090517
  0.053942	  0.766023	  2.099121
  0.067547	  0.777724	  2.110810
  0.083022	  0.783544	  2.122935
  0.098873	  0.785183	  2.132231
  0.115640	  0.788882	  2.140694
  0.138462	  0.798372	  2.147975
  0.158683	  0.800202	  2.150381
  0.178313	  0.797725	  2.150856
  0.199368	  0.797443	  2.154576
  0.218968	  0.806657	  2.162153
  0.231356	  0.817467	  2.169193
  0.248316	  0.826633	  2.180064
  0.270089	  0.825975	  2.185548
  0.289576	  0.820157	  2.187364
  0.309520	  0.816583	  2.191201
  0.328900	  0.815149	  2.196899
  0.347764	  0.813833	  2.203539
  0.365756	  0.813610	  2.212262
  0.383770	  0.813746	  2.220989
  0.401854	  0.813988	  2.229537
  0.420060	  0.816362	  2.237468
  0.438247	  0.819774	  2.245058
  0.456436	  0.823178	  2.252662
  0.474769	  0.826584	  2.260337
  0.493855	  0.827730	  2.269100
  0.511905	  0.827816	  2.277714
