 -2.735543	  1.268570	  0.297381
 -2.708458	  1.256010	  0.294436
 -2.683939	  1.236371	  0.258389
 -2.669501	  1.218364	  0.214811
 -2.645846	  1.192729	  0.176165
 -2.629768	  1.171133	  0.133494
 -2.606401	  1.154291	  0.092340
 -2.587860	  1.132016	  0.051765
 -2.570039	  1.113780	  0.012879
 -2.550473	  1.096281	 -0.027982
 -2.531509	  1.076575	 -0.070853
 -2.513759	  1.052930	 -0.115138
 -2.497663	  1.028662	 -0.155849
 -2.481870	  1.003693	 -0.195562
 -2.465466	  0.977935	 -0.235674
 -2.448714	  0.952738	 -0.274877
 -2.430606	  0.927829	 -0.315148
 -2.413280	  0.905094	 -0.353540
 -2.395392	  0.882439	 -0.393982
 -2.376412	  0.860763	 -0.435941
 -2.358087	  0.840134	 -0.478201
 -2.341992	  0.820070	 -0.521329
 -2.326113	  0.798111	 -0.563141
 -2.308807	  0.774603	 -0.604651
 -2.289661	  0.750885	 -0.646071
 -2.269529	  0.728669	 -0.686121
 -2.249030	  0.708354	 -0.723351
 -2.226964	  0.686266	 -0.761764
 -2.205075	  0.663277	 -0.800245
 -2.182455	  0.639271	 -0.840652
 -2.161537	  0.616677	 -0.879448
 -2.142208	  0.595451	 -0.916793
 -2.121850	  0.573324	 -0.956927
 -2.101746	  0.550982	 -0.997676
 -2.083456	  0.526080	 -1.039942
 -2.068196	  0.501267	 -1.079378
 -2.052504	  0.475168	 -1.119842
 -2.035444	  0.448269	 -1.161497
 -2.019136	  0.422527	 -1.200818
 -2.003858	  0.398039	 -1.240007
 -1.988741	  0.373850	 -1.281922
 -1.972761	  0.353049	 -1.322872
 -1.955896	  0.334420	 -1.362562
 -1.937045	  0.316782	 -1.405025
 -1.916151	  0.302718	 -1.450526
 -1.893849	  0.287164	 -1.495140
 -1.871743	  0.266769	 -1.537719
 -1.850576	  0.244538	 -1.577915
 -1.829541	  0.220723	 -1.618309
 -1.810565	  0.197529	 -1.655944
 -1.791884	  0.173799	 -1.693921
 -1.772047	  0.150346	 -1.735412
 -1.752627	  0.128326	 -1.777334
 -1.734543	  0.106769	 -1.817884
 -1.718840	  0.085698	 -1.859615
 -1.706843	  0.062666	 -1.900003
 -1.692040	  0.037564	 -1.941204
 -1.676811	  0.011417	 -1.981956
 -1.658899	 -0.012465	 -2.021520
 -1.641110	 -0.035699	 -2.062536
 -1.623783	 -0.056566	 -2.105129
 -1.606612	 -0.077764	 -2.149970
 -1.589135	 -0.098121	 -2.192273
 -1.571334	 -0.118806	 -2.232640
 -1.553938	 -0.138543	 -2.273176
 -1.535650	 -0.156938	 -2.318592
 -1.517354	 -0.175271	 -2.362644
 -1.500042	 -0.195014	 -2.404115
 -1.482501	 -0.215454	 -2.445658
 -1.462609	 -0.236746	 -2.488338
 -1.440132	 -0.259383	 -2.528602
 -1.418257	 -0.282768	 -2.564591
 -1.396896	 -0.306160	 -2.603409
 -1.377344	 -0.335958	 -2.643871
 -1.391118	 -0.339317	 -2.670310
