 0.0 0.0 0.0 0
 -0.9541718442202956 -0.2290213694291121 0.1900297451507394 1000
 0.7804519220552676 -0.616355116730737 -0.10640567390923729 1000
 -0.09531259144872378 0.7701127883758214 0.6301839438539727 1000
 -0.3865214938753907 -0.8991019418044024 -0.2031128578300505 1000
 -0.1941258780369483 0.49709025606949087 -0.845810511164973 1000
 0.6967217356912511 0.5480130300640211 -0.46307509314950396 1000
