  0.379183	 -2.425801	 -0.116723
  0.374717	 -2.435744	 -0.115946
  0.382887	 -2.417548	 -0.117364
  0.391327	 -2.399676	 -0.118275
  0.401734	 -2.383626	 -0.117772
  0.409981	 -2.367534	 -0.119997
  0.414825	 -2.344342	 -0.131147
  0.423486	 -2.322849	 -0.137468
  0.429155	 -2.312449	 -0.139258
  0.438049	 -2.294078	 -0.144953
  0.447449	 -2.272642	 -0.151823
  0.453957	 -2.259571	 -0.155482
  0.460894	 -2.240970	 -0.163340
  0.468418	 -2.221004	 -0.172099
  0.474059	 -2.208202	 -0.177064
  0.481427	 -2.189305	 -0.184752
  0.488658	 -2.169819	 -0.192426
  0.498044	 -2.153260	 -0.196523
  0.506558	 -2.138202	 -0.201230
  0.509626	 -2.120661	 -0.213557
  0.510151	 -2.104422	 -0.226987
  0.515982	 -2.085188	 -0.236589
  0.522139	 -2.068014	 -0.244586
  0.530779	 -2.049758	 -0.250649
  0.541706	 -2.031104	 -0.254737
  0.553427	 -2.013364	 -0.256049
  0.563925	 -1.993901	 -0.255010
  0.569926	 -1.974721	 -0.252904
  0.575513	 -1.955198	 -0.255405
  0.578418	 -1.937904	 -0.260114
  0.585872	 -1.918414	 -0.266100
  0.587034	 -1.897354	 -0.271976
  0.584418	 -1.878018	 -0.277500
  0.582341	 -1.857886	 -0.281664
  0.582904	 -1.835664	 -0.281997
  0.583369	 -1.814949	 -0.279586
  0.584925	 -1.793153	 -0.276215
  0.589164	 -1.773382	 -0.273861
  0.596181	 -1.754041	 -0.273336
  0.604955	 -1.735407	 -0.275981
  0.614129	 -1.718408	 -0.282132
  0.621868	 -1.701342	 -0.290104
  0.630251	 -1.684488	 -0.298726
  0.641244	 -1.668308	 -0.307435
  0.654490	 -1.653230	 -0.313977
  0.669080	 -1.637271	 -0.314807
  0.680324	 -1.618299	 -0.308877
  0.685616	 -1.600179	 -0.302219
  0.690656	 -1.579932	 -0.299197
  0.696224	 -1.561373	 -0.300260
  0.704085	 -1.542171	 -0.301927
  0.712180	 -1.525779	 -0.301551
  0.721287	 -1.508558	 -0.296862
  0.733540	 -1.486769	 -0.291892
  0.743380	 -1.470737	 -0.293241
  0.754894	 -1.456215	 -0.299771
  0.769795	 -1.437868	 -0.309257
  0.778340	 -1.421670	 -0.313533
  0.786340	 -1.404154	 -0.312160
  0.789659	 -1.380704	 -0.319207
  0.792112	 -1.357752	 -0.330455
  0.787880	 -1.348947	 -0.345989
  0.786943	 -1.333480	 -0.359708
  0.782832	 -1.321388	 -0.376055
  0.779830	 -1.306382	 -0.390428
  0.777543	 -1.294359	 -0.403354
  0.775399	 -1.279078	 -0.422608
  0.779781	 -1.265895	 -0.439890
  0.780645	 -1.257751	 -0.453470
  0.785225	 -1.250783	 -0.468005
  0.780901	 -1.240986	 -0.494526
  0.776411	 -1.237314	 -0.508612
  0.770913	 -1.229737	 -0.524621
  0.763531	 -1.217633	 -0.547427
  0.759993	 -1.212058	 -0.561792
  0.755691	 -1.203356	 -0.576342
  0.749214	 -1.191534	 -0.594367
  0.744495	 -1.184938	 -0.609089
  0.738317	 -1.173929	 -0.627596
  0.733692	 -1.157689	 -0.637051
  0.731304	 -1.140397	 -0.641432
  0.730452	 -1.121846	 -0.647382
  0.733101	 -1.102534	 -0.650170
  0.732469	 -1.089140	 -0.653979
  0.736907	 -1.075769	 -0.649975
  0.742795	 -1.057560	 -0.645857
  0.751319	 -1.047744	 -0.638531
  0.762287	 -1.034599	 -0.631546
  0.774134	 -1.019095	 -0.619857
  0.780918	 -1.004328	 -0.611241
  0.784679	 -0.986130	 -0.600479
  0.788362	 -0.970784	 -0.582796
  0.795879	 -0.960452	 -0.566321
  0.801215	 -0.951345	 -0.550076
  0.807505	 -0.942533	 -0.533080
  0.816417	 -0.933370	 -0.517001
  0.825161	 -0.924542	 -0.504184
  0.835130	 -0.914291	 -0.485665
  0.843889	 -0.906370	 -0.466424
  0.847845	 -0.899245	 -0.449424
  0.849930	 -0.885623	 -0.432423
  0.852841	 -0.870588	 -0.421105
  0.862410	 -0.854899	 -0.410625
  0.871830	 -0.841327	 -0.397752
  0.875813	 -0.823603	 -0.384669
  0.881060	 -0.804889	 -0.376575
  0.889660	 -0.789060	 -0.370491
  0.895817	 -0.770041	 -0.360492
  0.902712	 -0.749680	 -0.356831
  0.911610	 -0.732319	 -0.359854
  0.919852	 -0.713616	 -0.360770
  0.927679	 -0.695442	 -0.365191
  0.935611	 -0.677707	 -0.369963
  0.943615	 -0.660118	 -0.375120
  0.951098	 -0.642957	 -0.382236
  0.958545	 -0.625742	 -0.389183
  0.965898	 -0.608499	 -0.396159
  0.973029	 -0.591182	 -0.403180
  0.980083	 -0.573806	 -0.410129
  0.986927	 -0.556222	 -0.416761
  0.993679	 -0.538549	 -0.423253
  0.999391	 -0.519528	 -0.425646
  1.004800	 -0.500394	 -0.427639
  1.007609	 -0.480637	 -0.426347
  1.010346	 -0.460870	 -0.424981
  1.014762	 -0.441394	 -0.423907
  1.020390	 -0.422220	 -0.423050
  1.026060	 -0.403060	 -0.422213
  1.033385	 -0.384451	 -0.422425
  1.041775	 -0.366320	 -0.423334
  1.050323	 -0.348280	 -0.424356
  1.058092	 -0.329974	 -0.426483
  1.065533	 -0.312261	 -0.428745
  1.073559	 -0.296536	 -0.432568
  1.083638	 -0.277556	 -0.435288
  1.093885	 -0.251246	 -0.435746
  1.096294	 -0.236559	 -0.436951
  1.099014	 -0.220606	 -0.439544
  1.104391	 -0.196369	 -0.445349
  1.108365	 -0.177417	 -0.449972
  1.111928	 -0.164468	 -0.452050
  1.118869	 -0.144191	 -0.454981
  1.124467	 -0.116046	 -0.464772
  1.126200	 -0.101397	 -0.471745
  1.126812	 -0.090998	 -0.477940
  1.128064	 -0.067303	 -0.484176
  1.134148	 -0.046747	 -0.486313
  1.141328	 -0.028374	 -0.486383
  1.143571	 -0.008310	 -0.487884
  1.142032	  0.011446	 -0.492032
  1.135569	  0.029893	 -0.496029
  1.121580	  0.043782	 -0.499190
  1.107705	  0.057913	 -0.502227
  1.093587	  0.071602	 -0.505762
  1.081268	  0.083805	 -0.511082
  1.066488	  0.094928	 -0.520021
  1.047426	  0.109195	 -0.528091
  1.041010	  0.126339	 -0.530008
  1.041426	  0.143784	 -0.529807
  1.045597	  0.157243	 -0.529501
  1.061944	  0.170237	 -0.524993
  1.062816	  0.183065	 -0.525056
  1.074743	  0.197110	 -0.528714
  1.093312	  0.208494	 -0.534102
  1.112693	  0.218094	 -0.538228
  1.133003	  0.222481	 -0.538933
  1.153398	  0.225345	 -0.537696
  1.173885	  0.228428	 -0.532443
  1.193303	  0.235730	 -0.528863
  1.211118	  0.248844	 -0.527637
  1.228979	  0.262088	 -0.530199
  1.241056	  0.280817	 -0.530787
  1.246976	  0.301299	 -0.530016
  1.251903	  0.324990	 -0.527472
  1.252865	  0.344997	 -0.529719
  1.257001	  0.367609	 -0.535542
  1.263173	  0.385870	 -0.540900
  1.268681	  0.401968	 -0.546086
  1.272734	  0.421202	 -0.554270
  1.276536	  0.438355	 -0.564380
  1.283104	  0.455256	 -0.573349
  1.287509	  0.475647	 -0.580669
  1.291769	  0.495037	 -0.590045
  1.295520	  0.506681	 -0.595616
  1.301974	  0.525727	 -0.605777
  1.304906	  0.545278	 -0.615746
  1.310676	  0.564687	 -0.621279
  1.316268	  0.580477	 -0.625707
  1.321323	  0.598011	 -0.631732
  1.326207	  0.615225	 -0.634667
  1.335185	  0.643169	 -0.641211
  1.343838	  0.657287	 -0.640675
  1.349542	  0.669511	 -0.638524
  1.363481	  0.690715	 -0.635191
  1.373975	  0.710641	 -0.635176
  1.377089	  0.733226	 -0.639752
  1.378378	  0.745988	 -0.642055
  1.388115	  0.765587	 -0.642367
  1.396987	  0.785739	 -0.639062
  1.401128	  0.806954	 -0.636137
  1.405829	  0.827200	 -0.638074
  1.413050	  0.842446	 -0.644050
  1.423320	  0.859272	 -0.649341
  1.433705	  0.877576	 -0.652924
  1.439623	  0.896922	 -0.654810
  1.447317	  0.914655	 -0.658027
  1.453263	  0.932981	 -0.660173
  1.461805	  0.950387	 -0.663142
  1.471123	  0.967320	 -0.665870
  1.478260	  0.985271	 -0.667609
  1.488038	  1.002885	 -0.669554
  1.497423	  1.021384	 -0.671605
  1.506504	  1.039707	 -0.673509
  1.513818	  1.059008	 -0.674553
  1.520686	  1.077999	 -0.674963
  1.528982	  1.096468	 -0.674849
  1.535554	  1.115776	 -0.673180
  1.543512	  1.133881	 -0.672780
  1.550190	  1.152164	 -0.672291
  1.556793	  1.170495	 -0.672979
  1.565258	  1.188639	 -0.674666
  1.572542	  1.207767	 -0.676064
  1.580060	  1.226548	 -0.677945
  1.587822	  1.244717	 -0.681046
  1.591388	  1.262418	 -0.686056
  1.594595	  1.278265	 -0.685608
  1.601339	  1.313733	 -0.685144
  1.602027	  1.329336	 -0.690265
  1.601722	  1.342577	 -0.692028
  1.604767	  1.364697	 -0.700181
  1.611703	  1.385656	 -0.706818
  1.616070	  1.400189	 -0.711082
  1.623373	  1.418437	 -0.716914
  1.630219	  1.436941	 -0.721201
  1.636135	  1.455682	 -0.725853
  1.644309	  1.478875	 -0.734313
  1.646844	  1.494637	 -0.740671
  1.649617	  1.509349	 -0.745907
  1.650966	  1.533234	 -0.752243
  1.653083	  1.550599	 -0.753140
  1.656779	  1.569265	 -0.754913
  1.662472	  1.594853	 -0.756999
  1.668504	  1.608993	 -0.762073
  1.674804	  1.624150	 -0.768264
  1.679059	  1.658336	 -0.779204
  1.668253	  1.693534	 -0.766513
  1.671544	  1.713112	 -0.768936
