  1.168519	  2.154287	  0.439450
  1.172540	  2.162926	  0.443737
  1.172510	  2.144648	  0.431250
  1.170064	  2.124111	  0.421240
  1.164902	  2.106772	  0.414388
  1.156842	  2.092219	  0.405055
  1.146498	  2.073049	  0.394085
  1.141536	  2.061373	  0.386441
  1.132886	  2.049643	  0.376637
  1.123612	  2.035459	  0.362231
  1.117421	  2.022166	  0.347423
  1.113292	  2.010927	  0.334933
  1.108381	  1.997748	  0.319655
  1.103366	  1.984528	  0.303166
  1.101373	  1.973264	  0.289006
  1.099863	  1.961176	  0.275288
  1.097785	  1.949006	  0.259992
  1.097228	  1.938686	  0.243598
  1.095908	  1.929034	  0.230033
  1.095812	  1.918448	  0.212594
  1.097417	  1.907990	  0.182575
  1.098283	  1.903997	  0.167253
  1.098831	  1.900224	  0.156397
  1.100349	  1.893129	  0.135515
  1.105201	  1.882974	  0.115282
  1.110113	  1.872527	  0.098424
  1.114965	  1.861950	  0.085117
  1.119335	  1.850967	  0.068057
  1.122658	  1.841169	  0.053183
  1.127264	  1.828108	  0.035046
  1.131124	  1.814784	  0.017095
  1.134505	  1.805207	  0.003107
  1.139845	  1.794875	 -0.012013
  1.147062	  1.783503	 -0.028080
  1.156662	  1.772364	 -0.042460
  1.165626	  1.762111	 -0.055735
  1.173591	  1.748835	 -0.067191
  1.181575	  1.734271	 -0.079933
  1.187847	  1.719051	 -0.090868
  1.192526	  1.707575	 -0.103509
  1.199053	  1.690877	 -0.113641
  1.206393	  1.672603	 -0.121639
  1.212683	  1.653720	 -0.122843
  1.218700	  1.636005	 -0.126500
  1.223941	  1.616944	 -0.128691
  1.230495	  1.598357	 -0.128559
  1.237244	  1.581050	 -0.126900
  1.244053	  1.561937	 -0.126345
  1.248364	  1.541225	 -0.129393
  1.248576	  1.530605	 -0.130554
  1.243739	  1.499258	 -0.136507
  1.243584	  1.475719	 -0.135375
  1.246776	  1.456973	 -0.131314
  1.248598	  1.443841	 -0.126813
  1.249498	  1.421338	 -0.124167
  1.248361	  1.403407	 -0.120715
  1.246407	  1.387671	 -0.117078
  1.244478	  1.366536	 -0.112783
  1.239092	  1.345667	 -0.106764
  1.237445	  1.329059	 -0.102183
  1.231551	  1.313927	 -0.098436
  1.229743	  1.297346	 -0.091114
  1.223341	  1.279713	 -0.085958
  1.218777	  1.258241	 -0.079769
  1.211873	  1.243037	 -0.077215
  1.205544	  1.226362	 -0.073665
  1.193551	  1.210231	 -0.073537
  1.182849	  1.192917	 -0.072966
  1.174827	  1.177902	 -0.073645
  1.167986	  1.161062	 -0.073318
  1.156673	  1.145072	 -0.072059
  1.141827	  1.127579	 -0.069487
  1.126018	  1.114543	 -0.068473
  1.116603	  1.097846	 -0.067663
  1.097018	  1.094846	 -0.067855
  1.086242	  1.075369	 -0.068464
  1.062734	  1.071646	 -0.065388
  1.061827	  1.046316	 -0.071780
  1.041921	  1.029525	 -0.066794
  1.036862	  1.007976	 -0.077111
  1.018021	  0.996535	 -0.073298
  1.004440	  0.983940	 -0.074094
  0.990116	  0.970324	 -0.071357
  0.970850	  0.965748	 -0.063003
  0.953176	  0.952686	 -0.060489
  0.929930	  0.949762	 -0.051743
  0.909899	  0.938382	 -0.054095
  0.896282	  0.929296	 -0.053540
  0.881072	  0.918365	 -0.054820
  0.863636	  0.904434	 -0.058373
  0.848137	  0.894711	 -0.059691
  0.826555	  0.886335	 -0.059892
  0.810660	  0.876763	 -0.061853
  0.797460	  0.867013	 -0.063989
  0.778532	  0.852238	 -0.065779
  0.759318	  0.841852	 -0.065722
  0.743194	  0.835488	 -0.065986
  0.721601	  0.827692	 -0.068239
  0.702399	  0.820103	 -0.067592
  0.689557	  0.813288	 -0.068165
  0.671480	  0.802701	 -0.072014
  0.652060	  0.790068	 -0.074795
  0.636044	  0.780892	 -0.075192
  0.618703	  0.771190	 -0.076057
  0.601676	  0.759363	 -0.077293
  0.586403	  0.744788	 -0.080892
  0.574837	  0.732779	 -0.083781
  0.557145	  0.716346	 -0.086543
  0.542563	  0.704330	 -0.089307
  0.530779	  0.694544	 -0.094208
  0.515890	  0.681554	 -0.098448
  0.503609	  0.667191	 -0.102004
  0.486839	  0.649178	 -0.105013
  0.468554	  0.631712	 -0.105937
  0.460072	  0.623461	 -0.108380
  0.450432	  0.608867	 -0.112562
  0.440189	  0.594042	 -0.115537
  0.429750	  0.584211	 -0.118234
  0.411338	  0.562263	 -0.123333
  0.394555	  0.542597	 -0.123461
  0.389144	  0.534038	 -0.123820
  0.373716	  0.513908	 -0.128046
  0.356633	  0.500127	 -0.134782
  0.344301	  0.492024	 -0.137370
  0.328941	  0.478369	 -0.141161
  0.313008	  0.462237	 -0.144381
  0.305111	  0.451720	 -0.145326
  0.295203	  0.433140	 -0.147346
  0.282502	  0.407587	 -0.146608
  0.277448	  0.395765	 -0.146641
  0.270411	  0.377042	 -0.148428
  0.260128	  0.348326	 -0.151283
  0.254804	  0.336501	 -0.152982
  0.247731	  0.320872	 -0.157714
  0.235698	  0.299258	 -0.167157
  0.228265	  0.289100	 -0.169373
  0.215796	  0.271373	 -0.175643
  0.204741	  0.253965	 -0.179170
  0.195561	  0.236317	 -0.180587
  0.186143	  0.216354	 -0.185370
  0.174697	  0.194111	 -0.192219
  0.167551	  0.183760	 -0.194631
  0.159945	  0.171544	 -0.197721
  0.146940	  0.150597	 -0.201666
  0.139297	  0.134317	 -0.205821
  0.132662	  0.116445	 -0.209607
  0.124791	  0.095036	 -0.211847
  0.115421	  0.076113	 -0.215595
  0.107254	  0.062496	 -0.221002
  0.098427	  0.045967	 -0.228384
  0.091707	  0.025837	 -0.235920
  0.088024	  0.006936	 -0.243866
  0.083481	 -0.015014	 -0.252609
  0.079305	 -0.033583	 -0.257611
  0.077205	 -0.045451	 -0.260589
  0.068340	 -0.065863	 -0.262100
  0.059891	 -0.085586	 -0.266637
  0.051997	 -0.103818	 -0.271848
  0.043684	 -0.121774	 -0.273732
  0.034887	 -0.139385	 -0.275399
  0.025502	 -0.157234	 -0.279220
  0.017683	 -0.174708	 -0.283761
  0.009755	 -0.190150	 -0.287122
 -0.006191	 -0.204997	 -0.285091
 -0.018456	 -0.224288	 -0.284927
 -0.024347	 -0.248446	 -0.295230
 -0.027386	 -0.261046	 -0.300558
 -0.031935	 -0.277913	 -0.308045
 -0.044382	 -0.304055	 -0.315756
 -0.047656	 -0.313302	 -0.318680
 -0.054022	 -0.332399	 -0.324002
 -0.062053	 -0.351742	 -0.327888
 -0.067852	 -0.371049	 -0.331069
 -0.076183	 -0.388039	 -0.334065
 -0.088837	 -0.403594	 -0.339605
 -0.105279	 -0.418042	 -0.350640
 -0.117657	 -0.434140	 -0.357628
 -0.124007	 -0.455989	 -0.366973
 -0.125017	 -0.464678	 -0.371182
 -0.130295	 -0.483792	 -0.379119
 -0.142406	 -0.509563	 -0.388358
 -0.153701	 -0.523079	 -0.390239
 -0.161162	 -0.536058	 -0.391163
 -0.165860	 -0.554914	 -0.394754
 -0.165740	 -0.581206	 -0.403073
 -0.168028	 -0.597807	 -0.409517
 -0.172056	 -0.615548	 -0.415741
 -0.178934	 -0.637397	 -0.422953
 -0.182968	 -0.656703	 -0.427790
 -0.187115	 -0.670802	 -0.434253
 -0.191051	 -0.685073	 -0.443579
 -0.197393	 -0.708373	 -0.458458
 -0.203970	 -0.721349	 -0.467377
 -0.209497	 -0.731889	 -0.475103
 -0.218190	 -0.753868	 -0.485068
 -0.225140	 -0.767510	 -0.494410
 -0.230807	 -0.781760	 -0.504257
 -0.242501	 -0.799667	 -0.520838
 -0.252108	 -0.811593	 -0.535250
 -0.259595	 -0.824393	 -0.551393
 -0.262422	 -0.830234	 -0.560434
 -0.264826	 -0.844902	 -0.570795
 -0.262122	 -0.873955	 -0.586232
 -0.264201	 -0.893221	 -0.598252
 -0.270883	 -0.906216	 -0.605181
 -0.279242	 -0.918662	 -0.612661
 -0.293112	 -0.935738	 -0.623275
 -0.303754	 -0.950325	 -0.636268
 -0.310064	 -0.963996	 -0.652737
 -0.311249	 -0.972169	 -0.664494
 -0.314856	 -0.983131	 -0.682197
 -0.319881	 -0.990037	 -0.692022
 -0.322001	 -1.001334	 -0.701405
 -0.334783	 -1.033983	 -0.732446
 -0.340169	 -1.042333	 -0.740811
 -0.344241	 -1.050757	 -0.745644
 -0.357541	 -1.070988	 -0.752603
 -0.362274	 -1.078018	 -0.753999
 -0.376831	 -1.094540	 -0.754154
 -0.390866	 -1.108044	 -0.755062
 -0.399905	 -1.116333	 -0.762474
 -0.418164	 -1.131469	 -0.773264
 -0.434432	 -1.150028	 -0.772843
 -0.442236	 -1.159168	 -0.769948
 -0.457061	 -1.176398	 -0.767655
 -0.471499	 -1.188998	 -0.770421
 -0.486800	 -1.197208	 -0.777413
 -0.514051	 -1.216044	 -0.786413
 -0.523538	 -1.223467	 -0.789101
 -0.535405	 -1.232447	 -0.792301
 -0.550928	 -1.242182	 -0.799954
 -0.570137	 -1.253118	 -0.808360
 -0.586509	 -1.260919	 -0.817326
 -0.602700	 -1.268027	 -0.827340
 -0.618478	 -1.274971	 -0.838208
 -0.632518	 -1.281248	 -0.850619
 -0.644704	 -1.287413	 -0.863998
 -0.655989	 -1.294485	 -0.876310
 -0.665629	 -1.309466	 -0.887800
 -0.675031	 -1.332249	 -0.897399
 -0.687762	 -1.341680	 -0.904594
 -0.691014	 -1.344829	 -0.907937
 -0.696869	 -1.354696	 -0.911482
 -0.705751	 -1.364714	 -0.924731
 -0.707835	 -1.378968	 -0.934049
 -0.712411	 -1.395111	 -0.942334
 -0.717856	 -1.416977	 -0.947599
 -0.722393	 -1.441730	 -0.948571
 -0.727903	 -1.457827	 -0.947843
 -0.737037	 -1.474549	 -0.945972
 -0.743843	 -1.496093	 -0.944799
 -0.747535	 -1.515783	 -0.942937
 -0.751412	 -1.534307	 -0.941291
 -0.756084	 -1.553212	 -0.939687
 -0.761509	 -1.571892	 -0.937620
 -0.768061	 -1.590388	 -0.934916
 -0.776051	 -1.608579	 -0.932053
 -0.783518	 -1.626822	 -0.929743
 -0.790246	 -1.641775	 -0.928742
 -0.795641	 -1.662920	 -0.929650
 -0.797604	 -1.687328	 -0.927960
 -0.799416	 -1.709114	 -0.926328
 -0.800574	 -1.730003	 -0.924958
 -0.802762	 -1.747640	 -0.927913
 -0.805130	 -1.757788	 -0.930001
 -0.816540	 -1.784810	 -0.938447
 -0.820944	 -1.797584	 -0.941158
 -0.826602	 -1.817997	 -0.944789
 -0.833758	 -1.843895	 -0.951010
 -0.838950	 -1.859624	 -0.954849
 -0.844007	 -1.871461	 -0.960476
 -0.849989	 -1.890227	 -0.962351
 -0.859962	 -1.909775	 -0.965506
 -0.869135	 -1.925064	 -0.969822
 -0.877449	 -1.937514	 -0.974345
 -0.889881	 -1.957918	 -0.983586
 -0.899173	 -1.979326	 -0.989598
 -0.905721	 -1.996475	 -0.991505
 -0.913260	 -2.013236	 -0.991908
 -0.922957	 -2.029940	 -0.994136
 -0.932299	 -2.046724	 -0.996105
 -0.942495	 -2.064911	 -0.999228
 -0.950549	 -2.083272	 -0.999051
 -0.953536	 -2.103549	 -0.993054
 -0.963780	 -2.119821	 -0.998557
