 -1.063063	  0.718258	 -2.146587
 -1.064252	  0.718122	 -2.145150
 -1.075575	  0.716824	 -2.131468
 -1.087848	  0.714277	 -2.115555
 -1.099478	  0.711293	 -2.097537
 -1.111130	  0.713326	 -2.081650
 -1.124355	  0.718157	 -2.068217
 -1.137205	  0.720058	 -2.051871
 -1.148085	  0.719041	 -2.035849
 -1.159581	  0.717502	 -2.018956
 -1.170676	  0.718426	 -2.000870
 -1.181988	  0.721626	 -1.986350
 -1.193798	  0.723348	 -1.969960
 -1.204809	  0.724890	 -1.953388
 -1.216475	  0.728408	 -1.937453
 -1.228200	  0.732992	 -1.919636
 -1.236458	  0.731255	 -1.904030
 -1.246457	  0.730339	 -1.885586
 -1.256591	  0.732317	 -1.867610
 -1.266373	  0.736900	 -1.851789
 -1.277169	  0.741669	 -1.833607
 -1.285431	  0.740718	 -1.817043
 -1.293947	  0.738862	 -1.800341
 -1.302366	  0.737646	 -1.776223
 -1.308813	  0.740822	 -1.759773
 -1.317794	  0.743452	 -1.743140
 -1.327286	  0.741557	 -1.722969
 -1.331248	  0.739385	 -1.706876
 -1.336921	  0.740329	 -1.686635
 -1.342133	  0.737984	 -1.666008
 -1.348169	  0.732810	 -1.648629
 -1.353212	  0.725480	 -1.630039
 -1.357533	  0.722544	 -1.609576
 -1.358509	  0.723284	 -1.590455
 -1.360450	  0.721702	 -1.568963
 -1.363451	  0.714367	 -1.550467
 -1.365217	  0.705242	 -1.533488
 -1.364522	  0.696238	 -1.515205
 -1.363843	  0.688623	 -1.496311
 -1.363044	  0.681411	 -1.477924
 -1.359356	  0.673739	 -1.460257
 -1.352573	  0.665222	 -1.443078
 -1.348577	  0.655612	 -1.424298
 -1.348427	  0.646785	 -1.407611
 -1.347999	  0.636813	 -1.389557
 -1.343111	  0.627072	 -1.372572
 -1.335188	  0.618079	 -1.357460
 -1.324634	  0.607413	 -1.339389
 -1.320157	  0.598195	 -1.323474
 -1.315960	  0.588807	 -1.308788
 -1.307161	  0.578885	 -1.292402
 -1.294961	  0.571002	 -1.278030
 -1.284260	  0.562267	 -1.262965
 -1.278350	  0.549611	 -1.245653
 -1.270940	  0.541630	 -1.231332
 -1.261853	  0.533040	 -1.216516
 -1.250655	  0.522286	 -1.202627
 -1.238604	  0.510414	 -1.191233
 -1.230161	  0.496796	 -1.176187
 -1.221375	  0.483751	 -1.163752
 -1.207101	  0.476066	 -1.154119
 -1.190168	  0.470046	 -1.142151
 -1.178208	  0.461791	 -1.124509
 -1.170872	  0.454861	 -1.108675
 -1.159885	  0.449884	 -1.094302
 -1.144827	  0.441402	 -1.079517
 -1.134549	  0.433412	 -1.065394
 -1.127539	  0.427513	 -1.048539
 -1.115739	  0.417737	 -1.034745
 -1.105841	  0.404840	 -1.021105
 -1.094477	  0.394180	 -1.008390
 -1.081550	  0.386634	 -0.992503
 -1.072682	  0.384739	 -0.970553
 -1.068130	  0.378788	 -0.959075
 -1.058143	  0.371606	 -0.941003
 -1.046981	  0.368522	 -0.921503
 -1.032691	  0.366903	 -0.907966
 -1.021300	  0.356688	 -0.892998
 -1.015446	  0.347965	 -0.874096
 -1.004044	  0.346545	 -0.859334
 -0.991595	  0.343212	 -0.845879
 -0.982150	  0.334239	 -0.823638
 -0.975651	  0.325769	 -0.806542
 -0.968723	  0.328130	 -0.789457
 -0.962761	  0.328849	 -0.770280
 -0.950322	  0.326542	 -0.752639
 -0.933881	  0.324949	 -0.737412
 -0.921053	  0.317590	 -0.724890
 -0.910107	  0.310325	 -0.708838
 -0.901937	  0.309035	 -0.689372
 -0.897298	  0.308135	 -0.669264
 -0.894281	  0.304687	 -0.651236
 -0.889190	  0.302824	 -0.630830
 -0.880815	  0.299622	 -0.610617
 -0.873015	  0.295712	 -0.594826
 -0.865396	  0.291194	 -0.577114
 -0.859204	  0.290493	 -0.556497
 -0.856343	  0.290370	 -0.537490
 -0.852379	  0.289827	 -0.517666
 -0.848123	  0.289039	 -0.498768
 -0.844186	  0.282900	 -0.479353
 -0.842394	  0.274039	 -0.456335
 -0.839959	  0.271306	 -0.439502
 -0.834803	  0.270084	 -0.422130
 -0.834037	  0.266014	 -0.396884
 -0.837224	  0.262402	 -0.378874
 -0.837913	  0.259950	 -0.363690
 -0.836038	  0.255157	 -0.342305
 -0.838019	  0.253353	 -0.319793
 -0.834382	  0.253297	 -0.301057
 -0.827517	  0.248761	 -0.281662
 -0.828166	  0.244700	 -0.262403
 -0.831082	  0.240965	 -0.243659
 -0.830936	  0.238956	 -0.219167
 -0.824258	  0.237228	 -0.202728
 -0.817209	  0.234251	 -0.183448
 -0.816232	  0.231698	 -0.164119
 -0.816267	  0.230907	 -0.143353
 -0.816275	  0.228091	 -0.122560
 -0.813049	  0.222484	 -0.103630
 -0.813389	  0.218426	 -0.084372
 -0.812567	  0.214720	 -0.064485
 -0.812822	  0.203959	 -0.047479
 -0.813007	  0.194535	 -0.027444
 -0.815440	  0.192973	 -0.006792
 -0.818897	  0.192182	  0.013352
 -0.818461	  0.184687	  0.032091
 -0.818259	  0.181880	  0.050125
 -0.818779	  0.176883	  0.070027
 -0.821367	  0.168520	  0.088419
 -0.824638	  0.160696	  0.107120
 -0.827277	  0.154564	  0.126073
 -0.830112	  0.148455	  0.144871
 -0.832273	  0.143113	  0.163896
 -0.833848	  0.137263	  0.183244
 -0.835371	  0.130175	  0.202140
 -0.837933	  0.122369	  0.220317
 -0.840247	  0.115499	  0.238691
 -0.842644	  0.109623	  0.257459
 -0.844792	  0.101726	  0.276564
 -0.844490	  0.092758	  0.294508
 -0.845440	  0.083213	  0.312039
 -0.849165	  0.075632	  0.329403
 -0.850323	  0.068732	  0.348410
 -0.849489	  0.060483	  0.367031
 -0.849594	  0.049276	  0.384276
 -0.852244	  0.039439	  0.400577
 -0.854983	  0.030783	  0.418737
 -0.857505	  0.023774	  0.437525
 -0.858491	  0.016559	  0.456315
 -0.859148	  0.009713	  0.475097
 -0.859777	  0.003277	  0.494023
 -0.860409	 -0.003161	  0.512948
 -0.861080	 -0.009521	  0.531898
 -0.861751	 -0.015877	  0.550849
 -0.862694	 -0.022397	  0.569733
 -0.863841	 -0.029041	  0.588552
 -0.864673	 -0.036168	  0.606838
 -0.864893	 -0.045402	  0.624955
 -0.865444	 -0.055939	  0.643143
 -0.868505	 -0.061648	  0.662104
 -0.870350	 -0.067924	  0.680263
 -0.871834	 -0.073399	  0.699929
 -0.872536	 -0.077894	  0.719109
 -0.876786	 -0.079120	  0.740968
 -0.881612	 -0.084019	  0.760310
 -0.884645	 -0.090179	  0.777638
 -0.886863	 -0.091529	  0.796825
 -0.890225	 -0.095700	  0.817001
 -0.893390	 -0.103769	  0.835174
 -0.897528	 -0.111269	  0.854505
 -0.901104	 -0.113763	  0.873590
 -0.901871	 -0.115448	  0.892850
 -0.902566	 -0.120220	  0.913559
 -0.906646	 -0.124897	  0.932786
 -0.908006	 -0.129804	  0.950994
 -0.913795	 -0.132073	  0.972429
 -0.923440	 -0.132736	  0.992298
 -0.926770	 -0.133317	  1.009465
 -0.924738	 -0.136361	  1.028791
 -0.924790	 -0.139859	  1.049574
 -0.927334	 -0.141568	  1.070443
 -0.931221	 -0.142921	  1.089979
 -0.935880	 -0.145672	  1.109691
 -0.938486	 -0.151248	  1.127460
 -0.942217	 -0.157185	  1.147171
 -0.943217	 -0.160432	  1.166964
 -0.942144	 -0.164024	  1.186520
 -0.941259	 -0.169269	  1.205994
 -0.943187	 -0.173034	  1.225950
 -0.947593	 -0.170671	  1.247570
 -0.948916	 -0.171760	  1.267565
 -0.948039	 -0.176905	  1.285351
 -0.947739	 -0.182365	  1.304842
 -0.948290	 -0.186759	  1.324935
 -0.949159	 -0.190598	  1.344594
 -0.949711	 -0.194816	  1.364136
 -0.950247	 -0.199052	  1.383675
 -0.950664	 -0.203461	  1.403179
 -0.950858	 -0.208204	  1.422608
 -0.951045	 -0.212946	  1.442036
 -0.950910	 -0.218047	  1.461374
 -0.950637	 -0.223297	  1.480671
 -0.950352	 -0.228554	  1.499966
 -0.949558	 -0.234075	  1.519172
 -0.948762	 -0.239595	  1.538378
 -0.947800	 -0.245125	  1.557575
 -0.946324	 -0.250289	  1.576573
 -0.944267	 -0.253928	  1.595923
 -0.940417	 -0.256684	  1.615218
 -0.937338	 -0.264318	  1.636235
 -0.937112	 -0.271656	  1.653538
 -0.936530	 -0.276236	  1.672305
 -0.931530	 -0.280340	  1.692897
 -0.929686	 -0.288042	  1.711232
 -0.930438	 -0.292687	  1.729160
 -0.929095	 -0.298387	  1.749992
 -0.924685	 -0.305805	  1.769140
 -0.923084	 -0.309017	  1.786210
 -0.923396	 -0.315425	  1.806719
 -0.920397	 -0.323460	  1.826603
 -0.913346	 -0.326009	  1.844434
 -0.909915	 -0.329152	  1.862941
 -0.908997	 -0.334318	  1.883092
 -0.909238	 -0.339803	  1.902501
 -0.908193	 -0.344055	  1.922195
 -0.906541	 -0.348124	  1.941725
 -0.905257	 -0.351408	  1.961411
 -0.904013	 -0.354625	  1.981112
 -0.903260	 -0.357637	  2.000869
 -0.902781	 -0.360531	  2.020653
 -0.902637	 -0.363346	  2.040453
 -0.902882	 -0.366068	  2.060265
 -0.903245	 -0.368757	  2.080081
 -0.903987	 -0.371337	  2.099900
 -0.904730	 -0.373914	  2.119719
 -0.905392	 -0.376387	  2.139554
 -0.906034	 -0.378832	  2.159394
 -0.906645	 -0.381260	  2.179225
 -0.907128	 -0.383643	  2.199095
 -0.907572	 -0.386197	  2.218962
 -0.907798	 -0.389336	  2.238655
 -0.908014	 -0.392372	  2.258442
 -0.908355	 -0.397681	  2.294938
 -0.908372	 -0.398128	  2.298031
