 -1.559377	  1.292894	  1.630804
 -1.566117	  1.291979	  1.639723
 -1.555312	  1.311404	  1.626118
 -1.547478	  1.316885	  1.601975
 -1.540145	  1.318522	  1.588625
 -1.532363	  1.321918	  1.577777
 -1.520329	  1.332190	  1.561983
 -1.510906	  1.338772	  1.541544
 -1.503470	  1.341037	  1.528469
 -1.493107	  1.345980	  1.516192
 -1.483186	  1.354577	  1.499432
 -1.473791	  1.358657	  1.481554
 -1.464147	  1.363428	  1.465670
 -1.458117	  1.375533	  1.450897
 -1.451632	  1.389483	  1.440324
 -1.444361	  1.409452	  1.432858
 -1.441922	  1.430423	  1.415159
 -1.442266	  1.439396	  1.399740
 -1.442554	  1.445986	  1.379724
 -1.440013	  1.452596	  1.361762
 -1.437297	  1.465760	  1.344940
 -1.433957	  1.478421	  1.329576
 -1.428489	  1.491426	  1.315235
 -1.422323	  1.505028	  1.301759
 -1.417008	  1.518417	  1.287749
 -1.412330	  1.530731	  1.272538
 -1.406931	  1.541423	  1.256440
 -1.400447	  1.552122	  1.240638
 -1.394368	  1.562294	  1.224925
 -1.389111	  1.573729	  1.211619
 -1.383349	  1.586150	  1.196831
 -1.372057	  1.593348	  1.174758
 -1.363954	  1.598720	  1.156249
 -1.361130	  1.601381	  1.144841
 -1.357031	  1.604815	  1.122928
 -1.343904	  1.612328	  1.099128
 -1.334174	  1.617100	  1.089083
 -1.321374	  1.624932	  1.073713
 -1.313304	  1.628004	  1.056928
 -1.307677	  1.627657	  1.037730
 -1.296529	  1.630280	  1.016138
 -1.284048	  1.634608	  1.003953
 -1.268139	  1.641254	  0.991193
 -1.257168	  1.642752	  0.973351
 -1.252514	  1.640171	  0.955688
 -1.246233	  1.637437	  0.935510
 -1.234201	  1.639878	  0.920624
 -1.218657	  1.645379	  0.905712
 -1.203639	  1.647449	  0.884194
 -1.197335	  1.644738	  0.867847
 -1.191845	  1.639374	  0.846724
 -1.187501	  1.639182	  0.834204
 -1.176229	  1.640351	  0.813227
 -1.166010	  1.636099	  0.795528
 -1.157478	  1.629645	  0.778715
 -1.151004	  1.618122	  0.759226
 -1.144070	  1.607823	  0.738713
 -1.139635	  1.602346	  0.725508
 -1.133840	  1.598418	  0.707099
 -1.122646	  1.597038	  0.684287
 -1.114834	  1.597610	  0.671172
 -1.105306	  1.597202	  0.656115
 -1.090463	  1.593811	  0.638515
 -1.069607	  1.584039	  0.622559
 -1.066315	  1.583348	  0.617255
 -1.053137	  1.578563	  0.597995
 -1.042075	  1.570557	  0.579781
 -1.032534	  1.561388	  0.564848
 -1.015474	  1.545978	  0.549984
 -1.003935	  1.536852	  0.541697
 -0.999910	  1.534102	  0.538543
 -0.976587	  1.525579	  0.521902
 -0.952599	  1.520115	  0.508538
 -0.939429	  1.515168	  0.502398
 -0.924781	  1.507947	  0.487603
 -0.909920	  1.495968	  0.466938
 -0.905384	  1.491905	  0.458797
 -0.892394	  1.483058	  0.441628
 -0.880359	  1.475389	  0.432100
 -0.870746	  1.463588	  0.424163
 -0.857291	  1.450210	  0.412240
 -0.840232	  1.431159	  0.405476
 -0.835858	  1.423524	  0.399823
 -0.821567	  1.407417	  0.394681
 -0.793324	  1.392407	  0.378783
 -0.784540	  1.389748	  0.371469
 -0.773867	  1.382388	  0.376719
 -0.753082	  1.366811	  0.373718
 -0.732751	  1.352837	  0.372822
 -0.734077	  1.329013	  0.377183
 -0.709619	  1.324428	  0.359278
 -0.711320	  1.296903	  0.371884
 -0.681940	  1.292745	  0.362385
 -0.679185	  1.267056	  0.367381
 -0.657195	  1.261929	  0.365208
 -0.646962	  1.248686	  0.352953
 -0.629331	  1.246296	  0.348924
 -0.604413	  1.220737	  0.342872
 -0.582185	  1.218691	  0.341139
 -0.573515	  1.202287	  0.332022
 -0.558694	  1.204454	  0.338106
 -0.536171	  1.190798	  0.338802
 -0.516451	  1.187965	  0.339332
 -0.503241	  1.177614	  0.340901
 -0.480529	  1.170775	  0.335479
 -0.455830	  1.166317	  0.328730
 -0.445453	  1.162657	  0.327840
 -0.424677	  1.156283	  0.323821
 -0.406636	  1.151606	  0.321699
 -0.389074	  1.147266	  0.315186
 -0.369984	  1.141944	  0.310336
 -0.345643	  1.134649	  0.304237
 -0.331226	  1.130436	  0.301487
 -0.308196	  1.129334	  0.298484
 -0.290493	  1.131368	  0.294293
 -0.272132	  1.133972	  0.291830
 -0.245858	  1.139455	  0.290571
 -0.231062	  1.142024	  0.284309
 -0.216936	  1.143665	  0.281318
 -0.193416	  1.146418	  0.266560
 -0.174888	  1.147476	  0.258051
 -0.156741	  1.144609	  0.247092
 -0.140605	  1.141928	  0.239705
 -0.120426	  1.136843	  0.229063
 -0.104930	  1.133173	  0.223798
 -0.085489	  1.128522	  0.216562
 -0.067142	  1.128725	  0.210838
 -0.042713	  1.130907	  0.198617
 -0.030173	  1.135470	  0.190634
 -0.013107	  1.136928	  0.181456
  0.006039	  1.140346	  0.172651
  0.023876	  1.137312	  0.167772
  0.041140	  1.133407	  0.160138
  0.063517	  1.124778	  0.151423
  0.080964	  1.118080	  0.147620
  0.095419	  1.115819	  0.145268
  0.114862	  1.115656	  0.135861
  0.141212	  1.108623	  0.120230
  0.152509	  1.105995	  0.113554
  0.170406	  1.102577	  0.104621
  0.189684	  1.098526	  0.092673
  0.201324	  1.096221	  0.084963
  0.216217	  1.093708	  0.075878
  0.242571	  1.089313	  0.060838
  0.255540	  1.086600	  0.054320
  0.272103	  1.079806	  0.040862
  0.284885	  1.076354	  0.028459
  0.298255	  1.076679	  0.018023
  0.316452	  1.081672	  0.008575
  0.336747	  1.087438	 -0.003452
  0.353635	  1.087978	 -0.015975
  0.371294	  1.086044	 -0.027976
  0.382659	  1.085253	 -0.034500
  0.400352	  1.084095	 -0.043144
  0.427077	  1.084986	 -0.061389
  0.436696	  1.082913	 -0.067354
  0.447495	  1.082770	 -0.078080
  0.469968	  1.073907	 -0.093613
  0.481248	  1.069059	 -0.102079
  0.511275	  1.061724	 -0.115821
  0.519010	  1.060669	 -0.116101
  0.534882	  1.066037	 -0.126869
  0.557045	  1.071777	 -0.141586
  0.572166	  1.065891	 -0.147474
  0.587431	  1.072769	 -0.151112
  0.618548	  1.065378	 -0.158431
  0.636794	  1.067051	 -0.161314
  0.656100	  1.070770	 -0.167295
  0.669318	  1.072331	 -0.174768
  0.687335	  1.075655	 -0.183827
  0.705628	  1.076854	 -0.186106
  0.729068	  1.078767	 -0.191446
  0.748803	  1.078743	 -0.197441
  0.765045	  1.079648	 -0.204455
  0.791961	  1.083528	 -0.215506
  0.807914	  1.086663	 -0.221248
  0.819144	  1.092511	 -0.223705
  0.842446	  1.098137	 -0.226943
  0.865967	  1.103701	 -0.223229
  0.887712	  1.109601	 -0.218321
  0.907971	  1.117883	 -0.213464
  0.927469	  1.125094	 -0.211408
  0.946687	  1.129789	 -0.210213
  0.962084	  1.133113	 -0.203627
  0.978296	  1.138476	 -0.198562
  0.998106	  1.148546	 -0.191203
  1.016207	  1.158655	 -0.185768
  1.028846	  1.167902	 -0.183844
  1.041509	  1.171772	 -0.186210
  1.061520	  1.176475	 -0.184756
  1.081057	  1.184921	 -0.189719
  1.096848	  1.186736	 -0.188770
  1.113061	  1.197044	 -0.195518
  1.133625	  1.201031	 -0.197352
  1.155161	  1.206596	 -0.202880
  1.174303	  1.213205	 -0.208997
  1.188129	  1.220609	 -0.214872
  1.199824	  1.229265	 -0.220707
  1.215219	  1.242074	 -0.232007
  1.227198	  1.249284	 -0.246351
  1.236651	  1.256609	 -0.261844
  1.248324	  1.267836	 -0.277063
  1.260946	  1.279715	 -0.286790
  1.269067	  1.286519	 -0.292444
  1.283195	  1.298252	 -0.307152
  1.294728	  1.315634	 -0.324446
  1.303922	  1.331111	 -0.337018
  1.316652	  1.345690	 -0.357503
  1.322096	  1.350425	 -0.367013
  1.332788	  1.357359	 -0.380356
  1.346318	  1.379476	 -0.385941
  1.352934	  1.393244	 -0.386994
  1.355262	  1.409043	 -0.390330
  1.350256	  1.422783	 -0.397923
  1.347761	  1.435443	 -0.408773
  1.344598	  1.449029	 -0.425493
  1.346356	  1.461198	 -0.440792
  1.349927	  1.477599	 -0.452205
  1.345742	  1.493848	 -0.459362
  1.335424	  1.501232	 -0.475590
  1.325958	  1.504627	 -0.491910
  1.315476	  1.502768	 -0.507531
  1.304062	  1.501254	 -0.527893
  1.296937	  1.503743	 -0.540366
  1.287991	  1.500586	 -0.555228
  1.278550	  1.495216	 -0.573678
  1.270900	  1.499612	 -0.591270
  1.263556	  1.506236	 -0.604995
  1.254640	  1.497890	 -0.622975
  1.247540	  1.486733	 -0.638870
  1.239094	  1.476111	 -0.652534
  1.227764	  1.467665	 -0.667222
  1.228388	  1.457061	 -0.687904
  1.233747	  1.438164	 -0.710165
  1.234716	  1.426307	 -0.718977
  1.235432	  1.412137	 -0.729634
  1.236067	  1.396211	 -0.746692
  1.236633	  1.381384	 -0.758605
  1.237733	  1.366114	 -0.769267
  1.240014	  1.349929	 -0.782155
  1.243477	  1.334795	 -0.794570
  1.247828	  1.318246	 -0.805922
  1.252805	  1.303486	 -0.818777
  1.257509	  1.289614	 -0.829684
  1.264537	  1.272001	 -0.844300
  1.272349	  1.263642	 -0.860360
  1.280519	  1.260042	 -0.875748
  1.291764	  1.252521	 -0.897275
  1.299798	  1.241386	 -0.911004
  1.306794	  1.228822	 -0.920246
  1.318568	  1.216606	 -0.937713
  1.329032	  1.208941	 -0.954606
  1.336020	  1.202397	 -0.963251
  1.351613	  1.190698	 -0.975448
  1.364985	  1.182574	 -0.989589
  1.377390	  1.175245	 -1.003533
  1.389918	  1.168700	 -1.017495
  1.400779	  1.159778	 -1.029911
  1.411179	  1.144698	 -1.045163
  1.424610	  1.138599	 -1.058978
  1.447368	  1.148460	 -1.072237
  1.464641	  1.153099	 -1.082798
  1.481212	  1.151697	 -1.092451
  1.494277	  1.152308	 -1.101390
  1.519580	  1.148615	 -1.117436
  1.531652	  1.142701	 -1.126416
  1.542970	  1.134873	 -1.139443
  1.557655	  1.127318	 -1.159287
  1.573077	  1.125561	 -1.173891
  1.582826	  1.124327	 -1.183097
  1.597864	  1.124219	 -1.194845
  1.620173	  1.123927	 -1.210098
  1.636298	  1.127263	 -1.217806
  1.653271	  1.134959	 -1.224667
  1.673904	  1.143460	 -1.232403
  1.693040	  1.148653	 -1.238581
  1.714961	  1.149258	 -1.247448
  1.730032	  1.143646	 -1.258603
  1.743232	  1.132245	 -1.276775
  1.760445	  1.132555	 -1.286953
