 -0.830838	 -2.870705	  0.499661
 -0.822612	 -2.842282	  0.494714
 -0.816787	 -2.792991	  0.477519
 -0.817819	 -2.744549	  0.461883
 -0.822592	 -2.704139	  0.439639
 -0.821921	 -2.659171	  0.417535
 -0.819478	 -2.614658	  0.391620
 -0.820896	 -2.572519	  0.371334
 -0.819649	 -2.525690	  0.347502
 -0.819919	 -2.479998	  0.322739
 -0.821813	 -2.437947	  0.300416
 -0.821574	 -2.393585	  0.275518
 -0.820576	 -2.352415	  0.251530
 -0.818842	 -2.307315	  0.225645
 -0.818815	 -2.261128	  0.200668
 -0.817646	 -2.216794	  0.178483
 -0.814860	 -2.174713	  0.157972
 -0.801266	 -2.136225	  0.137126
 -0.780365	 -2.110803	  0.120108
 -0.725096	 -2.073877	  0.094841
 -0.651708	 -2.061995	  0.064783
 -0.526718	 -2.084934	 -0.000322
 -0.517113	 -2.084828	 -0.044902
 -0.506668	 -2.085768	 -0.068076
 -0.490562	 -2.086562	 -0.090968
 -0.460644	 -2.116032	 -0.233924
 -0.478161	 -2.014667	 -0.389830
 -0.718492	 -1.993670	 -0.533722
 -0.858860	 -2.032076	 -0.617159
 -0.956428	 -1.869278	 -0.774271
 -1.117487	 -1.535058	 -0.743090
 -1.182427	 -1.358974	 -0.535993
 -1.180701	 -1.378673	 -0.491194
 -1.244546	 -1.364170	 -0.400134
 -1.216550	 -1.317109	 -0.245245
 -1.218985	 -1.283043	 -0.210229
 -1.298502	 -1.247595	 -0.247474
 -1.245003	 -1.206909	 -0.265964
 -1.155363	 -1.084955	 -0.134784
 -1.104910	 -1.055880	 -0.124547
 -0.979527	 -1.020847	 -0.169769
 -0.873584	 -1.024199	 -0.302200
 -0.812080	 -0.991333	 -0.387446
 -0.796259	 -0.962579	 -0.417606
 -0.790990	 -0.919908	 -0.443236
 -0.789226	 -0.877658	 -0.465700
 -0.779248	 -0.834300	 -0.489574
 -0.754871	 -0.808473	 -0.511235
 -0.647575	 -0.768327	 -0.560484
 -0.500204	 -0.724625	 -0.604586
 -0.469916	 -0.688420	 -0.612897
 -0.437592	 -0.650236	 -0.642616
 -0.416575	 -0.583511	 -0.678279
 -0.412153	 -0.546285	 -0.707233
 -0.430629	 -0.509061	 -0.745778
 -0.416582	 -0.473268	 -0.768794
 -0.427889	 -0.416444	 -0.774415
 -0.430780	 -0.407123	 -0.780067
 -0.499210	 -0.330987	 -0.793598
 -0.588239	 -0.274137	 -0.805277
 -0.736772	 -0.185833	 -0.804929
 -0.768204	 -0.156639	 -0.811003
 -0.778366	 -0.113653	 -0.830859
 -0.777341	 -0.072304	 -0.852821
 -0.774734	 -0.029667	 -0.875056
 -0.772848	  0.014027	 -0.897056
 -0.771537	  0.058967	 -0.919925
 -0.770559	  0.108124	 -0.944511
 -0.770727	  0.151923	 -0.967469
 -0.769756	  0.192335	 -0.989503
 -0.769824	  0.236197	 -1.012895
 -0.770852	  0.281455	 -1.035874
 -0.780191	  0.327887	 -1.054997
 -0.802741	  0.368038	 -1.063676
 -0.831731	  0.401372	 -1.066431
 -0.972545	  0.519349	 -1.044160
 -1.040523	  0.589174	 -1.031047
 -1.052613	  0.610111	 -1.036315
 -1.056328	  0.652707	 -1.071704
 -1.044347	  0.671603	 -1.104912
 -0.992502	  0.659493	 -1.252602
 -0.956552	  0.661627	 -1.382138
 -0.890198	  0.754174	 -1.563424
 -0.828745	  0.735539	 -1.636882
 -0.809383	  0.737971	 -1.675698
 -0.756789	  0.723533	 -1.744313
 -0.608137	  0.679951	 -1.976842
 -0.564747	  0.694351	 -2.012874
 -0.537259	  0.754204	 -2.044290
 -0.536810	  0.797616	 -2.062480
 -0.536833	  0.871964	 -2.082102
 -0.546808	  0.932181	 -2.068073
 -0.559690	  0.991813	 -2.029726
 -0.685376	  1.187566	 -1.801290
 -0.709016	  1.237280	 -1.722472
 -0.741409	  1.321714	 -1.614958
 -0.754469	  1.397162	 -1.583416
 -0.755190	  1.444720	 -1.594830
 -0.754169	  1.490872	 -1.616235
 -0.753685	  1.536182	 -1.638531
 -0.753577	  1.579271	 -1.659177
 -0.754772	  1.622274	 -1.680674
 -0.756073	  1.671719	 -1.703141
 -0.756924	  1.715522	 -1.722692
 -0.755637	  1.759428	 -1.745549
 -0.753143	  1.803094	 -1.770371
 -0.752921	  1.847347	 -1.793151
 -0.753478	  1.890647	 -1.814440
 -0.751221	  1.938221	 -1.832841
 -0.748368	  1.984192	 -1.850937
 -0.747050	  2.028549	 -1.872627
 -0.747063	  2.069328	 -1.895940
 -0.748090	  2.112495	 -1.921037
 -0.747726	  2.156565	 -1.946826
 -0.755204	  2.178131	 -1.966295
