  0.862635	  1.154946	 -2.026691
  0.867126	  1.160301	 -2.032264
  0.857077	  1.148320	 -2.019795
  0.847018	  1.136338	 -2.007336
  0.835939	  1.124251	 -1.995941
  0.824728	  1.112916	 -1.984077
  0.812387	  1.103758	 -1.972395
  0.800218	  1.097414	 -1.959507
  0.786436	  1.089246	 -1.945981
  0.768691	  1.072313	 -1.937950
  0.757638	  1.056922	 -1.934025
  0.737603	  1.033640	 -1.929654
  0.723079	  1.016573	 -1.920357
  0.715002	  1.006557	 -1.921728
  0.715068	  1.004006	 -1.918413
  0.715442	  0.996598	 -1.911049
  0.716334	  0.984649	 -1.906570
  0.720222	  0.969192	 -1.874278
  0.720234	  0.966178	 -1.864901
  0.717566	  0.961438	 -1.850102
  0.712598	  0.952427	 -1.825873
  0.708194	  0.947180	 -1.805899
  0.704315	  0.945509	 -1.787727
  0.700133	  0.945712	 -1.765245
  0.700218	  0.944719	 -1.746838
  0.701770	  0.942243	 -1.725859
  0.703937	  0.938083	 -1.702587
  0.705071	  0.935573	 -1.687332
  0.704268	  0.935236	 -1.669536
  0.700590	  0.935687	 -1.647576
  0.698846	  0.933345	 -1.627134
  0.697368	  0.928342	 -1.607800
  0.694725	  0.921536	 -1.588913
  0.692656	  0.916623	 -1.569589
  0.688943	  0.913782	 -1.550013
  0.681869	  0.912453	 -1.530405
  0.673082	  0.912425	 -1.512220
  0.665957	  0.911710	 -1.497081
  0.659965	  0.909541	 -1.483628
  0.652882	  0.905106	 -1.467454
  0.642436	  0.899426	 -1.451785
  0.630246	  0.894085	 -1.437412
  0.618387	  0.890086	 -1.425456
  0.606416	  0.883443	 -1.417627
  0.594180	  0.868367	 -1.411140
  0.576906	  0.848240	 -1.397826
  0.561083	  0.840625	 -1.389030
  0.549956	  0.835528	 -1.384050
  0.530583	  0.828526	 -1.379702
  0.516017	  0.815550	 -1.378961
  0.504773	  0.799293	 -1.379541
  0.494258	  0.779586	 -1.379246
  0.483757	  0.762973	 -1.378177
  0.474124	  0.748146	 -1.378137
  0.464180	  0.730056	 -1.377166
  0.449847	  0.705201	 -1.372776
  0.443500	  0.693683	 -1.371106
  0.435960	  0.680389	 -1.367881
  0.420812	  0.662148	 -1.364676
  0.402791	  0.649631	 -1.361511
  0.386348	  0.638940	 -1.361372
  0.371979	  0.626312	 -1.365354
  0.354168	  0.605954	 -1.368195
  0.343753	  0.591710	 -1.368606
  0.332727	  0.573972	 -1.368204
  0.323814	  0.556672	 -1.365010
  0.312224	  0.534457	 -1.359398
  0.304472	  0.518176	 -1.354099
  0.298046	  0.505510	 -1.351161
  0.288826	  0.477465	 -1.334746
  0.284262	  0.470840	 -1.330760
  0.278320	  0.455327	 -1.326596
  0.261302	  0.426180	 -1.316650
  0.258977	  0.417054	 -1.318505
  0.246825	  0.406476	 -1.311076
  0.227416	  0.384733	 -1.303623
  0.217203	  0.374552	 -1.299398
  0.208429	  0.363252	 -1.298381
  0.187439	  0.328706	 -1.283022
  0.183071	  0.318508	 -1.278849
  0.180306	  0.307925	 -1.272050
  0.173838	  0.291298	 -1.267225
  0.164264	  0.269536	 -1.257452
  0.158069	  0.255923	 -1.255026
  0.149988	  0.236806	 -1.246359
  0.141026	  0.217309	 -1.234747
  0.136934	  0.203695	 -1.231538
  0.131910	  0.188306	 -1.223479
  0.121935	  0.165917	 -1.218141
  0.111251	  0.152276	 -1.214720
  0.100025	  0.139328	 -1.208616
  0.085256	  0.111114	 -1.197399
  0.078481	  0.101046	 -1.191838
  0.076036	  0.089409	 -1.184680
  0.070588	  0.071522	 -1.171487
  0.063890	  0.054702	 -1.162404
  0.053913	  0.040134	 -1.153192
  0.043894	  0.027111	 -1.142890
  0.033455	  0.009528	 -1.129972
  0.021836	 -0.007258	 -1.118498
  0.021419	 -0.016535	 -1.116140
  0.013925	 -0.030210	 -1.105826
  0.009295	 -0.054845	 -1.089049
  0.004348	 -0.068561	 -1.078021
 -0.002203	 -0.087122	 -1.061671
 -0.006364	 -0.097778	 -1.051056
 -0.012298	 -0.108266	 -1.037926
 -0.027274	 -0.124044	 -1.019772
 -0.035749	 -0.134041	 -1.011061
 -0.048431	 -0.144813	 -0.999293
 -0.059320	 -0.156459	 -0.987166
 -0.067507	 -0.168736	 -0.976528
 -0.074204	 -0.185629	 -0.961144
 -0.078158	 -0.193603	 -0.950732
 -0.089068	 -0.207030	 -0.930850
 -0.099731	 -0.219728	 -0.919768
 -0.107369	 -0.229975	 -0.908431
 -0.117319	 -0.238060	 -0.897606
 -0.134775	 -0.251718	 -0.873342
 -0.136547	 -0.259819	 -0.861863
 -0.139252	 -0.267925	 -0.851232
 -0.149003	 -0.286619	 -0.831166
 -0.159353	 -0.298409	 -0.818527
 -0.161162	 -0.306435	 -0.808050
 -0.170539	 -0.316647	 -0.798363
 -0.176785	 -0.342994	 -0.768398
 -0.178286	 -0.349262	 -0.760018
 -0.183198	 -0.356330	 -0.751773
 -0.191063	 -0.373713	 -0.730366
 -0.195420	 -0.385740	 -0.717169
 -0.203504	 -0.395968	 -0.705595
 -0.221708	 -0.406152	 -0.691190
 -0.235092	 -0.407736	 -0.679339
 -0.247340	 -0.412588	 -0.663525
 -0.259718	 -0.422741	 -0.643831
 -0.273894	 -0.433507	 -0.623461
 -0.280088	 -0.441003	 -0.615254
 -0.291285	 -0.449352	 -0.597369
 -0.300687	 -0.464691	 -0.583696
 -0.308363	 -0.467589	 -0.573324
 -0.315255	 -0.480894	 -0.561646
 -0.332022	 -0.492372	 -0.541957
 -0.337984	 -0.499715	 -0.532163
 -0.348082	 -0.510393	 -0.519285
 -0.359210	 -0.523208	 -0.501144
 -0.365722	 -0.533784	 -0.490305
 -0.374575	 -0.543805	 -0.481194
 -0.386613	 -0.565516	 -0.465488
 -0.390238	 -0.579760	 -0.453770
 -0.395359	 -0.589670	 -0.439931
 -0.403955	 -0.603870	 -0.412356
 -0.416472	 -0.610919	 -0.397247
 -0.408784	 -0.623668	 -0.390641
 -0.422335	 -0.629636	 -0.380982
 -0.435700	 -0.647760	 -0.358348
 -0.442469	 -0.657192	 -0.341258
 -0.448211	 -0.661592	 -0.329286
 -0.457820	 -0.668061	 -0.309195
 -0.468494	 -0.677676	 -0.289245
 -0.473336	 -0.686559	 -0.277689
 -0.476727	 -0.696569	 -0.267174
 -0.480774	 -0.713407	 -0.253445
 -0.483605	 -0.730018	 -0.236836
 -0.489982	 -0.746605	 -0.219389
 -0.494790	 -0.757749	 -0.207564
 -0.502228	 -0.769770	 -0.198599
 -0.509224	 -0.785252	 -0.184124
 -0.516132	 -0.798734	 -0.169961
 -0.520251	 -0.809240	 -0.159079
 -0.522139	 -0.820956	 -0.142807
 -0.530556	 -0.837786	 -0.123492
 -0.537605	 -0.853449	 -0.110489
 -0.539257	 -0.863929	 -0.100762
 -0.546445	 -0.880492	 -0.086140
 -0.555941	 -0.895134	 -0.071206
 -0.562127	 -0.904176	 -0.063095
 -0.574014	 -0.919179	 -0.048675
 -0.583028	 -0.935133	 -0.031725
 -0.586628	 -0.943440	 -0.024089
 -0.589096	 -0.957690	 -0.008119
 -0.594148	 -0.972585	  0.008873
 -0.599743	 -0.984163	  0.021196
 -0.601519	 -0.998489	  0.034919
 -0.603238	 -1.013600	  0.049360
 -0.604731	 -1.030956	  0.060584
 -0.607362	 -1.049297	  0.070555
 -0.611200	 -1.064095	  0.080135
 -0.615831	 -1.078008	  0.096709
 -0.618904	 -1.087419	  0.112549
 -0.621299	 -1.097588	  0.129168
 -0.629097	 -1.112338	  0.145906
 -0.640002	 -1.126207	  0.160461
 -0.648897	 -1.137025	  0.175234
 -0.654288	 -1.147821	  0.189404
 -0.658996	 -1.159456	  0.205258
 -0.662980	 -1.172189	  0.220813
 -0.665087	 -1.185506	  0.233704
 -0.667979	 -1.200857	  0.245519
 -0.672975	 -1.219293	  0.257614
 -0.680361	 -1.236286	  0.268533
 -0.685834	 -1.250251	  0.278067
 -0.690375	 -1.265149	  0.288759
 -0.693344	 -1.281674	  0.301612
 -0.696532	 -1.297948	  0.314144
 -0.700495	 -1.313743	  0.326810
 -0.704227	 -1.328766	  0.338575
 -0.707028	 -1.343512	  0.349688
 -0.709828	 -1.359183	  0.362580
 -0.712919	 -1.374308	  0.375773
 -0.716797	 -1.390699	  0.387510
 -0.723558	 -1.406773	  0.399851
 -0.733129	 -1.418180	  0.412693
 -0.745903	 -1.428655	  0.427024
 -0.757164	 -1.439678	  0.439930
 -0.767674	 -1.448792	  0.448003
 -0.780810	 -1.462667	  0.460865
 -0.790474	 -1.477524	  0.477724
 -0.798298	 -1.486344	  0.490104
 -0.802392	 -1.499095	  0.500196
 -0.812855	 -1.510728	  0.512729
 -0.825555	 -1.525976	  0.525498
 -0.837227	 -1.537871	  0.535586
 -0.852127	 -1.551491	  0.546216
 -0.860515	 -1.558286	  0.555440
 -0.873613	 -1.574001	  0.566168
 -0.886506	 -1.585965	  0.578399
 -0.898108	 -1.597127	  0.595069
 -0.904239	 -1.603792	  0.605111
 -0.912534	 -1.616092	  0.623552
 -0.925105	 -1.627307	  0.643020
 -0.933887	 -1.636015	  0.655788
 -0.940914	 -1.640230	  0.667452
 -0.956225	 -1.645187	  0.683431
 -0.974037	 -1.647325	  0.698467
 -0.989146	 -1.648902	  0.715989
 -1.000792	 -1.649108	  0.735761
 -1.008033	 -1.651582	  0.746057
 -1.019346	 -1.657408	  0.758558
 -1.038014	 -1.668457	  0.778697
 -1.045800	 -1.675479	  0.790799
 -1.054776	 -1.680700	  0.801123
 -1.070317	 -1.687676	  0.816984
 -1.081674	 -1.694649	  0.830633
 -1.092425	 -1.703192	  0.845323
 -1.104561	 -1.710867	  0.859555
 -1.114677	 -1.721227	  0.872895
 -1.122186	 -1.736000	  0.889014
 -1.126881	 -1.744913	  0.899437
 -1.135389	 -1.758593	  0.916048
 -1.145168	 -1.769319	  0.938143
 -1.148701	 -1.773661	  0.950629
 -1.154245	 -1.780009	  0.971753
 -1.164680	 -1.794810	  0.990279
 -1.173304	 -1.808476	  1.000284
 -1.180053	 -1.821589	  1.006929
 -1.190566	 -1.839056	  1.013975
 -1.197004	 -1.853661	  1.027049
 -1.204216	 -1.867708	  1.041320
 -1.212234	 -1.880987	  1.054361
 -1.220129	 -1.893687	  1.067535
 -1.227722	 -1.906866	  1.080511
 -1.235256	 -1.920061	  1.093561
 -1.242900	 -1.934417	  1.107245
 -1.253300	 -1.951345	  1.124495
 -1.261009	 -1.964537	  1.137400
