 -0.451037	  0.803450	  2.324085
 -0.453301	  0.805461	  2.325380
 -0.440998	  0.787662	  2.323849
 -0.426664	  0.777026	  2.316035
 -0.409973	  0.765457	  2.310550
 -0.397084	  0.753219	  2.301229
 -0.384543	  0.741227	  2.291182
 -0.370173	  0.729699	  2.283661
 -0.358464	  0.717726	  2.275010
 -0.348914	  0.701955	  2.266080
 -0.330465	  0.686783	  2.261548
 -0.310812	  0.680999	  2.256808
 -0.292185	  0.676021	  2.248102
 -0.277309	  0.665919	  2.237446
 -0.265775	  0.657000	  2.228704
 -0.249456	  0.649352	  2.218026
 -0.233753	  0.639171	  2.204940
 -0.224810	  0.626868	  2.194391
 -0.213735	  0.613000	  2.183056
 -0.194746	  0.605993	  2.173269
 -0.178816	  0.599689	  2.167061
 -0.165822	  0.588557	  2.158409
 -0.142619	  0.580464	  2.146746
 -0.125206	  0.579916	  2.139798
 -0.110784	  0.578312	  2.132811
 -0.094283	  0.569788	  2.120321
 -0.076465	  0.566784	  2.110506
 -0.059562	  0.564017	  2.101621
 -0.042295	  0.556676	  2.091464
 -0.024471	  0.553612	  2.083811
 -0.007180	  0.549977	  2.076038
  0.009206	  0.541692	  2.068694
  0.028110	  0.535553	  2.062639
  0.044572	  0.527974	  2.053629
  0.065344	  0.521431	  2.042302
  0.079557	  0.520896	  2.038498
  0.100813	  0.519004	  2.035264
  0.121339	  0.512981	  2.029405
  0.137453	  0.506563	  2.023261
  0.153912	  0.498402	  2.016402
  0.174502	  0.490957	  2.009642
  0.191796	  0.488950	  2.008384
  0.212950	  0.486477	  2.007905
  0.233098	  0.479054	  2.003102
  0.249058	  0.471262	  1.997121
  0.267258	  0.462480	  1.989935
  0.287812	  0.454157	  1.982999
  0.304086	  0.450610	  1.980914
  0.322112	  0.448925	  1.983851
  0.342631	  0.439650	  1.984197
  0.365011	  0.430419	  1.978698
  0.382937	  0.430355	  1.975889
  0.400849	  0.431769	  1.977019
  0.422734	  0.430220	  1.978012
  0.443266	  0.428623	  1.977716
  0.463223	  0.426044	  1.976523
  0.483968	  0.426093	  1.974237
  0.503816	  0.427043	  1.973077
  0.523802	  0.432556	  1.974515
  0.543803	  0.443000	  1.977072
  0.561594	  0.453469	  1.977920
  0.579849	  0.460294	  1.973088
  0.598344	  0.462491	  1.968501
  0.618300	  0.466750	  1.967411
  0.637973	  0.473269	  1.967357
  0.656722	  0.478812	  1.964315
  0.675533	  0.482826	  1.958324
  0.694815	  0.490008	  1.952674
  0.712369	  0.499745	  1.952378
  0.729800	  0.505725	  1.956461
  0.749943	  0.516383	  1.958442
  0.766340	  0.529684	  1.955510
  0.781026	  0.537613	  1.950455
  0.799647	  0.546832	  1.946055
  0.817401	  0.560113	  1.942521
  0.829832	  0.568807	  1.931917
  0.844981	  0.577969	  1.921378
  0.863147	  0.591906	  1.916888
  0.877226	  0.603744	  1.910445
  0.889928	  0.612607	  1.896835
  0.901469	  0.618594	  1.883525
  0.916056	  0.627431	  1.870497
  0.928880	  0.634160	  1.856605
  0.941626	  0.640801	  1.842697
  0.954373	  0.647442	  1.828789
  0.967119	  0.654084	  1.814881
  0.979842	  0.660620	  1.800920
  0.991653	  0.663189	  1.785009
  1.002853	  0.664087	  1.768473
  1.014051	  0.665002	  1.751902
  1.025249	  0.665843	  1.735354
  1.036483	  0.666534	  1.718825
  1.047726	  0.667084	  1.702301
  1.058963	  0.667516	  1.685752
  1.069829	  0.662873	  1.669568
  1.080453	  0.656914	  1.653700
  1.091021	  0.650914	  1.637829
  1.101532	  0.644960	  1.621883
  1.112070	  0.638911	  1.605973
  1.122621	  0.632798	  1.590119
  1.133316	  0.626562	  1.574445
  1.143913	  0.619597	  1.559226
  1.153377	  0.611911	  1.544202
  1.163159	  0.605693	  1.527643
  1.177005	  0.598822	  1.511542
  1.189259	  0.587316	  1.499838
  1.196689	  0.575225	  1.488335
  1.206342	  0.561423	  1.474262
  1.217820	  0.553638	  1.460424
  1.229811	  0.549390	  1.444141
  1.242622	  0.540435	  1.428755
  1.250096	  0.526624	  1.418027
  1.257296	  0.510457	  1.405698
  1.267843	  0.498325	  1.392759
  1.278750	  0.492718	  1.378396
  1.292011	  0.484715	  1.361614
  1.304836	  0.473724	  1.349179
  1.312079	  0.461389	  1.339102
  1.318418	  0.447495	  1.325593
  1.326938	  0.434629	  1.311515
  1.336279	  0.422865	  1.298150
  1.345522	  0.411117	  1.284863
  1.353649	  0.398707	  1.271451
  1.361735	  0.386276	  1.258031
  1.369822	  0.373845	  1.244612
  1.377908	  0.361414	  1.231193
  1.385942	  0.348937	  1.217792
  1.392032	  0.334791	  1.205077
  1.393675	  0.317912	  1.194519
  1.395189	  0.300954	  1.184024
  1.396704	  0.283996	  1.173529
  1.398219	  0.267039	  1.163034
  1.399622	  0.250034	  1.152645
  1.397126	  0.231391	  1.145984
  1.390900	  0.212560	  1.143598
  1.384569	  0.193726	  1.141334
  1.378336	  0.175000	  1.139389
  1.372239	  0.156310	  1.140645
  1.364519	  0.137562	  1.143037
  1.357897	  0.120656	  1.143145
  1.349148	  0.099812	  1.140233
  1.338562	  0.078391	  1.137306
  1.333272	  0.066288	  1.135695
  1.327223	  0.045183	  1.137028
  1.322415	  0.025032	  1.134585
  1.319021	  0.006540	  1.125994
  1.320058	 -0.012964	  1.119704
  1.320483	 -0.031954	  1.119086
  1.326730	 -0.049679	  1.119321
  1.339366	 -0.063922	  1.119253
  1.351108	 -0.078439	  1.121483
  1.364404	 -0.087887	  1.128998
  1.376220	 -0.098629	  1.135237
  1.391068	 -0.106694	  1.138170
  1.409935	 -0.110562	  1.141453
  1.428906	 -0.111678	  1.148229
  1.446287	 -0.108227	  1.158853
  1.462355	 -0.103592	  1.168151
  1.479119	 -0.100223	  1.173615
  1.498938	 -0.096185	  1.179460
  1.524030	 -0.087421	  1.188550
  1.537588	 -0.077344	  1.191870
  1.552550	 -0.063583	  1.193982
  1.566974	 -0.047813	  1.196818
  1.585711	 -0.033903	  1.203613
  1.596595	 -0.025441	  1.209091
  1.618096	 -0.015712	  1.211639
  1.636369	 -0.012881	  1.210307
  1.657829	 -0.010269	  1.209235
  1.678672	 -0.006972	  1.208403
  1.698183	 -0.001402	  1.208289
  1.717231	  0.004784	  1.208340
  1.736732	  0.009048	  1.206550
  1.756308	  0.011954	  1.203591
  1.775869	  0.014894	  1.200590
  1.795414	  0.017859	  1.197593
  1.814983	  0.020863	  1.194744
  1.834680	  0.021883	  1.191640
  1.854349	  0.020941	  1.188179
  1.874004	  0.019930	  1.184611
  1.893662	  0.018931	  1.181047
  1.913352	  0.017843	  1.177623
  1.932962	  0.015933	  1.174276
  1.952450	  0.012913	  1.170897
  1.971863	  0.010509	  1.167503
  1.991770	  0.010014	  1.164072
  2.011199	  0.009984	  1.159292
  2.030965	  0.006245	  1.151025
  2.043447	 -0.001453	  1.136090
  2.049998	 -0.014835	  1.121612
  2.060566	 -0.027981	  1.117019
  2.069621	 -0.045750	  1.107063
  2.072708	 -0.062679	  1.092354
  2.073851	 -0.072934	  1.078887
  2.076130	 -0.088758	  1.065267
  2.076831	 -0.102962	  1.050043
  2.075054	 -0.111907	  1.031365
  2.073951	 -0.124417	  1.012317
  2.075749	 -0.141252	  1.004283
  2.076951	 -0.160171	  0.995593
  2.077024	 -0.177724	  0.985390
  2.076951	 -0.194120	  0.973291
  2.076552	 -0.210240	  0.961391
  2.074796	 -0.227312	  0.950882
  2.073196	 -0.244406	  0.940611
  2.070854	 -0.261459	  0.930442
  2.069163	 -0.278597	  0.920212
  2.066545	 -0.295735	  0.910145
  2.063247	 -0.313061	  0.900513
  2.059659	 -0.330235	  0.890926
  2.056242	 -0.347410	  0.881290
  2.052622	 -0.364272	  0.871527
  2.051622	 -0.378331	  0.857673
  2.051046	 -0.392240	  0.843301
  2.050170	 -0.406064	  0.828914
  2.050001	 -0.419555	  0.814497
  2.053119	 -0.430340	  0.798466
  2.057422	 -0.440958	  0.782057
  2.061329	 -0.451638	  0.765591
  2.065832	 -0.462089	  0.749315
  2.072080	 -0.472294	  0.733696
  2.080635	 -0.482168	  0.718827
  2.089183	 -0.491809	  0.704211
  2.094825	 -0.501803	  0.688526
  2.105291	 -0.512879	  0.671965
  2.118503	 -0.522014	  0.658956
  2.134002	 -0.532299	  0.649431
  2.147163	 -0.542104	  0.640385
  2.156613	 -0.549087	  0.625664
  2.165329	 -0.556261	  0.608546
  2.176486	 -0.568026	  0.594512
  2.193790	 -0.578234	  0.582981
  2.210672	 -0.584829	  0.572475
  2.219726	 -0.591759	  0.563544
  2.232704	 -0.600249	  0.547480
  2.248178	 -0.605820	  0.532182
  2.262114	 -0.612351	  0.522292
  2.275698	 -0.627637	  0.514511
  2.290358	 -0.635544	  0.503441
