  1.096603	 -2.543950	 -1.227469
  1.085745	 -2.518762	 -1.215316
  1.095949	 -2.505326	 -1.165536
  1.101339	 -2.490247	 -1.115882
  1.110701	 -2.485362	 -1.065801
  1.117183	 -2.476025	 -1.015937
  1.118188	 -2.462853	 -0.966573
  1.126588	 -2.456014	 -0.917080
  1.128942	 -2.445657	 -0.869431
  1.137916	 -2.433895	 -0.824313
  1.143612	 -2.425406	 -0.775981
  1.150312	 -2.409288	 -0.727691
  1.151847	 -2.405418	 -0.676726
  1.159605	 -2.401104	 -0.628114
  1.153964	 -2.393580	 -0.580743
  1.148851	 -2.384069	 -0.531430
  1.150213	 -2.372449	 -0.479893
  1.153959	 -2.362807	 -0.430196
  1.158583	 -2.354180	 -0.380945
  1.164394	 -2.345624	 -0.331483
  1.171718	 -2.337113	 -0.283102
  1.180791	 -2.328949	 -0.235833
  1.193704	 -2.321288	 -0.189194
  1.209411	 -2.313591	 -0.142114
  1.225870	 -2.304827	 -0.093477
  1.241773	 -2.293802	 -0.044562
  1.250709	 -2.279425	  0.004969
  1.250078	 -2.260569	  0.051098
  1.252341	 -2.242186	  0.095197
  1.252157	 -2.222296	  0.141160
  1.259465	 -2.209210	  0.190283
  1.269102	 -2.198933	  0.240609
  1.278493	 -2.190834	  0.289556
  1.286494	 -2.185004	  0.338116
  1.292775	 -2.181960	  0.387937
  1.297343	 -2.180474	  0.439482
  1.300927	 -2.177813	  0.489229
  1.304337	 -2.173295	  0.537515
  1.307251	 -2.166143	  0.585947
  1.307784	 -2.154963	  0.634631
  1.307799	 -2.140702	  0.684264
  1.311428	 -2.124579	  0.731922
  1.309887	 -2.107750	  0.778688
  1.309496	 -2.091777	  0.825903
  1.310349	 -2.077889	  0.873311
  1.312582	 -2.067806	  0.922684
  1.316811	 -2.060235	  0.973247
  1.322736	 -2.053902	  1.022656
  1.330847	 -2.047332	  1.072550
  1.342730	 -2.039179	  1.122400
  1.356639	 -2.029814	  1.170758
  1.370472	 -2.020846	  1.217189
  1.384041	 -2.012781	  1.262940
  1.397387	 -2.004844	  1.310895
  1.407119	 -1.995368	  1.359068
  1.413065	 -1.986913	  1.407721
  1.416215	 -1.979066	  1.456771
  1.417510	 -1.971236	  1.504961
  1.417850	 -1.962424	  1.554436
  1.417438	 -1.952067	  1.603271
  1.416787	 -1.939997	  1.653417
  1.415704	 -1.927009	  1.702575
  1.424493	 -1.912101	  1.749004
  1.434021	 -1.891233	  1.791893
  1.434883	 -1.887146	  1.838421
  1.449232	 -1.906017	  1.856805
