 0.0 0.0 0.0 0
 0.2569237788482065 0.5078430524628017 0.41937004446903486 1000
 -0.8966970657878967 0.3545503987489762 -0.04223085473242938 1000
 0.2043375186919241 -0.8436497636128834 -0.18247200990122936 1000
 -0.9750124698765317 -0.028708522385444246 -0.2758829075453614 1000
 -0.6285119406832047 -0.17253682774701135 -0.4601048115513703 1000
 0.8243555982062934 -0.5356129934786533 0.23761192189427877 1000
 0.0030283590405758287 -0.1961379468686264 -0.45004326280461543 1000
 0.8537276387726103 0.25648260583636817 0.3584688569533785 1000
 0.0 0.0 0.0 0
 -0.08191204465930153 -0.7470983631972 -0.3101377795193905 1000
 0.5217967366388248 0.35245685263707294 -0.27007159417586646 1000
 0.9669233538484358 -0.24540192019716423 0.20556717534641525 1000
 0.06014129718522476 -0.33041885464614906 0.4500493584850437 1000
 -0.9026508838095195 -0.40770988071290193 -0.21978843736008413 1000
 0.3170613992974585 0.231831752877126 0.4782811503241916 1000
 0.05440867742418448 0.9643451360159854 0.1168829312245034 1000
 0.8661084810750403 0.24978106781675424 -0.048571002772205135 1000
 0.0 0.0 0.0 0
 0.4453245118747817 0.724828772441749 0.31268735976209494 1000
 -0.5913442728080996 -0.06132966416009884 0.2665905917223557 1000
 -0.7738025026365662 0.4822457497470713 0.04514540946147266 1000
 0.6939619745711231 0.3498782104267228 0.4100101130731544 1000
 0.28330131619190047 0.8570097598922926 -0.15871342681085923 1000
 -0.35402080129805696 0.2528586463259445 -0.482269416834919 1000
 -0.6325378647610769 0.7415712344183318 -0.018740379501050064 1000
 0.027142966798125195 0.8817311044506213 0.2110106573435457 1000
 0.0 0.0 0.0 0
 -0.064299967937135 -0.7508063376838955 0.30176785084165325 1000
 -0.5871499179902882 0.393517614766106 0.21704884347310938 1000
 -0.5954564188211589 -0.7075711488287992 -0.2732297708394198 1000
 -0.7773047390977095 0.4525659106345164 -0.3456909436273663 1000
 0.0037915059499834865 0.6042960641693099 0.3610789566752158 1000
 0.4164388494239139 -0.8389180404155021 0.24587607865358105 1000
 0.8690189808988446 -0.2638258608189129 -0.0352291979846118 1000
 -0.27169418307917836 -0.9355978517614256 0.06702798132767451 1000
 0.0 0.0 0.0 0
 -0.7900482382604277 -0.4104991412549328 0.07503892103166562 1000
 -0.2951692069918941 0.619586549990551 -0.39631914441282223 1000
 -0.6413873551198873 -0.23256421335016458 0.2262438285416168 1000
 0.46361867138693463 0.7476489902677897 -0.14613282181323095 1000
