 -1.586088	 -0.992855	  1.786047
 -1.603188	 -0.965033	  1.809161
 -1.593882	 -0.979798	  1.799400
 -1.584734	 -0.994388	  1.789416
 -1.573599	 -1.008967	  1.781463
 -1.561310	 -1.024083	  1.774990
 -1.550724	 -1.039532	  1.766871
 -1.542497	 -1.053535	  1.756563
 -1.532340	 -1.068861	  1.748344
 -1.521946	 -1.083344	  1.741145
 -1.508668	 -1.098954	  1.737500
 -1.496997	 -1.116731	  1.731275
 -1.490136	 -1.131569	  1.722205
 -1.482476	 -1.147889	  1.714714
 -1.472947	 -1.165046	  1.709205
 -1.464007	 -1.180702	  1.704446
 -1.451823	 -1.202581	  1.698969
 -1.442102	 -1.217327	  1.690214
 -1.433585	 -1.229604	  1.679454
 -1.424788	 -1.245368	  1.668208
 -1.422758	 -1.260588	  1.655339
 -1.420668	 -1.279770	  1.641095
 -1.411022	 -1.295556	  1.627103
 -1.400868	 -1.303289	  1.617243
 -1.388188	 -1.313374	  1.601895
 -1.381133	 -1.325828	  1.586515
 -1.375844	 -1.335123	  1.573008
 -1.363454	 -1.349076	  1.556017
 -1.353161	 -1.367733	  1.542684
 -1.349630	 -1.381201	  1.536065
 -1.349067	 -1.392415	  1.524282
 -1.347048	 -1.403436	  1.503629
 -1.341270	 -1.414540	  1.486548
 -1.335020	 -1.424896	  1.470570
 -1.328573	 -1.435532	  1.454896
 -1.321995	 -1.445690	  1.438970
 -1.315366	 -1.454876	  1.422486
 -1.308744	 -1.464070	  1.406006
 -1.302087	 -1.473075	  1.389438
 -1.295371	 -1.480374	  1.372224
 -1.290465	 -1.487464	  1.355153
 -1.288089	 -1.492378	  1.336224
 -1.285726	 -1.497699	  1.314245
 -1.279465	 -1.510722	  1.299459
 -1.266311	 -1.522905	  1.288710
 -1.248974	 -1.535016	  1.274278
 -1.240600	 -1.545946	  1.264431
 -1.232832	 -1.557232	  1.249207
 -1.225372	 -1.567560	  1.233091
 -1.219580	 -1.575498	  1.220529
 -1.211800	 -1.583311	  1.203830
 -1.199740	 -1.596745	  1.186818
 -1.189750	 -1.608622	  1.174775
 -1.182611	 -1.618224	  1.165724
 -1.176094	 -1.632071	  1.151774
 -1.167937	 -1.648778	  1.137104
 -1.160909	 -1.674834	  1.116380
 -1.162248	 -1.683789	  1.109357
 -1.158252	 -1.691200	  1.104172
 -1.153616	 -1.713545	  1.093094
 -1.139197	 -1.732126	  1.083189
 -1.130137	 -1.751304	  1.072726
 -1.128439	 -1.768903	  1.062844
 -1.125665	 -1.777230	  1.058136
 -1.115309	 -1.793543	  1.049134
 -1.102842	 -1.806808	  1.039582
 -1.089894	 -1.820175	  1.030122
 -1.074139	 -1.832421	  1.022443
 -1.060329	 -1.845558	  1.012787
 -1.049791	 -1.858899	  0.994574
 -1.042824	 -1.868042	  0.979482
 -1.034716	 -1.878525	  0.967585
 -1.020778	 -1.895531	  0.948146
 -1.015017	 -1.902276	  0.939045
 -1.003747	 -1.909878	  0.931870
 -0.988886	 -1.921736	  0.914293
 -0.977810	 -1.933217	  0.901042
 -0.972174	 -1.949261	  0.893739
 -0.959418	 -1.967967	  0.886996
 -0.937925	 -1.987403	  0.880145
 -0.929671	 -1.995681	  0.879514
 -0.917414	 -2.012185	  0.870864
 -0.913237	 -2.030031	  0.863446
 -0.904909	 -2.050434	  0.859381
 -0.900749	 -2.069383	  0.858474
 -0.895311	 -2.088802	  0.853409
 -0.887628	 -2.106291	  0.846247
 -0.879678	 -2.122769	  0.838122
 -0.871730	 -2.139226	  0.829998
 -0.863761	 -2.155663	  0.821853
 -0.854877	 -2.170755	  0.812190
 -0.845899	 -2.185694	  0.802379
 -0.836906	 -2.200614	  0.792555
 -0.827420	 -2.214837	  0.782175
 -0.817599	 -2.228549	  0.771426
 -0.807778	 -2.242260	  0.760676
 -0.797561	 -2.255471	  0.749677
 -0.786856	 -2.268210	  0.738588
 -0.776105	 -2.280982	  0.727559
 -0.765396	 -2.293662	  0.716524
 -0.754352	 -2.306603	  0.705485
 -0.743160	 -2.318541	  0.693855
 -0.731772	 -2.329215	  0.681966
 -0.720129	 -2.342052	  0.671201
 -0.708715	 -2.353449	  0.659028
 -0.697584	 -2.363979	  0.647406
 -0.685590	 -2.377074	  0.636518
 -0.674702	 -2.389520	  0.624616
 -0.665558	 -2.398560	  0.609942
 -0.655518	 -2.409828	  0.596339
 -0.646213	 -2.421445	  0.582799
 -0.637132	 -2.432951	  0.569186
 -0.627893	 -2.444643	  0.555836
 -0.618860	 -2.455929	  0.542014
 -0.609879	 -2.467117	  0.528080
 -0.600898	 -2.478294	  0.514136
 -0.592082	 -2.489337	  0.499982
 -0.583260	 -2.500374	  0.485820
 -0.574376	 -2.511493	  0.471559
 -0.565285	 -2.522954	  0.456633
 -0.556620	 -2.533894	  0.442307
