  1.346933	  0.204140	  2.089613
  1.349611	  0.204318	  2.091506
  1.331037	  0.205756	  2.083421
  1.314908	  0.204700	  2.071611
  1.297213	  0.202775	  2.061179
  1.281478	  0.199788	  2.049088
  1.266346	  0.195486	  2.036746
  1.250341	  0.190487	  2.025494
  1.234984	  0.184060	  2.014246
  1.219872	  0.177448	  2.002895
  1.204049	  0.171661	  1.992089
  1.187740	  0.166193	  1.981886
  1.171412	  0.160776	  1.971688
  1.154825	  0.156512	  1.961371
  1.138218	  0.153303	  1.950725
  1.121655	  0.150533	  1.939804
  1.104566	  0.147789	  1.929735
  1.087324	  0.144606	  1.920250
  1.070029	  0.141728	  1.910588
  1.052098	  0.141139	  1.901738
  1.033898	  0.141538	  1.893456
  1.015689	  0.141987	  1.885202
  0.997364	  0.143063	  1.877367
  0.978759	  0.149033	  1.873296
  0.960197	  0.155211	  1.869380
  0.942502	  0.161950	  1.865784
  0.928333	  0.175330	  1.867468
  0.914081	  0.189124	  1.870615
  0.900992	  0.203288	  1.867723
  0.887813	  0.217749	  1.864963
  0.865625	  0.231628	  1.867795
  0.845532	  0.237625	  1.868351
  0.831054	  0.240842	  1.866322
  0.808081	  0.252351	  1.866990
  0.793147	  0.267616	  1.877010
  0.785249	  0.279513	  1.886893
  0.774132	  0.297679	  1.897519
  0.763292	  0.312603	  1.901424
  0.751899	  0.326556	  1.901266
  0.733621	  0.342273	  1.899716
  0.716305	  0.355043	  1.902499
  0.704849	  0.363583	  1.905991
  0.686959	  0.375971	  1.912394
  0.669408	  0.387027	  1.914315
  0.653971	  0.396834	  1.911172
  0.635766	  0.407257	  1.905500
  0.618227	  0.415689	  1.902889
  0.601840	  0.423104	  1.898940
  0.586686	  0.431272	  1.894048
  0.569083	  0.440027	  1.888991
  0.552814	  0.445718	  1.881767
  0.536643	  0.454310	  1.876120
  0.518902	  0.467586	  1.865198
  0.501886	  0.475431	  1.850487
  0.493202	  0.477938	  1.843673
  0.474324	  0.480255	  1.830021
  0.456950	  0.482105	  1.809655
  0.448187	  0.477678	  1.788756
  0.444236	  0.472949	  1.773501
  0.431865	  0.459009	  1.759005
  0.411665	  0.455609	  1.750111
  0.389433	  0.456967	  1.739092
  0.370943	  0.457135	  1.728636
  0.354002	  0.456055	  1.716124
  0.343204	  0.454725	  1.707068
  0.326593	  0.449099	  1.690523
  0.312626	  0.442751	  1.677643
  0.303603	  0.437969	  1.669436
  0.284093	  0.431139	  1.653270
  0.270759	  0.427969	  1.642171
  0.257983	  0.422400	  1.629041
  0.239937	  0.414654	  1.614553
  0.230691	  0.410224	  1.607239
  0.213551	  0.401597	  1.594492
  0.195548	  0.392738	  1.581591
  0.185724	  0.388466	  1.573401
  0.172923	  0.378756	  1.558623
  0.163569	  0.368358	  1.540364
  0.158130	  0.360646	  1.527727
  0.149381	  0.348932	  1.512136
  0.138653	  0.338315	  1.498089
  0.127422	  0.330078	  1.483583
  0.116735	  0.321176	  1.468827
  0.106918	  0.309847	  1.453001
  0.100484	  0.300241	  1.438001
  0.092988	  0.292453	  1.422301
  0.082288	  0.286457	  1.407833
  0.067680	  0.276412	  1.392083
  0.053230	  0.265858	  1.378293
  0.045633	  0.259441	  1.369623
  0.036959	  0.249484	  1.355745
  0.030420	  0.234253	  1.337098
  0.023398	  0.219722	  1.321057
  0.011797	  0.209256	  1.306367
  0.000611	  0.204361	  1.295897
 -0.014057	  0.199992	  1.280228
 -0.029653	  0.197724	  1.263996
 -0.044267	  0.195449	  1.252055
 -0.060681	  0.194662	  1.243573
 -0.080322	  0.192167	  1.234011
 -0.095767	  0.187012	  1.223206
 -0.109041	  0.178269	  1.211312
 -0.127272	  0.163871	  1.198397
 -0.146842	  0.153942	  1.185788
 -0.157388	  0.152023	  1.175744
 -0.170187	  0.154757	  1.160578
 -0.184608	  0.155342	  1.146077
 -0.199600	  0.156850	  1.134614
 -0.215596	  0.159570	  1.118008
 -0.227120	  0.160916	  1.104450
 -0.240145	  0.164952	  1.089078
 -0.254806	  0.169046	  1.070496
 -0.268043	  0.169039	  1.058382
 -0.282621	  0.167618	  1.050186
 -0.303105	  0.164666	  1.040960
 -0.324398	  0.168072	  1.031078
 -0.337538	  0.172196	  1.022275
 -0.356191	  0.178573	  1.009161
 -0.378720	  0.181486	  0.996081
 -0.388141	  0.181438	  0.990656
 -0.407448	  0.183432	  0.977726
 -0.427751	  0.184314	  0.961109
 -0.440757	  0.182107	  0.952227
 -0.451809	  0.180082	  0.944014
 -0.476037	  0.179073	  0.929992
 -0.489743	  0.179167	  0.919784
 -0.501836	  0.179268	  0.905048
 -0.512466	  0.179816	  0.887850
 -0.526129	  0.181407	  0.872269
 -0.547730	  0.187158	  0.859918
 -0.564730	  0.191670	  0.851652
 -0.578869	  0.193484	  0.843900
 -0.596262	  0.194054	  0.835094
 -0.618696	  0.193160	  0.823760
 -0.637967	  0.192163	  0.813372
 -0.651836	  0.191024	  0.806818
 -0.670261	  0.188381	  0.797547
 -0.689587	  0.183156	  0.787524
 -0.704865	  0.180150	  0.778723
 -0.722262	  0.179600	  0.766806
 -0.741299	  0.176986	  0.749575
 -0.752370	  0.174010	  0.737816
 -0.762295	  0.172647	  0.726753
 -0.779776	  0.170854	  0.709445
 -0.797422	  0.170367	  0.697656
 -0.814004	  0.172313	  0.690111
 -0.837442	  0.174409	  0.678646
 -0.855354	  0.170812	  0.667211
 -0.862093	  0.167935	  0.662770
 -0.879561	  0.163000	  0.647772
 -0.902477	  0.159683	  0.631077
 -0.916413	  0.161818	  0.622400
 -0.928750	  0.165588	  0.615245
 -0.944863	  0.175904	  0.600852
 -0.963007	  0.176029	  0.584422
 -0.980206	  0.173478	  0.571277
 -0.993203	  0.171575	  0.560888
 -1.007876	  0.168430	  0.548759
 -1.021861	  0.164252	  0.533647
 -1.036240	  0.160155	  0.520918
 -1.048360	  0.156521	  0.507718
 -1.060040	  0.152443	  0.492479
 -1.071994	  0.147506	  0.477816
 -1.083233	  0.142795	  0.458174
 -1.090014	  0.142935	  0.439777
 -1.093407	  0.146053	  0.422088
 -1.095257	  0.152559	  0.400825
 -1.102127	  0.158229	  0.379506
 -1.111479	  0.162116	  0.360302
 -1.120420	  0.162394	  0.342207
 -1.124524	  0.156095	  0.326213
 -1.128422	  0.146964	  0.306878
 -1.133187	  0.142135	  0.286815
 -1.138632	  0.140195	  0.267619
 -1.146554	  0.128370	  0.254818
 -1.156737	  0.112520	  0.247345
 -1.167568	  0.094173	  0.241994
 -1.177082	  0.075936	  0.239885
 -1.186095	  0.057116	  0.242273
 -1.194422	  0.039863	  0.248161
 -1.202800	  0.021998	  0.254774
 -1.212406	  0.005126	  0.261124
 -1.223172	 -0.009647	  0.267172
 -1.233646	 -0.022468	  0.275969
 -1.248606	 -0.034905	  0.287416
 -1.264586	 -0.051691	  0.292226
 -1.276240	 -0.067784	  0.291360
 -1.287790	 -0.084513	  0.291327
 -1.299897	 -0.099617	  0.292595
 -1.312006	 -0.111999	  0.292765
 -1.331114	 -0.130075	  0.294801
 -1.348889	 -0.140871	  0.300620
 -1.360216	 -0.146034	  0.305135
 -1.380483	 -0.160541	  0.311409
 -1.396108	 -0.177593	  0.308960
 -1.404748	 -0.187249	  0.305299
 -1.416546	 -0.202947	  0.294864
 -1.433427	 -0.218228	  0.288633
 -1.449322	 -0.230477	  0.287236
 -1.465347	 -0.242724	  0.287319
 -1.481934	 -0.253954	  0.286448
 -1.499507	 -0.263728	  0.285367
 -1.517121	 -0.270961	  0.285477
 -1.538193	 -0.278799	  0.283283
 -1.558662	 -0.279338	  0.279738
 -1.578582	 -0.277585	  0.276823
 -1.598283	 -0.275383	  0.273947
 -1.616880	 -0.272158	  0.271281
 -1.637779	 -0.267225	  0.267248
 -1.659055	 -0.259653	  0.263511
 -1.677328	 -0.250199	  0.261190
 -1.693602	 -0.240365	  0.259621
 -1.709602	 -0.232545	  0.261983
 -1.728850	 -0.221858	  0.265940
 -1.748666	 -0.211815	  0.271395
 -1.770497	 -0.203567	  0.277623
 -1.793657	 -0.192238	  0.277688
 -1.808265	 -0.182175	  0.274214
 -1.819890	 -0.171867	  0.267642
 -1.833345	 -0.158396	  0.260446
 -1.843611	 -0.142987	  0.250421
 -1.856364	 -0.125081	  0.238788
 -1.870270	 -0.107770	  0.229271
 -1.877276	 -0.096863	  0.224270
 -1.886737	 -0.078230	  0.212555
 -1.898664	 -0.064028	  0.197933
 -1.905393	 -0.054609	  0.188910
 -1.917449	 -0.040634	  0.182645
 -1.938383	 -0.022057	  0.174421
 -1.953707	 -0.014674	  0.170817
 -1.967388	 -0.010009	  0.168544
 -1.986667	  0.000502	  0.163185
 -2.002877	  0.012020	  0.156359
 -2.016490	  0.022370	  0.149889
 -2.029020	  0.033234	  0.142774
 -2.041126	  0.044766	  0.133641
 -2.053984	  0.056175	  0.123084
 -2.066785	  0.066962	  0.112137
 -2.078991	  0.077399	  0.101514
 -2.091058	  0.087195	  0.090479
 -2.102856	  0.095933	  0.078930
 -2.115688	  0.103687	  0.066364
 -2.128840	  0.109530	  0.054725
 -2.144385	  0.114005	  0.044508
 -2.163060	  0.118080	  0.035828
 -2.181048	  0.123504	  0.028264
 -2.193607	  0.129147	  0.019268
 -2.204573	  0.131945	  0.004190
 -2.220475	  0.133577	 -0.010911
 -2.242511	  0.141700	 -0.024979
 -2.255189	  0.152843	 -0.037144
 -2.261558	  0.163747	 -0.046304
 -2.275412	  0.179393	 -0.063045
 -2.296564	  0.185761	 -0.076370
 -2.311115	  0.186456	 -0.083078
 -2.325279	  0.185982	 -0.088588
 -2.342008	  0.191108	 -0.102508
 -2.355225	  0.199595	 -0.116264
 -2.369634	  0.204978	 -0.129008
 -2.383659	  0.208990	 -0.140769
 -2.398275	  0.212473	 -0.152556
 -2.413642	  0.215253	 -0.164566
 -2.428473	  0.217282	 -0.175977
 -2.443905	  0.218337	 -0.187885
 -2.459290	  0.219419	 -0.199811
 -2.474617	  0.220529	 -0.211371
 -2.490552	  0.220664	 -0.223797
 -2.506187	  0.221486	 -0.236506
 -2.524220	  0.222547	 -0.250874
 -2.546071	  0.237581	 -0.259371
 -2.561383	  0.237011	 -0.272224
