 -1.557640	  1.120160	  1.592996
 -1.562879	  1.118536	  1.592304
 -1.544886	  1.119346	  1.593837
 -1.523534	  1.117826	  1.594207
 -1.500631	  1.123543	  1.589934
 -1.485661	  1.131758	  1.586796
 -1.464905	  1.147096	  1.584647
 -1.445490	  1.160437	  1.584623
 -1.432628	  1.168102	  1.585123
 -1.410897	  1.176480	  1.586055
 -1.394207	  1.179679	  1.588154
 -1.377668	  1.182363	  1.588642
 -1.353402	  1.186819	  1.586556
 -1.335727	  1.192323	  1.586230
 -1.317685	  1.200612	  1.585562
 -1.300277	  1.213442	  1.584388
 -1.286396	  1.225785	  1.586926
 -1.271836	  1.242224	  1.590487
 -1.246972	  1.258594	  1.590596
 -1.228064	  1.267124	  1.586867
 -1.216263	  1.270999	  1.584240
 -1.203506	  1.275284	  1.584012
 -1.177462	  1.281439	  1.580127
 -1.154878	  1.285576	  1.579226
 -1.135957	  1.287247	  1.578249
 -1.115978	  1.288413	  1.573261
 -1.093898	  1.288095	  1.572268
 -1.071776	  1.287576	  1.577972
 -1.052143	  1.288342	  1.582624
 -1.032658	  1.288888	  1.586779
 -1.011678	  1.288455	  1.589089
 -0.994523	  1.287681	  1.590050
 -0.975455	  1.289119	  1.593224
 -0.952142	  1.294976	  1.599084
 -0.940430	  1.300186	  1.602916
 -0.922179	  1.310250	  1.611831
 -0.899209	  1.321460	  1.622971
 -0.888521	  1.323893	  1.625220
 -0.867666	  1.326267	  1.628447
 -0.841902	  1.329569	  1.635226
 -0.828848	  1.329703	  1.638715
 -0.808177	  1.333550	  1.636725
 -0.793833	  1.349357	  1.649356
 -0.783633	  1.363045	  1.662622
 -0.780704	  1.378091	  1.675337
 -0.780955	  1.393805	  1.689111
 -0.778545	  1.407647	  1.705145
 -0.773268	  1.419181	  1.721412
 -0.766814	  1.428988	  1.737509
 -0.760573	  1.439289	  1.753401
 -0.753962	  1.451310	  1.767718
 -0.746393	  1.466889	  1.778510
 -0.739315	  1.482745	  1.790046
 -0.732253	  1.497824	  1.802056
 -0.722279	  1.512148	  1.814730
 -0.705740	  1.522950	  1.827083
 -0.690026	  1.527533	  1.842523
 -0.677261	  1.525585	  1.861060
 -0.661969	  1.534758	  1.870116
