  1.453030	  0.849565	  1.655889
  1.491104	  0.834020	  1.677357
  1.529178	  0.818475	  1.698825
  1.510301	  0.822518	  1.693003
  1.494050	  0.828128	  1.685963
  1.478536	  0.836493	  1.685060
  1.460466	  0.844140	  1.677918
  1.431104	  0.858875	  1.660094
  1.425871	  0.861842	  1.657236
  1.411980	  0.870287	  1.649775
  1.392922	  0.879193	  1.645312
  1.374269	  0.880628	  1.635971
  1.357085	  0.880715	  1.626605
  1.339614	  0.879221	  1.613207
  1.322861	  0.889059	  1.593151
  1.305545	  0.909413	  1.587305
  1.288861	  0.921927	  1.589515
  1.276040	  0.930302	  1.594660
  1.252743	  0.944070	  1.599518
  1.234661	  0.957200	  1.590935
  1.225592	  0.964095	  1.585546
  1.209938	  0.975873	  1.576395
  1.192388	  0.988266	  1.567763
  1.179226	  0.996780	  1.561180
  1.164734	  1.007358	  1.551197
  1.147896	  1.020088	  1.542428
  1.133142	  1.028788	  1.534545
  1.119006	  1.036863	  1.526229
  1.102888	  1.049988	  1.518888
  1.085923	  1.065219	  1.515289
  1.069407	  1.075955	  1.510938
  1.056372	  1.081323	  1.500295
  1.040496	  1.084879	  1.485579
  1.022595	  1.085979	  1.473800
  1.004213	  1.087407	  1.463746
  0.987879	  1.091944	  1.452796
  0.971865	  1.096937	  1.441881
  0.955864	  1.101937	  1.430976
  0.939432	  1.110544	  1.423504
  0.923132	  1.120565	  1.417683
  0.906829	  1.130583	  1.411866
  0.889984	  1.139436	  1.405712
  0.872674	  1.147091	  1.399252
  0.855450	  1.154809	  1.392635
  0.838566	  1.162783	  1.385469
  0.821684	  1.170753	  1.378296
  0.805237	  1.178975	  1.370428
  0.788936	  1.187276	  1.362341
  0.772748	  1.195833	  1.354296
  0.756948	  1.205218	  1.346406
  0.740707	  1.213851	  1.338560
  0.722624	  1.218187	  1.331202
  0.704539	  1.222505	  1.323835
  0.687545	  1.230051	  1.316473
  0.671890	  1.240207	  1.309278
  0.656237	  1.250360	  1.302075
  0.639077	  1.258509	  1.295823
  0.621267	  1.265579	  1.290096
  0.604608	  1.273892	  1.282859
  0.589790	  1.283740	  1.273714
  0.574744	  1.293448	  1.264800
  0.559713	  1.303678	  1.256478
  0.544795	  1.314093	  1.248169
  0.529724	  1.324401	  1.240002
  0.513763	  1.334089	  1.232919
  0.498508	  1.343565	  1.225867
  0.487706	  1.356388	  1.218425
  0.471032	  1.376279	  1.214339
  0.452267	  1.382557	  1.210533
  0.431500	  1.381114	  1.204944
  0.412049	  1.381836	  1.202939
  0.389927	  1.384628	  1.200860
  0.361431	  1.391184	  1.189896
  0.350389	  1.395408	  1.181993
  0.337901	  1.400072	  1.173555
  0.320799	  1.406655	  1.164149
  0.299490	  1.415274	  1.157882
  0.278294	  1.426790	  1.153338
  0.268509	  1.434788	  1.151758
  0.251023	  1.447276	  1.148359
  0.234058	  1.460848	  1.146942
  0.214513	  1.470534	  1.143768
  0.194241	  1.477214	  1.132754
  0.181187	  1.482720	  1.122160
  0.168909	  1.486993	  1.110085
  0.153925	  1.493944	  1.096228
  0.134889	  1.499409	  1.083825
  0.123470	  1.500795	  1.077450
  0.108294	  1.505892	  1.069479
  0.091006	  1.512689	  1.056057
  0.074341	  1.519762	  1.042148
  0.060592	  1.526148	  1.033246
  0.044238	  1.532967	  1.020264
  0.026418	  1.541679	  1.008992
  0.014354	  1.548582	  0.998067
 -0.002376	  1.559332	  0.988867
 -0.021365	  1.568881	  0.980501
 -0.028586	  1.574195	  0.974676
 -0.044495	  1.585514	  0.965169
 -0.056611	  1.601439	  0.953756
 -0.064282	  1.614496	  0.943555
 -0.078582	  1.633907	  0.925826
 -0.086847	  1.641459	  0.916772
 -0.098144	  1.647137	  0.905830
 -0.112328	  1.658888	  0.893181
 -0.128537	  1.665896	  0.881826
 -0.147061	  1.671598	  0.873396
 -0.163703	  1.681228	  0.866110
 -0.178308	  1.693072	  0.859795
 -0.191932	  1.707087	  0.855416
 -0.207079	  1.719258	  0.852975
 -0.222866	  1.731072	  0.850247
 -0.239518	  1.742220	  0.847087
 -0.258080	  1.750831	  0.844405
 -0.276990	  1.757731	  0.841303
 -0.296718	  1.762582	  0.838170
 -0.316413	  1.766069	  0.833798
 -0.335939	  1.767890	  0.828080
 -0.354964	  1.769147	  0.822262
 -0.373944	  1.769948	  0.816283
 -0.391863	  1.767147	  0.810081
 -0.412467	  1.756409	  0.807139
 -0.436835	  1.750871	  0.807497
 -0.461377	  1.758437	  0.806086
 -0.475587	  1.768521	  0.802714
 -0.492484	  1.772966	  0.798073
 -0.516873	  1.777379	  0.797748
 -0.535997	  1.786443	  0.796708
 -0.554207	  1.794974	  0.796198
 -0.576119	  1.806355	  0.794313
 -0.593541	  1.820935	  0.789908
 -0.602772	  1.833586	  0.784863
 -0.616157	  1.850920	  0.777685
 -0.630258	  1.867928	  0.770582
 -0.640843	  1.880375	  0.767190
 -0.654855	  1.891268	  0.765945
 -0.675748	  1.901887	  0.757835
 -0.692554	  1.910058	  0.748853
 -0.709304	  1.916943	  0.742087
 -0.724297	  1.928487	  0.734585
 -0.734221	  1.939827	  0.727796
 -0.750385	  1.952687	  0.719896
 -0.779091	  1.963787	  0.711424
 -0.788219	  1.967590	  0.708165
 -0.802062	  1.974678	  0.701036
 -0.819441	  1.985760	  0.685789
 -0.831862	  1.993940	  0.675451
 -0.845069	  2.002641	  0.667989
 -0.868744	  2.012669	  0.662286
 -0.886496	  2.019535	  0.656136
 -0.894782	  2.025925	  0.649712
 -0.909188	  2.040196	  0.638287
 -0.922724	  2.054200	  0.629639
 -0.939519	  2.069201	  0.632518
 -0.965683	  2.081348	  0.639178
 -0.985788	  2.087469	  0.634232
 -0.999271	  2.094187	  0.622647
 -1.006561	  2.104544	  0.607037
 -1.024031	  2.117568	  0.597624
 -1.041581	  2.115698	  0.575217
 -1.057816	  2.124732	  0.567816
 -1.074051	  2.133766	  0.560415
