  2.985434	  0.490491	  0.165837
  2.955875	  0.485634	  0.164195
  2.912096	  0.477893	  0.163236
  2.867053	  0.464824	  0.145623
  2.823047	  0.448504	  0.135679
  2.773558	  0.433722	  0.127592
  2.726930	  0.419824	  0.124880
  2.684684	  0.398334	  0.113996
  2.632237	  0.382036	  0.103681
  2.588978	  0.372637	  0.088238
  2.541176	  0.353467	  0.085887
  2.495806	  0.345338	  0.073429
  2.447168	  0.326007	  0.057512
  2.401731	  0.318218	  0.048502
  2.353640	  0.303667	  0.040207
  2.307207	  0.289651	  0.026944
  2.259497	  0.278899	  0.011512
  2.216604	  0.264886	  0.002338
  2.172760	  0.248097	 -0.011426
  2.137114	  0.219496	 -0.025941
  2.149600	  0.080639	 -0.040155
  2.137615	 -0.166295	 -0.046265
  2.099309	 -0.237281	 -0.055071
  2.055825	 -0.269104	 -0.051168
  2.037063	 -0.267122	 -0.067458
  1.958411	 -0.236507	 -0.090088
  1.919386	 -0.187224	 -0.102748
  1.782584	  0.030624	 -0.104282
  1.703902	  0.083948	 -0.110833
  1.652669	  0.090341	 -0.118568
  1.608651	  0.080380	 -0.127322
  1.561684	  0.062499	 -0.137789
  1.512578	  0.043207	 -0.147787
  1.468034	  0.028464	 -0.156381
  1.424047	  0.015801	 -0.165755
  1.375344	  0.000911	 -0.173150
  1.328064	 -0.013248	 -0.178156
  1.280554	 -0.028075	 -0.185241
  1.235928	 -0.045175	 -0.196662
  1.186378	 -0.060441	 -0.205055
  1.141804	 -0.075549	 -0.215125
  1.093445	 -0.090437	 -0.226528
  1.046025	 -0.104582	 -0.237490
  1.001201	 -0.118799	 -0.248015
  0.953641	 -0.135068	 -0.258790
  0.909682	 -0.149345	 -0.268813
  0.861639	 -0.163665	 -0.278645
  0.810683	 -0.176754	 -0.287036
  0.764338	 -0.189163	 -0.294206
  0.721981	 -0.202593	 -0.300974
  0.671106	 -0.216371	 -0.309578
  0.624953	 -0.231292	 -0.315996
  0.579748	 -0.246496	 -0.322827
  0.533378	 -0.258894	 -0.332386
  0.486166	 -0.273931	 -0.342986
  0.440467	 -0.290656	 -0.354040
  0.390211	 -0.307249	 -0.366593
  0.348377	 -0.321351	 -0.377946
  0.302811	 -0.338368	 -0.389696
  0.255960	 -0.357747	 -0.400621
  0.211179	 -0.373545	 -0.409662
  0.166009	 -0.387838	 -0.420341
  0.116342	 -0.402553	 -0.432668
  0.069909	 -0.416152	 -0.443952
  0.027763	 -0.428601	 -0.452710
 -0.021817	 -0.443040	 -0.461993
 -0.072479	 -0.456480	 -0.470808
 -0.121410	 -0.470040	 -0.479482
 -0.164445	 -0.480816	 -0.487075
 -0.213095	 -0.493451	 -0.494800
 -0.264663	 -0.505477	 -0.504060
 -0.313047	 -0.516433	 -0.512972
 -0.360537	 -0.528297	 -0.521825
 -0.401299	 -0.539943	 -0.529379
 -0.450187	 -0.556111	 -0.539685
 -0.499637	 -0.573917	 -0.552915
 -0.545062	 -0.591538	 -0.566447
 -0.586288	 -0.607885	 -0.579047
 -0.630463	 -0.623980	 -0.592391
 -0.675494	 -0.638610	 -0.605710
 -0.721631	 -0.652701	 -0.617920
 -0.774018	 -0.682674	 -0.623790
 -0.829542	 -0.850174	 -0.548425
 -0.864268	 -1.053041	 -0.518926
 -0.872320	 -1.113484	 -0.608185
 -0.886397	 -1.168049	 -0.668229
 -0.908119	 -1.154320	 -0.748384
 -0.926817	 -1.176340	 -0.820937
 -0.936479	 -1.166645	 -0.826604
 -1.037140	 -1.088853	 -0.807928
 -1.083468	 -1.155113	 -0.845691
 -1.113626	 -1.054549	 -0.830544
 -1.267168	 -0.926699	 -0.588145
 -1.383039	 -1.039736	 -0.508564
 -1.383713	 -1.041604	 -0.510432
 -1.396358	 -1.029388	 -0.517286
 -1.460003	 -0.905367	 -0.687610
 -1.516159	 -0.903945	 -0.777645
 -1.559381	 -0.916730	 -0.798166
 -1.609437	 -0.934120	 -0.810330
 -1.652746	 -0.949835	 -0.819092
 -1.702200	 -0.966971	 -0.827223
 -1.751657	 -0.981104	 -0.833690
 -1.795027	 -0.991918	 -0.840518
 -1.845422	 -1.004989	 -0.850124
 -1.893656	 -1.018002	 -0.860169
 -1.939958	 -1.030897	 -0.869818
 -1.987841	 -1.044929	 -0.879389
 -2.033130	 -1.059795	 -0.888100
 -2.078249	 -1.074854	 -0.897610
 -2.123729	 -1.091987	 -0.906504
 -2.170914	 -1.106149	 -0.915946
 -2.220129	 -1.119398	 -0.928744
 -2.268833	 -1.129644	 -0.938171
 -2.315445	 -1.139892	 -0.947006
 -2.359296	 -1.153704	 -0.956537
 -2.404671	 -1.173728	 -0.965364
 -2.454040	 -1.187792	 -0.982714
 -2.496579	 -1.201935	 -0.993758
 -2.549835	 -1.221160	 -1.003548
 -2.575334	 -1.233371	 -1.013583
