 -0.581765	  0.586892	  2.431848
 -0.584029	  0.588903	  2.433143
 -0.570281	  0.576690	  2.425279
 -0.556533	  0.564477	  2.417416
 -0.542542	  0.552313	  2.409913
 -0.528432	  0.540177	  2.402590
 -0.514290	  0.528071	  2.395279
 -0.499701	  0.516400	  2.388142
 -0.485112	  0.504728	  2.381004
 -0.470480	  0.493154	  2.373799
 -0.455772	  0.481749	  2.366476
 -0.441065	  0.470344	  2.359154
 -0.426373	  0.459104	  2.351550
 -0.411688	  0.447936	  2.343828
 -0.397003	  0.436768	  2.336107
 -0.382240	  0.426223	  2.327689
 -0.367469	  0.415767	  2.319175
 -0.352698	  0.405311	  2.310661
 -0.337769	  0.395765	  2.301387
 -0.322780	  0.386705	  2.291731
 -0.307791	  0.377645	  2.282075
 -0.292665	  0.368977	  2.272273
 -0.277234	  0.361297	  2.262129
 -0.261802	  0.353618	  2.251986
 -0.246366	  0.345948	  2.241842
 -0.230251	  0.339807	  2.231713
 -0.214136	  0.333666	  2.221584
 -0.198021	  0.327526	  2.211455
 -0.181460	  0.322386	  2.201490
 -0.164831	  0.317408	  2.191554
 -0.148202	  0.312431	  2.181619
 -0.131106	  0.307989	  2.172238
 -0.114011	  0.303547	  2.162857
 -0.096736	  0.299053	  2.153835
 -0.079282	  0.294507	  2.145193
 -0.061770	  0.289904	  2.136699
 -0.044025	  0.285057	  2.128849
 -0.026280	  0.280210	  2.121000
 -0.008310	  0.274972	  2.113954
  0.009666	  0.269722	  2.106932
  0.027831	  0.264244	  2.100605
  0.046043	  0.258706	  2.094468
  0.064372	  0.253007	  2.088852
  0.082777	  0.247195	  2.083609
  0.101232	  0.241308	  2.078631
  0.119755	  0.235307	  2.074062
  0.138308	  0.229247	  2.069695
  0.156925	  0.223042	  2.065840
  0.175574	  0.216808	  2.062184
  0.194301	  0.210501	  2.059094
  0.213047	  0.204230	  2.056056
  0.232005	  0.198359	  2.053582
  0.250964	  0.192488	  2.051108
  0.270105	  0.187117	  2.048925
  0.289450	  0.182377	  2.047109
  0.308795	  0.177638	  2.045293
  0.328161	  0.172972	  2.043500
  0.347939	  0.170248	  2.042315
  0.367717	  0.167524	  2.041130
  0.387495	  0.164800	  2.039945
  0.407273	  0.162076	  2.038760
  0.427241	  0.161464	  2.037794
  0.447214	  0.162070	  2.036959
  0.467187	  0.162677	  2.036125
  0.487161	  0.163283	  2.035290
  0.507134	  0.163889	  2.034455
  0.526938	  0.166499	  2.033469
  0.546457	  0.170720	  2.032368
  0.565976	  0.174940	  2.031266
  0.585494	  0.179160	  2.030165
  0.605013	  0.183381	  2.029064
  0.624254	  0.188622	  2.027546
  0.643481	  0.193909	  2.026010
  0.662709	  0.199197	  2.024474
  0.681913	  0.204529	  2.022813
  0.701099	  0.209896	  2.021058
  0.720286	  0.215262	  2.019302
  0.739321	  0.221167	  2.017635
  0.758329	  0.227165	  2.015983
  0.777271	  0.233363	  2.014310
  0.795802	  0.240669	  2.012521
  0.814334	  0.247975	  2.010733
  0.832769	  0.255500	  2.008851
  0.850477	  0.264454	  2.006351
  0.868185	  0.273408	  2.003852
  0.885893	  0.282362	  2.001352
  0.902915	  0.292275	  1.997889
  0.919654	  0.302531	  1.994070
  0.936394	  0.312788	  1.990250
  0.953133	  0.323045	  1.986430
  0.968801	  0.333791	  1.980183
  0.984426	  0.344551	  1.973851
  1.000051	  0.355311	  1.967519
  1.015676	  0.366070	  1.961186
  1.030148	  0.376254	  1.951868
  1.044251	  0.386239	  1.941797
  1.058353	  0.396224	  1.931727
  1.072455	  0.406210	  1.921656
  1.086011	  0.414628	  1.909599
  1.098757	  0.421270	  1.895691
  1.111503	  0.427911	  1.881783
  1.124250	  0.434552	  1.867875
  1.136544	  0.438838	  1.852693
  1.147768	  0.439539	  1.836155
  1.158992	  0.440240	  1.819616
  1.170217	  0.440941	  1.803078
  1.181225	  0.437584	  1.786721
  1.191833	  0.431573	  1.770867
  1.202441	  0.425563	  1.755013
  1.213049	  0.419552	  1.739159
  1.223673	  0.413278	  1.723419
  1.234336	  0.404400	  1.709014
  1.244998	  0.395523	  1.694610
  1.255661	  0.386645	  1.680205
  1.266324	  0.377768	  1.665800
  1.276987	  0.368890	  1.651396
  1.287423	  0.359085	  1.637433
  1.297563	  0.348247	  1.624027
  1.307703	  0.337410	  1.610621
  1.317843	  0.326572	  1.597215
  1.327983	  0.315734	  1.583809
  1.338123	  0.304897	  1.570403
  1.347942	  0.293710	  1.557044
  1.357265	  0.282008	  1.543772
  1.366588	  0.270306	  1.530500
  1.375911	  0.258604	  1.517228
  1.385234	  0.246902	  1.503956
  1.394556	  0.235200	  1.490684
  1.403217	  0.223097	  1.477324
  1.411304	  0.210665	  1.463905
  1.419390	  0.198234	  1.450485
  1.427477	  0.185803	  1.437066
  1.434070	  0.172036	  1.424143
  1.435585	  0.155078	  1.413649
  1.434218	  0.136728	  1.405814
  1.427886	  0.117892	  1.403549
  1.420615	  0.099311	  1.402186
  1.412459	  0.081056	  1.401708
  1.404303	  0.062800	  1.401230
  1.396381	  0.044452	  1.400462
  1.389204	  0.025858	  1.398799
  1.382027	  0.007265	  1.397137
  1.374879	 -0.011339	  1.395466
  1.372266	 -0.030966	  1.392639
  1.381050	 -0.048423	  1.388388
  1.400512	 -0.051385	  1.384856
  1.419973	 -0.054346	  1.381324
  1.439435	 -0.057307	  1.377792
  1.458897	 -0.060268	  1.374260
  1.478358	 -0.063229	  1.370728
  1.497820	 -0.066190	  1.367196
  1.517282	 -0.069151	  1.363664
  1.536743	 -0.072112	  1.360132
  1.556205	 -0.075073	  1.356600
  1.575667	 -0.078034	  1.353068
  1.595128	 -0.080996	  1.349536
  1.614590	 -0.083957	  1.346004
  1.634052	 -0.086918	  1.342472
  1.653513	 -0.089879	  1.338940
  1.672975	 -0.092840	  1.335408
  1.692437	 -0.095801	  1.331876
  1.711898	 -0.098762	  1.328344
  1.731360	 -0.101723	  1.324812
  1.750822	 -0.104684	  1.321280
  1.770283	 -0.107645	  1.317748
  1.789745	 -0.110607	  1.314216
  1.809207	 -0.113568	  1.310684
  1.828668	 -0.116529	  1.307151
  1.848130	 -0.119490	  1.303619
  1.867592	 -0.122451	  1.300087
  1.887054	 -0.125412	  1.296555
  1.906515	 -0.128373	  1.293023
  1.925977	 -0.131334	  1.289491
  1.945439	 -0.134295	  1.285959
  1.964900	 -0.137256	  1.282427
  1.984362	 -0.140218	  1.278895
  2.003496	 -0.144102	  1.274559
  2.022079	 -0.149182	  1.269189
  2.038994	 -0.156296	  1.261234
  2.051897	 -0.166226	  1.249619
  2.056853	 -0.179128	  1.235162
  2.059764	 -0.192362	  1.220452
  2.061569	 -0.206244	  1.206168
  2.062182	 -0.220748	  1.192411
  2.062796	 -0.235252	  1.178654
  2.063390	 -0.249803	  1.164945
  2.063358	 -0.265737	  1.152859
  2.063327	 -0.281672	  1.140772
  2.063295	 -0.297606	  1.128685
  2.063264	 -0.313540	  1.116598
  2.061462	 -0.330542	  1.106220
  2.059481	 -0.347634	  1.096025
  2.057501	 -0.364727	  1.085831
  2.055521	 -0.381819	  1.075636
  2.052226	 -0.399008	  1.065957
  2.048625	 -0.416207	  1.056405
  2.045025	 -0.433405	  1.046853
  2.041424	 -0.450604	  1.037301
  2.037824	 -0.467803	  1.027750
  2.035268	 -0.483934	  1.016206
  2.034504	 -0.497783	  1.001797
  2.033741	 -0.511632	  0.987387
  2.032977	 -0.525480	  0.972978
  2.032213	 -0.539329	  0.958569
  2.031450	 -0.553178	  0.944159
  2.030686	 -0.567027	  0.929750
  2.034523	 -0.577834	  0.913365
  2.038618	 -0.588437	  0.896909
  2.042712	 -0.599040	  0.880452
  2.046806	 -0.609643	  0.863996
  2.050900	 -0.620247	  0.847539
  2.057133	 -0.630627	  0.831621
  2.066191	 -0.640491	  0.816767
  2.075249	 -0.650355	  0.801912
  2.084307	 -0.660219	  0.787057
  2.093658	 -0.670068	  0.772376
  2.105178	 -0.679710	  0.759173
  2.116698	 -0.689352	  0.745969
  2.128217	 -0.698993	  0.732766
  2.140420	 -0.708268	  0.719917
  2.153080	 -0.717280	  0.707327
  2.165739	 -0.726293	  0.694737
  2.178870	 -0.735097	  0.682487
  2.192405	 -0.743712	  0.670546
  2.205941	 -0.752326	  0.658605
  2.220090	 -0.760674	  0.647199
  2.234470	 -0.768914	  0.636005
  2.248850	 -0.777155	  0.624811
  2.263371	 -0.785438	  0.613533
  2.278031	 -0.793345	  0.602463
