  0.385722	 -2.119472	  0.972368
  0.418898	 -2.140615	  0.982382
  0.400329	 -2.134189	  0.977282
  0.386050	 -2.124247	  0.973298
  0.368116	 -2.106503	  0.965693
  0.354846	 -2.097245	  0.959869
  0.340077	 -2.087395	  0.955839
  0.321282	 -2.074269	  0.953302
  0.307039	 -2.061372	  0.947141
  0.295499	 -2.051134	  0.940031
  0.280256	 -2.037273	  0.930267
  0.265532	 -2.028769	  0.921500
  0.248296	 -2.019620	  0.915629
  0.231469	 -2.009206	  0.909259
  0.218488	 -1.996075	  0.900941
  0.205835	 -1.982359	  0.893457
  0.192734	 -1.968815	  0.888548
  0.178078	 -1.955583	  0.883026
  0.164040	 -1.942539	  0.877534
  0.148997	 -1.929960	  0.873336
  0.133741	 -1.917552	  0.869692
  0.118487	 -1.905140	  0.866049
  0.102892	 -1.892942	  0.863220
  0.087049	 -1.880932	  0.861038
  0.071206	 -1.868923	  0.858854
  0.055146	 -1.857122	  0.857175
  0.038869	 -1.845583	  0.856062
  0.022876	 -1.834357	  0.854186
  0.006155	 -1.823796	  0.851334
 -0.011082	 -1.814369	  0.849449
 -0.031786	 -1.803291	  0.852710
 -0.045024	 -1.792273	  0.855422
 -0.061201	 -1.781032	  0.854150
 -0.076825	 -1.769458	  0.850303
 -0.091353	 -1.757338	  0.846547
 -0.112556	 -1.741031	  0.848443
 -0.128748	 -1.732441	  0.853063
 -0.147551	 -1.727586	  0.852748
 -0.167295	 -1.724919	  0.849105
 -0.187521	 -1.718257	  0.848293
 -0.203293	 -1.708712	  0.846539
 -0.221545	 -1.699489	  0.846040
 -0.241539	 -1.690440	  0.846322
 -0.260455	 -1.683898	  0.845214
 -0.278638	 -1.682996	  0.837440
 -0.298069	 -1.678962	  0.832157
 -0.317996	 -1.674613	  0.829187
 -0.337296	 -1.673389	  0.825426
 -0.356324	 -1.664798	  0.823306
 -0.372541	 -1.657596	  0.822713
 -0.397228	 -1.653661	  0.819428
 -0.412180	 -1.644332	  0.810973
 -0.426176	 -1.633490	  0.802107
 -0.443872	 -1.622414	  0.797635
 -0.465441	 -1.618442	  0.797860
 -0.485489	 -1.617695	  0.793944
 -0.506031	 -1.613784	  0.785978
 -0.518166	 -1.603845	  0.779444
 -0.534842	 -1.594722	  0.770044
 -0.553678	 -1.587583	  0.760556
 -0.571615	 -1.580877	  0.754035
 -0.588629	 -1.570195	  0.752098
 -0.603980	 -1.561377	  0.746756
 -0.618100	 -1.552145	  0.737318
 -0.640214	 -1.540443	  0.730548
 -0.656762	 -1.532815	  0.730294
 -0.672439	 -1.523258	  0.725826
 -0.689800	 -1.513543	  0.715361
 -0.705597	 -1.502818	  0.715147
 -0.722648	 -1.491732	  0.717235
 -0.740151	 -1.480385	  0.715662
 -0.758325	 -1.471964	  0.705108
 -0.773458	 -1.462301	  0.703952
 -0.791447	 -1.451138	  0.703121
 -0.810387	 -1.443326	  0.698817
 -0.826546	 -1.430786	  0.699880
 -0.843050	 -1.421337	  0.699064
 -0.860071	 -1.409933	  0.702223
 -0.876909	 -1.395805	  0.701640
 -0.890732	 -1.384494	  0.698271
 -0.907877	 -1.372062	  0.699089
 -0.922784	 -1.361119	  0.695348
 -0.938942	 -1.351020	  0.691285
 -0.959353	 -1.338685	  0.688832
 -0.973943	 -1.323756	  0.688031
 -0.987981	 -1.314426	  0.690807
 -1.006714	 -1.304409	  0.689994
 -1.024311	 -1.295734	  0.691481
 -1.043909	 -1.288382	  0.696258
 -1.062089	 -1.281974	  0.697264
 -1.078599	 -1.270858	  0.695911
 -1.097881	 -1.258848	  0.677378
 -1.111366	 -1.252501	  0.668929
 -1.129397	 -1.249451	  0.664672
 -1.152578	 -1.243624	  0.657388
 -1.166538	 -1.237173	  0.647383
 -1.178845	 -1.226096	  0.638528
 -1.193044	 -1.214885	  0.625693
 -1.208323	 -1.206104	  0.619205
 -1.219398	 -1.190353	  0.611375
 -1.232458	 -1.176423	  0.598973
 -1.245833	 -1.167982	  0.588954
 -1.261307	 -1.158967	  0.581634
 -1.274353	 -1.148076	  0.571437
 -1.287461	 -1.140351	  0.557648
 -1.300993	 -1.133431	  0.540110
 -1.312998	 -1.123009	  0.527336
 -1.326353	 -1.110565	  0.520923
 -1.339971	 -1.096865	  0.515675
 -1.355866	 -1.081233	  0.514539
 -1.370862	 -1.069634	  0.506176
 -1.383883	 -1.059121	  0.497322
 -1.399697	 -1.045548	  0.494740
 -1.413723	 -1.031676	  0.488753
 -1.427280	 -1.020656	  0.478402
 -1.444677	 -1.013280	  0.470696
 -1.462212	 -1.003926	  0.470806
 -1.479277	 -0.992187	  0.469405
 -1.494056	 -0.980970	  0.462479
 -1.509011	 -0.968556	  0.452439
 -1.527862	 -0.956787	  0.443914
 -1.542448	 -0.951583	  0.448254
 -1.561940	 -0.942516	  0.452324
 -1.581823	 -0.931500	  0.451930
 -1.596386	 -0.920222	  0.445988
 -1.614035	 -0.909902	  0.440848
 -1.634233	 -0.902540	  0.438510
 -1.647977	 -0.895045	  0.433225
 -1.666194	 -0.883954	  0.425355
 -1.684798	 -0.877635	  0.424169
 -1.703057	 -0.870861	  0.423070
 -1.720476	 -0.859919	  0.417312
 -1.739680	 -0.851955	  0.418979
 -1.759299	 -0.847305	  0.421909
 -1.778579	 -0.841666	  0.420202
 -1.796251	 -0.833219	  0.414165
 -1.813903	 -0.827105	  0.406691
 -1.832200	 -0.822338	  0.398940
 -1.849493	 -0.814059	  0.393233
 -1.866135	 -0.804366	  0.388606
 -1.883511	 -0.796788	  0.381478
 -1.900732	 -0.790780	  0.371663
 -1.917576	 -0.783379	  0.362611
 -1.932874	 -0.772685	  0.357843
 -1.948947	 -0.761383	  0.353549
 -1.965481	 -0.750469	  0.348204
 -1.981435	 -0.739531	  0.343015
 -1.996937	 -0.727586	  0.338892
 -2.012281	 -0.715716	  0.334722
 -2.026152	 -0.703373	  0.331090
 -2.040670	 -0.688682	  0.326253
 -2.056523	 -0.673247	  0.322441
 -2.071465	 -0.663281	  0.322238
 -2.088829	 -0.653951	  0.323348
 -2.107737	 -0.641488	  0.323588
 -2.120827	 -0.629016	  0.320539
 -2.136192	 -0.615943	  0.318048
 -2.152526	 -0.604274	  0.317126
 -2.167523	 -0.592550	  0.315302
 -2.185007	 -0.577853	  0.313058
 -2.200167	 -0.568331	  0.313705
 -2.217391	 -0.558297	  0.314865
 -2.234855	 -0.546498	  0.315072
 -2.248586	 -0.533383	  0.312111
 -2.263600	 -0.518719	  0.308383
 -2.279823	 -0.507532	  0.308412
 -2.295529	 -0.496360	  0.307527
 -2.312287	 -0.484408	  0.306046
 -2.327986	 -0.472221	  0.303800
