  2.068934	  1.149459	 -0.616535
  2.081804	  1.158992	 -0.607491
  2.062667	  1.150270	 -0.616111
  2.051615	  1.137068	 -0.623021
  2.040201	  1.123373	 -0.631648
  2.027526	  1.111189	 -0.640622
  2.016010	  1.099185	 -0.652657
  2.004214	  1.090012	 -0.665805
  1.985621	  1.078698	 -0.676127
  1.969198	  1.067968	 -0.681982
  1.954363	  1.058951	 -0.686865
  1.937982	  1.053830	 -0.695598
  1.921154	  1.048337	 -0.708031
  1.906560	  1.040112	 -0.719985
  1.890172	  1.030708	 -0.727416
  1.871128	  1.025324	 -0.731512
  1.851836	  1.019941	 -0.736215
  1.835928	  1.009149	 -0.747920
  1.826093	  0.998224	 -0.763961
  1.813327	  0.991090	 -0.782159
  1.798460	  0.989263	 -0.792395
  1.781211	  0.986285	 -0.799378
  1.760890	  0.983614	 -0.811223
  1.743432	  0.984022	 -0.824615
  1.729962	  0.980252	 -0.831348
  1.710135	  0.973305	 -0.838945
  1.690872	  0.971436	 -0.850709
  1.677203	  0.969396	 -0.867411
  1.668308	  0.962195	 -0.879558
  1.653368	  0.952938	 -0.891983
  1.638009	  0.945291	 -0.903627
  1.622723	  0.939573	 -0.915418
  1.607633	  0.933904	 -0.927258
  1.592542	  0.928222	 -0.939083
  1.578149	  0.921424	 -0.951194
  1.563759	  0.914704	 -0.963359
  1.549295	  0.908497	 -0.975693
  1.534759	  0.902805	 -0.988203
  1.520232	  0.897080	 -1.000702
  1.505510	  0.892671	 -1.013499
  1.490761	  0.888506	 -1.026350
  1.476089	  0.884097	 -1.039205
  1.461578	  0.879179	 -1.052061
  1.447073	  0.874255	 -1.064920
  1.432895	  0.869258	 -1.078111
  1.418822	  0.864239	 -1.091406
  1.404767	  0.859222	 -1.104718
  1.392683	  0.854465	 -1.119927
  1.380743	  0.849728	 -1.135257
  1.368123	  0.844817	 -1.149972
  1.354515	  0.839670	 -1.163694
  1.340240	  0.835580	 -1.177086
  1.324573	  0.834199	 -1.189436
  1.308865	  0.832527	 -1.201698
  1.293208	  0.826351	 -1.212498
  1.277548	  0.820146	 -1.223274
  1.261772	  0.813503	 -1.233633
  1.245942	  0.806713	 -1.243810
  1.230196	  0.799883	 -1.254084
  1.214677	  0.793162	 -1.264721
  1.199159	  0.786490	 -1.275432
  1.183916	  0.781158	 -1.287232
  1.168949	  0.777018	 -1.299831
  1.153939	  0.772998	 -1.312418
  1.140412	  0.769836	 -1.326789
  1.128572	  0.767523	 -1.342707
  1.116729	  0.765322	 -1.358670
  1.105671	  0.763433	 -1.375207
  1.099967	  0.763014	 -1.394349
  1.094284	  0.762646	 -1.413520
  1.088731	  0.762156	 -1.432715
  1.087601	  0.763493	 -1.452261
  1.086005	  0.767205	 -1.471220
  1.086038	  0.769775	 -1.493238
  1.090883	  0.770033	 -1.512978
  1.096226	  0.770188	 -1.531968
  1.098749	  0.774546	 -1.549851
  1.106590	  0.780412	 -1.571526
  1.112829	  0.779292	 -1.589424
  1.114120	  0.776899	 -1.607360
  1.117730	  0.773405	 -1.630096
  1.125114	  0.774141	 -1.649000
  1.130244	  0.780183	 -1.665670
  1.135983	  0.785202	 -1.685904
  1.141527	  0.787808	 -1.704962
  1.140487	  0.787706	 -1.723984
  1.134627	  0.786082	 -1.746758
  1.132876	  0.781201	 -1.767759
  1.137699	  0.777687	 -1.784741
  1.144069	  0.774662	 -1.803101
  1.147384	  0.763668	 -1.829293
  1.144488	  0.752758	 -1.843417
  1.136263	  0.743250	 -1.856076
  1.124609	  0.732225	 -1.877652
  1.122431	  0.727161	 -1.896633
  1.123222	  0.727475	 -1.914340
  1.118463	  0.728568	 -1.938304
  1.110455	  0.724244	 -1.958888
  1.108614	  0.719847	 -1.970984
  1.103071	  0.710380	 -1.993810
  1.092703	  0.696305	 -2.011515
  1.081783	  0.685061	 -2.018767
  1.064463	  0.673647	 -2.026417
  1.047650	  0.662872	 -2.036493
  1.038112	  0.654842	 -2.047049
  1.023063	  0.643713	 -2.061145
  1.004636	  0.635997	 -2.064740
  0.986216	  0.629205	 -2.065485
  0.967935	  0.620241	 -2.070765
  0.949027	  0.613359	 -2.073457
  0.930228	  0.608186	 -2.073286
  0.911734	  0.601743	 -2.078416
  0.892755	  0.596989	 -2.081982
  0.872627	  0.593838	 -2.085318
  0.853618	  0.588356	 -2.092914
  0.837226	  0.582446	 -2.103709
  0.824163	  0.580955	 -2.114062
  0.810122	  0.579700	 -2.130623
  0.796811	  0.577415	 -2.145891
  0.785347	  0.575204	 -2.162243
  0.776019	  0.573821	 -2.179927
  0.769638	  0.572139	 -2.198933
  0.763092	  0.570280	 -2.217743
  0.756590	  0.568447	 -2.236567
  0.750061	  0.566594	 -2.255384
  0.743428	  0.564770	 -2.274374
  0.736456	  0.561837	 -2.295344
  0.730422	  0.558789	 -2.314167
