  1.254266	  1.511679	  2.307064
  1.241848	  1.496711	  2.284222
  1.216683	  1.467026	  2.266731
  1.183508	  1.438572	  2.253381
  1.151325	  1.408812	  2.229388
  1.119212	  1.377257	  2.204926
  1.084782	  1.343686	  2.188342
  1.051115	  1.316464	  2.169399
  1.014299	  1.282690	  2.148884
  0.986503	  1.245961	  2.126068
  0.947732	  1.216832	  2.105892
  0.915804	  1.186682	  2.087212
  0.887911	  1.155420	  2.063729
  0.855247	  1.127455	  2.048348
  0.819532	  1.096943	  2.025329
  0.782857	  1.066006	  2.004065
  0.753675	  1.033025	  1.990171
  0.722583	  0.998549	  1.969449
  0.690733	  0.963997	  1.946053
  0.657329	  0.935305	  1.928419
  0.622918	  0.901328	  1.911198
  0.586492	  0.873800	  1.893205
  0.552795	  0.841809	  1.870098
  0.517596	  0.810899	  1.848202
  0.485433	  0.779038	  1.827644
  0.453051	  0.747812	  1.806377
  0.420565	  0.716886	  1.785239
  0.388702	  0.684320	  1.763954
  0.356443	  0.653984	  1.743444
  0.322604	  0.621345	  1.721627
  0.287872	  0.589081	  1.698989
  0.256051	  0.557504	  1.679995
  0.224131	  0.526945	  1.660104
  0.192040	  0.497316	  1.641459
  0.158854	  0.465821	  1.621981
  0.127553	  0.435740	  1.605174
  0.094190	  0.403251	  1.585831
  0.059658	  0.370037	  1.567708
  0.025035	  0.338092	  1.548030
 -0.005367	  0.308480	  1.529355
 -0.040741	  0.275205	  1.508974
 -0.074188	  0.245845	  1.489146
 -0.108858	  0.213786	  1.467234
 -0.141878	  0.181489	  1.447810
 -0.174046	  0.150487	  1.428894
 -0.206741	  0.118906	  1.408194
 -0.239212	  0.085703	  1.389559
 -0.271228	  0.053512	  1.371713
 -0.305683	  0.018826	  1.349664
 -0.337499	 -0.014095	  1.330179
 -0.371587	 -0.045400	  1.310040
 -0.403307	 -0.077766	  1.290325
 -0.436424	 -0.108410	  1.269591
 -0.464326	 -0.139191	  1.249476
 -0.497547	 -0.169590	  1.231296
 -0.530688	 -0.203412	  1.206820
 -0.565635	 -0.231176	  1.187161
 -0.597098	 -0.264316	  1.165198
 -0.631104	 -0.292563	  1.146802
 -0.664358	 -0.322437	  1.125919
 -0.698934	 -0.348143	  1.101618
 -0.740324	 -0.346647	  1.066388
 -0.773413	 -0.311354	  1.016236
 -0.836533	 -0.267067	  0.989007
 -0.842397	 -0.260018	  0.903167
 -0.955441	 -0.245248	  0.933319
 -0.954450	 -0.218483	  0.930686
 -1.025917	 -0.261134	  0.809460
 -1.069638	 -0.273648	  0.781286
 -1.097692	 -0.280059	  0.742507
 -1.242223	 -0.316085	  0.696372
 -1.263705	 -0.379468	  0.667481
 -1.271880	 -0.445152	  0.624582
 -1.305214	 -0.497086	  0.602566
 -1.357783	 -0.556669	  0.581649
 -1.403445	 -0.611590	  0.569038
 -1.414840	 -0.644625	  0.573597
 -1.417448	 -0.673130	  0.574953
 -1.436607	 -0.700032	  0.578997
 -1.464944	 -0.820011	  0.567427
 -1.498498	 -0.915130	  0.542975
 -1.468557	 -0.956775	  0.615147
 -1.441176	 -0.972903	  0.613757
 -1.458385	 -1.063554	  0.626108
 -1.486348	 -1.106551	  0.611874
 -1.517144	 -1.138651	  0.593644
 -1.549899	 -1.170901	  0.575405
 -1.584494	 -1.204613	  0.554026
 -1.617923	 -1.238379	  0.534094
 -1.651050	 -1.268088	  0.513201
 -1.682747	 -1.299679	  0.499047
 -1.716166	 -1.330749	  0.475088
 -1.753512	 -1.363317	  0.457422
 -1.783083	 -1.393949	  0.436323
 -1.818875	 -1.427204	  0.415763
 -1.848941	 -1.457413	  0.396494
 -1.880857	 -1.487866	  0.376509
 -1.911335	 -1.520942	  0.356324
 -1.943576	 -1.551156	  0.337044
 -1.980168	 -1.583321	  0.317170
 -2.012983	 -1.617500	  0.295031
 -2.048072	 -1.647056	  0.274303
 -2.078869	 -1.676764	  0.254410
 -2.111201	 -1.707106	  0.234856
 -2.146421	 -1.738684	  0.213329
 -2.180122	 -1.769983	  0.195474
 -2.208639	 -1.804953	  0.174632
 -2.242474	 -1.835150	  0.161706
 -2.280660	 -1.863505	  0.136527
 -2.315834	 -1.903710	  0.113141
 -2.338993	 -1.922747	  0.114273
