  0.533195	  2.374291	 -1.805365
  0.527916	  2.350783	 -1.787491
  0.512501	  2.342018	 -1.740670
  0.490630	  2.315259	 -1.704678
  0.466624	  2.303092	 -1.662054
  0.441182	  2.290325	 -1.620208
  0.420265	  2.274487	 -1.577405
  0.402572	  2.251380	 -1.536504
  0.381742	  2.230097	 -1.496493
  0.359003	  2.215505	 -1.455623
  0.333650	  2.202661	 -1.415459
  0.306948	  2.190143	 -1.375465
  0.279536	  2.176977	 -1.335754
  0.251395	  2.160843	 -1.297110
  0.223272	  2.142003	 -1.259338
  0.195747	  2.122550	 -1.222137
  0.167076	  2.101416	 -1.186900
  0.139230	  2.078007	 -1.152076
  0.114355	  2.052951	 -1.115276
  0.091518	  2.029809	 -1.074749
  0.070783	  2.010339	 -1.032871
  0.051006	  1.993583	 -0.990411
  0.030860	  1.978501	 -0.947636
  0.008987	  1.964881	 -0.905844
 -0.015985	  1.953498	 -0.869099
 -0.046808	  1.944821	 -0.840545
 -0.096534	  1.937655	 -0.819671
 -0.190909	  1.927472	 -0.812572
 -0.310791	  1.908895	 -0.816731
 -0.404537	  1.890307	 -0.808694
 -0.458417	  1.881465	 -0.791333
 -0.487799	  1.881393	 -0.773733
 -0.505208	  1.888872	 -0.758709
 -0.519102	  1.904542	 -0.735883
 -0.533607	  1.949765	 -0.684221
 -0.524720	  2.007506	 -0.601033
 -0.478395	  2.038518	 -0.512907
 -0.410613	  2.049929	 -0.399541
 -0.375881	  2.042646	 -0.257332
 -0.384813	  2.024744	 -0.148224
 -0.403426	  2.008608	 -0.089532
 -0.423258	  1.992543	 -0.052482
 -0.446934	  1.974144	 -0.024505
 -0.472752	  1.954463	 -0.003610
 -0.502320	  1.929415	  0.011420
 -0.544604	  1.893649	  0.025896
 -0.595847	  1.838393	  0.043176
 -0.645615	  1.766932	  0.067960
 -0.678697	  1.685031	  0.107349
 -0.694663	  1.610285	  0.156519
 -0.704096	  1.558485	  0.201699
 -0.719618	  1.526006	  0.229654
 -0.740156	  1.499740	  0.253513
 -0.764726	  1.475621	  0.280380
 -0.785247	  1.455496	  0.314287
 -0.803813	  1.438996	  0.353244
 -0.823449	  1.424467	  0.394564
 -0.845110	  1.410522	  0.433792
 -0.868669	  1.397037	  0.468386
 -0.894917	  1.383887	  0.499099
 -0.929420	  1.368721	  0.530838
 -0.986694	  1.346832	  0.571042
 -1.067085	  1.325800	  0.609074
 -1.149748	  1.316454	  0.629621
 -1.215175	  1.313553	  0.641751
 -1.271639	  1.312816	  0.654901
 -1.321879	  1.311126	  0.670298
 -1.370302	  1.307568	  0.690266
 -1.421570	  1.300269	  0.719874
 -1.472402	  1.285746	  0.765737
 -1.507141	  1.265440	  0.822345
 -1.523541	  1.243899	  0.874022
 -1.531306	  1.219869	  0.921807
 -1.531073	  1.181516	  0.984085
 -1.511427	  1.127439	  1.058122
 -1.463788	  1.067049	  1.133363
 -1.397677	  1.021931	  1.200613
 -1.350176	  0.996159	  1.249324
 -1.332030	  0.979489	  1.282800
 -1.330642	  0.961854	  1.316134
 -1.344224	  0.940639	  1.353673
 -1.364323	  0.920127	  1.393275
 -1.385936	  0.902066	  1.434343
 -1.407516	  0.886678	  1.476369
 -1.428177	  0.872805	  1.519709
 -1.448281	  0.860574	  1.563830
 -1.469840	  0.850825	  1.607890
 -1.493550	  0.840761	  1.650604
 -1.517908	  0.828107	  1.691957
 -1.542847	  0.812732	  1.732686
 -1.568167	  0.794739	  1.773002
 -1.593286	  0.774868	  1.812351
 -1.617515	  0.754184	  1.849746
 -1.641540	  0.733013	  1.886068
 -1.665927	  0.711460	  1.921821
 -1.691227	  0.689963	  1.957373
 -1.717238	  0.670266	  1.996095
 -1.739467	  0.650316	  2.036982
 -1.760708	  0.632344	  2.078208
 -1.781410	  0.616728	  2.120969
 -1.795347	  0.601654	  2.167379
 -1.816149	  0.582843	  2.208772
 -1.841073	  0.568992	  2.249357
 -1.868285	  0.544230	  2.283271
 -1.886968	  0.549672	  2.306103
