 -1.764434	  0.990959	 -1.508813
 -1.771159	  1.000090	 -1.515980
 -1.770275	  0.983023	 -1.506734
 -1.752509	  0.962078	 -1.506319
 -1.735743	  0.947934	 -1.497955
 -1.725977	  0.939256	 -1.490985
 -1.713040	  0.928225	 -1.481401
 -1.697491	  0.915202	 -1.469825
 -1.683308	  0.906838	 -1.454273
 -1.672497	  0.901284	 -1.436237
 -1.663769	  0.890474	 -1.426005
 -1.648104	  0.875915	 -1.414217
 -1.631912	  0.861249	 -1.405805
 -1.621305	  0.847897	 -1.404780
 -1.611628	  0.828386	 -1.406243
 -1.604037	  0.809595	 -1.402525
 -1.592944	  0.793695	 -1.393188
 -1.582681	  0.779124	 -1.384077
 -1.572210	  0.764219	 -1.375447
 -1.560475	  0.750548	 -1.366068
 -1.549505	  0.738843	 -1.355627
 -1.536725	  0.724485	 -1.350965
 -1.517767	  0.710551	 -1.349522
 -1.497798	  0.701501	 -1.339508
 -1.485056	  0.694173	 -1.321020
 -1.477160	  0.687406	 -1.308469
 -1.466557	  0.676803	 -1.297153
 -1.454709	  0.662374	 -1.286916
 -1.444779	  0.644031	 -1.278584
 -1.430594	  0.623177	 -1.261020
 -1.421946	  0.614912	 -1.250748
 -1.414464	  0.607128	 -1.241730
 -1.405071	  0.595057	 -1.229822
 -1.396760	  0.582823	 -1.218404
 -1.386161	  0.569631	 -1.203999
 -1.375009	  0.557736	 -1.189712
 -1.362593	  0.544668	 -1.171608
 -1.356194	  0.534452	 -1.155938
 -1.351994	  0.523448	 -1.141397
 -1.348831	  0.514000	 -1.128613
 -1.345738	  0.500396	 -1.114119
 -1.341362	  0.485180	 -1.096209
 -1.334011	  0.468451	 -1.078537
 -1.330829	  0.461627	 -1.071127
 -1.324105	  0.444309	 -1.057243
 -1.314466	  0.428303	 -1.047202
 -1.302121	  0.412752	 -1.038859
 -1.277635	  0.383806	 -1.030632
 -1.273338	  0.377811	 -1.029656
 -1.267428	  0.364004	 -1.021689
 -1.258597	  0.346960	 -1.008670
 -1.252721	  0.333197	 -0.997143
 -1.248789	  0.321422	 -0.987142
 -1.232821	  0.297285	 -0.968358
 -1.223005	  0.285768	 -0.960965
 -1.210296	  0.276801	 -0.954249
 -1.192942	  0.261644	 -0.948332
 -1.182935	  0.250989	 -0.943058
 -1.169899	  0.240492	 -0.935520
 -1.154754	  0.227178	 -0.923429
 -1.141809	  0.215139	 -0.911650
 -1.128195	  0.204315	 -0.900274
 -1.108990	  0.186281	 -0.890940
 -1.103120	  0.179314	 -0.887238
 -1.090102	  0.168497	 -0.879642
 -1.074334	  0.152590	 -0.868503
 -1.064808	  0.140272	 -0.856548
 -1.052199	  0.129602	 -0.842622
 -1.043398	  0.122393	 -0.835570
 -1.028621	  0.110129	 -0.824725
 -1.014929	  0.097805	 -0.813494
 -1.002843	  0.082678	 -0.796803
 -0.996468	  0.072636	 -0.786109
 -0.990383	  0.061789	 -0.774715
 -0.980696	  0.041391	 -0.760090
 -0.973898	  0.021212	 -0.747939
 -0.971369	  0.012695	 -0.744132
 -0.968760	  0.000229	 -0.738164
 -0.953449	 -0.025991	 -0.729002
 -0.944570	 -0.043368	 -0.719434
 -0.936652	 -0.057029	 -0.707583
 -0.925648	 -0.071380	 -0.696605
 -0.917547	 -0.081282	 -0.688321
 -0.905482	 -0.093609	 -0.678945
 -0.897994	 -0.102625	 -0.669652
 -0.889827	 -0.124831	 -0.647417
 -0.885991	 -0.144002	 -0.629830
 -0.884321	 -0.152966	 -0.619255
 -0.874626	 -0.161123	 -0.608087
 -0.857854	 -0.171545	 -0.594675
 -0.850013	 -0.182274	 -0.582355
 -0.839624	 -0.194212	 -0.569771
 -0.824711	 -0.210642	 -0.555656
 -0.814172	 -0.224399	 -0.546506
 -0.807493	 -0.235180	 -0.539954
 -0.799284	 -0.252155	 -0.526658
 -0.791708	 -0.265272	 -0.515515
 -0.785083	 -0.279559	 -0.504246
 -0.773152	 -0.293116	 -0.489460
 -0.758241	 -0.299928	 -0.475985
 -0.741452	 -0.305523	 -0.463845
 -0.722050	 -0.317274	 -0.449756
 -0.715249	 -0.325529	 -0.443126
 -0.705970	 -0.342494	 -0.431263
 -0.690403	 -0.355200	 -0.417370
 -0.680786	 -0.360261	 -0.410052
 -0.671131	 -0.371589	 -0.396824
 -0.662044	 -0.387588	 -0.383149
 -0.651405	 -0.401688	 -0.372122
 -0.645241	 -0.411633	 -0.362355
 -0.640982	 -0.419995	 -0.343098
 -0.624405	 -0.427286	 -0.322856
 -0.605489	 -0.443647	 -0.302934
 -0.599230	 -0.456987	 -0.295073
 -0.589801	 -0.469917	 -0.288275
 -0.575433	 -0.481929	 -0.277385
 -0.561620	 -0.494539	 -0.265697
 -0.554462	 -0.506720	 -0.258099
 -0.546503	 -0.521627	 -0.250338
 -0.538209	 -0.537345	 -0.242199
 -0.527483	 -0.559576	 -0.231166
 -0.519322	 -0.573485	 -0.224907
 -0.509914	 -0.589485	 -0.220130
 -0.498754	 -0.606396	 -0.210399
 -0.487006	 -0.620292	 -0.201303
 -0.477915	 -0.633251	 -0.196378
 -0.466599	 -0.656518	 -0.195023
 -0.458097	 -0.681377	 -0.193998
 -0.449254	 -0.703703	 -0.191007
 -0.445802	 -0.722427	 -0.188297
 -0.442943	 -0.740350	 -0.175377
 -0.426683	 -0.753528	 -0.153530
 -0.409037	 -0.761836	 -0.137210
 -0.403289	 -0.766178	 -0.131629
 -0.395757	 -0.778853	 -0.117173
 -0.387424	 -0.794086	 -0.099628
 -0.375617	 -0.802323	 -0.083098
 -0.355640	 -0.810580	 -0.060157
 -0.343073	 -0.811527	 -0.047186
 -0.332252	 -0.816405	 -0.037896
 -0.317281	 -0.822685	 -0.024989
 -0.304349	 -0.833178	 -0.013411
 -0.296713	 -0.840482	 -0.003828
 -0.286166	 -0.849440	  0.004871
 -0.270404	 -0.862235	  0.018505
 -0.253571	 -0.875341	  0.040529
 -0.248180	 -0.879709	  0.048761
 -0.237940	 -0.886759	  0.064624
 -0.213593	 -0.899248	  0.086428
 -0.205602	 -0.902655	  0.092150
 -0.193880	 -0.909967	  0.098171
 -0.173208	 -0.920815	  0.107887
 -0.157779	 -0.935062	  0.117886
 -0.149092	 -0.943453	  0.123023
 -0.134012	 -0.957877	  0.135314
 -0.121446	 -0.967239	  0.146710
 -0.107034	 -0.977205	  0.158610
 -0.094918	 -0.986943	  0.166474
 -0.083710	 -0.998428	  0.173327
 -0.069879	 -1.013168	  0.182785
 -0.053227	 -1.036072	  0.196469
 -0.047788	 -1.043215	  0.201138
 -0.032531	 -1.057181	  0.206708
 -0.015097	 -1.065683	  0.210909
  0.008074	 -1.070592	  0.221622
  0.026982	 -1.072677	  0.231000
  0.041893	 -1.072598	  0.235205
  0.064745	 -1.074571	  0.241561
  0.084625	 -1.080921	  0.251017
  0.096803	 -1.088738	  0.259085
  0.114273	 -1.103775	  0.268873
  0.127055	 -1.113762	  0.272879
  0.137664	 -1.126028	  0.275702
  0.160868	 -1.135593	  0.273824
  0.180939	 -1.142827	  0.274923
  0.200196	 -1.149476	  0.275480
  0.219317	 -1.155860	  0.271148
  0.237872	 -1.160345	  0.265520
  0.256521	 -1.165088	  0.259903
  0.275086	 -1.169664	  0.253713
  0.293751	 -1.174976	  0.248381
  0.312490	 -1.181579	  0.245581
  0.329210	 -1.192668	  0.246120
  0.345343	 -1.205918	  0.246001
  0.362800	 -1.216690	  0.245618
  0.379858	 -1.226754	  0.245666
  0.397292	 -1.234884	  0.246365
  0.411464	 -1.245684	  0.246652
  0.424767	 -1.257365	  0.246547
  0.436004	 -1.271949	  0.248031
  0.447297	 -1.285888	  0.251946
  0.457622	 -1.301386	  0.258659
  0.465194	 -1.316599	  0.267446
  0.472721	 -1.329189	  0.279325
  0.476375	 -1.342028	  0.293963
  0.482061	 -1.352795	  0.309950
  0.485036	 -1.364221	  0.326258
  0.489509	 -1.373893	  0.343625
  0.492023	 -1.383334	  0.361122
  0.493871	 -1.393013	  0.378984
  0.497907	 -1.402359	  0.396783
  0.500954	 -1.413030	  0.413565
  0.505947	 -1.423432	  0.429368
  0.509497	 -1.433912	  0.444223
  0.512414	 -1.444012	  0.458200
  0.511959	 -1.453203	  0.469522
  0.510883	 -1.462602	  0.483459
  0.504663	 -1.473317	  0.497718
  0.498709	 -1.483723	  0.513091
  0.489587	 -1.494021	  0.527028
  0.481153	 -1.503837	  0.542696
  0.471744	 -1.513871	  0.557893
  0.463149	 -1.524385	  0.574095
  0.457096	 -1.534416	  0.591221
  0.450042	 -1.544454	  0.606964
  0.444520	 -1.553995	  0.623891
  0.438338	 -1.564104	  0.640438
  0.433515	 -1.575071	  0.657494
  0.427317	 -1.588679	  0.672604
  0.419521	 -1.609208	  0.682203
  0.421902	 -1.629988	  0.694012
  0.440183	 -1.634364	  0.712198
  0.457084	 -1.635879	  0.731229
  0.464655	 -1.652082	  0.753793
  0.464870	 -1.666784	  0.765739
  0.465961	 -1.675833	  0.773843
  0.470565	 -1.692447	  0.789636
  0.476943	 -1.704905	  0.807117
  0.481494	 -1.714787	  0.821872
  0.486023	 -1.725503	  0.837404
  0.491952	 -1.736677	  0.852323
  0.501527	 -1.748745	  0.866588
  0.511109	 -1.761522	  0.880672
  0.518325	 -1.772956	  0.893326
  0.524071	 -1.787197	  0.908167
  0.529496	 -1.797111	  0.917770
  0.537696	 -1.813251	  0.931273
  0.546167	 -1.836682	  0.943606
  0.551837	 -1.845268	  0.949248
  0.560098	 -1.861344	  0.962149
  0.569898	 -1.880196	  0.975998
  0.576038	 -1.889527	  0.983987
  0.583487	 -1.905697	  0.999066
  0.590525	 -1.919050	  1.010765
  0.598696	 -1.933930	  1.021609
  0.607583	 -1.948357	  1.026265
  0.619033	 -1.966186	  1.032043
  0.629562	 -1.983954	  1.042245
  0.639781	 -1.997941	  1.051064
  0.650265	 -2.010123	  1.057140
  0.663870	 -2.026791	  1.067152
  0.674187	 -2.041405	  1.076155
  0.683216	 -2.052891	  1.082585
  0.697998	 -2.072153	  1.095355
  0.706788	 -2.085835	  1.107483
  0.711864	 -2.093856	  1.114018
  0.726869	 -2.110143	  1.130676
  0.739630	 -2.119968	  1.143176
  0.750133	 -2.126509	  1.157186
  0.762309	 -2.138614	  1.167442
