 0.0 0.0 0.0 0
 -0.08628304103149581 0.5406330311790034 -0.7440930094085373 1000
 0.7003756123240961 0.6280921095987969 0.0752173858749055 1000
 0.762915058723839 0.35807868846457125 -0.1046707372582272 1000
 -0.1207584604732646 0.9928008399668068 -0.6798881579235302 1000
 -0.8090530736761032 0.18448683863813237 -0.7342859538009034 1000
 -0.001958471123489569 -0.3774815548729064 -0.16325374794396175 1000
 -0.3521959773642588 -0.8634075566397299 0.5381694537886152 1000
 -0.04269412468906514 -0.8156337293541782 0.2457741092120299 1000
 0.0 0.0 0.0 0
 -0.3869797691765327 -0.047580087649846343 0.24862032891368957 1000
 0.5255127398476763 0.1864937998995846 0.4860221532112748 1000
 -0.7695168037088348 0.14226101632745167 -0.1782155505829303 1000
 -0.3543724738339285 -0.9208079375860508 0.3468938489058869 1000
 0.9117052414247224 0.19803535055215665 0.4542573072385136 1000
 -0.38388772044301556 -0.5407937520014945 0.4874372725782804 1000
 -0.8878943674820345 0.4472568956348273 -0.7436829158484666 1000
 0.41884119129042197 0.5915152057145097 0.11943617936895273 1000
 0.0 0.0 0.0 0
 -0.5146358193238253 0.44813481488937507 -0.8391932789777425 1000
 0.5868913472743231 0.8004093706082843 -0.28666989442511503 1000
 -0.08192268748248308 0.03993812141252137 0.36790839281085574 1000
 -0.17403989016639584 -0.7534276513905938 0.669540615653921 1000
 0.9547105477650941 0.2948468668751999 0.2715320032366736 1000
 0.7807491412953724 -0.4702604004327622 0.8381396463560923 1000
 0.13867648358401286 0.9796186670218272 -0.6180553304136062 1000
 -0.007467168495865706 0.6194655977966924 -0.05500130522768046 1000
 0.0 0.0 0.0 0
 -0.6365660728180754 -0.638142700682248 0.29494366664092686 1000
 0.018296081831185806 0.9621456340444123 -0.4822349308219228 1000
 -0.6775767311344958 -0.7250392384691737 0.08992391293578667 1000
 -0.7534551274654541 -0.05960070611311957 -0.5962840765754616 1000
 0.02706638347342591 0.9271038430209751 -0.7345261095948707 1000
 0.2924450445424051 -0.37378705030884996 0.7530341154268578 1000
 0.8924740009161125 0.3652099280708322 0.07043367342703419 1000
 0.5600042448609783 -0.8215342066967448 0.8254585769486368 1000
 0.0 0.0 0.0 0
 -0.9626595457749544 0.268159980995559 -0.6135298399958993 1000
 -0.23836685670388125 -0.5208028170990471 -0.13674730435697324 1000
 -0.3131401033140321 0.9364465166548999 -0.669863665094473 1000
 -0.3471955757403483 -0.30648301453814075 0.41603067182850006 1000
 0.9090115177902032 -0.145989401148688 0.3462250168874825 1000
 0.5954249011882069 -0.028291963356202113 -0.05306260462865689 1000
 0.7567591670108482 -0.6275372237466575 0.8289470160814598 1000
 0.019235389118887725 0.1663846502298127 -0.5228431543685208 1000
 0.0 0.0 0.0 0
 0.7325243865635127 0.6272102285879713 -0.17085079966312436 1000
 -0.23763963909009844 -0.731878159453599 0.07540449547391512 1000
 -0.14912332353082086 -0.561098330987559 0.6374780491192104 1000
 0.8140773195088615 -0.35245836688666055 0.4016743097323766 1000
 -0.9749231423116682 -0.1672277430477468 -0.2847376834073511 1000
 0.09405948028290834 0.14734900193675288 0.37695900851831016 1000
 0.8166037259586574 0.5681073595991192 0.06516244557252959 1000
 -0.8191418597750695 0.533498554099882 -0.6275101369332193 1000
 0.0 0.0 0.0 0
 -0.5303595006713041 0.49139900019783833 -0.25816198585119926 1000
 0.40292008652078254 -0.2008242456726943 0.7011073598862912 1000
 0.7288441842791571 -0.4075883068263414 0.8343791511463756 1000
 0.22605912637197811 -0.8938669663555601 0.8377397884906892 1000
 0.23253317429820303 0.14536994768474168 -0.39995271633891394 1000
 -0.14448744137620173 0.96673328448394 -0.5875320976442258 1000
