  2.245224	  1.034144	  0.143860
  2.246905	  1.039384	  0.143979
  2.240799	  1.020344	  0.143548
  2.234653	  1.001319	  0.143117
  2.226608	  0.983017	  0.142674
  2.217915	  0.965010	  0.142228
  2.208182	  0.947547	  0.141800
  2.196666	  0.931202	  0.141404
  2.185296	  0.914812	  0.141082
  2.182310	  0.895335	  0.144202
  2.180514	  0.875939	  0.147493
  2.188961	  0.859035	  0.153886
  2.199775	  0.843766	  0.160440
  2.210721	  0.828184	  0.167470
  2.223343	  0.814444	  0.174654
  2.232183	  0.798232	  0.183933
  2.238569	  0.782159	  0.190825
  2.244749	  0.760735	  0.202876
  2.252661	  0.749153	  0.210845
  2.264414	  0.734878	  0.219390
  2.275769	  0.718681	  0.229555
  2.280586	  0.704864	  0.240278
  2.289943	  0.689115	  0.249195
  2.299381	  0.672240	  0.258435
  2.302261	  0.654738	  0.268510
  2.304939	  0.635730	  0.275351
  2.307920	  0.619086	  0.284494
  2.314564	  0.603135	  0.294392
  2.320312	  0.585447	  0.304003
  2.322307	  0.564348	  0.308615
  2.320615	  0.543877	  0.310548
  2.327318	  0.525658	  0.315456
  2.334761	  0.507357	  0.323854
  2.333864	  0.490537	  0.331016
  2.332268	  0.470422	  0.334280
  2.331158	  0.448937	  0.339575
  2.331302	  0.429418	  0.345331
  2.326406	  0.411562	  0.349702
  2.316262	  0.393558	  0.352196
  2.300738	  0.376809	  0.356751
  2.291429	  0.359005	  0.359941
  2.286833	  0.342205	  0.356192
  2.279521	  0.324513	  0.350675
  2.271018	  0.303821	  0.350157
  2.261164	  0.287890	  0.350916
  2.248619	  0.271739	  0.344207
  2.241561	  0.253404	  0.344443
  2.229842	  0.239436	  0.337403
  2.220080	  0.226133	  0.326204
  2.208662	  0.213837	  0.315157
  2.193928	  0.203030	  0.306826
  2.181598	  0.188300	  0.301734
  2.169205	  0.176425	  0.291383
  2.154899	  0.168081	  0.281994
  2.144739	  0.155029	  0.270852
  2.133281	  0.142304	  0.258809
  2.119030	  0.133376	  0.251861
  2.101989	  0.124765	  0.243191
  2.084500	  0.116919	  0.233707
  2.066287	  0.106596	  0.227845
  2.049222	  0.098095	  0.222038
  2.041250	  0.092071	  0.207726
  2.025632	  0.087271	  0.190294
  2.010112	  0.082231	  0.178194
  1.992489	  0.076683	  0.168702
  1.969312	  0.074125	  0.168500
  1.948536	  0.070134	  0.167019
  1.931819	  0.064697	  0.162337
  1.912463	  0.058496	  0.155549
  1.890970	  0.055908	  0.152786
  1.874318	  0.054874	  0.148226
  1.854539	  0.052488	  0.142364
  1.835836	  0.050838	  0.134410
  1.817731	  0.049852	  0.126137
  1.798734	  0.048044	  0.119271
  1.779710	  0.045567	  0.113313
  1.760752	  0.043052	  0.107459
  1.741990	  0.040694	  0.101815
  1.724055	  0.038211	  0.096843
  1.703694	  0.031413	  0.089202
  1.685225	  0.025029	  0.082320
  1.670411	  0.019231	  0.071673
  1.654585	  0.013413	  0.064093
  1.636585	  0.005387	  0.058903
  1.621216	 -0.004666	  0.053720
  1.602663	 -0.016378	  0.041565
  1.589759	 -0.024556	  0.033028
  1.574400	 -0.033086	  0.024972
  1.558397	 -0.039085	  0.014537
  1.544443	 -0.046466	  0.001055
  1.531659	 -0.056606	 -0.013583
  1.517277	 -0.066086	 -0.024955
  1.502029	 -0.077765	 -0.029171
  1.489189	 -0.092530	 -0.034534
  1.477184	 -0.109057	 -0.042620
  1.466655	 -0.125351	 -0.049863
  1.458002	 -0.140989	 -0.061707
  1.450898	 -0.156831	 -0.074170
  1.442251	 -0.163814	 -0.090343
  1.430814	 -0.172068	 -0.105099
  1.417820	 -0.180159	 -0.118458
  1.406727	 -0.190689	 -0.131415
  1.397243	 -0.202976	 -0.144581
  1.388132	 -0.214964	 -0.157772
  1.379340	 -0.227835	 -0.170348
  1.371636	 -0.242497	 -0.181440
  1.364032	 -0.256069	 -0.193651
  1.360976	 -0.273486	 -0.203204
  1.368907	 -0.293194	 -0.200944
  1.377160	 -0.310780	 -0.195634
  1.383984	 -0.326484	 -0.183200
  1.391918	 -0.338942	 -0.171391
  1.404916	 -0.348578	 -0.156021
  1.416764	 -0.356578	 -0.143514
  1.433671	 -0.365258	 -0.130011
  1.444526	 -0.375838	 -0.119366
  1.453332	 -0.390269	 -0.107414
  1.464949	 -0.403104	 -0.095997
  1.473614	 -0.414538	 -0.085203
  1.482846	 -0.428674	 -0.072415
  1.494171	 -0.441720	 -0.061506
  1.506996	 -0.455815	 -0.054374
  1.519899	 -0.471220	 -0.049845
  1.533654	 -0.485584	 -0.042071
  1.545732	 -0.500832	 -0.037353
  1.556488	 -0.517087	 -0.032345
  1.565919	 -0.533978	 -0.026688
  1.574869	 -0.551539	 -0.022147
  1.584279	 -0.569332	 -0.019695
  1.594064	 -0.587477	 -0.023487
  1.605788	 -0.604772	 -0.019781
  1.615513	 -0.622261	 -0.020762
  1.624699	 -0.639913	 -0.022760
  1.633689	 -0.657689	 -0.024371
  1.642648	 -0.675603	 -0.025100
  1.651585	 -0.693553	 -0.028709
  1.660345	 -0.710172	 -0.036286
  1.670822	 -0.729067	 -0.038149
  1.678287	 -0.744614	 -0.048461
  1.684707	 -0.759229	 -0.061438
  1.692949	 -0.772854	 -0.075056
  1.706929	 -0.786270	 -0.083458
  1.712143	 -0.802771	 -0.089193
  1.720065	 -0.819901	 -0.095839
  1.727689	 -0.830917	 -0.112637
  1.740245	 -0.853313	 -0.119644
  1.746607	 -0.859221	 -0.135030
  1.753646	 -0.862422	 -0.155053
  1.765853	 -0.869535	 -0.169851
  1.777722	 -0.880945	 -0.179776
  1.782984	 -0.891220	 -0.199439
  1.794120	 -0.899133	 -0.217187
  1.802109	 -0.900253	 -0.233358
  1.808911	 -0.903950	 -0.250117
  1.818009	 -0.912674	 -0.267554
  1.825125	 -0.922440	 -0.283264
  1.830887	 -0.932842	 -0.299285
  1.836381	 -0.944438	 -0.315000
  1.842193	 -0.957666	 -0.328900
  1.846980	 -0.970093	 -0.343620
  1.852491	 -0.982639	 -0.358201
  1.857805	 -0.995543	 -0.370307
  1.861215	 -1.010527	 -0.378214
  1.865221	 -1.029479	 -0.384019
  1.869195	 -1.048190	 -0.389896
  1.873186	 -1.067000	 -0.395159
  1.876810	 -1.085259	 -0.399952
  1.878212	 -1.103435	 -0.401022
  1.878379	 -1.123328	 -0.399820
  1.878641	 -1.143404	 -0.398794
  1.877761	 -1.161808	 -0.394429
  1.879008	 -1.181533	 -0.389011
  1.880727	 -1.200365	 -0.380149
  1.879710	 -1.216305	 -0.368263
  1.876050	 -1.232934	 -0.359101
  1.870267	 -1.249137	 -0.348443
  1.864220	 -1.265328	 -0.338370
  1.859638	 -1.282916	 -0.329908
  1.853836	 -1.300474	 -0.321366
  1.848255	 -1.316066	 -0.310941
  1.841050	 -1.331249	 -0.298687
  1.829138	 -1.347562	 -0.290971
  1.820081	 -1.363500	 -0.282656
  1.807472	 -1.378598	 -0.278207
  1.791442	 -1.390855	 -0.274640
  1.774358	 -1.403703	 -0.273472
  1.758546	 -1.415608	 -0.273762
  1.746347	 -1.430604	 -0.274674
  1.729960	 -1.442264	 -0.275930
  1.715856	 -1.457479	 -0.277780
  1.702168	 -1.471992	 -0.277115
  1.682598	 -1.480757	 -0.281892
  1.664063	 -1.486309	 -0.284919
  1.650790	 -1.502806	 -0.285819
  1.639619	 -1.523562	 -0.283978
  1.620991	 -1.534206	 -0.284353
  1.602862	 -1.539487	 -0.283029
  1.584641	 -1.546321	 -0.281708
  1.563715	 -1.555882	 -0.286908
  1.547714	 -1.565496	 -0.291101
  1.532811	 -1.577407	 -0.290926
  1.514475	 -1.590903	 -0.290854
  1.497547	 -1.597590	 -0.288961
  1.481982	 -1.607364	 -0.288796
  1.463944	 -1.618964	 -0.287537
  1.447251	 -1.630299	 -0.287421
  1.431558	 -1.642095	 -0.286015
  1.416119	 -1.654325	 -0.284349
  1.402344	 -1.666994	 -0.279417
  1.389869	 -1.678902	 -0.271809
  1.377955	 -1.688355	 -0.262365
  1.367027	 -1.694053	 -0.248169
  1.355991	 -1.699110	 -0.232224
  1.344848	 -1.704492	 -0.216647
  1.334794	 -1.709613	 -0.200599
  1.325985	 -1.713644	 -0.183198
  1.316342	 -1.718754	 -0.166334
  1.307340	 -1.722971	 -0.148991
  1.298176	 -1.727375	 -0.131698
  1.288170	 -1.732771	 -0.114966
  1.276258	 -1.739579	 -0.099482
  1.264853	 -1.745784	 -0.084295
  1.252858	 -1.752907	 -0.070016
  1.240857	 -1.760007	 -0.055643
  1.229245	 -1.766334	 -0.040526
  1.216850	 -1.774031	 -0.026571
  1.203646	 -1.783438	 -0.013759
  1.190059	 -1.794931	 -0.003201
  1.176528	 -1.807202	  0.005011
  1.163243	 -1.818771	  0.014471
  1.149675	 -1.831234	  0.022306
  1.136459	 -1.842659	  0.031931
  1.123947	 -1.857253	  0.039674
  1.112537	 -1.875706	  0.046527
  1.104277	 -1.893642	  0.052843
  1.093229	 -1.909786	  0.051853
  1.082366	 -1.924865	  0.054915
  1.073631	 -1.944792	  0.056665
  1.065542	 -1.963390	  0.055041
  1.055540	 -1.980844	  0.050970
  1.048048	 -1.999670	  0.049622
  1.041166	 -2.017936	  0.048755
  1.031568	 -2.036234	  0.044927
  1.023615	 -2.054683	  0.043424
  1.017347	 -2.072348	  0.042137
  1.006854	 -2.089894	  0.038694
  0.999455	 -2.108707	  0.035818
  0.992356	 -2.126491	  0.036059
  0.981850	 -2.144842	  0.031377
  0.973784	 -2.163493	  0.029104
  0.968446	 -2.180468	  0.028889
  0.958821	 -2.200098	  0.024598
  0.951525	 -2.219151	  0.021774
  0.945533	 -2.237670	  0.021541
  0.938526	 -2.253894	  0.018892
  0.930884	 -2.273867	  0.016789
  0.924728	 -2.292588	  0.012554
  0.918991	 -2.309655	  0.006229
  0.912703	 -2.328388	  0.003144
