 0.0 0.0 0.0 0
 0.833092826218986 0.4603750963559998 0.4362657372838873 1000
 0.6888504890559276 -0.11487114527228505 -0.1270383203181586 1000
 0.4727020044414614 -0.5104140237060031 0.26706893195249953 1000
 -0.14578880883749096 0.7320121498635404 -0.11146858919441013 1000
 0.759459002181168 -0.5530944826041515 0.18585258819785574 1000
 -0.8481690719499819 -0.0015211837090363944 -0.011751126567347475 1000
 0.4290980902356385 0.42415237953371776 0.5125247773718427 1000
 0.04367042328310072 0.9522821122056844 0.3562817750863035 1000
 0.0 0.0 0.0 0
 -0.053588222256083395 -0.9665181366109248 -0.15222134649613958 1000
 -0.9144061321887252 -0.23114738823301884 -0.41087358285428127 1000
 0.7346784290029803 0.4233988750594153 0.08546006904554247 1000
 -0.1890358264229421 0.31841440894039463 0.3822480578686056 1000
