  2.012636	 -0.525268	  1.140542
  2.052443	 -0.543859	  1.156766
  2.092250	 -0.562450	  1.172990
  2.079336	 -0.560008	  1.155695
  2.061782	 -0.548823	  1.149109
  2.043617	 -0.540878	  1.147646
  2.024291	 -0.537979	  1.139575
  2.006976	 -0.528924	  1.121841
  1.994183	 -0.511467	  1.111995
  1.987958	 -0.497104	  1.110090
  1.977009	 -0.476386	  1.112057
  1.962979	 -0.453569	  1.101204
  1.948456	 -0.443469	  1.081167
  1.938755	 -0.442156	  1.069025
  1.925052	 -0.442343	  1.060202
  1.900481	 -0.437884	  1.055209
  1.878606	 -0.430296	  1.048175
  1.857989	 -0.422300	  1.041014
  1.842429	 -0.415254	  1.033498
  1.830145	 -0.407946	  1.024129
  1.822081	 -0.398740	  1.009673
  1.808726	 -0.386386	  0.995903
  1.792133	 -0.375668	  0.989391
  1.776213	 -0.365241	  0.983698
  1.760933	 -0.352971	  0.981542
  1.746350	 -0.339460	  0.982323
  1.731977	 -0.326889	  0.982452
  1.717102	 -0.313759	  0.982953
  1.701115	 -0.300762	  0.982297
  1.684182	 -0.287652	  0.980752
  1.667649	 -0.275880	  0.978017
  1.651321	 -0.265050	  0.974361
  1.634003	 -0.254666	  0.969978
  1.615980	 -0.244850	  0.964395
  1.598240	 -0.236832	  0.958000
  1.580265	 -0.229591	  0.951401
  1.562145	 -0.223409	  0.944314
  1.545230	 -0.218278	  0.936927
  1.528139	 -0.213399	  0.930030
  1.509557	 -0.206940	  0.926357
  1.491117	 -0.198233	  0.926347
  1.473169	 -0.189333	  0.926647
  1.455342	 -0.180222	  0.927432
  1.437914	 -0.170815	  0.929983
  1.420649	 -0.162228	  0.932877
  1.402006	 -0.155515	  0.940109
  1.383664	 -0.145248	  0.948492
  1.367045	 -0.133855	  0.951258
  1.352010	 -0.126260	  0.952730
  1.332556	 -0.116668	  0.957731
  1.313241	 -0.104466	  0.961091
  1.298536	 -0.097869	  0.956927
  1.281570	 -0.088839	  0.939639
  1.259201	 -0.070449	  0.932158
  1.246835	 -0.061345	  0.934323
  1.231679	 -0.049858	  0.945985
  1.214078	 -0.040293	  0.953561
  1.196526	 -0.028116	  0.952491
  1.181281	 -0.017573	  0.953729
  1.164874	 -0.002248	  0.955041
  1.148118	  0.008176	  0.948320
  1.129415	  0.013081	  0.929367
  1.111464	  0.024581	  0.913871
  1.099728	  0.038023	  0.911585
  1.089448	  0.053539	  0.913257
  1.072968	  0.071283	  0.914229
  1.058649	  0.081048	  0.911251
  1.041927	  0.091931	  0.902763
  1.027391	  0.102755	  0.892378
  1.016284	  0.110658	  0.883614
  0.999908	  0.128289	  0.871514
  0.983707	  0.145329	  0.864345
  0.974061	  0.154292	  0.858772
  0.953758	  0.160048	  0.854598
  0.929849	  0.158726	  0.854698
  0.904488	  0.157954	  0.852983
  0.883956	  0.162919	  0.847412
  0.869367	  0.169661	  0.841234
  0.856191	  0.181956	  0.835861
  0.839695	  0.194867	  0.832316
  0.820332	  0.203699	  0.827949
  0.801333	  0.210637	  0.824694
  0.784818	  0.219876	  0.821448
  0.769671	  0.233478	  0.816936
  0.756144	  0.247879	  0.811041
  0.741775	  0.260948	  0.806548
  0.726065	  0.272923	  0.802774
  0.712369	  0.283463	  0.797846
  0.698703	  0.291809	  0.787831
  0.681278	  0.300330	  0.772904
  0.657439	  0.308291	  0.757885
  0.638662	  0.314534	  0.750556
  0.631913	  0.317121	  0.748364
  0.613199	  0.327932	  0.739545
  0.598656	  0.337955	  0.731673
  0.585677	  0.347544	  0.724065
  0.565020	  0.361723	  0.715465
  0.552946	  0.370273	  0.712265
  0.533754	  0.381718	  0.706375
  0.515451	  0.391731	  0.700308
  0.503598	  0.397526	  0.696497
  0.482364	  0.402736	  0.688655
  0.463291	  0.406228	  0.678416
  0.445582	  0.410541	  0.660367
  0.431806	  0.419224	  0.647562
  0.422458	  0.425150	  0.639753
  0.405861	  0.432982	  0.633331
  0.380369	  0.443578	  0.630636
  0.357025	  0.451219	  0.630190
  0.337842	  0.465712	  0.636241
  0.324684	  0.479775	  0.637509
  0.314863	  0.494227	  0.634708
  0.300514	  0.508854	  0.628703
  0.282767	  0.514692	  0.627420
  0.263046	  0.519170	  0.630368
  0.238897	  0.532195	  0.632555
  0.223507	  0.545655	  0.628202
  0.215761	  0.556455	  0.623286
  0.200673	  0.571693	  0.616355
  0.183504	  0.583293	  0.614301
  0.167965	  0.592644	  0.615409
  0.154430	  0.605191	  0.623027
  0.127084	  0.618034	  0.633480
  0.109558	  0.624656	  0.629396
  0.090138	  0.630898	  0.621936
  0.079649	  0.636333	  0.620976
  0.057592	  0.646733	  0.622524
  0.031880	  0.665594	  0.615304
  0.022565	  0.673983	  0.612284
  0.011858	  0.682889	  0.608326
 -0.009388	  0.697149	  0.599856
 -0.026096	  0.705694	  0.595049
 -0.035826	  0.709700	  0.592659
 -0.053376	  0.716423	  0.585112
 -0.082203	  0.729202	  0.581796
 -0.101007	  0.744309	  0.578636
 -0.114629	  0.758258	  0.573221
 -0.118868	  0.762234	  0.570640
 -0.133717	  0.770419	  0.564248
 -0.158795	  0.783135	  0.556558
 -0.178020	  0.794034	  0.547030
 -0.191758	  0.801539	  0.536930
 -0.202779	  0.811536	  0.526939
 -0.219046	  0.833169	  0.510296
 -0.226217	  0.842230	  0.504412
 -0.235884	  0.851638	  0.501077
 -0.256075	  0.870192	  0.496793
 -0.277830	  0.883001	  0.495873
 -0.289469	  0.888605	  0.494969
 -0.306884	  0.899006	  0.491776
 -0.323223	  0.912256	  0.489295
 -0.342306	  0.929531	  0.488015
 -0.356183	  0.944927	  0.487230
 -0.365693	  0.953960	  0.486842
 -0.379431	  0.969614	  0.485449
 -0.399843	  0.988891	  0.486468
 -0.413862	  1.000269	  0.488510
 -0.427316	  1.006249	  0.490480
 -0.446734	  1.015717	  0.494975
 -0.465490	  1.025971	  0.495969
 -0.484792	  1.037395	  0.494391
 -0.502473	  1.048852	  0.490005
 -0.516855	  1.057997	  0.485336
 -0.530405	  1.066563	  0.480859
 -0.550737	  1.080748	  0.477828
 -0.566617	  1.086916	  0.478289
 -0.583726	  1.093152	  0.480997
 -0.603620	  1.098957	  0.480489
 -0.628282	  1.107489	  0.485037
 -0.642830	  1.112580	  0.485493
 -0.662686	  1.125164	  0.485604
 -0.678696	  1.140549	  0.484465
 -0.690019	  1.150414	  0.482035
 -0.711661	  1.161547	  0.476963
 -0.725850	  1.170551	  0.472988
 -0.741739	  1.180496	  0.470685
 -0.760349	  1.191986	  0.464645
 -0.773205	  1.194798	  0.466647
 -0.793823	  1.201942	  0.463908
 -0.818312	  1.213304	  0.463800
 -0.836230	  1.225222	  0.461621
 -0.853597	  1.232474	  0.465091
 -0.870084	  1.244593	  0.460951
 -0.890012	  1.250398	  0.466846
 -0.899598	  1.262360	  0.459387
 -0.916037	  1.264622	  0.467093
 -0.936290	  1.271893	  0.471884
 -0.959620	  1.283442	  0.472839
 -0.974515	  1.291842	  0.478584
 -0.986713	  1.301809	  0.468725
 -0.999605	  1.308208	  0.477805
 -1.026737	  1.319587	  0.485266
 -1.047921	  1.333758	  0.487427
 -1.063359	  1.343156	  0.488493
 -1.069845	  1.351626	  0.484773
 -1.090896	  1.361305	  0.490674
 -1.115887	  1.372188	  0.494847
 -1.142013	  1.390066	  0.493018
 -1.153428	  1.396464	  0.498826
 -1.161500	  1.410438	  0.494960
 -1.175787	  1.430651	  0.496391
 -1.185287	  1.445137	  0.493292
 -1.193878	  1.455396	  0.491401
 -1.217127	  1.475487	  0.489901
 -1.225941	  1.481216	  0.487594
 -1.242363	  1.491285	  0.479760
 -1.258335	  1.501189	  0.472578
 -1.274171	  1.515187	  0.469035
 -1.283497	  1.522031	  0.467348
 -1.297145	  1.532702	  0.463103
 -1.310624	  1.545205	  0.448358
 -1.319643	  1.559471	  0.434438
 -1.330709	  1.571046	  0.410597
 -1.334816	  1.573463	  0.400073
 -1.341878	  1.574572	  0.380237
 -1.353478	  1.573934	  0.358209
 -1.366165	  1.576441	  0.338192
 -1.375942	  1.579900	  0.323027
 -1.385438	  1.582303	  0.308867
 -1.397321	  1.585318	  0.292618
 -1.407350	  1.591711	  0.277423
 -1.418470	  1.599515	  0.264768
 -1.435804	  1.609121	  0.252679
 -1.451885	  1.616726	  0.239060
 -1.460617	  1.618465	  0.222136
 -1.469501	  1.619957	  0.210125
 -1.486554	  1.621652	  0.192707
 -1.505513	  1.627216	  0.182102
 -1.520514	  1.633876	  0.174353
 -1.537714	  1.644994	  0.169797
 -1.552673	  1.656399	  0.166357
 -1.566353	  1.666896	  0.160423
 -1.582965	  1.679951	  0.153803
 -1.605487	  1.692589	  0.148610
 -1.626248	  1.698164	  0.142783
 -1.635705	  1.700283	  0.138558
 -1.656264	  1.701210	  0.130989
 -1.673004	  1.702758	  0.117815
 -1.692329	  1.706904	  0.103284
 -1.710116	  1.711401	  0.095321
 -1.727903	  1.715898	  0.087358
