 -0.759758	 -2.057578	  1.090459
 -0.780853	 -2.083911	  1.095612
 -0.770422	 -2.071910	  1.084899
 -0.754129	 -2.058709	  1.086163
 -0.741129	 -2.042462	  1.087944
 -0.726989	 -2.018158	  1.089500
 -0.715629	 -2.001902	  1.090682
 -0.707707	 -1.993034	  1.092044
 -0.692129	 -1.975318	  1.092675
 -0.678829	 -1.958156	  1.091729
 -0.668725	 -1.944300	  1.091051
 -0.657900	 -1.926261	  1.091733
 -0.647562	 -1.908621	  1.092747
 -0.636807	 -1.891095	  1.092638
 -0.627059	 -1.874366	  1.093192
 -0.618549	 -1.855661	  1.094960
 -0.611180	 -1.836574	  1.095104
 -0.603701	 -1.817166	  1.096968
 -0.596015	 -1.800672	  1.100563
 -0.589522	 -1.781899	  1.101884
 -0.582127	 -1.759009	  1.101842
 -0.575525	 -1.744645	  1.103384
 -0.568008	 -1.726616	  1.103357
 -0.557380	 -1.702626	  1.102203
 -0.550818	 -1.689317	  1.100603
 -0.544255	 -1.672104	  1.097426
 -0.531023	 -1.644142	  1.092825
 -0.527908	 -1.635576	  1.092366
 -0.525031	 -1.619470	  1.091588
 -0.522329	 -1.589811	  1.092655
 -0.519144	 -1.572970	  1.093805
 -0.516045	 -1.560340	  1.098219
 -0.511796	 -1.539806	  1.105535
 -0.510520	 -1.517831	  1.109247
 -0.510068	 -1.498028	  1.108986
 -0.508284	 -1.480941	  1.105320
 -0.507678	 -1.460337	  1.104602
 -0.507507	 -1.441649	  1.108655
 -0.511734	 -1.425726	  1.115391
 -0.519958	 -1.404203	  1.123237
 -0.523919	 -1.385602	  1.124232
 -0.525797	 -1.367676	  1.122091
 -0.532453	 -1.342620	  1.121954
 -0.542657	 -1.327687	  1.128079
 -0.557151	 -1.314811	  1.139889
 -0.568917	 -1.298380	  1.149181
 -0.574755	 -1.277543	  1.147244
 -0.575799	 -1.256477	  1.142603
 -0.574041	 -1.236650	  1.141353
 -0.576050	 -1.215698	  1.139545
 -0.577761	 -1.195868	  1.136916
 -0.579346	 -1.176116	  1.134252
 -0.579739	 -1.156514	  1.130695
 -0.576002	 -1.138691	  1.125112
 -0.570069	 -1.121391	  1.124346
 -0.554145	 -1.104463	  1.124355
 -0.544249	 -1.082165	  1.112338
 -0.539876	 -1.069544	  1.102680
 -0.533567	 -1.056332	  1.093798
 -0.521718	 -1.039666	  1.084508
 -0.512553	 -1.027117	  1.076028
 -0.501444	 -1.013328	  1.065413
 -0.489405	 -1.000593	  1.055182
 -0.478264	 -0.988995	  1.045082
 -0.462679	 -0.975916	  1.035356
 -0.446813	 -0.967318	  1.031561
 -0.429015	 -0.958649	  1.031461
 -0.411796	 -0.947047	  1.027092
 -0.392643	 -0.930839	  1.016422
 -0.377949	 -0.924342	  1.006996
 -0.363999	 -0.921500	  0.999978
 -0.349515	 -0.924511	  0.993744
 -0.328863	 -0.928413	  0.983625
 -0.300053	 -0.923125	  0.973378
 -0.288220	 -0.919372	  0.968804
 -0.271580	 -0.911134	  0.961175
 -0.253450	 -0.907096	  0.952980
 -0.237768	 -0.902861	  0.945104
 -0.217693	 -0.894836	  0.935115
 -0.197265	 -0.889939	  0.926480
 -0.182421	 -0.891135	  0.922235
 -0.160312	 -0.896086	  0.914445
 -0.141091	 -0.891095	  0.903886
 -0.126550	 -0.883091	  0.894231
 -0.114687	 -0.872014	  0.884963
 -0.101844	 -0.855682	  0.872467
 -0.084134	 -0.844486	  0.861536
 -0.073599	 -0.840234	  0.858617
 -0.055639	 -0.830628	  0.853095
 -0.032514	 -0.811443	  0.841687
 -0.027799	 -0.803101	  0.836749
 -0.011590	 -0.790184	  0.827890
  0.002732	 -0.774849	  0.820633
  0.013027	 -0.766508	  0.815780
  0.029057	 -0.751224	  0.808207
  0.041192	 -0.732594	  0.796730
  0.050269	 -0.720805	  0.788636
  0.060328	 -0.709352	  0.782252
  0.077226	 -0.691645	  0.771822
  0.087283	 -0.674783	  0.763572
  0.089495	 -0.658964	  0.756090
  0.086277	 -0.638843	  0.748038
  0.086896	 -0.617392	  0.742795
  0.088816	 -0.597300	  0.736610
  0.090911	 -0.577648	  0.731397
  0.093746	 -0.556512	  0.729195
  0.099361	 -0.535901	  0.726855
  0.106255	 -0.518069	  0.720551
  0.111109	 -0.499946	  0.712247
  0.122019	 -0.481916	  0.706762
  0.137699	 -0.460978	  0.704694
  0.150645	 -0.448835	  0.706387
  0.170321	 -0.436279	  0.704974
  0.192175	 -0.423886	  0.696377
  0.204592	 -0.414317	  0.687931
  0.220042	 -0.401750	  0.677619
  0.228804	 -0.390590	  0.671359
  0.239258	 -0.372429	  0.663011
  0.249851	 -0.350835	  0.658586
  0.257913	 -0.338400	  0.656246
  0.268554	 -0.321485	  0.653976
  0.287270	 -0.302369	  0.650538
  0.294394	 -0.293937	  0.648194
  0.308369	 -0.277066	  0.644990
  0.318386	 -0.256288	  0.642805
  0.325373	 -0.240368	  0.641847
  0.337631	 -0.220292	  0.638987
  0.350132	 -0.204313	  0.637167
  0.358512	 -0.194192	  0.636691
  0.376652	 -0.181430	  0.633459
  0.394555	 -0.164438	  0.628786
  0.407102	 -0.149114	  0.625373
  0.417395	 -0.134921	  0.623034
  0.431188	 -0.117491	  0.622074
  0.444469	 -0.102526	  0.622864
  0.455099	 -0.090128	  0.624898
  0.472491	 -0.068752	  0.631579
  0.479043	 -0.060172	  0.635697
  0.492840	 -0.040007	  0.645329
  0.511052	 -0.020835	  0.650828
  0.523613	 -0.011365	  0.648776
  0.539558	  0.000043	  0.643610
  0.553467	  0.012858	  0.633919
  0.563778	  0.030844	  0.624098
  0.572826	  0.050122	  0.615047
  0.578581	  0.063492	  0.610657
  0.587892	  0.080138	  0.606770
  0.606255	  0.104387	  0.595887
  0.612409	  0.110246	  0.591473
  0.622378	  0.117110	  0.581863
  0.637459	  0.130937	  0.562237
  0.650879	  0.152033	  0.545681
  0.657256	  0.165317	  0.547739
  0.667541	  0.194029	  0.555744
  0.678114	  0.216364	  0.566737
  0.687792	  0.232846	  0.574764
  0.696491	  0.250377	  0.575971
  0.698778	  0.268098	  0.574908
  0.704353	  0.286725	  0.571247
  0.711589	  0.306794	  0.571427
  0.720050	  0.325496	  0.573295
  0.728062	  0.341467	  0.574024
  0.737217	  0.360281	  0.576363
  0.747879	  0.380911	  0.581278
  0.753376	  0.400235	  0.586380
  0.753957	  0.420939	  0.591722
  0.752536	  0.441668	  0.595946
  0.752031	  0.454723	  0.597238
  0.755505	  0.478361	  0.598415
  0.756131	  0.502891	  0.603743
  0.753674	  0.517762	  0.609282
  0.751443	  0.537087	  0.616691
  0.751573	  0.561318	  0.622224
  0.751771	  0.577669	  0.625654
  0.746335	  0.595024	  0.637297
  0.739265	  0.607609	  0.653541
  0.737215	  0.621026	  0.667849
  0.738232	  0.632874	  0.686485
  0.735125	  0.648611	  0.705529
  0.729074	  0.662813	  0.716364
  0.722833	  0.677171	  0.726722
  0.714478	  0.696159	  0.741041
  0.702577	  0.713446	  0.744953
  0.688281	  0.731104	  0.743964
  0.677705	  0.748956	  0.750216
  0.673631	  0.761962	  0.761818
  0.672780	  0.776296	  0.781240
  0.663116	  0.791792	  0.794909
  0.645805	  0.804937	  0.796880
  0.631716	  0.820812	  0.799414
  0.623932	  0.837875	  0.804816
  0.623394	  0.859494	  0.812391
  0.623984	  0.884681	  0.817613
  0.618833	  0.900275	  0.821168
  0.610081	  0.917089	  0.822739
  0.601750	  0.937186	  0.827336
  0.601336	  0.955528	  0.830173
  0.605994	  0.973149	  0.831512
  0.614936	  0.989531	  0.834015
  0.623630	  1.008451	  0.838608
  0.633135	  1.025643	  0.844149
  0.636174	  1.037053	  0.846978
  0.638979	  1.049022	  0.849493
  0.649497	  1.068539	  0.852714
  0.656463	  1.078480	  0.853810
  0.677041	  1.079120	  0.859639
  0.705524	  1.080157	  0.870515
  0.719003	  1.083473	  0.875046
  0.733548	  1.089225	  0.880141
  0.757431	  1.088914	  0.884904
  0.776256	  1.083641	  0.889928
  0.795332	  1.081155	  0.895299
  0.814787	  1.079810	  0.899727
  0.835099	  1.080869	  0.900875
  0.856666	  1.082447	  0.899961
  0.879713	  1.081670	  0.898269
  0.897017	  1.076437	  0.897428
  0.917080	  1.062871	  0.905713
  0.941774	  1.042762	  0.914426
  0.956431	  1.030720	  0.918822
  0.978472	  1.025190	  0.914499
  0.995119	  1.024078	  0.910483
  1.016541	  1.026781	  0.904106
  1.034553	  1.029837	  0.898401
  1.055394	  1.035637	  0.891961
  1.078520	  1.040610	  0.886449
  1.097853	  1.047425	  0.881461
  1.115976	  1.054317	  0.877669
  1.134545	  1.061139	  0.873766
  1.152861	  1.068801	  0.869600
  1.170581	  1.076693	  0.865789
  1.188843	  1.085260	  0.860967
  1.206952	  1.096038	  0.855038
  1.226195	  1.106346	  0.849748
  1.242505	  1.117208	  0.844048
  1.258182	  1.127887	  0.837796
  1.273191	  1.138873	  0.830398
  1.288401	  1.149951	  0.823307
  1.303478	  1.161385	  0.815683
  1.318104	  1.174664	  0.808030
  1.333247	  1.189027	  0.800794
  1.346331	  1.202659	  0.793315
  1.358118	  1.212407	  0.785097
  1.373554	  1.222711	  0.775788
  1.388485	  1.238651	  0.769380
  1.405442	  1.261016	  0.761660
  1.414923	  1.275657	  0.750840
  1.423404	  1.293733	  0.737300
  1.427495	  1.306427	  0.728703
  1.426297	  1.318704	  0.711265
  1.429666	  1.325433	  0.689991
  1.436778	  1.330637	  0.668485
  1.441968	  1.335133	  0.648877
  1.446421	  1.340035	  0.630345
  1.450530	  1.341978	  0.613659
  1.453534	  1.343165	  0.598736
  1.457943	  1.342661	  0.580339
  1.464278	  1.340782	  0.561317
  1.472478	  1.338711	  0.544432
  1.481712	  1.336635	  0.531385
  1.488423	  1.335148	  0.520414
  1.498340	  1.333517	  0.506129
  1.512529	  1.331540	  0.492017
  1.527087	  1.331238	  0.477154
  1.540113	  1.331677	  0.462669
  1.549759	  1.331970	  0.449216
  1.549247	  1.347233	  0.435991
  1.551060	  1.355350	  0.428220
  1.556406	  1.371437	  0.414209
  1.566440	  1.386838	  0.399306
  1.576089	  1.401779	  0.384843
  1.581192	  1.415947	  0.372412
  1.582386	  1.433463	  0.361021
  1.581047	  1.452199	  0.351024
  1.578852	  1.470355	  0.342493
  1.577990	  1.487524	  0.334760
  1.578084	  1.503053	  0.327551
  1.580536	  1.517554	  0.321369
  1.583199	  1.531969	  0.314387
  1.587409	  1.544678	  0.307750
  1.592304	  1.558700	  0.301253
  1.599265	  1.573899	  0.293654
  1.607839	  1.589061	  0.287474
  1.618370	  1.604097	  0.281467
  1.630626	  1.620476	  0.276123
  1.642353	  1.637186	  0.271360
  1.652677	  1.654382	  0.267458
  1.664568	  1.672411	  0.262685
  1.673210	  1.690030	  0.258727
  1.684301	  1.706622	  0.254498
  1.694730	  1.723690	  0.250646
  1.702947	  1.741625	  0.246973
  1.710506	  1.760036	  0.243186
  1.713698	  1.782039	  0.240633
  1.703139	  1.809670	  0.242255
  1.711944	  1.826974	  0.237451
