  1.668839	 -1.703799	 -0.412557
  1.684541	 -1.722463	 -0.399270
  1.673291	 -1.709118	 -0.408825
  1.662779	 -1.696794	 -0.419204
  1.652663	 -1.685217	 -0.433268
  1.643333	 -1.672860	 -0.448154
  1.630741	 -1.655012	 -0.452790
  1.620062	 -1.640151	 -0.459330
  1.609947	 -1.626712	 -0.471531
  1.600575	 -1.614414	 -0.478824
  1.589236	 -1.599267	 -0.487943
  1.578990	 -1.584687	 -0.498045
  1.569171	 -1.571108	 -0.508799
  1.559125	 -1.557538	 -0.520349
  1.548869	 -1.544923	 -0.531418
  1.539110	 -1.529903	 -0.541411
  1.530539	 -1.513665	 -0.551995
  1.522636	 -1.496404	 -0.558805
  1.513520	 -1.482171	 -0.564120
  1.501697	 -1.465847	 -0.574323
  1.492353	 -1.451091	 -0.582390
  1.482015	 -1.438245	 -0.590928
  1.470330	 -1.425825	 -0.603499
  1.460079	 -1.410973	 -0.613176
  1.449588	 -1.398230	 -0.622192
  1.438022	 -1.385600	 -0.632877
  1.426780	 -1.373401	 -0.644632
  1.415796	 -1.361486	 -0.656433
  1.404642	 -1.349160	 -0.667434
  1.393275	 -1.337383	 -0.679064
  1.383459	 -1.325598	 -0.691659
  1.375592	 -1.309272	 -0.704604
  1.369565	 -1.293705	 -0.713580
  1.359388	 -1.279082	 -0.720572
  1.347972	 -1.262807	 -0.731999
  1.341197	 -1.247691	 -0.741965
  1.336131	 -1.230955	 -0.750311
  1.327990	 -1.216560	 -0.760021
  1.318743	 -1.200078	 -0.771238
  1.316779	 -1.180571	 -0.780040
  1.312460	 -1.166910	 -0.790925
  1.305194	 -1.154365	 -0.805971
  1.298763	 -1.138892	 -0.817329
  1.293923	 -1.118507	 -0.824722
  1.287998	 -1.104388	 -0.835595
  1.279522	 -1.089761	 -0.844446
  1.272158	 -1.072059	 -0.856321
  1.268043	 -1.055168	 -0.864854
  1.261851	 -1.039049	 -0.872314
  1.253146	 -1.023566	 -0.884311
  1.247327	 -1.007452	 -0.894398
  1.240598	 -0.990472	 -0.900896
  1.232866	 -0.973488	 -0.909587
  1.224927	 -0.957998	 -0.919236
  1.217393	 -0.941824	 -0.926875
  1.211754	 -0.924456	 -0.935449
  1.203282	 -0.908529	 -0.950021
  1.192162	 -0.896528	 -0.958442
  1.177980	 -0.882367	 -0.961424
  1.161771	 -0.866886	 -0.970953
  1.157056	 -0.853487	 -0.985270
  1.151756	 -0.838836	 -0.994261
  1.140795	 -0.822298	 -1.006080
  1.127322	 -0.809518	 -1.009624
  1.115749	 -0.794791	 -1.017408
  1.103410	 -0.781031	 -1.026670
  1.088534	 -0.768438	 -1.032855
  1.074541	 -0.756183	 -1.037437
  1.060225	 -0.743292	 -1.044627
  1.043077	 -0.742694	 -1.054913
  1.025958	 -0.742550	 -1.065253
  1.008839	 -0.742409	 -1.075593
  0.991728	 -0.742267	 -1.085945
  0.975210	 -0.742099	 -1.097196
  0.962252	 -0.741848	 -1.112411
  0.949360	 -0.741591	 -1.127700
  0.936468	 -0.741334	 -1.142988
  0.923631	 -0.741039	 -1.158311
  0.914222	 -0.738394	 -1.175744
  0.907141	 -0.734388	 -1.194013
  0.900094	 -0.730362	 -1.212292
  0.893063	 -0.726314	 -1.230572
  0.886873	 -0.721001	 -1.248831
  0.880868	 -0.715422	 -1.267074
  0.875152	 -0.709486	 -1.285296
  0.870385	 -0.702426	 -1.303390
  0.865636	 -0.695346	 -1.321482
  0.860919	 -0.688264	 -1.339580
  0.857903	 -0.681226	 -1.358055
  0.855146	 -0.674197	 -1.376575
  0.852392	 -0.667167	 -1.395095
  0.849646	 -0.660148	 -1.413620
  0.847632	 -0.653837	 -1.432489
  0.846552	 -0.648451	 -1.451720
  0.845485	 -0.643080	 -1.470956
  0.844418	 -0.637709	 -1.490192
  0.843373	 -0.632340	 -1.509428
  0.843658	 -0.627078	 -1.528684
  0.845629	 -0.621717	 -1.547738
  0.848159	 -0.616407	 -1.567127
  0.851605	 -0.611645	 -1.585907
  0.853330	 -0.607280	 -1.606284
  0.856284	 -0.604303	 -1.625267
  0.858726	 -0.601458	 -1.644322
  0.860010	 -0.596672	 -1.663891
  0.862695	 -0.591984	 -1.683135
  0.865322	 -0.586179	 -1.702128
  0.867467	 -0.579097	 -1.720704
  0.871538	 -0.572038	 -1.739131
  0.876420	 -0.565550	 -1.757422
  0.881877	 -0.561086	 -1.776348
  0.886215	 -0.560485	 -1.796716
  0.888711	 -0.559471	 -1.817763
  0.889065	 -0.552855	 -1.835259
  0.892224	 -0.544856	 -1.854290
  0.896363	 -0.534619	 -1.871052
  0.901720	 -0.525409	 -1.888306
  0.907161	 -0.516835	 -1.905582
  0.909646	 -0.500162	 -1.916299
  0.909324	 -0.480344	 -1.922348
  0.904600	 -0.460831	 -1.921939
  0.901594	 -0.440093	 -1.910357
  0.904393	 -0.420525	 -1.899516
  0.899347	 -0.417306	 -1.874197
  0.889594	 -0.404815	 -1.860533
  0.880570	 -0.400037	 -1.847947
  0.873569	 -0.391389	 -1.827588
  0.869470	 -0.381107	 -1.810384
  0.862216	 -0.371416	 -1.796419
  0.858144	 -0.362768	 -1.776728
  0.849880	 -0.355309	 -1.760247
  0.838193	 -0.345643	 -1.748270
  0.824107	 -0.334699	 -1.734154
  0.818223	 -0.328871	 -1.713971
  0.815901	 -0.325067	 -1.695468
  0.808184	 -0.319102	 -1.677076
  0.794383	 -0.308693	 -1.664192
  0.781991	 -0.299063	 -1.649376
  0.769389	 -0.286981	 -1.639976
  0.757017	 -0.273877	 -1.631402
  0.744063	 -0.262495	 -1.620732
  0.731068	 -0.251293	 -1.610501
  0.717362	 -0.240062	 -1.601062
  0.703281	 -0.229036	 -1.591914
  0.688480	 -0.217275	 -1.586081
  0.675282	 -0.203905	 -1.580550
  0.661565	 -0.190611	 -1.575917
  0.647303	 -0.177534	 -1.570064
  0.632562	 -0.164575	 -1.564785
  0.618236	 -0.151117	 -1.562343
  0.603841	 -0.137658	 -1.564806
  0.588636	 -0.125768	 -1.570624
  0.570945	 -0.111990	 -1.570043
  0.559558	 -0.097595	 -1.569915
  0.551547	 -0.077489	 -1.578276
  0.538743	 -0.063561	 -1.584580
  0.523476	 -0.052275	 -1.588973
  0.516002	 -0.037458	 -1.600967
  0.508100	 -0.021268	 -1.610219
  0.493516	 -0.003714	 -1.613774
  0.489325	  0.012205	 -1.625948
  0.483655	  0.022384	 -1.638199
  0.476943	  0.035178	 -1.654215
  0.469216	  0.047845	 -1.669167
  0.463164	  0.060896	 -1.682882
  0.460547	  0.074516	 -1.697819
  0.463523	  0.086101	 -1.713329
  0.466425	  0.097402	 -1.729877
  0.469633	  0.109526	 -1.745850
  0.471151	  0.123105	 -1.760725
  0.472188	  0.134357	 -1.779009
  0.474795	  0.143949	 -1.795264
  0.480137	  0.152734	 -1.811668
  0.483256	  0.164747	 -1.829321
  0.484640	  0.173324	 -1.846869
  0.488591	  0.182826	 -1.862411
  0.491500	  0.196224	 -1.877563
  0.490392	  0.210068	 -1.894486
  0.491694	  0.218112	 -1.911141
  0.494931	  0.228400	 -1.926797
  0.497380	  0.241271	 -1.943390
  0.498876	  0.253895	 -1.959070
  0.500282	  0.266423	 -1.974597
  0.501687	  0.278951	 -1.990124
  0.503264	  0.291397	 -2.005632
  0.514435	  0.299317	 -2.020138
  0.526545	  0.306584	 -2.034298
  0.538670	  0.313841	 -2.048453
  0.550794	  0.321098	 -2.062607
  0.562918	  0.328355	 -2.076761
  0.575042	  0.335612	 -2.090915
  0.587167	  0.342869	 -2.105069
  0.599291	  0.350126	 -2.119223
  0.611430	  0.357377	 -2.133356
  0.624018	  0.364547	 -2.147008
  0.637328	  0.371147	 -2.160338
  0.651930	  0.370132	 -2.173654
  0.665590	  0.368877	 -2.188687
  0.679081	  0.367449	 -2.203256
  0.692951	  0.367158	 -2.217441
  0.706919	  0.368489	 -2.231773
  0.721952	  0.368216	 -2.244734
  0.735518	  0.366475	 -2.260924
  0.746012	  0.365882	 -2.278487
  0.755684	  0.367935	 -2.295873
  0.765626	  0.370754	 -2.313001
  0.773700	  0.370053	 -2.333678
  0.776184	  0.371089	 -2.349216
  0.779598	  0.373082	 -2.368822
