  0.881721	 -1.240144	  1.993079
  0.882696	 -1.241341	  1.995587
  0.862726	 -1.231727	  1.989196
  0.851090	 -1.219145	  1.967641
  0.847330	 -1.212020	  1.953170
  0.843484	 -1.201993	  1.937800
  0.836793	 -1.190979	  1.913008
  0.833315	 -1.186798	  1.895041
  0.830012	 -1.185169	  1.882217
  0.829782	 -1.176262	  1.862196
  0.827224	 -1.158204	  1.843860
  0.820408	 -1.149405	  1.825796
  0.813207	 -1.148197	  1.808988
  0.804933	 -1.146278	  1.790202
  0.797658	 -1.139612	  1.771881
  0.791596	 -1.133619	  1.753831
  0.785020	 -1.127541	  1.735915
  0.778167	 -1.121367	  1.718151
  0.771064	 -1.114895	  1.700607
  0.763758	 -1.108164	  1.683248
  0.756442	 -1.101418	  1.665900
  0.749252	 -1.094075	  1.648742
  0.742280	 -1.085776	  1.631934
  0.735310	 -1.077474	  1.615127
  0.728344	 -1.069099	  1.598355
  0.721740	 -1.058762	  1.582560
  0.715132	 -1.048409	  1.566775
  0.708470	 -1.037990	  1.551092
  0.701450	 -1.025882	  1.536823
  0.694078	 -1.013000	  1.523341
  0.687370	 -1.001134	  1.508677
  0.681811	 -0.988763	  1.495902
  0.677147	 -0.971425	  1.484212
  0.676768	 -0.954582	  1.470275
  0.676307	 -0.942504	  1.447269
  0.666416	 -0.936669	  1.428244
  0.649745	 -0.935678	  1.413381
  0.634801	 -0.933200	  1.398697
  0.626660	 -0.924137	  1.381904
  0.623209	 -0.913528	  1.367260
  0.619775	 -0.900990	  1.349881
  0.611539	 -0.892231	  1.333122
  0.602720	 -0.887304	  1.318928
  0.589030	 -0.882919	  1.302292
  0.578965	 -0.871499	  1.283313
  0.574435	 -0.862959	  1.269284
  0.572765	 -0.855039	  1.254008
  0.571551	 -0.838213	  1.231237
  0.574092	 -0.825627	  1.213113
  0.574367	 -0.814456	  1.201188
  0.570309	 -0.799071	  1.184017
  0.560490	 -0.783956	  1.165749
  0.554741	 -0.776873	  1.160199
  0.547632	 -0.766202	  1.145790
  0.535973	 -0.748008	  1.130046
  0.524257	 -0.731530	  1.112232
  0.515063	 -0.727370	  1.099126
  0.502964	 -0.727434	  1.080440
  0.493304	 -0.726844	  1.067319
  0.484198	 -0.723808	  1.045930
  0.473959	 -0.717754	  1.025808
  0.468726	 -0.713155	  1.014190
  0.464559	 -0.703182	  0.992004
  0.455590	 -0.697722	  0.965621
  0.453474	 -0.696728	  0.958680
  0.448869	 -0.690499	  0.937898
  0.439926	 -0.683312	  0.917480
  0.426998	 -0.681373	  0.900780
  0.418063	 -0.679201	  0.885262
  0.411952	 -0.673062	  0.866608
  0.405310	 -0.665527	  0.848001
  0.399135	 -0.659504	  0.833814
  0.389144	 -0.653522	  0.812997
  0.379102	 -0.647233	  0.789148
  0.372552	 -0.644415	  0.775673
  0.368815	 -0.642375	  0.766161
  0.366301	 -0.639162	  0.744536
  0.360089	 -0.638534	  0.711540
  0.354238	 -0.636438	  0.695136
  0.347866	 -0.631830	  0.681255
  0.332708	 -0.619624	  0.661327
  0.325242	 -0.614987	  0.648923
  0.316808	 -0.610630	  0.631358
  0.307770	 -0.604957	  0.612303
  0.289688	 -0.591632	  0.597221
  0.270436	 -0.576133	  0.588376
  0.262150	 -0.567354	  0.578769
  0.256603	 -0.559337	  0.562763
  0.253212	 -0.554181	  0.542116
  0.246674	 -0.548451	  0.524046
  0.234639	 -0.537003	  0.508750
  0.223358	 -0.525766	  0.499993
  0.211916	 -0.514957	  0.488763
  0.202889	 -0.502544	  0.465967
  0.193480	 -0.493431	  0.442684
  0.193381	 -0.488027	  0.437493
  0.190240	 -0.474517	  0.419147
  0.187502	 -0.455025	  0.403260
  0.185991	 -0.438034	  0.393261
  0.184067	 -0.418752	  0.380002
  0.173330	 -0.403868	  0.362603
  0.163204	 -0.397348	  0.350764
  0.141679	 -0.391029	  0.336988
  0.128086	 -0.388335	  0.324531
  0.114111	 -0.390025	  0.306696
  0.098541	 -0.385674	  0.287908
  0.087665	 -0.375488	  0.275445
  0.077914	 -0.362448	  0.265179
  0.068982	 -0.349724	  0.251976
  0.060673	 -0.339429	  0.238389
  0.050477	 -0.333909	  0.224968
  0.028458	 -0.323015	  0.201338
  0.021860	 -0.317882	  0.193745
  0.012742	 -0.313922	  0.183166
  0.005287	 -0.308139	  0.163887
 -0.011162	 -0.299890	  0.147147
 -0.028673	 -0.294419	  0.129943
 -0.037917	 -0.286152	  0.109451
 -0.040100	 -0.271881	  0.088635
 -0.039102	 -0.264029	  0.079940
 -0.042838	 -0.256847	  0.065408
 -0.048125	 -0.243287	  0.039319
 -0.050645	 -0.235402	  0.028578
 -0.055689	 -0.228955	  0.015349
 -0.064053	 -0.216677	 -0.009473
 -0.065353	 -0.199648	 -0.026522
 -0.063698	 -0.188344	 -0.036389
 -0.064871	 -0.176534	 -0.044368
 -0.078645	 -0.159435	 -0.070148
 -0.087367	 -0.148130	 -0.090668
 -0.089578	 -0.144410	 -0.096617
 -0.096022	 -0.135289	 -0.114535
 -0.103907	 -0.124994	 -0.133592
 -0.111275	 -0.116078	 -0.147403
 -0.122474	 -0.104614	 -0.163027
 -0.132151	 -0.095212	 -0.176987
 -0.137995	 -0.088906	 -0.187033
 -0.149479	 -0.074988	 -0.213739
 -0.154767	 -0.066560	 -0.229022
 -0.158825	 -0.061447	 -0.236594
 -0.168681	 -0.048910	 -0.253779
 -0.181407	 -0.034067	 -0.275265
 -0.182216	 -0.026695	 -0.283084
 -0.181905	 -0.015675	 -0.297155
 -0.185348	 -0.005640	 -0.312284
 -0.190691	  0.012013	 -0.339251
 -0.199398	  0.025611	 -0.354576
 -0.212518	  0.034842	 -0.372728
 -0.213738	  0.041248	 -0.377445
 -0.219800	  0.048205	 -0.398678
 -0.237740	  0.055665	 -0.426721
 -0.245934	  0.057439	 -0.432867
 -0.252901	  0.060121	 -0.451724
 -0.267620	  0.062992	 -0.477332
 -0.270783	  0.065535	 -0.488385
 -0.283748	  0.072273	 -0.504302
 -0.294816	  0.078188	 -0.521944
 -0.306892	  0.082639	 -0.537641
 -0.321304	  0.091510	 -0.550837
 -0.338026	  0.098608	 -0.565311
 -0.347497	  0.102686	 -0.574128
 -0.365578	  0.111088	 -0.587122
 -0.383437	  0.120455	 -0.606807
 -0.391896	  0.122782	 -0.618378
 -0.397473	  0.125019	 -0.627768
 -0.408414	  0.129326	 -0.651100
 -0.418622	  0.134390	 -0.668298
 -0.425568	  0.139271	 -0.685855
 -0.432660	  0.144659	 -0.706706
 -0.440219	  0.147604	 -0.723533
 -0.450198	  0.149032	 -0.743753
 -0.463012	  0.154321	 -0.761922
 -0.475020	  0.162257	 -0.775642
 -0.490901	  0.173032	 -0.785117
 -0.509474	  0.182618	 -0.790739
 -0.524144	  0.190191	 -0.800201
 -0.538541	  0.197141	 -0.816648
 -0.553144	  0.205940	 -0.832764
 -0.564018	  0.215672	 -0.846786
 -0.572485	  0.222005	 -0.853890
 -0.586973	  0.234933	 -0.867500
 -0.599587	  0.248747	 -0.880016
 -0.610435	  0.256854	 -0.891612
 -0.621798	  0.266708	 -0.905096
 -0.632441	  0.274170	 -0.920589
 -0.641513	  0.280327	 -0.933992
 -0.653941	  0.289016	 -0.947623
 -0.670500	  0.301247	 -0.966624
 -0.678051	  0.308848	 -0.978146
 -0.686255	  0.317295	 -0.989150
 -0.703035	  0.332902	 -1.008553
 -0.713271	  0.341516	 -1.020842
 -0.720465	  0.347512	 -1.030821
 -0.732195	  0.357312	 -1.045998
 -0.740478	  0.364456	 -1.063077
 -0.751081	  0.372864	 -1.078804
 -0.761843	  0.378421	 -1.096392
 -0.773405	  0.384634	 -1.108426
 -0.779444	  0.386428	 -1.119176
 -0.787901	  0.394174	 -1.137789
 -0.795791	  0.404751	 -1.154344
 -0.801452	  0.413975	 -1.162214
 -0.807301	  0.430303	 -1.174052
 -0.817119	  0.449286	 -1.189534
 -0.830249	  0.460300	 -1.203295
 -0.840135	  0.467232	 -1.221772
 -0.848851	  0.468075	 -1.241661
 -0.855529	  0.468147	 -1.255616
 -0.861216	  0.469877	 -1.269447
 -0.862340	  0.470213	 -1.291580
 -0.862288	  0.466750	 -1.313964
 -0.865519	  0.462266	 -1.335106
 -0.875343	  0.460755	 -1.356005
 -0.887005	  0.464649	 -1.372932
 -0.898790	  0.479037	 -1.397451
 -0.902194	  0.491133	 -1.416027
 -0.902074	  0.496101	 -1.425854
 -0.899635	  0.506131	 -1.444984
 -0.899667	  0.516989	 -1.465649
 -0.901421	  0.526662	 -1.485039
 -0.903044	  0.533257	 -1.498406
 -0.903350	  0.539110	 -1.517694
 -0.905313	  0.544490	 -1.537388
 -0.907337	  0.551860	 -1.555916
 -0.909297	  0.559060	 -1.572554
 -0.912915	  0.568948	 -1.591281
 -0.916436	  0.580583	 -1.611257
 -0.918723	  0.589047	 -1.629271
 -0.923934	  0.595456	 -1.643352
 -0.934472	  0.603399	 -1.662592
 -0.942636	  0.613687	 -1.678481
 -0.944506	  0.623492	 -1.696671
 -0.941086	  0.628961	 -1.719744
 -0.938526	  0.631260	 -1.736079
 -0.936791	  0.637985	 -1.758324
 -0.939012	  0.643212	 -1.774377
 -0.944307	  0.647886	 -1.790106
 -0.953290	  0.653582	 -1.812980
 -0.956203	  0.668059	 -1.835746
 -0.955845	  0.681597	 -1.849172
 -0.953822	  0.693783	 -1.863849
 -0.952928	  0.705324	 -1.882067
 -0.954911	  0.711714	 -1.894954
 -0.959137	  0.717614	 -1.916064
 -0.966564	  0.730527	 -1.942267
 -0.970338	  0.739105	 -1.949601
 -0.975049	  0.754943	 -1.964619
 -0.979406	  0.771865	 -1.981770
 -0.980397	  0.778485	 -1.994665
 -0.980615	  0.784048	 -2.013201
 -0.982014	  0.789727	 -2.037059
 -0.984231	  0.798254	 -2.058920
 -0.984577	  0.808903	 -2.075935
 -0.985641	  0.819376	 -2.086374
 -0.986827	  0.835776	 -2.102117
 -0.990738	  0.849547	 -2.115061
 -0.994418	  0.861559	 -2.129170
 -0.999535	  0.871569	 -2.149646
 -1.004246	  0.881344	 -2.166446
