 -1.637571	 -1.097700	 -1.598953
 -1.661266	 -1.118916	 -1.584552
 -1.647693	 -1.106762	 -1.592802
 -1.634219	 -1.094687	 -1.601290
 -1.623661	 -1.084877	 -1.615140
 -1.613136	 -1.075097	 -1.629055
 -1.602614	 -1.065327	 -1.642975
 -1.593040	 -1.058894	 -1.659310
 -1.585137	 -1.056780	 -1.677559
 -1.577240	 -1.054678	 -1.695813
 -1.569338	 -1.052575	 -1.714077
 -1.561244	 -1.050498	 -1.732921
 -1.552587	 -1.050849	 -1.756707
 -1.546002	 -1.051644	 -1.775575
