  1.775529	 -1.753295	  1.718824
  1.757950	 -1.735935	  1.701806
  1.718774	 -1.730173	  1.674784
  1.674760	 -1.729317	  1.654118
  1.640366	 -1.730103	  1.618746
  1.600560	 -1.723809	  1.589970
  1.559677	 -1.717240	  1.563280
  1.519580	 -1.714239	  1.534520
  1.477314	 -1.712132	  1.507137
  1.433278	 -1.720471	  1.481377
  1.388888	 -1.730477	  1.457016
  1.346289	 -1.739622	  1.431348
  1.305327	 -1.748558	  1.404094
  1.265682	 -1.757521	  1.374966
  1.227370	 -1.766163	  1.344256
  1.189520	 -1.773392	  1.312208
  1.151312	 -1.777957	  1.279306
  1.112978	 -1.780024	  1.246064
  1.073304	 -1.779790	  1.213089
  1.031559	 -1.777268	  1.182296
  0.988918	 -1.772141	  1.154384
  0.945471	 -1.764592	  1.129392
  0.900464	 -1.757242	  1.107661
  0.855003	 -1.752180	  1.087293
  0.809997	 -1.750656	  1.065564
  0.766312	 -1.751527	  1.041263
  0.724538	 -1.753820	  1.014678
  0.683688	 -1.757054	  0.985893
  0.643379	 -1.761412	  0.956457
  0.603088	 -1.766363	  0.927161
  0.562890	 -1.771510	  0.898268
  0.522626	 -1.777122	  0.869820
  0.480772	 -1.784292	  0.841728
  0.439069	 -1.794215	  0.815339
  0.399749	 -1.808221	  0.791360
  0.357736	 -1.831158	  0.765757
  0.306419	 -1.877765	  0.731972
  0.261089	 -1.957023	  0.681130
  0.234454	 -2.040344	  0.622525
  0.213393	 -2.095011	  0.574460
  0.191100	 -2.117611	  0.541089
  0.168257	 -2.120248	  0.518112
  0.141649	 -2.106531	  0.500221
  0.100241	 -2.066241	  0.484312
  0.040337	 -1.991524	  0.469805
 -0.031367	 -1.910104	  0.457273
 -0.095052	 -1.853016	  0.441323
 -0.142134	 -1.824096	  0.422314
 -0.183033	 -1.813272	  0.399045
 -0.224218	 -1.814485	  0.372307
 -0.263397	 -1.825790	  0.347351
 -0.296068	 -1.845925	  0.327152
 -0.317456	 -1.868346	  0.314358
 -0.327750	 -1.886957	  0.308300
 -0.335461	 -1.914949	  0.303995
 -0.349976	 -1.994302	  0.300209
 -0.394275	 -2.124082	  0.287116
 -0.474495	 -2.249123	  0.247620
 -0.558370	 -2.328965	  0.185336
 -0.632947	 -2.362978	  0.128042
 -0.689872	 -2.370842	  0.084810
 -0.727292	 -2.369284	  0.055024
 -0.757240	 -2.366766	  0.028457
 -0.796121	 -2.363874	 -0.008850
 -0.845959	 -2.356320	 -0.051750
 -0.904562	 -2.337067	 -0.082828
 -0.957756	 -2.299132	 -0.106920
 -0.993213	 -2.250496	 -0.139387
 -1.049462	 -2.217938	 -0.150439
 -1.108537	 -2.193613	 -0.155040
 -1.140176	 -2.161648	 -0.193764
 -1.166393	 -2.087964	 -0.187777
 -1.203007	 -2.003735	 -0.192894
 -1.249462	 -1.933436	 -0.222520
 -1.298291	 -1.889928	 -0.259308
 -1.342420	 -1.866992	 -0.295268
 -1.379558	 -1.852020	 -0.330423
 -1.414239	 -1.841027	 -0.366061
 -1.449342	 -1.833111	 -0.401366
 -1.486265	 -1.827737	 -0.435705
 -1.524820	 -1.824858	 -0.468402
 -1.565144	 -1.825398	 -0.498534
 -1.606724	 -1.827354	 -0.527114
 -1.648853	 -1.829784	 -0.555383
 -1.690940	 -1.832604	 -0.583709
 -1.731664	 -1.835997	 -0.611941
 -1.771141	 -1.840154	 -0.641084
 -1.810392	 -1.845530	 -0.670511
 -1.852943	 -1.851109	 -0.695840
 -1.898640	 -1.854895	 -0.719192
 -1.942679	 -1.861361	 -0.744321
 -1.983883	 -1.872671	 -0.769891
 -2.024779	 -1.873553	 -0.797347
 -2.067152	 -1.880099	 -0.824645
 -2.112819	 -1.884654	 -0.851105
 -2.157217	 -1.888433	 -0.883310
 -2.178789	 -1.907317	 -0.892143
