 -1.358282	  1.273634	  1.555024
 -1.373813	  1.313735	  1.548528
 -1.362185	  1.283714	  1.553391
 -1.335191	  1.218676	  1.556430
 -1.309713	  1.167530	  1.556006
 -1.273719	  1.112578	  1.553665
 -1.225257	  1.058037	  1.543063
 -1.148997	  1.003575	  1.500086
 -1.017397	  0.957495	  1.404835
 -0.862743	  0.887837	  1.358089
 -0.774702	  0.800765	  1.399965
 -0.744415	  0.742993	  1.443001
 -0.731203	  0.699905	  1.479390
 -0.723187	  0.660750	  1.514097
 -0.717152	  0.623439	  1.547329
 -0.712677	  0.587649	  1.577964
 -0.708190	  0.550401	  1.607785
 -0.702245	  0.511024	  1.638342
 -0.695749	  0.473631	  1.667189
 -0.688949	  0.437622	  1.694933
 -0.680138	  0.400669	  1.723239
 -0.670394	  0.360490	  1.754421
 -0.661801	  0.322004	  1.785244
 -0.654378	  0.282471	  1.817791
 -0.647970	  0.246449	  1.847533
 -0.639588	  0.209427	  1.872538
 -0.623319	  0.169281	  1.903355
 -0.610663	  0.138274	  1.949469
 -0.600325	  0.109266	  1.990012
 -0.592914	  0.078275	  2.026130
 -0.582541	  0.043292	  2.055248
 -0.570812	  0.003720	  2.080865
 -0.559649	 -0.035451	  2.109254
 -0.550624	 -0.076060	  2.140961
 -0.543541	 -0.117050	  2.170685
 -0.534272	 -0.155333	  2.199104
 -0.522799	 -0.191848	  2.227963
 -0.510342	 -0.228736	  2.257769
 -0.498579	 -0.268336	  2.287619
 -0.488574	 -0.309379	  2.315658
 -0.479745	 -0.349024	  2.341805
 -0.465972	 -0.412842	  2.384180
 -0.462501	 -0.429503	  2.395339
