 -0.479783	 -1.513199	 -1.878481
 -0.485000	 -1.546944	 -1.912213
 -0.506807	 -1.549602	 -1.939748
 -0.519096	 -1.536461	 -1.952787
 -0.523251	 -1.515200	 -1.961154
 -0.524597	 -1.490820	 -1.969420
 -0.529228	 -1.475789	 -1.975534
 -0.536466	 -1.453328	 -1.983893
 -0.538298	 -1.432160	 -1.992184
 -0.536945	 -1.419537	 -1.997974
 -0.535263	 -1.395449	 -2.005780
 -0.538735	 -1.376450	 -2.011465
 -0.544502	 -1.357326	 -2.016996
 -0.544284	 -1.334290	 -2.021417
 -0.542756	 -1.318899	 -2.025771
 -0.538380	 -1.295355	 -2.032917
 -0.536991	 -1.275820	 -2.036877
 -0.538741	 -1.260075	 -2.039696
 -0.541293	 -1.227100	 -2.044473
 -0.537021	 -1.211479	 -2.045312
 -0.529216	 -1.198020	 -2.043350
 -0.518562	 -1.175912	 -2.044200
 -0.512139	 -1.152576	 -2.050194
 -0.507172	 -1.134086	 -2.052240
 -0.499940	 -1.116961	 -2.050034
 -0.491527	 -1.098148	 -2.046178
 -0.481705	 -1.079814	 -2.041502
 -0.471834	 -1.059966	 -2.038994
 -0.461420	 -1.041602	 -2.034971
 -0.451881	 -1.024333	 -2.032560
 -0.441102	 -1.009205	 -2.028703
 -0.429005	 -0.993482	 -2.021733
 -0.418209	 -0.978849	 -2.009835
 -0.409290	 -0.964980	 -1.995339
 -0.400976	 -0.949752	 -1.983408
 -0.392219	 -0.933198	 -1.973712
 -0.384603	 -0.918564	 -1.967809
 -0.370256	 -0.906814	 -1.958460
 -0.350561	 -0.898827	 -1.947254
 -0.335358	 -0.892411	 -1.937933
 -0.321073	 -0.885778	 -1.928149
 -0.308664	 -0.877427	 -1.916687
 -0.295750	 -0.867490	 -1.904955
 -0.279711	 -0.855174	 -1.888809
 -0.265776	 -0.846238	 -1.876400
 -0.249076	 -0.835994	 -1.864242
 -0.241871	 -0.831055	 -1.855409
 -0.228461	 -0.824711	 -1.841104
 -0.211364	 -0.818194	 -1.828291
 -0.194941	 -0.811989	 -1.817889
 -0.178440	 -0.807699	 -1.807848
 -0.162773	 -0.803471	 -1.797608
 -0.146817	 -0.798500	 -1.785806
 -0.132414	 -0.791289	 -1.775118
 -0.111340	 -0.783839	 -1.756574
 -0.098398	 -0.780150	 -1.743988
 -0.089765	 -0.775388	 -1.733817
 -0.078975	 -0.768349	 -1.717911
 -0.067035	 -0.754040	 -1.702462
 -0.060289	 -0.746288	 -1.691863
 -0.049783	 -0.744136	 -1.669187
 -0.032754	 -0.741272	 -1.640209
 -0.026911	 -0.739703	 -1.635178
 -0.013822	 -0.731876	 -1.620570
  0.000230	 -0.705590	 -1.601602
  0.006215	 -0.698613	 -1.590389
  0.013300	 -0.694619	 -1.571488
  0.023616	 -0.695912	 -1.553231
  0.036970	 -0.694606	 -1.534345
  0.045111	 -0.694408	 -1.525342
  0.056398	 -0.693362	 -1.504598
  0.065117	 -0.684097	 -1.484941
  0.068003	 -0.674678	 -1.468485
  0.072001	 -0.666321	 -1.449474
  0.080984	 -0.659908	 -1.430978
  0.089531	 -0.654965	 -1.415536
  0.095935	 -0.650952	 -1.396071
  0.102115	 -0.643888	 -1.376294
  0.107588	 -0.635580	 -1.361348
  0.111499	 -0.628519	 -1.342080
  0.115115	 -0.619846	 -1.323507
  0.118400	 -0.610957	 -1.309051
  0.122195	 -0.599908	 -1.289598
  0.124884	 -0.590027	 -1.269624
  0.129143	 -0.577302	 -1.257522
  0.133252	 -0.564207	 -1.246742
  0.136546	 -0.547123	 -1.228657
  0.134632	 -0.537660	 -1.209443
  0.131319	 -0.532420	 -1.195191
  0.130449	 -0.525289	 -1.177774
  0.125721	 -0.514216	 -1.147651
  0.122189	 -0.506072	 -1.130978
  0.120851	 -0.502070	 -1.120934
  0.119933	 -0.497737	 -1.099910
  0.116810	 -0.488015	 -1.073203
  0.113505	 -0.481981	 -1.058660
  0.110825	 -0.475960	 -1.047087
  0.109656	 -0.467901	 -1.026476
  0.106052	 -0.460611	 -1.009055
  0.095537	 -0.448393	 -0.988492
  0.087833	 -0.438133	 -0.971305
  0.084295	 -0.427505	 -0.957451
  0.082050	 -0.419850	 -0.944144
  0.079413	 -0.405153	 -0.925827
  0.074626	 -0.389849	 -0.907812
  0.071840	 -0.379339	 -0.897473
  0.070534	 -0.368872	 -0.886169
  0.067798	 -0.351315	 -0.870334
  0.062676	 -0.335762	 -0.859216
  0.054935	 -0.318840	 -0.846558
  0.047454	 -0.299408	 -0.830552
  0.043493	 -0.288602	 -0.820718
  0.039248	 -0.279324	 -0.810519
  0.029554	 -0.264398	 -0.792565
  0.025089	 -0.255953	 -0.778038
  0.015113	 -0.248999	 -0.760915
 -0.001156	 -0.228346	 -0.739538
 -0.005650	 -0.219643	 -0.733659
 -0.007324	 -0.207894	 -0.726236
 -0.006662	 -0.189159	 -0.712284
 -0.007841	 -0.174758	 -0.696294
 -0.007943	 -0.156990	 -0.675521
 -0.008747	 -0.146855	 -0.664644
 -0.008807	 -0.137548	 -0.652947
 -0.010628	 -0.125675	 -0.638010
 -0.012741	 -0.111376	 -0.621287
 -0.012632	 -0.097354	 -0.609795
 -0.009254	 -0.084395	 -0.599357
 -0.004500	 -0.069562	 -0.584626
 -0.001383	 -0.055400	 -0.566735
  0.000077	 -0.041557	 -0.548807
  0.000809	 -0.036194	 -0.542846
  0.001482	 -0.017471	 -0.526238
  0.000398	  0.010592	 -0.512867
  0.000540	  0.021105	 -0.509882
  0.000561	  0.042501	 -0.501960
  0.004423	  0.067887	 -0.494354
  0.005980	  0.077639	 -0.486203
  0.009554	  0.090457	 -0.477135
  0.012593	  0.116423	 -0.457070
  0.010655	  0.134222	 -0.441721
  0.007595	  0.146750	 -0.431871
  0.006137	  0.155439	 -0.420272
  0.006275	  0.167517	 -0.403509
  0.008025	  0.179887	 -0.385130
  0.011146	  0.199984	 -0.370682
  0.010634	  0.216054	 -0.357890
  0.011036	  0.225210	 -0.346860
  0.011352	  0.238047	 -0.335616
  0.011587	  0.250477	 -0.317616
  0.016352	  0.268961	 -0.294334
  0.019135	  0.284013	 -0.281498
  0.020079	  0.293686	 -0.273119
  0.020261	  0.302790	 -0.261815
  0.031806	  0.318706	 -0.237279
  0.039052	  0.334563	 -0.225100
  0.043054	  0.352276	 -0.218240
  0.042633	  0.367617	 -0.210342
  0.040346	  0.380844	 -0.200006
  0.039686	  0.393785	 -0.182451
  0.045250	  0.406342	 -0.163180
  0.049765	  0.424608	 -0.152522
  0.053777	  0.442266	 -0.141288
  0.057835	  0.455316	 -0.131560
  0.061637	  0.473315	 -0.114494
  0.061992	  0.491069	 -0.103863
  0.065699	  0.504514	 -0.096110
  0.068906	  0.527078	 -0.087498
  0.073405	  0.550713	 -0.078817
  0.075988	  0.558678	 -0.072723
  0.081386	  0.570979	 -0.061626
  0.088488	  0.584845	 -0.043713
  0.091983	  0.602525	 -0.027073
  0.092318	  0.613583	 -0.015653
  0.092720	  0.627414	  0.000705
  0.093374	  0.636825	  0.014956
  0.095841	  0.652956	  0.030243
  0.101794	  0.673732	  0.043761
  0.107478	  0.689434	  0.055813
  0.108754	  0.705243	  0.068563
  0.113237	  0.723781	  0.076148
  0.117953	  0.738180	  0.088996
  0.120386	  0.759474	  0.089751
  0.121688	  0.777367	  0.101483
  0.126275	  0.792524	  0.114170
  0.138526	  0.801418	  0.130226
  0.140582	  0.817597	  0.133883
  0.149139	  0.837323	  0.152580
  0.153371	  0.854565	  0.168662
  0.161224	  0.864801	  0.177772
  0.164155	  0.874923	  0.188253
  0.173728	  0.892035	  0.204177
  0.185294	  0.909093	  0.212478
  0.194397	  0.930346	  0.217945
  0.198447	  0.946670	  0.221723
  0.200351	  0.960691	  0.227121
  0.202845	  0.980408	  0.244949
  0.206255	  0.996805	  0.255716
  0.212088	  1.010270	  0.268634
  0.217565	  1.025085	  0.284067
  0.223778	  1.034345	  0.294928
  0.230874	  1.049335	  0.309756
  0.239942	  1.063131	  0.319681
  0.251962	  1.079512	  0.333100
  0.264695	  1.095447	  0.345275
  0.271982	  1.103265	  0.349674
  0.285216	  1.116114	  0.359080
  0.302558	  1.133473	  0.371204
  0.308335	  1.141988	  0.378427
  0.313255	  1.155829	  0.390618
  0.316444	  1.182540	  0.406420
  0.319137	  1.199875	  0.411270
  0.325477	  1.215097	  0.420833
  0.334652	  1.231293	  0.430423
  0.342633	  1.240986	  0.439191
  0.346565	  1.254918	  0.449483
  0.348267	  1.274902	  0.463504
  0.357171	  1.298166	  0.483177
  0.367662	  1.308512	  0.490442
  0.375709	  1.315732	  0.495660
  0.393251	  1.330120	  0.499790
  0.407442	  1.350408	  0.500319
  0.422789	  1.371407	  0.506302
  0.435961	  1.391698	  0.525242
  0.441303	  1.400332	  0.536546
  0.444846	  1.408400	  0.549673
  0.449185	  1.425885	  0.566388
  0.452886	  1.440892	  0.580332
  0.456928	  1.452301	  0.591539
  0.461561	  1.467061	  0.606289
  0.462964	  1.485193	  0.617137
  0.464179	  1.502123	  0.627937
  0.462787	  1.521741	  0.646378
  0.461711	  1.537079	  0.660281
  0.461410	  1.550442	  0.671833
  0.460442	  1.564710	  0.681982
  0.461204	  1.578640	  0.690048
  0.458728	  1.598274	  0.704357
  0.456886	  1.618080	  0.718763
  0.456286	  1.630275	  0.726221
  0.455736	  1.651379	  0.738928
  0.455099	  1.663550	  0.747944
  0.454116	  1.680451	  0.759805
  0.453093	  1.699100	  0.767810
  0.454732	  1.715598	  0.774686
  0.460933	  1.736564	  0.787534
  0.467176	  1.754020	  0.798824
  0.469540	  1.766596	  0.804745
  0.466802	  1.785541	  0.816590
  0.461824	  1.802306	  0.830902
  0.455718	  1.818185	  0.843903
  0.452581	  1.835445	  0.855194
  0.451414	  1.852042	  0.866604
  0.449877	  1.865246	  0.875722
  0.448539	  1.886537	  0.889885
  0.444978	  1.906152	  0.899574
  0.442327	  1.926844	  0.903325
  0.442235	  1.936638	  0.908134
  0.442619	  1.956075	  0.919591
  0.441797	  1.976174	  0.936427
  0.438261	  1.986565	  0.950603
  0.431740	  2.001524	  0.968303
  0.426544	  2.016917	  0.979810
  0.423776	  2.029319	  0.984900
  0.420461	  2.052726	  0.992256
  0.420505	  2.077023	  1.001538
  0.425197	  2.093404	  1.007242
  0.429323	  2.114411	  1.018715
  0.429683	  2.127270	  1.030101
  0.426815	  2.137604	  1.042643
  0.425834	  2.156975	  1.056011
  0.429367	  2.173136	  1.064182
  0.433244	  2.187588	  1.078125
  0.434255	  2.205015	  1.098352
  0.429282	  2.202265	  1.134294
  0.432265	  2.218139	  1.146089
