  1.067853	 -0.020576	 -2.242596
  1.067865	 -0.020585	 -2.242620
  1.059359	 -0.014091	 -2.225724
  1.050855	 -0.007606	 -2.208823
  1.042478	 -0.001248	 -2.191812
  1.034225	  0.004984	 -2.174693
  1.025995	  0.011119	 -2.157535
  1.017583	  0.017731	 -2.140607
  1.009002	  0.025166	 -2.124122
  1.000293	  0.032915	 -2.107900
  0.991119	  0.041626	 -2.092387
  0.981951	  0.050324	 -2.076885
  0.972474	  0.059380	 -2.061780
  0.962166	  0.069429	 -2.047931
  0.951931	  0.080250	 -2.034902
  0.940935	  0.091626	 -2.021587
  0.930140	  0.101358	 -2.007918
  0.919747	  0.110001	 -1.994141
  0.908242	  0.120247	 -1.980773
  0.894721	  0.130584	 -1.968361
  0.882049	  0.139555	 -1.954698
  0.875377	  0.142336	 -1.934067
  0.867828	  0.142347	 -1.914544
  0.854402	  0.149750	 -1.900714
  0.842083	  0.156263	 -1.886419
  0.829558	  0.160919	 -1.869988
  0.818575	  0.158972	 -1.854490
  0.807295	  0.162066	 -1.836433
  0.796694	  0.160993	 -1.819498
  0.786669	  0.155158	 -1.804682
  0.777822	  0.148211	 -1.785617
  0.767372	  0.145799	 -1.767935
  0.756943	  0.143992	 -1.753946
  0.746405	  0.137090	 -1.736772
  0.731068	  0.131847	 -1.723904
  0.718621	  0.122737	 -1.712355
  0.705424	  0.108328	 -1.700427
  0.692316	  0.102872	 -1.688080
  0.678723	  0.095318	 -1.675468
  0.668372	  0.087457	 -1.662203
  0.656061	  0.076746	 -1.648054
  0.645023	  0.062735	 -1.638664
  0.635956	  0.048890	 -1.628519
  0.629609	  0.035044	 -1.615785
  0.617617	  0.021836	 -1.603496
  0.607727	  0.007538	 -1.596176
  0.603342	 -0.009004	 -1.582494
  0.596350	 -0.024743	 -1.571369
  0.583784	 -0.037692	 -1.560229
  0.578899	 -0.051341	 -1.549099
  0.574456	 -0.063947	 -1.532408
  0.567593	 -0.072218	 -1.517457
  0.558087	 -0.079416	 -1.500253
  0.548613	 -0.088825	 -1.484542
  0.539511	 -0.095839	 -1.467692
  0.531506	 -0.096773	 -1.448414
  0.524584	 -0.094279	 -1.428648
  0.516013	 -0.089609	 -1.412418
  0.506665	 -0.083338	 -1.395105
  0.497931	 -0.076376	 -1.378826
  0.491218	 -0.069357	 -1.360621
  0.485908	 -0.062414	 -1.342768
  0.480600	 -0.049929	 -1.325964
  0.478929	 -0.036876	 -1.312452
  0.471920	 -0.020407	 -1.298249
  0.464157	 -0.009372	 -1.283931
  0.455380	  0.001249	 -1.268811
  0.452248	  0.015564	 -1.256912
  0.448338	  0.030480	 -1.243217
  0.444543	  0.046731	 -1.231503
  0.438887	  0.059405	 -1.216011
  0.432847	  0.069489	 -1.198524
  0.431925	  0.080549	 -1.181733
  0.431153	  0.094978	 -1.166486
  0.431935	  0.110765	 -1.156360
  0.430101	  0.130215	 -1.147116
  0.426088	  0.149830	 -1.139337
  0.425713	  0.166005	 -1.125244
  0.427099	  0.176312	 -1.111239
  0.428706	  0.192646	 -1.097586
  0.431170	  0.209130	 -1.086414
  0.426643	  0.224137	 -1.071050
  0.421901	  0.239724	 -1.059146
  0.417927	  0.256090	 -1.046372
  0.410292	  0.266543	 -1.033102
  0.397733	  0.284181	 -1.021394
  0.397894	  0.297257	 -1.010851
  0.392702	  0.308497	 -0.992482
  0.390961	  0.315888	 -0.976530
  0.384744	  0.326373	 -0.958799
  0.380290	  0.334076	 -0.939591
  0.374612	  0.340374	 -0.920827
  0.368478	  0.347913	 -0.904553
  0.358614	  0.356276	 -0.889381
  0.345827	  0.364409	 -0.874560
  0.338909	  0.370263	 -0.858170
  0.332526	  0.372593	 -0.840843
  0.316945	  0.379803	 -0.819436
  0.306935	  0.386959	 -0.805338
  0.308695	  0.398267	 -0.791801
  0.302991	  0.409468	 -0.771129
  0.289108	  0.415207	 -0.754744
  0.274113	  0.418766	 -0.742047
  0.263958	  0.425492	 -0.728987
  0.254371	  0.435201	 -0.711481
  0.248724	  0.442854	 -0.695112
  0.242466	  0.449215	 -0.677116
  0.235452	  0.453169	 -0.657964
  0.224587	  0.457878	 -0.641248
  0.210094	  0.469073	 -0.627287
  0.203274	  0.476506	 -0.611693
  0.198508	  0.477225	 -0.591016
  0.189872	  0.480146	 -0.572179
  0.179854	  0.487878	 -0.557443
  0.171420	  0.488928	 -0.538537
  0.163714	  0.491551	 -0.520245
  0.153031	  0.498289	 -0.505328
  0.141636	  0.501637	 -0.488581
  0.134248	  0.500897	 -0.467480
  0.126974	  0.504377	 -0.448841
  0.117720	  0.510796	 -0.435303
  0.106060	  0.512579	 -0.417692
  0.095761	  0.511411	 -0.400181
  0.085426	  0.511511	 -0.382609
  0.074464	  0.512473	 -0.365257
  0.064106	  0.513321	 -0.347793
  0.055265	  0.517903	 -0.331141
  0.046367	  0.520558	 -0.314273
  0.033723	  0.526295	 -0.296307
  0.022280	  0.532815	 -0.281855
  0.011317	  0.536752	 -0.267164
 -0.000691	  0.540749	 -0.248612
 -0.010924	  0.546794	 -0.233887
 -0.022517	  0.553379	 -0.220227
 -0.034263	  0.560750	 -0.203507
 -0.042284	  0.565595	 -0.188671
 -0.055200	  0.572746	 -0.171463
 -0.068327	  0.581643	 -0.160392
 -0.083848	  0.579419	 -0.142744
 -0.092266	  0.572848	 -0.120196
 -0.099145	  0.571543	 -0.101353
 -0.112431	  0.578415	 -0.087268
 -0.124499	  0.591301	 -0.077033
 -0.135780	  0.596794	 -0.061692
 -0.149479	  0.599068	 -0.044711
 -0.162603	  0.604758	 -0.031075
 -0.173768	  0.614472	 -0.018137
 -0.185842	  0.621530	 -0.002154
 -0.199006	  0.622546	  0.014818
 -0.211614	  0.624680	  0.025317
 -0.230005	  0.625225	  0.041258
 -0.246045	  0.620905	  0.056378
 -0.252052	  0.622133	  0.077323
 -0.263192	  0.629084	  0.092780
 -0.272980	  0.641695	  0.103734
 -0.282135	  0.650094	  0.122852
 -0.290203	  0.647648	  0.142051
 -0.301698	  0.646064	  0.160820
 -0.313767	  0.651048	  0.174198
 -0.322132	  0.655009	  0.190461
 -0.330934	  0.656056	  0.211444
 -0.337388	  0.659216	  0.230057
 -0.346395	  0.662986	  0.244764
 -0.357050	  0.667494	  0.264509
 -0.364276	  0.668342	  0.282181
 -0.370324	  0.665659	  0.302040
 -0.374100	  0.669652	  0.322873
 -0.379864	  0.672942	  0.339233
 -0.388905	  0.671476	  0.358217
 -0.397400	  0.672851	  0.377230
 -0.404843	  0.678947	  0.393748
 -0.414381	  0.684368	  0.410428
 -0.420527	  0.691147	  0.433172
 -0.422902	  0.698246	  0.452223
 -0.432743	  0.697676	  0.465278
 -0.447731	  0.695358	  0.481511
 -0.457167	  0.693330	  0.502635
 -0.460689	  0.696786	  0.522462
 -0.470833	  0.697277	  0.537006
 -0.482875	  0.696408	  0.552773
 -0.493339	  0.694835	  0.567991
 -0.508040	  0.684869	  0.582210
 -0.519104	  0.671685	  0.592317
 -0.527506	  0.661159	  0.602370
 -0.538672	  0.646819	  0.611312
 -0.550418	  0.630443	  0.619665
 -0.561618	  0.618357	  0.629556
 -0.574229	  0.605849	  0.638669
 -0.586456	  0.591099	  0.645947
 -0.599611	  0.579590	  0.655385
 -0.613348	  0.568344	  0.664789
 -0.626697	  0.555245	  0.672160
 -0.641132	  0.545398	  0.681675
 -0.655994	  0.537439	  0.691775
 -0.671961	  0.528702	  0.700661
 -0.687347	  0.517978	  0.710470
 -0.702212	  0.513355	  0.721655
 -0.719000	  0.512618	  0.732575
 -0.735840	  0.511246	  0.747955
 -0.748789	  0.506568	  0.761168
 -0.764166	  0.503720	  0.769427
 -0.782536	  0.501351	  0.780110
 -0.801429	  0.499080	  0.791203
 -0.817977	  0.494130	  0.797876
 -0.834982	  0.489840	  0.807540
 -0.851882	  0.487476	  0.818233
 -0.869268	  0.485560	  0.831341
 -0.886779	  0.481963	  0.838913
 -0.905084	  0.484743	  0.849616
 -0.917643	  0.491095	  0.862199
 -0.933645	  0.495914	  0.877104
 -0.949688	  0.495148	  0.893432
 -0.965583	  0.491510	  0.899453
 -0.986015	  0.487735	  0.906213
 -1.003394	  0.492065	  0.916966
 -1.017248	  0.496259	  0.933155
 -1.031612	  0.492516	  0.945472
 -1.047598	  0.490294	  0.957115
 -1.061907	  0.493919	  0.971776
 -1.079047	  0.495312	  0.985782
 -1.093941	  0.490562	  0.994597
 -1.107502	  0.491401	  1.010724
 -1.119405	  0.496902	  1.027288
 -1.131160	  0.496936	  1.042228
 -1.142095	  0.500384	  1.061367
 -1.152151	  0.507024	  1.076163
 -1.162752	  0.510437	  1.091550
 -1.168226	  0.517883	  1.109424
 -1.175318	  0.525181	  1.126457
 -1.182237	  0.530961	  1.144402
 -1.188559	  0.539982	  1.160485
 -1.195975	  0.550229	  1.175890
 -1.197412	  0.558788	  1.195049
 -1.202198	  0.567420	  1.211580
 -1.204804	  0.580995	  1.226602
 -1.209403	  0.589305	  1.244611
 -1.212627	  0.597380	  1.263313
 -1.212789	  0.608527	  1.281239
 -1.207700	  0.621980	  1.294941
 -1.206200	  0.635970	  1.308050
 -1.207991	  0.650026	  1.325475
 -1.202782	  0.660526	  1.341876
 -1.196650	  0.672157	  1.355418
 -1.191141	  0.685740	  1.369138
 -1.186250	  0.699061	  1.383935
 -1.180808	  0.712524	  1.397728
 -1.170757	  0.728212	  1.404967
 -1.160674	  0.743915	  1.412162
 -1.150592	  0.759617	  1.419358
 -1.140528	  0.775301	  1.426535
 -1.131115	  0.790718	  1.433040
 -1.121647	  0.808700	  1.437820
 -1.113055	  0.826776	  1.439603
 -1.102384	  0.842536	  1.445285
 -1.092659	  0.858891	  1.448828
 -1.083929	  0.878052	  1.449666
 -1.074993	  0.894903	  1.453652
 -1.067265	  0.911891	  1.458611
 -1.060917	  0.932164	  1.461748
 -1.054323	  0.949742	  1.467763
 -1.049650	  0.965542	  1.476737
 -1.047214	  0.985458	  1.484935
 -1.042489	  1.002920	  1.494765
 -1.042722	  1.013956	  1.509233
 -1.045000	  1.025975	  1.525632
 -1.047587	  1.036369	  1.543186
 -1.049787	  1.049724	  1.557812
 -1.055084	  1.061836	  1.573307
 -1.062132	  1.071214	  1.590339
 -1.068928	  1.076572	  1.609043
 -1.076845	  1.080265	  1.627419
 -1.087273	  1.085101	  1.643433
 -1.101132	  1.088729	  1.660298
 -1.107861	  1.093358	  1.677625
 -1.113056	  1.100545	  1.694753
 -1.121186	  1.107007	  1.712776
 -1.132458	  1.110753	  1.729855
 -1.142061	  1.113982	  1.747005
 -1.146896	  1.117337	  1.767589
 -1.156564	  1.122271	  1.784396
 -1.169737	  1.128286	  1.796786
 -1.179745	  1.132156	  1.815279
 -1.188992	  1.134730	  1.832870
 -1.199028	  1.141767	  1.847767
 -1.213556	  1.143943	  1.871039
 -1.224662	  1.147667	  1.887251
