  0.242845	  0.257045	  3.009295
  0.240441	  0.254500	  2.979500
  0.244810	  0.254394	  2.933134
  0.243377	  0.248557	  2.884811
  0.239793	  0.245824	  2.836020
  0.236243	  0.243189	  2.787724
  0.232796	  0.238979	  2.738218
  0.230114	  0.233520	  2.687636
  0.229767	  0.226691	  2.635677
  0.231683	  0.218887	  2.585292
  0.234303	  0.211037	  2.536078
  0.237021	  0.203781	  2.488056
  0.239258	  0.197732	  2.440634
  0.241786	  0.191323	  2.392004
  0.245788	  0.184820	  2.342145
  0.251710	  0.182426	  2.293904
  0.256875	  0.191806	  2.249670
  0.257315	  0.222370	  2.212051
  0.249914	  0.294031	  2.166679
  0.220998	  0.418519	  2.097494
  0.170382	  0.520918	  2.015344
  0.125452	  0.556175	  1.952850
  0.096574	  0.558578	  1.913464
  0.074111	  0.548751	  1.882031
  0.051772	  0.526504	  1.849633
  0.023604	  0.479681	  1.806668
 -0.004581	  0.396913	  1.745412
 -0.010200	  0.319268	  1.677962
 -0.009526	  0.283722	  1.631273
 -0.010941	  0.261414	  1.591060
 -0.015789	  0.237021	  1.535619
 -0.022368	  0.216580	  1.476716
 -0.028124	  0.202844	  1.425988
 -0.031621	  0.192492	  1.381779
 -0.033366	  0.183527	  1.333665
 -0.035650	  0.176704	  1.275920
 -0.036763	  0.170823	  1.225742
 -0.034347	  0.163338	  1.183242
 -0.026686	  0.153243	  1.140395
 -0.013010	  0.142080	  1.101944
  0.011080	  0.126545	  1.060989
  0.052934	  0.103883	  1.009344
  0.105853	  0.084253	  0.953591
  0.154892	  0.074960	  0.894192
  0.187317	  0.074790	  0.834466
  0.205397	  0.076983	  0.785127
  0.217237	  0.077210	  0.741455
  0.226098	  0.073910	  0.696539
  0.233183	  0.068658	  0.649892
  0.240651	  0.063681	  0.601485
  0.246791	  0.060262	  0.551002
  0.250620	  0.058458	  0.500676
  0.253261	  0.057473	  0.450555
  0.255660	  0.056668	  0.402147
  0.258844	  0.056082	  0.354071
  0.264056	  0.055690	  0.304086
  0.271390	  0.054643	  0.255897
  0.281316	  0.052954	  0.207281
  0.293623	  0.048263	  0.156888
  0.308403	  0.038919	  0.108062
  0.324181	  0.025109	  0.059719
  0.329972	  0.009234	  0.009099
  0.328393	 -0.003529	 -0.041522
  0.325854	 -0.011910	 -0.091507
  0.322971	 -0.018652	 -0.141192
  0.320202	 -0.025224	 -0.190231
  0.318138	 -0.032634	 -0.238665
  0.317306	 -0.041661	 -0.286150
  0.316221	 -0.051636	 -0.334873
  0.313168	 -0.061270	 -0.385217
  0.307314	 -0.069429	 -0.436369
  0.299312	 -0.075061	 -0.486837
  0.293370	 -0.077878	 -0.534758
  0.292477	 -0.079326	 -0.582716
  0.296519	 -0.080936	 -0.632476
  0.303226	 -0.083030	 -0.682701
  0.311699	 -0.085389	 -0.733009
  0.320568	 -0.086567	 -0.783750
  0.328494	 -0.086619	 -0.833551
  0.335677	 -0.086715	 -0.881664
  0.341887	 -0.087727	 -0.930579
  0.346410	 -0.089623	 -0.982147
  0.347739	 -0.092182	 -1.031955
  0.345054	 -0.096552	 -1.082712
  0.338408	 -0.103501	 -1.132981
  0.331867	 -0.112518	 -1.182581
  0.327748	 -0.121162	 -1.231617
  0.325206	 -0.127699	 -1.279141
  0.323152	 -0.132797	 -1.327923
  0.321765	 -0.137266	 -1.376951
  0.321467	 -0.141834	 -1.425469
  0.322680	 -0.147174	 -1.474085
  0.326031	 -0.153960	 -1.523497
  0.331442	 -0.161811	 -1.572881
  0.337962	 -0.169659	 -1.621277
  0.345609	 -0.177237	 -1.668673
  0.354589	 -0.184306	 -1.719114
  0.360953	 -0.189320	 -1.772143
  0.363300	 -0.192261	 -1.824810
  0.363816	 -0.193264	 -1.875864
  0.361082	 -0.192648	 -1.926964
  0.354238	 -0.191112	 -1.978415
  0.345368	 -0.189776	 -2.027829
  0.335746	 -0.189459	 -2.076721
  0.326502	 -0.191334	 -2.125099
  0.319075	 -0.194244	 -2.173049
  0.314636	 -0.198088	 -2.220901
  0.312170	 -0.200523	 -2.269830
  0.309716	 -0.200393	 -2.320637
  0.306301	 -0.199112	 -2.371002
  0.301207	 -0.197586	 -2.420981
  0.293239	 -0.196726	 -2.472572
  0.283960	 -0.197962	 -2.523828
  0.278108	 -0.202252	 -2.574358
  0.278243	 -0.210731	 -2.622869
  0.282743	 -0.220978	 -2.670879
  0.291563	 -0.228672	 -2.721301
  0.307351	 -0.231635	 -2.770592
  0.319725	 -0.241211	 -2.818473
  0.316520	 -0.237792	 -2.868318
  0.317948	 -0.243106	 -2.919645
  0.317456	 -0.254506	 -2.972280
  0.320631	 -0.257051	 -3.002003
