  1.250502	 -0.678108	  1.960731
  1.247175	 -0.668410	  1.971529
  1.251643	 -0.681436	  1.957025
  1.256104	 -0.694462	  1.942517
  1.262808	 -0.707596	  1.929006
  1.269821	 -0.720729	  1.915652
  1.276823	 -0.733862	  1.902292
  1.284591	 -0.746418	  1.888801
  1.292511	 -0.758852	  1.875286
  1.300467	 -0.771469	  1.861962
  1.308590	 -0.784961	  1.849636
  1.316670	 -0.798406	  1.837362
  1.323775	 -0.811205	  1.825776
  1.327091	 -0.818730	  1.806443
  1.326428	 -0.833639	  1.781062
  1.332893	 -0.852244	  1.770339
  1.349117	 -0.873430	  1.770405
  1.360682	 -0.888573	  1.768752
  1.369633	 -0.903883	  1.761899
  1.377175	 -0.918347	  1.755301
  1.388504	 -0.938636	  1.747184
  1.397141	 -0.957870	  1.735051
  1.400256	 -0.965961	  1.728591
  1.408696	 -0.981656	  1.712324
  1.416697	 -0.996298	  1.701296
