  0.724215	  0.363595	 -2.385460
  0.752516	  0.391877	 -2.392729
  0.738502	  0.377999	 -2.389369
  0.724596	  0.364083	 -2.385779
  0.710716	  0.350163	 -2.382112
  0.696745	  0.336443	 -2.378460
  0.679084	  0.330191	 -2.371533
  0.660995	  0.325269	 -2.364630
  0.643020	  0.319604	 -2.356995
  0.625220	  0.315170	 -2.349461
  0.607735	  0.308816	 -2.341068
  0.590471	  0.304632	 -2.332447
  0.573288	  0.297532	 -2.323158
  0.556757	  0.293104	 -2.314447
  0.541086	  0.288427	 -2.307390
  0.524021	  0.285211	 -2.300636
  0.505995	  0.285280	 -2.291144
  0.489530	  0.286701	 -2.278440
  0.475363	  0.283734	 -2.264608
  0.458989	  0.281986	 -2.254060
  0.440936	  0.280710	 -2.245206
  0.423317	  0.281148	 -2.234776
  0.407522	  0.282831	 -2.222922
  0.389952	  0.281539	 -2.214269
  0.370239	  0.280025	 -2.211083
  0.348032	  0.270138	 -2.208470
  0.332074	  0.264770	 -2.202512
  0.313355	  0.260567	 -2.198165
  0.292639	  0.255434	 -2.194813
  0.274619	  0.249981	 -2.201346
  0.255974	  0.246414	 -2.208092
  0.236991	  0.240377	 -2.214347
  0.218732	  0.234617	 -2.223812
  0.204405	  0.231817	 -2.236501
  0.188980	  0.227147	 -2.248257
  0.172933	  0.217795	 -2.262931
  0.161502	  0.213183	 -2.277070
  0.151667	  0.208623	 -2.287011
  0.136881	  0.202572	 -2.301889
  0.118890	  0.194343	 -2.315415
  0.102446	  0.188291	 -2.325184
  0.087071	  0.185529	 -2.336773
  0.073628	  0.184586	 -2.350466
  0.058319	  0.181164	 -2.363635
  0.043264	  0.174782	 -2.375604
  0.031322	  0.168531	 -2.389201
  0.021376	  0.160014	 -2.405081
  0.008203	  0.152699	 -2.418524
 -0.014252	  0.144285	 -2.426684
 -0.027357	  0.135947	 -2.433687
 -0.038813	  0.123669	 -2.445585
 -0.048507	  0.110706	 -2.458025
 -0.061242	  0.099365	 -2.469566
 -0.076179	  0.092867	 -2.481005
 -0.090357	  0.088309	 -2.493981
 -0.105190	  0.080313	 -2.504754
