 -1.263123	  1.749076	  2.127476
 -1.250617	  1.731759	  2.106412
 -1.208744	  1.703393	  2.107151
 -1.174056	  1.670622	  2.101080
 -1.139727	  1.636574	  2.093321
 -1.105217	  1.601165	  2.080263
 -1.071170	  1.562505	  2.072061
 -1.033248	  1.528404	  2.067543
 -0.999247	  1.492799	  2.060576
 -0.960882	  1.462283	  2.051697
 -0.930966	  1.424492	  2.039304
 -0.901419	  1.385634	  2.031958
 -0.869101	  1.351078	  2.017275
 -0.837409	  1.311688	  2.011570
 -0.804318	  1.273514	  2.007307
 -0.772352	  1.238246	  1.999842
 -0.741342	  1.201293	  1.988949
 -0.709194	  1.164479	  1.978238
 -0.676479	  1.128127	  1.967764
 -0.643165	  1.092861	  1.957135
 -0.608816	  1.060852	  1.944921
 -0.573034	  1.029226	  1.932136
 -0.537514	  0.996882	  1.918503
 -0.499776	  0.962513	  1.905354
 -0.461843	  0.928205	  1.895677
 -0.424519	  0.894135	  1.889036
 -0.387874	  0.859829	  1.884064
 -0.353257	  0.826505	  1.879843
 -0.319786	  0.793922	  1.875999
 -0.283017	  0.759358	  1.871928
 -0.245138	  0.725459	  1.868690
 -0.208722	  0.693797	  1.865544
 -0.172361	  0.661114	  1.862013
 -0.136916	  0.624212	  1.859315
 -0.105391	  0.583812	  1.855376
 -0.077200	  0.542694	  1.850899
 -0.049111	  0.501621	  1.847183
 -0.019146	  0.461412	  1.844324
  0.012723	  0.422294	  1.840583
  0.047808	  0.383993	  1.836064
  0.084070	  0.348712	  1.831094
  0.123082	  0.315160	  1.824748
  0.164132	  0.284383	  1.816151
  0.207547	  0.258174	  1.804530
  0.260438	  0.237226	  1.788197
  0.346071	  0.230237	  1.762701
  0.453830	  0.277743	  1.755555
  0.530820	  0.308781	  1.737502
  0.616008	  0.303850	  1.724736
  0.677813	  0.273576	  1.740944
  0.716986	  0.244352	  1.774360
  0.743619	  0.212457	  1.810526
  0.758881	  0.183067	  1.839764
  0.768423	  0.144165	  1.869052
  0.771123	  0.086957	  1.892627
  0.755137	 -0.009795	  1.860640
  0.723973	 -0.099945	  1.772849
  0.726339	 -0.183589	  1.736206
  0.758839	 -0.220214	  1.703593
  0.790893	 -0.261443	  1.685806
  0.827258	 -0.290843	  1.665030
  0.859233	 -0.329568	  1.657307
  0.889494	 -0.367028	  1.655078
  0.920937	 -0.405075	  1.658533
  0.961208	 -0.438421	  1.656733
  1.001966	 -0.468276	  1.650448
  1.039908	 -0.498479	  1.641221
  1.078514	 -0.528700	  1.631216
  1.117161	 -0.561175	  1.624417
  1.153286	 -0.594015	  1.620084
  1.188638	 -0.628440	  1.615778
  1.222485	 -0.665644	  1.611075
  1.252915	 -0.705406	  1.605711
  1.280982	 -0.744939	  1.598480
  1.305783	 -0.784277	  1.586065
  1.331251	 -0.824126	  1.566806
  1.358673	 -0.864286	  1.544974
  1.387872	 -0.902936	  1.524537
  1.419096	 -0.939987	  1.506982
  1.453100	 -0.976250	  1.492185
  1.490868	 -1.013054	  1.481455
  1.531143	 -1.049015	  1.476035
  1.570452	 -1.082096	  1.474783
  1.609631	 -1.113393	  1.476792
  1.650567	 -1.144584	  1.481334
  1.691347	 -1.174314	  1.487709
  1.731016	 -1.202713	  1.494153
  1.768547	 -1.231847	  1.499463
  1.806535	 -1.263365	  1.504449
  1.847462	 -1.298294	  1.505120
  1.885869	 -1.334845	  1.497677
  1.919762	 -1.370070	  1.486259
  1.951826	 -1.405817	  1.474261
  1.985505	 -1.442326	  1.464722
  2.016280	 -1.476298	  1.446514
  2.051321	 -1.508197	  1.441679
  2.086109	 -1.542289	  1.432211
  2.114562	 -1.584474	  1.420587
  2.135708	 -1.600319	  1.434793
