 -0.581562	  2.276713	 -0.216386
 -0.577618	  2.290608	 -0.205872
 -0.573674	  2.304503	 -0.195358
 -0.573729	  2.293294	 -0.205806
 -0.574851	  2.274280	 -0.218811
 -0.580248	  2.254522	 -0.231110
 -0.589335	  2.239811	 -0.239830
 -0.599552	  2.223991	 -0.249950
 -0.608013	  2.210440	 -0.260446
 -0.617011	  2.196825	 -0.271603
 -0.623468	  2.179427	 -0.286913
 -0.625480	  2.168562	 -0.297766
 -0.624001	  2.153129	 -0.312554
 -0.626828	  2.131105	 -0.330248
 -0.629251	  2.120390	 -0.338128
 -0.635228	  2.103103	 -0.350248
 -0.639153	  2.084073	 -0.364497
 -0.642534	  2.069175	 -0.375194
 -0.654649	  2.057032	 -0.379296
 -0.666899	  2.038960	 -0.385103
 -0.674450	  2.020890	 -0.392654
 -0.681145	  2.003176	 -0.399392
 -0.688005	  1.985479	 -0.406111
 -0.694752	  1.967892	 -0.413027
 -0.701973	  1.951034	 -0.421068
 -0.709458	  1.934370	 -0.429214
 -0.716975	  1.917745	 -0.437402
 -0.724939	  1.901805	 -0.446480
 -0.733025	  1.886063	 -0.455796
 -0.741346	  1.870592	 -0.465127
 -0.751131	  1.856077	 -0.474977
 -0.761895	  1.841583	 -0.484021
 -0.771806	  1.825794	 -0.492141
 -0.778266	  1.809147	 -0.501441
 -0.786327	  1.794543	 -0.510713
 -0.799568	  1.778726	 -0.517640
 -0.809825	  1.760645	 -0.525719
 -0.815690	  1.744215	 -0.538112
 -0.818152	  1.731217	 -0.552595
 -0.821364	  1.717621	 -0.567130
 -0.826989	  1.701871	 -0.578656
 -0.832741	  1.685213	 -0.588789
 -0.839671	  1.668934	 -0.597310
 -0.847512	  1.651431	 -0.602308
 -0.856460	  1.633363	 -0.604888
 -0.862622	  1.615496	 -0.611053
 -0.868440	  1.597955	 -0.617928
 -0.873191	  1.578690	 -0.623826
 -0.876616	  1.558130	 -0.625077
 -0.877603	  1.537808	 -0.621306
 -0.879235	  1.519550	 -0.614116
 -0.883816	  1.501656	 -0.612255
 -0.896918	  1.483317	 -0.613810
 -0.912475	  1.463096	 -0.603426
 -0.918685	  1.445445	 -0.592708
 -0.920909	  1.433141	 -0.584249
 -0.925062	  1.414653	 -0.571684
 -0.935090	  1.398953	 -0.564511
 -0.947836	  1.384987	 -0.562561
 -0.964856	  1.365176	 -0.558514
 -0.975181	  1.349846	 -0.551918
 -0.981288	  1.337691	 -0.543597
 -0.984336	  1.319790	 -0.538172
 -0.996384	  1.300556	 -0.536172
 -1.009767	  1.285308	 -0.537199
 -1.023168	  1.270456	 -0.538109
 -1.036743	  1.255764	 -0.538538
 -1.050333	  1.241095	 -0.538904
 -1.063924	  1.226427	 -0.539270
 -1.077555	  1.211805	 -0.539665
 -1.092130	  1.198225	 -0.540700
 -1.109714	  1.189487	 -0.544232
 -1.127446	  1.180998	 -0.547889
 -1.145183	  1.172511	 -0.551548
 -1.162919	  1.164024	 -0.555207
 -1.180655	  1.155537	 -0.558866
 -1.198405	  1.147064	 -0.562482
 -1.216446	  1.138883	 -0.565127
 -1.235113	  1.131756	 -0.564903
 -1.253813	  1.124678	 -0.564491
 -1.272512	  1.117600	 -0.564076
 -1.291115	  1.110342	 -0.563562
 -1.307833	  1.099684	 -0.561160
 -1.323947	  1.088211	 -0.558223
 -1.339408	  1.075896	 -0.555340
 -1.352326	  1.060911	 -0.552665
 -1.364751	  1.045500	 -0.550042
 -1.374495	  1.028194	 -0.548080
 -1.383864	  1.010643	 -0.546223
 -1.391173	  0.992086	 -0.545112
 -1.397895	  0.973277	 -0.544223
 -1.403279	  0.954025	 -0.544282
 -1.407332	  0.934470	 -0.545286
 -1.410121	  0.914831	 -0.547661
 -1.410257	  0.895535	 -0.552834
 -1.409603	  0.876747	 -0.559153
 -1.404764	  0.863408	 -0.572089
 -1.398565	  0.857852	 -0.589073
 -1.391129	  0.851692	 -0.606377
 -1.383132	  0.834436	 -0.621101
 -1.375150	  0.823870	 -0.636103
 -1.366771	  0.814788	 -0.650211
 -1.358726	  0.806300	 -0.663103
 -1.351028	  0.791978	 -0.684195
 -1.343544	  0.786439	 -0.702779
 -1.333276	  0.788312	 -0.719169
 -1.322563	  0.802816	 -0.735889
 -1.309901	  0.818272	 -0.756225
 -1.302725	  0.819681	 -0.768147
 -1.290677	  0.816871	 -0.787855
 -1.281391	  0.814516	 -0.810975
 -1.276735	  0.812185	 -0.827409
 -1.268497	  0.805324	 -0.848750
 -1.257493	  0.801114	 -0.867792
 -1.250610	  0.799949	 -0.878415
 -1.237913	  0.802145	 -0.897347
 -1.226815	  0.803122	 -0.915583
 -1.214376	  0.805411	 -0.929402
 -1.200117	  0.807378	 -0.944940
 -1.187934	  0.809607	 -0.961283
 -1.175257	  0.812387	 -0.978059
 -1.165225	  0.811828	 -0.996041
 -1.159105	  0.811621	 -1.009738
 -1.150204	  0.811449	 -1.029974
 -1.138451	  0.810558	 -1.059566
 -1.135296	  0.809450	 -1.069833
 -1.128931	  0.808969	 -1.082126
 -1.115665	  0.809993	 -1.101746
 -1.106157	  0.812311	 -1.122377
 -1.096520	  0.803489	 -1.145608
 -1.098009	  0.790491	 -1.167865
 -1.098374	  0.784756	 -1.180124
 -1.098003	  0.773278	 -1.199416
 -1.097738	  0.751565	 -1.220488
 -1.098180	  0.742240	 -1.225699
 -1.098326	  0.725080	 -1.239405
 -1.097813	  0.700765	 -1.257362
 -1.098274	  0.691386	 -1.265571
 -1.094190	  0.679809	 -1.275431
 -1.085309	  0.664131	 -1.288533
 -1.080953	  0.648236	 -1.299142
 -1.082337	  0.625803	 -1.314950
 -1.082893	  0.611872	 -1.325024
 -1.082235	  0.597521	 -1.334618
 -1.082050	  0.576282	 -1.344476
 -1.081016	  0.563167	 -1.351676
 -1.079404	  0.537612	 -1.364375
 -1.079912	  0.526728	 -1.371363
 -1.078949	  0.507811	 -1.383204
 -1.070028	  0.480857	 -1.395297
 -1.067192	  0.470002	 -1.398081
 -1.060701	  0.453417	 -1.401727
 -1.057463	  0.432714	 -1.408294
 -1.062798	  0.413217	 -1.415515
 -1.070189	  0.394271	 -1.423438
 -1.072552	  0.375989	 -1.433691
 -1.070196	  0.362118	 -1.443309
 -1.065113	  0.343004	 -1.459236
 -1.066446	  0.327608	 -1.475058
 -1.068287	  0.321347	 -1.487906
 -1.067376	  0.308365	 -1.507931
 -1.061467	  0.289995	 -1.521330
 -1.058456	  0.271271	 -1.532082
 -1.062145	  0.252300	 -1.542214
 -1.067688	  0.234316	 -1.550543
 -1.072955	  0.215479	 -1.557960
 -1.079244	  0.197003	 -1.563458
 -1.084215	  0.177790	 -1.569225
 -1.090355	  0.158545	 -1.573334
 -1.096359	  0.139355	 -1.578034
 -1.103248	  0.120898	 -1.585201
 -1.111128	  0.105896	 -1.595049
 -1.119057	  0.094697	 -1.608003
 -1.120665	  0.079315	 -1.622003
 -1.118938	  0.053540	 -1.628049
 -1.124288	  0.033946	 -1.631948
 -1.131772	  0.018271	 -1.634955
 -1.139863	 -0.000165	 -1.641704
 -1.147514	 -0.017489	 -1.648505
 -1.155225	 -0.035253	 -1.653760
 -1.160321	 -0.058002	 -1.663059
 -1.159345	 -0.070300	 -1.671070
 -1.152883	 -0.081858	 -1.677854
 -1.145389	 -0.116947	 -1.688270
 -1.148938	 -0.135368	 -1.698203
 -1.153750	 -0.150093	 -1.708649
 -1.154916	 -0.164666	 -1.716719
 -1.161175	 -0.182438	 -1.727940
 -1.172618	 -0.199089	 -1.743369
 -1.179582	 -0.206890	 -1.753789
 -1.191950	 -0.217735	 -1.770784
 -1.201460	 -0.236644	 -1.787058
 -1.204395	 -0.250248	 -1.795038
 -1.205171	 -0.264487	 -1.802456
 -1.210499	 -0.285604	 -1.814556
 -1.214433	 -0.302024	 -1.823647
 -1.216266	 -0.318148	 -1.832654
 -1.216515	 -0.334477	 -1.840893
 -1.216458	 -0.353208	 -1.850315
 -1.216795	 -0.374075	 -1.861685
 -1.221876	 -0.392436	 -1.873160
 -1.225973	 -0.404219	 -1.882849
 -1.230556	 -0.420437	 -1.895565
 -1.235036	 -0.438908	 -1.906461
 -1.237700	 -0.451447	 -1.914800
 -1.241610	 -0.471822	 -1.931975
 -1.241646	 -0.487461	 -1.947228
 -1.241619	 -0.496179	 -1.956222
 -1.244203	 -0.511582	 -1.969723
 -1.252264	 -0.531742	 -1.986022
 -1.261097	 -0.551623	 -1.996755
 -1.265098	 -0.568185	 -2.007230
 -1.269099	 -0.584747	 -2.017705
