  1.683904	 -0.915648	  1.625067
  1.675190	 -0.910948	  1.616760
  1.668771	 -0.907485	  1.610640
  1.657717	 -0.895465	  1.603439
  1.647599	 -0.885213	  1.598855
  1.623429	 -0.868359	  1.591743
  1.609535	 -0.858919	  1.588177
  1.595164	 -0.849392	  1.583511
  1.578706	 -0.838393	  1.572433
  1.567245	 -0.830006	  1.564150
  1.553136	 -0.816230	  1.555151
  1.534633	 -0.797424	  1.547272
  1.522406	 -0.788554	  1.544006
  1.511642	 -0.780673	  1.541157
  1.494372	 -0.764624	  1.537592
  1.478752	 -0.750065	  1.534577
  1.464097	 -0.738602	  1.532743
  1.446006	 -0.726342	  1.531660
  1.427795	 -0.715042	  1.532058
  1.414318	 -0.705949	  1.532612
  1.398347	 -0.694297	  1.532416
  1.386297	 -0.675973	  1.523976
  1.375347	 -0.658837	  1.509313
  1.360837	 -0.646013	  1.493771
  1.343678	 -0.638657	  1.481834
  1.327817	 -0.634511	  1.473370
  1.310322	 -0.628130	  1.468184
  1.294113	 -0.615022	  1.464735
  1.279213	 -0.600250	  1.463010
  1.263042	 -0.588095	  1.459625
  1.244770	 -0.580161	  1.453362
  1.226425	 -0.573589	  1.447388
  1.208480	 -0.567364	  1.443887
  1.191302	 -0.559447	  1.440509
  1.174856	 -0.550124	  1.433799
  1.159977	 -0.540834	  1.424250
  1.145254	 -0.530565	  1.416802
  1.131071	 -0.519172	  1.408348
  1.117475	 -0.507184	  1.400105
  1.104613	 -0.497663	  1.389924
  1.090440	 -0.491040	  1.373964
  1.078462	 -0.479880	  1.359901
  1.067213	 -0.467610	  1.349450
  1.056130	 -0.455168	  1.338947
  1.044510	 -0.437110	  1.327471
  1.034704	 -0.419936	  1.320797
  1.027517	 -0.404675	  1.317404
  1.017041	 -0.386904	  1.309718
  1.008557	 -0.376095	  1.298945
  0.998854	 -0.366906	  1.281404
  0.986260	 -0.353138	  1.263761
  0.977100	 -0.339683	  1.255438
  0.967770	 -0.325535	  1.249750
  0.955016	 -0.309984	  1.242018
  0.942946	 -0.295393	  1.238174
  0.929250	 -0.280388	  1.232507
  0.916632	 -0.268455	  1.221587
  0.908673	 -0.260034	  1.205580
  0.902096	 -0.251341	  1.188760
  0.895633	 -0.242653	  1.171940
  0.889209	 -0.234182	  1.155005
  0.885545	 -0.230282	  1.135743
  0.883678	 -0.229263	  1.115851
  0.881826	 -0.228328	  1.095957
  0.879950	 -0.227472	  1.076065
  0.877864	 -0.226620	  1.056226
  0.870235	 -0.225515	  1.037829
  0.861550	 -0.225135	  1.019795
  0.853388	 -0.223946	  1.001533
  0.845469	 -0.220766	  0.983408
  0.840784	 -0.216339	  0.966111
  0.839560	 -0.212270	  0.945943
  0.827024	 -0.208610	  0.927404
  0.808925	 -0.198925	  0.909032
  0.798666	 -0.191177	  0.896592
  0.789928	 -0.184756	  0.885085
  0.782039	 -0.176259	  0.867307
  0.773921	 -0.167426	  0.848365
  0.766662	 -0.161835	  0.834105
  0.758949	 -0.155533	  0.817205
  0.751618	 -0.146250	  0.798847
  0.745750	 -0.136866	  0.783953
  0.738870	 -0.125488	  0.768582
  0.728621	 -0.112895	  0.758922
  0.713597	 -0.099724	  0.752460
  0.694624	 -0.084668	  0.747970
  0.681993	 -0.073309	  0.745009
  0.673892	 -0.066424	  0.746046
  0.661201	 -0.045773	  0.747030
  0.645190	 -0.027411	  0.743851
  0.635553	 -0.016791	  0.742859
  0.619544	 -0.000284	  0.742043
  0.607202	  0.014070	  0.747866
  0.594757	  0.027168	  0.755152
  0.580997	  0.040286	  0.765020
  0.571046	  0.049829	  0.774545
  0.558891	  0.063087	  0.788877
  0.539923	  0.081136	  0.800323
  0.528951	  0.090874	  0.801665
  0.519135	  0.101164	  0.801878
  0.502912	  0.117382	  0.808499
  0.487182	  0.129316	  0.817573
  0.471618	  0.139166	  0.826536
  0.454938	  0.148959	  0.833980
  0.438116	  0.159027	  0.839699
  0.421936	  0.170891	  0.841855
  0.406643	  0.183843	  0.844462
  0.390380	  0.195309	  0.847576
  0.373581	  0.205833	  0.849203
  0.357102	  0.216820	  0.849423
  0.341501	  0.229307	  0.849442
  0.326357	  0.242457	  0.848721
  0.311498	  0.254350	  0.842986
  0.294311	  0.264852	  0.836489
  0.277192	  0.277056	  0.835276
  0.259483	  0.285054	  0.839106
  0.237970	  0.289049	  0.843007
  0.214263	  0.294171	  0.844999
  0.195168	  0.302575	  0.844810
  0.183743	  0.309422	  0.844197
  0.165103	  0.322556	  0.841187
  0.150557	  0.336662	  0.837910
  0.137265	  0.351914	  0.831964
  0.121521	  0.369161	  0.826220
  0.105558	  0.379857	  0.825339
  0.089476	  0.383961	  0.829834
  0.068631	  0.388343	  0.842269
  0.041669	  0.399199	  0.842591
  0.027978	  0.415052	  0.836164
  0.021368	  0.424952	  0.831941
  0.010077	  0.443104	  0.826544
 -0.002177	  0.456933	  0.827776
 -0.017745	  0.474369	  0.823889
 -0.039439	  0.490580	  0.820741
 -0.053616	  0.498309	  0.821637
 -0.068467	  0.505043	  0.823906
 -0.088278	  0.516178	  0.825723
 -0.107024	  0.525461	  0.825261
 -0.124444	  0.534860	  0.820593
 -0.141477	  0.542317	  0.814951
 -0.157135	  0.554806	  0.813402
 -0.171341	  0.569957	  0.812235
 -0.183910	  0.584222	  0.801239
 -0.198862	  0.595313	  0.775336
 -0.214403	  0.598432	  0.761263
 -0.224703	  0.599337	  0.755092
 -0.246571	  0.606577	  0.747247
 -0.264110	  0.615925	  0.733992
 -0.272855	  0.623853	  0.724889
 -0.281803	  0.630505	  0.716379
 -0.307269	  0.642030	  0.700675
 -0.318610	  0.646553	  0.693504
 -0.336929	  0.649901	  0.680800
 -0.351378	  0.654436	  0.666771
 -0.366599	  0.662443	  0.652834
 -0.385118	  0.675290	  0.638756
 -0.395030	  0.686472	  0.632180
 -0.399546	  0.694533	  0.626922
 -0.406280	  0.712499	  0.614738
 -0.419974	  0.734370	  0.599187
 -0.431392	  0.746971	  0.593519
 -0.443790	  0.760823	  0.587048
 -0.454054	  0.776864	  0.577091
 -0.460524	  0.789046	  0.571897
 -0.475709	  0.808174	  0.562817
 -0.492020	  0.822344	  0.555298
 -0.499666	  0.831596	  0.554307
 -0.519345	  0.849534	  0.553981
 -0.539840	  0.871828	  0.560045
 -0.547343	  0.881213	  0.562859
 -0.565556	  0.899270	  0.563529
 -0.580827	  0.915971	  0.556356
 -0.591164	  0.922780	  0.547256
 -0.602592	  0.930715	  0.534568
 -0.618075	  0.936583	  0.519863
 -0.642162	  0.942480	  0.502590
 -0.657831	  0.949603	  0.491843
 -0.668066	  0.955056	  0.486609
 -0.688203	  0.971164	  0.476183
 -0.699092	  0.988431	  0.469591
 -0.706181	  0.991706	  0.470268
 -0.733402	  1.011772	  0.467817
 -0.749095	  1.023223	  0.460758
 -0.758063	  1.030791	  0.454742
 -0.771407	  1.046131	  0.449758
 -0.788226	  1.060631	  0.443779
 -0.797873	  1.071724	  0.440622
 -0.822663	  1.085837	  0.429502
 -0.835456	  1.095194	  0.423443
 -0.845772	  1.103915	  0.423279
 -0.862757	  1.112801	  0.414449
 -0.889234	  1.117308	  0.409817
 -0.901482	  1.129961	  0.402754
 -0.918706	  1.138644	  0.401404
 -0.937556	  1.149003	  0.392353
 -0.944370	  1.151965	  0.386718
 -0.977176	  1.164967	  0.380411
 -0.985354	  1.176411	  0.373216
 -1.001561	  1.186640	  0.376786
 -1.017317	  1.197972	  0.380893
 -1.039414	  1.209442	  0.393732
 -1.047692	  1.216484	  0.397584
 -1.065022	  1.225050	  0.406191
 -1.086717	  1.233093	  0.412566
 -1.106831	  1.238961	  0.423721
 -1.118417	  1.243334	  0.427280
 -1.135788	  1.250093	  0.434266
 -1.151129	  1.257396	  0.441377
 -1.172091	  1.269282	  0.456675
 -1.188426	  1.278232	  0.466354
 -1.199801	  1.283563	  0.471380
 -1.219908	  1.293960	  0.478154
 -1.236810	  1.303802	  0.482516
 -1.248396	  1.311686	  0.484192
 -1.262369	  1.323189	  0.484423
 -1.281537	  1.338299	  0.483424
 -1.297104	  1.350616	  0.481951
 -1.309933	  1.364533	  0.482117
 -1.321222	  1.377225	  0.485551
 -1.339918	  1.398456	  0.488438
 -1.347526	  1.404259	  0.487034
 -1.366216	  1.417638	  0.486565
 -1.381068	  1.433186	  0.483861
 -1.392586	  1.450653	  0.479419
 -1.402305	  1.462446	  0.476076
 -1.418914	  1.473932	  0.472528
 -1.436147	  1.482384	  0.469750
 -1.450685	  1.492613	  0.462528
 -1.467913	  1.505281	  0.451577
 -1.482882	  1.519585	  0.439737
 -1.488848	  1.526634	  0.431138
 -1.499855	  1.533358	  0.418086
 -1.516510	  1.539543	  0.402424
 -1.527673	  1.552215	  0.385656
 -1.529881	  1.563406	  0.364746
 -1.530336	  1.568346	  0.347014
 -1.530171	  1.569131	  0.328131
 -1.535289	  1.572603	  0.308405
 -1.542085	  1.577970	  0.292276
 -1.545861	  1.584257	  0.273735
 -1.547369	  1.586908	  0.254322
 -1.548793	  1.589819	  0.230448
 -1.550593	  1.593293	  0.210391
 -1.550753	  1.596824	  0.194511
 -1.547053	  1.601603	  0.175064
 -1.542812	  1.606002	  0.155780
 -1.543885	  1.611802	  0.132045
 -1.544179	  1.618293	  0.106500
 -1.543755	  1.620833	  0.093477
 -1.554485	  1.627969	  0.074234
 -1.571517	  1.638307	  0.060007
 -1.581682	  1.648228	  0.045896
 -1.594916	  1.659338	  0.028999
 -1.605962	  1.671279	  0.017333
 -1.616735	  1.680548	  0.006697
 -1.632820	  1.691870	 -0.005627
 -1.649631	  1.707082	 -0.011709
 -1.663437	  1.723455	 -0.011889
 -1.673169	  1.740303	 -0.014388
 -1.680652	  1.757198	 -0.025347
 -1.685505	  1.772655	 -0.038435
 -1.696558	  1.787292	 -0.047846
 -1.720577	  1.812664	 -0.062159
 -1.722125	  1.814262	 -0.063083
