 -0.862418	  2.224809	 -0.335819
 -0.864073	  2.229538	 -0.342250
 -0.865728	  2.234267	 -0.348681
 -0.867496	  2.223878	 -0.331395
 -0.863921	  2.212096	 -0.315516
 -0.853588	  2.199400	 -0.302006
 -0.843867	  2.185025	 -0.287228
 -0.839614	  2.173308	 -0.272837
 -0.836349	  2.160572	 -0.259102
 -0.835454	  2.147244	 -0.244392
 -0.834837	  2.132542	 -0.228804
 -0.833818	  2.117656	 -0.215248
 -0.828605	  2.100878	 -0.205325
 -0.821048	  2.086531	 -0.194140
 -0.813414	  2.070790	 -0.183469
 -0.805384	  2.051773	 -0.176636
 -0.802941	  2.036052	 -0.166637
 -0.794484	  2.021739	 -0.154726
 -0.790953	  2.007184	 -0.139877
 -0.788175	  1.990731	 -0.126436
 -0.790495	  1.973921	 -0.117114
 -0.786427	  1.956310	 -0.108431
 -0.780325	  1.937503	 -0.101391
 -0.775757	  1.919898	 -0.090887
 -0.774932	  1.901333	 -0.081873
 -0.771491	  1.882995	 -0.079136
 -0.767127	  1.862719	 -0.074877
 -0.766409	  1.843455	 -0.068819
 -0.765394	  1.826893	 -0.057350
 -0.761135	  1.811273	 -0.044923
 -0.753891	  1.792710	 -0.033925
 -0.751711	  1.776081	 -0.026186
 -0.751115	  1.757385	 -0.020397
 -0.750384	  1.740714	 -0.008966
 -0.753035	  1.720804	 -0.002789
 -0.761658	  1.699721	  0.002214
 -0.759658	  1.680802	  0.007250
 -0.758927	  1.663632	  0.018157
 -0.750961	  1.647578	  0.029116
 -0.744357	  1.629743	  0.036185
 -0.736042	  1.611933	  0.046221
 -0.733814	  1.596325	  0.059603
 -0.737778	  1.580516	  0.070188
 -0.740966	  1.562921	  0.079815
 -0.745743	  1.543748	  0.086978
 -0.751211	  1.525805	  0.088460
 -0.746465	  1.506156	  0.093729
 -0.746483	  1.485762	  0.092222
 -0.748283	  1.466247	  0.096190
 -0.755116	  1.447909	  0.099480
 -0.755702	  1.428011	  0.103096
 -0.762351	  1.405888	  0.105462
 -0.754486	  1.385531	  0.106383
 -0.745678	  1.369229	  0.111733
 -0.738570	  1.350192	  0.118765
 -0.736718	  1.331545	  0.120575
 -0.736676	  1.310842	  0.121756
 -0.728762	  1.291272	  0.125659
 -0.719027	  1.274817	  0.133860
 -0.713913	  1.257712	  0.139111
 -0.704859	  1.239183	  0.144610
 -0.690869	  1.224119	  0.142607
 -0.683154	  1.206603	  0.142253
 -0.669495	  1.190125	  0.144296
 -0.654717	  1.173708	  0.148025
 -0.645047	  1.161657	  0.143822
 -0.629379	  1.145900	  0.140598
 -0.613228	  1.130814	  0.140556
 -0.599678	  1.117903	  0.145824
 -0.586834	  1.104606	  0.153661
 -0.573193	  1.090316	  0.156656
 -0.560371	  1.078637	  0.165334
 -0.543765	  1.066186	  0.181153
 -0.530761	  1.055139	  0.189167
 -0.518188	  1.039994	  0.190567
 -0.502780	  1.027370	  0.194415
 -0.489736	  1.014962	  0.198214
 -0.472279	  1.005387	  0.208876
 -0.458140	  0.990073	  0.218298
 -0.445920	  0.982910	  0.225868
 -0.429388	  0.975064	  0.229185
 -0.410634	  0.963867	  0.238359
 -0.398376	  0.957065	  0.250248
 -0.382357	  0.949819	  0.266568
 -0.369955	  0.938856	  0.272697
 -0.355366	  0.928470	  0.280463
 -0.337321	  0.918998	  0.289610
 -0.321196	  0.914307	  0.297400
 -0.304631	  0.909533	  0.307958
 -0.291390	  0.902448	  0.325112
 -0.277942	  0.897375	  0.337081
 -0.261498	  0.894941	  0.347625
 -0.245101	  0.895045	  0.360500
 -0.231004	  0.888842	  0.374330
 -0.215225	  0.880651	  0.384258
 -0.200318	  0.875887	  0.395912
 -0.184420	  0.876247	  0.409000
 -0.169348	  0.874317	  0.423044
 -0.152883	  0.872554	  0.435473
 -0.139511	  0.871572	  0.446322
 -0.122842	  0.871848	  0.456965
 -0.103556	  0.869997	  0.471393
 -0.089125	  0.868001	  0.481127
 -0.073169	  0.870459	  0.496125
 -0.056669	  0.874206	  0.510157
 -0.047960	  0.867125	  0.527740
 -0.037197	  0.863270	  0.543595
 -0.027366	  0.861535	  0.559488
 -0.016441	  0.850473	  0.578552
 -0.006572	  0.842409	  0.595158
  0.007619	  0.843037	  0.609223
  0.022107	  0.846590	  0.620929
  0.036605	  0.839165	  0.635583
  0.048447	  0.828691	  0.650232
  0.052968	  0.822526	  0.668857
  0.060578	  0.817610	  0.685084
  0.070490	  0.813712	  0.707095
  0.074822	  0.808110	  0.726206
  0.087368	  0.801225	  0.735515
  0.097970	  0.790658	  0.750782
  0.113781	  0.780256	  0.766693
  0.121190	  0.775484	  0.779093
  0.126724	  0.767004	  0.795837
  0.131717	  0.756381	  0.811973
  0.135022	  0.743179	  0.830644
  0.136324	  0.732446	  0.846758
  0.145566	  0.727461	  0.865330
  0.152606	  0.722870	  0.884929
  0.158589	  0.718972	  0.905819
  0.159072	  0.714934	  0.921751
  0.159199	  0.708420	  0.942230
  0.157182	  0.701182	  0.961272
  0.154555	  0.694586	  0.979797
  0.152441	  0.688173	  0.998889
  0.150440	  0.680922	  1.017598
  0.148988	  0.673021	  1.034887
  0.147277	  0.665411	  1.053485
  0.144916	  0.654437	  1.071528
  0.141451	  0.644209	  1.089150
  0.137122	  0.639260	  1.107406
  0.133698	  0.633413	  1.125746
  0.131301	  0.625508	  1.144606
  0.129714	  0.620565	  1.164319
  0.128237	  0.613789	  1.185063
  0.122330	  0.605352	  1.199560
  0.118071	  0.600710	  1.219295
  0.113046	  0.596361	  1.240593
  0.106550	  0.586810	  1.257787
  0.100923	  0.577415	  1.269824
  0.096738	  0.570206	  1.289264
  0.093857	  0.566739	  1.307560
  0.090750	  0.556165	  1.331085
  0.087354	  0.545192	  1.346429
  0.082166	  0.540434	  1.362415
  0.073877	  0.538707	  1.382892
  0.067505	  0.530876	  1.402439
  0.069016	  0.520517	  1.418565
  0.067357	  0.516462	  1.438078
  0.063097	  0.510310	  1.457171
  0.063906	  0.502259	  1.475701
  0.063461	  0.499391	  1.495778
  0.063769	  0.494296	  1.515092
  0.064583	  0.487970	  1.532596
  0.065608	  0.479100	  1.554834
  0.063480	  0.474654	  1.573585
  0.061679	  0.472246	  1.591892
  0.062409	  0.466364	  1.611666
  0.057162	  0.467232	  1.629359
  0.051341	  0.464660	  1.652856
  0.050836	  0.456722	  1.671871
  0.055228	  0.453004	  1.687901
  0.056613	  0.450094	  1.708904
  0.056568	  0.443460	  1.730591
  0.055225	  0.442196	  1.747798
  0.054708	  0.440522	  1.768889
  0.062623	  0.432875	  1.788681
  0.067990	  0.424133	  1.804083
  0.069696	  0.413653	  1.823203
  0.070104	  0.408486	  1.844707
  0.074004	  0.411703	  1.862199
  0.078141	  0.410002	  1.883605
  0.079312	  0.403585	  1.904493
  0.080750	  0.397072	  1.922246
  0.085646	  0.389225	  1.940617
  0.092741	  0.387229	  1.960071
  0.101361	  0.386542	  1.978644
  0.106480	  0.377456	  1.994865
  0.110005	  0.368381	  2.011338
  0.118655	  0.362431	  2.032968
  0.128575	  0.352178	  2.047699
  0.132937	  0.346239	  2.064695
  0.140808	  0.347502	  2.086393
  0.149756	  0.338085	  2.101528
  0.157524	  0.330308	  2.115508
  0.167404	  0.325796	  2.136430
  0.173335	  0.323871	  2.158650
  0.182216	  0.319475	  2.171904
  0.192249	  0.309780	  2.184262
  0.202958	  0.297755	  2.200446
  0.220099	  0.287195	  2.212404
  0.231863	  0.287141	  2.226778
  0.241201	  0.279695	  2.243902
  0.248536	  0.268898	  2.258974
  0.255731	  0.254241	  2.271571
  0.262224	  0.238966	  2.283067
  0.272563	  0.223102	  2.293006
  0.283561	  0.214055	  2.305348
  0.291870	  0.199332	  2.316035
  0.300179	  0.184609	  2.326722
