 -1.310287	 -1.213503	 -1.818671
 -1.303936	 -1.242455	 -1.840365
 -1.307837	 -1.226667	 -1.828969
 -1.312451	 -1.210267	 -1.817818
 -1.316577	 -1.194266	 -1.806974
 -1.320080	 -1.177742	 -1.797682
 -1.323687	 -1.159147	 -1.786414
 -1.326527	 -1.142898	 -1.775521
 -1.323559	 -1.125784	 -1.766133
 -1.318800	 -1.107386	 -1.758111
 -1.317131	 -1.088852	 -1.748046
 -1.319586	 -1.071624	 -1.740238
 -1.320686	 -1.052006	 -1.736030
 -1.320214	 -1.031865	 -1.727306
 -1.314597	 -1.014360	 -1.722130
 -1.309240	 -0.995250	 -1.719896
 -1.305841	 -0.975428	 -1.717151
 -1.301510	 -0.955816	 -1.713815
 -1.294301	 -0.937346	 -1.711172
 -1.286573	 -0.918920	 -1.710925
 -1.280742	 -0.899758	 -1.710700
 -1.275719	 -0.880124	 -1.709206
 -1.268448	 -0.861487	 -1.707390
 -1.260246	 -0.843746	 -1.709776
 -1.252972	 -0.825125	 -1.713282
 -1.246571	 -0.806210	 -1.713774
 -1.234566	 -0.787062	 -1.704988
 -1.223951	 -0.771083	 -1.702209
 -1.216896	 -0.754665	 -1.708841
 -1.207200	 -0.734996	 -1.713881
 -1.196179	 -0.717293	 -1.714014
 -1.189455	 -0.699058	 -1.708379
 -1.185043	 -0.679921	 -1.706053
 -1.178712	 -0.659547	 -1.704479
 -1.175034	 -0.640872	 -1.700698
 -1.171503	 -0.621412	 -1.701904
 -1.166511	 -0.602244	 -1.707125
 -1.163660	 -0.580877	 -1.706607
 -1.160747	 -0.560558	 -1.699143
 -1.157613	 -0.545216	 -1.696947
 -1.160277	 -0.525936	 -1.690773
 -1.171641	 -0.513630	 -1.679307
 -1.185316	 -0.504235	 -1.667883
 -1.200305	 -0.496935	 -1.656840
 -1.215301	 -0.489643	 -1.645797
 -1.230315	 -0.482334	 -1.634788
 -1.245310	 -0.475033	 -1.623757
 -1.259747	 -0.465956	 -1.613317
 -1.273708	 -0.456569	 -1.602667
 -1.287518	 -0.447063	 -1.591332
 -1.301556	 -0.437313	 -1.580896
 -1.316399	 -0.427685	 -1.571997
 -1.330966	 -0.418037	 -1.562036
 -1.345204	 -0.408443	 -1.551762
 -1.357448	 -0.396323	 -1.541606
 -1.369527	 -0.384058	 -1.531426
 -1.381629	 -0.371767	 -1.521302
 -1.393710	 -0.359499	 -1.511128
 -1.405800	 -0.347221	 -1.500974
 -1.417886	 -0.334945	 -1.490808
 -1.429520	 -0.322772	 -1.480027
 -1.434570	 -0.312730	 -1.463484
 -1.439605	 -0.302686	 -1.446937
 -1.444600	 -0.292696	 -1.430365
 -1.449722	 -0.283405	 -1.413928
 -1.454889	 -0.275801	 -1.396105
 -1.457932	 -0.270675	 -1.376256
 -1.459837	 -0.260950	 -1.357324
 -1.455727	 -0.251246	 -1.342402
 -1.449787	 -0.242052	 -1.325116
 -1.447397	 -0.230505	 -1.305626
 -1.448169	 -0.223791	 -1.288124
 -1.447821	 -0.218922	 -1.268735
 -1.447019	 -0.208843	 -1.250085
 -1.443620	 -0.193843	 -1.237607
 -1.440048	 -0.177107	 -1.227728
 -1.441074	 -0.159813	 -1.217859
 -1.442100	 -0.141617	 -1.210427
 -1.441365	 -0.121543	 -1.205561
 -1.442450	 -0.101972	 -1.198163
 -1.446720	 -0.086386	 -1.186831
 -1.451645	 -0.071301	 -1.175647
 -1.455527	 -0.056528	 -1.161982
 -1.457612	 -0.040325	 -1.150455
 -1.460655	 -0.027734	 -1.134002
 -1.463705	 -0.020064	 -1.115530
 -1.460451	 -0.017991	 -1.096951
 -1.457883	 -0.013873	 -1.077801
 -1.456812	 -0.014195	 -1.055229
 -1.452951	 -0.018413	 -1.037683
 -1.446798	 -0.022710	 -1.018659
 -1.444607	 -0.023734	 -0.997901
 -1.442087	 -0.022640	 -0.978756
 -1.441369	 -0.020882	 -0.957108
 -1.440887	 -0.025308	 -0.936626
 -1.442570	 -0.025578	 -0.918374
 -1.441723	 -0.020530	 -0.898634
 -1.442187	 -0.012635	 -0.878347
 -1.437726	 -0.011736	 -0.860051
 -1.432314	 -0.012800	 -0.837847
 -1.431273	 -0.012422	 -0.818059
 -1.436267	 -0.004559	 -0.798715
 -1.436613	  0.007869	 -0.782603
 -1.433513	  0.016471	 -0.765395
 -1.433943	  0.024920	 -0.742314
 -1.439552	  0.025150	 -0.725214
 -1.438596	  0.030474	 -0.706486
 -1.433045	  0.038996	 -0.687104
 -1.428658	  0.046116	 -0.666240
 -1.432449	  0.058314	 -0.651157
 -1.429518	  0.065139	 -0.636315
 -1.426987	  0.071212	 -0.613857
 -1.437105	  0.083113	 -0.593409
 -1.436337	  0.092741	 -0.581764
 -1.433763	  0.110340	 -0.568312
 -1.437323	  0.123092	 -0.552344
 -1.445188	  0.133050	 -0.536583
 -1.443418	  0.152200	 -0.521601
 -1.438586	  0.165158	 -0.509145
 -1.439652	  0.177956	 -0.494892
 -1.440778	  0.194547	 -0.481668
 -1.441065	  0.213657	 -0.473302
 -1.439954	  0.225264	 -0.458472
 -1.440021	  0.234117	 -0.438032
 -1.448100	  0.250617	 -0.420071
 -1.449470	  0.263666	 -0.409730
 -1.446277	  0.286672	 -0.403809
 -1.448785	  0.306689	 -0.400452
 -1.456133	  0.321225	 -0.388214
 -1.461478	  0.335840	 -0.375051
 -1.462678	  0.353664	 -0.365946
 -1.465391	  0.369100	 -0.355341
 -1.469960	  0.385566	 -0.338198
 -1.470839	  0.400293	 -0.326234
 -1.472882	  0.415985	 -0.316972
 -1.476651	  0.433631	 -0.304586
 -1.477764	  0.449015	 -0.289871
 -1.481738	  0.461137	 -0.278903
 -1.485580	  0.476703	 -0.265567
 -1.486747	  0.491440	 -0.248519
 -1.489039	  0.503325	 -0.233525
 -1.492305	  0.514172	 -0.219652
 -1.494844	  0.527328	 -0.203684
 -1.496162	  0.540319	 -0.188076
 -1.497418	  0.553086	 -0.172733
 -1.498022	  0.566505	 -0.157915
 -1.498362	  0.580176	 -0.143321
 -1.498698	  0.593851	 -0.128730
 -1.498246	  0.608182	 -0.114787
 -1.497471	  0.622767	 -0.101124
 -1.496712	  0.637352	 -0.087460
 -1.496297	  0.651918	 -0.073761
 -1.496036	  0.666425	 -0.059996
 -1.497788	  0.680070	 -0.045481
 -1.499547	  0.693711	 -0.030961
 -1.500906	  0.707203	 -0.016259
 -1.502256	  0.720688	 -0.001551
 -1.503622	  0.734005	  0.013307
 -1.504925	  0.747122	  0.028234
 -1.505274	  0.760223	  0.042316
 -1.506414	  0.774092	  0.057495
 -1.509991	  0.787657	  0.074107
 -1.512158	  0.800463	  0.087822
 -1.511115	  0.816507	  0.100069
 -1.511734	  0.832467	  0.113063
 -1.515780	  0.843697	  0.127779
 -1.517205	  0.858990	  0.140883
 -1.520138	  0.876154	  0.154405
 -1.522468	  0.889153	  0.166743
 -1.524391	  0.902077	  0.181706
 -1.527813	  0.915107	  0.197031
 -1.530012	  0.932995	  0.208955
 -1.529470	  0.950914	  0.218705
 -1.529372	  0.967833	  0.228807
 -1.537914	  0.983416	  0.240957
 -1.545847	  0.998732	  0.254588
 -1.544469	  1.010861	  0.267638
 -1.546238	  1.026120	  0.281763
 -1.545493	  1.041044	  0.295286
 -1.544601	  1.057404	  0.306603
 -1.545011	  1.075119	  0.317549
 -1.544842	  1.090989	  0.331026
 -1.546894	  1.102561	  0.345987
 -1.548905	  1.115975	  0.362250
 -1.549113	  1.130759	  0.375657
 -1.549168	  1.147428	  0.386052
 -1.548840	  1.164743	  0.398549
 -1.550704	  1.175724	  0.413995
 -1.553914	  1.187682	  0.430476
 -1.555974	  1.202891	  0.445312
 -1.557455	  1.219376	  0.455613
 -1.556748	  1.238447	  0.464091
 -1.556155	  1.255331	  0.475506
 -1.557890	  1.268659	  0.489725
 -1.560184	  1.283808	  0.503120
 -1.561653	  1.300357	  0.514452
 -1.563885	  1.316205	  0.526089
 -1.567615	  1.329345	  0.539471
 -1.569143	  1.344961	  0.553806
 -1.570463	  1.364157	  0.564541
 -1.574981	  1.382879	  0.570862
 -1.579227	  1.403964	  0.577251
 -1.574133	  1.416469	  0.590124
 -1.573861	  1.430925	  0.606051
 -1.577662	  1.445773	  0.616356
 -1.580748	  1.464922	  0.626177
 -1.581947	  1.480389	  0.639613
 -1.582108	  1.493217	  0.656133
 -1.582894	  1.509381	  0.667259
 -1.583419	  1.525858	  0.677112
 -1.582975	  1.541272	  0.692739
 -1.583042	  1.556976	  0.704949
 -1.582650	  1.573126	  0.714050
 -1.581210	  1.587814	  0.729586
 -1.581035	  1.603684	  0.742804
 -1.580447	  1.620238	  0.750354
 -1.577589	  1.638064	  0.763946
 -1.573561	  1.652813	  0.777742
 -1.570316	  1.666159	  0.791075
 -1.568283	  1.679470	  0.803337
 -1.565312	  1.694757	  0.817452
 -1.561895	  1.709257	  0.831048
 -1.558130	  1.723254	  0.844836
 -1.554537	  1.737356	  0.858581
 -1.550450	  1.750788	  0.872827
 -1.546214	  1.764020	  0.887210
 -1.542545	  1.777140	  0.901853
 -1.539398	  1.790117	  0.916743
 -1.536254	  1.803093	  0.931634
 -1.533067	  1.816347	  0.946840
 -1.529750	  1.836068	  0.969166
 -1.527605	  1.849240	  0.984063
