  2.420441	  0.328519	 -1.792886
  2.396476	  0.325267	 -1.775135
  2.359431	  0.311351	 -1.747506
  2.315293	  0.299105	 -1.732389
  2.270154	  0.282892	 -1.722505
  2.226485	  0.270581	 -1.701105
  2.183621	  0.255798	 -1.678842
  2.139869	  0.238840	 -1.658689
  2.096046	  0.220625	 -1.639886
  2.052696	  0.201600	 -1.622194
  2.009720	  0.182046	 -1.605893
  1.966893	  0.162331	 -1.591693
  1.923715	  0.142591	 -1.577588
  1.880440	  0.123230	 -1.562406
  1.837470	  0.104761	 -1.545946
  1.793396	  0.087171	 -1.528780
  1.749607	  0.071360	 -1.510715
  1.705537	  0.058291	 -1.491221
  1.660396	  0.048692	 -1.469634
  1.614768	  0.043760	 -1.445628
  1.569849	  0.040651	 -1.420605
  1.526524	  0.035797	 -1.397548
  1.484607	  0.031104	 -1.377624
  1.445985	  0.030067	 -1.357803
  1.411129	  0.036699	 -1.335071
  1.379091	  0.054766	 -1.304203
  1.350799	  0.083390	 -1.264625
  1.325784	  0.109739	 -1.219878
  1.298402	  0.128761	 -1.167719
  1.266876	  0.145797	 -1.103545
  1.234449	  0.163432	 -1.035356
  1.204843	  0.177198	 -0.980228
  1.180870	  0.180504	 -0.944108
  1.151954	  0.171698	 -0.909315
  1.099929	  0.138356	 -0.854746
  1.029207	  0.100749	 -0.774913
  0.968888	  0.088115	 -0.680159
  0.927764	  0.071383	 -0.597489
  0.898634	  0.038527	 -0.528585
  0.872926	 -0.008015	 -0.486620
  0.849401	 -0.046887	 -0.478948
  0.826899	 -0.076374	 -0.488462
  0.794806	 -0.116342	 -0.518191
  0.758420	 -0.163037	 -0.570836
  0.717969	 -0.202610	 -0.642998
  0.660458	 -0.237977	 -0.732284
  0.573238	 -0.284053	 -0.820479
  0.471033	 -0.342779	 -0.865126
  0.382753	 -0.379932	 -0.863877
  0.321430	 -0.400185	 -0.851978
  0.273330	 -0.415972	 -0.837215
  0.228194	 -0.432209	 -0.820022
  0.184303	 -0.450128	 -0.800870
  0.142373	 -0.470054	 -0.780144
  0.101641	 -0.491157	 -0.759422
  0.061870	 -0.511570	 -0.740895
  0.021111	 -0.531032	 -0.724010
 -0.021709	 -0.549191	 -0.705838
 -0.064355	 -0.564977	 -0.685460
 -0.106741	 -0.579011	 -0.663143
 -0.148153	 -0.591594	 -0.639015
 -0.189978	 -0.603862	 -0.613227
 -0.233336	 -0.615968	 -0.587741
 -0.277216	 -0.627468	 -0.562561
 -0.319851	 -0.638279	 -0.537623
 -0.361331	 -0.648894	 -0.513115
 -0.402691	 -0.659829	 -0.489129
 -0.444623	 -0.670907	 -0.466866
 -0.488442	 -0.682213	 -0.447202
 -0.536594	 -0.693568	 -0.429734
 -0.585679	 -0.704802	 -0.415540
 -0.635759	 -0.715907	 -0.404595
 -0.686195	 -0.726375	 -0.396458
 -0.735657	 -0.736606	 -0.389245
 -0.784167	 -0.747256	 -0.381938
 -0.831684	 -0.759373	 -0.374129
 -0.878953	 -0.773820	 -0.364570
 -0.925279	 -0.790842	 -0.350552
 -0.969862	 -0.809671	 -0.332347
 -1.013295	 -0.829648	 -0.311706
 -1.054973	 -0.848903	 -0.289555
 -1.095456	 -0.864812	 -0.266860
 -1.136457	 -0.878095	 -0.241701
 -1.176109	 -0.891588	 -0.211917
 -1.212806	 -0.909549	 -0.180917
 -1.243411	 -0.938416	 -0.147869
 -1.288580	 -0.954225	 -0.127797
 -1.323974	 -0.982496	 -0.103232
 -1.376683	 -0.983903	 -0.096401
 -1.428809	 -0.989659	 -0.088470
 -1.478252	 -1.001497	 -0.077478
 -1.524194	 -1.016462	 -0.063698
 -1.567626	 -1.031140	 -0.050277
 -1.611048	 -1.045617	 -0.037827
 -1.657143	 -1.061141	 -0.025154
 -1.703456	 -1.078643	 -0.009624
 -1.747927	 -1.097380	  0.008100
 -1.791482	 -1.116040	  0.027865
 -1.834353	 -1.134422	  0.049144
 -1.876890	 -1.152061	  0.070554
 -1.919087	 -1.168171	  0.091652
 -1.961772	 -1.183359	  0.113506
 -2.002959	 -1.197632	  0.134931
 -2.043899	 -1.211747	  0.155867
 -2.084694	 -1.226865	  0.176326
 -2.128674	 -1.243446	  0.194390
 -2.171506	 -1.265299	  0.213098
 -2.211450	 -1.287201	  0.235204
 -2.253043	 -1.305511	  0.257155
 -2.295376	 -1.321459	  0.279292
 -2.337498	 -1.337380	  0.302126
 -2.378533	 -1.354169	  0.324484
 -2.418996	 -1.371516	  0.345801
 -2.460039	 -1.389100	  0.366414
 -2.502898	 -1.407090	  0.386567
 -2.548216	 -1.425339	  0.404269
 -2.598497	 -1.442268	  0.409480
 -2.624482	 -1.456691	  0.413575
