  0.284439	  2.464768	  0.440550
  0.272324	  2.489546	  0.460949
  0.279332	  2.475390	  0.449649
  0.285379	  2.460671	  0.439630
  0.292100	  2.443786	  0.425863
  0.299522	  2.430681	  0.411427
  0.309887	  2.417899	  0.399296
  0.317400	  2.404749	  0.387999
  0.319753	  2.392616	  0.375424
  0.325259	  2.377151	  0.360428
  0.331178	  2.363173	  0.347181
  0.337075	  2.349462	  0.333866
  0.343187	  2.335932	  0.320474
  0.350351	  2.324037	  0.306403
  0.363117	  2.330558	  0.292889
  0.374994	  2.341559	  0.281410
  0.385238	  2.354688	  0.269926
  0.400376	  2.367635	  0.260822
  0.417230	  2.377665	  0.254281
  0.433636	  2.384889	  0.248629
  0.452361	  2.393085	  0.244296
  0.469771	  2.402665	  0.241104
  0.486366	  2.411117	  0.232707
  0.500778	  2.422926	  0.225077
  0.522111	  2.427531	  0.214743
  0.538735	  2.428214	  0.204787
  0.553301	  2.431200	  0.194943
  0.572402	  2.440218	  0.184780
  0.589112	  2.447104	  0.178862
  0.604781	  2.453442	  0.171425
  0.625437	  2.457314	  0.165800
  0.643658	  2.463009	  0.159837
