 -2.237203	 -0.585430	  1.011349
 -2.238407	 -0.584744	  1.013924
 -2.230173	 -0.589436	  0.996312
 -2.221940	 -0.594128	  0.978699
 -2.213721	 -0.599228	  0.961194
 -2.205510	 -0.604510	  0.943739
 -2.197380	 -0.609759	  0.926236
 -2.189616	 -0.614859	  0.908524
 -2.181852	 -0.619960	  0.890812
 -2.174364	 -0.624749	  0.872896
 -2.167281	 -0.629086	  0.854702
 -2.160198	 -0.633422	  0.836508
 -2.153734	 -0.637206	  0.817963
 -2.148219	 -0.640151	  0.798966
 -2.142704	 -0.643095	  0.779968
 -2.138196	 -0.645941	  0.760692
 -2.134886	 -0.648662	  0.741156
 -2.131575	 -0.651384	  0.721621
 -2.128540	 -0.653627	  0.701980
 -2.125617	 -0.655675	  0.682301
 -2.122771	 -0.657773	  0.662616
 -2.120379	 -0.660163	  0.642904
 -2.118650	 -0.663589	  0.623276
 -2.118557	 -0.669471	  0.604160
 -2.120220	 -0.676050	  0.585347
 -2.123173	 -0.683106	  0.566867
 -2.126596	 -0.690502	  0.548603
 -2.131183	 -0.698723	  0.530957
 -2.135771	 -0.706944	  0.513311
 -2.141041	 -0.715858	  0.496201
 -2.147179	 -0.725638	  0.479871
 -2.153318	 -0.735418	  0.463541
 -2.159457	 -0.745199	  0.447211
 -2.167380	 -0.755638	  0.432103
 -2.175851	 -0.766259	  0.417426
 -2.184323	 -0.776880	  0.402749
 -2.192794	 -0.787501	  0.388071
 -2.202841	 -0.798742	  0.374929
 -2.213245	 -0.810109	  0.362180
 -2.223649	 -0.821475	  0.349430
 -2.234292	 -0.832961	  0.336988
 -2.245699	 -0.844807	  0.325606
 -2.257107	 -0.856653	  0.314225
 -2.268515	 -0.868500	  0.302844
 -2.279233	 -0.879868	  0.290359
 -2.289342	 -0.890801	  0.277007
 -2.299450	 -0.901733	  0.263654
 -2.309559	 -0.912666	  0.250301
 -2.319667	 -0.923598	  0.236948
 -2.328518	 -0.933621	  0.223013
 -2.336346	 -0.943173	  0.207281
