  0.906984	  1.849393	  1.350618
  0.910408	  1.865704	  1.367028
  0.905973	  1.853804	  1.351433
  0.900284	  1.840684	  1.339682
  0.892586	  1.826016	  1.328852
  0.887139	  1.801065	  1.313089
  0.887116	  1.789130	  1.305420
  0.887283	  1.771897	  1.290578
  0.885928	  1.761713	  1.278745
  0.883270	  1.749030	  1.261457
  0.877308	  1.735951	  1.245080
  0.869347	  1.723740	  1.230536
  0.862106	  1.713129	  1.217308
  0.853933	  1.700296	  1.202362
  0.846383	  1.686583	  1.188552
  0.839692	  1.674308	  1.175084
  0.834807	  1.660601	  1.160966
  0.830595	  1.644416	  1.146559
  0.825887	  1.630349	  1.131967
  0.815109	  1.621912	  1.116054
  0.801017	  1.616418	  1.098850
  0.786353	  1.611655	  1.086023
  0.771542	  1.604464	  1.073858
  0.758006	  1.596103	  1.060979
  0.743407	  1.587645	  1.049669
  0.728153	  1.578673	  1.039849
  0.712036	  1.569546	  1.031333
  0.695350	  1.560315	  1.024407
  0.678453	  1.551043	  1.018759
  0.660923	  1.542326	  1.014090
  0.643265	  1.533847	  1.009830
  0.625440	  1.525511	  1.006642
  0.607746	  1.516168	  1.003514
  0.590410	  1.506211	  0.999081
  0.573757	  1.496026	  0.992901
  0.557288	  1.486656	  0.985701
  0.540993	  1.480007	  0.977489
  0.527051	  1.472152	  0.969877
  0.512901	  1.458186	  0.960997
  0.498760	  1.445859	  0.954847
  0.487895	  1.430334	  0.950155
  0.476030	  1.415348	  0.946222
  0.463532	  1.398017	  0.941921
  0.455880	  1.388037	  0.938404
  0.445110	  1.374697	  0.934553
  0.428357	  1.355382	  0.927513
  0.419055	  1.344211	  0.921640
  0.407974	  1.333085	  0.913467
  0.394650	  1.316914	  0.898651
  0.385305	  1.303971	  0.885886
  0.377351	  1.291868	  0.873665
  0.363227	  1.275442	  0.860718
  0.353273	  1.264255	  0.855263
  0.347689	  1.245142	  0.850866
  0.359573	  1.212956	  0.833603
  0.366971	  1.201126	  0.824095
  0.369307	  1.189251	  0.815218
  0.373871	  1.171507	  0.803775
  0.378038	  1.157900	  0.788732
  0.378872	  1.149010	  0.775726
  0.377002	  1.135230	  0.749710
  0.377989	  1.123047	  0.732355
  0.378323	  1.114156	  0.723320
  0.383899	  1.103939	  0.713154
  0.389501	  1.087259	  0.699550
  0.392077	  1.070059	  0.686660
  0.393934	  1.054025	  0.672292
  0.394441	  1.041287	  0.656375
  0.395505	  1.032456	  0.640907
  0.396940	  1.019486	  0.624249
  0.399729	  1.004307	  0.607708
  0.401758	  0.994795	  0.597724
  0.407609	  0.981505	  0.583670
  0.414959	  0.966827	  0.570306
  0.418417	  0.957496	  0.562015
  0.428593	  0.935333	  0.542411
  0.434824	  0.920458	  0.527252
  0.437314	  0.908598	  0.513232
  0.438285	  0.898013	  0.500829
  0.441930	  0.885263	  0.483821
  0.441898	  0.867414	  0.470041
  0.448845	  0.849530	  0.457741
  0.450720	  0.831824	  0.445703
  0.443030	  0.798776	  0.434627
  0.439638	  0.787972	  0.430607
  0.434187	  0.772603	  0.425010
  0.427380	  0.755766	  0.408772
  0.424346	  0.742703	  0.396506
  0.424085	  0.731798	  0.390191
  0.427598	  0.709525	  0.371456
  0.428269	  0.695335	  0.359392
  0.432347	  0.678646	  0.347994
  0.434328	  0.663787	  0.336384
  0.439920	  0.642440	  0.320269
  0.439059	  0.630837	  0.310755
  0.436052	  0.618275	  0.300493
  0.421842	  0.602233	  0.284959
  0.411916	  0.586799	  0.272111
  0.407718	  0.576423	  0.264629
  0.403090	  0.560596	  0.252375
  0.398802	  0.542072	  0.240657
  0.389632	  0.530483	  0.220532
  0.381196	  0.522340	  0.202266
  0.377054	  0.515105	  0.191670
  0.373618	  0.497013	  0.179828
  0.368407	  0.482198	  0.165495
  0.362765	  0.470795	  0.150770
  0.359293	  0.458477	  0.136606
  0.354551	  0.451911	  0.120278
  0.348367	  0.452041	  0.095954
  0.343919	  0.450472	  0.072984
  0.343066	  0.448252	  0.061099
  0.341559	  0.448127	  0.041448
  0.337336	  0.447503	  0.016233
  0.334456	  0.446577	  0.003467
  0.330742	  0.444229	 -0.012002
  0.319870	  0.444570	 -0.037686
  0.312831	  0.447196	 -0.054788
  0.308472	  0.451845	 -0.072342
  0.306408	  0.456687	 -0.091832
  0.305950	  0.461593	 -0.108743
  0.304904	  0.472814	 -0.130196
  0.303561	  0.481428	 -0.147461
  0.301791	  0.490153	 -0.161888
  0.301260	  0.498544	 -0.181104
  0.300397	  0.505605	 -0.197055
  0.300258	  0.516899	 -0.218203
  0.300343	  0.532108	 -0.241438
  0.301130	  0.540781	 -0.252036
  0.301559	  0.553277	 -0.266931
  0.301501	  0.565525	 -0.282598
  0.301327	  0.576979	 -0.295957
  0.297450	  0.591978	 -0.316640
  0.294978	  0.601828	 -0.333021
  0.292558	  0.612557	 -0.351023
  0.290284	  0.619711	 -0.364768
  0.290574	  0.630011	 -0.381273
  0.294062	  0.640369	 -0.399341
  0.295653	  0.651586	 -0.416249
  0.296087	  0.667844	 -0.434861
  0.299490	  0.680116	 -0.446223
  0.308558	  0.693617	 -0.459751
  0.314321	  0.704225	 -0.474342
  0.308948	  0.716281	 -0.492623
  0.305824	  0.727117	 -0.512348
  0.305211	  0.734249	 -0.530737
  0.304938	  0.738461	 -0.546178
  0.305843	  0.744595	 -0.565044
  0.302902	  0.756306	 -0.587908
  0.298430	  0.761262	 -0.606611
  0.292681	  0.763206	 -0.623319
  0.287960	  0.760518	 -0.639456
  0.282310	  0.759679	 -0.662207
  0.276798	  0.759904	 -0.685710
  0.273525	  0.761391	 -0.699371
  0.268103	  0.759749	 -0.719407
  0.263682	  0.754167	 -0.739654
  0.258282	  0.746521	 -0.759163
  0.255492	  0.732630	 -0.777181
  0.256220	  0.723827	 -0.792061
  0.254718	  0.714779	 -0.809079
  0.249687	  0.702365	 -0.827232
  0.247547	  0.692260	 -0.842508
  0.245206	  0.681052	 -0.859145
  0.239779	  0.667790	 -0.880989
  0.241455	  0.661466	 -0.897130
  0.242313	  0.656818	 -0.908217
  0.244904	  0.650389	 -0.925414
  0.248042	  0.638957	 -0.957765
  0.249646	  0.633681	 -0.977062
  0.248878	  0.630140	 -0.989196
  0.244416	  0.622397	 -1.011740
  0.241041	  0.612263	 -1.031252
  0.235337	  0.601035	 -1.046589
  0.228812	  0.585109	 -1.059519
  0.225044	  0.572653	 -1.066056
  0.220509	  0.559746	 -1.074552
  0.213651	  0.540803	 -1.085598
  0.207662	  0.514251	 -1.105239
  0.200751	  0.493335	 -1.118425
  0.197064	  0.478399	 -1.123580
  0.192456	  0.470345	 -1.130505
  0.188977	  0.456929	 -1.135828
  0.180837	  0.444836	 -1.143502
  0.169944	  0.423272	 -1.155922
  0.158694	  0.405110	 -1.167639
  0.149428	  0.391549	 -1.175442
  0.140062	  0.374155	 -1.184102
  0.132266	  0.353141	 -1.190002
  0.131457	  0.337925	 -1.194521
  0.131418	  0.318818	 -1.203995
  0.129634	  0.292838	 -1.209895
  0.129388	  0.272226	 -1.211326
  0.127425	  0.262032	 -1.215047
  0.127242	  0.246448	 -1.221742
  0.121630	  0.216067	 -1.234269
  0.120733	  0.206593	 -1.237842
  0.117986	  0.187403	 -1.243183
  0.115860	  0.160585	 -1.244301
  0.115485	  0.146145	 -1.244704
  0.119326	  0.129524	 -1.249203
  0.127078	  0.098795	 -1.255959
  0.128964	  0.086034	 -1.257992
  0.132039	  0.071869	 -1.261983
  0.135168	  0.049274	 -1.271991
  0.133864	  0.029123	 -1.279427
  0.131521	  0.009405	 -1.285133
  0.130298	 -0.005138	 -1.289591
  0.128412	 -0.025250	 -1.299191
  0.129552	 -0.041222	 -1.308280
  0.132119	 -0.056970	 -1.319027
  0.131575	 -0.069814	 -1.332319
  0.126082	 -0.091782	 -1.353958
  0.123824	 -0.098997	 -1.363486
  0.121522	 -0.107161	 -1.376813
  0.113373	 -0.124285	 -1.405338
  0.106437	 -0.135017	 -1.415644
  0.098339	 -0.144540	 -1.424346
  0.087205	 -0.158704	 -1.434218
  0.076721	 -0.169964	 -1.452413
  0.069473	 -0.174896	 -1.465618
  0.058158	 -0.177894	 -1.482101
  0.048737	 -0.182081	 -1.501074
  0.039102	 -0.183396	 -1.521262
  0.033422	 -0.183092	 -1.533813
  0.024462	 -0.180104	 -1.552261
  0.017378	 -0.174988	 -1.571239
  0.012094	 -0.169385	 -1.591188
  0.006990	 -0.162479	 -1.610931
  0.001423	 -0.154821	 -1.625605
 -0.011436	 -0.152487	 -1.636624
 -0.026823	 -0.149563	 -1.650076
 -0.038086	 -0.143589	 -1.665847
 -0.046654	 -0.134106	 -1.681508
 -0.054947	 -0.123869	 -1.697077
 -0.062704	 -0.114326	 -1.713068
 -0.068361	 -0.104986	 -1.730131
 -0.072192	 -0.094400	 -1.747077
 -0.074978	 -0.082324	 -1.762855
 -0.079057	 -0.070782	 -1.777060
 -0.087623	 -0.059158	 -1.789998
 -0.099427	 -0.048326	 -1.804534
 -0.106960	 -0.033976	 -1.821136
 -0.107583	 -0.012378	 -1.846542
 -0.107267	 -0.006617	 -1.853348
 -0.105973	  0.003828	 -1.865788
 -0.106854	  0.018382	 -1.890729
 -0.104649	  0.026981	 -1.908227
 -0.102648	  0.033989	 -1.920765
 -0.101225	  0.046528	 -1.944974
 -0.097088	  0.055222	 -1.966427
 -0.094395	  0.056894	 -1.976019
 -0.090800	  0.058915	 -1.995802
 -0.084509	  0.060771	 -2.020438
 -0.081130	  0.066667	 -2.039245
 -0.084347	  0.075801	 -2.060248
 -0.093845	  0.085637	 -2.079965
 -0.098842	  0.085617	 -2.097150
 -0.098368	  0.080314	 -2.118548
 -0.093779	  0.074009	 -2.138967
 -0.087507	  0.069700	 -2.154072
 -0.084457	  0.068482	 -2.172333
 -0.082608	  0.054910	 -2.205913
 -0.081166	  0.044945	 -2.219825
 -0.080490	  0.039648	 -2.228363
 -0.080113	  0.028101	 -2.251543
 -0.080304	  0.020534	 -2.270768
 -0.080617	  0.015132	 -2.285825
 -0.082107	  0.010038	 -2.306961
 -0.083716	  0.005488	 -2.326460
 -0.086154	  0.000511	 -2.346048
 -0.088612	 -0.004948	 -2.365919
 -0.090657	 -0.008950	 -2.382831
 -0.093346	 -0.017402	 -2.405137
 -0.094596	 -0.030674	 -2.423357
 -0.095176	 -0.040561	 -2.433606
 -0.096164	 -0.057303	 -2.453455
 -0.099426	 -0.063976	 -2.474154
 -0.106814	 -0.063902	 -2.505186
 -0.110964	 -0.090697	 -2.528311
 -0.114394	 -0.099853	 -2.545758
