 0.0 0.0 0.0 0
 -0.33876191647635245 -0.9392132955168818 -0.2261068645800937 1000
 0.0019303673083732598 0.1272308249318599 -0.8751542345829191 1000
 -0.5904704387784173 0.13447015102212453 -0.7757803206223103 1000
 0.5797148149919129 0.6827515131837139 0.5726640535428043 1000
 0.16420368030332175 -0.40322822900479616 0.7765639089332779 1000
 0.8288376029906039 -0.13092558003021992 0.5806188313163485 1000
 -0.004614638815684219 1.0002498655440692 0.13092397737884842 1000
 -0.3253711732780413 -0.5612852442920094 -0.8059071678923905 1000
 0.0 0.0 0.0 0
 0.15261902860058574 -0.7685978926864988 -0.6469079560152537 1000
 -0.8181387767459527 -0.4583851768936812 -0.4835741778606897 1000
 -0.45351549855152373 0.33218452761744577 0.7318575974939149 1000
 -0.3750196216130203 0.9253795099432056 0.03394307148309312 1000
 -0.6133864946627913 -0.15294620155967922 0.5958171137356729 1000
 0.23642244543736884 0.9144157253250659 0.45343343976380457 1000
 -0.8009080293348474 0.028812368579594107 0.4377493985629057 1000
 0.3394895836602046 0.6910301493396941 -0.43316115456063553 1000
 0.0 0.0 0.0 0
 0.4894837230853399 0.2912458374994994 -0.6351972341086425 1000
 -0.88589875889813 0.44608179224534195 -0.1695486876059426 1000
 0.5677568524127972 -0.7298117379243071 -0.37142506637471023 1000
 0.825307472491195 -0.3136151169888346 0.4872710452042863 1000
 0.031082742047616185 0.7338547317627194 0.7171256706951737 1000
 0.19451027152817288 -0.9683972092446702 0.029399636218798222 1000
 0.9503571300521484 0.2615975169232114 0.011377631473458993 1000
 0.3011034597884909 0.14929784582617145 0.9086092821381183 1000
 0.0 0.0 0.0 0
