 -2.234888	  0.553550	 -1.052040
 -2.234222	  0.559682	 -1.053877
 -2.249321	  0.541867	 -1.055303
 -2.253424	  0.519445	 -1.047845
 -2.251743	  0.501073	 -1.039149
 -2.246465	  0.484611	 -1.031685
 -2.245650	  0.464743	 -1.024899
 -2.246500	  0.445775	 -1.017918
 -2.246986	  0.427078	 -1.010977
 -2.247702	  0.408378	 -1.003910
 -2.248543	  0.389581	 -0.996911
 -2.249469	  0.370945	 -0.989624
 -2.250621	  0.352837	 -0.981223
 -2.252014	  0.334555	 -0.973147
 -2.253628	  0.316634	 -0.964462
 -2.256850	  0.299087	 -0.955377
 -2.260105	  0.281416	 -0.946575
 -2.263785	  0.263918	 -0.937612
 -2.268275	  0.246836	 -0.928228
 -2.272763	  0.229775	 -0.918867
 -2.276727	  0.213794	 -0.910856
 -2.279951	  0.196264	 -0.903688
 -2.281586	  0.172645	 -0.891600
 -2.285937	  0.159502	 -0.881109
 -2.294081	  0.146603	 -0.867973
 -2.300081	  0.128667	 -0.855446
 -2.299554	  0.111140	 -0.852534
 -2.298839	  0.088806	 -0.850985
 -2.302064	  0.069465	 -0.845123
 -2.309926	  0.054493	 -0.836785
 -2.318466	  0.034620	 -0.827794
 -2.322086	  0.015076	 -0.824410
 -2.325484	 -0.001885	 -0.823948
 -2.333632	 -0.023074	 -0.821092
 -2.338491	 -0.040600	 -0.816463
 -2.342428	 -0.058037	 -0.814768
 -2.347607	 -0.078885	 -0.816390
 -2.354458	 -0.098184	 -0.815210
 -2.362269	 -0.115977	 -0.812366
 -2.367691	 -0.135914	 -0.813036
 -2.372453	 -0.157494	 -0.814063
 -2.379587	 -0.176381	 -0.809831
 -2.387274	 -0.193174	 -0.801662
 -2.400399	 -0.224493	 -0.790026
 -2.406803	 -0.242996	 -0.785950
