 0.0 0.0 0.0 0
 0.4731615232568984 0.8534661118456699 -0.4074607700321927 1000
 -0.9003510064839302 0.3622754689173978 -0.1103939215222533 1000
 0.6130370572472723 -0.5470148158129722 -0.7029152098346689 1000
 -0.6750038016226201 -0.6771683056967545 -0.12513612850960126 1000
 -0.5831944742078693 0.26545991611868924 -0.7454580708968681 1000
 0.7917546158865292 -0.08210637416359025 -0.8172101491379387 1000
 0.19304717282582914 -0.5146091202500531 -0.9105588579010091 1000
 -0.8682221254580003 0.45678965063612725 0.352466871548913 1000
 0.0 0.0 0.0 0
 -0.0876310286180067 -0.8155836749966596 0.7139255271974179 1000
 -0.15811606414569376 -0.48629287474089766 -0.8679802318484446 1000
 0.8291268234523459 0.5581109717584318 -0.19961816495125728 1000
 -0.21315333506167464 0.9713153884205881 0.07683508776167114 1000
 0.7234839257233328 -0.4309260075017236 0.4796049825327408 1000
 0.8876301031306617 -0.23282415337415524 -0.594908520588532 1000
 0.7626515544232049 -0.6362847571793826 0.026556840149850325 1000
 -0.2050058535469586 -0.9607812125052092 0.3248043800014291 1000
 0.0 0.0 0.0 0
 -0.2866682465417044 0.7101407992233805 0.7023719586441106 1000
 -0.8424423170203613 -0.29457654871698447 0.6902872247956794 1000
 -0.31293105072887345 0.40984817246665584 -0.909501618658832 1000
 -0.6701746403229054 -0.7381473261705712 0.2826055725930448 1000
 0.7608456883668735 -0.13840703573053825 0.5505967323081155 1000
 0.2722786926152611 0.8582155812464767 -0.6052046314577462 1000
 -0.6259711884904721 -0.036171491882645526 0.9830555395783089 1000
 -0.5211470803370695 0.5917948689250712 -0.6168152950317476 1000
 0.0 0.0 0.0 0
 -0.49258815111020376 0.7401247171781802 0.5382139813982397 1000
 0.05763732370958896 -0.11706122155091225 1.0843074643255382 1000
 0.0705746790006917 0.996913194486988 -0.06991698655896855 1000
 0.001147166206210257 0.6456198952702348 0.7819281703060261 1000
 0.8346874293304536 0.4863825492566283 0.07359194338243769 1000
 -0.8791020398109228 -0.060773717736041816 0.7004544410901674 1000
 -0.4226152897859599 0.886145263333448 0.2189658428041154 1000
 0.26953202487705036 0.6982469437472438 -0.840430179407861 1000
 0.0 0.0 0.0 0
 0.6150476937566214 0.3298400162941029 0.6318750753101954 1000
 0.2345753812942284 0.175185913008558 -1.109960526058829 1000
 -0.7415254309254597 0.6657698162973987 0.18481230505274693 1000
 -0.656276442954217 -0.6958570508089116 0.5119172535229154 1000
 0.9945722356272748 0.09247434280503292 -0.25328054789089904 1000
 -0.3435466212525399 -0.9392611173795185 0.1672499473879616 1000
 0.5067675299357817 0.3871723157183027 -0.9790138936525988 1000
 0.49064474827463955 -0.4449623623608214 0.7586537493547719 1000
 0.0 0.0 0.0 0
 -0.08297666497460206 -0.325969160415685 -0.9874665538764896 1000
 0.6530670441270596 0.7473720924119038 -0.06319091026835495 1000
 -0.13629329239505605 0.8207211275186597 0.5669946622640086 1000
 -0.3785993460951152 0.7428417197617033 -0.5900014107396666 1000
 -0.8803396856533365 -0.4221627454621252 0.45012542799893945 1000
 0.8565826818320441 0.07669727668721327 0.3774907917993204 1000
 -0.24689296717612808 -0.4364842107373704 1.0345460285277404 1000
 0.9634256125364866 -0.20773975122469873 0.006897348671322134 1000
 0.0 0.0 0.0 0
 0.7740627710808575 0.1573554030876546 -0.8414767628884711 1000
 -0.15881443749484137 0.30348954736383815 -1.0221546008407942 1000
 0.5491343783104451 -0.7911493194263317 -0.33908203077766996 1000
 -0.003275798130334351 0.6922599516248682 -0.8485021517860583 1000
 0.3279406714760766 -0.4237965745427487 -0.9560002942357223 1000
 -0.9096725347220399 -0.4099706530891666 0.15077577201861786 1000
 0.9310491565365119 -0.3088873587446622 -0.3715338521416156 1000
 0.5259965632056635 0.775765344551063 0.20878439536338447 1000
 0.0 0.0 0.0 0
 0.30943875819195366 0.5003324293540476 0.7814340099917545 1000
 -0.7942461692365543 0.3254903178885249 0.6966673907078826 1000
 0.030063498467477634 0.07499595827051825 1.0796895574326488 1000
 0.8511350815563443 -0.5135969621626814 -0.012459494273709626 1000
