 -0.589235	  2.357089	  0.137822
 -0.598167	  2.366143	  0.143777
 -0.607099	  2.375197	  0.149732
 -0.602905	  2.357367	  0.131310
 -0.593538	  2.343677	  0.124337
 -0.584581	  2.329691	  0.118984
 -0.570279	  2.313006	  0.108398
 -0.559637	  2.301109	  0.097718
 -0.549782	  2.291000	  0.088031
 -0.536817	  2.273431	  0.077299
 -0.533022	  2.265787	  0.072553
 -0.530078	  2.256306	  0.063431
 -0.524735	  2.239157	  0.046895
 -0.517693	  2.227613	  0.035114
 -0.510816	  2.216033	  0.020719
 -0.511031	  2.205792	  0.007112
 -0.518799	  2.195908	 -0.007962
 -0.526650	  2.186797	 -0.025411
 -0.527763	  2.178278	 -0.044276
 -0.528372	  2.169712	 -0.061633
 -0.536670	  2.159712	 -0.081703
 -0.547588	  2.152621	 -0.096310
 -0.558056	  2.144779	 -0.109512
 -0.567381	  2.133173	 -0.122808
 -0.576851	  2.119805	 -0.134895
 -0.587345	  2.104682	 -0.148902
 -0.594388	  2.092054	 -0.160210
 -0.599663	  2.078529	 -0.170563
 -0.608426	  2.062247	 -0.183967
 -0.615983	  2.049018	 -0.192598
 -0.625108	  2.034538	 -0.202261
 -0.635643	  2.017260	 -0.213853
 -0.643298	  2.003840	 -0.222395
 -0.650610	  1.988950	 -0.230294
 -0.660315	  1.968639	 -0.242955
 -0.663524	  1.949422	 -0.258063
 -0.664035	  1.936957	 -0.267910
 -0.667875	  1.913123	 -0.262885
 -0.664468	  1.885761	 -0.249255
 -0.649563	  1.867098	 -0.244694
 -0.632396	  1.854226	 -0.241216
 -0.618120	  1.841902	 -0.235339
 -0.605873	  1.830059	 -0.224214
 -0.589555	  1.814451	 -0.211298
 -0.574986	  1.802574	 -0.202001
 -0.570026	  1.797026	 -0.194243
 -0.563757	  1.791429	 -0.175580
 -0.549330	  1.786625	 -0.156049
 -0.532719	  1.788555	 -0.143682
 -0.524045	  1.775531	 -0.122569
 -0.504928	  1.767613	 -0.103197
 -0.504054	  1.757197	 -0.086328
 -0.495429	  1.749784	 -0.073260
 -0.481764	  1.743352	 -0.059164
 -0.475191	  1.730850	 -0.044538
 -0.473501	  1.717175	 -0.031110
 -0.474902	  1.700683	 -0.015754
 -0.477981	  1.688614	 -0.002220
 -0.479185	  1.674410	  0.014038
 -0.476747	  1.663412	  0.026945
 -0.472243	  1.653254	  0.037378
 -0.465548	  1.641505	  0.049311
 -0.460117	  1.627978	  0.059931
 -0.455043	  1.610310	  0.070255
 -0.451773	  1.592223	  0.082161
 -0.445835	  1.571795	  0.095188
 -0.440699	  1.560845	  0.102042
 -0.434485	  1.548089	  0.110114
 -0.423997	  1.529645	  0.113025
 -0.424790	  1.516827	  0.119684
 -0.420320	  1.494874	  0.134449
 -0.411529	  1.485503	  0.138876
 -0.402134	  1.473594	  0.140684
 -0.377388	  1.449761	  0.145157
 -0.370365	  1.438732	  0.150325
 -0.343553	  1.424813	  0.139570
 -0.331530	  1.421084	  0.130121
 -0.323238	  1.407330	  0.142488
 -0.308400	  1.400437	  0.141133
 -0.296319	  1.391244	  0.135829
 -0.277271	  1.370881	  0.129508
 -0.262708	  1.352970	  0.116542
 -0.251091	  1.336825	  0.109100
 -0.243846	  1.325179	  0.104505
 -0.239867	  1.319282	  0.098908
 -0.231911	  1.305828	  0.094653
 -0.220520	  1.289826	  0.096768
 -0.202430	  1.268449	  0.094541
 -0.182119	  1.253266	  0.095252
 -0.161561	  1.241540	  0.090710
 -0.146386	  1.231986	  0.085896
 -0.137990	  1.224298	  0.080241
 -0.129614	  1.212984	  0.066020
 -0.122724	  1.200197	  0.049853
 -0.113818	  1.184556	  0.038635
 -0.106154	  1.168189	  0.031711
 -0.101829	  1.149976	  0.027696
 -0.099507	  1.131050	  0.026382
 -0.094825	  1.111308	  0.026788
 -0.078078	  1.094814	  0.029361
 -0.059086	  1.077633	  0.036961
 -0.048408	  1.063555	  0.045934
 -0.037839	  1.047876	  0.054701
 -0.029236	  1.038188	  0.059855
 -0.016131	  1.023058	  0.066302
  0.001789	  1.001864	  0.075594
  0.007654	  0.993090	  0.080317
  0.016199	  0.979027	  0.086968
  0.027065	  0.962443	  0.092094
  0.050058	  0.940789	  0.091396
  0.061882	  0.923984	  0.096255
  0.076416	  0.909372	  0.100886
  0.085737	  0.901991	  0.103544
  0.095733	  0.891381	  0.103725
  0.108534	  0.875445	  0.099639
  0.121661	  0.855237	  0.104549
  0.132117	  0.841972	  0.112687
  0.140978	  0.825164	  0.113632
  0.147045	  0.805584	  0.107740
  0.147660	  0.795474	  0.113449
  0.159750	  0.763981	  0.121408
  0.165239	  0.742988	  0.106391
  0.167752	  0.741314	  0.103356
  0.174421	  0.723481	  0.096088
  0.189578	  0.709629	  0.092378
  0.193638	  0.680766	  0.086067
  0.197899	  0.671484	  0.080480
  0.201969	  0.646510	  0.082370
  0.207684	  0.630125	  0.078872
  0.218189	  0.616697	  0.066344
  0.231629	  0.599310	  0.043810
  0.243712	  0.592328	  0.026161
  0.251503	  0.578411	  0.011565
  0.259110	  0.578820	  0.000832
  0.269461	  0.572317	 -0.018180
  0.281346	  0.567623	 -0.037763
  0.288528	  0.563993	 -0.055697
  0.292284	  0.561201	 -0.078213
  0.293059	  0.556495	 -0.102501
  0.295334	  0.551940	 -0.118204
  0.298365	  0.547766	 -0.132460
  0.308505	  0.540121	 -0.155380
  0.318349	  0.538971	 -0.178318
  0.322230	  0.537260	 -0.187670
  0.330875	  0.535092	 -0.207370
  0.339103	  0.534115	 -0.231383
  0.341594	  0.535986	 -0.249035
  0.345374	  0.535515	 -0.268412
  0.351151	  0.533577	 -0.287997
  0.357638	  0.532872	 -0.307255
  0.368295	  0.532673	 -0.327263
  0.380889	  0.532786	 -0.346077
  0.388198	  0.532216	 -0.358509
  0.397623	  0.531703	 -0.377777
  0.417668	  0.526452	 -0.400182
  0.431629	  0.518706	 -0.412629
  0.438309	  0.516063	 -0.421429
  0.443750	  0.511555	 -0.432013
  0.464595	  0.497420	 -0.466897
  0.468018	  0.492143	 -0.474286
  0.472654	  0.492353	 -0.486548
  0.490948	  0.475679	 -0.512137
  0.499584	  0.469237	 -0.526114
  0.505967	  0.465034	 -0.533632
  0.522419	  0.454286	 -0.552105
  0.530103	  0.442323	 -0.566969
  0.535250	  0.434983	 -0.578430
  0.550749	  0.424649	 -0.594228
  0.568245	  0.417936	 -0.610360
  0.578988	  0.413198	 -0.617725
  0.593534	  0.407528	 -0.626803
  0.610413	  0.401654	 -0.637995
  0.633803	  0.393950	 -0.649660
  0.646961	  0.389645	 -0.659287
  0.656351	  0.387616	 -0.664593
  0.681910	  0.382649	 -0.672605
  0.700542	  0.380557	 -0.678576
  0.720203	  0.381371	 -0.685462
  0.742801	  0.381904	 -0.696694
  0.751903	  0.381282	 -0.703416
  0.769306	  0.378294	 -0.716622
  0.789530	  0.374282	 -0.727976
  0.803074	  0.370849	 -0.735250
  0.824513	  0.365290	 -0.748799
  0.843169	  0.362089	 -0.758964
  0.856875	  0.362812	 -0.763597
  0.878679	  0.366684	 -0.770335
  0.898685	  0.372757	 -0.776615
  0.918896	  0.377544	 -0.781195
  0.940401	  0.374328	 -0.784780
  0.954231	  0.368948	 -0.787899
  0.968731	  0.362607	 -0.791090
  0.999408	  0.347452	 -0.798739
  1.009371	  0.341567	 -0.802876
  1.018358	  0.336850	 -0.806653
  1.034348	  0.327491	 -0.814817
  1.047044	  0.317846	 -0.821890
  1.062442	  0.304593	 -0.829008
  1.079017	  0.288411	 -0.839143
  1.087313	  0.276057	 -0.844962
  1.098923	  0.262352	 -0.847493
  1.121985	  0.242306	 -0.848547
  1.133703	  0.233129	 -0.851224
  1.144400	  0.223870	 -0.854023
  1.161111	  0.209975	 -0.856828
  1.178161	  0.195818	 -0.859569
  1.190748	  0.183729	 -0.861868
  1.206146	  0.168577	 -0.866489
  1.218169	  0.154399	 -0.870006
  1.229416	  0.139281	 -0.873508
  1.243617	  0.122521	 -0.881190
  1.251003	  0.111182	 -0.886658
  1.256852	  0.095157	 -0.894697
  1.263883	  0.074349	 -0.907410
  1.272648	  0.055526	 -0.918572
  1.278243	  0.043368	 -0.925729
  1.288925	  0.027860	 -0.936772
  1.301628	  0.019774	 -0.945824
  1.317935	  0.011749	 -0.957052
  1.340694	  0.000150	 -0.968767
  1.352476	 -0.008183	 -0.973660
  1.362865	 -0.019774	 -0.978691
  1.379630	 -0.040195	 -0.993493
  1.389196	 -0.047639	 -1.005918
  1.399789	 -0.053352	 -1.018216
  1.409334	 -0.061808	 -1.030880
  1.424265	 -0.078294	 -1.042277
  1.436238	 -0.089589	 -1.049739
  1.446948	 -0.105714	 -1.057561
  1.457207	 -0.125244	 -1.065375
  1.465023	 -0.140031	 -1.072011
  1.474824	 -0.154741	 -1.078973
  1.495785	 -0.175414	 -1.092322
  1.502903	 -0.182077	 -1.097894
  1.511405	 -0.193142	 -1.108038
  1.524766	 -0.208283	 -1.124415
  1.537829	 -0.221251	 -1.133145
  1.553041	 -0.234297	 -1.137458
  1.576048	 -0.247681	 -1.139324
  1.594675	 -0.256949	 -1.140063
  1.607940	 -0.263967	 -1.142321
  1.624890	 -0.277609	 -1.148704
  1.640423	 -0.291796	 -1.157250
  1.650148	 -0.299957	 -1.161417
  1.666604	 -0.313222	 -1.168018
  1.679502	 -0.328588	 -1.178043
  1.685357	 -0.341153	 -1.188977
  1.694242	 -0.358052	 -1.205257
  1.708966	 -0.373278	 -1.215146
  1.720584	 -0.382762	 -1.220042
  1.736377	 -0.395765	 -1.219407
  1.749471	 -0.411790	 -1.223333
  1.761607	 -0.426275	 -1.231084
  1.773783	 -0.441363	 -1.237841
  1.785671	 -0.457053	 -1.244407
  1.797047	 -0.472770	 -1.250498
  1.808835	 -0.488482	 -1.255992
  1.821111	 -0.503501	 -1.261265
  1.832590	 -0.517487	 -1.267113
  1.843124	 -0.530597	 -1.273605
  1.854276	 -0.544289	 -1.280415
  1.865708	 -0.558100	 -1.289528
  1.879157	 -0.571636	 -1.298146
  1.893099	 -0.584166	 -1.306465
  1.907240	 -0.596413	 -1.313715
  1.920994	 -0.608467	 -1.320912
  1.934612	 -0.621203	 -1.328294
  1.948743	 -0.634502	 -1.336298
  1.965870	 -0.650047	 -1.333734
  1.978370	 -0.662563	 -1.343066
  1.990870	 -0.675079	 -1.352398
