  2.082566	  0.422568	 -1.055540
  2.102752	  0.442471	 -1.057239
  2.122938	  0.462374	 -1.058938
  2.108723	  0.448355	 -1.057752
  2.094608	  0.434191	 -1.057424
  2.080685	  0.419863	 -1.058337
  2.066764	  0.405533	 -1.059265
  2.052856	  0.391192	 -1.060206
  2.040259	  0.375926	 -1.063063
  2.028203	  0.360371	 -1.066626
  2.016150	  0.344808	 -1.070166
  2.004756	  0.328800	 -1.073886
  1.994758	  0.311976	 -1.078010
  1.984768	  0.295145	 -1.082126
  1.974570	  0.278477	 -1.086391
  1.964224	  0.261928	 -1.090739
  1.953960	  0.245350	 -1.094866
  1.945598	  0.227651	 -1.097832
  1.939080	  0.208472	 -1.100512
  1.932025	  0.189082	 -1.104676
  1.926571	  0.170920	 -1.111029
  1.918181	  0.154429	 -1.122460
  1.906422	  0.139256	 -1.135219
  1.894068	  0.125623	 -1.142405
  1.881703	  0.108992	 -1.142172
  1.868257	  0.093031	 -1.136388
  1.850397	  0.078358	 -1.132877
  1.831978	  0.066020	 -1.136591
  1.816533	  0.054298	 -1.145562
  1.807514	  0.041526	 -1.157718
  1.799455	  0.027245	 -1.171369
  1.787881	  0.011737	 -1.179714
  1.776319	 -0.001710	 -1.181629
  1.763008	 -0.013139	 -1.181820
  1.743668	 -0.032525	 -1.186582
  1.731549	 -0.047174	 -1.192922
  1.721759	 -0.056218	 -1.200277
  1.707281	 -0.067409	 -1.212273
  1.691659	 -0.085090	 -1.225917
  1.683273	 -0.092903	 -1.232387
  1.659393	 -0.109052	 -1.239129
  1.635160	 -0.122611	 -1.243222
  1.626759	 -0.130277	 -1.241608
  1.613009	 -0.141325	 -1.243635
  1.597910	 -0.166472	 -1.238095
  1.593723	 -0.177800	 -1.234640
  1.588120	 -0.199871	 -1.227433
  1.569463	 -0.231209	 -1.221393
  1.559075	 -0.239028	 -1.220987
  1.546333	 -0.244558	 -1.220041
  1.521913	 -0.250873	 -1.222055
  1.505707	 -0.265537	 -1.224503
  1.495797	 -0.284077	 -1.226465
  1.486344	 -0.301900	 -1.227279
  1.480247	 -0.321974	 -1.227883
  1.475853	 -0.346769	 -1.229262
  1.466339	 -0.366026	 -1.232233
  1.450044	 -0.373348	 -1.234712
  1.434169	 -0.381969	 -1.239398
  1.422585	 -0.400855	 -1.245136
  1.413262	 -0.418082	 -1.250063
  1.409176	 -0.436577	 -1.256470
  1.409606	 -0.455069	 -1.264067
  1.410081	 -0.473556	 -1.271682
  1.410557	 -0.492044	 -1.279297
  1.411033	 -0.510531	 -1.286912
  1.411564	 -0.529007	 -1.294539
  1.415914	 -0.545981	 -1.304152
  1.423842	 -0.560596	 -1.315255
  1.431814	 -0.575172	 -1.326349
  1.439754	 -0.589419	 -1.337305
  1.445645	 -0.600133	 -1.349532
  1.430144	 -0.606252	 -1.353288
  1.414288	 -0.604000	 -1.343270
  1.408056	 -0.615921	 -1.343576
  1.398304	 -0.621520	 -1.345542
  1.379977	 -0.619488	 -1.339625
  1.357452	 -0.621831	 -1.327943
  1.339960	 -0.631780	 -1.320760
  1.322616	 -0.645613	 -1.316663
  1.306556	 -0.654837	 -1.322645
  1.285659	 -0.658748	 -1.319932
  1.264461	 -0.657364	 -1.313147
  1.243679	 -0.661504	 -1.305341
  1.225952	 -0.672020	 -1.298438
  1.211558	 -0.687021	 -1.296093
  1.194885	 -0.699893	 -1.293731
  1.178145	 -0.710912	 -1.289761
  1.162558	 -0.723478	 -1.286784
  1.147166	 -0.736600	 -1.284813
  1.131895	 -0.750827	 -1.283975
  1.117876	 -0.766257	 -1.284326
  1.107649	 -0.783835	 -1.287371
  1.099798	 -0.798942	 -1.292085
  1.089506	 -0.814796	 -1.295482
  1.075370	 -0.845109	 -1.302093
  1.071064	 -0.854113	 -1.304263
  1.067876	 -0.863417	 -1.304389
  1.061187	 -0.885938	 -1.304264
  1.039541	 -0.914028	 -1.314373
  1.032543	 -0.920147	 -1.318547
  1.021484	 -0.931412	 -1.317566
  1.005270	 -0.956357	 -1.316140
  0.992357	 -0.971441	 -1.324851
  0.983180	 -0.978614	 -1.332847
  0.962381	 -0.997758	 -1.350301
  0.956037	 -1.011165	 -1.353009
  0.953079	 -1.021564	 -1.352502
  0.944057	 -1.046899	 -1.349537
  0.928209	 -1.066378	 -1.349449
  0.912468	 -1.083354	 -1.352671
  0.895279	 -1.097152	 -1.359171
  0.873796	 -1.106902	 -1.370779
  0.858543	 -1.111357	 -1.383932
  0.847243	 -1.119114	 -1.398221
  0.833312	 -1.132343	 -1.411576
  0.824384	 -1.140522	 -1.415853
  0.808301	 -1.153706	 -1.418342
  0.789472	 -1.169265	 -1.420493
  0.772863	 -1.184244	 -1.424267
  0.763554	 -1.189971	 -1.426351
  0.741564	 -1.197575	 -1.432313
  0.712360	 -1.205102	 -1.445782
  0.701472	 -1.209717	 -1.448581
  0.687182	 -1.217227	 -1.450521
  0.659429	 -1.231724	 -1.454358
  0.643151	 -1.243584	 -1.455755
  0.633147	 -1.255013	 -1.451232
  0.627594	 -1.275156	 -1.440973
  0.611411	 -1.292582	 -1.439988
  0.596360	 -1.305902	 -1.443351
  0.580518	 -1.319443	 -1.450737
  0.567533	 -1.334067	 -1.455627
  0.556993	 -1.348847	 -1.459009
  0.544660	 -1.364533	 -1.463498
  0.535628	 -1.381114	 -1.456976
  0.530236	 -1.401368	 -1.450269
  0.521536	 -1.420782	 -1.445574
  0.506055	 -1.437444	 -1.448364
  0.490282	 -1.454718	 -1.454404
  0.482233	 -1.470165	 -1.454646
  0.469014	 -1.492792	 -1.455936
  0.464636	 -1.501910	 -1.455614
  0.456557	 -1.521626	 -1.454613
  0.449481	 -1.536519	 -1.455858
  0.428546	 -1.553272	 -1.461478
  0.412397	 -1.569925	 -1.467640
  0.405513	 -1.587508	 -1.468522
  0.400435	 -1.607538	 -1.467204
  0.394502	 -1.621638	 -1.463930
  0.381908	 -1.641872	 -1.461658
  0.372502	 -1.663873	 -1.461649
  0.359404	 -1.680696	 -1.467428
  0.344123	 -1.691136	 -1.474952
  0.328047	 -1.701193	 -1.479915
  0.313837	 -1.715635	 -1.480675
  0.301004	 -1.731032	 -1.480692
  0.287411	 -1.745642	 -1.480787
  0.273655	 -1.760161	 -1.480489
  0.259921	 -1.774814	 -1.480607
  0.245676	 -1.788979	 -1.482175
  0.231721	 -1.803143	 -1.484458
  0.217593	 -1.817257	 -1.486303
  0.204148	 -1.831998	 -1.489016
  0.191073	 -1.846847	 -1.492161
  0.178041	 -1.861754	 -1.495426
  0.164507	 -1.877306	 -1.499162
  0.146991	 -1.894084	 -1.500740
  0.132034	 -1.907345	 -1.500090
  0.117077	 -1.920606	 -1.499440
