 -0.670237	  1.511396	  1.800006
 -0.660167	  1.536451	  1.810814
 -0.650097	  1.561506	  1.821622
 -0.663681	  1.544216	  1.818084
 -0.670957	  1.524445	  1.812235
 -0.676524	  1.506856	  1.804701
 -0.680935	  1.490710	  1.795396
 -0.684356	  1.476701	  1.781700
 -0.686091	  1.462381	  1.767608
 -0.686721	  1.447686	  1.752181
 -0.685403	  1.430956	  1.738918
 -0.683357	  1.412286	  1.730042
 -0.681798	  1.391523	  1.723431
 -0.686057	  1.369885	  1.718294
 -0.695596	  1.349118	  1.714294
 -0.709001	  1.331549	  1.710697
 -0.720156	  1.318265	  1.704693
 -0.730509	  1.304830	  1.695628
 -0.740695	  1.288312	  1.685863
 -0.750166	  1.275205	  1.675883
 -0.760059	  1.258922	  1.666604
 -0.767963	  1.241686	  1.659267
 -0.772665	  1.223692	  1.651870
 -0.777265	  1.205689	  1.644380
 -0.780931	  1.189596	  1.634899
 -0.782936	  1.177057	  1.617668
 -0.786047	  1.161160	  1.603361
 -0.791743	  1.137148	  1.601638
 -0.801395	  1.113106	  1.601250
 -0.808974	  1.099147	  1.596162
 -0.817171	  1.083955	  1.590040
 -0.827164	  1.065676	  1.584034
 -0.836136	  1.048642	  1.576306
 -0.844933	  1.034838	  1.570441
 -0.855695	  1.019112	  1.564600
 -0.867462	  0.999889	  1.557393
 -0.876934	  0.987267	  1.553122
 -0.888041	  0.975611	  1.547284
 -0.904886	  0.958122	  1.531425
 -0.913585	  0.948846	  1.519062
 -0.922106	  0.939345	  1.505736
 -0.937716	  0.919079	  1.493560
 -0.951150	  0.900493	  1.491544
 -0.957744	  0.890281	  1.492025
 -0.968273	  0.873663	  1.490789
 -0.983988	  0.849479	  1.480133
 -0.987770	  0.843959	  1.476163
 -0.997047	  0.826310	  1.463383
 -1.008114	  0.804081	  1.456398
 -1.016243	  0.785874	  1.458921
 -1.024992	  0.767250	  1.463889
 -1.032856	  0.753846	  1.457501
 -1.041958	  0.737861	  1.445253
 -1.049887	  0.720399	  1.437068
 -1.057198	  0.703269	  1.429577
 -1.060305	  0.685982	  1.421831
 -1.060492	  0.666949	  1.420865
 -1.056379	  0.649074	  1.413311
 -1.057301	  0.627714	  1.390469
 -1.061234	  0.613235	  1.376436
 -1.066012	  0.603183	  1.365948
 -1.073519	  0.587003	  1.355282
 -1.079789	  0.567596	  1.347984
 -1.085829	  0.542406	  1.345275
 -1.087288	  0.520667	  1.345643
 -1.087759	  0.505746	  1.343645
 -1.089634	  0.488955	  1.335947
 -1.090661	  0.466126	  1.324334
 -1.090576	  0.446268	  1.318086
 -1.089970	  0.429470	  1.313718
 -1.090882	  0.409351	  1.306562
 -1.091559	  0.394606	  1.298959
 -1.095802	  0.375995	  1.288495
 -1.102389	  0.358619	  1.278672
 -1.109963	  0.339918	  1.271371
 -1.116695	  0.320485	  1.267101
 -1.122365	  0.302163	  1.263270
 -1.129586	  0.285106	  1.255919
 -1.137583	  0.269467	  1.246393
 -1.148779	  0.254127	  1.238233
 -1.161979	  0.239496	  1.234642
 -1.176356	  0.220121	  1.232499
 -1.185151	  0.200857	  1.229881
 -1.188948	  0.182770	  1.225334
 -1.191647	  0.166806	  1.220477
 -1.197212	  0.147368	  1.212719
 -1.205501	  0.128616	  1.207882
 -1.213312	  0.110376	  1.204126
 -1.221434	  0.094225	  1.198822
 -1.233226	  0.080763	  1.193062
 -1.249759	  0.066659	  1.189961
 -1.262721	  0.044623	  1.188511
 -1.265480	  0.022415	  1.183875
 -1.264193	  0.005564	  1.179293
 -1.267138	 -0.012701	  1.171485
 -1.275190	 -0.029583	  1.163526
 -1.284199	 -0.049255	  1.160339
 -1.290134	 -0.071254	  1.157199
 -1.293730	 -0.088396	  1.150404
 -1.297404	 -0.105851	  1.138833
 -1.300087	 -0.119404	  1.126704
 -1.303425	 -0.133933	  1.113239
 -1.308718	 -0.149774	  1.099536
 -1.314843	 -0.164030	  1.087393
 -1.322482	 -0.179690	  1.076135
 -1.330216	 -0.195665	  1.066467
 -1.338177	 -0.211504	  1.057154
 -1.346588	 -0.227426	  1.048444
 -1.355044	 -0.243374	  1.039835
 -1.363621	 -0.259999	  1.032752
 -1.372276	 -0.277442	  1.028183
 -1.380940	 -0.294882	  1.023626
 -1.391392	 -0.311432	  1.019521
 -1.402783	 -0.327417	  1.015691
 -1.411775	 -0.344155	  1.009454
 -1.416760	 -0.361081	  1.000043
 -1.421729	 -0.378003	  0.990610
 -1.426337	 -0.394581	  0.980415
 -1.430935	 -0.411142	  0.970190
 -1.435249	 -0.428030	  0.960381
 -1.438890	 -0.445598	  0.951596
 -1.442484	 -0.462940	  0.943023
 -1.450632	 -0.479746	  0.939452
 -1.464313	 -0.495557	  0.937066
 -1.471277	 -0.512900	  0.922537
 -1.478383	 -0.528999	  0.912879
 -1.485010	 -0.541848	  0.905874
 -1.491571	 -0.559161	  0.894714
 -1.494624	 -0.576991	  0.887569
 -1.500302	 -0.597395	  0.881520
 -1.512864	 -0.625263	  0.873034
 -1.515048	 -0.631350	  0.869325
 -1.517747	 -0.644935	  0.865449
 -1.520498	 -0.671808	  0.854572
 -1.530791	 -0.690911	  0.842701
 -1.534074	 -0.697267	  0.841642
 -1.543540	 -0.714266	  0.836647
 -1.542397	 -0.745261	  0.836219
 -1.542388	 -0.756560	  0.835477
 -1.544385	 -0.776634	  0.833323
 -1.559543	 -0.803418	  0.825871
 -1.566973	 -0.816153	  0.819650
 -1.569244	 -0.826209	  0.814342
 -1.572288	 -0.852139	  0.801353
 -1.568093	 -0.868231	  0.793014
 -1.570362	 -0.887378	  0.786686
 -1.573455	 -0.909625	  0.782307
 -1.585647	 -0.930019	  0.785372
 -1.600820	 -0.946403	  0.786246
 -1.615635	 -0.958740	  0.784881
 -1.624647	 -0.973593	  0.782579
 -1.635688	 -0.991580	  0.778234
 -1.643536	 -1.012025	  0.773662
 -1.650084	 -1.024761	  0.770558
 -1.662731	 -1.041095	  0.763388
 -1.677224	 -1.055047	  0.757044
 -1.687878	 -1.067903	  0.752869
 -1.701328	 -1.087115	  0.747647
 -1.711340	 -1.101926	  0.742786
 -1.722653	 -1.118370	  0.730409
 -1.734146	 -1.136380	  0.722024
 -1.739715	 -1.145677	  0.718158
 -1.749164	 -1.166435	  0.706446
 -1.753466	 -1.188624	  0.697790
 -1.755185	 -1.200968	  0.694317
 -1.759264	 -1.218389	  0.685901
 -1.765325	 -1.242254	  0.676827
 -1.768323	 -1.259339	  0.671116
 -1.773126	 -1.274767	  0.665882
 -1.781207	 -1.290080	  0.661861
 -1.799360	 -1.319968	  0.653300
 -1.801877	 -1.333383	  0.648086
 -1.802244	 -1.346383	  0.640557
 -1.803578	 -1.367297	  0.631059
 -1.805967	 -1.385796	  0.618958
 -1.808542	 -1.399015	  0.610653
 -1.816643	 -1.420234	  0.593156
 -1.825161	 -1.432177	  0.584133
 -1.831473	 -1.441124	  0.577271
 -1.844985	 -1.459358	  0.568962
 -1.852055	 -1.481887	  0.569096
 -1.857398	 -1.499592	  0.566668
 -1.865048	 -1.516329	  0.557752
 -1.871138	 -1.533367	  0.545617
 -1.874689	 -1.551292	  0.535666
 -1.873847	 -1.567016	  0.532126
 -1.873396	 -1.575449	  0.530227
