  1.536213	 -1.223541	  1.614993
  1.540431	 -1.219480	  1.619709
  1.529788	 -1.231262	  1.607504
  1.518636	 -1.242554	  1.595284
  1.506695	 -1.253185	  1.583201
  1.495245	 -1.262659	  1.570459
  1.487106	 -1.272399	  1.555062
  1.479676	 -1.283827	  1.536807
  1.469487	 -1.294742	  1.522126
  1.458639	 -1.304588	  1.511243
  1.447053	 -1.316507	  1.498504
  1.434593	 -1.325707	  1.485643
  1.422815	 -1.333075	  1.470809
  1.411065	 -1.343429	  1.456737
  1.403272	 -1.355183	  1.448308
  1.392437	 -1.370938	  1.434891
  1.374924	 -1.374010	  1.418992
  1.346951	 -1.380318	  1.405348
  1.336662	 -1.385625	  1.402501
  1.317002	 -1.394914	  1.397993
  1.303039	 -1.405045	  1.391028
  1.288192	 -1.419534	  1.383815
  1.271475	 -1.433570	  1.378683
  1.257110	 -1.446460	  1.373866
  1.244026	 -1.458418	  1.369750
  1.227824	 -1.470694	  1.365001
  1.208984	 -1.484327	  1.355542
  1.198225	 -1.493526	  1.345844
  1.187324	 -1.502719	  1.329635
  1.181025	 -1.512742	  1.316951
  1.170333	 -1.525265	  1.299204
  1.160273	 -1.536013	  1.286528
  1.151768	 -1.548146	  1.273849
  1.136974	 -1.560218	  1.259733
  1.120368	 -1.569632	  1.258251
  1.098872	 -1.584769	  1.261695
  1.082292	 -1.604366	  1.256167
  1.073943	 -1.621490	  1.245025
  1.069823	 -1.636645	  1.232203
  1.065291	 -1.651541	  1.220730
  1.058039	 -1.666256	  1.211480
  1.047619	 -1.681931	  1.202226
  1.039117	 -1.695305	  1.194675
  1.028344	 -1.712503	  1.185800
  1.015803	 -1.731185	  1.179319
  1.005876	 -1.744688	  1.176853
  0.991867	 -1.763584	  1.174083
  0.982096	 -1.779767	  1.169720
  0.974827	 -1.792971	  1.165572
  0.965531	 -1.811905	  1.156730
  0.956354	 -1.828266	  1.149834
  0.948850	 -1.842063	  1.145404
  0.937030	 -1.865036	  1.138286
  0.929732	 -1.882501	  1.130712
  0.925466	 -1.894175	  1.126458
  0.916448	 -1.917682	  1.121406
  0.909330	 -1.937071	  1.115234
  0.906827	 -1.949862	  1.105642
  0.904089	 -1.963431	  1.082466
  0.893304	 -1.977060	  1.067769
  0.882553	 -1.989484	  1.061506
  0.872321	 -2.005196	  1.050148
  0.861166	 -2.020649	  1.040639
  0.847552	 -2.033789	  1.036886
  0.836573	 -2.047870	  1.026891
  0.826138	 -2.062057	  1.016628
  0.813488	 -2.075201	  1.008661
  0.802655	 -2.088265	  0.997810
  0.792115	 -2.101239	  0.986817
  0.781249	 -2.113741	  0.975608
  0.770304	 -2.126120	  0.964339
  0.759306	 -2.138448	  0.953067
  0.748094	 -2.150572	  0.941785
  0.736881	 -2.162694	  0.930501
  0.725488	 -2.174841	  0.919424
  0.713961	 -2.187001	  0.908504
  0.702434	 -2.199161	  0.897584
  0.690619	 -2.211166	  0.886801
  0.678780	 -2.223158	  0.876029
  0.666841	 -2.235079	  0.865289
  0.654599	 -2.246776	  0.854643
  0.642358	 -2.258474	  0.843999
  0.629933	 -2.270209	  0.833611
  0.617350	 -2.281967	  0.823442
  0.604763	 -2.293725	  0.813276
  0.591922	 -2.305428	  0.803370
  0.579069	 -2.317186	  0.793551
  0.566205	 -2.329000	  0.783901
  0.553791	 -2.341268	  0.775690
  0.543772	 -2.358916	  0.769241
  0.531449	 -2.375736	  0.760147
  0.512975	 -2.375009	  0.745377
  0.499613	 -2.386510	  0.735933
