  1.584794	 -0.148365	  1.853473
  1.583224	 -0.139681	  1.871661
  1.584984	 -0.147470	  1.853917
  1.586963	 -0.149390	  1.833611
  1.587602	 -0.153882	  1.810445
  1.587938	 -0.162787	  1.792108
  1.589274	 -0.176838	  1.779440
  1.591268	 -0.189669	  1.763675
  1.592812	 -0.199068	  1.745233
  1.594359	 -0.208061	  1.727417
  1.596009	 -0.217209	  1.709671
  1.598192	 -0.227261	  1.692450
  1.600534	 -0.237497	  1.675422
  1.603541	 -0.248820	  1.659179
  1.606844	 -0.260669	  1.643379
  1.610318	 -0.272903	  1.627940
  1.614416	 -0.286332	  1.613692
  1.618487	 -0.299797	  1.599476
  1.622118	 -0.314341	  1.586241
  1.625672	 -0.329047	  1.573160
  1.628997	 -0.343840	  1.560118
  1.632111	 -0.358709	  1.547109
  1.635171	 -0.373536	  1.534040
  1.637810	 -0.387952	  1.520433
  1.640427	 -0.402345	  1.506794
  1.642640	 -0.416045	  1.492394
  1.644503	 -0.429147	  1.477400
  1.646340	 -0.442182	  1.462347
  1.648411	 -0.454285	  1.446565
  1.650535	 -0.466077	  1.430555
  1.652686	 -0.477846	  1.414545
  1.655323	 -0.488327	  1.397744
  1.658031	 -0.498427	  1.380701
  1.660750	 -0.508473	  1.363645
  1.663721	 -0.517138	  1.345917
  1.666699	 -0.525548	  1.328033
  1.669640	 -0.533806	  1.310099
  1.672855	 -0.540467	  1.291584
  1.676072	 -0.547089	  1.272981
  1.679233	 -0.553520	  1.254291
  1.683576	 -0.559629	  1.235723
  1.688229	 -0.566151	  1.217400
  1.692978	 -0.572697	  1.199050
  1.700486	 -0.580758	  1.182146
  1.708248	 -0.588965	  1.165601
  1.716249	 -0.597416	  1.149363
  1.724391	 -0.605878	  1.133175
  1.737313	 -0.614347	  1.120336
  1.751661	 -0.622536	  1.109004
  1.766093	 -0.630815	  1.097849
  1.780529	 -0.639202	  1.086815
  1.795070	 -0.647833	  1.076160
  1.809670	 -0.656526	  1.065667
  1.824242	 -0.665048	  1.054879
  1.839796	 -0.672902	  1.045046
  1.859564	 -0.674690	  1.042021
  1.879332	 -0.676465	  1.039542
  1.899083	 -0.678402	  1.037419
  1.918883	 -0.680303	  1.035185
  1.938655	 -0.682084	  1.032692
  1.958414	 -0.683835	  1.030140
  1.978172	 -0.685585	  1.027586
  1.997931	 -0.687335	  1.025032
  2.017690	 -0.689086	  1.022479
  2.037449	 -0.690838	  1.019925
  2.057208	 -0.692590	  1.017372
  2.076967	 -0.694341	  1.014818
  2.096723	 -0.696099	  1.012265
  2.116457	 -0.697796	  1.009951
  2.136468	 -0.698989	  1.008834
  2.156440	 -0.701851	  1.007508
  2.175795	 -0.702800	  1.002084
  2.195640	 -0.701571	  0.999926
