 -1.543122	  0.172921	  1.938271
 -1.552931	  0.172919	  1.945633
 -1.525537	  0.172923	  1.925073
 -1.489988	  0.174224	  1.896084
 -1.454955	  0.176515	  1.864800
 -1.419706	  0.179486	  1.830844
 -1.383288	  0.182680	  1.793931
 -1.339929	  0.183162	  1.752327
 -1.291063	  0.169966	  1.715973
 -1.248626	  0.152815	  1.688162
 -1.210567	  0.137846	  1.661523
 -1.173671	  0.124515	  1.633430
 -1.137735	  0.113412	  1.604271
 -1.103867	  0.105953	  1.575223
 -1.071567	  0.103795	  1.544916
 -1.037962	  0.105998	  1.512233
 -1.002372	  0.109886	  1.479479
 -0.968388	  0.115082	  1.447389
 -0.935166	  0.121894	  1.415039
 -0.899435	  0.130733	  1.380184
 -0.860139	  0.140300	  1.344581
 -0.818719	  0.148151	  1.311379
 -0.777936	  0.153411	  1.281264
 -0.740026	  0.157715	  1.250858
 -0.702805	  0.162204	  1.215978
 -0.665550	  0.164692	  1.177827
 -0.629955	  0.162709	  1.138828
 -0.594507	  0.156425	  1.098261
 -0.559373	  0.146388	  1.058156
 -0.522172	  0.134633	  1.018829
 -0.482529	  0.122335	  0.983517
 -0.442726	  0.111489	  0.951848
 -0.403946	  0.101928	  0.922188
 -0.365567	  0.091870	  0.893809
 -0.329805	  0.081205	  0.867035
 -0.293980	  0.073519	  0.839277
 -0.256318	  0.073148	  0.811186
 -0.216653	  0.074927	  0.782628
 -0.177337	  0.076876	  0.753446
 -0.138095	  0.078923	  0.721682
 -0.099572	  0.080357	  0.688391
 -0.060800	  0.078778	  0.653724
 -0.024611	  0.072106	  0.618032
  0.011975	  0.063066	  0.581719
  0.048393	  0.056481	  0.549098
  0.085575	  0.052337	  0.517093
  0.123585	  0.047133	  0.484007
  0.162777	  0.041540	  0.452180
  0.201700	  0.037016	  0.421962
  0.240715	  0.033974	  0.392540
  0.278816	  0.032826	  0.363730
  0.314585	  0.033665	  0.335776
  0.349515	  0.036839	  0.307046
  0.383331	  0.043608	  0.277544
  0.419100	  0.052432	  0.244519
  0.455454	  0.060761	  0.210055
  0.490753	  0.067587	  0.175690
  0.528062	  0.072786	  0.138214
  0.573001	  0.075397	  0.099572
  0.623390	  0.073621	  0.066597
  0.671058	  0.068278	  0.041828
  0.713581	  0.064009	  0.018597
  0.755077	  0.060435	 -0.007160
  0.794457	  0.056160	 -0.033896
  0.828141	  0.053103	 -0.060103
  0.859505	  0.053532	 -0.088533
  0.897318	  0.057315	 -0.119988
  0.938793	  0.059207	 -0.153972
  0.981850	  0.058285	 -0.187834
  1.026093	  0.054051	 -0.222005
  1.068015	  0.045060	 -0.259627
  1.106124	  0.031538	 -0.296566
  1.143001	  0.012034	 -0.332453
  1.179004	 -0.017125	 -0.369694
  1.216526	 -0.066059	 -0.413549
  1.247208	 -0.160851	 -0.486164
  1.220238	 -0.261217	 -0.594996
  1.168095	 -0.303875	 -0.684679
  1.144089	 -0.332046	 -0.745350
  1.179205	 -0.400896	 -0.789890
  1.216455	 -0.427805	 -0.818187
  1.248976	 -0.427435	 -0.843762
  1.301822	 -0.404533	 -0.888409
  1.347479	 -0.372490	 -0.917723
  1.407393	 -0.338351	 -0.918444
  1.480175	 -0.314330	 -0.873343
  1.558692	 -0.258910	 -0.811527
  1.661131	 -0.162947	 -0.770622
  1.737216	 -0.092192	 -0.779572
  1.786337	 -0.055475	 -0.815610
  1.824430	 -0.039275	 -0.857986
  1.857580	 -0.033700	 -0.900310
  1.886873	 -0.032938	 -0.941787
  1.918302	 -0.034184	 -0.986075
  1.954079	 -0.039521	 -1.031185
  1.989491	 -0.049132	 -1.073464
  2.022987	 -0.061101	 -1.111534
  2.058721	 -0.074672	 -1.149337
  2.096288	 -0.088071	 -1.182052
  2.164858	 -0.105155	 -1.235343
  2.170961	 -0.106430	 -1.241164
