  1.973415	 -0.605751	  1.279746
  2.013222	 -0.624342	  1.295970
  1.996755	 -0.615781	  1.288516
  1.980621	 -0.606865	  1.280763
  1.964497	 -0.597938	  1.273000
  1.948994	 -0.588499	  1.265216
  1.933934	 -0.576808	  1.259563
  1.921161	 -0.563020	  1.254272
  1.905876	 -0.549797	  1.240361
  1.892246	 -0.542969	  1.226896
  1.879317	 -0.537542	  1.219090
  1.865780	 -0.524793	  1.211201
  1.848056	 -0.510497	  1.197290
  1.836161	 -0.507023	  1.190079
  1.817610	 -0.501019	  1.179339
  1.802112	 -0.492683	  1.168273
  1.791976	 -0.480081	  1.158043
  1.777605	 -0.467225	  1.146546
  1.761878	 -0.461649	  1.137091
  1.743041	 -0.458461	  1.129630
  1.721663	 -0.451361	  1.120596
  1.711585	 -0.442186	  1.112062
  1.696531	 -0.428411	  1.105761
  1.681692	 -0.416393	  1.101286
  1.665088	 -0.404145	  1.098005
  1.649758	 -0.391255	  1.097935
  1.634514	 -0.378327	  1.097904
  1.618737	 -0.366275	  1.095762
  1.602599	 -0.355015	  1.092180
  1.586341	 -0.343882	  1.088750
  1.569966	 -0.332889	  1.085452
  1.553219	 -0.322805	  1.081224
  1.536111	 -0.313993	  1.075779
  1.518549	 -0.306502	  1.069824
  1.500810	 -0.299636	  1.063645
  1.483040	 -0.292736	  1.057605
  1.465107	 -0.283894	  1.057835
  1.447160	 -0.275063	  1.058088
  1.429230	 -0.266206	  1.058361
  1.411403	 -0.257681	  1.060176
  1.392622	 -0.251261	  1.061381
  1.372867	 -0.244739	  1.063296
  1.353772	 -0.239256	  1.065129
  1.335218	 -0.229978	  1.066802
  1.317802	 -0.220779	  1.067420
  1.300759	 -0.210242	  1.067446
  1.284375	 -0.198119	  1.066823
  1.267340	 -0.188066	  1.064565
  1.251096	 -0.176722	  1.064006
  1.234524	 -0.165482	  1.061344
  1.219189	 -0.152644	  1.063220
  1.204130	 -0.139735	  1.062343
  1.188530	 -0.126562	  1.062292
  1.171920	 -0.115537	  1.058378
  1.151927	 -0.108020	  1.054644
  1.133491	 -0.101082	  1.057896
  1.118396	 -0.090220	  1.061300
  1.102196	 -0.076474	  1.062154
  1.087494	 -0.062800	  1.060757
  1.071727	 -0.050574	  1.057441
  1.056222	 -0.038448	  1.053880
  1.041161	 -0.025947	  1.049767
  1.026086	 -0.013467	  1.045647
  1.011265	 -0.000792	  1.041422
  0.997146	  0.012009	  1.039093
  0.981786	  0.027699	  1.039191
  0.968273	  0.044495	  1.038335
  0.953978	  0.058900	  1.031540
  0.939289	  0.067541	  1.022586
  0.921328	  0.074402	  1.016761
  0.903014	  0.083504	  1.011161
  0.886112	  0.091978	  1.003588
  0.868729	  0.096242	  0.996274
  0.849783	  0.102249	  0.992749
  0.831372	  0.110687	  0.991072
  0.813392	  0.118624	  0.987523
  0.794867	  0.124817	  0.980762
  0.776170	  0.130230	  0.964545
  0.762236	  0.139640	  0.952498
  0.748299	  0.151015	  0.949643
  0.730667	  0.161737	  0.950039
  0.711712	  0.171163	  0.950363
  0.693060	  0.179854	  0.949307
  0.675478	  0.189296	  0.945549
  0.659549	  0.200041	  0.940590
  0.644419	  0.212886	  0.935639
  0.628914	  0.224967	  0.928614
  0.613793	  0.232421	  0.918267
  0.596553	  0.231017	  0.903293
  0.573583	  0.232329	  0.893894
  0.556687	  0.240580	  0.889753
  0.543209	  0.254045	  0.884990
  0.528716	  0.269673	  0.877495
  0.513900	  0.280391	  0.868350
  0.499645	  0.286413	  0.855646
  0.484004	  0.295110	  0.843849
  0.473020	  0.308277	  0.837375
  0.458514	  0.324686	  0.830849
  0.441813	  0.334772	  0.822762
  0.425625	  0.335961	  0.812640
  0.406901	  0.338781	  0.797416
  0.390027	  0.348887	  0.787562
  0.378169	  0.359972	  0.783971
  0.361064	  0.373074	  0.779302
  0.343074	  0.384219	  0.778370
  0.325513	  0.394903	  0.779900
  0.307518	  0.403528	  0.778737
  0.289373	  0.411587	  0.776097
  0.270595	  0.420694	  0.775679
  0.253351	  0.433995	  0.777066
  0.241463	  0.447492	  0.770151
  0.227003	  0.460530	  0.762533
  0.210396	  0.472831	  0.759784
  0.193279	  0.480294	  0.760538
  0.172984	  0.486083	  0.764175
  0.153955	  0.496976	  0.770151
  0.140327	  0.510428	  0.771560
  0.124378	  0.521495	  0.771246
  0.106195	  0.529917	  0.768410
  0.088931	  0.541729	  0.768535
  0.072133	  0.552588	  0.764513
  0.055041	  0.563197	  0.761855
  0.036956	  0.572153	  0.759012
  0.018198	  0.580673	  0.760017
 -0.000653	  0.590075	  0.757316
 -0.017271	  0.600077	  0.751487
 -0.033236	  0.610605	  0.745636
 -0.049478	  0.621601	  0.740423
 -0.065191	  0.632004	  0.734420
 -0.080220	  0.642564	  0.730414
 -0.095324	  0.656973	  0.721740
 -0.107900	  0.671259	  0.711500
 -0.121828	  0.682157	  0.704302
 -0.140663	  0.690688	  0.701841
 -0.157257	  0.702354	  0.698952
 -0.170880	  0.714506	  0.696708
 -0.188537	  0.725640	  0.696241
 -0.208738	  0.735197	  0.689664
 -0.220838	  0.745316	  0.682385
 -0.235479	  0.756459	  0.673450
 -0.252549	  0.764765	  0.664520
 -0.271910	  0.771774	  0.658516
 -0.287004	  0.780901	  0.653893
 -0.302492	  0.794161	  0.649729
 -0.320101	  0.808649	  0.648107
 -0.335003	  0.824614	  0.643828
 -0.349942	  0.838529	  0.640581
 -0.358542	  0.846220	  0.640310
 -0.381176	  0.854248	  0.646857
 -0.405291	  0.859971	  0.648612
 -0.423587	  0.869039	  0.649863
 -0.437810	  0.887193	  0.645388
 -0.445894	  0.902396	  0.639381
 -0.459113	  0.917759	  0.631569
 -0.474424	  0.925707	  0.622525
 -0.491909	  0.938481	  0.617627
 -0.508246	  0.954582	  0.618537
 -0.523243	  0.963438	  0.621121
 -0.541588	  0.971442	  0.620026
 -0.560148	  0.978727	  0.616173
 -0.578092	  0.992239	  0.616401
 -0.594913	  1.006128	  0.621987
 -0.612836	  1.015243	  0.627842
 -0.631519	  1.019887	  0.627625
 -0.652346	  1.024146	  0.623415
 -0.673515	  1.025351	  0.618308
 -0.692605	  1.029987	  0.613387
 -0.711600	  1.038403	  0.611902
 -0.731340	  1.047412	  0.607460
 -0.747509	  1.053546	  0.603645
 -0.763229	  1.060169	  0.599024
 -0.780187	  1.068653	  0.597154
 -0.799949	  1.079300	  0.594000
 -0.814839	  1.090200	  0.590558
 -0.832418	  1.101253	  0.589348
 -0.850632	  1.111356	  0.589134
 -0.865734	  1.123173	  0.590258
 -0.883859	  1.136930	  0.591669
 -0.901678	  1.144117	  0.588310
 -0.919811	  1.149626	  0.578097
 -0.939461	  1.157523	  0.571500
 -0.953855	  1.168549	  0.575828
 -0.968002	  1.185535	  0.582563
 -0.982895	  1.202271	  0.581667
 -0.997317	  1.214366	  0.578202
 -1.013145	  1.224151	  0.577911
 -1.035583	  1.235436	  0.583160
 -1.047303	  1.241059	  0.587704
 -1.063133	  1.249495	  0.594465
 -1.086030	  1.264626	  0.597698
 -1.103636	  1.274451	  0.598264
 -1.115440	  1.279970	  0.598198
 -1.134738	  1.287817	  0.599215
 -1.154437	  1.295763	  0.598735
 -1.175008	  1.309060	  0.597268
 -1.189663	  1.326747	  0.598238
 -1.200346	  1.337701	  0.602012
 -1.216093	  1.349989	  0.609979
 -1.231373	  1.359795	  0.614176
 -1.249153	  1.373346	  0.618968
 -1.260709	  1.384111	  0.625856
 -1.275694	  1.395622	  0.637496
 -1.294759	  1.411386	  0.644606
 -1.305505	  1.425828	  0.640421
 -1.317939	  1.447341	  0.632154
 -1.333049	  1.460167	  0.623119
 -1.345700	  1.466052	  0.619597
 -1.364575	  1.473736	  0.612561
 -1.382889	  1.486802	  0.600528
 -1.392224	  1.491990	  0.591987
 -1.410117	  1.497811	  0.581227
 -1.430780	  1.506796	  0.568442
 -1.439298	  1.517212	  0.557460
 -1.444895	  1.530244	  0.542214
 -1.457028	  1.543067	  0.527345
 -1.471469	  1.549547	  0.517110
 -1.487308	  1.556277	  0.500332
 -1.497727	  1.562768	  0.483083
 -1.501377	  1.565316	  0.466678
 -1.508570	  1.571281	  0.446815
 -1.513659	  1.577538	  0.427889
 -1.520132	  1.585134	  0.410825
 -1.529201	  1.591941	  0.394417
 -1.538367	  1.598886	  0.378487
 -1.550424	  1.602956	  0.363803
 -1.561669	  1.606112	  0.349657
 -1.574961	  1.610251	  0.335514
 -1.590793	  1.611471	  0.322080
 -1.606914	  1.618454	  0.314650
 -1.621150	  1.630457	  0.307327
 -1.638148	  1.643788	  0.302179
 -1.653715	  1.649486	  0.293758
 -1.670155	  1.656226	  0.286020
 -1.689963	  1.667381	  0.281355
 -1.706653	  1.668971	  0.273215
 -1.723036	  1.672624	  0.264101
 -1.744147	  1.680729	  0.256590
 -1.762294	  1.681832	  0.247831
 -1.780081	  1.686330	  0.239868
