 -1.133918	  1.384561	 -1.640907
 -1.148261	  1.384493	 -1.646881
 -1.129873	  1.384578	 -1.639003
 -1.111365	  1.384690	 -1.631431
 -1.092035	  1.388110	 -1.627605
 -1.072840	  1.393018	 -1.624552
 -1.053589	  1.398124	 -1.621933
 -1.034281	  1.402877	 -1.621172
 -1.016057	  1.410485	 -1.624760
 -0.997830	  1.417775	 -1.628442
 -0.979671	  1.425296	 -1.632172
 -0.961499	  1.432650	 -1.635931
 -0.944257	  1.439056	 -1.642130
 -0.923406	  1.446295	 -1.645986
 -0.906571	  1.453014	 -1.654759
 -0.894619	  1.459173	 -1.670280
 -0.878861	  1.465940	 -1.678985
 -0.856245	  1.472790	 -1.680596
 -0.838400	  1.478561	 -1.690447
 -0.825488	  1.484332	 -1.701227
 -0.808704	  1.492667	 -1.709447
 -0.796403	  1.497866	 -1.729097
 -0.780278	  1.503526	 -1.739487
