 -1.396414	  1.473689	 -1.244481
 -1.431483	  1.508541	 -1.342970
 -1.420973	  1.504335	 -1.323205
 -1.416138	  1.499584	 -1.310971
 -1.408870	  1.484499	 -1.296388
 -1.398380	  1.473765	 -1.269555
 -1.392603	  1.472323	 -1.255564
 -1.385022	  1.473140	 -1.238551
 -1.376103	  1.473302	 -1.218301
 -1.369030	  1.475848	 -1.198879
 -1.361823	  1.475446	 -1.177272
 -1.356290	  1.473768	 -1.159376
 -1.351679	  1.470843	 -1.146155
 -1.337076	  1.476705	 -1.127071
 -1.317343	  1.477004	 -1.107726
 -1.306608	  1.469938	 -1.093521
 -1.302289	  1.464610	 -1.079440
 -1.292724	  1.462212	 -1.058755
 -1.281858	  1.456407	 -1.040538
 -1.275738	  1.450400	 -1.025142
 -1.271869	  1.447510	 -1.005095
 -1.263604	  1.445894	 -0.984311
 -1.260104	  1.439881	 -0.965749
 -1.260238	  1.433998	 -0.945984
 -1.264074	  1.430403	 -0.927034
 -1.267566	  1.432276	 -0.906132
 -1.273161	  1.437248	 -0.887422
 -1.278791	  1.442251	 -0.868887
 -1.284555	  1.447133	 -0.850396
 -1.291888	  1.452183	 -0.832455
 -1.300807	  1.457540	 -0.815365
 -1.309700	  1.463468	 -0.799423
 -1.320899	  1.464374	 -0.785371
 -1.341291	  1.464187	 -0.770537
 -1.353900	  1.481009	 -0.749768
 -1.355753	  1.496188	 -0.734081
 -1.360390	  1.504384	 -0.722973
 -1.371270	  1.514672	 -0.705369
 -1.377172	  1.525096	 -0.689255
 -1.383493	  1.533347	 -0.675877
 -1.394029	  1.543168	 -0.659100
 -1.402800	  1.553463	 -0.643431
 -1.410119	  1.562138	 -0.630955
 -1.424250	  1.572372	 -0.615967
 -1.436424	  1.584295	 -0.601514
 -1.436802	  1.599922	 -0.588901
 -1.440246	  1.606256	 -0.576160
 -1.450109	  1.606146	 -0.546765
 -1.455524	  1.613651	 -0.526135
 -1.460999	  1.626759	 -0.515403
 -1.470109	  1.647456	 -0.511473
 -1.483321	  1.672039	 -0.499739
 -1.489952	  1.680974	 -0.487570
 -1.496299	  1.686670	 -0.472394
 -1.507027	  1.696069	 -0.454776
 -1.507688	  1.704282	 -0.437702
 -1.515113	  1.703686	 -0.418567
 -1.540834	  1.709545	 -0.391512
 -1.548567	  1.714733	 -0.382769
 -1.555639	  1.720130	 -0.375556
 -1.561524	  1.737465	 -0.363004
 -1.575079	  1.755406	 -0.346366
 -1.598721	  1.758771	 -0.324106
 -1.608465	  1.758195	 -0.316211
 -1.617269	  1.760691	 -0.307380
 -1.630815	  1.774888	 -0.295822
 -1.658658	  1.770955	 -0.283085
 -1.677542	  1.769259	 -0.264012
 -1.670170	  1.786091	 -0.234730
 -1.681539	  1.790822	 -0.218970
