  1.437695	 -0.010725	  2.667174
  1.423460	 -0.010619	  2.640767
  1.441715	 -0.032404	  2.603148
  1.458907	 -0.057445	  2.566208
  1.473616	 -0.086087	  2.529129
  1.490722	 -0.112761	  2.490943
  1.502497	 -0.134656	  2.447183
  1.513049	 -0.162285	  2.407434
  1.527548	 -0.186237	  2.368639
  1.542872	 -0.210792	  2.330148
  1.556357	 -0.238080	  2.291114
  1.569349	 -0.264806	  2.250531
  1.584284	 -0.290588	  2.210727
  1.598398	 -0.314726	  2.172310
  1.610170	 -0.338936	  2.132684
  1.622487	 -0.364680	  2.092250
  1.636647	 -0.391615	  2.051799
  1.653027	 -0.419818	  2.011949
  1.670474	 -0.448655	  1.974317
  1.688197	 -0.476433	  1.937807
  1.705826	 -0.502169	  1.901517
  1.725095	 -0.526857	  1.863036
  1.745936	 -0.549678	  1.823424
  1.767485	 -0.571723	  1.783925
  1.789081	 -0.594719	  1.744519
  1.809011	 -0.619366	  1.707427
  1.828512	 -0.644474	  1.671513
  1.847856	 -0.670542	  1.635338
  1.867005	 -0.697045	  1.598813
  1.885378	 -0.724865	  1.561297
  1.900772	 -0.754201	  1.524067
  1.913616	 -0.785338	  1.486267
  1.925078	 -0.816446	  1.447787
  1.936635	 -0.845869	  1.409930
  1.949871	 -0.874715	  1.370789
  1.964056	 -0.902398	  1.331140
  1.978231	 -0.927872	  1.293516
  1.993348	 -0.953469	  1.256256
  2.010340	 -0.980563	  1.216481
  2.026713	 -1.005430	  1.175205
  2.042576	 -1.027583	  1.135581
  2.061969	 -1.046077	  1.096041
  2.075205	 -1.073750	  1.057945
  2.087063	 -1.096988	  1.015015
  2.099919	 -1.121349	  0.973801
  2.112745	 -1.150710	  0.936851
  2.123317	 -1.180535	  0.899776
  2.140442	 -1.209094	  0.863217
  2.159002	 -1.237390	  0.825960
  2.175721	 -1.266781	  0.789044
  2.191616	 -1.296932	  0.751584
  2.207688	 -1.325717	  0.713240
  2.223778	 -1.353232	  0.674505
  2.239247	 -1.379433	  0.635597
  2.253747	 -1.404386	  0.595998
  2.267202	 -1.427733	  0.556151
  2.280685	 -1.451375	  0.516071
  2.294937	 -1.475757	  0.474710
  2.309763	 -1.499489	  0.432869
  2.324213	 -1.521133	  0.391773
  2.339321	 -1.543826	  0.349418
  2.356621	 -1.568869	  0.308437
  2.376055	 -1.593764	  0.269662
  2.394065	 -1.617499	  0.232259
  2.405915	 -1.646361	  0.195834
  2.423415	 -1.671883	  0.157258
  2.444570	 -1.697681	  0.118932
  2.452614	 -1.726022	  0.074381
  2.477140	 -1.743283	  0.075125
