 -0.506632	  1.985739	 -1.450385
 -0.503670	  1.969779	 -1.454746
 -0.503108	  1.966750	 -1.455574
 -0.499450	  1.947783	 -1.460604
 -0.494506	  1.928691	 -1.464182
 -0.489093	  1.909587	 -1.467724
 -0.485795	  1.890358	 -1.472094
 -0.483154	  1.871137	 -1.476223
 -0.479401	  1.852101	 -1.479214
 -0.474491	  1.834120	 -1.479731
 -0.465931	  1.812252	 -1.481264
 -0.459167	  1.791510	 -1.487231
 -0.460647	  1.776469	 -1.492428
 -0.460344	  1.755176	 -1.495433
 -0.458797	  1.735085	 -1.496525
 -0.455884	  1.714992	 -1.497895
 -0.452988	  1.695243	 -1.499158
 -0.450106	  1.675473	 -1.500074
 -0.447221	  1.655706	 -1.500975
 -0.444550	  1.635975	 -1.501698
 -0.441995	  1.616171	 -1.501513
 -0.439667	  1.596212	 -1.500960
 -0.437980	  1.575751	 -1.501603
 -0.436007	  1.556480	 -1.502014
 -0.434451	  1.535785	 -1.505908
 -0.432519	  1.516369	 -1.509533
 -0.432220	  1.496728	 -1.514153
 -0.434224	  1.476741	 -1.518076
 -0.436686	  1.457178	 -1.519164
 -0.438858	  1.437191	 -1.519764
 -0.439490	  1.417290	 -1.519912
 -0.438773	  1.397531	 -1.521547
 -0.440223	  1.377256	 -1.527551
 -0.447489	  1.358609	 -1.533473
 -0.451041	  1.339688	 -1.536808
 -0.451610	  1.320122	 -1.540657
 -0.447686	  1.300429	 -1.544342
 -0.450172	  1.280962	 -1.551405
 -0.450369	  1.260939	 -1.557555
 -0.446762	  1.242017	 -1.563188
 -0.438242	  1.226610	 -1.569446
 -0.433798	  1.207555	 -1.580679
 -0.431963	  1.190484	 -1.588880
 -0.427257	  1.171278	 -1.591686
 -0.420919	  1.151769	 -1.597732
 -0.413974	  1.136253	 -1.606021
 -0.407827	  1.117872	 -1.612592
 -0.402179	  1.099860	 -1.619761
 -0.396894	  1.083483	 -1.630506
 -0.388743	  1.068977	 -1.643546
 -0.381387	  1.052556	 -1.648998
 -0.372407	  1.034081	 -1.656257
 -0.369782	  1.015276	 -1.668757
 -0.369855	  1.000969	 -1.677038
 -0.367453	  0.982191	 -1.684638
 -0.361882	  0.965187	 -1.695592
 -0.352949	  0.953127	 -1.708744
 -0.351692	  0.936025	 -1.724422
 -0.353726	  0.916093	 -1.734311
 -0.354880	  0.906886	 -1.748074
 -0.353439	  0.894783	 -1.764236
 -0.354315	  0.879862	 -1.779395
 -0.357520	  0.867997	 -1.795333
 -0.360247	  0.858112	 -1.812088
 -0.363956	  0.845646	 -1.827374
 -0.368942	  0.833619	 -1.843265
 -0.375182	  0.825439	 -1.859719
 -0.382541	  0.816277	 -1.875140
 -0.389892	  0.805292	 -1.893641
 -0.392943	  0.796212	 -1.910088
 -0.396800	  0.785658	 -1.926815
 -0.400483	  0.773907	 -1.941456
 -0.405956	  0.762168	 -1.957014
 -0.408942	  0.748791	 -1.971730
 -0.410666	  0.734197	 -1.988730
 -0.416217	  0.725868	 -2.004754
 -0.421816	  0.718010	 -2.019377
 -0.428722	  0.706349	 -2.041190
 -0.431967	  0.694546	 -2.059240
 -0.437068	  0.685153	 -2.067809
 -0.443008	  0.671333	 -2.082420
 -0.445364	  0.659244	 -2.099975
 -0.448295	  0.649445	 -2.116317
 -0.453910	  0.641537	 -2.136467
 -0.458529	  0.632810	 -2.153265
 -0.461636	  0.623994	 -2.169874
 -0.464511	  0.613179	 -2.188338
 -0.467739	  0.603046	 -2.204771
 -0.472677	  0.591164	 -2.218864
 -0.477516	  0.578388	 -2.234278
 -0.480924	  0.564922	 -2.248007
 -0.482834	  0.547990	 -2.260026
 -0.485862	  0.533708	 -2.274851
 -0.492717	  0.521239	 -2.285997
 -0.499516	  0.504387	 -2.297794
 -0.503153	  0.488696	 -2.310896
 -0.504020	  0.471389	 -2.318892
 -0.507631	  0.453172	 -2.326337
 -0.511461	  0.434776	 -2.335933
 -0.512187	  0.416498	 -2.343776
 -0.512517	  0.397400	 -2.348234
 -0.514619	  0.377676	 -2.352336
 -0.515235	  0.357462	 -2.358872
 -0.510783	  0.337866	 -2.361159
 -0.509581	  0.319236	 -2.359279
 -0.507041	  0.298002	 -2.358231
 -0.503837	  0.278827	 -2.357064
 -0.504113	  0.260238	 -2.357308
 -0.501961	  0.239916	 -2.351692
 -0.494673	  0.220843	 -2.347111
 -0.491225	  0.203170	 -2.341428
 -0.491222	  0.184644	 -2.335650
 -0.488181	  0.163167	 -2.330420
 -0.482147	  0.146617	 -2.321477
 -0.478807	  0.131555	 -2.309605
 -0.478062	  0.117379	 -2.295541
 -0.473859	  0.103250	 -2.280078
 -0.467605	  0.087098	 -2.270594
 -0.464828	  0.068673	 -2.261189
 -0.463576	  0.053105	 -2.250207
 -0.461039	  0.037945	 -2.236422
 -0.458825	  0.025949	 -2.220081
 -0.455662	  0.013595	 -2.203780
 -0.451814	 -0.000404	 -2.190060
 -0.447271	 -0.014310	 -2.176963
 -0.443429	 -0.027601	 -2.162128
 -0.439372	 -0.041224	 -2.148096
 -0.435204	 -0.054540	 -2.133758
 -0.427182	 -0.066681	 -2.119921
 -0.418743	 -0.078213	 -2.106039
 -0.411197	 -0.090498	 -2.092204
 -0.403379	 -0.103211	 -2.078737
 -0.391251	 -0.110342	 -2.062773
 -0.377512	 -0.115987	 -2.047389
 -0.365485	 -0.118871	 -2.032268
 -0.354959	 -0.118238	 -2.015224
 -0.346447	 -0.117311	 -1.997381
 -0.333245	 -0.120599	 -1.980263
 -0.319541	 -0.125466	 -1.965148
 -0.307901	 -0.137942	 -1.951176
 -0.303536	 -0.150659	 -1.941599
 -0.293360	 -0.162156	 -1.927426
 -0.279389	 -0.170424	 -1.912445
 -0.270457	 -0.179867	 -1.899080
 -0.262748	 -0.194415	 -1.888586
 -0.251421	 -0.206800	 -1.877084
 -0.239390	 -0.226029	 -1.867736
 -0.234080	 -0.238937	 -1.862872
 -0.229462	 -0.260207	 -1.862540
 -0.222955	 -0.281728	 -1.858178
 -0.215580	 -0.300178	 -1.856848
 -0.209548	 -0.317370	 -1.856141
 -0.203154	 -0.338682	 -1.861642
 -0.201054	 -0.360216	 -1.865667
 -0.197724	 -0.378150	 -1.872035
 -0.191509	 -0.391493	 -1.882569
 -0.187013	 -0.409888	 -1.894445
 -0.180294	 -0.427799	 -1.899389
 -0.171503	 -0.445878	 -1.903962
 -0.165555	 -0.465096	 -1.910129
 -0.161657	 -0.482219	 -1.917721
 -0.155639	 -0.498466	 -1.925215
 -0.149419	 -0.520016	 -1.930788
 -0.147294	 -0.540007	 -1.934946
 -0.145468	 -0.555058	 -1.941674
 -0.140777	 -0.574635	 -1.947115
 -0.136342	 -0.594332	 -1.951037
 -0.132158	 -0.613660	 -1.954390
 -0.128402	 -0.633217	 -1.956235
 -0.124648	 -0.652776	 -1.958068
 -0.120898	 -0.672348	 -1.959762
 -0.117176	 -0.691969	 -1.960835
 -0.113454	 -0.711591	 -1.961903
 -0.109926	 -0.731199	 -1.962951
 -0.106359	 -0.750306	 -1.964600
 -0.101743	 -0.769892	 -1.968106
 -0.096489	 -0.789751	 -1.973123
 -0.095392	 -0.809088	 -1.971940
 -0.095478	 -0.829086	 -1.970385
 -0.094708	 -0.851354	 -1.968392
 -0.093891	 -0.869626	 -1.967660
 -0.092749	 -0.890084	 -1.967943
 -0.088937	 -0.911112	 -1.971887
 -0.085257	 -0.927685	 -1.976923
 -0.082799	 -0.949219	 -1.979958
 -0.081296	 -0.968507	 -1.981808
 -0.079411	 -0.987921	 -1.985819
 -0.075728	 -1.008723	 -1.991028
 -0.074108	 -1.026132	 -1.993184
 -0.071766	 -1.048052	 -1.996295
 -0.069754	 -1.067559	 -1.997173
 -0.070119	 -1.086332	 -1.996429
 -0.066482	 -1.106625	 -2.001126
 -0.061609	 -1.125978	 -2.007774
 -0.059035	 -1.145349	 -2.009252
 -0.057321	 -1.166222	 -2.008430
 -0.056581	 -1.184088	 -2.007870
 -0.054113	 -1.205187	 -2.009625
 -0.051450	 -1.225122	 -2.011620
 -0.048889	 -1.244864	 -2.013542
 -0.046405	 -1.264615	 -2.015469
 -0.044558	 -1.284433	 -2.017430
 -0.042720	 -1.304251	 -2.019394
 -0.041408	 -1.324058	 -2.021831
 -0.040434	 -1.343846	 -2.024569
 -0.039400	 -1.363629	 -2.027323
 -0.038104	 -1.383387	 -2.030135
 -0.036817	 -1.403146	 -2.032951
 -0.036841	 -1.422863	 -2.036295
 -0.037754	 -1.444239	 -2.040282
 -0.038523	 -1.462151	 -2.043621
