  1.117481	  0.942143	 -2.654148
  1.106416	  0.932815	 -2.627870
  1.075579	  0.964433	 -2.599144
  1.035447	  0.990494	 -2.583552
  1.005733	  1.014760	 -2.555079
  0.964606	  1.039187	 -2.536042
  0.928268	  1.060574	 -2.517655
  0.893771	  1.091176	 -2.489867
  0.854208	  1.107932	 -2.469520
  0.821754	  1.141976	 -2.447394
  0.781609	  1.163318	 -2.421958
  0.748667	  1.184248	 -2.404988
  0.710817	  1.211604	 -2.380213
  0.674002	  1.233576	 -2.356490
  0.632376	  1.265860	 -2.342961
  0.594563	  1.289796	 -2.314984
  0.556054	  1.316640	 -2.291680
  0.528056	  1.342453	 -2.276694
  0.485169	  1.365079	 -2.249620
  0.449285	  1.389748	 -2.229303
  0.412713	  1.412682	 -2.205238
  0.378123	  1.435280	 -2.180975
  0.338743	  1.463066	 -2.165517
  0.305106	  1.489390	 -2.142978
  0.267535	  1.508961	 -2.121540
  0.226075	  1.535402	 -2.097565
  0.192371	  1.566977	 -2.079060
  0.152361	  1.584208	 -2.058611
  0.123334	  1.611990	 -2.030901
  0.079684	  1.641859	 -2.006885
  0.042988	  1.666423	 -1.986569
  0.010433	  1.690721	 -1.963652
 -0.030066	  1.714497	 -1.940531
 -0.064834	  1.739371	 -1.918059
 -0.104063	  1.760715	 -1.899489
 -0.140481	  1.784179	 -1.883181
 -0.175167	  1.814757	 -1.856523
 -0.206650	  1.833002	 -1.839185
 -0.249337	  1.867611	 -1.817871
 -0.279994	  1.885716	 -1.789517
 -0.318703	  1.909640	 -1.772085
 -0.357658	  1.936662	 -1.752534
 -0.393956	  1.966510	 -1.728236
 -0.433850	  1.986096	 -1.702201
 -0.463538	  2.010946	 -1.686612
 -0.503911	  2.042362	 -1.664270
 -0.542612	  2.065685	 -1.640756
 -0.574553	  2.083556	 -1.611858
 -0.617215	  2.114041	 -1.593219
 -0.650120	  2.142310	 -1.569124
 -0.684212	  2.159809	 -1.548362
 -0.720558	  2.184433	 -1.533267
 -0.763557	  2.210999	 -1.505659
 -0.798276	  2.240422	 -1.480581
 -0.837016	  2.265664	 -1.461774
 -0.874291	  2.291659	 -1.442110
 -0.909218	  2.317338	 -1.420837
 -0.947260	  2.341798	 -1.395898
 -0.981744	  2.364693	 -1.379561
 -1.015225	  2.390335	 -1.357683
 -1.055201	  2.408427	 -1.336593
 -1.094779	  2.433012	 -1.308376
 -1.134429	  2.457777	 -1.293214
 -1.145773	  2.482355	 -1.306146
