 -0.134893	  1.524324	  1.976278
 -0.138130	  1.532976	  1.987320
 -0.127619	  1.518499	  1.975814
 -0.123250	  1.507499	  1.962612
 -0.113395	  1.492902	  1.949951
 -0.108916	  1.478539	  1.932302
 -0.111580	  1.469467	  1.916147
 -0.118881	  1.460412	  1.894556
 -0.115501	  1.444661	  1.873335
 -0.110835	  1.437387	  1.866279
 -0.099350	  1.422958	  1.854120
 -0.089085	  1.409821	  1.841771
 -0.078224	  1.397552	  1.828189
 -0.062652	  1.389206	  1.812949
 -0.071116	  1.390987	  1.777706
 -0.082303	  1.381852	  1.754964
 -0.085126	  1.371415	  1.740897
 -0.083962	  1.363860	  1.730455
 -0.073385	  1.349168	  1.711201
 -0.063079	  1.337917	  1.696109
 -0.058041	  1.330618	  1.682092
 -0.051425	  1.325815	  1.664562
 -0.050370	  1.319777	  1.646021
 -0.045560	  1.314939	  1.625909
 -0.040358	  1.310127	  1.607291
 -0.031778	  1.306449	  1.588734
 -0.019986	  1.304470	  1.569632
  0.002466	  1.298177	  1.554879
  0.022562	  1.295682	  1.553863
  0.042882	  1.295029	  1.553215
  0.066731	  1.296904	  1.554244
  0.083472	  1.291499	  1.548839
  0.097838	  1.283655	  1.535263
  0.110726	  1.273926	  1.520243
  0.127129	  1.265071	  1.507902
  0.142389	  1.260571	  1.501554
  0.162713	  1.254735	  1.497331
  0.179971	  1.246548	  1.490030
  0.192777	  1.237481	  1.482794
  0.208254	  1.223952	  1.473299
  0.222881	  1.213994	  1.465453
  0.237290	  1.206509	  1.459961
  0.258879	  1.194333	  1.452434
  0.270729	  1.182395	  1.442265
  0.279510	  1.172730	  1.433810
  0.290709	  1.158842	  1.418793
  0.296667	  1.147489	  1.402988
  0.301605	  1.136467	  1.390744
  0.308073	  1.123493	  1.379360
  0.317103	  1.108377	  1.360665
  0.321767	  1.092932	  1.345657
  0.319089	  1.075924	  1.335758
  0.315584	  1.067710	  1.329725
  0.322334	  1.061223	  1.309101
  0.334392	  1.049815	  1.289571
  0.344332	  1.032322	  1.272271
  0.337741	  1.019077	  1.251733
  0.319574	  1.012763	  1.235632
  0.305584	  1.005075	  1.221117
  0.293701	  0.999082	  1.206705
  0.280046	  0.992937	  1.191843
  0.267050	  0.987114	  1.177086
  0.255807	  0.981538	  1.164649
  0.244712	  0.974306	  1.150742
  0.233203	  0.966159	  1.134005
  0.221882	  0.959891	  1.119875
  0.212337	  0.953686	  1.108057
  0.197045	  0.948249	  1.091525
  0.184719	  0.940373	  1.076692
  0.174151	  0.932853	  1.064295
  0.164297	  0.924965	  1.049690
  0.151187	  0.916544	  1.033604
  0.137376	  0.909483	  1.020247
  0.125895	  0.903426	  1.008755
  0.114095	  0.895777	  0.991823
  0.106841	  0.886571	  0.975356
  0.102638	  0.876702	  0.960694
  0.100541	  0.866066	  0.943208
  0.099804	  0.858287	  0.923996
  0.100583	  0.851990	  0.912015
  0.099465	  0.842298	  0.898944
  0.092786	  0.822934	  0.873432
  0.089815	  0.811881	  0.864308
  0.087267	  0.801251	  0.852574
  0.083229	  0.783535	  0.834551
  0.082067	  0.770340	  0.820112
  0.079557	  0.762251	  0.809660
  0.078034	  0.749790	  0.791071
  0.083156	  0.735734	  0.769454
  0.090970	  0.722472	  0.755495
  0.099367	  0.709217	  0.745182
  0.107874	  0.694810	  0.735245
  0.113342	  0.678130	  0.718909
  0.112861	  0.669691	  0.701303
  0.117556	  0.665180	  0.682298
  0.122102	  0.662208	  0.660480
  0.123013	  0.659375	  0.636885
  0.126962	  0.655342	  0.608918
  0.132782	  0.647760	  0.591388
  0.136200	  0.642643	  0.582764
  0.140626	  0.634766	  0.570794
  0.140729	  0.617665	  0.549957
  0.146503	  0.606724	  0.533040
  0.152646	  0.596674	  0.519257
  0.160637	  0.584594	  0.500175
  0.165642	  0.573389	  0.484224
  0.167222	  0.562567	  0.472955
  0.168410	  0.545638	  0.457922
  0.171042	  0.533455	  0.440052
  0.173435	  0.522992	  0.423178
  0.173173	  0.513791	  0.404716
  0.171409	  0.503107	  0.387336
  0.172090	  0.491923	  0.370693
  0.174807	  0.483958	  0.353285
  0.175594	  0.474708	  0.334372
  0.178549	  0.465750	  0.316434
  0.181176	  0.459551	  0.298195
  0.182181	  0.450739	  0.279600
  0.185126	  0.439301	  0.261825
  0.191761	  0.429823	  0.243820
  0.202247	  0.426540	  0.224224
  0.210157	  0.426105	  0.204310
  0.213048	  0.420868	  0.184571
  0.212367	  0.411099	  0.166555
  0.207707	  0.399630	  0.151790
  0.205801	  0.387171	  0.136119
  0.204524	  0.380456	  0.117347
  0.203802	  0.375442	  0.097940
  0.201299	  0.369776	  0.081152
  0.195374	  0.366227	  0.061368
  0.186722	  0.360129	  0.041366
  0.179162	  0.345453	  0.018124
  0.178200	  0.339625	  0.006719
  0.177450	  0.325892	 -0.010960
  0.173275	  0.317400	 -0.033705
  0.171615	  0.304903	 -0.051598
  0.175488	  0.290008	 -0.063948
  0.181905	  0.280494	 -0.073931
  0.201392	  0.266665	 -0.097891
  0.212474	  0.257813	 -0.120130
  0.215573	  0.257053	 -0.126246
  0.217287	  0.246305	 -0.143021
  0.220920	  0.232430	 -0.164492
  0.224538	  0.223613	 -0.179503
  0.229854	  0.210460	 -0.196333
  0.238486	  0.197131	 -0.214956
  0.241739	  0.190904	 -0.220265
  0.249052	  0.176400	 -0.236974
  0.256915	  0.158452	 -0.256450
  0.261446	  0.149150	 -0.269510
  0.266410	  0.140611	 -0.282000
  0.271877	  0.135141	 -0.307777
  0.273910	  0.131658	 -0.334803
  0.274328	  0.127104	 -0.347705
  0.277862	  0.115702	 -0.368188
  0.281184	  0.105239	 -0.385836
  0.283154	  0.096669	 -0.396581
  0.289533	  0.085138	 -0.409091
  0.297100	  0.071694	 -0.425957
  0.304824	  0.059688	 -0.443219
  0.313317	  0.047648	 -0.462679
  0.319628	  0.037913	 -0.479040
  0.323123	  0.030508	 -0.489512
  0.327045	  0.014587	 -0.505803
  0.331195	  0.000967	 -0.519578
  0.338559	 -0.011050	 -0.534121
  0.346341	 -0.021074	 -0.550362
  0.350241	 -0.030988	 -0.567172
  0.351135	 -0.041621	 -0.584116
  0.351806	 -0.051473	 -0.601504
  0.356685	 -0.060762	 -0.618829
  0.363259	 -0.070585	 -0.632951
  0.369790	 -0.087835	 -0.650648
  0.375039	 -0.102302	 -0.668521
  0.380370	 -0.110897	 -0.680704
  0.383373	 -0.117809	 -0.691278
  0.384423	 -0.128964	 -0.716505
  0.386046	 -0.140202	 -0.739872
  0.385918	 -0.144952	 -0.752502
  0.387947	 -0.149753	 -0.769883
  0.388077	 -0.158194	 -0.788888
  0.386508	 -0.171096	 -0.809589
  0.382208	 -0.182840	 -0.822490
  0.379955	 -0.190980	 -0.832180
  0.375868	 -0.205141	 -0.848460
  0.371308	 -0.220351	 -0.866267
  0.368226	 -0.232381	 -0.885090
  0.364557	 -0.239519	 -0.896393
  0.361344	 -0.248869	 -0.917693
  0.352319	 -0.255930	 -0.935475
  0.345652	 -0.261310	 -0.946574
  0.336046	 -0.273659	 -0.960276
  0.311520	 -0.284213	 -0.975831
  0.291620	 -0.287891	 -0.984522
  0.276507	 -0.290135	 -0.991271
  0.257328	 -0.295935	 -0.999775
  0.243005	 -0.303917	 -1.003389
  0.230507	 -0.320748	 -1.005923
  0.217664	 -0.335947	 -1.018341
  0.205321	 -0.342716	 -1.031396
  0.187734	 -0.348472	 -1.049638
  0.174258	 -0.355061	 -1.062500
  0.160281	 -0.362720	 -1.071761
  0.144703	 -0.371887	 -1.079475
  0.129438	 -0.382186	 -1.088666
  0.113743	 -0.389944	 -1.101865
  0.094388	 -0.395166	 -1.113507
  0.084612	 -0.397981	 -1.117411
  0.069277	 -0.406094	 -1.128009
  0.050935	 -0.420456	 -1.151528
  0.042532	 -0.424591	 -1.162385
  0.036988	 -0.426403	 -1.172080
  0.027450	 -0.428911	 -1.184587
  0.011365	 -0.435968	 -1.207508
  0.003404	 -0.442260	 -1.226322
  0.000817	 -0.447804	 -1.241008
 -0.000024	 -0.451487	 -1.249477
  0.001039	 -0.453129	 -1.255260
  0.013246	 -0.459878	 -1.273423
  0.024885	 -0.465095	 -1.285928
  0.039144	 -0.469849	 -1.303826
  0.047795	 -0.471779	 -1.317842
  0.054253	 -0.470206	 -1.327029
  0.069369	 -0.467859	 -1.343104
  0.085668	 -0.472971	 -1.365827
  0.096791	 -0.480285	 -1.380208
  0.107628	 -0.484438	 -1.392207
  0.122835	 -0.486988	 -1.413549
  0.134710	 -0.481728	 -1.428480
  0.144511	 -0.480807	 -1.438793
  0.157570	 -0.475770	 -1.450432
  0.171373	 -0.467759	 -1.469599
  0.186819	 -0.457265	 -1.495087
  0.195950	 -0.455498	 -1.512846
  0.204633	 -0.456176	 -1.521636
  0.214567	 -0.458936	 -1.537271
  0.231476	 -0.461389	 -1.555144
  0.245938	 -0.461573	 -1.572474
  0.258316	 -0.461282	 -1.583491
  0.270020	 -0.463611	 -1.595636
  0.275325	 -0.464667	 -1.603429
  0.294654	 -0.468139	 -1.624636
  0.306975	 -0.469348	 -1.638101
  0.319282	 -0.473133	 -1.651716
  0.325855	 -0.479488	 -1.669899
  0.323310	 -0.487499	 -1.693623
  0.321884	 -0.492431	 -1.712077
  0.322702	 -0.494031	 -1.728390
  0.325253	 -0.494471	 -1.748180
  0.331458	 -0.501859	 -1.770828
  0.337780	 -0.511315	 -1.784146
  0.345647	 -0.524403	 -1.797753
  0.351789	 -0.542521	 -1.816152
  0.349770	 -0.551316	 -1.832737
  0.348725	 -0.553091	 -1.847614
  0.350888	 -0.564007	 -1.866727
  0.348427	 -0.576831	 -1.887274
  0.343533	 -0.577733	 -1.903553
  0.340002	 -0.579873	 -1.924294
  0.339738	 -0.588395	 -1.943807
  0.341917	 -0.597480	 -1.961464
  0.341923	 -0.606135	 -1.978687
  0.341782	 -0.611910	 -1.997250
  0.340391	 -0.617615	 -2.016297
  0.346462	 -0.627555	 -2.037345
  0.352732	 -0.646166	 -2.058898
  0.355248	 -0.654332	 -2.067867
  0.356531	 -0.667251	 -2.081030
  0.358439	 -0.682236	 -2.097888
  0.359304	 -0.699160	 -2.109805
  0.360635	 -0.714742	 -2.123269
  0.362553	 -0.729192	 -2.135644
  0.365429	 -0.744406	 -2.147794
  0.369289	 -0.760997	 -2.165640
  0.374533	 -0.767245	 -2.180589
  0.381102	 -0.772445	 -2.200062
  0.387796	 -0.786160	 -2.225504
  0.388878	 -0.790247	 -2.232310
  0.391394	 -0.801007	 -2.249700
  0.394762	 -0.816142	 -2.269961
  0.396515	 -0.828830	 -2.281409
  0.398911	 -0.842490	 -2.296302
  0.407841	 -0.852383	 -2.313482
  0.409262	 -0.862559	 -2.330641
