 -1.873810	  0.854761	  1.423983
 -1.869117	  0.852008	  1.424950
 -1.856826	  0.844797	  1.427484
 -1.840077	  0.834373	  1.430774
 -1.823329	  0.823947	  1.434062
 -1.806868	  0.812998	  1.437087
 -1.790614	  0.801693	  1.439916
 -1.774353	  0.790396	  1.442741
 -1.758466	  0.778590	  1.445615
 -1.742568	  0.766817	  1.448405
 -1.726193	  0.755608	  1.451229
 -1.709920	  0.744363	  1.454668
 -1.694833	  0.732419	  1.458895
 -1.677781	  0.725049	  1.462811
 -1.656745	  0.721325	  1.461098
 -1.638194	  0.705119	  1.453957
 -1.624018	  0.676374	  1.457563
 -1.616579	  0.665086	  1.468868
 -1.609393	  0.657162	  1.488589
 -1.598472	  0.644113	  1.507966
 -1.581979	  0.623249	  1.513839
 -1.571747	  0.608026	  1.510675
 -1.554422	  0.594268	  1.505527
 -1.538517	  0.589616	  1.510231
 -1.526397	  0.581957	  1.526189
 -1.511095	  0.570983	  1.537105
 -1.493033	  0.558893	  1.544179
 -1.478833	  0.547879	  1.553647
 -1.455618	  0.533202	  1.562948
 -1.442862	  0.529484	  1.566340
 -1.426486	  0.525159	  1.568774
 -1.410916	  0.521484	  1.571964
 -1.387852	  0.510519	  1.576128
 -1.365604	  0.498288	  1.578091
 -1.351562	  0.490160	  1.582588
 -1.332571	  0.481178	  1.589017
 -1.321989	  0.473303	  1.596760
 -1.303780	  0.465392	  1.607624
 -1.279584	  0.462253	  1.616178
 -1.257557	  0.457263	  1.619256
 -1.242510	  0.450359	  1.621540
 -1.231764	  0.430191	  1.625006
 -1.223935	  0.412961	  1.628351
 -1.206647	  0.400503	  1.631939
 -1.187950	  0.395526	  1.633004
 -1.164573	  0.391326	  1.638144
 -1.144213	  0.381526	  1.644672
 -1.128388	  0.367268	  1.649908
 -1.117492	  0.356885	  1.653573
 -1.102079	  0.340201	  1.661016
 -1.086974	  0.329775	  1.663554
 -1.071553	  0.322966	  1.663900
 -1.049917	  0.313601	  1.664628
 -1.032112	  0.305474	  1.667793
 -1.015581	  0.296836	  1.668942
 -0.994162	  0.285388	  1.669817
 -0.976158	  0.276945	  1.673458
 -0.963085	  0.271587	  1.676020
 -0.946553	  0.262261	  1.678056
 -0.919368	  0.243057	  1.678369
 -0.907896	  0.233987	  1.684703
 -0.899631	  0.225264	  1.688823
 -0.878715	  0.220767	  1.696111
 -0.858293	  0.214936	  1.701453
 -0.842587	  0.204891	  1.711706
 -0.826863	  0.197109	  1.726830
 -0.807410	  0.187212	  1.733497
 -0.783662	  0.179189	  1.727749
 -0.764686	  0.174747	  1.722955
 -0.750338	  0.167047	  1.722142
 -0.732708	  0.156504	  1.726511
 -0.712634	  0.148330	  1.727762
 -0.693516	  0.142025	  1.725541
 -0.675660	  0.134442	  1.724594
 -0.657058	  0.126982	  1.727296
 -0.639187	  0.119089	  1.728999
 -0.620649	  0.110442	  1.728019
 -0.602358	  0.100902	  1.728730
 -0.585163	  0.091601	  1.730471
 -0.569235	  0.083647	  1.730955
 -0.549779	  0.073624	  1.729891
 -0.530041	  0.061604	  1.733765
 -0.516835	  0.054458	  1.738179
 -0.500127	  0.045967	  1.745035
 -0.478018	  0.030896	  1.750338
 -0.469011	  0.024573	  1.753430
 -0.449764	  0.015189	  1.759337
 -0.427669	  0.003149	  1.757631
 -0.414840	 -0.008632	  1.747649
 -0.399457	 -0.021991	  1.731403
 -0.382337	 -0.032390	  1.721910
 -0.365788	 -0.040235	  1.718114
 -0.347682	 -0.048670	  1.718455
 -0.330629	 -0.056667	  1.718781
 -0.312017	 -0.064068	  1.714356
 -0.291594	 -0.074734	  1.709518
 -0.276872	 -0.084163	  1.709203
 -0.260028	 -0.093614	  1.707561
 -0.239490	 -0.103827	  1.701940
 -0.227919	 -0.110536	  1.694790
 -0.215459	 -0.117327	  1.681571
 -0.202441	 -0.125908	  1.664039
 -0.176883	 -0.134255	  1.639858
 -0.158776	 -0.132922	  1.630270
 -0.145590	 -0.129855	  1.628870
 -0.127299	 -0.129551	  1.626164
 -0.105367	 -0.137039	  1.624537
 -0.084413	 -0.147635	  1.618872
 -0.070990	 -0.154793	  1.611850
 -0.053209	 -0.161594	  1.601529
 -0.028910	 -0.174207	  1.594344
 -0.017744	 -0.180654	  1.594258
 -0.001647	 -0.186818	  1.595135
  0.027868	 -0.186360	  1.596490
  0.042231	 -0.186269	  1.597897
  0.062417	 -0.182164	  1.598915
  0.077852	 -0.181871	  1.601318
  0.095519	 -0.186968	  1.605892
  0.118880	 -0.195938	  1.613380
  0.136708	 -0.206430	  1.625421
  0.144513	 -0.211041	  1.633252
  0.156605	 -0.219590	  1.650171
  0.167191	 -0.232290	  1.674776
  0.169973	 -0.240721	  1.688148
  0.169775	 -0.250500	  1.701025
  0.176431	 -0.262818	  1.720473
  0.181898	 -0.273794	  1.737681
  0.186359	 -0.284874	  1.753987
  0.191119	 -0.296443	  1.769772
  0.197142	 -0.308092	  1.785136
  0.204074	 -0.319818	  1.800176
  0.212530	 -0.332127	  1.813362
  0.220294	 -0.344600	  1.826985
  0.227723	 -0.356957	  1.840911
  0.235013	 -0.369008	  1.855225
  0.244957	 -0.378443	  1.870071
  0.254580	 -0.387466	  1.885110
  0.263468	 -0.396028	  1.900559
  0.272045	 -0.405954	  1.915958
  0.280840	 -0.416706	  1.930500
  0.293497	 -0.427738	  1.941536
  0.306711	 -0.437972	  1.951775
  0.319627	 -0.449289	  1.962313
  0.331710	 -0.461017	  1.973237
  0.343455	 -0.472772	  1.984414
  0.355209	 -0.482737	  1.995209
  0.364333	 -0.491469	  2.012589
  0.377585	 -0.504070	  2.027126
  0.403234	 -0.521668	  2.026556
  0.417304	 -0.529233	  2.023325
  0.436130	 -0.535539	  2.018921
  0.459936	 -0.546585	  2.017520
  0.475141	 -0.555351	  2.022803
  0.487223	 -0.564804	  2.029995
  0.504667	 -0.575808	  2.038858
  0.518515	 -0.584819	  2.045467
  0.532471	 -0.598397	  2.055505
  0.555618	 -0.614643	  2.061457
  0.570600	 -0.619732	  2.061218
  0.590323	 -0.622514	  2.058935
  0.611402	 -0.627781	  2.061137
  0.626385	 -0.635584	  2.066132
  0.640775	 -0.648047	  2.075996
  0.660865	 -0.664007	  2.082116
  0.676463	 -0.673013	  2.081822
  0.692666	 -0.674689	  2.081401
  0.717129	 -0.676660	  2.081685
  0.741431	 -0.690689	  2.076746
  0.756319	 -0.702387	  2.074083
  0.766220	 -0.711644	  2.079790
  0.783652	 -0.722034	  2.090504
  0.800726	 -0.729491	  2.099372
  0.818057	 -0.738234	  2.107111
  0.834170	 -0.746874	  2.115813
  0.850074	 -0.755933	  2.124847
  0.866443	 -0.765412	  2.132679
  0.883397	 -0.775187	  2.138353
  0.900247	 -0.785140	  2.141547
  0.916156	 -0.795033	  2.146358
  0.930707	 -0.806387	  2.155358
  0.946082	 -0.818137	  2.164620
  0.962328	 -0.825085	  2.171899
