 -0.811188	  2.295315	  0.617188
 -0.811303	  2.295700	  0.617509
 -0.811087	  2.286656	  0.598073
 -0.807619	  2.272544	  0.582190
 -0.803269	  2.257958	  0.570677
 -0.802671	  2.243762	  0.558970
 -0.802379	  2.229939	  0.540260
 -0.797757	  2.217239	  0.524051
 -0.796863	  2.204084	  0.511555
 -0.800722	  2.190047	  0.500315
 -0.801150	  2.171880	  0.491347
 -0.793738	  2.153865	  0.485364
 -0.781625	  2.129490	  0.465156
 -0.769474	  2.116687	  0.454857
 -0.765847	  2.109350	  0.447844
 -0.755082	  2.093687	  0.434063
 -0.749445	  2.074321	  0.415451
 -0.750233	  2.066875	  0.408770
 -0.748453	  2.051782	  0.390859
 -0.743740	  2.030429	  0.372924
 -0.741494	  2.024997	  0.366378
 -0.740479	  2.006776	  0.354175
 -0.733704	  1.980068	  0.333260
 -0.729854	  1.969820	  0.326684
 -0.724679	  1.958866	  0.322257
 -0.709104	  1.938471	  0.315842
 -0.696621	  1.922356	  0.313847
 -0.682869	  1.902841	  0.312432
 -0.670428	  1.886615	  0.306167
 -0.661660	  1.870998	  0.298914
 -0.655974	  1.857486	  0.293078
 -0.649676	  1.837527	  0.287764
 -0.642262	  1.816456	  0.284949
 -0.632789	  1.794680	  0.282102
 -0.622992	  1.781575	  0.275487
 -0.618170	  1.768037	  0.275745
 -0.602965	  1.754199	  0.269819
 -0.603775	  1.735019	  0.266590
 -0.589677	  1.718240	  0.261200
 -0.595288	  1.695517	  0.255510
 -0.575036	  1.686542	  0.255642
 -0.575720	  1.664041	  0.245663
 -0.560102	  1.645841	  0.243879
 -0.565040	  1.622854	  0.233466
 -0.557755	  1.593962	  0.231448
 -0.554115	  1.567237	  0.230896
 -0.537007	  1.563762	  0.237193
 -0.542524	  1.538020	  0.236212
 -0.545354	  1.527807	  0.231472
 -0.544847	  1.507268	  0.229378
 -0.539726	  1.481741	  0.229300
 -0.538022	  1.468783	  0.227894
 -0.529173	  1.449911	  0.218355
 -0.525833	  1.425363	  0.208767
 -0.513547	  1.411660	  0.202570
 -0.521390	  1.394018	  0.202580
 -0.511047	  1.373916	  0.200655
 -0.513690	  1.352342	  0.200192
 -0.511852	  1.321338	  0.201646
 -0.516553	  1.302795	  0.201837
 -0.519453	  1.290243	  0.203101
 -0.522906	  1.264803	  0.202600
 -0.525773	  1.238002	  0.194698
 -0.520374	  1.225154	  0.188721
 -0.527846	  1.212021	  0.178769
 -0.520925	  1.197201	  0.169323
 -0.519977	  1.181356	  0.153949
 -0.518817	  1.164372	  0.143567
 -0.521338	  1.141405	  0.130855
 -0.523164	  1.126040	  0.122205
 -0.524033	  1.112878	  0.111973
 -0.524109	  1.092586	  0.099238
 -0.528084	  1.075094	  0.089828
 -0.530658	  1.061092	  0.083731
 -0.532614	  1.042112	  0.071624
 -0.532964	  1.020522	  0.059988
 -0.532455	  1.003944	  0.052046
 -0.528410	  0.987083	  0.044898
 -0.521891	  0.971123	  0.035049
 -0.517282	  0.961227	  0.024696
 -0.513612	  0.948228	  0.003444
 -0.502962	  0.943873	 -0.026139
 -0.497416	  0.942408	 -0.036489
 -0.486974	  0.935675	 -0.053392
 -0.482304	  0.918445	 -0.067215
 -0.479258	  0.907409	 -0.084676
 -0.475167	  0.901690	 -0.103659
 -0.470754	  0.895124	 -0.121350
 -0.468146	  0.890100	 -0.136713
 -0.462615	  0.886533	 -0.160114
 -0.457454	  0.876861	 -0.185114
 -0.454714	  0.869240	 -0.197338
 -0.451437	  0.862371	 -0.210476
 -0.446913	  0.855903	 -0.233177
 -0.443056	  0.852382	 -0.253323
 -0.439664	  0.848361	 -0.270494
 -0.435048	  0.845179	 -0.289300
 -0.426118	  0.843883	 -0.311696
 -0.417559	  0.846175	 -0.327636
 -0.410316	  0.846744	 -0.344700
 -0.402765	  0.847120	 -0.365486
 -0.399031	  0.850143	 -0.381982
 -0.396377	  0.853970	 -0.403236
 -0.394854	  0.854067	 -0.422078
 -0.388817	  0.850594	 -0.446303
 -0.385821	  0.847593	 -0.457653
 -0.373746	  0.839123	 -0.482968
 -0.366820	  0.832315	 -0.499078
 -0.359495	  0.825798	 -0.517363
 -0.354847	  0.818994	 -0.533179
 -0.351050	  0.810323	 -0.549467
 -0.348333	  0.798491	 -0.565153
 -0.344306	  0.782225	 -0.581623
 -0.338946	  0.763087	 -0.598567
 -0.337980	  0.756575	 -0.605330
 -0.335109	  0.740880	 -0.617543
 -0.333606	  0.716897	 -0.636239
 -0.333977	  0.705136	 -0.646447
 -0.328828	  0.691813	 -0.661961
 -0.321971	  0.675239	 -0.678479
 -0.320067	  0.663986	 -0.687114
 -0.319290	  0.648662	 -0.698249
 -0.322117	  0.630069	 -0.707187
 -0.320895	  0.606484	 -0.716060
 -0.318307	  0.589825	 -0.726597
 -0.317875	  0.578461	 -0.734274
 -0.317367	  0.563012	 -0.741404
 -0.311034	  0.538044	 -0.753984
 -0.307769	  0.513700	 -0.766421
 -0.305887	  0.508806	 -0.769951
 -0.300977	  0.486299	 -0.786460
 -0.299052	  0.469608	 -0.794883
 -0.297410	  0.453219	 -0.800671
 -0.291737	  0.435910	 -0.811008
 -0.288805	  0.422933	 -0.822021
 -0.288475	  0.400398	 -0.835320
 -0.287475	  0.381561	 -0.846700
 -0.285008	  0.373817	 -0.853251
 -0.278352	  0.357141	 -0.867978
 -0.267548	  0.335923	 -0.886856
 -0.261512	  0.316658	 -0.895437
 -0.259127	  0.304853	 -0.898701
 -0.256124	  0.283598	 -0.899902
 -0.250369	  0.265519	 -0.903099
 -0.240164	  0.248351	 -0.906098
 -0.224930	  0.230566	 -0.911019
 -0.210837	  0.213847	 -0.919959
 -0.205508	  0.202064	 -0.927229
 -0.199431	  0.185917	 -0.937211
 -0.192824	  0.162803	 -0.948093
 -0.180997	  0.138831	 -0.960279
 -0.178532	  0.130711	 -0.964649
 -0.173100	  0.124065	 -0.974190
 -0.169498	  0.114855	 -0.989932
 -0.166143	  0.106530	 -1.009841
 -0.156640	  0.094390	 -1.028280
 -0.146858	  0.083680	 -1.038597
 -0.139406	  0.078075	 -1.052327
 -0.130534	  0.066533	 -1.068039
 -0.123802	  0.056835	 -1.085834
 -0.120689	  0.047142	 -1.101595
 -0.120781	  0.038164	 -1.121196
 -0.124506	  0.031925	 -1.140743
 -0.127009	  0.027711	 -1.150097
 -0.129549	  0.012618	 -1.174767
 -0.133033	 -0.000160	 -1.194997
 -0.136086	 -0.006905	 -1.204051
 -0.141130	 -0.020258	 -1.220261
 -0.142951	 -0.036408	 -1.242424
 -0.147063	 -0.049188	 -1.259380
 -0.148481	 -0.062048	 -1.278690
 -0.146815	 -0.072803	 -1.290924
 -0.149006	 -0.089511	 -1.309479
 -0.149982	 -0.096311	 -1.317387
 -0.142752	 -0.108066	 -1.332558
 -0.137005	 -0.126196	 -1.350055
 -0.133488	 -0.141356	 -1.365753
 -0.130764	 -0.150672	 -1.373971
 -0.121466	 -0.169543	 -1.387192
 -0.112823	 -0.187801	 -1.400191
 -0.106492	 -0.200094	 -1.411628
 -0.101714	 -0.211562	 -1.422931
 -0.097572	 -0.226960	 -1.437701
 -0.094728	 -0.238494	 -1.449447
 -0.089575	 -0.250191	 -1.463936
 -0.082592	 -0.265531	 -1.479404
 -0.071484	 -0.287481	 -1.495912
 -0.065797	 -0.299682	 -1.504280
 -0.061208	 -0.313216	 -1.512059
 -0.056014	 -0.327469	 -1.520634
 -0.052368	 -0.347315	 -1.530049
 -0.049780	 -0.368708	 -1.541258
 -0.046498	 -0.386209	 -1.552070
 -0.041822	 -0.399314	 -1.560317
 -0.033377	 -0.412306	 -1.569250
 -0.019448	 -0.429345	 -1.585534
 -0.009774	 -0.440082	 -1.600712
 -0.002299	 -0.448745	 -1.616248
  0.003873	 -0.455777	 -1.629079
  0.006804	 -0.471824	 -1.652717
  0.009302	 -0.484436	 -1.670344
  0.012877	 -0.493140	 -1.681972
  0.020082	 -0.506305	 -1.698355
  0.031979	 -0.529578	 -1.713602
  0.038235	 -0.541308	 -1.719101
  0.043312	 -0.559620	 -1.726724
  0.046941	 -0.573210	 -1.734777
  0.046491	 -0.590377	 -1.750057
  0.046812	 -0.606278	 -1.769968
  0.046684	 -0.614250	 -1.780718
  0.048408	 -0.623654	 -1.791131
  0.052403	 -0.642776	 -1.811054
  0.055265	 -0.665131	 -1.828303
  0.057195	 -0.680316	 -1.839855
  0.059017	 -0.697444	 -1.850187
  0.063110	 -0.714035	 -1.857069
  0.066601	 -0.726920	 -1.861272
  0.075036	 -0.748610	 -1.874138
  0.079123	 -0.766347	 -1.889183
  0.083730	 -0.781152	 -1.899562
  0.089757	 -0.795385	 -1.908092
  0.098525	 -0.813346	 -1.914854
  0.106981	 -0.830275	 -1.921573
  0.111327	 -0.852021	 -1.931003
  0.112050	 -0.875714	 -1.936764
  0.111456	 -0.890534	 -1.940032
  0.108248	 -0.910383	 -1.945670
  0.108239	 -0.929687	 -1.952865
  0.111611	 -0.946928	 -1.961741
  0.115825	 -0.964959	 -1.969673
  0.120503	 -0.982040	 -1.978716
  0.125387	 -0.998627	 -1.988692
  0.130508	 -1.015053	 -1.998770
  0.135845	 -1.031389	 -2.009104
  0.140480	 -1.047764	 -2.019462
  0.145565	 -1.063560	 -2.030720
  0.150711	 -1.079000	 -2.042357
  0.155195	 -1.094237	 -2.054516
  0.159659	 -1.109480	 -2.066670
  0.164032	 -1.124229	 -2.079450
  0.168391	 -1.138891	 -2.092334
  0.172893	 -1.153384	 -2.105359
  0.177711	 -1.167501	 -2.118683
  0.182536	 -1.181596	 -2.132025
  0.187334	 -1.194804	 -2.146255
  0.192126	 -1.207694	 -2.160783
  0.196933	 -1.220630	 -2.175368
  0.201854	 -1.233631	 -2.190206
  0.207398	 -1.244991	 -2.205705
