 0.0 0.0 0.0 0
 -0.8412694327294316 0.43030232434312277 -0.5606690872632358 1000
 0.5849924260013015 0.736764877197998 0.9467185183195195 1000
 0.14122288070425815 -0.6654638485907713 0.37754504830429936 1000
 0.8616632590486253 -0.5077430506333732 0.749677623660244 1000
 -0.9984422622450663 0.03398445304668604 -0.9730553500393208 1000
 -0.3776423800182265 0.2803850773331776 0.1679069230720115 1000
 0.04270485013576722 0.27078770639151667 -0.41308853245413474 1000
 0.5183905102908978 0.4230168133546659 0.21855240286551258 1000
 0.0 0.0 0.0 0
 0.15783519220989947 0.6696947512977252 0.7126053895259137 1000
 -0.3720953132332243 0.6616840531479752 -0.5653490965250075 1000
 -0.45488407462950986 -0.21300098476433643 -0.9754803375619483 1000
 -0.7167988566520421 -0.6520177070409636 -1.0087092267187372 1000
