 -0.712926	 -2.307760	  0.626629
 -0.720213	 -2.317378	  0.632425
 -0.709923	 -2.302977	  0.623210
 -0.699303	 -2.288117	  0.614704
 -0.687435	 -2.273730	  0.607684
 -0.678295	 -2.258725	  0.598113
 -0.667529	 -2.243454	  0.590049
 -0.655952	 -2.228899	  0.583500
 -0.647387	 -2.213732	  0.573479
 -0.636847	 -2.198117	  0.565333
 -0.625184	 -2.183164	  0.558814
 -0.614976	 -2.168175	  0.550830
 -0.606242	 -2.153092	  0.541640
 -0.597935	 -2.137505	  0.532355
 -0.593658	 -2.121532	  0.517657
 -0.589435	 -2.108116	  0.501893
 -0.584145	 -2.093395	  0.490025
 -0.578920	 -2.076036	  0.483663
 -0.573951	 -2.059660	  0.472475
 -0.564628	 -2.042342	  0.463381
 -0.559321	 -2.025672	  0.456274
 -0.557753	 -2.008821	  0.445678
 -0.551724	 -1.992368	  0.432377
 -0.542999	 -1.976776	  0.423433
 -0.539377	 -1.960506	  0.415679
 -0.535180	 -1.943935	  0.402909
 -0.527441	 -1.929255	  0.389784
 -0.520212	 -1.916031	  0.378798
 -0.519547	 -1.901522	  0.365818
 -0.513519	 -1.887627	  0.349232
 -0.505302	 -1.868852	  0.336834
 -0.493547	 -1.860516	  0.334506
 -0.482805	 -1.847031	  0.322377
 -0.466847	 -1.835807	  0.309517
 -0.453969	 -1.829308	  0.301559
 -0.437005	 -1.822993	  0.291577
 -0.419056	 -1.818138	  0.283073
 -0.401744	 -1.812599	  0.275507
 -0.382342	 -1.812126	  0.269282
 -0.363956	 -1.808941	  0.261748
 -0.343841	 -1.810481	  0.256844
 -0.323808	 -1.811186	  0.252810
 -0.305078	 -1.808720	  0.246916
 -0.285810	 -1.814573	  0.243334
 -0.266870	 -1.822248	  0.242413
 -0.245456	 -1.836528	  0.244184
 -0.227947	 -1.839704	  0.240399
 -0.209569	 -1.837633	  0.233461
 -0.189890	 -1.839388	  0.228966
 -0.169570	 -1.844175	  0.220037
 -0.152553	 -1.845312	  0.210473
 -0.133616	 -1.844218	  0.203307
 -0.116263	 -1.839924	  0.196772
 -0.097583	 -1.836806	  0.187996
 -0.079792	 -1.834444	  0.179004
 -0.063063	 -1.829071	  0.170035
 -0.047313	 -1.822084	  0.159441
 -0.032293	 -1.813930	  0.147599
 -0.016919	 -1.804025	  0.137552
 -0.001642	 -1.796985	  0.132722
  0.011401	 -1.785361	  0.123836
  0.025914	 -1.771266	  0.114380
  0.037949	 -1.759431	  0.107410
  0.044978	 -1.745472	  0.099862
  0.050234	 -1.729804	  0.091624
  0.054368	 -1.712056	  0.084462
  0.057403	 -1.693548	  0.078332
  0.057304	 -1.673818	  0.072631
  0.054041	 -1.654187	  0.069782
  0.050764	 -1.634658	  0.066974
  0.047245	 -1.615337	  0.063201
  0.043246	 -1.596616	  0.057409
  0.039244	 -1.577900	  0.051606
  0.035236	 -1.559189	  0.045792
  0.029841	 -1.541681	  0.038476
  0.023320	 -1.525596	  0.030485
  0.017768	 -1.506231	  0.020828
  0.013433	 -1.488802	  0.011506
  0.003960	 -1.474512	  0.003787
 -0.004822	 -1.459248	 -0.005143
 -0.012535	 -1.441758	 -0.015011
 -0.023295	 -1.427889	 -0.022989
 -0.033773	 -1.413272	 -0.031228
 -0.042097	 -1.396174	 -0.040599
 -0.054076	 -1.382199	 -0.048109
 -0.065204	 -1.368622	 -0.055836
 -0.073588	 -1.351483	 -0.065718
 -0.086691	 -1.337080	 -0.073664
 -0.098404	 -1.325022	 -0.079247
 -0.108728	 -1.308744	 -0.086815
 -0.117284	 -1.291878	 -0.094974
 -0.126329	 -1.275573	 -0.104198
 -0.134186	 -1.260308	 -0.116466
 -0.139316	 -1.244508	 -0.128900
 -0.143522	 -1.227008	 -0.134551
 -0.150994	 -1.208167	 -0.140475
 -0.156493	 -1.189214	 -0.145529
 -0.157907	 -1.169831	 -0.154644
 -0.156527	 -1.151934	 -0.164052
 -0.149759	 -1.134197	 -0.168142
 -0.138715	 -1.118041	 -0.173649
 -0.126534	 -1.103830	 -0.184089
 -0.118107	 -1.092307	 -0.197596
 -0.107305	 -1.079760	 -0.209372
 -0.093499	 -1.067093	 -0.217853
 -0.079108	 -1.056014	 -0.223391
 -0.062920	 -1.042958	 -0.228632
 -0.047218	 -1.027829	 -0.233500
 -0.038043	 -1.013632	 -0.239156
 -0.030373	 -0.996435	 -0.249077
 -0.021054	 -0.979138	 -0.257858
 -0.008285	 -0.965780	 -0.261329
  0.004015	 -0.949699	 -0.265990
  0.013467	 -0.932758	 -0.271768
  0.019389	 -0.916230	 -0.278511
  0.025164	 -0.896072	 -0.286217
  0.034999	 -0.881324	 -0.291964
  0.047248	 -0.866674	 -0.298382
  0.057714	 -0.848447	 -0.305014
  0.065405	 -0.833615	 -0.311052
  0.075120	 -0.816640	 -0.318729
  0.082797	 -0.798714	 -0.325559
  0.087232	 -0.783112	 -0.333636
  0.093003	 -0.763290	 -0.343321
  0.097254	 -0.746556	 -0.350888
  0.108523	 -0.732181	 -0.360184
  0.119669	 -0.712766	 -0.367904
  0.129368	 -0.702227	 -0.373083
  0.142923	 -0.687963	 -0.382293
  0.153773	 -0.671719	 -0.391671
  0.158243	 -0.655282	 -0.401183
  0.163282	 -0.638837	 -0.410879
  0.170492	 -0.621744	 -0.420149
  0.177663	 -0.605207	 -0.428896
  0.184147	 -0.588745	 -0.437853
  0.191817	 -0.572942	 -0.447567
  0.199631	 -0.558572	 -0.459347
  0.205038	 -0.541602	 -0.470561
  0.208217	 -0.522956	 -0.476347
  0.211369	 -0.502861	 -0.482035
  0.214582	 -0.484900	 -0.491458
  0.221116	 -0.471242	 -0.502688
  0.230250	 -0.456871	 -0.513403
  0.236038	 -0.437522	 -0.524921
  0.241315	 -0.421475	 -0.532120
  0.249134	 -0.404525	 -0.539923
  0.251398	 -0.387463	 -0.550331
  0.252136	 -0.370247	 -0.562239
  0.254699	 -0.354761	 -0.573237
  0.264733	 -0.338891	 -0.580887
  0.276473	 -0.320934	 -0.592597
  0.282295	 -0.306874	 -0.605041
  0.283606	 -0.295218	 -0.615537
  0.291640	 -0.278544	 -0.628070
  0.298718	 -0.263632	 -0.639085
  0.307113	 -0.250714	 -0.649614
  0.319399	 -0.234714	 -0.662036
  0.329167	 -0.223113	 -0.671247
  0.338511	 -0.208896	 -0.680887
  0.347953	 -0.193635	 -0.689975
  0.360530	 -0.179813	 -0.699685
  0.370842	 -0.167897	 -0.710765
  0.378863	 -0.154494	 -0.722925
  0.386539	 -0.137859	 -0.734258
  0.395361	 -0.122798	 -0.743982
  0.403619	 -0.111808	 -0.756664
  0.410887	 -0.096573	 -0.770852
  0.416994	 -0.080848	 -0.781984
  0.431527	 -0.067058	 -0.789477
  0.447175	 -0.057386	 -0.799238
  0.458317	 -0.045227	 -0.813079
  0.465674	 -0.033131	 -0.824615
  0.473096	 -0.017337	 -0.835486
  0.479735	 -0.001247	 -0.845165
  0.486593	  0.015054	 -0.855820
  0.493556	  0.030822	 -0.866334
  0.501690	  0.046898	 -0.875773
  0.509596	  0.063674	 -0.884064
  0.516542	  0.079907	 -0.892786
  0.525078	  0.098212	 -0.898409
  0.532017	  0.116176	 -0.901469
  0.539043	  0.136675	 -0.902981
  0.545011	  0.155792	 -0.905214
  0.550378	  0.173744	 -0.911087
  0.557989	  0.191039	 -0.917955
  0.566838	  0.208113	 -0.918376
  0.575550	  0.226843	 -0.918819
  0.581047	  0.246211	 -0.923680
  0.586168	  0.265963	 -0.926713
  0.594007	  0.284294	 -0.924328
  0.600799	  0.302103	 -0.925489
  0.605787	  0.319853	 -0.933343
  0.610097	  0.339414	 -0.941212
  0.616448	  0.359189	 -0.943688
  0.623795	  0.378444	 -0.942161
  0.630395	  0.397167	 -0.941794
  0.635497	  0.416436	 -0.941806
  0.637746	  0.436485	 -0.942020
  0.639249	  0.456786	 -0.941608
  0.642106	  0.476293	 -0.938056
  0.645677	  0.495424	 -0.932864
  0.649036	  0.514692	 -0.927178
  0.651171	  0.533718	 -0.921367
  0.655144	  0.552425	 -0.915828
  0.659521	  0.571546	 -0.910636
  0.665773	  0.589869	 -0.907700
  0.670383	  0.609396	 -0.904380
  0.674093	  0.629069	 -0.902068
  0.675881	  0.648393	 -0.900193
  0.676050	  0.668554	 -0.897471
  0.677937	  0.689907	 -0.894266
  0.677533	  0.708792	 -0.893498
  0.676860	  0.727773	 -0.892731
  0.682379	  0.748209	 -0.886843
  0.685463	  0.766814	 -0.881144
  0.686715	  0.787519	 -0.882241
  0.688965	  0.807676	 -0.883246
  0.695143	  0.827328	 -0.884599
  0.698088	  0.845396	 -0.888665
  0.703512	  0.865656	 -0.891409
  0.714032	  0.883163	 -0.901631
  0.714303	  0.898695	 -0.911947
  0.714935	  0.917480	 -0.917000
  0.720990	  0.933984	 -0.925947
  0.726029	  0.954555	 -0.939635
  0.724479	  0.973289	 -0.947937
  0.721812	  0.981458	 -0.966130
  0.725793	  0.992591	 -0.983534
  0.735453	  1.002688	 -0.997970
  0.738434	  1.014134	 -1.015137
  0.738176	  1.024067	 -1.033265
  0.744779	  1.031151	 -1.050565
  0.751260	  1.037582	 -1.068452
  0.753621	  1.045162	 -1.085295
  0.760091	  1.054632	 -1.104880
  0.771172	  1.059116	 -1.123149
  0.775288	  1.063350	 -1.141064
  0.775983	  1.069183	 -1.158336
  0.776802	  1.072370	 -1.179951
  0.776234	  1.073619	 -1.202561
  0.777817	  1.080538	 -1.218382
  0.783009	  1.081817	 -1.239623
  0.782492	  1.081247	 -1.258350
  0.783515	  1.083608	 -1.278376
  0.788559	  1.085755	 -1.299471
  0.795694	  1.083824	 -1.318868
  0.797236	  1.084910	 -1.336503
  0.803767	  1.089845	 -1.354567
  0.813628	  1.090586	 -1.374154
  0.821998	  1.090748	 -1.390660
  0.829447	  1.093395	 -1.408089
  0.841980	  1.099184	 -1.422996
  0.849504	  1.099346	 -1.440379
  0.860766	  1.106205	 -1.456472
  0.875519	  1.113324	 -1.470195
  0.888867	  1.123174	 -1.479627
  0.899410	  1.135396	 -1.490847
  0.911331	  1.146015	 -1.504408
  0.924060	  1.159124	 -1.512889
  0.935012	  1.173535	 -1.520949
  0.944682	  1.187767	 -1.531313
  0.956182	  1.200325	 -1.543481
  0.968291	  1.212396	 -1.554771
  0.976288	  1.227129	 -1.563161
  0.984563	  1.241951	 -1.574644
  0.994251	  1.257000	 -1.584642
  1.005520	  1.270248	 -1.595257
  1.016439	  1.284217	 -1.603034
  1.026864	  1.297750	 -1.613029
  1.037133	  1.312216	 -1.624012
  1.044602	  1.329648	 -1.631541
  1.050847	  1.348645	 -1.637488
  1.059225	  1.366737	 -1.645090
  1.068347	  1.378165	 -1.656375
  1.077673	  1.392675	 -1.668618
  1.087945	  1.408851	 -1.679619
  1.094106	  1.422868	 -1.686770
  1.100985	  1.445935	 -1.694676
  1.108204	  1.462370	 -1.703496
