  2.660651	  1.437727	 -0.186485
  2.634308	  1.423492	 -0.184638
  2.602014	  1.409580	 -0.211332
  2.569261	  1.398638	 -0.242120
  2.528810	  1.383509	 -0.265047
  2.495078	  1.365831	 -0.296623
  2.460405	  1.351012	 -0.329298
  2.424404	  1.329297	 -0.357162
  2.384728	  1.311804	 -0.384072
  2.347506	  1.295450	 -0.414302
  2.312087	  1.285045	 -0.448158
  2.280001	  1.269490	 -0.482236
  2.249155	  1.256045	 -0.517556
  2.218106	  1.246468	 -0.555033
  2.184599	  1.231132	 -0.588643
  2.150717	  1.212077	 -0.620262
  2.115458	  1.189165	 -0.649845
  2.079267	  1.162671	 -0.675449
  2.042853	  1.135214	 -0.698084
  2.005968	  1.109174	 -0.720212
  1.968354	  1.084993	 -0.742370
  1.930308	  1.063472	 -0.764659
  1.890390	  1.044458	 -0.788807
  1.848351	  1.028414	 -0.816335
  1.809327	  1.016243	 -0.844831
  1.771971	  1.004070	 -0.873775
  1.733882	  0.991418	 -0.902436
  1.696300	  0.978746	 -0.929853
  1.659037	  0.965455	 -0.957873
  1.621266	  0.951458	 -0.987553
  1.585678	  0.934803	 -1.017636
  1.549707	  0.920385	 -1.048514
  1.513028	  0.910108	 -1.080406
  1.476266	  0.897671	 -1.112892
  1.439917	  0.884727	 -1.147028
  1.409940	  0.872775	 -1.185479
  1.378063	  0.860176	 -1.217256
  1.338607	  0.856269	 -1.248247
  1.298306	  0.840140	 -1.276131
  1.258773	  0.822730	 -1.301840
  1.220333	  0.806818	 -1.328203
  1.183135	  0.796383	 -1.359070
  1.153473	  0.790703	 -1.398110
  1.139864	  0.789558	 -1.443099
  1.143994	  0.794992	 -1.513894
  1.175871	  0.808144	 -1.628150
  1.198343	  0.806961	 -1.730378
  1.195810	  0.789874	 -1.821178
  1.178591	  0.759823	 -1.915450
  1.160406	  0.728729	 -1.983865
  1.142290	  0.707128	 -2.026875
  1.115032	  0.685840	 -2.067331
  1.072320	  0.658266	 -2.102142
  1.009140	  0.627470	 -2.122705
  0.951891	  0.604732	 -2.129654
  0.915915	  0.593427	 -2.134775
  0.891527	  0.587656	 -2.141821
  0.863546	  0.581579	 -2.159574
  0.831349	  0.576921	 -2.202727
  0.807689	  0.572400	 -2.269541
  0.788723	  0.562953	 -2.332496
  0.770092	  0.547002	 -2.355714
  0.747876	  0.525910	 -2.366363
  0.717192	  0.494134	 -2.366211
  0.648304	  0.424781	 -2.347623
  0.534802	  0.379144	 -2.298767
  0.394463	  0.372655	 -2.204780
  0.287422	  0.362429	 -2.183372
  0.232603	  0.346370	 -2.194982
  0.192649	  0.329384	 -2.214837
  0.155271	  0.314116	 -2.241468
  0.117814	  0.301877	 -2.271805
  0.081794	  0.292141	 -2.302590
  0.044764	  0.284273	 -2.336047
  0.004733	  0.271188	 -2.369054
 -0.031597	  0.251751	 -2.399941
 -0.062761	  0.229803	 -2.431022
 -0.095835	  0.206581	 -2.460467
 -0.130748	  0.184487	 -2.488399
 -0.166555	  0.165236	 -2.514525
 -0.204010	  0.149563	 -2.539021
 -0.245091	  0.137848	 -2.562542
 -0.287418	  0.125261	 -2.586196
 -0.330349	  0.112761	 -2.610994
 -0.373734	  0.100670	 -2.638402
 -0.412249	  0.083144	 -2.666977
 -0.447014	  0.064021	 -2.696335
 -0.479104	  0.043973	 -2.727609
 -0.507624	  0.021739	 -2.759811
 -0.538081	  0.001088	 -2.791344
 -0.570959	 -0.018892	 -2.826546
 -0.607870	 -0.038231	 -2.856798
 -0.647247	 -0.055464	 -2.885222
 -0.686927	 -0.071756	 -2.919415
 -0.693796	 -0.072473	 -2.948609
