 -0.439115	  2.704466	  1.293808
 -0.434768	  2.677690	  1.280998
 -0.425406	  2.647355	  1.247116
 -0.417825	  2.615710	  1.214450
 -0.406234	  2.580545	  1.181048
 -0.397963	  2.550628	  1.139624
 -0.394673	  2.519860	  1.100443
 -0.385895	  2.486495	  1.066326
 -0.381677	  2.447733	  1.037980
 -0.367915	  2.413155	  1.002509
 -0.359886	  2.383212	  0.960547
 -0.349310	  2.350242	  0.926834
 -0.347246	  2.315712	  0.885786
 -0.342508	  2.283194	  0.849260
 -0.338825	  2.251231	  0.812714
 -0.335099	  2.220282	  0.777566
 -0.329383	  2.188161	  0.737024
 -0.324456	  2.156137	  0.699201
 -0.318507	  2.124035	  0.661417
 -0.311706	  2.092972	  0.623648
 -0.304845	  2.062085	  0.586637
 -0.297854	  2.032280	  0.550779
 -0.290979	  1.998996	  0.513847
 -0.288654	  1.963443	  0.480188
 -0.295752	  1.928502	  0.454629
 -0.308957	  1.901689	  0.443327
 -0.341474	  1.862120	  0.443213
 -0.514050	  1.748745	  0.451193
 -0.637569	  1.636108	  0.444480
 -0.726843	  1.423649	  0.457049
 -0.778902	  1.320351	  0.405997
 -0.779985	  1.318295	  0.405619
 -0.778364	  1.317540	  0.401750
 -0.753970	  1.305647	  0.358614
 -0.676320	  1.300291	  0.285195
 -0.458093	  1.338035	  0.156091
 -0.298319	  1.389593	  0.159194
 -0.113436	  1.401351	  0.066885
  0.039221	  1.339484	  0.016488
  0.144083	  1.328186	  0.004029
  0.181737	  1.301047	 -0.031915
  0.202995	  1.272605	 -0.054224
  0.212548	  1.257115	 -0.077838
  0.212906	  1.243332	 -0.102385
  0.209962	  1.219967	 -0.138309
  0.205093	  1.184876	 -0.195214
  0.185249	  1.129608	 -0.251458
  0.175235	  1.085047	 -0.279126
  0.155595	  1.035567	 -0.292288
  0.111505	  0.944258	 -0.297845
  0.062051	  0.817854	 -0.275902
  0.056175	  0.765075	 -0.276028
  0.043392	  0.681999	 -0.303976
  0.027733	  0.610666	 -0.343871
  0.027842	  0.606799	 -0.346122
  0.029000	  0.594067	 -0.352081
  0.042682	  0.565643	 -0.420993
  0.041532	  0.558064	 -0.469372
  0.033761	  0.580646	 -0.532960
  0.022183	  0.612063	 -0.590041
  0.000929	  0.696383	 -0.748154
  0.001887	  0.685472	 -0.875588
  0.014288	  0.657259	 -0.925740
  0.030058	  0.631954	 -0.952593
  0.053789	  0.602782	 -0.973322
  0.107265	  0.554914	 -0.993210
  0.259300	  0.457812	 -1.012793
  0.320698	  0.419914	 -1.023924
  0.356430	  0.390768	 -1.032385
  0.384160	  0.357600	 -1.057498
  0.399370	  0.321960	 -1.090192
  0.401738	  0.295187	 -1.120852
  0.388350	  0.268939	 -1.168452
  0.367028	  0.248750	 -1.217858
  0.328898	  0.234847	 -1.276447
  0.212696	  0.215601	 -1.400667
  0.141978	  0.200657	 -1.448586
  0.120749	  0.175459	 -1.483649
  0.121261	  0.145191	 -1.518637
  0.128454	  0.110167	 -1.557097
  0.134573	  0.078230	 -1.591727
  0.139205	  0.042755	 -1.628639
  0.143414	  0.006895	 -1.663454
  0.148719	 -0.030790	 -1.698158
  0.155738	 -0.069652	 -1.734330
  0.162489	 -0.102836	 -1.765477
  0.170073	 -0.138788	 -1.799771
  0.177985	 -0.174812	 -1.835661
  0.185506	 -0.207622	 -1.870302
  0.192906	 -0.238966	 -1.904498
  0.200365	 -0.270928	 -1.940828
  0.208548	 -0.303629	 -1.978544
  0.216196	 -0.334808	 -2.014268
  0.223879	 -0.368309	 -2.052063
  0.232810	 -0.400759	 -2.088049
  0.243313	 -0.433650	 -2.126375
  0.251647	 -0.461819	 -2.166793
  0.259480	 -0.492926	 -2.204867
  0.267669	 -0.524950	 -2.238092
  0.277369	 -0.560198	 -2.275715
  0.285899	 -0.594581	 -2.314602
  0.293295	 -0.624692	 -2.349213
  0.301243	 -0.655386	 -2.385000
  0.309810	 -0.688687	 -2.425165
  0.317368	 -0.721030	 -2.466057
  0.323625	 -0.751323	 -2.504985
  0.328828	 -0.780266	 -2.538861
  0.333500	 -0.812747	 -2.572572
  0.340238	 -0.848567	 -2.606652
  0.343570	 -0.884730	 -2.643320
  0.343710	 -0.918374	 -2.685257
  0.349678	 -0.954090	 -2.723214
  0.357845	 -0.988389	 -2.758488
  0.362989	 -1.022480	 -2.796922
  0.366619	 -1.032704	 -2.824892
