  0.488703	 -2.474697	 -0.112903
  0.484237	 -2.484640	 -0.112126
  0.500124	 -2.449273	 -0.114888
  0.521392	 -2.405117	 -0.121769
  0.543139	 -2.360404	 -0.131972
  0.564178	 -2.315176	 -0.145657
  0.583182	 -2.270088	 -0.163187
  0.600564	 -2.224478	 -0.183101
  0.616923	 -2.177557	 -0.203398
  0.631111	 -2.129726	 -0.221450
  0.643974	 -2.081830	 -0.235833
  0.656146	 -2.033588	 -0.247670
  0.668672	 -1.984296	 -0.257017
  0.680949	 -1.936519	 -0.264236
  0.692869	 -1.890673	 -0.270845
  0.704815	 -1.845732	 -0.277730
  0.717039	 -1.802204	 -0.285284
  0.731829	 -1.760146	 -0.293263
  0.751431	 -1.717184	 -0.300242
  0.772548	 -1.672100	 -0.305283
  0.795579	 -1.626402	 -0.305928
  0.819235	 -1.579788	 -0.304372
  0.841181	 -1.531970	 -0.304381
  0.861058	 -1.484166	 -0.308686
  0.878575	 -1.436926	 -0.319528
  0.892000	 -1.393979	 -0.337938
  0.900671	 -1.357396	 -0.363834
  0.905587	 -1.318839	 -0.409615
  0.899112	 -1.271206	 -0.506589
  0.863901	 -1.215074	 -0.637646
  0.833339	 -1.143462	 -0.705447
  0.831684	 -1.101283	 -0.715056
  0.838271	 -1.077769	 -0.709313
  0.859519	 -1.043552	 -0.682675
  0.904064	 -0.988098	 -0.611890
  0.953574	 -0.913816	 -0.513034
  0.986241	 -0.848051	 -0.443857
  1.005777	 -0.799761	 -0.414659
  1.020776	 -0.758582	 -0.409910
  1.038844	 -0.717352	 -0.420893
  1.057210	 -0.674999	 -0.437798
  1.074936	 -0.631934	 -0.455254
  1.093501	 -0.583447	 -0.473363
  1.110918	 -0.524422	 -0.479967
  1.118144	 -0.472514	 -0.476418
  1.129562	 -0.433671	 -0.474681
  1.149085	 -0.391562	 -0.476819
  1.167920	 -0.343549	 -0.482487
  1.184561	 -0.295340	 -0.490431
  1.199918	 -0.246827	 -0.499756
  1.214239	 -0.197684	 -0.509657
  1.227303	 -0.148182	 -0.520058
  1.238587	 -0.098791	 -0.530625
  1.249031	 -0.037943	 -0.543101
  1.241541	  0.056272	 -0.563322
  1.162965	  0.132792	 -0.582640
  1.142608	  0.152874	 -0.590749
  1.241183	  0.291573	 -0.610267
  1.258198	  0.338303	 -0.623658
  1.269775	  0.383353	 -0.638080
  1.280178	  0.429371	 -0.653431
  1.290642	  0.476734	 -0.669377
  1.302074	  0.526299	 -0.685627
  1.315617	  0.578030	 -0.701339
  1.332311	  0.628336	 -0.714164
  1.352685	  0.679384	 -0.722809
  1.373174	  0.728145	 -0.726419
  1.391548	  0.773976	 -0.727519
  1.408368	  0.819426	 -0.728407
  1.423640	  0.862514	 -0.731101
  1.440028	  0.909134	 -0.737771
  1.461150	  0.957621	 -0.745106
  1.486143	  1.001365	 -0.750703
  1.506339	  1.046001	 -0.754901
  1.524904	  1.094532	 -0.756857
  1.541257	  1.142098	 -0.754429
  1.559496	  1.184526	 -0.756072
  1.574718	  1.226438	 -0.761294
  1.587413	  1.270293	 -0.769729
  1.599908	  1.316532	 -0.780329
  1.612515	  1.363237	 -0.791856
  1.624412	  1.410084	 -0.803204
  1.635300	  1.457711	 -0.814290
  1.645316	  1.506593	 -0.824545
  1.654598	  1.556001	 -0.833570
  1.669493	  1.641858	 -0.845777
  1.671204	  1.652037	 -0.847037
