 -1.133918	  1.384561	 -1.640907
 -1.148261	  1.384493	 -1.646881
 -1.106040	  1.384695	 -1.629293
 -1.033618	  1.402169	 -1.621518
 -0.961211	  1.432058	 -1.636164
 -0.798238	  1.497222	 -1.727915
 -0.781485	  1.503102	 -1.738709
