 -1.590410	 -0.582934	 -1.821579
 -1.587261	 -0.586086	 -1.831847
 -1.584112	 -0.589238	 -1.842115
 -1.587757	 -0.584361	 -1.829367
 -1.590541	 -0.581008	 -1.806779
 -1.595672	 -0.574546	 -1.781825
 -1.600882	 -0.569680	 -1.766829
 -1.610272	 -0.561223	 -1.749966
 -1.619929	 -0.552571	 -1.732370
 -1.627509	 -0.546393	 -1.718236
 -1.637506	 -0.539599	 -1.699662
 -1.646736	 -0.533229	 -1.683145
 -1.655020	 -0.526973	 -1.669827
 -1.666504	 -0.519818	 -1.645815
 -1.669704	 -0.518942	 -1.629606
 -1.669741	 -0.520418	 -1.611400
 -1.675361	 -0.520675	 -1.583771
 -1.683674	 -0.518586	 -1.567549
 -1.693269	 -0.514554	 -1.553557
 -1.702231	 -0.508918	 -1.531970
 -1.706976	 -0.500583	 -1.512309
 -1.714003	 -0.491495	 -1.501694
 -1.727127	 -0.482134	 -1.486703
 -1.737077	 -0.477454	 -1.468327
 -1.745391	 -0.473744	 -1.450400
 -1.752900	 -0.471765	 -1.431968
 -1.760409	 -0.469807	 -1.413535
 -1.767869	 -0.468416	 -1.395030
 -1.775297	 -0.467409	 -1.376488
 -1.782688	 -0.466119	 -1.357952
 -1.789667	 -0.461907	 -1.339698
 -1.796626	 -0.457623	 -1.321443
 -1.803573	 -0.452566	 -1.303383
 -1.810499	 -0.446773	 -1.285536
 -1.817527	 -0.440999	 -1.267737
 -1.826284	 -0.436045	 -1.250577
 -1.833664	 -0.433885	 -1.232439
 -1.840819	 -0.433890	 -1.212332
 -1.850664	 -0.429720	 -1.195227
 -1.860828	 -0.428343	 -1.183416
 -1.878584	 -0.419544	 -1.163837
 -1.890597	 -0.412521	 -1.147208
 -1.897064	 -0.409719	 -1.135858
 -1.909755	 -0.404779	 -1.116349
 -1.923918	 -0.397827	 -1.101536
 -1.935301	 -0.392159	 -1.092847
 -1.953857	 -0.383627	 -1.078771
 -1.967361	 -0.380458	 -1.064384
 -1.978142	 -0.380287	 -1.048978
 -1.989698	 -0.381032	 -1.030537
 -1.998356	 -0.382426	 -1.014281
 -2.008972	 -0.384187	 -0.994166
 -2.022350	 -0.382427	 -0.977276
 -2.035278	 -0.374929	 -0.966980
 -2.053504	 -0.361966	 -0.954480
 -2.066094	 -0.357814	 -0.937252
 -2.074417	 -0.361009	 -0.917010
 -2.078691	 -0.365667	 -0.903437
 -2.091748	 -0.362460	 -0.884083
 -2.105468	 -0.350344	 -0.872615
 -2.117164	 -0.342050	 -0.857205
 -2.125892	 -0.336462	 -0.839764
 -2.134374	 -0.330928	 -0.822498
 -2.139468	 -0.325083	 -0.804053
 -2.144535	 -0.319243	 -0.785605
 -2.148847	 -0.313432	 -0.766946
 -2.151877	 -0.307534	 -0.748086
 -2.154445	 -0.301063	 -0.729330
 -2.157944	 -0.294173	 -0.710847
 -2.162156	 -0.286906	 -0.692512
 -2.166560	 -0.282537	 -0.673748
 -2.173229	 -0.274343	 -0.656981
 -2.180950	 -0.268345	 -0.639787
 -2.193184	 -0.269730	 -0.621236
 -2.204763	 -0.267683	 -0.602329
 -2.208485	 -0.261065	 -0.585493
 -2.204912	 -0.247572	 -0.565989
 -2.205464	 -0.235120	 -0.544839
 -2.215633	 -0.230399	 -0.527476
 -2.230020	 -0.231023	 -0.512852
 -2.247175	 -0.234429	 -0.495907
 -2.259255	 -0.234370	 -0.478847
 -2.264347	 -0.230975	 -0.463980
 -2.267191	 -0.219401	 -0.442251
 -2.277244	 -0.209585	 -0.421340
 -2.285051	 -0.208323	 -0.409977
 -2.300117	 -0.215329	 -0.397828
 -2.320805	 -0.226769	 -0.380880
 -2.336274	 -0.223716	 -0.361423
 -2.345554	 -0.215730	 -0.344192
 -2.347458	 -0.208721	 -0.328074
 -2.348473	 -0.205018	 -0.306907
 -2.355478	 -0.201192	 -0.287229
 -2.361684	 -0.197416	 -0.269203
 -2.370447	 -0.198390	 -0.251744
 -2.378775	 -0.195686	 -0.235301
 -2.380520	 -0.187332	 -0.208989
 -2.383362	 -0.183373	 -0.189462
 -2.387470	 -0.181764	 -0.172344
 -2.393657	 -0.179104	 -0.153450
 -2.401628	 -0.174275	 -0.134883
 -2.409678	 -0.169177	 -0.118780
 -2.418131	 -0.164839	 -0.101276
 -2.426776	 -0.160344	 -0.081770
 -2.435830	 -0.155830	 -0.065496
 -2.445334	 -0.153100	 -0.050151
 -2.453960	 -0.150389	 -0.033190
 -2.463122	 -0.144535	 -0.015896
 -2.466710	 -0.133362	  0.002250
 -2.463868	 -0.114786	  0.029281
 -2.464220	 -0.108271	  0.054038
 -2.465198	 -0.107616	  0.063909
 -2.474188	 -0.105466	  0.080310
 -2.484284	 -0.101250	  0.096882
 -2.495241	 -0.107608	  0.110428
 -2.504355	 -0.112896	  0.121697
