  2.018346	  0.509780	 -1.271587
  2.038532	  0.529683	 -1.273286
  2.024316	  0.515666	 -1.272090
  2.010365	  0.501355	 -1.272846
  1.996444	  0.487025	 -1.273775
  1.982834	  0.472439	 -1.275189
  1.970779	  0.456884	 -1.278754
  1.958724	  0.441328	 -1.282319
  1.946730	  0.425730	 -1.285902
  1.936741	  0.408900	 -1.290020
  1.926751	  0.392070	 -1.294138
  1.916678	  0.375302	 -1.298305
  1.906335	  0.358739	 -1.302631
  1.895992	  0.342177	 -1.306957
  1.885466	  0.325602	 -1.310759
  1.874910	  0.309026	 -1.314474
  1.864494	  0.292400	 -1.318362
  1.854301	  0.275703	 -1.322520
  1.844108	  0.259005	 -1.326678
  1.833893	  0.242544	 -1.331645
  1.823677	  0.226087	 -1.336627
  1.812758	  0.210219	 -1.342010
  1.801646	  0.194524	 -1.347504
  1.789569	  0.179984	 -1.354041
  1.777303	  0.165698	 -1.360782
  1.763781	  0.152840	 -1.367982
  1.750258	  0.139982	 -1.375181
  1.735938	  0.127651	 -1.381728
  1.721543	  0.115373	 -1.388211
  1.707144	  0.102899	 -1.394300
  1.692770	  0.089931	 -1.399323
  1.678396	  0.076964	 -1.404346
  1.664131	  0.063772	 -1.409087
  1.650358	  0.049718	 -1.412664
  1.636585	  0.035664	 -1.416241
  1.622859	  0.021531	 -1.419687
  1.609513	  0.006843	 -1.422162
  1.596168	 -0.007846	 -1.424637
  1.582867	 -0.022607	 -1.426920
  1.569742	 -0.037615	 -1.428503
  1.556616	 -0.052622	 -1.430086
  1.543524	 -0.067697	 -1.431246
  1.530478	 -0.082841	 -1.431915
  1.517431	 -0.097985	 -1.432584
  1.504335	 -0.113096	 -1.432960
  1.491230	 -0.128201	 -1.433283
  1.477978	 -0.143174	 -1.433702
  1.464527	 -0.157965	 -1.434252
  1.451064	 -0.172744	 -1.434814
  1.437394	 -0.187323	 -1.435582
  1.423724	 -0.201902	 -1.436350
  1.410471	 -0.216832	 -1.437561
  1.397774	 -0.232183	 -1.439332
  1.385077	 -0.247533	 -1.441103
  1.373213	 -0.263449	 -1.443542
  1.364048	 -0.280686	 -1.447889
  1.354883	 -0.297922	 -1.452236
  1.345719	 -0.315159	 -1.456583
  1.336554	 -0.332396	 -1.460931
  1.334148	 -0.351032	 -1.467780
  1.334624	 -0.369520	 -1.475395
  1.335100	 -0.388007	 -1.483010
  1.335576	 -0.406495	 -1.490625
  1.336052	 -0.424982	 -1.498240
  1.337666	 -0.443132	 -1.506484
  1.345647	 -0.457724	 -1.517592
  1.353628	 -0.472316	 -1.528700
  1.361608	 -0.486908	 -1.539807
  1.369589	 -0.501500	 -1.550915
  1.353776	 -0.513534	 -1.548653
  1.337801	 -0.525311	 -1.546185
  1.321826	 -0.537088	 -1.543717
  1.305850	 -0.548865	 -1.541248
  1.289875	 -0.560643	 -1.538780
  1.273900	 -0.572420	 -1.536312
  1.257925	 -0.584197	 -1.533843
  1.241950	 -0.595974	 -1.531375
  1.225974	 -0.607751	 -1.528907
  1.209999	 -0.619528	 -1.526439
  1.194024	 -0.631305	 -1.523970
  1.178049	 -0.643083	 -1.521502
  1.162074	 -0.654860	 -1.519034
  1.146099	 -0.666637	 -1.516565
  1.130123	 -0.678414	 -1.514097
  1.114148	 -0.690191	 -1.511629
  1.098173	 -0.701968	 -1.509161
  1.083616	 -0.715653	 -1.508247
  1.070267	 -0.730544	 -1.508468
  1.056917	 -0.745434	 -1.508688
  1.044984	 -0.761384	 -1.510480
  1.033618	 -0.777669	 -1.512848
  1.022455	 -0.794035	 -1.515599
  1.012149	 -0.810637	 -1.519857
  1.001842	 -0.827240	 -1.524114
  0.991728	 -0.843605	 -1.529580
  0.981656	 -0.859914	 -1.535289
  0.971260	 -0.875896	 -1.541330
  0.960543	 -0.891534	 -1.547703
  0.949705	 -0.907084	 -1.554084
  0.937951	 -0.921930	 -1.560521
  0.926197	 -0.936776	 -1.566958
  0.913558	 -0.950918	 -1.573305
  0.900604	 -0.964788	 -1.579613
  0.887272	 -0.978337	 -1.585832
  0.873268	 -0.991274	 -1.591878
  0.859265	 -1.004211	 -1.597924
  0.844553	 -1.016538	 -1.603544
  0.829788	 -1.028817	 -1.609130
  0.814691	 -1.040845	 -1.614368
  0.799211	 -1.052557	 -1.619182
  0.783731	 -1.064270	 -1.623996
  0.767783	 -1.075711	 -1.627841
  0.751805	 -1.087132	 -1.631617
  0.735800	 -1.098607	 -1.635105
  0.719737	 -1.110218	 -1.637783
  0.703675	 -1.121829	 -1.640461
  0.687590	 -1.133521	 -1.642603
  0.671496	 -1.145271	 -1.644313
  0.655400	 -1.157019	 -1.646018
  0.639133	 -1.168598	 -1.647152
  0.622865	 -1.180177	 -1.648286
  0.606622	 -1.191778	 -1.649543
  0.590398	 -1.203396	 -1.650898
  0.574175	 -1.215013	 -1.652252
  0.559289	 -1.228297	 -1.653646
  0.544661	 -1.241865	 -1.655046
  0.530034	 -1.255432	 -1.656445
  0.517501	 -1.270939	 -1.658017
  0.505751	 -1.287042	 -1.659640
  0.494002	 -1.303145	 -1.661264
  0.482923	 -1.319711	 -1.662949
  0.472120	 -1.336455	 -1.664659
  0.461316	 -1.353199	 -1.666368
  0.450632	 -1.370048	 -1.667769
  0.439957	 -1.386905	 -1.669146
  0.429353	 -1.403811	 -1.670451
  0.419037	 -1.420916	 -1.671461
  0.408721	 -1.438021	 -1.672470
  0.398360	 -1.455081	 -1.673732
  0.387970	 -1.472110	 -1.675160
  0.377506	 -1.489089	 -1.676658
  0.366777	 -1.505876	 -1.678413
  0.356048	 -1.522663	 -1.680168
  0.344861	 -1.539115	 -1.682215
  0.333639	 -1.555540	 -1.684285
  0.322137	 -1.571759	 -1.686441
  0.310473	 -1.587855	 -1.688647
  0.298748	 -1.603917	 -1.690777
  0.286802	 -1.619851	 -1.692616
  0.274855	 -1.635785	 -1.694455
  0.262342	 -1.651377	 -1.695029
  0.249561	 -1.666760	 -1.694950
  0.236562	 -1.681959	 -1.694832
  0.222815	 -1.696484	 -1.694581
  0.209068	 -1.711008	 -1.694330
  0.195044	 -1.725145	 -1.696195
  0.181008	 -1.739252	 -1.698187
  0.167520	 -1.753778	 -1.700848
  0.154493	 -1.768614	 -1.704039
  0.141466	 -1.783450	 -1.707230
  0.128439	 -1.798287	 -1.710421
  0.113743	 -1.814034	 -1.712889
  0.098786	 -1.827295	 -1.712239
