  0.823572	  2.479637	  1.534284
  0.815418	  2.455086	  1.519093
  0.788238	  2.426677	  1.505520
  0.756628	  2.395421	  1.493443
  0.724631	  2.362295	  1.475530
  0.686025	  2.332112	  1.458917
  0.656015	  2.295898	  1.437402
  0.625614	  2.259917	  1.420786
  0.595093	  2.221306	  1.412037
  0.564415	  2.185478	  1.396149
  0.536517	  2.146069	  1.381542
  0.502086	  2.109916	  1.366514
  0.465023	  2.076947	  1.351870
  0.431133	  2.045852	  1.337781
  0.396829	  2.014018	  1.322788
  0.359989	  1.982810	  1.305361
  0.323669	  1.953157	  1.286658
  0.287587	  1.924706	  1.266459
  0.252568	  1.899636	  1.244923
  0.216800	  1.874289	  1.223498
  0.181624	  1.848106	  1.205648
  0.144233	  1.816234	  1.189858
  0.107865	  1.778350	  1.176152
  0.075076	  1.738990	  1.164121
  0.046570	  1.700727	  1.152633
  0.018425	  1.662479	  1.140409
 -0.010385	  1.622808	  1.126229
 -0.040166	  1.583442	  1.110361
 -0.066576	  1.548721	  1.096019
 -0.089009	  1.515371	  1.085124
 -0.106464	  1.469272	  1.075189
 -0.087652	  1.373507	  1.049825
 -0.022319	  1.293645	  0.989827
  0.022453	  1.248504	  0.933097
  0.027784	  1.234897	  0.910978
  0.019905	  1.222960	  0.886737
 -0.016890	  1.207269	  0.840659
 -0.092438	  1.198933	  0.747114
 -0.161697	  1.198729	  0.601102
 -0.212073	  1.135225	  0.417828
 -0.245872	  1.092095	  0.325793
 -0.268221	  1.071967	  0.286888
 -0.295222	  1.048907	  0.251932
 -0.311138	  1.035585	  0.241744
 -0.328244	  1.020704	  0.239147
 -0.380915	  0.978038	  0.243738
 -0.451777	  0.915218	  0.290724
 -0.496072	  0.876395	  0.334979
 -0.523123	  0.856912	  0.361651
 -0.571732	  0.825297	  0.405532
 -0.637322	  0.793620	  0.457691
 -0.722963	  0.761040	  0.517784
 -0.823506	  0.727483	  0.578078
 -0.877669	  0.704786	  0.597170
 -0.912503	  0.684968	  0.601154
 -0.950181	  0.658491	  0.598557
 -0.988388	  0.627876	  0.591269
 -1.024159	  0.597347	  0.581317
 -1.061022	  0.565198	  0.568677
 -1.095365	  0.535754	  0.556229
 -1.130111	  0.507085	  0.543003
 -1.167696	  0.476279	  0.527481
 -1.201710	  0.445556	  0.505163
 -1.227924	  0.416482	  0.471223
 -1.252175	  0.377923	  0.403412
 -1.255505	  0.339171	  0.288057
 -1.250729	  0.322318	  0.216216
 -1.255554	  0.299281	  0.152467
 -1.271919	  0.238428	  0.069138
 -1.282226	  0.200324	  0.028796
 -1.283450	  0.198321	  0.027849
 -1.289168	  0.193995	  0.027267
 -1.291989	  0.192330	  0.028193
 -1.352758	  0.167800	  0.058082
 -1.410900	  0.149476	  0.085207
 -1.477769	  0.126121	  0.108102
 -1.548891	  0.092000	  0.111125
 -1.640207	  0.042580	  0.124029
 -1.706865	 -0.042892	  0.169152
 -1.762138	 -0.105241	  0.183982
 -1.796339	 -0.143511	  0.181112
 -1.829310	 -0.176913	  0.170416
 -1.864611	 -0.206415	  0.156995
 -1.905598	 -0.229333	  0.142805
 -1.959425	 -0.241503	  0.127727
 -2.053490	 -0.228337	  0.103865
 -2.176645	 -0.156949	  0.070184
 -2.200209	 -0.160445	  0.063294
 -2.188785	 -0.248791	  0.063426
 -2.150268	 -0.394214	  0.047535
 -2.146396	 -0.463532	  0.032472
 -2.166233	 -0.507194	  0.014740
 -2.198471	 -0.542581	 -0.002701
 -2.234521	 -0.573126	 -0.020526
 -2.271663	 -0.602559	 -0.037464
 -2.308797	 -0.631798	 -0.053357
 -2.346245	 -0.661522	 -0.069084
 -2.384274	 -0.692854	 -0.085115
 -2.420315	 -0.724666	 -0.100613
 -2.451835	 -0.754925	 -0.114751
 -2.482120	 -0.787747	 -0.130293
 -2.514653	 -0.824338	 -0.147125
 -2.547367	 -0.860003	 -0.162368
 -2.581843	 -0.894607	 -0.176072
 -2.615644	 -0.928288	 -0.190855
 -2.648981	 -0.959332	 -0.208178
 -2.681497	 -0.992550	 -0.225292
 -2.714435	 -1.021337	 -0.247437
 -2.750207	 -1.055662	 -0.266969
 -2.775232	 -1.101379	 -0.291640
 -2.802984	 -1.112393	 -0.294556
