  0.655126	  1.238493	 -2.113640
  0.659617	  1.243848	 -2.119213
  0.649561	  1.231868	 -2.106749
  0.639081	  1.219808	 -2.094722
  0.628041	  1.207823	 -2.083373
  0.617294	  1.197641	 -2.072509
  0.615609	  1.190908	 -2.058697
  0.622230	  1.186704	 -2.042156
  0.618633	  1.179553	 -2.036472
  0.617096	  1.167227	 -2.020071
  0.616375	  1.157407	 -2.001303
  0.616138	  1.149963	 -1.981466
  0.617014	  1.144525	 -1.960867
  0.618535	  1.139586	 -1.944399
  0.625810	  1.133017	 -1.925593
  0.639997	  1.131024	 -1.907838
  0.652292	  1.133267	 -1.887156
  0.660006	  1.135514	 -1.866733
  0.663721	  1.136299	 -1.850470
  0.669232	  1.137020	 -1.829032
  0.676168	  1.135643	 -1.807671
  0.681741	  1.135100	 -1.793429
  0.689083	  1.131153	 -1.772373
  0.699833	  1.126557	 -1.750123
  0.704737	  1.124258	 -1.739551
  0.710538	  1.119036	 -1.717615
  0.712846	  1.117251	 -1.696652
  0.713712	  1.117548	 -1.675013
  0.712150	  1.115378	 -1.652351
  0.711632	  1.111000	 -1.636081
  0.707168	  1.106321	 -1.619866
  0.705790	  1.098653	 -1.597999
  0.705678	  1.091083	 -1.578304
  0.706925	  1.083258	 -1.563095
  0.705483	  1.079297	 -1.541123
  0.705002	  1.076967	 -1.520208
  0.701628	  1.073364	 -1.506142
  0.697252	  1.069008	 -1.490652
  0.688488	  1.064004	 -1.467421
  0.672247	  1.060825	 -1.443519
  0.662470	  1.060843	 -1.426610
  0.653681	  1.059850	 -1.413207
  0.641481	  1.056636	 -1.400911
  0.627300	  1.050946	 -1.387970
  0.612171	  1.044963	 -1.371505
  0.593249	  1.038292	 -1.358923
  0.576632	  1.028606	 -1.348388
  0.563654	  1.017632	 -1.338224
  0.551660	  1.002406	 -1.330928
  0.538097	  0.991345	 -1.323813
  0.518619	  0.980781	 -1.317255
  0.501018	  0.970188	 -1.309815
  0.486830	  0.957153	 -1.304695
  0.474515	  0.943399	 -1.298564
  0.460939	  0.924175	 -1.293299
  0.446778	  0.904938	 -1.295358
  0.439746	  0.896977	 -1.295020
  0.426849	  0.881882	 -1.291469
  0.412251	  0.867611	 -1.285440
  0.393609	  0.846656	 -1.284359
  0.386022	  0.829205	 -1.283194
  0.376948	  0.818968	 -1.281944
  0.365661	  0.797840	 -1.278673
  0.353380	  0.780214	 -1.276330
  0.343543	  0.771547	 -1.273861
  0.328638	  0.752775	 -1.269759
  0.315379	  0.732416	 -1.267268
  0.303155	  0.725144	 -1.267641
  0.291963	  0.706931	 -1.269531
  0.280606	  0.688006	 -1.267352
  0.268893	  0.668852	 -1.258610
  0.260231	  0.655429	 -1.254976
  0.254485	  0.638902	 -1.250275
  0.238931	  0.614411	 -1.243420
  0.231762	  0.603534	 -1.240747
  0.226741	  0.590496	 -1.240653
  0.214166	  0.570448	 -1.228989
  0.198384	  0.553273	 -1.222778
  0.191090	  0.542422	 -1.221393
  0.176276	  0.520225	 -1.216974
  0.168548	  0.509297	 -1.213623
  0.156449	  0.487912	 -1.208657
  0.148736	  0.472762	 -1.205118
  0.139157	  0.461114	 -1.200954
  0.123394	  0.438743	 -1.198214
  0.114449	  0.423163	 -1.190700
  0.105891	  0.411020	 -1.188509
  0.092335	  0.397088	 -1.181784
  0.076667	  0.379819	 -1.178922
  0.065517	  0.360506	 -1.173166
  0.058258	  0.344248	 -1.166175
  0.054450	  0.330407	 -1.161503
  0.048658	  0.309680	 -1.150350
  0.041772	  0.295705	 -1.144171
  0.031646	  0.275791	 -1.138661
  0.020482	  0.255409	 -1.126392
  0.016215	  0.247532	 -1.123560
  0.008147	  0.232338	 -1.111688
 -0.002347	  0.210320	 -1.100677
 -0.010045	  0.195388	 -1.091981
 -0.018104	  0.182534	 -1.086104
 -0.026238	  0.171000	 -1.082025
 -0.039168	  0.154840	 -1.072702
 -0.049592	  0.139720	 -1.064498
 -0.058172	  0.122953	 -1.053689
 -0.064486	  0.104097	 -1.039340
 -0.066721	  0.092756	 -1.029884
 -0.069707	  0.076981	 -1.014990
 -0.073547	  0.063626	 -1.002260
 -0.079593	  0.052898	 -0.990976
 -0.089174	  0.031867	 -0.969159
 -0.092788	  0.022591	 -0.960855
 -0.101781	  0.009510	 -0.952360
 -0.110468	 -0.008118	 -0.931939
 -0.116444	 -0.015762	 -0.926458
 -0.121712	 -0.025035	 -0.913253
 -0.138957	 -0.047905	 -0.898382
 -0.144281	 -0.056342	 -0.890698
 -0.152292	 -0.069094	 -0.875290
 -0.159389	 -0.078391	 -0.861051
 -0.167172	 -0.085070	 -0.848493
 -0.175305	 -0.093919	 -0.832614
 -0.184476	 -0.105960	 -0.819039
 -0.192811	 -0.115349	 -0.806360
 -0.207543	 -0.138220	 -0.780116
 -0.210097	 -0.147215	 -0.769161
 -0.216577	 -0.151685	 -0.759747
 -0.219166	 -0.163550	 -0.745965
 -0.225808	 -0.173158	 -0.727068
 -0.227260	 -0.182350	 -0.708262
 -0.230606	 -0.189986	 -0.692290
 -0.236970	 -0.205932	 -0.672830
 -0.244946	 -0.222616	 -0.659398
 -0.254990	 -0.239481	 -0.648407
 -0.260539	 -0.248548	 -0.641150
 -0.272968	 -0.264304	 -0.626362
 -0.281544	 -0.276981	 -0.610120
 -0.286724	 -0.282706	 -0.600761
 -0.299005	 -0.291543	 -0.584659
 -0.314902	 -0.303076	 -0.562456
 -0.321071	 -0.307001	 -0.556334
 -0.335231	 -0.317021	 -0.543771
 -0.352584	 -0.330441	 -0.528258
 -0.361243	 -0.349377	 -0.512703
 -0.366910	 -0.366060	 -0.500606
 -0.370985	 -0.372614	 -0.492268
 -0.379643	 -0.378318	 -0.479608
 -0.390624	 -0.381185	 -0.456779
 -0.402240	 -0.387865	 -0.436112
 -0.410643	 -0.398118	 -0.422580
 -0.420153	 -0.408203	 -0.408702
 -0.430941	 -0.417836	 -0.393187
 -0.441246	 -0.428268	 -0.378329
 -0.448891	 -0.443047	 -0.368296
 -0.458992	 -0.458836	 -0.356362
 -0.469425	 -0.472677	 -0.345174
 -0.478251	 -0.486151	 -0.334532
 -0.486301	 -0.499106	 -0.323063
 -0.495177	 -0.512928	 -0.310843
 -0.506016	 -0.527239	 -0.296035
 -0.512604	 -0.538020	 -0.286721
 -0.521147	 -0.550904	 -0.275812
 -0.534044	 -0.563292	 -0.259628
 -0.544747	 -0.573193	 -0.240010
 -0.550846	 -0.579337	 -0.224984
 -0.556974	 -0.586376	 -0.208652
 -0.561438	 -0.596154	 -0.192364
 -0.567238	 -0.607447	 -0.175300
 -0.573806	 -0.618045	 -0.158485
 -0.577351	 -0.628852	 -0.140909
 -0.577723	 -0.640239	 -0.125170
 -0.578859	 -0.652192	 -0.108068
 -0.581654	 -0.664309	 -0.092534
 -0.586597	 -0.679749	 -0.082650
 -0.594855	 -0.697523	 -0.066228
 -0.604031	 -0.709252	 -0.052510
 -0.612279	 -0.720515	 -0.040505
 -0.620429	 -0.734135	 -0.029671
 -0.629144	 -0.748474	 -0.017581
 -0.636387	 -0.766468	 -0.002491
 -0.637770	 -0.778043	  0.006301
 -0.634588	 -0.795149	  0.018147
 -0.632821	 -0.816940	  0.036264
 -0.638182	 -0.831503	  0.048805
 -0.643634	 -0.842415	  0.057624
 -0.654692	 -0.856729	  0.072193
 -0.668094	 -0.867770	  0.088227
 -0.677356	 -0.877357	  0.103041
 -0.682603	 -0.888912	  0.117324
 -0.688106	 -0.901329	  0.132471
 -0.692630	 -0.916932	  0.144186
 -0.694984	 -0.933597	  0.154528
 -0.696097	 -0.949410	  0.164558
 -0.697730	 -0.962497	  0.174807
 -0.703946	 -0.980739	  0.196900
 -0.708008	 -0.992881	  0.211474
 -0.715334	 -1.001798	  0.224510
 -0.722208	 -1.016007	  0.239379
 -0.728259	 -1.030457	  0.256277
 -0.733384	 -1.042123	  0.268692
 -0.735846	 -1.053675	  0.279327
 -0.739217	 -1.075291	  0.299139
 -0.742906	 -1.083742	  0.308771
 -0.746352	 -1.097313	  0.318294
 -0.749453	 -1.112579	  0.333494
 -0.754838	 -1.129874	  0.345099
 -0.763099	 -1.148128	  0.357347
 -0.766382	 -1.164193	  0.372135
 -0.766886	 -1.174152	  0.380785
 -0.773468	 -1.190186	  0.395813
 -0.778245	 -1.206824	  0.409526
 -0.782521	 -1.220895	  0.422169
 -0.785168	 -1.237685	  0.437636
 -0.787084	 -1.249012	  0.446989
 -0.790760	 -1.260703	  0.463619
 -0.798083	 -1.275791	  0.476154
 -0.808848	 -1.288233	  0.488455
 -0.818720	 -1.302651	  0.499746
 -0.830174	 -1.312468	  0.515713
 -0.837755	 -1.323748	  0.526878
 -0.846737	 -1.337128	  0.537432
 -0.853198	 -1.347705	  0.546484
 -0.861333	 -1.364304	  0.557920
 -0.868331	 -1.378096	  0.568705
 -0.880354	 -1.393417	  0.580266
 -0.891494	 -1.405088	  0.593195
 -0.901800	 -1.414752	  0.606564
 -0.910241	 -1.421955	  0.619315
 -0.923207	 -1.432264	  0.634289
 -0.931901	 -1.437853	  0.641704
 -0.946510	 -1.447808	  0.655040
 -0.963599	 -1.456329	  0.671433
 -0.974122	 -1.458539	  0.687935
 -0.981206	 -1.462141	  0.697986
 -0.992033	 -1.466197	  0.719092
 -1.001310	 -1.471330	  0.734841
 -1.015886	 -1.479225	  0.750437
 -1.030158	 -1.489166	  0.764851
 -1.037607	 -1.494337	  0.771848
 -1.050248	 -1.501038	  0.788722
 -1.063534	 -1.502320	  0.805255
 -1.073761	 -1.504324	  0.821988
 -1.084702	 -1.512106	  0.841112
 -1.095725	 -1.525472	  0.850528
 -1.110461	 -1.542183	  0.866316
 -1.119414	 -1.549267	  0.878646
 -1.129442	 -1.557419	  0.890895
 -1.141111	 -1.565802	  0.909406
 -1.148961	 -1.571818	  0.925202
 -1.159008	 -1.582097	  0.940691
 -1.169431	 -1.592730	  0.953754
 -1.180291	 -1.604671	  0.968858
 -1.189263	 -1.617232	  0.980596
 -1.198034	 -1.628523	  0.990883
 -1.207788	 -1.644299	  1.006952
 -1.213870	 -1.656848	  1.021058
 -1.218847	 -1.666468	  1.031963
 -1.226710	 -1.681816	  1.051041
 -1.236173	 -1.695355	  1.067005
 -1.242922	 -1.703564	  1.076855
 -1.251738	 -1.712616	  1.087318
 -1.261159	 -1.725710	  1.103989
 -1.269389	 -1.738861	  1.118311
 -1.277983	 -1.752063	  1.131819
 -1.284975	 -1.764172	  1.146320
 -1.292287	 -1.775332	  1.161387
 -1.300492	 -1.786771	  1.175545
 -1.309784	 -1.799439	  1.187279
 -1.321919	 -1.818659	  1.201894
 -1.329906	 -1.863225	  1.213352
 -1.337615	 -1.876417	  1.226257
