  1.567200	  0.377689	 -1.923775
  1.563991	  0.375955	 -1.913789
  1.561069	  0.374377	 -1.904697
  1.554669	  0.372897	 -1.885413
  1.547436	  0.374791	 -1.867147
  1.539823	  0.379451	 -1.847898
  1.534944	  0.379695	 -1.828544
  1.532068	  0.377184	 -1.809747
  1.528873	  0.374328	 -1.789078
  1.524876	  0.375141	 -1.769740
  1.519973	  0.377768	 -1.750392
  1.516726	  0.377085	 -1.729991
  1.514903	  0.373455	 -1.711404
  1.512620	  0.369706	 -1.689917
  1.508121	  0.370768	 -1.670549
  1.502172	  0.373609	 -1.652746
  1.494529	  0.377299	 -1.634156
  1.487482	  0.380006	 -1.615273
  1.480419	  0.382284	 -1.597384
  1.472975	  0.385321	 -1.576870
  1.468790	  0.386162	 -1.558089
  1.462964	  0.386777	 -1.539811
  1.455636	  0.388046	 -1.520460
  1.448755	  0.390580	 -1.501043
  1.444846	  0.389649	 -1.481809
  1.440382	  0.387717	 -1.462451
  1.434713	  0.386744	 -1.443168
  1.428607	  0.386627	 -1.423965
  1.422427	  0.386560	 -1.404944
  1.415535	  0.386749	 -1.386176
  1.408117	  0.387021	 -1.367690
  1.400152	  0.387670	 -1.349365
  1.393271	  0.389605	 -1.331296
  1.387161	  0.393549	 -1.312935
  1.378021	  0.396689	 -1.291700
  1.370627	  0.392765	 -1.275691
  1.362448	  0.389213	 -1.256917
  1.354235	  0.388701	 -1.238519
  1.346561	  0.389669	 -1.221014
  1.338840	  0.390020	 -1.202636
  1.330935	  0.390990	 -1.182218
  1.325193	  0.392391	 -1.163273
  1.313855	  0.387428	 -1.146997
  1.304370	  0.381715	 -1.130006
  1.297114	  0.377687	 -1.110932
  1.288107	  0.375467	 -1.092731
  1.279422	  0.373883	 -1.075231
  1.273419	  0.373481	 -1.055951
  1.268141	  0.374782	 -1.040738
  1.259077	  0.374899	 -1.016716
  1.253276	  0.373491	 -0.995992
  1.245747	  0.368531	 -0.982669
  1.238296	  0.367353	 -0.965267
  1.233253	  0.369086	 -0.944120
  1.224862	  0.369682	 -0.923930
  1.219461	  0.369761	 -0.905129
  1.214174	  0.364072	 -0.887293
  1.207946	  0.368263	 -0.868129
  1.198569	  0.373176	 -0.852440
  1.192938	  0.367453	 -0.828348
  1.193027	  0.359403	 -0.806557
  1.183048	  0.359093	 -0.793784
  1.173542	  0.363381	 -0.775451
  1.167102	  0.365342	 -0.756927
  1.163906	  0.364770	 -0.733927
  1.160018	  0.364597	 -0.713001
  1.155137	  0.364666	 -0.697221
  1.146472	  0.366553	 -0.678479
  1.141261	  0.370691	 -0.657204
  1.137085	  0.371077	 -0.638119
  1.136186	  0.367205	 -0.617815
  1.133671	  0.368481	 -0.599808
  1.126505	  0.370996	 -0.580838
  1.120687	  0.373859	 -0.559144
  1.116563	  0.372374	 -0.541084
  1.110741	  0.371232	 -0.522059
  1.105249	  0.372461	 -0.502519
  1.099759	  0.373930	 -0.484145
  1.093682	  0.374100	 -0.463139
  1.089735	  0.376900	 -0.443197
  1.083867	  0.382526	 -0.427251
  1.077648	  0.387903	 -0.407882
  1.071731	  0.390579	 -0.389205
  1.064955	  0.391566	 -0.371088
  1.059396	  0.393209	 -0.348474
  1.055885	  0.398961	 -0.333211
  1.049300	  0.406564	 -0.314835
  1.043249	  0.409927	 -0.293820
  1.040239	  0.409308	 -0.275322
  1.035732	  0.409189	 -0.254017
  1.030119	  0.412958	 -0.235413
  1.026061	  0.409528	 -0.217083
  1.021709	  0.405287	 -0.195825
  1.013955	  0.410238	 -0.174028
  1.009255	  0.408379	 -0.158419
  1.007119	  0.403877	 -0.140429
  1.004720	  0.397401	 -0.119425
  1.001996	  0.391371	 -0.099952
  0.998826	  0.387088	 -0.080609
  0.994479	  0.383648	 -0.061421
  0.989979	  0.379193	 -0.042523
  0.986346	  0.373989	 -0.023494
  0.982639	  0.368605	 -0.004592
  0.978396	  0.362550	  0.013991
  0.974152	  0.356491	  0.032573
  0.969490	  0.350789	  0.051167
  0.963743	  0.346052	  0.069728
  0.957991	  0.341318	  0.088289
  0.952015	  0.337180	  0.106920
  0.945420	  0.334775	  0.125648
  0.938824	  0.332380	  0.144377
  0.932260	  0.330814	  0.163204
  0.925733	  0.329940	  0.182088
  0.919462	  0.329278	  0.201068
  0.914014	  0.329277	  0.220312
  0.908568	  0.329279	  0.239556
  0.902300	  0.329638	  0.258545
  0.895606	  0.330184	  0.277384
  0.888911	  0.330728	  0.296222
  0.881085	  0.331195	  0.314621
  0.872569	  0.331612	  0.332713
  0.864057	  0.332027	  0.350806
  0.855921	  0.332337	  0.369074
  0.848018	  0.332605	  0.387207
  0.841653	  0.332996	  0.405901
  0.838374	  0.333006	  0.424971
  0.832686	  0.333427	  0.447474
  0.823279	  0.333238	  0.464007
  0.807649	  0.336484	  0.480307
  0.795303	  0.341624	  0.496278
  0.792811	  0.345221	  0.513861
  0.787365	  0.346132	  0.534337
  0.777345	  0.347314	  0.554150
  0.766744	  0.352566	  0.567860
  0.757208	  0.356513	  0.586201
  0.748462	  0.358283	  0.603804
  0.738491	  0.358891	  0.620447
  0.728069	  0.361979	  0.640139
  0.722431	  0.363908	  0.657322
  0.714248	  0.362556	  0.677113
  0.705370	  0.361584	  0.694131
  0.695986	  0.362643	  0.711293
  0.685881	  0.362093	  0.731184
  0.681549	  0.357376	  0.748926
  0.677674	  0.354847	  0.768564
  0.669693	  0.354507	  0.790738
  0.666826	  0.353816	  0.806464
  0.662618	  0.351851	  0.826831
  0.655776	  0.350365	  0.846585
  0.650029	  0.351145	  0.864113
  0.643918	  0.354502	  0.885556
  0.638718	  0.354661	  0.903133
  0.633062	  0.356077	  0.921495
  0.625725	  0.360252	  0.942759
  0.620564	  0.363624	  0.957430
  0.617304	  0.370394	  0.975185
  0.611545	  0.381214	  0.996993
  0.603230	  0.383001	  1.013247
  0.595950	  0.389229	  1.029462
  0.592110	  0.402674	  1.046869
  0.587452	  0.414474	  1.061081
  0.581096	  0.424119	  1.075272
  0.574348	  0.440592	  1.084658
  0.568305	  0.457335	  1.094832
  0.562710	  0.473660	  1.105006
  0.557125	  0.489959	  1.115163
  0.551540	  0.506257	  1.125320
  0.545954	  0.522566	  1.135447
  0.540129	  0.541548	  1.137781
  0.534480	  0.560711	  1.136879
  0.529018	  0.579792	  1.135677
  0.524069	  0.599142	  1.133139
  0.518521	  0.618557	  1.131312
  0.513463	  0.637181	  1.129870
  0.505571	  0.657256	  1.131667
  0.496742	  0.676375	  1.132355
  0.486078	  0.691899	  1.141106
  0.476570	  0.707195	  1.150979
  0.467647	  0.718585	  1.166830
  0.457273	  0.730233	  1.182037
  0.450957	  0.732601	  1.200250
  0.445198	  0.735567	  1.219784
  0.437674	  0.738528	  1.239649
  0.429719	  0.742899	  1.255658
  0.421239	  0.747855	  1.272865
  0.414025	  0.748647	  1.293808
  0.410577	  0.747602	  1.311226
  0.407381	  0.747046	  1.330552
  0.403454	  0.745462	  1.352114
  0.404575	  0.736923	  1.368401
  0.405897	  0.728018	  1.386293
  0.406000	  0.716651	  1.400528
  0.407691	  0.703535	  1.415517
  0.409253	  0.689823	  1.428392
  0.412805	  0.674651	  1.441321
  0.417605	  0.657985	  1.451829
  0.422581	  0.641431	  1.461896
  0.427557	  0.624880	  1.471961
  0.432522	  0.608330	  1.482030
  0.434644	  0.592274	  1.492843
  0.436333	  0.575240	  1.503773
  0.437722	  0.559489	  1.514418
  0.441813	  0.541165	  1.529096
  0.447465	  0.525843	  1.536583
  0.450908	  0.508401	  1.545938
  0.447671	  0.493123	  1.561756
  0.443173	  0.481442	  1.577321
  0.441875	  0.465132	  1.592064
  0.441834	  0.451983	  1.605563
  0.436621	  0.440836	  1.621570
  0.431436	  0.426303	  1.634422
  0.429454	  0.411329	  1.646187
  0.426363	  0.399909	  1.662378
  0.422106	  0.389617	  1.683569
  0.416102	  0.380464	  1.697374
  0.409209	  0.367361	  1.711028
  0.403151	  0.356273	  1.727831
  0.399189	  0.347249	  1.745735
  0.391353	  0.341704	  1.763016
  0.383731	  0.335515	  1.781437
  0.378875	  0.332364	  1.799650
  0.371983	  0.329136	  1.817705
  0.364857	  0.324273	  1.838413
  0.361976	  0.320693	  1.857947
  0.358018	  0.315784	  1.875070
  0.350732	  0.310391	  1.893877
  0.341521	  0.302899	  1.908801
  0.332846	  0.300688	  1.927470
  0.326777	  0.296800	  1.947540
  0.318517	  0.292552	  1.963666
  0.308026	  0.290567	  1.980396
  0.299393	  0.285906	  2.001371
  0.291936	  0.284608	  2.016815
  0.282130	  0.282930	  2.032971
  0.274696	  0.280414	  2.055457
  0.266821	  0.280019	  2.075052
  0.254334	  0.283225	  2.089101
  0.246755	  0.285399	  2.105861
  0.241518	  0.285041	  2.129425
  0.232761	  0.287395	  2.148006
  0.226828	  0.295368	  2.161758
  0.221945	  0.299523	  2.181273
  0.209380	  0.301879	  2.201313
  0.198059	  0.306559	  2.218336
  0.198508	  0.307912	  2.235278
  0.197339	  0.311950	  2.256751
  0.189467	  0.319612	  2.276714
  0.181162	  0.323145	  2.293557
  0.175388	  0.324985	  2.311040
  0.169897	  0.328597	  2.331235
  0.166239	  0.329064	  2.350818
  0.160216	  0.328745	  2.370170
  0.153056	  0.330388	  2.390285
  0.149580	  0.333359	  2.408701
  0.148120	  0.332595	  2.429185
  0.144532	  0.334296	  2.450308
  0.137362	  0.329162	  2.474426
  0.134829	  0.325731	  2.487347
