 -2.206773	 -0.280339	 -0.958573
 -2.244755	 -0.307294	 -0.970014
 -2.227724	 -0.297788	 -0.964862
 -2.210262	 -0.287898	 -0.959181
 -2.194825	 -0.275628	 -0.954620
 -2.182608	 -0.261494	 -0.953065
 -2.166593	 -0.246759	 -0.949680
 -2.150082	 -0.237584	 -0.943994
 -2.132293	 -0.231302	 -0.937265
 -2.115264	 -0.221091	 -0.931978
 -2.100355	 -0.209863	 -0.928257
 -2.082866	 -0.197869	 -0.923516
 -2.066418	 -0.187787	 -0.917508
 -2.050692	 -0.179468	 -0.912746
 -2.034549	 -0.169944	 -0.908706
 -2.018084	 -0.158322	 -0.903723
 -1.999900	 -0.146249	 -0.897044
 -1.982946	 -0.139256	 -0.892088
 -1.965968	 -0.132738	 -0.888631
 -1.949573	 -0.120777	 -0.882314
 -1.931848	 -0.113585	 -0.876601
 -1.915222	 -0.106099	 -0.872286
 -1.897583	 -0.094341	 -0.866871
 -1.880674	 -0.084585	 -0.861369
 -1.863986	 -0.076418	 -0.859039
 -1.847082	 -0.067631	 -0.853304
 -1.829311	 -0.055807	 -0.842586
 -1.819040	 -0.044331	 -0.834358
 -1.804506	 -0.035351	 -0.828330
 -1.783973	 -0.027110	 -0.815564
 -1.773659	 -0.014789	 -0.801733
 -1.760418	 -0.005156	 -0.789809
 -1.742451	 -0.001764	 -0.785884
 -1.722520	  0.004471	 -0.779978
 -1.706277	  0.011449	 -0.770099
 -1.692819	  0.026165	 -0.759299
 -1.680426	  0.040126	 -0.752476
 -1.664569	  0.051601	 -0.749350
 -1.647606	  0.059968	 -0.742600
 -1.632660	  0.068634	 -0.730287
 -1.617310	  0.079975	 -0.724504
 -1.601011	  0.092764	 -0.721727
 -1.585473	  0.105749	 -0.716770
 -1.572231	  0.117485	 -0.706007
 -1.559991	  0.128015	 -0.696911
 -1.546441	  0.137559	 -0.688403
 -1.529458	  0.147607	 -0.675551
 -1.514467	  0.156992	 -0.664543
 -1.500891	  0.165641	 -0.654002
 -1.488795	  0.170466	 -0.643038
 -1.474002	  0.173990	 -0.627007
 -1.460030	  0.185561	 -0.615249
 -1.446960	  0.202398	 -0.608052
 -1.433356	  0.212737	 -0.598500
 -1.417804	  0.219152	 -0.589184
 -1.404220	  0.228457	 -0.581979
 -1.387951	  0.236498	 -0.567942
 -1.369588	  0.243809	 -0.552481
 -1.363061	  0.256499	 -0.543273
 -1.354266	  0.269205	 -0.531281
 -1.337109	  0.275841	 -0.517744
 -1.319352	  0.278412	 -0.510212
 -1.303834	  0.288619	 -0.500121
 -1.291463	  0.301894	 -0.487197
 -1.275400	  0.305837	 -0.478583
 -1.259657	  0.312847	 -0.468629
 -1.244593	  0.322718	 -0.460431
 -1.225167	  0.333769	 -0.454076
 -1.208138	  0.342663	 -0.447891
 -1.195794	  0.350112	 -0.433803
 -1.185908	  0.354672	 -0.416518
 -1.171988	  0.362386	 -0.401236
 -1.155410	  0.371864	 -0.393952
 -1.138535	  0.382671	 -0.388662
 -1.123600	  0.391407	 -0.380369
 -1.107995	  0.398094	 -0.370085
 -1.090979	  0.405756	 -0.361595
 -1.073876	  0.415392	 -0.354672
 -1.058877	  0.426172	 -0.346347
 -1.045684	  0.434222	 -0.334829
 -1.029655	  0.441755	 -0.323808
 -1.013399	  0.450139	 -0.317365
 -0.996633	  0.460809	 -0.313057
 -0.980712	  0.474339	 -0.307861
 -0.967149	  0.485946	 -0.300193
 -0.950480	  0.496957	 -0.297102
 -0.931634	  0.504862	 -0.292940
 -0.914648	  0.511268	 -0.284147
 -0.900137	  0.522186	 -0.278251
 -0.884824	  0.535219	 -0.266495
 -0.869747	  0.542256	 -0.258824
 -0.848646	  0.544721	 -0.251569
 -0.830736	  0.549412	 -0.243103
 -0.818527	  0.564176	 -0.234608
 -0.803502	  0.577901	 -0.226298
 -0.789349	  0.583897	 -0.216725
 -0.771879	  0.588968	 -0.206853
 -0.752428	  0.599001	 -0.201167
 -0.737906	  0.609568	 -0.199839
 -0.718359	  0.614317	 -0.193975
 -0.699110	  0.618973	 -0.182200
 -0.686033	  0.625990	 -0.174672
 -0.667403	  0.633982	 -0.167114
 -0.651531	  0.637960	 -0.157214
 -0.634499	  0.640267	 -0.145653
 -0.617020	  0.642846	 -0.135597
 -0.599357	  0.645572	 -0.126532
 -0.581495	  0.647294	 -0.117702
 -0.563569	  0.648653	 -0.108937
 -0.545643	  0.650009	 -0.100173
 -0.527539	  0.650846	 -0.091714
 -0.509245	  0.651057	 -0.083635
 -0.490955	  0.651268	 -0.075553
 -0.472930	  0.651690	 -0.067067
 -0.454572	  0.652246	 -0.058564
 -0.436918	  0.652259	 -0.050555
 -0.418820	  0.650445	 -0.041229
 -0.400665	  0.649091	 -0.032110
 -0.380543	  0.647274	 -0.027122
 -0.359736	  0.647110	 -0.025819
 -0.340457	  0.649991	 -0.025587
 -0.321210	  0.659419	 -0.017226
 -0.302659	  0.661557	 -0.005538
 -0.284993	  0.662303	  0.004338
 -0.266811	  0.660258	  0.010104
 -0.248630	  0.661947	  0.016094
 -0.230784	  0.664955	  0.020820
 -0.210515	  0.665927	  0.029319
 -0.192664	  0.670455	  0.037695
 -0.174481	  0.679188	  0.040607
 -0.155013	  0.681080	  0.047453
 -0.138974	  0.683767	  0.059409
 -0.122845	  0.691164	  0.069366
 -0.102848	  0.697303	  0.074268
 -0.084361	  0.702930	  0.075451
 -0.067430	  0.710037	  0.081796
 -0.049386	  0.717813	  0.092252
 -0.034115	  0.727611	  0.100718
 -0.017493	  0.738305	  0.104140
  0.000638	  0.745809	  0.106152
  0.019589	  0.751577	  0.115123
  0.034049	  0.761228	  0.122466
  0.049043	  0.770332	  0.129325
  0.065155	  0.781436	  0.135283
  0.085620	  0.789641	  0.144020
  0.100428	  0.792378	  0.153672
  0.118406	  0.805518	  0.156105
  0.134431	  0.819769	  0.152283
  0.156838	  0.825736	  0.144856
  0.178441	  0.829063	  0.154238
  0.193104	  0.838467	  0.165521
  0.204360	  0.849225	  0.169678
  0.222817	  0.858659	  0.169409
  0.242281	  0.869621	  0.170239
  0.259741	  0.878192	  0.174494
  0.278695	  0.884423	  0.175704
  0.298475	  0.890519	  0.174792
  0.317106	  0.898196	  0.175122
  0.335605	  0.905220	  0.171439
  0.354014	  0.912337	  0.168526
  0.372620	  0.916811	  0.163256
  0.392730	  0.920314	  0.157541
  0.409911	  0.923480	  0.154615
  0.430166	  0.926736	  0.152027
  0.453014	  0.932294	  0.147986
  0.470372	  0.937360	  0.145096
  0.489364	  0.931643	  0.139704
  0.509432	  0.931484	  0.133087
  0.526989	  0.939756	  0.130374
  0.547303	  0.950623	  0.129798
  0.567023	  0.955590	  0.128229
  0.587291	  0.955966	  0.127842
  0.606346	  0.965711	  0.126123
  0.625461	  0.967129	  0.121530
  0.644951	  0.962055	  0.112417
  0.665168	  0.955250	  0.104406
  0.683926	  0.951199	  0.101817
  0.703654	  0.949173	  0.101019
  0.723658	  0.949184	  0.096901
  0.743811	  0.954615	  0.095080
  0.764194	  0.957971	  0.097843
  0.786148	  0.952736	  0.103251
  0.805088	  0.943363	  0.105143
  0.824288	  0.945182	  0.104082
  0.843943	  0.949163	  0.105244
  0.863953	  0.956385	  0.103629
  0.882572	  0.959787	  0.100657
  0.905704	  0.954499	  0.095773
  0.926405	  0.956186	  0.100292
  0.943682	  0.962624	  0.106279
  0.962504	  0.969750	  0.111191
  0.980527	  0.977223	  0.114777
  0.999180	  0.984029	  0.116629
  1.017415	  0.993038	  0.117615
  1.034852	  1.004765	  0.119466
  1.048908	  1.019680	  0.125233
  1.065609	  1.018296	  0.129808
  1.088766	  1.019326	  0.134042
  1.111438	  1.035323	  0.134884
  1.124548	  1.049019	  0.132667
  1.129337	  1.061693	  0.133685
  1.145487	  1.080448	  0.137497
  1.161298	  1.091555	  0.141337
  1.178363	  1.103229	  0.144641
  1.187381	  1.118912	  0.145403
  1.204980	  1.131380	  0.143909
  1.209799	  1.152677	  0.137446
  1.207645	  1.171972	  0.140889
  1.210029	  1.192027	  0.144075
  1.214292	  1.211165	  0.148907
  1.214818	  1.231798	  0.151617
  1.219534	  1.252424	  0.157253
  1.225253	  1.271370	  0.164720
  1.234168	  1.287364	  0.163770
  1.238774	  1.307963	  0.162888
  1.246691	  1.327505	  0.160223
  1.249252	  1.346724	  0.161604
  1.252317	  1.364502	  0.160930
  1.252161	  1.385124	  0.164855
  1.254971	  1.404656	  0.166831
  1.255658	  1.424077	  0.166833
  1.255896	  1.445950	  0.168663
  1.258805	  1.466223	  0.175264
  1.258282	  1.482462	  0.178434
  1.256527	  1.503364	  0.180207
  1.252114	  1.523116	  0.181679
  1.245616	  1.541698	  0.186691
  1.239541	  1.559454	  0.192538
  1.236452	  1.578293	  0.198375
  1.232341	  1.596900	  0.204746
  1.229644	  1.615679	  0.210975
  1.227045	  1.634806	  0.216068
  1.223377	  1.653952	  0.221112
  1.216976	  1.671670	  0.227678
  1.208030	  1.687452	  0.235594
  1.198915	  1.704269	  0.243495
  1.192620	  1.720196	  0.252348
  1.197180	  1.734766	  0.262191
  1.204729	  1.744035	  0.275440
  1.223893	  1.747298	  0.286130
  1.238061	  1.753766	  0.295040
  1.251470	  1.761366	  0.308478
  1.263418	  1.771301	  0.322204
  1.276103	  1.780654	  0.335342
  1.289977	  1.788586	  0.346846
  1.303581	  1.795136	  0.360010
  1.317525	  1.801473	  0.372971
  1.331650	  1.807762	  0.385716
  1.345498	  1.814020	  0.398879
  1.360801	  1.821258	  0.409595
  1.375212	  1.826869	  0.422348
  1.390127	  1.832678	  0.434463
  1.405051	  1.838483	  0.446518
  1.420152	  1.844459	  0.458261
  1.435376	  1.850523	  0.469928
  1.450565	  1.856871	  0.481304
  1.465719	  1.862354	  0.493119
  1.481025	  1.871442	  0.503613
  1.497101	  1.878593	  0.514640
  1.508131	  1.895595	  0.521236
  1.524177	  1.902230	  0.531160
