 -0.168099	  1.005784	  2.291284
 -0.163578	  1.015592	  2.278555
 -0.162993	  1.016861	  2.276909
 -0.156704	  1.028423	  2.262889
 -0.148564	  1.039331	  2.243840
 -0.140546	  1.045330	  2.228158
 -0.130257	  1.051133	  2.212217
 -0.121413	  1.058152	  2.194634
 -0.116771	  1.068490	  2.179322
 -0.111290	  1.079785	  2.162108
 -0.104205	  1.087298	  2.144336
 -0.094864	  1.091306	  2.128310
 -0.085621	  1.097036	  2.109250
 -0.080282	  1.105222	  2.092180
 -0.075184	  1.113116	  2.077013
 -0.068823	  1.121685	  2.058523
 -0.062514	  1.129186	  2.040816
 -0.056686	  1.136452	  2.023118
 -0.050909	  1.143709	  2.005399
 -0.045192	  1.150927	  1.987644
 -0.039623	  1.158048	  1.969804
 -0.034050	  1.165167	  1.951965
 -0.027815	  1.172313	  1.934353
 -0.017968	  1.180635	  1.919032
 -0.003759	  1.189967	  1.908472
  0.010727	  1.199368	  1.898315
  0.025730	  1.208662	  1.888913
  0.040052	  1.217281	  1.878894
  0.054981	  1.225076	  1.868142
  0.071351	  1.233561	  1.858643
  0.088471	  1.243914	  1.851341
  0.102502	  1.254179	  1.842637
  0.114389	  1.262990	  1.829968
  0.128406	  1.272040	  1.818435
  0.143458	  1.280075	  1.807983
  0.156994	  1.288920	  1.796930
  0.168256	  1.298757	  1.784385
  0.181515	  1.310207	  1.770455
  0.193627	  1.317890	  1.755851
  0.207488	  1.321512	  1.745441
  0.218967	  1.331446	  1.732153
  0.231189	  1.341986	  1.718175
  0.242484	  1.349571	  1.703991
  0.252165	  1.358848	  1.689759
  0.265589	  1.364865	  1.676103
  0.277981	  1.371522	  1.659953
  0.283520	  1.380881	  1.644364
  0.292109	  1.389057	  1.628040
  0.300799	  1.397024	  1.609979
  0.302986	  1.405923	  1.593236
  0.306246	  1.414959	  1.575137
  0.312075	  1.422107	  1.558707
  0.314915	  1.429656	  1.539687
  0.316891	  1.436776	  1.521110
  0.319041	  1.443595	  1.502409
  0.318942	  1.449585	  1.483447
  0.318388	  1.456506	  1.464706
  0.316830	  1.462436	  1.445779
  0.315074	  1.468829	  1.426861
  0.311820	  1.473390	  1.408026
  0.309104	  1.479840	  1.389293
  0.305575	  1.485736	  1.371668
  0.305682	  1.493993	  1.349892
  0.307319	  1.498126	  1.330443
  0.304772	  1.500272	  1.312814
  0.301706	  1.502760	  1.292081
  0.300238	  1.507789	  1.273268
  0.299156	  1.515690	  1.256753
  0.300543	  1.523840	  1.233156
  0.298799	  1.526715	  1.215084
  0.297617	  1.530716	  1.196874
  0.301612	  1.532250	  1.173725
  0.309469	  1.540342	  1.155687
  0.310960	  1.555918	  1.141529
  0.313484	  1.562939	  1.121963
  0.318423	  1.568153	  1.102726
  0.318487	  1.579330	  1.087909
  0.319605	  1.592316	  1.069954
  0.323053	  1.604215	  1.054308
  0.324873	  1.617999	  1.038196
  0.331529	  1.630137	  1.025703
  0.340058	  1.643317	  1.012370
  0.344186	  1.658530	  0.998567
  0.347521	  1.673498	  0.984816
  0.357235	  1.686956	  0.975174
  0.366558	  1.701378	  0.964672
  0.372963	  1.717003	  0.950537
  0.381834	  1.729335	  0.939893
  0.394711	  1.743063	  0.931762
  0.402635	  1.758331	  0.920737
  0.411643	  1.773206	  0.903671
  0.421895	  1.782619	  0.901161
  0.433508	  1.802179	  0.896697
  0.447197	  1.817743	  0.886550
  0.459907	  1.826185	  0.872029
  0.470001	  1.839722	  0.860187
  0.476021	  1.855085	  0.854453
  0.487451	  1.871402	  0.847053
  0.500673	  1.885493	  0.838061
  0.509911	  1.901491	  0.828242
  0.518375	  1.917578	  0.825183
  0.528597	  1.935401	  0.821906
  0.538251	  1.953052	  0.814500
  0.549995	  1.966217	  0.806190
  0.564423	  1.979562	  0.799348
  0.576606	  1.995099	  0.794343
  0.585481	  2.013044	  0.791328
  0.594463	  2.031307	  0.789168
  0.603768	  2.048404	  0.789448
  0.612791	  2.066891	  0.788947
  0.621019	  2.085167	  0.788146
  0.629284	  2.103362	  0.787508
  0.637443	  2.121632	  0.787103
  0.645210	  2.140062	  0.786840
  0.653139	  2.158429	  0.786796
  0.660981	  2.176798	  0.786595
  0.669746	  2.194618	  0.784509
  0.678898	  2.212213	  0.781945
  0.688039	  2.229809	  0.779317
  0.697216	  2.247382	  0.776745
  0.709297	  2.269655	  0.771729
  0.716313	  2.280451	  0.766762
