  2.492041	  1.717424	  0.145210
  2.467367	  1.700420	  0.143773
  2.449614	  1.657734	  0.145421
  2.439287	  1.612057	  0.140261
  2.423775	  1.563844	  0.141286
  2.401094	  1.519646	  0.136048
  2.379094	  1.476074	  0.130312
  2.359569	  1.429351	  0.127152
  2.343182	  1.382077	  0.124517
  2.330482	  1.334143	  0.120592
  2.317401	  1.284353	  0.116479
  2.304096	  1.234631	  0.113203
  2.290655	  1.185007	  0.110970
  2.278421	  1.138276	  0.109482
  2.266451	  1.091316	  0.107983
  2.252788	  1.044305	  0.106251
  2.236689	  0.996138	  0.103926
  2.216204	  0.947858	  0.100881
  2.191133	  0.904843	  0.096558
  2.172420	  0.862568	  0.097833
  2.195439	  0.818169	  0.117043
  2.261202	  0.743780	  0.178618
  2.305927	  0.652880	  0.235061
  2.323930	  0.590014	  0.263833
  2.339767	  0.536763	  0.287319
  2.360548	  0.472769	  0.305381
  2.358177	  0.417895	  0.313839
  2.342095	  0.359801	  0.319830
  2.317811	  0.311844	  0.322059
  2.282126	  0.253601	  0.319427
  2.261385	  0.221808	  0.313479
  2.236556	  0.191057	  0.296404
  2.182182	  0.144038	  0.258468
  2.136890	  0.115245	  0.228235
  2.087872	  0.094899	  0.194468
  2.006062	  0.075384	  0.142477
  1.870514	  0.071942	  0.067440
  1.731624	  0.068772	 -0.002832
  1.652662	  0.032871	 -0.037082
  1.598148	 -0.019035	 -0.051519
  1.544626	 -0.084427	 -0.066416
  1.526704	 -0.108200	 -0.076608
  1.474219	 -0.172491	 -0.124204
  1.408954	 -0.238986	 -0.209674
  1.378524	 -0.282541	 -0.253456
  1.399062	 -0.289491	 -0.257157
  1.418066	 -0.293054	 -0.233414
  1.435841	 -0.316495	 -0.192308
  1.467301	 -0.363444	 -0.158614
  1.539828	 -0.447541	 -0.091668
  1.622704	 -0.571413	 -0.057224
  1.690007	 -0.708054	 -0.059747
  1.729065	 -0.788582	 -0.059390
  1.748765	 -0.828993	 -0.074935
  1.768900	 -0.867218	 -0.113843
  1.786070	 -0.895131	 -0.164609
  1.821578	 -0.935357	 -0.274493
  1.866005	 -0.999930	 -0.387770
  1.919254	 -1.109084	 -0.433397
  1.934215	 -1.176803	 -0.421992
  1.931766	 -1.236605	 -0.397871
  1.919103	 -1.301785	 -0.363932
  1.901912	 -1.350246	 -0.332525
  1.890684	 -1.388782	 -0.315040
  1.872232	 -1.422055	 -0.297050
  1.852304	 -1.453268	 -0.289688
  1.827985	 -1.482672	 -0.289598
  1.788841	 -1.511404	 -0.296064
  1.719197	 -1.545675	 -0.316253
  1.587228	 -1.592612	 -0.345492
  1.517291	 -1.617952	 -0.347703
  1.455230	 -1.655280	 -0.330959
  1.431537	 -1.698453	 -0.319349
  1.419982	 -1.738671	 -0.321229
  1.397691	 -1.758679	 -0.315981
  1.341903	 -1.778785	 -0.253286
  1.290430	 -1.812712	 -0.149258
  1.190209	 -1.840258	 -0.049835
  1.125384	 -1.888540	 -0.013344
  1.096418	 -1.936415	 -0.006145
  1.079076	 -1.983125	 -0.006976
  1.063524	 -2.028618	 -0.010092
  1.044424	 -2.076343	 -0.014267
  1.023626	 -2.124332	 -0.018863
  1.003902	 -2.169963	 -0.023086
  0.985509	 -2.214072	 -0.027030
  0.968606	 -2.257662	 -0.030847
  0.952388	 -2.303676	 -0.035142
  0.935923	 -2.351056	 -0.040445
  0.915637	 -2.397138	 -0.047554
  0.893656	 -2.442798	 -0.052200
  0.870722	 -2.489076	 -0.047633
  0.854709	 -2.537489	 -0.044746
  0.835002	 -2.583354	 -0.049426
  0.816541	 -2.631075	 -0.048776
  0.805157	 -2.680302	 -0.045755
  0.779191	 -2.723088	 -0.052967
  0.763529	 -2.771044	 -0.054642
  0.750848	 -2.818364	 -0.052993
  0.725597	 -2.863046	 -0.059797
  0.707702	 -2.914642	 -0.063382
  0.714779	 -2.943789	 -0.064016
