 -1.679276	  1.250402	  1.535837
 -1.686016	  1.249487	  1.544756
 -1.674046	  1.251133	  1.528820
 -1.662325	  1.253360	  1.512772
 -1.650941	  1.256339	  1.496638
 -1.640548	  1.260751	  1.480128
 -1.630870	  1.266219	  1.463417
 -1.620497	  1.272520	  1.447539
 -1.610398	  1.279964	  1.432297
 -1.603288	  1.289718	  1.416521
 -1.598010	  1.298704	  1.400062
 -1.595827	  1.308167	  1.383358
 -1.593669	  1.324137	  1.364520
 -1.589656	  1.337922	  1.353182
 -1.583671	  1.352446	  1.343489
 -1.578588	  1.369358	  1.328056
 -1.577972	  1.376956	  1.310845
 -1.577356	  1.383116	  1.291947
 -1.574748	  1.396968	  1.272531
 -1.570317	  1.412431	  1.258075
 -1.563148	  1.425425	  1.250388
 -1.556708	  1.440194	  1.236159
 -1.552597	  1.452782	  1.220231
 -1.545508	  1.466616	  1.208247
 -1.537856	  1.480884	  1.194324
 -1.534011	  1.490573	  1.178367
 -1.527331	  1.501821	  1.163570
 -1.518932	  1.516367	  1.147524
 -1.516991	  1.522573	  1.132042
 -1.513675	  1.527521	  1.112525
 -1.511805	  1.534429	  1.091905
 -1.502768	  1.544649	  1.073096
 -1.490256	  1.554101	  1.059657
 -1.479579	  1.563923	  1.045040
 -1.472316	  1.570464	  1.029070
 -1.465720	  1.574034	  1.014461
 -1.454591	  1.577244	  0.995309
 -1.441737	  1.582050	  0.976887
 -1.431168	  1.586914	  0.964109
 -1.419557	  1.590299	  0.946582
 -1.411900	  1.590673	  0.928185
 -1.406000	  1.589430	  0.910115
 -1.395458	  1.592682	  0.889960
 -1.384003	  1.596223	  0.876803
 -1.369916	  1.595325	  0.857492
 -1.361844	  1.592386	  0.839415
 -1.358179	  1.588436	  0.824702
 -1.352051	  1.581683	  0.803489
 -1.339277	  1.574853	  0.782529
 -1.327040	  1.573388	  0.769382
 -1.314430	  1.575599	  0.755431
 -1.304338	  1.578798	  0.736181
 -1.298309	  1.581175	  0.715867
 -1.293929	  1.578488	  0.694965
 -1.287793	  1.572505	  0.678307
 -1.279239	  1.564500	  0.662656
 -1.272237	  1.553799	  0.642251
 -1.266428	  1.548032	  0.621600
 -1.260314	  1.548003	  0.609902
 -1.248088	  1.543097	  0.592873
 -1.238013	  1.536161	  0.572123
 -1.228431	  1.534608	  0.558583
 -1.214507	  1.529824	  0.544226
 -1.203463	  1.523406	  0.529476
 -1.197439	  1.508847	  0.513462
 -1.189057	  1.491802	  0.496938
 -1.179022	  1.486700	  0.483086
 -1.165971	  1.486783	  0.465946
 -1.152173	  1.487680	  0.448876
 -1.142417	  1.483441	  0.433503
 -1.132470	  1.477585	  0.412135
 -1.118234	  1.467682	  0.398336
 -1.106215	  1.457759	  0.387682
 -1.088711	  1.445561	  0.385147
 -1.067281	  1.436712	  0.375547
 -1.051192	  1.434155	  0.365277
 -1.035251	  1.430786	  0.350851
 -1.020432	  1.426052	  0.338755
 -1.008100	  1.418499	  0.330114
 -0.988248	  1.403302	  0.318712
 -0.979550	  1.384893	  0.312264
 -0.965927	  1.365527	  0.307359
 -0.951758	  1.355735	  0.304756
 -0.935003	  1.343654	  0.298398
 -0.921234	  1.335640	  0.292880
 -0.908062	  1.317583	  0.281629
 -0.900124	  1.305368	  0.274906
 -0.888132	  1.291144	  0.261686
 -0.872636	  1.276414	  0.255138
 -0.855199	  1.267839	  0.252262
 -0.834523	  1.264361	  0.248018
 -0.813235	  1.260566	  0.244845
 -0.795378	  1.250517	  0.245604
 -0.780777	  1.236040	  0.239561
 -0.765647	  1.223269	  0.238524
 -0.749637	  1.212924	  0.236728
 -0.731436	  1.200967	  0.238268
 -0.715190	  1.192181	  0.237768
 -0.698635	  1.181128	  0.234314
 -0.681161	  1.167373	  0.232925
 -0.666525	  1.158448	  0.234063
 -0.651881	  1.146532	  0.237731
 -0.633272	  1.133802	  0.239120
 -0.617814	  1.124428	  0.238953
 -0.595778	  1.118700	  0.239983
 -0.568882	  1.111944	  0.244903
 -0.558055	  1.107714	  0.245501
 -0.544354	  1.092107	  0.245386
 -0.526303	  1.077885	  0.239511
 -0.509112	  1.069032	  0.234505
 -0.491912	  1.063700	  0.228636
 -0.474275	  1.059450	  0.222796
 -0.454717	  1.055792	  0.216931
 -0.439128	  1.051954	  0.212294
 -0.414357	  1.040116	  0.206125
 -0.397954	  1.033787	  0.205066
 -0.381757	  1.024739	  0.205642
 -0.356996	  1.024165	  0.204376
 -0.339173	  1.024868	  0.197332
 -0.323690	  1.030532	  0.185616
 -0.305694	  1.026663	  0.172275
 -0.285782	  1.019275	  0.165446
 -0.264994	  1.013786	  0.164115
 -0.246948	  1.014397	  0.163016
 -0.229119	  1.022734	  0.154976
 -0.206676	  1.031055	  0.139958
 -0.191061	  1.032422	  0.128662
 -0.176015	  1.026062	  0.123533
 -0.154608	  1.014885	  0.123484
 -0.131896	  1.014046	  0.119285
 -0.116868	  1.020671	  0.106344
 -0.100755	  1.026805	  0.091863
 -0.083312	  1.026736	  0.085721
 -0.065349	  1.018943	  0.083885
 -0.045144	  1.010305	  0.076072
 -0.030778	  1.008556	  0.062428
 -0.012371	  1.012564	  0.047565
  0.004822	  1.014688	  0.040927
  0.020669	  1.011239	  0.031563
  0.031119	  1.006926	  0.018875
  0.050465	  0.996162	 -0.005559
  0.064819	  0.989040	 -0.011100
  0.080642	  0.981433	 -0.019367
  0.101711	  0.975752	 -0.025541
  0.122424	  0.979650	 -0.031408
  0.139823	  0.980998	 -0.043044
  0.152385	  0.986822	 -0.052888
  0.173541	  0.984673	 -0.068327
  0.187270	  0.980058	 -0.077795
  0.207262	  0.971138	 -0.083158
  0.230419	  0.967194	 -0.089642
  0.246103	  0.966775	 -0.096299
  0.256809	  0.968103	 -0.101628
  0.275682	  0.965650	 -0.107584
  0.302625	  0.955813	 -0.125757
  0.315946	  0.952140	 -0.141061
  0.329621	  0.955536	 -0.156035
  0.339130	  0.950133	 -0.169909
  0.357137	  0.956074	 -0.178938
  0.372912	  0.955185	 -0.187547
  0.395249	  0.953191	 -0.200727
  0.412277	  0.954053	 -0.210107
  0.429467	  0.958147	 -0.217160
  0.449031	  0.963010	 -0.225582
  0.465967	  0.964056	 -0.232735
  0.483464	  0.962187	 -0.242769
  0.500398	  0.961064	 -0.250583
  0.518883	  0.963857	 -0.259628
  0.540506	  0.968578	 -0.270277
  0.555667	  0.968122	 -0.277380
  0.580993	  0.969029	 -0.282713
  0.594916	  0.970550	 -0.284336
  0.615500	  0.972451	 -0.287389
  0.636948	  0.972870	 -0.289511
  0.656649	  0.970743	 -0.294137
  0.674924	  0.969187	 -0.300170
  0.696141	  0.970134	 -0.308434
  0.713149	  0.971275	 -0.314521
  0.731825	  0.971930	 -0.316158
  0.752013	  0.974354	 -0.317814
  0.773354	  0.983668	 -0.320754
  0.790882	  0.997166	 -0.321444
  0.809351	  1.008226	 -0.323585
  0.825990	  1.011497	 -0.328868
  0.847322	  1.012034	 -0.334154
  0.867228	  1.010926	 -0.333665
  0.886741	  1.013733	 -0.331408
  0.905729	  1.019283	 -0.330414
  0.925255	  1.026473	 -0.330105
  0.944998	  1.032269	 -0.330989
  0.966713	  1.035740	 -0.329891
  0.986365	  1.037825	 -0.328404
  1.007047	  1.038562	 -0.325121
  1.027653	  1.038183	 -0.321613
  1.045236	  1.040106	 -0.318532
  1.060677	  1.043458	 -0.313226
  1.078246	  1.051834	 -0.309982
  1.093699	  1.062052	 -0.312029
  1.108851	  1.073328	 -0.316578
  1.124819	  1.082580	 -0.320571
  1.141129	  1.091304	 -0.325079
  1.158251	  1.100692	 -0.330157
  1.174663	  1.108767	 -0.328865
  1.192132	  1.119808	 -0.330266
  1.205887	  1.131705	 -0.339130
  1.218343	  1.140962	 -0.355446
  1.233460	  1.145131	 -0.369980
  1.249149	  1.151525	 -0.377382
  1.263326	  1.162966	 -0.383451
  1.275793	  1.176725	 -0.392773
  1.287734	  1.188678	 -0.404728
  1.299222	  1.199630	 -0.416784
  1.309107	  1.211602	 -0.429224
  1.316812	  1.225831	 -0.441130
  1.325974	  1.240071	 -0.452735
  1.335071	  1.253492	 -0.464495
  1.346973	  1.266396	 -0.474661
  1.357822	  1.279765	 -0.484934
  1.368436	  1.294682	 -0.491600
  1.376780	  1.311371	 -0.499628
  1.384837	  1.328125	 -0.506354
  1.383704	  1.343598	 -0.518437
  1.380823	  1.358114	 -0.531774
  1.373369	  1.367464	 -0.547661
  1.364795	  1.375044	 -0.563783
  1.357663	  1.369015	 -0.580887
  1.352619	  1.356044	 -0.595279
  1.348742	  1.342556	 -0.609592
  1.347694	  1.327612	 -0.623037
  1.347153	  1.313086	 -0.636831
  1.346848	  1.298577	 -0.650418
  1.349584	  1.282082	 -0.662198
  1.353382	  1.267586	 -0.675913
  1.356152	  1.253716	 -0.688651
  1.361130	  1.237066	 -0.701700
  1.368006	  1.221621	 -0.714312
  1.374763	  1.213021	 -0.730977
  1.381271	  1.204841	 -0.747401
  1.388494	  1.192546	 -0.762553
  1.395914	  1.182031	 -0.777916
  1.402219	  1.172549	 -0.795171
  1.412666	  1.163115	 -0.811025
  1.424358	  1.153465	 -0.823348
  1.437000	  1.142690	 -0.834624
  1.449461	  1.134262	 -0.848575
  1.461932	  1.126913	 -0.862393
  1.474748	  1.120099	 -0.876145
  1.487169	  1.113042	 -0.890313
  1.501039	  1.108120	 -0.904190
  1.514356	  1.102684	 -0.917214
  1.527854	  1.094110	 -0.930846
  1.541548	  1.087857	 -0.943623
  1.557204	  1.090689	 -0.956349
  1.577547	  1.098079	 -0.972680
  1.590315	  1.097752	 -0.983447
  1.603975	  1.092461	 -0.995922
  1.621489	  1.087688	 -1.013637
  1.636644	  1.083632	 -1.026254
  1.646840	  1.079675	 -1.032358
  1.667452	  1.073124	 -1.045706
  1.686637	  1.072659	 -1.056511
  1.702522	  1.077008	 -1.060588
  1.723712	  1.083594	 -1.068806
  1.742266	  1.090039	 -1.080185
  1.756843	  1.088822	 -1.090975
  1.774495	  1.088348	 -1.097995
  1.793696	  1.087437	 -1.105244
  1.814620	  1.085365	 -1.111155
  1.825224	  1.078413	 -1.137139
  1.842438	  1.078724	 -1.147317
