 -0.312259	  1.428672	 -2.102787
 -0.358021	  1.414695	 -2.134708
 -0.342109	  1.419553	 -2.123609
 -0.326181	  1.424286	 -2.112488
 -0.309959	  1.426593	 -2.101057
 -0.293675	  1.426205	 -2.089468
 -0.277384	  1.425670	 -2.077879
 -0.261071	  1.425119	 -2.066322
 -0.244747	  1.424562	 -2.054779
 -0.228450	  1.424022	 -2.043196
 -0.212199	  1.423505	 -2.031553
 -0.196076	  1.422882	 -2.019763
 -0.181687	  1.420403	 -2.006119
 -0.168110	  1.417153	 -1.991803
 -0.154533	  1.413838	 -1.977496
 -0.140934	  1.410522	 -1.963207
 -0.127423	  1.407256	 -1.948826
 -0.113915	  1.403980	 -1.934449
 -0.100369	  1.400674	 -1.920106
 -0.087066	  1.397363	 -1.905537
 -0.076126	  1.393454	 -1.889230
 -0.068170	  1.388477	 -1.871601
 -0.060523	  1.382277	 -1.854129
 -0.052815	  1.376014	 -1.836632
 -0.044344	  1.370624	 -1.819271
 -0.035201	  1.366489	 -1.801846
 -0.026311	  1.362692	 -1.784221
 -0.018798	  1.358589	 -1.765932
 -0.014047	  1.353367	 -1.746990
 -0.011905	  1.346760	 -1.728029
 -0.009932	  1.339736	 -1.709355
 -0.008775	  1.332563	 -1.690691
 -0.006933	  1.325481	 -1.672114
 -0.005603	  1.319137	 -1.653223
 -0.002914	  1.312681	 -1.634362
 -0.000767	  1.305412	 -1.615426
 -0.001058	  1.298085	 -1.596645
 -0.001598	  1.292667	 -1.578817
 -0.000978	  1.288453	 -1.559371
 -0.003280	  1.284192	 -1.532288
 -0.008163	  1.275597	 -1.512596
 -0.015375	  1.263087	 -1.494046
 -0.028921	  1.249465	 -1.481466
 -0.044258	  1.231798	 -1.470873
 -0.052406	  1.217062	 -1.461883
 -0.057053	  1.203978	 -1.453465
 -0.066316	  1.187019	 -1.439086
 -0.076997	  1.172069	 -1.425276
 -0.082633	  1.169100	 -1.418478
 -0.092817	  1.160557	 -1.404475
 -0.113362	  1.148526	 -1.384104
 -0.121290	  1.142384	 -1.376865
 -0.134303	  1.133232	 -1.365556
 -0.146012	  1.122471	 -1.355380
 -0.157885	  1.114752	 -1.344927
 -0.181533	  1.106307	 -1.326595
 -0.191679	  1.103854	 -1.319817
 -0.201887	  1.102687	 -1.309648
 -0.222932	  1.103715	 -1.287263
 -0.234793	  1.103151	 -1.275876
 -0.242057	  1.103124	 -1.267356
 -0.253818	  1.101607	 -1.254931
 -0.259056	  1.100710	 -1.230645
 -0.260232	  1.096899	 -1.210556
 -0.265315	  1.086750	 -1.193125
 -0.274815	  1.069340	 -1.169765
 -0.281106	  1.063250	 -1.153130
 -0.285689	  1.061667	 -1.140696
 -0.291575	  1.058811	 -1.117412
 -0.298120	  1.047092	 -1.095971
 -0.302396	  1.038268	 -1.084626
 -0.306308	  1.024640	 -1.069402
 -0.312531	  1.010959	 -1.051336
 -0.319243	  0.996313	 -1.039344
 -0.323710	  0.979747	 -1.028132
 -0.329979	  0.967905	 -1.012246
 -0.338230	  0.959153	 -0.995627
 -0.349308	  0.949814	 -0.981774
 -0.361596	  0.941599	 -0.967978
 -0.373527	  0.933927	 -0.953842
 -0.382542	  0.923299	 -0.941334
 -0.388308	  0.908185	 -0.928592
 -0.395969	  0.897488	 -0.913487
 -0.404855	  0.887188	 -0.900526
 -0.414784	  0.876259	 -0.887046
 -0.427706	  0.859077	 -0.861915
 -0.430457	  0.851079	 -0.851278
 -0.432436	  0.845448	 -0.842594
 -0.441455	  0.832155	 -0.816058
 -0.446829	  0.828063	 -0.804356
 -0.456954	  0.823596	 -0.785565
 -0.470648	  0.812477	 -0.762497
 -0.475262	  0.806062	 -0.753630
 -0.480276	  0.797983	 -0.743327
 -0.489388	  0.787297	 -0.726931
 -0.501391	  0.780089	 -0.708775
 -0.513031	  0.770465	 -0.686045
 -0.518234	  0.762312	 -0.674791
 -0.522487	  0.756284	 -0.664959
 -0.533058	  0.741972	 -0.644366
 -0.547599	  0.726640	 -0.623657
 -0.551818	  0.723729	 -0.617992
 -0.563174	  0.719515	 -0.600481
 -0.579038	  0.714417	 -0.579511
 -0.586927	  0.710900	 -0.570402
 -0.600440	  0.707053	 -0.553465
 -0.617781	  0.702188	 -0.534896
 -0.632756	  0.696560	 -0.523884
 -0.643651	  0.693385	 -0.513945
 -0.658321	  0.689627	 -0.502275
 -0.673339	  0.684762	 -0.485130
 -0.685433	  0.681245	 -0.469155
 -0.697172	  0.679040	 -0.454403
 -0.711760	  0.677345	 -0.437729
 -0.724120	  0.674648	 -0.423827
 -0.736652	  0.673006	 -0.410151
 -0.754946	  0.674141	 -0.393352
 -0.769354	  0.678007	 -0.383028
 -0.784720	  0.685420	 -0.374549
 -0.804417	  0.691992	 -0.361345
 -0.818065	  0.693019	 -0.350090
 -0.833079	  0.691054	 -0.335894
 -0.848118	  0.688140	 -0.321220
 -0.860032	  0.685150	 -0.308536
 -0.876878	  0.683845	 -0.293217
 -0.895979	  0.686913	 -0.276397
 -0.905270	  0.688012	 -0.267981
 -0.920254	  0.693979	 -0.259417
 -0.940913	  0.694649	 -0.250487
 -0.961990	  0.689154	 -0.234670
 -0.975722	  0.684269	 -0.216831
 -0.983984	  0.683708	 -0.200576
 -0.991439	  0.684574	 -0.181893
 -1.000372	  0.685308	 -0.164471
 -1.010807	  0.686593	 -0.148759
 -1.021957	  0.686392	 -0.130425
 -1.031525	  0.684053	 -0.110819
 -1.040266	  0.678040	 -0.085317
 -1.045363	  0.675941	 -0.071352
 -1.046319	  0.676732	 -0.054534
 -1.043629	  0.675519	 -0.031262
 -1.043656	  0.673041	 -0.004864
 -1.043801	  0.673166	  0.006777
 -1.049127	  0.671850	  0.028418
 -1.053958	  0.674153	  0.052540
 -1.058981	  0.677269	  0.069368
 -1.067689	  0.682960	  0.091004
 -1.069137	  0.691879	  0.112591
 -1.060544	  0.702492	  0.131532
 -1.053282	  0.705765	  0.146223
 -1.048260	  0.702189	  0.168458
 -1.042828	  0.702326	  0.200292
 -1.042478	  0.705069	  0.208654
 -1.039118	  0.709767	  0.220652
 -1.027796	  0.716902	  0.256623
 -1.025989	  0.717858	  0.268988
 -1.023865	  0.718470	  0.275827
 -1.016890	  0.718176	  0.304057
 -1.013939	  0.716862	  0.328389
 -1.011818	  0.716319	  0.346071
 -1.008395	  0.720210	  0.366110
 -1.002824	  0.725968	  0.380785
 -1.002268	  0.734581	  0.396955
 -1.012209	  0.747676	  0.417874
 -1.021661	  0.755672	  0.431180
 -1.035502	  0.763463	  0.449918
 -1.043972	  0.767996	  0.461532
 -1.056387	  0.771869	  0.477821
 -1.066778	  0.775250	  0.491989
 -1.080899	  0.778999	  0.505480
 -1.097559	  0.789166	  0.520985
 -1.113786	  0.802753	  0.539150
 -1.121393	  0.810629	  0.544389
 -1.130147	  0.820691	  0.551302
 -1.144679	  0.838185	  0.566950
 -1.158085	  0.850550	  0.579500
 -1.165471	  0.858101	  0.583068
 -1.178685	  0.869946	  0.586060
 -1.203480	  0.884959	  0.596056
 -1.222295	  0.893353	  0.602688
 -1.233487	  0.899296	  0.606014
 -1.249744	  0.910343	  0.608357
 -1.267094	  0.922819	  0.615975
 -1.284794	  0.931480	  0.622306
 -1.295661	  0.935497	  0.624636
 -1.314786	  0.940730	  0.627809
 -1.336164	  0.947453	  0.630146
 -1.353065	  0.950490	  0.631168
 -1.374960	  0.950556	  0.639769
 -1.390703	  0.953609	  0.647992
 -1.411228	  0.956487	  0.649402
 -1.429994	  0.958666	  0.651421
 -1.449194	  0.961849	  0.649980
 -1.469145	  0.961071	  0.645913
 -1.493644	  0.954317	  0.647058
 -1.513190	  0.946501	  0.655057
 -1.526962	  0.937957	  0.657799
 -1.542485	  0.927901	  0.661031
 -1.561702	  0.921946	  0.664068
 -1.583842	  0.907230	  0.671248
 -1.595404	  0.896747	  0.677211
 -1.607862	  0.881752	  0.685055
 -1.619409	  0.872854	  0.692368
 -1.631168	  0.863112	  0.700083
 -1.653831	  0.838003	  0.713183
 -1.659337	  0.823171	  0.713699
 -1.668478	  0.811056	  0.713475
 -1.681292	  0.791756	  0.719598
 -1.690478	  0.782294	  0.727022
 -1.702480	  0.763201	  0.731793
 -1.709981	  0.744518	  0.732753
 -1.718608	  0.726788	  0.739237
 -1.726537	  0.713305	  0.752160
 -1.733708	  0.701448	  0.761462
 -1.745620	  0.691451	  0.779548
 -1.756942	  0.683055	  0.802676
 -1.761700	  0.680033	  0.815435
 -1.764552	  0.677189	  0.825297
 -1.774529	  0.673148	  0.848370
 -1.785124	  0.674113	  0.864706
 -1.793597	  0.671181	  0.875757
 -1.804584	  0.664863	  0.896522
 -1.809579	  0.654979	  0.909086
 -1.815836	  0.647182	  0.926347
 -1.828577	  0.638284	  0.954421
 -1.833301	  0.637160	  0.965465
 -1.839190	  0.636514	  0.975107
 -1.853562	  0.634138	  0.997077
 -1.870125	  0.631166	  1.022658
 -1.875129	  0.632103	  1.031328
 -1.884674	  0.635809	  1.046171
 -1.899348	  0.644521	  1.064568
 -1.915277	  0.648900	  1.078592
 -1.929348	  0.648940	  1.089081
 -1.945218	  0.646683	  1.102517
 -1.960741	  0.647197	  1.121876
 -1.973889	  0.650224	  1.140494
 -1.982579	  0.651060	  1.151839
 -1.993628	  0.649639	  1.170281
 -2.002775	  0.642681	  1.183919
 -2.020694	  0.632042	  1.194158
 -2.040198	  0.624284	  1.207739
 -2.053212	  0.621195	  1.224177
 -2.062548	  0.621914	  1.242299
 -2.069974	  0.625335	  1.258654
 -2.082540	  0.625044	  1.275990
 -2.093460	  0.624351	  1.292306
 -2.103928	  0.623320	  1.307577
 -2.115517	  0.621784	  1.323805
