 -0.201476	  1.521904	  2.612301
 -0.199481	  1.506836	  2.586436
 -0.173423	  1.493601	  2.547780
 -0.150917	  1.484996	  2.504265
 -0.134112	  1.468207	  2.463448
 -0.114439	  1.460882	  2.416142
 -0.092318	  1.445917	  2.374803
 -0.072791	  1.432737	  2.327591
 -0.049858	  1.428143	  2.283263
 -0.029647	  1.409251	  2.242878
 -0.007588	  1.400096	  2.199161
  0.015371	  1.389738	  2.154540
  0.032760	  1.372967	  2.109936
  0.056674	  1.355541	  2.070703
  0.076825	  1.342072	  2.027745
  0.103944	  1.330217	  1.986210
  0.126099	  1.311568	  1.943643
  0.154382	  1.297580	  1.902174
  0.177849	  1.284671	  1.859460
  0.201000	  1.269888	  1.816721
  0.224226	  1.254898	  1.774790
  0.247424	  1.240655	  1.734260
  0.270594	  1.227300	  1.693366
  0.292022	  1.215205	  1.653171
  0.314054	  1.202067	  1.608376
  0.334462	  1.189529	  1.564687
  0.354515	  1.177112	  1.522171
  0.374821	  1.164548	  1.479597
  0.395663	  1.150879	  1.434530
  0.416317	  1.136356	  1.388135
  0.435458	  1.122807	  1.345015
  0.454890	  1.109799	  1.302371
  0.473722	  1.100302	  1.258566
  0.494672	  1.091618	  1.211487
  0.516046	  1.072381	  1.170351
  0.532971	  1.057079	  1.123541
  0.550120	  1.042480	  1.080144
  0.570847	  1.026566	  1.037605
  0.591059	  1.011941	  0.995736
  0.611381	  0.998323	  0.952410
  0.631991	  0.986140	  0.909210
  0.655301	  0.975114	  0.863510
  0.679381	  0.965130	  0.819605
  0.701401	  0.955344	  0.778063
  0.723807	  0.944275	  0.733818
  0.744639	  0.931955	  0.687145
  0.758100	  0.919356	  0.642401
  0.758089	  0.908239	  0.600162
  0.737056	  0.898959	  0.544101
  0.664688	  0.899954	  0.449950
  0.589657	  0.923626	  0.378756
  0.518214	  0.971558	  0.295259
  0.450070	  1.010236	  0.177299
  0.416613	  1.028642	  0.066839
  0.404658	  1.027772	 -0.061350
  0.408392	  1.026429	 -0.084860
  0.420924	  1.028492	 -0.117588
  0.471975	  1.026715	 -0.193033
  0.571849	  0.983743	 -0.244892
  0.727306	  0.918957	 -0.256382
  0.774099	  0.889107	 -0.250747
  0.844141	  0.844622	 -0.247917
  0.889098	  0.813763	 -0.240384
  0.950566	  0.777505	 -0.242360
  1.024727	  0.718168	 -0.235747
  1.118027	  0.663589	 -0.221424
  1.161736	  0.646433	 -0.234114
  1.189839	  0.633744	 -0.269763
  1.213081	  0.621721	 -0.314184
  1.233951	  0.609815	 -0.357674
  1.254706	  0.598399	 -0.401296
  1.276078	  0.588009	 -0.445277
  1.297222	  0.578606	 -0.488352
  1.320146	  0.569499	 -0.531828
  1.344020	  0.559585	 -0.575250
  1.369083	  0.548806	 -0.619195
  1.393836	  0.537273	 -0.661659
  1.416253	  0.525707	 -0.701689
  1.440125	  0.513017	 -0.745415
  1.463685	  0.498996	 -0.789155
  1.485727	  0.485469	 -0.830296
  1.507965	  0.471519	 -0.872534
  1.530772	  0.456467	 -0.916748
  1.550445	  0.442382	 -0.957260
  1.570451	  0.428377	 -0.999836
  1.591503	  0.415314	 -1.043607
  1.612772	  0.402788	 -1.087274
  1.633716	  0.390201	 -1.130991
  1.654165	  0.377367	 -1.174171
  1.675401	  0.363931	 -1.219667
  1.696503	  0.349824	 -1.263993
  1.716522	  0.336182	 -1.304692
  1.738138	  0.321188	 -1.347959
  1.758426	  0.305515	 -1.389823
  1.778228	  0.289069	 -1.432581
  1.796961	  0.272850	 -1.478714
  1.814347	  0.257695	 -1.524689
  1.831670	  0.244378	 -1.566711
  1.851340	  0.230767	 -1.610078
  1.871102	  0.218618	 -1.652390
  1.893268	  0.205857	 -1.697458
  1.917875	  0.191794	 -1.741540
  1.942828	  0.177851	 -1.784360
  1.966190	  0.162674	 -1.826955
  1.985418	  0.147627	 -1.869512
  2.007103	  0.134866	 -1.911343
  2.038419	  0.125023	 -1.949036
  2.057042	  0.105315	 -1.994147
  2.073512	  0.092482	 -2.038522
  2.102125	  0.086454	 -2.079701
  2.113659	  0.064260	 -2.127984
  2.134796	  0.064903	 -2.149264
