  0.380237	  1.856874	 -2.363966
  0.376472	  1.838490	 -2.340561
  0.383682	  1.858623	 -2.290036
  0.380559	  1.865515	 -2.238466
  0.375695	  1.871887	 -2.187195
  0.368277	  1.870576	 -2.135208
  0.363245	  1.871247	 -2.086452
  0.362133	  1.876002	 -2.038846
  0.355294	  1.876598	 -1.987705
  0.345478	  1.880843	 -1.937831
  0.338158	  1.884603	 -1.891610
  0.331298	  1.887484	 -1.842661
  0.324814	  1.890898	 -1.791526
  0.318334	  1.894089	 -1.739361
  0.312383	  1.897392	 -1.689378
  0.307486	  1.901785	 -1.640008
  0.304581	  1.907289	 -1.591334
  0.302726	  1.912838	 -1.543143
  0.301180	  1.916652	 -1.493311
  0.300134	  1.920680	 -1.442862
  0.299217	  1.925627	 -1.393979
  0.297463	  1.931340	 -1.343937
  0.293025	  1.938025	 -1.294781
  0.287066	  1.946222	 -1.245612
  0.280415	  1.953669	 -1.197077
  0.274637	  1.958275	 -1.150075
  0.268838	  1.959857	 -1.099474
  0.263282	  1.962106	 -1.048618
  0.256691	  1.966912	 -0.996676
  0.249087	  1.973038	 -0.946789
  0.240748	  1.980666	 -0.898564
  0.233063	  1.991885	 -0.853110
  0.228498	  2.009965	 -0.810509
  0.229375	  2.042092	 -0.766932
  0.249404	  2.120208	 -0.706563
  0.291463	  2.218288	 -0.656109
  0.309406	  2.271666	 -0.613061
  0.337349	  2.374374	 -0.559868
  0.326772	  2.406752	 -0.533334
  0.347686	  2.385031	 -0.485596
  0.328787	  2.403709	 -0.430411
  0.276621	  2.445587	 -0.375493
  0.289179	  2.540107	 -0.351086
  0.374320	  2.672374	 -0.344215
  0.497215	  2.836917	 -0.338636
  0.546075	  3.057905	 -0.276044
  0.534068	  3.000647	 -0.187588
  0.614507	  3.051447	 -0.128050
  0.521974	  3.178647	 -0.072475
  0.468005	  3.032028	  0.032565
  0.495488	  2.945452	  0.093730
  0.498503	  2.897582	  0.137301
  0.443748	  2.833295	  0.192387
  0.312376	  2.801918	  0.243529
  0.237483	  2.698516	  0.259743
  0.186648	  2.510303	  0.280971
  0.113497	  2.318474	  0.340645
  0.092591	  2.183593	  0.414316
  0.097135	  2.160754	  0.478462
  0.096653	  2.167670	  0.528590
  0.095378	  2.176397	  0.579017
  0.092328	  2.183102	  0.631969
  0.087178	  2.187472	  0.682142
  0.079739	  2.190403	  0.730999
  0.071315	  2.191946	  0.779888
  0.063400	  2.192800	  0.828321
  0.055226	  2.193798	  0.878589
  0.047460	  2.194568	  0.929070
  0.040487	  2.194959	  0.978437
  0.033633	  2.194967	  1.027193
  0.026430	  2.194561	  1.073011
  0.018341	  2.193955	  1.122419
  0.010815	  2.194899	  1.172425
  0.003519	  2.197598	  1.223347
 -0.003157	  2.201714	  1.273866
 -0.008912	  2.206825	  1.322675
 -0.014102	  2.212403	  1.369506
 -0.018916	  2.218739	  1.419065
 -0.022283	  2.225637	  1.469337
 -0.024863	  2.233426	  1.517329
 -0.028502	  2.243645	  1.569326
 -0.029424	  2.246144	  1.620915
 -0.029859	  2.248463	  1.671016
 -0.033167	  2.250324	  1.720167
 -0.040759	  2.256413	  1.769866
 -0.045884	  2.255837	  1.816881
 -0.052042	  2.260312	  1.864643
 -0.058192	  2.274011	  1.912653
 -0.063621	  2.269603	  1.960831
 -0.064257	  2.292299	  1.980439
