  0.618157	 -2.244709	 -0.860614
  0.598828	 -2.280886	 -0.874698
  0.606225	 -2.269163	 -0.857721
  0.616119	 -2.249073	 -0.857527
  0.623837	 -2.230729	 -0.855568
  0.629493	 -2.211965	 -0.846908
  0.636638	 -2.193287	 -0.837019
  0.646693	 -2.176657	 -0.827731
  0.654642	 -2.166820	 -0.822561
  0.664431	 -2.156248	 -0.814162
  0.681442	 -2.137222	 -0.789738
  0.687917	 -2.129633	 -0.779641
  0.698339	 -2.120845	 -0.765446
  0.707842	 -2.108847	 -0.752273
  0.714733	 -2.084503	 -0.746545
  0.719277	 -2.060343	 -0.746069
  0.726686	 -2.046411	 -0.741503
  0.739222	 -2.036883	 -0.724672
  0.749227	 -2.027058	 -0.710308
  0.758338	 -2.012547	 -0.698281
  0.767847	 -1.998909	 -0.687047
  0.777301	 -1.985320	 -0.675820
  0.787093	 -1.971845	 -0.664750
  0.797391	 -1.958561	 -0.653911
  0.807717	 -1.945277	 -0.643100
  0.818304	 -1.931733	 -0.632880
  0.828965	 -1.918119	 -0.622829
  0.839618	 -1.904477	 -0.612811
  0.850021	 -1.890068	 -0.603639
  0.860384	 -1.875553	 -0.594590
  0.870740	 -1.861019	 -0.585562
  0.880908	 -1.846027	 -0.577086
  0.891070	 -1.831017	 -0.568635
  0.901272	 -1.815951	 -0.560333
  0.911579	 -1.800734	 -0.552446
  0.921904	 -1.785512	 -0.544593
  0.932559	 -1.770244	 -0.537290
  0.943625	 -1.754940	 -0.530709
  0.954713	 -1.739631	 -0.524176
  0.966114	 -1.724261	 -0.518378
  0.978153	 -1.708819	 -0.514318
  0.990214	 -1.693376	 -0.510312
  1.001987	 -1.677783	 -0.506044
  1.013321	 -1.661978	 -0.501383
  1.024581	 -1.646145	 -0.496644
  1.034945	 -1.630000	 -0.491019
  1.045294	 -1.613984	 -0.485380
  1.056229	 -1.599938	 -0.480574
  1.070969	 -1.588298	 -0.473079
  1.081901	 -1.577446	 -0.455717
  1.090358	 -1.558311	 -0.439372
  1.096975	 -1.542515	 -0.434508
  1.106041	 -1.528191	 -0.429933
  1.116668	 -1.512106	 -0.420466
  1.124214	 -1.492305	 -0.415412
  1.131026	 -1.469129	 -0.415911
  1.139133	 -1.455421	 -0.412365
  1.153972	 -1.444300	 -0.404010
  1.169949	 -1.435132	 -0.395423
  1.184104	 -1.414239	 -0.377234
  1.190176	 -1.398420	 -0.369497
  1.194314	 -1.384533	 -0.363911
  1.209645	 -1.368146	 -0.362113
  1.228777	 -1.357406	 -0.363949
  1.246424	 -1.346710	 -0.362446
  1.263341	 -1.335530	 -0.361239
  1.279357	 -1.323545	 -0.360227
  1.295300	 -1.314400	 -0.359244
  1.313021	 -1.307512	 -0.355796
  1.331368	 -1.290796	 -0.355573
  1.347364	 -1.278801	 -0.360731
  1.365282	 -1.269502	 -0.366577
  1.382684	 -1.259210	 -0.371418
  1.395758	 -1.249832	 -0.372937
  1.410277	 -1.238561	 -0.372805
  1.431462	 -1.222446	 -0.367145
  1.445505	 -1.215164	 -0.362884
  1.452999	 -1.212634	 -0.360962
  1.464243	 -1.206238	 -0.350187
  1.472806	 -1.203317	 -0.332462
  1.475358	 -1.200154	 -0.311774
  1.477269	 -1.194035	 -0.291956
  1.480376	 -1.186611	 -0.273151
  1.485485	 -1.177815	 -0.256673
  1.491907	 -1.169363	 -0.238919
  1.497563	 -1.164303	 -0.221287
  1.503615	 -1.161590	 -0.201577
  1.510095	 -1.157527	 -0.180488
  1.517243	 -1.149946	 -0.160372
  1.523326	 -1.140978	 -0.144749
  1.529379	 -1.129713	 -0.127891
  1.535206	 -1.116446	 -0.113205
  1.542838	 -1.102979	 -0.099266
  1.553420	 -1.090732	 -0.087304
  1.565763	 -1.080450	 -0.074513
  1.578496	 -1.072080	 -0.062268
  1.592101	 -1.062336	 -0.050703
  1.604926	 -1.045751	 -0.043320
  1.613058	 -1.025392	 -0.036735
  1.618184	 -1.006972	 -0.025452
  1.622653	 -0.993916	 -0.013884
  1.630931	 -0.981400	  0.000062
  1.640427	 -0.970087	  0.013049
  1.647055	 -0.958694	  0.025674
  1.653716	 -0.945034	  0.041986
  1.658714	 -0.929424	  0.056062
  1.658578	 -0.913720	  0.066981
  1.658489	 -0.901570	  0.077470
  1.662703	 -0.884247	  0.090240
  1.671645	 -0.864199	  0.099527
  1.678798	 -0.844497	  0.107750
  1.683461	 -0.823979	  0.107949
  1.688622	 -0.803630	  0.108602
  1.690417	 -0.787788	  0.110373
  1.690009	 -0.767483	  0.117923
  1.693881	 -0.746292	  0.124985
  1.699124	 -0.724123	  0.130016
  1.698479	 -0.702950	  0.128091
  1.692129	 -0.686326	  0.126078
  1.680197	 -0.666797	  0.124630
  1.666959	 -0.650141	  0.122588
  1.657480	 -0.631530	  0.121192
  1.649431	 -0.613632	  0.123268
  1.641365	 -0.595315	  0.128118
  1.632461	 -0.576786	  0.133275
  1.622628	 -0.561709	  0.137061
  1.606032	 -0.546277	  0.140397
  1.590275	 -0.532899	  0.140537
  1.578155	 -0.517959	  0.137721
  1.569421	 -0.501995	  0.135458
  1.559168	 -0.482980	  0.137487
  1.553099	 -0.468559	  0.134762
  1.542567	 -0.449985	  0.131120
  1.533504	 -0.430875	  0.114102
  1.527612	 -0.419340	  0.104403
  1.521773	 -0.406273	  0.097572
  1.513241	 -0.386159	  0.094633
  1.502060	 -0.367928	  0.088892
  1.495450	 -0.351881	  0.078999
  1.496949	 -0.331686	  0.074144
  1.514348	 -0.307916	  0.062909
  1.523925	 -0.299021	  0.046393
  1.528965	 -0.293198	  0.034110
  1.532159	 -0.277761	  0.018714
  1.543252	 -0.263507	  0.006772
  1.557711	 -0.255760	 -0.002143
  1.575832	 -0.250158	 -0.010124
  1.596724	 -0.236686	 -0.018539
  1.609860	 -0.225611	 -0.024696
  1.621608	 -0.219225	 -0.032738
  1.637785	 -0.216200	 -0.046693
  1.658713	 -0.207204	 -0.059142
  1.674838	 -0.196680	 -0.068353
  1.686629	 -0.186275	 -0.076293
  1.699733	 -0.178695	 -0.089773
  1.711222	 -0.172974	 -0.106657
  1.719151	 -0.168050	 -0.121531
  1.727086	 -0.158673	 -0.139497
  1.733241	 -0.139951	 -0.140175
  1.746844	 -0.114776	 -0.134664
  1.761176	 -0.092925	 -0.130418
  1.769517	 -0.081726	 -0.125416
  1.776779	 -0.066627	 -0.111530
  1.779758	 -0.049686	 -0.100201
  1.781890	 -0.033506	 -0.085546
  1.787733	 -0.016417	 -0.056922
  1.792024	 -0.015077	 -0.039879
  1.795470	 -0.009540	 -0.030962
  1.803417	 -0.003769	 -0.010638
  1.813544	  0.000063	  0.009968
  1.820532	  0.001057	  0.024953
  1.830637	  0.007013	  0.043812
  1.839096	  0.010534	  0.062331
  1.847239	  0.013411	  0.081098
  1.857169	  0.019397	  0.097765
  1.868000	  0.027476	  0.112307
  1.878754	  0.037941	  0.125234
  1.890875	  0.048215	  0.140296
  1.905701	  0.057846	  0.157514
  1.913962	  0.065493	  0.166371
  1.922483	  0.077102	  0.176585
  1.930455	  0.091644	  0.194764
  1.935907	  0.112761	  0.220967
  1.937018	  0.114149	  0.225332
  1.939906	  0.125657	  0.238701
  1.945842	  0.139704	  0.261051
  1.953490	  0.150471	  0.276158
  1.962399	  0.160681	  0.294401
  1.967800	  0.165570	  0.309913
  1.972951	  0.172067	  0.324318
  1.981616	  0.183644	  0.342904
  1.989276	  0.193639	  0.359947
  1.994752	  0.202955	  0.372227
  1.999429	  0.216030	  0.390201
  2.006300	  0.226209	  0.404985
  2.021502	  0.240248	  0.427390
  2.031365	  0.246290	  0.436868
  2.045863	  0.249487	  0.443544
  2.059829	  0.266983	  0.455354
  2.062624	  0.281699	  0.470267
  2.060865	  0.297749	  0.486943
  2.063598	  0.313446	  0.505491
  2.074392	  0.322039	  0.515538
  2.094656	  0.331401	  0.521886
  2.111887	  0.340553	  0.531634
  2.121160	  0.356108	  0.549991
  2.126634	  0.368551	  0.563466
  2.134923	  0.378686	  0.574490
  2.148910	  0.388918	  0.583765
  2.159962	  0.406366	  0.596296
  2.167995	  0.421019	  0.608912
  2.169566	  0.430022	  0.617471
  2.176776	  0.449660	  0.632976
  2.194116	  0.470716	  0.642954
  2.203255	  0.478636	  0.646854
  2.217189	  0.490474	  0.651114
  2.232927	  0.508394	  0.660532
  2.240600	  0.522909	  0.668722
  2.245487	  0.536448	  0.675637
  2.254699	  0.560493	  0.684670
  2.263334	  0.581557	  0.688418
  2.271210	  0.598212	  0.696200
