 -0.290993	 -1.669739	  1.760737
 -0.290764	 -1.670732	  1.773679
 -0.284029	 -1.670785	  1.756463
 -0.285674	 -1.674701	  1.732484
 -0.295706	 -1.677493	  1.709849
 -0.304549	 -1.674656	  1.693827
 -0.304650	 -1.667211	  1.671921
 -0.301797	 -1.663298	  1.654140
 -0.297473	 -1.659402	  1.637781
 -0.294491	 -1.654011	  1.615684
 -0.291837	 -1.651371	  1.594576
 -0.290280	 -1.650277	  1.575676
 -0.290991	 -1.648506	  1.554399
 -0.292487	 -1.646020	  1.535083
 -0.294159	 -1.644759	  1.515304
 -0.295218	 -1.644179	  1.494254
 -0.295042	 -1.643744	  1.474852
 -0.294125	 -1.644624	  1.455503
 -0.295870	 -1.648818	  1.432076
 -0.299304	 -1.650953	  1.411255
 -0.298266	 -1.645126	  1.393784
 -0.295533	 -1.633578	  1.377927
 -0.294581	 -1.625862	  1.357046
 -0.293485	 -1.620220	  1.337264
 -0.292468	 -1.614266	  1.318161
 -0.292124	 -1.606581	  1.299716
 -0.291855	 -1.598415	  1.281487
 -0.291208	 -1.590522	  1.263434
 -0.284640	 -1.583652	  1.245440
 -0.277239	 -1.576920	  1.224929
 -0.277769	 -1.570991	  1.204000
 -0.286356	 -1.566096	  1.186412
 -0.291394	 -1.559595	  1.169732
 -0.280136	 -1.552723	  1.152540
 -0.267678	 -1.547443	  1.131994
 -0.274771	 -1.541729	  1.111255
 -0.291644	 -1.533473	  1.090034
 -0.296608	 -1.527003	  1.071396
 -0.292650	 -1.523180	  1.056389
 -0.276498	 -1.520461	  1.037686
 -0.264613	 -1.514823	  1.010575
 -0.272634	 -1.508768	  0.989762
 -0.281296	 -1.504482	  0.978018
 -0.286937	 -1.496127	  0.958979
 -0.288574	 -1.490491	  0.938159
 -0.291172	 -1.486019	  0.918812
 -0.293696	 -1.483352	  0.898999
 -0.295627	 -1.481125	  0.879176
 -0.297079	 -1.479103	  0.859321
 -0.299064	 -1.478299	  0.839435
 -0.301643	 -1.478138	  0.819626
 -0.304518	 -1.476826	  0.799837
 -0.307908	 -1.476048	  0.780048
 -0.310769	 -1.478167	  0.760311
 -0.310099	 -1.480587	  0.740206
 -0.307481	 -1.480929	  0.720062
 -0.307185	 -1.483121	  0.698786
 -0.313178	 -1.487937	  0.679742
 -0.323337	 -1.496998	  0.661917
 -0.326779	 -1.505416	  0.642550
 -0.334548	 -1.513536	  0.617097
 -0.339144	 -1.518653	  0.606206
 -0.345280	 -1.526313	  0.591468
 -0.348595	 -1.536970	  0.571696
 -0.347478	 -1.548702	  0.554425
 -0.343247	 -1.558853	  0.540967
 -0.342568	 -1.568456	  0.519040
 -0.342626	 -1.576238	  0.498566
 -0.343180	 -1.580457	  0.487050
 -0.346269	 -1.582816	  0.461924
 -0.351738	 -1.586379	  0.438789
 -0.363708	 -1.597805	  0.416144
 -0.372655	 -1.605728	  0.396683
 -0.379719	 -1.620579	  0.382546
 -0.376927	 -1.637626	  0.372483
 -0.370642	 -1.652549	  0.367418
 -0.360203	 -1.671340	  0.356663
 -0.355719	 -1.684629	  0.344398
 -0.353085	 -1.699679	  0.330731
 -0.348783	 -1.714757	  0.322720
 -0.337412	 -1.728028	  0.316016
 -0.331397	 -1.741807	  0.301983
 -0.328637	 -1.755255	  0.279466
 -0.323809	 -1.757123	  0.260463
 -0.316961	 -1.757572	  0.241317
 -0.307433	 -1.763189	  0.224973
 -0.299058	 -1.773346	  0.208463
 -0.289500	 -1.780807	  0.193389
 -0.281854	 -1.780863	  0.179153
 -0.278522	 -1.772997	  0.160332
 -0.272103	 -1.770735	  0.139925
 -0.267792	 -1.774254	  0.119501
 -0.266690	 -1.778423	  0.099317
 -0.267837	 -1.780113	  0.082215
 -0.268459	 -1.779292	  0.065510
 -0.274476	 -1.776373	  0.034830
 -0.276374	 -1.772550	  0.021338
 -0.277001	 -1.769632	  0.010848
 -0.282692	 -1.764313	 -0.007686
 -0.297163	 -1.762488	 -0.043938
 -0.301047	 -1.759925	 -0.052238
 -0.306784	 -1.751497	 -0.063797
 -0.317455	 -1.739805	 -0.085915
 -0.326399	 -1.740545	 -0.104080
 -0.335896	 -1.745058	 -0.118992
 -0.349568	 -1.745698	 -0.138121
 -0.358831	 -1.750141	 -0.153910
 -0.367984	 -1.755597	 -0.173064
 -0.379392	 -1.756224	 -0.192568
 -0.391045	 -1.754375	 -0.207496
 -0.403531	 -1.750729	 -0.215487
 -0.417844	 -1.735593	 -0.225081
 -0.441015	 -1.720040	 -0.234132
 -0.465448	 -1.719371	 -0.245124
 -0.479481	 -1.723490	 -0.254510
 -0.491458	 -1.722765	 -0.266672
 -0.514653	 -1.722390	 -0.279888
 -0.533159	 -1.726009	 -0.291691
 -0.547482	 -1.730111	 -0.300958
 -0.568953	 -1.732395	 -0.310608
 -0.589809	 -1.743788	 -0.320610
 -0.600020	 -1.760183	 -0.328979
 -0.609054	 -1.773140	 -0.338295
 -0.626421	 -1.781294	 -0.348680
 -0.643030	 -1.787543	 -0.358323
 -0.659880	 -1.792336	 -0.367409
 -0.676792	 -1.793232	 -0.372536
 -0.698475	 -1.793333	 -0.366204
 -0.721449	 -1.800686	 -0.364787
 -0.735509	 -1.809482	 -0.374545
 -0.751856	 -1.821603	 -0.394076
 -0.770066	 -1.830336	 -0.402362
 -0.791649	 -1.836305	 -0.394609
 -0.811404	 -1.839249	 -0.381573
 -0.831909	 -1.842002	 -0.374993
 -0.848641	 -1.850248	 -0.380141
 -0.865931	 -1.855059	 -0.386944
 -0.883960	 -1.850206	 -0.391265
 -0.900936	 -1.841299	 -0.396024
 -0.917759	 -1.830994	 -0.399973
 -0.934936	 -1.821416	 -0.405321
 -0.951640	 -1.813549	 -0.412115
 -0.965776	 -1.805338	 -0.417040
 -0.977334	 -1.792753	 -0.414216
 -0.987610	 -1.773605	 -0.409162
 -0.997407	 -1.754055	 -0.410857
 -1.006375	 -1.738085	 -0.418047
 -1.015501	 -1.722712	 -0.422856
 -1.020742	 -1.704793	 -0.422329
 -1.022568	 -1.685146	 -0.422095
 -1.023014	 -1.665082	 -0.421215
 -1.024321	 -1.645110	 -0.421951
 -1.025480	 -1.625296	 -0.422406
 -1.025946	 -1.606838	 -0.419898
 -1.020460	 -1.590671	 -0.410733
 -1.011983	 -1.576327	 -0.402226
 -1.002639	 -1.561877	 -0.396103
 -0.984391	 -1.541745	 -0.392796
 -0.971480	 -1.524051	 -0.393781
 -0.966082	 -1.511708	 -0.396971
 -0.956432	 -1.493550	 -0.392948
 -0.943066	 -1.470465	 -0.392357
 -0.937669	 -1.445062	 -0.398624
 -0.944111	 -1.425626	 -0.407147
 -0.951029	 -1.407624	 -0.417204
 -0.948867	 -1.388432	 -0.425855
 -0.947106	 -1.371340	 -0.436771
 -0.947757	 -1.356008	 -0.450033
 -0.950629	 -1.341834	 -0.463673
 -0.951398	 -1.328229	 -0.478632
 -0.952391	 -1.315826	 -0.495363
 -0.958419	 -1.307000	 -0.512572
 -0.964426	 -1.301179	 -0.530576
 -0.968030	 -1.297856	 -0.549186
 -0.973562	 -1.296956	 -0.567125
 -0.973353	 -1.307009	 -0.580901
 -0.961965	 -1.321280	 -0.590164
 -0.941513	 -1.328016	 -0.601426
 -0.927697	 -1.325059	 -0.615867
 -0.914235	 -1.329392	 -0.629912
 -0.898773	 -1.338873	 -0.644611
 -0.882930	 -1.352110	 -0.659227
 -0.869532	 -1.361411	 -0.667738
 -0.853637	 -1.368409	 -0.674586
 -0.831624	 -1.368917	 -0.690567
 -0.818770	 -1.366205	 -0.703156
 -0.810769	 -1.366327	 -0.711613
 -0.795154	 -1.370981	 -0.728457
 -0.777535	 -1.362437	 -0.752466
 -0.764656	 -1.361973	 -0.770029
 -0.751057	 -1.366071	 -0.788239
 -0.740192	 -1.369502	 -0.804630
 -0.732323	 -1.370939	 -0.818959
 -0.722614	 -1.370558	 -0.840414
 -0.720054	 -1.369231	 -0.857205
 -0.727323	 -1.368208	 -0.881935
 -0.740074	 -1.368800	 -0.900370
 -0.746339	 -1.371069	 -0.915629
 -0.752432	 -1.376214	 -0.935215
 -0.756335	 -1.378544	 -0.944609
 -0.766162	 -1.382106	 -0.961361
 -0.778079	 -1.384530	 -0.980213
 -0.784787	 -1.384655	 -0.992875
 -0.794175	 -1.382335	 -1.008559
 -0.805525	 -1.376099	 -1.024544
 -0.827430	 -1.366326	 -1.045039
 -0.847860	 -1.360523	 -1.056677
 -0.854170	 -1.359170	 -1.060978
 -0.868343	 -1.358317	 -1.073670
 -0.884091	 -1.357158	 -1.086639
 -0.900572	 -1.353596	 -1.104622
 -0.910743	 -1.344402	 -1.124820
 -0.929280	 -1.337243	 -1.137755
 -0.946021	 -1.337130	 -1.140963
 -0.962259	 -1.340720	 -1.151628
 -0.978410	 -1.344056	 -1.164203
 -0.989736	 -1.354238	 -1.175301
 -0.987842	 -1.361804	 -1.184089
 -0.978140	 -1.368380	 -1.191401
 -0.959132	 -1.376630	 -1.197400
 -0.936713	 -1.382636	 -1.208739
 -0.914563	 -1.383039	 -1.230203
 -0.907614	 -1.381322	 -1.244744
 -0.897780	 -1.381670	 -1.257171
 -0.882988	 -1.381489	 -1.275244
 -0.869510	 -1.378952	 -1.294215
 -0.860194	 -1.382929	 -1.308574
 -0.850310	 -1.386725	 -1.326399
 -0.844265	 -1.389073	 -1.351792
 -0.843028	 -1.392687	 -1.374981
 -0.840217	 -1.394480	 -1.393903
 -0.835151	 -1.396202	 -1.414099
 -0.827292	 -1.397562	 -1.433779
 -0.820916	 -1.399687	 -1.448762
 -0.815872	 -1.401337	 -1.468279
 -0.811522	 -1.400219	 -1.492955
 -0.805796	 -1.395880	 -1.508680
 -0.800063	 -1.386436	 -1.525162
 -0.798443	 -1.381907	 -1.553487
 -0.798341	 -1.385567	 -1.570172
 -0.794697	 -1.392205	 -1.590060
 -0.800243	 -1.398028	 -1.611422
 -0.811342	 -1.400167	 -1.627124
 -0.825340	 -1.397211	 -1.645814
 -0.836647	 -1.394629	 -1.664168
 -0.842997	 -1.390947	 -1.680206
 -0.850673	 -1.384945	 -1.697335
 -0.862851	 -1.382533	 -1.718605
 -0.866570	 -1.378944	 -1.738733
 -0.867679	 -1.374607	 -1.755667
 -0.874655	 -1.372316	 -1.774493
 -0.879058	 -1.371774	 -1.804976
 -0.872378	 -1.365047	 -1.819502
 -0.867301	 -1.360567	 -1.832972
 -0.861669	 -1.350998	 -1.852409
 -0.864727	 -1.351462	 -1.882468
 -0.873020	 -1.351840	 -1.904298
 -0.882272	 -1.348922	 -1.921382
 -0.890764	 -1.343201	 -1.932781
 -0.895446	 -1.333190	 -1.951644
 -0.898214	 -1.328454	 -1.971962
 -0.898256	 -1.322975	 -1.991538
 -0.899210	 -1.319806	 -2.010977
 -0.900095	 -1.316679	 -2.030871
 -0.900161	 -1.312604	 -2.051388
 -0.903945	 -1.311934	 -2.079873
 -0.890646	 -1.281169	 -2.111768
 -0.890700	 -1.278145	 -2.131538
