  2.392911	  0.042024	 -0.744534
  2.394696	  0.019747	 -0.780107
  2.393467	  0.030244	 -0.763128
  2.391924	  0.040648	 -0.746117
  2.390381	  0.051052	 -0.729106
  2.388247	  0.061350	 -0.712094
  2.386114	  0.071647	 -0.695081
  2.383828	  0.081999	 -0.678123
  2.381374	  0.092412	 -0.661224
  2.378918	  0.102825	 -0.644326
  2.376217	  0.113411	 -0.627574
  2.373515	  0.123998	 -0.610822
  2.370577	  0.134570	 -0.594101
  2.367405	  0.145128	 -0.577414
  2.364148	  0.155645	 -0.560717
  2.360031	  0.165728	 -0.543943
  2.355914	  0.175812	 -0.527169
  2.351274	  0.185616	 -0.510365
  2.346378	  0.195279	 -0.493553
  2.341513	  0.205009	 -0.476770
  2.337056	  0.215593	 -0.460396
  2.332598	  0.226177	 -0.444022
  2.328264	  0.236753	 -0.427610
  2.324018	  0.247322	 -0.411170
  2.319542	  0.257041	 -0.394273
  2.314551	  0.264588	 -0.376437
  2.309560	  0.272134	 -0.358600
  2.304213	  0.281369	 -0.341684
  2.298798	  0.290945	 -0.324982
  2.293384	  0.300520	 -0.308279
  2.287486	  0.312008	 -0.293006
  2.281564	  0.323597	 -0.277820
  2.277899	  0.334115	 -0.261209
  2.275995	  0.343678	 -0.243747
  2.273464	  0.353448	 -0.226480
  2.268877	  0.363821	 -0.210007
  2.264291	  0.374194	 -0.193533
  2.262588	  0.385387	 -0.177046
  2.262570	  0.396939	 -0.160720
  2.275801	  0.405928	 -0.148714
  2.292995	  0.412248	 -0.140688
  2.310189	  0.418568	 -0.132662
  2.327384	  0.424888	 -0.124637
  2.344578	  0.431208	 -0.116611
  2.361772	  0.437528	 -0.108585
  2.378966	  0.443847	 -0.100559
  2.396161	  0.450167	 -0.092533
  2.413355	  0.456487	 -0.084508
  2.430549	  0.462807	 -0.076482
  2.447744	  0.469127	 -0.068456
  2.466720	  0.475160	 -0.060729
  2.484926	  0.480226	 -0.054180
