 -2.041432	 -0.512408	 -1.246743
 -2.055661	 -0.499084	 -1.267287
 -2.049264	 -0.513176	 -1.253391
 -2.038650	 -0.525836	 -1.240889
 -2.026797	 -0.534169	 -1.228311
 -2.015966	 -0.546268	 -1.216326
 -2.004667	 -0.561035	 -1.203279
 -1.991710	 -0.566656	 -1.188218
 -1.978123	 -0.569244	 -1.172917
 -1.964901	 -0.571872	 -1.159572
 -1.951946	 -0.582040	 -1.146506
 -1.940589	 -0.594813	 -1.134323
 -1.926038	 -0.602850	 -1.121045
 -1.911330	 -0.606718	 -1.108857
 -1.895945	 -0.609993	 -1.096583
 -1.880999	 -0.616525	 -1.084217
 -1.866638	 -0.623506	 -1.072160
 -1.852279	 -0.630224	 -1.059998
 -1.837839	 -0.636955	 -1.047883
 -1.823502	 -0.643679	 -1.035666
 -1.809198	 -0.650371	 -1.023395
 -1.794894	 -0.657048	 -1.011117
 -1.780977	 -0.664529	 -0.998851
 -1.767167	 -0.672061	 -0.986518
 -1.753513	 -0.679920	 -0.974198
 -1.740092	 -0.688228	 -0.961914
 -1.726641	 -0.696484	 -0.949618
 -1.713599	 -0.703507	 -0.936166
 -1.700756	 -0.710116	 -0.922327
 -1.687936	 -0.716547	 -0.908388
 -1.676158	 -0.721589	 -0.893027
 -1.664445	 -0.726650	 -0.877629
 -1.652989	 -0.731835	 -0.862084
 -1.642575	 -0.737501	 -0.845978
 -1.632202	 -0.743077	 -0.829815
 -1.622165	 -0.748907	 -0.813540
 -1.612738	 -0.755205	 -0.797065
 -1.603302	 -0.761467	 -0.780590
 -1.594344	 -0.768791	 -0.764285
 -1.585768	 -0.776876	 -0.748129
 -1.577245	 -0.785099	 -0.732023
 -1.569648	 -0.796549	 -0.717504
 -1.562286	 -0.808406	 -0.703408
 -1.554903	 -0.819211	 -0.690176
 -1.549807	 -0.835078	 -0.679247
 -1.547473	 -0.861447	 -0.670054
 -1.547981	 -0.880164	 -0.664826
 -1.545552	 -0.896354	 -0.657457
 -1.542827	 -0.916698	 -0.656994
 -1.539088	 -0.942001	 -0.656778
 -1.534162	 -0.959700	 -0.662726
 -1.531279	 -0.977672	 -0.667441
 -1.531418	 -0.997147	 -0.679907
 -1.530286	 -1.016545	 -0.685946
 -1.522590	 -1.039082	 -0.695688
 -1.516455	 -1.049440	 -0.705194
 -1.508698	 -1.064914	 -0.717241
 -1.502652	 -1.084684	 -0.726852
 -1.499736	 -1.102421	 -0.736714
 -1.496634	 -1.118016	 -0.750317
 -1.493300	 -1.129485	 -0.760815
 -1.484257	 -1.149966	 -0.771397
 -1.475750	 -1.166097	 -0.777815
 -1.469117	 -1.185131	 -0.783645
 -1.461623	 -1.200990	 -0.786383
 -1.450571	 -1.217118	 -0.775880
 -1.446384	 -1.221112	 -0.760835
 -1.438889	 -1.215422	 -0.747036
 -1.425339	 -1.196763	 -0.730158
 -1.418921	 -1.193048	 -0.715570
 -1.414430	 -1.189571	 -0.694907
 -1.414313	 -1.187836	 -0.673907
 -1.412697	 -1.182198	 -0.654831
 -1.404986	 -1.177272	 -0.636446
 -1.395075	 -1.173453	 -0.620789
 -1.388726	 -1.161036	 -0.606103
 -1.383317	 -1.143964	 -0.590776
 -1.380158	 -1.131108	 -0.575181
 -1.379240	 -1.122009	 -0.558181
 -1.376228	 -1.111374	 -0.540103
 -1.367806	 -1.102213	 -0.525547
 -1.360476	 -1.094207	 -0.509723
 -1.358002	 -1.085967	 -0.488873
 -1.350582	 -1.078592	 -0.466103
 -1.338758	 -1.072923	 -0.450238
 -1.330732	 -1.068890	 -0.441527
 -1.321349	 -1.058799	 -0.423009
 -1.311320	 -1.053141	 -0.404246
 -1.298647	 -1.054221	 -0.387625
 -1.284737	 -1.057320	 -0.375253
 -1.267432	 -1.067380	 -0.364536
 -1.254149	 -1.077759	 -0.353254
 -1.244267	 -1.080172	 -0.335990
 -1.234481	 -1.081966	 -0.318098
 -1.222873	 -1.091866	 -0.299244
 -1.213572	 -1.101745	 -0.290336
 -1.203040	 -1.110980	 -0.275768
 -1.195220	 -1.117683	 -0.254721
 -1.186754	 -1.123786	 -0.239679
 -1.171804	 -1.133482	 -0.229156
 -1.157871	 -1.145127	 -0.216535
 -1.150189	 -1.150711	 -0.200170
 -1.141761	 -1.154024	 -0.182225
 -1.131086	 -1.162865	 -0.161855
 -1.119744	 -1.172503	 -0.154134
 -1.104633	 -1.182236	 -0.143194
 -1.092710	 -1.191355	 -0.127578
 -1.082598	 -1.198168	 -0.113969
 -1.071854	 -1.204780	 -0.097335
 -1.066345	 -1.211799	 -0.074547
 -1.061305	 -1.216889	 -0.063857
 -1.057259	 -1.222395	 -0.046666
 -1.060003	 -1.226380	 -0.027761
 -1.068096	 -1.224632	 -0.009043
 -1.076261	 -1.216614	  0.009303
 -1.085082	 -1.208535	  0.025084
 -1.089740	 -1.203199	  0.045305
 -1.088798	 -1.201693	  0.063195
 -1.091756	 -1.197247	  0.086332
 -1.096343	 -1.193165	  0.101838
 -1.100183	 -1.187782	  0.120293
 -1.107101	 -1.180787	  0.140883
 -1.115361	 -1.177106	  0.157360
 -1.126252	 -1.172823	  0.173199
 -1.136610	 -1.163993	  0.193913
 -1.141384	 -1.155352	  0.208734
 -1.144373	 -1.148193	  0.227688
 -1.143729	 -1.147676	  0.246729
 -1.142443	 -1.147209	  0.269260
 -1.145846	 -1.144026	  0.292482
 -1.151385	 -1.140564	  0.307163
 -1.154783	 -1.136605	  0.325757
 -1.157079	 -1.133081	  0.347250
 -1.160442	 -1.133751	  0.365952
 -1.162465	 -1.137080	  0.385315
 -1.165458	 -1.137537	  0.400846
 -1.166555	 -1.144033	  0.417191
 -1.164681	 -1.158620	  0.431809
 -1.164957	 -1.179585	  0.438369
 -1.164109	 -1.196930	  0.450178
 -1.156405	 -1.210277	  0.462523
 -1.149321	 -1.228985	  0.471350
 -1.148239	 -1.247958	  0.475904
 -1.147558	 -1.266997	  0.481033
 -1.147238	 -1.289617	  0.490317
 -1.145133	 -1.305907	  0.497219
 -1.144653	 -1.319297	  0.504268
 -1.138834	 -1.340769	  0.517813
 -1.129550	 -1.352607	  0.527196
 -1.121664	 -1.368464	  0.538193
 -1.114865	 -1.390345	  0.547326
 -1.107176	 -1.407583	  0.550944
 -1.104296	 -1.421471	  0.555154
 -1.091089	 -1.438309	  0.560923
 -1.077906	 -1.455540	  0.566664
 -1.072697	 -1.467384	  0.572906
 -1.060256	 -1.480395	  0.579440
 -1.040705	 -1.491318	  0.583821
 -1.023870	 -1.500031	  0.584623
 -1.007071	 -1.506305	  0.583165
 -0.986433	 -1.511197	  0.580670
 -0.966318	 -1.519360	  0.577284
 -0.951503	 -1.525895	  0.573524
 -0.932366	 -1.531903	  0.562472
 -0.915600	 -1.538015	  0.550326
 -0.897637	 -1.545432	  0.540420
 -0.883888	 -1.548560	  0.535354
 -0.864618	 -1.549712	  0.526181
 -0.845987	 -1.551414	  0.523199
 -0.817753	 -1.551166	  0.526674
 -0.800189	 -1.550792	  0.521749
 -0.781912	 -1.551886	  0.519148
 -0.758383	 -1.554661	  0.511677
 -0.738148	 -1.560786	  0.510871
 -0.725836	 -1.563135	  0.516432
 -0.701422	 -1.572179	  0.515393
 -0.684760	 -1.576981	  0.515406
 -0.667504	 -1.582483	  0.516229
 -0.641875	 -1.590280	  0.520526
 -0.623288	 -1.592243	  0.524897
 -0.613686	 -1.594282	  0.532461
 -0.591356	 -1.591836	  0.540237
 -0.571324	 -1.594130	  0.546381
 -0.553895	 -1.598799	  0.555301
 -0.540404	 -1.604373	  0.565569
 -0.523742	 -1.611502	  0.582399
 -0.507180	 -1.616004	  0.594017
 -0.494089	 -1.618799	  0.599944
 -0.470067	 -1.621035	  0.606041
 -0.449906	 -1.623479	  0.619169
 -0.439205	 -1.623666	  0.624686
 -0.424534	 -1.624474	  0.642292
 -0.406921	 -1.628248	  0.652467
 -0.388648	 -1.631591	  0.668634
 -0.371312	 -1.631363	  0.673881
 -0.357892	 -1.628535	  0.683533
 -0.333159	 -1.628110	  0.694468
 -0.315319	 -1.633482	  0.705593
 -0.307049	 -1.636668	  0.716116
 -0.295365	 -1.640121	  0.736239
 -0.284915	 -1.645346	  0.752139
 -0.272111	 -1.651956	  0.767728
 -0.257785	 -1.653983	  0.782767
 -0.242711	 -1.652062	  0.798299
 -0.230553	 -1.651575	  0.812400
 -0.220449	 -1.652503	  0.831652
 -0.215330	 -1.659703	  0.851812
 -0.208747	 -1.665247	  0.870223
 -0.200925	 -1.672805	  0.885999
 -0.192514	 -1.676654	  0.905062
 -0.187834	 -1.684207	  0.924614
 -0.181797	 -1.691229	  0.940924
 -0.174404	 -1.701991	  0.957465
 -0.170122	 -1.712762	  0.975125
 -0.168967	 -1.725812	  0.991828
 -0.164547	 -1.733909	  1.006417
 -0.157131	 -1.738761	  1.026741
 -0.152372	 -1.753302	  1.046458
 -0.149394	 -1.769036	  1.057393
 -0.148881	 -1.782590	  1.067908
 -0.147432	 -1.797077	  1.088303
 -0.141059	 -1.803215	  1.104736
 -0.129165	 -1.810531	  1.120894
 -0.118303	 -1.822675	  1.134087
 -0.113819	 -1.836342	  1.145561
 -0.105564	 -1.854610	  1.155248
 -0.097818	 -1.871250	  1.165915
 -0.090793	 -1.881517	  1.177984
 -0.073696	 -1.893542	  1.192581
 -0.063932	 -1.905137	  1.205344
 -0.059403	 -1.916421	  1.219073
 -0.049624	 -1.925928	  1.231732
 -0.031316	 -1.935926	  1.243601
 -0.020089	 -1.947804	  1.250379
 -0.009444	 -1.963551	  1.261241
  0.004453	 -1.972944	  1.274299
  0.019121	 -1.980068	  1.284144
  0.034767	 -1.990305	  1.292232
  0.052450	 -1.998706	  1.304351
  0.062685	 -2.002779	  1.317783
  0.073697	 -2.008992	  1.335687
  0.088756	 -2.014266	  1.351380
  0.103175	 -2.020348	  1.361192
  0.114148	 -2.029751	  1.371852
  0.129380	 -2.041615	  1.386564
  0.141736	 -2.048624	  1.400643
