  1.117481	  0.942143	 -2.654148
  1.106416	  0.932815	 -2.627870
  1.075980	  0.963501	 -2.599459
  1.036339	  0.990156	 -2.583498
  1.007269	  1.015743	 -2.552322
  0.969265	  1.040369	 -2.531694
  0.931838	  1.063816	 -2.511135
  0.895666	  1.088917	 -2.488395
  0.850508	  1.105252	 -2.471966
  0.810977	  1.131603	 -2.454913
  0.771738	  1.154050	 -2.434851
  0.734289	  1.176972	 -2.415533
  0.696065	  1.201766	 -2.395317
  0.657889	  1.227954	 -2.375312
  0.618850	  1.256090	 -2.354712
  0.581205	  1.284648	 -2.331319
  0.546914	  1.312244	 -2.307135
  0.514844	  1.339126	 -2.285369
  0.479277	  1.363366	 -2.260164
  0.446812	  1.389021	 -2.233067
  0.412594	  1.411528	 -2.205716
  0.372588	  1.427702	 -2.182228
  0.331213	  1.449137	 -2.164627
  0.294446	  1.471119	 -2.141011
  0.256597	  1.492193	 -2.116928
  0.218183	  1.518647	 -2.092660
  0.184316	  1.549544	 -2.072174
  0.149069	  1.574577	 -2.053887
  0.116217	  1.607396	 -2.033266
  0.075927	  1.635719	 -2.012987
  0.037542	  1.661924	 -1.993077
  0.000566	  1.688386	 -1.973536
 -0.035531	  1.716272	 -1.953311
 -0.069884	  1.744543	 -1.932079
 -0.102271	  1.772479	 -1.910488
 -0.134018	  1.800512	 -1.888362
 -0.165969	  1.828699	 -1.865251
 -0.197014	  1.855772	 -1.841709
 -0.230078	  1.883499	 -1.815203
 -0.262829	  1.909515	 -1.788565
 -0.295337	  1.935849	 -1.761997
 -0.330937	  1.962800	 -1.736729
 -0.369838	  1.988824	 -1.713482
 -0.409441	  2.012359	 -1.693143
 -0.448066	  2.033725	 -1.675701
 -0.489958	  2.057536	 -1.658496
 -0.532957	  2.081297	 -1.643073
 -0.575039	  2.100930	 -1.626463
 -0.618375	  2.121461	 -1.610020
 -0.654966	  2.146108	 -1.587396
 -0.689777	  2.169033	 -1.566095
 -0.725936	  2.193682	 -1.543639
 -0.763518	  2.220961	 -1.517986
 -0.799105	  2.248449	 -1.491498
 -0.832571	  2.276103	 -1.465625
 -0.864799	  2.303677	 -1.440349
 -0.897765	  2.329620	 -1.414927
 -0.935557	  2.352387	 -1.391186
 -0.974540	  2.370871	 -1.371693
 -1.013288	  2.390300	 -1.353062
 -1.055277	  2.409027	 -1.334994
 -1.093731	  2.432089	 -1.308908
 -1.134429	  2.457777	 -1.293214
 -1.145773	  2.482355	 -1.306146
