  0.283390	 -2.186958	  1.004333
  0.316566	 -2.208101	  1.014347
  0.349742	 -2.229244	  1.024361
  0.328098	 -2.215806	  1.034126
  0.312799	 -2.209098	  1.034327
  0.294525	 -2.201845	  1.028545
  0.275228	 -2.191366	  1.023126
  0.260354	 -2.182891	  1.016829
  0.244049	 -2.172676	  1.006849
  0.229430	 -2.157505	  0.994866
  0.218073	 -2.142544	  0.984433
  0.208189	 -2.128002	  0.975154
  0.197955	 -2.112827	  0.965755
  0.186311	 -2.098488	  0.957394
  0.172127	 -2.085984	  0.950138
  0.156233	 -2.076271	  0.943566
  0.139919	 -2.068530	  0.935529
  0.123578	 -2.060486	  0.926119
  0.107063	 -2.051426	  0.917977
  0.091437	 -2.042519	  0.912977
  0.071361	 -2.025429	  0.910728
  0.058560	 -2.009590	  0.910747
  0.049056	 -1.997069	  0.909428
  0.034234	 -1.984087	  0.904305
  0.017823	 -1.972931	  0.898506
  0.003017	 -1.960117	  0.894305
 -0.013307	 -1.946556	  0.894823
 -0.030628	 -1.933791	  0.897506
 -0.047632	 -1.913098	  0.898997
 -0.059877	 -1.896603	  0.898105
 -0.071921	 -1.885065	  0.898296
 -0.085570	 -1.879373	  0.899363
 -0.108009	 -1.874555	  0.892185
 -0.126880	 -1.866484	  0.885215
 -0.143883	 -1.854781	  0.884784
 -0.163405	 -1.840094	  0.887222
 -0.181384	 -1.831180	  0.888679
 -0.199364	 -1.826195	  0.890263
 -0.218278	 -1.819919	  0.892554
 -0.235995	 -1.811320	  0.893605
 -0.251176	 -1.801777	  0.892431
 -0.267902	 -1.789624	  0.890594
 -0.285455	 -1.776121	  0.889886
 -0.312073	 -1.762622	  0.889365
 -0.316617	 -1.762241	  0.889145
 -0.339930	 -1.759521	  0.890638
 -0.373253	 -1.757602	  0.890351
 -0.389388	 -1.757366	  0.886645
 -0.407681	 -1.751459	  0.878579
 -0.425547	 -1.748741	  0.870764
 -0.442654	 -1.748808	  0.859925
 -0.463263	 -1.744112	  0.847560
 -0.480263	 -1.735385	  0.836350
 -0.491977	 -1.727096	  0.830264
 -0.513879	 -1.714141	  0.817127
 -0.525969	 -1.706636	  0.812448
 -0.542271	 -1.699378	  0.809997
 -0.559259	 -1.688170	  0.805039
 -0.577086	 -1.679330	  0.801074
 -0.598653	 -1.674612	  0.797993
 -0.611662	 -1.669996	  0.796651
 -0.630416	 -1.660025	  0.794188
 -0.659319	 -1.654009	  0.790278
 -0.675503	 -1.651115	  0.786906
 -0.694972	 -1.642953	  0.784926
 -0.711758	 -1.637306	  0.782361
 -0.730861	 -1.632275	  0.782419
 -0.754926	 -1.625552	  0.781345
 -0.769197	 -1.614460	  0.778409
 -0.781581	 -1.597836	  0.775842
 -0.806328	 -1.579465	  0.777859
 -0.813287	 -1.570178	  0.771520
 -0.831975	 -1.559929	  0.766829
 -0.840269	 -1.550452	  0.765432
 -0.860234	 -1.537322	  0.760461
 -0.872988	 -1.526433	  0.762156
 -0.890794	 -1.507968	  0.766144
 -0.901291	 -1.496878	  0.766397
 -0.921399	 -1.480266	  0.757738
 -0.934020	 -1.468906	  0.753302
 -0.949558	 -1.458166	  0.749738
 -0.973956	 -1.443729	  0.743388
 -0.985062	 -1.437997	  0.740383
 -0.999503	 -1.432964	  0.736523
 -1.023917	 -1.424273	  0.736571
 -1.042834	 -1.417677	  0.737758
 -1.064763	 -1.409163	  0.734414
 -1.078440	 -1.404578	  0.731051
 -1.098187	 -1.393015	  0.732050
 -1.115125	 -1.374074	  0.732072
 -1.126881	 -1.364569	  0.729911
 -1.144231	 -1.363083	  0.724708
 -1.170180	 -1.363300	  0.718140
 -1.191824	 -1.359799	  0.712044
 -1.206408	 -1.354689	  0.704798
 -1.228713	 -1.344032	  0.690298
 -1.240563	 -1.335434	  0.678621
 -1.251306	 -1.329909	  0.668295
 -1.268504	 -1.321452	  0.650599
 -1.284246	 -1.313368	  0.635891
 -1.297623	 -1.305068	  0.627648
 -1.313265	 -1.298065	  0.619953
 -1.329796	 -1.288800	  0.611426
 -1.347111	 -1.275501	  0.603619
 -1.362881	 -1.261459	  0.596325
 -1.368786	 -1.254040	  0.590961
 -1.382378	 -1.232327	  0.574137
 -1.391543	 -1.216255	  0.560785
 -1.395215	 -1.212155	  0.556348
 -1.414420	 -1.195257	  0.540459
 -1.429971	 -1.184219	  0.528425
 -1.438844	 -1.175793	  0.525485
 -1.455102	 -1.159927	  0.516404
 -1.473355	 -1.143707	  0.507754
 -1.480553	 -1.136228	  0.504966
 -1.493646	 -1.122198	  0.494016
 -1.506659	 -1.108166	  0.484329
 -1.520406	 -1.092418	  0.478458
 -1.536633	 -1.074127	  0.471849
 -1.553454	 -1.059624	  0.470169
 -1.567310	 -1.053176	  0.470362
 -1.586173	 -1.045899	  0.470931
 -1.606725	 -1.040474	  0.469490
 -1.634719	 -1.032322	  0.466765
 -1.645886	 -1.029263	  0.466503
 -1.666798	 -1.024718	  0.466242
 -1.689139	 -1.017908	  0.468699
 -1.706363	 -1.011262	  0.471504
 -1.727929	 -1.000858	  0.473453
 -1.746604	 -0.993778	  0.470953
 -1.762448	 -0.988912	  0.466178
 -1.779690	 -0.985275	  0.459193
 -1.794674	 -0.979588	  0.454085
 -1.816579	 -0.969971	  0.447319
 -1.835485	 -0.962241	  0.442898
 -1.852856	 -0.954716	  0.439283
 -1.875182	 -0.941802	  0.433840
 -1.891284	 -0.928325	  0.429560
 -1.898861	 -0.920724	  0.427019
 -1.915978	 -0.913910	  0.416358
 -1.936488	 -0.908132	  0.406971
 -1.953947	 -0.900314	  0.399275
 -1.969590	 -0.890110	  0.392036
 -1.985304	 -0.880262	  0.384230
 -2.001265	 -0.870254	  0.376921
 -2.017679	 -0.859769	  0.371123
 -2.033517	 -0.848379	  0.366980
 -2.049456	 -0.837118	  0.362313
 -2.064947	 -0.824998	  0.358363
 -2.080352	 -0.813080	  0.354250
 -2.096169	 -0.804066	  0.352799
 -2.117374	 -0.797368	  0.356744
 -2.134849	 -0.784922	  0.354949
 -2.144786	 -0.766741	  0.345087
 -2.156931	 -0.748098	  0.338082
 -2.171914	 -0.735239	  0.336953
 -2.186166	 -0.727063	  0.339178
 -2.208151	 -0.716114	  0.343399
 -2.224793	 -0.704375	  0.342594
 -2.238076	 -0.692542	  0.338964
 -2.253499	 -0.677619	  0.333354
 -2.265350	 -0.665736	  0.328640
 -2.280715	 -0.651191	  0.323555
 -2.302089	 -0.636624	  0.324046
 -2.312984	 -0.630589	  0.326115
 -2.334385	 -0.618616	  0.329340
 -2.350362	 -0.606562	  0.329017
 -2.360565	 -0.593500	  0.324410
 -2.378777	 -0.576696	  0.320323
 -2.395950	 -0.569732	  0.322199
 -2.411648	 -0.557545	  0.319954
 -2.427346	 -0.545358	  0.317709
