  1.540358	 -1.693999	 -0.684027
  1.540055	 -1.702596	 -0.678099
  1.535553	 -1.691503	 -0.695399
  1.535097	 -1.675056	 -0.709742
  1.540169	 -1.660443	 -0.723806
  1.546764	 -1.643693	 -0.734066
  1.546724	 -1.627437	 -0.742891
  1.543738	 -1.610983	 -0.754805
  1.539573	 -1.594731	 -0.765656
  1.537727	 -1.576661	 -0.776820
  1.537768	 -1.560619	 -0.788173
  1.539617	 -1.543884	 -0.801005
  1.541828	 -1.529601	 -0.815022
  1.544075	 -1.515696	 -0.827741
  1.542502	 -1.499383	 -0.838689
  1.536783	 -1.482541	 -0.849923
  1.532582	 -1.469002	 -0.865605
  1.533077	 -1.456537	 -0.880675
  1.533270	 -1.442658	 -0.894261
  1.528212	 -1.427795	 -0.909126
  1.524206	 -1.416480	 -0.926055
  1.526240	 -1.406316	 -0.941900
  1.526364	 -1.392392	 -0.954930
  1.519416	 -1.376608	 -0.970760
  1.514968	 -1.366529	 -0.988192
  1.517027	 -1.355838	 -1.001706
  1.516367	 -1.340485	 -1.012391
  1.508388	 -1.322362	 -1.025554
  1.500010	 -1.309485	 -1.042627
  1.496716	 -1.298586	 -1.060467
  1.496907	 -1.287808	 -1.074278
  1.497209	 -1.272022	 -1.089489
  1.495923	 -1.251989	 -1.103252
  1.495573	 -1.236411	 -1.106500
  1.494145	 -1.219002	 -1.118838
  1.491762	 -1.199198	 -1.129354
  1.489612	 -1.182861	 -1.136861
  1.487021	 -1.167466	 -1.148174
  1.483944	 -1.149315	 -1.161102
  1.481146	 -1.133209	 -1.170501
  1.478294	 -1.117105	 -1.179084
  1.475259	 -1.099110	 -1.190050
  1.472158	 -1.081809	 -1.198868
  1.467268	 -1.063922	 -1.206495
  1.462307	 -1.044722	 -1.214309
  1.462272	 -1.024485	 -1.224645
  1.465112	 -1.011863	 -1.239458
  1.463883	 -1.000886	 -1.252795
  1.463946	 -0.982229	 -1.269078
  1.465515	 -0.965598	 -1.280246
  1.464733	 -0.953620	 -1.290938
  1.466053	 -0.939252	 -1.308104
  1.466315	 -0.922287	 -1.318970
  1.465001	 -0.904641	 -1.328406
  1.465663	 -0.888427	 -1.341111
  1.466141	 -0.874158	 -1.353908
  1.464695	 -0.855884	 -1.364283
  1.467184	 -0.838087	 -1.377565
  1.469723	 -0.829767	 -1.391776
  1.472998	 -0.817175	 -1.408764
  1.476189	 -0.798297	 -1.420817
  1.473052	 -0.778558	 -1.430071
  1.470887	 -0.766327	 -1.442847
  1.470930	 -0.751327	 -1.456523
  1.469317	 -0.732860	 -1.465999
  1.466949	 -0.717549	 -1.477934
  1.466555	 -0.703296	 -1.494551
  1.464094	 -0.686131	 -1.504250
  1.460821	 -0.666015	 -1.506496
  1.457484	 -0.643882	 -1.512331
  1.453720	 -0.628555	 -1.525307
  1.452271	 -0.617475	 -1.536002
  1.447538	 -0.597434	 -1.546224
  1.442581	 -0.580870	 -1.558750
  1.442408	 -0.567424	 -1.572078
  1.440402	 -0.549948	 -1.583616
  1.435387	 -0.532931	 -1.593218
  1.434642	 -0.515859	 -1.604546
  1.436919	 -0.498261	 -1.614390
  1.438251	 -0.478285	 -1.619697
  1.436123	 -0.458755	 -1.626305
  1.433843	 -0.441225	 -1.637914
  1.428196	 -0.429428	 -1.651490
  1.423850	 -0.413106	 -1.663944
  1.422627	 -0.395374	 -1.673482
  1.423346	 -0.376208	 -1.680865
  1.423309	 -0.358256	 -1.692358
  1.421381	 -0.343505	 -1.705277
  1.417327	 -0.329620	 -1.719014
  1.414112	 -0.313949	 -1.731379
  1.412027	 -0.297601	 -1.742746
  1.409876	 -0.280210	 -1.752513
  1.407738	 -0.262950	 -1.762886
  1.403405	 -0.247827	 -1.775156
  1.398869	 -0.232335	 -1.787079
  1.394887	 -0.216329	 -1.798462
  1.390047	 -0.201238	 -1.810661
  1.385207	 -0.186145	 -1.822859
  1.380088	 -0.171335	 -1.835287
  1.374479	 -0.157044	 -1.848106
  1.368872	 -0.142753	 -1.860924
  1.363511	 -0.128519	 -1.873911
  1.358238	 -0.114307	 -1.886958
  1.353062	 -0.100073	 -1.900020
  1.349140	 -0.085605	 -1.913260
  1.345217	 -0.071138	 -1.926500
  1.341668	 -0.056712	 -1.939890
  1.339019	 -0.042413	 -1.953620
  1.336369	 -0.028114	 -1.967350
  1.333718	 -0.013807	 -1.981087
  1.330907	  0.001546	 -1.995854
  1.326379	  0.031182	 -2.024994
  1.324254	  0.045349	 -2.038951
