 0.0 0.0 0.0 0
 -0.20949596179963376 0.9524353677418339 0.21937937976055147 1000
 0.8021060934591047 0.22398024392030297 0.5534443650170954 1000
 0.6225587351587303 0.6770022681006966 0.39154380376156467 1000
 0.2806999572501867 0.2310245863756511 -0.9315391427576744 1000
 -0.06123398126028412 -0.9346843700793956 -0.3486782583819912 1000
 0.09633560473559502 -0.4986726987301058 0.8613773800149738 1000
 0.07042834560391151 0.7896616042548967 -0.6098257119055239 1000
 0.8808569018224788 0.39661269312541614 -0.25873440081193033 1000
 0.0 0.0 0.0 0
 -0.6533707866274614 -0.2318768882583182 -0.7205863750262365 1000
 0.8878095824556032 -0.3761325183023092 -0.2634776536550505 1000
 0.49928539932413113 -0.06925016674243699 0.8637757257690724 1000
 -0.6431579627017167 0.00879783867242824 0.7656855967354169 1000
