  0.084488	 -2.093146	 -1.238652
  0.081587	 -2.111468	 -1.260030
  0.078686	 -2.129790	 -1.281408
  0.080735	 -2.116843	 -1.266302
  0.083713	 -2.104028	 -1.251239
  0.086754	 -2.091222	 -1.236181
  0.089381	 -2.078654	 -1.220846
  0.090592	 -2.066964	 -1.204663
  0.091804	 -2.055274	 -1.188481
  0.092923	 -2.043839	 -1.172110
  0.093866	 -2.032894	 -1.155398
  0.094809	 -2.021949	 -1.138685
  0.095688	 -2.011394	 -1.121720
  0.096535	 -2.001028	 -1.104637
  0.097363	 -1.990701	 -1.087529
  0.098011	 -1.980733	 -1.070202
  0.098660	 -1.970765	 -1.052880
  0.100104	 -1.960860	 -1.035825
  0.102532	 -1.950484	 -1.018874
  0.102913	 -1.939668	 -1.001557
  0.099449	 -1.928614	 -0.984368
  0.095262	 -1.921782	 -0.964554
  0.096828	 -1.915989	 -0.947047
  0.097302	 -1.906360	 -0.928889
  0.094747	 -1.896337	 -0.911203
  0.092442	 -1.889063	 -0.892529
  0.092908	 -1.882904	 -0.873792
  0.091051	 -1.874872	 -0.855296
  0.088300	 -1.865607	 -0.837831
  0.087013	 -1.857170	 -0.819965
  0.085904	 -1.849778	 -0.800571
  0.081358	 -1.840552	 -0.782492
  0.078884	 -1.827518	 -0.768825
  0.078342	 -1.813260	 -0.754242
  0.075342	 -1.799422	 -0.738529
  0.073112	 -1.788975	 -0.721861
  0.075790	 -1.778766	 -0.705358
  0.077188	 -1.767901	 -0.687797
  0.076518	 -1.755828	 -0.671649
  0.076570	 -1.742325	 -0.657585
  0.078692	 -1.728399	 -0.642951
  0.078492	 -1.714489	 -0.627803
  0.074032	 -1.704120	 -0.609977
  0.074324	 -1.692889	 -0.594311
  0.078501	 -1.680686	 -0.579913
  0.081096	 -1.668001	 -0.561708
  0.079491	 -1.659078	 -0.542265
  0.080373	 -1.648746	 -0.528358
  0.082397	 -1.635990	 -0.512442
  0.082767	 -1.624200	 -0.495510
  0.079470	 -1.611505	 -0.480998
  0.075321	 -1.598299	 -0.466194
  0.074893	 -1.587415	 -0.449001
  0.074502	 -1.573854	 -0.430804
  0.067753	 -1.561427	 -0.419260
  0.062544	 -1.551726	 -0.402983
  0.060183	 -1.541794	 -0.385783
  0.057928	 -1.530501	 -0.369423
  0.051885	 -1.519757	 -0.350503
  0.047323	 -1.509154	 -0.336517
  0.045473	 -1.498201	 -0.319375
  0.042620	 -1.488686	 -0.301099
  0.037780	 -1.477525	 -0.286149
  0.033465	 -1.466159	 -0.270553
  0.029903	 -1.456775	 -0.252230
  0.024370	 -1.447884	 -0.235696
  0.023643	 -1.435657	 -0.216626
  0.027958	 -1.426718	 -0.200163
  0.034927	 -1.418072	 -0.182729
  0.035290	 -1.412161	 -0.162069
  0.031547	 -1.404445	 -0.144505
  0.031223	 -1.394050	 -0.126354
  0.035305	 -1.382851	 -0.111966
  0.035127	 -1.371872	 -0.093711
  0.030968	 -1.364919	 -0.074562
  0.031600	 -1.356908	 -0.057978
  0.033785	 -1.344563	 -0.039340
  0.033708	 -1.335026	 -0.020023
  0.033379	 -1.327025	 -0.002411
  0.034463	 -1.316661	  0.010241
  0.037257	 -1.302641	  0.028605
  0.033404	 -1.291794	  0.044423
  0.032442	 -1.281387	  0.060512
  0.035271	 -1.271113	  0.079012
  0.032099	 -1.259960	  0.096405
  0.029643	 -1.246634	  0.110179
  0.031462	 -1.231052	  0.124058
  0.033254	 -1.219073	  0.139801
  0.032049	 -1.208946	  0.158151
  0.032309	 -1.197355	  0.174545
  0.032822	 -1.184985	  0.189820
  0.032823	 -1.177201	  0.208546
  0.029970	 -1.172112	  0.226990
  0.029841	 -1.165159	  0.247575
  0.034118	 -1.155536	  0.265360
  0.034917	 -1.146459	  0.282623
  0.033281	 -1.136318	  0.299859
  0.033586	 -1.124194	  0.319336
  0.034686	 -1.111355	  0.334739
  0.035037	 -1.094960	  0.343421
  0.038352	 -1.076225	  0.356372
  0.042742	 -1.061241	  0.370932
  0.041015	 -1.049753	  0.382876
  0.038569	 -1.036098	  0.399126
  0.038759	 -1.021431	  0.413432
  0.039230	 -1.007392	  0.426910
  0.039437	 -0.993816	  0.440718
  0.040793	 -0.981040	  0.456321
  0.042919	 -0.970635	  0.472254
  0.044449	 -0.962032	  0.490765
  0.045856	 -0.951380	  0.507766
  0.047360	 -0.939720	  0.524277
  0.048442	 -0.926569	  0.539606
  0.047488	 -0.913135	  0.554607
  0.048019	 -0.900233	  0.569762
  0.046411	 -0.886972	  0.584985
  0.044984	 -0.873837	  0.599852
  0.042593	 -0.861725	  0.615991
  0.040190	 -0.850632	  0.632050
  0.035431	 -0.838471	  0.648034
  0.031444	 -0.824965	  0.661661
  0.027500	 -0.807000	  0.673112
  0.022736	 -0.791693	  0.686625
  0.018461	 -0.781937	  0.704147
  0.017355	 -0.774990	  0.721926
  0.017509	 -0.762498	  0.739989
  0.017404	 -0.745819	  0.752639
  0.016032	 -0.729130	  0.764380
  0.015768	 -0.718311	  0.780807
  0.018462	 -0.709716	  0.799355
  0.020921	 -0.703032	  0.819317
  0.020317	 -0.693766	  0.838182
  0.016782	 -0.679226	  0.850990
  0.015014	 -0.662716	  0.865698
  0.017454	 -0.650151	  0.881880
  0.019193	 -0.638031	  0.895602
  0.019987	 -0.626535	  0.912410
  0.021115	 -0.618537	  0.930847
  0.022792	 -0.610049	  0.949870
  0.021352	 -0.603558	  0.969179
  0.019613	 -0.596483	  0.988074
  0.015761	 -0.588913	  1.007029
  0.011466	 -0.582725	  1.025441
  0.005753	 -0.575692	  1.043434
 -0.000955	 -0.567639	  1.059616
 -0.005134	 -0.554953	  1.077488
 -0.005934	 -0.545651	  1.096528
 -0.007661	 -0.535000	  1.110395
 -0.011213	 -0.527629	  1.128950
 -0.014823	 -0.514700	  1.145698
 -0.020056	 -0.499689	  1.159232
 -0.028404	 -0.489039	  1.175918
 -0.033556	 -0.479868	  1.193388
 -0.037721	 -0.472679	  1.208588
 -0.042855	 -0.463154	  1.225998
 -0.045582	 -0.452188	  1.243688
 -0.046930	 -0.439986	  1.258998
 -0.049644	 -0.427405	  1.274865
 -0.052144	 -0.415291	  1.290763
 -0.055002	 -0.404105	  1.306861
 -0.057780	 -0.395550	  1.324176
 -0.061895	 -0.386405	  1.340966
 -0.066398	 -0.375385	  1.359177
 -0.067160	 -0.361944	  1.378229
 -0.064689	 -0.353292	  1.394508
 -0.063029	 -0.342111	  1.407352
 -0.061386	 -0.331230	  1.426614
 -0.061747	 -0.323754	  1.444315
 -0.065117	 -0.313707	  1.460095
 -0.063725	 -0.302369	  1.481675
 -0.061891	 -0.296759	  1.496423
 -0.062536	 -0.289706	  1.515564
 -0.059653	 -0.279056	  1.536680
 -0.057922	 -0.265903	  1.548417
 -0.055754	 -0.248305	  1.561341
 -0.054620	 -0.234392	  1.578576
 -0.046961	 -0.220145	  1.589439
 -0.039690	 -0.203613	  1.594864
 -0.037710	 -0.193286	  1.616435
 -0.038296	 -0.181993	  1.632841
 -0.038203	 -0.162840	  1.641233
 -0.033560	 -0.141397	  1.649037
 -0.028935	 -0.128692	  1.662615
 -0.027930	 -0.120820	  1.682293
 -0.024910	 -0.109407	  1.698726
 -0.021059	 -0.095385	  1.713962
 -0.023172	 -0.084056	  1.728357
 -0.025895	 -0.074597	  1.746423
 -0.029167	 -0.065709	  1.764542
 -0.030740	 -0.057157	  1.782835
 -0.031009	 -0.049668	  1.801450
 -0.030983	 -0.043853	  1.820541
 -0.031567	 -0.039252	  1.840103
 -0.033004	 -0.032538	  1.859124
 -0.036347	 -0.023304	  1.876970
 -0.040871	 -0.012127	  1.893256
 -0.046997	 -0.000422	  1.907158
 -0.050091	  0.012208	  1.921071
 -0.055186	  0.027183	  1.937844
 -0.061501	  0.037092	  1.953559
 -0.064176	  0.053865	  1.965231
 -0.068810	  0.068649	  1.977820
 -0.076266	  0.078691	  1.992741
 -0.084024	  0.091060	  2.007223
 -0.084479	  0.110095	  2.019869
 -0.086725	  0.123686	  2.034588
 -0.090132	  0.131197	  2.050789
 -0.092034	  0.144431	  2.067209
 -0.091762	  0.159069	  2.081369
 -0.091897	  0.171867	  2.096684
 -0.093319	  0.184104	  2.112708
 -0.092645	  0.194528	  2.129762
 -0.091799	  0.204817	  2.146891
 -0.091081	  0.214482	  2.164386
 -0.090729	  0.222337	  2.182776
 -0.090374	  0.230195	  2.201165
 -0.090942	  0.237940	  2.219595
 -0.092228	  0.245587	  2.238031
 -0.093615	  0.253478	  2.256356
 -0.095636	  0.262901	  2.273880
 -0.097658	  0.272331	  2.291401
 -0.099778	  0.283642	  2.307746
 -0.102216	  0.295390	  2.323765
 -0.104811	  0.307366	  2.339336
 -0.107514	  0.319477	  2.355377
 -0.110618	  0.332030	  2.370824
 -0.113780	  0.347092	  2.384418
 -0.112512	  0.364589	  2.396966
 -0.110547	  0.378884	  2.409717
 -0.112708	  0.393179	  2.424807
 -0.105262	  0.423565	  2.461608
 -0.104828	  0.425336	  2.463753
