 -1.917608	 -1.188624	  0.746123
 -1.960252	 -1.187769	  0.760890
 -1.942280	 -1.192837	  0.753093
 -1.927182	 -1.192801	  0.746193
 -1.910814	 -1.188596	  0.738052
 -1.879099	 -1.185192	  0.727078
 -1.863703	 -1.188066	  0.719739
 -1.853035	 -1.190987	  0.713335
 -1.835006	 -1.195758	  0.702348
 -1.818943	 -1.199662	  0.692463
 -1.802627	 -1.201975	  0.682533
 -1.780203	 -1.204190	  0.670412
 -1.763118	 -1.206551	  0.663588
 -1.743100	 -1.208079	  0.656790
 -1.727851	 -1.206562	  0.651631
 -1.716060	 -1.203794	  0.645528
 -1.684093	 -1.196954	  0.631191
 -1.665706	 -1.193904	  0.621008
 -1.653269	 -1.192426	  0.617725
 -1.634613	 -1.193075	  0.612540
 -1.613358	 -1.191634	  0.600283
 -1.598090	 -1.189333	  0.590784
 -1.576051	 -1.184248	  0.580115
 -1.563823	 -1.179275	  0.573965
 -1.547036	 -1.173154	  0.563299
 -1.528362	 -1.165999	  0.556614
 -1.510846	 -1.158843	  0.550818
 -1.494644	 -1.152917	  0.543694
 -1.473971	 -1.147725	  0.536720
 -1.456444	 -1.140730	  0.530809
 -1.440228	 -1.132900	  0.520525
 -1.427385	 -1.126925	  0.510405
 -1.409355	 -1.114802	  0.495989
 -1.398090	 -1.107479	  0.489404
 -1.377542	 -1.095766	  0.479554
 -1.359427	 -1.088251	  0.470742
 -1.345281	 -1.084665	  0.466437
 -1.321354	 -1.080823	  0.464697
 -1.301824	 -1.072278	  0.461842
 -1.291037	 -1.063613	  0.450774
 -1.280345	 -1.049989	  0.436750
 -1.267032	 -1.038567	  0.427816
 -1.247373	 -1.032193	  0.425504
 -1.228418	 -1.023160	  0.420440
 -1.214630	 -1.011204	  0.405083
 -1.200726	 -1.001939	  0.389137
 -1.187863	 -0.994736	  0.380672
 -1.172224	 -0.986881	  0.372445
 -1.157170	 -0.977594	  0.365590
 -1.141974	 -0.963879	  0.360255
 -1.131751	 -0.949165	  0.358300
 -1.117553	 -0.933123	  0.354724
 -1.098812	 -0.920805	  0.350240
 -1.078749	 -0.912749	  0.347407
 -1.059248	 -0.906888	  0.349009
 -1.041655	 -0.901849	  0.353367
 -1.021876	 -0.896848	  0.354199
 -0.997626	 -0.886039	  0.351901
 -0.983147	 -0.876135	  0.352739
 -0.972805	 -0.867541	  0.355512
 -0.961637	 -0.859741	  0.356645
 -0.942758	 -0.843009	  0.356719
 -0.925139	 -0.822527	  0.358250
 -0.915918	 -0.810908	  0.359309
 -0.900887	 -0.797479	  0.362962
 -0.865442	 -0.789832	  0.359028
 -0.851958	 -0.787883	  0.355432
 -0.836049	 -0.785583	  0.351930
 -0.808853	 -0.781393	  0.345686
 -0.793187	 -0.776412	  0.343953
 -0.780658	 -0.768736	  0.345271
 -0.760606	 -0.755719	  0.350123
 -0.744572	 -0.746261	  0.354435
 -0.724251	 -0.730036	  0.359854
 -0.705569	 -0.715828	  0.361463
 -0.695358	 -0.709429	  0.361585
 -0.676433	 -0.702756	  0.360389
 -0.652364	 -0.697490	  0.357955
 -0.633714	 -0.698486	  0.351232
 -0.618520	 -0.698900	  0.345048
 -0.597935	 -0.691462	  0.343502
 -0.565736	 -0.687374	  0.340746
 -0.549969	 -0.688218	  0.336995
 -0.536323	 -0.690437	  0.332995
 -0.514804	 -0.692950	  0.325445
 -0.495472	 -0.694242	  0.318297
 -0.477939	 -0.696636	  0.310811
 -0.459582	 -0.699157	  0.302335
 -0.440813	 -0.701813	  0.293596
 -0.424789	 -0.705119	  0.285300
 -0.409196	 -0.711549	  0.276116
 -0.391422	 -0.721330	  0.267049
 -0.374434	 -0.727872	  0.259697
 -0.353275	 -0.734128	  0.253407
 -0.338588	 -0.738939	  0.249008
 -0.323459	 -0.747556	  0.240945
 -0.306675	 -0.757069	  0.230066
 -0.287838	 -0.764362	  0.215563
 -0.281458	 -0.766842	  0.212730
 -0.262450	 -0.776532	  0.201657
 -0.234132	 -0.784359	  0.186888
 -0.223248	 -0.786846	  0.180693
 -0.211992	 -0.790627	  0.173119
 -0.194131	 -0.797737	  0.161208
 -0.177236	 -0.803829	  0.151336
 -0.158175	 -0.810605	  0.140314
 -0.140698	 -0.814371	  0.130845
 -0.128443	 -0.817017	  0.126296
 -0.106368	 -0.820502	  0.118422
 -0.086223	 -0.822484	  0.104105
 -0.074503	 -0.826991	  0.094691
 -0.058440	 -0.831356	  0.076095
 -0.047487	 -0.833757	  0.062746
 -0.033277	 -0.836242	  0.051555
 -0.016804	 -0.837776	  0.039876
  0.003041	 -0.841133	  0.029339
  0.020257	 -0.844618	  0.020647
  0.037314	 -0.848173	  0.009728
  0.052533	 -0.852204	 -0.000382
  0.074023	 -0.854782	 -0.008989
  0.094924	 -0.855903	 -0.018739
  0.110802	 -0.858640	 -0.029031
  0.123014	 -0.860477	 -0.037086
  0.140583	 -0.862471	 -0.051179
  0.155631	 -0.856375	 -0.066253
  0.167271	 -0.849343	 -0.081967
  0.181945	 -0.843282	 -0.095465
  0.194707	 -0.834287	 -0.108835
  0.205477	 -0.825470	 -0.123329
  0.214335	 -0.816917	 -0.139143
  0.222461	 -0.809039	 -0.155646
  0.229856	 -0.801996	 -0.172846
  0.237203	 -0.794983	 -0.190075
  0.244642	 -0.788591	 -0.207504
  0.252181	 -0.783459	 -0.225303
  0.259747	 -0.778348	 -0.243096
  0.267303	 -0.773255	 -0.260899
  0.275266	 -0.768912	 -0.278721
  0.283812	 -0.765720	 -0.296517
  0.292369	 -0.762555	 -0.314315
  0.300923	 -0.759372	 -0.332104
  0.309201	 -0.755964	 -0.349976
  0.317671	 -0.753224	 -0.367964
  0.325964	 -0.750374	 -0.386006
  0.334697	 -0.748265	 -0.403954
  0.343695	 -0.746994	 -0.421862
  0.352476	 -0.745734	 -0.439945
  0.361498	 -0.744733	 -0.457950
  0.371277	 -0.743925	 -0.475634
  0.381560	 -0.742718	 -0.492884
  0.393469	 -0.741521	 -0.509564
  0.407483	 -0.742653	 -0.523390
  0.419167	 -0.744978	 -0.535753
  0.431831	 -0.747677	 -0.559076
  0.443513	 -0.745824	 -0.576262
  0.452905	 -0.742703	 -0.589949
  0.462984	 -0.738833	 -0.604977
  0.475643	 -0.736759	 -0.620415
  0.494984	 -0.739616	 -0.638922
  0.509447	 -0.743623	 -0.650575
  0.521750	 -0.745390	 -0.661069
  0.544819	 -0.746176	 -0.674321
  0.561817	 -0.744780	 -0.681891
  0.575065	 -0.741739	 -0.689617
  0.594402	 -0.738422	 -0.705989
  0.607936	 -0.739633	 -0.720798
  0.617486	 -0.740380	 -0.731614
  0.636401	 -0.745389	 -0.752446
  0.654925	 -0.750467	 -0.765108
  0.670299	 -0.752430	 -0.771966
  0.693642	 -0.752731	 -0.780926
  0.713626	 -0.748063	 -0.788239
  0.724541	 -0.743909	 -0.792412
  0.744041	 -0.738182	 -0.797718
  0.765282	 -0.736292	 -0.806373
  0.784887	 -0.737295	 -0.812219
  0.804254	 -0.737271	 -0.817432
  0.823558	 -0.737927	 -0.822406
  0.842707	 -0.739649	 -0.828117
  0.861754	 -0.741555	 -0.833921
  0.880830	 -0.744114	 -0.839344
  0.899933	 -0.747889	 -0.843899
  0.919040	 -0.751689	 -0.848421
  0.938135	 -0.755484	 -0.852922
  0.956848	 -0.760043	 -0.856746
  0.973483	 -0.763632	 -0.855616
  0.995188	 -0.769894	 -0.860729
  1.017116	 -0.778840	 -0.867414
  1.032611	 -0.785036	 -0.869227
  1.049643	 -0.791923	 -0.870652
  1.070175	 -0.800613	 -0.876299
  1.084037	 -0.806565	 -0.883554
  1.103426	 -0.815011	 -0.895477
  1.123272	 -0.823444	 -0.899714
  1.137479	 -0.828814	 -0.900155
  1.158365	 -0.838021	 -0.898717
  1.175579	 -0.846203	 -0.898120
  1.193996	 -0.854756	 -0.898412
  1.218979	 -0.867812	 -0.903251
  1.231576	 -0.874056	 -0.906468
  1.244395	 -0.878073	 -0.908860
  1.269036	 -0.882712	 -0.913466
  1.293909	 -0.886629	 -0.928609
  1.305689	 -0.892840	 -0.940996
  1.316501	 -0.901101	 -0.947187
  1.335024	 -0.911448	 -0.952941
  1.351325	 -0.920295	 -0.962107
  1.366760	 -0.926809	 -0.970393
  1.385286	 -0.928710	 -0.976910
  1.400130	 -0.931379	 -0.984500
  1.417318	 -0.931197	 -0.997150
  1.442987	 -0.929779	 -1.007820
  1.467088	 -0.927085	 -1.006532
  1.478414	 -0.925257	 -1.005457
  1.500710	 -0.921798	 -1.005381
  1.524497	 -0.917294	 -1.003710
  1.539586	 -0.914473	 -1.003089
  1.558914	 -0.909840	 -1.000190
  1.585042	 -0.902653	 -0.991419
  1.594551	 -0.899518	 -0.985768
  1.611263	 -0.892909	 -0.972051
  1.632058	 -0.884980	 -0.961482
  1.645604	 -0.879025	 -0.956113
  1.667402	 -0.872570	 -0.951892
  1.689408	 -0.865722	 -0.944737
  1.700887	 -0.860701	 -0.940058
  1.714272	 -0.847000	 -0.931175
  1.724151	 -0.827168	 -0.924868
  1.738329	 -0.812487	 -0.917360
  1.752813	 -0.798797	 -0.911748
  1.768554	 -0.785714	 -0.908919
  1.782275	 -0.775985	 -0.905263
  1.800858	 -0.765887	 -0.896279
  1.827982	 -0.753510	 -0.893563
  1.839889	 -0.742738	 -0.900087
  1.847919	 -0.725461	 -0.914018
  1.864205	 -0.705742	 -0.932656
  1.881582	 -0.698673	 -0.937587
  1.896521	 -0.693843	 -0.939896
  1.917333	 -0.687877	 -0.942590
  1.934410	 -0.680898	 -0.943111
  1.961325	 -0.668970	 -0.941406
  1.982871	 -0.656842	 -0.948610
  1.994746	 -0.649407	 -0.955821
  2.009044	 -0.642398	 -0.964137
  2.027418	 -0.639537	 -0.975634
  2.042188	 -0.633173	 -0.993240
  2.056060	 -0.630002	 -1.010913
  2.071932	 -0.630762	 -1.019922
  2.090383	 -0.624564	 -1.030691
  2.107983	 -0.622824	 -1.043144
  2.124840	 -0.634566	 -1.054171
  2.141833	 -0.632000	 -1.064401
