 -0.189696	  0.720682	  2.349966
 -0.195111	  0.712136	  2.362472
 -0.191235	  0.727587	  2.344462
 -0.183555	  0.734601	  2.332914
 -0.176399	  0.743448	  2.317059
 -0.170369	  0.756781	  2.298834
 -0.161710	  0.765482	  2.285984
 -0.153396	  0.773593	  2.271547
 -0.142901	  0.786376	  2.252148
 -0.135766	  0.792981	  2.239521
 -0.125268	  0.796343	  2.221450
 -0.112984	  0.804121	  2.202937
 -0.107161	  0.818660	  2.189782
 -0.103019	  0.832979	  2.176654
 -0.097572	  0.840741	  2.160940
 -0.090405	  0.851693	  2.144273
 -0.083341	  0.863674	  2.128149
 -0.076331	  0.869543	  2.111280
 -0.069464	  0.877369	  2.095897
 -0.061686	  0.889919	  2.075755
 -0.055833	  0.892969	  2.061181
 -0.048605	  0.897470	  2.042673
 -0.042168	  0.904705	  2.022090
 -0.037588	  0.916540	  2.008445
 -0.030865	  0.927715	  1.992319
 -0.022724	  0.935444	  1.974035
 -0.016354	  0.945790	  1.959153
 -0.010665	  0.958898	  1.942040
 -0.004578	  0.962004	  1.923497
  0.001875	  0.962210	  1.903491
  0.007222	  0.964653	  1.884714
  0.013716	  0.971810	  1.866295
  0.020558	  0.979043	  1.848979
  0.029364	  0.987344	  1.833158
  0.043625	  0.996927	  1.822975
  0.058360	  1.005762	  1.812811
  0.073127	  1.015016	  1.802961
  0.088235	  1.024300	  1.793707
  0.103356	  1.033547	  1.784445
  0.118338	  1.042737	  1.774918
  0.132840	  1.051972	  1.766177
  0.148146	  1.061548	  1.760577
  0.167617	  1.069224	  1.751720
  0.186559	  1.075040	  1.736714
  0.193790	  1.083507	  1.723447
  0.203437	  1.093849	  1.710350
  0.216433	  1.099714	  1.694850
  0.228916	  1.105510	  1.681969
  0.243821	  1.116705	  1.669760
  0.260393	  1.129323	  1.658415
  0.271231	  1.138202	  1.649556
  0.283009	  1.145460	  1.635877
  0.297757	  1.150363	  1.617581
  0.307832	  1.156188	  1.606184
  0.320841	  1.169863	  1.593715
  0.331146	  1.180249	  1.576081
  0.335537	  1.186011	  1.554958
  0.334539	  1.189741	  1.539399
  0.336913	  1.200510	  1.519704
  0.342128	  1.213659	  1.503992
  0.348859	  1.221798	  1.487896
  0.358396	  1.228583	  1.470707
  0.365738	  1.239839	  1.453499
  0.365803	  1.252365	  1.436391
  0.365243	  1.262750	  1.418103
  0.365320	  1.266469	  1.399678
  0.363818	  1.270598	  1.379607
  0.356668	  1.269043	  1.360964
  0.346309	  1.274901	  1.338174
  0.339388	  1.287529	  1.320117
  0.337684	  1.298712	  1.301647
  0.341124	  1.301872	  1.286899
  0.343990	  1.302798	  1.264583
  0.344676	  1.304481	  1.243885
  0.343980	  1.307924	  1.223832
  0.344034	  1.312631	  1.204534
  0.345144	  1.315909	  1.185316
  0.347442	  1.319729	  1.167224
  0.348796	  1.325447	  1.145393
  0.347358	  1.331574	  1.122438
  0.345438	  1.336802	  1.108873
  0.349632	  1.341125	  1.091651
  0.356404	  1.347481	  1.066021
  0.358937	  1.356074	  1.048989
  0.358283	  1.364546	  1.034906
  0.358624	  1.377838	  1.015651
  0.358679	  1.390548	  0.994783
  0.361013	  1.398979	  0.984711
  0.364491	  1.414757	  0.970312
  0.371511	  1.427380	  0.953471
  0.379733	  1.436925	  0.938375
  0.380459	  1.449547	  0.921843
  0.383459	  1.462445	  0.907350
  0.393723	  1.473940	  0.893176
  0.400457	  1.485947	  0.878660
  0.403234	  1.499420	  0.866019
  0.412425	  1.512757	  0.854857
  0.425119	  1.526556	  0.840305
  0.431177	  1.539403	  0.828004
  0.438550	  1.552683	  0.819083
  0.450201	  1.567485	  0.809025
  0.455148	  1.582101	  0.796661
  0.456549	  1.599843	  0.785592
  0.464908	  1.619478	  0.775050
  0.478976	  1.632605	  0.760955
  0.487068	  1.639058	  0.752103
  0.500693	  1.650671	  0.740939
  0.510866	  1.666927	  0.733933
  0.522119	  1.682705	  0.724739
  0.532090	  1.696678	  0.715359
  0.539163	  1.712806	  0.707836
  0.549118	  1.730248	  0.698460
  0.560307	  1.743508	  0.687051
  0.569199	  1.758383	  0.678539
  0.576529	  1.776111	  0.671272
  0.587909	  1.792511	  0.666163
  0.603370	  1.803735	  0.662478
  0.617117	  1.818685	  0.656613
  0.628353	  1.834655	  0.651263
  0.639305	  1.850690	  0.646454
  0.650145	  1.866797	  0.641643
  0.660974	  1.882929	  0.636890
  0.671698	  1.899289	  0.632718
  0.682081	  1.916179	  0.630057
  0.692453	  1.933072	  0.627396
  0.702825	  1.949963	  0.624729
  0.713182	  1.966862	  0.622054
  0.722459	  1.984498	  0.620372
  0.730835	  2.002638	  0.619487
  0.739203	  2.020782	  0.618611
  0.747569	  2.038927	  0.617736
  0.755839	  2.057122	  0.617005
  0.763703	  2.075510	  0.616872
  0.771552	  2.093905	  0.616743
  0.779398	  2.112298	  0.616569
  0.788264	  2.129897	  0.613971
  0.795121	  2.147523	  0.609624
  0.802336	  2.161550	  0.596872
  0.806378	  2.168349	  0.581535
  0.813796	  2.170939	  0.567367
  0.819252	  2.172050	  0.548247
  0.823871	  2.174231	  0.530724
  0.819625	  2.169144	  0.511778
  0.813919	  2.162980	  0.493532
  0.808526	  2.157352	  0.475233
  0.803103	  2.153301	  0.456851
  0.799416	  2.152688	  0.436456
  0.795500	  2.152874	  0.414752
  0.788255	  2.145436	  0.391007
  0.782813	  2.131058	  0.377931
  0.770505	  2.105284	  0.369701
  0.753865	  2.082852	  0.363745
  0.737059	  2.074704	  0.352844
  0.725278	  2.071716	  0.336076
  0.718000	  2.066407	  0.319115
  0.710643	  2.062481	  0.299388
  0.707999	  2.064216	  0.271129
  0.705254	  2.063080	  0.256149
  0.696312	  2.057282	  0.233711
  0.694678	  2.055341	  0.220462
  0.696767	  2.052473	  0.197141
  0.695635	  2.051003	  0.172244
  0.687732	  2.049215	  0.155457
  0.674731	  2.045321	  0.138805
  0.667204	  2.043356	  0.122173
  0.664892	  2.045040	  0.099053
  0.664595	  2.045749	  0.075386
  0.661931	  2.043671	  0.062754
  0.656861	  2.042708	  0.039838
  0.660544	  2.045465	  0.020418
  0.670955	  2.049715	 -0.000732
  0.675284	  2.051978	 -0.023018
  0.672323	  2.054488	 -0.040252
  0.666631	  2.058903	 -0.058960
  0.663779	  2.063245	 -0.085218
  0.662803	  2.064375	 -0.097475
  0.665297	  2.066124	 -0.119775
  0.669869	  2.071924	 -0.143742
  0.677524	  2.078502	 -0.159034
  0.685730	  2.084389	 -0.175681
  0.690672	  2.089215	 -0.195451
  0.699305	  2.094042	 -0.212199
  0.712921	  2.098898	 -0.231056
  0.718382	  2.104867	 -0.247348
  0.722555	  2.113196	 -0.266521
  0.730594	  2.120673	 -0.280284
  0.739690	  2.128659	 -0.298325
  0.748449	  2.136737	 -0.315482
  0.759230	  2.143817	 -0.331353
  0.768914	  2.150121	 -0.346747
  0.775976	  2.155680	 -0.364906
  0.786734	  2.159853	 -0.384751
  0.798554	  2.161990	 -0.401417
  0.815817	  2.165010	 -0.411147
  0.831176	  2.171505	 -0.423732
  0.844338	  2.179763	 -0.436029
  0.855843	  2.186698	 -0.451482
  0.866985	  2.193317	 -0.466711
  0.878072	  2.199898	 -0.482012
  0.889566	  2.206703	 -0.497741
  0.904083	  2.215959	 -0.518218
  0.914774	  2.222900	 -0.533629
