  2.169414	  0.595354	  2.029802
  2.147935	  0.589460	  2.009705
  2.114306	  0.615901	  1.990989
  2.072146	  0.637087	  1.977368
  2.029700	  0.656681	  1.959526
  1.985787	  0.672423	  1.942004
  1.940976	  0.687295	  1.928698
  1.896347	  0.704840	  1.919221
  1.850426	  0.724784	  1.905706
  1.809403	  0.749749	  1.888136
  1.767693	  0.770911	  1.872548
  1.726574	  0.793446	  1.856840
  1.684407	  0.816672	  1.841153
  1.645671	  0.841563	  1.821591
  1.608169	  0.867115	  1.803443
  1.567381	  0.886995	  1.780876
  1.526244	  0.903459	  1.757831
  1.483671	  0.918069	  1.737219
  1.440473	  0.933746	  1.721398
  1.396895	  0.950732	  1.703783
  1.353880	  0.970036	  1.686057
  1.312785	  0.994375	  1.670512
  1.273698	  1.021090	  1.655544
  1.235641	  1.048457	  1.639429
  1.197356	  1.075807	  1.621175
  1.158811	  1.101748	  1.601065
  1.121159	  1.124787	  1.580814
  1.081159	  1.146439	  1.560395
  1.040336	  1.164043	  1.540402
  0.997131	  1.174633	  1.519040
  0.956824	  1.187266	  1.491534
  0.914799	  1.213128	  1.476551
  0.869373	  1.233194	  1.459594
  0.827096	  1.253159	  1.441632
  0.787544	  1.273294	  1.422005
  0.748822	  1.296315	  1.402666
  0.703822	  1.307047	  1.384367
  0.665309	  1.332056	  1.366643
  0.622042	  1.349214	  1.352739
  0.585314	  1.372999	  1.330856
  0.547411	  1.399251	  1.309788
  0.507846	  1.422566	  1.292358
  0.464293	  1.443338	  1.279373
  0.421269	  1.462432	  1.264382
  0.377082	  1.481912	  1.250615
  0.332528	  1.500482	  1.237384
  0.287564	  1.517513	  1.223654
  0.242490	  1.533751	  1.209345
  0.197763	  1.549543	  1.194054
  0.153509	  1.566218	  1.177160
  0.111520	  1.584145	  1.156284
  0.072215	  1.603226	  1.130691
  0.034808	  1.624366	  1.101255
  0.000384	  1.646353	  1.071581
 -0.031503	  1.668213	  1.042588
 -0.062384	  1.690113	  1.012935
 -0.095245	  1.714104	  0.980516
 -0.129243	  1.738332	  0.952073
 -0.171382	  1.766163	  0.929993
 -0.213627	  1.803888	  0.925856
 -0.264030	  1.824930	  0.917149
 -0.313761	  1.835831	  0.908186
 -0.363056	  1.839187	  0.891995
 -0.409328	  1.843241	  0.877856
 -0.458985	  1.855412	  0.867349
 -0.505630	  1.876962	  0.861917
 -0.548996	  1.903277	  0.856930
 -0.590855	  1.930939	  0.849357
 -0.629851	  1.957548	  0.838119
 -0.669217	  1.982106	  0.824392
 -0.710290	  2.005064	  0.807550
 -0.753678	  2.026335	  0.789264
 -0.797332	  2.047142	  0.769783
 -0.839341	  2.067009	  0.751003
 -0.880706	  2.087943	  0.731836
 -0.918597	  2.110694	  0.714137
 -0.955699	  2.138085	  0.694648
 -0.986991	  2.164135	  0.667003
 -1.025492	  2.185454	  0.650158
 -1.061284	  2.215063	  0.628035
 -1.102713	  2.239563	  0.601824
 -1.144915	  2.256431	  0.575141
 -1.184876	  2.271441	  0.547824
 -1.225230	  2.287122	  0.521774
 -1.267325	  2.303774	  0.501438
 -1.308766	  2.320353	  0.484674
 -1.351557	  2.336871	  0.469215
 -1.397686	  2.353644	  0.455253
 -1.443956	  2.376669	  0.447692
 -1.488070	  2.401575	  0.440252
 -1.526476	  2.423806	  0.420710
 -1.565635	  2.447509	  0.402333
 -1.610623	  2.465878	  0.383037
 -1.656080	  2.475389	  0.360349
 -1.672641	  2.500142	  0.363952
