  2.422005	 -0.440520	 -0.321859
  2.445962	 -0.434382	 -0.319744
  2.426980	 -0.439371	 -0.324024
  2.407460	 -0.444109	 -0.325595
  2.388217	 -0.449926	 -0.325384
  2.369366	 -0.455203	 -0.328489
  2.350420	 -0.460699	 -0.333888
  2.331202	 -0.466110	 -0.336160
  2.312344	 -0.472505	 -0.336114
  2.293914	 -0.478850	 -0.339782
  2.275407	 -0.485366	 -0.345445
  2.256266	 -0.491520	 -0.347967
  2.238013	 -0.499600	 -0.347614
  2.219430	 -0.506464	 -0.350881
  2.200577	 -0.512453	 -0.358427
  2.182251	 -0.518105	 -0.364110
  2.162132	 -0.525658	 -0.367523
  2.145144	 -0.536202	 -0.364239
  2.129751	 -0.548058	 -0.360833
  2.112975	 -0.560298	 -0.359569
  2.096261	 -0.571721	 -0.358744
  2.081313	 -0.584526	 -0.355152
  2.066415	 -0.597380	 -0.351500
  2.051610	 -0.610309	 -0.347767
  2.036845	 -0.623267	 -0.344013
  2.022233	 -0.636326	 -0.340071
  2.010907	 -0.651005	 -0.332479
  2.001144	 -0.666043	 -0.323589
  1.991498	 -0.681079	 -0.314617
  1.981812	 -0.696111	 -0.305653
  1.972132	 -0.711150	 -0.296700
  1.964168	 -0.726652	 -0.286886
  1.957149	 -0.742346	 -0.276662
  1.950170	 -0.758065	 -0.266456
  1.943117	 -0.773887	 -0.256462
  1.935679	 -0.790045	 -0.247319
  1.928201	 -0.806204	 -0.238215
  1.919141	 -0.822514	 -0.231036
  1.909323	 -0.838737	 -0.225280
  1.896451	 -0.853886	 -0.223844
  1.884393	 -0.868066	 -0.223336
  1.870260	 -0.882188	 -0.227482
  1.856745	 -0.893284	 -0.237293
  1.843142	 -0.909240	 -0.245164
  1.832508	 -0.921614	 -0.249824
  1.817271	 -0.930880	 -0.259606
  1.803648	 -0.936659	 -0.270115
  1.790175	 -0.946988	 -0.278579
  1.770204	 -0.957204	 -0.290696
  1.755386	 -0.961638	 -0.299849
  1.742817	 -0.967198	 -0.310742
  1.728785	 -0.973554	 -0.325978
  1.712114	 -0.975601	 -0.339625
  1.697995	 -0.971312	 -0.355944
  1.689533	 -0.967593	 -0.374392
  1.681467	 -0.968023	 -0.393310
  1.671886	 -0.971923	 -0.410065
  1.663048	 -0.975418	 -0.427155
  1.654992	 -0.978525	 -0.445565
  1.644895	 -0.980457	 -0.464132
  1.633246	 -0.979699	 -0.480797
  1.617041	 -0.970939	 -0.495779
  1.606441	 -0.965638	 -0.508380
  1.595881	 -0.963477	 -0.525621
  1.588359	 -0.964059	 -0.545383
  1.577905	 -0.961382	 -0.563713
  1.563730	 -0.954958	 -0.578565
  1.546409	 -0.950152	 -0.588485
  1.530955	 -0.949795	 -0.599953
  1.515377	 -0.948572	 -0.614171
  1.498771	 -0.947719	 -0.625814
  1.482008	 -0.943700	 -0.637267
  1.463444	 -0.941842	 -0.644905
  1.444658	 -0.940603	 -0.652651
  1.426463	 -0.939163	 -0.661146
  1.409333	 -0.935273	 -0.669605
  1.390019	 -0.930776	 -0.674789
  1.371085	 -0.928545	 -0.679121
  1.350926	 -0.930437	 -0.688467
  1.332952	 -0.931590	 -0.697344
  1.315670	 -0.928807	 -0.704006
  1.296593	 -0.923556	 -0.708882
  1.276788	 -0.920914	 -0.716342
  1.256509	 -0.925970	 -0.725779
  1.239144	 -0.929784	 -0.727237
  1.218975	 -0.929413	 -0.727469
  1.198670	 -0.928045	 -0.730624
  1.178311	 -0.929480	 -0.735292
  1.158540	 -0.933180	 -0.738892
  1.139437	 -0.937772	 -0.736413
  1.119279	 -0.941403	 -0.734040
  1.099230	 -0.942324	 -0.736990
  1.079406	 -0.945004	 -0.742253
  1.060279	 -0.951364	 -0.744303
  1.041257	 -0.956790	 -0.741687
  1.021789	 -0.959585	 -0.741174
  1.001204	 -0.962406	 -0.743818
  0.981514	 -0.969242	 -0.747579
  0.963173	 -0.979274	 -0.746490
  0.946090	 -0.984871	 -0.741868
  0.926874	 -0.987850	 -0.738749
  0.906000	 -0.990401	 -0.736980
  0.886058	 -0.995832	 -0.731967
  0.866469	 -1.006048	 -0.726247
  0.851762	 -1.015799	 -0.724699
  0.835074	 -1.025356	 -0.721808
  0.814953	 -1.032008	 -0.713663
  0.797313	 -1.034833	 -0.708824
  0.779753	 -1.040443	 -0.704359
  0.761775	 -1.049219	 -0.695340
  0.743817	 -1.055689	 -0.688343
  0.725989	 -1.062312	 -0.686149
  0.707999	 -1.070701	 -0.681937
  0.688741	 -1.076626	 -0.676883
  0.668528	 -1.080569	 -0.676449
  0.646576	 -1.086191	 -0.676893
  0.631282	 -1.091205	 -0.670043
  0.615914	 -1.097725	 -0.656970
  0.603113	 -1.103727	 -0.641584
  0.583361	 -1.109075	 -0.625268
  0.568159	 -1.114219	 -0.620243
  0.546418	 -1.123269	 -0.621167
  0.522610	 -1.129284	 -0.621036
  0.507203	 -1.133419	 -0.613235
  0.493371	 -1.139475	 -0.601556
  0.477021	 -1.145668	 -0.590185
  0.462141	 -1.151927	 -0.578938
  0.447393	 -1.157118	 -0.562876
  0.427281	 -1.155895	 -0.548973
  0.408393	 -1.155975	 -0.545240
  0.389750	 -1.158881	 -0.543797
  0.370226	 -1.160973	 -0.534495
  0.353504	 -1.164752	 -0.523420
  0.336075	 -1.168862	 -0.513149
  0.318106	 -1.167604	 -0.506482
  0.295232	 -1.166835	 -0.503095
  0.272891	 -1.171340	 -0.501727
  0.260000	 -1.177089	 -0.496868
  0.240711	 -1.185047	 -0.491834
  0.221571	 -1.193369	 -0.491017
  0.201962	 -1.199679	 -0.489905
  0.183040	 -1.206238	 -0.489599
  0.164166	 -1.212842	 -0.489358
  0.145602	 -1.220286	 -0.489510
  0.127501	 -1.228766	 -0.490179
  0.109412	 -1.237271	 -0.490854
  0.091711	 -1.246536	 -0.491707
  0.075190	 -1.257728	 -0.493018
  0.058689	 -1.268952	 -0.494339
  0.042201	 -1.280194	 -0.495649
  0.026934	 -1.293058	 -0.496822
  0.012493	 -1.306852	 -0.497873
 -0.001952	 -1.320650	 -0.498896
 -0.016354	 -1.334490	 -0.499948
 -0.029811	 -1.349156	 -0.500367
 -0.044012	 -1.363015	 -0.499783
 -0.056681	 -1.379052	 -0.498130
 -0.066214	 -1.396944	 -0.497191
 -0.072888	 -1.416163	 -0.498490
 -0.081569	 -1.435706	 -0.502772
 -0.091538	 -1.453239	 -0.507880
 -0.105671	 -1.465856	 -0.508458
 -0.114785	 -1.481535	 -0.502825
 -0.123512	 -1.501473	 -0.495561
 -0.129508	 -1.519748	 -0.496217
 -0.140987	 -1.539798	 -0.505502
 -0.152374	 -1.554698	 -0.510416
 -0.159930	 -1.570763	 -0.511290
 -0.168072	 -1.591433	 -0.514654
 -0.179622	 -1.605984	 -0.513491
 -0.191831	 -1.622562	 -0.510625
 -0.200329	 -1.639871	 -0.507263
 -0.204097	 -1.660957	 -0.509912
 -0.206001	 -1.681038	 -0.518281
 -0.212753	 -1.698537	 -0.527158
 -0.224805	 -1.715093	 -0.527337
 -0.236520	 -1.729850	 -0.523150
 -0.248707	 -1.750027	 -0.524406
 -0.259640	 -1.766293	 -0.530936
 -0.262998	 -1.781775	 -0.538892
 -0.266303	 -1.799166	 -0.546569
 -0.280052	 -1.820148	 -0.560336
 -0.289189	 -1.832306	 -0.567563
 -0.299145	 -1.841997	 -0.579784
 -0.311643	 -1.852269	 -0.594412
 -0.325106	 -1.860403	 -0.601104
 -0.346220	 -1.867225	 -0.611392
 -0.358962	 -1.878578	 -0.624759
 -0.365333	 -1.885270	 -0.633751
 -0.380187	 -1.887522	 -0.648001
 -0.395806	 -1.886756	 -0.663546
 -0.410799	 -1.886166	 -0.674504
 -0.428390	 -1.887176	 -0.683130
 -0.447297	 -1.884173	 -0.690052
 -0.465932	 -1.878620	 -0.696179
 -0.484698	 -1.872514	 -0.699437
 -0.503466	 -1.866397	 -0.702597
 -0.522396	 -1.859987	 -0.702296
 -0.541313	 -1.853550	 -0.701449
 -0.560225	 -1.847123	 -0.700523
 -0.579049	 -1.840913	 -0.697904
 -0.597873	 -1.834709	 -0.695235
 -0.616475	 -1.828338	 -0.692884
 -0.634814	 -1.821278	 -0.692517
 -0.654500	 -1.814959	 -0.693689
 -0.675266	 -1.813490	 -0.694669
 -0.698683	 -1.815552	 -0.687628
 -0.714247	 -1.811270	 -0.681004
 -0.731674	 -1.802410	 -0.677980
 -0.751567	 -1.797624	 -0.676326
 -0.773785	 -1.798308	 -0.667508
 -0.788972	 -1.794154	 -0.660741
 -0.807662	 -1.786528	 -0.657454
 -0.829070	 -1.783296	 -0.651844
 -0.848919	 -1.785176	 -0.645322
 -0.865578	 -1.782177	 -0.641998
 -0.884809	 -1.775496	 -0.636000
 -0.905183	 -1.773442	 -0.625366
 -0.922746	 -1.775990	 -0.622638
 -0.941646	 -1.772926	 -0.620790
 -0.961727	 -1.767266	 -0.611996
 -0.981309	 -1.767422	 -0.601287
 -0.999406	 -1.771164	 -0.599439
 -1.018361	 -1.771777	 -0.596840
 -1.037023	 -1.769654	 -0.588235
 -1.057254	 -1.767714	 -0.576017
 -1.074488	 -1.767408	 -0.569760
 -1.095138	 -1.766357	 -0.567052
 -1.112955	 -1.762288	 -0.566572
 -1.133544	 -1.758852	 -0.561255
 -1.151847	 -1.756473	 -0.553142
 -1.170792	 -1.754078	 -0.546292
 -1.189641	 -1.752155	 -0.538792
 -1.206333	 -1.750937	 -0.527965
 -1.222457	 -1.750661	 -0.516276
 -1.239978	 -1.750666	 -0.506303
 -1.257197	 -1.750706	 -0.497615
 -1.275209	 -1.753213	 -0.491758
 -1.293383	 -1.762102	 -0.486822
 -1.314609	 -1.770668	 -0.474301
 -1.326947	 -1.769828	 -0.466209
 -1.346202	 -1.771528	 -0.460845
 -1.366644	 -1.773589	 -0.453752
 -1.384623	 -1.776412	 -0.447916
 -1.402839	 -1.782602	 -0.446006
 -1.423449	 -1.794852	 -0.440421
 -1.438450	 -1.800012	 -0.432881
 -1.458913	 -1.803862	 -0.428728
 -1.477302	 -1.810757	 -0.424946
