  0.442428	  1.180555	  2.755258
  0.438048	  1.168866	  2.727978
  0.457548	  1.196340	  2.687652
  0.469174	  1.211248	  2.644108
  0.478831	  1.230925	  2.599649
  0.493177	  1.245510	  2.555801
  0.499543	  1.269769	  2.513240
  0.513390	  1.284646	  2.465366
  0.525366	  1.307539	  2.419841
  0.537829	  1.327009	  2.377027
  0.541662	  1.345376	  2.333668
  0.551833	  1.363502	  2.284459
  0.567932	  1.384668	  2.244004
  0.573732	  1.398486	  2.194810
  0.584094	  1.419355	  2.151619
  0.598207	  1.437564	  2.105359
  0.611324	  1.457864	  2.062772
  0.625835	  1.477101	  2.019588
  0.638882	  1.494020	  1.976155
  0.649656	  1.510844	  1.932783
  0.663064	  1.529846	  1.885979
  0.678190	  1.549847	  1.841190
  0.690512	  1.569483	  1.796238
  0.698934	  1.587820	  1.753732
  0.707020	  1.607215	  1.709183
  0.716443	  1.624596	  1.666994
  0.726231	  1.642035	  1.619753
  0.735246	  1.660440	  1.571534
  0.744499	  1.680127	  1.524105
  0.754047	  1.700089	  1.479531
  0.764353	  1.720189	  1.435686
  0.774609	  1.738967	  1.395847
  0.787167	  1.760800	  1.349670
  0.799878	  1.780938	  1.307332
  0.812489	  1.801269	  1.264907
  0.826125	  1.823673	  1.218876
  0.839870	  1.845397	  1.172883
  0.852113	  1.866004	  1.129264
  0.863677	  1.886527	  1.084138
  0.874544	  1.905450	  1.040862
  0.886097	  1.923774	  0.996366
  0.897472	  1.940543	  0.955618
  0.910154	  1.959661	  0.909993
  0.921973	  1.977875	  0.866622
  0.932167	  1.996222	  0.825015
  0.942808	  2.016922	  0.779444
  0.953731	  2.038028	  0.732663
  0.962496	  2.058195	  0.684460
  0.971228	  2.077710	  0.643397
  0.982217	  2.098251	  0.598814
  0.992892	  2.118066	  0.555245
  1.004130	  2.139205	  0.512451
  1.015528	  2.159995	  0.469359
  1.026673	  2.180630	  0.424776
  1.037175	  2.199196	  0.382381
  1.048171	  2.219310	  0.336269
  1.058229	  2.238463	  0.292505
  1.069291	  2.258662	  0.247563
  1.081076	  2.278285	  0.202804
  1.094237	  2.295905	  0.158594
  1.108234	  2.312765	  0.111129
  1.120741	  2.327746	  0.066974
  1.134648	  2.347021	  0.022780
  1.148830	  2.367836	 -0.022568
  1.160772	  2.386780	 -0.068559
  1.167965	  2.405226	 -0.115579
  1.177116	  2.423158	 -0.158979
  1.186130	  2.444879	 -0.202501
  1.197234	  2.463625	 -0.244671
  1.210074	  2.480895	 -0.293276
  1.221115	  2.497922	 -0.338172
  1.233274	  2.519244	 -0.382702
  1.241165	  2.535043	 -0.422805
  1.254674	  2.551649	 -0.468487
  1.263987	  2.577415	 -0.516695
  1.274233	  2.592347	 -0.557730
  1.284609	  2.608266	 -0.606459
  1.292098	  2.627399	 -0.653650
  1.305019	  2.653673	 -0.660187
