 -0.546600	  1.583295	  1.876505
 -0.576945	  1.580859	  1.884547
 -0.557581	  1.583133	  1.879630
 -0.539543	  1.581877	  1.870629
 -0.522154	  1.579621	  1.860746
 -0.505262	  1.576691	  1.850134
 -0.489661	  1.572344	  1.837790
 -0.477529	  1.566276	  1.822489
 -0.467048	  1.559065	  1.806750
 -0.457265	  1.550993	  1.791040
 -0.446781	  1.543157	  1.775820
 -0.435010	  1.536013	  1.761706
 -0.424326	  1.525988	  1.749387
 -0.415916	  1.511569	  1.736457
 -0.404252	  1.500291	  1.721439
 -0.389924	  1.496895	  1.709955
 -0.368787	  1.500004	  1.695854
 -0.351422	  1.503856	  1.681950
 -0.336076	  1.503585	  1.667691
 -0.325187	  1.502941	  1.656193
 -0.311047	  1.503229	  1.642529
 -0.290086	  1.502720	  1.629122
 -0.275613	  1.501014	  1.621797
 -0.258026	  1.501934	  1.613569
 -0.233510	  1.507444	  1.605866
 -0.216647	  1.512347	  1.605688
 -0.200139	  1.515808	  1.608337
 -0.177388	  1.518596	  1.610867
 -0.154048	  1.517957	  1.609185
 -0.141858	  1.517298	  1.606929
 -0.117595	  1.519623	  1.598787
 -0.091940	  1.526486	  1.592622
 -0.072224	  1.528916	  1.591379
 -0.057820	  1.527408	  1.591417
 -0.032353	  1.524411	  1.596434
 -0.010092	  1.522588	  1.607152
  0.004134	  1.525361	  1.617183
  0.018011	  1.533548	  1.625786
  0.037879	  1.540215	  1.634176
  0.057333	  1.543955	  1.640333
  0.076835	  1.546765	  1.645136
  0.095552	  1.549383	  1.649993
  0.114626	  1.553221	  1.653638
  0.134051	  1.557833	  1.656660
  0.153281	  1.562644	  1.659331
  0.172027	  1.569619	  1.659754
  0.190184	  1.577978	  1.659221
  0.208138	  1.586917	  1.658553
  0.226305	  1.594916	  1.655854
  0.244846	  1.601399	  1.652104
  0.261702	  1.610356	  1.651405
  0.278536	  1.624786	  1.651999
  0.297211	  1.631106	  1.651432
  0.320309	  1.626446	  1.647846
  0.345746	  1.622670	  1.642037
  0.363692	  1.626782	  1.640699
  0.378152	  1.632748	  1.640514
  0.400215	  1.646300	  1.641208
  0.421792	  1.653926	  1.641636
  0.435133	  1.656273	  1.641960
  0.458155	  1.656661	  1.643163
  0.478690	  1.657723	  1.645156
  0.497005	  1.660266	  1.645135
  0.522323	  1.666299	  1.644931
  0.538077	  1.671380	  1.646888
  0.548913	  1.679969	  1.651392
  0.562293	  1.694281	  1.663457
  0.581144	  1.707407	  1.671652
  0.611226	  1.718573	  1.677117
  0.625666	  1.719998	  1.679541
  0.639831	  1.720043	  1.683511
  0.661405	  1.724824	  1.690396
  0.684936	  1.721710	  1.691878
  0.706547	  1.717274	  1.691270
  0.725609	  1.720864	  1.692937
  0.744783	  1.724598	  1.697230
