 0.0 0.0 0.0 0
 -0.48404744282896595 -0.8496367221152215 -0.49274248340684684 1000
 0.6897788810975818 0.5784933696614488 1.1010294939075909 1000
 0.6021946034971782 0.6263883028610308 0.37982213290089095 1000
 0.7533872078574594 -0.04830247658452454 0.30769227409739996 1000
 -0.5597360908079737 -0.37359427842671933 -1.1422568045979649 1000
 -0.7878531546007355 0.2796007692571367 -0.37645459059544045 1000
 -0.10277687285008442 0.817344579346984 0.42510011568136 1000
 0.8182209928020632 -0.569482323048303 0.6780718926066379 1000
 0.0 0.0 0.0 0
 0.39128668845093073 -0.5944541319289564 -0.1866656678853451 1000
 -0.8885312733271472 -0.4275156670218038 -0.8649672361498603 1000
 -0.3613819630694564 0.5951528771032633 -0.7599466136176388 1000
 0.6347423816082176 -0.2927458916043723 1.0877803506356607 1000
