  1.993425	  1.204756	 -0.940286
  2.007681	  1.235049	 -0.937514
  2.001486	  1.212471	 -0.939575
  1.992902	  1.200084	 -0.940269
  1.986454	  1.179435	 -0.942446
  1.981972	  1.156067	 -0.943734
  1.974971	  1.142035	 -0.944158
  1.967917	  1.122446	 -0.945237
  1.960833	  1.100371	 -0.945993
  1.948730	  1.085802	 -0.947049
  1.937861	  1.070813	 -0.948184
  1.928878	  1.050830	 -0.947899
  1.918905	  1.034110	 -0.946524
  1.910344	  1.016017	 -0.947769
  1.903131	  0.994522	 -0.945686
  1.894006	  0.978546	 -0.941001
  1.881875	  0.964176	 -0.938382
  1.869779	  0.945523	 -0.933954
  1.863122	  0.925450	 -0.926366
  1.856829	  0.910341	 -0.922984
  1.847138	  0.891687	 -0.923176
  1.835187	  0.876392	 -0.922577
  1.822779	  0.860181	 -0.920721
  1.812428	  0.842875	 -0.922590
  1.803634	  0.825017	 -0.925289
  1.794852	  0.807295	 -0.928270
  1.786016	  0.789609	 -0.931292
  1.777005	  0.771987	 -0.934173
  1.766435	  0.755122	 -0.936132
  1.755859	  0.738259	 -0.938082
  1.747387	  0.720167	 -0.939036
  1.740967	  0.701226	 -0.939065
  1.735351	  0.682033	 -0.938824
  1.733922	  0.662146	 -0.937260
  1.732501	  0.642258	 -0.935693
  1.731096	  0.622488	 -0.933019
  1.729706	  0.602854	 -0.929472
  1.728322	  0.583219	 -0.925925
  1.725277	  0.563839	 -0.922038
  1.721652	  0.544597	 -0.917963
  1.718020	  0.525344	 -0.913856
  1.712500	  0.506625	 -0.909310
  1.706920	  0.487994	 -0.904697
  1.700918	  0.469397	 -0.900282
  1.694514	  0.450944	 -0.896149
  1.689446	  0.432724	 -0.891136
  1.687205	  0.412670	 -0.885492
  1.686611	  0.392851	 -0.881830
  1.676250	  0.371571	 -0.881867
  1.663290	  0.355648	 -0.878267
  1.649942	  0.338683	 -0.872506
  1.643345	  0.325431	 -0.870631
  1.632021	  0.306843	 -0.867737
  1.621680	  0.287403	 -0.866456
  1.614116	  0.269095	 -0.866423
  1.605285	  0.253046	 -0.868284
  1.593916	  0.234919	 -0.867732
  1.584674	  0.217613	 -0.869610
  1.574801	  0.200620	 -0.872822
  1.563650	  0.183661	 -0.874280
  1.552518	  0.166988	 -0.874077
  1.542117	  0.149872	 -0.873947
  1.531930	  0.132660	 -0.873697
  1.521634	  0.115516	 -0.873706
  1.511268	  0.098423	 -0.873918
  1.501014	  0.081257	 -0.873948
  1.490377	  0.064219	 -0.875214
  1.479803	  0.047279	 -0.876501
  1.469487	  0.030233	 -0.878475
  1.459392	  0.013284	 -0.881570
  1.450429	 -0.003995	 -0.883621
  1.443356	 -0.023247	 -0.883080
  1.433958	 -0.042089	 -0.884230
  1.426331	 -0.059737	 -0.886485
  1.418255	 -0.078365	 -0.889723
  1.409474	 -0.096222	 -0.894327
  1.402987	 -0.112525	 -0.901550
  1.399690	 -0.131068	 -0.905750
  1.389861	 -0.152257	 -0.908958
  1.377000	 -0.168950	 -0.912219
  1.367896	 -0.183234	 -0.920430
  1.364438	 -0.201817	 -0.927860
  1.363362	 -0.220703	 -0.935265
  1.360275	 -0.238579	 -0.942908
  1.357828	 -0.261859	 -0.949422
  1.359569	 -0.282912	 -0.952558
  1.360527	 -0.302302	 -0.946138
  1.355164	 -0.319682	 -0.938149
  1.345464	 -0.337184	 -0.934408
  1.339898	 -0.359367	 -0.935867
  1.337350	 -0.379115	 -0.937219
  1.333733	 -0.396841	 -0.932544
  1.327505	 -0.415035	 -0.927134
  1.323584	 -0.438358	 -0.926076
  1.320105	 -0.457338	 -0.930683
  1.310621	 -0.473213	 -0.933949
  1.302000	 -0.491801	 -0.932444
  1.296597	 -0.513051	 -0.932505
  1.288427	 -0.530524	 -0.939526
  1.275376	 -0.546476	 -0.947647
  1.266107	 -0.561615	 -0.947774
  1.258719	 -0.582240	 -0.946023
  1.254243	 -0.601149	 -0.941795
  1.247585	 -0.620509	 -0.940411
  1.240760	 -0.639346	 -0.940029
  1.233955	 -0.658151	 -0.939669
  1.226454	 -0.676631	 -0.938189
  1.218488	 -0.694837	 -0.935931
  1.210524	 -0.713044	 -0.933679
  1.201800	 -0.730910	 -0.931644
  1.193776	 -0.747563	 -0.928650
  1.184958	 -0.766889	 -0.924445
  1.176553	 -0.785967	 -0.919628
  1.166483	 -0.804199	 -0.922730
  1.157086	 -0.819243	 -0.928272
  1.146777	 -0.837246	 -0.929907
  1.137527	 -0.854787	 -0.929908
  1.128945	 -0.870236	 -0.931994
  1.114193	 -0.893181	 -0.933075
  1.105401	 -0.907320	 -0.931845
  1.099036	 -0.925147	 -0.930007
  1.091364	 -0.945893	 -0.929960
  1.083625	 -0.963187	 -0.936373
  1.078476	 -0.981294	 -0.943636
  1.073722	 -1.000294	 -0.948864
  1.068621	 -1.018613	 -0.955585
  1.060673	 -1.040979	 -0.960188
  1.058222	 -1.057542	 -0.955617
  1.055486	 -1.078306	 -0.948960
  1.049635	 -1.099634	 -0.946028
  1.045401	 -1.115472	 -0.950722
  1.039784	 -1.135906	 -0.958735
  1.031323	 -1.159220	 -0.959326
  1.028181	 -1.173143	 -0.955588
  1.024154	 -1.193900	 -0.955271
  1.019371	 -1.214439	 -0.953258
  1.014750	 -1.233585	 -0.948850
  1.009874	 -1.252465	 -0.945468
  1.003697	 -1.271770	 -0.944666
  0.996759	 -1.290536	 -0.944771
  0.989801	 -1.309286	 -0.944873
  0.982260	 -1.327779	 -0.945970
  0.974486	 -1.346143	 -0.947492
  0.966664	 -1.364509	 -0.948713
  0.958589	 -1.382800	 -0.948197
  0.950517	 -1.401091	 -0.947677
  0.941606	 -1.418991	 -0.947270
  0.931647	 -1.436333	 -0.947012
  0.921769	 -1.453723	 -0.946830
  0.913918	 -1.472049	 -0.948385
  0.906075	 -1.490381	 -0.949951
  0.898221	 -1.508587	 -0.952567
  0.890366	 -1.526775	 -0.955308
  0.883152	 -1.545318	 -0.957335
  0.876494	 -1.564123	 -0.958755
  0.869835	 -1.582929	 -0.960174
  0.862852	 -1.601645	 -0.961150
  0.855861	 -1.620358	 -0.962116
  0.848855	 -1.639076	 -0.962857
  0.841825	 -1.657797	 -0.963193
  0.834793	 -1.676517	 -0.963534
  0.827949	 -1.695306	 -0.963702
  0.821161	 -1.714124	 -0.963830
  0.814418	 -1.732956	 -0.963922
  0.807783	 -1.751780	 -0.963750
  0.800317	 -1.769883	 -0.965149
  0.791983	 -1.787328	 -0.969222
  0.782927	 -1.807253	 -0.970764
  0.773461	 -1.825368	 -0.967935
  0.766203	 -1.843986	 -0.961366
  0.763118	 -1.863628	 -0.957614
  0.759779	 -1.882531	 -0.959608
  0.755328	 -1.902729	 -0.961766
  0.749962	 -1.922614	 -0.961279
  0.742129	 -1.940943	 -0.960064
  0.733530	 -1.958336	 -0.960411
  0.725977	 -1.976392	 -0.963089
  0.721928	 -1.998086	 -0.962461
  0.719444	 -2.019278	 -0.955165
  0.713091	 -2.034568	 -0.952734
  0.704545	 -2.053629	 -0.954339
  0.694768	 -2.071746	 -0.954972
  0.686348	 -2.091004	 -0.950773
  0.682921	 -2.110708	 -0.946009
  0.680503	 -2.130236	 -0.945415
  0.676617	 -2.149677	 -0.947437
  0.670903	 -2.169255	 -0.947158
  0.664016	 -2.187954	 -0.945204
  0.657049	 -2.206571	 -0.942834
  0.651217	 -2.225523	 -0.941869
  0.645036	 -2.245250	 -0.943508
  0.638033	 -2.265555	 -0.945733
  0.628927	 -2.285532	 -0.935776
  0.621445	 -2.303969	 -0.933751
