  1.536213	 -1.223541	  1.614993
  1.540431	 -1.219480	  1.619709
  1.529210	 -1.230282	  1.607163
  1.517990	 -1.241085	  1.594617
  1.506507	 -1.251509	  1.581988
  1.495069	 -1.261808	  1.569350
  1.484237	 -1.272038	  1.556325
  1.473203	 -1.282643	  1.542253
  1.462338	 -1.292865	  1.528942
  1.450367	 -1.302892	  1.517130
  1.437466	 -1.313469	  1.505471
  1.425663	 -1.323500	  1.492995
  1.411920	 -1.331875	  1.480806
  1.399078	 -1.340699	  1.467524
  1.387727	 -1.351892	  1.457544
  1.374125	 -1.365333	  1.447019
  1.362282	 -1.376864	  1.435317
  1.342789	 -1.379263	  1.422425
  1.327694	 -1.384409	  1.413506
  1.313848	 -1.396153	  1.402849
  1.301020	 -1.407864	  1.394115
  1.286354	 -1.420435	  1.387292
  1.271758	 -1.433536	  1.380764
  1.257451	 -1.444396	  1.371412
  1.245338	 -1.455331	  1.360831
  1.232390	 -1.468853	  1.352880
  1.215657	 -1.481737	  1.346254
  1.202865	 -1.489483	  1.335978
  1.190013	 -1.502209	  1.325462
  1.180069	 -1.514657	  1.314811
  1.168551	 -1.527761	  1.303308
  1.156768	 -1.540425	  1.293461
  1.146513	 -1.553143	  1.283406
  1.134138	 -1.566559	  1.271255
  1.120066	 -1.578431	  1.263527
  1.105429	 -1.591019	  1.259176
  1.090312	 -1.607231	  1.254907
  1.081075	 -1.624475	  1.247143
  1.077482	 -1.638381	  1.234772
  1.066295	 -1.652154	  1.221044
  1.053884	 -1.666113	  1.216715
  1.042750	 -1.682234	  1.210526
  1.032226	 -1.697248	  1.203324
  1.022480	 -1.713043	  1.194493
  1.013808	 -1.731464	  1.189962
  1.002903	 -1.746526	  1.185032
  0.990760	 -1.762531	  1.179982
  0.981026	 -1.779608	  1.174499
  0.973901	 -1.795002	  1.165089
  0.965946	 -1.811664	  1.155502
  0.957152	 -1.828715	  1.150134
  0.946996	 -1.844134	  1.144859
  0.937441	 -1.862131	  1.137253
  0.931393	 -1.879724	  1.130615
  0.922446	 -1.894708	  1.123192
  0.911951	 -1.911931	  1.116968
  0.904397	 -1.930370	  1.110908
  0.899383	 -1.945642	  1.100029
  0.892975	 -1.960535	  1.086575
  0.883154	 -1.975090	  1.076481
  0.873478	 -1.989948	  1.068597
  0.863910	 -2.005148	  1.058641
  0.854362	 -2.019796	  1.048856
  0.843886	 -2.034176	  1.040074
  0.833826	 -2.047996	  1.029474
  0.823838	 -2.061819	  1.018969
  0.813130	 -2.075229	  1.008829
  0.802587	 -2.088247	  0.997841
  0.792105	 -2.101242	  0.986828
  0.781249	 -2.113741	  0.975608
  0.770304	 -2.126120	  0.964339
  0.759307	 -2.138449	  0.953067
  0.748094	 -2.150572	  0.941785
  0.736881	 -2.162695	  0.930502
  0.725488	 -2.174841	  0.919425
  0.713961	 -2.187001	  0.908504
  0.702435	 -2.199161	  0.897584
  0.690619	 -2.211166	  0.886801
  0.678780	 -2.223158	  0.876029
  0.666841	 -2.235078	  0.865288
  0.654598	 -2.246775	  0.854643
  0.642355	 -2.258471	  0.843998
  0.629928	 -2.270203	  0.833610
  0.617348	 -2.281963	  0.823440
  0.604767	 -2.293724	  0.813270
  0.591926	 -2.305422	  0.803358
  0.579038	 -2.317108	  0.793492
  0.566081	 -2.328767	  0.783684
  0.553053	 -2.340418	  0.774295
  0.540419	 -2.353359	  0.765214
  0.527980	 -2.366639	  0.756207
  0.512975	 -2.375009	  0.745377
  0.499613	 -2.386510	  0.735933
