  1.957863	 -1.508332	 -0.411203
  1.991111	 -1.499675	 -0.439082
  1.979634	 -1.503746	 -0.422329
  1.967989	 -1.507556	 -0.410986
  1.951488	 -1.511014	 -0.399853
  1.931894	 -1.516421	 -0.378485
  1.924796	 -1.518811	 -0.368262
  1.914237	 -1.521908	 -0.352303
  1.895546	 -1.524927	 -0.332515
  1.882785	 -1.526756	 -0.322080
  1.871515	 -1.528229	 -0.312160
  1.855280	 -1.529307	 -0.294405
  1.839947	 -1.531134	 -0.279206
  1.828340	 -1.532775	 -0.268646
  1.815263	 -1.534881	 -0.252803
  1.800991	 -1.537167	 -0.235236
  1.789501	 -1.538910	 -0.221890
  1.776668	 -1.540527	 -0.206327
  1.764032	 -1.541829	 -0.190234
  1.752004	 -1.544522	 -0.174701
  1.740107	 -1.549588	 -0.161556
  1.721256	 -1.557136	 -0.145933
  1.704406	 -1.563480	 -0.133565
  1.695913	 -1.567331	 -0.127327
  1.683704	 -1.573106	 -0.112353
  1.668061	 -1.572765	 -0.095537
  1.651413	 -1.572554	 -0.082412
  1.640520	 -1.578600	 -0.067361
  1.632722	 -1.590950	 -0.051521
  1.626740	 -1.607188	 -0.030361
  1.618575	 -1.617332	 -0.013369
  1.607903	 -1.622602	 -0.001806
  1.598047	 -1.625976	  0.010735
  1.579855	 -1.632670	  0.027032
  1.567182	 -1.645969	  0.044144
  1.562246	 -1.660428	  0.057942
  1.557229	 -1.672174	  0.066987
  1.551120	 -1.692191	  0.082747
  1.548393	 -1.704759	  0.098061
  1.548659	 -1.711593	  0.120161
  1.553295	 -1.716517	  0.136749
  1.556062	 -1.724905	  0.157700
  1.558379	 -1.732897	  0.176408
  1.561225	 -1.741649	  0.194092
  1.563704	 -1.750524	  0.211919
  1.566417	 -1.759431	  0.229665
  1.568897	 -1.768363	  0.247389
  1.571203	 -1.777365	  0.265072
  1.567989	 -1.787500	  0.281980
  1.563584	 -1.797818	  0.298534
  1.559160	 -1.808163	  0.315072
  1.553070	 -1.818347	  0.331157
  1.543395	 -1.827951	  0.345788
  1.533672	 -1.837548	  0.360385
  1.523987	 -1.846981	  0.374833
  1.512223	 -1.855559	  0.386582
  1.504784	 -1.865741	  0.402099
  1.503079	 -1.874861	  0.424879
  1.494969	 -1.881048	  0.444931
  1.485606	 -1.884235	  0.458877
  1.473463	 -1.888779	  0.475796
  1.461424	 -1.891754	  0.491833
  1.450616	 -1.893963	  0.505717
  1.437116	 -1.896649	  0.523771
  1.424766	 -1.898579	  0.538154
  1.413697	 -1.900996	  0.551167
  1.399874	 -1.902139	  0.567329
  1.385722	 -1.901369	  0.580463
  1.372776	 -1.902534	  0.594224
  1.357019	 -1.906707	  0.607893
  1.336728	 -1.910969	  0.617815
  1.322148	 -1.911051	  0.625095
  1.306775	 -1.904763	  0.634163
  1.289350	 -1.895510	  0.644811
  1.270098	 -1.890021	  0.651003
  1.250758	 -1.885683	  0.655048
  1.232208	 -1.878849	  0.657001
  1.213247	 -1.871662	  0.656396
  1.194295	 -1.865213	  0.655896
  1.176099	 -1.857125	  0.656847
  1.159308	 -1.847733	  0.658716
  1.141709	 -1.841284	  0.662465
  1.124336	 -1.834690	  0.661650
  1.097478	 -1.818942	  0.655365
  1.082404	 -1.808779	  0.653595
  1.075236	 -1.803051	  0.653439
  1.060571	 -1.787435	  0.655029
  1.043576	 -1.771858	  0.659984
  1.022782	 -1.757337	  0.661238
  1.007488	 -1.750919	  0.661750
  0.992483	 -1.744631	  0.666533
  0.975908	 -1.735297	  0.673907
  0.951753	 -1.726321	  0.678815
  0.929187	 -1.722770	  0.680828
  0.912020	 -1.723662	  0.688042
  0.895083	 -1.722410	  0.696946
  0.878169	 -1.715707	  0.704802
  0.861716	 -1.710403	  0.712986
  0.841462	 -1.706378	  0.722246
  0.824968	 -1.702146	  0.730301
  0.809080	 -1.696600	  0.737598
  0.788667	 -1.690591	  0.751541
  0.777953	 -1.688207	  0.765907
  0.768653	 -1.686496	  0.781985
  0.748406	 -1.683039	  0.801815
  0.736464	 -1.682454	  0.811217
  0.723187	 -1.684090	  0.820407
  0.700009	 -1.685330	  0.834832
  0.683516	 -1.683358	  0.846745
  0.674380	 -1.681842	  0.853951
  0.657732	 -1.674612	  0.871936
  0.643171	 -1.667131	  0.888297
  0.634158	 -1.662847	  0.896525
  0.613822	 -1.662590	  0.914396
  0.598235	 -1.665790	  0.927739
  0.588676	 -1.666696	  0.936324
  0.572258	 -1.670457	  0.951140
  0.555356	 -1.673927	  0.967045
  0.542861	 -1.675078	  0.980140
  0.532244	 -1.675217	  0.992736
  0.523107	 -1.674304	  1.004402
  0.510271	 -1.669440	  1.030251
  0.496716	 -1.669510	  1.058207
  0.482593	 -1.677636	  1.073816
  0.469901	 -1.685904	  1.080640
  0.456240	 -1.694235	  1.085431
  0.435625	 -1.707686	  1.096390
  0.425286	 -1.716201	  1.105399
  0.411266	 -1.724727	  1.118301
  0.397009	 -1.732471	  1.131978
  0.384939	 -1.738699	  1.144094
  0.370137	 -1.746005	  1.158426
  0.356997	 -1.752364	  1.170476
  0.344080	 -1.758946	  1.183305
  0.329999	 -1.766125	  1.200194
  0.319110	 -1.771020	  1.211971
  0.306501	 -1.777295	  1.225487
  0.290864	 -1.783605	  1.245087
  0.283332	 -1.786161	  1.254312
  0.272529	 -1.791669	  1.268960
  0.257571	 -1.795967	  1.286141
  0.243857	 -1.803805	  1.301465
  0.233632	 -1.815979	  1.313755
  0.224552	 -1.827506	  1.330743
  0.211816	 -1.827679	  1.347456
  0.195499	 -1.824670	  1.362170
  0.182912	 -1.819692	  1.375749
  0.169499	 -1.819987	  1.391270
  0.156106	 -1.821943	  1.406048
  0.146643	 -1.823138	  1.424826
  0.135546	 -1.819926	  1.445044
  0.119535	 -1.815862	  1.460132
  0.102114	 -1.814494	  1.469101
  0.084418	 -1.817462	  1.476702
  0.067873	 -1.818467	  1.489025
  0.052288	 -1.819785	  1.500672
  0.037287	 -1.821604	  1.514817
  0.020826	 -1.823410	  1.526630
  0.004260	 -1.826703	  1.537012
 -0.010990	 -1.829317	  1.548291
 -0.023060	 -1.831103	  1.558854
 -0.040811	 -1.836050	  1.579310
 -0.058731	 -1.843159	  1.593024
 -0.071215	 -1.848761	  1.601088
 -0.085610	 -1.856150	  1.609124
 -0.101960	 -1.866247	  1.618355
 -0.116279	 -1.875061	  1.627091
 -0.133656	 -1.885135	  1.638087
 -0.148805	 -1.890424	  1.648457
 -0.161849	 -1.892773	  1.657459
 -0.180693	 -1.897592	  1.672011
 -0.195700	 -1.904058	  1.683543
