 -2.372792	  0.803327	 -0.071303
 -2.368646	  0.797262	 -0.062382
 -2.365617	  0.792831	 -0.055865
 -2.358517	  0.782326	 -0.040450
 -2.351775	  0.771465	 -0.025185
 -2.344995	  0.760830	 -0.009563
 -2.339304	  0.751062	  0.005937
 -2.333789	  0.740856	  0.023760
 -2.326792	  0.729161	  0.038868
 -2.317389	  0.718037	  0.052038
 -2.309804	  0.705048	  0.065529
 -2.304164	  0.692011	  0.079704
 -2.298462	  0.681093	  0.095234
 -2.289915	  0.671078	  0.110294
 -2.280689	  0.661314	  0.125193
 -2.277385	  0.646607	  0.141191
 -2.273151	  0.632710	  0.155120
 -2.262049	  0.622394	  0.166214
 -2.247828	  0.610342	  0.177618
 -2.235008	  0.596116	  0.187439
 -2.225627	  0.582286	  0.200288
 -2.219033	  0.576459	  0.216888
 -2.210232	  0.567584	  0.232640
 -2.203278	  0.555934	  0.246335
 -2.193562	  0.541741	  0.262760
 -2.183768	  0.533819	  0.276366
 -2.173038	  0.526339	  0.290840
 -2.161075	  0.519202	  0.306045
 -2.154213	  0.510003	  0.321713
 -2.148373	  0.494488	  0.338814
 -2.138960	  0.485022	  0.350148
 -2.127892	  0.472956	  0.363702
 -2.118441	  0.460931	  0.378651
 -2.114904	  0.451289	  0.389910
 -2.108498	  0.441144	  0.406881
 -2.108581	  0.429295	  0.424092
 -2.109402	  0.424370	  0.440494
 -2.120171	  0.421470	  0.457571
 -2.118458	  0.412227	  0.475432
 -2.130159	  0.413332	  0.491862
 -2.141087	  0.411137	  0.506753
 -2.153775	  0.408725	  0.527452
 -2.163783	  0.407750	  0.543314
 -2.175109	  0.406525	  0.555891
 -2.190290	  0.405101	  0.570853
 -2.204139	  0.404012	  0.585789
 -2.217216	  0.403345	  0.600867
 -2.229113	  0.402727	  0.616602
 -2.241543	  0.401561	  0.632932
 -2.252392	  0.400742	  0.649021
 -2.265918	  0.400652	  0.665377
 -2.275310	  0.402757	  0.681573
 -2.287179	  0.401634	  0.695405
 -2.296505	  0.400480	  0.714017
 -2.305508	  0.399353	  0.730946
 -2.314025	  0.399435	  0.749246
 -2.322005	  0.399760	  0.767905
 -2.334933	  0.400289	  0.798660
 -2.337506	  0.400395	  0.804782
