 -1.640961	  0.031606	  1.828562
 -1.653849	  0.034332	  1.830656
 -1.666737	  0.037058	  1.832750
 -1.647411	  0.032973	  1.829617
 -1.627992	  0.029017	  1.826958
 -1.608241	  0.025902	  1.827243
 -1.588485	  0.022804	  1.827580
 -1.568699	  0.020142	  1.828768
 -1.549080	  0.017645	  1.830109
 -1.529287	  0.014493	  1.829669
 -1.510388	  0.010410	  1.827579
 -1.489726	  0.005018	  1.827646
 -1.469550	  0.000379	  1.831071
 -1.450425	 -0.002242	  1.833736
 -1.430872	 -0.003373	  1.832018
 -1.411023	 -0.005795	  1.828482
 -1.390756	 -0.006923	  1.826268
 -1.370447	 -0.008847	  1.825957
 -1.350550	 -0.008700	  1.825500
 -1.330729	 -0.008842	  1.823206
 -1.310799	 -0.008111	  1.820505
 -1.291016	 -0.009753	  1.819122
 -1.269626	 -0.008554	  1.820791
 -1.249626	 -0.007121	  1.823945
 -1.230489	 -0.001909	  1.823597
 -1.210238	  0.001215	  1.822742
 -1.191376	  0.003386	  1.819460
 -1.170982	  0.005466	  1.817796
 -1.151207	  0.008822	  1.816426
 -1.131609	  0.012764	  1.815409
 -1.111937	  0.016410	  1.814499
 -1.092214	  0.019793	  1.814143
 -1.072508	  0.023201	  1.813891
 -1.052800	  0.026594	  1.813645
 -1.032923	  0.028803	  1.813795
 -1.013029	  0.030844	  1.814002
 -0.993132	  0.032837	  1.814247
 -0.973211	  0.032651	  1.815957
 -0.953288	  0.032425	  1.817698
 -0.933377	  0.032041	  1.819530
 -0.913664	  0.030074	  1.822268
 -0.893955	  0.028081	  1.825019
 -0.874308	  0.025682	  1.827891
 -0.854859	  0.022265	  1.831057
 -0.835447	  0.019069	  1.834324
 -0.815851	  0.016027	  1.838075
 -0.796486	  0.012453	  1.841648
 -0.777614	  0.008052	  1.845149
 -0.757434	  0.005938	  1.848150
 -0.737402	  0.004171	  1.850006
 -0.718978	 -0.000590	  1.851320
 -0.699251	 -0.001542	  1.853463
 -0.676923	 -0.003494	  1.853362
 -0.660263	 -0.008880	  1.852601
 -0.640224	 -0.012806	  1.854074
 -0.619754	 -0.014481	  1.855421
 -0.599730	 -0.014632	  1.854927
 -0.579649	 -0.014926	  1.855318
 -0.559740	 -0.016413	  1.855637
 -0.539730	 -0.017190	  1.855157
 -0.519744	 -0.017985	  1.854441
 -0.499767	 -0.018774	  1.853909
 -0.479962	 -0.019496	  1.851198
 -0.460425	 -0.016433	  1.848153
 -0.453259	  0.001548	  1.845758
 -0.445053	  0.020403	  1.842711
 -0.437613	  0.039087	  1.839535
 -0.432183	  0.057903	  1.836176
 -0.425561	  0.076227	  1.832638
 -0.420492	  0.095217	  1.828953
 -0.415424	  0.114154	  1.825257
 -0.408050	  0.131569	  1.821357
 -0.398512	  0.145822	  1.816858
 -0.387714	  0.159323	  1.811353
 -0.374136	  0.172802	  1.804590
 -0.359473	  0.184880	  1.798261
 -0.344768	  0.196811	  1.792451
 -0.332000	  0.211501	  1.786254
 -0.318562	  0.225021	  1.779669
 -0.304113	  0.237257	  1.772714
 -0.289224	  0.247966	  1.767210
 -0.271089	  0.252004	  1.761511
 -0.255863	  0.258860	  1.753446
 -0.239460	  0.262512	  1.742621
 -0.225999	  0.269709	  1.730595
 -0.208898	  0.273221	  1.719682
 -0.192719	  0.278036	  1.709120
 -0.175133	  0.279984	  1.701204
 -0.157318	  0.279539	  1.691011
 -0.141788	  0.276301	  1.682075
 -0.125197	  0.278983	  1.670789
 -0.109212	  0.279819	  1.658402
 -0.096497	  0.273911	  1.644348
 -0.082927	  0.263997	  1.636795
 -0.064262	  0.264176	  1.624938
 -0.049136	  0.255807	  1.616402
 -0.035866	  0.245399	  1.610549
 -0.020577	  0.235822	  1.602411
 -0.003979	  0.227495	  1.593048
  0.008652	  0.213479	  1.589354
  0.026091	  0.202969	  1.583412
  0.037572	  0.187716	  1.578433
  0.045153	  0.169551	  1.577457
  0.057954	  0.153787	  1.574080
  0.076381	  0.138348	  1.570474
  0.085926	  0.128807	  1.566691
  0.089693	  0.107724	  1.567806
  0.100072	  0.093351	  1.564497
  0.105882	  0.074161	  1.562772
  0.109049	  0.056456	  1.557384
  0.111113	  0.035668	  1.556130
  0.114985	  0.015922	  1.554105
  0.117633	 -0.003912	  1.554251
  0.121533	 -0.023519	  1.552507
  0.125972	 -0.042700	  1.551519
  0.134084	 -0.062350	  1.546446
  0.141516	 -0.081050	  1.543469
  0.146102	 -0.099981	  1.538979
  0.150186	 -0.118283	  1.535385
  0.155413	 -0.136696	  1.526863
  0.163161	 -0.153326	  1.516662
  0.166669	 -0.172723	  1.511224
  0.173604	 -0.190757	  1.505668
  0.183861	 -0.205418	  1.495350
  0.191441	 -0.221769	  1.487128
  0.198469	 -0.239342	  1.479830
  0.209581	 -0.253642	  1.471280
  0.219335	 -0.268923	  1.463557
  0.229573	 -0.285534	  1.457984
  0.241135	 -0.300988	  1.447657
  0.254225	 -0.311970	  1.443864
  0.268852	 -0.325615	  1.438808
  0.283948	 -0.339467	  1.433109
  0.295644	 -0.351669	  1.430464
  0.311953	 -0.363443	  1.431488
  0.329087	 -0.374179	  1.434699
  0.344231	 -0.389409	  1.438545
  0.356842	 -0.403103	  1.442349
  0.374086	 -0.410684	  1.447594
  0.390791	 -0.420639	  1.454148
  0.407839	 -0.430608	  1.457434
  0.424363	 -0.440467	  1.460794
  0.443526	 -0.448891	  1.465599
  0.459039	 -0.460159	  1.473452
  0.475882	 -0.463105	  1.481719
  0.493718	 -0.464859	  1.492571
  0.512146	 -0.469444	  1.499574
  0.529912	 -0.472452	  1.508823
  0.546861	 -0.469415	  1.519304
  0.564016	 -0.469060	  1.531145
  0.578786	 -0.464175	  1.543681
  0.592594	 -0.456609	  1.553660
  0.607095	 -0.448933	  1.564221
  0.618575	 -0.437946	  1.576402
  0.629188	 -0.426682	  1.589334
  0.638565	 -0.415626	  1.603081
  0.646615	 -0.404027	  1.616798
  0.653420	 -0.391635	  1.630551
  0.658218	 -0.380427	  1.646625
  0.663473	 -0.369974	  1.663415
  0.672436	 -0.357958	  1.676394
  0.679023	 -0.346658	  1.688951
  0.690711	 -0.332745	  1.702698
  0.703473	 -0.324390	  1.717895
  0.712417	 -0.318038	  1.731150
  0.721439	 -0.310868	  1.747090
  0.732256	 -0.305346	  1.762842
  0.741766	 -0.301589	  1.778547
  0.756965	 -0.297458	  1.795675
  0.769787	 -0.294212	  1.809467
  0.781880	 -0.290780	  1.823139
  0.794309	 -0.289227	  1.837882
  0.806163	 -0.290727	  1.852868
  0.819806	 -0.289829	  1.865093
  0.834010	 -0.293752	  1.878710
  0.848240	 -0.297773	  1.892646
  0.860880	 -0.303022	  1.907275
  0.873993	 -0.307820	  1.921702
  0.886659	 -0.313266	  1.935816
  0.899917	 -0.318102	  1.948604
  0.918452	 -0.322776	  1.956612
  0.935615	 -0.324575	  1.954965
  0.953617	 -0.330062	  1.949799
  0.969164	 -0.331954	  1.939220
  0.989872	 -0.328823	  1.928591
  1.007419	 -0.323017	  1.920367
  1.022683	 -0.321109	  1.911553
  1.040895	 -0.320998	  1.901004
  1.056384	 -0.319540	  1.889182
  1.071962	 -0.317619	  1.876979
  1.091450	 -0.312260	  1.866583
  1.108830	 -0.309862	  1.860712
  1.128404	 -0.309230	  1.854575
  1.147852	 -0.309316	  1.850781
  1.162880	 -0.311221	  1.849587
  1.181504	 -0.311942	  1.845259
  1.202000	 -0.313695	  1.843396
  1.219966	 -0.313835	  1.840621
  1.240104	 -0.318409	  1.844465
  1.258556	 -0.323446	  1.847977
  1.278131	 -0.326905	  1.851744
  1.298055	 -0.329501	  1.854926
  1.318739	 -0.330972	  1.856447
  1.338832	 -0.332171	  1.857991
  1.358450	 -0.333955	  1.857154
  1.377835	 -0.335888	  1.856531
  1.397448	 -0.340151	  1.856179
  1.417006	 -0.345146	  1.855217
  1.436539	 -0.349230	  1.853236
  1.456097	 -0.351988	  1.852913
  1.475287	 -0.356202	  1.853079
  1.495200	 -0.358401	  1.852355
  1.515154	 -0.361389	  1.853234
  1.535328	 -0.363142	  1.852507
  1.555176	 -0.365621	  1.852439
  1.575444	 -0.366879	  1.850998
  1.595459	 -0.368054	  1.849698
  1.615349	 -0.368028	  1.847664
  1.635477	 -0.368230	  1.846687
  1.644973	 -0.368258	  1.846199
  1.655505	 -0.368290	  1.845657
