 -0.595832	 -1.679576	  2.450492
 -0.589932	 -1.662947	  2.426229
 -0.602601	 -1.634331	  2.389365
 -0.630843	 -1.619806	  2.350990
 -0.647220	 -1.593964	  2.308707
 -0.668817	 -1.577976	  2.266170
 -0.688782	 -1.566639	  2.223237
 -0.706942	 -1.548156	  2.179643
 -0.731299	 -1.529789	  2.139998
 -0.757333	 -1.513896	  2.101939
 -0.783901	 -1.496510	  2.062527
 -0.809722	 -1.476658	  2.023273
 -0.834577	 -1.455006	  1.984467
 -0.858047	 -1.432901	  1.946703
 -0.879898	 -1.411051	  1.905936
 -0.897820	 -1.389485	  1.862640
 -0.913814	 -1.366646	  1.821920
 -0.931667	 -1.346079	  1.781017
 -0.952020	 -1.328656	  1.741532
 -0.974488	 -1.309909	  1.700476
 -0.999657	 -1.286545	  1.659604
 -1.025656	 -1.260458	  1.623351
 -1.051491	 -1.235473	  1.591337
 -1.077179	 -1.208520	  1.559909
 -1.101900	 -1.182183	  1.522319
 -1.120074	 -1.157972	  1.480286
 -1.133256	 -1.136130	  1.437302
 -1.150262	 -1.114318	  1.395032
 -1.180265	 -1.095111	  1.352292
 -1.242344	 -1.084038	  1.309162
 -1.370951	 -1.097794	  1.277889
 -1.525557	 -1.127704	  1.272230
 -1.600397	 -1.137437	  1.270870
 -1.651091	 -1.137532	  1.262939
 -1.699893	 -1.127731	  1.242411
 -1.737521	 -1.108012	  1.210340
 -1.758748	 -1.085150	  1.175388
 -1.767808	 -1.056185	  1.131723
 -1.758030	 -1.018226	  1.081088
 -1.728289	 -0.974790	  1.027435
 -1.667192	 -0.919266	  0.943027
 -1.596891	 -0.862291	  0.844931
 -1.568750	 -0.827338	  0.789592
 -1.561402	 -0.805661	  0.755251
 -1.564092	 -0.784064	  0.720908
 -1.577735	 -0.759592	  0.685678
 -1.600458	 -0.731195	  0.650844
 -1.625072	 -0.701455	  0.620936
 -1.645342	 -0.674956	  0.600242
 -1.666789	 -0.641388	  0.582592
 -1.700635	 -0.567432	  0.565187
 -1.747718	 -0.469714	  0.566553
 -1.792204	 -0.413139	  0.565839
 -1.824016	 -0.350056	  0.568247
 -1.854877	 -0.255192	  0.561481
 -1.872465	 -0.186947	  0.539631
 -1.884231	 -0.136439	  0.501842
 -1.913140	 -0.101996	  0.434167
 -1.976702	 -0.104279	  0.350886
 -2.011294	 -0.119849	  0.299318
 -2.026598	 -0.141291	  0.253495
 -2.024398	 -0.178888	  0.195115
 -2.008755	 -0.223741	  0.137541
 -1.983190	 -0.279078	  0.064735
 -1.966748	 -0.330373	 -0.033557
 -1.986177	 -0.340522	 -0.114987
 -2.015880	 -0.326275	 -0.165572
 -2.041721	 -0.308635	 -0.202790
 -2.067757	 -0.289798	 -0.241096
 -2.093754	 -0.269649	 -0.280199
 -2.119839	 -0.248221	 -0.320798
 -2.143586	 -0.227236	 -0.359932
 -2.164931	 -0.206583	 -0.398075
 -2.184722	 -0.185033	 -0.437619
 -2.204306	 -0.162067	 -0.476344
 -2.224920	 -0.136318	 -0.512398
 -2.248293	 -0.108909	 -0.549536
 -2.273555	 -0.087215	 -0.587291
 -2.301262	 -0.070574	 -0.626091
 -2.331562	 -0.057207	 -0.667761
 -2.357700	 -0.045382	 -0.709138
 -2.379229	 -0.032473	 -0.749649
 -2.400415	 -0.015378	 -0.791709
 -2.421124	  0.005355	 -0.834589
 -2.440446	  0.028322	 -0.876983
 -2.458546	  0.052774	 -0.919313
 -2.476167	  0.076200	 -0.960210
 -2.495436	  0.098078	 -1.000366
 -2.515613	  0.118845	 -1.038625
 -2.537633	  0.140327	 -1.077610
 -2.559860	  0.161033	 -1.115095
 -2.584209	  0.182058	 -1.154607
 -2.610920	  0.200191	 -1.195066
 -2.632765	  0.214906	 -1.237543
 -2.658113	  0.237398	 -1.276353
 -2.682259	  0.256661	 -1.318944
 -2.709081	  0.259227	 -1.332134
