  1.453400	  1.121878	  1.718749
  1.457021	  1.123522	  1.720388
  1.418286	  1.105934	  1.702856
  1.378434	  1.085177	  1.684214
  1.338987	  1.062475	  1.665141
  1.299387	  1.037525	  1.646974
  1.260524	  1.012275	  1.631318
  1.221606	  0.987960	  1.617816
  1.180649	  0.964371	  1.604672
  1.136870	  0.941737	  1.590808
  1.092547	  0.922234	  1.576956
  1.049131	  0.905631	  1.562751
  1.000568	  0.895104	  1.550399
  0.952414	  0.876987	  1.531732
  0.908608	  0.866249	  1.511341
  0.867867	  0.843525	  1.495579
  0.823296	  0.824834	  1.477603
  0.782818	  0.809930	  1.462156
  0.738327	  0.787331	  1.449818
  0.692241	  0.765607	  1.428784
  0.651857	  0.748102	  1.409733
  0.610311	  0.736599	  1.395138
  0.568277	  0.713131	  1.378291
  0.528890	  0.692028	  1.359379
  0.496537	  0.658039	  1.343774
  0.456962	  0.628615	  1.327399
  0.416072	  0.603755	  1.311268
  0.372512	  0.581276	  1.294705
  0.324902	  0.562413	  1.276645
  0.274306	  0.549951	  1.256196
  0.224202	  0.542739	  1.233279
  0.176266	  0.537423	  1.208892
  0.131890	  0.532078	  1.184949
  0.088794	  0.524434	  1.161861
  0.046243	  0.513570	  1.139379
  0.003496	  0.500530	  1.117044
 -0.038992	  0.487106	  1.096054
 -0.080172	  0.472278	  1.077364
 -0.121754	  0.454141	  1.058726
 -0.161612	  0.435743	  1.041187
 -0.204110	  0.417024	  1.022788
 -0.246535	  0.397616	  1.006287
 -0.288057	  0.376567	  0.992041
 -0.329466	  0.352563	  0.977136
 -0.371254	  0.327388	  0.961184
 -0.412221	  0.304624	  0.947025
 -0.451884	  0.284319	  0.935608
 -0.492378	  0.264783	  0.927496
 -0.533714	  0.245090	  0.922582
 -0.577821	  0.222738	  0.918339
 -0.626904	  0.195138	  0.907986
 -0.675190	  0.166518	  0.890611
 -0.718784	  0.140930	  0.872487
 -0.759768	  0.117785	  0.855437
 -0.798912	  0.096890	  0.839758
 -0.838291	  0.077159	  0.824911
 -0.880582	  0.057815	  0.810107
 -0.927582	  0.038662	  0.794417
 -0.976698	  0.021854	  0.775182
 -1.025187	  0.006853	  0.752815
 -1.069993	 -0.006931	  0.726055
 -1.110816	 -0.018443	  0.699289
 -1.151013	 -0.028557	  0.674197
 -1.191741	 -0.040267	  0.651273
 -1.225998	 -0.060140	  0.629764
 -1.238111	 -0.090641	  0.615202
 -1.233348	 -0.168673	  0.614170
 -1.240108	 -0.330570	  0.616415
 -1.284594	 -0.437459	  0.601350
 -1.306428	 -0.455053	  0.595352
 -1.310858	 -0.455946	  0.594255
 -1.379611	 -0.443907	  0.578636
 -1.513580	 -0.390293	  0.551041
 -1.616254	 -0.295305	  0.529473
 -1.673322	 -0.234999	  0.497961
 -1.721790	 -0.248576	  0.462686
 -1.758212	 -0.269180	  0.441443
 -1.796666	 -0.290368	  0.423883
 -1.846132	 -0.311016	  0.409154
 -1.935284	 -0.317868	  0.402307
 -2.062022	 -0.269640	  0.439367
 -2.154174	 -0.181402	  0.499149
 -2.244660	 -0.134600	  0.506086
 -2.383094	 -0.245262	  0.403783
 -2.453910	 -0.269589	  0.379897
 -2.508549	 -0.289954	  0.358998
 -2.561809	 -0.311675	  0.336330
 -2.617556	 -0.337070	  0.311940
 -2.655927	 -0.356479	  0.294289
