 -1.937272	 -1.503143	  0.707503
 -1.979916	 -1.502288	  0.722270
 -1.961232	 -1.502831	  0.715157
 -1.942547	 -1.503374	  0.708044
 -1.923986	 -1.503956	  0.700618
 -1.905498	 -1.504560	  0.693013
 -1.887055	 -1.505153	  0.685300
 -1.868721	 -1.505717	  0.677329
 -1.850387	 -1.506281	  0.669357
 -1.832192	 -1.506623	  0.661059
 -1.814020	 -1.506934	  0.652713
 -1.795917	 -1.507156	  0.644213
 -1.777926	 -1.507246	  0.635479
 -1.759934	 -1.507335	  0.626744
 -1.742062	 -1.507083	  0.617770
 -1.724206	 -1.506787	  0.608765
 -1.706346	 -1.506344	  0.599775
 -1.688479	 -1.505249	  0.590855
 -1.670612	 -1.504154	  0.581936
 -1.652736	 -1.502789	  0.573071
 -1.634853	 -1.500685	  0.564365
 -1.616971	 -1.498581	  0.555660
 -1.599097	 -1.496163	  0.547018
 -1.581267	 -1.492941	  0.538549
 -1.563437	 -1.489719	  0.530080
 -1.545636	 -1.486201	  0.521670
 -1.527938	 -1.481850	  0.513433
 -1.510240	 -1.477500	  0.505196
 -1.492590	 -1.472887	  0.496998
 -1.475147	 -1.467314	  0.488956
 -1.457703	 -1.461741	  0.480915
 -1.440317	 -1.455968	  0.472890
 -1.423280	 -1.449109	  0.464972
 -1.406243	 -1.442250	  0.457055
 -1.389246	 -1.435271	  0.449154
 -1.372648	 -1.427229	  0.441419
 -1.356050	 -1.419187	  0.433683
 -1.339544	 -1.410994	  0.425910
 -1.323330	 -1.402340	  0.418023
 -1.307116	 -1.393685	  0.410136
 -1.291062	 -1.385048	  0.401911
 -1.275064	 -1.376418	  0.393568
 -1.259097	 -1.368119	  0.384841
 -1.243158	 -1.360069	  0.375831
 -1.227498	 -1.353072	  0.365546
 -1.211888	 -1.346237	  0.355076
 -1.196046	 -1.339062	  0.345200
 -1.180094	 -1.331718	  0.335629
 -1.164142	 -1.324374	  0.326058
 -1.148158	 -1.316823	  0.316704
 -1.132169	 -1.309232	  0.307391
 -1.116180	 -1.301640	  0.298079
 -1.100027	 -1.293276	  0.289766
 -1.083769	 -1.284098	  0.282594
 -1.067510	 -1.274921	  0.275421
 -1.051252	 -1.265743	  0.268249
 -1.034887	 -1.256045	  0.262073
 -1.018470	 -1.245887	  0.256849
 -1.002053	 -1.235730	  0.251624
 -0.985636	 -1.225572	  0.246399
 -0.969055	 -1.215449	  0.241642
 -0.952454	 -1.205332	  0.236950
 -0.935852	 -1.195215	  0.232257
 -0.919250	 -1.185098	  0.227564
 -0.902639	 -1.174214	  0.225195
 -0.886035	 -1.163292	  0.222954
 -0.869431	 -1.152370	  0.220713
 -0.852827	 -1.141448	  0.218472
 -0.836223	 -1.130526	  0.216231
 -0.819971	 -1.118935	  0.217453
 -0.803726	 -1.107337	  0.218716
 -0.787480	 -1.095740	  0.219979
 -0.771235	 -1.084143	  0.221242
 -0.754844	 -1.072814	  0.222975
 -0.738230	 -1.061978	  0.225532
 -0.721615	 -1.051143	  0.228090
 -0.704788	 -1.040595	  0.230460
 -0.687128	 -1.031339	  0.232017
 -0.669467	 -1.022083	  0.233574
 -0.651093	 -1.014270	  0.234724
 -0.632288	 -1.007461	  0.234917
 -0.612839	 -1.003722	  0.232134
 -0.593389	 -0.999983	  0.229352
 -0.574116	 -0.999846	  0.224013
 -0.554868	 -0.999853	  0.218577
 -0.535826	 -1.001038	  0.212579
 -0.517218	 -1.003846	  0.205808
 -0.499201	 -1.008169	  0.198278
 -0.481842	 -1.013730	  0.190048
 -0.465324	 -1.020454	  0.180995
 -0.449375	 -1.027804	  0.171424
 -0.433701	 -1.035437	  0.161623
 -0.418368	 -1.043199	  0.151393
 -0.403154	 -1.051004	  0.141019
 -0.387939	 -1.058803	  0.130642
 -0.372560	 -1.065916	  0.120017
 -0.357181	 -1.073028	  0.109392
 -0.341802	 -1.080141	  0.098766
 -0.326219	 -1.086483	  0.087951
 -0.310495	 -1.092213	  0.077000
 -0.294771	 -1.097942	  0.066049
 -0.279047	 -1.103671	  0.055098
 -0.263067	 -1.108181	  0.043949
 -0.247030	 -1.112359	  0.032753
 -0.230993	 -1.116537	  0.021557
 -0.214947	 -1.120665	  0.010354
 -0.198729	 -1.123508	 -0.000999
 -0.182512	 -1.126352	 -0.012353
 -0.166294	 -1.129195	 -0.023707
 -0.150035	 -1.131512	 -0.035120
 -0.133751	 -1.133420	 -0.046574
 -0.117468	 -1.135328	 -0.058029
 -0.101161	 -1.137010	 -0.069485
 -0.084829	 -1.138428	 -0.080943
 -0.068497	 -1.139846	 -0.092400
 -0.052126	 -1.141024	 -0.103828
 -0.035736	 -1.142081	 -0.115240
 -0.019338	 -1.143094	 -0.126645
 -0.002864	 -1.143642	 -0.137973
  0.013610	 -1.144190	 -0.149300
  0.030162	 -1.144365	 -0.160524
  0.046777	 -1.144219	 -0.171657
  0.063391	 -1.144073	 -0.182790
  0.080313	 -1.143077	 -0.193404
  0.097301	 -1.141882	 -0.203892
  0.114288	 -1.140687	 -0.214379
  0.131596	 -1.138175	 -0.224082
  0.149053	 -1.134825	 -0.233249
  0.166510	 -1.131476	 -0.242415
  0.183769	 -1.127200	 -0.251572
  0.200377	 -1.120689	 -0.260615
  0.214712	 -1.113728	 -0.272700
  0.222068	 -1.106704	 -0.289921
  0.229423	 -1.099680	 -0.307142
  0.236923	 -1.093963	 -0.324779
  0.244478	 -1.088852	 -0.342578
  0.252346	 -1.084323	 -0.360399
  0.260906	 -1.081159	 -0.378196
  0.269465	 -1.077995	 -0.395992
  0.278250	 -1.075152	 -0.413733
  0.287793	 -1.073442	 -0.431226
  0.297336	 -1.071732	 -0.448720
  0.306879	 -1.070022	 -0.466213
  0.317066	 -1.068883	 -0.483386
  0.327639	 -1.068096	 -0.500345
  0.338212	 -1.067310	 -0.517303
  0.348785	 -1.066523	 -0.534262
  0.360222	 -1.066086	 -0.550663
  0.371980	 -1.065782	 -0.566839
  0.383737	 -1.065478	 -0.583016
  0.395494	 -1.065174	 -0.599192
  0.408296	 -1.065029	 -0.614557
  0.421423	 -1.064935	 -0.629646
  0.434550	 -1.064841	 -0.644735
  0.447677	 -1.064747	 -0.659824
  0.461853	 -1.064487	 -0.673930
  0.476224	 -1.064193	 -0.687836
  0.490596	 -1.063900	 -0.701742
  0.505091	 -1.063577	 -0.715517
  0.520581	 -1.063002	 -0.728156
  0.536071	 -1.062427	 -0.740794
  0.551561	 -1.061852	 -0.753433
  0.567644	 -1.061107	 -0.765298
  0.584121	 -1.060245	 -0.776601
  0.600599	 -1.059383	 -0.787904
  0.617312	 -1.058526	 -0.798855
  0.634705	 -1.057686	 -0.808693
  0.652098	 -1.056847	 -0.818530
  0.669583	 -1.056052	 -0.828207
  0.687664	 -1.055566	 -0.836742
  0.705745	 -1.055080	 -0.845277
  0.723991	 -1.054834	 -0.853464
  0.742636	 -1.055239	 -0.860689
  0.761280	 -1.055643	 -0.867915
  0.780194	 -1.057032	 -0.874267
  0.799213	 -1.058926	 -0.880157
  0.818273	 -1.061242	 -0.885756
  0.837379	 -1.065043	 -0.890286
  0.856485	 -1.068844	 -0.894816
  0.875348	 -1.074246	 -0.898687
  0.894153	 -1.079931	 -0.902437
  0.912619	 -1.086571	 -0.906300
  0.930788	 -1.093941	 -0.910246
  0.948778	 -1.101639	 -0.914379
  0.966220	 -1.110249	 -0.919034
  0.983661	 -1.118859	 -0.923688
  1.000817	 -1.127872	 -0.928633
  1.017820	 -1.137090	 -0.933725
  1.034823	 -1.146307	 -0.938817
  1.051803	 -1.155390	 -0.944218
  1.068774	 -1.164418	 -0.949740
  1.085744	 -1.173447	 -0.955262
  1.102818	 -1.181954	 -0.961271
  1.119931	 -1.190227	 -0.967493
  1.137044	 -1.198500	 -0.973715
  1.154469	 -1.205870	 -0.980199
  1.172063	 -1.212682	 -0.986836
  1.189657	 -1.219493	 -0.993472
  1.207514	 -1.225569	 -1.000123
  1.225713	 -1.230519	 -1.006777
  1.243913	 -1.235470	 -1.013430
  1.262122	 -1.240395	 -1.020077
  1.280984	 -1.243092	 -1.026154
  1.299847	 -1.245790	 -1.032231
  1.318709	 -1.248487	 -1.038308
  1.337823	 -1.250285	 -1.043915
  1.357204	 -1.250788	 -1.048824
  1.376586	 -1.251291	 -1.053734
  1.395968	 -1.251794	 -1.058643
  1.415619	 -1.251138	 -1.062300
  1.435340	 -1.250002	 -1.065431
  1.455061	 -1.248865	 -1.068562
  1.474782	 -1.247729	 -1.071692
  1.494617	 -1.245356	 -1.072651
  1.514452	 -1.242973	 -1.073591
  1.534288	 -1.240589	 -1.074531
  1.554095	 -1.237850	 -1.074914
  1.573729	 -1.234193	 -1.073837
  1.593362	 -1.230536	 -1.072760
  1.612995	 -1.226880	 -1.071683
  1.632397	 -1.222487	 -1.069612
  1.651481	 -1.217358	 -1.066531
  1.670565	 -1.212230	 -1.063451
  1.689649	 -1.207101	 -1.060370
  1.708378	 -1.201327	 -1.056383
  1.726380	 -1.194529	 -1.050929
  1.744381	 -1.187732	 -1.045475
  1.762383	 -1.180935	 -1.040022
  1.780384	 -1.174138	 -1.034568
  1.797166	 -1.165805	 -1.027572
  1.813395	 -1.156903	 -1.019998
  1.829624	 -1.148000	 -1.012425
  1.845853	 -1.139098	 -1.004851
  1.862082	 -1.130195	 -0.997277
  1.877113	 -1.119423	 -0.989658
  1.892057	 -1.108532	 -0.982039
  1.907001	 -1.097640	 -0.974420
  1.921946	 -1.086740	 -0.966816
  1.936944	 -1.074511	 -0.961765
  1.951942	 -1.062281	 -0.956715
  1.967056	 -1.049987	 -0.952195
  1.982641	 -1.037497	 -0.951152
  1.998311	 -1.025094	 -0.950358
  2.015088	 -1.015634	 -0.955745
  2.031865	 -1.006174	 -0.961133
  2.048643	 -0.996714	 -0.966520
  2.065716	 -0.989144	 -0.973675
  2.082859	 -0.982485	 -0.981535
  2.100018	 -0.976677	 -0.990011
  2.117133	 -0.972116	 -0.999300
  2.134228	 -0.967925	 -1.008797
  2.151252	 -0.964671	 -1.018777
  2.168276	 -0.961416	 -1.028757
  2.185297	 -0.958715	 -1.038952
  2.202290	 -0.956150	 -1.049182
