 -0.290272	 -1.455452	 -2.034675
 -0.290720	 -1.450103	 -2.015610
 -0.290728	 -1.450004	 -2.015255
 -0.289742	 -1.444629	 -1.996094
 -0.289795	 -1.438676	 -1.976958
 -0.289673	 -1.431290	 -1.958231
 -0.288445	 -1.424034	 -1.939618
 -0.286699	 -1.416231	 -1.921345
 -0.285928	 -1.405746	 -1.904228
 -0.284515	 -1.394593	 -1.887439
 -0.281244	 -1.384081	 -1.870961
 -0.278762	 -1.371685	 -1.855340
 -0.277062	 -1.357976	 -1.840621
 -0.275758	 -1.343476	 -1.826622
 -0.274314	 -1.327107	 -1.814604
 -0.272601	 -1.309417	 -1.804872
 -0.270559	 -1.291431	 -1.795946
 -0.267688	 -1.272231	 -1.789667
 -0.264369	 -1.252851	 -1.784860
 -0.258908	 -1.233703	 -1.781740
 -0.244335	 -1.221576	 -1.775360
 -0.227910	 -1.214470	 -1.766445
 -0.211065	 -1.209064	 -1.757463
 -0.194002	 -1.205177	 -1.748820
 -0.176561	 -1.202004	 -1.739907
 -0.159012	 -1.199165	 -1.731605
 -0.141017	 -1.195956	 -1.724546
 -0.123147	 -1.192901	 -1.715673
 -0.106070	 -1.190601	 -1.705405
 -0.090578	 -1.189277	 -1.692927
 -0.075681	 -1.188255	 -1.679649
 -0.060867	 -1.187183	 -1.666250
 -0.046005	 -1.186262	 -1.652906
 -0.031282	 -1.185084	 -1.639448
 -0.017047	 -1.184036	 -1.625531
 -0.004018	 -1.183081	 -1.610465
  0.008847	 -1.181919	 -1.595200
  0.021795	 -1.180948	 -1.579986
  0.034631	 -1.179717	 -1.564700
  0.047524	 -1.178730	 -1.549441
  0.060305	 -1.177513	 -1.534149
  0.072294	 -1.175662	 -1.518353
  0.083238	 -1.173098	 -1.501910
  0.093990	 -1.170523	 -1.485233
  0.104703	 -1.167725	 -1.468575
  0.115521	 -1.165102	 -1.451963
  0.126233	 -1.162402	 -1.435294
  0.136740	 -1.159530	 -1.418576
  0.146011	 -1.157083	 -1.401139
  0.153303	 -1.154767	 -1.382748
  0.160417	 -1.152332	 -1.364358
  0.163463	 -1.151423	 -1.347042
  0.156838	 -1.158842	 -1.326905
  0.160628	 -1.164321	 -1.302676
  0.172649	 -1.161167	 -1.283123
  0.178387	 -1.160724	 -1.268071
  0.182248	 -1.161157	 -1.248803
  0.183889	 -1.162962	 -1.230076
  0.183568	 -1.166905	 -1.210633
  0.180650	 -1.171551	 -1.194903
  0.177203	 -1.180605	 -1.182517
  0.171987	 -1.199093	 -1.162179
  0.168898	 -1.209933	 -1.139775
  0.165817	 -1.215044	 -1.124289
  0.163458	 -1.217620	 -1.102924
  0.163060	 -1.216920	 -1.079899
  0.158774	 -1.216791	 -1.063440
  0.150259	 -1.220584	 -1.047946
  0.139605	 -1.225745	 -1.029122
  0.130388	 -1.226229	 -1.010724
  0.121541	 -1.223696	 -0.993849
  0.109084	 -1.221013	 -0.977173
  0.096918	 -1.219488	 -0.964920
  0.080085	 -1.215698	 -0.951359
  0.059994	 -1.210445	 -0.934698
  0.048691	 -1.208373	 -0.921966
  0.038293	 -1.206102	 -0.908127
  0.024741	 -1.205475	 -0.883495
  0.018703	 -1.206556	 -0.867876
  0.012781	 -1.208708	 -0.854894
  0.001135	 -1.217223	 -0.832721
 -0.008999	 -1.219219	 -0.815367
 -0.015006	 -1.218419	 -0.806544
 -0.028209	 -1.215004	 -0.789926
 -0.039276	 -1.214994	 -0.770570
 -0.048407	 -1.213336	 -0.752656
 -0.055985	 -1.207813	 -0.735122
 -0.065031	 -1.200954	 -0.718541
 -0.074396	 -1.194119	 -0.702114
 -0.084374	 -1.186629	 -0.686357
 -0.094491	 -1.177704	 -0.671485
 -0.103559	 -1.167785	 -0.656811
 -0.110323	 -1.158192	 -0.641032
 -0.118917	 -1.150153	 -0.623513
 -0.129806	 -1.141230	 -0.607225
 -0.140445	 -1.129722	 -0.593594
 -0.146717	 -1.115778	 -0.582004
 -0.149078	 -1.102575	 -0.568655
 -0.150150	 -1.091133	 -0.552580
 -0.152153	 -1.079480	 -0.536002
 -0.154965	 -1.072947	 -0.518358
 -0.163808	 -1.066614	 -0.495829
 -0.172095	 -1.057731	 -0.482112
 -0.179837	 -1.048118	 -0.471529
 -0.192345	 -1.033944	 -0.462711
 -0.210937	 -1.020620	 -0.447839
 -0.222420	 -1.010614	 -0.432325
 -0.226064	 -0.999731	 -0.416691
 -0.225015	 -0.991905	 -0.399739
 -0.223559	 -0.983066	 -0.382027
 -0.229059	 -0.965542	 -0.354704
 -0.233382	 -0.956043	 -0.340552
 -0.237348	 -0.951346	 -0.327945
 -0.245748	 -0.945067	 -0.305811
 -0.248235	 -0.944303	 -0.286477
 -0.248644	 -0.943804	 -0.267637
 -0.244331	 -0.939458	 -0.247248
 -0.241311	 -0.933028	 -0.224736
 -0.244423	 -0.934699	 -0.209141
 -0.252682	 -0.939914	 -0.189569
 -0.262695	 -0.943762	 -0.170229
 -0.271081	 -0.944466	 -0.147734
 -0.270021	 -0.940492	 -0.123522
 -0.268670	 -0.938676	 -0.102510
 -0.260964	 -0.934595	 -0.083358
 -0.259061	 -0.933329	 -0.072602
 -0.259866	 -0.932606	 -0.044793
 -0.260728	 -0.937997	 -0.023044
 -0.261304	 -0.943700	 -0.011172
 -0.263970	 -0.955397	  0.008452
 -0.269700	 -0.963003	  0.022205
 -0.274129	 -0.968056	  0.046740
 -0.273519	 -0.969015	  0.068678
 -0.272252	 -0.970098	  0.085607
 -0.272561	 -0.971543	  0.105124
 -0.271698	 -0.971966	  0.127280
 -0.270713	 -0.971339	  0.147558
 -0.272632	 -0.974144	  0.168297
 -0.277172	 -0.981075	  0.187384
 -0.281316	 -0.990529	  0.202446
 -0.285930	 -1.001272	  0.221913
 -0.287462	 -1.006176	  0.246251
 -0.289087	 -1.009076	  0.264247
 -0.291559	 -1.011485	  0.280873
 -0.294195	 -1.011125	  0.299028
 -0.300091	 -1.008498	  0.318750
 -0.312360	 -1.002180	  0.345066
 -0.317064	 -0.999050	  0.363648
 -0.318250	 -0.998910	  0.380973
 -0.317523	 -0.999081	  0.396657
 -0.314935	 -1.002010	  0.420063
 -0.311934	 -1.006579	  0.444149
 -0.312098	 -1.006775	  0.459251
 -0.313525	 -1.007676	  0.476440
 -0.316701	 -1.010999	  0.502508
 -0.318779	 -1.012841	  0.520505
 -0.320298	 -1.013538	  0.536956
 -0.320352	 -1.013357	  0.555534
 -0.318858	 -1.014111	  0.576988
 -0.313396	 -1.016179	  0.600470
 -0.310586	 -1.016744	  0.617853
 -0.314025	 -1.012530	  0.641490
 -0.320372	 -1.007711	  0.661832
 -0.322932	 -1.005392	  0.676992
 -0.323718	 -1.000858	  0.695677
 -0.322773	 -0.996500	  0.718850
 -0.323565	 -0.994712	  0.738144
 -0.320625	 -0.991866	  0.762840
 -0.319490	 -0.992706	  0.775404
 -0.315355	 -0.994119	  0.797450
 -0.307940	 -0.991215	  0.821294
 -0.304849	 -0.987806	  0.833999
 -0.306417	 -0.983829	  0.852395
 -0.310421	 -0.978761	  0.872398
 -0.313242	 -0.971528	  0.901913
 -0.313813	 -0.968000	  0.915543
 -0.313497	 -0.963680	  0.929832
 -0.311332	 -0.958702	  0.958605
 -0.308674	 -0.957853	  0.977584
 -0.306639	 -0.957130	  0.989206
 -0.302470	 -0.955758	  1.018625
 -0.298552	 -0.954564	  1.037688
 -0.296504	 -0.951741	  1.048578
 -0.291881	 -0.945367	  1.073151
 -0.287533	 -0.943827	  1.094680
 -0.285101	 -0.943590	  1.104664
 -0.275781	 -0.942139	  1.137087
 -0.272469	 -0.942968	  1.157514
 -0.273181	 -0.943346	  1.168882
 -0.276615	 -0.942917	  1.188927
 -0.279123	 -0.939638	  1.213693
 -0.279497	 -0.937734	  1.237125
 -0.277362	 -0.934153	  1.255382
 -0.275532	 -0.934677	  1.270547
 -0.272624	 -0.934652	  1.287945
 -0.271259	 -0.936982	  1.305586
 -0.271590	 -0.935405	  1.327058
 -0.271646	 -0.936073	  1.351978
 -0.271137	 -0.938428	  1.368798
 -0.270531	 -0.943080	  1.384395
 -0.264698	 -0.945411	  1.407925
 -0.261551	 -0.947265	  1.426295
 -0.261266	 -0.948366	  1.442252
 -0.260653	 -0.948365	  1.469130
 -0.260110	 -0.946374	  1.496707
 -0.259047	 -0.945358	  1.510020
 -0.260010	 -0.944069	  1.521330
 -0.260130	 -0.954230	  1.538015
 -0.263596	 -0.973474	  1.562337
 -0.265036	 -0.984880	  1.579047
 -0.269968	 -0.996148	  1.597699
 -0.273984	 -1.002738	  1.614609
 -0.276843	 -1.007493	  1.630185
 -0.276692	 -1.014133	  1.651264
 -0.279322	 -1.022259	  1.670364
 -0.282589	 -1.026703	  1.686683
 -0.287800	 -1.031406	  1.705382
 -0.291305	 -1.041155	  1.724878
 -0.291950	 -1.048606	  1.744669
 -0.296731	 -1.051234	  1.765238
 -0.295147	 -1.054225	  1.788125
 -0.283343	 -1.058120	  1.813127
 -0.278037	 -1.062717	  1.824130
 -0.272747	 -1.071247	  1.841755
 -0.277887	 -1.087458	  1.858496
 -0.290464	 -1.098204	  1.877105
 -0.298792	 -1.104172	  1.895347
 -0.302324	 -1.111004	  1.916413
 -0.300280	 -1.114456	  1.930151
 -0.298441	 -1.121029	  1.946556
 -0.300328	 -1.127172	  1.970101
 -0.307345	 -1.131053	  1.988355
 -0.311834	 -1.133325	  2.007274
 -0.312519	 -1.133771	  2.027555
 -0.313131	 -1.134087	  2.047560
 -0.313693	 -1.134108	  2.067531
 -0.313970	 -1.133088	  2.087325
 -0.312895	 -1.128606	  2.106607
 -0.311906	 -1.123571	  2.125933
 -0.310923	 -1.118392	  2.145225
 -0.309908	 -1.113014	  2.164423
 -0.308393	 -1.106271	  2.183062
 -0.306045	 -1.097506	  2.200770
 -0.301611	 -1.079707	  2.234561
 -0.301438	 -1.078990	  2.235904
