 -0.186761	 -2.205781	 -1.156244
 -0.204044	 -2.237845	 -1.168199
 -0.195369	 -2.221032	 -1.161718
 -0.187774	 -2.204002	 -1.154501
 -0.180251	 -2.186955	 -1.147234
 -0.172526	 -2.169945	 -1.140096
 -0.164597	 -2.152973	 -1.133089
 -0.156459	 -2.136057	 -1.126190
 -0.147567	 -2.119367	 -1.119685
 -0.138917	 -2.102572	 -1.113104
 -0.129879	 -2.085923	 -1.106630
 -0.120298	 -2.069731	 -1.100384
 -0.114282	 -2.052331	 -1.093195
 -0.110379	 -2.032325	 -1.086934
 -0.101833	 -2.012392	 -1.082768
 -0.090823	 -1.995287	 -1.079253
 -0.080602	 -1.980836	 -1.072111
 -0.073228	 -1.965674	 -1.061501
 -0.063070	 -1.946245	 -1.054023
 -0.051443	 -1.929606	 -1.049517
 -0.040032	 -1.917039	 -1.041521
 -0.027864	 -1.907182	 -1.027217
 -0.010531	 -1.898552	 -1.018738
  0.014335	 -1.877943	 -1.015069
  0.022102	 -1.868242	 -1.013496
  0.029858	 -1.853928	 -1.012354
  0.039103	 -1.835146	 -1.002007
  0.052973	 -1.821540	 -0.989944
  0.068575	 -1.812119	 -0.979043
  0.082966	 -1.804094	 -0.967369
  0.096542	 -1.792004	 -0.958534
  0.109343	 -1.778627	 -0.950517
  0.122266	 -1.766736	 -0.940620
  0.136012	 -1.756256	 -0.930945
  0.149977	 -1.744888	 -0.921941
  0.163571	 -1.732686	 -0.913665
  0.177033	 -1.720233	 -0.905676
  0.190511	 -1.707792	 -0.897705
  0.204335	 -1.695700	 -0.889789
  0.218179	 -1.683633	 -0.881869
  0.232269	 -1.672068	 -0.873641
  0.246626	 -1.661101	 -0.865062
  0.260975	 -1.650147	 -0.856454
  0.274783	 -1.639029	 -0.847198
  0.288279	 -1.627827	 -0.837586
  0.301745	 -1.616599	 -0.827962
  0.313894	 -1.604310	 -0.817899
  0.325337	 -1.591515	 -0.807636
  0.336729	 -1.578679	 -0.797372
  0.346362	 -1.564371	 -0.787257
  0.355257	 -1.549528	 -0.777231
  0.364063	 -1.534581	 -0.767295
  0.372173	 -1.518730	 -0.758402
  0.381751	 -1.503422	 -0.749489
  0.391689	 -1.488181	 -0.740858
  0.399557	 -1.471779	 -0.733162
  0.408137	 -1.457930	 -0.730094
  0.419502	 -1.439625	 -0.731181
  0.428349	 -1.409622	 -0.726877
  0.430311	 -1.392141	 -0.719816
  0.431445	 -1.380931	 -0.716487
  0.437662	 -1.358619	 -0.710766
  0.444982	 -1.339184	 -0.706968
  0.449837	 -1.323930	 -0.705836
  0.456258	 -1.300700	 -0.702061
  0.462433	 -1.281893	 -0.696634
  0.470185	 -1.265689	 -0.690773
  0.480724	 -1.246545	 -0.684692
  0.493217	 -1.228153	 -0.670865
  0.500146	 -1.214112	 -0.656351
  0.503627	 -1.205249	 -0.647396
  0.510227	 -1.189315	 -0.630622
  0.520506	 -1.176840	 -0.617059
  0.527441	 -1.165752	 -0.608080
  0.538047	 -1.142936	 -0.596298
  0.547799	 -1.127607	 -0.587836
  0.551929	 -1.109515	 -0.584526
  0.556838	 -1.091708	 -0.580075
  0.563548	 -1.065023	 -0.577111
  0.567982	 -1.051873	 -0.575428
  0.575840	 -1.034348	 -0.571055
  0.585374	 -1.012423	 -0.558097
  0.588933	 -0.997249	 -0.546750
  0.589983	 -0.981735	 -0.534829
  0.591897	 -0.969824	 -0.525660
  0.596587	 -0.948476	 -0.510206
  0.598888	 -0.934760	 -0.503114
  0.606192	 -0.916513	 -0.495816
  0.614183	 -0.897338	 -0.489887
  0.620767	 -0.880748	 -0.484579
  0.629591	 -0.861320	 -0.478222
  0.635808	 -0.840198	 -0.476701
  0.638033	 -0.826504	 -0.476665
  0.637387	 -0.797927	 -0.475557
  0.638491	 -0.779487	 -0.471445
  0.642046	 -0.766585	 -0.467986
  0.649714	 -0.742825	 -0.459907
  0.651374	 -0.731040	 -0.458421
  0.667302	 -0.701814	 -0.455209
  0.674795	 -0.688035	 -0.451245
  0.681911	 -0.672580	 -0.447857
  0.691034	 -0.655882	 -0.443641
  0.696579	 -0.636501	 -0.445848
  0.700073	 -0.619183	 -0.448044
  0.706128	 -0.599877	 -0.442073
  0.714006	 -0.584852	 -0.434602
  0.727366	 -0.569270	 -0.427424
  0.737286	 -0.558450	 -0.421787
  0.748349	 -0.548310	 -0.415902
  0.758523	 -0.533777	 -0.411254
  0.775187	 -0.522452	 -0.404067
  0.792809	 -0.515587	 -0.400036
  0.808755	 -0.507635	 -0.389527
  0.822823	 -0.500950	 -0.376919
  0.836085	 -0.497806	 -0.362282
  0.848938	 -0.494741	 -0.347259
  0.861892	 -0.491799	 -0.332218
  0.876315	 -0.491220	 -0.318245
  0.891463	 -0.491783	 -0.305154
  0.906864	 -0.492309	 -0.292434
  0.924145	 -0.491261	 -0.282364
  0.941835	 -0.489702	 -0.273112
  0.959807	 -0.487451	 -0.264513
  0.977335	 -0.479848	 -0.258418
  0.994978	 -0.472077	 -0.253253
  1.012527	 -0.464193	 -0.247800
  1.027894	 -0.453337	 -0.241031
  1.042522	 -0.441656	 -0.233988
  1.057136	 -0.429957	 -0.226947
  1.071188	 -0.417891	 -0.219407
  1.083762	 -0.405010	 -0.210697
  1.096313	 -0.392136	 -0.201934
  1.108755	 -0.379197	 -0.193141
  1.120357	 -0.365817	 -0.184645
  1.130664	 -0.348526	 -0.181415
  1.140129	 -0.328788	 -0.177298
  1.151063	 -0.311614	 -0.167188
  1.160079	 -0.300232	 -0.156204
  1.170923	 -0.292227	 -0.147019
  1.180238	 -0.276651	 -0.130910
  1.183902	 -0.261991	 -0.111513
  1.193136	 -0.248769	 -0.096097
  1.209474	 -0.240737	 -0.087438
  1.222583	 -0.231786	 -0.083354
  1.231765	 -0.211048	 -0.076046
  1.233645	 -0.187582	 -0.060915
  1.235505	 -0.173564	 -0.048746
  1.241690	 -0.163172	 -0.038700
  1.253167	 -0.153445	 -0.024817
  1.268434	 -0.144763	 -0.008639
  1.279827	 -0.134950	  0.007693
  1.286452	 -0.120859	  0.022848
  1.291138	 -0.102754	  0.032172
  1.299147	 -0.084476	  0.038207
  1.310138	 -0.068461	  0.040605
  1.321740	 -0.053726	  0.039728
  1.341054	 -0.031903	  0.047029
  1.351619	 -0.014931	  0.059764
  1.356613	 -0.005610	  0.067266
  1.362400	  0.009028	  0.080104
  1.368511	  0.026006	  0.092866
  1.373622	  0.040259	  0.101485
  1.382310	  0.060515	  0.112003
  1.392478	  0.074166	  0.116385
  1.405684	  0.087258	  0.119972
  1.422743	  0.104509	  0.127505
  1.431052	  0.115702	  0.134234
  1.439948	  0.131583	  0.146764
  1.453111	  0.150457	  0.160206
  1.461565	  0.161574	  0.166445
  1.475666	  0.171566	  0.169399
  1.497478	  0.181275	  0.172846
  1.517590	  0.186219	  0.179677
  1.537694	  0.174225	  0.191969
  1.556256	  0.154660	  0.213817
  1.570721	  0.153041	  0.226519
  1.580894	  0.154294	  0.232753
  1.603175	  0.149688	  0.243155
  1.624989	  0.141814	  0.252054
  1.642074	  0.136139	  0.265175
  1.649341	  0.132778	  0.273399
  1.659774	  0.120138	  0.291091
  1.671236	  0.107414	  0.305178
  1.680616	  0.099504	  0.319555
  1.694442	  0.094206	  0.337437
  1.711805	  0.089105	  0.350846
  1.727356	  0.085124	  0.361144
  1.743376	  0.080822	  0.373640
  1.759338	  0.075919	  0.385875
  1.776713	  0.075031	  0.396275
  1.794791	  0.080542	  0.403290
  1.806578	  0.091225	  0.406214
  1.830239	  0.109256	  0.407939
  1.847148	  0.115797	  0.414774
  1.871476	  0.124149	  0.423748
  1.882299	  0.132480	  0.424804
  1.902029	  0.155493	  0.430496
  1.914994	  0.173353	  0.429052
  1.923080	  0.180862	  0.430481
  1.930348	  0.186640	  0.430423
  1.938328	  0.199551	  0.428051
  1.950197	  0.220769	  0.428152
  1.960088	  0.239885	  0.430162
  1.964346	  0.257509	  0.428977
  1.967131	  0.274078	  0.424036
  1.974282	  0.295194	  0.416449
  1.979748	  0.317912	  0.410766
  1.982541	  0.332400	  0.407809
  1.988210	  0.346546	  0.404971
  1.993735	  0.370616	  0.399329
  1.993984	  0.388512	  0.392554
  1.994636	  0.403739	  0.386394
  1.997621	  0.423550	  0.382555
  1.997141	  0.444955	  0.378549
  1.996261	  0.464851	  0.373029
  1.993126	  0.485390	  0.369557
  1.987437	  0.505187	  0.369351
  1.977540	  0.521483	  0.373912
  1.969366	  0.538999	  0.380881
  1.963342	  0.559215	  0.384448
  1.956231	  0.576386	  0.386910
  1.948019	  0.594807	  0.393790
  1.941174	  0.615474	  0.401344
  1.938346	  0.634493	  0.405344
  1.938161	  0.650947	  0.405814
  1.939119	  0.674674	  0.404870
  1.937073	  0.697711	  0.410512
  1.935512	  0.712630	  0.419089
  1.930758	  0.730825	  0.430217
  1.926543	  0.746676	  0.443452
  1.921075	  0.760587	  0.453615
  1.915488	  0.775992	  0.463877
  1.911140	  0.796225	  0.477970
  1.906876	  0.816722	  0.488589
  1.903380	  0.832854	  0.494959
  1.902209	  0.849066	  0.503193
  1.901029	  0.873608	  0.513535
  1.901788	  0.886789	  0.517588
  1.906290	  0.907011	  0.523989
  1.919127	  0.932411	  0.532111
  1.924442	  0.944157	  0.535498
  1.929402	  0.959892	  0.539019
  1.934337	  0.982990	  0.547856
  1.939265	  0.998687	  0.553129
  1.943427	  1.013692	  0.558317
  1.949621	  1.033711	  0.564253
  1.957218	  1.054677	  0.568849
  1.965255	  1.069450	  0.572911
  1.982473	  1.084264	  0.579745
  1.999286	  1.096169	  0.586829
  2.009033	  1.111308	  0.596395
  2.013872	  1.125824	  0.600808
  2.021739	  1.145580	  0.599975
  2.030270	  1.165177	  0.598925
  2.040648	  1.184093	  0.599027
  2.057179	  1.197044	  0.605441
  2.074127	  1.212739	  0.619730
  2.071823	  1.227185	  0.638490
  2.083725	  1.242095	  0.644494
