 -2.735543	  1.268570	  0.297381
 -2.708458	  1.256010	  0.294436
 -2.684387	  1.236568	  0.258443
 -2.670410	  1.219365	  0.216500
 -2.645166	  1.192013	  0.175122
 -2.630195	  1.169561	  0.132978
 -2.608870	  1.150712	  0.093554
 -2.590387	  1.124051	  0.051780
 -2.577200	  1.103070	  0.016485
 -2.555955	  1.087596	 -0.025442
 -2.535223	  1.067126	 -0.066530
 -2.516021	  1.039145	 -0.111891
 -2.497680	  1.021788	 -0.151128
 -2.483484	  0.998164	 -0.190516
 -2.464308	  0.971914	 -0.232197
 -2.448645	  0.948369	 -0.269457
 -2.425847	  0.930167	 -0.315666
 -2.407348	  0.908087	 -0.352572
 -2.389857	  0.888302	 -0.394789
 -2.371835	  0.867342	 -0.437676
 -2.349596	  0.843476	 -0.477235
 -2.333181	  0.817175	 -0.519204
 -2.314722	  0.798907	 -0.556033
 -2.296546	  0.774070	 -0.598693
 -2.281269	  0.749387	 -0.639867
 -2.260361	  0.726128	 -0.683347
 -2.243845	  0.706904	 -0.717725
 -2.222821	  0.684667	 -0.761426
 -2.204866	  0.666526	 -0.798535
 -2.184762	  0.640792	 -0.844976
 -2.167923	  0.618384	 -0.884808
 -2.151125	  0.599999	 -0.919577
 -2.129217	  0.576310	 -0.962962
 -2.109906	  0.555672	 -1.001609
 -2.090371	  0.529521	 -1.048110
 -2.074009	  0.507203	 -1.084635
 -2.054063	  0.485550	 -1.125223
 -2.038763	  0.460973	 -1.172221
 -2.019364	  0.439501	 -1.210572
 -1.998787	  0.419590	 -1.247941
 -1.981653	  0.399890	 -1.293023
 -1.961666	  0.378286	 -1.332844
 -1.948376	  0.356917	 -1.369762
 -1.930885	  0.334558	 -1.409810
 -1.905886	  0.311038	 -1.451143
 -1.892259	  0.288886	 -1.494053
 -1.870757	  0.268960	 -1.540241
 -1.852936	  0.245662	 -1.576206
 -1.832090	  0.220519	 -1.622368
 -1.818056	  0.196662	 -1.657586
 -1.800987	  0.173927	 -1.696242
 -1.778699	  0.158020	 -1.742722
 -1.762850	  0.131753	 -1.784988
 -1.741526	  0.107840	 -1.821075
 -1.725117	  0.088401	 -1.866015
 -1.709120	  0.068616	 -1.902317
 -1.683502	  0.045848	 -1.943777
 -1.670773	  0.018282	 -1.985261
 -1.647427	  0.002050	 -2.021935
 -1.635591	 -0.026615	 -2.066515
 -1.613804	 -0.042924	 -2.103848
 -1.591353	 -0.064762	 -2.152633
 -1.575618	 -0.087737	 -2.191631
 -1.556738	 -0.108538	 -2.233479
 -1.542292	 -0.133278	 -2.268166
 -1.521463	 -0.155261	 -2.314587
 -1.500890	 -0.172945	 -2.357616
 -1.483039	 -0.201400	 -2.392572
 -1.470360	 -0.222163	 -2.436002
 -1.449684	 -0.240300	 -2.479610
 -1.426203	 -0.263646	 -2.520034
 -1.407559	 -0.288892	 -2.553326
 -1.390186	 -0.310266	 -2.596613
 -1.377344	 -0.335958	 -2.643871
 -1.391118	 -0.339317	 -2.670310
