  0.437519	  2.035847	  1.348312
  0.454703	  2.051396	  1.354628
  0.439808	  2.038827	  1.350969
  0.427439	  2.022620	  1.348762
  0.413429	  2.006352	  1.347258
  0.397582	  1.992327	  1.344287
  0.381212	  1.980795	  1.339107
  0.366465	  1.970972	  1.331565
  0.353099	  1.958141	  1.323367
  0.338422	  1.944713	  1.315693
  0.320847	  1.934395	  1.309124
  0.304217	  1.926381	  1.300206
  0.290142	  1.916968	  1.291092
  0.275127	  1.906557	  1.281731
  0.258195	  1.900995	  1.272269
  0.242877	  1.894859	  1.258917
  0.230750	  1.891195	  1.242339
  0.216786	  1.890556	  1.226018
  0.195876	  1.883167	  1.212619
  0.180595	  1.870185	  1.206305
  0.168471	  1.854646	  1.201974
  0.157094	  1.838927	  1.199039
  0.142970	  1.821123	  1.195975
  0.126809	  1.809091	  1.190044
  0.114228	  1.796190	  1.185640
  0.102516	  1.784375	  1.184398
  0.089299	  1.768980	  1.181365
  0.076910	  1.750100	  1.177695
  0.066696	  1.735399	  1.175508
  0.055376	  1.718908	  1.171927
  0.043309	  1.696163	  1.166945
  0.036786	  1.685402	  1.165597
  0.024377	  1.671797	  1.162679
  0.004959	  1.644825	  1.155297
 -0.001838	  1.635179	  1.151462
 -0.007492	  1.627739	  1.149499
 -0.029104	  1.603117	  1.138559
 -0.039632	  1.590239	  1.132687
 -0.047170	  1.579348	  1.130377
 -0.062038	  1.557697	  1.125995
 -0.072144	  1.539414	  1.120446
 -0.078221	  1.527347	  1.116045
 -0.085216	  1.506289	  1.106758
 -0.086979	  1.487680	  1.100539
 -0.089360	  1.469629	  1.095361
 -0.095736	  1.447375	  1.086449
 -0.096772	  1.432958	  1.077370
 -0.099279	  1.420119	  1.065238
 -0.095849	  1.403501	  1.049085
 -0.089990	  1.387872	  1.033905
 -0.087298	  1.376427	  1.021717
 -0.084262	  1.366129	  1.012243
 -0.083093	  1.345936	  1.002585
 -0.075769	  1.324931	  0.995550
 -0.063333	  1.307117	  0.987073
 -0.053959	  1.295680	  0.974420
 -0.044331	  1.287218	  0.959035
 -0.038167	  1.281128	  0.945341
 -0.032823	  1.272260	  0.926755
 -0.029656	  1.257527	  0.901155
 -0.030053	  1.253874	  0.893352
 -0.030194	  1.250903	  0.889068
 -0.036074	  1.245054	  0.870641
 -0.040720	  1.242495	  0.849720
 -0.044921	  1.244320	  0.829258
 -0.051171	  1.246777	  0.810554
 -0.056845	  1.245829	  0.793343
 -0.064868	  1.242272	  0.774759
 -0.074930	  1.240254	  0.754999
 -0.083035	  1.238690	  0.736717
 -0.090004	  1.235716	  0.720704
 -0.102219	  1.229979	  0.702166
 -0.114416	  1.225976	  0.684224
 -0.124972	  1.223656	  0.667636
 -0.131798	  1.222230	  0.655229
 -0.143728	  1.218853	  0.637083
 -0.155466	  1.215317	  0.619900
 -0.166355	  1.213597	  0.604849
 -0.173605	  1.208812	  0.588205
 -0.176145	  1.201910	  0.570171
 -0.180020	  1.193038	  0.547446
 -0.181613	  1.185281	  0.533058
 -0.183470	  1.178036	  0.521926
 -0.189241	  1.159217	  0.496303
 -0.194431	  1.150938	  0.479806
 -0.198181	  1.145547	  0.470423
 -0.207753	  1.131194	  0.451589
 -0.216199	  1.119442	  0.434973
 -0.223259	  1.113508	  0.420897
 -0.234774	  1.103064	  0.404693
 -0.243330	  1.094607	  0.391069
 -0.252833	  1.085564	  0.374763
 -0.262813	  1.073364	  0.359604
 -0.271128	  1.062947	  0.346726
 -0.280627	  1.053593	  0.338153
 -0.291601	  1.041824	  0.330575
 -0.304301	  1.024162	  0.320801
 -0.317740	  1.009948	  0.317490
 -0.331918	  0.998369	  0.311089
 -0.340681	  0.989039	  0.304939
 -0.349130	  0.981875	  0.300557
 -0.367093	  0.964045	  0.299850
 -0.381530	  0.948785	  0.302356
 -0.391311	  0.936623	  0.305596
 -0.408218	  0.921915	  0.312571
 -0.425849	  0.909078	  0.317687
 -0.442488	  0.896385	  0.320205
 -0.457314	  0.889192	  0.323223
 -0.474552	  0.884883	  0.329361
 -0.495803	  0.873140	  0.333628
 -0.512252	  0.863697	  0.340101
 -0.524377	  0.859448	  0.349214
 -0.547797	  0.847273	  0.366967
 -0.559174	  0.838242	  0.374087
 -0.570071	  0.832502	  0.380998
 -0.588095	  0.822671	  0.395655
 -0.598861	  0.812758	  0.407142
 -0.610360	  0.805904	  0.416564
 -0.625668	  0.791695	  0.427696
 -0.642263	  0.772335	  0.438140
 -0.647783	  0.766328	  0.441123
 -0.661676	  0.754481	  0.450085
 -0.680629	  0.744279	  0.462202
 -0.696848	  0.739761	  0.470432
 -0.720405	  0.737481	  0.486863
 -0.736709	  0.738784	  0.502087
 -0.746370	  0.738508	  0.512953
 -0.761641	  0.732640	  0.526088
 -0.781173	  0.723732	  0.536122
 -0.797169	  0.716945	  0.542046
 -0.811224	  0.707905	  0.547337
 -0.826271	  0.694155	  0.550767
 -0.848607	  0.678202	  0.554850
 -0.858406	  0.671887	  0.557226
 -0.874472	  0.662155	  0.562188
 -0.890807	  0.649016	  0.565736
 -0.914928	  0.633381	  0.572529
 -0.927253	  0.625502	  0.573006
 -0.937728	  0.616705	  0.573463
 -0.956021	  0.601053	  0.574777
 -0.968576	  0.591785	  0.574437
 -0.980727	  0.579028	  0.572620
 -1.004377	  0.560935	  0.573996
 -1.020575	  0.548835	  0.572412
 -1.032927	  0.536347	  0.566273
 -1.044947	  0.525777	  0.559986
 -1.064910	  0.514704	  0.553380
 -1.081810	  0.506520	  0.552675
 -1.101915	  0.499652	  0.552612
 -1.119657	  0.491790	  0.546155
 -1.135070	  0.481829	  0.538771
 -1.150114	  0.471458	  0.530212
 -1.165387	  0.461413	  0.522549
 -1.180989	  0.449176	  0.516423
 -1.195634	  0.437013	  0.509701
 -1.209266	  0.425312	  0.500793
 -1.220064	  0.415588	  0.488956
 -1.230758	  0.406062	  0.474216
 -1.239774	  0.394964	  0.459444
 -1.248391	  0.384910	  0.445825
 -1.259042	  0.375430	  0.430206
 -1.268645	  0.369761	  0.411565
 -1.275347	  0.366301	  0.392021
 -1.280631	  0.361740	  0.372366
 -1.285818	  0.357133	  0.352974
 -1.290073	  0.353834	  0.334057
 -1.294068	  0.351353	  0.314122
 -1.295933	  0.350168	  0.292881
 -1.294502	  0.347135	  0.273339
 -1.293936	  0.339567	  0.253865
 -1.292845	  0.327352	  0.237439
 -1.288494	  0.313919	  0.222515
 -1.284068	  0.301186	  0.205811
 -1.281421	  0.292262	  0.186346
 -1.282039	  0.286192	  0.165351
 -1.286203	  0.280456	  0.148360
 -1.294370	  0.274099	  0.129081
 -1.303546	  0.263715	  0.111783
 -1.310442	  0.252146	  0.101120
 -1.317235	  0.240824	  0.097381
 -1.319892	  0.238640	  0.094918
 -1.325385	  0.224460	  0.084314
 -1.344364	  0.205144	  0.076276
 -1.355131	  0.198121	  0.075600
 -1.360291	  0.191655	  0.070489
 -1.378303	  0.184060	  0.069725
 -1.397269	  0.178561	  0.073875
 -1.413395	  0.173422	  0.077677
 -1.438440	  0.163010	  0.084857
 -1.452180	  0.155527	  0.088456
 -1.466208	  0.148270	  0.091091
 -1.487521	  0.135761	  0.093839
 -1.503240	  0.124735	  0.093479
 -1.516675	  0.113231	  0.092018
 -1.534110	  0.100959	  0.095143
 -1.550336	  0.090622	  0.098370
 -1.565839	  0.080999	  0.101284
 -1.581735	  0.070468	  0.104475
 -1.596985	  0.058565	  0.108629
 -1.611023	  0.046717	  0.112251
 -1.621973	  0.035737	  0.113589
 -1.638677	  0.021491	  0.117116
 -1.661433	 -0.001041	  0.125071
 -1.669903	 -0.010917	  0.127604
 -1.682276	 -0.026000	  0.130194
 -1.688950	 -0.037157	  0.130055
 -1.699348	 -0.049740	  0.141559
 -1.714848	 -0.065311	  0.152830
 -1.730947	 -0.082041	  0.159070
 -1.739957	 -0.092381	  0.161471
 -1.753828	 -0.108625	  0.161600
 -1.767196	 -0.124172	  0.158136
 -1.777709	 -0.135952	  0.155815
 -1.793477	 -0.151344	  0.152656
 -1.805271	 -0.163692	  0.150851
 -1.816884	 -0.174980	  0.149665
 -1.834871	 -0.189266	  0.147684
 -1.853913	 -0.202452	  0.139245
 -1.876699	 -0.212595	  0.131776
 -1.888167	 -0.217843	  0.129018
 -1.903495	 -0.221784	  0.127667
 -1.929620	 -0.223275	  0.115332
 -1.948676	 -0.227216	  0.102800
 -1.960331	 -0.228828	  0.100247
 -1.982320	 -0.231790	  0.095839
 -2.004541	 -0.230640	  0.093437
 -2.021049	 -0.228857	  0.091184
 -2.043142	 -0.224499	  0.087937
 -2.059217	 -0.218852	  0.081760
 -2.077796	 -0.208190	  0.073868
 -2.101957	 -0.202667	  0.063988
 -2.113467	 -0.202505	  0.060582
 -2.130469	 -0.205107	  0.056373
 -2.141608	 -0.208341	  0.053683
 -2.142502	 -0.207643	  0.054229
 -2.149853	 -0.210715	  0.049107
 -2.155779	 -0.224103	  0.046668
 -2.154305	 -0.245686	  0.044335
 -2.151794	 -0.266317	  0.041440
 -2.146244	 -0.283011	  0.039251
 -2.142016	 -0.303596	  0.042255
 -2.138436	 -0.324159	  0.048843
 -2.133268	 -0.340477	  0.049612
 -2.124206	 -0.360648	  0.046464
 -2.120124	 -0.379884	  0.041972
 -2.118422	 -0.399695	  0.041232
 -2.116862	 -0.421354	  0.041923
 -2.120710	 -0.446090	  0.042906
 -2.133533	 -0.471166	  0.034618
 -2.148066	 -0.488397	  0.023664
 -2.154607	 -0.504143	  0.018772
 -2.166585	 -0.524265	  0.015183
 -2.181010	 -0.542862	  0.003402
 -2.188914	 -0.554023	 -0.008786
 -2.201086	 -0.566744	 -0.024111
 -2.215440	 -0.581510	 -0.035313
 -2.226276	 -0.591157	 -0.039540
 -2.244315	 -0.605674	 -0.040297
 -2.259092	 -0.618332	 -0.043650
 -2.275483	 -0.630496	 -0.045005
 -2.294759	 -0.644092	 -0.051619
 -2.306523	 -0.652237	 -0.062278
 -2.321952	 -0.662654	 -0.078304
 -2.340879	 -0.673336	 -0.084364
 -2.356244	 -0.683238	 -0.082914
 -2.369425	 -0.693715	 -0.079708
 -2.389956	 -0.705330	 -0.083247
 -2.412937	 -0.705363	 -0.092840
 -2.427673	 -0.717469	 -0.098863
