 -1.897722	 -2.086665	  1.106970
 -1.878933	 -2.066004	  1.096009
 -1.839324	 -2.072760	  1.065793
 -1.796668	 -2.075469	  1.040327
 -1.754134	 -2.077663	  1.016428
 -1.709978	 -2.079798	  0.992732
 -1.668003	 -2.084329	  0.964434
 -1.626587	 -2.089888	  0.936007
 -1.585572	 -2.095331	  0.906757
 -1.544932	 -2.098693	  0.876076
 -1.504819	 -2.100055	  0.843893
 -1.466035	 -2.100733	  0.811236
 -1.428744	 -2.100683	  0.779086
 -1.391852	 -2.100196	  0.747782
 -1.353125	 -2.099323	  0.716590
 -1.312438	 -2.098343	  0.686500
 -1.270929	 -2.097620	  0.659403
 -1.227693	 -2.098502	  0.635424
 -1.184153	 -2.100580	  0.611818
 -1.140880	 -2.103481	  0.584604
 -1.099150	 -2.105669	  0.553645
 -1.060307	 -2.106713	  0.520933
 -1.024405	 -2.106941	  0.486883
 -0.990445	 -2.105886	  0.452017
 -0.956044	 -2.104382	  0.417004
 -0.919854	 -2.102785	  0.382099
 -0.880645	 -2.101165	  0.347674
 -0.838716	 -2.098767	  0.315228
 -0.795989	 -2.095843	  0.286022
 -0.753305	 -2.093907	  0.259174
 -0.710324	 -2.094687	  0.233718
 -0.667351	 -2.097616	  0.209048
 -0.624182	 -2.101669	  0.184237
 -0.581277	 -2.106519	  0.159111
 -0.538853	 -2.112086	  0.133605
 -0.497357	 -2.119047	  0.107375
 -0.456795	 -2.126775	  0.080398
 -0.415171	 -2.134197	  0.052087
 -0.372912	 -2.140846	  0.023660
 -0.332254	 -2.145573	 -0.003223
 -0.291988	 -2.148354	 -0.029850
 -0.251981	 -2.151425	 -0.057385
 -0.210824	 -2.154591	 -0.086630
 -0.168713	 -2.157104	 -0.117300
 -0.127516	 -2.159602	 -0.147860
 -0.087413	 -2.162117	 -0.176716
 -0.045300	 -2.164618	 -0.204504
 -0.002078	 -2.164836	 -0.230861
  0.037680	 -2.164668	 -0.260365
  0.073367	 -2.166072	 -0.295649
  0.107373	 -2.167745	 -0.333380
  0.141055	 -2.166637	 -0.370731
  0.174621	 -2.164695	 -0.406892
  0.209538	 -2.164377	 -0.442791
  0.250053	 -2.165227	 -0.476518
  0.295312	 -2.165956	 -0.505196
  0.340928	 -2.166981	 -0.529676
  0.385632	 -2.168547	 -0.551140
  0.430432	 -2.170995	 -0.571227
  0.475615	 -2.173102	 -0.592439
  0.519536	 -2.174288	 -0.612663
  0.566280	 -2.176221	 -0.630344
  0.613696	 -2.178471	 -0.653075
  0.657732	 -2.180352	 -0.680376
  0.698527	 -2.181810	 -0.710242
  0.738671	 -2.184107	 -0.740640
  0.777497	 -2.186267	 -0.771999
  0.814867	 -2.187887	 -0.803708
  0.852701	 -2.188700	 -0.837443
  0.889588	 -2.187648	 -0.873743
  0.922954	 -2.183881	 -0.910884
  0.959552	 -2.179235	 -0.945127
  0.994963	 -2.176449	 -0.981273
  1.032515	 -2.178916	 -1.015361
  1.072578	 -2.176206	 -1.046054
  1.115871	 -2.172734	 -1.072228
  1.160104	 -2.174884	 -1.096637
  1.199312	 -2.183198	 -1.127340
  1.237666	 -2.180069	 -1.160190
  1.276261	 -2.185226	 -1.192918
  1.318960	 -2.188698	 -1.220012
  1.357749	 -2.185209	 -1.251345
  1.396442	 -2.191867	 -1.281563
  1.441030	 -2.191333	 -1.303180
  1.475895	 -2.189535	 -1.338810
  1.513954	 -2.197914	 -1.370080
  1.529094	 -2.219893	 -1.383781
