  0.367138	  0.715095	 -2.382480
  0.377109	  0.715522	 -2.394419
  0.361542	  0.715029	 -2.381039
  0.347655	  0.715237	 -2.367943
  0.332444	  0.717011	 -2.355370
  0.314644	  0.720617	 -2.347171
  0.299473	  0.723911	 -2.338101
  0.281131	  0.730000	 -2.333249
  0.263193	  0.737241	 -2.330611
  0.244666	  0.744476	 -2.328583
  0.226626	  0.752810	 -2.327231
  0.209620	  0.763339	 -2.328556
  0.192712	  0.773828	 -2.330157
  0.175630	  0.784130	 -2.332088
  0.158578	  0.794398	 -2.334031
  0.141831	  0.805163	 -2.335931
  0.126515	  0.817911	 -2.337637
  0.111206	  0.830667	 -2.339341
  0.095896	  0.843423	 -2.341045
  0.080587	  0.856179	 -2.342750
  0.065274	  0.868930	 -2.344464
  0.049967	  0.881691	 -2.346160
  0.034658	  0.894447	 -2.347863
  0.019336	  0.907185	 -2.349594
  0.004039	  0.919958	 -2.351273
 -0.011270	  0.932716	 -2.352974
 -0.026579	  0.945472	 -2.354678
 -0.041871	  0.958214	 -2.356379
 -0.056492	  0.970952	 -2.357410
 -0.071442	  0.984214	 -2.358211
