  2.137004	 -1.148037	  0.030803
  2.163997	 -1.155535	  0.040729
  2.144171	 -1.150029	  0.033438
  2.097099	 -1.138448	  0.016135
  2.050465	 -1.128457	 -0.000710
  2.004539	 -1.120890	 -0.016333
  1.957855	 -1.115184	 -0.030980
  1.908394	 -1.111028	 -0.046385
  1.857008	 -1.106800	 -0.064257
  1.807119	 -1.099815	 -0.084784
  1.761817	 -1.089656	 -0.105284
  1.720788	 -1.077382	 -0.124079
  1.683886	 -1.063574	 -0.140249
  1.649326	 -1.047777	 -0.153544
  1.614717	 -1.029239	 -0.164232
  1.577540	 -1.007876	 -0.173409
  1.537337	 -0.984900	 -0.181777
  1.494185	 -0.962110	 -0.189885
  1.448537	 -0.941269	 -0.197864
  1.398204	 -0.924490	 -0.205523
  1.348364	 -0.899703	 -0.218313
  1.294888	 -0.879544	 -0.232760
  1.239346	 -0.863398	 -0.250445
  1.186446	 -0.851642	 -0.272105
  1.141182	 -0.843314	 -0.293367
  1.100006	 -0.832505	 -0.311954
  1.057095	 -0.817716	 -0.331989
  1.013042	 -0.799814	 -0.354339
  0.970383	 -0.780815	 -0.378142
  0.928070	 -0.762098	 -0.402652
  0.884823	 -0.744777	 -0.427951
  0.840810	 -0.729586	 -0.454234
  0.797465	 -0.717651	 -0.479667
  0.755328	 -0.708575	 -0.501356
  0.713026	 -0.701643	 -0.519449
  0.672593	 -0.696917	 -0.533229
  0.633631	 -0.693403	 -0.542478
  0.591915	 -0.689092	 -0.549054
  0.548440	 -0.683006	 -0.553452
  0.502818	 -0.675392	 -0.556197
  0.453714	 -0.666703	 -0.558642
  0.398418	 -0.657007	 -0.563042
  0.337277	 -0.646540	 -0.573690
  0.277901	 -0.635685	 -0.592393
  0.224774	 -0.624900	 -0.615435
  0.178028	 -0.614847	 -0.638777
  0.134781	 -0.605660	 -0.660857
  0.094459	 -0.596172	 -0.680589
  0.057296	 -0.585359	 -0.696938
  0.020203	 -0.571053	 -0.710453
 -0.021025	 -0.552848	 -0.723768
 -0.065745	 -0.535101	 -0.737375
 -0.111215	 -0.519492	 -0.750098
 -0.156956	 -0.505834	 -0.761919
 -0.202500	 -0.494001	 -0.772678
 -0.248112	 -0.483537	 -0.782542
 -0.293083	 -0.474094	 -0.791642
 -0.337282	 -0.465231	 -0.800098
 -0.381396	 -0.456058	 -0.808208
 -0.422918	 -0.445242	 -0.816322
 -0.458330	 -0.431964	 -0.823009
 -0.500552	 -0.404472	 -0.828619
 -0.553090	 -0.383192	 -0.830380
 -0.607707	 -0.371872	 -0.818317
 -0.670107	 -0.377638	 -0.790886
 -0.741732	 -0.384942	 -0.776891
 -0.820933	 -0.395824	 -0.777385
 -0.888690	 -0.412154	 -0.792107
 -0.992224	 -0.455293	 -0.842675
 -1.093738	 -0.367863	 -0.861483
 -1.123389	 -0.349345	 -0.870753
 -1.146528	 -0.332166	 -0.879291
 -1.179664	 -0.310421	 -0.894541
 -1.190121	 -0.303016	 -0.903924
 -1.253406	 -0.258445	 -0.947003
 -1.301433	 -0.234452	 -0.995847
 -1.334379	 -0.214109	 -1.036241
 -1.371189	 -0.186950	 -1.086457
 -1.409292	 -0.157694	 -1.134201
 -1.442283	 -0.134041	 -1.171541
 -1.469536	 -0.117784	 -1.197747
 -1.497398	 -0.105065	 -1.218718
 -1.530075	 -0.092868	 -1.238172
 -1.565711	 -0.080924	 -1.255128
 -1.603049	 -0.068382	 -1.270152
 -1.643100	 -0.053465	 -1.283563
 -1.688765	 -0.040590	 -1.297582
 -1.735060	 -0.026390	 -1.312056
 -1.778878	 -0.013115	 -1.326611
 -1.818158	 -0.007148	 -1.336550
 -1.864541	 -0.000872	 -1.342328
 -1.913873	  0.005983	 -1.351303
 -1.965533	  0.016166	 -1.359064
 -2.035058	  0.029977	 -1.377306
 -2.070550	  0.039833	 -1.389193
