  2.537289	  1.582047	  0.490093
  2.512167	  1.566383	  0.485241
  2.466565	  1.567642	  0.495371
  2.418844	  1.566227	  0.495793
  2.370341	  1.569441	  0.498868
  2.320162	  1.563515	  0.506682
  2.267742	  1.563146	  0.499721
  2.216320	  1.560898	  0.496370
  2.166874	  1.564718	  0.497746
  2.118772	  1.568574	  0.497449
  2.067662	  1.569815	  0.498572
  2.016344	  1.569224	  0.505594
  1.967556	  1.564904	  0.511089
  1.919572	  1.561998	  0.523873
  1.868006	  1.558316	  0.532341
  1.817643	  1.563882	  0.540453
  1.769837	  1.561076	  0.541500
  1.723930	  1.566624	  0.559911
  1.672768	  1.571414	  0.568719
  1.620805	  1.573603	  0.573980
  1.570623	  1.572977	  0.576277
  1.521302	  1.571566	  0.577497
  1.473050	  1.571298	  0.579586
  1.431530	  1.575448	  0.590356
  1.387325	  1.595515	  0.635781
  1.347391	  1.651099	  0.727206
  1.291145	  1.701387	  0.753831
  1.252849	  1.688517	  0.817521
  1.213939	  1.763707	  0.831753
  1.190403	  1.821162	  0.849897
  1.132183	  1.774214	  0.919198
  1.047535	  1.774641	  0.900656
  0.986707	  1.775634	  0.888571
  0.937022	  1.779087	  0.884041
  0.889570	  1.778675	  0.879517
  0.847648	  1.773626	  0.873333
  0.806855	  1.762820	  0.863340
  0.725781	  1.733122	  0.837979
  0.678345	  1.709356	  0.811506
  0.658540	  1.695469	  0.791693
  0.628683	  1.669470	  0.749464
  0.562753	  1.624716	  0.678786
  0.482313	  1.591227	  0.631914
  0.419499	  1.574532	  0.612253
  0.369202	  1.565131	  0.603650
  0.321151	  1.558078	  0.600142
  0.269720	  1.551691	  0.599446
  0.220703	  1.544518	  0.600424
  0.176914	  1.536020	  0.599184
  0.148165	  1.529035	  0.593339
  0.134958	  1.525306	  0.586687
  0.114457	  1.517831	  0.563748
  0.087084	  1.492060	  0.498186
  0.066887	  1.450367	  0.426850
  0.045366	  1.421765	  0.386431
  0.005965	  1.389222	  0.346000
 -0.081105	  1.333251	  0.293357
 -0.204757	  1.279581	  0.240424
 -0.365300	  1.253734	  0.216480
 -0.504201	  1.271854	  0.280865
 -0.612252	  1.328279	  0.398714
 -0.650659	  1.358279	  0.454341
 -0.670042	  1.377998	  0.490982
 -0.699397	  1.413500	  0.555052
 -0.734189	  1.449199	  0.621223
 -0.764313	  1.471867	  0.661023
 -0.782206	  1.482952	  0.679768
 -0.800110	  1.492942	  0.693952
 -0.829560	  1.504233	  0.709521
 -0.871391	  1.516326	  0.724762
 -0.919141	  1.526001	  0.735911
 -0.969902	  1.534510	  0.742483
 -1.019082	  1.540957	  0.746034
 -1.066717	  1.545412	  0.748307
 -1.114978	  1.548258	  0.749902
 -1.165788	  1.548575	  0.751564
 -1.220601	  1.544210	  0.753671
 -1.273817	  1.536685	  0.754664
 -1.325126	  1.527893	  0.754941
 -1.375212	  1.518722	  0.755045
 -1.422649	  1.509947	  0.755323
 -1.469391	  1.501900	  0.755829
 -1.518136	  1.495573	  0.756844
 -1.569018	  1.492297	  0.758607
 -1.618529	  1.491830	  0.761604
 -1.669897	  1.491689	  0.765830
 -1.719084	  1.492692	  0.769382
 -1.770225	  1.490738	  0.770977
 -1.820073	  1.494083	  0.769570
 -1.869612	  1.495726	  0.769909
 -1.920709	  1.497882	  0.772258
 -1.970058	  1.499419	  0.777404
 -2.017791	  1.493490	  0.786619
 -2.066700	  1.501399	  0.787949
 -2.117065	  1.498865	  0.794576
 -2.166408	  1.500484	  0.797711
 -2.215665	  1.507598	  0.799756
 -2.264996	  1.504664	  0.808675
 -2.316252	  1.504683	  0.808062
 -2.367142	  1.498342	  0.810064
 -2.419518	  1.499003	  0.811338
 -2.471041	  1.494853	  0.812016
 -2.495752	  1.509801	  0.820136
