 -2.046067	  1.501023	 -0.221081
 -2.045871	  1.511058	 -0.230321
 -2.052740	  1.487069	 -0.219756
 -2.052492	  1.476250	 -0.208279
 -2.051212	  1.465915	 -0.193054
 -2.051501	  1.452992	 -0.175829
 -2.048373	  1.443885	 -0.158851
 -2.044445	  1.430013	 -0.137758
 -2.047048	  1.415232	 -0.125982
 -2.054246	  1.400274	 -0.118722
 -2.062744	  1.382095	 -0.105050
 -2.063064	  1.371338	 -0.088792
 -2.060910	  1.362945	 -0.069444
 -2.062672	  1.352494	 -0.050534
 -2.069591	  1.342515	 -0.037591
 -2.081325	  1.329842	 -0.022742
 -2.086998	  1.314574	 -0.004798
 -2.083403	  1.303753	  0.009430
 -2.081584	  1.291900	  0.024738
 -2.083145	  1.277775	  0.040933
 -2.083030	  1.264397	  0.055022
 -2.083216	  1.249515	  0.070667
 -2.082405	  1.233499	  0.083468
 -2.080533	  1.217666	  0.093791
 -2.080558	  1.202146	  0.107645
 -2.081263	  1.187771	  0.121687
 -2.082008	  1.173363	  0.135542
 -2.082752	  1.158927	  0.149364
 -2.083471	  1.144505	  0.163201
 -2.084155	  1.130102	  0.177061
 -2.084837	  1.115699	  0.190921
 -2.083964	  1.101154	  0.204620
 -2.082550	  1.086580	  0.218244
 -2.081144	  1.072000	  0.231863
 -2.078739	  1.058224	  0.246162
 -2.075982	  1.044753	  0.260685
 -2.073251	  1.031305	  0.275226
 -2.070614	  1.020253	  0.291674
 -2.068041	  1.010086	  0.308700
 -2.065431	  0.999858	  0.325678
 -2.061667	  0.990736	  0.343076
 -2.057261	  0.981982	  0.360476
 -2.053753	  0.973708	  0.377642
 -2.051175	  0.969890	  0.397962
 -2.052483	  0.963018	  0.421497
 -2.060778	  0.948600	  0.436001
 -2.066154	  0.920214	  0.447561
 -2.063524	  0.905733	  0.453164
 -2.057607	  0.890270	  0.462308
 -2.054074	  0.870280	  0.477026
 -2.057117	  0.853998	  0.489332
 -2.062600	  0.841192	  0.498345
 -2.067369	  0.825401	  0.511654
 -2.070686	  0.810008	  0.524507
 -2.077679	  0.795896	  0.536984
 -2.084848	  0.778853	  0.550850
 -2.083495	  0.764307	  0.561811
 -2.078174	  0.750661	  0.572755
 -2.074541	  0.727738	  0.588328
 -2.076697	  0.714248	  0.598382
 -2.078600	  0.701101	  0.607052
 -2.078969	  0.682783	  0.621581
 -2.083379	  0.667917	  0.634806
 -2.089421	  0.653804	  0.646079
 -2.092067	  0.635756	  0.654401
 -2.086146	  0.609105	  0.660914
 -2.080215	  0.590872	  0.672396
 -2.078461	  0.579035	  0.682563
 -2.077123	  0.566952	  0.693389
 -2.075773	  0.545463	  0.710286
 -2.074059	  0.535886	  0.724680
 -2.068544	  0.525918	  0.740733
 -2.063244	  0.507471	  0.759860
 -2.063263	  0.496342	  0.775047
 -2.068857	  0.489022	  0.787656
 -2.076309	  0.475815	  0.805906
 -2.070716	  0.462756	  0.820974
 -2.057859	  0.447026	  0.839404
 -2.055051	  0.434532	  0.853911
 -2.054181	  0.425431	  0.864771
 -2.055851	  0.414086	  0.880787
 -2.051284	  0.397904	  0.904363
 -2.051598	  0.391677	  0.913127
 -2.053928	  0.378335	  0.929863
 -2.051901	  0.361533	  0.948165
 -2.051536	  0.353496	  0.958480
 -2.051199	  0.341584	  0.981201
 -2.051238	  0.329743	  1.003891
 -2.050977	  0.320088	  1.016213
 -2.051738	  0.309492	  1.026535
 -2.051332	  0.291902	  1.042544
 -2.049140	  0.284182	  1.058271
 -2.045492	  0.278371	  1.084330
 -2.045008	  0.266418	  1.104926
 -2.046127	  0.257361	  1.113358
 -2.046561	  0.245234	  1.130887
 -2.049030	  0.230045	  1.147601
 -2.053774	  0.214609	  1.160461
 -2.058349	  0.199233	  1.171788
 -2.059570	  0.185640	  1.187705
 -2.059965	  0.172520	  1.202825
 -2.060360	  0.159295	  1.217993
 -2.060157	  0.145279	  1.232552
 -2.059426	  0.130959	  1.246506
 -2.058468	  0.116466	  1.260297
 -2.057450	  0.101864	  1.274097
 -2.056042	  0.086960	  1.287463
 -2.054058	  0.071663	  1.300025
 -2.052328	  0.056413	  1.312942
 -2.051077	  0.039869	  1.324226
 -2.050002	  0.023252	  1.335309
 -2.049158	  0.006371	  1.345999
 -2.048450	 -0.010673	  1.356441
 -2.047760	 -0.027699	  1.366909
 -2.047932	 -0.042311	  1.380556
 -2.048180	 -0.056759	  1.394383
 -2.052091	 -0.070612	  1.408267
 -2.057238	 -0.084142	  1.422068
 -2.061506	 -0.097359	  1.436459
 -2.064411	 -0.109990	  1.451688
 -2.067309	 -0.122564	  1.466848
 -2.069903	 -0.134775	  1.481736
 -2.071103	 -0.146910	  1.497589
