 -0.658445	  2.547826	 -0.161114
 -0.660100	  2.552555	 -0.167545
 -0.656040	  2.540953	 -0.151768
 -0.651983	  2.529350	 -0.135991
 -0.648239	  2.517316	 -0.120462
 -0.644669	  2.505051	 -0.105072
 -0.641100	  2.492784	 -0.089686
 -0.637508	  2.479998	 -0.074732
 -0.633905	  2.466882	 -0.060069
 -0.630301	  2.453765	 -0.045408
 -0.626640	  2.440188	 -0.031186
 -0.622911	  2.426078	 -0.017511
 -0.619256	  2.411927	 -0.003918
 -0.616436	  2.396874	  0.008701
 -0.613575	  2.380951	  0.021011
 -0.610592	  2.365611	  0.031960
 -0.606645	  2.349147	  0.043466
 -0.604452	  2.331830	  0.056928
 -0.601271	  2.318258	  0.070036
 -0.595253	  2.304227	  0.081617
 -0.589158	  2.288171	  0.092053
 -0.583517	  2.271975	  0.103173
 -0.577806	  2.256325	  0.114073
 -0.573075	  2.239555	  0.124069
 -0.568611	  2.222770	  0.133960
 -0.564670	  2.205604	  0.143448
 -0.561136	  2.187989	  0.152211
 -0.557509	  2.170489	  0.160540
 -0.553529	  2.151716	  0.168103
 -0.549885	  2.135065	  0.174846
 -0.543065	  2.117770	  0.186865
 -0.535496	  2.101415	  0.197506
 -0.527777	  2.084455	  0.206996
 -0.525944	  2.068038	  0.214149
 -0.521593	  2.048677	  0.223739
 -0.517926	  2.029501	  0.230253
 -0.517670	  2.012072	  0.232904
 -0.516434	  1.991632	  0.238540
 -0.512055	  1.972070	  0.243892
 -0.506415	  1.952335	  0.251188
 -0.504984	  1.935376	  0.259992
 -0.505252	  1.918620	  0.267437
 -0.505282	  1.901135	  0.280232
 -0.503616	  1.882999	  0.289684
 -0.501999	  1.863330	  0.297281
 -0.495214	  1.846733	  0.302344
 -0.487780	  1.828162	  0.312855
 -0.483237	  1.810230	  0.322456
 -0.490064	  1.793788	  0.328987
 -0.492689	  1.776632	  0.338850
 -0.487720	  1.755000	  0.351667
 -0.481552	  1.741383	  0.359921
 -0.482241	  1.722978	  0.372127
 -0.490055	  1.705837	  0.386985
 -0.488101	  1.693111	  0.394727
 -0.484602	  1.674235	  0.404546
 -0.492712	  1.653934	  0.409931
 -0.492495	  1.638154	  0.422076
 -0.491862	  1.618775	  0.426224
 -0.497013	  1.598935	  0.433262
 -0.496672	  1.582231	  0.443866
 -0.497920	  1.561882	  0.446580
 -0.500046	  1.539683	  0.446454
 -0.499347	  1.524184	  0.453112
 -0.503233	  1.503701	  0.454287
 -0.511196	  1.482557	  0.456279
 -0.513959	  1.463114	  0.459163
 -0.514842	  1.443125	  0.464701
 -0.512534	  1.422957	  0.468968
 -0.497918	  1.407977	  0.472913
 -0.485797	  1.390894	  0.478385
 -0.472778	  1.376759	  0.481522
 -0.459021	  1.361545	  0.479901
 -0.446390	  1.343803	  0.479376
 -0.433803	  1.330818	  0.489385
 -0.418944	  1.321235	  0.496534
 -0.402751	  1.311142	  0.501602
 -0.386975	  1.302549	  0.507955
 -0.370872	  1.293000	  0.519417
 -0.356235	  1.283812	  0.527332
 -0.340026	  1.276706	  0.534210
 -0.324111	  1.272167	  0.547288
 -0.309635	  1.265129	  0.558607
 -0.295037	  1.260369	  0.568102
 -0.279423	  1.258174	  0.581026
 -0.265316	  1.257528	  0.595736
 -0.250331	  1.256045	  0.608423
 -0.232764	  1.250068	  0.619619
 -0.217700	  1.247540	  0.631848
 -0.201326	  1.246409	  0.643191
 -0.184992	  1.244047	  0.655537
 -0.170185	  1.240743	  0.670144
 -0.159160	  1.238582	  0.686203
 -0.152639	  1.238742	  0.706744
 -0.143407	  1.236509	  0.726361
 -0.129877	  1.233007	  0.739618
 -0.114268	  1.229174	  0.752367
 -0.099463	  1.222133	  0.765585
 -0.088306	  1.219365	  0.780302
 -0.076674	  1.215753	  0.796793
 -0.063481	  1.211675	  0.811477
 -0.048901	  1.208587	  0.823808
 -0.035343	  1.202685	  0.838505
 -0.023952	  1.196494	  0.854279
 -0.014726	  1.190830	  0.870089
 -0.003817	  1.183975	  0.885899
  0.005848	  1.177689	  0.901984
  0.014061	  1.173126	  0.919785
  0.025102	  1.166851	  0.937442
  0.033531	  1.155875	  0.950101
  0.041234	  1.146790	  0.965529
  0.048749	  1.141395	  0.984023
  0.059285	  1.135313	  1.002699
  0.065847	  1.128800	  1.018585
  0.070554	  1.117514	  1.035862
  0.069961	  1.105434	  1.055836
  0.072013	  1.099628	  1.071868
  0.070866	  1.093608	  1.090092
  0.068740	  1.085664	  1.111242
  0.071381	  1.080354	  1.129068
  0.072154	  1.076201	  1.149954
  0.067024	  1.067422	  1.167430
  0.062873	  1.058208	  1.185417
  0.061239	  1.052710	  1.201664
  0.058661	  1.046650	  1.221937
  0.053891	  1.040312	  1.240344
  0.049115	  1.029107	  1.260094
  0.048687	  1.023134	  1.275513
  0.047010	  1.016774	  1.295695
  0.043021	  1.007662	  1.315012
  0.035510	  1.001038	  1.331367
  0.031910	  0.995172	  1.349652
  0.029856	  0.986280	  1.368759
  0.023797	  0.978577	  1.385550
  0.016564	  0.973171	  1.403319
  0.011100	  0.966944	  1.421560
  0.005875	  0.959354	  1.442092
  0.004389	  0.953951	  1.457628
  0.001293	  0.944316	  1.474894
 -0.000688	  0.932293	  1.497452
 -0.003955	  0.929089	  1.512399
 -0.006341	  0.922874	  1.530519
 -0.008543	  0.909997	  1.551896
 -0.014600	  0.904023	  1.570123
 -0.018357	  0.904076	  1.587387
 -0.017728	  0.896331	  1.606945
 -0.018712	  0.890814	  1.626740
 -0.021241	  0.887505	  1.646216
 -0.020666	  0.881184	  1.665585
 -0.018235	  0.874609	  1.685231
 -0.018696	  0.874380	  1.705415
 -0.022080	  0.872949	  1.725092
 -0.024375	  0.870725	  1.745303
 -0.024096	  0.868252	  1.765351
 -0.022522	  0.864617	  1.785054
 -0.020272	  0.859012	  1.804151
 -0.019309	  0.852843	  1.823047
 -0.018263	  0.846293	  1.841943
 -0.016436	  0.839350	  1.860855
 -0.011089	  0.831167	  1.879068
 -0.004717	  0.824307	  1.898166
 -0.000388	  0.821132	  1.916844
  0.002099	  0.819121	  1.935348
  0.005379	  0.812741	  1.954968
  0.005893	  0.805139	  1.974733
  0.006268	  0.804534	  1.993351
  0.010546	  0.802740	  2.013059
  0.012146	  0.797357	  2.035494
  0.014092	  0.792205	  2.053191
  0.020328	  0.788560	  2.070584
  0.025106	  0.785539	  2.091328
  0.028504	  0.778690	  2.110021
  0.034793	  0.771056	  2.126937
  0.041787	  0.765516	  2.145030
  0.047682	  0.761002	  2.163933
  0.053970	  0.753368	  2.181305
  0.061889	  0.743361	  2.197919
  0.068481	  0.736602	  2.214846
  0.075633	  0.731602	  2.233599
  0.082934	  0.729723	  2.251213
  0.091984	  0.725137	  2.269205
  0.100766	  0.719451	  2.286403
  0.109428	  0.713662	  2.303476
  0.118664	  0.707701	  2.320183
  0.128282	  0.701624	  2.336632
  0.137903	  0.695549	  2.353079
  0.147746	  0.689332	  2.369342
  0.158270	  0.682682	  2.384995
  0.168797	  0.676030	  2.400645
  0.179325	  0.669375	  2.416294
  0.190049	  0.661964	  2.431462
  0.200879	  0.654100	  2.446323
  0.211710	  0.646233	  2.461183
  0.222540	  0.638360	  2.476039
  0.233031	  0.629149	  2.490359
  0.243255	  0.619043	  2.504265
  0.253477	  0.608934	  2.518168
  0.263700	  0.598825	  2.532071
  0.273918	  0.588701	  2.545966
  0.283134	  0.575815	  2.558170
  0.292211	  0.562616	  2.570145
  0.301287	  0.549415	  2.582118
  0.310362	  0.536214	  2.594092
  0.319438	  0.523013	  2.606066
  0.328479	  0.509861	  2.617992
  0.336179	  0.496566	  2.627933
  0.344487	  0.481843	  2.638620
