 -1.644838	 -0.591039	 -1.847984
 -1.641689	 -0.594191	 -1.858252
 -1.647315	 -0.588560	 -1.839904
 -1.652966	 -0.582876	 -1.821581
 -1.658853	 -0.576684	 -1.803498
 -1.664741	 -0.570491	 -1.785415
 -1.670952	 -0.564216	 -1.767469
 -1.677311	 -0.557903	 -1.749589
 -1.683855	 -0.551713	 -1.731732
 -1.690922	 -0.545878	 -1.713956
 -1.697989	 -0.540043	 -1.696179
 -1.705519	 -0.534599	 -1.678468
 -1.713145	 -0.529238	 -1.660773
 -1.720932	 -0.524028	 -1.643104
 -1.728945	 -0.519032	 -1.625474
 -1.736958	 -0.514035	 -1.607843
 -1.745219	 -0.509296	 -1.590256
 -1.753483	 -0.504560	 -1.572670
 -1.761815	 -0.499948	 -1.555083
 -1.770205	 -0.495442	 -1.537496
 -1.778595	 -0.490948	 -1.519906
 -1.786938	 -0.487069	 -1.502148
 -1.795281	 -0.483190	 -1.484390
 -1.803247	 -0.480202	 -1.466290
 -1.810753	 -0.478250	 -1.447855
 -1.818259	 -0.476297	 -1.429420
 -1.825696	 -0.475208	 -1.410886
 -1.833125	 -0.474193	 -1.392345
 -1.840423	 -0.472095	 -1.373842
 -1.847384	 -0.467806	 -1.355590
 -1.854345	 -0.463518	 -1.337337
 -1.861300	 -0.458097	 -1.319386
 -1.868245	 -0.452236	 -1.301570
 -1.875777	 -0.446538	 -1.283940
 -1.884547	 -0.441211	 -1.266773
 -1.893499	 -0.435934	 -1.249684
 -1.903961	 -0.431094	 -1.233341
 -1.914423	 -0.426255	 -1.216997
 -1.925963	 -0.422008	 -1.201224
 -1.937670	 -0.417857	 -1.185548
 -1.949772	 -0.413922	 -1.170119
 -1.962184	 -0.410162	 -1.154894
 -1.974666	 -0.406446	 -1.139716
 -1.987502	 -0.402958	 -1.124780
 -2.000337	 -0.399469	 -1.109843
 -2.013212	 -0.396179	 -1.094896
 -2.026103	 -0.392974	 -1.079945
 -2.038965	 -0.389809	 -1.064961
 -2.051652	 -0.386877	 -1.049780
 -2.064339	 -0.383946	 -1.034599
 -2.076818	 -0.381117	 -1.019228
 -2.089115	 -0.378377	 -1.003695
 -2.101411	 -0.375638	 -0.988161
 -2.113073	 -0.372669	 -0.972187
 -2.124632	 -0.369664	 -0.956145
 -2.136086	 -0.366546	 -0.940048
 -2.146467	 -0.362338	 -0.923479
 -2.156848	 -0.358131	 -0.906910
 -2.166815	 -0.353613	 -0.890169
 -2.175393	 -0.348115	 -0.872959
 -2.183972	 -0.342617	 -0.855749
 -2.191894	 -0.337037	 -0.838254
 -2.196890	 -0.331190	 -0.819792
 -2.201885	 -0.325342	 -0.801329
 -2.206641	 -0.319502	 -0.782802
 -2.209602	 -0.313747	 -0.763878
 -2.212564	 -0.307991	 -0.744955
 -2.216058	 -0.302240	 -0.726121
 -2.220252	 -0.296501	 -0.707426
 -2.224547	 -0.290751	 -0.688758
 -2.229985	 -0.284876	 -0.670431
 -2.235422	 -0.279001	 -0.652103
 -2.241849	 -0.273370	 -0.634020
 -2.248525	 -0.267804	 -0.616007
 -2.255906	 -0.262681	 -0.598139
 -2.263789	 -0.257887	 -0.580394
 -2.271934	 -0.253260	 -0.562724
 -2.280602	 -0.248974	 -0.545216
 -2.289269	 -0.244688	 -0.527709
 -2.298577	 -0.240633	 -0.510478
 -2.307885	 -0.236578	 -0.493246
 -2.317770	 -0.232725	 -0.476292
 -2.327933	 -0.228972	 -0.459480
 -2.338286	 -0.225362	 -0.442754
 -2.348985	 -0.222012	 -0.426192
 -2.359684	 -0.218662	 -0.409629
 -2.369489	 -0.216227	 -0.392369
 -2.379102	 -0.213983	 -0.374975
 -2.388715	 -0.211739	 -0.357580
 -2.396293	 -0.209894	 -0.339164
 -2.403828	 -0.208058	 -0.320729
 -2.411314	 -0.206185	 -0.302277
 -2.417314	 -0.203218	 -0.283431
 -2.423313	 -0.200251	 -0.264584
 -2.429210	 -0.197050	 -0.245743
 -2.434790	 -0.193141	 -0.226939
 -2.440369	 -0.189232	 -0.208135
 -2.446278	 -0.185201	 -0.189458
 -2.452336	 -0.181114	 -0.170841
 -2.458544	 -0.177042	 -0.152270
 -2.465232	 -0.173017	 -0.133856
 -2.471921	 -0.168993	 -0.115442
 -2.478774	 -0.165136	 -0.097053
 -2.485674	 -0.161326	 -0.078672
 -2.492608	 -0.157546	 -0.060297
 -2.499622	 -0.153834	 -0.041939
 -2.506635	 -0.150123	 -0.023580
 -2.513828	 -0.146209	 -0.005333
 -2.521046	 -0.142266	  0.012897
 -2.528624	 -0.138189	  0.030951
 -2.536506	 -0.133999	  0.048849
 -2.544387	 -0.129809	  0.066747
 -2.552957	 -0.125410	  0.085849
 -2.561215	 -0.121445	  0.103627
