 -1.780940	  0.480233	  1.701610
 -1.764950	  0.481182	  1.703941
 -1.761184	  0.481406	  1.704490
 -1.741477	  0.482988	  1.707515
 -1.722015	  0.485969	  1.711026
 -1.702552	  0.488948	  1.714537
 -1.683219	  0.492409	  1.718312
 -1.664156	  0.496720	  1.722555
 -1.645094	  0.501031	  1.726806
 -1.626221	  0.505504	  1.731684
 -1.607421	  0.510035	  1.736786
 -1.588630	  0.514501	  1.741942
 -1.570110	  0.518800	  1.747631
 -1.553674	  0.523428	  1.753093
 -1.536348	  0.535150	  1.755689
 -1.513188	  0.545944	  1.758941
 -1.491002	  0.548981	  1.764169
 -1.479163	  0.547433	  1.767753
 -1.459245	  0.546831	  1.772434
 -1.433793	  0.552259	  1.777138
 -1.418094	  0.554428	  1.780544
 -1.398704	  0.553040	  1.786297
 -1.377043	  0.554321	  1.792626
 -1.360273	  0.555133	  1.798547
 -1.339912	  0.554056	  1.806063
 -1.321565	  0.555696	  1.812173
 -1.303732	  0.553632	  1.819553
 -1.280630	  0.548590	  1.831033
 -1.263610	  0.553902	  1.837945
 -1.248913	  0.568965	  1.842839
 -1.233028	  0.578254	  1.851391
 -1.216364	  0.578680	  1.861027
 -1.201146	  0.574135	  1.874329
 -1.186461	  0.574786	  1.888069
 -1.168569	  0.584039	  1.895562
 -1.139866	  0.590467	  1.890293
 -1.114467	  0.589578	  1.894802
 -1.102577	  0.587504	  1.902473
 -1.090857	  0.582893	  1.915902
 -1.070100	  0.576595	  1.932380
 -1.045108	  0.576664	  1.939198
 -1.031752	  0.579822	  1.942442
 -1.015787	  0.584678	  1.948644
 -0.994642	  0.584540	  1.960533
 -0.971671	  0.586796	  1.966205
 -0.954671	  0.591953	  1.969607
 -0.939428	  0.597467	  1.974312
 -0.918423	  0.599968	  1.982837
 -0.895678	  0.604134	  1.988085
 -0.878178	  0.610640	  1.990481
 -0.862963	  0.612928	  1.995004
 -0.838864	  0.610699	  2.003309
 -0.812742	  0.613145	  2.005927
 -0.796034	  0.623331	  2.000553
 -0.784142	  0.635546	  1.995783
 -0.764852	  0.649563	  1.995257
 -0.745238	  0.658074	  1.995629
 -0.725003	  0.664638	  1.995988
 -0.703741	  0.665544	  1.995539
 -0.680343	  0.662184	  1.993608
 -0.663830	  0.660367	  1.994622
 -0.647792	  0.662315	  1.999084
 -0.625994	  0.663799	  2.007214
 -0.602664	  0.660202	  2.009974
 -0.582264	  0.657179	  2.010909
 -0.568388	  0.655247	  2.013458
 -0.550127	  0.655354	  2.024437
 -0.531273	  0.659311	  2.036407
 -0.510420	  0.663089	  2.040495
 -0.487645	  0.664592	  2.038973
 -0.467062	  0.663807	  2.041195
 -0.449240	  0.659693	  2.047547
 -0.433002	  0.654004	  2.054623
 -0.412263	  0.651208	  2.062746
 -0.394044	  0.652800	  2.067609
 -0.375688	  0.659945	  2.074951
 -0.352455	  0.670292	  2.081008
 -0.330325	  0.682534	  2.085320
 -0.317350	  0.688908	  2.089583
 -0.302172	  0.696628	  2.095151
 -0.278633	  0.708223	  2.100989
 -0.263719	  0.714975	  2.104791
 -0.250364	  0.720459	  2.108149
 -0.225560	  0.721805	  2.115693
 -0.211433	  0.721212	  2.119084
 -0.189507	  0.724194	  2.123657
 -0.167005	  0.729998	  2.129942
 -0.152698	  0.735764	  2.133687
 -0.125401	  0.748186	  2.142138
 -0.112653	  0.754744	  2.147778
 -0.098979	  0.759192	  2.153119
 -0.077389	  0.762167	  2.161165
 -0.058750	  0.760394	  2.171113
 -0.043454	  0.759494	  2.178408
 -0.021604	  0.755384	  2.181716
 -0.000671	  0.749831	  2.187430
  0.015652	  0.751411	  2.198571
  0.031700	  0.762693	  2.210508
  0.049094	  0.770622	  2.220550
  0.066008	  0.771852	  2.227658
  0.081080	  0.768806	  2.234146
  0.102983	  0.759540	  2.241176
  0.131344	  0.759012	  2.242768
  0.153498	  0.771448	  2.247957
  0.165899	  0.780003	  2.250915
  0.181133	  0.785211	  2.257625
  0.198839	  0.795888	  2.268243
  0.217579	  0.813425	  2.276878
  0.230183	  0.822788	  2.284528
  0.252461	  0.824384	  2.290551
  0.274125	  0.819473	  2.291020
  0.291885	  0.811695	  2.294424
  0.311173	  0.806538	  2.301771
  0.329618	  0.806351	  2.310187
  0.347748	  0.806592	  2.318665
  0.382345	  0.809861	  2.334082
  0.384038	  0.810169	  2.334791
