  1.734418	 -0.279275	 -1.773634
  1.740864	 -0.280985	 -1.792378
  1.734377	 -0.279266	 -1.773538
  1.726818	 -0.277498	 -1.755108
  1.716756	 -0.275641	 -1.737924
  1.706680	 -0.273788	 -1.720747
  1.696948	 -0.272600	 -1.703316
  1.687357	 -0.271674	 -1.685790
  1.677295	 -0.270922	 -1.668523
  1.666039	 -0.270614	 -1.651993
  1.654774	 -0.270306	 -1.635470
  1.643079	 -0.269009	 -1.619299
  1.631117	 -0.267049	 -1.603391
  1.619012	 -0.265274	 -1.587935
  1.606554	 -0.264180	 -1.572270
  1.593980	 -0.262559	 -1.556643
  1.584997	 -0.262849	 -1.536611
  1.577416	 -0.264820	 -1.519504
  1.566089	 -0.265229	 -1.503558
  1.554793	 -0.263767	 -1.484609
  1.548307	 -0.265087	 -1.466975
  1.539868	 -0.267158	 -1.449947
  1.531267	 -0.266600	 -1.428298
  1.523306	 -0.265226	 -1.412314
  1.515774	 -0.266861	 -1.394508
  1.509641	 -0.268002	 -1.374034
  1.501184	 -0.266440	 -1.356840
  1.493123	 -0.265892	 -1.338043
  1.487735	 -0.267434	 -1.318957
  1.482794	 -0.270425	 -1.300302
  1.479664	 -0.272834	 -1.279321
  1.474818	 -0.272165	 -1.261383
  1.470645	 -0.271588	 -1.241200
  1.468582	 -0.272736	 -1.220600
  1.469539	 -0.275910	 -1.200381
  1.473967	 -0.278014	 -1.181617
  1.481519	 -0.275915	 -1.162633
  1.488372	 -0.273341	 -1.143923
  1.495193	 -0.270778	 -1.125298
  1.501650	 -0.268071	 -1.106661
  1.506698	 -0.264504	 -1.087943
  1.513354	 -0.259794	 -1.069758
  1.523249	 -0.255284	 -1.051831
  1.532367	 -0.253638	 -1.032884
  1.540500	 -0.249078	 -1.015855
  1.551110	 -0.241164	 -1.000864
  1.562301	 -0.233803	 -0.986724
  1.571484	 -0.227322	 -0.969422
  1.581302	 -0.220728	 -0.953251
  1.591330	 -0.213970	 -0.937439
  1.600475	 -0.206911	 -0.921103
  1.608602	 -0.198566	 -0.905655
  1.615812	 -0.189001	 -0.890386
  1.618961	 -0.182455	 -0.868939
  1.612390	 -0.181183	 -0.849202
  1.614330	 -0.178630	 -0.831810
  1.611507	 -0.176908	 -0.815722
  1.605196	 -0.174574	 -0.792691
  1.592278	 -0.179086	 -0.781882
  1.581530	 -0.184055	 -0.765949
  1.566455	 -0.189162	 -0.749823
  1.550351	 -0.188477	 -0.738069
  1.532092	 -0.189862	 -0.727868
  1.513886	 -0.193212	 -0.723801
  1.494279	 -0.197319	 -0.718065
  1.475619	 -0.200892	 -0.711200
  1.457204	 -0.201876	 -0.703813
  1.438493	 -0.199977	 -0.696352
  1.419992	 -0.197474	 -0.689132
  1.401821	 -0.195346	 -0.681722
  1.382854	 -0.195275	 -0.674642
  1.362389	 -0.196135	 -0.671433
  1.342042	 -0.198286	 -0.672946
  1.321594	 -0.196540	 -0.679990
  1.302694	 -0.192255	 -0.684310
  1.284573	 -0.189284	 -0.685023
  1.264261	 -0.186853	 -0.686755
  1.244198	 -0.184512	 -0.689867
  1.224270	 -0.184052	 -0.690877
  1.204119	 -0.183680	 -0.691483
  1.184144	 -0.184344	 -0.691389
  1.165266	 -0.186931	 -0.684959
  1.148162	 -0.190482	 -0.675183
  1.130877	 -0.193181	 -0.664017
  1.116080	 -0.195588	 -0.650171
  1.104008	 -0.199836	 -0.636045
  1.089951	 -0.202412	 -0.619967
  1.074524	 -0.201318	 -0.600670
  1.068990	 -0.200151	 -0.582601
  1.070395	 -0.204110	 -0.560389
  1.068128	 -0.206873	 -0.540548
  1.056980	 -0.207655	 -0.524734
  1.045687	 -0.209318	 -0.508252
  1.035109	 -0.209473	 -0.487034
  1.028617	 -0.207961	 -0.468901
  1.022696	 -0.209355	 -0.451058
  1.015451	 -0.211271	 -0.432124
  1.008259	 -0.211362	 -0.412325
  1.005916	 -0.213004	 -0.394511
  1.000499	 -0.215324	 -0.375636
  0.991972	 -0.214018	 -0.353244
  0.986603	 -0.214924	 -0.335367
  0.979370	 -0.218361	 -0.319513
  0.969913	 -0.217603	 -0.300354
  0.961666	 -0.216504	 -0.282155
  0.952651	 -0.216667	 -0.265562
  0.942988	 -0.216596	 -0.245095
  0.935374	 -0.214893	 -0.229180
  0.925392	 -0.216086	 -0.211324
  0.915940	 -0.212261	 -0.192145
  0.905904	 -0.206022	 -0.178306
  0.894031	 -0.202686	 -0.159556
  0.887258	 -0.200857	 -0.137499
  0.881655	 -0.199770	 -0.124429
  0.870083	 -0.198449	 -0.105887
  0.860535	 -0.200292	 -0.088209
  0.852746	 -0.202762	 -0.069295
  0.845164	 -0.205750	 -0.051207
  0.836999	 -0.206568	 -0.032805
  0.828211	 -0.205969	 -0.014849
  0.819418	 -0.205357	  0.003103
  0.810497	 -0.203685	  0.020924
  0.801437	 -0.200460	  0.038460
  0.792382	 -0.197186	  0.055955
  0.784110	 -0.192273	  0.073166
  0.776435	 -0.185751	  0.091036
  0.770074	 -0.179129	  0.108863
  0.764363	 -0.174993	  0.128011
  0.757806	 -0.173803	  0.146962
  0.748824	 -0.172053	  0.164510
  0.738730	 -0.169068	  0.181895
  0.729222	 -0.168265	  0.199801
  0.725319	 -0.168383	  0.221063
  0.720858	 -0.164397	  0.238479
  0.714533	 -0.160300	  0.257803
  0.707669	 -0.160357	  0.277189
  0.699022	 -0.162049	  0.294830
  0.688257	 -0.164595	  0.312006
  0.679132	 -0.168898	  0.330026
  0.673247	 -0.168152	  0.347992
  0.663512	 -0.168638	  0.365068
  0.653964	 -0.173621	  0.385606
  0.644524	 -0.178163	  0.400044
  0.632724	 -0.179501	  0.415844
  0.622131	 -0.181463	  0.434614
  0.610561	 -0.186528	  0.449870
  0.596037	 -0.192908	  0.463004
  0.582923	 -0.196641	  0.476607
  0.570773	 -0.195389	  0.494618
  0.559291	 -0.189993	  0.512554
  0.550216	 -0.186854	  0.529739
  0.542903	 -0.187778	  0.545944
  0.536303	 -0.188196	  0.566461
  0.525488	 -0.185856	  0.583835
  0.509630	 -0.180913	  0.597496
  0.494467	 -0.174088	  0.614562
  0.493745	 -0.174795	  0.630866
  0.487704	 -0.175246	  0.651301
  0.477535	 -0.170786	  0.672897
  0.467505	 -0.167302	  0.686221
  0.457989	 -0.165194	  0.703924
  0.448975	 -0.163991	  0.723461
  0.438635	 -0.164007	  0.738160
  0.426263	 -0.161586	  0.757118
  0.415101	 -0.159966	  0.772379
  0.403652	 -0.160407	  0.789212
  0.392825	 -0.158602	  0.804359
  0.381220	 -0.154099	  0.821115
  0.366541	 -0.149424	  0.838474
  0.351405	 -0.151251	  0.848633
  0.336339	 -0.150676	  0.860655
  0.318933	 -0.151303	  0.869822
  0.301300	 -0.152659	  0.881018
  0.284440	 -0.152507	  0.890273
  0.266045	 -0.152310	  0.896279
  0.244858	 -0.156901	  0.905083
  0.227950	 -0.163065	  0.912493
  0.210126	 -0.166234	  0.914559
  0.189571	 -0.169134	  0.918448
  0.169331	 -0.174527	  0.920281
  0.151086	 -0.182638	  0.918221
  0.132683	 -0.189555	  0.915752
  0.113254	 -0.194808	  0.915852
  0.093993	 -0.200891	  0.915799
  0.075930	 -0.208907	  0.913524
  0.057461	 -0.216710	  0.912795
  0.038906	 -0.223303	  0.913549
  0.020238	 -0.231856	  0.912822
  0.003052	 -0.243744	  0.910126
 -0.014557	 -0.253774	  0.912302
 -0.032308	 -0.258628	  0.915860
 -0.052171	 -0.263843	  0.920148
 -0.071051	 -0.269456	  0.924240
 -0.089651	 -0.274345	  0.930358
 -0.107285	 -0.275864	  0.939698
 -0.123433	 -0.276718	  0.951477
 -0.137182	 -0.276817	  0.965959
 -0.139005	 -0.276131	  0.985776
 -0.141806	 -0.276481	  1.005553
 -0.142285	 -0.276186	  1.026038
 -0.139909	 -0.274933	  1.045891
 -0.136192	 -0.273492	  1.064389
 -0.132294	 -0.268822	  1.087747
 -0.126928	 -0.265082	  1.103164
 -0.120053	 -0.264643	  1.120592
 -0.112871	 -0.263000	  1.143680
 -0.104929	 -0.253847	  1.160119
 -0.100567	 -0.248538	  1.178291
 -0.095302	 -0.243358	  1.194768
 -0.084504	 -0.236080	  1.211140
 -0.072286	 -0.228677	  1.228972
 -0.063916	 -0.223004	  1.247588
 -0.059790	 -0.217364	  1.260676
 -0.050152	 -0.206197	  1.276170
 -0.045874	 -0.195371	  1.294905
 -0.042284	 -0.185074	  1.314797
 -0.034960	 -0.178202	  1.330580
 -0.027454	 -0.169995	  1.343068
 -0.021203	 -0.159592	  1.360019
 -0.014921	 -0.151475	  1.380717
 -0.006986	 -0.142230	  1.396782
 -0.000733	 -0.133095	  1.412822
  0.001600	 -0.129106	  1.430014
  0.004990	 -0.122466	  1.452230
  0.008889	 -0.110875	  1.468090
  0.006070	 -0.101825	  1.486020
  0.006508	 -0.091643	  1.504936
  0.005417	 -0.091308	  1.524571
  0.001315	 -0.093920	  1.546559
 -0.000276	 -0.091739	  1.564211
 -0.006465	 -0.090096	  1.583166
 -0.013142	 -0.090187	  1.605809
 -0.020005	 -0.094393	  1.622943
 -0.030461	 -0.099813	  1.640074
 -0.034268	 -0.095588	  1.657688
 -0.040149	 -0.090547	  1.677275
 -0.047719	 -0.089906	  1.696280
 -0.052677	 -0.093957	  1.715486
 -0.059719	 -0.096819	  1.734195
 -0.069089	 -0.098477	  1.751856
 -0.079402	 -0.100300	  1.769107
 -0.088221	 -0.103295	  1.786582
 -0.095478	 -0.106711	  1.805085
 -0.105242	 -0.111374	  1.822627
 -0.115975	 -0.115048	  1.839109
 -0.127126	 -0.114724	  1.855452
 -0.136231	 -0.113162	  1.873215
 -0.144310	 -0.112237	  1.891762
 -0.150646	 -0.111822	  1.910815
 -0.161342	 -0.115075	  1.929035
 -0.173352	 -0.116248	  1.945116
 -0.184691	 -0.113388	  1.961358
 -0.195178	 -0.109735	  1.978656
 -0.203436	 -0.104248	  1.995177
 -0.212597	 -0.099324	  2.012914
 -0.221391	 -0.095075	  2.030390
 -0.231212	 -0.091553	  2.047568
 -0.241078	 -0.088885	  2.064762
 -0.250905	 -0.086560	  2.082025
 -0.260702	 -0.084021	  2.099276
 -0.270393	 -0.080771	  2.116466
 -0.280065	 -0.077504	  2.133662
 -0.287081	 -0.072493	  2.151706
 -0.293259	 -0.066986	  2.169912
 -0.300387	 -0.063071	  2.188181
 -0.309197	 -0.062354	  2.206120
 -0.317552	 -0.061908	  2.224284
 -0.323486	 -0.062744	  2.243364
 -0.329406	 -0.063572	  2.262449
 -0.335852	 -0.062087	  2.281322
 -0.342431	 -0.059939	  2.300086
 -0.349043	 -0.057817	  2.318839
 -0.358534	 -0.058601	  2.336423
 -0.368048	 -0.059407	  2.353997
 -0.378185	 -0.061320	  2.371129
 -0.389456	 -0.065469	  2.387120
 -0.400733	 -0.069618	  2.403108
 -0.411772	 -0.072071	  2.419603
 -0.422605	 -0.073387	  2.436363
 -0.433437	 -0.074696	  2.453125
 -0.444372	 -0.075990	  2.470081
 -0.456647	 -0.075536	  2.491378
 -0.466254	 -0.074473	  2.508887
