 0.0 0.0 0.0 0
 -0.6289620141132047 -0.35289653083712835 -0.6927913274036999 1000
 -0.6411263758685123 0.6552794396300147 -0.3995094819448982 1000
 -0.037117184126391325 -0.6147199744921663 -0.7874970905361351 1000
 -0.1313404983293267 0.7998430703999861 -0.585696795476744 1000
 0.680808948215786 0.7058244266308483 0.19583680655216373 1000
 0.8101761505556563 -0.5674321000185749 -0.14426162670415288 1000
 0.678687003047743 -0.1851299272217273 0.7113373756108635 1000
 0.4347446146337697 -0.7933415597366941 -0.4257737540542916 1000
 0.0 0.0 0.0 0
 0.3692233768707166 -0.9167146623044738 0.14993107045632303 1000
 0.855198114955948 -0.49039110245748874 0.16957225836298184 1000
 -0.4279045703753037 0.07019086725789789 -0.9006180771034472 1000
 -0.7747079971082278 0.4576205992827774 0.4371463214172457 1000
 0.6309179841871866 0.6025552051192977 0.48858133612820087 1000
 -0.5776852770856746 -0.5610520771232257 0.5932008828332618 1000
 0.40341648941071984 -0.7747186804179532 0.4872721029188884 1000
 0.3490594328220836 0.5056346512739485 0.7890545683214804 1000
 0.0 0.0 0.0 0
 -0.9000141100879405 -0.42737340072440366 -0.08265940960272408 1000
 0.10540377618559098 -0.9913667465845285 0.07868302060943613 1000
 0.18737644184845298 0.1892597271218817 -0.9638468886342707 1000
 0.5118736278034371 0.8570526900254998 0.05705327054080913 1000
 0.26697225713134354 -0.29052503892373627 0.9188291547837157 1000
 -0.17813483903468874 -0.7352118781173552 -0.6530064880207829 1000
 -0.06808008478856056 -0.073620565870756 -0.9944722793200684 1000
 -0.4666323913799886 -0.4251746404323701 0.7756414999522641 1000
 0.0 0.0 0.0 0
 -0.8392290884136919 0.21555829624539843 -0.49871951844709733 1000
 -0.9548717257509165 -0.24272634583242825 0.1713998494757299 1000
 -0.6584177070807349 0.6897294573739812 0.3021943060898747 1000
 -0.48132781810675107 0.07378985057005809 0.8737663242935396 1000
 0.6538516061439372 0.6750338800910458 -0.34199610797817764 1000
 -0.7553985038923531 0.261995688187222 0.6007098797993076 1000
 0.9703480419467883 -0.022380431706315013 -0.23880074071634108 1000
 -0.1914131807647336 0.9011437176847564 0.3880708624810983 1000
 0.0 0.0 0.0 0
 -0.7891957703353247 -0.6134123965923958 -0.0075675485863460484 1000
 0.8061216555399064 -0.46368201912186047 0.36834883142569486 1000
 -0.12325736135823079 0.009318352235037165 0.9924211763070305 1000
 -0.48185352311783614 -0.8611863614066795 0.16030980377398327 1000
 0.10640710465770689 0.9830374519788521 -0.14633487651715024 1000
 0.6777379984285387 -0.5909722715703376 -0.4382191001326542 1000
 -0.5274399563950058 0.2573466001243262 0.8093490098854044 1000
 -0.16182640131876314 0.444357236649949 -0.8813324356183878 1000
 0.0 0.0 0.0 0
 0.7730627960262153 0.603857773771664 -0.19514021229787654 1000
 0.22969320190073306 0.8481883441319185 0.4756958754071168 1000
