  0.237121	  0.099481	  2.493607
  0.237316	  0.098591	  2.486757
  0.237686	  0.096907	  2.473789
  0.237837	  0.094245	  2.453951
  0.238197	  0.091530	  2.434089
  0.239697	  0.089015	  2.414314
  0.241149	  0.086416	  2.394529
  0.242586	  0.083780	  2.374732
  0.244165	  0.081246	  2.354908
  0.246618	  0.080030	  2.335056
  0.249603	  0.079195	  2.315316
  0.253124	  0.078159	  2.295609
  0.257530	  0.079537	  2.276016
  0.262153	  0.083305	  2.256736
  0.265719	  0.087217	  2.237269
  0.267575	  0.091949	  2.217752
  0.268651	  0.099445	  2.198918
  0.268396	  0.111879	  2.182860
  0.268464	  0.124676	  2.167483
  0.267944	  0.137549	  2.152316
  0.268500	  0.150408	  2.136861
  0.268396	  0.165423	  2.123526
  0.266442	  0.178721	  2.110182
  0.267296	  0.189960	  2.099158
  0.264813	  0.210575	  2.080451
  0.256271	  0.225231	  2.065043
  0.249941	  0.237442	  2.057688
  0.244962	  0.255856	  2.052042
  0.240027	  0.276048	  2.045697
  0.232459	  0.297502	  2.034347
  0.225885	  0.315808	  2.023839
  0.227395	  0.330078	  2.019074
  0.231829	  0.349791	  2.013777
  0.232338	  0.370328	  2.007098
  0.225421	  0.394276	  1.993391
  0.219022	  0.406220	  1.984750
  0.209991	  0.418393	  1.974590
  0.199396	  0.432485	  1.956545
  0.192779	  0.434850	  1.945696
  0.180306	  0.437899	  1.927654
  0.169738	  0.436351	  1.908926
  0.164810	  0.441363	  1.899975
  0.153659	  0.440992	  1.885782
  0.141890	  0.438754	  1.871161
  0.129598	  0.430928	  1.859132
  0.124115	  0.425379	  1.850998
  0.114891	  0.406603	  1.830644
  0.106851	  0.395832	  1.816562
  0.105007	  0.385924	  1.808467
  0.100889	  0.365018	  1.792110
  0.096811	  0.354519	  1.781525
  0.094023	  0.341413	  1.771352
  0.086691	  0.324297	  1.757528
  0.079589	  0.309099	  1.747656
  0.073591	  0.288922	  1.736896
  0.076286	  0.270526	  1.721293
  0.083266	  0.258864	  1.710664
  0.093599	  0.245356	  1.699623
  0.100129	  0.224182	  1.682632
  0.096626	  0.211848	  1.661986
  0.093522	  0.207309	  1.647727
  0.089901	  0.201487	  1.628387
  0.088808	  0.194900	  1.605286
  0.088276	  0.193441	  1.580788
  0.088816	  0.192821	  1.566009
  0.090902	  0.188294	  1.543149
  0.090354	  0.182993	  1.523341
  0.085737	  0.175400	  1.505126
  0.080486	  0.167967	  1.491190
  0.073601	  0.160082	  1.471490
  0.070776	  0.155375	  1.453973
  0.070748	  0.146078	  1.436241
  0.071893	  0.136454	  1.415666
  0.074520	  0.131222	  1.398512
  0.079613	  0.120758	  1.379646
  0.074296	  0.109982	  1.364643
  0.075961	  0.101318	  1.342206
  0.076927	  0.098231	  1.318966
  0.071113	  0.101868	  1.298284
  0.062390	  0.106176	  1.280714
  0.058584	  0.104908	  1.260987
  0.057885	  0.103523	  1.241948
  0.065470	  0.100878	  1.225796
  0.073352	  0.098544	  1.204451
  0.077545	  0.093935	  1.182046
  0.083035	  0.089457	  1.167656
  0.089213	  0.085255	  1.153220
  0.096558	  0.080117	  1.137161
  0.108599	  0.072585	  1.120294
  0.119008	  0.067067	  1.108297
  0.130010	  0.060901	  1.099158
  0.149988	  0.051209	  1.087094
  0.166338	  0.042982	  1.071524
  0.174985	  0.039488	  1.059099
  0.188227	  0.032124	  1.037353
  0.199001	  0.023736	  1.021709
  0.205594	  0.020423	  1.007594
  0.215651	  0.025244	  0.988163
  0.226275	  0.029057	  0.970438
  0.236258	  0.023887	  0.957141
  0.250969	  0.026828	  0.935785
  0.260110	  0.034537	  0.917283
  0.265271	  0.039891	  0.901779
  0.272102	  0.043835	  0.881810
  0.278870	  0.043617	  0.859655
  0.282907	  0.043097	  0.845525
  0.287039	  0.039801	  0.822643
  0.288754	  0.037968	  0.803819
  0.293360	  0.036683	  0.784840
  0.302657	  0.037361	  0.762366
  0.308000	  0.038381	  0.750870
  0.321909	  0.037197	  0.729596
  0.333639	  0.033861	  0.702306
  0.336754	  0.031813	  0.690296
  0.339356	  0.027524	  0.673719
  0.341837	  0.024287	  0.651959
  0.343718	  0.022422	  0.635023
  0.348386	  0.017893	  0.609692
  0.347940	  0.012010	  0.589756
  0.347619	  0.009289	  0.579731
  0.346949	  0.004824	  0.560723
  0.354175	  0.006710	  0.528031
  0.355905	  0.008955	  0.513763
  0.357205	  0.011303	  0.487872
  0.356945	  0.014448	  0.466650
  0.356285	  0.014956	  0.456855
  0.356419	  0.012301	  0.434518
  0.356919	  0.007810	  0.411487
  0.357457	  0.006142	  0.396151
  0.358727	  0.007588	  0.374363
  0.361174	  0.009190	  0.350455
  0.365017	  0.011290	  0.334954
  0.370729	  0.012752	  0.317019
  0.375760	  0.015951	  0.289057
  0.376408	  0.017316	  0.275386
  0.375466	  0.017246	  0.254128
  0.378835	  0.015571	  0.229331
  0.383623	  0.011762	  0.212567
  0.387620	  0.005814	  0.199449
  0.395300	 -0.009428	  0.181152
  0.400572	 -0.021609	  0.161380
  0.402822	 -0.029353	  0.140466
  0.402916	 -0.033445	  0.122615
  0.405371	 -0.033971	  0.105330
  0.415029	 -0.034108	  0.085545
  0.423078	 -0.033882	  0.065765
  0.426127	 -0.039140	  0.046146
  0.428093	 -0.045001	  0.027090
  0.427618	 -0.049868	  0.007710
  0.427422	 -0.054296	 -0.011767
  0.427751	 -0.058821	 -0.031069
  0.430760	 -0.059484	 -0.049227
  0.437809	 -0.057201	 -0.069944
  0.439410	 -0.063504	 -0.091912
  0.435864	 -0.071365	 -0.113902
  0.432146	 -0.072134	 -0.129742
  0.426071	 -0.072214	 -0.150091
  0.420231	 -0.076278	 -0.173063
  0.420048	 -0.079768	 -0.191165
  0.422694	 -0.085390	 -0.205896
  0.428273	 -0.092655	 -0.226700
  0.431719	 -0.094999	 -0.247043
  0.431614	 -0.096203	 -0.264810
  0.427540	 -0.100415	 -0.284433
  0.421627	 -0.111878	 -0.315179
  0.420350	 -0.117417	 -0.327478
  0.419767	 -0.120807	 -0.342768
  0.416941	 -0.125838	 -0.362274
  0.406589	 -0.134153	 -0.384902
  0.394918	 -0.139178	 -0.404638
  0.388572	 -0.142014	 -0.418941
  0.388159	 -0.141250	 -0.440442
  0.391147	 -0.139398	 -0.460646
  0.391103	 -0.137009	 -0.480975
  0.385881	 -0.135712	 -0.503633
  0.383651	 -0.134709	 -0.520848
  0.384403	 -0.131260	 -0.539458
  0.386334	 -0.123659	 -0.567604
  0.386510	 -0.123085	 -0.588264
  0.388878	 -0.124676	 -0.597472
  0.400790	 -0.132169	 -0.616886
  0.406267	 -0.143137	 -0.643263
  0.405612	 -0.152454	 -0.662550
  0.406654	 -0.160451	 -0.675000
  0.414008	 -0.165405	 -0.695628
  0.421043	 -0.162546	 -0.718470
  0.424097	 -0.157041	 -0.737941
  0.427190	 -0.156359	 -0.758822
  0.427729	 -0.157108	 -0.779899
  0.424743	 -0.154666	 -0.799443
  0.420564	 -0.149665	 -0.822201
  0.422127	 -0.142414	 -0.844255
  0.429114	 -0.136299	 -0.864265
  0.433897	 -0.134721	 -0.875439
  0.441853	 -0.133087	 -0.895928
  0.448804	 -0.130959	 -0.920100
  0.450338	 -0.139932	 -0.949235
  0.451017	 -0.146427	 -0.959858
  0.452055	 -0.155043	 -0.978076
  0.449225	 -0.150366	 -0.995194
  0.446444	 -0.150719	 -1.018252
  0.446868	 -0.152329	 -1.038858
  0.446077	 -0.154139	 -1.058920
  0.443520	 -0.155830	 -1.078603
  0.440416	 -0.158102	 -1.098307
  0.437423	 -0.160644	 -1.117962
  0.434789	 -0.163433	 -1.137603
  0.432170	 -0.167088	 -1.157091
  0.430053	 -0.170413	 -1.176513
  0.430937	 -0.172194	 -1.195963
  0.435038	 -0.171876	 -1.215246
  0.439923	 -0.171066	 -1.234679
  0.440708	 -0.170522	 -1.255206
  0.433732	 -0.173079	 -1.276176
  0.429508	 -0.184291	 -1.303326
  0.429543	 -0.192685	 -1.318678
  0.427078	 -0.201029	 -1.333691
  0.422297	 -0.207205	 -1.353500
  0.420957	 -0.209422	 -1.373238
  0.423943	 -0.213393	 -1.389441
  0.427175	 -0.219888	 -1.409209
  0.426120	 -0.219567	 -1.436534
  0.425689	 -0.214588	 -1.453463
  0.425810	 -0.208998	 -1.469931
  0.428279	 -0.206793	 -1.492079
  0.431334	 -0.209735	 -1.516785
  0.432128	 -0.210816	 -1.531957
  0.431417	 -0.215072	 -1.552062
  0.428716	 -0.218988	 -1.575667
  0.426315	 -0.217555	 -1.591738
  0.424627	 -0.213668	 -1.614985
  0.425950	 -0.217557	 -1.640886
  0.426293	 -0.221962	 -1.651108
  0.425877	 -0.230838	 -1.673303
  0.427937	 -0.235229	 -1.693763
  0.430874	 -0.238023	 -1.710857
  0.431229	 -0.244723	 -1.732925
  0.432607	 -0.251431	 -1.756241
  0.434344	 -0.255087	 -1.766062
  0.440632	 -0.263436	 -1.785878
  0.453609	 -0.275568	 -1.809292
  0.465553	 -0.281790	 -1.828453
  0.472620	 -0.283845	 -1.847463
  0.476127	 -0.280321	 -1.866703
  0.470225	 -0.273281	 -1.895940
  0.465078	 -0.262529	 -1.913653
  0.460187	 -0.253542	 -1.927481
  0.456928	 -0.250115	 -1.948015
  0.454885	 -0.253069	 -1.965669
  0.455572	 -0.261771	 -1.984615
  0.454042	 -0.265086	 -2.011861
  0.449958	 -0.260023	 -2.031908
  0.445498	 -0.255369	 -2.046503
  0.439409	 -0.251254	 -2.067118
  0.433643	 -0.246620	 -2.084848
  0.428310	 -0.242069	 -2.105640
  0.425341	 -0.243777	 -2.128507
  0.424020	 -0.246349	 -2.142638
  0.422900	 -0.255734	 -2.164327
  0.419314	 -0.260106	 -2.186124
  0.416825	 -0.259047	 -2.203578
  0.414578	 -0.255613	 -2.224818
  0.411854	 -0.255995	 -2.246063
  0.410636	 -0.254724	 -2.261926
  0.412360	 -0.249431	 -2.282543
  0.412665	 -0.238079	 -2.305335
  0.406739	 -0.233786	 -2.328558
  0.400422	 -0.239987	 -2.344512
  0.401667	 -0.251202	 -2.360394
  0.403315	 -0.254560	 -2.383110
  0.401563	 -0.253816	 -2.403685
  0.399461	 -0.253403	 -2.423617
  0.394881	 -0.253378	 -2.455579
  0.393686	 -0.253314	 -2.463165
