 -2.041185	  1.824519	  1.298304
 -2.020975	  1.806455	  1.285450
 -1.976335	  1.785901	  1.276070
 -1.936804	  1.757519	  1.265339
 -1.897445	  1.732397	  1.246771
 -1.862384	  1.700902	  1.231466
 -1.823967	  1.673715	  1.216351
 -1.786876	  1.642545	  1.209686
 -1.748116	  1.616292	  1.193530
 -1.711735	  1.585568	  1.177455
 -1.672541	  1.556401	  1.166443
 -1.636410	  1.524992	  1.154900
 -1.599574	  1.494992	  1.140928
 -1.560157	  1.468368	  1.125781
 -1.519454	  1.443086	  1.110619
 -1.478929	  1.417790	  1.094843
 -1.439965	  1.391164	  1.077541
 -1.403782	  1.362758	  1.057922
 -1.370368	  1.333177	  1.037172
 -1.342006	  1.304574	  1.016467
 -1.319752	  1.277760	  0.994168
 -1.295128	  1.241231	  0.962295
 -1.268733	  1.180672	  0.904052
 -1.257640	  1.121345	  0.837255
 -1.259487	  1.076799	  0.780599
 -1.260401	  1.039688	  0.733076
 -1.254330	  1.005690	  0.700080
 -1.236388	  0.964510	  0.668043
 -1.202919	  0.917369	  0.638842
 -1.165667	  0.871254	  0.611908
 -1.121066	  0.832159	  0.589907
 -1.083814	  0.803095	  0.574893
 -1.046071	  0.776796	  0.565550
 -0.987387	  0.744937	  0.557628
 -0.903254	  0.706923	  0.557578
 -0.844718	  0.688177	  0.567748
 -0.798874	  0.674033	  0.582384
 -0.750295	  0.665884	  0.609256
 -0.698084	  0.660763	  0.649243
 -0.636528	  0.655497	  0.701762
 -0.559688	  0.651704	  0.738138
 -0.500754	  0.641900	  0.745106
 -0.458875	  0.623192	  0.739106
 -0.419754	  0.597956	  0.724982
 -0.381217	  0.571353	  0.707569
 -0.345572	  0.544002	  0.692289
 -0.307661	  0.513436	  0.679723
 -0.267928	  0.483254	  0.665881
 -0.227819	  0.454562	  0.650797
 -0.188221	  0.427423	  0.634980
 -0.148630	  0.401494	  0.618387
 -0.109232	  0.376320	  0.601654
 -0.068710	  0.351022	  0.584172
 -0.028661	  0.327418	  0.566640
  0.009688	  0.305932	  0.549930
  0.048945	  0.285447	  0.532532
  0.090341	  0.263987	  0.513020
  0.130180	  0.241674	  0.493154
  0.169562	  0.216383	  0.474776
  0.208909	  0.189349	  0.459213
  0.247790	  0.162356	  0.444497
  0.286925	  0.134986	  0.429506
  0.325860	  0.107899	  0.414403
  0.364166	  0.080600	  0.399061
  0.402013	  0.051841	  0.384599
  0.439546	  0.021951	  0.372283
  0.478777	 -0.009075	  0.361809
  0.519193	 -0.040531	  0.353400
  0.558834	 -0.071239	  0.346895
  0.598150	 -0.101089	  0.341370
  0.638226	 -0.130700	  0.333902
  0.676982	 -0.158979	  0.322398
  0.715257	 -0.186405	  0.307422
  0.754085	 -0.214313	  0.289101
  0.791739	 -0.243480	  0.270955
  0.827376	 -0.272360	  0.254749
  0.862986	 -0.301195	  0.239662
  0.900726	 -0.330250	  0.224022
  0.939206	 -0.358904	  0.208978
  0.977511	 -0.387378	  0.195411
  1.015547	 -0.415660	  0.182270
  1.054354	 -0.443265	  0.166641
  1.091622	 -0.465640	  0.146699
  1.130133	 -0.480077	  0.116018
  1.184418	 -0.473535	  0.047194
  1.250579	 -0.415628	 -0.056145
  1.297901	 -0.379436	 -0.086998
  1.322046	 -0.366407	 -0.086134
  1.350655	 -0.360095	 -0.071326
  1.383728	 -0.366778	 -0.045382
  1.406276	 -0.385260	 -0.027041
  1.448821	 -0.436385	 -0.005317
  1.533953	 -0.526607	  0.020003
  1.606703	 -0.605419	  0.018284
  1.649496	 -0.645528	  0.017247
  1.672582	 -0.669760	  0.012706
  1.679361	 -0.699372	  0.006207
  1.708040	 -0.744463	 -0.007872
  1.750252	 -0.849722	 -0.044895
  1.787199	 -0.917497	 -0.070695
  1.811660	 -0.956316	 -0.084933
  1.838526	 -0.989853	 -0.096965
  1.871771	 -1.023817	 -0.109806
  1.907833	 -1.054181	 -0.123337
  1.946938	 -1.081657	 -0.139339
  1.986788	 -1.107681	 -0.157204
  2.025599	 -1.132949	 -0.175439
  2.063335	 -1.158404	 -0.193304
  2.101678	 -1.184494	 -0.210626
  2.140169	 -1.212603	 -0.227293
  2.176074	 -1.241033	 -0.241938
  2.211557	 -1.270491	 -0.256299
  2.247141	 -1.300264	 -0.270643
  2.285321	 -1.331693	 -0.284998
  2.323724	 -1.364172	 -0.298823
  2.359910	 -1.396620	 -0.311406
  2.396508	 -1.428973	 -0.320881
  2.435509	 -1.453622	 -0.335412
  2.469972	 -1.483056	 -0.354804
  2.507375	 -1.511648	 -0.371150
  2.541025	 -1.547449	 -0.385476
  2.566435	 -1.562924	 -0.389331
