  0.195768	 -2.235587	 -0.965372
  0.211811	 -2.248237	 -0.995148
  0.202798	 -2.241177	 -0.978749
  0.192848	 -2.233735	 -0.963078
  0.182884	 -2.226287	 -0.947419
  0.172762	 -2.218867	 -0.931847
  0.161445	 -2.211681	 -0.917005
  0.150120	 -2.204498	 -0.902168
  0.138665	 -2.197267	 -0.887454
  0.126702	 -2.189854	 -0.873244
  0.114737	 -2.182439	 -0.859037
  0.102670	 -2.174684	 -0.845099
  0.090490	 -2.166525	 -0.831494
  0.078311	 -2.158358	 -0.817895
  0.066095	 -2.149235	 -0.804951
  0.053878	 -2.139895	 -0.792164
  0.041645	 -2.130338	 -0.779555
  0.029372	 -2.120128	 -0.767506
  0.017124	 -2.109948	 -0.755401
  0.004644	 -2.099177	 -0.744022
 -0.007883	 -2.088147	 -0.733011
 -0.019679	 -2.076742	 -0.722901
 -0.031183	 -2.061535	 -0.715934
 -0.045915	 -2.044718	 -0.709029
 -0.060024	 -2.033734	 -0.700634
 -0.071345	 -2.028234	 -0.686229
 -0.083637	 -2.022171	 -0.668773
 -0.100319	 -2.013192	 -0.658284
 -0.115313	 -2.002514	 -0.653861
 -0.131077	 -1.989464	 -0.642314
 -0.141564	 -1.978774	 -0.628825
 -0.148204	 -1.969866	 -0.615928
 -0.157349	 -1.958028	 -0.598995
 -0.169387	 -1.949705	 -0.582070
 -0.180759	 -1.946040	 -0.570462
 -0.196689	 -1.939381	 -0.553877
 -0.208048	 -1.930159	 -0.544102
 -0.219164	 -1.916821	 -0.535515
 -0.234740	 -1.904920	 -0.521244
 -0.247040	 -1.898978	 -0.504288
 -0.253652	 -1.894056	 -0.492511
 -0.264970	 -1.880513	 -0.479745
 -0.274959	 -1.870410	 -0.459989
 -0.281952	 -1.864578	 -0.441371
 -0.290833	 -1.858454	 -0.429480
 -0.303392	 -1.849924	 -0.414544
 -0.312376	 -1.843261	 -0.397252
 -0.323229	 -1.838892	 -0.380603
 -0.338207	 -1.830081	 -0.367868
 -0.350470	 -1.826180	 -0.350405
 -0.353661	 -1.830375	 -0.330742
 -0.354543	 -1.836581	 -0.312158
 -0.356190	 -1.844095	 -0.294178
 -0.361777	 -1.856633	 -0.276715
 -0.373475	 -1.866819	 -0.256495
 -0.376788	 -1.868293	 -0.241354
 -0.373451	 -1.864026	 -0.213944
 -0.375856	 -1.861075	 -0.194046
 -0.382467	 -1.866359	 -0.174960
 -0.384615	 -1.874425	 -0.159955
 -0.385433	 -1.880238	 -0.139652
 -0.391780	 -1.883831	 -0.120559
 -0.400161	 -1.887415	 -0.100000
 -0.399202	 -1.887274	 -0.081244
 -0.390994	 -1.887503	 -0.062138
 -0.388306	 -1.886891	 -0.040135
 -0.399288	 -1.886590	 -0.017149
 -0.410842	 -1.889155	 -0.002201
 -0.419739	 -1.893374	  0.016309
 -0.421135	 -1.895389	  0.036489
 -0.418831	 -1.897193	  0.056195
 -0.418705	 -1.902212	  0.075994
 -0.422376	 -1.904973	  0.096348
 -0.428083	 -1.902996	  0.113950
 -0.432685	 -1.895523	  0.137780
 -0.432137	 -1.893605	  0.157999
 -0.434740	 -1.896651	  0.175286
 -0.441846	 -1.899606	  0.193540
 -0.446843	 -1.899149	  0.214948
 -0.449163	 -1.895203	  0.234518
 -0.454478	 -1.892932	  0.253174
 -0.466339	 -1.890633	  0.269421
 -0.479844	 -1.886407	  0.285854
 -0.493095	 -1.883022	  0.299706
 -0.506164	 -1.884675	  0.311127
 -0.527596	 -1.884813	  0.326588
 -0.541383	 -1.880195	  0.341725
 -0.546270	 -1.873301	  0.354014
 -0.554087	 -1.863572	  0.369072
 -0.564581	 -1.853663	  0.391978
 -0.571461	 -1.845640	  0.409396
 -0.578643	 -1.835738	  0.421285
 -0.593266	 -1.822479	  0.432247
 -0.609042	 -1.813679	  0.442688
 -0.626281	 -1.805128	  0.447285
 -0.643161	 -1.792453	  0.448263
 -0.658200	 -1.780220	  0.449392
 -0.674090	 -1.770464	  0.457534
 -0.689449	 -1.759935	  0.464761
 -0.703701	 -1.747763	  0.468411
 -0.720826	 -1.734697	  0.471923
 -0.733479	 -1.719899	  0.471450
 -0.744251	 -1.703435	  0.467908
 -0.753529	 -1.689279	  0.465512
 -0.771317	 -1.672485	  0.462674
 -0.782159	 -1.656756	  0.456513
 -0.794237	 -1.642899	  0.451367
 -0.802557	 -1.626736	  0.448702
 -0.813542	 -1.605383	  0.449812
 -0.819086	 -1.585370	  0.449433
 -0.822961	 -1.569681	  0.448540
 -0.830571	 -1.550831	  0.446912
 -0.839263	 -1.533265	  0.445650
 -0.845812	 -1.508366	  0.443226
 -0.852290	 -1.488234	  0.441359
 -0.855896	 -1.478610	  0.440428
 -0.865911	 -1.460364	  0.441110
 -0.886686	 -1.443246	  0.443827
 -0.900014	 -1.434030	  0.447697
 -0.913446	 -1.420364	  0.451508
 -0.930184	 -1.406680	  0.454250
 -0.944714	 -1.394571	  0.453099
 -0.955949	 -1.383988	  0.456782
 -0.971414	 -1.371929	  0.470327
 -0.981240	 -1.363362	  0.485378
 -0.991531	 -1.354662	  0.500749
 -1.004751	 -1.342813	  0.509835
 -1.018715	 -1.330813	  0.518690
 -1.031545	 -1.322721	  0.531930
 -1.042057	 -1.322249	  0.552556
 -1.055007	 -1.321308	  0.568911
 -1.067700	 -1.318110	  0.580387
 -1.081765	 -1.309890	  0.589904
 -1.090156	 -1.297614	  0.606384
 -1.096352	 -1.286118	  0.623518
 -1.107374	 -1.279713	  0.638954
 -1.120735	 -1.277536	  0.655692
 -1.131608	 -1.274722	  0.674072
 -1.138418	 -1.269729	  0.689106
 -1.143153	 -1.260489	  0.704891
 -1.145781	 -1.246951	  0.731741
 -1.143544	 -1.242304	  0.745823
 -1.144277	 -1.235703	  0.765547
 -1.152292	 -1.223646	  0.783141
 -1.161805	 -1.208750	  0.795074
 -1.174056	 -1.194924	  0.810275
 -1.184275	 -1.191549	  0.822236
 -1.195558	 -1.184921	  0.838364
 -1.205518	 -1.175675	  0.853832
 -1.213987	 -1.165785	  0.870107
 -1.222357	 -1.156387	  0.885698
 -1.231077	 -1.147020	  0.901069
 -1.239783	 -1.137620	  0.916427
 -1.249245	 -1.128344	  0.931407
 -1.260553	 -1.119468	  0.945309
 -1.271875	 -1.110592	  0.959204
 -1.283200	 -1.101718	  0.973096
 -1.296007	 -1.093343	  0.985972
 -1.310022	 -1.085459	  0.997864
 -1.324025	 -1.077547	  1.009750
 -1.338033	 -1.069616	  1.021624
 -1.353459	 -1.062484	  1.032180
 -1.369077	 -1.055524	  1.042485
 -1.383339	 -1.047168	  1.051941
 -1.393369	 -1.034540	  1.061062
 -1.412391	 -1.024869	  1.077946
 -1.430615	 -1.024626	  1.090542
 -1.449202	 -1.022696	  1.097574
 -1.462658	 -1.015812	  1.102524
 -1.479536	 -1.007526	  1.112780
 -1.496419	 -0.999515	  1.125265
 -1.507057	 -0.988555	  1.137017
 -1.517924	 -0.979599	  1.151092
 -1.534509	 -0.975789	  1.160320
 -1.557805	 -0.965318	  1.167189
 -1.569945	 -0.951653	  1.174088
 -1.577744	 -0.938442	  1.183510
 -1.585600	 -0.923336	  1.195321
 -1.602585	 -0.910813	  1.211104
 -1.618619	 -0.904842	  1.223932
 -1.626267	 -0.900929	  1.235021
 -1.636763	 -0.889547	  1.251387
 -1.646276	 -0.878390	  1.265879
 -1.657109	 -0.868941	  1.280251
 -1.667197	 -0.860697	  1.295425
 -1.676723	 -0.853335	  1.311396
 -1.686322	 -0.846538	  1.327568
 -1.696232	 -0.843387	  1.344649
 -1.706146	 -0.840248	  1.361731
 -1.716336	 -0.834802	  1.378051
 -1.726649	 -0.825678	  1.392551
 -1.736967	 -0.816529	  1.407036
 -1.747609	 -0.807862	  1.421583
 -1.758388	 -0.799401	  1.436152
 -1.769168	 -0.790942	  1.450721
 -1.779953	 -0.782479	  1.465297
 -1.791387	 -0.773507	  1.480733
 -1.809978	 -0.758925	  1.505419
 -1.820870	 -0.750382	  1.519855
