 -1.896278	  1.454207	 -0.248607
 -1.896082	  1.464242	 -0.257847
 -1.895886	  1.474277	 -0.267087
 -1.897778	  1.462394	 -0.259159
 -1.903883	  1.442072	 -0.247762
 -1.904204	  1.422713	 -0.231755
 -1.900691	  1.412339	 -0.216553
 -1.896271	  1.400974	 -0.198582
 -1.898165	  1.388339	 -0.183454
 -1.901974	  1.375997	 -0.173014
 -1.907612	  1.352478	 -0.153474
 -1.908408	  1.342966	 -0.141819
 -1.908077	  1.334350	 -0.130569
 -1.910194	  1.322359	 -0.110804
 -1.912451	  1.312442	 -0.092315
 -1.915011	  1.301683	 -0.076168
 -1.919429	  1.287833	 -0.059694
 -1.926258	  1.270861	 -0.047268
 -1.934852	  1.253347	 -0.038300
 -1.937892	  1.238338	 -0.023437
 -1.936463	  1.226613	 -0.005122
 -1.931150	  1.218959	  0.015928
 -1.930885	  1.212508	  0.030153
 -1.937221	  1.197657	  0.045969
 -1.945544	  1.182863	  0.057074
 -1.948875	  1.168505	  0.071738
 -1.953927	  1.151419	  0.086496
 -1.955437	  1.132725	  0.098224
 -1.950252	  1.119059	  0.108065
 -1.944210	  1.106695	  0.123419
 -1.941320	  1.092663	  0.139322
 -1.937828	  1.078005	  0.152969
 -1.934111	  1.063397	  0.166604
 -1.932828	  1.048276	  0.179969
 -1.930864	  1.034015	  0.194023
 -1.928070	  1.020727	  0.208788
 -1.925043	  1.007798	  0.223771
 -1.922017	  0.996083	  0.239797
 -1.918952	  0.985946	  0.256794
 -1.915184	  0.975720	  0.273503
 -1.910264	  0.965960	  0.290246
 -1.904495	  0.957209	  0.307358
 -1.899229	  0.948254	  0.324765
 -1.896775	  0.936066	  0.341087
 -1.895391	  0.924063	  0.357202
 -1.895068	  0.912406	  0.372692
 -1.889720	  0.899220	  0.387698
 -1.886805	  0.885044	  0.402810
 -1.897346	  0.871865	  0.418449
 -1.914983	  0.850686	  0.425087
 -1.920594	  0.833790	  0.430110
 -1.919890	  0.819822	  0.448356
 -1.923889	  0.808243	  0.465157
 -1.930280	  0.796902	  0.477662
 -1.937119	  0.774938	  0.494165
 -1.936883	  0.765290	  0.504380
 -1.933856	  0.752424	  0.518173
 -1.930790	  0.737091	  0.533575
 -1.931985	  0.719756	  0.547800
 -1.935863	  0.702774	  0.562773
 -1.941124	  0.690444	  0.574017
 -1.944038	  0.680836	  0.582629
 -1.949215	  0.664227	  0.594853
 -1.947236	  0.633213	  0.614173
 -1.938329	  0.613795	  0.623151
 -1.934378	  0.606562	  0.628551
 -1.927766	  0.591048	  0.641074
 -1.929143	  0.578301	  0.657543
 -1.934224	  0.561841	  0.664972
 -1.933755	  0.542119	  0.676977
 -1.931613	  0.525914	  0.688215
 -1.934982	  0.509726	  0.700209
 -1.937727	  0.490862	  0.711637
 -1.938294	  0.470518	  0.719377
 -1.933886	  0.452677	  0.731203
 -1.927545	  0.440223	  0.746324
 -1.923301	  0.435069	  0.761495
 -1.924921	  0.419196	  0.779049
 -1.923723	  0.399912	  0.805158
 -1.922427	  0.393464	  0.814822
 -1.917809	  0.385697	  0.828084
 -1.909967	  0.374699	  0.850477
 -1.906270	  0.367144	  0.865561
 -1.901919	  0.357134	  0.883680
 -1.897457	  0.347845	  0.901478
 -1.891712	  0.338393	  0.916906
 -1.885865	  0.326111	  0.931348
 -1.883409	  0.313687	  0.952089
 -1.887626	  0.299497	  0.972250
 -1.889682	  0.290495	  0.981561
 -1.894148	  0.272387	  0.994191
 -1.896797	  0.259478	  1.008835
 -1.895367	  0.256895	  1.032018
 -1.892830	  0.254712	  1.057535
 -1.892928	  0.244033	  1.075099
 -1.895720	  0.231173	  1.084027
 -1.905878	  0.217950	  1.097039
 -1.908279	  0.194836	  1.109356
 -1.903671	  0.175406	  1.125387
 -1.900324	  0.161680	  1.138232
 -1.898746	  0.148784	  1.148168
 -1.898275	  0.132510	  1.162635
 -1.898753	  0.118375	  1.179054
 -1.899730	  0.106816	  1.192681
 -1.901174	  0.093673	  1.207538
 -1.901126	  0.079931	  1.225564
 -1.902106	  0.071508	  1.249126
 -1.904491	  0.066756	  1.263440
 -1.902264	  0.048184	  1.275199
 -1.899040	  0.027822	  1.282132
 -1.897821	  0.009285	  1.292092
 -1.896884	 -0.007636	  1.303068
 -1.896177	 -0.024688	  1.313518
 -1.895462	 -0.041746	  1.323937
 -1.895019	 -0.058140	  1.335382
 -1.895266	 -0.072563	  1.349245
 -1.895505	 -0.087004	  1.363080
 -1.895709	 -0.101462	  1.376910
 -1.899315	 -0.115381	  1.390808
 -1.904490	 -0.128906	  1.404608
 -1.909608	 -0.142449	  1.418406
 -1.913247	 -0.155401	  1.433200
 -1.916183	 -0.168046	  1.448345
 -1.918909	 -0.180437	  1.463477
 -1.920109	 -0.192571	  1.479329
 -1.921309	 -0.204705	  1.495181
