 -0.271730	 -2.339568	  0.850304
 -0.275334	 -2.336641	  0.845164
 -0.281922	 -2.331290	  0.835768
 -0.295807	 -2.324090	  0.823559
 -0.310270	 -2.317590	  0.811440
 -0.322145	 -2.311262	  0.798391
 -0.336122	 -2.301496	  0.784878
 -0.351380	 -2.289390	  0.774317
 -0.369411	 -2.283119	  0.768843
 -0.390042	 -2.279942	  0.765095
 -0.407250	 -2.274230	  0.753938
 -0.418668	 -2.263356	  0.743758
 -0.433289	 -2.251553	  0.736822
 -0.454336	 -2.242263	  0.729702
 -0.469740	 -2.234295	  0.723783
 -0.482221	 -2.225967	  0.716475
 -0.499275	 -2.215349	  0.707146
 -0.517245	 -2.205688	  0.703182
 -0.530480	 -2.191866	  0.700289
 -0.542237	 -2.174960	  0.694016
 -0.558092	 -2.162395	  0.690658
 -0.576776	 -2.153982	  0.690325
 -0.594111	 -2.144982	  0.681875
 -0.607646	 -2.132189	  0.672538
 -0.618100	 -2.116065	  0.670139
 -0.634507	 -2.100945	  0.667454
 -0.646954	 -2.085925	  0.662820
 -0.655142	 -2.068623	  0.660862
 -0.671705	 -2.056085	  0.656522
 -0.687171	 -2.042328	  0.655708
 -0.695655	 -2.023027	  0.655828
 -0.702952	 -2.003933	  0.654003
 -0.707327	 -1.984113	  0.652615
 -0.712575	 -1.964229	  0.650640
 -0.718607	 -1.944424	  0.650061
 -0.728168	 -1.927152	  0.648969
 -0.740223	 -1.911910	  0.646067
 -0.751747	 -1.895125	  0.644638
 -0.761479	 -1.877787	  0.643073
 -0.769691	 -1.859740	  0.640157
 -0.775916	 -1.840160	  0.636435
 -0.779005	 -1.819473	  0.635242
 -0.784652	 -1.801758	  0.633039
 -0.793521	 -1.783572	  0.632155
 -0.801822	 -1.763930	  0.634955
 -0.807180	 -1.744613	  0.636860
 -0.814084	 -1.726031	  0.631797
 -0.819497	 -1.708577	  0.627779
 -0.825151	 -1.684988	  0.636207
 -0.831719	 -1.668016	  0.638149
 -0.836322	 -1.648772	  0.638543
 -0.836055	 -1.628697	  0.649089
 -0.844522	 -1.610118	  0.659837
 -0.852661	 -1.594799	  0.662973
 -0.855475	 -1.574459	  0.664700
 -0.854682	 -1.552549	  0.664209
 -0.857360	 -1.532590	  0.662182
 -0.859074	 -1.511696	  0.658566
 -0.860307	 -1.492023	  0.664889
 -0.863640	 -1.472922	  0.672925
 -0.869465	 -1.452789	  0.675860
 -0.877009	 -1.435566	  0.669843
 -0.884125	 -1.416666	  0.661993
 -0.887877	 -1.395929	  0.657956
 -0.889465	 -1.375384	  0.656542
 -0.885931	 -1.354565	  0.656902
 -0.886730	 -1.335573	  0.671266
 -0.885655	 -1.313337	  0.675645
 -0.885760	 -1.291556	  0.674512
 -0.894798	 -1.274712	  0.665063
 -0.901277	 -1.254178	  0.662709
 -0.904588	 -1.238939	  0.652269
 -0.908326	 -1.219309	  0.642738
 -0.908778	 -1.203596	  0.630290
 -0.907859	 -1.185453	  0.620400
 -0.909384	 -1.167255	  0.611605
 -0.913172	 -1.149262	  0.601348
 -0.916620	 -1.132472	  0.589792
 -0.916019	 -1.115389	  0.583853
 -0.917993	 -1.100594	  0.571023
 -0.924812	 -1.089179	  0.557709
 -0.934453	 -1.076630	  0.547339
 -0.948153	 -1.065785	  0.535562
 -0.959203	 -1.058395	  0.520317
 -0.969656	 -1.054025	  0.504549
 -0.981145	 -1.048086	  0.487579
 -0.992655	 -1.038109	  0.475947
 -1.005114	 -1.027520	  0.462724
 -1.015342	 -1.018654	  0.447196
 -1.024123	 -1.013880	  0.430694
 -1.033128	 -1.006619	  0.413135
 -1.042540	 -0.997032	  0.398866
 -1.052135	 -0.985510	  0.385437
 -1.061532	 -0.974301	  0.371289
 -1.067056	 -0.966963	  0.353899
 -1.075049	 -0.958097	  0.332789
 -1.081972	 -0.950301	  0.320537
 -1.090590	 -0.937048	  0.307090
 -1.099964	 -0.922498	  0.291465
 -1.104136	 -0.915809	  0.274517
 -1.106569	 -0.906078	  0.258412
 -1.111371	 -0.894191	  0.242710
 -1.114676	 -0.882069	  0.226391
 -1.117171	 -0.869888	  0.210027
 -1.124806	 -0.856218	  0.197449
 -1.131097	 -0.841658	  0.184819
 -1.131829	 -0.829154	  0.168541
 -1.131418	 -0.816015	  0.152714
 -1.132738	 -0.800730	  0.140506
 -1.135221	 -0.784428	  0.128580
 -1.133740	 -0.770289	  0.112082
 -1.133544	 -0.758578	  0.093823
 -1.132024	 -0.741607	  0.086422
 -1.130619	 -0.722582	  0.079967
 -1.127602	 -0.704096	  0.070830
 -1.127830	 -0.686047	  0.060785
 -1.128574	 -0.668034	  0.052098
 -1.129992	 -0.648611	  0.046454
 -1.130468	 -0.628986	  0.041528
 -1.126887	 -0.609729	  0.034157
 -1.122981	 -0.592073	  0.025142
 -1.122425	 -0.574257	  0.017827
 -1.121463	 -0.554485	  0.012636
 -1.120581	 -0.534612	  0.008065
 -1.112943	 -0.516128	 -0.002122
 -1.102716	 -0.501303	 -0.010714
 -1.100869	 -0.481819	 -0.013842
 -1.100234	 -0.461756	 -0.018232
 -1.098662	 -0.442295	 -0.022774
 -1.097338	 -0.422903	 -0.029038
 -1.094281	 -0.404021	 -0.034465
 -1.090268	 -0.385284	 -0.040301
 -1.085040	 -0.366150	 -0.044190
 -1.083479	 -0.347529	 -0.052185
 -1.079504	 -0.328549	 -0.054944
 -1.078998	 -0.309347	 -0.062154
 -1.080831	 -0.290421	 -0.064639
 -1.082689	 -0.271481	 -0.070273
 -1.084058	 -0.251887	 -0.073109
 -1.083238	 -0.232533	 -0.077887
 -1.082216	 -0.212459	 -0.082696
 -1.084248	 -0.194712	 -0.090601
 -1.091285	 -0.175409	 -0.098698
 -1.101030	 -0.159626	 -0.107442
 -1.112170	 -0.147302	 -0.119509
 -1.117285	 -0.130512	 -0.127743
 -1.123872	 -0.115670	 -0.139031
 -1.136131	 -0.100749	 -0.148655
 -1.141233	 -0.081749	 -0.151966
 -1.142123	 -0.061461	 -0.162353
 -1.149375	 -0.047995	 -0.174735
 -1.161525	 -0.036145	 -0.189043
 -1.175903	 -0.030663	 -0.202446
 -1.188349	 -0.020256	 -0.217208
 -1.195622	 -0.008468	 -0.225645
 -1.211238	  0.000700	 -0.235636
 -1.222779	  0.010238	 -0.249029
 -1.235075	  0.021429	 -0.260764
 -1.247775	  0.034461	 -0.268906
 -1.257856	  0.049177	 -0.283622
 -1.269848	  0.053168	 -0.298660
 -1.285734	  0.055728	 -0.309918
 -1.304560	  0.064393	 -0.319132
 -1.321970	  0.072016	 -0.328094
 -1.338064	  0.071818	 -0.336996
 -1.357585	  0.073866	 -0.345991
 -1.372845	  0.075824	 -0.355500
 -1.390937	  0.076223	 -0.366767
 -1.405716	  0.076627	 -0.379958
 -1.420650	  0.077684	 -0.393250
 -1.436430	  0.077104	 -0.405618
 -1.451453	  0.077805	 -0.419006
 -1.467164	  0.076190	 -0.430110
 -1.484151	  0.073809	 -0.440909
 -1.500791	  0.070293	 -0.453814
 -1.514782	  0.066043	 -0.466085
 -1.529932	  0.063118	 -0.477834
 -1.547119	  0.063245	 -0.492124
 -1.562370	  0.061904	 -0.504462
 -1.576060	  0.063849	 -0.516107
 -1.591796	  0.064073	 -0.529448
 -1.607851	  0.061910	 -0.542153
 -1.623664	  0.059633	 -0.554481
 -1.639361	  0.060030	 -0.567242
 -1.655823	  0.058081	 -0.578050
 -1.673628	  0.060571	 -0.589495
 -1.691639	  0.061885	 -0.598270
 -1.709180	  0.065790	 -0.606844
 -1.724888	  0.072977	 -0.621310
 -1.737393	  0.078810	 -0.637357
 -1.750141	  0.085240	 -0.652980
 -1.763629	  0.091017	 -0.665352
 -1.779551	  0.100097	 -0.672872
 -1.796261	  0.108626	 -0.682032
 -1.811986	  0.115043	 -0.691734
 -1.828536	  0.119716	 -0.702719
 -1.844253	  0.125706	 -0.712526
 -1.859853	  0.135309	 -0.722423
 -1.875378	  0.145541	 -0.729626
 -1.890945	  0.155091	 -0.737418
 -1.906115	  0.164982	 -0.746437
 -1.919993	  0.176736	 -0.755446
 -1.933698	  0.190125	 -0.762254
 -1.948039	  0.202311	 -0.767919
 -1.963130	  0.214008	 -0.774425
 -1.976843	  0.226829	 -0.781814
 -1.988825	  0.240890	 -0.789713
 -2.001050	  0.254642	 -0.797543
 -2.013195	  0.268511	 -0.805433
 -2.023756	  0.283291	 -0.814085
 -2.033925	  0.297935	 -0.823248
 -2.043490	  0.313000	 -0.832314
 -2.053450	  0.327782	 -0.841460
 -2.062108	  0.342950	 -0.851353
 -2.069966	  0.358163	 -0.861783
 -2.077452	  0.373200	 -0.872325
 -2.083427	  0.389104	 -0.883319
 -2.088568	  0.404446	 -0.895037
 -2.094643	  0.418754	 -0.907001
 -2.103337	  0.430862	 -0.919315
 -2.115195	  0.446680	 -0.933012
 -2.122136	  0.460553	 -0.942980
 -2.128393	  0.476621	 -0.950566
 -2.140613	  0.492924	 -0.958730
 -2.149780	  0.508895	 -0.966534
 -2.159964	  0.522336	 -0.975836
 -2.172062	  0.534145	 -0.988594
 -2.178422	  0.549312	 -1.001389
 -2.182662	  0.564016	 -1.011468
 -2.202683	  0.582297	 -1.029134
 -2.209332	  0.588958	 -1.035379
