  0.848214	 -2.351818	 -1.711837
  0.839816	 -2.328532	 -1.694888
  0.840940	 -2.274366	 -1.683494
  0.844494	 -2.223166	 -1.670854
  0.838242	 -2.178165	 -1.656017
  0.837230	 -2.127662	 -1.645807
  0.834112	 -2.076933	 -1.635740
  0.834008	 -2.030516	 -1.624580
  0.826549	 -1.982645	 -1.615119
  0.824866	 -1.934440	 -1.605843
  0.822411	 -1.887654	 -1.595712
  0.820092	 -1.836856	 -1.588384
  0.815854	 -1.785420	 -1.576802
  0.810714	 -1.736084	 -1.567421
  0.810733	 -1.689799	 -1.556147
  0.812139	 -1.639341	 -1.543682
  0.812163	 -1.590965	 -1.531451
  0.811506	 -1.546356	 -1.519756
  0.810694	 -1.497643	 -1.507991
  0.809146	 -1.449730	 -1.498341
  0.806713	 -1.398736	 -1.487784
  0.803201	 -1.351041	 -1.478922
  0.798766	 -1.299807	 -1.467031
  0.795421	 -1.254374	 -1.456346
  0.791367	 -1.207714	 -1.445703
  0.787649	 -1.158023	 -1.435126
  0.784572	 -1.108639	 -1.424944
  0.781820	 -1.056674	 -1.415277
  0.778145	 -1.010096	 -1.406425
  0.774829	 -0.959880	 -1.396894
  0.770967	 -0.907300	 -1.387181
  0.768417	 -0.857972	 -1.377590
  0.763449	 -0.812311	 -1.370681
  0.748938	 -0.779395	 -1.370843
  0.688474	 -0.747114	 -1.394565
  0.601706	 -0.679111	 -1.417809
  0.614478	 -0.729608	 -1.470278
  0.647595	 -0.652539	 -1.616226
  0.813819	 -0.609600	 -1.694032
  0.773400	 -0.565192	 -1.750968
  0.834205	 -0.593462	 -1.755524
  0.778238	 -0.466437	 -1.831433
  0.775700	 -0.367123	 -1.860559
  0.836523	 -0.159855	 -1.948454
  0.798843	  0.085931	 -1.848568
  0.752622	  0.201187	 -1.673338
  0.718656	  0.154060	 -1.619406
  0.624772	  0.089098	 -1.433164
  0.624842	  0.167938	 -1.422882
  0.599990	  0.174166	 -1.367445
  0.595823	  0.149361	 -1.309637
  0.611618	  0.136525	 -1.253182
  0.633088	  0.146794	 -1.207902
  0.692483	  0.217195	 -1.156548
  0.709037	  0.257451	 -1.140016
  0.715155	  0.305214	 -1.127480
  0.713444	  0.357963	 -1.118040
  0.710786	  0.404734	 -1.109173
  0.707939	  0.454183	 -1.099595
  0.705100	  0.500071	 -1.089991
  0.702497	  0.551758	 -1.079073
  0.700893	  0.598131	 -1.069880
  0.699210	  0.646320	 -1.060342
  0.697495	  0.699023	 -1.050341
  0.695254	  0.746614	 -1.039668
  0.692518	  0.796238	 -1.028081
  0.690418	  0.840837	 -1.016627
  0.687921	  0.889229	 -1.004813
  0.685934	  0.938700	 -0.991807
  0.683429	  0.990656	 -0.979279
  0.681520	  1.035658	 -0.970016
  0.681680	  1.087080	 -0.967823
  0.685556	  1.127628	 -0.980625
  0.703346	  1.224316	 -1.065192
  0.829261	  1.371502	 -1.429623
  0.876512	  1.440239	 -1.604359
  0.900114	  1.459640	 -1.600335
  0.908769	  1.501614	 -1.526650
  0.857180	  1.586537	 -1.550403
  0.930996	  1.655042	 -1.520599
  0.888346	  1.707054	 -1.502649
  0.908717	  1.735205	 -1.367071
  0.804859	  1.725040	 -1.177729
  0.841017	  1.749841	 -1.101287
  0.731984	  1.754416	 -0.974023
  0.650824	  1.774443	 -0.833600
  0.641092	  1.814497	 -0.813442
  0.642649	  1.868332	 -0.799632
  0.645932	  1.916025	 -0.789707
  0.642055	  1.962523	 -0.779335
  0.643397	  2.013136	 -0.767412
  0.638950	  2.061163	 -0.760893
  0.635735	  2.108169	 -0.750799
  0.625071	  2.160199	 -0.736312
  0.620502	  2.205943	 -0.725719
  0.620311	  2.253987	 -0.715407
  0.614449	  2.306063	 -0.707963
  0.612725	  2.356345	 -0.696827
  0.613305	  2.401737	 -0.684404
  0.611618	  2.448835	 -0.673936
  0.609647	  2.494544	 -0.664543
  0.604972	  2.542900	 -0.649972
  0.605849	  2.593137	 -0.640647
  0.600602	  2.646970	 -0.626620
  0.602525	  2.695355	 -0.617874
  0.602120	  2.746436	 -0.608636
  0.599414	  2.794632	 -0.595433
  0.592925	  2.840287	 -0.592994
  0.588917	  2.883206	 -0.583350
  0.594806	  2.912038	 -0.589184
