 -0.883654	 -2.214293	  0.301971
 -0.887667	 -2.242370	  0.323368
 -0.885790	 -2.229237	  0.313359
 -0.877264	 -2.187463	  0.283461
 -0.866137	 -2.144269	  0.252148
 -0.851067	 -2.100801	  0.218357
 -0.829178	 -2.058587	  0.180743
 -0.796238	 -2.017258	  0.134746
 -0.745679	 -1.980751	  0.077419
 -0.674230	 -1.959046	  0.017388
 -0.595159	 -1.957776	 -0.035045
 -0.533476	 -1.970356	 -0.082276
 -0.498621	 -1.985028	 -0.129147
 -0.481161	 -1.998131	 -0.189134
 -0.491128	 -1.999176	 -0.269439
 -0.535782	 -1.965145	 -0.360904
 -0.595404	 -1.885301	 -0.449988
 -0.677864	 -1.752240	 -0.524047
 -0.791516	 -1.596700	 -0.577782
 -0.904898	 -1.466220	 -0.602893
 -0.977894	 -1.380039	 -0.561254
 -1.017983	 -1.321586	 -0.474651
 -1.040376	 -1.289525	 -0.388336
 -1.046166	 -1.271872	 -0.342429
 -1.009007	 -1.249419	 -0.343583
 -0.970754	 -1.228781	 -0.355498
 -0.916696	 -1.191153	 -0.405304
 -0.867371	 -1.127005	 -0.479590
 -0.829658	 -1.068476	 -0.534309
 -0.803016	 -1.027192	 -0.570492
 -0.779346	 -0.993825	 -0.599747
 -0.750285	 -0.957078	 -0.632734
 -0.701866	 -0.902753	 -0.676530
 -0.638037	 -0.837463	 -0.708663
 -0.583907	 -0.780819	 -0.734818
 -0.550042	 -0.736317	 -0.763662
 -0.531530	 -0.702926	 -0.785538
 -0.521013	 -0.668094	 -0.816060
 -0.513412	 -0.616922	 -0.847038
 -0.513984	 -0.577265	 -0.866211
 -0.519700	 -0.547669	 -0.878694
 -0.530165	 -0.521135	 -0.888891
 -0.551865	 -0.482985	 -0.902882
 -0.590955	 -0.422446	 -0.922951
 -0.640802	 -0.345031	 -0.946824
 -0.688779	 -0.269905	 -0.969488
 -0.723082	 -0.207143	 -0.989148
 -0.741907	 -0.159079	 -1.003431
 -0.752241	 -0.118791	 -1.015684
 -0.757122	 -0.086414	 -1.026396
 -0.759972	 -0.061383	 -1.037603
 -0.763054	 -0.039147	 -1.052287
 -0.770491	 -0.004057	 -1.081437
 -0.782511	  0.038843	 -1.115805
 -0.797373	  0.085054	 -1.148453
 -0.813537	  0.131326	 -1.176507
 -0.831140	  0.175846	 -1.200495
 -0.851369	  0.221572	 -1.222974
 -0.878318	  0.278625	 -1.248420
 -0.914573	  0.355279	 -1.277102
 -0.948751	  0.437522	 -1.301716
 -0.966005	  0.493567	 -1.317497
 -0.951993	  0.527179	 -1.360345
 -0.923973	  0.549952	 -1.418912
 -0.881290	  0.554544	 -1.488319
 -0.843523	  0.544916	 -1.572671
 -0.788395	  0.523713	 -1.681178
 -0.699796	  0.520471	 -1.808975
 -0.654038	  0.584448	 -1.947498
 -0.635803	  0.658409	 -2.042010
 -0.627613	  0.718916	 -2.098833
 -0.623219	  0.776372	 -2.137286
 -0.622036	  0.848862	 -2.167232
 -0.629624	  0.961165	 -2.186899
 -0.659837	  1.136995	 -2.169181
 -0.717345	  1.324219	 -2.058164
 -0.764104	  1.432846	 -1.898587
 -0.788743	  1.485215	 -1.802893
 -0.790673	  1.513701	 -1.813217
 -0.796226	  1.589642	 -1.849952
 -0.796526	  1.593275	 -1.851827
