  1.614703	 -0.006688	  1.788410
  1.613133	  0.001996	  1.806598
  1.613472	 -0.002583	  1.785990
  1.614657	 -0.013676	  1.770125
  1.618419	 -0.023183	  1.753074
  1.621709	 -0.031559	  1.734194
  1.618926	 -0.040324	  1.714589
  1.616009	 -0.050260	  1.697142
  1.619006	 -0.057977	  1.681508
  1.622369	 -0.067237	  1.662704
  1.626183	 -0.076025	  1.645337
  1.628458	 -0.085881	  1.627653
  1.630623	 -0.095919	  1.610490
  1.632790	 -0.105963	  1.593331
  1.635611	 -0.117073	  1.576943
  1.638799	 -0.128769	  1.561035
  1.641998	 -0.140492	  1.545181
  1.645903	 -0.153651	  1.531086
  1.650160	 -0.168557	  1.519606
  1.654242	 -0.186239	  1.506947
  1.659100	 -0.203973	  1.496934
  1.667446	 -0.217620	  1.481816
  1.668658	 -0.223971	  1.467062
  1.669790	 -0.240160	  1.454278
  1.669853	 -0.258413	  1.440033
  1.668863	 -0.274315	  1.427219
  1.670123	 -0.287506	  1.414331
  1.673791	 -0.301540	  1.398847
  1.679940	 -0.316014	  1.383466
  1.682393	 -0.322281	  1.366075
  1.682221	 -0.332944	  1.346912
  1.686130	 -0.344916	  1.332471
  1.690283	 -0.355434	  1.317071
  1.691216	 -0.366576	  1.296758
  1.692092	 -0.379559	  1.283112
  1.696014	 -0.388601	  1.265772
  1.699091	 -0.393956	  1.243844
  1.701366	 -0.402872	  1.228718
  1.705440	 -0.412760	  1.209926
  1.710993	 -0.416054	  1.192047
  1.715795	 -0.420849	  1.172898
  1.721555	 -0.426718	  1.154071
  1.730281	 -0.431985	  1.137563
  1.740211	 -0.437588	  1.117133
  1.744552	 -0.447783	  1.101879
  1.750731	 -0.456742	  1.087727
  1.759481	 -0.465452	  1.070651
  1.773504	 -0.475358	  1.059431
  1.787852	 -0.484211	  1.048027
  1.802431	 -0.492080	  1.036913
  1.817744	 -0.498821	  1.026411
  1.832586	 -0.507092	  1.015525
  1.847090	 -0.515560	  1.004657
  1.861619	 -0.523993	  0.993872
  1.881358	 -0.526165	  0.991481
  1.901124	 -0.527944	  0.988969
  1.920819	 -0.529394	  0.986126
  1.940290	 -0.532013	  0.984354
  1.960768	 -0.535363	  0.983201
  1.980007	 -0.538515	  0.982096
  1.999077	 -0.541713	  0.980267
  2.019882	 -0.544567	  0.978000
  2.041409	 -0.543662	  0.973836
  2.058486	 -0.539393	  0.966851
  2.077921	 -0.542560	  0.965035
  2.098773	 -0.546665	  0.964147
  2.119313	 -0.546262	  0.960079
  2.137546	 -0.548066	  0.957956
  2.157845	 -0.550227	  0.955999
  2.177832	 -0.550929	  0.953007
  2.197677	 -0.549700	  0.950849
