 -1.990226	  1.419299	 -1.790389
 -1.970521	  1.405246	 -1.772662
 -1.938524	  1.377004	 -1.738048
 -1.910801	  1.342219	 -1.713413
 -1.884621	  1.316525	 -1.685504
 -1.860484	  1.279744	 -1.650863
 -1.837694	  1.247399	 -1.621051
 -1.811236	  1.217397	 -1.593978
 -1.787691	  1.186081	 -1.568701
 -1.760263	  1.153279	 -1.538576
 -1.733397	  1.121502	 -1.509406
 -1.709997	  1.092222	 -1.483001
 -1.686095	  1.060341	 -1.453536
 -1.658832	  1.025942	 -1.424428
 -1.629610	  0.993175	 -1.399264
 -1.600327	  0.960570	 -1.372802
 -1.575445	  0.929037	 -1.350407
 -1.552321	  0.893311	 -1.325886
 -1.525665	  0.855669	 -1.299305
 -1.494061	  0.824565	 -1.271146
 -1.468401	  0.797443	 -1.246945
 -1.438506	  0.762136	 -1.217468
 -1.411169	  0.729480	 -1.190578
 -1.386963	  0.699490	 -1.165264
 -1.361218	  0.666886	 -1.137256
 -1.333632	  0.630666	 -1.105621
 -1.308944	  0.597752	 -1.076327
 -1.285956	  0.566933	 -1.048925
 -1.261455	  0.534398	 -1.020472
 -1.237232	  0.502361	 -0.992095
 -1.212281	  0.469499	 -0.963065
 -1.188346	  0.437875	 -0.936205
 -1.160811	  0.403485	 -0.907190
 -1.134838	  0.373404	 -0.881186
 -1.104151	  0.339675	 -0.851028
 -1.075092	  0.309447	 -0.823202
 -1.047491	  0.279524	 -0.796297
 -1.018891	  0.247923	 -0.767401
 -0.993769	  0.217477	 -0.739826
 -0.970418	  0.187499	 -0.713051
 -0.946117	  0.154520	 -0.684865
 -0.920605	  0.118888	 -0.654732
 -0.895457	  0.083822	 -0.626923
 -0.872124	  0.051842	 -0.601621
 -0.847129	  0.020052	 -0.575498
 -0.819354	 -0.014478	 -0.547789
 -0.791952	 -0.049616	 -0.518807
 -0.766316	 -0.082313	 -0.490672
 -0.740666	 -0.113574	 -0.462540
 -0.718008	 -0.141482	 -0.438194
 -0.690722	 -0.175213	 -0.408541
 -0.665062	 -0.206669	 -0.380743
 -0.639500	 -0.238963	 -0.352517
 -0.612017	 -0.275283	 -0.321353
 -0.585896	 -0.309237	 -0.292319
 -0.564334	 -0.339992	 -0.267592
 -0.540000	 -0.374462	 -0.239815
 -0.514873	 -0.406800	 -0.214770
 -0.488215	 -0.438718	 -0.188540
 -0.458140	 -0.474396	 -0.158494
 -0.431191	 -0.508199	 -0.132023
 -0.405732	 -0.540689	 -0.106497
 -0.379130	 -0.573200	 -0.079380
 -0.351963	 -0.604074	 -0.050921
 -0.325984	 -0.632777	 -0.022347
 -0.297980	 -0.662981	  0.008543
 -0.271913	 -0.690974	  0.037759
 -0.243794	 -0.721147	  0.068312
 -0.217597	 -0.749415	  0.096169
 -0.190245	 -0.779229	  0.124861
 -0.163125	 -0.808634	  0.151647
 -0.132075	 -0.843483	  0.181780
 -0.105465	 -0.875517	  0.208065
 -0.079248	 -0.907356	  0.233073
 -0.053095	 -0.941623	  0.260363
 -0.027853	 -0.974271	  0.286482
  0.000825	 -1.007739	  0.313762
  0.034406	 -1.032328	  0.331062
  0.089711	 -1.047937	  0.337667
  0.247990	 -1.042803	  0.289069
  0.328648	 -1.102400	  0.240958
  0.406178	 -1.009133	  0.335899
  0.374298	 -1.172479	  0.298214
  0.509295	 -1.127621	  0.345341
  0.534601	 -1.193676	  0.322002
  0.564387	 -1.253564	  0.293834
  0.593207	 -1.260162	  0.343151
  0.581238	 -1.286989	  0.440156
  0.616758	 -1.305898	  0.501953
  0.629097	 -1.346040	  0.519862
  0.691985	 -1.399853	  0.487929
  0.595948	 -1.447805	  0.590794
  0.596769	 -1.457197	  0.654434
  0.532227	 -1.524747	  0.703727
  0.478832	 -1.585343	  0.806847
  0.491914	 -1.621378	  0.845763
  0.515248	 -1.652928	  0.875628
  0.539623	 -1.683557	  0.903829
  0.566954	 -1.719412	  0.935015
  0.589227	 -1.750856	  0.962008
  0.612899	 -1.784290	  0.989028
  0.636523	 -1.818795	  1.016875
  0.662766	 -1.855549	  1.045822
  0.687175	 -1.888944	  1.072191
  0.710135	 -1.919775	  1.096645
  0.736417	 -1.953020	  1.123945
  0.763762	 -1.986656	  1.152021
  0.790275	 -2.017922	  1.179105
  0.820065	 -2.051570	  1.208103
  0.847078	 -2.083575	  1.234451
  0.873602	 -2.116715	  1.263064
  0.901400	 -2.149049	  1.293378
  0.921447	 -2.177571	  1.320701
  0.949152	 -2.206984	  1.344789
  0.976020	 -2.245435	  1.374621
  1.006004	 -2.276451	  1.404677
  1.033814	 -2.305528	  1.433831
  1.059992	 -2.340740	  1.455708
  1.077251	 -2.376416	  1.480600
  1.088023	 -2.400181	  1.495406
