 -2.348111	  0.875956	 -0.157297
 -2.368441	  0.905639	 -0.189093
 -2.360794	  0.893066	 -0.175549
 -2.353006	  0.880537	 -0.162044
 -2.345689	  0.868048	 -0.148244
 -2.338633	  0.855614	 -0.134258
 -2.331706	  0.843389	 -0.120029
 -2.325079	  0.831762	 -0.105187
 -2.319145	  0.820069	 -0.090329
 -2.314921	  0.808330	 -0.074443
 -2.310750	  0.797591	 -0.057920
 -2.301656	  0.787626	 -0.042687
 -2.290598	  0.774895	 -0.029511
 -2.280653	  0.760749	 -0.017383
 -2.270652	  0.748536	 -0.006687
 -2.259712	  0.738171	  0.006763
 -2.251943	  0.727756	  0.024037
 -2.250905	  0.714411	  0.040950
 -2.249497	  0.702398	  0.061114
 -2.247286	  0.696453	  0.074342
 -2.238723	  0.687938	  0.091617
 -2.228870	  0.677510	  0.107706
 -2.220266	  0.666328	  0.121899
 -2.211664	  0.653055	  0.133671
 -2.202478	  0.636831	  0.142169
 -2.193127	  0.618753	  0.149432
 -2.184123	  0.601320	  0.158427
 -2.173937	  0.586461	  0.170432
 -2.164669	  0.578459	  0.185869
 -2.156523	  0.577154	  0.203605
 -2.146965	  0.573777	  0.224302
 -2.135636	  0.574562	  0.244249
 -2.124983	  0.571840	  0.263178
 -2.111408	  0.555608	  0.292665
 -2.101808	  0.546169	  0.302646
 -2.099627	  0.543163	  0.304557
 -2.085270	  0.526030	  0.316208
 -2.067641	  0.501716	  0.330630
 -2.061524	  0.489785	  0.337721
 -2.054626	  0.473238	  0.344365
 -2.045659	  0.455167	  0.358987
 -2.039010	  0.442522	  0.375786
 -2.038839	  0.434555	  0.393212
 -2.041470	  0.426838	  0.416571
 -2.046330	  0.425961	  0.429882
 -2.054453	  0.425119	  0.450353
 -2.064231	  0.424050	  0.479282
 -2.072695	  0.426057	  0.492140
 -2.078079	  0.426360	  0.502984
 -2.086661	  0.423869	  0.523891
 -2.093920	  0.420839	  0.544582
 -2.100815	  0.414974	  0.564491
 -2.107685	  0.412173	  0.576136
 -2.123952	  0.412007	  0.589252
 -2.139350	  0.409298	  0.605759
 -2.149360	  0.402615	  0.622159
 -2.161792	  0.399074	  0.637847
 -2.175222	  0.398079	  0.652828
 -2.188679	  0.396752	  0.667484
 -2.201559	  0.395784	  0.682687
 -2.214069	  0.395130	  0.698288
 -2.225456	  0.394514	  0.714309
 -2.234714	  0.394022	  0.731368
 -2.243169	  0.393884	  0.749618
 -2.251050	  0.394078	  0.768027
 -2.258819	  0.394381	  0.786455
 -2.266584	  0.394696	  0.804884
 -2.274332	  0.395028	  0.823319
 -2.282044	  0.395340	  0.841756
 -2.289292	  0.395038	  0.860177
 -2.289821	  0.387634	  0.878530
 -2.289669	  0.379467	  0.896773
 -2.289482	  0.371267	  0.915014
 -2.289291	  0.363062	  0.933250
 -2.288915	  0.354702	  0.951382
 -2.285749	  0.344158	  0.967918
 -2.277660	  0.330516	  0.979927
 -2.269204	  0.316647	  0.991584
 -2.260739	  0.302771	  1.003237
 -2.252143	  0.288877	  1.014739
 -2.241625	  0.274750	  1.024000
 -2.227612	  0.261089	  1.027685
 -2.213341	  0.247469	  1.030944
 -2.199063	  0.233848	  1.034190
 -2.184694	  0.220305	  1.037226
 -2.168999	  0.208032	  1.037347
 -2.152107	  0.198344	  1.033028
 -2.135134	  0.188842	  1.028392
 -2.118186	  0.179318	  1.023723
 -2.101428	  0.169552	  1.018838
 -2.084667	  0.159958	  1.013714
 -2.067064	  0.152060	  1.008415
 -2.048292	  0.148575	  1.002500
 -2.029294	  0.145862	  0.996690
 -2.010018	  0.143650	  0.992123
 -1.990684	  0.141133	  0.987546
 -1.971474	  0.138743	  0.982707
 -1.952526	  0.136591	  0.976492
 -1.933316	  0.133879	  0.971254
 -1.913976	  0.131170	  0.967150
 -1.894789	  0.128992	  0.962460
 -1.875602	  0.133293	  0.959546
 -1.856679	  0.139441	  0.957514
 -1.837706	  0.145657	  0.955714
 -1.818787	  0.151947	  0.953949
 -1.799833	  0.158267	  0.952545
 -1.780878	  0.164578	  0.952075
 -1.761878	  0.170888	  0.951166
 -1.742841	  0.176903	  0.950891
 -1.723819	  0.183033	  0.950485
 -1.705728	  0.190666	  0.952100
 -1.694940	  0.202988	  0.963019
 -1.684521	  0.215403	  0.973953
 -1.673102	  0.230090	  0.980373
 -1.664033	  0.248783	  0.985138
 -1.656249	  0.268159	  0.998187
 -1.647150	  0.277507	  1.016007
 -1.637651	  0.285676	  1.030941
 -1.629435	  0.295735	  1.042340
 -1.621369	  0.311747	  1.056186
 -1.611777	  0.322621	  1.072221
 -1.603010	  0.328536	  1.084665
 -1.589639	  0.333453	  1.101248
 -1.579343	  0.343594	  1.124002
 -1.574453	  0.350891	  1.136530
 -1.569551	  0.358514	  1.149771
 -1.561501	  0.361985	  1.168374
 -1.556964	  0.357504	  1.178708
 -1.553787	  0.355213	  1.186170
 -1.549306	  0.346559	  1.200872
 -1.546063	  0.339168	  1.215960
 -1.544137	  0.325532	  1.236671
 -1.539278	  0.298584	  1.246667
 -1.540378	  0.284530	  1.239620
 -1.549029	  0.260967	  1.213409
 -1.547082	  0.239079	  1.200850
 -1.541151	  0.224840	  1.191825
 -1.527327	  0.205440	  1.196248
 -1.516307	  0.186897	  1.201431
 -1.512699	  0.168711	  1.188608
 -1.513470	  0.155753	  1.174258
 -1.509898	  0.137384	  1.163652
 -1.506086	  0.118905	  1.156572
 -1.502958	  0.099639	  1.152244
 -1.499881	  0.080316	  1.148106
 -1.496803	  0.060991	  1.143971
 -1.493727	  0.041667	  1.139835
 -1.490649	  0.022343	  1.135700
 -1.487572	  0.003018	  1.131566
 -1.484497	 -0.016307	  1.127432
 -1.481434	 -0.035639	  1.123369
 -1.478609	 -0.055115	  1.120682
 -1.477316	 -0.074218	  1.125980
 -1.476132	 -0.093288	  1.131847
 -1.474842	 -0.112406	  1.137592
 -1.473322	 -0.131503	  1.143365
 -1.471907	 -0.150552	  1.149319
 -1.471012	 -0.169580	  1.155398
 -1.470110	 -0.188349	  1.161906
 -1.467447	 -0.204190	  1.173696
 -1.464919	 -0.219806	  1.186058
 -1.462099	 -0.235512	  1.198217
 -1.458215	 -0.251150	  1.210149
 -1.452136	 -0.264690	  1.223483
 -1.445878	 -0.277353	  1.237717
 -1.439167	 -0.289891	  1.251859
 -1.431190	 -0.301105	  1.266341
 -1.423059	 -0.311548	  1.281385
 -1.414689	 -0.321803	  1.296404
 -1.405145	 -0.330299	  1.311767
 -1.395523	 -0.338565	  1.327218
 -1.384060	 -0.348036	  1.340558
 -1.371685	 -0.358123	  1.352586
 -1.360529	 -0.368512	  1.365494
 -1.352002	 -0.379225	  1.380046
 -1.343676	 -0.389881	  1.394775
 -1.335440	 -0.399327	  1.410333
 -1.327494	 -0.406165	  1.427345
 -1.319495	 -0.412912	  1.444377
 -1.310582	 -0.421092	  1.460289
 -1.301240	 -0.430170	  1.475456
 -1.292996	 -0.440483	  1.490463
 -1.286042	 -0.452009	  1.505243
 -1.279011	 -0.463293	  1.520126
 -1.270425	 -0.472404	  1.535796
 -1.261950	 -0.482248	  1.551127
 -1.253888	 -0.494394	  1.564970
 -1.246133	 -0.507621	  1.577854
 -1.238682	 -0.520304	  1.591479
 -1.230622	 -0.532609	  1.605127
 -1.221517	 -0.544686	  1.618223
 -1.211109	 -0.555476	  1.631491
 -1.200333	 -0.565761	  1.644860
 -1.189961	 -0.576253	  1.658356
 -1.180725	 -0.587523	  1.672054
 -1.171618	 -0.598811	  1.685822
 -1.162962	 -0.609546	  1.700303
 -1.154742	 -0.619767	  1.715399
 -1.146598	 -0.629914	  1.730588
 -1.138823	 -0.639560	  1.746280
 -1.131301	 -0.649050	  1.762198
 -1.123814	 -0.658780	  1.777990
 -1.116199	 -0.669086	  1.793347
 -1.108363	 -0.679544	  1.808471
 -1.098837	 -0.691317	  1.821545
 -1.089212	 -0.703578	  1.834100
 -1.079937	 -0.716977	  1.845576
 -1.070968	 -0.730765	  1.856947
 -1.062433	 -0.744482	  1.868754
 -1.054081	 -0.758047	  1.880848
 -1.045666	 -0.771487	  1.893024
 -1.036326	 -0.783445	  1.906042
 -1.026726	 -0.794923	  1.919309
 -1.017362	 -0.806501	  1.932656
 -1.009038	 -0.818582	  1.946245
 -1.000715	 -0.830599	  1.959885
 -0.991313	 -0.841223	  1.973964
 -0.981043	 -0.850633	  1.988288
 -0.971852	 -0.862301	  2.001620
 -0.964432	 -0.876731	  2.013267
 -0.957100	 -0.890957	  2.025250
 -0.949686	 -0.904171	  2.038297
 -0.942265	 -0.917307	  2.051426
 -0.934841	 -0.930445	  2.064560
 -0.927304	 -0.943767	  2.077887
 -0.917750	 -0.959788	  2.094391
 -0.902780	 -0.981715	  2.118888
 -0.894421	 -0.993773	  2.132480
