 -2.237608	 -0.755049	 -0.328473
 -2.253849	 -0.791519	 -0.337279
 -2.252017	 -0.787405	 -0.336286
 -2.233453	 -0.749393	 -0.327177
 -2.211848	 -0.711509	 -0.316639
 -2.186944	 -0.673804	 -0.304054
 -2.160464	 -0.636449	 -0.290705
 -2.134472	 -0.600623	 -0.277904
 -2.107071	 -0.563042	 -0.263816
 -2.078620	 -0.520588	 -0.247662
 -2.051367	 -0.477961	 -0.232145
 -2.023535	 -0.433583	 -0.216597
 -1.997589	 -0.384587	 -0.201580
 -1.977225	 -0.336902	 -0.186344
 -1.959592	 -0.297610	 -0.172432
 -1.939745	 -0.261207	 -0.161027
 -1.916859	 -0.221242	 -0.150747
 -1.897330	 -0.189354	 -0.144451
 -1.869298	 -0.154746	 -0.141452
 -1.834478	 -0.109329	 -0.131839
 -1.803415	 -0.063992	 -0.114162
 -1.773763	 -0.015525	 -0.092529
 -1.748026	  0.042381	 -0.065719
 -1.734869	  0.109572	 -0.042471
 -1.740412	  0.182572	 -0.032000
 -1.771808	  0.274057	 -0.045087
 -1.829931	  0.370153	 -0.105613
 -1.875190	  0.425956	 -0.160064
 -1.886612	  0.446970	 -0.176019
 -1.883016	  0.505169	 -0.186690
 -1.864890	  0.594289	 -0.184131
 -1.835293	  0.681366	 -0.123484
 -1.775773	  0.753060	 -0.051955
 -1.698513	  0.792971	 -0.006310
 -1.658720	  0.804416	  0.014932
 -1.594391	  0.732374	  0.077691
 -1.499843	  0.690820	  0.155993
 -1.408914	  0.725252	  0.221587
 -1.356881	  0.777794	  0.265952
 -1.321925	  0.827828	  0.298209
 -1.294022	  0.876005	  0.319877
 -1.267392	  0.924511	  0.334986
 -1.240904	  0.974303	  0.343957
 -1.216160	  1.021695	  0.346740
 -1.193227	  1.067400	  0.345469
 -1.170842	  1.114277	  0.341964
 -1.148767	  1.162365	  0.338077
 -1.128570	  1.207574	  0.335878
 -1.109120	  1.251953	  0.337061
 -1.089916	  1.295966	  0.343179
 -1.069957	  1.337216	  0.357230
 -1.047212	  1.378626	  0.367116
 -1.024568	  1.414250	  0.378558
 -1.001882	  1.445610	  0.397132
 -0.975276	  1.479848	  0.422679
 -0.947339	  1.517088	  0.453556
 -0.920225	  1.557916	  0.486893
 -0.895854	  1.602171	  0.518539
 -0.875929	  1.648375	  0.544803
 -0.858335	  1.695423	  0.565218
 -0.841882	  1.741963	  0.581240
 -0.827186	  1.782775	  0.593577
 -0.812256	  1.818803	  0.604599
 -0.792629	  1.855109	  0.618046
 -0.769865	  1.892688	  0.635822
 -0.746006	  1.930480	  0.655415
 -0.721261	  1.967732	  0.673635
 -0.695605	  2.001225	  0.688448
 -0.667082	  2.034012	  0.702192
 -0.635499	  2.068211	  0.715869
 -0.603977	  2.102751	  0.729355
 -0.572199	  2.136531	  0.742505
 -0.533049	  2.178232	  0.757159
 -0.485597	  2.243967	  0.773176
 -0.469906	  2.271784	  0.778872
