 0.0 0.0 0.0 0
 0.2186130380133482 0.7840797777137195 0.13910041526029512 1000
 0.36995480451097895 -0.9273449753989946 -0.7947495864895405 1000
 -0.1490555349767648 -0.1320961397012194 -0.054883860752268185 1000
 0.6330630402469282 -0.7103267915432075 -0.8683907913524277 1000
 -0.6459804562608539 0.1825196080373454 0.5610678478787926 1000
 -0.24900464004128925 -0.5383879505095583 0.03818291377776037 1000
 0.6886776167920988 0.7220052333567133 -0.22134960989180574 1000
 0.5228473479795416 -0.45800596047375336 -0.7679150689615066 1000
 0.0 0.0 0.0 0
 0.36844022828904915 -0.11926612162746042 -0.2682944799716328 1000
 0.9867585893293092 0.1429374067936946 -0.7693777752127594 1000
 -0.5426892965291974 -0.6501545392760182 0.2021744602291083 1000
 -0.8760184691800041 0.3565199516375125 0.9742419009179464 1000
 0.032802042316105035 -0.45403171912420603 -0.363866969861109 1000
 0.6126507867705264 0.04629933570956557 -0.5986266266634385 1000
 -0.2516234370466635 -0.9254361730699988 -0.21747411485555548 1000
 -0.5642144482334702 0.19590144705859264 0.6809365882909728 1000
 0.0 0.0 0.0 0
 0.023026286283694408 0.8676902446925947 0.36013164228543804 1000
 0.8040324638125838 0.34960137157739557 -0.458965644035414 1000
 -0.16578240921410053 0.9645624840341425 0.655027185421552 1000
 -0.918788774890535 0.11273769029459246 0.8941176173701213 1000
 -0.3955616221190656 0.6522806367880524 0.7478933277522788 1000
 0.4056368281804058 0.813034411380444 0.011953493411773375 1000
 -0.591312441210298 0.6300670191092816 0.7686790308352971 1000
 -0.38771593907484236 0.017356791796630133 0.45268856116379 1000
 0.0 0.0 0.0 0
 0.24198768825402595 -0.5783112974667066 -0.4084873067359441 1000
 -0.7186389599333641 0.6923820539881937 0.9625182354922106 1000
 -0.4611290195354162 -0.833557552686006 -0.06013608588083519 1000
 0.04751328582211131 0.12427217216210185 -0.09606970578578083 1000
 0.19044389132657924 -0.8667312367819131 -0.5479456935129177 1000
 0.11702271729620085 0.3128758505597115 0.16950964432791574 1000
