  2.094084	 -0.406085	  2.151931
  2.073350	 -0.402064	  2.130625
  2.059609	 -0.443684	  2.112225
  2.035800	 -0.481380	  2.093668
  2.007080	 -0.516200	  2.074945
  1.975975	 -0.549637	  2.055911
  1.944706	 -0.582692	  2.036102
  1.913587	 -0.615746	  2.015957
  1.882667	 -0.648715	  1.995431
  1.852061	 -0.681584	  1.975051
  1.821139	 -0.714574	  1.955735
  1.788720	 -0.747875	  1.938069
  1.755760	 -0.781567	  1.920681
  1.722975	 -0.815786	  1.902114
  1.691142	 -0.850180	  1.882078
  1.660759	 -0.884246	  1.860631
  1.631709	 -0.918140	  1.837571
  1.603957	 -0.951867	  1.813602
  1.577084	 -0.985516	  1.789070
  1.550634	 -1.019535	  1.763741
  1.524230	 -1.053354	  1.737529
  1.497116	 -1.086090	  1.710367
  1.469322	 -1.117440	  1.682683
  1.441119	 -1.147338	  1.654727
  1.412665	 -1.176474	  1.626604
  1.384246	 -1.204948	  1.598778
  1.355533	 -1.233261	  1.571563
  1.326217	 -1.261588	  1.545168
  1.296067	 -1.290034	  1.519537
  1.264302	 -1.318778	  1.494760
  1.230541	 -1.348062	  1.471126
  1.196852	 -1.378230	  1.448590
  1.164096	 -1.408949	  1.425721
  1.132324	 -1.440410	  1.402611
  1.101246	 -1.472219	  1.379191
  1.070803	 -1.504657	  1.355809
  1.040898	 -1.537470	  1.332772
  1.011452	 -1.570963	  1.310355
  0.982643	 -1.605301	  1.288373
  0.955061	 -1.640332	  1.267273
  0.928114	 -1.676885	  1.246878
  0.901505	 -1.714182	  1.227407
  0.875600	 -1.752434	  1.208424
  0.850251	 -1.791352	  1.189314
  0.825198	 -1.830514	  1.169209
  0.800083	 -1.869255	  1.148210
  0.774864	 -1.906861	  1.126256
  0.749250	 -1.943064	  1.103384
  0.723436	 -1.977391	  1.079945
  0.697264	 -2.010691	  1.055711
  0.670567	 -2.043611	  1.030946
  0.643088	 -2.076023	  1.005791
  0.614918	 -2.108525	  0.980205
  0.585863	 -2.140473	  0.954483
  0.555955	 -2.171952	  0.927963
  0.524648	 -2.202138	  0.901658
  0.492392	 -2.231619	  0.875888
  0.460409	 -2.261684	  0.851391
  0.428851	 -2.291920	  0.827876
  0.397711	 -2.322150	  0.805153
  0.366859	 -2.352517	  0.782665
  0.335970	 -2.383154	  0.760309
  0.305068	 -2.414226	  0.738058
  0.273759	 -2.445575	  0.715857
  0.242075	 -2.476825	  0.693384
  0.210067	 -2.507643	  0.670676
  0.177089	 -2.538326	  0.647791
  0.143971	 -2.568745	  0.624407
  0.111167	 -2.599306	  0.601025
  0.079697	 -2.630706	  0.578876
  0.048989	 -2.661660	  0.555811
  0.021742	 -2.697532	  0.536211
  0.000182	 -2.732568	  0.509251
 -0.027734	 -2.767654	  0.488407
 -0.056741	 -2.802771	  0.467749
 -0.081672	 -2.834993	  0.437951
 -0.117280	 -2.866015	  0.418904
 -0.145124	 -2.904517	  0.398373
 -0.173661	 -2.938166	  0.369432
 -0.206750	 -2.972830	  0.345744
 -0.208817	 -3.002558	  0.349201
