 -0.161381	 -2.591950	  1.560977
 -0.159784	 -2.566288	  1.545522
 -0.141093	 -2.518789	  1.530530
 -0.139405	 -2.469408	  1.516801
 -0.127418	 -2.422136	  1.503131
 -0.115056	 -2.377484	  1.484265
 -0.106870	 -2.330661	  1.471690
 -0.095731	 -2.284098	  1.459169
 -0.089608	 -2.235486	  1.445970
 -0.078239	 -2.189566	  1.430043
 -0.071422	 -2.144283	  1.414160
 -0.065509	 -2.097366	  1.398456
 -0.057904	 -2.050701	  1.382720
 -0.048244	 -2.004427	  1.366770
 -0.037178	 -1.958915	  1.349277
 -0.026512	 -1.914117	  1.330200
 -0.017662	 -1.869143	  1.310713
 -0.010937	 -1.822785	  1.291234
 -0.004881	 -1.775487	  1.271855
  0.001795	 -1.729158	  1.254176
  0.009362	 -1.682318	  1.239534
  0.017808	 -1.634661	  1.231973
  0.027605	 -1.578007	  1.235858
  0.048512	 -1.490570	  1.272040
  0.092992	 -1.406019	  1.356862
  0.137511	 -1.352029	  1.423717
  0.171083	 -1.298835	  1.456812
  0.197700	 -1.247759	  1.473567
  0.225153	 -1.204779	  1.475799
  0.232376	 -1.178234	  1.437407
  0.258914	 -1.132946	  1.420671
  0.228669	 -1.068993	  1.430949
  0.230870	 -1.027909	  1.376617
  0.230744	 -1.016005	  1.299819
  0.221496	 -1.006116	  1.195058
  0.216187	 -0.980892	  1.073016
  0.218149	 -0.947981	  0.997898
  0.222130	 -0.912788	  0.958958
  0.229311	 -0.870962	  0.933440
  0.235127	 -0.825554	  0.912686
  0.238463	 -0.778568	  0.894041
  0.241684	 -0.731692	  0.876906
  0.245668	 -0.684510	  0.859480
  0.250943	 -0.636920	  0.840901
  0.258160	 -0.589829	  0.822593
  0.267828	 -0.543954	  0.805600
  0.278034	 -0.499932	  0.789642
  0.288672	 -0.454821	  0.772950
  0.299477	 -0.409474	  0.755826
  0.310192	 -0.364447	  0.738184
  0.320729	 -0.319475	  0.720373
  0.331526	 -0.273853	  0.703047
  0.343200	 -0.226646	  0.686341
  0.355818	 -0.178890	  0.671077
  0.368713	 -0.132346	  0.658672
  0.380911	 -0.085563	  0.647211
  0.392080	 -0.038623	  0.634886
  0.402322	  0.007719	  0.621213
  0.411367	  0.053296	  0.606781
  0.419007	  0.098438	  0.591469
  0.424650	  0.143529	  0.574931
  0.427840	  0.188762	  0.557879
  0.428770	  0.236383	  0.540647
  0.429823	  0.284444	  0.525183
  0.432937	  0.332700	  0.512092
  0.439849	  0.382033	  0.500979
  0.451208	  0.432185	  0.490517
  0.467484	  0.482758	  0.479425
  0.486155	  0.530067	  0.468319
  0.505704	  0.573873	  0.457152
  0.525301	  0.617097	  0.444858
  0.542590	  0.661173	  0.430828
  0.555035	  0.706564	  0.414977
  0.563291	  0.752116	  0.397849
  0.569389	  0.797178	  0.379195
  0.574797	  0.841745	  0.358136
  0.579966	  0.885352	  0.334101
  0.585964	  0.931549	  0.303073
  0.594404	  0.983347	  0.254047
  0.604834	  1.016643	  0.184983
  0.633216	  1.031601	  0.121994
  0.667879	  1.041785	  0.061057
  0.705184	  1.072975	  0.020038
  0.734904	  1.099551	 -0.017986
  0.755504	  1.112643	 -0.044775
  0.765271	  1.117985	 -0.057593
  0.775592	  1.125844	 -0.066606
  0.802186	  1.144277	 -0.082985
  0.906153	  1.289453	 -0.070221
  0.941365	  1.396250	 -0.071018
  0.939837	  1.479525	 -0.074417
  0.937553	  1.513671	 -0.085717
  0.930854	  1.544871	 -0.104803
  0.923507	  1.589299	 -0.107047
  0.913556	  1.631154	 -0.084336
  0.897485	  1.685624	 -0.075988
  0.879365	  1.753479	 -0.068919
  0.867206	  1.824142	 -0.070680
  0.860190	  1.880835	 -0.078489
  0.856695	  1.927064	 -0.088389
  0.856016	  1.972079	 -0.100995
  0.857907	  2.017280	 -0.116139
  0.861876	  2.063152	 -0.133651
  0.868387	  2.108537	 -0.151966
  0.877161	  2.152166	 -0.169772
  0.887824	  2.197328	 -0.188200
  0.898193	  2.243237	 -0.206620
  0.907504	  2.289917	 -0.223315
  0.915300	  2.336415	 -0.236917
  0.921605	  2.383449	 -0.248987
  0.928359	  2.431586	 -0.260375
  0.935782	  2.481598	 -0.270110
  0.943876	  2.530995	 -0.278001
  0.953321	  2.578125	 -0.291920
  0.963544	  2.622635	 -0.313690
  0.971306	  2.669400	 -0.330478
  0.987412	  2.714742	 -0.342818
  0.996961	  2.756662	 -0.365424
  1.009753	  2.798577	 -0.385181
  1.019850	  2.826563	 -0.389033
