 -1.040098	 -1.882354	 -1.017308
 -1.026089	 -1.923018	 -0.994365
 -1.035540	 -1.907940	 -1.011036
 -1.040372	 -1.896985	 -1.016104
 -1.044665	 -1.870888	 -1.022272
 -1.048959	 -1.854555	 -1.028703
 -1.062445	 -1.836328	 -1.043020
 -1.070082	 -1.828316	 -1.049658
 -1.074484	 -1.809708	 -1.060118
 -1.073249	 -1.789579	 -1.067941
 -1.073337	 -1.770334	 -1.075979
 -1.077305	 -1.752640	 -1.085518
 -1.081078	 -1.735515	 -1.095154
 -1.084723	 -1.718457	 -1.104943
 -1.088346	 -1.701425	 -1.114776
 -1.092131	 -1.684889	 -1.124676
 -1.099443	 -1.668414	 -1.134361
 -1.105450	 -1.650879	 -1.144861
 -1.109096	 -1.635818	 -1.154562
 -1.111554	 -1.618896	 -1.166316
 -1.114030	 -1.598823	 -1.179554
 -1.109277	 -1.584784	 -1.189214
 -1.102374	 -1.569105	 -1.201718
 -1.101554	 -1.551473	 -1.214555
 -1.109467	 -1.537175	 -1.224576
 -1.118870	 -1.519525	 -1.236600
 -1.120608	 -1.500755	 -1.246533
 -1.115323	 -1.486157	 -1.255421
 -1.111127	 -1.470817	 -1.269908
 -1.107348	 -1.455715	 -1.287971
 -1.107125	 -1.442168	 -1.298780
 -1.107496	 -1.426206	 -1.310977
 -1.106492	 -1.412643	 -1.325733
 -1.108278	 -1.394974	 -1.341278
 -1.113941	 -1.376989	 -1.349244
 -1.118584	 -1.358767	 -1.356455
 -1.119584	 -1.339933	 -1.364689
 -1.117527	 -1.320913	 -1.370501
 -1.113837	 -1.302333	 -1.375239
 -1.112702	 -1.282836	 -1.384823
 -1.117916	 -1.264307	 -1.398247
 -1.122752	 -1.249982	 -1.407099
 -1.122350	 -1.233310	 -1.414927
 -1.122625	 -1.213649	 -1.423904
 -1.132967	 -1.190549	 -1.432928
 -1.139157	 -1.179965	 -1.436359
 -1.140903	 -1.160100	 -1.445355
 -1.144138	 -1.141772	 -1.458812
 -1.147331	 -1.128540	 -1.472769
 -1.148024	 -1.112165	 -1.485654
 -1.145920	 -1.096033	 -1.493550
 -1.145487	 -1.076570	 -1.503119
 -1.146833	 -1.058803	 -1.513268
 -1.147312	 -1.041589	 -1.523309
 -1.146932	 -1.024744	 -1.533951
 -1.146415	 -1.008750	 -1.546530
 -1.146321	 -0.993643	 -1.560276
 -1.146716	 -0.978958	 -1.572330
 -1.151024	 -0.961248	 -1.582737
 -1.158125	 -0.943618	 -1.591595
 -1.166754	 -0.926750	 -1.603952
 -1.169763	 -0.912642	 -1.617297
 -1.168460	 -0.896719	 -1.626237
 -1.168217	 -0.877662	 -1.633426
 -1.171572	 -0.857440	 -1.645812
 -1.171543	 -0.843438	 -1.660195
 -1.166256	 -0.830430	 -1.674108
 -1.159949	 -0.815813	 -1.685215
 -1.158759	 -0.797560	 -1.696370
 -1.163291	 -0.779403	 -1.709939
 -1.166310	 -0.767014	 -1.720230
 -1.167451	 -0.748929	 -1.730140
 -1.168492	 -0.731218	 -1.738479
 -1.173618	 -0.713991	 -1.751539
 -1.181443	 -0.699941	 -1.768451
 -1.184025	 -0.686170	 -1.782844
 -1.180814	 -0.670379	 -1.790495
 -1.177312	 -0.649628	 -1.797997
 -1.178681	 -0.630607	 -1.804275
 -1.185280	 -0.612413	 -1.813172
 -1.188636	 -0.595834	 -1.821850
 -1.187392	 -0.576951	 -1.829624
 -1.184101	 -0.557528	 -1.835947
 -1.186416	 -0.538945	 -1.841564
 -1.197676	 -0.519408	 -1.852463
 -1.206038	 -0.505364	 -1.863906
 -1.208763	 -0.489080	 -1.873730
 -1.206552	 -0.470085	 -1.879097
 -1.204589	 -0.450105	 -1.886972
 -1.201976	 -0.433991	 -1.898883
 -1.202150	 -0.414615	 -1.912134
 -1.209606	 -0.397429	 -1.918591
 -1.221641	 -0.381889	 -1.925291
 -1.230672	 -0.366294	 -1.936418
 -1.232648	 -0.350041	 -1.948841
 -1.230904	 -0.332254	 -1.960973
 -1.227661	 -0.316816	 -1.973363
 -1.228908	 -0.301894	 -1.988562
 -1.236802	 -0.287508	 -2.001678
 -1.245261	 -0.270852	 -2.007724
 -1.250316	 -0.251916	 -2.014675
 -1.254563	 -0.234895	 -2.027412
 -1.261994	 -0.205244	 -2.045123
 -1.265929	 -0.189078	 -2.056221
