 -1.866085	  1.569517	 -0.142881
 -1.865889	  1.579552	 -0.152121
 -1.848773	  1.575467	 -0.127572
 -1.848510	  1.558527	 -0.114792
 -1.858854	  1.538560	 -0.111173
 -1.867874	  1.510088	 -0.103393
 -1.864963	  1.496164	 -0.087519
 -1.859369	  1.488927	 -0.076233
 -1.850413	  1.479288	 -0.058040
 -1.855516	  1.463172	 -0.037944
 -1.859596	  1.454810	 -0.019370
 -1.862983	  1.444326	  0.000252
 -1.869523	  1.431909	  0.011223
 -1.880297	  1.414729	  0.021904
 -1.885744	  1.401593	  0.036581
 -1.882644	  1.392929	  0.053915
 -1.875023	  1.385646	  0.076805
 -1.877777	  1.377338	  0.094343
 -1.892811	  1.364510	  0.108653
 -1.908869	  1.348727	  0.119391
 -1.915280	  1.328055	  0.130712
 -1.916357	  1.314571	  0.142985
 -1.916071	  1.304164	  0.159991
 -1.918264	  1.289290	  0.176336
 -1.920106	  1.272163	  0.188263
 -1.919097	  1.258697	  0.200748
 -1.919068	  1.246674	  0.217420
 -1.918718	  1.233097	  0.232782
 -1.918426	  1.217216	  0.245372
 -1.918746	  1.203424	  0.259469
 -1.916846	  1.190308	  0.275486
 -1.915013	  1.176015	  0.291237
 -1.913354	  1.161455	  0.305294
 -1.909843	  1.145325	  0.316607
 -1.906243	  1.130810	  0.330122
 -1.899426	  1.119028	  0.343666
 -1.893494	  1.108089	  0.360142
 -1.886472	  1.098779	  0.376704
 -1.881588	  1.089800	  0.394006
 -1.877940	  1.080017	  0.411070
 -1.876566	  1.067746	  0.426805
 -1.875189	  1.055471	  0.442535
 -1.873810	  1.043215	  0.458248
 -1.874622	  1.030271	  0.472762
 -1.881962	  1.017814	  0.486587
 -1.892101	  1.006628	  0.504500
 -1.895229	  0.995120	  0.522016
 -1.889674	  0.978375	  0.531319
 -1.876388	  0.956539	  0.538706
 -1.867456	  0.938632	  0.553980
 -1.869865	  0.926131	  0.570609
 -1.880770	  0.918038	  0.586854
 -1.898853	  0.902356	  0.602436
 -1.911386	  0.886158	  0.615101
 -1.914243	  0.875201	  0.623037
 -1.914312	  0.858044	  0.633402
 -1.916718	  0.836964	  0.647200
 -1.916086	  0.819985	  0.660102
 -1.913695	  0.810606	  0.666739
 -1.907965	  0.791715	  0.684907
 -1.907531	  0.775397	  0.699730
 -1.907714	  0.760785	  0.707783
 -1.909027	  0.744923	  0.712497
 -1.909490	  0.723415	  0.720963
 -1.913399	  0.703436	  0.737520
 -1.917059	  0.684159	  0.755639
 -1.917460	  0.676539	  0.762719
 -1.915521	  0.662476	  0.774331
 -1.913969	  0.646440	  0.787886
 -1.916253	  0.631077	  0.803216
 -1.918145	  0.616795	  0.818002
 -1.915790	  0.598547	  0.837798
 -1.910666	  0.584595	  0.847881
 -1.905664	  0.575655	  0.852286
 -1.896379	  0.553206	  0.865404
 -1.887473	  0.536488	  0.882522
 -1.883085	  0.524986	  0.896391
 -1.879858	  0.516067	  0.908474
 -1.880698	  0.507015	  0.932691
 -1.881515	  0.497635	  0.954641
 -1.880956	  0.490755	  0.965952
 -1.877921	  0.479409	  0.988911
 -1.874101	  0.466577	  1.007831
 -1.870637	  0.457562	  1.017496
 -1.862487	  0.444909	  1.030922
 -1.858826	  0.430874	  1.051421
 -1.860643	  0.417247	  1.068996
 -1.865507	  0.407729	  1.081353
 -1.869839	  0.401720	  1.099947
 -1.868927	  0.399359	  1.122550
 -1.865069	  0.383931	  1.144042
 -1.863328	  0.361683	  1.154758
 -1.865305	  0.345338	  1.162313
 -1.872515	  0.332183	  1.177327
 -1.880055	  0.325270	  1.193620
 -1.882259	  0.312657	  1.211365
 -1.883124	  0.299882	  1.226917
 -1.884294	  0.287660	  1.242545
 -1.885395	  0.275303	  1.258353
 -1.885683	  0.262059	  1.273389
 -1.885838	  0.248707	  1.288262
 -1.885777	  0.235040	  1.302949
 -1.885358	  0.220974	  1.317234
 -1.884375	  0.206413	  1.330867
 -1.883059	  0.191619	  1.344302
 -1.881915	  0.176983	  1.357896
 -1.880851	  0.162339	  1.371478
 -1.879789	  0.147664	  1.385025
 -1.878712	  0.132974	  1.398549
 -1.877659	  0.116431	  1.409737
 -1.876589	  0.099820	  1.420826
 -1.875549	  0.083169	  1.431856
 -1.874845	  0.066129	  1.442303
 -1.874139	  0.049089	  1.452749
 -1.874027	  0.033598	  1.465398
 -1.874266	  0.019156	  1.479231
 -1.874510	  0.004719	  1.493070
 -1.878865	 -0.009034	  1.506920
 -1.883997	 -0.022537	  1.520684
 -1.888995	 -0.034860	  1.533849
 -1.895422	 -0.044887	  1.549037
 -1.894097	 -0.060619	  1.564797
 -1.895297	 -0.072754	  1.580650
