 -0.161381	 -2.591950	  1.560977
 -0.159784	 -2.566288	  1.545522
 -0.141055	 -2.518733	  1.530511
 -0.139412	 -2.469399	  1.516798
 -0.127414	 -2.422120	  1.503128
 -0.115050	 -2.377454	  1.484255
 -0.106863	 -2.330683	  1.471681
 -0.095577	 -2.284160	  1.459068
 -0.089503	 -2.235522	  1.445703
 -0.078023	 -2.189665	  1.429726
 -0.071202	 -2.144406	  1.413971
 -0.065241	 -2.097470	  1.398186
 -0.057590	 -2.050880	  1.382343
 -0.047854	 -2.004697	  1.366350
 -0.036719	 -1.959193	  1.348870
 -0.026004	 -1.914401	  1.329847
 -0.017091	 -1.869454	  1.310414
 -0.010304	 -1.823035	  1.290948
 -0.004116	 -1.775708	  1.271540
  0.002669	 -1.729495	  1.253790
  0.010353	 -1.682643	  1.238954
  0.019051	 -1.635104	  1.231350
  0.028929	 -1.579364	  1.235248
  0.049790	 -1.492493	  1.271870
  0.094632	 -1.407443	  1.358947
  0.138637	 -1.353695	  1.425603
  0.171799	 -1.299291	  1.458307
  0.197396	 -1.247712	  1.474558
  0.225777	 -1.204501	  1.477289
  0.232134	 -1.178531	  1.437269
  0.259832	 -1.133339	  1.420254
  0.228286	 -1.068440	  1.431449
  0.230997	 -1.027185	  1.377032
  0.231915	 -1.015112	  1.300665
  0.222207	 -1.005793	  1.195927
  0.215715	 -0.980954	  1.071457
  0.217330	 -0.948226	  0.996701
  0.221425	 -0.912929	  0.958520
  0.228811	 -0.870827	  0.933575
  0.234741	 -0.825318	  0.913114
  0.238215	 -0.778303	  0.894574
  0.241609	 -0.731459	  0.877487
  0.245859	 -0.684347	  0.860125
  0.251332	 -0.636696	  0.841491
  0.258764	 -0.589605	  0.823217
  0.268538	 -0.543832	  0.806240
  0.278759	 -0.499903	  0.790402
  0.289420	 -0.454792	  0.773715
  0.300223	 -0.409405	  0.756614
  0.310928	 -0.364293	  0.739017
  0.321385	 -0.319339	  0.721240
  0.332146	 -0.273756	  0.703934
  0.343750	 -0.226469	  0.687251
  0.356265	 -0.178682	  0.671843
  0.369076	 -0.132208	  0.659339
  0.381193	 -0.085516	  0.647748
  0.392307	 -0.038598	  0.635287
  0.402579	  0.007779	  0.621503
  0.411634	  0.053271	  0.607057
  0.419352	  0.098420	  0.591720
  0.425149	  0.143579	  0.575119
  0.428556	  0.188783	  0.558103
  0.429751	  0.236425	  0.540789
  0.431087	  0.284396	  0.525245
  0.434425	  0.332530	  0.511997
  0.441356	  0.381688	  0.500672
  0.452485	  0.431702	  0.490021
  0.468566	  0.482315	  0.478864
  0.487033	  0.529608	  0.467595
  0.506331	  0.573382	  0.456312
  0.525742	  0.616711	  0.444018
  0.542992	  0.660851	  0.430114
  0.555610	  0.706245	  0.414470
  0.563760	  0.751850	  0.397386
  0.569544	  0.796915	  0.378760
  0.574739	  0.841498	  0.357721
  0.579547	  0.884870	  0.333514
  0.585185	  0.930579	  0.302674
  0.593609	  0.983227	  0.254290
  0.602135	  1.017169	  0.183894
  0.633333	  1.034337	  0.123231
  0.675463	  1.044049	  0.067264
  0.707587	  1.073781	  0.021436
  0.734797	  1.098241	 -0.018975
  0.755144	  1.108376	 -0.047549
  0.767022	  1.114290	 -0.058571
  0.776712	  1.122853	 -0.067777
  0.798666	  1.143572	 -0.080284
  0.897863	  1.289846	 -0.064705
  0.935436	  1.396767	 -0.073354
  0.942304	  1.479759	 -0.075912
  0.936371	  1.515933	 -0.084134
  0.933721	  1.543199	 -0.101324
  0.924176	  1.592054	 -0.103977
  0.916359	  1.630856	 -0.082871
  0.898976	  1.685918	 -0.076268
  0.879922	  1.753481	 -0.068231
  0.867102	  1.824673	 -0.069796
  0.859511	  1.881207	 -0.077356
  0.855745	  1.927314	 -0.087156
  0.855198	  1.972467	 -0.099655
  0.857264	  2.017625	 -0.115081
  0.861366	  2.063549	 -0.132728
  0.868039	  2.108930	 -0.151248
  0.876913	  2.152479	 -0.168992
  0.887687	  2.197676	 -0.187385
  0.898006	  2.243602	 -0.205772
  0.907378	  2.290301	 -0.222403
  0.915259	  2.336703	 -0.236031
  0.921599	  2.383627	 -0.248217
  0.928465	  2.431670	 -0.259788
  0.936051	  2.481668	 -0.269810
  0.944218	  2.530965	 -0.277943
  0.953766	  2.577971	 -0.292044
  0.964101	  2.622473	 -0.313845
  0.971717	  2.669292	 -0.330577
  0.987810	  2.714623	 -0.342864
  0.997161	  2.756614	 -0.365506
  1.009753	  2.798577	 -0.385181
  1.019850	  2.826563	 -0.389033
