 -0.555182	 -1.501365	 -2.002769
 -0.556157	 -1.508839	 -2.034304
 -0.555557	 -1.504228	 -2.014852
 -0.554745	 -1.498842	 -1.995608
 -0.553908	 -1.493360	 -1.976392
 -0.553071	 -1.487878	 -1.957176
 -0.552210	 -1.480923	 -1.938444
 -0.551341	 -1.473416	 -1.919927
 -0.550471	 -1.465909	 -1.901410
 -0.549610	 -1.457825	 -1.883137
 -0.548799	 -1.447159	 -1.866238
 -0.547988	 -1.436492	 -1.849339
 -0.547177	 -1.425826	 -1.832440
 -0.546308	 -1.414389	 -1.816056
 -0.545207	 -1.399880	 -1.802335
 -0.544106	 -1.385371	 -1.788613
 -0.543005	 -1.370862	 -1.774892
 -0.541905	 -1.356353	 -1.761170
 -0.540081	 -1.339131	 -1.751167
 -0.538141	 -1.321529	 -1.741870
 -0.536202	 -1.303928	 -1.732573
 -0.534262	 -1.286327	 -1.723276
 -0.531534	 -1.267800	 -1.716255
 -0.528155	 -1.248716	 -1.711315
 -0.524776	 -1.229632	 -1.706376
 -0.521397	 -1.210549	 -1.701436
 -0.516725	 -1.191414	 -1.697970
 -0.510950	 -1.172386	 -1.695829
 -0.505176	 -1.153357	 -1.693688
 -0.499402	 -1.134329	 -1.691547
 -0.490308	 -1.116563	 -1.690253
 -0.480386	 -1.099230	 -1.689191
 -0.470464	 -1.081898	 -1.688129
 -0.459176	 -1.065432	 -1.686917
 -0.445227	 -1.051178	 -1.685413
 -0.431278	 -1.036925	 -1.683909
 -0.416246	 -1.023924	 -1.681668
 -0.399658	 -1.013297	 -1.678218
 -0.383071	 -1.002669	 -1.674768
 -0.365553	 -0.994752	 -1.669249
 -0.347884	 -0.987579	 -1.663220
 -0.330193	 -0.980628	 -1.656997
 -0.312567	 -0.976575	 -1.648459
 -0.294941	 -0.972522	 -1.639921
 -0.277315	 -0.968470	 -1.631384
 -0.260498	 -0.966114	 -1.620818
 -0.243867	 -0.964080	 -1.609897
 -0.227236	 -0.962046	 -1.598976
 -0.210685	 -0.960062	 -1.587924
 -0.195848	 -0.959041	 -1.574551
 -0.181011	 -0.958020	 -1.561179
 -0.166174	 -0.956999	 -1.547806
 -0.151337	 -0.955978	 -1.534434
 -0.137388	 -0.954917	 -1.520141
 -0.124498	 -0.953817	 -1.504889
 -0.111607	 -0.952716	 -1.489637
 -0.098717	 -0.951616	 -1.474385
 -0.085826	 -0.950516	 -1.459133
 -0.073167	 -0.949229	 -1.443702
 -0.062415	 -0.946525	 -1.427056
 -0.051663	 -0.943821	 -1.410411
 -0.040911	 -0.941118	 -1.393765
 -0.030159	 -0.938414	 -1.377119
 -0.019407	 -0.935710	 -1.360473
 -0.011960	 -0.933307	 -1.342067
 -0.004865	 -0.930940	 -1.323519
  0.002230	 -0.928572	 -1.304970
  0.009326	 -0.926205	 -1.286422
  0.013732	 -0.926252	 -1.266913
  0.016293	 -0.927881	 -1.247145
  0.018854	 -0.929509	 -1.227376
  0.021415	 -0.931137	 -1.207608
  0.022573	 -0.934263	 -1.187888
  0.021932	 -0.939243	 -1.168528
  0.021292	 -0.944223	 -1.149169
  0.020652	 -0.949203	 -1.129809
  0.018354	 -0.954597	 -1.110688
  0.013956	 -0.960464	 -1.092080
  0.009557	 -0.966330	 -1.073473
  0.003872	 -0.971982	 -1.055150
 -0.004361	 -0.977115	 -1.037661
 -0.012593	 -0.982249	 -1.020172
 -0.023280	 -0.986288	 -1.003756
 -0.034211	 -0.990207	 -0.987472
 -0.045680	 -0.992648	 -0.971270
 -0.057363	 -0.994432	 -0.955136
 -0.069000	 -0.994087	 -0.938873
 -0.080564	 -0.992695	 -0.922615
 -0.091552	 -0.988255	 -0.906504
 -0.102431	 -0.983368	 -0.890449
 -0.112561	 -0.975613	 -0.875046
 -0.122581	 -0.967515	 -0.859749
 -0.132202	 -0.958088	 -0.844965
 -0.141397	 -0.947452	 -0.830741
 -0.150591	 -0.936816	 -0.816516
 -0.159184	 -0.925234	 -0.802658
 -0.167490	 -0.913234	 -0.788984
 -0.175797	 -0.901233	 -0.775310
 -0.183555	 -0.888956	 -0.761559
 -0.190947	 -0.876504	 -0.747764
 -0.198340	 -0.864051	 -0.733970
 -0.205155	 -0.852030	 -0.719512
 -0.211693	 -0.840220	 -0.704754
 -0.218231	 -0.828411	 -0.689996
 -0.223836	 -0.817875	 -0.673947
 -0.229429	 -0.807357	 -0.657882
 -0.234656	 -0.797386	 -0.641351
 -0.239378	 -0.788176	 -0.624237
 -0.244100	 -0.778965	 -0.607124
 -0.248329	 -0.770700	 -0.589409
 -0.252548	 -0.762454	 -0.571684
 -0.256608	 -0.754558	 -0.553763
 -0.260517	 -0.746994	 -0.535665
 -0.264426	 -0.739430	 -0.517568
 -0.267938	 -0.732324	 -0.499206
 -0.271425	 -0.725247	 -0.480828
 -0.274749	 -0.718276	 -0.462379
 -0.277407	 -0.711744	 -0.443664
 -0.280065	 -0.705212	 -0.424948
 -0.282457	 -0.698887	 -0.406126
 -0.284125	 -0.693135	 -0.387044
 -0.285794	 -0.687383	 -0.367962
 -0.287238	 -0.681931	 -0.348774
 -0.288225	 -0.677098	 -0.329391
 -0.289212	 -0.672266	 -0.310009
 -0.290063	 -0.667983	 -0.290492
 -0.290747	 -0.664378	 -0.270831
 -0.291431	 -0.660774	 -0.251170
 -0.292036	 -0.657978	 -0.231376
 -0.292556	 -0.656064	 -0.211475
 -0.293077	 -0.654151	 -0.191573
 -0.293637	 -0.653031	 -0.171612
 -0.294245	 -0.652890	 -0.151622
 -0.294854	 -0.652749	 -0.131632
 -0.295675	 -0.653405	 -0.111659
 -0.296709	 -0.654864	 -0.091740
 -0.297742	 -0.656323	 -0.071820
 -0.299295	 -0.658532	 -0.052003
 -0.301146	 -0.661170	 -0.032264
 -0.302997	 -0.663808	 -0.012525
 -0.305620	 -0.667010	  0.007042
 -0.308455	 -0.670366	  0.026553
 -0.311290	 -0.673722	  0.046065
 -0.314803	 -0.677304	  0.065425
 -0.318486	 -0.680942	  0.084744
 -0.322169	 -0.684580	  0.104062
 -0.326342	 -0.688288	  0.123267
 -0.330721	 -0.692025	  0.142421
 -0.335100	 -0.695762	  0.161574
 -0.339586	 -0.699517	  0.180699
 -0.344150	 -0.703287	  0.199803
 -0.348715	 -0.707056	  0.218907
 -0.353126	 -0.710697	  0.238072
 -0.357425	 -0.714243	  0.257280
 -0.361724	 -0.717789	  0.276488
 -0.365505	 -0.720921	  0.295876
 -0.369208	 -0.723990	  0.315289
 -0.372544	 -0.726800	  0.334807
 -0.375315	 -0.729208	  0.354468
 -0.378077	 -0.731609	  0.374130
 -0.379876	 -0.733279	  0.393979
 -0.381676	 -0.734950	  0.413827
 -0.382963	 -0.736144	  0.433750
 -0.383969	 -0.737076	  0.453703
 -0.384832	 -0.737819	  0.473671
 -0.385298	 -0.738034	  0.493664
 -0.385764	 -0.738249	  0.513657
 -0.385836	 -0.737906	  0.533654
 -0.385831	 -0.737454	  0.553649
 -0.385685	 -0.736788	  0.573638
 -0.385280	 -0.735730	  0.593606
 -0.384874	 -0.734672	  0.613573
 -0.384266	 -0.733153	  0.633506
 -0.383627	 -0.731560	  0.653433
 -0.382940	 -0.729791	  0.673342
 -0.382183	 -0.727759	  0.693224
 -0.381426	 -0.725728	  0.713107
 -0.380512	 -0.723385	  0.732948
 -0.379588	 -0.721023	  0.752786
 -0.378555	 -0.718604	  0.772613
 -0.377371	 -0.716108	  0.792421
 -0.376188	 -0.713611	  0.812229
 -0.374794	 -0.710894	  0.831995
 -0.373370	 -0.708146	  0.851754
 -0.371891	 -0.705275	  0.871491
 -0.370321	 -0.702207	  0.891192
 -0.368752	 -0.699139	  0.910893
 -0.366991	 -0.695801	  0.930534
 -0.365211	 -0.692435	  0.950168
 -0.363382	 -0.688986	  0.969783
 -0.361480	 -0.685415	  0.989370
 -0.359579	 -0.681844	  1.008956
 -0.357588	 -0.678215	  1.028523
 -0.355586	 -0.674580	  1.048088
 -0.353506	 -0.670967	  1.067649
 -0.351257	 -0.667403	  1.087200
 -0.349009	 -0.663838	  1.106751
 -0.346628	 -0.660504	  1.126326
 -0.344181	 -0.657285	  1.145913
 -0.341733	 -0.654069	  1.165501
 -0.339375	 -0.651624	  1.185210
 -0.337017	 -0.649179	  1.204920
 -0.334730	 -0.647116	  1.224681
 -0.332572	 -0.645735	  1.244516
 -0.330414	 -0.644355	  1.264351
 -0.328505	 -0.643792	  1.284252
 -0.326689	 -0.643530	  1.304168
 -0.324942	 -0.643439	  1.324091
 -0.323528	 -0.644144	  1.344029
 -0.322113	 -0.644850	  1.363966
 -0.320882	 -0.646162	  1.383885
 -0.319751	 -0.647803	  1.403785
 -0.318620	 -0.649444	  1.423686
 -0.317727	 -0.652277	  1.443464
 -0.316843	 -0.655157	  1.463236
 -0.316021	 -0.658184	  1.482988
 -0.315698	 -0.662380	  1.502541
 -0.315375	 -0.666577	  1.522093
 -0.315051	 -0.670773	  1.541645
 -0.314911	 -0.676235	  1.560884
 -0.314777	 -0.681743	  1.580110
 -0.314644	 -0.687251	  1.599336
 -0.314639	 -0.693299	  1.618400
 -0.314780	 -0.699949	  1.637261
 -0.314921	 -0.706599	  1.656123
 -0.315062	 -0.713248	  1.674985
 -0.315783	 -0.720597	  1.693572
 -0.316527	 -0.727972	  1.712147
 -0.317270	 -0.735347	  1.730723
 -0.318450	 -0.743102	  1.749121
 -0.319920	 -0.751106	  1.767390
 -0.321390	 -0.759110	  1.785660
 -0.323234	 -0.767373	  1.803779
 -0.325574	 -0.775971	  1.821685
 -0.327913	 -0.784569	  1.839590
 -0.330391	 -0.793307	  1.857409
 -0.333076	 -0.802251	  1.875095
 -0.335761	 -0.811195	  1.892781
 -0.338482	 -0.819746	  1.910654
 -0.341222	 -0.828084	  1.928626
 -0.343975	 -0.835944	  1.946810
 -0.346749	 -0.842715	  1.965423
 -0.349408	 -0.849158	  1.984169
 -0.351378	 -0.853669	  2.003554
 -0.353101	 -0.857434	  2.023121
 -0.353665	 -0.857726	  2.043111
 -0.353232	 -0.854609	  2.062861
 -0.352044	 -0.848969	  2.082013
 -0.349725	 -0.839721	  2.099594
 -0.347241	 -0.829512	  2.116612
 -0.344485	 -0.817683	  2.132502
 -0.342053	 -0.805056	  2.147820
 -0.339920	 -0.791736	  2.162585
 -0.338980	 -0.777759	  2.176860
 -0.338465	 -0.763571	  2.190946
 -0.339646	 -0.748736	  2.204307
 -0.340827	 -0.733900	  2.217669
 -0.343103	 -0.718894	  2.230693
 -0.345479	 -0.703875	  2.243684
 -0.347855	 -0.688855	  2.256675
 -0.350231	 -0.673836	  2.269667
 -0.352606	 -0.658817	  2.282658
 -0.355494	 -0.640020	  2.298868
 -0.357640	 -0.624912	  2.311796
