 -0.789261	  1.254440	  2.002432
 -0.797423	  1.263628	  2.004336
 -0.784300	  1.248850	  2.001269
 -0.771317	  1.234016	  1.997895
 -0.758882	  1.219009	  1.993413
 -0.746526	  1.203951	  1.988877
 -0.733992	  1.189006	  1.984428
 -0.721337	  1.174135	  1.980077
 -0.708437	  1.159476	  1.975771
 -0.695701	  1.144914	  1.971067
 -0.684330	  1.129230	  1.965833
 -0.673117	  1.112982	  1.961112
 -0.660548	  1.097463	  1.957024
 -0.646489	  1.083450	  1.953143
 -0.632790	  1.070894	  1.947593
 -0.620561	  1.057237	  1.937649
 -0.606870	  1.043398	  1.929521
 -0.592880	  1.029973	  1.926783
 -0.578810	  1.015155	  1.924273
 -0.563891	  1.001384	  1.920788
 -0.548786	  0.989156	  1.918304
 -0.532214	  0.980714	  1.913901
 -0.516189	  0.972191	  1.905417
 -0.499787	  0.957722	  1.891900
 -0.488697	  0.941878	  1.885435
 -0.476264	  0.924661	  1.887926
 -0.462029	  0.910367	  1.891134
 -0.446136	  0.897655	  1.890107
 -0.430184	  0.884799	  1.889269
 -0.415914	  0.875035	  1.887499
 -0.398352	  0.861686	  1.883299
 -0.383349	  0.850941	  1.878847
 -0.370121	  0.840792	  1.872597
 -0.354137	  0.822946	  1.865282
 -0.340572	  0.805402	  1.864795
 -0.330707	  0.792257	  1.863654
 -0.314808	  0.777269	  1.862601
 -0.297496	  0.762608	  1.859503
 -0.284786	  0.752281	  1.858366
 -0.271183	  0.740842	  1.862016
 -0.253591	  0.727532	  1.865452
 -0.238836	  0.715522	  1.866909
 -0.225637	  0.702518	  1.867929
 -0.204492	  0.682681	  1.864594
 -0.191358	  0.673126	  1.863031
 -0.179216	  0.663385	  1.862255
 -0.164024	  0.646869	  1.861422
 -0.150732	  0.632806	  1.859833
 -0.135431	  0.620279	  1.858572
 -0.118618	  0.600913	  1.854884
 -0.112879	  0.590407	  1.851957
 -0.103705	  0.573714	  1.847495
 -0.088732	  0.552959	  1.843019
 -0.078309	  0.534825	  1.840932
 -0.067814	  0.519221	  1.840196
 -0.057747	  0.504649	  1.839566
 -0.045346	  0.490119	  1.836086
 -0.032932	  0.471862	  1.831758
 -0.022933	  0.456436	  1.830200
 -0.009606	  0.431625	  1.828419
 -0.002427	  0.420898	  1.828956
  0.010344	  0.409840	  1.831506
  0.030980	  0.394009	  1.830145
  0.044432	  0.380938	  1.827019
  0.056286	  0.371302	  1.824281
  0.075364	  0.350935	  1.821256
  0.089592	  0.337687	  1.824244
  0.101046	  0.327158	  1.826952
  0.118267	  0.307567	  1.828832
  0.131186	  0.297074	  1.827218
  0.145741	  0.283762	  1.825155
  0.162524	  0.269482	  1.818652
  0.174068	  0.257048	  1.812008
  0.190013	  0.241747	  1.802767
  0.210622	  0.231331	  1.797770
  0.227957	  0.228121	  1.795211
  0.249984	  0.228953	  1.789555
  0.271404	  0.227267	  1.783136
  0.289157	  0.226194	  1.774841
  0.308890	  0.228400	  1.766026
  0.330603	  0.230254	  1.761450
  0.348365	  0.227207	  1.757107
  0.371548	  0.224157	  1.748530
  0.389073	  0.234419	  1.740042
  0.404428	  0.251415	  1.738694
  0.418856	  0.265205	  1.741059
  0.437379	  0.275776	  1.741405
  0.454874	  0.281705	  1.743440
  0.474349	  0.288294	  1.742013
  0.493438	  0.293259	  1.740669
  0.512648	  0.298963	  1.738133
  0.531644	  0.304987	  1.734935
  0.551535	  0.305893	  1.731427
  0.571284	  0.306559	  1.727825
  0.591181	  0.306534	  1.724725
  0.611067	  0.305787	  1.721170
  0.632111	  0.296661	  1.719039
  0.648984	  0.283640	  1.716815
  0.664633	  0.267947	  1.723544
  0.679090	  0.254585	  1.734573
  0.692157	  0.249072	  1.748729
  0.705702	  0.242766	  1.763114
  0.717600	  0.233065	  1.775744
  0.727943	  0.219441	  1.786410
  0.737934	  0.205914	  1.798074
  0.744131	  0.193827	  1.811499
  0.748156	  0.180287	  1.826310
  0.753856	  0.167447	  1.839691
  0.760271	  0.154230	  1.852245
  0.764977	  0.138708	  1.863687
  0.767305	  0.122404	  1.873057
  0.768948	  0.104405	  1.881985
  0.769978	  0.086009	  1.889753
  0.767173	  0.067013	  1.884424
  0.764106	  0.048255	  1.878206
  0.761037	  0.029500	  1.871977
  0.757968	  0.010745	  1.865749
  0.754858	 -0.007931	  1.859392
  0.750329	 -0.022571	  1.846591
  0.745646	 -0.036561	  1.833088
  0.740961	 -0.050542	  1.819576
  0.736277	 -0.064523	  1.806064
  0.731592	 -0.078504	  1.792551
  0.726947	 -0.092519	  1.779068
  0.725439	 -0.109263	  1.768261
  0.726173	 -0.127313	  1.759683
  0.727034	 -0.145282	  1.750969
  0.728045	 -0.163121	  1.742032
  0.730090	 -0.180419	  1.732800
  0.740024	 -0.194285	  1.722942
  0.750435	 -0.207887	  1.712596
  0.761129	 -0.221762	  1.702860
  0.773364	 -0.235445	  1.694804
  0.785512	 -0.249398	  1.687255
  0.798135	 -0.262730	  1.679771
  0.811528	 -0.275261	  1.672293
  0.825271	 -0.287754	  1.664635
  0.838097	 -0.302775	  1.660675
  0.850569	 -0.318118	  1.657560
  0.863061	 -0.333547	  1.655109
  0.875505	 -0.349188	  1.654330
  0.887949	 -0.364825	  1.653597
  0.900530	 -0.380302	  1.655046
  0.913122	 -0.395735	  1.656863
  0.926912	 -0.410183	  1.657820
  0.942357	 -0.422883	  1.657415
  0.957822	 -0.435555	  1.656966
  0.973843	 -0.447340	  1.654879
  0.989996	 -0.458851	  1.652316
  1.005984	 -0.470509	  1.649411
  1.021398	 -0.482591	  1.645406
  1.036745	 -0.494687	  1.641110
  1.052168	 -0.506645	  1.636676
  1.067712	 -0.518551	  1.632477
  1.083256	 -0.530674	  1.628969
  1.098546	 -0.543289	  1.626322
  1.113863	 -0.555806	  1.623218
  1.128961	 -0.568894	  1.620802
  1.143823	 -0.582214	  1.618739
  1.158264	 -0.595941	  1.617785
  1.172587	 -0.609512	  1.615905
  1.187791	 -0.622353	  1.612564
  1.201368	 -0.636591	  1.609625
  1.212589	 -0.651204	  1.603289
  1.225888	 -0.666806	  1.596760
  1.242944	 -0.678271	  1.592345
  1.262741	 -0.692971	  1.595103
  1.275319	 -0.707825	  1.599817
  1.284470	 -0.724903	  1.599026
  1.291604	 -0.742215	  1.592787
  1.300708	 -0.760187	  1.586911
  1.310812	 -0.777452	  1.582853
  1.317992	 -0.794799	  1.578436
  1.325428	 -0.812244	  1.571083
  1.334254	 -0.828455	  1.562913
  1.343976	 -0.843875	  1.554416
  1.353540	 -0.858896	  1.545620
  1.363228	 -0.874266	  1.537199
  1.373160	 -0.889645	  1.528924
  1.384103	 -0.904069	  1.520077
  1.396902	 -0.917202	  1.512338
  1.410631	 -0.929779	  1.504142
  1.426772	 -0.940241	  1.496114
  1.440269	 -0.952432	  1.490386
  1.452899	 -0.963763	  1.483752
  1.470760	 -0.982404	  1.473147
  1.478895	 -0.999298	  1.471384
  1.488968	 -1.016801	  1.474075
  1.504598	 -1.030070	  1.477195
  1.522649	 -1.036848	  1.475989
  1.543738	 -1.045737	  1.470473
  1.558828	 -1.059227	  1.469401
  1.569207	 -1.075230	  1.474169
  1.583864	 -1.090825	  1.478124
  1.600058	 -1.100084	  1.477742
  1.619253	 -1.108604	  1.476197
  1.636581	 -1.121657	  1.475822
  1.648729	 -1.136419	  1.476954
  1.660326	 -1.153276	  1.480119
  1.676406	 -1.164820	  1.482977
