 -1.874964	 -1.293230	  0.737347
 -1.917608	 -1.292375	  0.752114
 -1.960252	 -1.291520	  0.766881
 -1.941532	 -1.292036	  0.759859
 -1.922919	 -1.292684	  0.752761
 -1.904877	 -1.294909	  0.745313
 -1.885914	 -1.298243	  0.737228
 -1.868081	 -1.299554	  0.729457
 -1.851407	 -1.298524	  0.720853
 -1.831894	 -1.299075	  0.711122
 -1.812037	 -1.296114	  0.701219
 -1.795727	 -1.292755	  0.694371
 -1.776291	 -1.291680	  0.688786
 -1.757570	 -1.294648	  0.681907
 -1.738963	 -1.301324	  0.674806
 -1.718094	 -1.308655	  0.671057
 -1.700326	 -1.302043	  0.660343
 -1.686638	 -1.290220	  0.648825
 -1.668880	 -1.284725	  0.635354
 -1.650196	 -1.292643	  0.623584
 -1.633424	 -1.299859	  0.615967
 -1.613883	 -1.294913	  0.609295
 -1.598252	 -1.288441	  0.600402
 -1.580508	 -1.286812	  0.590404
 -1.561318	 -1.284543	  0.582554
 -1.541525	 -1.280985	  0.576683
 -1.524155	 -1.276921	  0.570666
 -1.506304	 -1.265819	  0.560249
 -1.492746	 -1.255927	  0.551683
 -1.476165	 -1.250680	  0.540021
 -1.457831	 -1.248383	  0.531217
 -1.441177	 -1.239599	  0.527983
 -1.422709	 -1.229857	  0.523590
 -1.406345	 -1.222795	  0.513052
 -1.390157	 -1.218989	  0.501311
 -1.373817	 -1.211631	  0.490669
 -1.358628	 -1.202075	  0.483149
 -1.342637	 -1.193413	  0.475630
 -1.326396	 -1.184550	  0.467734
 -1.310029	 -1.175241	  0.459594
 -1.294617	 -1.165397	  0.453673
 -1.278209	 -1.156881	  0.444687
 -1.263175	 -1.148837	  0.435063
 -1.247476	 -1.139688	  0.424824
 -1.231183	 -1.130143	  0.417385
 -1.214271	 -1.123287	  0.409537
 -1.199307	 -1.118230	  0.397365
 -1.184872	 -1.108807	  0.386925
 -1.167490	 -1.100493	  0.380085
 -1.150713	 -1.093764	  0.373287
 -1.134755	 -1.086647	  0.363636
 -1.118248	 -1.076452	  0.357062
 -1.101556	 -1.068196	  0.352826
 -1.083833	 -1.060546	  0.347446
 -1.066602	 -1.052611	  0.340386
 -1.049399	 -1.043871	  0.332406
 -1.032516	 -1.033363	  0.327852
 -1.017035	 -1.020916	  0.326586
 -1.001058	 -1.009030	  0.324121
 -0.987415	 -0.995486	  0.319937
 -0.974490	 -0.979436	  0.318452
 -0.960741	 -0.966543	  0.319090
 -0.937532	 -0.956732	  0.318002
 -0.918559	 -0.950016	  0.314814
 -0.901852	 -0.946312	  0.315829
 -0.884894	 -0.935434	  0.318115
 -0.870578	 -0.918167	  0.321840
 -0.857588	 -0.903392	  0.329569
 -0.839368	 -0.894952	  0.331603
 -0.819449	 -0.886637	  0.332067
 -0.806309	 -0.876122	  0.332088
 -0.788363	 -0.862914	  0.333876
 -0.769768	 -0.856087	  0.332340
 -0.751494	 -0.849388	  0.333851
 -0.731033	 -0.838521	  0.334712
 -0.714261	 -0.831722	  0.334280
 -0.695510	 -0.826998	  0.334305
 -0.675778	 -0.820865	  0.333454
 -0.657389	 -0.815171	  0.333160
 -0.637882	 -0.809819	  0.333524
 -0.617178	 -0.803310	  0.328337
 -0.601008	 -0.800517	  0.323789
 -0.581229	 -0.797197	  0.320418
 -0.557915	 -0.796748	  0.315876
 -0.540043	 -0.793349	  0.312272
 -0.522683	 -0.795667	  0.306091
 -0.501394	 -0.799862	  0.300436
 -0.484536	 -0.800989	  0.294381
 -0.466755	 -0.800779	  0.287287
 -0.442768	 -0.802317	  0.280070
 -0.425892	 -0.806213	  0.273959
 -0.407549	 -0.812188	  0.269093
 -0.391041	 -0.820078	  0.258142
 -0.378665	 -0.825587	  0.247089
 -0.358846	 -0.834883	  0.236429
 -0.342898	 -0.846439	  0.228976
 -0.329676	 -0.849000	  0.222056
 -0.314803	 -0.857148	  0.209298
 -0.296607	 -0.869957	  0.199413
 -0.282028	 -0.877296	  0.194495
 -0.267301	 -0.885329	  0.182592
 -0.254811	 -0.894832	  0.168362
 -0.240095	 -0.902095	  0.157883
 -0.222465	 -0.907449	  0.146822
 -0.207466	 -0.913992	  0.134114
 -0.191348	 -0.916839	  0.125228
 -0.173271	 -0.920752	  0.115746
 -0.155364	 -0.923271	  0.102729
 -0.142131	 -0.928582	  0.092983
 -0.125518	 -0.936292	  0.082347
 -0.108028	 -0.941804	  0.071465
 -0.092377	 -0.943975	  0.062595
 -0.075960	 -0.941198	  0.048639
 -0.058699	 -0.939959	  0.034457
 -0.043846	 -0.944342	  0.023019
 -0.024125	 -0.947135	  0.015579
 -0.004766	 -0.944781	  0.006174
  0.003992	 -0.945475	 -0.009541
  0.021221	 -0.948894	 -0.021935
  0.042469	 -0.948191	 -0.028969
  0.057052	 -0.952749	 -0.040567
  0.071881	 -0.958747	 -0.053505
  0.089322	 -0.957413	 -0.066293
  0.106770	 -0.955252	 -0.077901
  0.119570	 -0.952154	 -0.086756
  0.137921	 -0.950169	 -0.098945
  0.155029	 -0.948928	 -0.109933
  0.172529	 -0.945826	 -0.119339
  0.189963	 -0.942364	 -0.128504
  0.206553	 -0.935862	 -0.137571
  0.217858	 -0.927627	 -0.151859
  0.226919	 -0.919078	 -0.167505
  0.235957	 -0.910561	 -0.183184
  0.243523	 -0.903337	 -0.200234
  0.250877	 -0.896318	 -0.217459
  0.258287	 -0.889763	 -0.234841
  0.265845	 -0.884637	 -0.252636
  0.273402	 -0.879521	 -0.270433
  0.280955	 -0.874434	 -0.288241
  0.289362	 -0.870930	 -0.306048
  0.297919	 -0.867770	 -0.323848
  0.306479	 -0.864604	 -0.341643
  0.314820	 -0.861428	 -0.359388
  0.322382	 -0.859244	 -0.377472
  0.329595	 -0.856397	 -0.397138
  0.338887	 -0.853965	 -0.415315
  0.349432	 -0.852932	 -0.431001
  0.360103	 -0.852227	 -0.448279
  0.370241	 -0.850818	 -0.466232
  0.381004	 -0.850112	 -0.482588
  0.392053	 -0.849244	 -0.498943
  0.403564	 -0.845494	 -0.515563
  0.418395	 -0.844747	 -0.530509
  0.430522	 -0.844859	 -0.545977
  0.440344	 -0.846195	 -0.563614
  0.451286	 -0.844986	 -0.579962
  0.467317	 -0.846333	 -0.592013
  0.485356	 -0.851805	 -0.605782
  0.496070	 -0.856352	 -0.621740
  0.505439	 -0.858587	 -0.640268
  0.519269	 -0.855687	 -0.653266
  0.536671	 -0.850649	 -0.663580
  0.553618	 -0.846500	 -0.681306
  0.566346	 -0.849646	 -0.697967
  0.579556	 -0.852381	 -0.704776
  0.596360	 -0.854278	 -0.719111
  0.612679	 -0.854198	 -0.731619
  0.629400	 -0.848949	 -0.741663
  0.648451	 -0.844452	 -0.751655
  0.667609	 -0.846286	 -0.760729
  0.686283	 -0.846592	 -0.767255
  0.701763	 -0.843300	 -0.774732
  0.720936	 -0.841131	 -0.783710
  0.739365	 -0.840372	 -0.792387
  0.757903	 -0.840589	 -0.799889
  0.776547	 -0.840997	 -0.807118
  0.795194	 -0.841409	 -0.814340
  0.814144	 -0.842940	 -0.820552
  0.833161	 -0.844837	 -0.826447
  0.852181	 -0.846734	 -0.832334
  0.871285	 -0.849799	 -0.837402
  0.890392	 -0.853594	 -0.841934
  0.909498	 -0.857399	 -0.846464
  0.928005	 -0.861599	 -0.850698
  0.947149	 -0.866999	 -0.854978
  0.965014	 -0.872104	 -0.860031
  0.986420	 -0.880538	 -0.865688
  1.001836	 -0.885922	 -0.866300
  1.020881	 -0.893501	 -0.871166
  1.038959	 -0.901556	 -0.875442
  1.056512	 -0.909907	 -0.876577
  1.075723	 -0.919329	 -0.879619
  1.091636	 -0.927142	 -0.886688
  1.107252	 -0.936029	 -0.894046
  1.126344	 -0.946626	 -0.898446
  1.142165	 -0.955713	 -0.897633
  1.163168	 -0.963668	 -0.904994
  1.180529	 -0.969886	 -0.915614
  1.193102	 -0.979269	 -0.920542
  1.210472	 -0.989451	 -0.925075
  1.228330	 -0.997905	 -0.931169
  1.245075	 -1.006108	 -0.937218
  1.262293	 -1.014833	 -0.943959
  1.280977	 -1.018578	 -0.952731
  1.298051	 -1.024565	 -0.957825
  1.316804	 -1.029881	 -0.964290
  1.335279	 -1.033675	 -0.970728
  1.354718	 -1.034787	 -0.973781
  1.376158	 -1.033893	 -0.977661
  1.393437	 -1.035471	 -0.984780
  1.410838	 -1.037764	 -0.992065
  1.431581	 -1.037935	 -0.998483
  1.451424	 -1.036868	 -1.004561
  1.471533	 -1.035221	 -1.002442
  1.490582	 -1.033175	 -1.002243
  1.511556	 -1.030405	 -1.004642
  1.531313	 -1.027714	 -1.003962
  1.549998	 -1.023925	 -1.001249
  1.570577	 -1.019257	 -1.001460
  1.590430	 -1.015388	 -0.999542
  1.607362	 -1.009725	 -0.993715
  1.627582	 -1.002711	 -0.990889
  1.647798	 -0.998002	 -0.986606
  1.661840	 -0.990960	 -0.978951
  1.678453	 -0.981513	 -0.968967
  1.696802	 -0.975008	 -0.959217
  1.712800	 -0.967793	 -0.954715
  1.728434	 -0.957923	 -0.949715
  1.744292	 -0.945840	 -0.942512
  1.759329	 -0.934744	 -0.934895
  1.774280	 -0.923855	 -0.927289
  1.789285	 -0.911855	 -0.921736
  1.804249	 -0.900175	 -0.916119
  1.819186	 -0.889539	 -0.909407
  1.835572	 -0.877090	 -0.905873
  1.851689	 -0.861520	 -0.904689
  1.865119	 -0.846741	 -0.909493
  1.880576	 -0.838093	 -0.910491
  1.899163	 -0.829139	 -0.913259
  1.916932	 -0.818942	 -0.917837
  1.931827	 -0.807456	 -0.919051
  1.948813	 -0.796251	 -0.921261
  1.968466	 -0.786186	 -0.927522
  1.984161	 -0.780802	 -0.935245
  2.001102	 -0.775159	 -0.945699
  2.015996	 -0.767386	 -0.954858
  2.033679	 -0.762312	 -0.963613
  2.051786	 -0.760340	 -0.973924
  2.067507	 -0.752887	 -0.982868
  2.084540	 -0.747530	 -0.990750
  2.103279	 -0.745354	 -1.001038
  2.119112	 -0.741000	 -1.011978
  2.135945	 -0.737057	 -1.019724
  2.152963	 -0.733859	 -1.031401
  2.169956	 -0.731294	 -1.041631
  2.186949	 -0.728729	 -1.051861
