  0.894987	  1.851583	  2.225205
  0.886125	  1.833251	  2.203174
  0.853170	  1.832036	  2.169596
  0.820859	  1.832821	  2.135161
  0.785934	  1.826368	  2.100519
  0.752323	  1.829309	  2.062600
  0.721260	  1.824452	  2.024613
  0.690156	  1.818391	  1.987115
  0.657832	  1.819737	  1.949526
  0.624060	  1.822147	  1.912218
  0.588883	  1.825550	  1.876211
  0.551483	  1.830939	  1.842967
  0.512766	  1.837032	  1.811153
  0.474058	  1.842120	  1.779711
  0.435444	  1.845644	  1.746934
  0.398577	  1.846440	  1.713490
  0.362721	  1.844007	  1.678750
  0.330127	  1.835347	  1.641702
  0.300924	  1.825911	  1.600823
  0.271456	  1.817462	  1.561022
  0.238663	  1.808957	  1.523815
  0.203320	  1.799345	  1.488512
  0.165774	  1.788102	  1.455927
  0.126793	  1.777138	  1.425021
  0.088522	  1.768695	  1.395042
  0.052390	  1.765906	  1.364570
  0.016293	  1.769170	  1.332925
 -0.021479	  1.777365	  1.299484
 -0.059002	  1.786958	  1.265517
 -0.094430	  1.794659	  1.230659
 -0.127940	  1.801097	  1.197291
 -0.159551	  1.808619	  1.168645
 -0.187777	  1.817833	  1.146662
 -0.215444	  1.830951	  1.129818
 -0.270217	  1.861095	  1.108781
 -0.382963	  1.914455	  1.097534
 -0.498346	  1.973971	  1.098673
 -0.574157	  2.027902	  1.096084
 -0.638034	  2.078884	  1.086540
 -0.700786	  2.110639	  1.059119
 -0.768401	  2.098562	  1.048313
 -0.791841	  2.117041	  1.010328
 -0.807931	  2.084163	  0.963281
 -0.818727	  2.025232	  0.918598
 -0.797270	  1.958200	  0.866981
 -0.749315	  1.874879	  0.783110
 -0.740314	  1.796582	  0.685001
 -0.763575	  1.762045	  0.609655
 -0.785196	  1.750488	  0.564564
 -0.808277	  1.746367	  0.524996
 -0.833180	  1.747073	  0.485438
 -0.857531	  1.751921	  0.447590
 -0.880225	  1.760556	  0.414343
 -0.905443	  1.774449	  0.382037
 -0.948643	  1.800993	  0.338255
 -1.032877	  1.844416	  0.292429
 -1.129413	  1.875335	  0.302746
 -1.194350	  1.887805	  0.318634
 -1.228229	  1.946903	  0.312604
 -1.288695	  1.957329	  0.325778
 -1.354497	  1.960046	  0.333893
 -1.384484	  1.984584	  0.277352
 -1.403523	  1.974318	  0.206410
 -1.433416	  1.963835	  0.158479
 -1.456515	  1.948810	  0.120229
 -1.469716	  1.926700	  0.078940
 -1.476341	  1.887701	  0.028580
 -1.482297	  1.835779	 -0.022593
 -1.485983	  1.783285	 -0.071282
 -1.491233	  1.719079	 -0.129082
 -1.508323	  1.648072	 -0.198458
 -1.545676	  1.615130	 -0.254914
 -1.585060	  1.611734	 -0.295523
 -1.619578	  1.610011	 -0.332880
 -1.649269	  1.608256	 -0.371361
 -1.676575	  1.608446	 -0.410359
 -1.704839	  1.609403	 -0.451992
 -1.734962	  1.603462	 -0.492786
 -1.768592	  1.598492	 -0.530034
 -1.804015	  1.595808	 -0.565263
 -1.840032	  1.593913	 -0.601639
 -1.874298	  1.592618	 -0.638064
 -1.907366	  1.591298	 -0.674476
 -1.940831	  1.589627	 -0.712282
 -1.973193	  1.587462	 -0.749783
 -2.004829	  1.584685	 -0.787127
 -2.037211	  1.580624	 -0.825366
 -2.069229	  1.575304	 -0.862113
 -2.101631	  1.569485	 -0.898121
 -2.134605	  1.563656	 -0.933800
 -2.167978	  1.558184	 -0.968907
 -2.202217	  1.553366	 -1.003582
 -2.239074	  1.549466	 -1.038993
 -2.280239	  1.547405	 -1.071212
 -2.320254	  1.544653	 -1.109263
 -2.343457	  1.560100	 -1.120356
