  0.239786	 -2.737804	 -1.275866
  0.237412	 -2.710697	 -1.263234
  0.267088	 -2.673413	 -1.236027
  0.290022	 -2.633173	 -1.210537
  0.313950	 -2.595251	 -1.190128
  0.340117	 -2.557758	 -1.172339
  0.365284	 -2.520796	 -1.151550
  0.392061	 -2.483500	 -1.130448
  0.418921	 -2.445125	 -1.111094
  0.444076	 -2.406624	 -1.092057
  0.468845	 -2.368634	 -1.072745
  0.493990	 -2.328993	 -1.052609
  0.518103	 -2.286967	 -1.032192
  0.540918	 -2.246611	 -1.012335
  0.563039	 -2.208991	 -0.993380
  0.586726	 -2.170250	 -0.973512
  0.611005	 -2.131432	 -0.953138
  0.635116	 -2.093977	 -0.932556
  0.659260	 -2.056762	 -0.911093
  0.683051	 -2.020049	 -0.888886
  0.707262	 -1.982146	 -0.865344
  0.731170	 -1.943488	 -0.841024
  0.754251	 -1.905934	 -0.817180
  0.777105	 -1.870033	 -0.795007
  0.801021	 -1.834488	 -0.773974
  0.825752	 -1.797631	 -0.752768
  0.850917	 -1.760112	 -0.731407
  0.875045	 -1.723975	 -0.711046
  0.899001	 -1.686042	 -0.689133
  0.928350	 -1.649908	 -0.671250
  0.954785	 -1.610251	 -0.652977
  0.978116	 -1.569234	 -0.633520
  1.001219	 -1.530497	 -0.612170
  1.026035	 -1.494678	 -0.592762
  1.051381	 -1.457627	 -0.572686
  1.076257	 -1.419152	 -0.549880
  1.100224	 -1.381026	 -0.527076
  1.123630	 -1.343313	 -0.505103
  1.148421	 -1.306336	 -0.486292
  1.178707	 -1.272841	 -0.477395
  1.217862	 -1.244234	 -0.484964
  1.299529	 -1.197586	 -0.523757
  1.419646	 -1.135415	 -0.589137
  1.477109	 -1.114569	 -0.608154
  1.502147	 -1.112886	 -0.603383
  1.523478	 -1.117824	 -0.577828
  1.536394	 -1.130373	 -0.509301
  1.535852	 -1.128307	 -0.397157
  1.566060	 -1.075252	 -0.254913
  1.654067	 -0.987660	 -0.144608
  1.715782	 -0.925288	 -0.090484
  1.757855	 -0.844564	 -0.048611
  1.781094	 -0.755361	 -0.017223
  1.781162	 -0.679654	 -0.004659
  1.772854	 -0.667204	 -0.006934
  1.759692	 -0.668686	 -0.006512
  1.743432	 -0.646570	 -0.008984
  1.686197	 -0.624362	 -0.000734
  1.575175	 -0.546183	  0.001462
  1.522488	 -0.453058	 -0.018898
  1.563054	 -0.353196	 -0.080736
  1.658867	 -0.292412	 -0.180363
  1.731783	 -0.262532	 -0.219293
  1.764065	 -0.243684	 -0.228322
  1.815295	 -0.189699	 -0.228322
  1.860830	 -0.096766	 -0.199322
  1.871010	 -0.050753	 -0.192766
  1.883082	  0.019421	 -0.190477
  1.891282	  0.025493	 -0.183947
  1.920682	  0.031646	 -0.151184
  1.955316	  0.027347	 -0.100067
  1.975354	  0.032298	 -0.056956
  1.995632	  0.052184	  0.006891
  2.016222	  0.081267	  0.085092
  2.036473	  0.106049	  0.146249
  2.065492	  0.140482	  0.218330
  2.089678	  0.169725	  0.268699
  2.109669	  0.195062	  0.304052
  2.129164	  0.221769	  0.333390
  2.149840	  0.253257	  0.359585
  2.171630	  0.288461	  0.383060
  2.195213	  0.327344	  0.406295
  2.218668	  0.364989	  0.428874
  2.243145	  0.401805	  0.451183
  2.269145	  0.439343	  0.473458
  2.295313	  0.477497	  0.494698
  2.321167	  0.517558	  0.516162
  2.344757	  0.557451	  0.537015
  2.366247	  0.596431	  0.557149
  2.387197	  0.636036	  0.577713
  2.409005	  0.676510	  0.598637
  2.431798	  0.716633	  0.619892
  2.454855	  0.754110	  0.640795
  2.479283	  0.790421	  0.662135
  2.503972	  0.826236	  0.683600
  2.528973	  0.862799	  0.705633
  2.555869	  0.900968	  0.728771
  2.583794	  0.937643	  0.748974
  2.611406	  0.974291	  0.769359
  2.632756	  1.012420	  0.791045
  2.658370	  1.045867	  0.810249
  2.672395	  1.085664	  0.824402
  2.699119	  1.096520	  0.832646
