  2.004637	  1.230909	 -0.610888
  2.017507	  1.240442	 -0.601844
  2.004640	  1.228532	 -0.609496
  1.988248	  1.222912	 -0.619919
  1.966719	  1.217046	 -0.627098
  1.950788	  1.206668	 -0.631725
  1.937670	  1.191062	 -0.640725
  1.925616	  1.178071	 -0.650496
  1.915219	  1.168660	 -0.662692
  1.903655	  1.159375	 -0.676203
  1.888233	  1.143381	 -0.686879
  1.870644	  1.128525	 -0.692459
  1.860455	  1.123750	 -0.696248
  1.843063	  1.118523	 -0.710362
  1.827139	  1.113513	 -0.724995
  1.810946	  1.105670	 -0.735072
  1.794159	  1.099411	 -0.742464
  1.776398	  1.095862	 -0.751335
  1.760006	  1.092601	 -0.762636
  1.746004	  1.088358	 -0.776567
  1.731339	  1.082139	 -0.789753
  1.715887	  1.074424	 -0.799990
  1.697946	  1.067666	 -0.808002
  1.680275	  1.063248	 -0.815248
  1.661411	  1.057816	 -0.823918
  1.647259	  1.054403	 -0.835596
  1.630946	  1.049641	 -0.847975
  1.617391	  1.045363	 -0.862121
  1.603425	  1.040357	 -0.875765
  1.589032	  1.035470	 -0.888930
  1.573993	  1.030146	 -0.901080
  1.559064	  1.024646	 -0.912706
  1.544326	  1.017909	 -0.923315
  1.529851	  1.006691	 -0.933488
  1.513714	  0.994749	 -0.946447
  1.499143	  0.990692	 -0.960887
  1.488719	  0.991060	 -0.971204
  1.472768	  0.983451	 -0.983791
  1.456261	  0.975276	 -0.997206
  1.441985	  0.972934	 -1.010559
  1.427615	  0.972328	 -1.024248
  1.413059	  0.969965	 -1.037734
  1.398378	  0.965049	 -1.050767
  1.384263	  0.960037	 -1.064023
  1.370190	  0.955018	 -1.077318
  1.356135	  0.950000	 -1.090630
  1.343984	  0.945233	 -1.105782
  1.332044	  0.940497	 -1.121112
  1.319560	  0.935621	 -1.135955
  1.305933	  0.930504	 -1.149663
  1.290509	  0.928569	 -1.162240
  1.274825	  0.927156	 -1.174564
  1.259057	  0.922402	 -1.185905
  1.243677	  0.915970	 -1.196742
  1.230225	  0.907816	 -1.208715
  1.216495	  0.899303	 -1.222329
  1.204753	  0.891078	 -1.237016
  1.188729	  0.882725	 -1.246543
  1.174642	  0.872351	 -1.254883
  1.157013	  0.868262	 -1.268254
  1.141623	  0.866439	 -1.281868
  1.125582	  0.865325	 -1.292015
  1.111382	  0.861386	 -1.301858
  1.097248	  0.857446	 -1.316360
  1.082866	  0.856040	 -1.330149
  1.068996	  0.855661	 -1.344722
  1.058170	  0.854559	 -1.361615
  1.053304	  0.853890	 -1.380877
  1.050413	  0.852503	 -1.400531
  1.048124	  0.851209	 -1.420655
  1.050547	  0.851032	 -1.439352
  1.050789	  0.852473	 -1.458619
  1.054738	  0.853553	 -1.477938
  1.056157	  0.855260	 -1.498083
  1.056702	  0.857344	 -1.517056
  1.056889	  0.859222	 -1.534780
  1.057557	  0.859243	 -1.556787
  1.063635	  0.857811	 -1.577829
  1.069811	  0.861589	 -1.594847
  1.073039	  0.868604	 -1.613036
  1.076935	  0.873557	 -1.633062
  1.080280	  0.874346	 -1.652861
  1.082172	  0.874776	 -1.672215
  1.082429	  0.873514	 -1.693221
  1.085571	  0.868627	 -1.713521
  1.093518	  0.864882	 -1.732251
  1.097095	  0.865213	 -1.750132
  1.098328	  0.867327	 -1.770093
  1.097505	  0.865503	 -1.790272
  1.098138	  0.861214	 -1.809823
  1.096207	  0.855100	 -1.829152
  1.093055	  0.851163	 -1.848231
  1.088359	  0.846996	 -1.867251
  1.087328	  0.840114	 -1.886054
  1.085535	  0.831711	 -1.904919
  1.079660	  0.824968	 -1.922299
  1.075305	  0.818924	 -1.940368
  1.073813	  0.807105	 -1.958657
  1.069413	  0.793776	 -1.974525
  1.059717	  0.787462	 -1.988625
  1.045467	  0.782548	 -2.004523
  1.033403	  0.774040	 -2.021183
  1.027097	  0.767911	 -2.035945
  1.016947	  0.760764	 -2.049509
  1.001514	  0.752048	 -2.058881
  0.987639	  0.745145	 -2.068338
  0.968486	  0.735705	 -2.072890
  0.953312	  0.727043	 -2.078070
  0.937315	  0.720678	 -2.085665
  0.915762	  0.712602	 -2.093911
  0.898616	  0.704592	 -2.095153
  0.881013	  0.700706	 -2.096599
  0.862112	  0.696921	 -2.104044
  0.844716	  0.692651	 -2.110148
  0.826928	  0.689797	 -2.115045
  0.809734	  0.683728	 -2.131657
  0.796754	  0.678051	 -2.146404
  0.788609	  0.679768	 -2.157133
  0.779262	  0.684632	 -2.176231
  0.770701	  0.685080	 -2.200624
  0.759929	  0.675643	 -2.212667
  0.748916	  0.666483	 -2.229697
  0.743195	  0.665790	 -2.247776
  0.739131	  0.668298	 -2.267819
  0.732969	  0.667570	 -2.287848
  0.725707	  0.664246	 -2.309404
  0.719672	  0.661197	 -2.328227
