 -0.359190	  0.669066	  2.241303
 -0.364605	  0.660520	  2.253809
 -0.357923	  0.674330	  2.239334
 -0.356813	  0.684912	  2.223011
 -0.349495	  0.694668	  2.205615
 -0.343551	  0.705299	  2.189644
 -0.337179	  0.716609	  2.176085
 -0.329424	  0.726906	  2.158768
 -0.322070	  0.734467	  2.143193
 -0.314597	  0.744578	  2.129724
 -0.298829	  0.754411	  2.112075
 -0.287874	  0.759689	  2.096508
 -0.281818	  0.769733	  2.083871
 -0.275563	  0.781176	  2.067287
 -0.268218	  0.790187	  2.048256
 -0.258378	  0.797028	  2.035413
 -0.245164	  0.805864	  2.020751
 -0.238305	  0.815468	  2.003674
 -0.233835	  0.827581	  1.989007
 -0.228761	  0.839221	  1.972011
 -0.220382	  0.844246	  1.953854
 -0.212772	  0.849485	  1.936837
 -0.206188	  0.855603	  1.917086
 -0.199228	  0.866101	  1.901241
 -0.194461	  0.870526	  1.881915
 -0.190646	  0.873116	  1.863259
 -0.184703	  0.880456	  1.844855
 -0.177951	  0.890791	  1.829445
 -0.170833	  0.899267	  1.812432
 -0.165168	  0.905976	  1.793877
 -0.156771	  0.914141	  1.777120
 -0.152138	  0.921978	  1.759138
 -0.147280	  0.928307	  1.742248
 -0.139768	  0.935557	  1.725040
 -0.131951	  0.943255	  1.707991
 -0.121757	  0.952035	  1.693093
 -0.109823	  0.961516	  1.680181
 -0.098390	  0.970141	  1.667453
 -0.084895	  0.979742	  1.654451
 -0.071426	  0.991367	  1.643162
 -0.057192	  1.003431	  1.634159
 -0.042652	  1.011148	  1.627382
 -0.025165	  1.019264	  1.619194
 -0.012353	  1.029876	  1.609296
 -0.000317	  1.041384	  1.593299
  0.012758	  1.050421	  1.580916
  0.029097	  1.055553	  1.573912
  0.047313	  1.063870	  1.565562
  0.060510	  1.076068	  1.554102
  0.072803	  1.081566	  1.540571
  0.090005	  1.087119	  1.532250
  0.109181	  1.094940	  1.522459
  0.119466	  1.102748	  1.507185
  0.125451	  1.114014	  1.490345
  0.134249	  1.122607	  1.476987
  0.146681	  1.129475	  1.462627
  0.157451	  1.137116	  1.445415
  0.163431	  1.147017	  1.428642
  0.165474	  1.156256	  1.411123
  0.167695	  1.161720	  1.393447
  0.166819	  1.166717	  1.373163
  0.165354	  1.174630	  1.353718
  0.165595	  1.180963	  1.336897
  0.162649	  1.186120	  1.316716
  0.160524	  1.192466	  1.297631
  0.161452	  1.199419	  1.279180
  0.160043	  1.206469	  1.259442
  0.154523	  1.211220	  1.241657
  0.152736	  1.214882	  1.222212
  0.154575	  1.217760	  1.201025
  0.153937	  1.224030	  1.182392
  0.151329	  1.232697	  1.164236
  0.150786	  1.237696	  1.144503
  0.152385	  1.241716	  1.125952
  0.152842	  1.249633	  1.106320
  0.152299	  1.254552	  1.086512
  0.155531	  1.258426	  1.068310
  0.159752	  1.263672	  1.048066
  0.160119	  1.268996	  1.027740
  0.159227	  1.277963	  1.009826
  0.161793	  1.287436	  0.994267
  0.166161	  1.297245	  0.976280
  0.168781	  1.306084	  0.958305
  0.170852	  1.314855	  0.940555
  0.174626	  1.324033	  0.924487
  0.178702	  1.334153	  0.907274
  0.184025	  1.346703	  0.888903
  0.185981	  1.357068	  0.873337
  0.190374	  1.366741	  0.859234
  0.196428	  1.379937	  0.841749
  0.200193	  1.392240	  0.825094
  0.203941	  1.403288	  0.815015
  0.207433	  1.420249	  0.799348
  0.209658	  1.434122	  0.783014
  0.217506	  1.442967	  0.770107
  0.222822	  1.457574	  0.756918
  0.228289	  1.473443	  0.743194
  0.236643	  1.487187	  0.733688
  0.245071	  1.502225	  0.723788
  0.253089	  1.517042	  0.708980
  0.261905	  1.528369	  0.695821
  0.267273	  1.541501	  0.681985
  0.268985	  1.558158	  0.669102
  0.278786	  1.572519	  0.660827
  0.294449	  1.586472	  0.653324
  0.300377	  1.602974	  0.643220
  0.314287	  1.617582	  0.630030
  0.325657	  1.628082	  0.621416
  0.332264	  1.643165	  0.613403
  0.339633	  1.658746	  0.601516
  0.350724	  1.670459	  0.588794
  0.359887	  1.685734	  0.577328
  0.370888	  1.698645	  0.568045
  0.382133	  1.712575	  0.558306
  0.395786	  1.723669	  0.549699
  0.409692	  1.737668	  0.541473
  0.423469	  1.752547	  0.537004
  0.435379	  1.769488	  0.534135
  0.443920	  1.784953	  0.526681
  0.452368	  1.799919	  0.516996
  0.461257	  1.815356	  0.506704
  0.469036	  1.831616	  0.497831
  0.481214	  1.850698	  0.495736
  0.493652	  1.865336	  0.494080
  0.505957	  1.880263	  0.488733
  0.516535	  1.894069	  0.481564
  0.527811	  1.910317	  0.474992
  0.538730	  1.926520	  0.469854
  0.549392	  1.942967	  0.465875
  0.559761	  1.959856	  0.463183
  0.570129	  1.976746	  0.460496
  0.580496	  1.993637	  0.457809
  0.590864	  2.010527	  0.455120
  0.600555	  2.027901	  0.453063
  0.608924	  2.046044	  0.452185
  0.617292	  2.064189	  0.451309
  0.625659	  2.082333	  0.450432
  0.633898	  2.099896	  0.450089
  0.641982	  2.118102	  0.451654
  0.649462	  2.136629	  0.453079
  0.643457	  2.134153	  0.422443
  0.654884	  2.157994	  0.428978
  0.655481	  2.162744	  0.410228
  0.654364	  2.164015	  0.390590
  0.652345	  2.161808	  0.368982
  0.647847	  2.159210	  0.349459
  0.642945	  2.159515	  0.330781
  0.638716	  2.162691	  0.310145
  0.638254	  2.164798	  0.289961
  0.639370	  2.166497	  0.271399
  0.640340	  2.166782	  0.249609
  0.637640	  2.165723	  0.228368
  0.633103	  2.166183	  0.210659
  0.631332	  2.167469	  0.191427
  0.629896	  2.168316	  0.170932
  0.630304	  2.171138	  0.151555
  0.631017	  2.173320	  0.129623
  0.627964	  2.173650	  0.111093
  0.622987	  2.173460	  0.091748
  0.621383	  2.174022	  0.070737
  0.621832	  2.176509	  0.051886
  0.626960	  2.181385	  0.030920
  0.623240	  2.181137	  0.011802
  0.619221	  2.182188	 -0.007887
  0.620305	  2.186110	 -0.029655
  0.623012	  2.190251	 -0.046687
  0.623142	  2.193728	 -0.067276
  0.628407	  2.198251	 -0.087751
  0.632386	  2.201831	 -0.108598
  0.635556	  2.207161	 -0.123632
  0.636706	  2.214871	 -0.144654
  0.639607	  2.217709	 -0.167381
  0.650127	  2.223929	 -0.178992
  0.655588	  2.233383	 -0.198333
  0.664519	  2.238733	 -0.217160
  0.674237	  2.243524	 -0.234569
  0.684066	  2.248393	 -0.250372
  0.696207	  2.254073	 -0.265982
  0.703149	  2.260271	 -0.283948
  0.715154	  2.266469	 -0.299235
  0.724914	  2.272543	 -0.315750
  0.736027	  2.278424	 -0.331611
  0.747610	  2.284021	 -0.346262
  0.759088	  2.290088	 -0.361789
  0.770921	  2.295787	 -0.376943
  0.782451	  2.301624	 -0.392507
  0.793381	  2.308295	 -0.407411
  0.803613	  2.314999	 -0.422948
  0.815997	  2.320665	 -0.438590
  0.828356	  2.326868	 -0.454150
  0.839638	  2.332773	 -0.469299
  0.854284	  2.339953	 -0.485878
  0.864975	  2.346895	 -0.501290
