 -1.673970	  1.468346	 -1.159761
 -1.679618	  1.482744	 -1.159211
 -1.672332	  1.464217	 -1.160257
 -1.665723	  1.445593	 -1.163211
 -1.660367	  1.426249	 -1.166831
 -1.655807	  1.406550	 -1.169074
 -1.649912	  1.386938	 -1.167767
 -1.643663	  1.368201	 -1.166225
 -1.636588	  1.349864	 -1.166820
 -1.628179	  1.331887	 -1.169139
 -1.619375	  1.312603	 -1.171117
 -1.613565	  1.293274	 -1.169254
 -1.608239	  1.274148	 -1.163312
 -1.601644	  1.255848	 -1.157187
 -1.593267	  1.238409	 -1.154605
 -1.583567	  1.220191	 -1.154894
 -1.574167	  1.201587	 -1.151628
 -1.570537	  1.183053	 -1.145634
 -1.568185	  1.163644	 -1.142236
 -1.562826	  1.144487	 -1.141694
 -1.552799	  1.124876	 -1.139036
 -1.545378	  1.107482	 -1.131921
 -1.542575	  1.090376	 -1.127437
 -1.538293	  1.068655	 -1.129322
 -1.531263	  1.046867	 -1.131389
 -1.523830	  1.028896	 -1.124143
 -1.518147	  1.015956	 -1.108835
 -1.512385	  0.999412	 -1.094693
 -1.508075	  0.978791	 -1.089554
 -1.503898	  0.961120	 -1.088638
 -1.499344	  0.941613	 -1.083184
 -1.493666	  0.921880	 -1.074079
 -1.485865	  0.905834	 -1.070222
 -1.478208	  0.885305	 -1.072488
 -1.471275	  0.863485	 -1.073283
 -1.460287	  0.848980	 -1.067706
 -1.441304	  0.838494	 -1.056297
 -1.425525	  0.824770	 -1.041315
 -1.421324	  0.810624	 -1.032741
 -1.419545	  0.790410	 -1.025813
 -1.412045	  0.772336	 -1.018076
 -1.398983	  0.759582	 -1.010889
 -1.382082	  0.744234	 -1.005467
 -1.370648	  0.724615	 -1.003851
 -1.364320	  0.708229	 -1.003842
 -1.355394	  0.688122	 -1.004398
 -1.347323	  0.667318	 -1.005606
 -1.343450	  0.648697	 -1.003336
 -1.342344	  0.631622	 -0.997732
 -1.335748	  0.611282	 -0.991821
 -1.330138	  0.591166	 -0.988378
 -1.324173	  0.572075	 -0.987774
 -1.314979	  0.555239	 -0.986345
 -1.305579	  0.537022	 -0.981310
 -1.296662	  0.517138	 -0.978480
 -1.288309	  0.500139	 -0.981830
 -1.280362	  0.482205	 -0.982226
 -1.271896	  0.463425	 -0.982708
 -1.263595	  0.448903	 -0.984587
 -1.248554	  0.429860	 -0.993166
 -1.236914	  0.408702	 -0.998805
 -1.232241	  0.396421	 -1.000343
 -1.225983	  0.381636	 -1.002130
 -1.212427	  0.352275	 -1.010453
 -1.206392	  0.338093	 -1.018945
 -1.198736	  0.324061	 -1.025910
 -1.189106	  0.309206	 -1.027104
 -1.175280	  0.288656	 -1.025008
 -1.163294	  0.274563	 -1.026846
 -1.154099	  0.260393	 -1.023648
 -1.145538	  0.239642	 -1.016603
 -1.136246	  0.220634	 -1.017770
 -1.123657	  0.209376	 -1.024186
 -1.109790	  0.194184	 -1.021876
 -1.095231	  0.175814	 -1.017491
 -1.085284	  0.160572	 -1.014957
 -1.073926	  0.147065	 -1.011816
 -1.058134	  0.129574	 -1.006653
 -1.049917	  0.112711	 -1.005932
 -1.044005	  0.094674	 -1.005342
 -1.035256	  0.073536	 -1.003351
 -1.022147	  0.059807	 -0.996681
 -1.007961	  0.047672	 -0.988667
 -0.996141	  0.032769	 -0.983445
 -0.981752	  0.020651	 -0.976861
 -0.962606	  0.012536	 -0.967215
 -0.949782	  0.001696	 -0.961806
 -0.936938	 -0.011504	 -0.956507
 -0.917517	 -0.019606	 -0.952943
 -0.897559	 -0.026757	 -0.951731
 -0.882600	 -0.037812	 -0.955320
 -0.864285	 -0.047780	 -0.953939
 -0.843963	 -0.052415	 -0.948643
 -0.824942	 -0.057790	 -0.948389
 -0.806781	 -0.066208	 -0.951834
 -0.787871	 -0.073778	 -0.953187
 -0.769400	 -0.080651	 -0.951980
 -0.752350	 -0.090306	 -0.954811
 -0.735123	 -0.099526	 -0.958356
 -0.718270	 -0.109102	 -0.958431
 -0.701286	 -0.120092	 -0.957660
 -0.684183	 -0.131382	 -0.959893
 -0.668114	 -0.143434	 -0.965075
 -0.656581	 -0.157025	 -0.971145
 -0.646994	 -0.174175	 -0.978709
 -0.635866	 -0.192989	 -0.980889
 -0.623615	 -0.209422	 -0.976914
 -0.612560	 -0.227869	 -0.976711
 -0.606539	 -0.245007	 -0.979267
 -0.597198	 -0.262590	 -0.979925
 -0.589947	 -0.283658	 -0.981356
 -0.592182	 -0.307925	 -0.982800
 -0.592995	 -0.325376	 -0.980080
 -0.586998	 -0.348784	 -0.974890
 -0.583048	 -0.364856	 -0.969773
 -0.584102	 -0.381477	 -0.966683
 -0.588856	 -0.404913	 -0.965724
 -0.595844	 -0.431995	 -0.958768
 -0.599643	 -0.445538	 -0.951549
 -0.602210	 -0.460108	 -0.940531
 -0.606564	 -0.473273	 -0.921430
 -0.608175	 -0.482078	 -0.898164
 -0.615649	 -0.490575	 -0.881018
 -0.630883	 -0.506483	 -0.873327
 -0.642431	 -0.523419	 -0.867945
 -0.646642	 -0.536636	 -0.852417
 -0.645251	 -0.540866	 -0.826625
 -0.649673	 -0.540737	 -0.802895
 -0.661558	 -0.543566	 -0.788581
 -0.672309	 -0.550955	 -0.772662
 -0.680967	 -0.558418	 -0.756628
 -0.690211	 -0.561697	 -0.737042
 -0.697769	 -0.565435	 -0.718478
 -0.702631	 -0.573293	 -0.700810
 -0.707477	 -0.580914	 -0.683951
 -0.714569	 -0.585735	 -0.664945
 -0.719581	 -0.591293	 -0.646488
 -0.721737	 -0.595810	 -0.627715
 -0.723906	 -0.602107	 -0.609049
 -0.722035	 -0.610695	 -0.589511
 -0.716729	 -0.614547	 -0.565169
 -0.718234	 -0.612705	 -0.547158
 -0.726516	 -0.610890	 -0.530683
 -0.734078	 -0.609021	 -0.508006
 -0.731922	 -0.618075	 -0.487834
 -0.729392	 -0.633037	 -0.472109
 -0.730213	 -0.646229	 -0.457108
 -0.732620	 -0.652950	 -0.440802
 -0.726964	 -0.664090	 -0.419619
 -0.718436	 -0.676140	 -0.406758
 -0.708598	 -0.688242	 -0.394845
 -0.700363	 -0.703147	 -0.388799
 -0.689962	 -0.724698	 -0.382240
 -0.683215	 -0.741531	 -0.383799
 -0.682624	 -0.754459	 -0.391857
 -0.682262	 -0.772237	 -0.401895
 -0.679778	 -0.789743	 -0.413070
 -0.675606	 -0.803806	 -0.427163
 -0.663734	 -0.818929	 -0.430015
 -0.658153	 -0.833287	 -0.439322
 -0.652855	 -0.848218	 -0.446981
 -0.655173	 -0.861369	 -0.466956
 -0.656588	 -0.873132	 -0.485011
 -0.652467	 -0.883110	 -0.494326
 -0.645875	 -0.898267	 -0.510986
 -0.644528	 -0.902869	 -0.530788
 -0.645448	 -0.905112	 -0.552267
 -0.647768	 -0.911977	 -0.574971
 -0.649227	 -0.917259	 -0.589800
 -0.644504	 -0.922665	 -0.605882
 -0.638901	 -0.931219	 -0.627071
 -0.640417	 -0.936406	 -0.647212
 -0.642255	 -0.938684	 -0.665410
 -0.634521	 -0.944253	 -0.682132
 -0.624177	 -0.952161	 -0.697210
 -0.614726	 -0.958771	 -0.712245
 -0.603895	 -0.964949	 -0.728572
 -0.590109	 -0.974396	 -0.743842
 -0.575987	 -0.988779	 -0.755762
 -0.568832	 -0.996379	 -0.767476
 -0.562241	 -0.999557	 -0.785074
 -0.552174	 -1.003276	 -0.805593
 -0.537049	 -1.014395	 -0.822792
 -0.523201	 -1.025980	 -0.829329
 -0.509172	 -1.035358	 -0.835379
 -0.496018	 -1.043746	 -0.843888
 -0.476004	 -1.058217	 -0.850054
 -0.461180	 -1.068061	 -0.858334
 -0.444186	 -1.079507	 -0.870981
 -0.434371	 -1.085799	 -0.879394
 -0.420992	 -1.094577	 -0.886874
 -0.404305	 -1.104369	 -0.898352
 -0.386452	 -1.115705	 -0.913414
 -0.377465	 -1.120636	 -0.920894
 -0.356549	 -1.132557	 -0.926974
 -0.338256	 -1.146960	 -0.925509
 -0.324470	 -1.157066	 -0.924754
 -0.306068	 -1.167443	 -0.925301
 -0.288579	 -1.179304	 -0.927876
 -0.274026	 -1.188174	 -0.936572
 -0.257545	 -1.199549	 -0.949862
 -0.241966	 -1.213777	 -0.955785
 -0.229420	 -1.223854	 -0.951560
 -0.214565	 -1.237947	 -0.954500
 -0.201986	 -1.252786	 -0.961800
 -0.192451	 -1.268407	 -0.969969
 -0.184537	 -1.284704	 -0.978439
 -0.176691	 -1.301022	 -0.986932
 -0.168922	 -1.317277	 -0.995380
 -0.164331	 -1.335193	 -1.002450
 -0.161848	 -1.353411	 -1.011750
 -0.155896	 -1.374219	 -1.019336
 -0.149206	 -1.393432	 -1.019141
 -0.144777	 -1.410758	 -1.014741
 -0.142354	 -1.429252	 -1.008876
 -0.135858	 -1.454159	 -0.998896
 -0.131867	 -1.471917	 -0.989861
 -0.131558	 -1.487118	 -0.988062
 -0.131944	 -1.506389	 -0.984480
 -0.128604	 -1.527946	 -0.978148
 -0.126203	 -1.547359	 -0.970146
 -0.126622	 -1.561422	 -0.961493
 -0.128922	 -1.578447	 -0.946911
 -0.133054	 -1.597107	 -0.937191
 -0.140142	 -1.615699	 -0.935451
 -0.147754	 -1.633549	 -0.927677
 -0.152495	 -1.650036	 -0.916398
 -0.156883	 -1.666047	 -0.905235
 -0.163189	 -1.680662	 -0.893133
 -0.169830	 -1.695038	 -0.880919
 -0.176588	 -1.709305	 -0.868743
 -0.185094	 -1.722236	 -0.856484
 -0.194450	 -1.733992	 -0.842307
 -0.200752	 -1.747060	 -0.828820
 -0.206432	 -1.761211	 -0.816049
 -0.213472	 -1.774698	 -0.802803
 -0.220578	 -1.787375	 -0.789029
 -0.225327	 -1.799900	 -0.774181
 -0.230025	 -1.812421	 -0.759309
 -0.234673	 -1.824965	 -0.744459
 -0.236369	 -1.838291	 -0.730864
 -0.228927	 -1.851454	 -0.722360
 -0.216974	 -1.872417	 -0.714980
 -0.216577	 -1.891079	 -0.703902
 -0.217696	 -1.903842	 -0.691036
 -0.213089	 -1.918652	 -0.676884
 -0.202968	 -1.936924	 -0.669148
 -0.192981	 -1.951920	 -0.667551
 -0.180341	 -1.968246	 -0.663570
 -0.171654	 -1.985807	 -0.653450
 -0.168876	 -2.003728	 -0.647160
 -0.162961	 -2.026393	 -0.645781
 -0.158161	 -2.042990	 -0.646417
 -0.152385	 -2.063909	 -0.639591
 -0.144049	 -2.078295	 -0.630351
 -0.130936	 -2.094396	 -0.625914
 -0.118306	 -2.112981	 -0.630149
 -0.113582	 -2.135566	 -0.629679
 -0.115418	 -2.153214	 -0.628370
 -0.112309	 -2.175325	 -0.629540
 -0.101733	 -2.194862	 -0.633913
 -0.095294	 -2.207889	 -0.637566
 -0.089554	 -2.228496	 -0.637502
 -0.083839	 -2.248715	 -0.634975
 -0.075791	 -2.267303	 -0.633481
 -0.066663	 -2.284973	 -0.631266
 -0.057522	 -2.302619	 -0.629021
 -0.048325	 -2.320192	 -0.626465
 -0.038848	 -2.337227	 -0.622004
 -0.029365	 -2.354251	 -0.617501
 -0.019879	 -2.371263	 -0.612969
 -0.010337	 -2.387837	 -0.607120
 -0.000794	 -2.404394	 -0.601220
  0.008622	 -2.421011	 -0.595287
  0.017587	 -2.437833	 -0.589235
  0.026541	 -2.454661	 -0.583180
  0.035498	 -2.471498	 -0.577123
  0.044836	 -2.489086	 -0.570806
  0.057050	 -2.512832	 -0.562511
  0.065482	 -2.530027	 -0.556747
