  2.425645	 -0.050197	 -1.815111
  2.401629	 -0.049700	 -1.797139
  2.396393	 -0.034819	 -1.744405
  2.390907	 -0.021570	 -1.697332
  2.382325	 -0.020006	 -1.645897
  2.369877	 -0.008517	 -1.598363
  2.353575	 -0.001448	 -1.551879
  2.340959	  0.007995	 -1.507789
  2.328506	  0.018822	 -1.459430
  2.311981	  0.025523	 -1.411424
  2.295653	  0.034939	 -1.368083
  2.283030	  0.048531	 -1.322432
  2.271623	  0.057995	 -1.269922
  2.263206	  0.061834	 -1.220167
  2.253063	  0.069340	 -1.175896
  2.239173	  0.081639	 -1.130147
  2.223615	  0.086141	 -1.079060
  2.209434	  0.085684	 -1.030773
  2.195443	  0.087341	 -0.983839
  2.178989	  0.093693	 -0.939120
  2.161761	  0.101550	 -0.893991
  2.145909	  0.109170	 -0.846796
  2.132363	  0.116927	 -0.797930
  2.121075	  0.124997	 -0.749465
  2.112212	  0.132765	 -0.701369
  2.104963	  0.139242	 -0.654612
  2.098141	  0.145456	 -0.606762
  2.091467	  0.151892	 -0.557402
  2.083950	  0.159707	 -0.505469
  2.075885	  0.167764	 -0.457740
  2.067521	  0.176646	 -0.410668
  2.058428	  0.186804	 -0.360125
  2.053766	  0.187225	 -0.316065
  2.083763	  0.142845	 -0.283339
  2.161219	 -0.002104	 -0.209966
  2.178964	 -0.084313	 -0.120650
  2.197352	 -0.124657	 -0.054783
  2.224515	 -0.158152	  0.044616
  2.215059	 -0.127889	  0.109097
  2.206585	 -0.104411	  0.140078
  2.219954	 -0.088162	  0.167006
  2.186317	 -0.104278	  0.222793
  2.114950	 -0.061749	  0.292910
  2.060571	 -0.016971	  0.314094
  2.008748	  0.033532	  0.327099
  1.931172	  0.184911	  0.356171
  1.893587	  0.270046	  0.379897
  1.873162	  0.305772	  0.405805
  1.853695	  0.331313	  0.443918
  1.836917	  0.346556	  0.486909
  1.822033	  0.356196	  0.533698
  1.807888	  0.363365	  0.584886
  1.795479	  0.368798	  0.633258
  1.783828	  0.374092	  0.682529
  1.773322	  0.378755	  0.729761
  1.763483	  0.382692	  0.775007
  1.752280	  0.387381	  0.823745
  1.740466	  0.393609	  0.870199
  1.726836	  0.402247	  0.919802
  1.713618	  0.411366	  0.966293
  1.696942	  0.417351	  1.012034
  1.687948	  0.426553	  1.062042
  1.672964	  0.430421	  1.109295
  1.662803	  0.435008	  1.157838
  1.657501	  0.450522	  1.206407
  1.647842	  0.458670	  1.255045
  1.631115	  0.465938	  1.301654
  1.621237	  0.473286	  1.347281
  1.610964	  0.482011	  1.394107
  1.601258	  0.485737	  1.441945
  1.586293	  0.492990	  1.487306
  1.577506	  0.500996	  1.533873
  1.573676	  0.506751	  1.584658
  1.566740	  0.509612	  1.635326
  1.553787	  0.515291	  1.685583
  1.539357	  0.522082	  1.731848
  1.524880	  0.529728	  1.778648
  1.509851	  0.537609	  1.823242
  1.491843	  0.546807	  1.870392
  1.471374	  0.557972	  1.918419
  1.454988	  0.567848	  1.961870
  1.439119	  0.577479	  2.009582
  1.425544	  0.586078	  2.055116
  1.414204	  0.593998	  2.102134
  1.403530	  0.603516	  2.151978
  1.395557	  0.609703	  2.199594
  1.388193	  0.618554	  2.249552
  1.375071	  0.627805	  2.299231
  1.362008	  0.631889	  2.345995
  1.348540	  0.636129	  2.393551
  1.342269	  0.646360	  2.438851
  1.326787	  0.653640	  2.485011
  1.315517	  0.666286	  2.532493
  1.308269	  0.668006	  2.579841
  1.286892	  0.674945	  2.624568
  1.299761	  0.681694	  2.650814
