  1.289682	  2.340316	  1.428475
  1.276913	  2.317145	  1.414332
  1.241272	  2.305756	  1.393735
  1.202484	  2.288840	  1.369269
  1.160615	  2.268625	  1.350772
  1.121556	  2.250177	  1.324398
  1.077942	  2.232862	  1.304210
  1.038484	  2.218079	  1.280492
  0.995926	  2.204291	  1.256111
  0.957456	  2.184798	  1.234782
  0.917791	  2.167930	  1.209375
  0.877566	  2.154355	  1.187524
  0.835240	  2.137670	  1.163794
  0.791242	  2.118481	  1.140859
  0.750387	  2.098839	  1.118153
  0.713405	  2.082377	  1.094818
  0.671684	  2.063883	  1.068171
  0.631913	  2.045508	  1.043656
  0.590300	  2.025191	  1.019488
  0.552571	  2.004409	  0.996434
  0.516341	  1.987197	  0.974258
  0.477752	  1.969559	  0.950565
  0.437294	  1.951186	  0.926406
  0.396465	  1.933453	  0.902923
  0.357278	  1.915368	  0.880809
  0.313942	  1.898238	  0.856436
  0.274532	  1.883311	  0.835979
  0.233351	  1.863000	  0.813117
  0.191011	  1.846421	  0.790425
  0.152306	  1.828670	  0.767590
  0.116380	  1.816789	  0.739737
  0.095401	  1.822226	  0.706079
  0.054514	  1.864164	  0.624177
 -0.026826	  1.866941	  0.658127
 -0.101742	  1.926047	  0.623982
 -0.152698	  1.908639	  0.558144
 -0.234742	  1.912781	  0.509690
 -0.290606	  1.864320	  0.468725
 -0.320618	  1.848071	  0.468500
 -0.336738	  1.838274	  0.445306
 -0.353577	  1.845078	  0.390862
 -0.372833	  1.808813	  0.348129
 -0.388524	  1.738651	  0.303995
 -0.408348	  1.721328	  0.209536
 -0.387690	  1.681588	  0.160211
 -0.407619	  1.655241	  0.167512
 -0.476080	  1.605131	  0.206228
 -0.541762	  1.561896	  0.251747
 -0.615762	  1.489418	  0.289092
 -0.647696	  1.451677	  0.305910
 -0.680134	  1.410404	  0.312384
 -0.736368	  1.297438	  0.328968
 -0.760418	  1.254559	  0.345934
 -0.783652	  1.205632	  0.343052
 -0.822877	  1.162112	  0.340169
 -0.856592	  1.084815	  0.354790
 -0.868607	  1.071168	  0.351458
 -0.944943	  1.023455	  0.325176
 -0.991698	  1.006474	  0.316435
 -1.081770	  0.967933	  0.309971
 -1.108847	  0.952860	  0.299367
 -1.158717	  0.969680	  0.293140
 -1.202102	  0.979749	  0.287720
 -1.450077	  1.086728	  0.311155
 -1.508891	  1.143349	  0.348548
 -1.545418	  1.156969	  0.369774
 -1.656986	  1.226350	  0.359302
 -1.636969	  1.126854	  0.283395
 -1.699789	  1.271315	  0.214034
 -1.665302	  1.211169	  0.111411
 -1.789180	  1.269003	  0.104173
 -1.766271	  1.274901	  0.023642
 -1.739239	  1.166037	 -0.022358
 -1.671380	  1.084235	 -0.193014
 -1.670108	  1.026052	 -0.275562
 -1.706690	  1.005936	 -0.302577
 -1.745290	  0.986588	 -0.325372
 -1.785550	  0.967352	 -0.348365
 -1.825442	  0.948948	 -0.374603
 -1.869267	  0.935208	 -0.398121
 -1.907331	  0.916954	 -0.418778
 -1.948100	  0.904394	 -0.446513
 -1.986497	  0.887980	 -0.467610
 -2.025278	  0.870732	 -0.493036
 -2.068629	  0.852536	 -0.518040
 -2.110198	  0.836196	 -0.540115
 -2.149045	  0.818282	 -0.563140
 -2.192326	  0.799046	 -0.588981
 -2.234011	  0.780535	 -0.613206
 -2.273758	  0.762440	 -0.634775
 -2.312839	  0.746900	 -0.655162
 -2.355209	  0.725776	 -0.679353
 -2.393960	  0.709500	 -0.701683
 -2.431362	  0.693718	 -0.723663
 -2.472361	  0.674365	 -0.749183
 -2.516030	  0.656361	 -0.773068
 -2.554623	  0.634908	 -0.790983
 -2.591358	  0.621168	 -0.819185
 -2.631684	  0.596892	 -0.838126
 -2.674909	  0.585282	 -0.862195
 -2.717815	  0.560844	 -0.882879
 -2.754816	  0.546136	 -0.914331
 -2.800112	  0.524400	 -0.940414
 -2.828113	  0.529644	 -0.949818
