 -1.574442	 -1.900818	  0.074240
 -1.578836	 -1.930390	  0.087754
 -1.576236	 -1.912315	  0.079615
 -1.574856	 -1.893486	  0.073044
 -1.574022	 -1.874382	  0.067187
 -1.573270	 -1.855289	  0.061290
 -1.573338	 -1.836572	  0.054271
 -1.573792	 -1.818322	  0.047093
 -1.575167	 -1.801776	  0.039033
 -1.574433	 -1.782179	  0.028220
 -1.571013	 -1.764343	  0.017183
 -1.565120	 -1.750286	  0.004236
 -1.559826	 -1.735504	 -0.007607
 -1.551795	 -1.718767	 -0.018767
 -1.547269	 -1.701892	 -0.026754
 -1.546069	 -1.684802	 -0.036463
 -1.542438	 -1.666552	 -0.046621
 -1.536842	 -1.649069	 -0.051196
 -1.532332	 -1.629299	 -0.056995
 -1.528398	 -1.610877	 -0.068950
 -1.522724	 -1.595242	 -0.080071
 -1.513812	 -1.583965	 -0.088130
 -1.505135	 -1.568084	 -0.101225
 -1.502208	 -1.548681	 -0.113138
 -1.497575	 -1.531806	 -0.117394
 -1.488317	 -1.516646	 -0.124095
 -1.479721	 -1.498509	 -0.131011
 -1.479247	 -1.474118	 -0.137509
 -1.479324	 -1.455950	 -0.144160
 -1.472597	 -1.441684	 -0.149658
 -1.461748	 -1.424734	 -0.157952
 -1.455200	 -1.406694	 -0.165811
 -1.449633	 -1.389041	 -0.173564
 -1.440158	 -1.372829	 -0.181177
 -1.430242	 -1.356506	 -0.188431
 -1.423496	 -1.338439	 -0.195787
 -1.416894	 -1.321838	 -0.203894
 -1.408302	 -1.305175	 -0.211377
 -1.399176	 -1.286579	 -0.217015
 -1.394031	 -1.267669	 -0.221986
 -1.391458	 -1.250393	 -0.227771
 -1.385567	 -1.234512	 -0.233522
 -1.377337	 -1.215948	 -0.237967
 -1.370814	 -1.198852	 -0.245698
 -1.360485	 -1.184362	 -0.254817
 -1.352478	 -1.169354	 -0.261426
 -1.337061	 -1.155449	 -0.271159
 -1.321174	 -1.141565	 -0.280431
 -1.310761	 -1.130946	 -0.285804
 -1.291995	 -1.124316	 -0.294392
 -1.270377	 -1.116656	 -0.299485
 -1.256983	 -1.107777	 -0.298951
 -1.239026	 -1.098363	 -0.304506
 -1.217935	 -1.087165	 -0.311457
 -1.206605	 -1.078555	 -0.312714
 -1.189040	 -1.067062	 -0.313877
 -1.168019	 -1.053816	 -0.318804
 -1.152476	 -1.046561	 -0.323558
 -1.137851	 -1.040272	 -0.324996
 -1.118626	 -1.030291	 -0.329095
 -1.100880	 -1.017715	 -0.330803
 -1.085965	 -1.003831	 -0.328016
 -1.071726	 -0.989417	 -0.320057
 -1.059783	 -0.975942	 -0.314570
 -1.054254	 -0.958565	 -0.312536
 -1.047316	 -0.937261	 -0.309491
 -1.041479	 -0.921291	 -0.299958
 -1.032578	 -0.908594	 -0.291307
 -1.029449	 -0.890940	 -0.283940
 -1.024532	 -0.875477	 -0.270092
 -1.020888	 -0.860791	 -0.256660
 -1.026086	 -0.838456	 -0.249714
 -1.029258	 -0.823638	 -0.245491
 -1.029150	 -0.805686	 -0.235471
 -1.030143	 -0.783632	 -0.223122
 -1.031433	 -0.767363	 -0.214959
 -1.030949	 -0.750916	 -0.207374
 -1.029100	 -0.733867	 -0.202254
 -1.030258	 -0.712058	 -0.194866
 -1.033110	 -0.694679	 -0.186951
 -1.035785	 -0.678080	 -0.176909
 -1.040399	 -0.660900	 -0.167414
 -1.047090	 -0.643124	 -0.161076
 -1.051493	 -0.624810	 -0.155470
 -1.051216	 -0.601631	 -0.147449
 -1.054057	 -0.585083	 -0.141459
 -1.061498	 -0.567455	 -0.133874
 -1.067565	 -0.553748	 -0.130266
 -1.071949	 -0.535582	 -0.123977
 -1.079014	 -0.517409	 -0.122368
 -1.088452	 -0.499227	 -0.123279
 -1.096460	 -0.480577	 -0.124883
 -1.102554	 -0.461465	 -0.126016
 -1.106625	 -0.442432	 -0.126491
 -1.111396	 -0.423097	 -0.127503
 -1.114870	 -0.403606	 -0.130665
 -1.117414	 -0.384265	 -0.134024
 -1.115397	 -0.365929	 -0.140342
 -1.116409	 -0.346670	 -0.145907
 -1.111618	 -0.328665	 -0.153304
 -1.106012	 -0.311476	 -0.161410
 -1.099690	 -0.293886	 -0.169431
 -1.093574	 -0.276883	 -0.177603
 -1.086799	 -0.259408	 -0.185592
 -1.081139	 -0.242574	 -0.194303
 -1.079620	 -0.226148	 -0.203559
 -1.079659	 -0.211537	 -0.210679
 -1.077805	 -0.193819	 -0.216780
 -1.075939	 -0.178781	 -0.229825
 -1.075606	 -0.168658	 -0.247453
 -1.079751	 -0.159779	 -0.265512
 -1.087330	 -0.147147	 -0.281773
 -1.095337	 -0.128617	 -0.293693
 -1.097061	 -0.110491	 -0.304125
 -1.102877	 -0.102351	 -0.317620
 -1.097126	 -0.089593	 -0.331206
 -1.098174	 -0.076109	 -0.348328
 -1.100007	 -0.062286	 -0.360733
 -1.112260	 -0.060602	 -0.377804
 -1.123301	 -0.066120	 -0.398516
 -1.130018	 -0.061243	 -0.418866
 -1.141414	 -0.048355	 -0.429901
 -1.156483	 -0.042751	 -0.439174
 -1.167556	 -0.041791	 -0.454321
 -1.175365	 -0.033052	 -0.470799
 -1.192382	 -0.025248	 -0.484684
 -1.207225	 -0.024532	 -0.493376
 -1.219475	 -0.023522	 -0.505520
 -1.231047	 -0.023746	 -0.521112
 -1.244678	 -0.029359	 -0.536467
 -1.256649	 -0.029866	 -0.551148
 -1.270450	 -0.030569	 -0.562650
 -1.280905	 -0.034458	 -0.570798
 -1.295456	 -0.045517	 -0.583291
 -1.310621	 -0.053109	 -0.596023
 -1.328029	 -0.061313	 -0.604920
 -1.345330	 -0.061742	 -0.614352
 -1.361156	 -0.064234	 -0.624621
 -1.374717	 -0.072042	 -0.634237
 -1.390294	 -0.083986	 -0.637675
 -1.407429	 -0.099070	 -0.642771
 -1.420390	 -0.114057	 -0.644965
 -1.434581	 -0.126056	 -0.656264
 -1.449671	 -0.133118	 -0.659080
 -1.459705	 -0.142721	 -0.663697
 -1.470724	 -0.159114	 -0.673342
 -1.480170	 -0.173883	 -0.681549
 -1.496042	 -0.188855	 -0.686991
 -1.514945	 -0.193680	 -0.689092
 -1.534545	 -0.202624	 -0.686866
 -1.542671	 -0.212289	 -0.675796
 -1.551003	 -0.225030	 -0.671067
 -1.554330	 -0.239037	 -0.658019
 -1.558327	 -0.252808	 -0.641619
 -1.556984	 -0.263224	 -0.620703
 -1.558296	 -0.266973	 -0.603371
 -1.560502	 -0.273209	 -0.586821
 -1.559430	 -0.276813	 -0.573724
 -1.543868	 -0.272049	 -0.559940
 -1.529288	 -0.268075	 -0.546516
 -1.514841	 -0.264058	 -0.533266
 -1.500303	 -0.259889	 -0.520202
 -1.485278	 -0.254035	 -0.508763
 -1.470251	 -0.241484	 -0.506208
 -1.454948	 -0.229261	 -0.503606
 -1.439116	 -0.217636	 -0.498871
 -1.424877	 -0.206139	 -0.491448
 -1.411709	 -0.194732	 -0.485118
 -1.397729	 -0.183585	 -0.476969
 -1.383684	 -0.172245	 -0.468185
 -1.370812	 -0.160883	 -0.458155
 -1.357119	 -0.144367	 -0.454041
 -1.344586	 -0.126687	 -0.453063
 -1.330750	 -0.111234	 -0.460817
 -1.317815	 -0.098470	 -0.464507
 -1.307093	 -0.081871	 -0.464210
 -1.296018	 -0.061474	 -0.467936
 -1.284411	 -0.048884	 -0.474225
 -1.272960	 -0.036798	 -0.481063
 -1.258195	 -0.024802	 -0.492748
 -1.244699	 -0.011742	 -0.505004
 -1.236322	  0.008493	 -0.509998
 -1.234083	  0.030660	 -0.511098
 -1.229248	  0.050656	 -0.513460
 -1.223878	  0.065866	 -0.516915
 -1.212569	  0.082373	 -0.523145
 -1.202160	  0.103894	 -0.532663
 -1.195961	  0.120290	 -0.535306
 -1.191997	  0.135628	 -0.541302
 -1.186871	  0.159427	 -0.547957
 -1.183010	  0.179015	 -0.553733
 -1.179175	  0.194230	 -0.564110
 -1.172743	  0.209430	 -0.574318
 -1.170322	  0.228234	 -0.584130
 -1.168035	  0.244538	 -0.592778
 -1.167778	  0.265870	 -0.598246
 -1.168122	  0.285935	 -0.603920
 -1.165674	  0.301617	 -0.611309
 -1.162991	  0.322706	 -0.619725
 -1.161153	  0.342370	 -0.625957
 -1.155472	  0.355408	 -0.633751
 -1.148463	  0.378007	 -0.645776
 -1.142987	  0.392878	 -0.659474
 -1.140379	  0.401877	 -0.669040
 -1.142748	  0.421002	 -0.683567
 -1.145231	  0.440278	 -0.692420
 -1.146696	  0.460812	 -0.699259
 -1.144620	  0.481154	 -0.706936
 -1.141036	  0.498210	 -0.714314
 -1.138522	  0.515672	 -0.720768
 -1.130842	  0.535826	 -0.730380
 -1.120754	  0.552836	 -0.739331
 -1.113432	  0.566614	 -0.743080
 -1.109130	  0.590970	 -0.746670
 -1.102882	  0.609098	 -0.752545
 -1.096084	  0.621463	 -0.759894
 -1.091097	  0.639562	 -0.769571
 -1.085165	  0.657936	 -0.780543
 -1.077717	  0.674256	 -0.787425
 -1.072289	  0.692210	 -0.791446
 -1.066776	  0.710859	 -0.796199
 -1.056725	  0.729599	 -0.804467
 -1.048496	  0.743520	 -0.815339
 -1.045144	  0.760249	 -0.824186
 -1.043792	  0.779184	 -0.829272
 -1.041064	  0.798661	 -0.834737
 -1.040455	  0.817857	 -0.840515
 -1.042852	  0.836881	 -0.844931
 -1.046523	  0.855828	 -0.847864
 -1.050348	  0.875502	 -0.848713
 -1.053506	  0.895874	 -0.848187
 -1.056018	  0.916168	 -0.847903
 -1.060990	  0.934071	 -0.851228
 -1.067431	  0.952242	 -0.856080
 -1.076026	  0.970632	 -0.859194
 -1.083550	  0.989424	 -0.860678
 -1.090927	  1.008083	 -0.860177
 -1.100192	  1.025595	 -0.857662
 -1.111217	  1.042059	 -0.856737
 -1.124719	  1.056611	 -0.857788
 -1.139531	  1.070304	 -0.855884
 -1.147369	  1.088855	 -0.848461
 -1.156900	  1.107018	 -0.842572
 -1.169898	  1.121581	 -0.842821
 -1.185293	  1.133706	 -0.845900
 -1.201983	  1.146464	 -0.849358
 -1.218048	  1.157942	 -0.853566
 -1.233589	  1.171387	 -0.856447
 -1.247574	  1.186356	 -0.858591
 -1.261664	  1.201514	 -0.855144
 -1.276241	  1.213809	 -0.850981
 -1.294557	  1.222748	 -0.850627
 -1.314616	  1.231741	 -0.851703
 -1.333862	  1.238942	 -0.850710
 -1.352522	  1.246373	 -0.848285
 -1.371866	  1.249268	 -0.841142
 -1.392342	  1.249599	 -0.837209
 -1.412966	  1.251085	 -0.838117
 -1.431858	  1.256227	 -0.837794
 -1.450004	  1.264606	 -0.834251
 -1.469721	  1.270342	 -0.830813
 -1.490980	  1.272809	 -0.832681
 -1.510109	  1.276438	 -0.836835
 -1.527414	  1.283809	 -0.837621
 -1.546626	  1.292671	 -0.837817
 -1.566538	  1.298852	 -0.843635
 -1.586998	  1.298283	 -0.849453
 -1.604835	  1.299544	 -0.848871
 -1.625314	  1.303856	 -0.847803
 -1.645217	  1.307963	 -0.849585
 -1.664553	  1.311965	 -0.853067
 -1.683496	  1.316648	 -0.856065
 -1.701253	  1.324581	 -0.859492
 -1.718657	  1.334869	 -0.865876
 -1.732251	  1.343866	 -0.875422
 -1.750591	  1.346468	 -0.880539
 -1.767385	  1.354946	 -0.888087
 -1.781798	  1.366327	 -0.896619
 -1.795353	  1.378919	 -0.903161
 -1.809633	  1.391401	 -0.907570
 -1.821649	  1.410418	 -0.917393
 -1.835358	  1.424096	 -0.934733
 -1.844523	  1.439102	 -0.944264
