 -2.774803	 -1.057720	  0.602160
 -2.747330	 -1.047247	  0.596198
 -2.704094	 -1.012046	  0.618747
 -2.669618	 -0.990130	  0.641207
 -2.639904	 -0.958763	  0.659824
 -2.605437	 -0.930718	  0.687141
 -2.570469	 -0.897902	  0.703410
 -2.536454	 -0.870800	  0.729610
 -2.493424	 -0.848915	  0.753785
 -2.462143	 -0.822939	  0.775109
 -2.428418	 -0.786283	  0.793229
 -2.395196	 -0.767036	  0.816145
 -2.357932	 -0.739765	  0.831558
 -2.319789	 -0.706928	  0.852843
 -2.283955	 -0.677411	  0.874339
 -2.249132	 -0.654610	  0.897225
 -2.214712	 -0.622333	  0.916694
 -2.178356	 -0.595144	  0.939842
 -2.142968	 -0.566417	  0.959025
 -2.110309	 -0.539406	  0.980754
 -2.077553	 -0.508747	  0.999905
 -2.041582	 -0.480898	  1.019742
 -2.012361	 -0.452480	  1.044496
 -1.974231	 -0.424296	  1.070011
 -1.941227	 -0.397095	  1.087741
 -1.902875	 -0.373531	  1.113501
 -1.936424	 -0.375101	  1.275292
 -2.018621	 -0.400271	  1.567824
 -1.976587	 -0.380791	  1.592032
 -1.936164	 -0.329396	  1.598563
 -1.801446	 -0.276710	  1.325269
 -1.699250	 -0.205154	  1.241482
 -1.657255	 -0.179293	  1.255608
 -1.624509	 -0.150950	  1.281767
 -1.593784	 -0.120860	  1.304534
 -1.555825	 -0.091265	  1.319407
 -1.523887	 -0.066393	  1.339915
 -1.481842	 -0.033939	  1.363691
 -1.448432	 -0.007057	  1.379334
 -1.412600	  0.021226	  1.400894
 -1.379120	  0.049759	  1.425707
 -1.344953	  0.074738	  1.448332
 -1.312832	  0.098771	  1.467252
 -1.276350	  0.130579	  1.491539
 -1.241356	  0.159208	  1.515950
 -1.203724	  0.189766	  1.540050
 -1.168616	  0.217789	  1.559789
 -1.139440	  0.243816	  1.577905
 -1.104112	  0.269887	  1.598666
 -1.066153	  0.298883	  1.621640
 -1.033942	  0.323341	  1.641230
 -0.997716	  0.353362	  1.664765
 -0.962637	  0.378952	  1.684655
 -0.929318	  0.407136	  1.706047
 -0.891327	  0.435735	  1.728250
 -0.856068	  0.463585	  1.752666
 -0.822079	  0.489796	  1.773670
 -0.789878	  0.517432	  1.794436
 -0.756699	  0.545250	  1.811959
 -0.716114	  0.575788	  1.833431
 -0.678721	  0.604960	  1.851007
 -0.642005	  0.630344	  1.869187
 -0.606741	  0.658867	  1.891740
 -0.573880	  0.690484	  1.913897
 -0.542262	  0.715810	  1.930297
 -0.504625	  0.741525	  1.952104
 -0.465490	  0.772628	  1.977306
 -0.433304	  0.801329	  1.999028
 -0.401332	  0.827684	  2.020953
 -0.364506	  0.860655	  2.040641
 -0.333099	  0.888467	  2.065079
 -0.297641	  0.915764	  2.080244
 -0.264745	  0.940143	  2.101956
 -0.226467	  0.971908	  2.122250
 -0.189236	  0.999366	  2.146012
 -0.158280	  1.026429	  2.167010
 -0.121773	  1.056847	  2.186306
 -0.086697	  1.082341	  2.207129
 -0.055254	  1.108631	  2.228476
 -0.015977	  1.136087	  2.254921
  0.020745	  1.164839	  2.275096
  0.055027	  1.189925	  2.295094
  0.091923	  1.223675	  2.311120
  0.122866	  1.250393	  2.332671
  0.161245	  1.275804	  2.358743
  0.197248	  1.309260	  2.377513
  0.228640	  1.338791	  2.397898
  0.265249	  1.360520	  2.421926
  0.297845	  1.394750	  2.439346
  0.334934	  1.422211	  2.462918
  0.364015	  1.450827	  2.481839
  0.404958	  1.476604	  2.503903
  0.433441	  1.499871	  2.526759
  0.468160	  1.524448	  2.541040
  0.472842	  1.539693	  2.566450
