 -1.868597	 -2.273554	  0.721250
 -1.850096	 -2.251043	  0.714109
 -1.806139	 -2.224175	  0.725671
 -1.759805	 -2.198102	  0.725133
 -1.716544	 -2.170653	  0.728108
 -1.674500	 -2.141945	  0.735126
 -1.632232	 -2.115206	  0.743231
 -1.591991	 -2.091933	  0.750090
 -1.549747	 -2.067566	  0.757601
 -1.507090	 -2.042057	  0.766957
 -1.464512	 -2.016376	  0.777870
 -1.421675	 -1.990486	  0.789620
 -1.380957	 -1.965371	  0.800968
 -1.341314	 -1.940043	  0.811530
 -1.300648	 -1.913443	  0.821043
 -1.257839	 -1.886303	  0.829100
 -1.215701	 -1.861827	  0.834497
 -1.174311	 -1.839627	  0.837372
 -1.129502	 -1.815937	  0.837834
 -1.082505	 -1.790529	  0.837395
 -1.037334	 -1.764777	  0.842436
 -0.995628	 -1.738693	  0.852164
 -0.957179	 -1.711607	  0.865315
 -0.918771	 -1.683719	  0.880387
 -0.880941	 -1.656429	  0.895133
 -0.843751	 -1.629697	  0.909100
 -0.805581	 -1.602351	  0.922415
 -0.765626	 -1.573806	  0.934703
 -0.723482	 -1.544627	  0.945415
 -0.679368	 -1.516745	  0.953951
 -0.633912	 -1.491303	  0.960535
 -0.590423	 -1.468533	  0.966455
 -0.548814	 -1.447625	  0.973611
 -0.509712	 -1.427259	  0.984142
 -0.475958	 -1.407077	  0.999661
 -0.442071	 -1.379771	  1.029603
 -0.404586	 -1.321899	  1.111080
 -0.406846	 -1.226149	  1.228024
 -0.406814	 -1.153447	  1.287982
 -0.402752	 -1.146232	  1.293975
 -0.347045	 -1.123729	  1.307746
 -0.281469	 -1.094497	  1.316838
 -0.235949	 -1.060761	  1.325443
 -0.204004	 -1.040792	  1.328297
 -0.174856	 -1.024590	  1.321095
 -0.130784	 -1.007688	  1.302266
 -0.071323	 -1.001944	  1.271974
  0.000774	 -1.017067	  1.212509
  0.106290	 -1.045754	  1.120633
  0.178229	 -1.034268	  1.080129
  0.227401	 -1.015781	  1.070900
  0.271866	 -0.994394	  1.072221
  0.316197	 -0.971904	  1.078798
  0.361056	 -0.948894	  1.086923
  0.404851	 -0.925908	  1.094588
  0.449652	 -0.900601	  1.102168
  0.492200	 -0.874822	  1.109162
  0.532929	 -0.849125	  1.115586
  0.573362	 -0.823915	  1.121544
  0.614920	 -0.797848	  1.127383
  0.657725	 -0.770634	  1.133494
  0.699466	 -0.743942	  1.140534
  0.740010	 -0.718986	  1.148963
  0.781997	 -0.694169	  1.158618
  0.824027	 -0.670634	  1.167446
  0.866064	 -0.649114	  1.174823
  0.912862	 -0.624951	  1.179376
  0.957723	 -0.597177	  1.183304
  0.999906	 -0.571116	  1.185820
  1.039677	 -0.545932	  1.188728
  1.080296	 -0.517160	  1.193896
  1.121884	 -0.488048	  1.200097
  1.165704	 -0.461271	  1.207583
  1.209305	 -0.437013	  1.216214
  1.251627	 -0.414668	  1.225686
  1.293340	 -0.391524	  1.236634
  1.334087	 -0.368299	  1.249481
  1.372281	 -0.346389	  1.264177
  1.411696	 -0.321481	  1.280635
  1.451859	 -0.292429	  1.297452
  1.491062	 -0.261503	  1.312010
  1.529595	 -0.229760	  1.323699
  1.569298	 -0.195757	  1.332461
  1.607624	 -0.164104	  1.338688
  1.645402	 -0.134624	  1.343099
  1.685446	 -0.106370	  1.347243
  1.729093	 -0.078504	  1.350399
  1.771903	 -0.053066	  1.351551
  1.816045	 -0.028513	  1.352508
  1.860107	 -0.004910	  1.355067
  1.902288	  0.018774	  1.360431
  1.945625	  0.042469	  1.367357
  1.989708	  0.065991	  1.375757
  2.032489	  0.087764	  1.384835
  2.076844	  0.109426	  1.394369
  2.120124	  0.130959	  1.402527
  2.164414	  0.152941	  1.409695
  2.210457	  0.174990	  1.415622
  2.254706	  0.194849	  1.419912
  2.299151	  0.215333	  1.424458
  2.343393	  0.237377	  1.429571
  2.388594	  0.262093	  1.435129
  2.430453	  0.288673	  1.440350
  2.472045	  0.316601	  1.445072
  2.514401	  0.343485	  1.450990
  2.550357	  0.375048	  1.460083
  2.588921	  0.394120	  1.463611
  2.614810	  0.398061	  1.478248
