 -0.136765	 -2.350558	  1.907111
 -0.135411	 -2.327285	  1.888229
 -0.139344	 -2.275528	  1.884852
 -0.151349	 -2.226065	  1.877735
 -0.164228	 -2.177498	  1.875175
 -0.177300	 -2.130335	  1.877564
 -0.188303	 -2.082591	  1.879799
 -0.196207	 -2.033587	  1.876269
 -0.202688	 -1.984262	  1.869958
 -0.208110	 -1.933216	  1.863774
 -0.213953	 -1.881982	  1.857508
 -0.220325	 -1.832823	  1.850830
 -0.226958	 -1.784896	  1.844534
 -0.234057	 -1.736629	  1.838815
 -0.242425	 -1.687290	  1.833505
 -0.252138	 -1.639207	  1.828190
 -0.263364	 -1.591568	  1.822020
 -0.276408	 -1.542468	  1.813967
 -0.290705	 -1.493432	  1.804595
 -0.306398	 -1.447192	  1.796188
 -0.321173	 -1.401562	  1.791113
 -0.333948	 -1.355193	  1.789771
 -0.346610	 -1.306764	  1.789725
 -0.358403	 -1.256618	  1.789431
 -0.368953	 -1.206970	  1.789024
 -0.380100	 -1.158457	  1.788160
 -0.392392	 -1.110681	  1.786927
 -0.405685	 -1.063244	  1.785364
 -0.419947	 -1.014957	  1.783425
 -0.434401	 -0.965408	  1.780765
 -0.446960	 -0.915031	  1.777205
 -0.454537	 -0.864687	  1.773292
 -0.457269	 -0.815641	  1.769955
 -0.458639	 -0.768471	  1.768029
 -0.462089	 -0.720190	  1.766942
 -0.468033	 -0.669083	  1.764359
 -0.475316	 -0.616774	  1.755714
 -0.485467	 -0.565911	  1.744385
 -0.497490	 -0.517946	  1.733471
 -0.510681	 -0.471905	  1.721926
 -0.524652	 -0.427657	  1.709707
 -0.538989	 -0.381500	  1.696256
 -0.552054	 -0.333873	  1.682810
 -0.563543	 -0.285561	  1.670737
 -0.573177	 -0.237482	  1.661239
 -0.581182	 -0.189544	  1.654170
 -0.588114	 -0.140161	  1.649221
 -0.593649	 -0.090218	  1.645765
 -0.598152	 -0.039565	  1.643385
 -0.602502	  0.010738	  1.641716
 -0.608275	  0.059259	  1.640312
 -0.616928	  0.107300	  1.638997
 -0.629944	  0.154875	  1.635645
 -0.644722	  0.203012	  1.628064
 -0.658272	  0.250193	  1.617615
 -0.668487	  0.297946	  1.606229
 -0.676055	  0.346148	  1.594445
 -0.683050	  0.395608	  1.583334
 -0.688647	  0.445399	  1.573926
 -0.692953	  0.494478	  1.565688
 -0.696638	  0.542694	  1.558464
 -0.700305	  0.591370	  1.552249
 -0.705636	  0.641556	  1.547577
 -0.714528	  0.692432	  1.545687
 -0.727347	  0.743290	  1.546743
 -0.744305	  0.791514	  1.551152
 -0.765159	  0.835860	  1.560219
 -0.795862	  0.884947	  1.578573
 -0.855016	  0.950241	  1.621709
 -0.942144	  1.012825	  1.684836
 -1.003863	  1.048428	  1.725343
 -1.026826	  1.072582	  1.739136
 -1.038417	  1.107154	  1.744637
 -1.038400	  1.149577	  1.738604
 -1.027241	  1.189459	  1.720154
 -0.996367	  1.246242	  1.672724
 -0.950768	  1.316116	  1.583933
 -0.922789	  1.371824	  1.514338
 -0.911929	  1.416125	  1.480188
 -0.913297	  1.462645	  1.464159
 -0.923246	  1.512139	  1.458356
 -0.935417	  1.559946	  1.456531
 -0.944198	  1.606875	  1.455326
 -0.951579	  1.655441	  1.447986
 -0.960760	  1.706138	  1.448514
 -0.971579	  1.755299	  1.441522
 -0.983999	  1.802579	  1.433711
 -0.988482	  1.851214	  1.428444
 -0.996318	  1.899943	  1.428641
 -1.007337	  1.949102	  1.422141
 -1.022107	  1.998192	  1.418289
 -1.032126	  2.047447	  1.412281
 -1.035690	  2.095444	  1.399775
 -1.046337	  2.144231	  1.403189
 -1.063860	  2.191889	  1.397046
 -1.068807	  2.241805	  1.390093
 -1.075839	  2.290300	  1.384578
 -1.092725	  2.334804	  1.376187
 -1.104070	  2.382440	  1.376383
 -1.115142	  2.429200	  1.362147
 -1.126293	  2.453492	  1.375768
