 -1.820067	 -1.953295	  1.432793
 -1.802046	 -1.933955	  1.418607
 -1.784702	 -1.915863	  1.375975
 -1.766154	 -1.901215	  1.331114
 -1.755347	 -1.884599	  1.284104
 -1.746267	 -1.864159	  1.239002
 -1.739557	 -1.843383	  1.194332
 -1.735479	 -1.823640	  1.149304
 -1.733262	 -1.804882	  1.103880
 -1.730740	 -1.785789	  1.060135
 -1.726484	 -1.765178	  1.015315
 -1.720371	 -1.745150	  0.969167
 -1.712880	 -1.730400	  0.923179
 -1.702317	 -1.720886	  0.874249
 -1.683978	 -1.715767	  0.828380
 -1.657794	 -1.715402	  0.785041
 -1.636594	 -1.706349	  0.737123
 -1.621864	 -1.690249	  0.689892
 -1.612633	 -1.670033	  0.644483
 -1.606168	 -1.650052	  0.597969
 -1.599690	 -1.631926	  0.548761
 -1.595660	 -1.612205	  0.500690
 -1.593981	 -1.591898	  0.456747
 -1.589384	 -1.572370	  0.413171
 -1.577475	 -1.552012	  0.369177
 -1.563169	 -1.528860	  0.327369
 -1.550927	 -1.504478	  0.286475
 -1.541686	 -1.480509	  0.243405
 -1.532812	 -1.457510	  0.199084
 -1.522783	 -1.436019	  0.154154
 -1.511473	 -1.417932	  0.108876
 -1.500017	 -1.402929	  0.063826
 -1.489115	 -1.390196	  0.019026
 -1.477933	 -1.378484	 -0.027882
 -1.467882	 -1.367326	 -0.075869
 -1.461391	 -1.356638	 -0.123944
 -1.457314	 -1.345083	 -0.173730
 -1.454499	 -1.330634	 -0.222554
 -1.452253	 -1.315194	 -0.268093
 -1.449953	 -1.299087	 -0.313922
 -1.444517	 -1.276394	 -0.360672
 -1.435728	 -1.247655	 -0.404047
 -1.424151	 -1.219946	 -0.445757
 -1.410748	 -1.196397	 -0.488423
 -1.395814	 -1.176471	 -0.532317
 -1.381608	 -1.159470	 -0.577498
 -1.369365	 -1.145232	 -0.623800
 -1.358237	 -1.133745	 -0.668615
 -1.348002	 -1.124408	 -0.711503
 -1.338090	 -1.116903	 -0.754207
 -1.324174	 -1.115402	 -0.807146
 -1.295098	 -1.153002	 -0.870341
 -1.271401	 -1.226183	 -0.912311
 -1.253161	 -1.285576	 -0.953511
 -1.230117	 -1.321208	 -0.987187
 -1.228515	 -1.335045	 -1.023684
 -1.232439	 -1.335348	 -1.089451
 -1.222266	 -1.308233	 -1.188902
 -1.191445	 -1.274293	 -1.288260
 -1.161279	 -1.248039	 -1.360385
 -1.139158	 -1.223977	 -1.410917
 -1.126024	 -1.201584	 -1.442372
 -1.114537	 -1.166832	 -1.476132
 -1.104415	 -1.118280	 -1.513326
 -1.100104	 -1.068011	 -1.546516
 -1.101140	 -1.025150	 -1.567665
 -1.107720	 -0.963778	 -1.587117
 -1.121665	 -0.881354	 -1.608153
 -1.137981	 -0.809553	 -1.637531
 -1.149387	 -0.757096	 -1.672423
 -1.152900	 -0.718898	 -1.709891
 -1.149575	 -0.688752	 -1.749759
 -1.140138	 -0.663968	 -1.791393
 -1.127052	 -0.642069	 -1.834196
 -1.113322	 -0.622595	 -1.878054
 -1.100403	 -0.605450	 -1.922353
 -1.088329	 -0.589841	 -1.967789
 -1.077001	 -0.575438	 -2.015011
 -1.066909	 -0.562968	 -2.062296
 -1.057070	 -0.552081	 -2.109384
 -1.047435	 -0.541601	 -2.155169
 -1.037043	 -0.530490	 -2.203017
 -1.026506	 -0.518530	 -2.252345
 -1.018003	 -0.503534	 -2.301799
 -1.012160	 -0.486173	 -2.348509
 -1.008073	 -0.466394	 -2.394031
 -1.005242	 -0.443652	 -2.439172
 -1.002385	 -0.420000	 -2.482169
 -0.997729	 -0.397346	 -2.524385
 -0.991251	 -0.375486	 -2.566006
 -0.983067	 -0.352970	 -2.608032
 -0.972285	 -0.327496	 -2.650600
 -0.961327	 -0.305926	 -2.695224
 -0.952413	 -0.285958	 -2.740035
 -0.939551	 -0.271615	 -2.787368
 -0.935944	 -0.260095	 -2.838373
 -0.945303	 -0.262696	 -2.866756
