  0.681065	  1.190581	 -2.138773
  0.685556	  1.195936	 -2.144346
  0.675472	  1.184018	 -2.131853
  0.664861	  1.172172	 -2.119733
  0.653763	  1.160562	 -2.108454
  0.644608	  1.150879	 -2.099081
  0.648297	  1.143756	 -2.079674
  0.649490	  1.143019	 -2.075001
  0.647768	  1.134218	 -2.060126
  0.648284	  1.124082	 -2.039866
  0.648012	  1.116413	 -2.021455
  0.648190	  1.109309	 -2.001580
  0.650127	  1.101230	 -1.983151
  0.654311	  1.091031	 -1.966887
  0.664072	  1.081100	 -1.949870
  0.676806	  1.077097	 -1.931704
  0.690488	  1.078009	 -1.910822
  0.698089	  1.082195	 -1.891818
  0.702934	  1.085334	 -1.876339
  0.707795	  1.086437	 -1.852929
  0.712790	  1.084297	 -1.834770
  0.718328	  1.078835	 -1.819180
  0.729798	  1.071441	 -1.795022
  0.733946	  1.067204	 -1.780101
  0.737914	  1.062922	 -1.763214
  0.742212	  1.057798	 -1.742215
  0.743808	  1.053919	 -1.723534
  0.746254	  1.050640	 -1.700817
  0.745783	  1.042544	 -1.680140
  0.747482	  1.036553	 -1.667629
  0.745540	  1.027450	 -1.649226
  0.750605	  1.024864	 -1.622081
  0.756736	  1.023419	 -1.600048
  0.759968	  1.022132	 -1.585590
  0.758751	  1.017130	 -1.566297
  0.754098	  1.014760	 -1.546199
  0.750624	  1.014639	 -1.524972
  0.745341	  1.014663	 -1.505660
  0.737196	  1.013613	 -1.488175
  0.728930	  1.010981	 -1.466854
  0.719388	  1.006749	 -1.451150
  0.711403	  1.001990	 -1.430661
  0.702069	  0.997344	 -1.412939
  0.690128	  0.991898	 -1.397735
  0.678553	  0.984830	 -1.383267
  0.667180	  0.975050	 -1.369782
  0.656930	  0.966494	 -1.354402
  0.641232	  0.954812	 -1.342999
  0.618676	  0.946627	 -1.338735
  0.599430	  0.943259	 -1.330916
  0.581341	  0.934814	 -1.322775
  0.574308	  0.928424	 -1.312952
  0.562760	  0.909543	 -1.306143
  0.550119	  0.891232	 -1.300242
  0.532775	  0.877254	 -1.294727
  0.520254	  0.866684	 -1.291804
  0.507691	  0.856653	 -1.288759
  0.496369	  0.838368	 -1.286157
  0.480273	  0.823782	 -1.280371
  0.472066	  0.808628	 -1.279541
  0.452099	  0.800593	 -1.271525
  0.436134	  0.786865	 -1.266816
  0.427820	  0.772547	 -1.265961
  0.420391	  0.758140	 -1.265824
  0.407734	  0.732869	 -1.263148
  0.390997	  0.716793	 -1.260864
  0.383802	  0.708162	 -1.260058
  0.373375	  0.691920	 -1.259409
  0.363656	  0.670380	 -1.261432
  0.357587	  0.659183	 -1.258050
  0.348637	  0.639145	 -1.251373
  0.329740	  0.611622	 -1.243384
  0.323275	  0.603317	 -1.243114
  0.312117	  0.596150	 -1.243035
  0.293327	  0.578343	 -1.237526
  0.278727	  0.558555	 -1.229922
  0.266838	  0.543732	 -1.227653
  0.257742	  0.527426	 -1.224962
  0.249023	  0.512794	 -1.221362
  0.241400	  0.494629	 -1.216403
  0.228286	  0.475940	 -1.211791
  0.218624	  0.458025	 -1.207063
  0.212029	  0.447523	 -1.205467
  0.200463	  0.430343	 -1.204724
  0.188102	  0.407102	 -1.200607
  0.183094	  0.395043	 -1.195135
  0.172809	  0.377615	 -1.189615
  0.161795	  0.359063	 -1.183030
  0.152989	  0.339580	 -1.175806
  0.145708	  0.326113	 -1.171518
  0.134077	  0.311377	 -1.169093
  0.124805	  0.292689	 -1.161794
  0.120657	  0.273241	 -1.153892
  0.113909	  0.251612	 -1.142360
  0.109244	  0.239916	 -1.135134
  0.102689	  0.226304	 -1.127716
  0.091300	  0.208489	 -1.120677
  0.084510	  0.192562	 -1.110942
  0.077767	  0.180779	 -1.104406
  0.068244	  0.156481	 -1.091709
  0.061801	  0.140420	 -1.082894
  0.049315	  0.130475	 -1.075409
  0.040905	  0.119099	 -1.069490
  0.023605	  0.105806	 -1.061761
  0.015958	  0.086056	 -1.049700
  0.011112	  0.074862	 -1.041831
  0.005316	  0.055876	 -1.027503
  0.004791	  0.033994	 -1.014522
 -0.000921	  0.026454	 -1.008247
 -0.006453	  0.012712	 -0.994117
 -0.019527	 -0.004602	 -0.978554
 -0.029754	 -0.018856	 -0.966404
 -0.039506	 -0.028309	 -0.955217
 -0.047710	 -0.037569	 -0.943527
 -0.056248	 -0.052205	 -0.935869
 -0.065878	 -0.074709	 -0.917398
 -0.069623	 -0.081679	 -0.909073
 -0.077818	 -0.092405	 -0.896900
 -0.090803	 -0.106704	 -0.878874
 -0.100491	 -0.120594	 -0.862657
 -0.102997	 -0.125440	 -0.853691
 -0.106501	 -0.135243	 -0.835797
 -0.113786	 -0.146772	 -0.822454
 -0.125616	 -0.160170	 -0.810212
 -0.140212	 -0.177801	 -0.785588
 -0.153624	 -0.186590	 -0.774544
 -0.146083	 -0.195924	 -0.765484
 -0.159594	 -0.205712	 -0.753257
 -0.164561	 -0.223081	 -0.730724
 -0.167219	 -0.232172	 -0.719353
 -0.168743	 -0.240971	 -0.706830
 -0.177563	 -0.257049	 -0.688365
 -0.184239	 -0.269286	 -0.673190
 -0.190711	 -0.278409	 -0.661727
 -0.201041	 -0.291368	 -0.642395
 -0.210953	 -0.298807	 -0.627285
 -0.217787	 -0.305647	 -0.613854
 -0.227932	 -0.317959	 -0.596874
 -0.237730	 -0.329146	 -0.584663
 -0.246265	 -0.343121	 -0.571669
 -0.254590	 -0.354015	 -0.560940
 -0.268237	 -0.366664	 -0.540800
 -0.273742	 -0.371383	 -0.530773
 -0.283807	 -0.381411	 -0.516656
 -0.297718	 -0.394241	 -0.497744
 -0.306271	 -0.404129	 -0.481032
 -0.310898	 -0.408802	 -0.472369
 -0.317823	 -0.424065	 -0.456739
 -0.324292	 -0.439935	 -0.438144
 -0.329921	 -0.452032	 -0.422949
 -0.337923	 -0.461918	 -0.409655
 -0.347654	 -0.471045	 -0.394277
 -0.358678	 -0.481310	 -0.377079
 -0.372011	 -0.489056	 -0.365276
 -0.381505	 -0.495906	 -0.351519
 -0.395171	 -0.506568	 -0.339067
 -0.406893	 -0.520245	 -0.327745
 -0.417855	 -0.534408	 -0.317044
 -0.427287	 -0.548719	 -0.305749
 -0.435361	 -0.561421	 -0.296168
 -0.444675	 -0.576423	 -0.283895
 -0.455215	 -0.589549	 -0.273046
 -0.464452	 -0.601758	 -0.259444
 -0.471863	 -0.611469	 -0.245635
 -0.477889	 -0.623367	 -0.229828
 -0.489284	 -0.634483	 -0.212621
 -0.497019	 -0.642843	 -0.197893
 -0.503075	 -0.648895	 -0.185503
 -0.507735	 -0.661964	 -0.168815
 -0.512530	 -0.674700	 -0.153111
 -0.518200	 -0.686339	 -0.137595
 -0.523691	 -0.698463	 -0.122506
 -0.528278	 -0.710590	 -0.107873
 -0.532511	 -0.723012	 -0.093066
 -0.535688	 -0.735701	 -0.078778
 -0.537645	 -0.748846	 -0.064643
 -0.539691	 -0.762662	 -0.046988
 -0.545174	 -0.772673	 -0.031991
 -0.553815	 -0.784984	 -0.018147
 -0.563425	 -0.800459	 -0.005972
 -0.568044	 -0.814531	  0.006986
 -0.569426	 -0.825785	  0.021410
 -0.572395	 -0.839102	  0.037279
 -0.576399	 -0.853469	  0.052309
 -0.585509	 -0.867601	  0.063914
 -0.591021	 -0.879228	  0.077509
 -0.598266	 -0.890481	  0.092631
 -0.604077	 -0.904370	  0.104583
 -0.609641	 -0.925517	  0.118236
 -0.612819	 -0.940086	  0.128996
 -0.613413	 -0.954161	  0.140327
 -0.616813	 -0.968182	  0.154254
 -0.622250	 -0.982762	  0.166366
 -0.630628	 -0.998864	  0.180318
 -0.635990	 -1.010838	  0.191372
 -0.643743	 -1.022281	  0.205500
 -0.653373	 -1.034389	  0.224457
 -0.658073	 -1.048028	  0.241464
 -0.660910	 -1.059365	  0.253999
 -0.666799	 -1.073340	  0.266969
 -0.669796	 -1.088394	  0.278230
 -0.669148	 -1.105935	  0.289253
 -0.671922	 -1.126776	  0.302263
 -0.675194	 -1.141075	  0.312378
 -0.678243	 -1.155070	  0.327310
 -0.683880	 -1.165624	  0.341560
 -0.690321	 -1.178337	  0.357278
 -0.694560	 -1.191157	  0.372170
 -0.696431	 -1.204823	  0.386342
 -0.703404	 -1.219346	  0.396867
 -0.711902	 -1.234772	  0.409142
 -0.719155	 -1.248747	  0.422254
 -0.725349	 -1.263333	  0.436829
 -0.730789	 -1.276295	  0.451444
 -0.736850	 -1.290869	  0.462581
 -0.740505	 -1.304722	  0.470277
 -0.750792	 -1.325598	  0.476822
 -0.761500	 -1.338987	  0.485624
 -0.770858	 -1.357550	  0.501968
 -0.779658	 -1.366893	  0.511415
 -0.786952	 -1.375222	  0.524304
 -0.795946	 -1.387368	  0.544435
 -0.801480	 -1.401397	  0.560230
 -0.807511	 -1.408351	  0.569765
 -0.817936	 -1.422280	  0.584379
 -0.824537	 -1.438927	  0.596850
 -0.831068	 -1.450032	  0.607889
 -0.844050	 -1.462817	  0.620557
 -0.857193	 -1.477518	  0.632588
 -0.865375	 -1.485800	  0.642251
 -0.875517	 -1.492299	  0.655371
 -0.891798	 -1.507892	  0.678969
 -0.900193	 -1.513850	  0.692268
 -0.906103	 -1.515882	  0.703176
 -0.921026	 -1.519440	  0.723324
 -0.934688	 -1.522852	  0.738873
 -0.945098	 -1.528207	  0.749685
 -0.962307	 -1.536697	  0.767393
 -0.971704	 -1.544168	  0.776944
 -0.985603	 -1.550518	  0.791494
 -0.998749	 -1.553189	  0.806242
 -1.008915	 -1.556316	  0.822982
 -1.021211	 -1.560837	  0.840322
 -1.033789	 -1.567979	  0.848476
 -1.044967	 -1.578168	  0.858498
 -1.059958	 -1.590316	  0.879439
 -1.066618	 -1.597224	  0.892726
 -1.071493	 -1.604714	  0.905376
 -1.082990	 -1.612606	  0.923277
 -1.093289	 -1.622654	  0.938782
 -1.101498	 -1.633849	  0.950229
 -1.111907	 -1.646917	  0.963562
 -1.122050	 -1.659057	  0.975058
 -1.131015	 -1.671446	  0.988215
 -1.141832	 -1.684363	  1.001577
 -1.148714	 -1.694464	  1.013634
 -1.159498	 -1.707122	  1.026822
 -1.168261	 -1.720478	  1.041910
 -1.174851	 -1.731427	  1.054182
 -1.180476	 -1.744812	  1.072114
 -1.186405	 -1.758834	  1.089026
 -1.191129	 -1.767369	  1.098197
 -1.199301	 -1.780250	  1.112299
 -1.208572	 -1.793337	  1.125571
 -1.219099	 -1.806766	  1.136565
 -1.229140	 -1.822205	  1.147623
 -1.235984	 -1.837837	  1.160076
 -1.239770	 -1.851258	  1.174891
 -1.244874	 -1.864933	  1.193363
 -1.274975	 -1.888782	  1.211088
 -1.282684	 -1.901974	  1.223993
