  2.052443	 -0.338864	  1.391664
  2.092250	 -0.357455	  1.407888
  2.076037	 -0.348620	  1.400203
  2.059932	 -0.339670	  1.392421
  2.044194	 -0.330374	  1.384303
  2.028900	 -0.320687	  1.375803
  2.013681	 -0.310928	  1.367252
  1.999702	 -0.300082	  1.357926
  1.985724	 -0.289236	  1.348600
  1.971860	 -0.278556	  1.338919
  1.958115	 -0.268047	  1.328887
  1.944371	 -0.257538	  1.318854
  1.930377	 -0.247740	  1.308453
  1.916206	 -0.238512	  1.297775
  1.902034	 -0.229285	  1.287097
  1.887568	 -0.220559	  1.276392
  1.872862	 -0.212263	  1.265672
  1.858156	 -0.203968	  1.254952
  1.842714	 -0.195701	  1.245298
  1.827071	 -0.187134	  1.236249
  1.811818	 -0.174198	  1.236217
  1.796565	 -0.161261	  1.236185
  1.781103	 -0.148593	  1.235503
  1.764965	 -0.137336	  1.231919
  1.748827	 -0.126079	  1.228336
  1.732689	 -0.114821	  1.224753
  1.716346	 -0.103803	  1.221364
  1.699935	 -0.092865	  1.218039
  1.683525	 -0.081927	  1.214715
  1.666756	 -0.071900	  1.210439
  1.649648	 -0.063089	  1.204991
  1.632540	 -0.054278	  1.199544
  1.615432	 -0.045466	  1.194096
  1.597819	 -0.038147	  1.188078
  1.580079	 -0.031284	  1.181899
  1.562292	 -0.022308	  1.183642
  1.544645	 -0.013216	  1.186077
  1.526998	 -0.004125	  1.188511
  1.509360	  0.005007	  1.190859
  1.491727	  0.014162	  1.193158
  1.474098	  0.023332	  1.195418
  1.456579	  0.032901	  1.196648
  1.439059	  0.042470	  1.197877
  1.421606	  0.052199	  1.198725
  1.404275	  0.062178	  1.198951
  1.386944	  0.072158	  1.199178
  1.369801	  0.082453	  1.198820
  1.352713	  0.092833	  1.198301
  1.335715	  0.103352	  1.197665
  1.318990	  0.114274	  1.196684
  1.302264	  0.125197	  1.195703
  1.285843	  0.136467	  1.193883
  1.269544	  0.147860	  1.191751
  1.253277	  0.159286	  1.189548
  1.237593	  0.171220	  1.186147
  1.221908	  0.183155	  1.182746
  1.206482	  0.195330	  1.179032
  1.191411	  0.207814	  1.174908
  1.176339	  0.220297	  1.170783
  1.161919	  0.233399	  1.166267
  1.147537	  0.246536	  1.161730
  1.133155	  0.259583	  1.156941
  1.118783	  0.272451	  1.151662
  1.104411	  0.285318	  1.146382
  1.089974	  0.298106	  1.141087
  1.073507	  0.307884	  1.135323
  1.057040	  0.317663	  1.129558
  1.040574	  0.327441	  1.123794
  1.023702	  0.336430	  1.117915
  1.006466	  0.344623	  1.111934
  0.989229	  0.352816	  1.105953
  0.971907	  0.360893	  1.100062
  0.954526	  0.368890	  1.094235
  0.937137	  0.376887	  1.088433
  0.919670	  0.384899	  1.082891
  0.902203	  0.392911	  1.077348
  0.884895	  0.401685	  1.072505
  0.867608	  0.410542	  1.067739
  0.850791	  0.420533	  1.063575
  0.833983	  0.430546	  1.059423
  0.817281	  0.440587	  1.054926
  0.800607	  0.450635	  1.050340
  0.783934	  0.460683	  1.045754
  0.767109	  0.469864	  1.040041
  0.750279	  0.478999	  1.034270
  0.733449	  0.488133	  1.028499
  0.716610	  0.496392	  1.021554
  0.699789	  0.504334	  1.014205
  0.682969	  0.512275	  1.006856
  0.666478	  0.520107	  0.998687
  0.650266	  0.527843	  0.989894
  0.634055	  0.535579	  0.981100
  0.618350	  0.543859	  0.971890
  0.602767	  0.552262	  0.962587
  0.587184	  0.560983	  0.953581
  0.571611	  0.570076	  0.944933
  0.555937	  0.579238	  0.936542
  0.539987	  0.588591	  0.928920
  0.524015	  0.597960	  0.921362
  0.507755	  0.607544	  0.914746
  0.491496	  0.617128	  0.908129
  0.475040	  0.626933	  0.902380
  0.458558	  0.636768	  0.896757
  0.441879	  0.646776	  0.892102
  0.425138	  0.656843	  0.887813
  0.408254	  0.666948	  0.884233
  0.391285	  0.677071	  0.881140
  0.374256	  0.687237	  0.878555
  0.357175	  0.697440	  0.876523
  0.340087	  0.707703	  0.874888
  0.323006	  0.718073	  0.874054
  0.305937	  0.728475	  0.873375
  0.288929	  0.738997	  0.873308
  0.271921	  0.749520	  0.873241
  0.254989	  0.760160	  0.872924
  0.238074	  0.770825	  0.872555
  0.221154	  0.781476	  0.872039
  0.204223	  0.792023	  0.870593
  0.187292	  0.802571	  0.869147
  0.170370	  0.813093	  0.867437
  0.153520	  0.823481	  0.864576
  0.136670	  0.833868	  0.861715
  0.119874	  0.844255	  0.858553
  0.103283	  0.854620	  0.854395
  0.086692	  0.864986	  0.850236
  0.070238	  0.875482	  0.845866
  0.053970	  0.886147	  0.841218
  0.037701	  0.896812	  0.836569
  0.021668	  0.907778	  0.831807
  0.005673	  0.918792	  0.827027
 -0.010248	  0.929877	  0.822165
 -0.026028	  0.941094	  0.817148
 -0.041807	  0.952312	  0.812130
 -0.057431	  0.963593	  0.806779
 -0.072995	  0.974896	  0.801303
 -0.088558	  0.986195	  0.795812
 -0.104113	  0.997468	  0.790249
 -0.119668	  1.008742	  0.784687
 -0.135395	  1.019946	  0.779478
 -0.151175	  1.031127	  0.774382
 -0.167073	  1.042308	  0.769665
 -0.183074	  1.053484	  0.765300
 -0.199102	  1.064731	  0.761221
 -0.215168	  1.076098	  0.757666
 -0.231233	  1.087502	  0.754221
 -0.247272	  1.099137	  0.751503
 -0.263311	  1.110771	  0.748785
 -0.279328	  1.122611	  0.746975
 -0.295342	  1.134463	  0.745219
 -0.311356	  1.146399	  0.744185
 -0.327368	  1.158351	  0.743302
 -0.343505	  1.170155	  0.742780
 -0.359734	  1.181841	  0.742539
 -0.375963	  1.193527	  0.742299
 -0.392972	  1.204048	  0.742243
 -0.410042	  1.214469	  0.742201
 -0.427112	  1.224891	  0.742159
 -0.444841	  1.234134	  0.741636
 -0.462814	  1.242877	  0.740916
 -0.480787	  1.251620	  0.740196
 -0.498836	  1.260147	  0.738964
 -0.517002	  1.268171	  0.736597
 -0.535169	  1.276195	  0.734230
 -0.553321	  1.284234	  0.731809
 -0.570603	  1.292902	  0.726688
 -0.587884	  1.301570	  0.721567
 -0.605378	  1.310148	  0.717055
 -0.623299	  1.318479	  0.713980
 -0.641378	  1.326695	  0.711609
 -0.659757	  1.334565	  0.711062
 -0.678093	  1.342529	  0.710471
 -0.696057	  1.351268	  0.709511
 -0.714021	  1.360008	  0.708552
 -0.731374	  1.369684	  0.706259
 -0.748504	  1.379643	  0.703545
 -0.765495	  1.389897	  0.701060
 -0.782430	  1.400321	  0.698927
 -0.799386	  1.410898	  0.698147
 -0.816362	  1.421424	  0.699156
 -0.833253	  1.431864	  0.701545
 -0.850127	  1.442278	  0.704156
 -0.866910	  1.452569	  0.707681
 -0.883693	  1.462860	  0.711205
 -0.900476	  1.473151	  0.714730
 -0.917217	  1.483524	  0.718217
 -0.933861	  1.494078	  0.721621
 -0.950504	  1.504632	  0.725026
 -0.967148	  1.515187	  0.728430
 -0.983792	  1.525741	  0.731835
 -1.000350	  1.536467	  0.735117
 -1.016656	  1.547670	  0.738055
 -1.032961	  1.558872	  0.740993
 -1.049267	  1.570075	  0.743931
 -1.065572	  1.581278	  0.746869
 -1.081689	  1.592958	  0.748826
 -1.097733	  1.604786	  0.750462
 -1.113777	  1.616614	  0.752099
 -1.129808	  1.628545	  0.752917
 -1.145728	  1.640621	  0.752076
 -1.161648	  1.652698	  0.751235
 -1.177446	  1.664752	  0.748965
 -1.192990	  1.676697	  0.745005
 -1.208535	  1.688642	  0.741045
 -1.223189	  1.700221	  0.733891
 -1.237796	  1.711777	  0.726604
 -1.251545	  1.722968	  0.717346
 -1.264639	  1.733847	  0.706849
 -1.277733	  1.744726	  0.696351
 -1.289765	  1.755035	  0.684147
 -1.301061	  1.764929	  0.670936
 -1.312358	  1.774822	  0.657726
 -1.323654	  1.784716	  0.644516
 -1.334744	  1.794511	  0.631060
 -1.343986	  1.803370	  0.615694
 -1.353227	  1.812229	  0.600328
 -1.362468	  1.821089	  0.584962
 -1.371710	  1.829948	  0.569596
 -1.380951	  1.838807	  0.554231
 -1.390192	  1.847667	  0.538865
 -1.398079	  1.853954	  0.521594
 -1.405935	  1.860188	  0.504290
 -1.413791	  1.866421	  0.486986
 -1.421648	  1.872654	  0.469683
 -1.429504	  1.878888	  0.452379
 -1.437361	  1.885121	  0.435075
 -1.446890	  1.888962	  0.417916
 -1.456811	  1.892186	  0.400852
 -1.466732	  1.895410	  0.383788
 -1.478784	  1.899816	  0.368448
 -1.494911	  1.906699	  0.358826
 -1.511796	  1.914486	  0.351460
 -1.528865	  1.922473	  0.344764
 -1.546357	  1.930222	  0.338936
 -1.563850	  1.937971	  0.333107
 -1.581361	  1.945641	  0.327231
 -1.599251	  1.950958	  0.320042
 -1.617141	  1.956275	  0.312853
 -1.635030	  1.961592	  0.305663
 -1.652920	  1.966909	  0.298474
 -1.670810	  1.972226	  0.291285
 -1.689603	  1.977545	  0.283457
 -1.707390	  1.982042	  0.275494
