 -3.026702	  0.139941	 -0.019721
 -2.996735	  0.138555	 -0.019526
 -2.942964	  0.133151	 -0.026939
 -2.900122	  0.116949	 -0.049659
 -2.860468	  0.109515	 -0.068153
 -2.812266	  0.092658	 -0.081380
 -2.769621	  0.078725	 -0.093469
 -2.722382	  0.068184	 -0.113195
 -2.673584	  0.053155	 -0.129824
 -2.632274	  0.040339	 -0.149161
 -2.587469	  0.028462	 -0.165421
 -2.538029	  0.015225	 -0.177681
 -2.494824	  0.002507	 -0.194726
 -2.448142	 -0.007952	 -0.213510
 -2.407256	 -0.019691	 -0.227043
 -2.360198	 -0.035982	 -0.241797
 -2.314603	 -0.050514	 -0.262694
 -2.271626	 -0.060974	 -0.277954
 -2.225044	 -0.070536	 -0.292789
 -2.175957	 -0.081661	 -0.308461
 -2.132470	 -0.091707	 -0.325551
 -2.093141	 -0.104508	 -0.339019
 -2.044048	 -0.116481	 -0.360345
 -1.996407	 -0.134484	 -0.377481
 -1.950374	 -0.146841	 -0.390208
 -1.913486	 -0.162737	 -0.407086
 -1.878502	 -0.174369	 -0.436456
 -1.956791	 -0.242775	 -0.674488
 -1.932224	 -0.279293	 -0.754463
 -1.856026	 -0.295166	 -0.795073
 -1.835886	 -0.339486	 -0.832822
 -1.781634	 -0.311999	 -0.827711
 -1.666321	 -0.301782	 -0.691313
 -1.577176	 -0.212404	 -0.608748
 -1.526059	 -0.188930	 -0.634260
 -1.497226	 -0.211805	 -0.695062
 -1.466451	 -0.203121	 -0.732810
 -1.462864	 -0.177175	 -0.770805
 -1.380108	 -0.140217	 -0.865895
 -1.277937	 -0.172604	 -0.890147
 -1.269477	 -0.174316	 -0.890239
 -1.220980	 -0.183918	 -0.927112
 -1.174611	 -0.190803	 -0.961017
 -1.112789	 -0.239151	 -0.949174
 -1.060356	 -0.279690	 -0.927655
 -1.024643	 -0.296606	 -0.919611
 -0.985127	 -0.316598	 -0.912298
 -0.924410	 -0.334375	 -0.911434
 -0.887688	 -0.375794	 -0.912459
 -0.842894	 -0.402019	 -0.878415
 -0.764682	 -0.345429	 -0.758042
 -0.644774	 -0.245485	 -0.720423
 -0.585799	 -0.226310	 -0.748339
 -0.502663	 -0.256915	 -0.675786
 -0.466055	 -0.225157	 -0.771997
 -0.451556	 -0.260025	 -0.847047
 -0.327491	 -0.229576	 -0.666310
 -0.381047	 -0.316466	 -0.864633
 -0.293974	 -0.359238	 -0.823546
 -0.325447	 -0.465788	 -0.913484
 -0.330581	 -0.602942	 -0.976293
 -0.290482	 -0.614242	 -0.995543
 -0.247078	 -0.627597	 -1.008921
 -0.201133	 -0.640791	 -1.026345
 -0.155800	 -0.653694	 -1.043597
 -0.107927	 -0.667538	 -1.060890
 -0.062498	 -0.680079	 -1.080642
 -0.016535	 -0.689929	 -1.093840
  0.031529	 -0.708601	 -1.113371
  0.068830	 -0.718941	 -1.123754
  0.114866	 -0.735744	 -1.138605
  0.163311	 -0.747799	 -1.160755
  0.211770	 -0.757434	 -1.171668
  0.253393	 -0.768680	 -1.193212
  0.298490	 -0.780088	 -1.206491
  0.343968	 -0.793988	 -1.226616
  0.387201	 -0.808932	 -1.240304
  0.429126	 -0.820457	 -1.256411
  0.478034	 -0.837537	 -1.279119
  0.518358	 -0.851186	 -1.289914
  0.565263	 -0.861685	 -1.305220
  0.611590	 -0.870396	 -1.319776
  0.656470	 -0.883358	 -1.337188
  0.705206	 -0.897783	 -1.355763
  0.747620	 -0.906167	 -1.371688
  0.798445	 -0.921358	 -1.386175
  0.841183	 -0.930188	 -1.403503
  0.884902	 -0.943200	 -1.415375
  0.933971	 -0.957442	 -1.434976
  0.979178	 -0.972456	 -1.451619
  1.017060	 -0.987579	 -1.466872
  1.062130	 -1.004080	 -1.484677
  1.107772	 -1.014319	 -1.499031
  1.157584	 -1.026372	 -1.516677
  1.195442	 -1.036143	 -1.534989
  1.246902	 -1.052875	 -1.552913
  1.288357	 -1.061963	 -1.566666
  1.329104	 -1.076858	 -1.585628
  1.381986	 -1.094244	 -1.605125
  1.422024	 -1.105066	 -1.615702
  1.466141	 -1.109825	 -1.633546
  1.511609	 -1.131283	 -1.648892
  1.562851	 -1.142923	 -1.663072
  1.606535	 -1.149346	 -1.683619
  1.653636	 -1.168534	 -1.698913
  1.698848	 -1.172262	 -1.712374
  1.739870	 -1.191883	 -1.728626
  1.785519	 -1.205045	 -1.748479
  1.826010	 -1.215427	 -1.761675
  1.879001	 -1.231964	 -1.776577
  1.920367	 -1.239587	 -1.795195
  1.963255	 -1.256488	 -1.811793
  2.004973	 -1.271065	 -1.834252
  2.025022	 -1.283776	 -1.852594
