 -2.151821	 -0.285037	 -1.129916
 -2.189803	 -0.311992	 -1.141357
 -2.173902	 -0.300738	 -1.136841
 -2.158603	 -0.288827	 -1.133149
 -2.144022	 -0.274440	 -1.130867
 -2.128807	 -0.260753	 -1.126970
 -2.112276	 -0.250567	 -1.121030
 -2.095030	 -0.244219	 -1.114514
 -2.078329	 -0.234304	 -1.109780
 -2.063262	 -0.220572	 -1.107701
 -2.047860	 -0.205439	 -1.104625
 -2.031394	 -0.193704	 -1.098603
 -2.014489	 -0.189670	 -1.091278
 -1.996130	 -0.182189	 -1.085910
 -1.978354	 -0.173541	 -1.080474
 -1.961012	 -0.165314	 -1.074987
 -1.944205	 -0.156027	 -1.070162
 -1.929731	 -0.144468	 -1.065780
 -1.913051	 -0.130673	 -1.059613
 -1.896120	 -0.121626	 -1.053040
 -1.876992	 -0.116797	 -1.047445
 -1.860858	 -0.108905	 -1.042567
 -1.845794	 -0.096705	 -1.035212
 -1.828372	 -0.088408	 -1.027240
 -1.811247	 -0.081460	 -1.023457
 -1.796125	 -0.069075	 -1.017843
 -1.781301	 -0.056962	 -1.006290
 -1.763661	 -0.052077	 -0.999231
 -1.746822	 -0.043826	 -0.996793
 -1.730067	 -0.031549	 -0.994474
 -1.709811	 -0.023427	 -0.986135
 -1.693050	 -0.019383	 -0.974259
 -1.679929	 -0.010201	 -0.964864
 -1.666605	  0.002564	 -0.957458
 -1.652915	  0.013608	 -0.949645
 -1.636288	  0.024705	 -0.942032
 -1.619406	  0.036187	 -0.938169
 -1.602236	  0.049107	 -0.935525
 -1.587452	  0.059530	 -0.929207
 -1.571974	  0.066841	 -0.920216
 -1.557335	  0.076996	 -0.909786
 -1.545310	  0.093189	 -0.897452
 -1.536629	  0.104664	 -0.886558
 -1.521707	  0.113889	 -0.876555
 -1.501686	  0.121112	 -0.871497
 -1.481804	  0.129636	 -0.866782
 -1.468725	  0.144602	 -0.859824
 -1.458394	  0.159988	 -0.848709
 -1.446659	  0.169005	 -0.837199
 -1.431184	  0.174236	 -0.825229
 -1.417067	  0.180065	 -0.815858
 -1.396122	  0.192275	 -0.805500
 -1.380566	  0.203685	 -0.798437
 -1.368715	  0.215880	 -0.796273
 -1.356117	  0.232785	 -0.785927
 -1.343603	  0.247322	 -0.771605
 -1.334593	  0.253391	 -0.760919
 -1.318338	  0.258966	 -0.747699
 -1.300644	  0.261999	 -0.732342
 -1.286388	  0.267858	 -0.719153
 -1.274816	  0.273780	 -0.705854
 -1.260698	  0.284349	 -0.695037
 -1.247105	  0.293881	 -0.685989
 -1.231928	  0.298344	 -0.673621
 -1.216834	  0.304678	 -0.657554
 -1.204740	  0.314089	 -0.639306
 -1.194694	  0.322891	 -0.626816
 -1.184159	  0.334441	 -0.613561
 -1.164605	  0.344347	 -0.606678
 -1.149648	  0.351519	 -0.602076
 -1.130121	  0.361078	 -0.596487
 -1.117041	  0.369679	 -0.586242
 -1.102722	  0.378619	 -0.572033
 -1.087591	  0.385679	 -0.562612
 -1.069979	  0.391330	 -0.555030
 -1.052529	  0.397299	 -0.546263
 -1.037721	  0.403889	 -0.534260
 -1.023658	  0.413695	 -0.521339
 -1.009124	  0.426102	 -0.513221
 -0.991893	  0.436432	 -0.510703
 -0.973614	  0.444641	 -0.506629
 -0.956468	  0.447972	 -0.496739
 -0.941343	  0.454658	 -0.482167
 -0.929020	  0.463945	 -0.472919
 -0.915755	  0.479054	 -0.467623
 -0.896603	  0.501297	 -0.458533
 -0.881802	  0.508842	 -0.452833
 -0.868269	  0.510562	 -0.448028
 -0.848746	  0.515213	 -0.438125
 -0.834457	  0.527878	 -0.431697
 -0.822378	  0.543497	 -0.427239
 -0.801935	  0.559653	 -0.419575
 -0.786017	  0.564074	 -0.414746
 -0.769470	  0.566672	 -0.406346
 -0.752500	  0.576920	 -0.395200
 -0.736950	  0.588954	 -0.389492
 -0.719771	  0.595175	 -0.384270
 -0.702456	  0.601164	 -0.376468
 -0.686870	  0.609541	 -0.371760
 -0.669514	  0.623063	 -0.367356
 -0.650797	  0.635818	 -0.355775
 -0.636620	  0.639676	 -0.344437
 -0.621932	  0.639945	 -0.334358
 -0.603575	  0.642702	 -0.322732
 -0.585097	  0.649566	 -0.311779
 -0.566513	  0.650461	 -0.308245
 -0.548080	  0.649950	 -0.302825
 -0.525925	  0.650782	 -0.295687
 -0.510515	  0.654999	 -0.286612
 -0.493874	  0.657004	 -0.276879
 -0.473872	  0.656772	 -0.269185
 -0.457840	  0.657984	 -0.259217
 -0.440789	  0.656985	 -0.246166
 -0.421964	  0.653666	 -0.237576
 -0.404529	  0.651198	 -0.232253
 -0.386466	  0.651000	 -0.224702
 -0.364513	  0.655759	 -0.216637
 -0.347602	  0.659740	 -0.211504
 -0.327529	  0.659577	 -0.205663
 -0.309277	  0.656718	 -0.197313
 -0.295308	  0.658714	 -0.189416
 -0.272055	  0.667270	 -0.183145
 -0.252186	  0.668170	 -0.182074
 -0.228302	  0.669912	 -0.179947
 -0.213242	  0.674775	 -0.177150
 -0.193526	  0.686949	 -0.167337
 -0.177590	  0.691368	 -0.159316
 -0.161659	  0.688399	 -0.153956
 -0.136861	  0.687121	 -0.149261
 -0.117034	  0.691417	 -0.142103
 -0.104966	  0.694146	 -0.136317
 -0.083793	  0.696820	 -0.126377
 -0.063887	  0.703007	 -0.116441
 -0.052429	  0.710034	 -0.109996
 -0.034500	  0.717223	 -0.102431
 -0.014199	  0.718770	 -0.092921
  0.004369	  0.721005	 -0.082031
  0.019664	  0.725155	 -0.072712
  0.036708	  0.736530	 -0.066838
  0.053273	  0.746598	 -0.062111
  0.073006	  0.754119	 -0.053013
  0.088901	  0.758344	 -0.045116
  0.105984	  0.764711	 -0.038383
  0.120516	  0.775294	 -0.033122
  0.136825	  0.789954	 -0.027125
  0.156600	  0.800253	 -0.023194
  0.173054	  0.807394	 -0.020794
  0.188475	  0.815613	 -0.023064
  0.210879	  0.829635	 -0.026055
  0.224411	  0.838903	 -0.026191
  0.243436	  0.850046	 -0.021173
  0.259282	  0.857550	 -0.014808
  0.275054	  0.863223	 -0.014457
  0.296725	  0.871851	 -0.020471
  0.314892	  0.880032	 -0.020793
  0.329091	  0.886364	 -0.017977
  0.347046	  0.893041	 -0.012056
  0.374038	  0.899586	 -0.008208
  0.396558	  0.902839	 -0.005817
  0.417173	  0.901032	 -0.008506
  0.432689	  0.905795	 -0.010768
  0.454243	  0.905252	 -0.016764
  0.472665	  0.911701	 -0.026736
  0.494753	  0.917260	 -0.039100
  0.502571	  0.922365	 -0.044764
  0.523586	  0.924135	 -0.051666
  0.543039	  0.922690	 -0.053342
  0.567882	  0.915300	 -0.054402
  0.588164	  0.912184	 -0.056670
  0.605170	  0.911653	 -0.058802
  0.626006	  0.916382	 -0.058207
  0.646366	  0.921428	 -0.058008
  0.666081	  0.922897	 -0.058807
  0.686209	  0.919931	 -0.061801
  0.705048	  0.918772	 -0.066597
  0.723748	  0.919385	 -0.072950
  0.743310	  0.925340	 -0.079511
  0.763553	  0.932478	 -0.082383
  0.784497	  0.936091	 -0.082447
  0.805960	  0.934085	 -0.080506
  0.826810	  0.931540	 -0.080833
  0.843306	  0.926584	 -0.082030
  0.863288	  0.926903	 -0.086355
  0.883728	  0.921081	 -0.091970
  0.908708	  0.923550	 -0.092905
  0.925889	  0.926565	 -0.092698
  0.943742	  0.934726	 -0.083945
  0.964638	  0.943130	 -0.075869
  0.980408	  0.949314	 -0.071834
  1.000294	  0.949785	 -0.070089
  1.022417	  0.949266	 -0.068784
  1.043768	  0.950897	 -0.069109
  1.061491	  0.956344	 -0.068022
  1.072712	  0.970731	 -0.063633
  1.094181	  0.988053	 -0.062052
  1.103978	  1.003276	 -0.059047
  1.119867	  1.016580	 -0.059114
  1.141439	  1.019270	 -0.052873
  1.157324	  1.031518	 -0.050546
  1.177002	  1.036810	 -0.039432
  1.195348	  1.043827	 -0.034505
  1.210795	  1.057359	 -0.032101
  1.224597	  1.070437	 -0.029144
  1.228671	  1.090298	 -0.031080
  1.244946	  1.105493	 -0.027785
  1.253658	  1.128915	 -0.024045
  1.265452	  1.142662	 -0.019391
  1.269499	  1.158640	 -0.016022
  1.273245	  1.178400	 -0.013461
  1.276029	  1.200239	 -0.012023
  1.277707	  1.223592	 -0.012232
  1.279929	  1.237860	 -0.011323
  1.286213	  1.256055	 -0.011686
  1.294354	  1.278285	 -0.013751
  1.299424	  1.297132	 -0.016115
  1.303097	  1.318368	 -0.014736
  1.299629	  1.337249	 -0.008106
  1.301754	  1.357908	 -0.005575
  1.297947	  1.376887	 -0.002526
  1.301659	  1.390259	 -0.003290
  1.301385	  1.415508	  0.002701
  1.307381	  1.434118	  0.008325
  1.312993	  1.454875	  0.015229
  1.316610	  1.472378	  0.016654
  1.316985	  1.492977	  0.015416
  1.317454	  1.515932	  0.009763
  1.317771	  1.532078	  0.006173
  1.314958	  1.551641	  0.010125
  1.310417	  1.571496	  0.017911
  1.309755	  1.594672	  0.027114
  1.306564	  1.612859	  0.037256
  1.301489	  1.624923	  0.044485
  1.291381	  1.643193	  0.049385
  1.284135	  1.663304	  0.050699
  1.281854	  1.685838	  0.050201
  1.281353	  1.706638	  0.052965
  1.276351	  1.722869	  0.060437
  1.265400	  1.738274	  0.069238
  1.253653	  1.754023	  0.076097
  1.243878	  1.770704	  0.081376
  1.236642	  1.788605	  0.086368
  1.230168	  1.807996	  0.092321
  1.223362	  1.824412	  0.099792
  1.215219	  1.840085	  0.107792
  1.206533	  1.856313	  0.115809
  1.197585	  1.870083	  0.126254
  1.186443	  1.881980	  0.138268
  1.178258	  1.892197	  0.151816
  1.177074	  1.898417	  0.170505
  1.176170	  1.901210	  0.177154
  1.170217	  1.909558	  0.190874
  1.170342	  1.909999	  0.211019
  1.172522	  1.907183	  0.232669
  1.179569	  1.903571	  0.251828
  1.189319	  1.901098	  0.268827
  1.198221	  1.899264	  0.286468
  1.206593	  1.895537	  0.305483
  1.219376	  1.888341	  0.323154
  1.231804	  1.886624	  0.335590
  1.245751	  1.888860	  0.350249
  1.264250	  1.887881	  0.364616
  1.279790	  1.881923	  0.378584
  1.288869	  1.878176	  0.391071
  1.300256	  1.877731	  0.410062
  1.311524	  1.879410	  0.425883
  1.325102	  1.880699	  0.441762
  1.338905	  1.881862	  0.456378
  1.353846	  1.882734	  0.469824
  1.367553	  1.884995	  0.484220
  1.382676	  1.887707	  0.497365
  1.397378	  1.890964	  0.510741
  1.412970	  1.895334	  0.522643
  1.427627	  1.900747	  0.535588
  1.444247	  1.906031	  0.546880
  1.461514	  1.911102	  0.555929
  1.480934	  1.915371	  0.558894
  1.496981	  1.922006	  0.568817
