 -1.768080	 -1.578679	 -0.326773
 -1.787905	 -1.574849	 -0.342188
 -1.807730	 -1.571019	 -0.357603
 -1.792781	 -1.572835	 -0.346146
 -1.775783	 -1.576510	 -0.335041
 -1.758234	 -1.578588	 -0.323868
 -1.743832	 -1.581740	 -0.311207
 -1.728823	 -1.585743	 -0.297133
 -1.712161	 -1.588424	 -0.286247
 -1.694685	 -1.591411	 -0.279527
 -1.674510	 -1.596350	 -0.272227
 -1.655562	 -1.598013	 -0.262615
 -1.642375	 -1.603580	 -0.253429
 -1.624945	 -1.611936	 -0.244675
 -1.608615	 -1.620548	 -0.237035
 -1.591326	 -1.627871	 -0.229259
 -1.574375	 -1.634865	 -0.221369
 -1.557786	 -1.642215	 -0.214444
 -1.540009	 -1.651274	 -0.207267
 -1.523988	 -1.660382	 -0.199410
 -1.506881	 -1.663504	 -0.187094
 -1.490707	 -1.663885	 -0.175510
 -1.474425	 -1.667706	 -0.164524
 -1.458493	 -1.672345	 -0.153391
 -1.442642	 -1.673739	 -0.141524
 -1.426740	 -1.676146	 -0.128610
 -1.411598	 -1.680609	 -0.117040
 -1.395923	 -1.681867	 -0.104809
 -1.380547	 -1.683008	 -0.090928
 -1.365789	 -1.688679	 -0.077581
 -1.351905	 -1.692445	 -0.066094
 -1.335037	 -1.691484	 -0.053919
 -1.318776	 -1.689019	 -0.041790
 -1.304730	 -1.689562	 -0.026755
 -1.292628	 -1.691012	 -0.010841
 -1.278474	 -1.695564	  0.005302
 -1.262328	 -1.697070	  0.014877
 -1.245882	 -1.695335	  0.025700
 -1.227729	 -1.695551	  0.037662
 -1.215428	 -1.699247	  0.052257
 -1.201356	 -1.701095	  0.066703
 -1.187619	 -1.702849	  0.081258
 -1.174307	 -1.706010	  0.096430
 -1.162133	 -1.709236	  0.111731
 -1.148768	 -1.712049	  0.126549
 -1.135439	 -1.715378	  0.141101
 -1.122119	 -1.718706	  0.155644
 -1.108115	 -1.722221	  0.169483
 -1.093467	 -1.725912	  0.182591
 -1.076516	 -1.729744	  0.192490
 -1.058872	 -1.734130	  0.200823
 -1.040701	 -1.739540	  0.207188
 -1.022526	 -1.744951	  0.213546
 -1.005010	 -1.750592	  0.221379
 -0.988407	 -1.756698	  0.230391
 -0.972112	 -1.764242	  0.238796
 -0.956117	 -1.771880	  0.248149
 -0.942202	 -1.778585	  0.261161
 -0.928204	 -1.782668	  0.276837
 -0.915163	 -1.780252	  0.295023
 -0.902470	 -1.782001	  0.309441
 -0.887795	 -1.784846	  0.319496
 -0.873178	 -1.789398	  0.333784
 -0.861999	 -1.792075	  0.351659
 -0.851116	 -1.796205	  0.366539
 -0.837627	 -1.800448	  0.381396
 -0.823568	 -1.802475	  0.396578
 -0.812131	 -1.808628	  0.410322
 -0.801525	 -1.817982	  0.425402
 -0.790397	 -1.825958	  0.442821
 -0.777610	 -1.825618	  0.458699
 -0.761058	 -1.833150	  0.464481
 -0.745988	 -1.843948	  0.472050
 -0.724106	 -1.843838	  0.491955
 -0.709488	 -1.841328	  0.505009
 -0.699680	 -1.846508	  0.513492
 -0.682696	 -1.856996	  0.525001
 -0.664639	 -1.861998	  0.534212
 -0.646917	 -1.867429	  0.541499
 -0.632184	 -1.875508	  0.550204
 -0.613837	 -1.882538	  0.562492
 -0.597196	 -1.884694	  0.570629
 -0.579648	 -1.893913	  0.579077
 -0.564502	 -1.897898	  0.588341
 -0.548379	 -1.904424	  0.598391
 -0.532780	 -1.912685	  0.608918
 -0.515942	 -1.916174	  0.619351
 -0.494084	 -1.915161	  0.627833
 -0.480726	 -1.919017	  0.639044
 -0.467440	 -1.927644	  0.650141
 -0.448936	 -1.933386	  0.662772
 -0.437438	 -1.938310	  0.678133
 -0.424815	 -1.939496	  0.693381
 -0.407444	 -1.943246	  0.704985
 -0.390499	 -1.947428	  0.713226
 -0.372097	 -1.951077	  0.721940
 -0.355821	 -1.954826	  0.734253
 -0.342784	 -1.956082	  0.748299
 -0.327580	 -1.957949	  0.762698
 -0.312457	 -1.963000	  0.774660
 -0.297313	 -1.969235	  0.784904
 -0.282239	 -1.975595	  0.799123
 -0.269990	 -1.979959	  0.813617
 -0.256778	 -1.983304	  0.827284
 -0.240717	 -1.987915	  0.839664
 -0.222782	 -1.987139	  0.848539
 -0.200618	 -1.988247	  0.856368
 -0.185730	 -1.994970	  0.870005
 -0.175212	 -2.000783	  0.885920
 -0.163034	 -2.009221	  0.899098
 -0.148349	 -2.016307	  0.910792
 -0.134334	 -2.024187	  0.923005
 -0.120749	 -2.035467	  0.935817
 -0.104381	 -2.039667	  0.944380
 -0.087597	 -2.041360	  0.955121
 -0.066891	 -2.047493	  0.963381
 -0.051730	 -2.053999	  0.971825
 -0.037425	 -2.060973	  0.983941
 -0.023077	 -2.065142	  0.996894
 -0.005116	 -2.069968	  1.010665
  0.010203	 -2.072152	  1.019994
  0.032842	 -2.066184	  1.027471
  0.052785	 -2.055928	  1.032802
  0.069096	 -2.054154	  1.041894
  0.085665	 -2.056455	  1.054734
  0.101810	 -2.057944	  1.064839
  0.121241	 -2.058704	  1.071783
  0.138742	 -2.060051	  1.081500
  0.156601	 -2.061326	  1.091769
  0.173693	 -2.057996	  1.104582
  0.185754	 -2.057967	  1.118959
  0.202678	 -2.061909	  1.130923
  0.218105	 -2.067867	  1.142573
  0.235344	 -2.071800	  1.153967
  0.252636	 -2.069900	  1.164678
  0.268459	 -2.065014	  1.179193
  0.280843	 -2.066054	  1.193049
  0.295856	 -2.074621	  1.206772
  0.312122	 -2.077455	  1.218058
  0.328388	 -2.080289	  1.229344
