 -1.461119	  1.640095	 -1.308006
 -1.548786	  1.641760	 -1.293131
 -1.529309	  1.641907	 -1.296641
 -1.510565	  1.644098	 -1.302347
 -1.492062	  1.645564	 -1.312161
 -1.473232	  1.645930	 -1.321126
 -1.453692	  1.649143	 -1.325312
 -1.435349	  1.651589	 -1.329679
 -1.415238	  1.652383	 -1.336910
 -1.395485	  1.655893	 -1.340315
 -1.377323	  1.658994	 -1.343718
 -1.356933	  1.660848	 -1.351502
 -1.337007	  1.665467	 -1.355090
 -1.319689	  1.670024	 -1.356495
 -1.297639	  1.674458	 -1.364520
 -1.273311	  1.679539	 -1.362969
 -1.257480	  1.681618	 -1.354379
 -1.238319	  1.683669	 -1.346959
 -1.217454	  1.687295	 -1.345360
 -1.197562	  1.690974	 -1.346247
 -1.177944	  1.695111	 -1.346513
 -1.158403	  1.699356	 -1.346103
 -1.138948	  1.703767	 -1.345798
 -1.121955	  1.713016	 -1.349176
 -1.113055	  1.728508	 -1.357865
 -1.104691	  1.744029	 -1.367680
 -1.098480	  1.760042	 -1.378142
 -1.092520	  1.777682	 -1.386580
 -1.087879	  1.796355	 -1.391930
 -1.084144	  1.814900	 -1.398452
 -1.080867	  1.833892	 -1.404304
 -1.076882	  1.852516	 -1.410668
 -1.071794	  1.870411	 -1.417528
 -1.066842	  1.888001	 -1.424113
 -1.062622	  1.906083	 -1.431543
