 -2.402795	 -0.661148	 -0.412709
 -2.419036	 -0.697618	 -0.421515
 -2.429012	 -0.675012	 -0.411767
 -2.417586	 -0.656715	 -0.408225
 -2.401407	 -0.645221	 -0.398464
 -2.388978	 -0.632634	 -0.390845
 -2.379066	 -0.610273	 -0.383657
 -2.369496	 -0.590490	 -0.376612
 -2.361746	 -0.577757	 -0.372404
 -2.352191	 -0.563899	 -0.370597
 -2.338686	 -0.544533	 -0.368508
 -2.326646	 -0.527827	 -0.365572
 -2.316805	 -0.515266	 -0.363413
 -2.300351	 -0.495310	 -0.360735
 -2.289349	 -0.483200	 -0.355290
 -2.278935	 -0.472608	 -0.347215
 -2.262433	 -0.457629	 -0.333139
 -2.248428	 -0.440196	 -0.325517
 -2.241589	 -0.427279	 -0.324612
 -2.233899	 -0.408104	 -0.328140
 -2.227013	 -0.387812	 -0.323056
 -2.220730	 -0.367709	 -0.313181
 -2.205781	 -0.355471	 -0.308248
 -2.187348	 -0.343509	 -0.304155
 -2.172127	 -0.330894	 -0.299354
 -2.165008	 -0.312058	 -0.289015
 -2.157454	 -0.296785	 -0.286305
 -2.144900	 -0.275788	 -0.284367
 -2.139147	 -0.258818	 -0.276723
 -2.139989	 -0.240666	 -0.265951
 -2.141514	 -0.218673	 -0.253170
 -2.133100	 -0.201407	 -0.244719
 -2.124623	 -0.189746	 -0.240495
 -2.111241	 -0.168590	 -0.229990
 -2.100590	 -0.152048	 -0.221338
 -2.089672	 -0.141675	 -0.220346
 -2.078040	 -0.118976	 -0.231075
 -2.067817	 -0.096286	 -0.233172
 -2.058212	 -0.082592	 -0.228554
 -2.043593	 -0.071128	 -0.213739
 -2.028686	 -0.058012	 -0.205126
 -2.019374	 -0.040476	 -0.205993
 -2.007972	 -0.025369	 -0.207409
 -1.994998	 -0.010361	 -0.208248
 -1.980481	  0.002260	 -0.205931
 -1.966206	  0.018844	 -0.195252
 -1.957285	  0.035848	 -0.188687
 -1.950589	  0.052337	 -0.183909
 -1.941702	  0.065738	 -0.180803
 -1.929164	  0.082708	 -0.172791
 -1.922356	  0.101384	 -0.163654
 -1.919755	  0.118186	 -0.161066
 -1.926491	  0.130661	 -0.166989
 -1.939779	  0.142165	 -0.174297
 -1.953549	  0.171732	 -0.182757
 -1.961573	  0.188859	 -0.189787
 -1.965737	  0.201948	 -0.195912
 -1.971230	  0.220091	 -0.208074
 -1.978843	  0.237255	 -0.214878
 -1.985405	  0.251804	 -0.223701
 -1.991012	  0.263721	 -0.238103
 -1.998806	  0.271753	 -0.253741
 -2.014994	  0.280711	 -0.271718
 -2.028411	  0.288732	 -0.286873
 -2.036744	  0.295467	 -0.301510
 -2.052543	  0.310084	 -0.312012
 -2.058976	  0.333291	 -0.313049
 -2.050310	  0.367927	 -0.321687
 -2.047881	  0.380124	 -0.326064
 -2.044556	  0.395182	 -0.330234
 -2.043375	  0.422893	 -0.336121
 -2.045183	  0.438072	 -0.338015
 -2.047212	  0.454707	 -0.341165
 -2.044849	  0.480796	 -0.345430
 -2.041914	  0.496139	 -0.346420
 -2.038964	  0.512080	 -0.349176
 -2.034181	  0.535355	 -0.351636
 -2.031433	  0.552256	 -0.351939
 -2.027823	  0.572524	 -0.354150
 -2.025182	  0.595079	 -0.351695
 -2.019610	  0.613452	 -0.345230
 -2.006689	  0.628042	 -0.344903
 -1.999462	  0.649157	 -0.349562
 -2.003773	  0.670095	 -0.353601
 -2.005377	  0.687667	 -0.351909
 -1.995172	  0.698185	 -0.339543
 -1.980290	  0.714584	 -0.334470
 -1.974273	  0.744357	 -0.335148
 -1.976032	  0.767893	 -0.327607
 -1.979547	  0.784153	 -0.314036
 -1.975513	  0.793054	 -0.302865
 -1.960238	  0.807718	 -0.294945
 -1.948184	  0.828412	 -0.288442
 -1.948271	  0.845754	 -0.273490
 -1.945636	  0.855572	 -0.256957
 -1.937421	  0.864486	 -0.239318
 -1.927461	  0.872296	 -0.221218
 -1.916579	  0.879520	 -0.202933
 -1.902886	  0.888728	 -0.192214
 -1.885039	  0.901861	 -0.185847
 -1.873299	  0.913119	 -0.179767
 -1.865349	  0.929739	 -0.167787
 -1.863893	  0.941132	 -0.150411
 -1.857098	  0.948213	 -0.131563
 -1.838595	  0.951203	 -0.113866
 -1.825043	  0.960174	 -0.105405
 -1.812551	  0.975611	 -0.102348
 -1.800408	  0.990593	 -0.096329
 -1.780539	  0.998115	 -0.084799
 -1.764613	  1.002937	 -0.076375
 -1.750587	  1.014651	 -0.070316
 -1.733295	  1.027502	 -0.064430
 -1.712209	  1.033122	 -0.058944
 -1.697926	  1.039860	 -0.053007
 -1.682996	  1.052447	 -0.045434
 -1.657844	  1.058697	 -0.037110
 -1.639071	  1.054604	 -0.023361
 -1.628282	  1.043365	 -0.007182
 -1.614559	  1.036114	  0.005530
 -1.592516	  1.025095	  0.017838
 -1.581535	  1.014820	  0.027448
 -1.574177	  1.003533	  0.044899
 -1.572567	  1.001933	  0.059914
 -1.569405	  0.991556	  0.071331
 -1.564666	  0.969646	  0.086002
 -1.548019	  0.956476	  0.097286
 -1.523756	  0.952578	  0.104471
 -1.503819	  0.954785	  0.115155
 -1.490994	  0.953460	  0.126260
 -1.481811	  0.957918	  0.133504
 -1.471158	  0.961555	  0.140423
 -1.460163	  0.974107	  0.149479
 -1.452054	  0.991345	  0.160212
 -1.444125	  1.007808	  0.168331
 -1.435306	  1.023014	  0.171605
 -1.426327	  1.039551	  0.175521
 -1.409974	  1.065720	  0.185855
 -1.404601	  1.076166	  0.188867
 -1.396548	  1.088694	  0.190699
 -1.381892	  1.104276	  0.190897
 -1.362850	  1.125757	  0.195845
 -1.354959	  1.146485	  0.197464
 -1.350085	  1.158639	  0.196977
 -1.343298	  1.175799	  0.196964
 -1.333570	  1.203667	  0.184300
 -1.328560	  1.214521	  0.176624
 -1.324025	  1.226815	  0.169561
 -1.307271	  1.258202	  0.169086
 -1.300217	  1.269714	  0.173035
 -1.292185	  1.280002	  0.175087
 -1.285619	  1.301895	  0.177828
 -1.277624	  1.323138	  0.179101
 -1.269657	  1.341517	  0.180363
 -1.263182	  1.359502	  0.185691
 -1.257440	  1.377688	  0.192979
 -1.251065	  1.395512	  0.199992
 -1.243921	  1.412422	  0.206646
 -1.235998	  1.429564	  0.212949
 -1.226887	  1.446708	  0.217749
 -1.216406	  1.464325	  0.221363
 -1.205412	  1.481694	  0.224393
 -1.195259	  1.498682	  0.228229
 -1.186252	  1.515003	  0.232702
 -1.176087	  1.531683	  0.237543
 -1.163573	  1.547276	  0.237863
 -1.150028	  1.563389	  0.237181
 -1.137483	  1.578431	  0.240710
 -1.123139	  1.590787	  0.248509
 -1.106690	  1.601445	  0.255685
 -1.089907	  1.617028	  0.258850
 -1.078118	  1.637580	  0.261636
 -1.072283	  1.658526	  0.269430
 -1.069144	  1.672630	  0.281534
 -1.060201	  1.681075	  0.294513
 -1.048995	  1.699364	  0.306920
 -1.035411	  1.724321	  0.323520
 -1.032833	  1.728829	  0.328546
 -1.028333	  1.739817	  0.337675
 -1.023792	  1.754937	  0.356783
 -1.019543	  1.772823	  0.372546
 -1.016113	  1.784970	  0.378560
 -1.010034	  1.805485	  0.386508
 -1.001996	  1.822039	  0.394169
 -0.994510	  1.834955	  0.400841
 -0.984972	  1.849568	  0.411511
 -0.979475	  1.866162	  0.420955
 -0.973063	  1.883542	  0.427276
 -0.955890	  1.908085	  0.428369
 -0.944911	  1.923117	  0.425890
 -0.934304	  1.937791	  0.424365
 -0.925681	  1.952432	  0.429903
 -0.909046	  1.970457	  0.442522
 -0.901157	  1.984129	  0.448941
 -0.896624	  1.999485	  0.454064
 -0.888510	  2.025354	  0.471625
 -0.885293	  2.041041	  0.483892
 -0.887428	  2.051012	  0.488979
 -0.889346	  2.074869	  0.495834
 -0.881339	  2.096015	  0.505367
 -0.870316	  2.110423	  0.514864
 -0.861099	  2.124389	  0.521819
 -0.846435	  2.144397	  0.527994
 -0.829958	  2.158742	  0.533296
 -0.814645	  2.170317	  0.540366
 -0.797622	  2.178685	  0.548651
 -0.782295	  2.189616	  0.557311
 -0.772202	  2.201276	  0.565513
 -0.762808	  2.214532	  0.575407
 -0.746270	  2.228279	  0.584661
 -0.725528	  2.245961	  0.587530
 -0.716941	  2.254547	  0.586903
 -0.707466	  2.274319	  0.584531
 -0.696490	  2.295019	  0.587848
 -0.684277	  2.309678	  0.595527
 -0.672106	  2.321800	  0.606656
 -0.661998	  2.334802	  0.617316
 -0.652377	  2.352102	  0.625333
 -0.641568	  2.368440	  0.627914
 -0.617759	  2.380342	  0.621475
 -0.608085	  2.397491	  0.624986
