  0.983190	  1.081884	  1.876359
  0.999161	  1.095202	  1.884500
  0.984857	  1.083275	  1.877209
  0.970300	  1.071578	  1.870049
  0.954566	  1.061070	  1.863569
  0.938829	  1.050563	  1.857091
  0.923303	  1.039678	  1.850832
  0.907704	  1.028676	  1.845250
  0.892147	  1.016545	  1.839861
  0.877425	  1.003989	  1.834664
  0.864192	  0.990249	  1.829325
  0.852964	  0.973203	  1.822553
  0.841877	  0.958569	  1.815867
  0.829202	  0.945522	  1.808501
  0.814687	  0.933693	  1.802406
  0.800125	  0.918724	  1.797559
  0.789493	  0.901234	  1.792734
  0.777206	  0.890259	  1.784801
  0.761467	  0.879409	  1.777052
  0.746624	  0.867896	  1.768594
  0.733055	  0.855208	  1.760693
  0.718907	  0.841859	  1.755823
  0.703130	  0.830810	  1.751234
  0.687220	  0.819467	  1.746193
  0.673559	  0.806318	  1.738954
  0.660929	  0.793630	  1.729983
  0.649107	  0.782697	  1.718637
  0.637079	  0.771500	  1.706252
  0.627870	  0.756612	  1.694669
  0.618394	  0.741625	  1.685905
  0.606360	  0.728541	  1.676406
  0.593250	  0.718621	  1.666940
  0.580415	  0.706468	  1.655922
  0.569060	  0.694425	  1.644672
  0.558198	  0.683598	  1.632255
  0.547452	  0.671648	  1.619050
  0.538679	  0.659788	  1.605690
  0.529280	  0.644875	  1.594367
  0.518992	  0.630291	  1.585849
  0.507918	  0.615879	  1.576515
  0.495042	  0.603976	  1.568330
  0.482315	  0.591359	  1.558642
  0.470862	  0.578509	  1.549269
  0.460848	  0.565148	  1.540342
  0.447723	  0.549292	  1.527985
  0.436454	  0.537421	  1.516257
  0.426029	  0.526345	  1.509385
  0.411950	  0.512838	  1.501901
  0.399144	  0.499505	  1.493119
  0.390729	  0.484838	  1.481093
  0.380302	  0.471096	  1.469724
  0.366256	  0.459846	  1.462653
  0.350497	  0.448848	  1.457931
  0.334537	  0.434540	  1.450255
  0.326689	  0.419628	  1.439748
  0.317748	  0.401417	  1.431979
  0.305581	  0.385389	  1.426845
  0.288822	  0.372886	  1.425836
  0.270961	  0.364531	  1.424139
  0.254180	  0.353327	  1.418323
  0.239452	  0.342224	  1.411745
  0.224725	  0.328299	  1.407313
  0.209455	  0.314462	  1.404271
  0.196239	  0.301629	  1.399678
  0.183092	  0.287645	  1.393794
  0.171830	  0.271952	  1.387306
  0.160765	  0.256325	  1.380841
  0.149184	  0.240492	  1.375231
  0.135973	  0.227127	  1.368888
  0.121862	  0.215547	  1.360742
  0.107844	  0.204464	  1.350932
  0.091605	  0.194992	  1.342265
  0.075794	  0.181388	  1.337930
  0.065446	  0.166097	  1.331231
  0.051181	  0.151149	  1.326787
  0.036195	  0.137898	  1.322764
  0.019816	  0.129526	  1.317027
  0.002170	  0.117776	  1.310408
 -0.014262	  0.108475	  1.306526
 -0.030003	  0.102058	  1.296665
 -0.046801	  0.095752	  1.284999
 -0.061722	  0.085418	  1.279207
 -0.076467	  0.066189	  1.279076
 -0.090242	  0.049862	  1.275386
 -0.105091	  0.041618	  1.269862
 -0.122895	  0.032106	  1.264978
 -0.137974	  0.020519	  1.255493
 -0.148912	  0.012050	  1.243084
 -0.160903	 -0.003139	  1.231184
 -0.173916	 -0.018442	  1.225539
 -0.182683	 -0.033430	  1.216861
 -0.192637	 -0.046398	  1.204721
 -0.209396	 -0.057501	  1.196601
 -0.227508	 -0.067233	  1.190353
 -0.244398	 -0.079590	  1.187711
 -0.260654	 -0.094033	  1.192316
 -0.278982	 -0.109716	  1.188741
 -0.285411	 -0.121181	  1.174629
 -0.296213	 -0.134296	  1.158756
 -0.299773	 -0.148710	  1.149893
 -0.309634	 -0.166705	  1.142414
 -0.321611	 -0.181164	  1.132559
 -0.335383	 -0.190581	  1.120004
 -0.346058	 -0.202322	  1.110411
 -0.357192	 -0.216160	  1.100522
 -0.368322	 -0.229769	  1.090482
 -0.380200	 -0.241825	  1.079828
 -0.395951	 -0.248794	  1.065390
 -0.408848	 -0.254391	  1.052492
 -0.420334	 -0.265408	  1.041754
 -0.432530	 -0.277054	  1.030122
 -0.444723	 -0.287768	  1.017437
 -0.457456	 -0.295048	  1.002367
 -0.470588	 -0.298192	  0.987496
 -0.484327	 -0.305473	  0.975719
 -0.497205	 -0.316285	  0.963773
 -0.513434	 -0.324152	  0.952049
 -0.527460	 -0.330589	  0.938651
 -0.539921	 -0.329807	  0.923690
 -0.552936	 -0.331013	  0.907917
 -0.567370	 -0.332541	  0.894595
 -0.585395	 -0.331730	  0.883608
 -0.604673	 -0.333278	  0.873224
 -0.618076	 -0.336629	  0.860887
 -0.630713	 -0.335265	  0.845559
 -0.646486	 -0.330428	  0.831315
 -0.661987	 -0.330931	  0.820310
 -0.675210	 -0.331159	  0.805594
 -0.688117	 -0.327811	  0.789998
 -0.703702	 -0.320640	  0.778008
 -0.720189	 -0.319128	  0.767227
 -0.735232	 -0.316715	  0.754867
 -0.751172	 -0.310686	  0.744135
 -0.767816	 -0.304141	  0.733431
 -0.782976	 -0.301617	  0.720942
 -0.798883	 -0.299951	  0.707995
 -0.813730	 -0.296577	  0.695523
 -0.827186	 -0.292043	  0.682607
 -0.844565	 -0.291904	  0.669837
 -0.863307	 -0.290410	  0.661843
 -0.880076	 -0.285940	  0.652877
 -0.895265	 -0.283819	  0.643046
 -0.913658	 -0.284265	  0.632659
 -0.931289	 -0.285059	  0.623104
 -0.949168	 -0.288847	  0.614984
 -0.966873	 -0.292076	  0.607051
 -0.985302	 -0.293689	  0.599595
 -1.005745	 -0.297301	  0.593437
 -1.024853	 -0.303071	  0.589146
 -1.041352	 -0.310924	  0.582467
 -1.058209	 -0.316720	  0.575252
 -1.076123	 -0.324628	  0.569144
 -1.094289	 -0.332328	  0.566884
 -1.114182	 -0.339089	  0.555741
 -1.129302	 -0.343531	  0.542761
 -1.143550	 -0.354438	  0.533356
 -1.153976	 -0.371871	  0.526763
 -1.166195	 -0.386705	  0.519767
 -1.180871	 -0.395598	  0.508577
 -1.190816	 -0.406179	  0.496896
 -1.200503	 -0.419571	  0.479689
 -1.215106	 -0.427924	  0.467966
 -1.225089	 -0.443295	  0.462928
 -1.231934	 -0.462159	  0.454996
 -1.237835	 -0.476518	  0.440956
 -1.244095	 -0.492240	  0.433294
 -1.257658	 -0.507593	  0.425920
 -1.266949	 -0.523294	  0.412516
 -1.269620	 -0.540117	  0.399297
 -1.271654	 -0.554637	  0.393098
 -1.275171	 -0.576395	  0.389331
 -1.278723	 -0.595525	  0.385639
 -1.280799	 -0.614390	  0.378242
 -1.283745	 -0.634149	  0.371268
 -1.288871	 -0.653233	  0.366445
 -1.292234	 -0.672612	  0.366040
 -1.292480	 -0.692425	  0.365071
 -1.292450	 -0.712580	  0.364505
 -1.296166	 -0.733317	  0.364399
 -1.301650	 -0.752545	  0.363080
 -1.304922	 -0.772081	  0.359842
 -1.305478	 -0.791387	  0.356589
 -1.306503	 -0.811332	  0.353640
 -1.308174	 -0.831287	  0.350917
 -1.310532	 -0.851303	  0.349767
 -1.312118	 -0.871133	  0.348006
 -1.315431	 -0.891216	  0.348267
 -1.318781	 -0.911311	  0.349391
 -1.323158	 -0.931096	  0.351671
 -1.328794	 -0.950352	  0.353500
 -1.336302	 -0.968578	  0.354006
 -1.343547	 -0.988062	  0.354746
 -1.352413	 -1.005283	  0.353513
 -1.361580	 -1.023663	  0.353778
 -1.369586	 -1.041856	  0.352898
 -1.377820	 -1.060314	  0.353698
 -1.383881	 -1.079359	  0.352514
 -1.391697	 -1.097990	  0.351235
 -1.398981	 -1.115999	  0.347878
 -1.407364	 -1.134208	  0.345368
 -1.416559	 -1.151784	  0.342502
 -1.426410	 -1.169146	  0.339938
 -1.436208	 -1.186442	  0.337711
 -1.445621	 -1.203974	  0.336293
 -1.456180	 -1.220846	  0.334615
 -1.467202	 -1.237344	  0.332359
 -1.478697	 -1.253571	  0.331072
 -1.490729	 -1.269169	  0.331226
 -1.503242	 -1.285464	  0.329740
 -1.515158	 -1.302261	  0.326216
 -1.525985	 -1.318068	  0.321593
 -1.538111	 -1.332891	  0.313519
 -1.556069	 -1.341944	  0.305866
 -1.572863	 -1.352267	  0.304325
 -1.588088	 -1.365273	  0.302630
 -1.596446	 -1.383517	  0.296410
 -1.606796	 -1.403098	  0.286029
 -1.618301	 -1.415440	  0.280245
 -1.636350	 -1.426186	  0.277345
 -1.653237	 -1.436699	  0.270516
 -1.664079	 -1.448780	  0.261271
 -1.674853	 -1.463513	  0.252084
 -1.687382	 -1.480165	  0.244846
 -1.701208	 -1.491776	  0.238875
 -1.713889	 -1.502804	  0.229810
 -1.727925	 -1.512951	  0.219299
 -1.741076	 -1.524211	  0.208638
 -1.757132	 -1.540684	  0.204528
 -1.768934	 -1.555244	  0.201247
 -1.780515	 -1.570989	  0.193188
 -1.792524	 -1.579919	  0.181826
 -1.811053	 -1.597022	  0.166842
 -1.823689	 -1.609999	  0.158361
