  0.888948	 -1.747961	 -1.618747
  0.888815	 -1.762925	 -1.621966
  0.894064	 -1.744141	 -1.620254
  0.893581	 -1.724545	 -1.615153
  0.897104	 -1.700763	 -1.610458
  0.897569	 -1.685854	 -1.604972
  0.896399	 -1.666761	 -1.597769
  0.898457	 -1.647351	 -1.591442
  0.900282	 -1.628985	 -1.585804
  0.900960	 -1.610958	 -1.579858
  0.906933	 -1.586979	 -1.573855
  0.910619	 -1.571479	 -1.569424
  0.910580	 -1.553402	 -1.562546
  0.913265	 -1.532712	 -1.556058
  0.917776	 -1.514104	 -1.550576
  0.918799	 -1.496945	 -1.542431
  0.917897	 -1.479391	 -1.532922
  0.921166	 -1.458680	 -1.525811
  0.925132	 -1.439189	 -1.521093
  0.922112	 -1.419569	 -1.518251
  0.915177	 -1.401947	 -1.512414
  0.905681	 -1.382627	 -1.507632
  0.902328	 -1.358636	 -1.507336
  0.905373	 -1.339008	 -1.506179
  0.906777	 -1.323503	 -1.497990
  0.906801	 -1.304557	 -1.486676
  0.907844	 -1.284460	 -1.478742
  0.902049	 -1.265286	 -1.474648
  0.894329	 -1.247515	 -1.469223
  0.890888	 -1.229176	 -1.465029
  0.889330	 -1.208605	 -1.460219
  0.882609	 -1.189540	 -1.458578
  0.874918	 -1.169446	 -1.459762
  0.872570	 -1.150140	 -1.457423
  0.869531	 -1.130983	 -1.448158
  0.864692	 -1.112080	 -1.441420
  0.861109	 -1.094570	 -1.444065
  0.857391	 -1.071097	 -1.453228
  0.855820	 -1.051394	 -1.454188
  0.854985	 -1.030719	 -1.446218
  0.852796	 -1.011736	 -1.438249
  0.847934	 -0.992031	 -1.438126
  0.844673	 -0.969780	 -1.443521
  0.845835	 -0.954288	 -1.443003
  0.842669	 -0.932718	 -1.437163
  0.833679	 -0.915519	 -1.439192
  0.828472	 -0.895740	 -1.443474
  0.826128	 -0.874857	 -1.443205
  0.820795	 -0.855917	 -1.442751
  0.811525	 -0.835324	 -1.445486
  0.805138	 -0.815157	 -1.448023
  0.802941	 -0.798587	 -1.450343
  0.796494	 -0.783196	 -1.452437
  0.782759	 -0.763693	 -1.454060
  0.776683	 -0.744112	 -1.452998
  0.772790	 -0.728377	 -1.458004
  0.763344	 -0.711966	 -1.465966
  0.755758	 -0.695667	 -1.474457
  0.751272	 -0.679618	 -1.488635
  0.756292	 -0.665863	 -1.506694
  0.760711	 -0.653158	 -1.521330
  0.770975	 -0.640167	 -1.535270
  0.781449	 -0.628169	 -1.547728
  0.791269	 -0.617755	 -1.561965
  0.799629	 -0.611628	 -1.578681
  0.805503	 -0.602892	 -1.595874
  0.810426	 -0.593532	 -1.613001
  0.816244	 -0.584193	 -1.630284
  0.824381	 -0.574978	 -1.645746
  0.830629	 -0.564017	 -1.661443
  0.839116	 -0.556644	 -1.677725
  0.844226	 -0.550793	 -1.696036
  0.848558	 -0.545180	 -1.713917
  0.852317	 -0.534713	 -1.731012
  0.856576	 -0.522737	 -1.743196
  0.859337	 -0.506670	 -1.753238
  0.861681	 -0.486874	 -1.765793
  0.864750	 -0.471254	 -1.776322
  0.869583	 -0.454937	 -1.780907
  0.875225	 -0.436037	 -1.785080
  0.883680	 -0.420270	 -1.788832
  0.895801	 -0.401400	 -1.790756
  0.903389	 -0.383707	 -1.790108
  0.904950	 -0.366514	 -1.789258
  0.910612	 -0.342887	 -1.789815
  0.919060	 -0.324766	 -1.785820
  0.924179	 -0.309668	 -1.781373
  0.928410	 -0.290348	 -1.776102
  0.933388	 -0.271909	 -1.774229
  0.939503	 -0.249263	 -1.768804
  0.943354	 -0.234611	 -1.758844
  0.949620	 -0.216919	 -1.750391
  0.955015	 -0.196474	 -1.747328
  0.955646	 -0.178438	 -1.739593
  0.954368	 -0.164484	 -1.726139
  0.957814	 -0.146554	 -1.713838
  0.963323	 -0.131653	 -1.704703
  0.968947	 -0.117759	 -1.687008
  0.971423	 -0.101631	 -1.672199
  0.968595	 -0.080947	 -1.664648
  0.968734	 -0.068542	 -1.661531
  0.966055	 -0.053065	 -1.645225
  0.958743	 -0.036847	 -1.630594
  0.952512	 -0.019804	 -1.621255
  0.949181	 -0.007930	 -1.608128
  0.943898	  0.004554	 -1.590994
  0.936703	  0.021476	 -1.578452
  0.934771	  0.040823	 -1.569723
  0.938252	  0.054478	 -1.560490
  0.933859	  0.069098	 -1.546445
  0.923052	  0.081452	 -1.533959
  0.912155	  0.093384	 -1.522153
  0.901260	  0.105297	 -1.510346
  0.890344	  0.117204	 -1.498576
  0.878990	  0.128859	 -1.487102
  0.866338	  0.139248	 -1.477707
  0.850386	  0.146433	 -1.466001
  0.837320	  0.151507	 -1.452228
  0.826810	  0.160090	 -1.430989
  0.819257	  0.163325	 -1.418370
  0.806579	  0.164122	 -1.401322
  0.798620	  0.166674	 -1.382794
  0.797594	  0.173750	 -1.366409
  0.802102	  0.185574	 -1.338165
  0.798997	  0.187219	 -1.323850
  0.796248	  0.192582	 -1.305384
  0.794025	  0.203736	 -1.286220
  0.792817	  0.221280	 -1.275783
  0.791100	  0.233203	 -1.260996
  0.786882	  0.247967	 -1.244717
  0.785560	  0.259843	 -1.225712
  0.787221	  0.268697	 -1.217498
  0.791493	  0.284982	 -1.202894
  0.793103	  0.303854	 -1.189799
  0.791102	  0.316751	 -1.175303
  0.789607	  0.328654	 -1.159656
  0.785679	  0.348205	 -1.149087
  0.777230	  0.368398	 -1.143451
  0.774390	  0.383986	 -1.134611
  0.782701	  0.398736	 -1.119346
  0.791163	  0.414495	 -1.104203
  0.798675	  0.433200	 -1.091391
  0.804837	  0.451095	 -1.081073
  0.806520	  0.470643	 -1.076143
  0.807874	  0.490474	 -1.081275
  0.807075	  0.516231	 -1.092455
  0.801591	  0.538036	 -1.095243
  0.799681	  0.554858	 -1.086927
  0.804004	  0.573647	 -1.079578
  0.807049	  0.591640	 -1.081639
  0.805039	  0.611111	 -1.083906
  0.805642	  0.631448	 -1.084806
  0.808032	  0.648840	 -1.080676
  0.809011	  0.672680	 -1.071785
  0.810288	  0.692584	 -1.072744
  0.812208	  0.720761	 -1.081976
  0.811336	  0.734871	 -1.082240
  0.809271	  0.750718	 -1.076265
  0.806975	  0.770210	 -1.066982
  0.808262	  0.792721	 -1.060456
  0.812052	  0.808556	 -1.052658
  0.816240	  0.827442	 -1.043135
  0.818475	  0.848569	 -1.035814
  0.819953	  0.864097	 -1.029683
  0.822453	  0.883841	 -1.019241
  0.823324	  0.901796	 -1.012750
  0.822737	  0.921309	 -1.010749
  0.825105	  0.941950	 -1.004202
  0.827331	  0.963112	 -0.993336
  0.821440	  0.981882	 -0.994192
  0.814811	  0.998621	 -1.000652
  0.815644	  1.019876	 -1.002984
  0.819467	  1.040496	 -1.002622
  0.817968	  1.061927	 -1.001871
  0.817456	  1.081039	 -1.005408
  0.819101	  1.099065	 -1.013961
  0.819806	  1.117246	 -1.022815
  0.818185	  1.136479	 -1.026877
  0.817314	  1.156339	 -1.032256
  0.817812	  1.172796	 -1.044208
  0.817430	  1.189568	 -1.053462
  0.814804	  1.210335	 -1.061680
  0.812689	  1.226451	 -1.074705
  0.815325	  1.236181	 -1.089238
  0.817035	  1.251013	 -1.107516
  0.814588	  1.266549	 -1.121934
  0.813180	  1.281155	 -1.129526
  0.813885	  1.296186	 -1.144537
  0.814337	  1.309684	 -1.158311
  0.814592	  1.325802	 -1.169172
  0.813126	  1.344171	 -1.187523
  0.812540	  1.351261	 -1.200920
  0.816034	  1.359397	 -1.217857
  0.821134	  1.369335	 -1.237792
  0.826027	  1.380686	 -1.256352
  0.833922	  1.389091	 -1.274472
  0.839433	  1.397033	 -1.287929
  0.842653	  1.410304	 -1.299814
  0.850017	  1.425953	 -1.311376
  0.863249	  1.436903	 -1.325283
  0.873137	  1.442022	 -1.342669
  0.878586	  1.448140	 -1.361349
  0.885049	  1.457081	 -1.377533
  0.895913	  1.467477	 -1.390495
  0.906944	  1.478959	 -1.403119
  0.918220	  1.497460	 -1.407040
  0.928413	  1.511748	 -1.406666
  0.940216	  1.525475	 -1.401089
  0.950621	  1.542020	 -1.391619
  0.951137	  1.557360	 -1.380974
  0.950543	  1.574691	 -1.371322
  0.951047	  1.592555	 -1.362232
  0.950992	  1.607195	 -1.351186
  0.952466	  1.619223	 -1.337056
  0.954116	  1.631776	 -1.319496
  0.956422	  1.647039	 -1.303778
  0.954470	  1.662642	 -1.289661
  0.947316	  1.675464	 -1.278769
  0.934201	  1.689108	 -1.265069
  0.914920	  1.691089	 -1.249639
  0.904120	  1.689278	 -1.233575
  0.894472	  1.696485	 -1.217084
  0.887445	  1.711616	 -1.197076
  0.885178	  1.716025	 -1.184236
  0.873445	  1.717704	 -1.168195
  0.860677	  1.719228	 -1.147037
  0.853686	  1.724015	 -1.128070
  0.846390	  1.728254	 -1.112227
  0.838419	  1.731395	 -1.091657
  0.830725	  1.737806	 -1.074313
  0.821815	  1.740554	 -1.061588
  0.810576	  1.742537	 -1.042639
  0.799266	  1.747215	 -1.026613
  0.789523	  1.751527	 -1.009156
  0.781250	  1.754632	 -0.991053
  0.773104	  1.757648	 -0.973061
  0.765569	  1.759096	 -0.954723
  0.757000	  1.761119	 -0.936673
  0.748173	  1.763196	 -0.918550
  0.740489	  1.765544	 -0.899368
  0.735694	  1.771320	 -0.881402
  0.734870	  1.775245	 -0.861340
  0.736736	  1.779805	 -0.841553
  0.738685	  1.784125	 -0.822505
  0.740483	  1.790239	 -0.808292
  0.740273	  1.793981	 -0.789477
  0.745092	  1.810823	 -0.775626
  0.752157	  1.830093	 -0.768840
  0.750541	  1.848613	 -0.764087
  0.749684	  1.866884	 -0.755535
  0.753110	  1.888497	 -0.750515
  0.756251	  1.911878	 -0.751688
  0.753008	  1.925946	 -0.748688
  0.750100	  1.944115	 -0.738484
  0.746911	  1.966605	 -0.731901
  0.748076	  1.991375	 -0.733990
  0.751362	  2.007260	 -0.733332
  0.752987	  2.024359	 -0.726190
  0.751111	  2.043330	 -0.717549
  0.749038	  2.063471	 -0.711784
  0.744148	  2.082215	 -0.706726
  0.738445	  2.100696	 -0.701633
  0.732702	  2.119163	 -0.696538
  0.726144	  2.137334	 -0.691361
  0.719136	  2.155324	 -0.686143
  0.712137	  2.173324	 -0.680952
  0.705908	  2.191883	 -0.676864
  0.699774	  2.210498	 -0.672883
  0.694596	  2.229463	 -0.669214
  0.690213	  2.248673	 -0.665788
  0.686939	  2.268034	 -0.662004
  0.684832	  2.287485	 -0.657846
  0.682756	  2.307070	 -0.653642
  0.681055	  2.327664	 -0.648987
  0.679762	  2.347098	 -0.644441
