  1.898480	 -1.537902	 -0.491198
  1.931728	 -1.529245	 -0.519077
  1.916427	 -1.535037	 -0.507875
  1.903641	 -1.539404	 -0.492374
  1.892438	 -1.544693	 -0.476987
  1.884332	 -1.552962	 -0.463109
  1.875057	 -1.560045	 -0.444919
  1.864213	 -1.563129	 -0.425755
  1.848997	 -1.568504	 -0.404896
  1.837776	 -1.574053	 -0.393164
  1.825260	 -1.577216	 -0.378693
  1.815218	 -1.579692	 -0.361285
  1.800830	 -1.579854	 -0.343637
  1.790092	 -1.579594	 -0.331651
  1.774313	 -1.579854	 -0.319288
  1.752400	 -1.582095	 -0.302217
  1.743073	 -1.583202	 -0.294082
  1.727603	 -1.584553	 -0.281315
  1.704182	 -1.589026	 -0.263457
  1.695434	 -1.591627	 -0.256025
  1.684226	 -1.595359	 -0.244633
  1.668059	 -1.598031	 -0.225601
  1.653966	 -1.594123	 -0.206950
  1.645332	 -1.591869	 -0.194200
  1.629992	 -1.594097	 -0.177068
  1.615945	 -1.597258	 -0.164063
  1.603177	 -1.600572	 -0.152153
  1.587651	 -1.607861	 -0.136340
  1.575903	 -1.617269	 -0.125503
  1.565287	 -1.629574	 -0.117518
  1.552608	 -1.646041	 -0.107680
  1.535468	 -1.660429	 -0.093281
  1.524833	 -1.667317	 -0.082989
  1.512772	 -1.673670	 -0.065651
  1.508831	 -1.680401	 -0.048422
  1.502576	 -1.691246	 -0.030559
  1.496638	 -1.701729	 -0.013890
  1.491407	 -1.712221	  0.002700
  1.488635	 -1.721221	  0.020347
  1.485852	 -1.730826	  0.038018
  1.485037	 -1.740531	  0.055846
  1.483722	 -1.750807	  0.072993
  1.481898	 -1.761166	  0.090017
  1.480012	 -1.771475	  0.107051
  1.480103	 -1.780948	  0.124663
  1.481200	 -1.789939	  0.142496
  1.482296	 -1.798933	  0.160326
  1.483413	 -1.807926	  0.178155
  1.485427	 -1.816884	  0.195922
  1.487883	 -1.825817	  0.213644
  1.490095	 -1.834836	  0.231310
  1.486054	 -1.845064	  0.247956
  1.481464	 -1.855352	  0.264458
  1.472488	 -1.865121	  0.279393
  1.462777	 -1.874725	  0.294002
  1.453084	 -1.884246	  0.308677
  1.443928	 -1.892567	  0.324387
  1.434773	 -1.900867	  0.340077
  1.424889	 -1.909236	  0.354713
  1.410908	 -1.918578	  0.366817
  1.396495	 -1.928985	  0.381300
  1.386185	 -1.935505	  0.398355
  1.376484	 -1.936923	  0.412920
  1.362647	 -1.940962	  0.428992
  1.350450	 -1.945616	  0.447401
  1.342385	 -1.945368	  0.459298
  1.328986	 -1.945209	  0.473059
  1.314537	 -1.949015	  0.490556
  1.307880	 -1.952644	  0.509054
  1.303859	 -1.951265	  0.526959
  1.291710	 -1.944294	  0.542243
  1.274181	 -1.939234	  0.552805
  1.257391	 -1.934870	  0.562551
  1.241402	 -1.923957	  0.569610
  1.221002	 -1.911926	  0.570197
  1.197006	 -1.910319	  0.563719
  1.175995	 -1.908756	  0.558583
  1.162832	 -1.906015	  0.559361
  1.144116	 -1.903527	  0.570472
  1.122911	 -1.903235	  0.578033
  1.097235	 -1.899927	  0.575426
  1.075041	 -1.887110	  0.571900
  1.063967	 -1.875766	  0.571165
  1.054345	 -1.861909	  0.571185
  1.036585	 -1.843069	  0.573471
  1.013553	 -1.831158	  0.572893
  1.002606	 -1.827522	  0.573386
  0.987369	 -1.818902	  0.573999
  0.967070	 -1.804552	  0.577372
  0.948346	 -1.794072	  0.580568
  0.932520	 -1.788346	  0.584622
  0.915410	 -1.783132	  0.588256
  0.897498	 -1.774121	  0.594287
  0.881388	 -1.762010	  0.599649
  0.865620	 -1.752382	  0.606620
  0.845058	 -1.748058	  0.613091
  0.824073	 -1.747668	  0.620885
  0.809838	 -1.748114	  0.630827
  0.795746	 -1.744033	  0.646397
  0.781141	 -1.738222	  0.659746
  0.762673	 -1.732592	  0.666729
  0.744230	 -1.728358	  0.670119
  0.727476	 -1.721322	  0.676099
  0.710328	 -1.714076	  0.687075
  0.690335	 -1.709848	  0.694097
  0.668617	 -1.708479	  0.702556
  0.652806	 -1.707350	  0.717903
  0.645180	 -1.708288	  0.733545
  0.633594	 -1.713751	  0.749596
  0.620350	 -1.708405	  0.766061
  0.604896	 -1.700770	  0.786034
  0.592682	 -1.699708	  0.801543
  0.577731	 -1.700265	  0.816594
  0.562541	 -1.700491	  0.827869
  0.547836	 -1.700616	  0.836770
  0.533748	 -1.703584	  0.845437
  0.512385	 -1.706756	  0.861565
  0.496056	 -1.703158	  0.877375
  0.491320	 -1.701275	  0.881819
  0.476126	 -1.691838	  0.897462
  0.454405	 -1.691189	  0.923580
  0.445533	 -1.693671	  0.936181
  0.440534	 -1.698222	  0.945817
  0.422731	 -1.704161	  0.970015
  0.404931	 -1.714491	  0.989922
  0.399683	 -1.718189	  0.996705
  0.392340	 -1.723950	  1.006269
  0.376300	 -1.738630	  1.028579
  0.367112	 -1.746742	  1.039924
  0.356057	 -1.752818	  1.049150
  0.337836	 -1.761539	  1.064147
  0.326038	 -1.768749	  1.075486
  0.312250	 -1.776385	  1.086390
  0.296019	 -1.784625	  1.099915
  0.282813	 -1.790394	  1.111439
  0.267997	 -1.796197	  1.125289
  0.254392	 -1.802305	  1.138740
  0.241794	 -1.807890	  1.150448
  0.227173	 -1.812994	  1.166593
  0.214343	 -1.816839	  1.181276
  0.202831	 -1.821021	  1.191371
  0.184749	 -1.826305	  1.206879
  0.171645	 -1.831409	  1.222198
  0.168534	 -1.838865	  1.240150
  0.168846	 -1.842052	  1.265872
  0.159764	 -1.840856	  1.288147
  0.148417	 -1.842174	  1.303495
  0.136107	 -1.843267	  1.319073
  0.117473	 -1.843032	  1.334572
  0.099831	 -1.843792	  1.342711
  0.077918	 -1.845199	  1.347006
  0.054231	 -1.847057	  1.358353
  0.040921	 -1.848706	  1.367403
  0.027792	 -1.849955	  1.380157
  0.014018	 -1.850646	  1.397799
  0.002749	 -1.850097	  1.413383
 -0.008751	 -1.849780	  1.429168
 -0.028289	 -1.851430	  1.446683
 -0.042796	 -1.853809	  1.453476
 -0.065481	 -1.856936	  1.459154
 -0.088240	 -1.858439	  1.469007
 -0.102515	 -1.861722	  1.476089
 -0.114268	 -1.866232	  1.484656
 -0.128337	 -1.876353	  1.500497
 -0.142912	 -1.882633	  1.515586
 -0.157276	 -1.888903	  1.528509
 -0.171035	 -1.896652	  1.539432
 -0.186953	 -1.907620	  1.547411
 -0.203757	 -1.917507	  1.556348
 -0.217890	 -1.922091	  1.569309
 -0.232055	 -1.925940	  1.583558
 -0.247412	 -1.931061	  1.597514
 -0.262419	 -1.937526	  1.609045
