 -1.505371	 -1.257140	 -1.616330
 -1.529066	 -1.278356	 -1.601929
 -1.515495	 -1.266203	 -1.610182
 -1.502256	 -1.254308	 -1.619277
 -1.491705	 -1.244493	 -1.633129
 -1.481269	 -1.234789	 -1.647120
 -1.473133	 -1.231983	 -1.665146
 -1.465306	 -1.229902	 -1.683495
 -1.456989	 -1.227880	 -1.702950
 -1.448129	 -1.228640	 -1.727276
 -1.441544	 -1.229435	 -1.746145
