 -1.926659	 -1.560243	  0.747386
 -1.961058	 -1.546671	  0.722462
 -1.945407	 -1.552227	  0.733606
 -1.929628	 -1.557461	  0.744725
 -1.913849	 -1.562694	  0.755843
 -1.897752	 -1.566681	  0.767023
 -1.881605	 -1.570448	  0.778208
 -1.865459	 -1.574214	  0.789393
 -1.849121	 -1.576455	  0.800709
 -1.832780	 -1.578673	  0.812026
 -1.816410	 -1.580753	  0.823325
 -1.799889	 -1.582075	  0.834519
 -1.783368	 -1.583398	  0.845713
 -1.766716	 -1.584647	  0.856721
 -1.749864	 -1.585782	  0.867431
 -1.733012	 -1.586917	  0.878142
 -1.715942	 -1.588023	  0.888505
 -1.698785	 -1.589117	  0.898725
 -1.681597	 -1.590232	  0.908891
 -1.664298	 -1.591422	  0.918856
 -1.646998	 -1.592611	  0.928821
 -1.629850	 -1.594373	  0.938963
 -1.612717	 -1.596183	  0.949120
 -1.596450	 -1.599777	  0.960187
 -1.580235	 -1.603465	  0.971299
 -1.564179	 -1.606816	  0.982743
 -1.548156	 -1.610098	  0.994254
 -1.532134	 -1.613379	  1.005765
 -1.514908	 -1.614882	  1.015817
 -1.497660	 -1.616345	  1.025835
 -1.482310	 -1.619989	  1.038126
 -1.467480	 -1.624127	  1.050892
 -1.452532	 -1.627590	  1.063720
 -1.437557	 -1.630882	  1.076562
 -1.422559	 -1.634138	  1.089386
 -1.407147	 -1.636728	  1.101866
 -1.391734	 -1.639318	  1.114345
 -1.376240	 -1.641714	  1.126763
 -1.360584	 -1.643703	  1.139048
 -1.344927	 -1.645691	  1.151333
 -1.329141	 -1.647276	  1.163510
 -1.313281	 -1.648620	  1.175620
 -1.297421	 -1.649964	  1.187730
 -1.281443	 -1.650840	  1.199727
 -1.265449	 -1.651654	  1.211709
 -1.249446	 -1.652378	  1.223683
 -1.233417	 -1.652855	  1.235635
 -1.217388	 -1.653332	  1.247586
 -1.201380	 -1.653698	  1.259569
 -1.185377	 -1.654035	  1.271561
 -1.169384	 -1.654402	  1.283565
 -1.153411	 -1.654828	  1.295593
 -1.137438	 -1.655255	  1.307622
 -1.121510	 -1.656028	  1.319691
 -1.105586	 -1.656843	  1.331766
 -1.089750	 -1.658144	  1.343911
 -1.073976	 -1.659766	  1.356099
 -1.058262	 -1.661673	  1.368323
 -1.042669	 -1.664118	  1.380607
 -1.027097	 -1.666636	  1.392902
 -1.011708	 -1.669750	  1.405291
 -0.996320	 -1.672865	  1.417680
 -0.981147	 -1.676429	  1.430214
 -0.966016	 -1.680078	  1.442773
 -0.950997	 -1.683971	  1.455394
 -0.936116	 -1.688156	  1.468084
 -0.921215	 -1.692383	  1.480737
 -0.906132	 -1.697003	  1.493032
 -0.891050	 -1.701624	  1.505327
 -0.875624	 -1.706451	  1.517105
 -0.860030	 -1.711381	  1.528617
 -0.844401	 -1.716335	  1.540071
 -0.828102	 -1.721763	  1.550312
 -0.811802	 -1.727191	  1.560552
 -0.795582	 -1.733476	  1.570422
 -0.779435	 -1.740319	  1.580037
 -0.765315	 -1.746394	  1.592831
 -0.752465	 -1.751977	  1.607104
 -0.739648	 -1.756993	  1.621615
 -0.726961	 -1.760618	  1.636645
 -0.714275	 -1.764243	  1.651676
 -0.701379	 -1.767209	  1.666673
 -0.688190	 -1.769145	  1.681582
 -0.675001	 -1.771081	  1.696492
 -0.661185	 -1.772425	  1.710891
 -0.646615	 -1.773002	  1.724579
 -0.632045	 -1.773579	  1.738268
 -0.616998	 -1.774021	  1.751436
 -0.601522	 -1.774335	  1.764101
 -0.586047	 -1.774650	  1.776766
 -0.569848	 -1.774976	  1.788492
 -0.553337	 -1.775307	  1.799773
 -0.536826	 -1.775638	  1.811055
 -0.520315	 -1.775969	  1.822336
 -0.502886	 -1.776295	  1.833883
 -0.485910	 -1.776570	  1.844453
