 0.0 0.0 0.0 0
 0.9694628048885408 0.1295879128594199 -0.3513754140795848 1000
 -0.7035431073528736 -0.4035014375334577 -0.4366833571046416 1000
 0.19945593285711738 0.5362470445169121 -1.0054830194113717 1000
 -0.571725469287671 -0.7728256567034453 -0.0394644144093805 1000
 0.2564522398157924 0.9141089537957392 -0.57434958304154 1000
 -0.8413747382866734 -0.17273653121769106 0.6672120345454238 1000
 0.8088449650471796 -0.5713057573207325 0.1925924098038242 1000
 -0.0023269065522688592 -0.2122763199764513 -0.9670693184312298 1000
 0.0 0.0 0.0 0
 -0.34202721835676286 -0.7346710770111188 0.8242852116415756 1000
 0.3692534816328624 -0.90521513627251 -0.0400877105194494 1000
 -0.920873469687098 0.19650694437986282 0.4020488584257944 1000
 -0.04085750203017979 0.6865329706177997 0.5958145857217727 1000
 -0.07001579944335033 0.301829695266771 -1.0563390559017094 1000
 0.4967692726118543 -0.21167228856603607 -0.8801129541724831 1000
 -0.9958577168868104 0.011650321673463249 0.009863053129769206 1000
 -0.2727499053000021 0.1872865475011746 0.9681580653981559 1000
 0.0 0.0 0.0 0
 0.9593513688700558 0.27798154168188 -0.204420187741368 1000
 0.3548582004121643 -0.8921216764201714 0.4699401477135242 1000
 0.7388518362617864 0.16133623237880848 0.5628991575552148 1000
 -0.2888906948254033 0.6775966342585646 0.5727947657873018 1000
 0.23628104769790464 0.14812354781081874 0.9400167831427866 1000
 0.9866810367449027 -0.10502290364813344 -0.20846087387740472 1000
 0.5826667082352639 0.8095129853883614 -0.19043867445940393 1000
 -0.4270703025889466 -0.04044610545604052 0.99763376713378 1000
 0.0 0.0 0.0 0
 -0.732923769134572 -0.6071374918226792 0.5443645144395165 1000
 0.4420452900082793 0.7430416082450982 0.29636130534781774 1000
 -0.7572700955231231 0.45822108216813345 -0.5130784731400518 1000
 0.4856442135597998 0.39059024712797397 -0.9623716847285279 1000
 -0.8870625043592064 -0.45471126823899544 0.1329556177919379 1000
 -0.03371402293306074 -0.4731617445576434 1.035338759466589 1000
