 -0.494613	  0.712509	  2.389132
 -0.496877	  0.714520	  2.390427
 -0.483129	  0.702307	  2.382563
 -0.469381	  0.690094	  2.374700
 -0.455381	  0.677933	  2.367209
 -0.441272	  0.665797	  2.359886
 -0.427052	  0.653764	  2.352604
 -0.412463	  0.642093	  2.345466
 -0.397874	  0.630421	  2.338329
 -0.383202	  0.618938	  2.331060
 -0.368495	  0.607532	  2.323737
 -0.353790	  0.596166	  2.316349
 -0.339105	  0.584998	  2.308628
 -0.324420	  0.573830	  2.300906
 -0.309682	  0.563056	  2.292738
 -0.294911	  0.552600	  2.284225
 -0.280139	  0.542144	  2.275711
 -0.265182	  0.532817	  2.266262
 -0.250193	  0.523757	  2.256606
 -0.235179	  0.514765	  2.246924
 -0.219748	  0.507086	  2.236781
 -0.204316	  0.499406	  2.226637
 -0.188599	  0.492333	  2.216491
 -0.172484	  0.486193	  2.206362
 -0.156369	  0.480053	  2.196233
 -0.139823	  0.474874	  2.186261
 -0.123195	  0.469896	  2.176325
 -0.106409	  0.465094	  2.166570
 -0.089313	  0.460651	  2.157189
 -0.072218	  0.456209	  2.147808
 -0.054792	  0.451672	  2.139104
 -0.037337	  0.447126	  2.130462
 -0.019720	  0.442414	  2.122251
 -0.001975	  0.437567	  2.114401
  0.015817	  0.432641	  2.106709
  0.033793	  0.427392	  2.099687
  0.051769	  0.422142	  2.092665
  0.069953	  0.416640	  2.086413
  0.088164	  0.411102	  2.080276
  0.106488	  0.405411	  2.074631
  0.124893	  0.399600	  2.069388
  0.143331	  0.393738	  2.064322
  0.161854	  0.387737	  2.059752
  0.180385	  0.381723	  2.055228
  0.199002	  0.375518	  2.051374
  0.217620	  0.369312	  2.047519
  0.236343	  0.363008	  2.044403
  0.255069	  0.356700	  2.041312
  0.273994	  0.350761	  2.038743
  0.292952	  0.344890	  2.036269
  0.312120	  0.339597	  2.034131
  0.331465	  0.334857	  2.032315
  0.350810	  0.330118	  2.030499
  0.370493	  0.326840	  2.029140
  0.390271	  0.324115	  2.027955
  0.410049	  0.321391	  2.026770
  0.429968	  0.319929	  2.025715
  0.449941	  0.320535	  2.024880
  0.469914	  0.321142	  2.024045
  0.489888	  0.321748	  2.023211
  0.509623	  0.324824	  2.022191
  0.529142	  0.329045	  2.021089
  0.548661	  0.333265	  2.019988
  0.568169	  0.337526	  2.018870
  0.587397	  0.342813	  2.017334
  0.606624	  0.348100	  2.015798
  0.625851	  0.353387	  2.014261
  0.645042	  0.358745	  2.012529
  0.664229	  0.364112	  2.010774
  0.683359	  0.369685	  2.009052
  0.702367	  0.375683	  2.007400
  0.721361	  0.381723	  2.005743
  0.739892	  0.389029	  2.003955
  0.758424	  0.396336	  2.002167
  0.776432	  0.404739	  1.999907
  0.794140	  0.413693	  1.997407
  0.811848	  0.422647	  1.994907
  0.828631	  0.432852	  1.991141
  0.845370	  0.443109	  1.987321
  0.862110	  0.453365	  1.983502
  0.878050	  0.464016	  1.977804
  0.893675	  0.474776	  1.971472
  0.909300	  0.485536	  1.965140
  0.924924	  0.496296	  1.958808
  0.939304	  0.506430	  1.949295
  0.953407	  0.516416	  1.939224
  0.967509	  0.526401	  1.929153
  0.981612	  0.536386	  1.919083
  0.995499	  0.545692	  1.908103
  1.008245	  0.552333	  1.894196
  1.020991	  0.558974	  1.880288
  1.033737	  0.565616	  1.866380
  1.046484	  0.572257	  1.852472
  1.059230	  0.578898	  1.838564
  1.070654	  0.580170	  1.822197
  1.081878	  0.580871	  1.805659
  1.093103	  0.581572	  1.789120
  1.104327	  0.582273	  1.772582
  1.115551	  0.582974	  1.756043
  1.126775	  0.583349	  1.739494
  1.137383	  0.577338	  1.723640
  1.147991	  0.571328	  1.707786
  1.158599	  0.565317	  1.691932
  1.169207	  0.559306	  1.676079
  1.179815	  0.553296	  1.660225
  1.190423	  0.547285	  1.644371
  1.201098	  0.539246	  1.629491
  1.211761	  0.530368	  1.615086
  1.222424	  0.521491	  1.600682
  1.233087	  0.512613	  1.586277
  1.243750	  0.503736	  1.571872
  1.254412	  0.494859	  1.557468
  1.265058	  0.485906	  1.543097
  1.275198	  0.475068	  1.529691
  1.285338	  0.464231	  1.516285
  1.295478	  0.453393	  1.502878
  1.305618	  0.442555	  1.489472
  1.315758	  0.431718	  1.476066
  1.325898	  0.420880	  1.462660
  1.335694	  0.409669	  1.449305
  1.345017	  0.397967	  1.436033
  1.354340	  0.386265	  1.422761
  1.363663	  0.374563	  1.409489
  1.372986	  0.362861	  1.396217
  1.382309	  0.351159	  1.382945
  1.391180	  0.339180	  1.369610
  1.399266	  0.326749	  1.356191
  1.407352	  0.314318	  1.342772
  1.415439	  0.301887	  1.329352
  1.423525	  0.289456	  1.315933
  1.431612	  0.277025	  1.302514
  1.433221	  0.260110	  1.291964
  1.434736	  0.243152	  1.281470
  1.436251	  0.226194	  1.270975
  1.437766	  0.209236	  1.260480
  1.436339	  0.190865	  1.252705
  1.430007	  0.172029	  1.250440
  1.423675	  0.153194	  1.248175
  1.417343	  0.134358	  1.245910
  1.410130	  0.115758	  1.244490
  1.401975	  0.097503	  1.244011
  1.393819	  0.079248	  1.243533
  1.385767	  0.060950	  1.242926
  1.378590	  0.042357	  1.241263
  1.371413	  0.023763	  1.239601
  1.365297	  0.004821	  1.237649
  1.362684	 -0.014805	  1.234823
  1.365170	 -0.034588	  1.233263
  1.383333	 -0.041140	  1.238475
  1.401568	 -0.037267	  1.245720
  1.419123	 -0.030374	  1.252376
  1.436678	 -0.023482	  1.259033
  1.454151	 -0.015841	  1.265058
  1.471491	 -0.007424	  1.270396
  1.488830	  0.000993	  1.275734
  1.506170	  0.009410	  1.281072
  1.523920	  0.017862	  1.284746
  1.541756	  0.026314	  1.287981
  1.559592	  0.034765	  1.291216
  1.577427	  0.043216	  1.294450
  1.595263	  0.051667	  1.297685
  1.614004	  0.058635	  1.298180
  1.632816	  0.065422	  1.298363
  1.651628	  0.072209	  1.298545
  1.670440	  0.078996	  1.298728
  1.689253	  0.085784	  1.298911
  1.708065	  0.092571	  1.299093
  1.727614	  0.095770	  1.296336
  1.747172	  0.098782	  1.293434
  1.766729	  0.101793	  1.290532
  1.786287	  0.104805	  1.287630
  1.805845	  0.107817	  1.284728
  1.825403	  0.110829	  1.281826
  1.845122	  0.111638	  1.278588
  1.864786	  0.110560	  1.275097
  1.884449	  0.109482	  1.271606
  1.904113	  0.108404	  1.268115
  1.923776	  0.107326	  1.264623
  1.943439	  0.106247	  1.261132
  1.962977	  0.103824	  1.257608
  1.982438	  0.100863	  1.254076
  2.001900	  0.097902	  1.250544
  2.021362	  0.094941	  1.247012
  2.040696	  0.091593	  1.243143
  2.059280	  0.086512	  1.237772
  2.077863	  0.081432	  1.232402
  2.096447	  0.076351	  1.227031
  2.113494	  0.069287	  1.219318
  2.130041	  0.061723	  1.211012
  2.146183	  0.053819	  1.202239
  2.159085	  0.043889	  1.190624
  2.171988	  0.033959	  1.179009
  2.181062	  0.022540	  1.165324
  2.188957	  0.010807	  1.151182
  2.196273	 -0.001152	  1.136918
  2.199184	 -0.014386	  1.122207
  2.202096	 -0.027619	  1.107497
  2.205007	 -0.040852	  1.092786
  2.206973	 -0.054643	  1.078435
  2.207587	 -0.069147	  1.064678
  2.208201	 -0.083651	  1.050921
  2.208814	 -0.098155	  1.037164
  2.209428	 -0.112659	  1.023407
  2.209726	 -0.127890	  1.010448
  2.209694	 -0.143824	  0.998361
  2.209663	 -0.159759	  0.986274
  2.209631	 -0.175693	  0.974187
  2.209600	 -0.191628	  0.962101
  2.209568	 -0.207562	  0.950014
  2.207967	 -0.224457	  0.939430
  2.205986	 -0.241549	  0.929236
  2.204006	 -0.258642	  0.919041
  2.202026	 -0.275734	  0.908847
  2.200045	 -0.292826	  0.898652
  2.197487	 -0.309971	  0.888677
  2.193887	 -0.327170	  0.879126
  2.190286	 -0.344369	  0.869574
  2.186686	 -0.361568	  0.860023
  2.184388	 -0.377405	  0.848026
  2.183624	 -0.391254	  0.833617
  2.182861	 -0.405103	  0.819207
  2.186455	 -0.416101	  0.802894
  2.190549	 -0.426704	  0.786438
  2.195410	 -0.437243	  0.770150
  2.204468	 -0.447107	  0.755295
  2.213526	 -0.456971	  0.740441
  2.222886	 -0.466820	  0.725764
  2.234405	 -0.476461	  0.712561
  2.245925	 -0.486103	  0.699357
  2.257750	 -0.495584	  0.686308
  2.270409	 -0.504597	  0.673718
  2.283069	 -0.513609	  0.661128
  2.296362	 -0.522339	  0.649000
  2.309897	 -0.530953	  0.637058
  2.323698	 -0.539455	  0.625343
  2.338078	 -0.547695	  0.614149
  2.352458	 -0.555936	  0.602955
  2.366838	 -0.564176	  0.591761
  2.383042	 -0.572929	  0.579516
  2.397703	 -0.580837	  0.568446
