  2.216657	  1.046837	 -0.011777
  2.218338	  1.052077	 -0.011658
  2.213729	  1.032510	 -0.013157
  2.206461	  1.013949	 -0.013460
  2.198081	  0.995707	 -0.013788
  2.189147	  0.977809	 -0.014062
  2.178606	  0.960823	 -0.014603
  2.167394	  0.944270	 -0.015701
  2.156195	  0.927687	 -0.016288
  2.147129	  0.910132	 -0.015114
  2.143862	  0.890945	 -0.011468
  2.141475	  0.871422	 -0.007819
  2.139152	  0.851876	 -0.004276
  2.137117	  0.832386	 -0.000555
  2.138321	  0.813309	  0.004306
  2.147072	  0.797171	  0.011589
  2.156882	  0.781458	  0.018769
  2.166271	  0.765710	  0.024541
  2.172372	  0.746245	  0.023407
  2.174889	  0.722856	  0.025695
  2.187076	  0.705340	  0.044848
  2.197097	  0.693267	  0.055406
  2.203465	  0.680061	  0.061590
  2.213694	  0.661832	  0.072498
  2.223444	  0.648743	  0.082449
  2.229078	  0.638112	  0.089233
  2.240652	  0.614718	  0.102802
  2.247030	  0.603034	  0.110058
  2.251134	  0.591515	  0.115227
  2.258915	  0.565337	  0.124586
  2.265465	  0.549777	  0.132386
  2.268939	  0.538775	  0.136760
  2.273118	  0.513948	  0.142882
  2.275831	  0.492724	  0.150683
  2.280702	  0.482398	  0.162751
  2.291274	  0.470556	  0.175823
  2.295499	  0.450197	  0.180639
  2.291513	  0.432261	  0.182267
  2.275535	  0.416251	  0.182392
  2.260966	  0.397412	  0.188753
  2.260146	  0.378359	  0.193773
  2.264064	  0.360709	  0.193110
  2.265802	  0.342321	  0.187125
  2.259611	  0.326838	  0.176661
  2.252474	  0.316224	  0.167049
  2.243101	  0.303606	  0.156180
  2.231612	  0.291564	  0.149044
  2.212006	  0.270228	  0.144019
  2.195886	  0.247750	  0.138403
  2.183982	  0.237594	  0.134981
  2.174542	  0.231534	  0.130266
  2.163713	  0.224769	  0.123208
  2.150351	  0.216126	  0.103832
  2.125590	  0.213554	  0.083577
  2.111639	  0.211233	  0.077407
  2.093075	  0.201053	  0.073278
  2.077967	  0.188781	  0.069904
  2.061812	  0.174858	  0.064443
  2.043565	  0.168931	  0.055407
  2.026238	  0.167359	  0.047135
  2.009692	  0.167459	  0.040567
  1.989731	  0.165982	  0.032592
  1.968004	  0.160018	  0.026933
  1.950780	  0.153516	  0.023911
  1.931695	  0.150352	  0.019911
  1.903487	  0.152225	  0.016950
  1.888881	  0.154248	  0.014207
  1.873236	  0.157318	  0.008947
  1.856140	  0.152655	 -0.007906
  1.839478	  0.148284	 -0.018288
  1.808051	  0.147432	 -0.014290
  1.793818	  0.144953	 -0.013924
  1.776821	  0.138473	 -0.018253
  1.759016	  0.127252	 -0.025756
  1.737411	  0.117523	 -0.027151
  1.717395	  0.111402	 -0.031332
  1.701117	  0.112252	 -0.039009
  1.684000	  0.120626	 -0.053672
  1.667236	  0.123955	 -0.070370
  1.649305	  0.119698	 -0.084620
  1.629361	  0.108775	 -0.091395
  1.619047	  0.089150	 -0.100728
  1.612110	  0.069046	 -0.117932
  1.598433	  0.056645	 -0.137139
  1.592427	  0.052107	 -0.147950
  1.579011	  0.046310	 -0.160304
  1.559200	  0.035290	 -0.172514
  1.541210	  0.023323	 -0.180453
  1.528789	  0.013573	 -0.185430
  1.513600	 -0.000273	 -0.190109
  1.500464	 -0.015229	 -0.196081
  1.490013	 -0.027325	 -0.202709
  1.479960	 -0.036668	 -0.213852
  1.471792	 -0.046821	 -0.232229
  1.464885	 -0.064197	 -0.245567
  1.459349	 -0.084971	 -0.252864
  1.449113	 -0.104015	 -0.256865
  1.436070	 -0.115712	 -0.263126
  1.424385	 -0.126568	 -0.278261
  1.413187	 -0.134466	 -0.292655
  1.403819	 -0.147818	 -0.305003
  1.396125	 -0.162525	 -0.316338
  1.389143	 -0.177335	 -0.327521
  1.385743	 -0.193759	 -0.338249
  1.386484	 -0.212499	 -0.344005
  1.382756	 -0.229249	 -0.346500
  1.378551	 -0.246891	 -0.349833
  1.374962	 -0.265257	 -0.355103
  1.373210	 -0.285018	 -0.360430
  1.373788	 -0.305191	 -0.362694
  1.378673	 -0.324074	 -0.360109
  1.388933	 -0.338515	 -0.351443
  1.399836	 -0.352367	 -0.342053
  1.410787	 -0.366243	 -0.332728
  1.421933	 -0.380220	 -0.323734
  1.433515	 -0.393957	 -0.314679
  1.444837	 -0.407759	 -0.305396
  1.455878	 -0.420416	 -0.294814
  1.466250	 -0.434926	 -0.286694
  1.478939	 -0.451317	 -0.280207
  1.490064	 -0.463074	 -0.270661
  1.495786	 -0.477580	 -0.264978
  1.511536	 -0.496780	 -0.260138
  1.531397	 -0.508442	 -0.249984
  1.544050	 -0.516900	 -0.241173
  1.550198	 -0.523789	 -0.232621
  1.556885	 -0.540099	 -0.226330
  1.561758	 -0.558793	 -0.224093
  1.566488	 -0.578799	 -0.222463
  1.572576	 -0.596822	 -0.216712
  1.579367	 -0.612631	 -0.212474
  1.588101	 -0.627764	 -0.212076
  1.597672	 -0.642341	 -0.214804
  1.610172	 -0.656204	 -0.214460
  1.626341	 -0.669941	 -0.215813
  1.641143	 -0.683232	 -0.220357
  1.648919	 -0.694607	 -0.228387
  1.653693	 -0.704345	 -0.236304
  1.657528	 -0.713048	 -0.247374
  1.665129	 -0.723875	 -0.262684
  1.676980	 -0.734169	 -0.278488
  1.689693	 -0.745805	 -0.287849
  1.698806	 -0.756461	 -0.295864
  1.707260	 -0.767976	 -0.308027
  1.716572	 -0.777992	 -0.320951
  1.724145	 -0.786311	 -0.337527
  1.732513	 -0.795465	 -0.352980
  1.739265	 -0.803076	 -0.370271
  1.746810	 -0.812008	 -0.386620
  1.753028	 -0.822546	 -0.402589
  1.757847	 -0.833891	 -0.418311
  1.762758	 -0.845724	 -0.433865
  1.768990	 -0.858134	 -0.448417
  1.774487	 -0.870124	 -0.463204
  1.779980	 -0.882356	 -0.478259
  1.785850	 -0.895049	 -0.492799
  1.791771	 -0.908913	 -0.505912
  1.796959	 -0.925706	 -0.515476
  1.800541	 -0.943777	 -0.523596
  1.804579	 -0.961545	 -0.531468
  1.807647	 -0.980039	 -0.539004
  1.811257	 -0.998887	 -0.545454
  1.816033	 -1.017730	 -0.550552
  1.819748	 -1.036378	 -0.556611
  1.824107	 -1.055380	 -0.561952
  1.828632	 -1.074616	 -0.565408
  1.831038	 -1.094797	 -0.567011
  1.831920	 -1.115008	 -0.566704
  1.832926	 -1.135113	 -0.565155
  1.833590	 -1.155092	 -0.563892
  1.834008	 -1.175221	 -0.562617
  1.834149	 -1.195362	 -0.560011
  1.831945	 -1.213372	 -0.554430
  1.822235	 -1.229735	 -0.547712
  1.812693	 -1.245103	 -0.536018
  1.805254	 -1.262395	 -0.524462
  1.802716	 -1.280671	 -0.515522
  1.803587	 -1.299819	 -0.509464
  1.802772	 -1.319254	 -0.502939
  1.802040	 -1.336532	 -0.492077
  1.796135	 -1.352789	 -0.477888
  1.789830	 -1.365950	 -0.468550
  1.786113	 -1.378286	 -0.462794
  1.780296	 -1.391276	 -0.460063
  1.771276	 -1.403904	 -0.460835
  1.755174	 -1.420175	 -0.465089
  1.744477	 -1.429418	 -0.465320
  1.728986	 -1.442736	 -0.462990
  1.714876	 -1.449787	 -0.462103
  1.700312	 -1.461114	 -0.462342
  1.679493	 -1.480135	 -0.464900
  1.664659	 -1.492524	 -0.467628
  1.652782	 -1.504201	 -0.470196
  1.640398	 -1.519341	 -0.474808
  1.625398	 -1.537919	 -0.474592
  1.609138	 -1.550332	 -0.472142
  1.593689	 -1.561583	 -0.469064
  1.575850	 -1.571131	 -0.465629
  1.557444	 -1.580132	 -0.464025
  1.535747	 -1.587357	 -0.462933
  1.513505	 -1.592254	 -0.460215
  1.499209	 -1.596919	 -0.457767
  1.483266	 -1.608431	 -0.461286
  1.467070	 -1.621705	 -0.462701
  1.449779	 -1.633899	 -0.461749
  1.433154	 -1.645995	 -0.460004
  1.417095	 -1.658177	 -0.458253
  1.401735	 -1.670837	 -0.455188
  1.386405	 -1.683912	 -0.451864
  1.372119	 -1.697977	 -0.446986
  1.358552	 -1.711882	 -0.441451
  1.345694	 -1.725548	 -0.434100
  1.331935	 -1.737764	 -0.425410
  1.318392	 -1.747873	 -0.413907
  1.304910	 -1.754789	 -0.399805
  1.293104	 -1.759900	 -0.383259
  1.283151	 -1.766606	 -0.367987
  1.273263	 -1.773906	 -0.354344
  1.261102	 -1.780808	 -0.341134
  1.248339	 -1.784017	 -0.328539
  1.231694	 -1.783091	 -0.314513
  1.216506	 -1.782092	 -0.299651
  1.202186	 -1.783983	 -0.284341
  1.191435	 -1.796046	 -0.266236
  1.185524	 -1.817554	 -0.244003
  1.181063	 -1.824774	 -0.224880
  1.176999	 -1.826029	 -0.212863
  1.167295	 -1.827526	 -0.201003
  1.148711	 -1.831032	 -0.191588
  1.131103	 -1.842246	 -0.185065
  1.118096	 -1.859467	 -0.172682
  1.109209	 -1.873216	 -0.162747
  1.102784	 -1.883510	 -0.150546
  1.095642	 -1.897039	 -0.139520
  1.085493	 -1.914410	 -0.130522
  1.076027	 -1.926607	 -0.123568
  1.066760	 -1.939527	 -0.121402
  1.055218	 -1.958018	 -0.122706
  1.045127	 -1.974001	 -0.121885
  1.035828	 -1.990004	 -0.122665
  1.025283	 -2.008656	 -0.125513
  1.017156	 -2.025051	 -0.127206
  1.007158	 -2.042707	 -0.130150
  0.997527	 -2.061802	 -0.133216
  0.990301	 -2.077653	 -0.135326
  0.980559	 -2.095986	 -0.138628
  0.971719	 -2.115667	 -0.141731
  0.964761	 -2.131278	 -0.144214
  0.955270	 -2.149914	 -0.147531
  0.946403	 -2.170469	 -0.150472
  0.940414	 -2.184515	 -0.152497
  0.930662	 -2.202658	 -0.155654
  0.922045	 -2.226912	 -0.158115
  0.919880	 -2.243981	 -0.158609
  0.918493	 -2.260169	 -0.156932
  0.917725	 -2.285479	 -0.153672
  0.911437	 -2.304213	 -0.156756
