  1.312197	  0.312184	  2.128598
  1.314875	  0.312362	  2.130491
  1.298568	  0.311280	  2.118963
  1.282260	  0.310197	  2.107434
  1.265781	  0.307981	  2.096321
  1.249239	  0.305211	  2.085426
  1.232735	  0.302086	  2.074571
  1.216407	  0.297709	  2.063882
  1.200079	  0.293331	  2.053194
  1.184288	  0.288014	  2.042132
  1.168754	  0.282281	  2.030914
  1.153009	  0.276616	  2.019961
  1.136676	  0.271155	  2.009791
  1.120344	  0.265695	  1.999620
  1.103639	  0.261790	  1.989338
  1.086892	  0.258104	  1.979046
  1.069982	  0.254939	  1.968845
  1.052861	  0.252534	  1.958792
  1.035659	  0.250300	  1.948837
  1.017465	  0.250727	  1.940542
  0.999196	  0.251434	  1.932434
  0.980582	  0.257617	  1.928524
  0.962348	  0.265510	  1.926239
  0.945658	  0.276480	  1.927299
  0.930270	  0.288926	  1.930176
  0.915874	  0.302212	  1.934205
  0.901478	  0.315499	  1.938235
  0.887726	  0.329460	  1.942231
  0.874170	  0.343615	  1.946215
  0.860614	  0.357769	  1.950199
  0.847058	  0.371924	  1.954183
  0.833502	  0.386079	  1.958167
  0.818822	  0.399356	  1.961038
  0.804070	  0.412568	  1.963831
  0.789317	  0.425780	  1.966624
  0.774565	  0.438993	  1.969417
  0.759813	  0.452205	  1.972210
  0.745060	  0.465418	  1.975003
  0.727966	  0.475797	  1.974809
  0.710825	  0.486099	  1.974541
  0.693685	  0.496402	  1.974273
  0.676545	  0.506705	  1.974006
  0.659405	  0.517007	  1.973738
  0.641679	  0.525516	  1.970079
  0.623923	  0.532761	  1.964401
  0.606168	  0.540007	  1.958722
  0.588413	  0.547252	  1.953043
  0.571126	  0.553360	  1.945051
  0.554921	  0.557793	  1.934200
  0.538716	  0.562226	  1.923348
  0.522512	  0.566660	  1.912497
  0.508256	  0.569418	  1.898744
  0.494156	  0.572055	  1.884806
  0.480196	  0.574609	  1.870714
  0.467025	  0.576703	  1.855810
  0.453854	  0.578796	  1.840905
  0.440124	  0.580291	  1.826440
  0.426322	  0.581707	  1.812035
  0.411813	  0.582269	  1.798281
  0.396725	  0.582068	  1.785154
  0.381637	  0.581867	  1.772028
  0.365708	  0.580225	  1.760045
  0.349723	  0.578476	  1.748153
  0.333698	  0.576577	  1.736338
  0.317423	  0.573596	  1.725102
  0.301149	  0.570614	  1.713867
  0.284934	  0.567441	  1.702597
  0.269044	  0.563315	  1.691173
  0.253154	  0.559189	  1.679750
  0.237450	  0.554799	  1.668170
  0.222485	  0.549434	  1.656034
  0.207520	  0.544068	  1.643899
  0.193025	  0.538144	  1.631458
  0.179215	  0.531461	  1.618627
  0.165405	  0.524779	  1.605796
  0.152537	  0.516988	  1.592616
  0.139905	  0.508939	  1.579363
  0.127653	  0.500460	  1.566022
  0.116276	  0.491059	  1.552523
  0.104899	  0.481659	  1.539025
  0.094712	  0.471146	  1.525398
  0.084710	  0.460472	  1.511759
  0.075235	  0.449394	  1.498065
  0.066370	  0.437877	  1.484326
  0.057505	  0.426359	  1.470588
  0.048794	  0.414880	  1.456719
  0.040105	  0.403406	  1.442832
  0.031416	  0.391933	  1.428944
  0.021573	  0.381390	  1.415090
  0.011327	  0.371195	  1.401266
  0.001081	  0.361001	  1.387441
 -0.009255	  0.350898	  1.373618
 -0.021497	  0.342914	  1.359966
 -0.033739	  0.334930	  1.346313
 -0.045980	  0.326946	  1.332660
 -0.058672	  0.319554	  1.319085
 -0.072239	  0.313425	  1.305729
 -0.085807	  0.307296	  1.292374
 -0.099381	  0.301182	  1.279020
 -0.113555	  0.296409	  1.265741
 -0.127729	  0.291637	  1.252462
 -0.141898	  0.287079	  1.239103
 -0.156032	  0.283346	  1.225454
 -0.170166	  0.279613	  1.211805
 -0.184335	  0.276663	  1.198002
 -0.198512	  0.273999	  1.184148
 -0.212939	  0.271922	  1.170454
 -0.227657	  0.270578	  1.156979
 -0.242518	  0.269604	  1.143630
 -0.257821	  0.269903	  1.130756
 -0.273125	  0.270202	  1.117883
 -0.288708	  0.271746	  1.105443
 -0.304308	  0.273372	  1.093033
 -0.320024	  0.274985	  1.080769
 -0.335852	  0.276586	  1.068648
 -0.351700	  0.278152	  1.056549
 -0.367867	  0.279192	  1.044822
 -0.384035	  0.280231	  1.033094
 -0.400336	  0.280974	  1.021531
 -0.416716	  0.281538	  1.010069
 -0.433116	  0.282159	  0.998638
 -0.449608	  0.283054	  0.987359
 -0.466100	  0.283949	  0.976080
 -0.482581	  0.285261	  0.964826
 -0.499055	  0.286729	  0.953581
 -0.515511	  0.288276	  0.942320
 -0.531906	  0.290077	  0.931009
 -0.548302	  0.291879	  0.919697
 -0.564589	  0.293606	  0.908219
 -0.580843	  0.295312	  0.896691
 -0.597021	  0.296914	  0.885042
 -0.612991	  0.298238	  0.873075
 -0.628960	  0.299562	  0.861108
 -0.645076	  0.300368	  0.849291
 -0.661232	  0.301023	  0.837519
 -0.677425	  0.301434	  0.825789
 -0.693711	  0.301169	  0.814182
 -0.709996	  0.300904	  0.802575
 -0.726242	  0.300085	  0.790939
 -0.742467	  0.299036	  0.779293
 -0.758682	  0.297922	  0.767639
 -0.774817	  0.296339	  0.755926
 -0.790951	  0.294757	  0.744214
 -0.807124	  0.293079	  0.732569
 -0.823325	  0.291334	  0.720972
 -0.839560	  0.289628	  0.709417
 -0.855997	  0.288169	  0.698116
 -0.872434	  0.286709	  0.686816
 -0.889212	  0.285633	  0.675984
 -0.906101	  0.284686	  0.665312
 -0.923124	  0.283824	  0.654850
 -0.940348	  0.283091	  0.644711
 -0.957572	  0.282359	  0.634573
 -0.974760	  0.281056	  0.624429
 -0.991946	  0.279743	  0.614286
 -1.008841	  0.278185	  0.603696
 -1.025370	  0.276338	  0.592588
 -1.041899	  0.274492	  0.581481
 -1.056811	  0.272336	  0.568328
 -1.071298	  0.270112	  0.554720
 -1.085430	  0.267944	  0.540734
 -1.096129	  0.266318	  0.523915
 -1.106829	  0.264691	  0.507096
 -1.117186	  0.263102	  0.490061
 -1.123541	  0.261970	  0.471132
 -1.129896	  0.260837	  0.452202
 -1.136252	  0.259705	  0.433272
 -1.142508	  0.258583	  0.414309
 -1.147372	  0.257612	  0.394934
 -1.152236	  0.256641	  0.375559
 -1.157101	  0.255670	  0.356184
 -1.161965	  0.254698	  0.336809
 -1.167491	  0.253751	  0.317611
 -1.173606	  0.252826	  0.298591
 -1.179722	  0.251900	  0.279572
 -1.185838	  0.250975	  0.260552
 -1.193198	  0.246663	  0.242463
 -1.201074	  0.240785	  0.225043
 -1.210693	  0.226892	  0.214346
 -1.220328	  0.211327	  0.206290
 -1.229762	  0.194463	  0.201130
 -1.239161	  0.177491	  0.196272
 -1.248689	  0.160219	  0.192971
 -1.258293	  0.142715	  0.191795
 -1.268189	  0.125375	  0.192971
 -1.278251	  0.108589	  0.197091
 -1.288438	  0.091908	  0.201332
 -1.300007	  0.076596	  0.206962
 -1.311575	  0.061284	  0.212593
 -1.323144	  0.045972	  0.218223
 -1.334713	  0.030659	  0.223854
 -1.347395	  0.015819	  0.228203
 -1.361136	  0.001594	  0.231177
 -1.374877	 -0.012631	  0.234150
 -1.388618	 -0.026855	  0.237124
 -1.402359	 -0.041080	  0.240098
 -1.416100	 -0.055305	  0.243071
 -1.430312	 -0.069317	  0.244374
 -1.444785	 -0.083119	  0.244518
 -1.459258	 -0.096921	  0.244663
 -1.473731	 -0.110724	  0.244807
 -1.488204	 -0.124526	  0.244951
 -1.503778	 -0.137036	  0.243962
 -1.520058	 -0.148510	  0.242144
 -1.536338	 -0.159983	  0.240326
 -1.556141	 -0.162099	  0.238483
 -1.576003	 -0.160520	  0.236750
 -1.595865	 -0.158942	  0.235017
 -1.614651	 -0.152349	  0.233119
 -1.632635	 -0.143812	  0.231190
 -1.650618	 -0.135275	  0.229261
 -1.668601	 -0.126738	  0.227332
 -1.686297	 -0.117782	  0.224753
 -1.700630	 -0.106065	  0.217186
 -1.714964	 -0.094348	  0.209619
 -1.729298	 -0.082630	  0.202053
 -1.743631	 -0.070913	  0.194486
 -1.758156	 -0.058263	  0.189101
 -1.772698	 -0.045212	  0.184836
 -1.787241	 -0.032161	  0.180571
 -1.801531	 -0.018830	  0.176318
 -1.815032	 -0.004688	  0.172111
 -1.828534	  0.009455	  0.167904
 -1.842035	  0.023598	  0.163698
 -1.855543	  0.037597	  0.159053
 -1.869020	  0.051051	  0.152943
 -1.882498	  0.064506	  0.146834
 -1.895976	  0.077961	  0.140724
 -1.909453	  0.091415	  0.134615
 -1.922931	  0.104870	  0.128505
 -1.935679	  0.116421	  0.118305
 -1.948334	  0.127779	  0.107775
 -1.960988	  0.139137	  0.097246
 -1.973642	  0.150495	  0.086717
 -1.986296	  0.161853	  0.076187
 -1.999025	  0.172194	  0.064741
 -2.011772	  0.181720	  0.052625
 -2.024518	  0.191246	  0.040509
 -2.037264	  0.200772	  0.028393
 -2.051089	  0.208603	  0.016247
 -2.065402	  0.215556	  0.004131
 -2.079714	  0.222510	 -0.007985
 -2.094706	  0.227470	 -0.020259
 -2.109803	  0.232062	 -0.032546
 -2.125003	  0.236347	 -0.044819
 -2.140352	  0.240152	 -0.057063
 -2.155710	  0.244010	 -0.069280
 -2.171180	  0.248700	 -0.081056
 -2.186651	  0.253391	 -0.092832
 -2.201871	  0.259510	 -0.104272
 -2.217023	  0.265953	 -0.115626
 -2.232087	  0.272740	 -0.126897
 -2.247066	  0.279839	 -0.138088
 -2.262045	  0.286938	 -0.149279
 -2.277253	  0.292799	 -0.160869
 -2.292469	  0.298614	 -0.172474
 -2.307772	  0.304083	 -0.184132
 -2.323433	  0.307826	 -0.195995
 -2.339094	  0.311569	 -0.207858
 -2.354859	  0.314729	 -0.219752
 -2.370816	  0.316504	 -0.231677
 -2.386774	  0.318279	 -0.243602
 -2.402619	  0.319280	 -0.255765
 -2.418279	  0.319276	 -0.268205
 -2.433939	  0.319273	 -0.280645
 -2.449600	  0.319269	 -0.293085
 -2.465260	  0.319266	 -0.305525
 -2.483579	  0.318915	 -0.320498
 -2.498891	  0.318345	 -0.333351
