  1.697571	 -2.500476	 -0.216266
  1.680764	 -2.475719	 -0.214125
  1.682773	 -2.430284	 -0.242917
  1.681730	 -2.392558	 -0.267662
  1.681650	 -2.354307	 -0.299388
  1.677631	 -2.315327	 -0.334860
  1.671023	 -2.279392	 -0.366484
  1.664691	 -2.243964	 -0.396650
  1.658410	 -2.203844	 -0.429683
  1.652133	 -2.164112	 -0.462066
  1.647062	 -2.129012	 -0.489724
  1.641093	 -2.090011	 -0.520258
  1.635505	 -2.050381	 -0.550892
  1.629352	 -2.009180	 -0.582659
  1.624614	 -1.969878	 -0.611661
  1.620549	 -1.931932	 -0.638983
  1.616865	 -1.889757	 -0.668184
  1.612785	 -1.849528	 -0.696908
  1.608539	 -1.810493	 -0.725967
  1.604388	 -1.770034	 -0.756345
  1.601718	 -1.731267	 -0.784592
  1.599426	 -1.689613	 -0.815593
  1.597187	 -1.651776	 -0.844862
  1.593868	 -1.611448	 -0.877389
  1.590451	 -1.575092	 -0.907338
  1.586978	 -1.535487	 -0.941261
  1.584422	 -1.501362	 -0.973177
  1.580371	 -1.465692	 -1.005764
  1.574617	 -1.429059	 -1.036088
  1.567481	 -1.386833	 -1.068906
  1.561464	 -1.348684	 -1.097911
  1.557516	 -1.307210	 -1.129534
  1.550876	 -1.269520	 -1.158163
  1.548673	 -1.233667	 -1.186794
  1.542771	 -1.195431	 -1.216571
  1.538844	 -1.152241	 -1.249359
  1.531744	 -1.114219	 -1.276607
  1.525025	 -1.074984	 -1.310337
  1.521497	 -1.032230	 -1.340392
  1.519956	 -0.994336	 -1.368435
  1.518651	 -0.955946	 -1.400300
  1.516880	 -0.917974	 -1.432045
  1.514730	 -0.878936	 -1.463866
  1.511726	 -0.841298	 -1.493519
  1.507378	 -0.800564	 -1.524759
  1.502389	 -0.761649	 -1.553065
  1.496483	 -0.720122	 -1.582531
  1.491188	 -0.680347	 -1.610380
  1.485377	 -0.638249	 -1.641511
  1.479801	 -0.601253	 -1.669985
  1.474514	 -0.565210	 -1.697430
  1.470802	 -0.522890	 -1.729750
  1.468053	 -0.484022	 -1.760085
  1.463787	 -0.440852	 -1.791338
  1.460602	 -0.403059	 -1.819587
  1.454825	 -0.365308	 -1.845673
  1.448787	 -0.325338	 -1.876973
  1.443848	 -0.286039	 -1.906924
  1.437036	 -0.246271	 -1.938840
  1.431516	 -0.208739	 -1.967963
  1.425029	 -0.171316	 -1.999812
  1.418065	 -0.134618	 -2.031414
  1.413159	 -0.093713	 -2.062557
  1.410403	 -0.056360	 -2.092868
  1.406538	 -0.021679	 -2.124434
  1.400924	  0.016199	 -2.158002
  1.397901	  0.053720	 -2.190869
  1.395161	  0.095744	 -2.220371
  1.390657	  0.131686	 -2.248619
  1.387152	  0.169867	 -2.280979
  1.382915	  0.206734	 -2.315940
  1.378220	  0.241967	 -2.347858
  1.373076	  0.280174	 -2.379695
  1.367747	  0.321167	 -2.410836
  1.362791	  0.364591	 -2.440933
  1.358054	  0.403701	 -2.466818
  1.354570	  0.443037	 -2.495176
  1.357327	  0.486761	 -2.525139
  1.355980	  0.528298	 -2.549171
  1.348363	  0.567329	 -2.583080
  1.338463	  0.597821	 -2.617466
  1.351848	  0.603799	 -2.643640
