 -2.152055	  0.302955	  2.111345
 -2.130747	  0.299955	  2.090441
 -2.102199	  0.275288	  2.065647
 -2.084834	  0.241085	  2.027828
 -2.057816	  0.208289	  1.996523
 -2.036916	  0.179217	  1.967583
 -2.018101	  0.148991	  1.930941
 -1.999808	  0.115769	  1.897106
 -1.983487	  0.082950	  1.866294
 -1.966630	  0.048706	  1.834352
 -1.948516	  0.015042	  1.803392
 -1.926483	 -0.019683	  1.772562
 -1.903432	 -0.052574	  1.743018
 -1.877320	 -0.085902	  1.709946
 -1.854991	 -0.114456	  1.682326
 -1.830044	 -0.146475	  1.652504
 -1.809452	 -0.178384	  1.621211
 -1.790638	 -0.209977	  1.589036
 -1.772874	 -0.243465	  1.555808
 -1.753810	 -0.281755	  1.520555
 -1.735897	 -0.316197	  1.491137
 -1.716271	 -0.345349	  1.463330
 -1.698402	 -0.379554	  1.429706
 -1.674784	 -0.414328	  1.398934
 -1.659476	 -0.445285	  1.361135
 -1.637965	 -0.476804	  1.331838
 -1.624842	 -0.508999	  1.296025
 -1.603059	 -0.538988	  1.262152
 -1.585343	 -0.575052	  1.227777
 -1.564919	 -0.609942	  1.195583
 -1.544142	 -0.645521	  1.166466
 -1.526719	 -0.678569	  1.139493
 -1.519054	 -0.714465	  1.111175
 -1.530116	 -0.742368	  1.090487
 -1.579265	 -0.780330	  1.060662
 -1.716037	 -0.887919	  0.955700
 -1.748666	 -0.943086	  0.895899
 -1.763742	 -0.976030	  0.860913
 -1.779243	 -1.014390	  0.825045
 -1.766974	 -1.083265	  0.777314
 -1.716888	 -1.132373	  0.733707
 -1.690128	 -1.150879	  0.720129
 -1.640139	 -1.173790	  0.693145
 -1.593050	 -1.176691	  0.680402
 -1.537494	 -1.187307	  0.671279
 -1.389471	 -1.173442	  0.674560
 -1.245937	 -1.172137	  0.657214
 -1.189793	 -1.192885	  0.627755
 -1.158430	 -1.218638	  0.597430
 -1.135658	 -1.248281	  0.563154
 -1.116985	 -1.281760	  0.526003
 -1.101372	 -1.313308	  0.492778
 -1.084194	 -1.347454	  0.460029
 -1.067351	 -1.383509	  0.428478
 -1.051571	 -1.418165	  0.400226
 -1.033343	 -1.457748	  0.373363
 -1.017094	 -1.493196	  0.358614
 -0.992582	 -1.549561	  0.355737
 -0.928675	 -1.673526	  0.416041
 -0.864695	 -1.746029	  0.453628
 -0.824022	 -1.785789	  0.463883
 -0.782254	 -1.831148	  0.463942
 -0.728335	 -1.923784	  0.469769
 -0.705399	 -1.982429	  0.461931
 -0.684468	 -2.013882	  0.445436
 -0.677125	 -2.027642	  0.427105
 -0.655232	 -2.050906	  0.356984
 -0.644767	 -2.054781	  0.290528
 -0.634665	 -2.052574	  0.194534
 -0.642454	 -2.058222	  0.091385
 -0.652371	 -2.057218	  0.032369
 -0.675747	 -2.051272	 -0.028299
 -0.705485	 -2.038299	 -0.152921
 -0.687365	 -2.056973	 -0.206111
 -0.664278	 -2.086532	 -0.242802
 -0.639657	 -2.118095	 -0.276048
 -0.618098	 -2.146644	 -0.305009
 -0.596806	 -2.177739	 -0.333546
 -0.572627	 -2.213951	 -0.364365
 -0.550642	 -2.245022	 -0.394928
 -0.528497	 -2.276932	 -0.429198
 -0.508474	 -2.307977	 -0.461603
 -0.487419	 -2.340030	 -0.494467
 -0.467850	 -2.369985	 -0.530073
 -0.450014	 -2.401313	 -0.563242
 -0.423491	 -2.438050	 -0.594266
 -0.402620	 -2.467767	 -0.620985
 -0.387548	 -2.494784	 -0.660053
 -0.360253	 -2.531780	 -0.685271
 -0.347926	 -2.566521	 -0.719692
 -0.321992	 -2.592619	 -0.752446
 -0.305862	 -2.625368	 -0.788147
 -0.281885	 -2.661891	 -0.819587
 -0.261350	 -2.690659	 -0.848267
 -0.244714	 -2.727310	 -0.885333
 -0.221522	 -2.762527	 -0.913921
 -0.198762	 -2.792867	 -0.947384
 -0.186989	 -2.828368	 -0.982532
 -0.188858	 -2.856652	 -0.992357
