 -2.188456	 -0.200690	 -1.207009
 -2.226438	 -0.227645	 -1.218450
 -2.210534	 -0.216385	 -1.213945
 -2.194645	 -0.205123	 -1.209398
 -2.178714	 -0.193900	 -1.204895
 -2.162718	 -0.182778	 -1.200374
 -2.146699	 -0.171703	 -1.195816
 -2.130513	 -0.160982	 -1.191012
 -2.114277	 -0.150369	 -1.186139
 -2.098025	 -0.139765	 -1.181300
 -2.081533	 -0.129532	 -1.176469
 -2.065022	 -0.119329	 -1.171633
 -2.048356	 -0.109423	 -1.166717
 -2.031493	 -0.099855	 -1.161811
 -2.014629	 -0.090270	 -1.156936
 -1.997669	 -0.080850	 -1.152073
 -1.980666	 -0.071507	 -1.147217
 -1.963634	 -0.062186	 -1.142461
 -1.946420	 -0.053033	 -1.137974
 -1.929403	 -0.043609	 -1.133413
 -1.912521	 -0.034365	 -1.129666
 -1.894097	 -0.026048	 -1.128252
 -1.876205	 -0.016202	 -1.127349
 -1.859290	 -0.004491	 -1.127941
 -1.840583	  0.007085	 -1.125041
 -1.821308	  0.012035	 -1.115443
 -1.800320	  0.019344	 -1.097727
 -1.791249	  0.026523	 -1.085623
 -1.781544	  0.036286	 -1.073348
 -1.766896	  0.048692	 -1.063620
 -1.751148	  0.058939	 -1.055026
 -1.736297	  0.067180	 -1.047219
 -1.719449	  0.075543	 -1.039859
 -1.700902	  0.084791	 -1.034266
 -1.683489	  0.094288	 -1.028654
 -1.671486	  0.104067	 -1.022447
 -1.659473	  0.117237	 -1.014324
 -1.642354	  0.133000	 -1.003948
 -1.624450	  0.148018	 -0.994112
 -1.615729	  0.155695	 -0.988739
 -1.602299	  0.163370	 -0.981884
 -1.586697	  0.172963	 -0.974422
 -1.566740	  0.184734	 -0.960632
 -1.552782	  0.196589	 -0.950323
 -1.543522	  0.204441	 -0.943591
 -1.530778	  0.217562	 -0.933825
 -1.515024	  0.230586	 -0.923592
 -1.500702	  0.241024	 -0.913990
 -1.485713	  0.248866	 -0.906174
 -1.472591	  0.258542	 -0.895793
 -1.459400	  0.268623	 -0.885664
 -1.445034	  0.276805	 -0.874435
 -1.429313	  0.283305	 -0.861572
 -1.415304	  0.288864	 -0.848558
 -1.401652	  0.297911	 -0.839417
 -1.387242	  0.312711	 -0.831558
 -1.376241	  0.323333	 -0.823572
 -1.363548	  0.337395	 -0.816466
 -1.343711	  0.351875	 -0.805851
 -1.323962	  0.362360	 -0.796001
 -1.313548	  0.367745	 -0.789338
 -1.298867	  0.376507	 -0.780090
 -1.283322	  0.383922	 -0.769204
 -1.262697	  0.392925	 -0.757310
 -1.243008	  0.400812	 -0.750006
 -1.229816	  0.406432	 -0.744206
 -1.218909	  0.411618	 -0.740150
 -1.201260	  0.422464	 -0.722525
 -1.187880	  0.431819	 -0.703201
 -1.182415	  0.436964	 -0.695017
 -1.169066	  0.450047	 -0.677705
 -1.153729	  0.465721	 -0.658117
 -1.144531	  0.474819	 -0.643050
 -1.135812	  0.480111	 -0.634063
 -1.120469	  0.485318	 -0.617715
 -1.107323	  0.488196	 -0.608981
 -1.088509	  0.492747	 -0.599737
 -1.067523	  0.497974	 -0.585632
 -1.048820	  0.506224	 -0.573684
 -1.036634	  0.512446	 -0.567430
 -1.020244	  0.521394	 -0.563161
 -1.000622	  0.533249	 -0.558313
 -0.984509	  0.544969	 -0.558391
 -0.967747	  0.557303	 -0.557244
 -0.947147	  0.568227	 -0.547992
 -0.933069	  0.576235	 -0.541462
 -0.921558	  0.584386	 -0.535049
 -0.899135	  0.600575	 -0.525709
 -0.886554	  0.607656	 -0.520174
 -0.872278	  0.614950	 -0.512880
 -0.854028	  0.626492	 -0.504675
 -0.840069	  0.635755	 -0.500302
 -0.822526	  0.647259	 -0.494911
 -0.803862	  0.655876	 -0.486824
 -0.789797	  0.661573	 -0.479314
 -0.770243	  0.667624	 -0.468877
 -0.753078	  0.675983	 -0.460948
 -0.740195	  0.684954	 -0.454538
 -0.722528	  0.697398	 -0.445642
 -0.707715	  0.703239	 -0.437734
 -0.691612	  0.706778	 -0.427592
 -0.670601	  0.713040	 -0.412583
 -0.659036	  0.718439	 -0.403908
 -0.651436	  0.726341	 -0.392411
 -0.628937	  0.737430	 -0.381550
 -0.606271	  0.743430	 -0.377212
 -0.593921	  0.749559	 -0.372263
 -0.577402	  0.757106	 -0.364044
 -0.553744	  0.762206	 -0.354243
 -0.538548	  0.763151	 -0.352542
 -0.519545	  0.765595	 -0.353350
 -0.494864	  0.768975	 -0.342306
 -0.478398	  0.770198	 -0.332575
 -0.461188	  0.769112	 -0.323058
 -0.443298	  0.769867	 -0.313708
 -0.426523	  0.770631	 -0.302828
 -0.409790	  0.767975	 -0.293462
 -0.389938	  0.765274	 -0.286381
 -0.373135	  0.764967	 -0.282988
 -0.351181	  0.763380	 -0.276488
 -0.329142	  0.762464	 -0.267857
 -0.315985	  0.765535	 -0.260846
 -0.299266	  0.767775	 -0.250595
 -0.279526	  0.771288	 -0.237994
 -0.266083	  0.775860	 -0.230009
 -0.246758	  0.779043	 -0.220724
 -0.220145	  0.782914	 -0.212945
 -0.210523	  0.786285	 -0.211121
 -0.191337	  0.788537	 -0.208897
 -0.160593	  0.787435	 -0.199097
 -0.148333	  0.786868	 -0.194180
 -0.131683	  0.787257	 -0.188808
 -0.111756	  0.791194	 -0.183367
 -0.095713	  0.799101	 -0.176952
 -0.077245	  0.807664	 -0.169084
 -0.059769	  0.814612	 -0.161337
 -0.043108	  0.822382	 -0.153435
 -0.026218	  0.830106	 -0.145540
 -0.007870	  0.835750	 -0.138133
  0.011085	  0.838009	 -0.132646
  0.027994	  0.839268	 -0.130610
  0.049760	  0.850692	 -0.132570
  0.071517	  0.859511	 -0.130631
  0.086112	  0.868389	 -0.129367
  0.104651	  0.880151	 -0.127776
  0.126801	  0.891541	 -0.122718
  0.136254	  0.898016	 -0.120335
  0.155013	  0.906860	 -0.114471
  0.174860	  0.913495	 -0.107717
  0.187650	  0.922196	 -0.104886
  0.214248	  0.935535	 -0.100793
  0.222499	  0.942339	 -0.100276
  0.234162	  0.942065	 -0.094698
  0.261701	  0.947613	 -0.086188
  0.279934	  0.950416	 -0.080734
  0.292003	  0.952563	 -0.078654
  0.312902	  0.960678	 -0.077398
  0.332980	  0.972931	 -0.077946
  0.352119	  0.983138	 -0.082498
  0.371372	  0.988055	 -0.090894
  0.386407	  0.989935	 -0.099163
  0.408880	  0.995769	 -0.106292
  0.429355	  1.002707	 -0.110991
  0.449144	  1.011746	 -0.114698
  0.472065	  1.017111	 -0.113689
  0.482397	  1.019164	 -0.118150
  0.495997	  1.024171	 -0.121717
  0.520489	  1.027650	 -0.132755
  0.540881	  1.027599	 -0.133346
  0.563760	  1.025072	 -0.133275
  0.584756	  1.022058	 -0.134232
  0.608157	  1.020658	 -0.137583
  0.627239	  1.011289	 -0.131694
  0.642927	  1.016975	 -0.139543
  0.660400	  1.010467	 -0.137124
  0.687596	  1.008050	 -0.138641
  0.701572	  1.006393	 -0.139833
  0.720370	  1.007690	 -0.145700
  0.746791	  1.009399	 -0.148589
  0.761523	  1.011430	 -0.152313
  0.776412	  1.014492	 -0.157421
  0.796830	  1.024739	 -0.158993
  0.815543	  1.029284	 -0.157178
  0.837237	  1.031766	 -0.154909
  0.855255	  1.031375	 -0.154435
  0.878188	  1.034678	 -0.152011
  0.904381	  1.038773	 -0.143383
  0.920821	  1.041745	 -0.142453
  0.935713	  1.039541	 -0.143845
  0.954337	  1.045995	 -0.142760
  0.976462	  1.049034	 -0.141611
  0.998174	  1.052021	 -0.138766
  1.015886	  1.052093	 -0.133624
  1.030248	  1.055002	 -0.134638
  1.047596	  1.066730	 -0.132943
  1.064977	  1.078831	 -0.133704
  1.085077	  1.096937	 -0.130713
  1.097310	  1.109416	 -0.127022
  1.104751	  1.131210	 -0.120633
  1.115291	  1.136033	 -0.114893
  1.132426	  1.145942	 -0.108258
  1.140725	  1.154745	 -0.106172
  1.152400	  1.174028	 -0.105704
  1.165953	  1.194225	 -0.110272
  1.175147	  1.209470	 -0.111301
  1.176386	  1.229226	 -0.113065
  1.186798	  1.243940	 -0.114036
  1.197397	  1.257165	 -0.116890
  1.204596	  1.283351	 -0.115620
  1.207883	  1.296215	 -0.113791
  1.212016	  1.312571	 -0.112875
  1.217298	  1.334257	 -0.113818
  1.221105	  1.353329	 -0.111902
  1.223020	  1.371498	 -0.109583
  1.223980	  1.400302	 -0.108286
  1.223637	  1.426400	 -0.106077
  1.223857	  1.436083	 -0.104086
  1.224104	  1.445115	 -0.102593
  1.221847	  1.471034	 -0.097597
  1.215199	  1.497159	 -0.088635
  1.213028	  1.510664	 -0.084248
  1.210145	  1.526041	 -0.078076
  1.205175	  1.550908	 -0.069455
  1.206193	  1.572058	 -0.064252
  1.206719	  1.584446	 -0.061406
  1.208718	  1.601654	 -0.056494
  1.210877	  1.623337	 -0.050683
  1.216185	  1.645503	 -0.048021
  1.218433	  1.668705	 -0.046914
  1.215944	  1.689234	 -0.045618
  1.211501	  1.705531	 -0.043779
  1.203750	  1.724968	 -0.040812
  1.192574	  1.743566	 -0.034094
  1.184428	  1.759317	 -0.026917
  1.175203	  1.776793	 -0.019106
  1.167626	  1.793621	 -0.010633
  1.161354	  1.810614	 -0.003589
  1.152470	  1.826232	  0.004050
  1.140828	  1.840427	  0.013180
  1.126458	  1.852269	  0.022636
  1.113761	  1.862019	  0.030497
  1.099957	  1.872920	  0.040137
  1.089034	  1.887332	  0.049965
  1.080682	  1.901426	  0.065150
  1.074850	  1.913226	  0.078904
  1.069800	  1.920093	  0.095295
  1.065496	  1.924919	  0.111456
  1.062950	  1.928421	  0.129091
  1.063266	  1.930335	  0.147670
  1.063527	  1.931922	  0.161033
  1.063278	  1.933982	  0.176086
  1.063780	  1.936605	  0.203365
  1.067852	  1.936757	  0.221441
  1.069464	  1.937251	  0.234158
  1.073485	  1.933463	  0.254419
  1.077260	  1.929934	  0.275315
  1.082125	  1.925912	  0.293497
  1.089057	  1.921690	  0.312515
  1.099090	  1.919644	  0.332507
  1.109828	  1.919801	  0.348005
  1.123040	  1.919062	  0.360431
  1.140567	  1.917202	  0.374058
  1.157791	  1.911066	  0.394979
  1.164952	  1.908533	  0.404930
  1.175862	  1.904692	  0.418903
  1.191028	  1.902313	  0.436179
  1.203109	  1.899029	  0.452941
  1.211792	  1.892168	  0.472755
  1.218195	  1.887261	  0.489335
  1.230169	  1.886383	  0.507925
  1.247349	  1.888306	  0.521678
  1.262954	  1.893977	  0.530728
  1.279725	  1.900913	  0.542911
  1.294750	  1.903668	  0.556732
  1.309263	  1.905902	  0.570384
  1.324281	  1.909848	  0.583028
  1.339363	  1.913872	  0.595537
  1.354554	  1.918050	  0.607873
  1.370232	  1.923747	  0.618967
  1.386185	  1.929446	  0.629586
  1.402446	  1.935018	  0.639671
  1.418493	  1.941653	  0.649594
