  0.763381	 -1.854085	 -2.271677
  0.755823	 -1.835728	 -2.249186
  0.773860	 -1.784287	 -2.254133
  0.797275	 -1.737701	 -2.252681
  0.821783	 -1.692032	 -2.250514
  0.845393	 -1.647748	 -2.247808
  0.868013	 -1.604481	 -2.244698
  0.891151	 -1.559331	 -2.239954
  0.913269	 -1.514660	 -2.232705
  0.933365	 -1.470285	 -2.224995
  0.952482	 -1.425702	 -2.217463
  0.971661	 -1.382218	 -2.209098
  0.992389	 -1.337426	 -2.199473
  1.014022	 -1.292891	 -2.189172
  1.033135	 -1.247791	 -2.180234
  1.050711	 -1.199890	 -2.172393
  1.071191	 -1.153052	 -2.170388
  1.092914	 -1.109441	 -2.169918
  1.112943	 -1.064093	 -2.164561
  1.130041	 -1.016546	 -2.161415
  1.146907	 -0.969578	 -2.160293
  1.162945	 -0.922898	 -2.161263
  1.178415	 -0.875125	 -2.164869
  1.194478	 -0.826511	 -2.169089
  1.211019	 -0.779659	 -2.172894
  1.227633	 -0.734299	 -2.176475
  1.244874	 -0.688536	 -2.179431
  1.263674	 -0.641514	 -2.180290
  1.283749	 -0.595012	 -2.178260
  1.304628	 -0.549442	 -2.172940
  1.325939	 -0.503651	 -2.164557
  1.347682	 -0.458742	 -2.154482
  1.370689	 -0.414798	 -2.147293
  1.395427	 -0.372250	 -2.141693
  1.420691	 -0.331149	 -2.134995
  1.446639	 -0.290930	 -2.127791
  1.472898	 -0.247454	 -2.121859
  1.497045	 -0.202977	 -2.115505
  1.519961	 -0.158386	 -2.108562
  1.541407	 -0.113557	 -2.101312
  1.561074	 -0.068625	 -2.094092
  1.580143	 -0.021171	 -2.087446
  1.597572	  0.025637	 -2.082568
  1.615485	  0.070523	 -2.077889
  1.633660	  0.114688	 -2.069705
  1.652723	  0.158993	 -2.061617
  1.679505	  0.201340	 -2.051013
  1.702852	  0.245661	 -2.042931
  1.723799	  0.290721	 -2.035017
  1.742591	  0.337555	 -2.030432
  1.758294	  0.384655	 -2.028495
  1.773920	  0.433077	 -2.027203
  1.791094	  0.479938	 -2.028010
  1.808961	  0.525204	 -2.029288
  1.829746	  0.570802	 -2.028913
  1.848254	  0.618574	 -2.028245
  1.870244	  0.663422	 -2.027589
  1.883661	  0.710823	 -2.020531
  1.906042	  0.754360	 -2.019691
  1.928208	  0.798632	 -2.022383
  1.945918	  0.845900	 -2.014040
  1.963906	  0.893078	 -2.011510
  1.983939	  0.936736	 -2.008739
  2.004141	  0.975954	 -2.007719
  2.024182	  0.985713	 -2.027796
