 -2.146661	  1.098233	 -0.682975
 -2.140021	  1.099297	 -0.679599
 -2.129012	  1.101060	 -0.674002
 -2.111119	  1.103201	 -0.665328
 -2.093225	  1.105335	 -0.656655
 -2.075227	  1.106733	 -0.648043
 -2.057202	  1.107880	 -0.639455
 -2.039243	  1.108889	 -0.630831
 -2.021803	  1.108691	 -0.621427
 -2.004438	  1.106759	 -0.610891
 -1.986602	  1.106124	 -0.601423
 -1.968463	  1.110133	 -0.594436
 -1.948028	  1.114871	 -0.587403
 -1.930507	  1.114587	 -0.578956
 -1.915207	  1.113769	 -0.568433
 -1.896715	  1.114594	 -0.558268
 -1.877759	  1.115374	 -0.550510
 -1.861711	  1.117271	 -0.540833
 -1.843575	  1.116966	 -0.529403
 -1.825260	  1.118698	 -0.520779
 -1.808577	  1.124094	 -0.513149
 -1.790805	  1.126945	 -0.503429
 -1.772906	  1.129572	 -0.494270
 -1.755692	  1.135642	 -0.486614
 -1.738024	  1.140455	 -0.478059
 -1.720601	  1.143476	 -0.468713
 -1.703795	  1.151095	 -0.460916
 -1.686777	  1.158105	 -0.452929
 -1.670236	  1.164634	 -0.444113
 -1.652879	  1.172559	 -0.436414
 -1.640550	  1.186880	 -0.432425
 -1.628641	  1.202294	 -0.428647
 -1.615225	  1.220529	 -0.427367
 -1.601427	  1.235455	 -0.422943
 -1.591940	  1.247102	 -0.413953
 -1.588550	  1.266467	 -0.410610
 -1.583387	  1.287851	 -0.406609
 -1.577080	  1.305835	 -0.400505
 -1.570109	  1.323035	 -0.399538
 -1.566334	  1.344369	 -0.399697
 -1.562514	  1.363249	 -0.397124
 -1.556258	  1.380709	 -0.393536
 -1.549530	  1.402465	 -0.390036
 -1.545990	  1.421660	 -0.388353
 -1.541643	  1.438493	 -0.382379
 -1.543512	  1.458939	 -0.370534
 -1.538781	  1.476972	 -0.367077
 -1.520238	  1.491718	 -0.363999
 -1.510194	  1.499853	 -0.363622
 -1.497245	  1.509872	 -0.354569
 -1.482295	  1.510591	 -0.340427
 -1.464319	  1.508612	 -0.327113
 -1.449057	  1.503337	 -0.315139
 -1.432838	  1.497996	 -0.306418
 -1.413801	  1.495857	 -0.299275
 -1.395096	  1.492446	 -0.291403
 -1.377112	  1.488859	 -0.285025
 -1.358893	  1.486674	 -0.275853
 -1.342084	  1.483538	 -0.266234
 -1.324297	  1.482068	 -0.257607
 -1.305451	  1.480435	 -0.248355
 -1.289910	  1.477284	 -0.240198
 -1.270796	  1.475615	 -0.230981
 -1.252968	  1.473432	 -0.222360
 -1.232533	  1.471391	 -0.212363
 -1.219376	  1.468124	 -0.206741
 -1.198653	  1.466231	 -0.197155
 -1.177186	  1.464271	 -0.187103
 -1.155517	  1.453634	 -0.209931
 -1.141949	  1.441940	 -0.256276
 -1.129986	  1.451921	 -0.194361
 -1.113504	  1.445260	 -0.202320
 -1.093480	  1.442563	 -0.200670
 -1.067815	  1.448717	 -0.166421
 -1.048808	  1.437795	 -0.188649
 -1.024770	  1.428470	 -0.199078
 -1.009150	  1.429121	 -0.190237
 -0.985921	  1.424675	 -0.186648
 -0.969275	  1.424126	 -0.179291
 -0.952946	  1.423498	 -0.172593
 -0.928761	  1.419116	 -0.167608
 -0.914630	  1.419495	 -0.161345
 -0.890982	  1.415278	 -0.156263
 -0.879140	  1.410673	 -0.142770
 -0.859325	  1.407963	 -0.138802
 -0.839044	  1.404042	 -0.132069
 -0.826285	  1.399704	 -0.120209
 -0.810544	  1.391882	 -0.107183
 -0.797024	  1.387028	 -0.095469
 -0.784403	  1.379726	 -0.082729
 -0.769874	  1.374552	 -0.070895
 -0.745647	  1.368368	 -0.059563
 -0.728262	  1.364318	 -0.050850
 -0.721409	  1.357253	 -0.039421
 -0.706196	  1.345926	 -0.029493
 -0.680289	  1.346788	 -0.026530
 -0.671262	  1.355563	 -0.034099
 -0.649509	  1.344984	 -0.023328
 -0.629707	  1.353579	 -0.024946
 -0.611807	  1.362319	 -0.024431
 -0.594362	  1.371196	 -0.029082
 -0.577118	  1.379812	 -0.039039
 -0.558350	  1.384782	 -0.041625
 -0.541772	  1.395879	 -0.042982
 -0.526217	  1.407703	 -0.046743
 -0.509593	  1.415133	 -0.040787
 -0.495754	  1.422685	 -0.046718
 -0.477281	  1.429001	 -0.041878
 -0.458617	  1.435414	 -0.038111
 -0.439845	  1.441582	 -0.035152
 -0.421038	  1.447705	 -0.032328
 -0.402198	  1.453769	 -0.029580
 -0.383585	  1.459147	 -0.027530
 -0.363832	  1.463895	 -0.026953
 -0.342752	  1.469606	 -0.027828
 -0.325834	  1.475485	 -0.018946
 -0.311662	  1.482301	 -0.014878
 -0.295146	  1.485577	 -0.003046
 -0.276300	  1.492973	  0.002292
 -0.256537	  1.500085	  0.006414
 -0.240771	  1.505966	  0.020474
 -0.227141	  1.513349	  0.029206
 -0.210118	  1.519632	  0.035085
 -0.191338	  1.526807	  0.049323
 -0.177753	  1.533287	  0.062705
 -0.163114	  1.540600	  0.069643
 -0.145284	  1.545921	  0.082899
 -0.132351	  1.546391	  0.092007
 -0.114649	  1.549752	  0.105392
 -0.097079	  1.553570	  0.115499
 -0.079560	  1.559022	  0.123526
 -0.061391	  1.564610	  0.132111
 -0.043565	  1.567021	  0.140273
 -0.025705	  1.568509	  0.147441
 -0.005679	  1.575361	  0.154449
  0.011598	  1.574439	  0.161048
  0.031822	  1.578599	  0.166001
  0.051300	  1.583930	  0.172251
  0.069039	  1.581714	  0.179180
  0.089303	  1.587147	  0.182488
  0.107002	  1.587575	  0.189384
  0.126292	  1.594757	  0.192049
  0.145864	  1.591189	  0.199129
  0.163073	  1.600642	  0.200813
  0.182682	  1.602528	  0.206411
  0.202690	  1.603550	  0.212282
  0.219313	  1.608600	  0.214413
  0.238949	  1.612208	  0.219099
  0.259208	  1.613609	  0.224860
  0.277356	  1.617505	  0.228360
  0.295613	  1.618323	  0.234987
  0.313386	  1.621597	  0.238574
  0.332362	  1.621258	  0.246446
  0.350614	  1.620520	  0.255124
  0.369305	  1.621733	  0.262874
  0.385449	  1.619934	  0.273715
  0.400725	  1.617628	  0.284025
  0.419772	  1.618537	  0.291526
  0.437130	  1.615770	  0.304385
  0.456159	  1.617048	  0.311881
  0.470955	  1.613818	  0.322882
  0.487131	  1.611474	  0.330065
  0.501259	  1.606052	  0.342166
  0.516623	  1.602952	  0.355220
  0.534986	  1.600048	  0.367685
  0.550705	  1.597806	  0.379594
  0.563320	  1.599177	  0.391899
  0.577553	  1.595896	  0.406770
  0.591940	  1.593233	  0.420976
  0.607107	  1.593569	  0.434084
  0.616054	  1.588434	  0.449809
  0.625001	  1.585023	  0.462394
  0.631938	  1.578422	  0.478302
  0.638455	  1.570568	  0.495874
  0.645332	  1.563109	  0.513186
  0.649666	  1.554518	  0.530637
  0.656639	  1.546631	  0.547846
  0.663738	  1.539016	  0.564836
  0.668269	  1.529796	  0.582258
  0.677360	  1.523849	  0.599625
  0.683540	  1.515451	  0.617438
  0.690978	  1.508658	  0.634870
  0.699361	  1.503157	  0.652005
  0.707457	  1.497380	  0.669342
  0.714186	  1.490276	  0.686760
  0.717457	  1.485924	  0.704347
  0.722554	  1.478616	  0.720037
  0.722602	  1.472177	  0.739050
  0.719186	  1.468557	  0.758915
  0.736342	  1.473646	  0.778072
  0.735740	  1.467045	  0.801194
  0.750879	  1.466296	  0.815564
  0.768936	  1.468876	  0.824995
  0.787794	  1.468564	  0.833415
  0.807506	  1.466425	  0.839762
  0.826640	  1.469813	  0.839994
  0.843305	  1.472212	  0.837503
  0.864975	  1.477492	  0.835299
  0.878377	  1.484804	  0.822104
  0.888789	  1.496268	  0.809718
  0.902769	  1.505661	  0.798502
  0.916620	  1.516225	  0.788820
  0.931753	  1.523645	  0.777474
  0.946229	  1.532493	  0.766951
  0.961201	  1.539449	  0.755493
  0.975683	  1.548379	  0.745002
  0.990469	  1.555521	  0.733581
  1.006513	  1.563233	  0.724948
  1.023331	  1.568130	  0.718047
  1.041577	  1.572242	  0.711926
  1.060982	  1.576111	  0.709608
  1.080577	  1.578661	  0.706451
  1.100151	  1.581556	  0.703268
  1.119702	  1.584032	  0.700029
  1.139232	  1.587835	  0.697286
  1.158514	  1.589449	  0.693256
  1.177830	  1.592946	  0.688390
  1.197666	  1.594826	  0.685734
  1.217895	  1.598412	  0.686467
  1.239187	  1.602694	  0.691097
  1.255759	  1.600779	  0.697087
  1.275635	  1.597795	  0.701724
  1.296848	  1.598737	  0.709057
  1.313734	  1.601970	  0.714183
  1.334136	  1.603957	  0.717900
  1.352711	  1.603772	  0.725327
  1.370687	  1.605919	  0.732987
  1.391074	  1.608038	  0.740918
  1.408956	  1.607971	  0.749640
  1.424115	  1.607299	  0.757816
  1.443633	  1.604912	  0.767918
  1.461367	  1.604167	  0.777400
  1.479173	  1.604057	  0.785021
  1.497010	  1.606309	  0.792734
  1.515842	  1.605602	  0.800641
  1.534302	  1.604907	  0.808333
  1.552805	  1.604032	  0.815769
  1.571439	  1.603863	  0.822647
  1.590302	  1.604331	  0.829685
  1.609595	  1.604904	  0.836006
  1.628447	  1.606593	  0.842719
  1.647364	  1.607157	  0.849022
  1.666037	  1.609305	  0.856078
  1.701958	  1.611116	  0.870427
  1.703005	  1.611200	  0.870889
