 0.0 0.0 0.0 0
 0.9713630165183903 -0.1274572708967292 0.18854092672437983 1000
 -0.583313113007431 -0.20509960472618832 -1.2179931887804585 1000
 -0.3647795745988227 0.9236068695235741 -0.06897677018083626 1000
 0.550275040372847 0.6681436826640181 -0.14360053017147267 1000
 -0.5383893885468345 0.5460999356560523 0.6211666693110477 1000
 0.033192896762410384 0.21118682374848735 -1.0421215008157443 1000
 0.8777578584596533 -0.41161610680923694 0.021041536399563077 1000
 0.7823292832728765 0.1096931199748914 1.0893322015607287 1000
 0.0 0.0 0.0 0
 0.1355593558432409 -0.989835480450771 -0.16263754041472328 1000
 0.45314233240953616 -0.7534166237081292 -0.5265861885669523 1000
 -0.021171956745001254 0.6776586766462981 1.0017514509161756 1000
 -0.3206350012985054 -0.7968490202641733 -0.9375401025087581 1000
 0.8732747362031561 0.48386546379592166 0.47505959937165804 1000
 -0.4599954424711191 0.3350657259278854 -1.0630757096710175 1000
 -0.9449780819829783 0.3268713760271571 -0.3327482679973435 1000
 -0.315449533783699 0.534655755485175 0.8831995201331425 1000
 0.0 0.0 0.0 0
 0.03930802672826217 0.9794305179283292 0.0468334103815955 1000
 0.00716343148595372 -0.6532266263718889 0.6969438336684983 1000
 -0.9749532355973791 0.017733463520820336 -0.6987346697252169 1000
 0.9398186181054277 0.11485330296055724 0.10002389175616636 1000
 0.11815228273974251 -0.32800001670573986 1.0365340674904433 1000
 -0.949429603294454 -0.3118242914418458 -0.5447690713016399 1000
 -0.713326035092285 0.4492172299537257 -0.8277805242946144 1000
 -0.6051764438560117 -0.7106784184979087 -0.05789116068470013 1000
 0.0 0.0 0.0 0
