  0.198922	 -2.227650	  0.907979
  0.211727	 -2.250006	  0.928710
  0.203982	 -2.236485	  0.916172
  0.195361	 -2.223327	  0.903822
  0.186663	 -2.210201	  0.891490
  0.177966	 -2.197075	  0.879159
  0.168316	 -2.184628	  0.866831
  0.158631	 -2.172208	  0.854505
  0.148856	 -2.159909	  0.842128
  0.138568	 -2.148337	  0.829470
  0.128281	 -2.136764	  0.816811
  0.117638	 -2.125704	  0.803989
  0.106601	 -2.115250	  0.790993
  0.095563	 -2.104797	  0.777997
  0.083804	 -2.095353	  0.764862
  0.071871	 -2.086169	  0.751698
  0.059813	 -2.077143	  0.738541
  0.046979	 -2.069143	  0.725453
  0.034146	 -2.061143	  0.712365
  0.020990	 -2.053441	  0.699418
  0.007254	 -2.046302	  0.686755
 -0.006481	 -2.039163	  0.674091
 -0.020464	 -2.032070	  0.661674
 -0.035167	 -2.025129	  0.650028
 -0.049870	 -2.018188	  0.638382
 -0.064574	 -2.011247	  0.626735
 -0.079958	 -2.003878	  0.616294
 -0.095548	 -1.996377	  0.606260
 -0.111139	 -1.988876	  0.596226
 -0.126733	 -1.981368	  0.586204
 -0.142812	 -1.972871	  0.577881
 -0.158891	 -1.964374	  0.569559
 -0.174970	 -1.955877	  0.561236
 -0.191066	 -1.946900	  0.553470
 -0.207119	 -1.936858	  0.547030
 -0.223172	 -1.926816	  0.540590
 -0.239214	 -1.916739	  0.534179
 -0.254582	 -1.904858	  0.529417
 -0.269950	 -1.892978	  0.524655
 -0.284856	 -1.880360	  0.520346
 -0.299002	 -1.866689	  0.516736
 -0.312543	 -1.852358	  0.513383
 -0.325271	 -1.837228	  0.510368
 -0.336632	 -1.820976	  0.507755
 -0.346940	 -1.804005	  0.505369
 -0.356505	 -1.786577	  0.503181
 -0.364952	 -1.768536	  0.501401
 -0.373130	 -1.750359	  0.499747
 -0.380241	 -1.731702	  0.498584
 -0.387351	 -1.713045	  0.497421
 -0.393891	 -1.694156	  0.496777
 -0.399886	 -1.675076	  0.496621
 -0.405881	 -1.655996	  0.496465
 -0.411876	 -1.636916	  0.496309
 -0.417089	 -1.617648	  0.497550
 -0.422297	 -1.598378	  0.498800
 -0.427505	 -1.579109	  0.500051
 -0.432712	 -1.559839	  0.501301
 -0.437399	 -1.540513	  0.503427
 -0.442047	 -1.521184	  0.505616
 -0.446695	 -1.501855	  0.507805
 -0.451343	 -1.482526	  0.509994
 -0.455670	 -1.463211	  0.512862
 -0.459880	 -1.443908	  0.515971
 -0.464090	 -1.424605	  0.519081
 -0.468219	 -1.405235	  0.521862
 -0.471870	 -1.385592	  0.522774
 -0.475522	 -1.365950	  0.523687
 -0.479130	 -1.346295	  0.524510
 -0.482525	 -1.326589	  0.524895
 -0.485920	 -1.306883	  0.525279
 -0.488710	 -1.287505	  0.521190
 -0.491360	 -1.268255	  0.516454
 -0.493177	 -1.249299	  0.510343
 -0.494995	 -1.230342	  0.504232
 -0.496625	 -1.211985	  0.496464
 -0.498187	 -1.193873	  0.488127
 -0.499412	 -1.175996	  0.479244
 -0.499371	 -1.159180	  0.468416
 -0.499330	 -1.142365	  0.457588
 -0.499290	 -1.125550	  0.446759
 -0.501871	 -1.109338	  0.435335
 -0.506549	 -1.093844	  0.423585
 -0.511227	 -1.078350	  0.411836
 -0.515905	 -1.062857	  0.400086
 -0.520583	 -1.047363	  0.388337
 -0.527301	 -1.032830	  0.376351
 -0.540504	 -1.023225	  0.364800
 -0.553708	 -1.013621	  0.353249
 -0.566911	 -1.004016	  0.341697
 -0.580114	 -0.994412	  0.330146
 -0.592057	 -0.985598	  0.316742
 -0.603819	 -0.976899	  0.303104
 -0.615773	 -0.968945	  0.289182
 -0.627811	 -0.961350	  0.275131
 -0.639191	 -0.953667	  0.260589
 -0.650017	 -0.945922	  0.245663
 -0.659725	 -0.937562	  0.230304
 -0.668977	 -0.928898	  0.214834
 -0.677154	 -0.919510	  0.199181
 -0.684639	 -0.909722	  0.183428
 -0.691314	 -0.899492	  0.167592
 -0.697312	 -0.888786	  0.151800
 -0.702652	 -0.877640	  0.136075
 -0.707447	 -0.865931	  0.120587
 -0.711536	 -0.853532	  0.105435
 -0.714985	 -0.840433	  0.090721
 -0.717716	 -0.826599	  0.076537
 -0.719419	 -0.811658	  0.063351
 -0.720389	 -0.796008	  0.050937
 -0.720201	 -0.779370	  0.039840
 -0.718875	 -0.761967	  0.030074
 -0.717203	 -0.744363	  0.020729
 -0.714338	 -0.726232	  0.012790
 -0.711472	 -0.708100	  0.004851
 -0.708194	 -0.689727	 -0.002340
 -0.704618	 -0.671202	 -0.008976
 -0.701043	 -0.652677	 -0.015612
 -0.697480	 -0.634086	 -0.022068
 -0.694008	 -0.615087	 -0.027260
 -0.690537	 -0.596087	 -0.032453
 -0.687066	 -0.577087	 -0.037646
 -0.683595	 -0.558088	 -0.042838
 -0.680586	 -0.538784	 -0.047118
 -0.677653	 -0.519436	 -0.051248
 -0.674720	 -0.500088	 -0.055379
 -0.671787	 -0.480741	 -0.059510
 -0.669078	 -0.461348	 -0.063584
 -0.667226	 -0.441810	 -0.067436
 -0.665375	 -0.422273	 -0.071289
 -0.663523	 -0.402735	 -0.075142
 -0.661672	 -0.383197	 -0.078995
 -0.660698	 -0.363667	 -0.083196
 -0.660775	 -0.344205	 -0.087801
 -0.660852	 -0.324742	 -0.092406
 -0.660930	 -0.305280	 -0.097010
 -0.661007	 -0.285817	 -0.101615
 -0.662664	 -0.266719	 -0.107316
 -0.664564	 -0.247693	 -0.113182
 -0.666464	 -0.228667	 -0.119048
 -0.668365	 -0.209642	 -0.124915
 -0.671126	 -0.190986	 -0.131574
 -0.674684	 -0.172741	 -0.138954
 -0.678243	 -0.154496	 -0.146333
 -0.681802	 -0.136252	 -0.153713
 -0.685770	 -0.118287	 -0.161558
 -0.690733	 -0.101107	 -0.170513
 -0.695696	 -0.083927	 -0.179469
 -0.700660	 -0.066746	 -0.188425
 -0.705688	 -0.049624	 -0.197455
 -0.712012	 -0.033808	 -0.207937
 -0.718336	 -0.017993	 -0.218419
 -0.724660	 -0.002177	 -0.228901
 -0.730984	  0.013638	 -0.239383
 -0.738222	  0.028606	 -0.250499
 -0.746085	  0.042931	 -0.262031
 -0.753948	  0.057256	 -0.273563
 -0.761811	  0.071580	 -0.285094
 -0.769674	  0.085905	 -0.296626
 -0.779042	  0.098933	 -0.308563
 -0.788738	  0.111649	 -0.320575
 -0.798434	  0.124366	 -0.332587
 -0.808129	  0.137082	 -0.344599
 -0.817825	  0.149799	 -0.356611
 -0.829141	  0.161258	 -0.368470
 -0.840891	  0.172342	 -0.380264
 -0.852640	  0.183426	 -0.392057
 -0.864390	  0.194510	 -0.403851
 -0.876140	  0.205594	 -0.415644
 -0.889035	  0.215606	 -0.427197
 -0.902720	  0.224791	 -0.438526
 -0.916405	  0.233976	 -0.449856
 -0.930091	  0.243160	 -0.461185
 -0.943776	  0.252345	 -0.472515
 -0.957909	  0.260838	 -0.483834
 -0.972862	  0.267913	 -0.495074
 -0.987815	  0.274989	 -0.506315
 -1.002768	  0.282064	 -0.517556
 -1.017720	  0.289140	 -0.528796
 -1.032841	  0.295782	 -0.540077
 -1.048576	  0.300561	 -0.551459
 -1.064312	  0.305339	 -0.562841
 -1.080048	  0.310118	 -0.574223
 -1.095784	  0.314897	 -0.585605
 -1.111548	  0.319562	 -0.596994
 -1.127787	  0.321844	 -0.608444
 -1.144025	  0.324127	 -0.619895
 -1.160263	  0.326409	 -0.631345
 -1.176501	  0.328692	 -0.642796
 -1.192752	  0.330784	 -0.654265
 -1.209042	  0.331081	 -0.665863
 -1.225333	  0.331378	 -0.677462
 -1.241624	  0.331675	 -0.689060
 -1.257915	  0.331972	 -0.700658
 -1.273862	  0.331224	 -0.712705
 -1.289744	  0.330293	 -0.724826
 -1.305625	  0.329362	 -0.736947
 -1.321269	  0.328125	 -0.749346
 -1.336690	  0.326613	 -0.761991
 -1.352112	  0.325100	 -0.774636
 -1.367417	  0.323349	 -0.787391
 -1.382716	  0.321586	 -0.800151
 -1.398125	  0.320149	 -0.812819
 -1.413687	  0.318973	 -0.825328
 -1.429461	  0.318199	 -0.837599
 -1.445506	  0.318252	 -0.849538
 -1.461688	  0.319293	 -0.861245
 -1.477987	  0.321187	 -0.872681
 -1.494343	  0.323946	 -0.883855
 -1.510689	  0.327687	 -0.894754
 -1.526860	  0.332934	 -0.905288
 -1.542864	  0.339117	 -0.915567
 -1.558616	  0.346394	 -0.925513
 -1.574121	  0.354761	 -0.934978
 -1.589450	  0.363766	 -0.944140
 -1.604502	  0.373731	 -0.952750
 -1.619330	  0.384350	 -0.960958
 -1.633659	  0.395837	 -0.968879
 -1.647499	  0.408086	 -0.976521
 -1.660117	  0.421503	 -0.984316
 -1.671697	  0.435629	 -0.992463
 -1.681501	  0.450500	 -1.001558
 -1.689715	  0.465584	 -1.011806
 -1.697546	  0.480699	 -1.022304
 -1.704486	  0.495893	 -1.033303
 -1.711425	  0.511088	 -1.044301
 -1.718696	  0.526274	 -1.055095
 -1.726195	  0.541451	 -1.065746
 -1.733693	  0.556627	 -1.076397
 -1.741724	  0.571560	 -1.087004
 -1.750012	  0.586370	 -1.097587
 -1.758300	  0.601179	 -1.108169
 -1.767163	  0.615611	 -1.118807
 -1.776186	  0.629934	 -1.129458
 -1.785215	  0.644252	 -1.140111
 -1.794681	  0.658140	 -1.150951
 -1.804147	  0.672028	 -1.161791
 -1.813737	  0.685787	 -1.172687
 -1.823550	  0.699308	 -1.183682
 -1.833362	  0.712830	 -1.194677
 -1.843427	  0.726132	 -1.205711
 -1.853588	  0.739348	 -1.216760
 -1.863750	  0.752565	 -1.227808
 -1.874547	  0.765490	 -1.238595
 -1.885352	  0.778412	 -1.249378
 -1.896156	  0.791334	 -1.260162
 -1.906960	  0.804256	 -1.270946
 -1.917765	  0.817179	 -1.281729
 -1.937514	  0.840235	 -1.300864
 -1.948525	  0.853083	 -1.311526
