  0.349555	 -0.415295	  2.486925
  0.352860	 -0.415064	  2.491055
  0.341747	 -0.404701	  2.473422
  0.330209	 -0.401860	  2.454945
  0.317891	 -0.408057	  2.441093
  0.303237	 -0.416396	  2.431583
  0.285452	 -0.422358	  2.415750
  0.271908	 -0.422672	  2.398200
  0.260636	 -0.418330	  2.388505
  0.244102	 -0.410708	  2.378158
  0.227741	 -0.403766	  2.362561
  0.209005	 -0.398008	  2.351193
  0.193001	 -0.402075	  2.332913
  0.183419	 -0.409696	  2.318800
  0.178445	 -0.418567	  2.297848
  0.172813	 -0.419845	  2.277302
  0.159820	 -0.409243	  2.256914
  0.144851	 -0.396826	  2.248922
  0.129043	 -0.387446	  2.244179
  0.112802	 -0.379665	  2.233008
  0.102588	 -0.376631	  2.216319
  0.090406	 -0.368707	  2.202444
  0.077095	 -0.357671	  2.191437
  0.064174	 -0.346495	  2.181216
  0.053028	 -0.330296	  2.178432
  0.043671	 -0.312704	  2.179768
  0.034405	 -0.295047	  2.181306
  0.025140	 -0.277390	  2.182846
  0.015998	 -0.259693	  2.184487
  0.009253	 -0.241241	  2.188088
  0.004982	 -0.222480	  2.193496
  0.000773	 -0.203712	  2.198903
 -0.003317	 -0.185366	  2.203740
 -0.006826	 -0.167698	  2.204961
 -0.006169	 -0.147790	  2.204794
 -0.006343	 -0.121721	  2.213996
 -0.011178	 -0.105160	  2.217983
 -0.015927	 -0.089512	  2.217941
 -0.018237	 -0.067843	  2.213256
 -0.015271	 -0.051612	  2.207430
 -0.009237	 -0.035568	  2.202939
 -0.002403	 -0.018946	  2.193697
 -0.002921	  0.001825	  2.182833
 -0.009752	  0.017532	  2.170753
 -0.013379	  0.026705	  2.158371
 -0.011501	  0.036964	  2.136804
 -0.014583	  0.046248	  2.115975
 -0.029034	  0.052953	  2.101358
 -0.039760	  0.061633	  2.089770
 -0.050067	  0.069749	  2.074990
 -0.060327	  0.076293	  2.059385
 -0.078853	  0.078835	  2.047714
 -0.097465	  0.085135	  2.037674
 -0.108343	  0.094254	  2.030346
 -0.116627	  0.107910	  2.012018
 -0.126768	  0.113315	  1.995389
 -0.144069	  0.109386	  1.985594
 -0.163345	  0.104864	  1.977175
 -0.181970	  0.103785	  1.965727
 -0.195455	  0.104991	  1.954273
 -0.211967	  0.103375	  1.940682
 -0.227576	  0.094113	  1.932094
 -0.243392	  0.082539	  1.926559
 -0.255752	  0.068633	  1.919917
 -0.265716	  0.055119	  1.901793
 -0.281710	  0.046961	  1.881929
 -0.291472	  0.043420	  1.874686
 -0.303550	  0.028804	  1.865201
 -0.312575	  0.010076	  1.852857
 -0.319689	 -0.007547	  1.840359
 -0.324129	 -0.019652	  1.834763
 -0.331558	 -0.035060	  1.828748
 -0.338464	 -0.056101	  1.821146
 -0.343878	 -0.074676	  1.813560
 -0.348734	 -0.090432	  1.807986
 -0.353857	 -0.109919	  1.804128
 -0.353475	 -0.133120	  1.796343
 -0.350658	 -0.151860	  1.783583
 -0.351606	 -0.163458	  1.769474
 -0.356439	 -0.174830	  1.760934
 -0.360559	 -0.194777	  1.760015
 -0.370521	 -0.220798	  1.757263
 -0.377651	 -0.232886	  1.749951
 -0.382093	 -0.250685	  1.742000
 -0.381576	 -0.268284	  1.737001
 -0.384061	 -0.290033	  1.736102
 -0.387091	 -0.309856	  1.735578
 -0.389894	 -0.329192	  1.736057
 -0.390645	 -0.348824	  1.739819
 -0.395460	 -0.369592	  1.741602
 -0.415405	 -0.387204	  1.733635
 -0.427440	 -0.401481	  1.724637
 -0.434076	 -0.412102	  1.713996
 -0.444979	 -0.422747	  1.700250
 -0.456418	 -0.433137	  1.689179
 -0.465988	 -0.440932	  1.674817
 -0.478811	 -0.447464	  1.657271
 -0.491009	 -0.453270	  1.646797
 -0.506435	 -0.460535	  1.636462
 -0.530243	 -0.470092	  1.620813
 -0.540123	 -0.472709	  1.614419
 -0.559224	 -0.474011	  1.604247
 -0.577837	 -0.475233	  1.593001
 -0.591630	 -0.476945	  1.578804
 -0.599892	 -0.474851	  1.561758
 -0.612391	 -0.472383	  1.546055
 -0.639471	 -0.474772	  1.533967
 -0.651708	 -0.477830	  1.525080
 -0.662328	 -0.481964	  1.511666
 -0.675001	 -0.486918	  1.490013
 -0.690259	 -0.493587	  1.478717
 -0.709928	 -0.501483	  1.474259
 -0.727522	 -0.506433	  1.466680
 -0.740561	 -0.506804	  1.451196
 -0.751510	 -0.504066	  1.433213
 -0.768837	 -0.501222	  1.416403
 -0.783814	 -0.502899	  1.408320
 -0.802022	 -0.507507	  1.398866
 -0.818778	 -0.509384	  1.386671
 -0.831560	 -0.507240	  1.373869
 -0.849004	 -0.499992	  1.357513
 -0.866071	 -0.496250	  1.346231
 -0.879172	 -0.496985	  1.339610
 -0.896556	 -0.491170	  1.330619
 -0.913508	 -0.481617	  1.321948
 -0.929410	 -0.472940	  1.312794
 -0.944830	 -0.463935	  1.303922
 -0.956900	 -0.449566	  1.297163
 -0.968860	 -0.434952	  1.290581
 -0.980802	 -0.420293	  1.284068
 -0.992796	 -0.405689	  1.277507
 -1.004767	 -0.391103	  1.270834
 -1.016329	 -0.376180	  1.264089
 -1.025626	 -0.360062	  1.256560
 -1.034220	 -0.343726	  1.248835
 -1.042745	 -0.327423	  1.240975
 -1.051203	 -0.311079	  1.233128
 -1.059585	 -0.294638	  1.225428
 -1.067791	 -0.278231	  1.217474
 -1.074580	 -0.262881	  1.206590
 -1.079834	 -0.247957	  1.195482
 -1.079982	 -0.232488	  1.182765
 -1.080648	 -0.215144	  1.165087
 -1.085000	 -0.201837	  1.149612
 -1.093308	 -0.190754	  1.140828
 -1.099583	 -0.178024	  1.128466
 -1.107263	 -0.166045	  1.111984
 -1.115002	 -0.159068	  1.096782
 -1.121945	 -0.156564	  1.077730
 -1.130530	 -0.154165	  1.057117
 -1.143705	 -0.150976	  1.041403
 -1.160257	 -0.147289	  1.029054
 -1.176822	 -0.145302	  1.017689
 -1.191164	 -0.148695	  1.005964
 -1.204100	 -0.155957	  0.992895
 -1.217603	 -0.166159	  0.981215
 -1.231561	 -0.174645	  0.971045
 -1.244871	 -0.182600	  0.960244
 -1.255035	 -0.190577	  0.947347
 -1.263007	 -0.204230	  0.934931
 -1.270180	 -0.223745	  0.931056
 -1.285254	 -0.242486	  0.929691
 -1.299638	 -0.250591	  0.926951
 -1.316276	 -0.261521	  0.915535
 -1.323410	 -0.278304	  0.902772
 -1.320263	 -0.306725	  0.896492
 -1.319462	 -0.328095	  0.897991
 -1.323833	 -0.347756	  0.902060
 -1.331986	 -0.361345	  0.901773
 -1.342316	 -0.379751	  0.896495
 -1.351347	 -0.397892	  0.890840
 -1.358976	 -0.417157	  0.889448
 -1.364710	 -0.436820	  0.888757
 -1.369530	 -0.456358	  0.883640
 -1.376184	 -0.474022	  0.874931
 -1.382829	 -0.490643	  0.865941
 -1.388883	 -0.507248	  0.856432
 -1.391942	 -0.523056	  0.843695
 -1.394713	 -0.537783	  0.830080
 -1.403775	 -0.552422	  0.819152
 -1.415828	 -0.568456	  0.808930
 -1.424139	 -0.587156	  0.793628
 -1.425166	 -0.597016	  0.784100
 -1.424883	 -0.608525	  0.769320
 -1.432431	 -0.623420	  0.756348
 -1.446968	 -0.632345	  0.739196
 -1.454657	 -0.636126	  0.715106
 -1.460557	 -0.638437	  0.696439
 -1.466000	 -0.643524	  0.681491
 -1.473284	 -0.652352	  0.663941
 -1.479063	 -0.662341	  0.647327
 -1.490264	 -0.671091	  0.630199
 -1.505922	 -0.677344	  0.613185
 -1.519039	 -0.681067	  0.602731
 -1.535688	 -0.687417	  0.589125
 -1.544594	 -0.693466	  0.571655
 -1.549896	 -0.698674	  0.553207
 -1.552685	 -0.707304	  0.534966
 -1.557703	 -0.714823	  0.516615
 -1.565267	 -0.729914	  0.502161
 -1.572142	 -0.742938	  0.492243
 -1.582688	 -0.757202	  0.482380
 -1.593542	 -0.771852	  0.473893
 -1.602976	 -0.788932	  0.464951
 -1.611472	 -0.803553	  0.450903
 -1.617801	 -0.816542	  0.431768
 -1.619920	 -0.831051	  0.418933
 -1.621490	 -0.848112	  0.410854
 -1.625200	 -0.863946	  0.402962
 -1.635322	 -0.875670	  0.394310
 -1.642376	 -0.885149	  0.387051
 -1.653310	 -0.893412	  0.373828
 -1.660896	 -0.907512	  0.356968
 -1.669246	 -0.925376	  0.345756
 -1.685192	 -0.932430	  0.340660
 -1.712499	 -0.933403	  0.341616
 -1.729749	 -0.942801	  0.342504
 -1.742495	 -0.957590	  0.338372
 -1.758556	 -0.970877	  0.329041
 -1.776986	 -0.976775	  0.319125
 -1.793798	 -0.976682	  0.310814
 -1.812032	 -0.972905	  0.299091
 -1.826913	 -0.970396	  0.289774
 -1.844268	 -0.972482	  0.281390
 -1.860045	 -0.972708	  0.269935
 -1.878181	 -0.974113	  0.261425
 -1.896293	 -0.974727	  0.251386
 -1.912517	 -0.982122	  0.243132
 -1.928542	 -0.987382	  0.230939
 -1.944069	 -0.988904	  0.217963
 -1.957628	 -0.988058	  0.203202
 -1.970737	 -0.985949	  0.188557
 -1.984405	 -0.981217	  0.174198
 -1.997887	 -0.979228	  0.156950
 -2.008787	 -0.981250	  0.140460
 -2.017332	 -0.983132	  0.125919
 -2.027553	 -0.975058	  0.110604
 -2.034833	 -0.969574	  0.095375
 -2.040782	 -0.957114	  0.082035
 -2.046150	 -0.940199	  0.072187
 -2.051565	 -0.923283	  0.062987
 -2.057157	 -0.906581	  0.053783
 -2.063227	 -0.889566	  0.047582
 -2.071021	 -0.870756	  0.044033
 -2.081892	 -0.853693	  0.037346
 -2.094135	 -0.840468	  0.017939
 -2.096913	 -0.827890	  0.000551
 -2.095803	 -0.814811	 -0.010503
 -2.096155	 -0.796831	 -0.021758
 -2.100332	 -0.781764	 -0.037369
 -2.110377	 -0.769756	 -0.051130
 -2.123070	 -0.760677	 -0.061479
 -2.135331	 -0.751354	 -0.075865
 -2.143189	 -0.740688	 -0.090294
 -2.155188	 -0.732962	 -0.103217
 -2.168700	 -0.727755	 -0.118971
 -2.177418	 -0.721711	 -0.134579
 -2.188751	 -0.718381	 -0.149327
 -2.202562	 -0.717362	 -0.165368
 -2.210784	 -0.717912	 -0.181072
 -2.219643	 -0.721761	 -0.200319
 -2.228375	 -0.721888	 -0.218872
 -2.240284	 -0.718024	 -0.234677
 -2.261289	 -0.712243	 -0.253969
 -2.275808	 -0.713207	 -0.267926
 -2.284742	 -0.711512	 -0.276433
 -2.298621	 -0.715581	 -0.292383
 -2.314059	 -0.719802	 -0.306875
 -2.330493	 -0.728240	 -0.320034
 -2.345966	 -0.741353	 -0.332440
 -2.357511	 -0.751608	 -0.342255
 -2.369564	 -0.758637	 -0.354680
 -2.382865	 -0.761052	 -0.373103
 -2.391950	 -0.758611	 -0.390638
 -2.403628	 -0.758848	 -0.407846
 -2.416633	 -0.761739	 -0.425781
 -2.434482	 -0.766947	 -0.449649
 -2.446496	 -0.769851	 -0.465372
