 -0.640505	  1.352278	 -2.634767
 -0.634164	  1.338889	 -2.608680
 -0.611592	  1.311797	 -2.570208
 -0.595685	  1.272886	 -2.544414
 -0.586780	  1.237811	 -2.510304
 -0.569837	  1.200912	 -2.478580
 -0.552956	  1.164698	 -2.448115
 -0.538727	  1.131254	 -2.417922
 -0.524314	  1.096244	 -2.385814
 -0.509764	  1.061311	 -2.351760
 -0.493209	  1.026507	 -2.317806
 -0.474350	  0.991720	 -2.284380
 -0.455168	  0.957784	 -2.252534
 -0.435565	  0.923843	 -2.222026
 -0.414696	  0.888762	 -2.192229
 -0.391934	  0.853394	 -2.163468
 -0.369027	  0.816870	 -2.135419
 -0.347977	  0.779924	 -2.108229
 -0.329748	  0.744310	 -2.082597
 -0.312767	  0.709609	 -2.058040
 -0.295756	  0.676347	 -2.035361
 -0.277140	  0.646438	 -2.017204
 -0.237477	  0.600883	 -1.997347
 -0.147471	  0.545312	 -1.991578
 -0.051458	  0.493041	 -2.006422
  0.044778	  0.393043	 -2.081785
  0.176187	  0.300957	 -2.175770
  0.245622	  0.246308	 -2.214253
  0.283434	  0.204293	 -2.216772
  0.310444	  0.156680	 -2.203499
  0.324764	  0.108826	 -2.175304
  0.330957	  0.070659	 -2.140042
  0.331630	  0.047269	 -2.098740
  0.326670	  0.036373	 -2.039551
  0.312151	  0.035848	 -1.965333
  0.285866	  0.041420	 -1.901365
  0.201579	  0.029289	 -1.789550
  0.080419	  0.068918	 -1.633471
  0.004916	  0.057042	 -1.522582
 -0.037876	  0.011043	 -1.442648
 -0.028764	 -0.037199	 -1.387557
 -0.012069	 -0.074313	 -1.349834
  0.006659	 -0.109153	 -1.316511
  0.026049	 -0.145018	 -1.284658
  0.044395	 -0.179691	 -1.256032
  0.063227	 -0.215657	 -1.227831
  0.082893	 -0.252065	 -1.199679
  0.103591	 -0.289979	 -1.170447
  0.122544	 -0.326922	 -1.142123
  0.139179	 -0.361926	 -1.116062
  0.156787	 -0.400668	 -1.088209
  0.173448	 -0.437927	 -1.060234
  0.190368	 -0.474352	 -1.031566
  0.206800	 -0.510042	 -1.001901
  0.220950	 -0.549614	 -0.970207
  0.231209	 -0.588426	 -0.939303
  0.239493	 -0.626160	 -0.907322
  0.247743	 -0.662068	 -0.873341
  0.257833	 -0.695754	 -0.838106
  0.269196	 -0.727227	 -0.802652
  0.281529	 -0.760667	 -0.765539
  0.295025	 -0.795125	 -0.729731
  0.309473	 -0.829760	 -0.695893
  0.323594	 -0.865139	 -0.664299
  0.334383	 -0.901736	 -0.635188
  0.345172	 -0.940097	 -0.605508
  0.356881	 -0.977448	 -0.575143
  0.368995	 -1.014524	 -0.543224
  0.382264	 -1.050863	 -0.509232
  0.396939	 -1.084539	 -0.473887
  0.412270	 -1.116773	 -0.438481
  0.427868	 -1.149223	 -0.403725
  0.443147	 -1.181555	 -0.370359
  0.458122	 -1.214708	 -0.337498
  0.473667	 -1.249536	 -0.304025
  0.489128	 -1.282781	 -0.272073
  0.505953	 -1.317502	 -0.238445
  0.524286	 -1.352003	 -0.204859
  0.542961	 -1.385724	 -0.171769
  0.561590	 -1.418473	 -0.138773
  0.581093	 -1.450961	 -0.106582
  0.601286	 -1.483439	 -0.075541
  0.622604	 -1.517298	 -0.044408
  0.643497	 -1.550061	 -0.014328
  0.664470	 -1.582129	  0.016791
  0.685697	 -1.615131	  0.049503
  0.704471	 -1.646967	  0.079854
  0.722232	 -1.679237	  0.110464
  0.739697	 -1.713895	  0.142542
  0.756118	 -1.751821	  0.174574
  0.770358	 -1.789510	  0.204029
  0.785137	 -1.826743	  0.234114
  0.800555	 -1.865250	  0.264078
  0.814823	 -1.907153	  0.291981
  0.826284	 -1.949154	  0.315741
  0.837162	 -1.989786	  0.339336
  0.848657	 -2.030923	  0.367598
  0.859543	 -2.067673	  0.398405
  0.872114	 -2.105632	  0.428261
  0.888573	 -2.143693	  0.459888
  0.907204	 -2.179197	  0.493903
  0.927025	 -2.213254	  0.523221
  0.944143	 -2.248164	  0.551403
  0.964927	 -2.285270	  0.576904
  0.987510	 -2.322310	  0.605118
  1.004198	 -2.358101	  0.635139
  1.021601	 -2.393149	  0.665647
  1.039424	 -2.426353	  0.698201
  1.057357	 -2.458314	  0.730491
  1.075726	 -2.491654	  0.763084
  1.091448	 -2.525130	  0.795855
  1.106252	 -2.561836	  0.827861
  1.115790	 -2.597191	  0.862658
  1.116810	 -2.637445	  0.892537
  1.127978	 -2.663819	  0.901462
