 -0.558637	  0.644853	 -2.164633
 -0.542932	  0.650453	 -2.193683
 -0.552366	  0.652324	 -2.174456
 -0.561544	  0.652930	 -2.162573
 -0.576134	  0.652857	 -2.146060
 -0.587384	  0.651814	 -2.129252
 -0.601047	  0.646601	 -2.109481
 -0.612444	  0.639530	 -2.093665
 -0.619298	  0.633263	 -2.085440
 -0.633793	  0.622006	 -2.070826
 -0.654362	  0.613394	 -2.051595
 -0.665279	  0.612957	 -2.039021
 -0.678981	  0.616552	 -2.021601
 -0.686190	  0.620225	 -2.009997
 -0.697953	  0.625140	 -1.991135
 -0.710284	  0.628909	 -1.970332
 -0.730303	  0.630247	 -1.953586
 -0.743084	  0.628653	 -1.943166
 -0.756517	  0.625825	 -1.934658
 -0.771321	  0.620643	 -1.918421
 -0.779596	  0.618150	 -1.904115
 -0.790448	  0.616455	 -1.882749
 -0.800244	  0.613860	 -1.864125
 -0.808462	  0.609836	 -1.846878
 -0.820212	  0.601893	 -1.825379
 -0.833651	  0.596931	 -1.805855
 -0.840888	  0.594174	 -1.793862
 -0.850285	  0.595855	 -1.781171
 -0.861340	  0.601252	 -1.759362
 -0.873464	  0.609201	 -1.744134
 -0.884634	  0.616920	 -1.731227
 -0.898311	  0.626896	 -1.712912
 -0.909359	  0.632638	 -1.693453
 -0.916394	  0.634644	 -1.680064
 -0.926701	  0.631824	 -1.663032
 -0.943200	  0.621665	 -1.641935
 -0.949963	  0.618700	 -1.629774
 -0.963320	  0.618335	 -1.610615
 -0.965650	  0.617301	 -1.596583
 -0.973806	  0.616987	 -1.577083
 -0.977203	  0.618027	 -1.557623
 -0.980530	  0.615894	 -1.533417
 -0.978486	  0.612869	 -1.520697
 -0.970524	  0.599994	 -1.501840
 -0.957608	  0.581260	 -1.484727
 -0.949397	  0.571718	 -1.476961
 -0.939534	  0.563372	 -1.469453
 -0.923200	  0.552412	 -1.454677
 -0.907777	  0.545908	 -1.433668
 -0.900189	  0.539468	 -1.419827
 -0.892009	  0.533758	 -1.409419
 -0.880898	  0.520070	 -1.394136
 -0.869178	  0.507018	 -1.376681
 -0.861266	  0.497442	 -1.360268
 -0.853202	  0.489690	 -1.345291
 -0.845981	  0.478771	 -1.328027
 -0.840714	  0.468645	 -1.314177
 -0.831780	  0.460292	 -1.300780
 -0.816192	  0.450964	 -1.288600
 -0.796595	  0.441518	 -1.279798
 -0.783137	  0.433314	 -1.269118
 -0.773057	  0.425147	 -1.251700
 -0.766526	  0.418959	 -1.231487
 -0.759230	  0.413147	 -1.209448
 -0.749300	  0.410468	 -1.192287
 -0.740329	  0.406078	 -1.177344
 -0.729701	  0.400671	 -1.164891
 -0.713120	  0.393551	 -1.153991
 -0.694906	  0.386562	 -1.142354
 -0.678235	  0.382656	 -1.127513
 -0.664229	  0.379658	 -1.112966
 -0.653745	  0.376618	 -1.099341
 -0.638598	  0.370160	 -1.077170
 -0.628924	  0.367046	 -1.058431
 -0.622436	  0.364123	 -1.044747
 -0.613602	  0.358946	 -1.025922
 -0.605364	  0.354997	 -1.005740
 -0.600236	  0.352770	 -0.990907
 -0.592708	  0.349787	 -0.968109
 -0.585491	  0.345014	 -0.945473
 -0.581004	  0.342257	 -0.935075
 -0.570249	  0.337903	 -0.912072
 -0.562979	  0.331926	 -0.891653
 -0.558215	  0.330025	 -0.881930
 -0.550067	  0.324878	 -0.862911
 -0.538267	  0.319441	 -0.833511
 -0.533261	  0.318556	 -0.826593
 -0.524297	  0.312493	 -0.807714
 -0.514314	  0.305423	 -0.791145
 -0.507613	  0.298461	 -0.772277
 -0.504992	  0.296064	 -0.748711
 -0.503359	  0.297599	 -0.727849
 -0.499958	  0.298160	 -0.712907
 -0.489330	  0.300098	 -0.694387
 -0.478965	  0.304246	 -0.676057
 -0.470673	  0.310006	 -0.652654
 -0.467834	  0.311580	 -0.631564
 -0.466466	  0.309918	 -0.612673
 -0.466499	  0.306199	 -0.594644
 -0.463948	  0.297203	 -0.574437
 -0.460683	  0.289426	 -0.556848
 -0.457366	  0.286117	 -0.539153
 -0.454863	  0.288256	 -0.520590
 -0.449712	  0.291921	 -0.492513
 -0.445880	  0.293459	 -0.479378
 -0.442858	  0.294650	 -0.464337
 -0.441440	  0.293241	 -0.438876
 -0.442300	  0.288249	 -0.411720
 -0.444635	  0.280143	 -0.392930
 -0.446310	  0.273969	 -0.378717
 -0.449350	  0.259687	 -0.357835
 -0.447167	  0.251474	 -0.340472
 -0.444393	  0.246789	 -0.326644
 -0.442521	  0.239887	 -0.293684
 -0.443883	  0.236429	 -0.279037
 -0.443623	  0.236337	 -0.264813
 -0.444396	  0.232926	 -0.238893
 -0.444263	  0.230721	 -0.217541
 -0.441910	  0.229284	 -0.201482
 -0.440179	  0.227442	 -0.180966
 -0.435914	  0.223749	 -0.165417
 -0.431131	  0.218108	 -0.141968
 -0.425413	  0.214706	 -0.125421
 -0.416134	  0.209931	 -0.107607
 -0.409835	  0.206362	 -0.083998
 -0.408301	  0.202517	 -0.063424
 -0.407651	  0.200207	 -0.050204
 -0.403602	  0.193582	 -0.029311
 -0.401787	  0.190203	 -0.005759
 -0.404327	  0.186371	  0.013820
 -0.406432	  0.181482	  0.031139
 -0.406727	  0.175511	  0.050969
 -0.406374	  0.169800	  0.070000
 -0.406234	  0.164188	  0.087157
 -0.406325	  0.157423	  0.109917
 -0.412247	  0.152400	  0.128113
 -0.426190	  0.145319	  0.152712
 -0.435420	  0.139372	  0.169170
 -0.441093	  0.135699	  0.178730
 -0.443070	  0.127474	  0.201999
 -0.439852	  0.119764	  0.225143
 -0.435582	  0.115606	  0.236913
 -0.432649	  0.107408	  0.259141
 -0.437632	  0.098425	  0.278941
 -0.445259	  0.090523	  0.295045
 -0.449459	  0.083148	  0.315893
 -0.449531	  0.078542	  0.333273
 -0.450064	  0.071819	  0.348534
 -0.458297	  0.060353	  0.366305
 -0.464703	  0.053064	  0.386503
 -0.466695	  0.045729	  0.404331
 -0.471255	  0.038992	  0.421020
 -0.475455	  0.034559	  0.442745
 -0.471637	  0.026428	  0.461129
 -0.470514	  0.015315	  0.481423
 -0.467719	  0.006380	  0.505757
 -0.464835	  0.002267	  0.516863
 -0.461938	 -0.002408	  0.528487
 -0.460385	 -0.011638	  0.547264
 -0.462782	 -0.024770	  0.577224
 -0.465240	 -0.031536	  0.588196
 -0.470066	 -0.042860	  0.604479
 -0.473288	 -0.055069	  0.629996
 -0.474457	 -0.059560	  0.643758
 -0.472838	 -0.059808	  0.663998
 -0.471199	 -0.062604	  0.679445
 -0.474105	 -0.069253	  0.701961
 -0.480230	 -0.069155	  0.721135
 -0.480742	 -0.072073	  0.743319
 -0.476684	 -0.083518	  0.763342
 -0.477471	 -0.093067	  0.780947
 -0.483497	 -0.098347	  0.798269
 -0.488873	 -0.102348	  0.817749
 -0.491206	 -0.107225	  0.835738
 -0.495545	 -0.112067	  0.854085
 -0.502700	 -0.116457	  0.874741
 -0.506205	 -0.120604	  0.894001
 -0.507503	 -0.124844	  0.911326
 -0.511218	 -0.128564	  0.929510
 -0.516138	 -0.131565	  0.952768
 -0.516707	 -0.133284	  0.973101
 -0.512642	 -0.137810	  0.988972
 -0.506743	 -0.145472	  1.007540
 -0.504310	 -0.153670	  1.030856
 -0.510111	 -0.158422	  1.053468
 -0.515654	 -0.161248	  1.073979
 -0.517010	 -0.162404	  1.083493
 -0.519766	 -0.160671	  1.108757
 -0.517990	 -0.159588	  1.135810
 -0.517186	 -0.160839	  1.146391
 -0.518109	 -0.163678	  1.165735
 -0.520081	 -0.167298	  1.190871
 -0.521516	 -0.171425	  1.212037
 -0.524579	 -0.174034	  1.229659
 -0.529859	 -0.174595	  1.246109
 -0.535165	 -0.177232	  1.266453
 -0.540127	 -0.181609	  1.288312
 -0.544209	 -0.185806	  1.307565
 -0.548232	 -0.189021	  1.322910
 -0.554211	 -0.194461	  1.345504
 -0.556279	 -0.200558	  1.368096
 -0.554500	 -0.206914	  1.381746
 -0.548630	 -0.218550	  1.400627
 -0.545349	 -0.229654	  1.424091
 -0.545136	 -0.233863	  1.437520
 -0.547022	 -0.234031	  1.453285
 -0.539742	 -0.236437	  1.473786
 -0.534514	 -0.240838	  1.502114
 -0.541614	 -0.247572	  1.520416
 -0.546714	 -0.251679	  1.535246
 -0.551602	 -0.261009	  1.556843
 -0.550073	 -0.267400	  1.575139
 -0.546790	 -0.271563	  1.590725
 -0.542375	 -0.276798	  1.615501
 -0.539392	 -0.280914	  1.635697
 -0.537867	 -0.282900	  1.649562
 -0.534537	 -0.287513	  1.670356
 -0.530301	 -0.292703	  1.689804
 -0.524065	 -0.296861	  1.707555
 -0.516435	 -0.299742	  1.730563
 -0.516167	 -0.305315	  1.752463
 -0.518050	 -0.308624	  1.765899
 -0.516991	 -0.316423	  1.786191
 -0.514675	 -0.322927	  1.805033
 -0.517056	 -0.330202	  1.823467
 -0.523179	 -0.335052	  1.845125
 -0.523472	 -0.335912	  1.871649
 -0.521671	 -0.334486	  1.883808
 -0.514188	 -0.337500	  1.903035
 -0.507335	 -0.346720	  1.921957
 -0.505491	 -0.352107	  1.942189
 -0.504491	 -0.355945	  1.961844
 -0.503701	 -0.359046	  1.981602
 -0.503217	 -0.361943	  2.001385
 -0.502742	 -0.364836	  2.021169
 -0.502722	 -0.367622	  2.040974
 -0.502964	 -0.370345	  2.060786
 -0.503213	 -0.373063	  2.080599
 -0.503849	 -0.375674	  2.100418
 -0.504593	 -0.378254	  2.120236
 -0.505293	 -0.380845	  2.140050
 -0.505684	 -0.383568	  2.159855
 -0.506129	 -0.386374	  2.179591
 -0.504827	 -0.390985	  2.198067
 -0.497843	 -0.397858	  2.217144
 -0.489478	 -0.401486	  2.236930
 -0.489491	 -0.401134	  2.260195
 -0.495745	 -0.399733	  2.281487
 -0.499448	 -0.401854	  2.298706
 -0.498700	 -0.407043	  2.316378
 -0.498820	 -0.410547	  2.338960
 -0.508858	 -0.410943	  2.358243
 -0.509008	 -0.413791	  2.378038
