  0.575473	  2.365264	 -0.116110
  0.569449	  2.381110	 -0.119884
  0.581431	  2.370060	 -0.114129
  0.594915	  2.352341	 -0.106190
  0.604810	  2.333581	 -0.099945
  0.610570	  2.317337	 -0.094610
  0.616316	  2.298420	 -0.090321
  0.623432	  2.275710	 -0.085162
  0.630377	  2.262714	 -0.078988
  0.641627	  2.249769	 -0.073482
  0.652981	  2.228510	 -0.072889
  0.655394	  2.211698	 -0.074037
  0.657088	  2.185651	 -0.077679
  0.658722	  2.149939	 -0.086580
  0.662146	  2.136239	 -0.090686
  0.668802	  2.121254	 -0.091448
  0.681805	  2.106740	 -0.088163
  0.703696	  2.088348	 -0.081902
  0.717731	  2.080287	 -0.079795
  0.741313	  2.067588	 -0.076829
  0.759202	  2.050463	 -0.078945
  0.770859	  2.042113	 -0.082842
  0.779714	  2.032785	 -0.084470
  0.799303	  2.018953	 -0.090772
  0.816677	  2.000469	 -0.096061
  0.824531	  1.993182	 -0.099974
  0.839209	  1.987416	 -0.107439
  0.873686	  1.978450	 -0.120154
  0.892837	  1.976270	 -0.125591
  0.898287	  1.972154	 -0.126862
  0.920130	  1.966286	 -0.130058
  0.944408	  1.950319	 -0.134757
  0.957208	  1.940919	 -0.141246
  0.969783	  1.930623	 -0.150122
  0.984213	  1.918676	 -0.165078
  0.995967	  1.909628	 -0.177107
  1.008082	  1.896590	 -0.190852
  1.015662	  1.885860	 -0.200077
  1.031418	  1.872878	 -0.206918
  1.049069	  1.857946	 -0.210706
  1.066123	  1.846443	 -0.214249
  1.083172	  1.838334	 -0.220630
  1.098390	  1.829553	 -0.229525
  1.111325	  1.818171	 -0.239693
  1.121597	  1.805894	 -0.250231
  1.130136	  1.791767	 -0.259130
  1.141421	  1.772822	 -0.266763
  1.154360	  1.758232	 -0.278166
  1.163739	  1.749106	 -0.288479
  1.175373	  1.740377	 -0.305018
  1.186947	  1.726623	 -0.317531
  1.199161	  1.711174	 -0.325032
  1.210866	  1.696115	 -0.329094
  1.221404	  1.678877	 -0.332780
  1.231385	  1.661075	 -0.336487
  1.240302	  1.643035	 -0.339689
  1.248436	  1.624603	 -0.341564
  1.255172	  1.605472	 -0.342856
  1.260146	  1.586166	 -0.346730
  1.265713	  1.567584	 -0.353453
  1.275211	  1.551184	 -0.362229
  1.292081	  1.534042	 -0.371453
  1.311622	  1.521864	 -0.374916
  1.330709	  1.509676	 -0.374021
  1.342218	  1.495764	 -0.372128
  1.349390	  1.477717	 -0.371640
  1.360367	  1.456369	 -0.371972
  1.372898	  1.438840	 -0.367639
  1.382903	  1.422843	 -0.365139
  1.391967	  1.409960	 -0.360096
  1.407147	  1.390983	 -0.352583
  1.423142	  1.375661	 -0.343009
  1.434067	  1.365489	 -0.336104
  1.447418	  1.352736	 -0.332123
  1.458879	  1.335988	 -0.330948
  1.469505	  1.319525	 -0.331440
  1.484556	  1.299931	 -0.331297
  1.495590	  1.287940	 -0.328514
  1.509958	  1.275210	 -0.325496
  1.526746	  1.260269	 -0.324634
  1.540609	  1.246702	 -0.321824
  1.553304	  1.231046	 -0.316322
  1.564329	  1.217713	 -0.311894
  1.575581	  1.199035	 -0.298190
  1.586121	  1.184915	 -0.284339
  1.594352	  1.170594	 -0.276572
  1.602894	  1.156594	 -0.272236
  1.617477	  1.132827	 -0.273097
  1.626686	  1.118456	 -0.269544
  1.634093	  1.108669	 -0.264592
  1.650123	  1.091652	 -0.252740
  1.659134	  1.080807	 -0.240705
  1.668190	  1.070754	 -0.232716
  1.685883	  1.057217	 -0.216805
  1.696492	  1.045020	 -0.199828
  1.701600	  1.036753	 -0.192817
  1.708391	  1.022549	 -0.178781
  1.715128	  1.007161	 -0.160516
  1.715479	  0.995063	 -0.143108
  1.713903	  0.986904	 -0.125260
  1.716668	  0.982574	 -0.105937
  1.725110	  0.978783	 -0.086648
  1.736769	  0.973587	 -0.068991
  1.747389	  0.964278	 -0.052397
  1.755660	  0.952312	 -0.037401
  1.759373	  0.939985	 -0.020709
  1.760097	  0.931988	 -0.003564
  1.761212	  0.926248	  0.015508
  1.762754	  0.923617	  0.035105
  1.766422	  0.919147	  0.053149
  1.775822	  0.906390	  0.070668
  1.780469	  0.891210	  0.089182
  1.784396	  0.885352	  0.102715
  1.798776	  0.881877	  0.119535
  1.820092	  0.887497	  0.139995
  1.833985	  0.893371	  0.159075
  1.837471	  0.897789	  0.176587
  1.830115	  0.890909	  0.196506
  1.821224	  0.873763	  0.225400
  1.820039	  0.855632	  0.240938
  1.823635	  0.839878	  0.249589
  1.833110	  0.838991	  0.262748
  1.842803	  0.833692	  0.283721
  1.843302	  0.826496	  0.306221
  1.839592	  0.811791	  0.324442
  1.836494	  0.796292	  0.337610
  1.836242	  0.785364	  0.341033
  1.853431	  0.767938	  0.349246
  1.861691	  0.748122	  0.351638
  1.857473	  0.726251	  0.355825
  1.848450	  0.709055	  0.363956
  1.846088	  0.691291	  0.374935
  1.849127	  0.673808	  0.382920
  1.851485	  0.653804	  0.386722
  1.851690	  0.633625	  0.389044
  1.849164	  0.616195	  0.395359
  1.840720	  0.597634	  0.402551
  1.826117	  0.580580	  0.402770
  1.816019	  0.563702	  0.400210
  1.811669	  0.545257	  0.399016
  1.807821	  0.524406	  0.400562
  1.791635	  0.506035	  0.400268
  1.772823	  0.494483	  0.395263
  1.756871	  0.483009	  0.388111
  1.749957	  0.469065	  0.383128
  1.741334	  0.452361	  0.377875
  1.727157	  0.436439	  0.375135
  1.714376	  0.421277	  0.373737
  1.699898	  0.407539	  0.370912
  1.685281	  0.394195	  0.367912
  1.670974	  0.380485	  0.365191
  1.656749	  0.366676	  0.362592
  1.642536	  0.352938	  0.359984
  1.628947	  0.341313	  0.357133
  1.617658	  0.325453	  0.352639
  1.609329	  0.301882	  0.346650
  1.602345	  0.283935	  0.346260
  1.596661	  0.270296	  0.350623
  1.589502	  0.249478	  0.356279
  1.590412	  0.228708	  0.356961
  1.595492	  0.214020	  0.357057
  1.607033	  0.195503	  0.361069
  1.616659	  0.177284	  0.364332
  1.624544	  0.163035	  0.366939
  1.634632	  0.148777	  0.369396
  1.650179	  0.135927	  0.372798
  1.668116	  0.125474	  0.373520
  1.686001	  0.114485	  0.373118
  1.700707	  0.099745	  0.375829
  1.712724	  0.085000	  0.382430
  1.725534	  0.073241	  0.391515
  1.741275	  0.064499	  0.402053
  1.757733	  0.058892	  0.411649
  1.774054	  0.052139	  0.423153
  1.787847	  0.042483	  0.434070
  1.803306	  0.028051	  0.443343
  1.819620	  0.016888	  0.446668
  1.838503	  0.010363	  0.451127
  1.857225	  0.006109	  0.457082
  1.873992	 -0.001290	  0.463894
  1.891432	 -0.009522	  0.471262
  1.911476	 -0.011176	  0.477264
  1.937586	 -0.001861	  0.487150
  1.960509	  0.007541	  0.495442
  1.977598	  0.013806	  0.499757
  1.993718	  0.013580	  0.506658
  2.014123	 -0.000442	  0.514596
  2.025794	 -0.008854	  0.519671
  2.046973	 -0.013264	  0.520109
  2.068294	 -0.018009	  0.516906
  2.087498	 -0.023745	  0.514464
  2.105406	 -0.031134	  0.509255
  2.122910	 -0.038835	  0.503357
  2.140333	 -0.046560	  0.497278
  2.156758	 -0.055674	  0.490320
  2.172542	 -0.065338	  0.482630
  2.188181	 -0.075044	  0.474745
  2.203555	 -0.084580	  0.466388
  2.217425	 -0.096359	  0.458386
  2.230970	 -0.108991	  0.450733
  2.244471	 -0.121649	  0.443138
  2.257843	 -0.134434	  0.435611
  2.268541	 -0.150380	  0.430201
  2.277806	 -0.167598	  0.425998
  2.287005	 -0.184858	  0.421838
  2.295781	 -0.202236	  0.417895
  2.295409	 -0.222057	  0.419039
  2.292523	 -0.241681	  0.421360
  2.286019	 -0.260504	  0.421977
  2.273969	 -0.276198	  0.419482
  2.261675	 -0.291749	  0.416848
  2.249377	 -0.307288	  0.414159
  2.237079	 -0.322558	  0.410240
  2.224878	 -0.337273	  0.404376
  2.212742	 -0.351978	  0.398352
  2.201974	 -0.366985	  0.390698
  2.191708	 -0.382062	  0.382497
  2.181508	 -0.397163	  0.374259
  2.172362	 -0.412762	  0.365727
  2.165019	 -0.429062	  0.356772
  2.157755	 -0.445393	  0.347799
  2.150546	 -0.461749	  0.338830
  2.144576	 -0.478657	  0.329985
  2.140432	 -0.496226	  0.321385
  2.136368	 -0.513825	  0.312795
  2.132333	 -0.531434	  0.304218
  2.128998	 -0.549319	  0.295929
  2.127948	 -0.567911	  0.288654
  2.127000	 -0.586534	  0.281425
  2.126053	 -0.605158	  0.274197
  2.125229	 -0.623809	  0.267061
  2.127098	 -0.643042	  0.261957
  2.129102	 -0.662302	  0.256958
  2.131109	 -0.681564	  0.251961
  2.133183	 -0.700835	  0.247065
  2.136739	 -0.720329	  0.244427
  2.140678	 -0.739831	  0.242393
  2.144631	 -0.759333	  0.240384
  2.148648	 -0.778824	  0.238465
  2.154037	 -0.798077	  0.238573
  2.159661	 -0.817264	  0.239035
  2.165324	 -0.836438	  0.239534
  2.171697	 -0.855364	  0.240573
  2.179019	 -0.873889	  0.242346
  2.186404	 -0.892386	  0.244164
  2.194236	 -0.910671	  0.246234
  2.202724	 -0.928614	  0.248674
  2.211264	 -0.946530	  0.251134
  2.220310	 -0.964189	  0.253652
  2.229607	 -0.981718	  0.256201
  2.239000	 -0.999375	  0.258765
  2.248938	 -1.017497	  0.261304
  2.258670	 -1.034810	  0.263657
