  0.100085	  2.415764	  0.332898
  0.087970	  2.440542	  0.353297
  0.075855	  2.465320	  0.373696
  0.081475	  2.451430	  0.362665
  0.089052	  2.435331	  0.346999
  0.096670	  2.423561	  0.336014
  0.102354	  2.408945	  0.324822
  0.107718	  2.394465	  0.309605
  0.115699	  2.381995	  0.298199
  0.121050	  2.367397	  0.286462
  0.125493	  2.352300	  0.269901
  0.132813	  2.339619	  0.257255
  0.139298	  2.326506	  0.246113
  0.143088	  2.312776	  0.229349
  0.150209	  2.301103	  0.214591
  0.159903	  2.290038	  0.202749
  0.171607	  2.283828	  0.188076
  0.183644	  2.280495	  0.172085
  0.195146	  2.276885	  0.156064
  0.208159	  2.282774	  0.142108
  0.220692	  2.293440	  0.130754
  0.233220	  2.304150	  0.119425
  0.245747	  2.314860	  0.108096
  0.258275	  2.325570	  0.096767
  0.270807	  2.336277	  0.085439
  0.283944	  2.346660	  0.074519
  0.300975	  2.354114	  0.067165
  0.318040	  2.361540	  0.059842
  0.335106	  2.368965	  0.052519
  0.352172	  2.376391	  0.045196
  0.369177	  2.383897	  0.037866
  0.385860	  2.392040	  0.030458
  0.402962	  2.399606	  0.023047
  0.420188	  2.406524	  0.015731
  0.437255	  2.413903	  0.008604
  0.453909	  2.422439	  0.001273
  0.470866	  2.430683	 -0.005803
  0.488262	  2.437046	 -0.013020
  0.505650	  2.443454	 -0.020602
  0.513240	  2.446633	 -0.023885
  0.522826	  2.450649	 -0.028032
