 -2.339037	 -0.962844	 -0.101096
 -2.347255	 -0.958687	 -0.073182
 -2.341816	 -0.961647	 -0.092171
 -2.337107	 -0.966095	 -0.111031
 -2.332965	 -0.972002	 -0.129698
 -2.328237	 -0.978350	 -0.147981
 -2.323526	 -0.984771	 -0.166151
 -2.319423	 -0.991421	 -0.184570
 -2.315397	 -0.998659	 -0.202856
 -2.311465	 -1.005741	 -0.221138
 -2.307362	 -1.011819	 -0.239826
 -2.302967	 -1.017762	 -0.258523
 -2.298438	 -1.024115	 -0.277023
 -2.292208	 -1.030026	 -0.295011
 -2.287431	 -1.034839	 -0.313816
 -2.281825	 -1.039179	 -0.332613
 -2.275632	 -1.043496	 -0.351093
 -2.270991	 -1.046886	 -0.369476
 -2.267761	 -1.049901	 -0.389065
 -2.263610	 -1.047366	 -0.407765
 -2.259664	 -1.044385	 -0.426979
 -2.258269	 -1.051726	 -0.453057
 -2.251295	 -1.061702	 -0.474307
 -2.244717	 -1.066389	 -0.487272
 -2.235861	 -1.064060	 -0.505788
 -2.227022	 -1.057604	 -0.525110
 -2.215857	 -1.058481	 -0.543190
 -2.193142	 -1.061655	 -0.561084
 -2.174786	 -1.057596	 -0.569726
 -2.159740	 -1.053314	 -0.577121
 -2.144210	 -1.048100	 -0.589314
 -2.126971	 -1.044737	 -0.600055
 -2.107826	 -1.041730	 -0.609338
 -2.091755	 -1.039645	 -0.618020
 -2.076205	 -1.036752	 -0.628847
 -2.056600	 -1.032947	 -0.639421
 -2.039251	 -1.028874	 -0.647648
 -2.022485	 -1.026869	 -0.656761
 -2.002913	 -1.025438	 -0.667360
 -1.983689	 -1.024407	 -0.674643
 -1.963319	 -1.025676	 -0.678748
 -1.945072	 -1.027325	 -0.681151
 -1.925051	 -1.029367	 -0.684730
 -1.904550	 -1.028746	 -0.689582
 -1.886832	 -1.028778	 -0.693998
 -1.866068	 -1.031773	 -0.696678
 -1.844026	 -1.041286	 -0.703605
 -1.828112	 -1.052276	 -0.710584
 -1.820882	 -1.065484	 -0.719494
 -1.819114	 -1.075132	 -0.736960
 -1.816151	 -1.082339	 -0.762910
 -1.814343	 -1.093569	 -0.792627
 -1.815115	 -1.099104	 -0.809485
 -1.814167	 -1.106660	 -0.828920
 -1.812574	 -1.116573	 -0.846608
 -1.811781	 -1.124065	 -0.858064
 -1.811312	 -1.140517	 -0.870997
 -1.822032	 -1.155888	 -0.885170
 -1.830116	 -1.170461	 -0.898667
 -1.837070	 -1.184298	 -0.911249
 -1.844049	 -1.197220	 -0.924921
 -1.851311	 -1.209677	 -0.938575
 -1.858827	 -1.221828	 -0.952570
 -1.866132	 -1.233713	 -0.966857
 -1.872723	 -1.244839	 -0.981533
 -1.878654	 -1.251057	 -0.998786
 -1.883004	 -1.255677	 -1.017700
 -1.888231	 -1.260447	 -1.036403
 -1.892818	 -1.265182	 -1.055334
 -1.897577	 -1.270873	 -1.073979
 -1.902741	 -1.276713	 -1.092395
 -1.907380	 -1.283390	 -1.110845
 -1.907464	 -1.300500	 -1.124641
 -1.904163	 -1.315760	 -1.137141
