 -2.772100	 -0.442106	  1.140571
 -2.744654	 -0.437729	  1.129278
 -2.699111	 -0.408537	  1.136710
 -2.653880	 -0.382942	  1.132311
 -2.613190	 -0.354420	  1.128729
 -2.569384	 -0.327371	  1.133992
 -2.530049	 -0.293756	  1.135729
 -2.487813	 -0.273695	  1.130392
 -2.447295	 -0.246803	  1.128364
 -2.402483	 -0.214645	  1.130651
 -2.367774	 -0.193839	  1.130778
 -2.326153	 -0.164713	  1.130141
 -2.283225	 -0.142942	  1.134693
 -2.236445	 -0.117366	  1.129825
 -2.192461	 -0.084813	  1.135109
 -2.153500	 -0.055777	  1.136408
 -2.113569	 -0.032221	  1.131853
 -2.068911	 -0.008843	  1.125941
 -2.026717	  0.018783	  1.126174
 -1.988994	  0.040805	  1.131710
 -1.942436	  0.066509	  1.130094
 -1.897196	  0.093674	  1.129266
 -1.857992	  0.122392	  1.132203
 -1.818438	  0.150926	  1.128153
 -1.772483	  0.173948	  1.127355
 -1.730987	  0.203004	  1.132713
 -1.696125	  0.236794	  1.135934
 -1.650692	  0.262437	  1.131879
 -1.611779	  0.283796	  1.130088
 -1.570419	  0.307993	  1.129422
 -1.524175	  0.335475	  1.127634
 -1.483512	  0.362973	  1.125740
 -1.445110	  0.393030	  1.126652
 -1.399141	  0.422697	  1.124214
 -1.357319	  0.446610	  1.122177
 -1.315459	  0.468913	  1.123989
 -1.270068	  0.494106	  1.126565
 -1.228090	  0.521681	  1.128066
 -1.189120	  0.544118	  1.127895
 -1.145440	  0.571477	  1.127976
 -1.102491	  0.599024	  1.128233
 -1.060262	  0.629015	  1.129878
 -1.028916	  0.638587	  1.137388
 -0.932163	  0.546789	  1.215028
 -0.832659	  0.541048	  1.212466
 -0.805094	  0.545170	  1.210602
 -0.663060	  0.454444	  1.350640
 -0.677014	  0.543564	  1.293101
 -0.516892	  0.424288	  1.281668
 -0.464619	  0.390598	  1.253450
 -0.428070	  0.385483	  1.298565
 -0.414840	  0.468531	  1.218696
 -0.275183	  0.490254	  1.235004
 -0.282915	  0.448702	  1.095968
 -0.268823	  0.516853	  1.158068
 -0.032678	  0.475136	  1.187895
 -0.145509	  0.583001	  1.118108
 -0.052234	  0.567915	  1.094061
 -0.092639	  0.721035	  0.919885
 -0.001945	  0.925911	  0.999666
 -0.011879	  0.903567	  1.014151
 -0.046893	  0.946541	  0.990149
 -0.024365	  0.986403	  1.017557
  0.033350	  1.096949	  1.013034
  0.011972	  1.140204	  1.068957
 -0.012494	  1.175758	  1.081733
 -0.024647	  1.274487	  1.116898
  0.017444	  1.319420	  1.125825
  0.062882	  1.348502	  1.125713
  0.109017	  1.376625	  1.125016
  0.150825	  1.401951	  1.123261
  0.188813	  1.426947	  1.123962
  0.232215	  1.452680	  1.123913
  0.273383	  1.480041	  1.124858
  0.314039	  1.505837	  1.123354
  0.358100	  1.536894	  1.122847
  0.398129	  1.565522	  1.124335
  0.443486	  1.592660	  1.123141
  0.480064	  1.617755	  1.126836
  0.524176	  1.644425	  1.126336
  0.562733	  1.673370	  1.123106
  0.611063	  1.700357	  1.124329
  0.651492	  1.721750	  1.123958
  0.691288	  1.745295	  1.123249
  0.735526	  1.772540	  1.122802
  0.776875	  1.801217	  1.121712
  0.822562	  1.828096	  1.120241
  0.859257	  1.854879	  1.119189
  0.900219	  1.879259	  1.118864
  0.943401	  1.908465	  1.118110
  0.985273	  1.936868	  1.119562
  1.024343	  1.962214	  1.122637
  1.070526	  1.987855	  1.123319
  1.112834	  2.016987	  1.124082
  1.147861	  2.042593	  1.119064
  1.191317	  2.064326	  1.120776
  1.233265	  2.091500	  1.121634
  1.275517	  2.121760	  1.115630
  1.320097	  2.145199	  1.119317
  1.361707	  2.172414	  1.118218
  1.403134	  2.203290	  1.115932
  1.442286	  2.225493	  1.116705
  1.489970	  2.251963	  1.122467
  1.531490	  2.280937	  1.125238
  1.564392	  2.304010	  1.115444
  1.580036	  2.327050	  1.126599
