 0.0 0.0 0.0 0
 0.3930897797021589 0.8716731048948835 0.04914156631879488 1000
 0.43405140343883747 -0.8815454543346233 -0.6662956408058078 1000
 0.41707588695452447 0.8216526758855185 -0.7075491036063232 1000
 0.7459716134556131 -0.444461194350479 -1.2341364749248485 1000
 -0.3711591241818174 0.18848357198270335 -0.6276037397299267 1000
 0.5924649105368269 -0.7754414214351376 -0.3628439815702229 1000
 0.6301543230017177 0.3049995745397937 -1.2940275008773825 1000
 -0.7366987062690609 0.6663716741218032 0.8376200636494058 1000
 0.0 0.0 0.0 0
 -0.8486765188175854 0.09505147038501965 1.316917657408949 1000
 -0.15793866018950525 -0.7897411077218529 0.6990166330033559 1000
 -0.46618412190630715 0.2715536328476396 1.341565815502662 1000
 0.5805702962672202 0.23753818214101202 0.3441550603552395 1000
 -0.795175724069811 0.5540100162574635 0.4944695282750124 1000
 0.01800063821356851 -0.5262398639906496 -0.9779893797841661 1000
 0.622921869568196 0.6370152744414708 -0.9755677575040133 1000
 -0.7474228548099667 0.41108868768785867 0.14178408841978268 1000
 0.0 0.0 0.0 0
 -0.7619781410657052 -0.6126026290095923 0.8421454960768556 1000
 -0.13626086964008427 -0.9551806337703441 -0.25112339913894055 1000
 0.4125714518938787 -0.03659911621161975 -1.344356326838576 1000
 -0.6670789363089173 0.6581781303672956 1.0266582490357268 1000
 0.5008274397519987 0.47180561296979434 0.3801632547976312 1000
 -0.42692822225155913 -0.6679480658484038 0.9663485483983753 1000
 0.9838708794268375 0.1761087066598419 -0.8545962119558277 1000
 0.1345885279899588 -0.19304390197387286 0.9040868963605763 1000
 0.0 0.0 0.0 0
 -0.7017093498416968 0.23732288238016397 1.3642560260369585 1000
 -0.5723080604405445 -0.7223323227089298 0.02127099838472654 1000
 0.9401319155496438 -0.310326879899908 -0.7144761438416236 1000
 0.3566000540785192 -0.891345594502451 -0.10158217216583115 1000
 0.8135176739177399 -0.5781938581780983 -0.7157722239742141 1000
 -0.28490734535708295 -0.14960888647948792 -0.7773203308061922 1000
 -0.7322521220202215 -0.10813353765486625 1.3579747357559848 1000
 0.9514583283275241 -0.14174840534033034 -1.147426584280772 1000
 0.0 0.0 0.0 0
 0.795687846056164 0.4762890807676021 -0.2574513625865521 1000
 0.24274711151454406 0.8667751505300343 -0.5970523772272628 1000
 -0.967387909282451 0.12812698147496518 0.6363671797980324 1000
 -0.4684234819902096 -0.6477482655357433 -0.29137956652665853 1000
 -0.2534577688021179 0.8012118311164316 -0.27915146235424704 1000
 -0.6292767763576351 -0.7584138895662129 0.30059475500192445 1000
 -0.0329245745304108 0.9803775020065103 0.3317769306561662 1000
 -0.02427682375538206 0.11109726310185733 1.0975841672850613 1000
 0.0 0.0 0.0 0
 0.9617996597218266 0.23056001627555384 -0.9862979038948388 1000
 -0.40456890742876367 0.9141275177285044 0.4261620959754773 1000
