  0.413200	  0.713720	 -2.344057
  0.423171	  0.714147	 -2.355996
  0.405241	  0.710013	 -2.341851
  0.386045	  0.711208	 -2.326519
  0.379099	  0.713986	 -2.322222
  0.363860	  0.723416	 -2.310557
  0.343201	  0.730846	 -2.296100
  0.331141	  0.732816	 -2.288864
  0.314900	  0.735025	 -2.282253
  0.294369	  0.738701	 -2.274671
  0.275396	  0.737927	 -2.269600
  0.251994	  0.734500	 -2.265118
  0.231255	  0.742014	 -2.263625
  0.215043	  0.757322	 -2.262978
  0.202992	  0.770624	 -2.267103
  0.186336	  0.783860	 -2.270981
  0.170319	  0.795956	 -2.273471
  0.153269	  0.806432	 -2.275891
  0.136638	  0.817542	 -2.277890
  0.120887	  0.829426	 -2.281180
  0.105704	  0.841357	 -2.284617
  0.089420	  0.849258	 -2.284311
  0.068045	  0.858416	 -2.290955
  0.051823	  0.872219	 -2.300670
  0.038266	  0.886249	 -2.304162
  0.026564	  0.895932	 -2.306180
  0.006246	  0.911045	 -2.311055
 -0.008850	  0.928777	 -2.311654
 -0.016391	  0.937477	 -2.310481
 -0.035310	  0.947708	 -2.308951
 -0.045944	  0.972066	 -2.297589
 -0.060894	  0.985327	 -2.298390
