 -0.251154	  2.269038	  0.919809
 -0.251124	  2.270531	  0.921623
 -0.251471	  2.257952	  0.906097
 -0.251604	  2.245136	  0.890726
 -0.251017	  2.233154	  0.874734
 -0.250125	  2.221356	  0.858591
 -0.249096	  2.209496	  0.842522
 -0.248977	  2.197210	  0.827330
 -0.251131	  2.182088	  0.813559
 -0.251842	  2.168756	  0.798786
 -0.253495	  2.157719	  0.784090
 -0.250675	  2.139085	  0.764892
 -0.245254	  2.125877	  0.750241
 -0.242518	  2.117611	  0.738605
 -0.244494	  2.105528	  0.721673
 -0.242526	  2.099220	  0.699565
 -0.238993	  2.095782	  0.676948
 -0.236804	  2.090890	  0.659372
 -0.233598	  2.082671	  0.640833
 -0.230086	  2.073201	  0.620602
 -0.232494	  2.050881	  0.603983
 -0.237877	  2.035341	  0.601120
 -0.245278	  2.009977	  0.598186
 -0.246987	  1.988660	  0.587921
 -0.251136	  1.976132	  0.583565
 -0.256132	  1.959707	  0.571549
 -0.262824	  1.945009	  0.563375
 -0.268345	  1.931437	  0.556957
 -0.281894	  1.909798	  0.552515
 -0.290342	  1.895064	  0.549527
 -0.298552	  1.882909	  0.545870
 -0.310914	  1.865930	  0.542917
 -0.319696	  1.847040	  0.544497
 -0.326927	  1.826807	  0.547173
 -0.335430	  1.808003	  0.547928
 -0.347690	  1.791381	  0.549118
 -0.366354	  1.778418	  0.550486
 -0.388765	  1.769605	  0.548794
 -0.404434	  1.761866	  0.541205
 -0.417442	  1.747287	  0.533672
 -0.425308	  1.732119	  0.525322
 -0.436077	  1.717292	  0.519757
 -0.452461	  1.700016	  0.523046
 -0.467666	  1.683873	  0.526817
 -0.477641	  1.668937	  0.526663
 -0.488250	  1.653292	  0.526680
 -0.495884	  1.634628	  0.524930
 -0.503095	  1.614304	  0.517266
 -0.510844	  1.597821	  0.500349
 -0.522300	  1.577676	  0.483897
 -0.526952	  1.570368	  0.479467
 -0.533880	  1.552558	  0.472444
 -0.541478	  1.532529	  0.470717
 -0.543403	  1.512483	  0.468006
 -0.543819	  1.491029	  0.463861
 -0.550443	  1.468447	  0.453037
 -0.557715	  1.453451	  0.441293
 -0.557465	  1.443492	  0.428082
 -0.549319	  1.439678	  0.415315
 -0.546948	  1.420939	  0.393439
 -0.539634	  1.417460	  0.386459
 -0.526571	  1.407626	  0.369646
 -0.518429	  1.396931	  0.359112
 -0.513041	  1.384805	  0.351439
 -0.490384	  1.375221	  0.336732
 -0.476039	  1.370970	  0.329332
 -0.464820	  1.367249	  0.318873
 -0.442523	  1.367787	  0.318961
 -0.429484	  1.359911	  0.303063
 -0.408654	  1.355650	  0.296552
 -0.396401	  1.351017	  0.280284
 -0.373925	  1.350510	  0.266928
 -0.354617	  1.344539	  0.256089
 -0.340371	  1.343250	  0.244380
 -0.330172	  1.342168	  0.241131
 -0.301773	  1.357497	  0.231162
 -0.284303	  1.365332	  0.231893
 -0.264574	  1.366231	  0.235171
 -0.242765	  1.375993	  0.235777
 -0.221233	  1.382839	  0.231819
 -0.202580	  1.390584	  0.224050
 -0.185212	  1.390227	  0.223119
 -0.165852	  1.394978	  0.216689
 -0.146800	  1.399766	  0.195758
 -0.134914	  1.402657	  0.184095
 -0.120148	  1.403416	  0.171142
 -0.105966	  1.401795	  0.159922
 -0.085311	  1.402245	  0.152271
 -0.068679	  1.400108	  0.143990
 -0.049204	  1.401534	  0.135374
 -0.031814	  1.400030	  0.125491
 -0.015094	  1.398489	  0.115728
  0.000853	  1.398788	  0.107832
  0.020512	  1.399099	  0.101366
  0.044419	  1.392785	  0.093959
  0.061809	  1.385698	  0.083928
  0.074429	  1.377632	  0.076281
  0.089894	  1.370655	  0.064947
  0.103869	  1.358617	  0.055411
  0.117233	  1.343515	  0.048374
  0.135676	  1.332979	  0.043569
  0.145891	  1.319222	  0.035427
  0.160846	  1.311960	  0.028397
  0.178019	  1.301354	  0.016683
  0.189243	  1.293854	  0.008906
  0.201998	  1.283267	 -0.004051
  0.217843	  1.273553	 -0.014408
  0.229395	  1.264344	 -0.027071
  0.239284	  1.254215	 -0.038190
  0.243800	  1.239998	 -0.053376
  0.240135	  1.227899	 -0.068109
  0.238376	  1.213886	 -0.082602
  0.241925	  1.202883	 -0.095871
  0.249978	  1.190347	 -0.112479
  0.255695	  1.180599	 -0.129775
  0.252181	  1.172981	 -0.142992
  0.246991	  1.163333	 -0.159048
  0.244819	  1.150123	 -0.176842
  0.238048	  1.134364	 -0.192062
  0.233630	  1.120771	 -0.202322
  0.228682	  1.104667	 -0.214176
  0.227816	  1.095635	 -0.221575
  0.219797	  1.074452	 -0.235951
  0.209948	  1.056316	 -0.248413
  0.202242	  1.047809	 -0.253117
  0.196057	  1.038024	 -0.253541
  0.181460	  1.010894	 -0.262637
  0.178648	  0.997972	 -0.266886
  0.175927	  0.977661	 -0.271681
  0.173337	  0.954246	 -0.277105
  0.169807	  0.934247	 -0.283724
  0.168739	  0.925682	 -0.284560
  0.167459	  0.903038	 -0.286564
  0.163545	  0.881942	 -0.285579
  0.164279	  0.860089	 -0.280572
  0.167801	  0.843488	 -0.276877
  0.168586	  0.820545	 -0.279122
  0.163627	  0.796516	 -0.287733
  0.161653	  0.783702	 -0.293023
  0.156047	  0.764978	 -0.303426
  0.156243	  0.745324	 -0.310751
  0.160876	  0.729253	 -0.316289
  0.162267	  0.714043	 -0.326133
  0.163143	  0.692913	 -0.332711
  0.161858	  0.668051	 -0.347850
  0.162874	  0.658311	 -0.355296
  0.160878	  0.643626	 -0.363131
  0.159783	  0.634717	 -0.377097
  0.157670	  0.625651	 -0.392571
  0.154423	  0.616248	 -0.405350
  0.147943	  0.607665	 -0.426140
  0.139724	  0.609150	 -0.449968
  0.137224	  0.615972	 -0.471775
  0.137449	  0.617255	 -0.481872
  0.140997	  0.623651	 -0.500843
  0.138490	  0.632818	 -0.528915
  0.135532	  0.641777	 -0.542727
  0.131292	  0.653725	 -0.559811
  0.126732	  0.666645	 -0.575769
  0.123642	  0.674686	 -0.589983
  0.118605	  0.683269	 -0.611549
  0.115182	  0.689962	 -0.633713
  0.113429	  0.696709	 -0.648277
  0.115459	  0.701333	 -0.665692
  0.117670	  0.701260	 -0.685417
  0.118581	  0.697200	 -0.706491
  0.121539	  0.695325	 -0.734858
  0.121396	  0.691839	 -0.747185
  0.119642	  0.686202	 -0.764612
  0.118300	  0.675746	 -0.783973
  0.120215	  0.665892	 -0.802100
  0.122633	  0.654021	 -0.814468
  0.126484	  0.642501	 -0.827231
  0.134159	  0.624043	 -0.841745
  0.142832	  0.611131	 -0.854926
  0.153115	  0.601420	 -0.865632
  0.162559	  0.590388	 -0.879911
  0.174112	  0.579555	 -0.892275
  0.185257	  0.569954	 -0.902285
  0.198733	  0.553232	 -0.914089
  0.205875	  0.539621	 -0.925077
  0.218140	  0.526470	 -0.934197
  0.231560	  0.512792	 -0.946009
  0.243934	  0.500323	 -0.958612
  0.254541	  0.494584	 -0.965962
  0.271472	  0.481840	 -0.974257
  0.283620	  0.466220	 -0.980979
  0.294447	  0.453115	 -0.984285
  0.308392	  0.436781	 -0.985282
  0.328179	  0.418450	 -0.991895
  0.337135	  0.407585	 -0.999208
  0.345313	  0.397261	 -1.006844
  0.359203	  0.377683	 -1.019356
  0.365242	  0.361653	 -1.032097
  0.367178	  0.349588	 -1.045357
  0.374254	  0.331640	 -1.062792
  0.379856	  0.319704	 -1.077453
  0.371162	  0.315543	 -1.090377
  0.375529	  0.306990	 -1.109900
  0.384840	  0.291004	 -1.129595
  0.384474	  0.282334	 -1.148578
  0.381252	  0.281170	 -1.155504
  0.377110	  0.265915	 -1.175651
  0.370400	  0.251232	 -1.192049
  0.366556	  0.243634	 -1.206166
  0.363424	  0.234837	 -1.223662
  0.362123	  0.227056	 -1.246816
  0.360045	  0.219920	 -1.258021
  0.348032	  0.210336	 -1.280908
  0.340827	  0.202942	 -1.301039
  0.339851	  0.199661	 -1.313523
  0.333453	  0.193494	 -1.331855
  0.324939	  0.182995	 -1.358732
  0.321208	  0.178807	 -1.366730
  0.311579	  0.173333	 -1.386638
  0.294775	  0.167283	 -1.404100
  0.285585	  0.158377	 -1.412006
  0.277147	  0.145161	 -1.425755
  0.262708	  0.129587	 -1.445096
  0.255778	  0.126256	 -1.458383
  0.246822	  0.119751	 -1.481627
  0.242883	  0.121186	 -1.494431
  0.228951	  0.117391	 -1.509454
  0.224985	  0.107614	 -1.524089
  0.232324	  0.093773	 -1.542241
  0.234363	  0.077442	 -1.555088
  0.234907	  0.063190	 -1.568313
  0.238082	  0.051714	 -1.582319
  0.242955	  0.039457	 -1.597264
  0.250248	  0.026180	 -1.612606
  0.253595	  0.008346	 -1.626817
  0.250585	 -0.009630	 -1.642375
  0.245072	 -0.025765	 -1.655445
  0.244674	 -0.037315	 -1.665672
  0.243307	 -0.052580	 -1.676807
  0.244787	 -0.072596	 -1.688816
  0.245461	 -0.086413	 -1.699791
  0.246518	 -0.097967	 -1.711670
  0.250118	 -0.119484	 -1.728405
  0.254280	 -0.141206	 -1.737167
  0.257765	 -0.152906	 -1.743116
  0.265729	 -0.167297	 -1.751436
  0.272958	 -0.183455	 -1.765395
  0.277944	 -0.197751	 -1.776836
  0.287512	 -0.214498	 -1.789576
  0.293940	 -0.229444	 -1.803459
  0.297075	 -0.244734	 -1.818508
  0.295975	 -0.256410	 -1.831358
  0.291704	 -0.270416	 -1.847001
  0.284344	 -0.283541	 -1.865674
  0.278358	 -0.296935	 -1.882453
  0.280823	 -0.314576	 -1.896545
  0.286544	 -0.327110	 -1.906869
  0.295007	 -0.339750	 -1.925405
  0.300272	 -0.348218	 -1.937018
  0.309369	 -0.361966	 -1.949921
  0.318027	 -0.379628	 -1.965654
  0.319997	 -0.389298	 -1.980433
  0.321686	 -0.399504	 -1.998152
  0.324950	 -0.410116	 -2.014831
  0.326523	 -0.419152	 -2.032888
  0.328531	 -0.430468	 -2.053547
  0.333039	 -0.440729	 -2.067325
  0.341340	 -0.449737	 -2.078716
  0.351462	 -0.462757	 -2.097231
  0.356408	 -0.478270	 -2.117742
  0.357683	 -0.483476	 -2.127009
  0.362507	 -0.492746	 -2.146238
  0.370056	 -0.502076	 -2.162627
  0.377056	 -0.512597	 -2.179665
  0.384892	 -0.520522	 -2.196445
  0.394202	 -0.532369	 -2.216132
  0.401065	 -0.544757	 -2.230683
  0.404401	 -0.558398	 -2.240853
  0.408348	 -0.570716	 -2.253182
  0.411816	 -0.589837	 -2.267910
  0.416545	 -0.608359	 -2.281295
  0.421448	 -0.619409	 -2.295905
  0.426345	 -0.623522	 -2.308016
  0.434383	 -0.632111	 -2.330835
  0.439992	 -0.648461	 -2.348283
  0.440432	 -0.662379	 -2.356722
  0.431791	 -0.686655	 -2.365293
  0.435514	 -0.698375	 -2.381066
