 -0.918689	  1.623352	  2.387810
 -0.909593	  1.607280	  2.364168
 -0.876659	  1.575678	  2.348305
 -0.849484	  1.548221	  2.318780
 -0.826804	  1.514928	  2.289526
 -0.792872	  1.487446	  2.264926
 -0.758383	  1.460832	  2.238209
 -0.723486	  1.430912	  2.214227
 -0.687999	  1.402006	  2.190904
 -0.657366	  1.369194	  2.166518
 -0.630734	  1.334898	  2.141167
 -0.606317	  1.300046	  2.116747
 -0.582517	  1.266002	  2.090919
 -0.558174	  1.233633	  2.061786
 -0.534413	  1.203175	  2.030576
 -0.511510	  1.174379	  1.997830
 -0.489310	  1.147208	  1.964034
 -0.466028	  1.120305	  1.929094
 -0.441108	  1.093094	  1.892515
 -0.415296	  1.064083	  1.857090
 -0.388685	  1.031591	  1.824443
 -0.361693	  0.996550	  1.796053
 -0.335546	  0.960600	  1.771919
 -0.310421	  0.923221	  1.749691
 -0.285648	  0.883594	  1.728877
 -0.260474	  0.842170	  1.712201
 -0.234514	  0.800081	  1.700773
 -0.207414	  0.758942	  1.687753
 -0.180280	  0.720256	  1.672096
 -0.155092	  0.683311	  1.654074
 -0.132266	  0.647084	  1.631990
 -0.108460	  0.612856	  1.603366
 -0.080498	  0.582282	  1.571149
 -0.050180	  0.555244	  1.538498
 -0.019077	  0.530137	  1.506937
  0.012072	  0.507127	  1.476092
  0.040037	  0.486360	  1.446343
  0.064506	  0.467148	  1.417189
  0.089471	  0.445404	  1.382956
  0.118111	  0.415170	  1.332606
  0.131328	  0.390168	  1.260085
  0.147014	  0.351637	  1.169362
  0.136338	  0.329613	  1.081605
  0.120819	  0.317625	  1.022651
  0.114010	  0.306791	  0.985920
  0.113853	  0.289166	  0.945800
  0.127384	  0.252465	  0.888622
  0.157626	  0.197695	  0.833091
  0.193577	  0.143198	  0.800903
  0.222861	  0.106954	  0.793529
  0.249393	  0.081175	  0.798113
  0.289854	  0.048496	  0.815336
  0.346191	  0.008281	  0.840737
  0.400569	 -0.029933	  0.859379
  0.440981	 -0.061943	  0.864238
  0.480347	 -0.094559	  0.869735
  0.531143	 -0.140737	  0.888636
  0.588462	 -0.196283	  0.925973
  0.642391	 -0.250869	  0.934570
  0.686270	 -0.298224	  0.915874
  0.720142	 -0.336507	  0.892367
  0.751837	 -0.370666	  0.866315
  0.785349	 -0.399137	  0.839146
  0.820364	 -0.423754	  0.811783
  0.854914	 -0.447949	  0.784363
  0.888742	 -0.473883	  0.757654
  0.920778	 -0.502237	  0.733771
  0.951249	 -0.532460	  0.711019
  0.981109	 -0.564694	  0.688585
  1.011025	 -0.600478	  0.666068
  1.036873	 -0.638828	  0.642165
  1.055749	 -0.677754	  0.618755
  1.066540	 -0.715354	  0.604103
  1.069585	 -0.750725	  0.601942
  1.066523	 -0.799691	  0.614617
  1.062088	 -0.884622	  0.655632
  1.079963	 -0.985356	  0.701271
  1.104103	 -1.069617	  0.726007
  1.141518	 -1.134366	  0.757674
  1.225594	 -1.195000	  0.809055
  1.375055	 -1.252605	  0.872284
  1.509886	 -1.300014	  0.913046
  1.518066	 -1.379000	  0.881549
  1.488901	 -1.431677	  0.751513
  1.440657	 -1.433174	  0.614787
  1.425327	 -1.410491	  0.511513
  1.426059	 -1.385084	  0.437460
  1.438566	 -1.355351	  0.371610
  1.459734	 -1.319274	  0.289878
  1.498464	 -1.302480	  0.196069
  1.558178	 -1.306311	  0.131439
  1.605098	 -1.318172	  0.092147
  1.644700	 -1.335571	  0.061583
  1.681541	 -1.360121	  0.033945
  1.715728	 -1.391505	  0.009916
  1.746957	 -1.426393	 -0.008442
  1.777045	 -1.465057	 -0.022774
  1.805380	 -1.506704	 -0.035790
  1.830913	 -1.548593	 -0.050266
  1.854489	 -1.589263	 -0.067658
  1.879200	 -1.627388	 -0.089065
  1.905888	 -1.662027	 -0.114063
  1.935446	 -1.693502	 -0.142557
  1.966329	 -1.722639	 -0.174078
  1.995448	 -1.749861	 -0.208180
  2.021643	 -1.775432	 -0.243450
  2.045255	 -1.801682	 -0.276485
  2.068050	 -1.834542	 -0.304633
  2.088779	 -1.873557	 -0.330871
  2.107357	 -1.908340	 -0.364132
  2.131307	 -1.945749	 -0.387898
  2.162440	 -1.973218	 -0.416374
  2.181084	 -2.010828	 -0.446589
  2.202895	 -2.030936	 -0.451055
