 -3.014270	 -0.182956	 -0.248195
 -2.984426	 -0.181144	 -0.245737
 -2.934283	 -0.160291	 -0.253878
 -2.888344	 -0.137266	 -0.256768
 -2.845678	 -0.114861	 -0.269334
 -2.803991	 -0.093001	 -0.285614
 -2.761621	 -0.078089	 -0.304463
 -2.719579	 -0.054397	 -0.318928
 -2.675037	 -0.034979	 -0.330720
 -2.627596	 -0.020155	 -0.340826
 -2.580726	 -0.000403	 -0.351539
 -2.537112	  0.022626	 -0.362903
 -2.494560	  0.045817	 -0.374238
 -2.451803	  0.067532	 -0.385877
 -2.408524	  0.090035	 -0.399092
 -2.366008	  0.113329	 -0.412251
 -2.323583	  0.135626	 -0.422969
 -2.280413	  0.159113	 -0.432739
 -2.238521	  0.185369	 -0.441472
 -2.196666	  0.212616	 -0.446307
 -2.154674	  0.237322	 -0.448696
 -2.111441	  0.261955	 -0.454568
 -2.066801	  0.288116	 -0.462936
 -2.024175	  0.313179	 -0.471452
 -1.981899	  0.335781	 -0.478581
 -1.937060	  0.358229	 -0.485910
 -1.892047	  0.380851	 -0.492206
 -1.848824	  0.402398	 -0.496479
 -1.803441	  0.423701	 -0.500254
 -1.757384	  0.441862	 -0.503163
 -1.708629	  0.460098	 -0.503950
 -1.663196	  0.484156	 -0.505954
 -1.618530	  0.507277	 -0.514260
 -1.575560	  0.524537	 -0.524984
 -1.534097	  0.548729	 -0.534708
 -1.489720	  0.574522	 -0.544238
 -1.442646	  0.596862	 -0.552596
 -1.397869	  0.617198	 -0.559049
 -1.356142	  0.637859	 -0.562859
 -1.314007	  0.661990	 -0.565456
 -1.270299	  0.687968	 -0.568453
 -1.224615	  0.712727	 -0.573565
 -1.179121	  0.735763	 -0.581192
 -1.136892	  0.757331	 -0.591173
 -1.097099	  0.779622	 -0.602065
 -1.056761	  0.803906	 -0.612898
 -1.014618	  0.827938	 -0.621903
 -0.972496	  0.852326	 -0.629180
 -0.928518	  0.877708	 -0.635691
 -0.882094	  0.902115	 -0.643625
 -0.836836	  0.923393	 -0.653159
 -0.792888	  0.943421	 -0.663174
 -0.748378	  0.964102	 -0.672716
 -0.703664	  0.987688	 -0.683472
 -0.662319	  1.012743	 -0.694831
 -0.627144	  1.037641	 -0.704640
 -0.600615	  1.060408	 -0.711250
 -0.582249	  1.079821	 -0.714668
 -0.563067	  1.104915	 -0.716404
 -0.533110	  1.153766	 -0.717056
 -0.504579	  1.220249	 -0.722453
 -0.485913	  1.310061	 -0.742938
 -0.474124	  1.379387	 -0.744020
 -0.454137	  1.432422	 -0.736840
 -0.402763	  1.511629	 -0.717715
 -0.328193	  1.570057	 -0.681270
 -0.244177	  1.607584	 -0.623924
 -0.142250	  1.658406	 -0.623738
 -0.060481	  1.684949	 -0.669270
 -0.002402	  1.691977	 -0.709969
  0.037136	  1.690304	 -0.737774
  0.103455	  1.683316	 -0.776346
  0.217281	  1.649834	 -0.891302
  0.282786	  1.614878	 -1.062181
  0.297459	  1.576194	 -1.172068
  0.280745	  1.534598	 -1.257870
  0.269026	  1.519276	 -1.298660
  0.277967	  1.519791	 -1.325333
  0.329588	  1.539705	 -1.342357
  0.409278	  1.562880	 -1.314181
  0.498030	  1.581891	 -1.204266
  0.561777	  1.583208	 -1.078644
  0.594340	  1.580611	 -1.019370
  0.631193	  1.587070	 -1.000218
  0.676394	  1.601373	 -1.004636
  0.721246	  1.618767	 -1.016800
  0.766426	  1.640865	 -1.030123
  0.810302	  1.666143	 -1.040641
  0.851867	  1.692731	 -1.049091
  0.892511	  1.720256	 -1.057424
  0.932741	  1.747331	 -1.066039
  0.973968	  1.774130	 -1.075586
  1.014894	  1.799230	 -1.086234
  1.058713	  1.823363	 -1.097787
  1.103800	  1.844002	 -1.105680
  1.150588	  1.862849	 -1.111170
  1.197264	  1.878601	 -1.114836
  1.241052	  1.898046	 -1.120161
  1.285864	  1.919906	 -1.129466
  1.329170	  1.936430	 -1.146107
  1.371921	  1.959552	 -1.153448
  1.415032	  1.984725	 -1.161388
  1.461887	  2.004487	 -1.166301
  1.508602	  2.023908	 -1.175925
  1.553287	  2.043803	 -1.189778
  1.594677	  2.070141	 -1.201780
  1.641611	  2.086302	 -1.206467
  1.683275	  2.108609	 -1.216114
  1.722320	  2.127031	 -1.228557
  1.739543	  2.148301	 -1.240843
