 -1.868597	 -2.273554	  0.721250
 -1.850096	 -2.251043	  0.714109
 -1.806033	 -2.224805	  0.721524
 -1.760340	 -2.198775	  0.716885
 -1.716519	 -2.169704	  0.719049
 -1.674138	 -2.140838	  0.724972
 -1.632717	 -2.113749	  0.732163
 -1.591903	 -2.088325	  0.739943
 -1.549828	 -2.062937	  0.749438
 -1.507973	 -2.037165	  0.761379
 -1.466045	 -2.011454	  0.775266
 -1.424569	 -1.986284	  0.789876
 -1.383807	 -1.961437	  0.804180
 -1.343932	 -1.936475	  0.817261
 -1.303667	 -1.910751	  0.828346
 -1.261245	 -1.884476	  0.836499
 -1.218384	 -1.860280	  0.840120
 -1.174482	 -1.837419	  0.839684
 -1.129735	 -1.814187	  0.837133
 -1.083759	 -1.790185	  0.834629
 -1.038706	 -1.763976	  0.838678
 -0.998822	 -1.736048	  0.850202
 -0.961834	 -1.706464	  0.866800
 -0.926257	 -1.676764	  0.885717
 -0.891094	 -1.647693	  0.904997
 -0.855649	 -1.619252	  0.923807
 -0.818427	 -1.590952	  0.941165
 -0.778102	 -1.562264	  0.956663
 -0.735738	 -1.533849	  0.969442
 -0.691493	 -1.505702	  0.980106
 -0.646723	 -1.478750	  0.989762
 -0.603795	 -1.455604	  0.998458
 -0.564140	 -1.436059	  1.007787
 -0.528778	 -1.418793	  1.019806
 -0.495536	 -1.400002	  1.037423
 -0.455684	 -1.370787	  1.069834
 -0.408569	 -1.320265	  1.133254
 -0.381104	 -1.247986	  1.213427
 -0.371163	 -1.190053	  1.265207
 -0.357224	 -1.168534	  1.282540
 -0.323820	 -1.148837	  1.295581
 -0.271241	 -1.123756	  1.305972
 -0.223489	 -1.094513	  1.308120
 -0.189676	 -1.073299	  1.304632
 -0.160482	 -1.059910	  1.296126
 -0.122805	 -1.051166	  1.279919
 -0.070898	 -1.049761	  1.249836
  0.003967	 -1.056946	  1.199986
  0.093022	 -1.056648	  1.139343
  0.170158	 -1.040431	  1.097461
  0.227784	 -1.021856	  1.078810
  0.276375	 -1.003745	  1.072248
  0.322870	 -0.984045	  1.074124
  0.368816	 -0.962595	  1.080402
  0.414251	 -0.940087	  1.087780
  0.459212	 -0.915679	  1.095350
  0.501977	 -0.889872	  1.102408
  0.543047	 -0.863201	  1.108630
  0.584001	 -0.836393	  1.114438
  0.624789	 -0.809736	  1.120195
  0.666720	 -0.782650	  1.126581
  0.707476	 -0.757262	  1.134110
  0.749418	 -0.734271	  1.143733
  0.792265	 -0.711107	  1.154246
  0.834238	 -0.688388	  1.163706
  0.876436	 -0.665570	  1.172335
  0.921423	 -0.641114	  1.176795
  0.965671	 -0.611806	  1.179090
  1.006782	 -0.582244	  1.180800
  1.045459	 -0.551642	  1.182827
  1.085140	 -0.521144	  1.183374
  1.127677	 -0.492637	  1.185105
  1.171320	 -0.466469	  1.189683
  1.215786	 -0.443660	  1.197309
  1.260078	 -0.422806	  1.208476
  1.302316	 -0.400964	  1.223524
  1.341868	 -0.378935	  1.242354
  1.378833	 -0.356512	  1.265123
  1.414936	 -0.330986	  1.290587
  1.450138	 -0.300553	  1.315975
  1.485715	 -0.266600	  1.337754
  1.521958	 -0.230022	  1.354201
  1.558942	 -0.192386	  1.365345
  1.596558	 -0.156649	  1.372395
  1.634902	 -0.123607	  1.376251
  1.675534	 -0.092992	  1.377945
  1.719112	 -0.064720	  1.376934
  1.763340	 -0.038495	  1.372347
  1.807237	 -0.013960	  1.368166
  1.850556	  0.009159	  1.366883
  1.893439	  0.032745	  1.370048
  1.936650	  0.056559	  1.377531
  1.980379	  0.078387	  1.387490
  2.024783	  0.098362	  1.398582
  2.069594	  0.118370	  1.408675
  2.114797	  0.138350	  1.417355
  2.160915	  0.158149	  1.424452
  2.207831	  0.177101	  1.429322
  2.254413	  0.194113	  1.431520
  2.301072	  0.210841	  1.432411
  2.347362	  0.229514	  1.433399
  2.393596	  0.251932	  1.435771
  2.437165	  0.278174	  1.439725
  2.477347	  0.308121	  1.444248
  2.514698	  0.340736	  1.450136
  2.548290	  0.374207	  1.459872
  2.588921	  0.394120	  1.463611
  2.614810	  0.398061	  1.478248
