 -1.824477	 -1.379951	  1.041831
 -1.808733	 -1.380409	  1.035836
 -1.805793	 -1.380494	  1.034716
 -1.787265	 -1.381086	  1.027210
 -1.768893	 -1.381879	  1.019598
 -1.751045	 -1.384450	  1.011677
 -1.731996	 -1.387177	  1.002965
 -1.714516	 -1.388769	  0.995091
 -1.697292	 -1.389482	  0.987029
 -1.676046	 -1.390470	  0.977671
 -1.658542	 -1.389404	  0.970510
 -1.641493	 -1.387083	  0.963141
 -1.623451	 -1.384889	  0.955140
 -1.605977	 -1.383293	  0.946008
 -1.585921	 -1.385442	  0.934998
 -1.568141	 -1.385907	  0.928142
 -1.549942	 -1.380843	  0.921603
 -1.532579	 -1.375897	  0.910348
 -1.516218	 -1.376356	  0.899152
 -1.499485	 -1.378354	  0.891272
 -1.480241	 -1.377659	  0.882898
 -1.461966	 -1.375569	  0.874299
 -1.444165	 -1.372366	  0.865864
 -1.426294	 -1.369458	  0.858246
 -1.408672	 -1.365769	  0.852315
 -1.388597	 -1.358997	  0.844525
 -1.371539	 -1.353719	  0.834577
 -1.354564	 -1.354002	  0.826506
 -1.335889	 -1.350641	  0.817794
 -1.320600	 -1.342537	  0.807654
 -1.305361	 -1.329771	  0.798615
 -1.289156	 -1.315255	  0.792396
 -1.272516	 -1.314108	  0.785765
 -1.252528	 -1.313453	  0.777810
 -1.233189	 -1.307433	  0.768600
 -1.219365	 -1.295875	  0.761476
 -1.206006	 -1.282975	  0.752565
 -1.189592	 -1.274134	  0.744553
 -1.171618	 -1.270254	  0.738964
 -1.152282	 -1.263549	  0.731385
 -1.133419	 -1.249405	  0.724356
 -1.124157	 -1.236138	  0.720217
 -1.107289	 -1.227574	  0.710244
 -1.091407	 -1.226293	  0.697897
 -1.072461	 -1.221178	  0.687978
 -1.058641	 -1.210977	  0.676812
 -1.045157	 -1.203991	  0.665093
 -1.028362	 -1.199208	  0.654708
 -1.010194	 -1.191403	  0.647591
 -0.995670	 -1.179045	  0.639284
 -0.983852	 -1.170234	  0.628145
 -0.969350	 -1.159948	  0.617768
 -0.953854	 -1.149456	  0.611188
 -0.935882	 -1.137894	  0.607532
 -0.917400	 -1.128061	  0.606556
 -0.900031	 -1.120818	  0.601764
 -0.885098	 -1.111626	  0.595316
 -0.866340	 -1.102179	  0.589564
 -0.849165	 -1.091641	  0.590247
 -0.833968	 -1.080314	  0.591752
 -0.816568	 -1.069799	  0.592790
 -0.799467	 -1.058725	  0.594973
 -0.784527	 -1.046390	  0.599005
 -0.767260	 -1.035930	  0.599873
 -0.749584	 -1.027117	  0.600089
 -0.732899	 -1.015989	  0.604609
 -0.716230	 -1.005023	  0.606976
 -0.697934	 -0.997046	  0.604626
 -0.680540	 -0.989233	  0.604860
 -0.657239	 -0.983386	  0.607615
 -0.640774	 -0.978759	  0.607752
 -0.623102	 -0.970854	  0.606326
 -0.601591	 -0.964407	  0.606288
 -0.583071	 -0.961676	  0.608450
 -0.563792	 -0.955363	  0.606582
 -0.544426	 -0.952948	  0.600825
 -0.525293	 -0.951868	  0.594820
 -0.506273	 -0.948298	  0.589146
 -0.489308	 -0.945689	  0.582194
 -0.466464	 -0.945267	  0.577608
 -0.447106	 -0.944983	  0.572792
 -0.431019	 -0.947420	  0.565612
 -0.411875	 -0.952269	  0.561033
 -0.392126	 -0.956563	  0.558176
 -0.375239	 -0.958577	  0.551109
 -0.356788	 -0.964707	  0.539613
 -0.338925	 -0.970302	  0.534265
 -0.319977	 -0.970075	  0.528862
 -0.304925	 -0.975727	  0.516965
 -0.285958	 -0.982206	  0.510206
 -0.267319	 -0.989041	  0.504841
 -0.252565	 -0.993643	  0.494227
 -0.236812	 -0.997501	  0.483258
 -0.213875	 -1.003928	  0.474887
 -0.202000	 -1.014189	  0.467670
 -0.188769	 -1.021985	  0.454576
 -0.174725	 -1.027629	  0.441866
 -0.156758	 -1.036158	  0.432341
 -0.143979	 -1.042906	  0.420841
 -0.131208	 -1.051057	  0.406105
 -0.117824	 -1.060929	  0.394352
 -0.099573	 -1.075047	  0.389404
 -0.082993	 -1.081496	  0.382159
 -0.067477	 -1.086186	  0.370545
 -0.053241	 -1.091028	  0.357448
 -0.036783	 -1.096169	  0.345413
 -0.018147	 -1.096088	  0.335473
 -0.003417	 -1.099713	  0.324625
  0.010663	 -1.105128	  0.310575
  0.027170	 -1.107521	  0.295674
  0.043704	 -1.109963	  0.288071
  0.061868	 -1.114225	  0.280299
  0.081137	 -1.115271	  0.268605
  0.095154	 -1.112630	  0.251837
  0.106989	 -1.113469	  0.241040
  0.124387	 -1.117614	  0.228737
  0.141722	 -1.120117	  0.217995
  0.158915	 -1.120307	  0.207792
  0.175778	 -1.120327	  0.196701
  0.192752	 -1.120461	  0.186066
  0.209445	 -1.120880	  0.174954
  0.225924	 -1.121427	  0.163625
  0.242474	 -1.121613	  0.152397
  0.259088	 -1.121468	  0.141264
  0.275825	 -1.120996	  0.130326
  0.292813	 -1.119801	  0.119839
  0.309919	 -1.118163	  0.109609
  0.327375	 -1.114820	  0.100436
  0.344831	 -1.111465	  0.091271
  0.361891	 -1.106409	  0.082139
  0.378500	 -1.099903	  0.073095
  0.395108	 -1.093391	  0.064052
  0.411713	 -1.086877	  0.055006
  0.427624	 -1.079833	  0.045151
  0.440516	 -1.071047	  0.032640
  0.453396	 -1.062255	  0.020118
  0.466275	 -1.053463	  0.007595
  0.479155	 -1.044671	 -0.004929
  0.491774	 -1.035880	 -0.017710
  0.500836	 -1.027347	 -0.033362
  0.509882	 -1.018814	 -0.049026
  0.518929	 -1.010282	 -0.064690
  0.527970	 -1.001759	 -0.080362
  0.535553	 -0.994528	 -0.097395
  0.542620	 -0.987401	 -0.114610
  0.548707	 -0.979927	 -0.132187
  0.554324	 -0.973444	 -0.149330
  0.563302	 -0.967157	 -0.167934
  0.572422	 -0.963812	 -0.185220
  0.582947	 -0.963475	 -0.202803
  0.590458	 -0.959045	 -0.217662
  0.595893	 -0.953241	 -0.239834
  0.608138	 -0.952336	 -0.259476
  0.621471	 -0.955503	 -0.271124
  0.626630	 -0.952856	 -0.289995
  0.637799	 -0.949911	 -0.309798
  0.654603	 -0.950186	 -0.321417
  0.660884	 -0.949937	 -0.339503
  0.670898	 -0.949428	 -0.360776
  0.686962	 -0.950043	 -0.371459
  0.695597	 -0.949438	 -0.389059
  0.708110	 -0.947808	 -0.406966
  0.723985	 -0.948546	 -0.420945
  0.737701	 -0.947822	 -0.429870
  0.753211	 -0.946536	 -0.443609
  0.771158	 -0.948460	 -0.457137
  0.785222	 -0.945812	 -0.469784
  0.802143	 -0.944019	 -0.480264
  0.821364	 -0.947664	 -0.487844
  0.841563	 -0.949986	 -0.492195
  0.857908	 -0.947481	 -0.500559
  0.875359	 -0.948889	 -0.504299
  0.898727	 -0.952831	 -0.508429
  0.915084	 -0.956662	 -0.511635
  0.933956	 -0.961079	 -0.525598
  0.950479	 -0.964080	 -0.537105
  0.964634	 -0.966714	 -0.542869
  0.983687	 -0.969570	 -0.546408
  1.003889	 -0.972069	 -0.549362
  1.024222	 -0.975190	 -0.552237
  1.042635	 -0.982365	 -0.556205
  1.060200	 -0.991235	 -0.561493
  1.077911	 -0.997653	 -0.567786
  1.096390	 -1.002728	 -0.573643
  1.113998	 -1.011401	 -0.580474
  1.130408	 -1.021666	 -0.585610
  1.147588	 -1.030797	 -0.587307
  1.166063	 -1.038892	 -0.589846
  1.183218	 -1.049558	 -0.592889
  1.198212	 -1.062164	 -0.601360
  1.214440	 -1.067866	 -0.609385
  1.232716	 -1.073430	 -0.614486
  1.252259	 -1.083625	 -0.616161
  1.269327	 -1.097652	 -0.619287
  1.283123	 -1.106936	 -0.628251
  1.300667	 -1.110542	 -0.636941
  1.320451	 -1.116989	 -0.640871
  1.337764	 -1.128391	 -0.644630
  1.353827	 -1.136096	 -0.654467
  1.370637	 -1.138327	 -0.665129
  1.390879	 -1.138434	 -0.669682
  1.410946	 -1.144191	 -0.675432
  1.426997	 -1.147185	 -0.684013
  1.446139	 -1.147191	 -0.690583
  1.465553	 -1.146521	 -0.693258
  1.485716	 -1.143195	 -0.697262
  1.506682	 -1.141039	 -0.706397
  1.525331	 -1.145139	 -0.713043
  1.545449	 -1.145467	 -0.712303
  1.564533	 -1.142416	 -0.707067
  1.585488	 -1.137430	 -0.701899
  1.602915	 -1.130143	 -0.694758
  1.620687	 -1.122361	 -0.687990
  1.637535	 -1.114055	 -0.680793
  1.653776	 -1.105150	 -0.673215
  1.670002	 -1.096243	 -0.665641
  1.685500	 -1.086151	 -0.658027
  1.700446	 -1.075262	 -0.650408
  1.715390	 -1.064371	 -0.642789
  1.730334	 -1.053479	 -0.635170
  1.745287	 -1.042520	 -0.627669
  1.760285	 -1.030296	 -0.622609
  1.775283	 -1.018066	 -0.617558
  1.790281	 -1.005837	 -0.612508
  1.805279	 -0.993608	 -0.607458
  1.820277	 -0.981378	 -0.602408
  1.835505	 -0.969008	 -0.598589
  1.850443	 -0.956098	 -0.598353
  1.864523	 -0.942336	 -0.599662
  1.881423	 -0.928566	 -0.600690
  1.897728	 -0.917216	 -0.601279
  1.914294	 -0.906323	 -0.598622
  1.928761	 -0.895277	 -0.595015
  1.945445	 -0.883085	 -0.596771
  1.961679	 -0.871565	 -0.599541
  1.977838	 -0.860114	 -0.602325
  1.993997	 -0.848662	 -0.605108
  2.010397	 -0.837799	 -0.608713
  2.027174	 -0.828336	 -0.614098
  2.043951	 -0.818876	 -0.619486
  2.060729	 -0.809415	 -0.624873
  2.077533	 -0.800072	 -0.630376
  2.094611	 -0.792568	 -0.637588
  2.111690	 -0.785072	 -0.644807
  2.128769	 -0.777578	 -0.652028
  2.145903	 -0.770762	 -0.659771
  2.163062	 -0.764950	 -0.668244
  2.180221	 -0.759143	 -0.676721
  2.197378	 -0.753555	 -0.685345
  2.214485	 -0.749099	 -0.694699
  2.231592	 -0.744648	 -0.704055
  2.248691	 -0.740386	 -0.713513
  2.275445	 -0.735268	 -0.729198
  2.282738	 -0.733874	 -0.733473
