 -0.105333	 -2.427343	  0.880566
 -0.092528	 -2.449699	  0.901297
 -0.100707	 -2.436354	  0.888847
 -0.109341	 -2.423205	  0.876499
 -0.118468	 -2.410378	  0.864165
 -0.128143	 -2.397958	  0.851830
 -0.138196	 -2.386059	  0.839291
 -0.148263	 -2.374817	  0.826250
 -0.158499	 -2.364945	  0.812160
 -0.169303	 -2.355774	  0.798469
 -0.178325	 -2.349505	  0.783528
 -0.185776	 -2.346303	  0.764415
 -0.204635	 -2.347761	  0.748173
 -0.225672	 -2.340720	  0.738208
 -0.241647	 -2.332331	  0.730277
 -0.252829	 -2.325167	  0.722085
 -0.272497	 -2.309338	  0.705419
 -0.285228	 -2.298318	  0.697019
 -0.295817	 -2.291193	  0.693009
 -0.313550	 -2.281236	  0.681212
 -0.333794	 -2.271436	  0.670057
 -0.343660	 -2.265081	  0.663771
 -0.357798	 -2.256227	  0.652495
 -0.369083	 -2.246608	  0.642867
 -0.386851	 -2.230937	  0.630763
 -0.401505	 -2.221431	  0.615694
 -0.418149	 -2.218243	  0.606860
 -0.438416	 -2.215445	  0.597880
 -0.455885	 -2.208561	  0.594313
 -0.472855	 -2.196411	  0.591442
 -0.488502	 -2.181642	  0.582420
 -0.504270	 -2.170986	  0.574467
 -0.518728	 -2.164844	  0.570313
 -0.536947	 -2.158555	  0.566687
 -0.565295	 -2.141059	  0.561970
 -0.576121	 -2.127631	  0.562128
 -0.584607	 -2.115145	  0.566009
 -0.603631	 -2.092736	  0.573652
 -0.619027	 -2.068740	  0.575015
 -0.626824	 -2.050156	  0.573793
 -0.629957	 -2.041873	  0.574644
 -0.640314	 -2.024481	  0.568459
 -0.652025	 -2.004188	  0.559984
 -0.661648	 -1.985477	  0.554024
 -0.668786	 -1.968208	  0.554201
 -0.676088	 -1.948357	  0.555582
 -0.685333	 -1.927520	  0.557752
 -0.692064	 -1.910544	  0.559595
 -0.699242	 -1.894547	  0.559139
 -0.709145	 -1.873339	  0.556189
 -0.714333	 -1.854612	  0.555245
 -0.718749	 -1.840924	  0.555244
 -0.722647	 -1.821144	  0.555247
 -0.726742	 -1.796308	  0.558185
 -0.730533	 -1.781194	  0.559462
 -0.738868	 -1.765280	  0.561388
 -0.748656	 -1.745169	  0.566888
 -0.763938	 -1.718476	  0.567485
 -0.768488	 -1.710962	  0.564978
 -0.779089	 -1.690621	  0.560402
 -0.783373	 -1.670645	  0.560740
 -0.793726	 -1.648649	  0.560569
 -0.799211	 -1.636852	  0.560251
 -0.804919	 -1.613694	  0.563547
 -0.812257	 -1.594941	  0.562733
 -0.820794	 -1.575472	  0.559750
 -0.823354	 -1.560940	  0.559168
 -0.825512	 -1.539028	  0.561919
 -0.831607	 -1.516877	  0.563281
 -0.837759	 -1.501730	  0.562360
 -0.843076	 -1.473505	  0.565135
 -0.845272	 -1.452465	  0.568605
 -0.846824	 -1.436791	  0.568616
 -0.845912	 -1.415432	  0.569255
 -0.844361	 -1.397595	  0.569137
 -0.844862	 -1.378675	  0.567048
 -0.845772	 -1.359116	  0.565781
 -0.847900	 -1.342014	  0.566045
 -0.850623	 -1.325039	  0.560988
 -0.856213	 -1.306187	  0.547980
 -0.860286	 -1.286769	  0.539377
 -0.864580	 -1.266868	  0.533286
 -0.869762	 -1.247109	  0.528707
 -0.873660	 -1.233944	  0.525053
 -0.881620	 -1.217225	  0.514526
 -0.892060	 -1.210762	  0.503332
 -0.896708	 -1.199628	  0.488669
 -0.894582	 -1.184972	  0.479232
 -0.902814	 -1.171996	  0.466279
 -0.899908	 -1.157012	  0.463802
 -0.913273	 -1.142770	  0.455009
 -0.917511	 -1.131952	  0.450701
 -0.918473	 -1.113090	  0.442201
 -0.934392	 -1.097758	  0.427487
 -0.943950	 -1.089527	  0.417051
 -0.955470	 -1.080664	  0.401249
 -0.966450	 -1.073354	  0.390383
 -0.978671	 -1.063039	  0.379116
 -0.993478	 -1.047781	  0.357856
 -0.997976	 -1.040376	  0.343547
 -1.002415	 -1.031557	  0.324031
 -1.008175	 -1.023195	  0.307222
 -1.015390	 -1.014775	  0.293456
 -1.023987	 -1.004155	  0.272087
 -1.030775	 -0.996595	  0.255124
 -1.035740	 -0.989870	  0.244298
 -1.047841	 -0.972865	  0.222575
 -1.054829	 -0.963762	  0.212785
 -1.060500	 -0.952916	  0.203206
 -1.070352	 -0.939058	  0.184640
 -1.075187	 -0.925197	  0.165522
 -1.076605	 -0.913674	  0.146222
 -1.075467	 -0.905472	  0.133623
 -1.068992	 -0.892271	  0.112077
 -1.067352	 -0.880848	  0.096559
 -1.069948	 -0.869259	  0.081319
 -1.074102	 -0.855842	  0.066747
 -1.076575	 -0.840305	  0.053932
 -1.076599	 -0.822331	  0.044754
 -1.078000	 -0.803853	  0.035951
 -1.084779	 -0.785840	  0.023860
 -1.089767	 -0.768718	  0.010852
 -1.087119	 -0.752891	  0.000760
 -1.081192	 -0.737510	 -0.008202
 -1.073689	 -0.719767	 -0.016138
 -1.064953	 -0.702030	 -0.023182
 -1.055939	 -0.684035	 -0.032502
 -1.047307	 -0.662272	 -0.041479
 -1.043521	 -0.649157	 -0.045510
 -1.042229	 -0.630520	 -0.052377
 -1.043876	 -0.607368	 -0.061610
 -1.042411	 -0.588081	 -0.067759
 -1.038821	 -0.570212	 -0.072242
 -1.034415	 -0.550535	 -0.078819
 -1.032131	 -0.537161	 -0.086434
 -1.030464	 -0.517783	 -0.097555
 -1.031072	 -0.495928	 -0.102750
 -1.029283	 -0.475331	 -0.103854
 -1.025221	 -0.456187	 -0.105874
 -1.020826	 -0.434429	 -0.109031
 -1.019069	 -0.416600	 -0.111220
 -1.018520	 -0.397761	 -0.114354
 -1.019724	 -0.378257	 -0.119074
 -1.021756	 -0.358327	 -0.123951
 -1.022860	 -0.338798	 -0.128850
 -1.022430	 -0.320202	 -0.133985
 -1.021180	 -0.301706	 -0.139530
 -1.020902	 -0.282715	 -0.145237
 -1.022579	 -0.263416	 -0.149896
 -1.025152	 -0.244277	 -0.155685
 -1.027257	 -0.225774	 -0.162528
 -1.029627	 -0.209046	 -0.172211
 -1.031731	 -0.195494	 -0.185882
 -1.034192	 -0.181957	 -0.200878
 -1.037008	 -0.163861	 -0.212344
 -1.038119	 -0.148037	 -0.218176
 -1.044015	 -0.130723	 -0.226588
 -1.052518	 -0.114383	 -0.241593
 -1.067857	 -0.096789	 -0.251361
 -1.080697	 -0.086019	 -0.258462
 -1.093017	 -0.077338	 -0.266595
 -1.109841	 -0.065102	 -0.274201
 -1.133443	 -0.054701	 -0.285462
 -1.144125	 -0.046548	 -0.294567
 -1.152548	 -0.039577	 -0.303225
 -1.167058	 -0.027208	 -0.314512
 -1.173655	 -0.015607	 -0.325161
 -1.181067	 -0.003302	 -0.337689
 -1.201760	  0.008780	 -0.356454
 -1.210104	  0.014460	 -0.370404
 -1.216767	  0.021765	 -0.383263
 -1.234396	  0.031403	 -0.397909
 -1.246626	  0.035889	 -0.405807
 -1.260293	  0.038863	 -0.412955
 -1.277246	  0.038895	 -0.416870
 -1.298711	  0.036646	 -0.421960
 -1.321096	  0.038460	 -0.435495
 -1.334973	  0.040899	 -0.448543
 -1.351044	  0.038818	 -0.459760
 -1.365179	  0.043080	 -0.474289
 -1.374966	  0.045373	 -0.484614
 -1.394973	  0.046178	 -0.498072
 -1.415340	  0.050738	 -0.510909
 -1.429851	  0.050832	 -0.521345
 -1.442031	  0.047339	 -0.528933
 -1.458158	  0.043863	 -0.539426
 -1.477865	  0.042076	 -0.555900
 -1.492912	  0.043235	 -0.568702
 -1.507038	  0.046839	 -0.579554
 -1.518850	  0.049245	 -0.587499
 -1.536967	  0.048987	 -0.598695
 -1.555831	  0.048039	 -0.611581
 -1.578315	  0.046788	 -0.625787
 -1.593932	  0.048578	 -0.635231
 -1.607838	  0.053994	 -0.645362
 -1.621141	  0.060261	 -0.657960
 -1.633688	  0.065371	 -0.673274
 -1.647149	  0.064880	 -0.691383
 -1.659407	  0.065031	 -0.706092
 -1.674254	  0.064499	 -0.722041
 -1.690611	  0.068301	 -0.739211
 -1.700377	  0.069546	 -0.748858
 -1.715963	  0.074555	 -0.761711
 -1.736433	  0.083060	 -0.769637
 -1.754351	  0.091457	 -0.774428
 -1.774871	  0.101369	 -0.777470
 -1.795225	  0.109639	 -0.781077
 -1.809778	  0.116177	 -0.785234
 -1.827929	  0.125056	 -0.789283
 -1.851272	  0.136599	 -0.798475
 -1.865724	  0.145271	 -0.809938
 -1.874951	  0.153093	 -0.822476
 -1.883834	  0.161058	 -0.835565
 -1.896993	  0.175438	 -0.849325
 -1.909216	  0.187959	 -0.860041
 -1.922854	  0.199945	 -0.869138
 -1.936140	  0.213030	 -0.877763
 -1.948166	  0.227207	 -0.885628
 -1.960039	  0.241234	 -0.893457
 -1.971825	  0.255382	 -0.901862
 -1.982536	  0.270227	 -0.910897
 -1.991990	  0.285475	 -0.919840
 -2.001978	  0.300061	 -0.929218
 -2.011210	  0.315007	 -0.939224
 -2.019162	  0.330382	 -0.949652
 -2.026705	  0.345753	 -0.960016
 -2.033919	  0.360682	 -0.970183
 -2.045168	  0.371987	 -0.978940
 -2.050525	  0.388722	 -0.990087
 -2.053151	  0.410738	 -1.006457
 -2.058960	  0.423972	 -1.016397
 -2.066694	  0.436886	 -1.026384
 -2.075725	  0.450772	 -1.038091
 -2.084493	  0.465239	 -1.049332
 -2.093374	  0.478700	 -1.060076
 -2.101480	  0.492769	 -1.071499
 -2.110859	  0.506812	 -1.083256
 -2.121145	  0.520715	 -1.093040
 -2.130711	  0.533716	 -1.102491
 -2.142608	  0.547736	 -1.114454
 -2.158951	  0.560733	 -1.126023
 -2.169513	  0.566798	 -1.131664
 -2.179165	  0.582626	 -1.141983
 -2.185159	  0.600324	 -1.153573
 -2.196135	  0.613751	 -1.164681
 -2.206820	  0.627182	 -1.175607
 -2.218398	  0.643432	 -1.187821
 -2.231829	  0.668605	 -1.202859
 -2.242841	  0.681453	 -1.213520
