 0.0 0.0 0.0 0
 0.43341726371360734 -0.43976799020365054 0.4934810363759864 1000
 -0.7440379653827465 -0.6042971936262456 0.06119959041193841 1000
 0.2012271511961911 0.33462936444577496 -0.6920844743304394 1000
 -0.042701118920797476 0.711341138827178 -0.33744664138191527 1000
 -0.4973783124222543 -0.5693752605498067 0.3857937181936775 1000
 0.8468963583513011 0.11921641486948908 0.44938049796479207 1000
 -0.14201225417770943 0.3434622845899801 -0.674011594428881 1000
 -0.011408202681613855 0.9888740944162107 0.5138259506864863 1000
 0.0 0.0 0.0 0
 -0.6210024425699735 0.25486160859000595 0.7903028377572622 1000
 -0.8507991294398655 0.45052909623691195 -0.00856309827589119 1000
 0.9180848842241768 0.39091051429356144 0.040514636419419964 1000
 -0.956332900925795 -0.011718825400457558 -0.2011639487969995 1000
 -0.8315586545616909 0.09942158864342027 0.572278415232019 1000
 0.9550369969112411 -0.28883252992105835 -0.23098555676281368 1000
 -0.15788808384020137 -0.48414819668748016 -0.9351850094327929 1000
 0.06056338625761973 -0.9904557882658346 -0.2824645293100263 1000
 0.0 0.0 0.0 0
 0.4928508556354586 -0.37426654805412046 -0.868524358850859 1000
 0.7571349679531054 -0.4946553744699586 0.13473808189957093 1000
