  0.154963	 -0.680217	  2.378680
  0.151022	 -0.706474	  2.409012
  0.157842	 -0.693284	  2.395302
  0.161707	 -0.679761	  2.381117
  0.166762	 -0.666057	  2.368472
  0.176827	 -0.652311	  2.359636
  0.191287	 -0.639637	  2.353913
  0.206058	 -0.627254	  2.348566
  0.220884	 -0.614903	  2.343431
  0.236152	 -0.602607	  2.341236
  0.251795	 -0.590133	  2.344577
  0.267797	 -0.578057	  2.347952
  0.285190	 -0.568447	  2.348715
  0.302158	 -0.558495	  2.349738
  0.317068	 -0.547057	  2.356244
  0.330314	 -0.535055	  2.365134
  0.343169	 -0.522713	  2.374228
  0.355540	 -0.510214	  2.383555
  0.362218	 -0.496025	  2.395680
  0.365001	 -0.482360	  2.409213
  0.363913	 -0.473505	  2.425766
  0.353006	 -0.466867	  2.440758
  0.340639	 -0.462224	  2.449958
  0.324882	 -0.459671	  2.460971
  0.304790	 -0.449877	  2.473634
  0.295030	 -0.435737	  2.478726
  0.279693	 -0.422935	  2.482163
  0.261773	 -0.411607	  2.483311
  0.244158	 -0.402388	  2.487294
  0.225878	 -0.395547	  2.492282
  0.207656	 -0.388949	  2.497264
  0.189918	 -0.380422	  2.500732
  0.172881	 -0.370128	  2.502635
  0.155892	 -0.359729	  2.504424
  0.138903	 -0.349328	  2.506211
  0.121913	 -0.338928	  2.507999
  0.104924	 -0.328527	  2.509787
  0.087935	 -0.318127	  2.511574
  0.070945	 -0.307727	  2.513362
  0.053956	 -0.297326	  2.515149
  0.036967	 -0.286926	  2.516937
  0.019978	 -0.276525	  2.518724
  0.003005	 -0.266128	  2.520499
 -0.013567	 -0.255469	  2.521466
 -0.025207	 -0.241966	  2.513069
 -0.034644	 -0.228237	  2.502064
 -0.043925	 -0.214497	  2.490882
 -0.053204	 -0.200757	  2.479697
 -0.062483	 -0.187017	  2.468512
 -0.071762	 -0.173276	  2.457327
 -0.081041	 -0.159536	  2.446142
 -0.090319	 -0.145796	  2.434957
 -0.099598	 -0.132055	  2.423772
 -0.108877	 -0.118315	  2.412587
 -0.118156	 -0.104575	  2.401402
 -0.127435	 -0.090834	  2.390217
 -0.136714	 -0.077094	  2.379032
 -0.145993	 -0.063354	  2.367847
 -0.155272	 -0.049613	  2.356662
 -0.164531	 -0.035889	  2.345480
 -0.172887	 -0.022479	  2.333810
 -0.170605	 -0.013034	  2.316783
 -0.164526	 -0.005871	  2.299186
 -0.158181	  0.001125	  2.281560
 -0.151838	  0.008110	  2.263957
 -0.145507	  0.014611	  2.246509
 -0.137665	  0.016290	  2.229121
 -0.123931	  0.014622	  2.213093
 -0.111410	  0.025718	  2.192604
 -0.110631	  0.039908	  2.173499
 -0.113366	  0.048816	  2.159354
 -0.117675	  0.057558	  2.138672
 -0.114222	  0.067711	  2.116702
 -0.108056	  0.075130	  2.102881
 -0.101432	  0.084354	  2.088669
 -0.090553	  0.094744	  2.071552
 -0.074267	  0.101752	  2.050670
 -0.066724	  0.100489	  2.034589
 -0.061008	  0.097687	  2.015306
 -0.057917	  0.099325	  1.993849
 -0.059634	  0.104304	  1.976297
 -0.060309	  0.111551	  1.954376
 -0.056090	  0.121463	  1.933054
 -0.051894	  0.127461	  1.919836
 -0.040453	  0.134412	  1.903471
 -0.029738	  0.139239	  1.882977
 -0.022075	  0.137509	  1.861448
 -0.022047	  0.134380	  1.847969
 -0.024524	  0.124476	  1.828858
 -0.014430	  0.109534	  1.804053
 -0.011573	  0.106428	  1.786011
 -0.010312	  0.110103	  1.775222
 -0.017314	  0.119963	  1.760794
 -0.031868	  0.130705	  1.746888
 -0.047619	  0.136138	  1.736853
 -0.061852	  0.140867	  1.725829
 -0.079543	  0.146877	  1.712556
 -0.093170	  0.160173	  1.703472
 -0.104807	  0.173875	  1.697319
 -0.118662	  0.190049	  1.697926
 -0.134445	  0.208823	  1.699799
 -0.150004	  0.225429	  1.695080
 -0.159663	  0.239630	  1.683310
 -0.165786	  0.255096	  1.674004
 -0.169005	  0.274663	  1.656592
 -0.177346	  0.288345	  1.635750
 -0.187466	  0.300069	  1.622926
 -0.192580	  0.310641	  1.616736
 -0.200854	  0.326853	  1.614867
 -0.207556	  0.349111	  1.602404
 -0.211568	  0.367991	  1.582056
 -0.209064	  0.375640	  1.562800
 -0.206086	  0.383430	  1.545732
 -0.202198	  0.395688	  1.530516
 -0.201441	  0.414254	  1.518057
 -0.200649	  0.432879	  1.505084
 -0.189894	  0.443031	  1.485499
 -0.184148	  0.448623	  1.465756
 -0.179996	  0.454388	  1.443362
 -0.167183	  0.460163	  1.423557
 -0.154858	  0.462127	  1.413093
 -0.136958	  0.467519	  1.399923
 -0.123227	  0.475962	  1.387615
 -0.114593	  0.483815	  1.373781
 -0.102127	  0.492726	  1.352525
 -0.089779	  0.498870	  1.337114
 -0.080644	  0.500083	  1.328659
 -0.063717	  0.500196	  1.315121
 -0.040185	  0.493626	  1.300406
 -0.015903	  0.496039	  1.287184
 -0.009104	  0.498731	  1.283356
  0.011144	  0.510415	  1.276477
  0.032875	  0.518437	  1.261202
  0.043088	  0.522646	  1.249432
  0.053606	  0.526227	  1.240653
  0.074940	  0.521911	  1.230507
  0.096667	  0.516643	  1.219568
  0.115383	  0.514448	  1.209224
  0.135792	  0.512028	  1.197441
  0.150133	  0.514496	  1.186162
  0.161912	  0.524526	  1.171107
  0.171864	  0.535305	  1.156315
  0.184220	  0.549642	  1.136450
  0.188038	  0.558992	  1.126717
  0.192455	  0.573586	  1.109120
  0.195738	  0.584605	  1.089661
  0.200192	  0.591916	  1.071375
  0.201309	  0.604883	  1.052085
  0.201251	  0.617244	  1.034388
  0.194176	  0.631338	  1.024835
  0.185261	  0.650247	  1.016818
  0.183601	  0.669501	  1.006128
  0.187895	  0.684201	  0.993202
  0.193643	  0.698438	  0.978885
  0.197602	  0.711513	  0.964364
  0.202195	  0.723897	  0.953303
  0.210362	  0.740652	  0.939921
  0.217671	  0.754280	  0.917608
  0.217855	  0.758830	  0.902521
  0.217612	  0.764384	  0.881925
  0.220238	  0.777356	  0.860727
  0.224558	  0.790995	  0.849386
  0.231469	  0.805639	  0.842572
  0.240975	  0.821245	  0.830544
  0.248581	  0.832834	  0.813898
  0.256842	  0.839042	  0.789164
  0.261175	  0.842044	  0.768422
  0.259979	  0.845020	  0.753089
  0.256679	  0.850611	  0.736603
  0.254752	  0.863659	  0.712690
  0.256505	  0.874832	  0.694147
  0.254408	  0.887407	  0.675090
  0.251718	  0.898839	  0.662733
  0.253581	  0.909483	  0.654432
  0.265665	  0.928971	  0.643327
  0.279385	  0.950785	  0.629824
  0.287984	  0.963696	  0.617779
  0.294944	  0.973955	  0.604867
  0.305659	  0.987064	  0.577274
  0.308399	  0.996042	  0.562067
  0.311298	  1.002669	  0.551182
  0.308228	  1.015901	  0.529643
  0.304288	  1.027324	  0.513585
  0.302509	  1.040130	  0.499119
  0.296489	  1.057816	  0.481474
  0.289761	  1.071584	  0.468003
  0.286801	  1.078882	  0.460373
  0.278981	  1.090311	  0.445688
  0.273218	  1.103306	  0.429658
  0.272893	  1.117203	  0.410758
  0.272202	  1.127086	  0.393752
  0.272208	  1.136070	  0.374508
  0.269138	  1.143808	  0.355725
  0.267016	  1.151023	  0.338105
  0.264606	  1.160536	  0.320804
  0.258465	  1.172759	  0.303554
  0.251763	  1.180153	  0.291350
  0.245744	  1.195268	  0.271403
  0.240725	  1.213661	  0.255372
  0.225963	  1.224914	  0.237928
  0.210355	  1.220333	  0.221262
  0.200938	  1.213925	  0.211411
  0.190609	  1.218722	  0.197781
  0.174694	  1.219723	  0.180370
  0.149245	  1.217496	  0.158935
  0.136921	  1.214222	  0.149780
  0.127293	  1.211450	  0.142091
  0.111072	  1.207962	  0.125387
  0.100039	  1.203065	  0.105224
  0.089400	  1.199496	  0.089003
  0.077286	  1.201174	  0.073785
  0.062292	  1.206979	  0.057534
  0.050379	  1.212267	  0.047495
  0.038112	  1.218300	  0.033859
  0.025275	  1.223694	  0.014352
  0.011790	  1.225615	 -0.006649
  0.007742	  1.234418	 -0.027811
  0.002779	  1.235118	 -0.038822
  0.003285	  1.233342	 -0.046630
 -0.000493	  1.243147	 -0.062031
 -0.007123	  1.266454	 -0.085380
 -0.005242	  1.272479	 -0.086960
 -0.004540	  1.289531	 -0.100923
  0.004798	  1.306089	 -0.107407
  0.021362	  1.324332	 -0.103757
  0.032271	  1.335095	 -0.097448
  0.041424	  1.347781	 -0.092766
  0.059521	  1.366043	 -0.079913
  0.067362	  1.375167	 -0.072151
  0.078064	  1.384724	 -0.063639
  0.094962	  1.400196	 -0.056148
  0.107962	  1.411315	 -0.053759
  0.126885	  1.422695	 -0.046212
  0.146279	  1.438077	 -0.036636
  0.155730	  1.447012	 -0.031233
  0.164439	  1.455348	 -0.024790
  0.180636	  1.463127	 -0.017447
  0.200307	  1.472228	 -0.021227
  0.220917	  1.477863	 -0.021096
  0.242943	  1.488826	 -0.012511
  0.254253	  1.498785	 -0.002848
  0.266711	  1.513562	  0.007841
  0.280263	  1.531386	  0.007931
  0.293776	  1.549293	  0.003102
  0.306846	  1.564811	 -0.001477
  0.320212	  1.580461	 -0.006212
  0.333458	  1.596405	 -0.011289
  0.345561	  1.611853	 -0.016626
  0.359221	  1.625921	 -0.019842
  0.372338	  1.638289	 -0.023573
  0.386232	  1.649504	 -0.025763
  0.401946	  1.662228	 -0.026724
  0.418805	  1.675614	 -0.028303
  0.434466	  1.686071	 -0.030440
  0.451408	  1.698101	 -0.032096
  0.469181	  1.709849	 -0.034157
  0.487830	  1.722836	 -0.037246
  0.502212	  1.737820	 -0.047073
  0.511221	  1.750764	 -0.067810
  0.514283	  1.763083	 -0.082918
  0.516234	  1.780858	 -0.089371
  0.517427	  1.805693	 -0.095516
  0.526750	  1.823765	 -0.113355
  0.538881	  1.834932	 -0.127967
  0.545674	  1.839224	 -0.134710
  0.560302	  1.851138	 -0.147263
  0.573049	  1.864848	 -0.161116
  0.582344	  1.874606	 -0.175363
  0.591652	  1.887649	 -0.188249
  0.598521	  1.903963	 -0.207299
  0.599969	  1.915079	 -0.226129
  0.597112	  1.923152	 -0.245416
  0.593123	  1.929717	 -0.267422
  0.595064	  1.935766	 -0.280435
  0.602079	  1.943587	 -0.299627
  0.612699	  1.953182	 -0.315202
  0.619826	  1.963898	 -0.330986
  0.617936	  1.974184	 -0.347135
  0.621423	  1.985381	 -0.363357
  0.626562	  1.996606	 -0.380472
  0.630575	  2.007231	 -0.397041
  0.634014	  2.017456	 -0.413725
  0.631282	  2.023572	 -0.432424
  0.627520	  2.028935	 -0.451310
  0.623705	  2.034261	 -0.470206
  0.619886	  2.039583	 -0.489102
  0.615852	  2.044773	 -0.507966
  0.609089	  2.048259	 -0.526366
  0.598096	  2.048689	 -0.542988
  0.586750	  2.048859	 -0.559453
  0.575397	  2.049025	 -0.575917
  0.564042	  2.049187	 -0.592380
  0.552583	  2.049228	 -0.608761
  0.540025	  2.047963	 -0.624262
  0.527315	  2.046544	 -0.639615
  0.513742	  2.044669	 -0.654300
  0.500674	  2.044709	 -0.670093
  0.494114	  2.055211	 -0.688109
  0.491146	  2.065610	 -0.706888
  0.497173	  2.078918	 -0.718543
  0.508311	  2.096373	 -0.725154
  0.524170	  2.114856	 -0.747492
  0.523480	  2.124643	 -0.767146
  0.519085	  2.128390	 -0.779060
  0.505040	  2.139797	 -0.795690
  0.499272	  2.153322	 -0.817797
  0.506669	  2.165416	 -0.836754
  0.516403	  2.178063	 -0.843981
  0.515534	  2.195382	 -0.854364
  0.514620	  2.209737	 -0.871599
  0.518999	  2.222230	 -0.886896
  0.526961	  2.236931	 -0.897746
  0.529735	  2.252065	 -0.911715
  0.528218	  2.263662	 -0.928157
  0.525913	  2.274307	 -0.944943
  0.523738	  2.284924	 -0.961724
  0.523643	  2.295903	 -0.978168
  0.524903	  2.307146	 -0.993841
  0.528829	  2.320056	 -1.008604
