 -2.672784	  0.491366	  1.340033
 -2.646320	  0.486501	  1.326765
 -2.592952	  0.502043	  1.339871
 -2.547855	  0.504785	  1.362370
 -2.496651	  0.513465	  1.371294
 -2.449235	  0.522700	  1.381761
 -2.404637	  0.529140	  1.397308
 -2.355973	  0.535856	  1.414199
 -2.307272	  0.540787	  1.428932
 -2.259070	  0.546557	  1.442912
 -2.214198	  0.553215	  1.457208
 -2.166483	  0.560550	  1.474156
 -2.122414	  0.567114	  1.490419
 -2.075494	  0.573689	  1.507718
 -2.028869	  0.579993	  1.523192
 -1.981240	  0.586911	  1.537474
 -1.935302	  0.594767	  1.550864
 -1.887144	  0.603887	  1.566252
 -1.836541	  0.611421	  1.579482
 -1.790832	  0.613063	  1.592283
 -1.742678	  0.617314	  1.605656
 -1.694975	  0.624696	  1.614445
 -1.645860	  0.634450	  1.626291
 -1.597292	  0.644216	  1.640389
 -1.548035	  0.652484	  1.655840
 -1.501092	  0.660052	  1.670304
 -1.455715	  0.667510	  1.683432
 -1.407436	  0.675840	  1.697012
 -1.360732	  0.683623	  1.710490
 -1.315272	  0.690490	  1.724418
 -1.269793	  0.697829	  1.739465
 -1.222485	  0.705547	  1.754988
 -1.172445	  0.711197	  1.772510
 -1.125572	  0.713763	  1.788956
 -1.078324	  0.718012	  1.805929
 -1.029574	  0.724277	  1.822434
 -0.983657	  0.731769	  1.837658
 -0.936831	  0.740160	  1.852615
 -0.891469	  0.748465	  1.866390
 -0.844924	  0.758093	  1.879328
 -0.796934	  0.768379	  1.890484
 -0.746981	  0.777823	  1.898767
 -0.696578	  0.783780	  1.907231
 -0.650863	  0.786756	  1.915627
 -0.602183	  0.789125	  1.926523
 -0.551845	  0.792161	  1.940235
 -0.503161	  0.797724	  1.955088
 -0.454294	  0.804839	  1.970219
 -0.406864	  0.812542	  1.985194
 -0.359876	  0.820822	  1.999646
 -0.313998	  0.829241	  2.014173
 -0.264431	  0.839134	  2.029195
 -0.217579	  0.848299	  2.042955
 -0.173159	  0.857221	  2.055665
 -0.126974	  0.865209	  2.068182
 -0.078219	  0.872146	  2.081765
 -0.032088	  0.877152	  2.095743
  0.017899	  0.881858	  2.112621
  0.064278	  0.886809	  2.128697
  0.108718	  0.895904	  2.141957
  0.154729	  0.907495	  2.157210
  0.204999	  0.916228	  2.176416
  0.253496	  0.920124	  2.190831
  0.302489	  0.925740	  2.196110
  0.349415	  0.926467	  2.213604
  0.397421	  0.932057	  2.232365
  0.441808	  0.946660	  2.244524
  0.486701	  0.946937	  2.264139
  0.535405	  0.953499	  2.277673
  0.581830	  0.959624	  2.287988
  0.630410	  0.967955	  2.305356
  0.678660	  0.977939	  2.317847
  0.725105	  0.988382	  2.331692
  0.773217	  0.995799	  2.343785
  0.822940	  1.001933	  2.355230
  0.872838	  1.005362	  2.365930
  0.918809	  1.011270	  2.380527
  0.964098	  1.019298	  2.394589
  1.010167	  1.028573	  2.408691
  1.059362	  1.036188	  2.421207
  1.104946	  1.039824	  2.436743
  1.152867	  1.047968	  2.451524
  1.200871	  1.053479	  2.470231
  1.248835	  1.063309	  2.483986
  1.291886	  1.063874	  2.489820
  1.304805	  1.074513	  2.514718
