 -1.643024	 -0.548097	 -1.577605
 -1.650003	 -0.558075	 -1.574432
 -1.640639	 -0.542962	 -1.578358
 -1.629738	 -0.529811	 -1.584076
 -1.613581	 -0.506581	 -1.590406
 -1.604600	 -0.495205	 -1.594185
 -1.593172	 -0.484251	 -1.598728
 -1.573710	 -0.466132	 -1.604557
 -1.563699	 -0.450637	 -1.610077
 -1.555297	 -0.440062	 -1.614443
 -1.536541	 -0.425200	 -1.618810
 -1.521269	 -0.408060	 -1.622061
 -1.515186	 -0.391515	 -1.628724
 -1.508986	 -0.379070	 -1.638448
 -1.495274	 -0.363144	 -1.647583
 -1.481952	 -0.349081	 -1.653861
 -1.469177	 -0.335468	 -1.659120
 -1.454599	 -0.321798	 -1.660051
 -1.435691	 -0.311505	 -1.660216
 -1.413837	 -0.303869	 -1.667963
 -1.400823	 -0.292228	 -1.680429
 -1.394880	 -0.277150	 -1.687833
 -1.387464	 -0.256298	 -1.692369
 -1.374440	 -0.239759	 -1.704001
 -1.355296	 -0.229514	 -1.714794
 -1.342831	 -0.223972	 -1.718381
 -1.326079	 -0.210930	 -1.723604
 -1.309368	 -0.199479	 -1.729320
 -1.293065	 -0.190768	 -1.730786
 -1.273551	 -0.180292	 -1.733192
 -1.257955	 -0.168726	 -1.740974
 -1.246567	 -0.157667	 -1.748792
 -1.230830	 -0.146788	 -1.759782
 -1.209814	 -0.136816	 -1.772699
 -1.201519	 -0.132608	 -1.777959
 -1.188014	 -0.119368	 -1.785502
 -1.168929	 -0.105177	 -1.799931
 -1.150815	 -0.091249	 -1.808680
 -1.140373	 -0.081338	 -1.809350
 -1.128833	 -0.068210	 -1.802948
 -1.111112	 -0.051438	 -1.804660
 -1.096720	 -0.037763	 -1.810646
 -1.083312	 -0.024176	 -1.816709
 -1.070457	 -0.010076	 -1.822791
 -1.057689	  0.004110	 -1.828689
 -1.045902	  0.018980	 -1.835070
 -1.034117	  0.033786	 -1.841549
 -1.022776	  0.048991	 -1.847887
 -1.011704	  0.064431	 -1.854134
 -1.000634	  0.079947	 -1.860193
 -0.989570	  0.095577	 -1.865961
 -0.978506	  0.111207	 -1.871729
 -0.966680	  0.126143	 -1.877817
 -0.954790	  0.141017	 -1.883939
 -0.942889	  0.155880	 -1.890093
 -0.929681	  0.169269	 -1.896935
 -0.916138	  0.182239	 -1.903877
 -0.902778	  0.195478	 -1.910767
 -0.888615	  0.207658	 -1.918088
 -0.873788	  0.218825	 -1.925629
 -0.858863	  0.229846	 -1.933140
 -0.843641	  0.240409	 -1.940860
 -0.828057	  0.250318	 -1.948775
 -0.812154	  0.259346	 -1.956728
 -0.796084	  0.268294	 -1.964618
 -0.780055	  0.277442	 -1.972382
 -0.764179	  0.286846	 -1.980111
 -0.748384	  0.296406	 -1.987803
 -0.732609	  0.305988	 -1.995504
 -0.717010	  0.315785	 -2.003296
 -0.701436	  0.325612	 -2.011100
 -0.686002	  0.335610	 -2.018962
 -0.670798	  0.345884	 -2.026917
 -0.655595	  0.356160	 -2.034872
 -0.640714	  0.366914	 -2.042802
 -0.625831	  0.377683	 -2.050695
 -0.610883	  0.388542	 -2.058341
 -0.595835	  0.399411	 -2.065846
 -0.580857	  0.410090	 -2.073697
 -0.566365	  0.420243	 -2.081082
 -0.547493	  0.428817	 -2.086297
 -0.529912	  0.438006	 -2.092117
 -0.520757	  0.453810	 -2.102077
 -0.514243	  0.474882	 -2.116951
 -0.503126	  0.487635	 -2.126335
 -0.491308	  0.497139	 -2.132064
 -0.478212	  0.510716	 -2.139519
 -0.461746	  0.526446	 -2.149536
 -0.449160	  0.532716	 -2.153618
 -0.430540	  0.543541	 -2.159980
 -0.414923	  0.562016	 -2.173107
 -0.410521	  0.574614	 -2.180984
 -0.402098	  0.588227	 -2.184444
 -0.384742	  0.605667	 -2.187364
 -0.374147	  0.623838	 -2.198704
 -0.369000	  0.638148	 -2.209992
 -0.359793	  0.653143	 -2.219065
 -0.348480	  0.667667	 -2.226879
