 -2.073926	 -0.864073	  1.134464
 -2.060676	 -0.861478	  1.123152
 -2.058881	 -0.861127	  1.121620
 -2.043078	 -0.856773	  1.110161
 -2.027021	 -0.851864	  1.099296
 -2.010965	 -0.846960	  1.088426
 -1.995216	 -0.843238	  1.076674
 -1.979484	 -0.839564	  1.064884
 -1.964047	 -0.835339	  1.052891
 -1.948805	 -0.830767	  1.040776
 -1.933597	 -0.826191	  1.028674
 -1.919806	 -0.819730	  1.016198
 -1.907752	 -0.811231	  1.003083
 -1.893129	 -0.809266	  0.987985
 -1.881144	 -0.815447	  0.975107
 -1.869338	 -0.826982	  0.963677
 -1.859447	 -0.840224	  0.951788
 -1.850453	 -0.851353	  0.938293
 -1.843995	 -0.862160	  0.922736
 -1.836592	 -0.873719	  0.908498
 -1.824455	 -0.885297	  0.895726
 -1.808934	 -0.891303	  0.883553
 -1.797378	 -0.897894	  0.868877
 -1.788828	 -0.911577	  0.855007
 -1.775432	 -0.920022	  0.842043
 -1.759651	 -0.924143	  0.830054
 -1.742259	 -0.931612	  0.821249
 -1.730018	 -0.949015	  0.812113
 -1.713532	 -0.958466	  0.805293
 -1.696183	 -0.959026	  0.795859
 -1.679783	 -0.966532	  0.785335
 -1.661661	 -0.971327	  0.776227
 -1.644761	 -0.971761	  0.765800
 -1.629078	 -0.978713	  0.755410
 -1.610984	 -0.986426	  0.747053
 -1.593304	 -0.985500	  0.740860
 -1.575111	 -0.988913	  0.732905
 -1.552954	 -0.991262	  0.728146
 -1.533371	 -0.987378	  0.724942
 -1.518507	 -0.989450	  0.716864
 -1.499384	 -0.988833	  0.709977
 -1.480502	 -0.984942	  0.705502
 -1.462442	 -0.980792	  0.697647
 -1.445442	 -0.976004	  0.689884
 -1.427076	 -0.970647	  0.682977
 -1.408572	 -0.963104	  0.679885
 -1.389524	 -0.954164	  0.678282
 -1.373699	 -0.942300	  0.674819
 -1.361115	 -0.927777	  0.670537
 -1.348083	 -0.912702	  0.666888
 -1.336317	 -0.896817	  0.663770
 -1.325153	 -0.879996	  0.658926
 -1.312633	 -0.864360	  0.652706
 -1.299732	 -0.849634	  0.646463
 -1.290908	 -0.834312	  0.637436
 -1.279654	 -0.818648	  0.630873
 -1.268056	 -0.802270	  0.624831
 -1.262844	 -0.782726	  0.618699
 -1.260101	 -0.763266	  0.614979
 -1.255078	 -0.744294	  0.611407
 -1.248965	 -0.724828	  0.605059
 -1.242201	 -0.705322	  0.596211
 -1.242843	 -0.687174	  0.588626
 -1.244440	 -0.669893	  0.580436
 -1.239256	 -0.653034	  0.570209
 -1.228281	 -0.636877	  0.559326
 -1.216930	 -0.621423	  0.548499
 -1.216321	 -0.605339	  0.541923
 -1.210474	 -0.588585	  0.535109
 -1.202308	 -0.571578	  0.525389
 -1.195046	 -0.556409	  0.511414
 -1.190394	 -0.543663	  0.497190
 -1.187127	 -0.530380	  0.487696
 -1.176838	 -0.517610	  0.478696
 -1.162023	 -0.505288	  0.469730
 -1.149531	 -0.493021	  0.460059
 -1.138797	 -0.482223	  0.448812
 -1.123956	 -0.472214	  0.439793
 -1.109304	 -0.461739	  0.430168
 -1.092759	 -0.451604	  0.420711
 -1.078929	 -0.445207	  0.411128
 -1.063326	 -0.436777	  0.402956
 -1.046549	 -0.428308	  0.393723
 -1.030054	 -0.422931	  0.384824
 -1.013595	 -0.417965	  0.374027
 -0.996237	 -0.411939	  0.365692
 -0.980277	 -0.406334	  0.356331
 -0.962933	 -0.403959	  0.344580
 -0.945724	 -0.397717	  0.335453
 -0.930812	 -0.391066	  0.328820
 -0.913406	 -0.386781	  0.317561
 -0.897350	 -0.384141	  0.305065
 -0.882574	 -0.382081	  0.291520
 -0.867611	 -0.380019	  0.278541
 -0.852560	 -0.377899	  0.265122
 -0.837643	 -0.375657	  0.252994
 -0.823128	 -0.372513	  0.238058
 -0.807500	 -0.370767	  0.225289
 -0.795822	 -0.369313	  0.209117
 -0.784902	 -0.366072	  0.193828
 -0.772318	 -0.364121	  0.174798
 -0.758859	 -0.362432	  0.162736
 -0.743651	 -0.358423	  0.149795
 -0.729858	 -0.354850	  0.134809
 -0.718174	 -0.351514	  0.119621
 -0.708348	 -0.347143	  0.102121
 -0.695345	 -0.345316	  0.085217
 -0.681788	 -0.341430	  0.072933
 -0.667387	 -0.336108	  0.059202
 -0.655767	 -0.331769	  0.043085
 -0.645922	 -0.327064	  0.027309
 -0.636207	 -0.322566	  0.008122
 -0.622754	 -0.319388	 -0.006667
 -0.609221	 -0.312689	 -0.017749
 -0.595360	 -0.306019	 -0.031976
 -0.582269	 -0.300724	 -0.047013
 -0.573616	 -0.294155	 -0.062439
 -0.562692	 -0.286249	 -0.078399
 -0.549704	 -0.280906	 -0.093786
 -0.535064	 -0.275541	 -0.106403
 -0.521521	 -0.267775	 -0.118088
 -0.508879	 -0.259285	 -0.131105
 -0.495742	 -0.251369	 -0.144525
 -0.482068	 -0.244194	 -0.156995
 -0.467972	 -0.236713	 -0.169206
 -0.455167	 -0.228787	 -0.182378
 -0.442233	 -0.222227	 -0.196357
 -0.430234	 -0.215636	 -0.210951
 -0.418433	 -0.209105	 -0.225820
 -0.406324	 -0.202940	 -0.240613
 -0.395385	 -0.196465	 -0.256061
 -0.383803	 -0.190317	 -0.271270
 -0.373322	 -0.184008	 -0.287019
 -0.362562	 -0.178769	 -0.301681
 -0.351794	 -0.172000	 -0.319236
 -0.339111	 -0.164872	 -0.334398
 -0.328612	 -0.157593	 -0.348252
 -0.319428	 -0.152705	 -0.363590
 -0.305948	 -0.147345	 -0.378192
 -0.292547	 -0.136002	 -0.393147
 -0.283854	 -0.129505	 -0.405399
 -0.272263	 -0.123527	 -0.424220
 -0.261448	 -0.119919	 -0.441845
 -0.250127	 -0.110784	 -0.453576
 -0.237440	 -0.101241	 -0.467024
 -0.223857	 -0.096138	 -0.479551
 -0.209512	 -0.091142	 -0.494224
 -0.195109	 -0.081982	 -0.504071
 -0.182298	 -0.075269	 -0.516263
 -0.170539	 -0.066200	 -0.531729
 -0.155373	 -0.057882	 -0.543578
 -0.140305	 -0.051054	 -0.549099
 -0.122491	 -0.049897	 -0.556196
 -0.102632	 -0.045906	 -0.573461
 -0.092170	 -0.036661	 -0.590296
 -0.080654	 -0.021361	 -0.602125
 -0.064923	 -0.018229	 -0.604544
 -0.043531	 -0.017837	 -0.614457
 -0.024141	 -0.021737	 -0.626272
 -0.009700	 -0.020607	 -0.637059
  0.006849	 -0.016081	 -0.648614
  0.022490	 -0.011129	 -0.659502
  0.038883	 -0.007473	 -0.671657
  0.052963	 -0.002795	 -0.685475
  0.069506	  0.001933	 -0.697083
  0.087474	  0.004774	 -0.704981
  0.102598	  0.008605	 -0.715797
  0.118364	  0.013247	 -0.729245
  0.135327	  0.017381	 -0.738522
  0.152466	  0.023467	 -0.749099
  0.166301	  0.028987	 -0.760750
  0.181378	  0.031801	 -0.771796
  0.197860	  0.036108	 -0.786981
  0.209656	  0.044200	 -0.801310
  0.228784	  0.049977	 -0.807862
  0.247472	  0.053937	 -0.814818
  0.263069	  0.056643	 -0.825404
  0.279636	  0.060653	 -0.838506
  0.296634	  0.066988	 -0.848941
  0.311378	  0.067462	 -0.860795
  0.327684	  0.066208	 -0.872260
  0.345301	  0.066923	 -0.883388
  0.360704	  0.068554	 -0.896236
  0.376658	  0.069057	 -0.910143
  0.393819	  0.070214	 -0.920101
  0.409955	  0.076580	 -0.927705
  0.427580	  0.083654	 -0.936376
  0.446896	  0.087947	 -0.943443
  0.465460	  0.087591	 -0.952137
  0.481239	  0.088551	 -0.962031
  0.498290	  0.089901	 -0.971413
  0.517419	  0.088057	 -0.977911
  0.535271	  0.087569	 -0.982612
  0.554382	  0.087401	 -0.987272
  0.577645	  0.082081	 -0.993386
  0.593640	  0.077972	 -0.998948
  0.610736	  0.077432	 -1.005339
  0.631070	  0.076255	 -1.012161
  0.649983	  0.075019	 -1.019683
  0.668796	  0.073265	 -1.026410
  0.687474	  0.071799	 -1.033796
  0.705665	  0.070819	 -1.042184
  0.723886	  0.069756	 -1.050376
  0.742078	  0.068915	 -1.058913
  0.760303	  0.069242	 -1.067750
  0.777514	  0.070983	 -1.077981
  0.795166	  0.072279	 -1.087297
  0.812413	  0.073957	 -1.097346
  0.829760	  0.075631	 -1.107321
  0.846478	  0.078641	 -1.118387
  0.862959	  0.082241	 -1.129375
  0.878658	  0.086328	 -1.141047
  0.894539	  0.090231	 -1.152540
  0.910339	  0.094110	 -1.164197
  0.926392	  0.096181	 -1.175915
  0.941383	  0.096311	 -1.189093
  0.956736	  0.095878	 -1.201821
  0.972236	  0.094890	 -1.214677
  0.987536	  0.093005	 -1.227223
  1.001707	  0.090162	 -1.240229
  1.016736	  0.085523	 -1.254130
  1.030518	  0.080700	 -1.267722
  1.043260	  0.078834	 -1.282431
  1.057136	  0.076903	 -1.296237
  1.071332	  0.073483	 -1.310169
  1.086008	  0.068745	 -1.323061
  1.100084	  0.064645	 -1.336738
  1.114857	  0.064323	 -1.350649
  1.129148	  0.067263	 -1.364447
  1.143737	  0.070996	 -1.376522
  1.158219	  0.076583	 -1.389790
  1.171855	  0.082429	 -1.406200
  1.181650	  0.087978	 -1.421896
  1.196097	  0.089531	 -1.434557
  1.210559	  0.096563	 -1.446396
  1.224133	  0.103795	 -1.459878
  1.233987	  0.113262	 -1.475253
  1.243358	  0.125114	 -1.487990
  1.252743	  0.138574	 -1.500283
  1.258986	  0.153018	 -1.513724
  1.265163	  0.163119	 -1.529361
  1.275087	  0.174380	 -1.542254
  1.285525	  0.187705	 -1.552581
  1.291190	  0.205834	 -1.565397
  1.291576	  0.222382	 -1.579543
  1.291785	  0.233914	 -1.591642
  1.296525	  0.248522	 -1.604885
  1.299941	  0.266681	 -1.616683
  1.297749	  0.287184	 -1.624724
  1.299960	  0.302030	 -1.633672
  1.300415	  0.319754	 -1.644318
  1.301471	  0.339360	 -1.653114
  1.295173	  0.355072	 -1.662822
  1.290611	  0.371374	 -1.673234
  1.288087	  0.390610	 -1.681381
  1.280682	  0.409164	 -1.689786
  1.272640	  0.422678	 -1.703442
  1.267206	  0.437511	 -1.715794
  1.270151	  0.449388	 -1.731121
  1.272880	  0.463238	 -1.747125
  1.276619	  0.474546	 -1.761793
  1.283578	  0.488980	 -1.776589
  1.291518	  0.505798	 -1.788777
  1.299647	  0.511686	 -1.803548
  1.309870	  0.518235	 -1.821022
  1.323297	  0.526419	 -1.834822
  1.334074	  0.538124	 -1.844774
  1.347542	  0.548247	 -1.857483
  1.358642	  0.559516	 -1.871188
  1.364885	  0.572622	 -1.884069
  1.376669	  0.582446	 -1.897479
  1.388349	  0.591263	 -1.911528
  1.397040	  0.602077	 -1.925705
  1.408014	  0.610739	 -1.940246
  1.421805	  0.622434	 -1.959859
  1.427434	  0.629905	 -1.970616
