  1.540661	 -1.744394	 -0.775512
  1.540358	 -1.752991	 -0.769584
  1.540055	 -1.761588	 -0.763656
  1.558692	 -1.744788	 -0.767056
  1.563018	 -1.727589	 -0.783672
  1.564980	 -1.711754	 -0.795957
  1.560814	 -1.693493	 -0.806927
  1.550990	 -1.675841	 -0.819682
  1.542210	 -1.661712	 -0.832180
  1.539608	 -1.646511	 -0.844550
  1.540427	 -1.632209	 -0.857612
  1.540570	 -1.617341	 -0.870563
  1.538028	 -1.602169	 -0.883060
  1.534894	 -1.586680	 -0.895722
  1.534038	 -1.570272	 -0.909374
  1.534177	 -1.556842	 -0.923207
  1.532059	 -1.544254	 -0.936680
  1.528785	 -1.530708	 -0.951795
  1.526967	 -1.514839	 -0.967935
  1.526276	 -1.502514	 -0.981737
  1.522807	 -1.492561	 -0.995400
  1.517669	 -1.479040	 -1.014339
  1.516539	 -1.467906	 -1.036175
  1.517774	 -1.461840	 -1.053018
  1.521353	 -1.454916	 -1.067876
  1.522090	 -1.436369	 -1.081718
  1.516077	 -1.417563	 -1.092478
  1.511282	 -1.400861	 -1.103264
  1.508621	 -1.385249	 -1.115596
  1.506113	 -1.369459	 -1.127710
  1.503318	 -1.353495	 -1.139495
  1.500381	 -1.337424	 -1.151033
  1.497731	 -1.320976	 -1.162147
  1.495196	 -1.304443	 -1.173126
  1.492841	 -1.287660	 -1.183756
  1.490626	 -1.270699	 -1.194133
  1.488397	 -1.253747	 -1.204514
  1.485990	 -1.236638	 -1.214592
  1.483603	 -1.219506	 -1.224616
  1.480779	 -1.203111	 -1.235689
  1.477681	 -1.187181	 -1.247371
  1.474644	 -1.171214	 -1.259025
  1.471883	 -1.155120	 -1.270577
  1.469102	 -1.139041	 -1.282136
  1.466900	 -1.123186	 -1.293904
  1.464221	 -1.108353	 -1.305426
  1.456015	 -1.090362	 -1.312547
  1.452073	 -1.071615	 -1.321117
  1.454399	 -1.050236	 -1.337565
  1.455257	 -1.036897	 -1.345932
  1.455766	 -1.023233	 -1.354932
  1.456939	 -1.001475	 -1.373739
  1.458845	 -0.992899	 -1.384442
  1.463807	 -0.983045	 -1.403082
  1.467324	 -0.967665	 -1.422595
  1.467802	 -0.954157	 -1.434606
  1.466992	 -0.938258	 -1.444905
  1.465533	 -0.919783	 -1.455612
  1.465002	 -0.903947	 -1.465491
  1.464896	 -0.886865	 -1.478511
  1.462818	 -0.872716	 -1.491179
  1.460731	 -0.858176	 -1.504822
  1.461089	 -0.844301	 -1.520683
  1.465068	 -0.830580	 -1.542061
  1.467125	 -0.825254	 -1.550723
  1.472959	 -0.805628	 -1.572918
  1.473823	 -0.781731	 -1.586250
  1.472843	 -0.765399	 -1.590220
  1.471655	 -0.748008	 -1.593154
  1.471329	 -0.724506	 -1.602754
  1.470284	 -0.710455	 -1.611284
  1.465480	 -0.693957	 -1.624786
  1.461898	 -0.682922	 -1.631851
  1.453364	 -0.664257	 -1.642362
  1.451076	 -0.644693	 -1.652032
  1.447830	 -0.626079	 -1.656905
  1.436967	 -0.597436	 -1.658116
  1.432074	 -0.578366	 -1.663622
  1.431552	 -0.566474	 -1.667186
  1.435173	 -0.548360	 -1.681222
  1.434018	 -0.529633	 -1.700163
  1.429271	 -0.519403	 -1.715051
  1.422813	 -0.507248	 -1.732491
  1.420101	 -0.490527	 -1.745000
  1.420368	 -0.476363	 -1.749031
  1.422791	 -0.452893	 -1.751069
  1.423200	 -0.428625	 -1.765632
  1.420404	 -0.419040	 -1.775925
  1.411436	 -0.408383	 -1.794634
  1.406190	 -0.392641	 -1.811836
  1.405764	 -0.377626	 -1.820800
  1.410106	 -0.356418	 -1.828841
  1.413454	 -0.334921	 -1.839949
  1.414104	 -0.317887	 -1.850288
  1.411435	 -0.306565	 -1.857112
  1.402401	 -0.288250	 -1.868740
  1.395832	 -0.273641	 -1.882880
  1.389388	 -0.260294	 -1.896849
  1.383685	 -0.245321	 -1.908993
  1.377071	 -0.231045	 -1.921383
  1.370767	 -0.216879	 -1.934042
  1.365235	 -0.202627	 -1.946953
  1.359963	 -0.188414	 -1.959999
  1.354681	 -0.174206	 -1.973047
  1.350483	 -0.159782	 -1.986251
  1.346568	 -0.145312	 -1.999491
  1.342762	 -0.130850	 -2.012771
  1.340093	 -0.116555	 -2.026500
  1.337443	 -0.102254	 -2.040232
  1.334770	 -0.087829	 -2.054083
  1.331713	 -0.070846	 -2.070452
  1.327502	 -0.043692	 -2.097109
  1.325376	 -0.029526	 -2.111065
  1.323250	 -0.015360	 -2.125021
