clone_pair,start_commit,end_commit,genealogy
src/main/target/CHEBUZZF3/system_stm32f30x.c^290^357+src/main/target/STM32F3DISCOVERY/system_stm32f30x.c^290^357,d262c6e,fc93be3,"C,9f1a0fc,136"
src/main/common/typeconversion.c^25^41+src/main/common/typeconversion.c^54^70,d262c6e,043ed0f,"C,9d4bc1a,34"
src/main/flight/flight.c^191^205+src/main/flight/flight.c^267^281,d262c6e,78ebbcd,"I,f9b630a,30"
src/main/target/CHEBUZZF3/system_stm32f30x.c^159^200+src/main/target/NAZE32PRO/system_stm32f30x.c^159^200,d262c6e,fc93be3,"C,9f1a0fc,84"
src/main/target/CHEBUZZF3/system_stm32f30x.c^159^200+src/main/target/STM32F3DISCOVERY/system_stm32f30x.c^159^200,d262c6e,fc93be3,"C,9f1a0fc,84"
src/main/target/NAZE32PRO/system_stm32f30x.c^159^200+src/main/target/STM32F3DISCOVERY/system_stm32f30x.c^159^200,d262c6e,fc93be3,"C,9f1a0fc,84"
src/main/target/CHEBUZZF3/system_stm32f30x.c^238^280+src/main/target/NAZE32PRO/system_stm32f30x.c^238^280,d262c6e,fc93be3,"C,9f1a0fc,86"
src/main/target/CHEBUZZF3/system_stm32f30x.c^238^280+src/main/target/STM32F3DISCOVERY/system_stm32f30x.c^238^280,d262c6e,fc93be3,"C,9f1a0fc,86"
src/main/target/NAZE32PRO/system_stm32f30x.c^238^280+src/main/target/STM32F3DISCOVERY/system_stm32f30x.c^238^280,d262c6e,fc93be3,"C,9f1a0fc,86"
src/main/target/CHEBUZZF3/system_stm32f30x.c^290^357+src/main/target/NAZE32PRO/system_stm32f30x.c^290^357,d262c6e,fc93be3,"C,9f1a0fc,136"
src/main/target/NAZE32PRO/system_stm32f30x.c^290^357+src/main/target/STM32F3DISCOVERY/system_stm32f30x.c^290^357,d262c6e,fc93be3,"C,9f1a0fc,136"
src/main/drivers/bus_i2c_stm32f10x.c^115^132+src/main/drivers/bus_i2c_stm32f10x.c^154^170,d262c6e,1790e08,"I,d60183d,35"
src/main/drivers/compass_hmc5883l.c^153^171+src/main/drivers/compass_hmc5883l.c^174^191,d262c6e,f8bdc79,"C,e867af8,37"
src/main/drivers/light_ws2811strip_stm32f10x.c^76^105+src/main/drivers/light_ws2811strip_stm32f30x.c^81^110,d262c6e,5086b46,"I,c9b5334,30"
src/main/drivers/bus_i2c_stm32f30x.c^86^115+src/main/drivers/bus_i2c_stm32f30x.c^129^157,d262c6e,a6f4633,"C,32622da,1-I,b3a7188,1-C,1d5ef51,59"
src/main/drivers/serial_uart_stm32f10x.c^94^118+src/main/drivers/serial_uart_stm32f10x.c^179^200,d262c6e,8c6c14b,"I,b017246,27"
src/main/drivers/accgyro_spi_mpu6000.c^335^348+src/main/drivers/accgyro_spi_mpu6000.c^350^363,d262c6e,fc93be3,"C,9f1a0fc,27"
