clone_pair,start_commit,end_commit,genealogy
modules/admin/admin-impl/src/main/java/com/enonic/xp/admin/impl/rest/resource/application/ApplicationResource.java^98^108+modules/admin/admin-impl/src/main/java/com/enonic/xp/admin/impl/rest/resource/application/ApplicationResource.java^328^338,2000d91,855eca7,"I,c734af8,1-I,b35498b,1-I,91f0626,5-I,d445c68,2-I,003c8c2,1-I,afcd631,13-I,8d1a1e1,20-I,43024a5,41-I,5f8c7d4,2-I,756c15e,3-I,96a63cd,2-I,012e9bc,1-I,985ebfc,15-I,5f881bf,1-I,d7c9c5f,4-I,de32db7,2-I,5a94bc1,1-I,bf511d9,2-I,708c292,4-I,1806838,2-I,9edd17b,94-I,4b0d8f2,1-I,917e949,3-I,0133636,2-I,8b0fb364,15-I,9cfab51,1-I,4d8b5ab,3-I,6a84dca,10-I,967cfc1,2-I,4588ece,1-I,31e1412,1-I,0a5869a,1-I,d608972,1-I,6bbe98a,3-I,93a64fd,7-I,9bf5293,32-I,d9f01f2,1-I,c408682,1-I,8276abe,3-I,c210195,2-I,4a19174,10-I,0048ab4,18-I,6f74b73,6-I,75c7e95,1-I,66b0af5,1-I,db50e83,1-I,a734c50,6"
modules/admin/admin-impl/src/test/java/com/enonic/xp/admin/impl/rest/resource/content/ResolveDependenciesAggregationFactoryTest.java^92^101+modules/admin/admin-impl/src/test/java/com/enonic/xp/admin/impl/rest/resource/content/ResolveDependenciesAggregationFactoryTest.java^139^149,2000d91,855eca7,"C,f4463b4,2-C,db91cc3,3-C,0ba9967,2-C,28f793b,2"
modules/admin/admin-impl/src/test/java/com/enonic/xp/admin/impl/rest/resource/content/ResolveDependenciesAggregationFactoryTest.java^92^101+modules/admin/admin-impl/src/test/java/com/enonic/xp/admin/impl/rest/resource/content/ResolveDependenciesAggregationFactoryTest.java^180^188,2000d91,855eca7,"I,f4463b4,1-I,db91cc3,1-I,0ba9967,1-I,28f793b,1"
modules/admin/admin-impl/src/test/java/com/enonic/xp/admin/impl/rest/resource/content/ResolveDependenciesAggregationFactoryTest.java^139^149+modules/admin/admin-impl/src/test/java/com/enonic/xp/admin/impl/rest/resource/content/ResolveDependenciesAggregationFactoryTest.java^180^188,2000d91,855eca7,"I,f4463b4,1-I,db91cc3,2-I,0ba9967,1-I,28f793b,1"
modules/admin/admin-impl/src/test/java/com/enonic/xp/admin/impl/rest/resource/content/ContentResourceTest.java^1144^1156+modules/admin/admin-impl/src/test/java/com/enonic/xp/admin/impl/rest/resource/content/ContentSelectorQueryJsonToContentQueryConverterTest.java^329^341,2000d91,855eca7,"I,6e0dcd9,1"
modules/admin/admin-impl/src/test/java/com/enonic/xp/admin/impl/rest/resource/content/ContentResourceTest.java^1144^1158+modules/admin/admin-impl/src/test/java/com/enonic/xp/admin/impl/rest/resource/content/ContentSelectorQueryJsonToContentQueryConverterTest.java^278^308,2000d91,1e79afe,"I,11e3976,2-I,6e995ab,2-I,d451579,19"
modules/admin/admin-impl/src/test/java/com/enonic/xp/admin/impl/rest/resource/content/ContentResourceTest.java^1142^1159+modules/admin/admin-impl/src/test/java/com/enonic/xp/admin/impl/rest/resource/content/ContentSelectorQueryJsonToContentQueryConverterTest.java^308^325,2000d91,855eca7,"I,6e0dcd9,1"
modules/admin/admin-impl/src/main/java/com/enonic/xp/admin/impl/rest/resource/security/json/UpdateGroupJson.java^27^39+modules/admin/admin-impl/src/main/java/com/enonic/xp/admin/impl/rest/resource/security/json/UpdateRoleJson.java^27^40,2000d91,855eca7,"I,f76fcdd,2"
modules/admin/admin-impl/src/test/java/com/enonic/xp/admin/impl/rest/resource/content/ResolveDependenciesAggregationFactoryTest.java^92^109+modules/admin/admin-impl/src/test/java/com/enonic/xp/admin/impl/rest/resource/content/ResolveDependenciesAggregationFactoryTest.java^139^157,2000d91,855eca7,"I,f4463b4,2-I,db91cc3,4-I,0ba9967,5-I,28f793b,2"
modules/admin/admin-impl/src/test/java/com/enonic/xp/admin/impl/rest/resource/content/ResolveDependenciesAggregationFactoryTest.java^123^149+modules/admin/admin-impl/src/test/java/com/enonic/xp/admin/impl/rest/resource/content/ResolveDependenciesAggregationFactoryTest.java^166^188,2000d91,855eca7,"I,f4463b4,8-I,db91cc3,5-I,0ba9967,7-I,db05148,1-I,28f793b,1"
modules/admin/admin-impl/src/test/java/com/enonic/xp/admin/impl/rest/resource/application/ApplicationResourceTest.java^41^55+modules/admin/admin-impl/src/test/java/com/enonic/xp/admin/impl/rest/resource/application/ApplicationResourceTest.java^61^75,2000d91,855eca7,"C,cea395f,2-I,913cedf,1-I,9bf5293,13-I,36ce684,1-I,2f98b5b,1-I,c52b371,1-I,4a19174,4-I,6e5333f,1-I,95b1527,1"
modules/admin/admin-impl/src/test/java/com/enonic/xp/admin/impl/rest/resource/application/ApplicationResourceTest.java^61^76+modules/admin/admin-impl/src/test/java/com/enonic/xp/admin/impl/rest/resource/application/ApplicationResourceTest.java^82^97,2000d91,855eca7,"C,cea395f,2-I,4a19174,6"
modules/admin/admin-impl/src/test/java/com/enonic/xp/admin/impl/rest/resource/security/SecurityResourceTest.java^153^177+modules/admin/admin-impl/src/test/java/com/enonic/xp/admin/impl/rest/resource/security/SecurityResourceTest.java^185^209,2000d91,855eca7,"I,2f7e8db,17-I,1d86f1e,2-I,91665ad,4"
modules/admin/admin-impl/src/test/java/com/enonic/xp/admin/impl/rest/resource/security/SecurityResourceTest.java^304^321+modules/admin/admin-impl/src/test/java/com/enonic/xp/admin/impl/rest/resource/security/SecurityResourceTest.java^485^499,2000d91,855eca7,"I,de2a369,1"
modules/admin/admin-impl/src/test/java/com/enonic/xp/admin/impl/rest/resource/security/SecurityResourceTest.java^314^324+modules/admin/admin-impl/src/test/java/com/enonic/xp/admin/impl/rest/resource/security/SecurityResourceTest.java^341^351,2000d91,855eca7,"I,2f7e8db,1-I,de2a369,1-I,8332320,2"
modules/admin/admin-impl/src/test/java/com/enonic/xp/admin/impl/rest/resource/security/SecurityResourceTest.java^399^418+modules/admin/admin-impl/src/test/java/com/enonic/xp/admin/impl/rest/resource/security/SecurityResourceTest.java^463^482,2000d91,855eca7,"I,2f7e8db,2-I,91665ad,2-I,80a619c,5-I,bd00d7d,3"
modules/admin/admin-impl/src/test/java/com/enonic/xp/admin/impl/rest/resource/auth/AuthResourceTest.java^54^73+modules/admin/admin-impl/src/test/java/com/enonic/xp/admin/impl/rest/resource/auth/AuthResourceTest.java^76^95,2000d91,855eca7,"C,2f7e8db,2"
modules/admin/admin-impl/src/test/java/com/enonic/xp/admin/impl/rest/resource/auth/AuthResourceTest.java^54^73+modules/admin/admin-impl/src/test/java/com/enonic/xp/admin/impl/rest/resource/auth/AuthResourceTest.java^98^117,2000d91,855eca7,"C,2f7e8db,3"
modules/admin/admin-impl/src/test/java/com/enonic/xp/admin/impl/rest/resource/auth/AuthResourceTest.java^76^95+modules/admin/admin-impl/src/test/java/com/enonic/xp/admin/impl/rest/resource/auth/AuthResourceTest.java^98^117,2000d91,855eca7,"C,2f7e8db,3"
modules/admin/admin-impl/src/test/java/com/enonic/xp/admin/impl/rest/resource/application/ApplicationResourceTest.java^45^55+modules/admin/admin-impl/src/test/java/com/enonic/xp/admin/impl/rest/resource/application/ApplicationResourceTest.java^65^75,2000d91,855eca7,"C,cea395f,2-I,913cedf,1-I,9bf5293,13-I,36ce684,1-I,2f98b5b,1-I,c52b371,1-I,4a19174,4-I,6e5333f,1-I,95b1527,1"
modules/admin/admin-impl/src/test/java/com/enonic/xp/admin/impl/rest/resource/application/ApplicationResourceTest.java^45^55+modules/admin/admin-impl/src/test/java/com/enonic/xp/admin/impl/rest/resource/application/ApplicationResourceTest.java^86^96,2000d91,855eca7,"C,cea395f,1-I,913cedf,1-I,9bf5293,13-I,36ce684,1-I,2f98b5b,1-I,c52b371,1-I,4a19174,6-I,6e5333f,1-I,95b1527,1"
modules/admin/admin-impl/src/test/java/com/enonic/xp/admin/impl/rest/resource/application/ApplicationResourceTest.java^65^75+modules/admin/admin-impl/src/test/java/com/enonic/xp/admin/impl/rest/resource/application/ApplicationResourceTest.java^86^96,2000d91,855eca7,"C,cea395f,1-I,4a19174,6"
modules/admin/admin-impl/src/test/java/com/enonic/xp/admin/impl/rest/resource/content/ContentResourceTest.java^180^187+modules/admin/admin-impl/src/test/java/com/enonic/xp/admin/impl/rest/resource/content/ContentResourceTest.java^756^763,2000d91,5345bba,"I,b1d9c95,5"
modules/admin/admin-impl/src/test/java/com/enonic/xp/admin/impl/rest/resource/content/ContentResourceTest.java^180^187+modules/admin/admin-impl/src/test/java/com/enonic/xp/admin/impl/rest/resource/content/ContentResourceTest.java^780^787,2000d91,1a31be3,"I,b317c94,8"
modules/admin/admin-impl/src/test/java/com/enonic/xp/admin/impl/rest/resource/content/ContentResourceTest.java^756^763+modules/admin/admin-impl/src/test/java/com/enonic/xp/admin/impl/rest/resource/content/ContentResourceTest.java^780^787,2000d91,5345bba,"I,b1d9c95,5"
modules/admin/admin-impl/src/test/java/com/enonic/xp/admin/impl/rest/resource/content/ContentResourceTest.java^1005^1019+modules/admin/admin-impl/src/test/java/com/enonic/xp/admin/impl/rest/resource/content/ContentResourceTest.java^1040^1055,2000d91,5345bba,"I,b1d9c95,15"
modules/admin/admin-impl/src/test/java/com/enonic/xp/admin/impl/rest/resource/content/ContentResourceTest.java^1005^1019+modules/admin/admin-impl/src/test/java/com/enonic/xp/admin/impl/rest/resource/content/ContentResourceTest.java^1091^1106,2000d91,5345bba,"I,b1d9c95,15"
modules/admin/admin-impl/src/test/java/com/enonic/xp/admin/impl/rest/resource/content/ContentSelectorQueryJsonToContentQueryConverterTest.java^92^106+modules/admin/admin-impl/src/test/java/com/enonic/xp/admin/impl/rest/resource/content/ContentSelectorQueryJsonToContentQueryConverterTest.java^153^167,2000d91,c4cc123,"I,5967f48,1-I,55ee9c9,16"
modules/admin/admin-impl/src/test/java/com/enonic/xp/admin/impl/rest/resource/content/ContentSelectorQueryJsonToContentQueryConverterTest.java^213^231+modules/admin/admin-impl/src/test/java/com/enonic/xp/admin/impl/rest/resource/content/ContentSelectorQueryJsonToContentQueryConverterTest.java^253^272,2000d91,c4cc123,"I,11e3976,6-I,55ee9c9,13"
modules/admin/admin-impl/src/test/java/com/enonic/xp/admin/impl/rest/resource/content/ContentSelectorQueryJsonToContentQueryConverterTest.java^278^290+modules/admin/admin-impl/src/test/java/com/enonic/xp/admin/impl/rest/resource/content/ContentSelectorQueryJsonToContentQueryConverterTest.java^329^341,2000d91,1e79afe,"I,11e3976,2-I,6e995ab,1-I,d451579,19"
modules/admin/admin-impl/src/test/java/com/enonic/xp/admin/impl/rest/resource/schema/relationship/RelationshipTypeResourceTest.java^94^111+modules/admin/admin-impl/src/test/java/com/enonic/xp/admin/impl/rest/resource/schema/relationship/RelationshipTypeResourceTest.java^119^135,2000d91,855eca7,"I,c4e6a2d,13-I,184b5b6,1-I,77faa08,9"
modules/admin/admin-impl/src/test/java/com/enonic/xp/admin/impl/rest/resource/application/ApplicationResourceTest.java^46^55+modules/admin/admin-impl/src/test/java/com/enonic/xp/admin/impl/rest/resource/application/ApplicationResourceTest.java^66^75,2000d91,855eca7,"C,cea395f,2-I,4a19174,4"
modules/admin/admin-impl/src/test/java/com/enonic/xp/admin/impl/rest/resource/application/ApplicationResourceTest.java^46^55+modules/admin/admin-impl/src/test/java/com/enonic/xp/admin/impl/rest/resource/application/ApplicationResourceTest.java^87^96,2000d91,855eca7,"C,cea395f,1-I,4a19174,4"
modules/admin/admin-impl/src/test/java/com/enonic/xp/admin/impl/rest/resource/application/ApplicationResourceTest.java^46^55+modules/admin/admin-impl/src/test/java/com/enonic/xp/admin/impl/rest/resource/application/ApplicationResourceTest.java^107^116,2000d91,855eca7,"C,cea395f,1-C,b14c93f,1-I,4a19174,2"
modules/admin/admin-impl/src/test/java/com/enonic/xp/admin/impl/rest/resource/application/ApplicationResourceTest.java^66^75+modules/admin/admin-impl/src/test/java/com/enonic/xp/admin/impl/rest/resource/application/ApplicationResourceTest.java^87^96,2000d91,855eca7,"C,cea395f,1-I,4a19174,4"
modules/admin/admin-impl/src/test/java/com/enonic/xp/admin/impl/rest/resource/application/ApplicationResourceTest.java^66^75+modules/admin/admin-impl/src/test/java/com/enonic/xp/admin/impl/rest/resource/application/ApplicationResourceTest.java^107^116,2000d91,855eca7,"C,cea395f,1-C,b14c93f,1-I,4a19174,2"
modules/admin/admin-impl/src/test/java/com/enonic/xp/admin/impl/rest/resource/application/ApplicationResourceTest.java^87^96+modules/admin/admin-impl/src/test/java/com/enonic/xp/admin/impl/rest/resource/application/ApplicationResourceTest.java^107^116,2000d91,855eca7,"C,b14c93f,1-I,4a19174,2"
modules/admin/admin-impl/src/test/java/com/enonic/xp/admin/impl/rest/resource/content/ContentResourceTest.java^177^189+modules/admin/admin-impl/src/test/java/com/enonic/xp/admin/impl/rest/resource/content/ContentResourceTest.java^777^788,2000d91,1a31be3,"I,b317c94,12"
modules/admin/admin-impl/src/test/java/com/enonic/xp/admin/impl/rest/resource/content/ContentResourceTest.java^243^258+modules/admin/admin-impl/src/test/java/com/enonic/xp/admin/impl/rest/resource/content/ContentResourceTest.java^360^375,2000d91,855eca7,"I,58b8c09,56-I,52c0dd6,2"
modules/admin/admin-impl/src/test/java/com/enonic/xp/admin/impl/rest/resource/content/ContentResourceTest.java^391^403+modules/admin/admin-impl/src/test/java/com/enonic/xp/admin/impl/rest/resource/content/ContentResourceTest.java^409^421,2000d91,66a6f0f,"I,a945bcb,26"
modules/admin/admin-impl/src/test/java/com/enonic/xp/admin/impl/rest/resource/content/ContentResourceTest.java^577^589+modules/admin/admin-impl/src/test/java/com/enonic/xp/admin/impl/rest/resource/content/ContentResourceTest.java^613^626,2000d91,1a31be3,"I,950e225,1-C,b317c94,24"
modules/admin/admin-impl/src/test/java/com/enonic/xp/admin/impl/rest/resource/content/ContentResourceTest.java^675^687+modules/admin/admin-impl/src/test/java/com/enonic/xp/admin/impl/rest/resource/content/ContentResourceTest.java^691^703,2000d91,855eca7,"I,950e225,6"
modules/admin/admin-impl/src/test/java/com/enonic/xp/admin/impl/rest/resource/content/ContentResourceTest.java^814^839+modules/admin/admin-impl/src/test/java/com/enonic/xp/admin/impl/rest/resource/content/ContentResourceTest.java^842^867,2000d91,855eca7,"I,950e225,3-I,d844397,2-I,184b5b6,1-I,ee8a2b6,1-I,de2a369,1-I,146f2f6,16"
modules/admin/admin-impl/src/test/java/com/enonic/xp/admin/impl/rest/resource/content/ContentResourceTest.java^1040^1059+modules/admin/admin-impl/src/test/java/com/enonic/xp/admin/impl/rest/resource/content/ContentResourceTest.java^1091^1110,2000d91,855eca7,"I,2ea3d1b,12-I,6bfcbd5,9-I,de68f6d,14-I,19ad8b5,4-I,8f8b343,1-I,6e0dcd9,1-I,2990c0f,10-I,2f7e8db,2-I,765e99a,4-I,80a619c,7-I,bb0300b,9-I,42640fd,3-I,d1e9026,2-I,47ac805,1-I,86c1d08,4-I,52c0dd6,13-I,738a8b7,4-I,66b0af5,9-I,6fdb7bd,13-I,b1056c9,4"
modules/admin/admin-impl/src/test/java/com/enonic/xp/admin/impl/rest/resource/content/ContentResourceTest.java^1144^1156+modules/admin/admin-impl/src/test/java/com/enonic/xp/admin/impl/rest/resource/content/ContentResourceTest.java^1164^1176,2000d91,855eca7,"I,0245bad,6"
modules/admin/admin-impl/src/main/java/com/enonic/xp/admin/impl/rest/resource/security/json/CreateUserStoreJson.java^20^36+modules/admin/admin-impl/src/main/java/com/enonic/xp/admin/impl/rest/resource/security/json/UpdateUserStoreJson.java^20^37,2000d91,2f7e8db,"I,1adfb6e,4-C,925e67e,4-I,cba0040,4"
modules/admin/admin-impl/src/main/java/com/enonic/xp/admin/impl/rest/resource/content/ContentResource.java^833^860+modules/admin/admin-impl/src/main/java/com/enonic/xp/admin/impl/rest/resource/content/ContentResource.java^864^889,2000d91,855eca7,"I,fdae6b8,4-I,44cdb01,4-I,897d670,1-I,07eb689,1-I,de42666,4-I,c257dbd,1-I,b2d46c2,1-I,cb8f83f,8-I,b69611c,8-I,ae0edd9,6-I,09b0286,17-I,2cabfc2,2"
modules/wem-web/src/main/java/com/enonic/wem/web/rest/account/UserModelTranslator.java^394^430+modules/wem-web/src/main/java/com/enonic/wem/web/rest/account/UserModelTranslator.java^452^488,0670332,72f10cf,"I,d0c4a28,65"
modules/wem-core/src/main/java/com/enonic/wem/core/jcr/AccountJcrDaoImpl.java^155^175+modules/wem-core/src/main/java/com/enonic/wem/core/jcr/AccountJcrDaoImpl.java^225^245,ecf3bf9,855eca7,"C,e30e9d7,1-I,7316907,1-I,8c47320,7-I,c64d115,35-I,6d989cf,8"
modules/wem-web/src/main/java/com/enonic/wem/web/rest/account/AccountController.java^91^106+modules/wem-web/src/main/java/com/enonic/wem/web/rest2/resource/account/AccountResource.java^135^150,c6ee15e,e1ea7ed,"I,9464500,3-I,0f4e19f,27"
modules/wem-web/src/main/java/com/enonic/wem/web/rest/account/AccountController.java^158^190+modules/wem-web/src/main/java/com/enonic/wem/web/rest2/resource/account/AccountResource.java^199^231,c6ee15e,e1ea7ed,"I,0f4e19f,33"
modules/wem-web/src/main/java/com/enonic/wem/web/rest/account/AccountController.java^211^255+modules/wem-web/src/main/java/com/enonic/wem/web/rest2/resource/account/AccountResource.java^252^296,c6ee15e,e1ea7ed,"I,0f4e19f,45"
modules/wem-web/src/main/java/com/enonic/wem/web/rest/account/AccountController.java^272^289+modules/wem-web/src/main/java/com/enonic/wem/web/rest2/resource/account/AccountResource.java^313^330,c6ee15e,e1ea7ed,"I,0f4e19f,18"
modules/wem-web/src/main/java/com/enonic/wem/web/rest/account/AccountController.java^308^334+modules/wem-web/src/main/java/com/enonic/wem/web/rest2/resource/account/AccountResource.java^349^375,c6ee15e,e1ea7ed,"I,0f4e19f,27"
modules/wem-web/src/main/java/com/enonic/wem/web/rest/account/AccountController.java^338^362+modules/wem-web/src/main/java/com/enonic/wem/web/rest2/resource/account/AccountResource.java^379^403,c6ee15e,e1ea7ed,"I,0f4e19f,25"
modules/wem-web/src/main/java/com/enonic/wem/web/rest/account/AccountController.java^366^384+modules/wem-web/src/main/java/com/enonic/wem/web/rest2/resource/account/AccountResource.java^407^425,c6ee15e,e1ea7ed,"I,0f4e19f,19"
modules/wem-web/src/main/java/com/enonic/wem/web/rest/account/AccountController.java^388^431+modules/wem-web/src/main/java/com/enonic/wem/web/rest2/resource/account/AccountResource.java^429^472,c6ee15e,e1ea7ed,"I,0f4e19f,44"
modules/wem-core/src/main/java/com/enonic/wem/core/jcr/AccountJcrDaoImpl.java^160^180+modules/wem-core/src/main/java/com/enonic/wem/core/jcr/AccountJcrDaoImpl.java^230^250,f389b04,855eca7,"I,e30e9d7,1-I,8c47320,27-I,c64d115,31-I,6d989cf,4"
modules/wem-core/src/main/java/com/enonic/wem/core/jcr/AccountJcrDaoImpl.java^160^181+modules/wem-core/src/main/java/com/enonic/wem/core/jcr/AccountJcrDaoImpl.java^259^279,7316907,855eca7,"I,8c47320,15-I,c64d115,18-I,6d989cf,4"
modules/wem-core/src/main/java/com/enonic/wem/core/jcr/AccountJcrDaoImpl.java^162^183+modules/wem-core/src/main/java/com/enonic/wem/core/jcr/AccountJcrDaoImpl.java^292^312,8c47320,855eca7,"I,c64d115,28"
modules/wem-web/src/main/java/com/enonic/wem/web/rest/account/AccountController.java^91^106+modules/wem-web/src/main/java/com/enonic/wem/web/rest2/resource/account/AccountResource.java^134^149,ea7fea4,e1ea7ed,"I,9464500,2-I,0f4e19f,28"
modules/wem-web/src/main/java/com/enonic/wem/web/rest/account/AccountController.java^158^190+modules/wem-web/src/main/java/com/enonic/wem/web/rest2/resource/account/AccountResource.java^193^225,ea7fea4,e1ea7ed,"I,9464500,4-I,0f4e19f,37"
modules/wem-web/src/main/java/com/enonic/wem/web/rest/account/AccountController.java^211^255+modules/wem-web/src/main/java/com/enonic/wem/web/rest2/resource/account/AccountResource.java^246^290,ea7fea4,e1ea7ed,"I,0f4e19f,45"
modules/wem-web/src/main/java/com/enonic/wem/web/rest/account/AccountController.java^272^289+modules/wem-web/src/main/java/com/enonic/wem/web/rest2/resource/account/AccountResource.java^307^324,ea7fea4,e1ea7ed,"I,0f4e19f,18"
modules/wem-web/src/main/java/com/enonic/wem/web/rest/account/AccountController.java^308^334+modules/wem-web/src/main/java/com/enonic/wem/web/rest2/resource/account/AccountResource.java^343^369,ea7fea4,e1ea7ed,"I,0f4e19f,27"
modules/wem-web/src/main/java/com/enonic/wem/web/rest/account/AccountController.java^338^362+modules/wem-web/src/main/java/com/enonic/wem/web/rest2/resource/account/AccountResource.java^373^397,ea7fea4,e1ea7ed,"I,0f4e19f,25"
modules/wem-web/src/main/java/com/enonic/wem/web/rest/account/AccountController.java^366^384+modules/wem-web/src/main/java/com/enonic/wem/web/rest2/resource/account/AccountResource.java^401^419,ea7fea4,e1ea7ed,"I,0f4e19f,19"
modules/wem-web/src/main/java/com/enonic/wem/web/rest/account/AccountController.java^388^431+modules/wem-web/src/main/java/com/enonic/wem/web/rest2/resource/account/AccountResource.java^423^466,ea7fea4,e1ea7ed,"I,0f4e19f,44"
