{
    "synthese_experience_professionnel" : [
        {"annee": "08/2018 - Aujourd'hui" , "entreprise": "Groupe ADSN"  , "fonction": "Architecte syst&egrave;me"},
        {"annee": "2015 - 08/2018" , "entreprise": "SQUAD pour Groupe ADSN(ex-Real.not)"  , "fonction": "Ing&eacute;nieur syst&egrave;me/r&eacute;seau " },
        {"annee": "2006 - 2014" , "entreprise": "Xelians digital (ex SCANECO SAS)" , "fonction": "Responsable d'exploitation " },
        {"annee": "2004 - 2006 " , "entreprise": "Xelians digital (ex SCANECO SAS)" , "fonction": "Technicien d'exploitation"  }
    ],
    "enjeux" : [
        { 
        "entreprise" : "Groupe ADSN" , 
        "description": "REAL.NOT , filliale de l'ADSN (Association pour le developpement du service notarial) a pour but d'innover, construire, d&eacute;ployer, mettre &agrave; disposition des notaires, les technologies et services de pointe n&eacute;cessaires &agrave; leur mission de service public. " 
        },
        { 
        "entreprise" : "Xelians digital (ex SCANECO SAS)" , 
        "description": "SCANECO SAS, filiale d'Archiveco, est un acteur majeur dans le domaine de la num&eacute;risation de document, traitement d'image et traitement WorkFlow. Les pr&eacute;occupations principales de Scaneco s'articulent autour de ces axes : Continuit&eacute; de service  et autonomie fonctionnelle des agences ; le but &eacute;tant de penser le syst&egrave;me d'information afin qu'il soit fonctionnel en cas de panne (&eacute;lectrique, r&eacute;seau, syst&egrave;me) sans intervention d'un technicien mais sous sa supervision. S&eacute;curit&eacute; des donn&eacute;es confi&eacute;es. La plupart des donn&eacute;es  sont d'ordre personnelles et confidentielles(donn&eacute;es bancaires, imposition, brevet technique.)"
        }
    ],
    "experience_professionnel" : [
        { 
            "date": "08/2018 - Aujourd'hui", 
            "label": "Architecte syst&egrave;me au sein d'une &eacute;quipe de 9 personnes", 
            "missions": [
                "Membre actif du projet Kubernetes au sein de l'entreprise",
                "Membre du projet SDS(Software-Define-Storage) : Scality RING",
                "R&eacute;f&eacute;rent sur l'outil d'industrialisation/automatisation",
                "Maintien en condition op&eacute;rationnelle et &eacute;volution du code d'industrialisation",
                "Industrialisation du processus d'installation (Infrastructure as Code)",
                "Administration centralis&eacute;e d'un parc de machine cons&eacute;quent (>1500 syst&egrave;mes)"
            ],
            "css-class":"" 
        },
        { 
            "date": "2015 - 08/2018", 
            "label": "Ing&eacute;nieur syst&egrave;me/r&eacute;seau au sein d'une &eacute;quipe de 9 personnes", 
            "missions": [
                "A partir de 2016, sp&eacute;cialisation sur l'outil IAC et autour des probl&eacute;matiques d'automatisation",
                "Maintien en condition op&eacute;rationnelle et &eacute;volution du code d'industrialisation Automatisation du d&eacute;ploiement de Vm",
                "Industrialisation du processus d'installation (Infrastructure as Code)",
                "Administration centralis&eacute;e d'un parc de machine cons&eacute;quent (>1500 syst&egrave;mes)"
            ],
            "css-class":""
        },
        { 
            "date": "2008-2014", 
            "label": "Responsable Service exploitation au sein d'une &eacute;quipe de 3 personnes dans une Start-Up", 
            "missions": [
                "Gestion d'une &eacute;quipe de technicien",
                "Am&eacute;lioration de l'outil de production et de l'efficacit&eacute; du syst&egrave;me.",
                "Responsable des achats et du renouvellement des contrats de maintenance (mat&eacute;riels et logiciels)",
                "Automatisation du process d'installation des serveurs linux",
                "Administration d'une DMZ : DNS public, serveur de mail, serveur http(s), serveur ftp/ftp-over-ssl"
            ],
            "css-class":""
        },
        { 
            "date": "2004-2008", 
            "label": "Technicien d'exploitation au sein d'une &eacute;quipe de 3 personnes ",
            "missions": [
                "Exploitation de l'outil de production. R&eacute;daction de proc&eacute;dure d'arr&ecirc;t, d&eacute;marrage, r&eacute;solution d'incident.",
                "R&eacute;f&eacute;rent SGBD MySQL aupr&egrave;s de l'&eacute;quipe de d&eacute;veloppement.",
                "Traitement d'appel hotline et cr&eacute;ation de ticket d'incident.",
                "Administration syst&egrave;me et r&eacute;seaux.",
                "Administration et optimisation service : LAMP, Courriel(postfix/dovecot), apache, Mysql, VPN, DNS. Active Directory, DNS, DFS/RFS, profils itin&eacute;rants/mandataires."
            ],
            "css-class":""
        },
        { "date": "", "label": "", "missions": [ "" ],"css-class": "hide"
        }
    ]
}
