{
    "projects" : [
        { 
            "date": "" ,
            "description": " " ,
            "objectifs": [""] ,
            "implications": [
                " "
                ] ,
            "technos": [""],
            "css-class": "hide"
        },
        { 
            "date": "Depuis Juillet 2020" ,
            "description": "Lutte contre les logiciels malveillants" ,
            "objectifs": ["Mettre &agrave; niveau les proc&eacute;dures, la documentation dans le cadre de la pr&eacute;paration d'audit.",
                "Rattraper un dette technique.", "Etudier des solutions novatrices en mati&egrave;re de cyber-s&eacute;curit&eacute;"] ,
            "implications": [
                "Revue documentaire","Conception de l'architecture et d&eacute;ploiementde l'infrastruture"
                ] ,
            "technos": ["EDR","XDR","Virtual patching","Trend deep security"],
            "css-class": ""
        },
        { 
            "date": "De septembre 2020 &agrave;  d&eacutecembre 2020" ,
            "description": "Participation au groupe d'&eacute;tude sur S3" ,
            "objectifs": ["Acqu&eacute;rir un vocabulaire commun sur S3","Banaliser la technologie S3 pour diff&eacute;rents publics","Promouvoir et favoriser l'adoption de S3 au sein de l'entreprise","Cr&eacute;er une note d'expertise pouvant servir d'entrant pour un projet"] ,
            "implications": [
                "Je faisais partie du noyau dur de l'&eacute;quipe d'&eacute;tude pluri-discplinaire"
                ] ,
            "technos": ["S3","S3-Cloudserver","Scality RING"],
            "css-class": ""
        },
        { 
            "date": "Depuis Juin 2019" ,
            "description": "Architecte sur le projet d'int&eacute;gration d'une solution SDS (Software-Define-Storage) : Scality RING" ,
            "objectifs": [
                "Installer et prendre en main la solution Scality RING",
                "Accompagner les &eacute;quipes op&eacute;rationnelles",
                "Migrer un passif cons&eacute;quent (200 To)"
                ],
            "implications": [
                "J'ai industrialis&eacute; l'installation de pr&eacute;-requis n&eacute;cessaire au fonctionement de la solution Scality RING",
                "J'ai construit et d&eacute;ploy&eacute; l'ensemble des syst&egrave;mes",
                "J'ai particip&eacute; &egrave; la mise en place de la solution de SDN (Software-Define-Network)",
                "J'ai cr&eacute;e et mis en oeuvre une application de copie de donn&eacute;es avec v&eacute;rification d'int&eacute;grit&eacute; et suivi de la bonne sant&eacute; de l'environement"
                ] ,
            "technos": [
                "Scality RING",
                "Puppet",
                "HPE Composable Fabric",
                "Python Flask/Celery"
                ],
            "css-class": ""
        },
        { 
            "date": "Entre Juin 2018 et Juillet 2019" ,
            "description": "Participation &agrave; la note d'expertise Kubernetes" ,
            "objectifs": ["Evaluer le produit Kubernetes et prendre en compte les modifications dans les usages et les outils"] ,
            "implications": [
                "J'ai construit le d&eacute;ploiement automatis&eacute; de Cluster Kubernetes avec Puppet",
                "J'ai construit le stockage persistent partag&eacute;",
                "J'ai particip&eacute; &egrave; la cr&eacute;ation d'image docker de base,d'entreprise, middleware et applicative"
                ] ,
            "technos": [
                "Kubernetes",
                "Docker",
                "Glusterfs",
                "Gitlab",
                "Jenkins",
                "Prometheus/Grafana"
            ],
            "css-class": ""
        },
        { 
            "date": "Entre Juin 2017 et Juillet 2019 " ,
            "description": "Mise en place CI/CD pour les modules Puppet" ,
            "objectifs": [
                "Am&eacute;lioration de la fiabilit&eacute; du code IAC"
            ],
            "implications": [
                "J'ai mis en place les tests unitaires et fonctionnelle des modules Puppet gr&agrave;ce &agrave; l'outil Gitlab CI et docker",
                "J'ai form&eacute; les personnes au maintien des tests unitaires en &eacute;tant le r&eacute;f&eacute;rent de l'outils Puppet et Gitlab"
            ],
            "technos": ["Puppet","Beaker","Gitlab","Gitlab-CI","Docker"],
            "css-class": "hide_on_print"
        },
        { 
            "date": "Juin 2018 -> Octobre 2018" ,
            "description": "Mont&eacute;e de version du code des modules Puppet et de l'infrastructure sous jacente " ,
            "objectifs": ["Am&eacute;lioration de la fiabilit&eacute; du code IAC"] ,
            "implications": ["Profiter des nouvelles fonctionalit&eacute;s de l'outils"] ,
            "technos": ["Puppet","Beaker","Gitlab","Gitlab-CI","Docker"],
            "css-class": "hide_on_print"
        },
        { 
            "date": "Avril-Mai-Juin 2018" ,
            "description": "Remplacement de l'outil de VCS " ,
            "objectifs": [
	            "Am&eacute;lioration de la fiabilit&eacute; du versionning et du d&eacute;ploiement de module Puppet",
                "D&eacute;l&eacute;gation plus ais&eacute;e du d&eacute;ploiement de module Puppet"
            ] ,
            "implications": [
                "Mise en place technique",
                "Accompagnement au changement des &eacute;quipes op&eacute;rationnelles"
            ] ,
            "technos": [	
                "Puppet","TheForeman","Gitlab","R10k","Git-Webhook"
            ],
            "css-class": "hide_on_print"
        },
        { 
            "date": "De juillet 2017 &agrave; juillet 2019" ,
            "description": "R&eacute;flexion autour de la mise en place d'un portail de personnalisation de configuration de VM " ,
            "objectifs": ["D&eacute;ploiement de syst&egrave;me personalis&eacute; &egrave; la demande."] ,
            "implications": [
                "R&eacute;flexion en &eacute;quipe afin que le projet profite des comp&eacute;tences et id&eacute;es de chacun.",
                "Cr&eacute;ation d'un produits d'infrastructure"
            ] ,
            "technos": [
                "Puppet", "TheForeman","Django (Serveur d'application en python)","Vmware","Celery","Postgresql"
            ],
            "css-class": "hide_on_print"
        },
        { 
            "date": "De d&eacute;cembre 2016 &agrave; juillet 2019" ,
            "description": "Mise en place d'une m&eacute;thode de cr&eacute;ation de machine virtuelle rapide et facile" ,
            "objectifs": ["Cr&eacute;ation de syst&egrave;me &agrave; la demande."] ,
            "implications": ["Mise en place de profil de serveur","Industrualisation du d&eacute;ploiement de middleware"] ,
            "technos": ["Puppet","TheForeman","Vmware"],
            "css-class": ""
        },
        { 
            "date": "Septembre 2016" ,
            "description": "Refonte des droits d'acc&egrave;s aux serveurs" ,
            "objectifs": ["Refonte des autorisations de connexions"] ,
            "implications": ["En respectant les bonnes pratiques en vigueur et en collaboration avec les &eacute;quipes de Real.Not et CSSI, nous &eacute;tudions l'impl&eacute;mentation afin de garantir la souplesse, la s&eacute;curit&eacute;, la p&eacute;r&eacute;nit&eacute; et la fiabilit&eacute; du SI."] ,
            "technos": ["Active Directory","TheForeman","Python Script"],
            "css-class": "hide_on_print"
        },
        { 
            "date": "Juin/Juillet 2016" ,
            "description": "Participation &egrave; la mise en place du cloud &copy;Communotaire",
            "objectifs": ["Cr&eacute;ation d'un nouvel AD","Migration de machines dans cet AD","Installation de l'agent de migration des machines"] ,
            "implications": ["En bin&ocirc;me, nous avons outill&eacute; l'infrastructure en place afin de r&eacute;aliser cette op&eacute;ration"] ,
            "technos": ["Puppet","TheForeman","Active Directory"],
            "css-class": "hide_on_print"
        },
        { 
            "date": "De f&eacute;vrier 2016 &egrave; juillet 2019" ,
            "description": "Gestion centralis&eacute;e de la configuration de serveur " ,
            "objectifs": ["Limiter autant que faire ce peut les op&eacute;rations manuelles. "] ,
            "implications": [""] ,
            "technos": ["Puppet","TheForeman"],
            "css-class": ""
        },
        { 
            "date": "Novembre/Decembre 2015" ,
            "description": "Gestion centralis&eacute;e de l'installation d'application sur des postes de production" ,
            "objectifs": ["Mise en place de profil de machines selon les besoins de chaque service."] ,
            "implications": [""] ,
            "technos": ["Puppet","TheForeman","Chocolatey","Powershell"],
            "css-class": "hide_on_print"
        },
        { 
            "date": "Janvier-Aout 2013" ,
            "description": "R&eacute;fonte r&eacute;seaux" ,
            "objectifs": ["Refonte de l'adressage IPV4","Mise en place de VLAN ","S'affranchir des probl&egrave;mes de conflit d'adresse IP avec les partenaires reli&eacute; en VPN. "] ,
            "implications": [
                "J'ai r&eacute;fl&eacute;chit sur l'adressage IP,la s&eacute;curit&eacute;, la segmentation logique et confront&eacute; mes id&eacute;es aux remarques de mes collaborateurs.",
                "J'ai personnellement effectu&eacute; la partie technique de cette refonte pour les serveurs et mat&eacute;riels r&eacute;seaux des centres serveurs."
            ],
            "technos": ["VLAN","VLAN Trunk","Agr&eacute;gation de lien","VPN Ipsec"],
            "css-class": "hide_on_print"
        },
        { 
            "date": "2013" ,
            "description": "Mise en place d'un 3&#176; anneau de r&eacute;plication circulaire. Anneau de contr&ocirc;le et configuration." ,
            "objectifs": ["Segmentation du flux de r&eacute;plication.","Optimisation des ressources allou&eacute;es.","Am&eacute;lioration de la rapidit&eacute; de propagation des configurations. "] ,
            "implications": [
                "J'ai configur&eacute; ce 3&#176; anneau qui comptait 5 serveurs.",
                "J'ai adapt&eacute; les processus d'exploitation &egrave; cette modification.",
                "J'ai effectu&eacute; et suivi les demandes de modification du processus m&eacute;tier auprès des d&eacute;veloppeurs."
            ],
            "technos": ["Utilisation experte de MySQL. "],
            "css-class": "hide_on_print"
        },
        { 
            "date": "Aout-Septembre 2012" ,
            "description": "Mise en place d'un service http(s) redond&eacute; multi-sites/multi-liens avec persistance de session" ,
            "objectifs": [
                "Equilibrer la charge de consultation sur l'ensemble des serveurs WEB. ",
                "Assurer la persistance de la session pour un confort utilisateur accru.",
                "Assurer la continuit&eacute; de l'activit&eacute; en cas de d&eacute;faillance des serveurs.",
                "Assurer la continuit&eacute; de l'activit&eacute; en cas de d&eacute;faillance d'un lien internet. "
            ],
            "implications": [
                "J'ai effectu&eacute; ce projet de bout en bout en solo.",
                "Chiffrage, pr&eacute;paration du projet,",
                "mise en place, suivi",
                "Automatisation",
                "R&eacute;daction des proc&eacute;dures",
                "Formation des collaborateurs "
            ] ,
            "technos": ["Reverse Proxy SSL (nginx)","R&eacute;partiteur de charge (Haproxy)","Split view DNS (Bind)","H&ocirc;te virtuel en masse (apache)","Failover (hearbeat)"],
            "css-class": "hide_on_print"
        },
        { 
            "date": "2011-2012" ,
            "description": "Mont&eacute;e en version majeure CentOs 5 x86 => CentOs 6 x64" ,
            "objectifs": [
                "Gestion de l'obsolescence de l'ensemble du parc de serveur linux.",
                "Compilation des applications m&eacute;tiers"
            ] ,
            "implications": [
                "J'ai mis en place un environnement de d&eacute;veloppement et de validation virtualis&eacute;.",
                "J'ai recett&eacute; l'ensemble du processus m&eacute;tier.",
                "J'&eacute;tais le r&eacute;f&eacute;rent de cette migration auprès des d&eacute;veloppeurs.",
                "J'ai cr&eacute;&eacute; les proc&eacute;dures de migration et attribu&eacute; les t&acirc;ches &egrave; mes collaborateurs. "
            ] ,
            "technos": ["Xen","Linux"],
            "css-class": "hide_on_print"
        },
        { 
            "date": "2011" ,
            "description": "Refonte du monitoring : Nagios/Centreon." ,
            "objectifs": [
                "Mise en place de template de serveur et postes de production.",
                "Am&eacute;liorer la r&eacute;activit&eacute; sur incident",
                "Am&eacute;lioration des remont&eacute;es d'information",
                "Mise en place de m&eacute;trologie"
            ] ,
            "implications": ["Mise en place de template service/serveur. "] ,
            "technos": ["Nagios/Centreon (snmp/nrpe/nsca)"],
            "css-class": "hide_on_print"
        },
        { 
            "date": "2011" ,
            "description": "Mise en place de la filiale Tunisienne. " ,
            "objectifs": ["Installation de l'agence &egrave; Tunis et virtualisation des serveurs du site "] ,
            "implications": [
                "J'ai chiffr&eacute; le mat&eacute;riel n&eacute;cessaire et g&eacute;rer l'attribution des t&acirc;ches des collaborateurs",
                "Techniquement, je suis intervenu sur quasiment toutes les t&acirc;ches des collaborateurs afin d'optimiser, v&eacute;rifier, comprendre et documenter.",
                "J'ai  configur&eacute; la r&eacute;plication s&eacute;lective du SGBD."
            ] ,
            "technos": ["Xen","VPN Ipsec","Microsoft : DFS, RFS, profils itin&eacute;rants/mandataires","MySQL : utilisation experte "],
            "css-class": "hide_on_print"
        },
        { 
            "date": "2010" ,
            "description": "Mise en place de l'acc&egrave;s http via un tunnel VPN." ,
            "objectifs": ["Le client souhaitait avoir un accès privil&eacute;gi&eacute; redond&eacute; s&eacute;curis&eacute; via VPN &egrave; la plateforme de consultation de documents. "] ,
            "implications": ["J'ai mis en place un VPN et une adresse IP flottante d&eacute;di&eacute;e et un h&ocirc;te virtuel ssl sur apache."] ,
            "technos": ["Ucarp","VPN Ipsec"],
            "css-class": "hide_on_print"
        },
        { 
            "date": "2010" ,
            "description": "Mise en place de la r&eacute;plication s&eacute;lective sur les postes de production." ,
            "objectifs": ["R&eacute;duire l'utilisation de la bande passante entre le serveur principal et les postes de production. "] ,
            "implications": [
                "J'ai effectu&eacute; l'&eacute;tude pr&eacute;alable, la configuration et la mise en exploitation.",
                "J'ai cr&eacute;&eacute; un script de v&eacute;rification d'alignement des bases. "] ,
            "technos": ["MySQL : Utilisation complexe et experte "],
            "css-class": "hide_on_print"
        },
        { 
            "date": "2007" ,
            "description": "Mise en place de la r&eacute;plication circulaire et multi-instance avec Mysql pour l'agenda partag&eacute; en ligne &copy;Quickmed. " ,
            "objectifs": ["S&eacute;paration des flux de r&eacute;plication. ","Optimisation de l'allocation des ressources serveurs." ] ,
            "implications": [
                "J'ai effectu&eacute; l'&eacute;tude pr&eacute;alable, la configuration et la mise en exploitation."
                ] ,
            "technos": ["MySQL : Utilisation complexe et experte "],
            "css-class": "hide_on_print"
        },
        { 
            "date": "2006" ,
            "description": "Mise en place de la r&eacute;plication circulaire." ,
            "objectifs": ["Rendre autonome les centres serveurs lors de l'int&eacute;gration d'image sur le serveur NAS et des donn&eacute;es dans le SGBD."] ,
            "implications": [
                "J'ai effectu&eacute; l'&eacute;tude pr&eacute;alable, la configuration et la mise en exploitation."
                ] ,
            "technos": ["MySQL : Utilisation complexe et experte "],
            "css-class": "hide_on_print"
        },
        { 
            "date": "2006" ,
            "description": "Ouverture de l'agence de Saint Quentin " ,
            "objectifs": ["Installation des postes et serveurs de l'agence de Saint Quentin"] ,
            "implications": [
                "Avec un collaborateur, j'ai install&eacute; l'agence de Saint Quentin. "
                ] ,
            "technos": [""],
            "css-class": "hide_on_print"
        }
    ]
}
