<mxfile host="65bd71144e">
    <diagram id="6CIydtU9rtTrBHraTvE7" name="Page-1">
        <mxGraphModel dx="2885" dy="1553" grid="1" gridSize="10" guides="1" tooltips="1" connect="1" arrows="1" fold="1" page="1" pageScale="1" pageWidth="827" pageHeight="1169" background="#FFFFFF" math="0" shadow="0">
            <root>
                <mxCell id="0"/>
                <mxCell id="1" parent="0"/>
                <mxCell id="2" value="" style="rounded=0;whiteSpace=wrap;html=1;fontColor=#000000;" parent="1" vertex="1">
                    <mxGeometry x="-299.5" y="-38" width="479" height="280" as="geometry"/>
                </mxCell>
                <mxCell id="3" value="" style="rounded=0;whiteSpace=wrap;html=1;fontColor=#000000;" parent="1" vertex="1">
                    <mxGeometry x="-1160" y="-38" width="479" height="280" as="geometry"/>
                </mxCell>
                <mxCell id="4" value="" style="rounded=0;whiteSpace=wrap;html=1;fontColor=#000000;" parent="1" vertex="1">
                    <mxGeometry x="490" y="-41" width="390" height="280" as="geometry"/>
                </mxCell>
                <mxCell id="6" value="" style="rounded=0;whiteSpace=wrap;html=1;fontColor=#000000;" parent="1" vertex="1">
                    <mxGeometry x="-630" y="480" width="915" height="360" as="geometry"/>
                </mxCell>
                <mxCell id="7" value="&lt;div&gt;Ancienne plateforme &lt;br&gt;&lt;/div&gt;&lt;div&gt;de stockage&lt;br&gt;&lt;/div&gt;" style="shadow=0;dashed=0;html=1;strokeColor=none;fillColor=#505050;labelPosition=center;verticalLabelPosition=bottom;verticalAlign=top;outlineConnect=0;align=center;shape=mxgraph.office.servers.file_server;fontColor=#000000;" parent="1" vertex="1">
                    <mxGeometry x="-1107.5" y="-14" width="45" height="56" as="geometry"/>
                </mxCell>
                <mxCell id="8" value="&lt;div&gt;ancien &lt;br&gt;&lt;/div&gt;&lt;div&gt;partage&lt;br&gt;&lt;/div&gt;" style="html=1;verticalLabelPosition=top;align=center;verticalAlign=bottom;strokeWidth=2;strokeColor=#0080F0;shadow=0;dashed=0;shape=mxgraph.ios7.icons.share;rotation=0;labelPosition=center;textDirection=ltr;fontSize=8;fillColor=none;fontColor=#000000;" parent="1" vertex="1">
                    <mxGeometry x="-514" y="56.5" width="21" height="28.5" as="geometry"/>
                </mxCell>
                <mxCell id="9" value="" style="endArrow=classic;html=1;entryX=-0.04;entryY=0.632;entryDx=0;entryDy=0;entryPerimeter=0;fillColor=#ffe6cc;strokeColor=#D79B00;exitX=1;exitY=0.5;exitDx=0;exitDy=0;fontColor=#000000;" parent="1" source="3" target="8" edge="1">
                    <mxGeometry width="50" height="50" relative="1" as="geometry">
                        <mxPoint x="-680" y="81" as="sourcePoint"/>
                        <mxPoint x="-330" y="-165.5" as="targetPoint"/>
                    </mxGeometry>
                </mxCell>
                <mxCell id="10" value="&lt;font&gt;partage&lt;/font&gt;" style="text;html=1;resizable=0;points=[];align=center;verticalAlign=middle;fontSize=10;fontColor=#000000;" parent="9" vertex="1" connectable="0">
                    <mxGeometry x="0.085" relative="1" as="geometry">
                        <mxPoint as="offset"/>
                    </mxGeometry>
                </mxCell>
                <mxCell id="11" value="&lt;div&gt;Nouvelle plateforme&amp;nbsp;&lt;/div&gt;&lt;div&gt;de stockage&lt;/div&gt;" style="shadow=0;dashed=0;html=1;strokeColor=#000000;fillColor=#66FF66;labelPosition=center;verticalLabelPosition=bottom;verticalAlign=top;outlineConnect=0;align=center;shape=mxgraph.office.servers.file_server;fontSize=10;fontColor=#000000;" parent="1" vertex="1">
                    <mxGeometry x="524.5" y="0.5" width="45" height="56" as="geometry"/>
                </mxCell>
                <mxCell id="15" value="&lt;div&gt;nouveau&lt;br&gt;&lt;/div&gt;&lt;div&gt;partage&lt;br&gt;&lt;/div&gt;" style="html=1;verticalLabelPosition=top;align=center;verticalAlign=bottom;strokeWidth=2;strokeColor=#0080F0;shadow=0;dashed=0;shape=mxgraph.ios7.icons.share;rotation=0;labelPosition=center;textDirection=ltr;fontSize=8;fillColor=none;fontColor=#000000;" parent="1" vertex="1">
                    <mxGeometry x="324" y="66" width="21" height="28.5" as="geometry"/>
                </mxCell>
                <mxCell id="16" value="" style="endArrow=classic;html=1;entryX=0.962;entryY=0.684;entryDx=0;entryDy=0;entryPerimeter=0;fillColor=#ffe6cc;strokeColor=#D79B00;exitX=0;exitY=0.5;exitDx=0;exitDy=0;fontColor=#000000;" parent="1" source="4" target="15" edge="1">
                    <mxGeometry width="50" height="50" relative="1" as="geometry">
                        <mxPoint x="130" y="289.7724719101125" as="sourcePoint"/>
                        <mxPoint x="297" y="-41.5" as="targetPoint"/>
                    </mxGeometry>
                </mxCell>
                <mxCell id="17" value="&lt;font&gt;partage&lt;/font&gt;" style="text;html=1;resizable=0;points=[];align=center;verticalAlign=middle;fontSize=10;fontColor=#000000;" parent="16" vertex="1" connectable="0">
                    <mxGeometry x="0.085" relative="1" as="geometry">
                        <mxPoint as="offset"/>
                    </mxGeometry>
                </mxCell>
                <mxCell id="18" value="controller-plane" style="shadow=0;dashed=0;html=1;strokeColor=none;fillColor=#FF3333;labelPosition=center;verticalLabelPosition=bottom;verticalAlign=top;outlineConnect=0;align=center;shape=mxgraph.office.servers.application_server_orange;fontColor=#000000;" parent="1" vertex="1">
                    <mxGeometry x="-560" y="500" width="46" height="56" as="geometry"/>
                </mxCell>
                <mxCell id="19" value="runner-plane" style="shadow=0;dashed=0;html=1;strokeColor=none;fillColor=#505050;labelPosition=center;verticalLabelPosition=bottom;verticalAlign=top;outlineConnect=0;align=center;shape=mxgraph.office.servers.server_farm;fillColor=#DA4026;fontColor=#000000;" parent="1" vertex="1">
                    <mxGeometry x="-80" y="-25" width="80" height="67" as="geometry"/>
                </mxCell>
                <mxCell id="20" value="" style="endArrow=classic;html=1;entryX=1.128;entryY=0.849;entryDx=0;entryDy=0;entryPerimeter=0;strokeColor=#7EA6E0;exitX=0;exitY=0.25;exitDx=0;exitDy=0;fontColor=#000000;" parent="1" source="2" target="8" edge="1">
                    <mxGeometry width="50" height="50" relative="1" as="geometry">
                        <mxPoint x="-280" y="54" as="sourcePoint"/>
                        <mxPoint x="-110" y="370" as="targetPoint"/>
                    </mxGeometry>
                </mxCell>
                <mxCell id="21" value="montage" style="text;html=1;resizable=0;points=[];align=center;verticalAlign=middle;fontColor=#000000;" parent="20" vertex="1" connectable="0">
                    <mxGeometry x="0.1206" y="1" relative="1" as="geometry">
                        <mxPoint as="offset"/>
                    </mxGeometry>
                </mxCell>
                <mxCell id="22" value="" style="endArrow=classic;html=1;strokeColor=#7EA6E0;exitX=1;exitY=0.25;exitDx=0;exitDy=0;fontColor=#000000;" parent="1" source="2" target="15" edge="1">
                    <mxGeometry width="50" height="50" relative="1" as="geometry">
                        <mxPoint x="88" y="54" as="sourcePoint"/>
                        <mxPoint x="-366.31034482758605" y="238.68965517241384" as="targetPoint"/>
                    </mxGeometry>
                </mxCell>
                <mxCell id="23" value="montage" style="text;html=1;resizable=0;points=[];align=center;verticalAlign=middle;fontColor=#000000;" parent="22" vertex="1" connectable="0">
                    <mxGeometry x="0.1206" y="1" relative="1" as="geometry">
                        <mxPoint as="offset"/>
                    </mxGeometry>
                </mxCell>
                <mxCell id="24" value="postgresql 5432" style="html=1;outlineConnect=0;whiteSpace=wrap;fillColor=#99ffff;strokeColor=#000000;shape=mxgraph.archimate3.application;appType=serv;archiType=rounded;verticalAlign=top;fontColor=#000000;" parent="1" vertex="1">
                    <mxGeometry x="-616" y="641" width="123" height="38" as="geometry"/>
                </mxCell>
                <mxCell id="25" value="&lt;div&gt;dtransfert tcp:5000&lt;br&gt;&lt;/div&gt;&lt;div&gt;via apache tcp:80&lt;/div&gt;" style="html=1;outlineConnect=0;whiteSpace=wrap;fillColor=#99ffff;strokeColor=#000000;shape=mxgraph.archimate3.application;appType=serv;archiType=rounded;verticalAlign=top;fontColor=#000000;" parent="1" vertex="1">
                    <mxGeometry x="104.5" y="761" width="150" height="38" as="geometry"/>
                </mxCell>
                <mxCell id="26" value="&lt;div&gt;rabbitmq 5672&lt;/div&gt;&lt;div&gt;rabbitmqadm 15672&lt;br&gt;&lt;/div&gt;" style="html=1;outlineConnect=0;whiteSpace=wrap;fillColor=#99ffff;strokeColor=#000000;shape=mxgraph.archimate3.application;appType=serv;archiType=rounded;verticalAlign=top;fontColor=#000000;" parent="1" vertex="1">
                    <mxGeometry x="-313.5" y="641" width="170" height="38" as="geometry"/>
                </mxCell>
                <mxCell id="29" value="&lt;div&gt;dtransfert&lt;/div&gt;&lt;div&gt;celery worker&lt;br&gt;&lt;/div&gt;" style="html=1;outlineConnect=0;whiteSpace=wrap;fillColor=#99ffff;strokeColor=#000000;shape=mxgraph.archimate3.application;appType=serv;archiType=rounded;verticalAlign=top;fontColor=#000000;" parent="1" vertex="1">
                    <mxGeometry x="-270" y="142" width="180" height="38" as="geometry"/>
                </mxCell>
                <mxCell id="30" value="&lt;div&gt;api&lt;/div&gt;&lt;div&gt;rest&lt;br&gt;&lt;/div&gt;" style="html=1;outlineConnect=0;whiteSpace=wrap;fillColor=#99ffff;strokeColor=#000000;shape=mxgraph.archimate3.component;fontSize=10;align=right;fontColor=#000000;" parent="1" vertex="1">
                    <mxGeometry x="44.5" y="488" width="60" height="60" as="geometry"/>
                </mxCell>
                <mxCell id="31" value="" style="edgeStyle=elbowEdgeStyle;html=1;endArrow=open;elbow=vertical;endFill=1;exitX=0.5;exitY=0;exitDx=0;exitDy=0;exitPerimeter=0;entryX=0.625;entryY=1;entryDx=0;entryDy=0;entryPerimeter=0;fontColor=#000000;" parent="1" source="25" target="60" edge="1">
                    <mxGeometry width="160" relative="1" as="geometry">
                        <mxPoint x="130" y="840" as="sourcePoint"/>
                        <mxPoint x="290" y="840" as="targetPoint"/>
                    </mxGeometry>
                </mxCell>
                <mxCell id="33" value="&lt;div&gt;snmpd&lt;/div&gt;&lt;div&gt;tcp : 161&lt;/div&gt;" style="html=1;outlineConnect=0;whiteSpace=wrap;fillColor=#99ffff;strokeColor=#000000;shape=mxgraph.archimate3.application;appType=serv;archiType=rounded;verticalAlign=top;fontColor=#000000;" parent="1" vertex="1">
                    <mxGeometry x="524.5" y="124" width="178" height="37" as="geometry"/>
                </mxCell>
                <mxCell id="34" value="&lt;div&gt;snmpd&lt;/div&gt;&lt;div&gt;tcp : 161&lt;/div&gt;" style="html=1;outlineConnect=0;whiteSpace=wrap;fillColor=#99ffff;strokeColor=#000000;shape=mxgraph.archimate3.application;appType=serv;archiType=rounded;verticalAlign=top;fontColor=#000000;" parent="1" vertex="1">
                    <mxGeometry x="-30" y="142" width="178" height="37" as="geometry"/>
                </mxCell>
                <mxCell id="35" value="produit/consome" style="edgeStyle=elbowEdgeStyle;html=1;endArrow=block;dashed=1;elbow=vertical;endFill=1;dashPattern=6 4;exitX=0.5;exitY=1;exitDx=0;exitDy=0;exitPerimeter=0;entryX=1;entryY=0.5;entryDx=0;entryDy=0;entryPerimeter=0;startArrow=block;startFill=1;fontColor=#000000;" parent="1" source="44" target="26" edge="1">
                    <mxGeometry width="160" relative="1" as="geometry">
                        <mxPoint x="230" y="660" as="sourcePoint"/>
                        <mxPoint x="390" y="660" as="targetPoint"/>
                        <Array as="points">
                            <mxPoint x="10" y="660"/>
                            <mxPoint x="80" y="760"/>
                        </Array>
                    </mxGeometry>
                </mxCell>
                <mxCell id="36" value="" style="edgeStyle=elbowEdgeStyle;html=1;endArrow=open;elbow=vertical;endFill=1;exitX=0.5;exitY=0;exitDx=0;exitDy=0;exitPerimeter=0;entryX=1;entryY=0.5;entryDx=0;entryDy=0;entryPerimeter=0;fontColor=#000000;" parent="1" source="25" target="30" edge="1">
                    <mxGeometry width="160" relative="1" as="geometry">
                        <mxPoint x="50" y="830" as="sourcePoint"/>
                        <mxPoint x="210" y="830" as="targetPoint"/>
                        <Array as="points">
                            <mxPoint x="160" y="518"/>
                            <mxPoint x="130" y="558"/>
                            <mxPoint x="123" y="580"/>
                        </Array>
                    </mxGeometry>
                </mxCell>
                <mxCell id="37" value="&lt;div style=&quot;font-size: 11px;&quot;&gt;porte la &lt;br style=&quot;font-size: 11px;&quot;&gt;&lt;/div&gt;&lt;div style=&quot;font-size: 11px;&quot;&gt;fonctionnalité&lt;br style=&quot;font-size: 11px;&quot;&gt;&lt;/div&gt;" style="text;html=1;resizable=0;points=[];align=center;verticalAlign=middle;fontSize=11;fontColor=#000000;" parent="36" vertex="1" connectable="0">
                    <mxGeometry x="-0.3115" y="-1" relative="1" as="geometry">
                        <mxPoint x="10.5" y="-15" as="offset"/>
                    </mxGeometry>
                </mxCell>
                <mxCell id="38" value="" style="edgeStyle=elbowEdgeStyle;html=1;endArrow=block;dashed=1;elbow=vertical;endFill=1;dashPattern=6 4;exitX=0;exitY=0.5;exitDx=0;exitDy=0;exitPerimeter=0;entryX=0.75;entryY=0;entryDx=0;entryDy=0;entryPerimeter=0;fontColor=#000000;" parent="1" source="41" target="26" edge="1">
                    <mxGeometry width="160" relative="1" as="geometry">
                        <mxPoint x="-110" y="600" as="sourcePoint"/>
                        <mxPoint x="50" y="600" as="targetPoint"/>
                        <Array as="points">
                            <mxPoint x="-62" y="620"/>
                            <mxPoint x="30" y="554"/>
                        </Array>
                    </mxGeometry>
                </mxCell>
                <mxCell id="39" value="produit " style="text;html=1;resizable=0;points=[];align=center;verticalAlign=middle;fontColor=#000000;" parent="38" vertex="1" connectable="0">
                    <mxGeometry x="0.0504" y="1" relative="1" as="geometry">
                        <mxPoint as="offset"/>
                    </mxGeometry>
                </mxCell>
                <mxCell id="40" value="&lt;div&gt;snmpd&lt;/div&gt;&lt;div&gt;tcp : 161&lt;/div&gt;" style="html=1;outlineConnect=0;whiteSpace=wrap;fillColor=#99ffff;strokeColor=#000000;shape=mxgraph.archimate3.application;appType=serv;archiType=rounded;verticalAlign=top;fontColor=#000000;" parent="1" vertex="1">
                    <mxGeometry x="-1028.5" y="127.5" width="178" height="37" as="geometry"/>
                </mxCell>
                <mxCell id="41" value="&lt;div&gt;message de taches : type transfert&lt;br&gt;&lt;/div&gt;" style="html=1;outlineConnect=0;whiteSpace=wrap;fillColor=#AFFFAF;strokeColor=#000000;shape=mxgraph.archimate3.artifact;fontColor=#000000;" parent="1" vertex="1">
                    <mxGeometry x="-170" y="535" width="130" height="46" as="geometry"/>
                </mxCell>
                <mxCell id="42" value="" style="edgeStyle=elbowEdgeStyle;html=1;endArrow=block;dashed=1;elbow=vertical;endFill=1;dashPattern=6 4;exitX=0;exitY=0.675;exitDx=0;exitDy=0;exitPerimeter=0;entryX=0.5;entryY=0;entryDx=0;entryDy=0;entryPerimeter=0;fontColor=#000000;" parent="1" source="30" target="41" edge="1">
                    <mxGeometry width="160" relative="1" as="geometry">
                        <mxPoint x="87" y="554" as="sourcePoint"/>
                        <mxPoint x="-53" y="652" as="targetPoint"/>
                        <Array as="points"/>
                    </mxGeometry>
                </mxCell>
                <mxCell id="43" value="produit " style="text;html=1;resizable=0;points=[];align=center;verticalAlign=middle;fontColor=#000000;" parent="42" vertex="1" connectable="0">
                    <mxGeometry x="0.0504" y="1" relative="1" as="geometry">
                        <mxPoint as="offset"/>
                    </mxGeometry>
                </mxCell>
                <mxCell id="44" value="&lt;div&gt;message de taches:&lt;/div&gt;&lt;div&gt;type healthcheck&lt;/div&gt;" style="html=1;outlineConnect=0;whiteSpace=wrap;fillColor=#AFFFAF;strokeColor=#000000;shape=mxgraph.archimate3.artifact;fontColor=#000000;" parent="1" vertex="1">
                    <mxGeometry x="-10" y="595" width="118" height="46" as="geometry"/>
                </mxCell>
                <mxCell id="45" value="produit/consome" style="edgeStyle=elbowEdgeStyle;html=1;endArrow=block;dashed=1;elbow=vertical;endFill=1;dashPattern=6 4;exitX=0;exitY=0.325;exitDx=0;exitDy=0;exitPerimeter=0;startArrow=block;startFill=1;entryX=1;entryY=0.75;entryDx=0;entryDy=0;entryPerimeter=0;fontColor=#000000;" parent="1" source="60" target="44" edge="1">
                    <mxGeometry width="160" relative="1" as="geometry">
                        <mxPoint x="229" y="554" as="sourcePoint"/>
                        <mxPoint x="200" y="753" as="targetPoint"/>
                        <Array as="points">
                            <mxPoint x="190" y="580"/>
                            <mxPoint x="190" y="530"/>
                            <mxPoint x="250" y="765"/>
                            <mxPoint x="250" y="720"/>
                            <mxPoint x="250" y="760"/>
                        </Array>
                    </mxGeometry>
                </mxCell>
                <mxCell id="46" value="&lt;div&gt;message de taches : &lt;br&gt;&lt;/div&gt;&lt;div&gt;type transfert&lt;br&gt;&lt;/div&gt;" style="html=1;outlineConnect=0;whiteSpace=wrap;fillColor=#AFFFAF;strokeColor=#000000;shape=mxgraph.archimate3.artifact;fontColor=#000000;" parent="1" vertex="1">
                    <mxGeometry x="-330" y="494" width="116" height="46" as="geometry"/>
                </mxCell>
                <mxCell id="47" value="" style="edgeStyle=elbowEdgeStyle;html=1;endArrow=block;dashed=1;elbow=vertical;endFill=1;dashPattern=6 4;exitX=0.5;exitY=1;exitDx=0;exitDy=0;exitPerimeter=0;entryX=0.25;entryY=0;entryDx=0;entryDy=0;entryPerimeter=0;fontColor=#000000;" parent="1" source="46" target="26" edge="1">
                    <mxGeometry width="160" relative="1" as="geometry">
                        <mxPoint x="-35" y="566" as="sourcePoint"/>
                        <mxPoint x="-72" y="659" as="targetPoint"/>
                        <Array as="points">
                            <mxPoint x="-260" y="590"/>
                            <mxPoint x="-180" y="640"/>
                            <mxPoint x="-52" y="630"/>
                            <mxPoint x="40" y="564"/>
                        </Array>
                    </mxGeometry>
                </mxCell>
                <mxCell id="48" value="consomme" style="text;html=1;resizable=0;points=[];align=center;verticalAlign=middle;fontColor=#000000;" parent="47" vertex="1" connectable="0">
                    <mxGeometry x="0.0504" y="1" relative="1" as="geometry">
                        <mxPoint as="offset"/>
                    </mxGeometry>
                </mxCell>
                <mxCell id="49" value="" style="edgeStyle=elbowEdgeStyle;html=1;endArrow=block;dashed=1;elbow=vertical;endFill=1;dashPattern=6 4;exitX=0.5;exitY=1;exitDx=0;exitDy=0;exitPerimeter=0;entryX=0.25;entryY=0;entryDx=0;entryDy=0;entryPerimeter=0;fontColor=#000000;" parent="1" source="29" target="46" edge="1">
                    <mxGeometry width="160" relative="1" as="geometry">
                        <mxPoint x="-157" y="659" as="sourcePoint"/>
                        <mxPoint x="-145" y="564" as="targetPoint"/>
                        <Array as="points">
                            <mxPoint x="-200" y="390"/>
                            <mxPoint x="-170" y="420"/>
                            <mxPoint x="50" y="574"/>
                        </Array>
                    </mxGeometry>
                </mxCell>
                <mxCell id="50" value="consomme" style="text;html=1;resizable=0;points=[];align=center;verticalAlign=middle;fontColor=#000000;" parent="49" vertex="1" connectable="0">
                    <mxGeometry x="0.0504" y="1" relative="1" as="geometry">
                        <mxPoint x="18" y="-81" as="offset"/>
                    </mxGeometry>
                </mxCell>
                <mxCell id="51" value="" style="edgeStyle=elbowEdgeStyle;html=1;endArrow=open;elbow=vertical;endFill=0;dashed=1;dashPattern=1 4;entryX=0.5;entryY=1;entryDx=0;entryDy=0;entryPerimeter=0;exitX=0.625;exitY=0;exitDx=0;exitDy=0;exitPerimeter=0;fontColor=#000000;" parent="1" source="60" target="34" edge="1">
                    <mxGeometry width="160" relative="1" as="geometry">
                        <mxPoint x="40" y="370" as="sourcePoint"/>
                        <mxPoint x="200" y="370" as="targetPoint"/>
                        <Array as="points">
                            <mxPoint x="190" y="360"/>
                            <mxPoint x="130" y="370"/>
                            <mxPoint x="170" y="330"/>
                        </Array>
                    </mxGeometry>
                </mxCell>
                <mxCell id="52" value="interroge" style="text;html=1;resizable=0;points=[];align=center;verticalAlign=middle;fontColor=#000000;" parent="51" vertex="1" connectable="0">
                    <mxGeometry x="0.0497" y="-2" relative="1" as="geometry">
                        <mxPoint x="104.5" y="2" as="offset"/>
                    </mxGeometry>
                </mxCell>
                <mxCell id="53" value="" style="edgeStyle=elbowEdgeStyle;html=1;endArrow=open;elbow=vertical;endFill=0;dashed=1;dashPattern=1 4;exitX=0.625;exitY=0;exitDx=0;exitDy=0;exitPerimeter=0;entryX=0.25;entryY=1;entryDx=0;entryDy=0;entryPerimeter=0;fontColor=#000000;" parent="1" source="60" target="33" edge="1">
                    <mxGeometry width="160" relative="1" as="geometry">
                        <mxPoint x="243" y="504" as="sourcePoint"/>
                        <mxPoint x="55" y="189" as="targetPoint"/>
                        <Array as="points">
                            <mxPoint x="280" y="360"/>
                            <mxPoint x="430" y="330"/>
                            <mxPoint x="340" y="280"/>
                        </Array>
                    </mxGeometry>
                </mxCell>
                <mxCell id="54" value="" style="edgeStyle=elbowEdgeStyle;html=1;endArrow=open;elbow=vertical;endFill=0;dashed=1;dashPattern=1 4;entryX=0.5;entryY=1;entryDx=0;entryDy=0;entryPerimeter=0;exitX=0.625;exitY=0;exitDx=0;exitDy=0;exitPerimeter=0;fontColor=#000000;" parent="1" source="60" target="40" edge="1">
                    <mxGeometry width="160" relative="1" as="geometry">
                        <mxPoint x="243" y="504" as="sourcePoint"/>
                        <mxPoint x="55" y="189" as="targetPoint"/>
                        <Array as="points">
                            <mxPoint x="257" y="360"/>
                            <mxPoint x="257" y="360"/>
                            <mxPoint x="-300" y="360"/>
                        </Array>
                    </mxGeometry>
                </mxCell>
                <mxCell id="57" value="stocke" style="edgeStyle=elbowEdgeStyle;html=1;endArrow=block;dashed=0;elbow=vertical;endFill=1;exitX=0;exitY=0.5;exitDx=0;exitDy=0;exitPerimeter=0;fontColor=#000000;" parent="1" source="25" target="62" edge="1">
                    <mxGeometry width="160" relative="1" as="geometry">
                        <mxPoint x="-230" y="750" as="sourcePoint"/>
                        <mxPoint x="-70" y="750" as="targetPoint"/>
                    </mxGeometry>
                </mxCell>
                <mxCell id="58" value="stocke" style="edgeStyle=elbowEdgeStyle;html=1;endArrow=block;dashed=0;elbow=vertical;endFill=1;exitX=0;exitY=1;exitDx=2.9;exitDy=-2.9;exitPerimeter=0;fontColor=#000000;labelBackgroundColor=none;" parent="1" source="29" target="62" edge="1">
                    <mxGeometry width="160" relative="1" as="geometry">
                        <mxPoint x="115" y="790" as="sourcePoint"/>
                        <mxPoint x="-493" y="689" as="targetPoint"/>
                        <Array as="points">
                            <mxPoint x="-370" y="320"/>
                            <mxPoint x="-440" y="440"/>
                        </Array>
                    </mxGeometry>
                </mxCell>
                <mxCell id="59" value="" style="group;fontColor=#000000;" parent="1" vertex="1" connectable="0">
                    <mxGeometry x="218" y="558" width="62" height="67" as="geometry"/>
                </mxCell>
                <mxCell id="60" value="&lt;div&gt;health&lt;/div&gt;&lt;div&gt;check&lt;/div&gt;" style="html=1;outlineConnect=0;whiteSpace=wrap;fillColor=#99ffff;strokeColor=#000000;shape=mxgraph.archimate3.component;fontSize=10;labelPosition=center;verticalLabelPosition=middle;align=right;verticalAlign=middle;fontColor=#000000;" parent="59" vertex="1">
                    <mxGeometry y="7" width="62" height="60" as="geometry"/>
                </mxCell>
                <mxCell id="61" value="" style="shadow=0;dashed=0;html=1;strokeColor=none;fillColor=#505050;labelPosition=center;verticalLabelPosition=bottom;verticalAlign=top;outlineConnect=0;align=center;shape=mxgraph.office.concepts.clock;fontColor=#000000;" parent="59" vertex="1">
                    <mxGeometry x="12" width="19" height="20" as="geometry"/>
                </mxCell>
                <mxCell id="62" value="" style="shadow=0;dashed=0;html=1;strokeColor=none;labelPosition=center;verticalLabelPosition=bottom;verticalAlign=top;outlineConnect=0;align=center;shape=mxgraph.office.databases.database_mini_1;fillColor=#7FBA42;fontColor=#000000;" parent="1" vertex="1">
                    <mxGeometry x="-440" y="646.5" width="35" height="27" as="geometry"/>
                </mxCell>
                <mxCell id="63" value="" style="edgeStyle=elbowEdgeStyle;html=1;endArrow=block;dashed=0;elbow=vertical;endFill=1;exitX=1;exitY=0.5;exitDx=0;exitDy=0;exitPerimeter=0;fontColor=#000000;" parent="1" source="24" target="62" edge="1">
                    <mxGeometry width="160" relative="1" as="geometry">
                        <mxPoint x="-540" y="880" as="sourcePoint"/>
                        <mxPoint x="-380" y="880" as="targetPoint"/>
                    </mxGeometry>
                </mxCell>
                <mxCell id="64" value="porte" style="text;html=1;resizable=0;points=[];align=center;verticalAlign=middle;fontColor=#000000;" parent="63" vertex="1" connectable="0">
                    <mxGeometry y="-12" relative="1" as="geometry">
                        <mxPoint x="-3.5" y="-12" as="offset"/>
                    </mxGeometry>
                </mxCell>
                <mxCell id="65" value="" style="shadow=0;dashed=0;html=1;strokeColor=none;fillColor=#505050;labelPosition=center;verticalLabelPosition=bottom;verticalAlign=top;outlineConnect=0;align=center;shape=mxgraph.office.communications.xmpp_service;fontColor=#000000;" parent="1" vertex="1">
                    <mxGeometry x="150.5" y="960" width="58" height="52" as="geometry"/>
                </mxCell>
                <mxCell id="66" value="notifie" style="endArrow=classic;html=1;exitX=0.5;exitY=1;exitDx=0;exitDy=0;exitPerimeter=0;fontColor=#000000;labelBackgroundColor=none;" parent="1" source="25" target="65" edge="1">
                    <mxGeometry width="50" height="50" relative="1" as="geometry">
                        <mxPoint x="-30" y="990" as="sourcePoint"/>
                        <mxPoint x="20" y="940" as="targetPoint"/>
                    </mxGeometry>
                </mxCell>
                <mxCell id="67" value="adapte" style="endArrow=classic;html=1;entryX=1;entryY=1;entryDx=-2.9;entryDy=-2.9;entryPerimeter=0;exitX=0.25;exitY=0;exitDx=0;exitDy=0;exitPerimeter=0;fontColor=#000000;labelBackgroundColor=none;" edge="1" parent="1" source="60" target="29">
                    <mxGeometry width="50" height="50" relative="1" as="geometry">
                        <mxPoint x="-80" y="370" as="sourcePoint"/>
                        <mxPoint x="-30" y="320" as="targetPoint"/>
                    </mxGeometry>
                </mxCell>
            </root>
        </mxGraphModel>
    </diagram>
</mxfile>