<?xml version="1.0"?>
<svg xmlns="http://www.w3.org/2000/svg" width="81" height="81" viewBox="0 0 81 81" fill="none">
<path d="M6.25 63V21C6.25 18.9289 7.92893 17.25 10 17.25H23.5H70C72.0711 17.25 73.75 18.9289 73.75 21V63C73.75 65.0711 72.0711 66.75 70 66.75H23.5H10C7.92893 66.75 6.25 65.0711 6.25 63Z" stroke="#F14D34" stroke-width="2.5"/>
<path d="M30.5 24H37.5" stroke="#F14D34" stroke-width="2.5"/>
<path d="M11 24H18" stroke="#F14D34" stroke-width="2.5"/>
<path d="M11 35H18" stroke="#F14D34" stroke-width="2.5"/>
<path d="M11 41H18" stroke="#F14D34" stroke-width="2.5"/>
<path d="M11 47H18" stroke="#F14D34" stroke-width="2.5"/>
<path d="M11 53H15" stroke="#F14D34" stroke-width="2.5"/>
<path d="M41 24H48" stroke="#F14D34" stroke-width="2.5"/>
<path d="M52 24H59" stroke="#F14D34" stroke-width="2.5"/>
<path d="M36.852 48.168C38.56 48.168 39.974 47.552 40.898 46.418L39.442 45.074C38.784 45.844 37.958 46.236 36.978 46.236C35.144 46.236 33.842 44.948 33.842 43.1C33.842 41.252 35.144 39.964 36.978 39.964C37.958 39.964 38.784 40.356 39.442 41.112L40.898 39.768C39.974 38.648 38.56 38.032 36.866 38.032C33.814 38.032 31.546 40.146 31.546 43.1C31.546 46.054 33.814 48.168 36.852 48.168ZM51.1096 48L48.9116 44.85C50.1856 44.304 50.9276 43.226 50.9276 41.756C50.9276 39.558 49.2896 38.2 46.6716 38.2H42.4296V48H44.6976V45.27H46.6716H46.7836L48.6736 48H51.1096ZM48.6316 41.756C48.6316 42.82 47.9316 43.464 46.5456 43.464H44.6976V40.048H46.5456C47.9316 40.048 48.6316 40.678 48.6316 41.756ZM63.7705 48L63.7425 38.2H61.8805L58.2685 44.29L54.6005 38.2H52.7245V48H54.8525V42.246L57.7225 46.964H58.7445L61.6285 42.12L61.6425 48H63.7705Z" fill="#050C33"/>
</svg>
