﻿,Normalised egress,Repeat 1,Repeat 2,Repeat 3,Average
4 hr,Media,112.7675719,72.35257249,98.09984291,94.40666245
,C1,74.07927013,76.59674344,73.19328843,74.62310067
8 hr wash out,Media,92.14026471,88.5195463,107.5640328,96.07461461
,C1 ,89.99079107,94.71237148,96.99770611,93.90028955
8 hr no wash out,Media ,93.56060743,99.28178589,116.9630084,103.2684672
,C1 ,86.22162836,92.257978,102.9387862,93.80613084
,DMSO ,99.95269136,106.7601732,127.856499,111.5231212