# @reboot cd /home/vpnuser/vpn-setup && sudo git pull && npm install && ./on-start.mjs
# cat crontab.txt |crontab -

@reboot cd /home/vpnuser/vpn-setup && sudo git pull && npm install && sudo ./on-start.mjs
*/2 *   *   *   *    cd /home/vpnuser/vpn-setup && sudo git pull && npm install && sudo ./on-start.mjs && sudo ./ping.mjs
0 4   *   *   *    /sbin/shutdown -r +5

