look_for_symbols_in_file subroutine   73 krextract        sub look_for_symbols_in_file
main             function      1 main.c           int main(void)
wanted           subroutine   51 krextract        sub wanted {
