<svg width="9px" height="6px" viewBox="0 0 9 6" version="1.1" xmlns:xlink="http://www.w3.org/1999/xlink" xmlns="http://www.w3.org/2000/svg">
  <desc>Created with Lunacy</desc>
  <path d="M5.14285 4.5C5.14285 4.57214 5.10751 4.65331 5.05449 4.70741L0.936671 8.90982C0.883652 8.96393 0.804123 9 0.733431 9C0.662739 9 0.58321 8.96393 0.530191 8.90982L0.0883652 8.45892C0.0353461 8.40481 0 8.33267 0 8.2515C0 8.17936 0.0353461 8.0982 0.0883652 8.04409L3.56112 4.5L0.0883652 0.955912C0.0353461 0.901804 0 0.820641 0 0.748497C0 0.676353 0.0353461 0.59519 0.0883652 0.541082L0.530191 0.0901804C0.58321 0.0360721 0.662739 0 0.733431 0C0.804123 0 0.883652 0.0360721 0.936671 0.0901804L5.05449 4.29258C5.10751 4.34669 5.14285 4.42786 5.14285 4.5Z" transform="matrix(-4.371139E-08 1 -1 -4.371139E-08 9 0)" id="" fill="#9EA7B7" stroke="none" />
</svg>