%YAML 1.1
%TAG !u! tag:unity3d.com,2011:
--- !u!78 &1
TagManager:
  serializedVersion: 2
  tags:
  - field
  - enemy
  - player
  - strike
  - bouncer
  - upexit
  - downexit
  - heal
  - money
  - metalpunch
  - lifeup
  - moneyup
  - rangeup
  - newstage
  - bullet
  - boss
  - saw
  - laserpower
  - returnlaser
  - timerstage
  - repeat
  - vampire
  - descuento
  - wall
  layers:
  - Default
  - TransparentFX
  - Ignore Raycast
  - 
  - Water
  - UI
  - 
  - 
  - 
  - 
  - 
  - 
  - 
  - 
  - 
  - 
  - 
  - 
  - 
  - 
  - 
  - 
  - 
  - 
  - 
  - 
  - 
  - 
  - 
  - 
  - 
  - 
  m_SortingLayers:
  - name: Default
    uniqueID: 0
    locked: 0
  - name: Layer
    uniqueID: 305146191
    locked: 0
