<?xml version="1.0" encoding="utf-8"?>
<!-- Generator: Adobe Illustrator 24.3.0, SVG Export Plug-In . SVG Version: 6.00 Build 0)  -->
<svg version="1.1" id="Calque_1" xmlns="http://www.w3.org/2000/svg" xmlns:xlink="http://www.w3.org/1999/xlink" x="0px" y="0px"
	 viewBox="0 0 737.8 563" style="enable-background:new 0 0 737.8 563;" xml:space="preserve">
<style type="text/css">
	.st0{fill:#C6E7FB;}
</style>
<path class="st0" d="M0,551.9c0,0,80.9-256.9,325.3-279.2C586.4,254.7,737.8,0,737.8,0H0V551.9z"/>
</svg>
