^D:\лена\oopkontr\ConsoleApplication1\Poly-Test\Poly-Test.vcxproj
D:\лена\oopkontr\ConsoleApplication1\packages\Microsoft.googletest.v140.windesktop.msvcstl.static.rt-dyn.1.8.1.3\lib\native\v140\windesktop\msvcstl\static\rt-dyn\x86\Debug\gtest.pdb
D:\лена\oopkontr\ConsoleApplication1\packages\Microsoft.googletest.v140.windesktop.msvcstl.static.rt-dyn.1.8.1.3\lib\native\v140\windesktop\msvcstl\static\rt-dyn\x86\Debug\gtest_main.pdb
