^D:\ЛЕНА\OOPKONTR\CONSOLEAPPLICATION1\CONSOLEAPPLICATION1\DEBUG\CONSOLEAPPLICATION1.OBJ
D:\лена\OOPKONTR\CONSOLEAPPLICATION1\DEBUG\CONSOLEAPPLICATION1.EXE
D:\лена\OOPKONTR\CONSOLEAPPLICATION1\DEBUG\CONSOLEAPPLICATION1.ILK
D:\ЛЕНА\OOPKONTR\CONSOLEAPPLICATION1\DEBUG\CONSOLEAPPLICATION1.PDB
