^D:\ЛЕНА\OOPKONTR\CONSOLEAPPLICATION1\POLY-TEST\PCH.CPP
/c /I"D:\ЛЕНА\OOPKONTR\CONSOLEAPPLICATION1\PACKAGES\MICROSOFT.GOOGLETEST.V140.WINDESKTOP.MSVCSTL.STATIC.RT-DYN.1.8.1.3\BUILD\NATIVE\INCLUDE" /Zi /nologo /W3 /WX- /diagnostics:column /Od /Oy- /D WIN32 /D _DEBUG /D _CONSOLE /D _UNICODE /D UNICODE /Gm- /EHsc /RTC1 /MDd /GS /fp:precise /Zc:wchar_t /Zc:forScope /Zc:inline /Yc"pch.h" /Fp"DEBUG\POLY-TEST.PCH" /Fo"DEBUG\\" /Fd"DEBUG\VC142.PDB" /Gd /TP /analyze- /FC D:\ЛЕНА\OOPKONTR\CONSOLEAPPLICATION1\POLY-TEST\PCH.CPP
^D:\ЛЕНА\OOPKONTR\CONSOLEAPPLICATION1\POLY-TEST\TEST.CPP
/c /I"D:\ЛЕНА\OOPKONTR\CONSOLEAPPLICATION1\PACKAGES\MICROSOFT.GOOGLETEST.V140.WINDESKTOP.MSVCSTL.STATIC.RT-DYN.1.8.1.3\BUILD\NATIVE\INCLUDE" /Zi /nologo /W3 /WX- /diagnostics:column /Od /Oy- /D WIN32 /D _DEBUG /D _CONSOLE /D _UNICODE /D UNICODE /Gm- /EHsc /RTC1 /MDd /GS /fp:precise /Zc:wchar_t /Zc:forScope /Zc:inline /Yu"pch.h" /Fp"DEBUG\POLY-TEST.PCH" /Fo"DEBUG\\" /Fd"DEBUG\VC142.PDB" /Gd /TP /analyze- /FC D:\ЛЕНА\OOPKONTR\CONSOLEAPPLICATION1\POLY-TEST\TEST.CPP
