10
10.47051078
10.93666561
11.39417199
11.8388634
12.26675982
12.67412534
13.05752198
13.41385896
13.74043643
14.03498326
14.29568809
14.52122333
14.71076154
14.8639842
14.98108253
15.0627504
15.11016961
15.12498751
15.10928759
15.06555328
14.99662578
14.9056563
14.7960538
14.67142873
14.53553391
14.3922034
14.24529028
14.09860436
13.95585087
13.82057098
13.69608515
13.58544019
13.49136096
13.41620722
13.36193658
13.330074
13.3216883
13.33737608
13.37725333
13.4409548
13.52764112
13.63601363
13.76433662
13.91046659
14.07188819
14.24575605
14.42894203
14.6180871
14.80965685
15
15.18540875
15.36218018
15.52667761
15.67539097
15.80499521
15.91240591
15.994831
16.04981798
16.07529574
16.06961036
16.03155436
15.96038878
15.85585796
15.71819652
15.54812866
15.34685958
15.11605931
14.85783906
14.5747206
14.26959896
13.94569925
13.60652807
13.25582042
12.89748288
12.53553391
12.17404233
11.81706485
11.46858359
11.13244476
10.81229924
10.51154619
10.23328044
9.980244548
9.75478634
9.558822472
9.393808714
9.260717369
9.160022201
9.09169111
9.055186687
9.04947463
9.073039911
9.12391043
9.199687808
9.297584826
9.414468932
9.546911147
9.69123959
9.843596809
10
10.15640319
10.30876041
10.45308885
10.58553107
10.70241517
10.80031219
10.87608957
10.92696009
10.95052537
10.94481331
10.90830889
10.8399778
10.73928263
10.60619129
10.44117753
10.24521366
10.01975545
9.766719563
9.488453808
9.187700759
8.867555241
8.531416407
8.182935149
7.825957666
7.464466094
7.102517124
6.744179579
6.393471931
6.054300751
5.73040104
5.425279403
5.142160939
4.883940694
4.65314042
4.451871341
4.281803479
4.144142042
4.03961122
3.968445644
3.930389638
3.924704262
3.950182017
4.005168996
4.087594087
4.195004787
4.324609032
4.473322386
4.637819817
4.814591251
5
5.190343146
5.381912899
5.571057968
5.754243954
5.928111807
6.089533406
6.235663384
6.363986371
6.472358882
6.559045199
6.622746667
6.662623921
6.678311701
6.669925996
6.638063417
6.583792779
6.508639036
6.414559806
6.303914855
6.179429016
6.044149125
5.901395641
5.754709725
5.607796602
5.464466094
5.328571275
5.203946198
5.094343695
5.003374222
4.934446718
4.890712413
4.875012487
4.88983039
4.937249599
5.018917474
5.136015798
5.289238463
5.478776674
5.704311908
5.965016743
6.25956357
6.586141039
6.942478016
7.325874663
7.733240176
8.161136597
8.605828013
9.063334394
9.529489218
10
10.47051078
10.93666561
11.39417199
11.8388634
12.26675982
12.67412534
13.05752198
13.41385896
13.74043643
14.03498326
14.29568809
14.52122333
14.71076154
14.8639842
14.98108253
15.0627504
15.11016961
15.12498751
15.10928759
15.06555328
14.99662578
14.9056563
14.7960538
14.67142873
14.53553391
14.3922034
14.24529028
14.09860436
13.95585087
13.82057098
13.69608515
13.58544019
13.49136096
13.41620722
13.36193658
13.330074
13.3216883
13.33737608
13.37725333
13.4409548
13.52764112
13.63601363
13.76433662
13.91046659
14.07188819
14.24575605
14.42894203
14.6180871
14.80965685
15
15.18540875
15.36218018
15.52667761
15.67539097
15.80499521
15.91240591
15.994831
16.04981798
16.07529574
16.06961036
16.03155436
15.96038878
15.85585796
15.71819652
15.54812866
15.34685958
15.11605931
14.85783906
14.5747206
14.26959896
13.94569925
13.60652807
13.25582042
12.89748288
12.53553391
12.17404233
11.81706485
11.46858359
11.13244476
10.81229924
