^D:\ЛЕНА\OOPKONTR\CONSOLEAPPLICATION2\CONSOLEAPPLICATION2\CONSOLEAPPLICATION2.CPP
D:\лена\OOPKONTR\CONSOLEAPPLICATION2\CONSOLEAPPLICATION2\DEBUG\VC142.PDB
D:\лена\OOPKONTR\CONSOLEAPPLICATION2\CONSOLEAPPLICATION2\DEBUG\VC142.IDB
D:\лена\OOPKONTR\CONSOLEAPPLICATION2\CONSOLEAPPLICATION2\DEBUG\CONSOLEAPPLICATION2.OBJ
