^D:\ЛЕНА\OOPKONTR\CONSOLEAPPLICATION3\CONSOLEAPPLICATION3\DEBUG\CONSOLEAPPLICATION3.OBJ
D:\лена\OOPKONTR\CONSOLEAPPLICATION3\DEBUG\CONSOLEAPPLICATION3.ILK
D:\лена\OOPKONTR\CONSOLEAPPLICATION3\DEBUG\CONSOLEAPPLICATION3.EXE
D:\ЛЕНА\OOPKONTR\CONSOLEAPPLICATION3\DEBUG\CONSOLEAPPLICATION3.PDB
