<?xml version="1.0" encoding="UTF-8"?>
<!-- Generator: Adobe Illustrator 22.1.0, SVG Export Plug-In . SVG Version: 6.00 Build 0)  -->
<svg version="1.1" id="Layer_1" xmlns="http://www.w3.org/2000/svg" xmlns:xlink="http://www.w3.org/1999/xlink" x="0px" y="0px" viewBox="0 0 160 210" style="enable-background:new 0 0 160 210;" xml:space="preserve">
<style type="text/css">
	.st0{fill:#00BFF3;}
	.st1{fill:#231F20;}
</style>
<title>logo</title>
<path class="st0" d="M95.7,124.4c-5.4-6.3-5.8-14.7-0.6-19.9c6-6,14-4.1,19.7,0.9L95.7,124.4z M126.8,114.8c0-0.5-0.1-0.9-0.5-1.3  c-0.7-0.7-1.8-0.6-2.4,0c0,0,0,0,0,0c-0.3,0.3-0.5,0.7-0.5,1.2c0.1,4.5-1.6,8.9-4.9,12.1c-5.1,5.1-13.6,6-20.7-0.1l20.5-20.5  c0.6-0.7,0.6-1.7,0-2.4c-7.6-7.6-18.3-9-25.7-1.7c-7.1,7.1-6.3,18.5,1.3,26.2l0.1,0.1c8.2,8.2,19.7,7.8,26.6,0.9  C124.9,125.5,127.1,120.2,126.8,114.8L126.8,114.8z"/>
<path class="st1" d="M87.7,19.7c0,7.2,4.2,12.9,10.8,12.9h0.1c6.5,0,8.7-6.3,10.4-12.3c1.5-5.3,3.1-10.4,7.2-10.4h0.1  c3.7,0,6.5,3.4,6.5,8.5c-0.1,3.7-1.1,7.3-3,10.4c-0.2,0.3-0.3,0.7-0.3,1c0,1,0.8,1.7,1.7,1.8c0.7,0,1.3-0.4,1.6-1  c2.1-3.7,3.2-7.8,3.3-12.1c0-7.3-4.3-12.3-10.2-12.3h-0.1c-6.6,0-8.4,6.7-10.2,12.8c-1.5,5.2-3.1,9.9-7.4,9.9h-0.1c-4.3,0-7-4-7-9  c0-4.5,1.5-8.9,4.2-12.5c0.2-0.3,0.4-0.8,0.4-1.2c0-1-0.8-1.7-1.7-1.8c-0.5,0-1,0.3-1.4,0.7C89.5,9.4,87.8,14.5,87.7,19.7z"/>
<path class="st1" d="M87.8,56.7c0,1.8,0.3,3.6,0.9,5.3c0.2,0.7,0.8,1.2,1.5,1.2c0.9,0,1.6-0.7,1.6-1.6c-0.4-1.4-0.7-2.8-0.7-4.2  c0-4.3,1.9-7.5,7.2-7.5h23.9v11.7c0,0.9,0.7,1.6,1.6,1.7c0.9,0,1.6-0.8,1.7-1.7V49.8h10.3c1,0,1.8-0.8,1.8-1.8c0,0,0,0,0,0  c0-1-0.8-1.8-1.7-1.8c0,0-0.1,0-0.1,0h-10.3v-4c0-0.9-0.7-1.6-1.6-1.7c-0.9,0-1.6,0.8-1.7,1.7v4H98C90.9,46.2,87.8,50.9,87.8,56.7z"/>
<path class="st1" d="M90,74.5c-1,0-1.8,0.8-1.8,1.8c0,1,0.8,1.8,1.8,1.8c0,0,0,0,0,0h13.7c11.9,0,17.8,7.1,18.5,15  c0,1.1,0.9,1.9,2,1.9c1.1,0,1.9-0.8,2-1.8c0,0,0,0,0-0.1c0-5.3-3.9-11.8-11.1-15h9c1,0,1.8-0.7,1.8-1.7c0,0,0-0.1,0-0.1  c0-1-0.8-1.8-1.7-1.8c0,0-0.1,0-0.1,0L90,74.5z"/>
<path class="st1" d="M108.7,145c8.2,0.7,14.4,6.4,14.4,13.8c0,8.6-6.9,12.9-14.4,13.4V145z M93.6,174.1c0.3,0.4,0.8,0.6,1.2,0.6  c0.9,0,1.7-0.8,1.7-1.8c0,0,0,0,0,0c0-0.4-0.2-0.9-0.5-1.2c-3.3-3.2-5.1-7.5-5.1-12.1c0-7.3,5.4-14,14.6-14.6v29.3  c0,0.9,0.7,1.7,1.7,1.8c10.6,0,19.2-6.7,19.2-17.1c0-10.1-8.6-17.7-19.3-17.7h-0.1c-11.6,0-19.3,8.5-19.3,18.3  C87.4,165,89.6,170.3,93.6,174.1L93.6,174.1z"/>
<path class="st1" d="M5,134c0,1,0.8,1.8,1.7,1.8s1.8-0.8,1.8-1.7c0,0,0,0,0-0.1v-13.8c0-12,7-17.9,14.9-18.7c1.1,0,1.9-0.9,1.9-2  c0-1-0.8-1.9-1.8-2c0,0,0,0-0.1,0c-5.2,0-11.7,4-14.9,11.2v-9.1c0-1-0.8-1.8-1.7-1.8S5,98.7,5,99.7c0,0,0,0,0,0.1L5,134z"/>
<path class="st1" d="M34.1,86.6c0,1.2,0.9,2.2,2.1,2.2c0,0,0.1,0,0.1,0c1.2,0,2.2-0.9,2.3-2.2c0,0,0,0,0,0v-1.2c0-1.2-1-2.2-2.2-2.2  c0,0,0,0,0,0c-1.2,0-2.2,0.9-2.2,2.1c0,0,0,0.1,0,0.1V86.6z M34.6,134c0,1,0.7,1.8,1.7,1.8c0,0,0.1,0,0.1,0c0.9,0,1.7-0.7,1.7-1.7  c0-0.1,0-0.1,0-0.2V99.7c0-1-0.7-1.8-1.7-1.8c0,0-0.1,0-0.1,0c-1,0-1.7,0.8-1.7,1.7c0,0,0,0.1,0,0.1V134z"/>
<path class="st1" d="M67.6,134.5l15-33.8c0.1-0.3,0.2-0.6,0.2-1c0-1-0.8-1.8-1.8-1.8c-0.8,0-1.5,0.5-1.8,1.3l-13.7,32.3L52,99.4  c-0.4-0.8-0.8-1.5-1.9-1.5c-1,0-1.9,0.7-1.9,1.8c0,0,0,0.1,0,0.1c0,0.4,0.1,0.8,0.3,1.1l14.9,33.7c0.3,0.9,1.1,1.5,2,1.5h0.1  C66.5,136,67.4,135.4,67.6,134.5z"/>
<path class="st1" d="M134.7,134c0,1,0.8,1.8,1.7,1.8c1,0,1.8-0.8,1.8-1.7c0,0,0,0,0-0.1v-13.8c0-12,7-17.9,14.9-18.7  c1.1,0,1.9-0.9,1.9-2c0-1-0.8-1.9-1.8-2c0,0,0,0-0.1,0c-5.2,0-11.7,4-14.9,11.2v-9.1c0-1-0.8-1.8-1.7-1.8c-1,0-1.8,0.8-1.8,1.7  c0,0,0,0,0,0.1L134.7,134z"/>
<path class="st1" d="M87.8,199c0,1.8,0.3,3.6,0.9,5.3c0.2,0.7,0.8,1.2,1.5,1.2c0.9,0,1.6-0.7,1.6-1.6c-0.4-1.4-0.7-2.8-0.7-4.2  c0-4.3,1.9-7.5,7.2-7.5h23.9v11.7c0,0.9,0.7,1.6,1.6,1.7c0.9,0,1.6-0.8,1.7-1.7v-11.7h10.3c1,0,1.8-0.8,1.8-1.8c0,0,0,0,0,0  c0-1-0.8-1.8-1.7-1.8c0,0-0.1,0-0.1,0h-10.3v-4c0-0.9-0.7-1.6-1.6-1.7c-0.9,0-1.6,0.8-1.7,1.7v4H98C90.9,188.5,87.8,193.2,87.8,199z  "/>
</svg>