{
  "status": "done",
  "assets": {
    "0c35d18bf06992036b69.woff2": {
      "name": "0c35d18bf06992036b69.woff2",
      "path": "/home/mrmelve/dev/www/ado/ado/git/ado/customadmin/static/customadmin/bundle/0c35d18bf06992036b69.woff2"
    },
    "4d73cb90e394b34b7670.woff": {
      "name": "4d73cb90e394b34b7670.woff",
      "path": "/home/mrmelve/dev/www/ado/ado/git/ado/customadmin/static/customadmin/bundle/4d73cb90e394b34b7670.woff"
    },
    "customadmin.commons.1363e891.js": {
      "name": "customadmin.commons.1363e891.js",
      "path": "/home/mrmelve/dev/www/ado/ado/git/ado/customadmin/static/customadmin/bundle/customadmin.commons.1363e891.js"
    },
    "customadmin.commons.1363e891.js.LICENSE.txt": {
      "name": "customadmin.commons.1363e891.js.LICENSE.txt",
      "path": "/home/mrmelve/dev/www/ado/ado/git/ado/customadmin/static/customadmin/bundle/customadmin.commons.1363e891.js.LICENSE.txt"
    },
    "customadmin.content_inlines.0e07c2c1.css": {
      "name": "customadmin.content_inlines.0e07c2c1.css",
      "path": "/home/mrmelve/dev/www/ado/ado/git/ado/customadmin/static/customadmin/bundle/customadmin.content_inlines.0e07c2c1.css"
    },
    "customadmin.content_inlines.5a69d2cd.js": {
      "name": "customadmin.content_inlines.5a69d2cd.js",
      "path": "/home/mrmelve/dev/www/ado/ado/git/ado/customadmin/static/customadmin/bundle/customadmin.content_inlines.5a69d2cd.js"
    },
    "customadmin.link_browser.67e6972b.js": {
      "name": "customadmin.link_browser.67e6972b.js",
      "path": "/home/mrmelve/dev/www/ado/ado/git/ado/customadmin/static/customadmin/bundle/customadmin.link_browser.67e6972b.js"
    },
    "customadmin.link_browser.6b0cf799.css": {
      "name": "customadmin.link_browser.6b0cf799.css",
      "path": "/home/mrmelve/dev/www/ado/ado/git/ado/customadmin/static/customadmin/bundle/customadmin.link_browser.6b0cf799.css"
    },
    "customadmin.main.5fe5497e.css": {
      "name": "customadmin.main.5fe5497e.css",
      "path": "/home/mrmelve/dev/www/ado/ado/git/ado/customadmin/static/customadmin/bundle/customadmin.main.5fe5497e.css"
    },
    "customadmin.main.77f9dbfd.js": {
      "name": "customadmin.main.77f9dbfd.js",
      "path": "/home/mrmelve/dev/www/ado/ado/git/ado/customadmin/static/customadmin/bundle/customadmin.main.77f9dbfd.js"
    },
    "customadmin.media_changelist.2acc05d7.css": {
      "name": "customadmin.media_changelist.2acc05d7.css",
      "path": "/home/mrmelve/dev/www/ado/ado/git/ado/customadmin/static/customadmin/bundle/customadmin.media_changelist.2acc05d7.css"
    },
    "customadmin.media_changelist.3bdd1f45.js": {
      "name": "customadmin.media_changelist.3bdd1f45.js",
      "path": "/home/mrmelve/dev/www/ado/ado/git/ado/customadmin/static/customadmin/bundle/customadmin.media_changelist.3bdd1f45.js"
    },
    "customadmin.media_inlines.0e596b02.js": {
      "name": "customadmin.media_inlines.0e596b02.js",
      "path": "/home/mrmelve/dev/www/ado/ado/git/ado/customadmin/static/customadmin/bundle/customadmin.media_inlines.0e596b02.js"
    },
    "customadmin.media_inlines.7c9aeb5b.css": {
      "name": "customadmin.media_inlines.7c9aeb5b.css",
      "path": "/home/mrmelve/dev/www/ado/ado/git/ado/customadmin/static/customadmin/bundle/customadmin.media_inlines.7c9aeb5b.css"
    },
    "customadmin.media_upload.45f38b12.css": {
      "name": "customadmin.media_upload.45f38b12.css",
      "path": "/home/mrmelve/dev/www/ado/ado/git/ado/customadmin/static/customadmin/bundle/customadmin.media_upload.45f38b12.css"
    },
    "customadmin.media_upload.eab09965.js": {
      "name": "customadmin.media_upload.eab09965.js",
      "path": "/home/mrmelve/dev/www/ado/ado/git/ado/customadmin/static/customadmin/bundle/customadmin.media_upload.eab09965.js"
    },
    "customadmin.media_upload.eab09965.js.LICENSE.txt": {
      "name": "customadmin.media_upload.eab09965.js.LICENSE.txt",
      "path": "/home/mrmelve/dev/www/ado/ado/git/ado/customadmin/static/customadmin/bundle/customadmin.media_upload.eab09965.js.LICENSE.txt"
    },
    "customadmin.media_widgets.a25c88ae.css": {
      "name": "customadmin.media_widgets.a25c88ae.css",
      "path": "/home/mrmelve/dev/www/ado/ado/git/ado/customadmin/static/customadmin/bundle/customadmin.media_widgets.a25c88ae.css"
    },
    "customadmin.media_widgets.af7ee337.js": {
      "name": "customadmin.media_widgets.af7ee337.js",
      "path": "/home/mrmelve/dev/www/ado/ado/git/ado/customadmin/static/customadmin/bundle/customadmin.media_widgets.af7ee337.js"
    },
    "customadmin.menus.888fa919.js": {
      "name": "customadmin.menus.888fa919.js",
      "path": "/home/mrmelve/dev/www/ado/ado/git/ado/customadmin/static/customadmin/bundle/customadmin.menus.888fa919.js"
    },
    "customadmin.menus.ee5a1d50.css": {
      "name": "customadmin.menus.ee5a1d50.css",
      "path": "/home/mrmelve/dev/www/ado/ado/git/ado/customadmin/static/customadmin/bundle/customadmin.menus.ee5a1d50.css"
    },
    "customadmin.runtime.44f5d2cd.js": {
      "name": "customadmin.runtime.44f5d2cd.js",
      "path": "/home/mrmelve/dev/www/ado/ado/git/ado/customadmin/static/customadmin/bundle/customadmin.runtime.44f5d2cd.js"
    },
    "customadmin.smartselect.a1e53b3e.js": {
      "name": "customadmin.smartselect.a1e53b3e.js",
      "path": "/home/mrmelve/dev/www/ado/ado/git/ado/customadmin/static/customadmin/bundle/customadmin.smartselect.a1e53b3e.js"
    },
    "customadmin.smartselect.a1e53b3e.js.LICENSE.txt": {
      "name": "customadmin.smartselect.a1e53b3e.js.LICENSE.txt",
      "path": "/home/mrmelve/dev/www/ado/ado/git/ado/customadmin/static/customadmin/bundle/customadmin.smartselect.a1e53b3e.js.LICENSE.txt"
    },
    "customadmin.smartselect.e5068a9f.css": {
      "name": "customadmin.smartselect.e5068a9f.css",
      "path": "/home/mrmelve/dev/www/ado/ado/git/ado/customadmin/static/customadmin/bundle/customadmin.smartselect.e5068a9f.css"
    },
    "customadmin.sortablelist.6d0485f2.js": {
      "name": "customadmin.sortablelist.6d0485f2.js",
      "path": "/home/mrmelve/dev/www/ado/ado/git/ado/customadmin/static/customadmin/bundle/customadmin.sortablelist.6d0485f2.js"
    },
    "customadmin.sortablelist.94c1dee0.css": {
      "name": "customadmin.sortablelist.94c1dee0.css",
      "path": "/home/mrmelve/dev/www/ado/ado/git/ado/customadmin/static/customadmin/bundle/customadmin.sortablelist.94c1dee0.css"
    }
  },
  "chunks": {
    "content_inlines": [
      "customadmin.runtime.44f5d2cd.js",
      "customadmin.commons.1363e891.js",
      "customadmin.content_inlines.0e07c2c1.css",
      "customadmin.content_inlines.5a69d2cd.js"
    ],
    "link_browser": [
      "customadmin.runtime.44f5d2cd.js",
      "customadmin.commons.1363e891.js",
      "customadmin.link_browser.6b0cf799.css",
      "customadmin.link_browser.67e6972b.js"
    ],
    "main": [
      "customadmin.runtime.44f5d2cd.js",
      "customadmin.commons.1363e891.js",
      "customadmin.main.5fe5497e.css",
      "customadmin.main.77f9dbfd.js"
    ],
    "media_changelist": [
      "customadmin.runtime.44f5d2cd.js",
      "customadmin.commons.1363e891.js",
      "customadmin.media_changelist.2acc05d7.css",
      "customadmin.media_changelist.3bdd1f45.js"
    ],
    "media_inlines": [
      "customadmin.runtime.44f5d2cd.js",
      "customadmin.commons.1363e891.js",
      "customadmin.media_inlines.7c9aeb5b.css",
      "customadmin.media_inlines.0e596b02.js"
    ],
    "media_upload": [
      "customadmin.runtime.44f5d2cd.js",
      "customadmin.commons.1363e891.js",
      "customadmin.media_upload.45f38b12.css",
      "customadmin.media_upload.eab09965.js"
    ],
    "media_widgets": [
      "customadmin.runtime.44f5d2cd.js",
      "customadmin.commons.1363e891.js",
      "customadmin.media_widgets.a25c88ae.css",
      "customadmin.media_widgets.af7ee337.js"
    ],
    "menus": [
      "customadmin.runtime.44f5d2cd.js",
      "customadmin.commons.1363e891.js",
      "customadmin.menus.ee5a1d50.css",
      "customadmin.menus.888fa919.js"
    ],
    "smartselect": [
      "customadmin.runtime.44f5d2cd.js",
      "customadmin.commons.1363e891.js",
      "customadmin.smartselect.e5068a9f.css",
      "customadmin.smartselect.a1e53b3e.js"
    ],
    "sortablelist": [
      "customadmin.runtime.44f5d2cd.js",
      "customadmin.commons.1363e891.js",
      "customadmin.sortablelist.94c1dee0.css",
      "customadmin.sortablelist.6d0485f2.js"
    ]
  }
}