<svg viewBox="0 0 16 16" fill="none" xmlns="http://www.w3.org/2000/svg">
<path fill-rule="evenodd" clip-rule="evenodd" d="M0.422503 13.2295C-0.140878 13.794 -0.140828 14.7092 0.422616 15.2736C0.986132 15.8381 1.89977 15.8381 2.46323 15.2735L7.84885 9.87709L13.5369 15.5766C14.1004 16.1411 15.014 16.1412 15.5775 15.5767C16.141 15.0122 16.141 14.0971 15.5776 13.5326L9.88917 7.83269L15.2437 2.46746C15.8071 1.90295 15.807 0.987803 15.2436 0.423356C14.68 -0.141163 13.7664 -0.141112 13.2029 0.423469L7.84885 5.78828L2.79721 0.72652C2.23376 0.161938 1.32012 0.161888 0.756601 0.726406C0.193157 1.29085 0.193106 2.206 0.756487 2.77051L5.80854 7.83269L0.422503 13.2295Z" fill="#90A1AC"/>
</svg>
