<svg width="60" height="61" viewBox="0 0 60 61" fill="none" xmlns="http://www.w3.org/2000/svg">
<path d="M30 60C46.5685 60 60 46.5685 60 30C60 13.4315 46.5685 0 30 0C13.4315 0 0 13.4315 0 30C0 46.5685 13.4315 60 30 60Z" fill="#E5E5E5"/>
<path d="M42.1795 4H10.2051C8.99231 4 8 4.81667 8 5.81481V53H48.7949C50.0077 53 51 52.1833 51 51.1852V11.2593L42.1795 4Z" fill="white"/>
<path d="M46 40L40.3529 46L38 43.6786" stroke="#FF0550" stroke-width="2" stroke-miterlimit="10"/>
<path d="M15 54L15 43" stroke="#2F3542" stroke-width="2" stroke-miterlimit="10" stroke-linecap="round"/>
<path d="M2 40C2 40.75 2.90278 42 4.16667 42C5.01889 42 5.51 41.74 6.99056 41.18C7.92944 40.82 9.93 40 11.3889 40C12.8478 40 13.5844 42 15 42C16.4156 42 17.1594 40 18.6111 40C20.0628 40 22.0706 40.82 23.0094 41.18C24.4972 41.75 24.9811 42 25.8333 42C27.0972 42 28 40.75 28 40" stroke="#2F3542" stroke-width="2" stroke-miterlimit="10" stroke-linecap="round"/>
<path d="M17.173 54H12.6212C10.535 54 8.82812 56.4828 8.82812 59.5172H20.9661C20.9661 56.4828 19.2592 54 17.173 54Z" fill="#FF0550" stroke="#2F3542" stroke-width="2" stroke-miterlimit="10" stroke-linecap="round"/>
<path d="M6 43L8.80255 48.099C8.93653 48.3571 9 48.7278 9 49" stroke="#2F3542" stroke-width="2" stroke-miterlimit="10" stroke-linecap="round"/>
<path d="M1 49C1 48.6403 1.09498 48.2857 1.28494 47.956L4 43" stroke="#2F3542" stroke-width="2" stroke-miterlimit="10" stroke-linecap="round"/>
<path d="M0 49C0 51.4349 2.22302 53.4138 4.96552 53.4138C7.70801 53.4138 9.93104 51.4349 9.93104 49H0Z" fill="#FF0550"/>
<path d="M24.0352 43L21.241 48.099C21.1013 48.3571 21.0352 48.7278 21.0352 49" stroke="#2F3542" stroke-width="2" stroke-miterlimit="10" stroke-linecap="round"/>
<path d="M29.0352 49C29.0352 48.6403 28.9133 48.2857 28.6696 47.956L25.0352 43" stroke="#2F3542" stroke-width="2" stroke-miterlimit="10" stroke-linecap="round"/>
<path d="M20 49C20 51.4349 22.223 53.4138 24.9655 53.4138C27.708 53.4138 29.931 51.4349 29.931 49H20Z" fill="#FF0550"/>
<path d="M42.9316 17.8967H46.242" stroke="#2F3542" stroke-width="2" stroke-miterlimit="10"/>
<path d="M37.6211 17.8967H40.9314" stroke="#2F3542" stroke-width="2" stroke-miterlimit="10"/>
<path d="M42.9316 22.8967H46.242" stroke="#2F3542" stroke-width="2" stroke-miterlimit="10"/>
<path d="M37.6211 22.8967H40.9314" stroke="#2F3542" stroke-width="2" stroke-miterlimit="10"/>
<path d="M42.9316 27.8967H46.242" stroke="#2F3542" stroke-width="2" stroke-miterlimit="10"/>
<path d="M42.9316 32.8967H46.242" stroke="#2F3542" stroke-width="2" stroke-miterlimit="10"/>
<path d="M37.6211 27.8967H40.9314" stroke="#2F3542" stroke-width="2" stroke-miterlimit="10"/>
<path d="M37.6211 32.8967H40.9314" stroke="#2F3542" stroke-width="2" stroke-miterlimit="10"/>
<path d="M23.4079 24.2358C22.6995 23.4441 21.7829 22.9024 20.637 22.7149L24.1995 19.3608V17.0691H15.0745V19.2774H21.0537L16.9079 23.1733L17.9912 25.0066C18.4079 24.7983 18.887 24.6524 19.3454 24.6524C20.0329 24.6524 20.6995 24.8608 21.2204 25.3399C21.7829 25.8816 22.0329 26.6316 22.0329 27.4024C22.0329 28.1733 21.762 28.9233 21.1787 29.4441C20.6787 29.8816 20.0329 30.1316 19.3662 30.1316C18.6787 30.1316 18.0329 29.9024 17.5329 29.4649C17.1579 29.1316 16.9079 28.6941 16.762 28.2149L14.4912 28.8191C14.762 29.7149 15.262 30.5066 15.9495 31.1108C16.887 31.9441 18.137 32.3816 19.3662 32.3608C20.5745 32.3816 21.8245 31.9441 22.762 31.1108C23.8245 30.1941 24.387 28.8191 24.4287 27.4024C24.4495 26.2566 24.1162 25.1316 23.4079 24.2358ZM29.4094 17.0691L26.5969 18.7566V21.3608L29.4094 19.6316V32.0691H31.8053V17.0691H29.4094Z" fill="#FF0550"/>
<path d="M8.38672 35.4482L8.38672 6.65514C8.38672 5.44135 9.39239 4.44824 10.6216 4.44824H43.0266L51.9659 13.2758C51.9659 13.2758 51.9659 48.6138 51.9659 49.8276C51.9659 51.0413 50.9603 52.0345 49.7311 52.0345C48.502 52.0345 35 52.0345 35 52.0345" stroke="#2F3542" stroke-width="2" stroke-miterlimit="10" stroke-linecap="round"/>
<path d="M21 1C21 0.447715 20.5523 0 20 0C19.4477 0 19 0.447715 19 1H21ZM19 9C19 9.55229 19.4477 10 20 10C20.5523 10 21 9.55229 21 9H19ZM19 1V9H21V1H19Z" fill="#2F3542"/>
<path d="M39 1C39 0.447715 38.5523 0 38 0C37.4477 0 37 0.447715 37 1H39ZM37 9C37 9.55229 37.4477 10 38 10C38.5523 10 39 9.55229 39 9H37ZM37 1V9H39V1H37Z" fill="#2F3542"/>
</svg>
