<svg xmlns="http://www.w3.org/2000/svg" fill="none" viewBox="0 0 60 60">

<path fill="url(#a)" d="M30 11c-10.493 0-19 8.506-19 19 0 10.493 8.507 19 19 19 10.494 0 19-8.507 19-19 0-10.494-8.506-19-19-19zm0 37.05c-9.969 0-18.05-8.082-18.05-18.05 0-9.969 8.081-18.05 18.05-18.05 9.969 0 18.05 8.081 18.05 18.05 0 9.968-8.081 18.05-18.05 18.05z"/><path fill="#333" d="M48.186 29.998c0 10.043-8.143 18.185-18.186 18.185-10.044 0-18.186-8.142-18.186-18.185 0-10.044 8.142-18.186 18.186-18.186 10.043 0 18.186 8.142 18.186 18.186z"/><path fill="url(#b)" d="M48.05 29.998c0 9.968-8.082 18.05-18.05 18.05-9.97 0-18.05-8.082-18.05-18.05 0-9.969 8.08-18.05 18.05-18.05 9.968 0 18.05 8.081 18.05 18.05z"/><path fill="url(#c)" d="M42.1 29.997c0 6.684-5.417 12.101-12.1 12.101-6.684 0-12.102-5.417-12.102-12.1 0-6.684 5.418-12.102 12.102-12.102 6.683 0 12.1 5.418 12.1 12.101z"/><path fill="#2F3542" d="M30.484 17.57l1.257-3.332v3.331h.955v-4.771H31.26l-1.305 3.416h.012l-1.305-3.416H27.23v4.771h.954v-3.331l1.257 3.331h1.044zm13.102 2.139l-1.631 2.378 2.562-1.26.695.834-4.032 2.024-.815-.986 1.563-2.357-.01-.011-2.6 1.112-.823-.98 2.719-3.6.695.834-1.703 2.293 2.635-1.175.745.894z"/><path fill="#333" d="M21.548 18.797c-.384-.373-.977-.485-1.534-.14a1.06 1.06 0 00.007-.712c-.24-.437-.325-.493-.521-.659-.641-.537-1.315-.078-1.797.496l-2.329 2.775 3.661 3.071 2.455-2.926c.562-.668.648-1.331.058-1.905zm-4.735 1.339l1.399-1.667c.162-.193.529-.185.764.013.259.217.26.525.085.732l-1.383 1.648-.865-.726zm3.859.277l-1.458 1.737-.913-.767 1.469-1.75c.166-.199.536-.256.786-.047.281.237.309.597.116.827z"/><path fill="url(#d)" d="M30.494 17.385l1.257-3.331v3.331h.955v-4.771H31.27l-1.305 3.416h.012l-1.305-3.416h-1.435v4.771h.955v-3.331l1.257 3.331h1.044z"/><path fill="url(#e)" d="M43.595 19.39l-1.63 2.378 2.562-1.26.694.833-4.032 2.024-.815-.986 1.564-2.357-.01-.012-2.6 1.114-.824-.98 2.72-3.6.694.833-1.702 2.293 2.634-1.175.745.894z"/><path fill="url(#f)" d="M21.378 18.704c-.384-.373-.978-.486-1.534-.14.106-.276.062-.558.006-.712-.24-.438-.324-.493-.522-.66-.64-.536-1.314-.078-1.795.497l-2.33 2.774 3.661 3.072 2.456-2.927c.56-.668.647-1.33.058-1.904zm-4.736 1.338l1.399-1.666c.162-.194.528-.186.764.012.259.217.26.525.085.732l-1.383 1.648-.865-.726zm3.86.277l-1.458 1.738-.915-.768 1.47-1.751c.166-.198.535-.255.785-.046.283.237.31.596.118.827z"/><path fill="url(#g)" d="M18.301 29.998c0-6.461 5.238-11.699 11.699-11.699 6.46 0 11.698 5.238 11.698 11.699 0 6.46-5.237 11.698-11.698 11.698S18.3 36.46 18.3 29.998z"/><path fill="url(#h)" d="M18.637 29.998c0-6.275 5.087-11.362 11.362-11.362S41.36 23.723 41.36 29.998 36.274 41.361 30 41.361s-11.362-5.088-11.362-11.363z"/><path fill="url(#i)" d="M18.62 29.998h11.379v-11.38c-6.285 0-11.38 5.095-11.38 11.38z"/><path fill="url(#j)" d="M30 29.998v11.38c6.285 0 11.38-5.096 11.38-11.38H30z"/><path fill="url(#k)" d="M41.474 29.796H30.2V18.523h-.403v11.273H18.525v.403h11.273v11.273h.403V30.199h11.273v-.403z"/><path fill="url(#l)" d="M30.201 18.843c6.003.107 10.847 4.95 10.955 10.953h.2c-.107-6.114-5.04-11.049-11.155-11.155v.202z"/><path fill="#C2D7E8" d="M18.824 29.794c.106-6.01 4.958-10.861 10.968-10.968v-.202c-6.122.107-11.063 5.048-11.17 11.17h.202z"/><path fill="url(#m)" d="M29.798 41.153c-6.003-.107-10.847-4.95-10.954-10.954h-.201c.107 6.114 5.04 11.05 11.155 11.156v-.202z"/><path fill="#12404F" d="M41.156 30.2c-.108 6.002-4.952 10.846-10.955 10.953v.202c6.114-.107 11.049-5.041 11.156-11.156h-.201z"/><path fill="url(#n)" d="M29.582 18.624v10.95h-10.95v.216h11.165V18.624h-.215z"/><path fill="url(#o)" d="M29.564 41.249V30.43H18.723v-.213h11.054v11.032h-.213z"/><path fill="url(#p)" d="M30.432 41.249V30.43h10.819v-.213H30.22v11.032h.212z"/><path fill="url(#q)" d="M30.432 18.72v10.82h10.819v.212H30.22V18.721h.212z"/><defs><radialGradient id="b" cx="0" cy="0" r="1" gradientTransform="translate(10.763 12.255) scale(26.9938)" gradientUnits="userSpaceOnUse"><stop stop-color="#fff"/><stop offset=".306" stop-color="#A8A8A8"/><stop offset=".646" stop-color="#4F4F4F"/><stop offset=".885" stop-color="#161616"/><stop offset="1"/></radialGradient><radialGradient id="d" cx="0" cy="0" r="1" gradientTransform="translate(5.914 9.506) scale(64.8622)" gradientUnits="userSpaceOnUse"><stop stop-color="#fff"/><stop offset=".31" stop-color="#FDFDFD"/><stop offset=".451" stop-color="#F6F6F6"/><stop offset=".557" stop-color="#E9E9E9"/><stop offset=".646" stop-color="#D7D7D7"/><stop offset=".724" stop-color="#BFBFBF"/><stop offset=".794" stop-color="#A2A2A2"/><stop offset=".859" stop-color="gray"/><stop offset=".92" stop-color="#575757"/><stop offset=".975" stop-color="#2B2B2B"/><stop offset="1" stop-color="#141414"/></radialGradient><radialGradient id="e" cx="0" cy="0" r="1" gradientTransform="translate(5.911 9.506) scale(64.8677)" gradientUnits="userSpaceOnUse"><stop stop-color="#fff"/><stop offset=".31" stop-color="#FDFDFD"/><stop offset=".451" stop-color="#F6F6F6"/><stop offset=".557" stop-color="#E9E9E9"/><stop offset=".646" stop-color="#D7D7D7"/><stop offset=".724" stop-color="#BFBFBF"/><stop offset=".794" stop-color="#A2A2A2"/><stop offset=".859" stop-color="gray"/><stop offset=".92" stop-color="#575757"/><stop offset=".975" stop-color="#2B2B2B"/><stop offset="1" stop-color="#141414"/></radialGradient><radialGradient id="f" cx="0" cy="0" r="1" gradientTransform="translate(5.908 9.487) scale(64.9174)" gradientUnits="userSpaceOnUse"><stop stop-color="#fff"/><stop offset=".31" stop-color="#FDFDFD"/><stop offset=".451" stop-color="#F6F6F6"/><stop offset=".557" stop-color="#E9E9E9"/><stop offset=".646" stop-color="#D7D7D7"/><stop offset=".724" stop-color="#BFBFBF"/><stop offset=".794" stop-color="#A2A2A2"/><stop offset=".859" stop-color="gray"/><stop offset=".92" stop-color="#575757"/><stop offset=".975" stop-color="#2B2B2B"/><stop offset="1" stop-color="#141414"/></radialGradient><radialGradient id="g" cx="0" cy="0" r="1" gradientTransform="translate(17.532 18.498) scale(17.4953)" gradientUnits="userSpaceOnUse"><stop stop-color="#E6E6E6"/><stop offset=".104" stop-color="#D6D6D6"/><stop offset=".307" stop-color="#ADADAD"/><stop offset=".588" stop-color="#6C6C6C"/><stop offset=".933" stop-color="#121212"/><stop offset="1"/></radialGradient><radialGradient id="h" cx="0" cy="0" r="1" gradientTransform="translate(22.316 20.851) scale(25.4432)" gradientUnits="userSpaceOnUse"><stop stop-color="#fff"/><stop offset=".344" stop-color="#FDFDFD"/><stop offset=".481" stop-color="#F6F6F6"/><stop offset=".582" stop-color="#EAEAEA"/><stop offset=".665" stop-color="#D8D8D8"/><stop offset=".737" stop-color="#C2C2C2"/><stop offset=".802" stop-color="#A6A6A6"/><stop offset=".86" stop-color="#848484"/><stop offset=".913" stop-color="#5F5F5F"/><stop offset=".949" stop-color="#404040"/><stop offset=".957" stop-color="#404040"/><stop offset="1"/></radialGradient><radialGradient id="i" cx="0" cy="0" r="1" gradientTransform="translate(14.846 11.207) scale(45.0602)" gradientUnits="userSpaceOnUse"><stop offset=".169" stop-color="#fff"/><stop offset=".196" stop-color="#E0EFF7"/><stop offset=".241" stop-color="#B2D9EC"/><stop offset=".287" stop-color="#8BC5E2"/><stop offset=".335" stop-color="#6BB5DA"/><stop offset=".384" stop-color="#52A9D4"/><stop offset=".436" stop-color="#41A0CF"/><stop offset=".491" stop-color="#369BCD"/><stop offset=".556" stop-color="#39C"/><stop offset=".606" stop-color="#3396C8"/><stop offset=".655" stop-color="#328EBC"/><stop offset=".705" stop-color="#3180A8"/><stop offset=".754" stop-color="#2F6D8C"/><stop offset=".803" stop-color="#2D5468"/><stop offset=".851" stop-color="#2A373D"/><stop offset=".871" stop-color="#292929"/></radialGradient><radialGradient id="j" cx="0" cy="0" r="1" gradientTransform="translate(14.846 11.206) scale(45.0593)" gradientUnits="userSpaceOnUse"><stop offset=".169" stop-color="#fff"/><stop offset=".196" stop-color="#E0EFF7"/><stop offset=".241" stop-color="#B2D9EC"/><stop offset=".287" stop-color="#8BC5E2"/><stop offset=".335" stop-color="#6BB5DA"/><stop offset=".384" stop-color="#52A9D4"/><stop offset=".436" stop-color="#41A0CF"/><stop offset=".491" stop-color="#369BCD"/><stop offset=".556" stop-color="#39C"/><stop offset=".606" stop-color="#3396C8"/><stop offset=".655" stop-color="#328EBC"/><stop offset=".705" stop-color="#3180A8"/><stop offset=".754" stop-color="#2F6D8C"/><stop offset=".803" stop-color="#2D5468"/><stop offset=".851" stop-color="#2A373D"/><stop offset=".871" stop-color="#292929"/></radialGradient><radialGradient id="k" cx="0" cy="0" r="1" gradientTransform="translate(17.77 18.718) scale(17.16)" gradientUnits="userSpaceOnUse"><stop stop-color="#E6E6E6"/><stop offset=".104" stop-color="#D6D6D6"/><stop offset=".307" stop-color="#ADADAD"/><stop offset=".588" stop-color="#6C6C6C"/><stop offset=".933" stop-color="#121212"/><stop offset="1"/></radialGradient><linearGradient id="a" x1="8.219" x2="48.533" y1="8.951" y2="47.908" gradientUnits="userSpaceOnUse"><stop stop-color="#DFF4FF"/><stop offset=".098" stop-color="#D6EAF5"/><stop offset=".268" stop-color="#BFD0D9"/><stop offset=".488" stop-color="#98A5AC"/><stop offset=".747" stop-color="#646B6E"/><stop offset="1" stop-color="#2B2B2B"/></linearGradient><linearGradient id="c" x1="43.872" x2="18.196" y1="43.403" y2="18.591" gradientUnits="userSpaceOnUse"><stop stop-color="#DFF4FF"/><stop offset=".086" stop-color="#D6EAF5"/><stop offset=".233" stop-color="#BED0D9"/><stop offset=".424" stop-color="#96A4AC"/><stop offset=".652" stop-color="#5F686D"/><stop offset=".907" stop-color="#1A1D1E"/><stop offset="1"/></linearGradient><linearGradient id="l" x1="27.749" x2="44.484" y1="14.434" y2="30.605" gradientUnits="userSpaceOnUse"><stop stop-color="#F0F4FF"/><stop offset=".109" stop-color="#EBEFF9"/><stop offset=".247" stop-color="#DCE0EA"/><stop offset=".403" stop-color="#C4C7CF"/><stop offset=".57" stop-color="#A2A4AB"/><stop offset=".747" stop-color="#76777C"/><stop offset=".929" stop-color="#414243"/><stop offset="1" stop-color="#2B2B2B"/></linearGradient><linearGradient id="m" x1="14.167" x2="30.902" y1="28.087" y2="44.258" gradientUnits="userSpaceOnUse"><stop stop-color="#F0F4FF"/><stop offset=".109" stop-color="#EBEFF9"/><stop offset=".247" stop-color="#DCE0EA"/><stop offset=".403" stop-color="#C4C7CF"/><stop offset=".57" stop-color="#A2A4AB"/><stop offset=".747" stop-color="#76777C"/><stop offset=".929" stop-color="#414243"/><stop offset="1" stop-color="#2B2B2B"/></linearGradient><linearGradient id="n" x1="22.262" x2="30.94" y1="22.32" y2="30.706" gradientUnits="userSpaceOnUse"><stop stop-color="#C2D7E8"/><stop offset=".134" stop-color="#BACFE1"/><stop offset=".343" stop-color="#A4BACD"/><stop offset=".6" stop-color="#8098AC"/><stop offset=".894" stop-color="#4E697F"/><stop offset="1" stop-color="#3A566D"/></linearGradient><linearGradient id="o" x1="17.916" x2="34.483" y1="24.375" y2="40.383" gradientUnits="userSpaceOnUse"><stop stop-color="#F0F4FF"/><stop offset=".097" stop-color="#E8EBF6"/><stop offset=".257" stop-color="#D1D4DD"/><stop offset=".459" stop-color="#ABAEB5"/><stop offset=".695" stop-color="#78797D"/><stop offset=".958" stop-color="#363637"/><stop offset="1" stop-color="#2B2B2B"/></linearGradient><linearGradient id="p" x1="30.127" x2="35.938" y1="30.313" y2="35.928" gradientUnits="userSpaceOnUse"><stop stop-color="#D9DEF0"/><stop offset=".123" stop-color="#D4DAEC"/><stop offset=".263" stop-color="#C7CFE2"/><stop offset=".411" stop-color="#B0BCD1"/><stop offset=".566" stop-color="#90A1B8"/><stop offset=".725" stop-color="#677F99"/><stop offset=".885" stop-color="#355674"/><stop offset=".972" stop-color="#173D5D"/></linearGradient><linearGradient id="q" x1="24.182" x2="40.731" y1="18.299" y2="34.291" gradientUnits="userSpaceOnUse"><stop stop-color="#F0F4FF"/><stop offset=".109" stop-color="#EBEFF9"/><stop offset=".247" stop-color="#DCE0EA"/><stop offset=".403" stop-color="#C4C7CF"/><stop offset=".57" stop-color="#A2A4AB"/><stop offset=".747" stop-color="#76777C"/><stop offset=".929" stop-color="#414243"/><stop offset="1" stop-color="#2B2B2B"/></linearGradient></defs>

</svg>