<svg width="40" height="41" viewBox="0 0 40 41" fill="none" xmlns="http://www.w3.org/2000/svg">
    <path fill-rule="evenodd" clip-rule="evenodd"
        d="M32.7279 32.8931C29.3282 36.31 24.808 38.1918 20 38.1918C15.192 38.1918 10.6718 36.31 7.27208 32.8931C3.87233 29.4762 2 24.9332 2 20.101C2 15.2687 3.87233 10.7257 7.27208 7.30879C10.6718 3.89188 15.192 2.0101 20 2.0101C24.808 2.0101 29.3282 3.89188 32.7279 7.30879C36.1277 10.7257 38 15.2687 38 20.101C38 24.9332 36.1277 29.4762 32.7279 32.8931ZM0 20.101C0 31.2024 8.9543 40.2019 20 40.2019C31.0457 40.2019 40 31.2024 40 20.101C40 8.9995 31.0457 0 20 0C8.9543 0 0 8.9995 0 20.101ZM17.9411 24.0992C17.5606 24.5016 17.5768 25.1377 17.9772 25.5201C18.3776 25.9024 19.0106 25.8861 19.391 25.4837L24.058 20.547C24.2408 20.3535 24.3396 20.095 24.3327 19.8283C24.3257 19.5615 24.2135 19.3086 24.0207 19.1251L19.3537 14.6818C18.9528 14.3 18.3198 14.3173 17.94 14.7202C17.5602 15.1232 17.5774 15.7593 17.9783 16.1411L21.9182 19.8921L17.9411 24.0992Z"
        fill="#FF0550" />
</svg>
