<svg width="40" height="40" viewBox="0 0 40 40" fill="none" xmlns="http://www.w3.org/2000/svg">
<path d="M40 0H0V40H40V0Z" fill="white"/>
<path d="M19.9994 25C19.703 25.0005 19.4184 24.8841 19.2074 24.676L12.3274 17.887C12.224 17.7847 12.1419 17.6629 12.0858 17.5287C12.0298 17.3945 12.001 17.2504 12.001 17.105C12.001 16.9595 12.0298 16.8155 12.0858 16.6813C12.1419 16.5471 12.224 16.4253 12.3274 16.323C12.5389 16.1153 12.8234 15.9989 13.1199 15.9989C13.4163 15.9989 13.7009 16.1153 13.9124 16.323L19.9994 22.331L26.0864 16.324C26.2978 16.1166 26.5822 16.0004 26.8784 16.0004C27.1746 16.0004 27.4589 16.1166 27.6704 16.324C27.7738 16.4263 27.8559 16.5481 27.9119 16.6823C27.9679 16.8165 27.9968 16.9605 27.9968 17.106C27.9968 17.2514 27.9679 17.3955 27.9119 17.5297C27.8559 17.6639 27.7738 17.7857 27.6704 17.888L20.7904 24.677C20.5794 24.8845 20.2952 25.0005 19.9994 25Z" fill="#FF0550"/>
</svg>
