<svg width="8" height="14" viewBox="0 0 8 14" fill="none" xmlns="http://www.w3.org/2000/svg">
<path d="M4.16392e-06 6.9995C-0.000534874 7.29596 0.115882 7.58066 0.32396 7.79174L6.11217 13.6735C6.21445 13.7769 6.33622 13.8591 6.47043 13.9151C6.60464 13.9711 6.74863 14 6.89406 14C7.0395 14 7.18348 13.9711 7.3177 13.9151C7.45191 13.8591 7.57368 13.7769 7.67596 13.6735C7.88364 13.462 8 13.1773 8 12.8808C8 12.5843 7.88364 12.2996 7.67596 12.088L2.66864 6.9995L7.67496 1.91096C7.88234 1.69946 7.99851 1.415 7.99851 1.11873C7.99851 0.822448 7.88234 0.537994 7.67496 0.326486C7.57268 0.223052 7.45091 0.140938 7.3167 0.0848967C7.18249 0.0288556 7.0385 2.51555e-08 6.89307 0C6.74763 -2.51555e-08 6.60365 0.0288555 6.46943 0.0848966C6.33522 0.140938 6.21345 0.223052 6.11117 0.326486L0.32296 6.20726C0.115248 6.4185 -0.000801196 6.70318 4.16392e-06 6.9995Z" fill="#A4B0BE"/>
</svg>
