{
  "android_install_page": {
    "js_files": [
      "static/js/accordion.js"
    ],
    "output_name": "android-install-page"
  },
  "download_page": {
    "js_files": [
      "static/js/main.js",
      "static/js/vendor/bowser.js",
      "static/js/download.js"
    ],
    "output_name": "download-page"
  },
  "installed_donate_page": {
    "js_files": [
      "static/js/vendor/url-search-params.min.js",
      "static/js/vendor/uuidv4.min.js",
      "static/js/vendor/bowser.js",
      "static/js/vendor/lodash.custom.min.js",
      "static/js/payment/form.js",
      "static/js/payment/providers/paypal.js",
      "static/js/payment/providers/stripe.js",
      "static/js/payment/controller.js",
      "static/js/pages/installed-donate.js",
      "static/js/address-masking.js"
    ],
    "output_name": "installed-donate-page"
  }
}
