{
    "openapi": "3.0.0",
    "info": {
        "title": "Printing API",
        "description": "An API to manage documents",
        "contact": {
            "email": "contact@initialde.com"
        },
        "version": "1.0.0",
        "x-logo": {
            "url": "https://via.placeholder.com/190x90.png?text=L5-Swagger"
        }
    },
    "servers": [
        {
            "url": "http://localhost:8000",
            "description": "Local Server"
        }
    ],
    "paths": {
        "/api/v1/auth/batches": {
            "get": {
                "tags": [
                    "Batches"
                ],
                "summary": "Get list of batches",
                "description": "Order Batches in descending order of ID",
                "operationId": "batches",
                "parameters": [
                    {
                        "name": "updated_at",
                        "in": "query",
                        "description": "Filtre the batches by updated_at",
                        "required": false,
                        "schema": {
                            "type": "date"
                        }
                    },
                    {
                        "name": "documents",
                        "in": "query",
                        "description": "Load the relationship documents",
                        "required": false
                    }
                ],
                "responses": {
                    "200": {
                        "description": "Successful operation",
                        "content": {
                            "application/json": {
                                "schema": {
                                    "type": "array",
                                    "items": {
                                        "$ref": "#/components/schemas/BatchOutput"
                                    }
                                }
                            }
                        }
                    },
                    "400": {
                        "description": "Something went wrong"
                    }
                },
                "security": [
                    {
                        "sanctumToken": []
                    }
                ]
            },
            "post": {
                "tags": [
                    "Batches"
                ],
                "summary": "Store Batch",
                "description": "Store Batch",
                "operationId": "storeBatch",
                "requestBody": {
                    "required": true,
                    "content": {
                        "application/json": {
                            "schema": {
                                "$ref": "#/components/schemas/BatchInput"
                            }
                        }
                    }
                },
                "responses": {
                    "200": {
                        "description": "Success",
                        "content": {
                            "application/json": {
                                "schema": {
                                    "$ref": "#/components/schemas/BatchOutput"
                                }
                            }
                        }
                    },
                    "400": {
                        "description": "Bad request"
                    },
                    "401": {
                        "description": "Unauthorized"
                    },
                    "403": {
                        "description": "Forbidden"
                    },
                    "404": {
                        "description": "Not found"
                    },
                    "422": {
                        "description": "Unprocessable Entity"
                    }
                },
                "security": [
                    {
                        "sanctumToken": []
                    }
                ]
            }
        },
        "/api/v1/auth/batches/{id}": {
            "get": {
                "tags": [
                    "Batches"
                ],
                "summary": "Get one Batch",
                "description": "Get Batch by id",
                "operationId": "batchShow",
                "parameters": [
                    {
                        "name": "id",
                        "in": "path",
                        "description": "The ID of the batch to show",
                        "required": true,
                        "schema": {
                            "type": "number",
                            "example": 1
                        }
                    }
                ],
                "responses": {
                    "200": {
                        "description": "show batch",
                        "content": {
                            "application/json": {
                                "schema": {
                                    "$ref": "#/components/schemas/BatchOutput"
                                }
                            }
                        }
                    },
                    "400": {
                        "description": "Something went wrong"
                    }
                },
                "security": [
                    {
                        "sanctumToken": []
                    }
                ]
            },
            "put": {
                "tags": [
                    "Batches"
                ],
                "summary": "Update Batch",
                "description": "Update Batch",
                "operationId": "updateBatch",
                "parameters": [
                    {
                        "name": "id",
                        "in": "path",
                        "description": "The ID of the batch to update",
                        "required": true,
                        "schema": {
                            "type": "number",
                            "example": 1
                        }
                    }
                ],
                "requestBody": {
                    "required": true,
                    "content": {
                        "application/json": {
                            "schema": {
                                "$ref": "#/components/schemas/BatchInput"
                            }
                        }
                    }
                },
                "responses": {
                    "200": {
                        "description": "Success",
                        "content": {
                            "application/json": {
                                "schema": {
                                    "$ref": "#/components/schemas/BatchOutput"
                                }
                            }
                        }
                    },
                    "400": {
                        "description": "Bad request"
                    },
                    "401": {
                        "description": "Unauthorized"
                    },
                    "403": {
                        "description": "Forbidden"
                    },
                    "404": {
                        "description": "Not found"
                    },
                    "422": {
                        "description": "Unprocessable Entity"
                    }
                },
                "security": [
                    {
                        "sanctumToken": []
                    }
                ]
            },
            "delete": {
                "tags": [
                    "Batches"
                ],
                "summary": "Delete Batch",
                "description": "Delete Batch",
                "operationId": "deleteBatch",
                "parameters": [
                    {
                        "name": "id",
                        "in": "path",
                        "description": "The ID of the batch to delete",
                        "required": true,
                        "schema": {
                            "type": "number",
                            "example": 1
                        }
                    }
                ],
                "responses": {
                    "200": {
                        "description": "Success"
                    },
                    "400": {
                        "description": "Bad request"
                    },
                    "401": {
                        "description": "Unauthorized"
                    },
                    "403": {
                        "description": "Forbidden"
                    },
                    "404": {
                        "description": "Not found"
                    },
                    "422": {
                        "description": "Unprocessable Entity"
                    }
                },
                "security": [
                    {
                        "sanctumToken": []
                    }
                ]
            }
        },
        "/api/v1/auth/documents": {
            "get": {
                "tags": [
                    "Documents"
                ],
                "summary": "Get list of documents",
                "description": "Order Documents in descending order of ID",
                "operationId": "documents",
                "parameters": [
                    {
                        "name": "updated_at",
                        "in": "query",
                        "description": "Filtre the documents by updated_at",
                        "required": false,
                        "schema": {
                            "type": "date"
                        }
                    },
                    {
                        "name": "batch_id",
                        "in": "query",
                        "description": "Filter the  by batch_id",
                        "required": false,
                        "schema": {
                            "type": "number"
                        }
                    },
                    {
                        "name": "document_type_id",
                        "in": "query",
                        "description": "Filter the documents by document_type_id",
                        "required": false,
                        "schema": {
                            "type": "number"
                        }
                    },
                    {
                        "name": "status",
                        "in": "query",
                        "description": "Filter the documents by status",
                        "required": false,
                        "schema": {
                            "type": "string"
                        }
                    },
                    {
                        "name": "document_type",
                        "in": "query",
                        "description": "Load the relationship document_type",
                        "required": false
                    },
                    {
                        "name": "batch",
                        "in": "query",
                        "description": "Load the relationship batch",
                        "required": false
                    }
                ],
                "responses": {
                    "200": {
                        "description": "Successful operation",
                        "content": {
                            "application/json": {
                                "schema": {
                                    "type": "array",
                                    "items": {
                                        "$ref": "#/components/schemas/DocumentOuput"
                                    }
                                }
                            }
                        }
                    },
                    "400": {
                        "description": "Something went wrong"
                    }
                },
                "security": [
                    {
                        "sanctumToken": []
                    }
                ]
            },
            "post": {
                "tags": [
                    "Documents"
                ],
                "summary": "Store Document",
                "description": "Store Document",
                "operationId": "storeDocument",
                "requestBody": {
                    "required": true,
                    "content": {
                        "application/json": {
                            "schema": {
                                "$ref": "#/components/schemas/DocumentInput"
                            }
                        }
                    }
                },
                "responses": {
                    "200": {
                        "description": "Success",
                        "content": {
                            "application/json": {
                                "schema": {
                                    "$ref": "#/components/schemas/DocumentOuput"
                                }
                            }
                        }
                    },
                    "400": {
                        "description": "Bad request"
                    },
                    "401": {
                        "description": "Unauthorized"
                    },
                    "403": {
                        "description": "Forbidden"
                    },
                    "404": {
                        "description": "Not found"
                    },
                    "422": {
                        "description": "Unprocessable Entity"
                    }
                },
                "security": [
                    {
                        "sanctumToken": []
                    }
                ]
            }
        },
        "/api/v1/auth/documents/{id}": {
            "get": {
                "tags": [
                    "Documents"
                ],
                "summary": "Get one Document",
                "description": "Get Document by id",
                "operationId": "documentShow",
                "parameters": [
                    {
                        "name": "id",
                        "in": "path",
                        "description": "The ID of the document to show",
                        "required": true,
                        "schema": {
                            "type": "number",
                            "example": 1
                        }
                    }
                ],
                "responses": {
                    "200": {
                        "description": "show document type",
                        "content": {
                            "application/json": {
                                "schema": {
                                    "$ref": "#/components/schemas/DocumentOuput"
                                }
                            }
                        }
                    },
                    "400": {
                        "description": "Something went wrong"
                    }
                },
                "security": [
                    {
                        "sanctumToken": []
                    }
                ]
            },
            "put": {
                "tags": [
                    "Documents"
                ],
                "summary": "Update Document",
                "description": "Update Document",
                "operationId": "updateDocument",
                "parameters": [
                    {
                        "name": "id",
                        "in": "path",
                        "description": "The ID of the document to update",
                        "required": true,
                        "schema": {
                            "type": "number",
                            "example": 1
                        }
                    }
                ],
                "requestBody": {
                    "required": true,
                    "content": {
                        "application/json": {
                            "schema": {
                                "$ref": "#/components/schemas/DocumentInput"
                            }
                        }
                    }
                },
                "responses": {
                    "200": {
                        "description": "Success",
                        "content": {
                            "application/json": {
                                "schema": {
                                    "$ref": "#/components/schemas/DocumentOuput"
                                }
                            }
                        }
                    },
                    "400": {
                        "description": "Bad request"
                    },
                    "401": {
                        "description": "Unauthorized"
                    },
                    "403": {
                        "description": "Forbidden"
                    },
                    "404": {
                        "description": "Not found"
                    },
                    "422": {
                        "description": "Unprocessable Entity"
                    }
                },
                "security": [
                    {
                        "sanctumToken": []
                    }
                ]
            },
            "delete": {
                "tags": [
                    "Documents"
                ],
                "summary": "Delete Document",
                "description": "Delete Document",
                "operationId": "deleteDocument",
                "parameters": [
                    {
                        "name": "id",
                        "in": "path",
                        "description": "The ID of the document to delete",
                        "required": true,
                        "schema": {
                            "type": "number",
                            "example": 1
                        }
                    }
                ],
                "responses": {
                    "200": {
                        "description": "Success"
                    },
                    "400": {
                        "description": "Bad request"
                    },
                    "401": {
                        "description": "Unauthorized"
                    },
                    "403": {
                        "description": "Forbidden"
                    },
                    "404": {
                        "description": "Not found"
                    },
                    "422": {
                        "description": "Unprocessable Entity"
                    }
                },
                "security": [
                    {
                        "sanctumToken": []
                    }
                ]
            }
        },
        "/api/v1/auth/documents/{id}/changeStatus": {
            "post": {
                "tags": [
                    "Documents"
                ],
                "summary": "changeStatus",
                "description": "changeStatus",
                "operationId": "changeStatus",
                "parameters": [
                    {
                        "name": "id",
                        "in": "path",
                        "description": "The ID of the document to change status",
                        "required": true,
                        "schema": {
                            "type": "number",
                            "example": 1
                        }
                    },
                    {
                        "name": "state",
                        "in": "path",
                        "description": "The status of the document to change",
                        "required": true,
                        "schema": {
                            "type": "string",
                            "example": "pending"
                        }
                    }
                ],
                "responses": {
                    "200": {
                        "description": "Success",
                        "content": {
                            "application/json": {
                                "schema": {
                                    "$ref": "#/components/schemas/DocumentOuput"
                                }
                            }
                        }
                    },
                    "400": {
                        "description": "Bad request"
                    },
                    "401": {
                        "description": "Unauthorized"
                    },
                    "403": {
                        "description": "Forbidden"
                    },
                    "404": {
                        "description": "Not found"
                    },
                    "422": {
                        "description": "Unprocessable Entity"
                    }
                },
                "security": [
                    {
                        "sanctumToken": []
                    }
                ]
            }
        },
        "/api/v1/auth/admin/document_types": {
            "get": {
                "tags": [
                    "Document Types"
                ],
                "summary": "Get list of documents types",
                "description": "Order Document Types in descending order of ID",
                "operationId": "documents_types",
                "parameters": [
                    {
                        "name": "updated_at",
                        "in": "query",
                        "description": "Filtre the documents types by updated_at",
                        "required": false,
                        "schema": {
                            "type": "date"
                        }
                    }
                ],
                "responses": {
                    "200": {
                        "description": "Successful operation",
                        "content": {
                            "application/json": {
                                "schema": {
                                    "type": "array",
                                    "items": {
                                        "$ref": "#/components/schemas/DocumentTypeOutput"
                                    }
                                }
                            }
                        }
                    },
                    "400": {
                        "description": "Something went wrong"
                    }
                },
                "security": [
                    {
                        "sanctumToken": []
                    }
                ]
            },
            "post": {
                "tags": [
                    "Document Types"
                ],
                "summary": "Store Document Type",
                "description": "Store Document Type",
                "operationId": "storeDocumentType",
                "requestBody": {
                    "required": true,
                    "content": {
                        "application/json": {
                            "schema": {
                                "$ref": "#/components/schemas/DocumentTypeInput"
                            }
                        }
                    }
                },
                "responses": {
                    "200": {
                        "description": "Success",
                        "content": {
                            "application/json": {
                                "schema": {
                                    "$ref": "#/components/schemas/DocumentTypeOutput"
                                }
                            }
                        }
                    },
                    "400": {
                        "description": "Bad request"
                    },
                    "401": {
                        "description": "Unauthorized"
                    },
                    "403": {
                        "description": "Forbidden"
                    },
                    "404": {
                        "description": "Not found"
                    },
                    "422": {
                        "description": "Unprocessable Entity"
                    }
                },
                "security": [
                    {
                        "sanctumToken": []
                    }
                ]
            }
        },
        "/api/v1/auth/admin/document_types/{id}": {
            "get": {
                "tags": [
                    "Document Types"
                ],
                "summary": "Get one Document Type",
                "description": "Get Document Type by id",
                "operationId": "documenttypeShow",
                "parameters": [
                    {
                        "name": "id",
                        "in": "path",
                        "description": "The ID of the document type to show",
                        "required": true,
                        "schema": {
                            "type": "number",
                            "example": 1
                        }
                    }
                ],
                "responses": {
                    "200": {
                        "description": "show document type",
                        "content": {
                            "application/json": {
                                "schema": {
                                    "$ref": "#/components/schemas/DocumentTypeOutput"
                                }
                            }
                        }
                    },
                    "400": {
                        "description": "Something went wrong"
                    }
                },
                "security": [
                    {
                        "sanctumToken": []
                    }
                ]
            },
            "put": {
                "tags": [
                    "Document Types"
                ],
                "summary": "Update Document Type",
                "description": "Update Document Type",
                "operationId": "updateDocumentType",
                "parameters": [
                    {
                        "name": "id",
                        "in": "path",
                        "description": "The ID of the document type to update",
                        "required": true,
                        "schema": {
                            "type": "number",
                            "example": 1
                        }
                    }
                ],
                "requestBody": {
                    "required": true,
                    "content": {
                        "application/json": {
                            "schema": {
                                "$ref": "#/components/schemas/DocumentTypeInput"
                            }
                        }
                    }
                },
                "responses": {
                    "200": {
                        "description": "Success",
                        "content": {
                            "application/json": {
                                "schema": {
                                    "$ref": "#/components/schemas/DocumentTypeOutput"
                                }
                            }
                        }
                    },
                    "400": {
                        "description": "Bad request"
                    },
                    "401": {
                        "description": "Unauthorized"
                    },
                    "403": {
                        "description": "Forbidden"
                    },
                    "404": {
                        "description": "Not found"
                    },
                    "422": {
                        "description": "Unprocessable Entity"
                    }
                },
                "security": [
                    {
                        "sanctumToken": []
                    }
                ]
            },
            "delete": {
                "tags": [
                    "Document Types"
                ],
                "summary": "Delete Document Type",
                "description": "Delete Document Type",
                "operationId": "deleteDocumentType",
                "parameters": [
                    {
                        "name": "id",
                        "in": "path",
                        "description": "The ID of the document type to delete",
                        "required": true,
                        "schema": {
                            "type": "number",
                            "example": 1
                        }
                    }
                ],
                "responses": {
                    "200": {
                        "description": "Success"
                    },
                    "400": {
                        "description": "Bad request"
                    },
                    "401": {
                        "description": "Unauthorized"
                    },
                    "403": {
                        "description": "Forbidden"
                    },
                    "404": {
                        "description": "Not found"
                    },
                    "422": {
                        "description": "Unprocessable Entity"
                    }
                },
                "security": [
                    {
                        "sanctumToken": []
                    }
                ]
            }
        },
        "/api/v1/auth/admin/document_types/documents/count": {
            "get": {
                "tags": [
                    "Document Types"
                ],
                "summary": "Get documents count by type",
                "description": "documents count by type",
                "operationId": "documents_types_count",
                "parameters": [
                    {
                        "name": "document_type_name",
                        "in": "query",
                        "description": "Filtre the documents count by type name",
                        "required": false,
                        "schema": {
                            "type": "string"
                        }
                    }
                ],
                "responses": {
                    "200": {
                        "description": "Successful operation",
                        "content": {
                            "application/json": {
                                "schema": {
                                    "properties": {
                                        "id": {
                                            "type": "number",
                                            "example": 1
                                        },
                                        "name": {
                                            "type": "string",
                                            "example": "Permis"
                                        },
                                        "description": {
                                            "type": "string",
                                            "example": null
                                        },
                                        "configuration": {
                                            "type": "string",
                                            "example": null
                                        },
                                        "created_at": {
                                            "type": "string",
                                            "format": "date",
                                            "example": null
                                        },
                                        "updated_at": {
                                            "type": "string",
                                            "format": "date",
                                            "example": null
                                        },
                                        "documents_all": {
                                            "type": "number",
                                            "example": 0
                                        },
                                        "documents_printed": {
                                            "type": "number",
                                            "example": 0
                                        },
                                        "documents_pending": {
                                            "type": "number",
                                            "example": 0
                                        }
                                    },
                                    "type": "object"
                                }
                            }
                        }
                    },
                    "400": {
                        "description": "Something went wrong"
                    }
                },
                "security": [
                    {
                        "sanctumToken": []
                    }
                ]
            }
        },
        "/api/v1/login": {
            "post": {
                "tags": [
                    "Authentication"
                ],
                "summary": "Login",
                "description": "Returns response",
                "operationId": "ea8abffa2b6dd5c1344f3333453e03de",
                "requestBody": {
                    "description": "Login credentials",
                    "required": true,
                    "content": {
                        "application/json": {
                            "schema": {
                                "required": [
                                    "registration",
                                    "password"
                                ],
                                "properties": {
                                    "registration": {
                                        "type": "string",
                                        "format": "registration",
                                        "example": "john@example.com"
                                    },
                                    "password": {
                                        "type": "string",
                                        "format": "password",
                                        "example": "password123"
                                    }
                                },
                                "type": "object"
                            }
                        }
                    }
                },
                "responses": {
                    "200": {
                        "description": "Successful operation",
                        "content": {
                            "application/json": {
                                "schema": {
                                    "properties": {
                                        "message": {
                                            "type": "string",
                                            "format": "message",
                                            "example": "Connexion réussie"
                                        },
                                        "success": {
                                            "type": "boolean",
                                            "format": "succes",
                                            "example": "true"
                                        },
                                        "user": {
                                            "$ref": "#/components/schemas/UserOutput"
                                        },
                                        "token": {
                                            "type": "string",
                                            "format": "JWT",
                                            "example": "eyJhbGciOiJIUzI1NiIsInR5cCI6IkpXVCJ9.eyJzdWIiOiIxMjM0NTY3ODkwIiwibmFtZSI6IkpvaG4gRG9lIiwiaWF0IjoxNTE2MjM5MDIyfQ.SflKxwRJSMeKKF2QT4fwpMeJf36POk6yJV_adQssw5c"
                                        }
                                    },
                                    "type": "object"
                                }
                            }
                        }
                    },
                    "403": {
                        "description": "Failure operation",
                        "content": {
                            "application/json": {
                                "schema": {
                                    "properties": {
                                        "message": {
                                            "type": "string",
                                            "format": "message",
                                            "example": "Échec de la connexion, réessayez plustard."
                                        },
                                        "success": {
                                            "type": "boolean",
                                            "format": "succes",
                                            "example": "false"
                                        },
                                        "user": {
                                            "type": "object",
                                            "format": "user",
                                            "example": "null"
                                        }
                                    },
                                    "type": "object"
                                }
                            }
                        }
                    },
                    "500": {
                        "description": "Failure operation",
                        "content": {
                            "application/json": {
                                "schema": {
                                    "properties": {
                                        "message": {
                                            "type": "string",
                                            "format": "message",
                                            "example": "Impossible de créer le jeton"
                                        },
                                        "success": {
                                            "type": "boolean",
                                            "format": "succes",
                                            "example": "false"
                                        },
                                        "error": {
                                            "type": "string",
                                            "format": "error",
                                            "example": "something went wrong"
                                        }
                                    },
                                    "type": "object"
                                }
                            }
                        }
                    },
                    "400": {
                        "description": "Failure operation",
                        "content": {
                            "application/json": {
                                "schema": {
                                    "properties": {
                                        "message": {
                                            "type": "string",
                                            "format": "message",
                                            "example": "Échec de connexion, vérifiez vos données et envoyez à nouveau"
                                        },
                                        "success": {
                                            "type": "boolean",
                                            "format": "succes",
                                            "example": "false"
                                        }
                                    },
                                    "type": "object"
                                }
                            }
                        }
                    },
                    "401": {
                        "description": "Invalid credentials"
                    }
                }
            }
        },
        "/api/v1/auth/logout": {
            "post": {
                "tags": [
                    "Authentication"
                ],
                "summary": "Logout",
                "operationId": "4984033a5e6e40245b5f579c0ab4ad73",
                "responses": {
                    "200": {
                        "description": "Success operation",
                        "content": {
                            "application/json": {
                                "schema": {
                                    "properties": {
                                        "message": {
                                            "type": "string",
                                            "format": "message",
                                            "example": "Utilisateur déconnecté."
                                        }
                                    },
                                    "type": "object"
                                }
                            }
                        }
                    },
                    "401": {
                        "description": "Unauthenticated",
                        "content": {
                            "application/json": {
                                "schema": {
                                    "properties": {
                                        "message": {
                                            "type": "string",
                                            "format": "message",
                                            "example": "Unauthenticated"
                                        }
                                    },
                                    "type": "object"
                                }
                            }
                        }
                    }
                },
                "security": [
                    {
                        "sanctumToken": []
                    }
                ]
            }
        },
        "/api/v1/auth/admin/users": {
            "get": {
                "tags": [
                    "Users"
                ],
                "summary": "Get list of users",
                "description": "Order users in descending order of ID",
                "operationId": "users",
                "parameters": [
                    {
                        "name": "updated_at",
                        "in": "query",
                        "description": "Filter users by updated_at",
                        "required": false,
                        "schema": {
                            "type": "date"
                        }
                    }
                ],
                "responses": {
                    "200": {
                        "description": "Successful operation",
                        "content": {
                            "application/json": {
                                "schema": {
                                    "type": "array",
                                    "items": {
                                        "$ref": "#/components/schemas/UserOutput"
                                    }
                                }
                            }
                        }
                    },
                    "400": {
                        "description": "Something went wrong"
                    },
                    "403": {
                        "description": "Forbidden"
                    }
                },
                "security": [
                    {
                        "sanctumToken": []
                    }
                ]
            },
            "post": {
                "tags": [
                    "Users"
                ],
                "summary": "Store User",
                "description": "Store User",
                "operationId": "storeUser",
                "requestBody": {
                    "required": true,
                    "content": {
                        "multipart/form-data": {
                            "schema": {
                                "$ref": "#/components/schemas/UserInput"
                            }
                        },
                        "application/json": {
                            "schema": {
                                "$ref": "#/components/schemas/UserInput"
                            }
                        }
                    }
                },
                "responses": {
                    "200": {
                        "description": "Success",
                        "content": {
                            "application/json": {
                                "schema": {
                                    "$ref": "#/components/schemas/UserOutput"
                                }
                            }
                        }
                    },
                    "400": {
                        "description": "Bad request"
                    },
                    "401": {
                        "description": "Unauthorized"
                    },
                    "403": {
                        "description": "Forbidden"
                    },
                    "404": {
                        "description": "Not found"
                    },
                    "422": {
                        "description": "Unprocessable Entity"
                    }
                },
                "security": [
                    {
                        "sanctumToken": []
                    }
                ]
            }
        },
        "/api/v1/auth/admin/users/{id}": {
            "get": {
                "tags": [
                    "Users"
                ],
                "summary": "Get one User",
                "description": "Get User by id",
                "operationId": "userShow",
                "parameters": [
                    {
                        "name": "id",
                        "in": "path",
                        "description": "The ID of the User to show",
                        "required": true,
                        "schema": {
                            "type": "number",
                            "example": 1
                        }
                    }
                ],
                "responses": {
                    "200": {
                        "description": "show User",
                        "content": {
                            "application/json": {
                                "schema": {
                                    "$ref": "#/components/schemas/UserOutput"
                                }
                            }
                        }
                    },
                    "400": {
                        "description": "Something went wrong"
                    }
                },
                "security": [
                    {
                        "sanctumToken": []
                    }
                ]
            },
            "put": {
                "tags": [
                    "Users"
                ],
                "summary": "Update User",
                "description": "Update User",
                "operationId": "updateUser",
                "parameters": [
                    {
                        "name": "id",
                        "in": "path",
                        "description": "The ID of the User to update",
                        "required": true,
                        "schema": {
                            "type": "number",
                            "example": 1
                        }
                    }
                ],
                "requestBody": {
                    "required": true,
                    "content": {
                        "multipart/form-data": {
                            "schema": {
                                "$ref": "#/components/schemas/UserInput"
                            }
                        },
                        "application/json": {
                            "schema": {
                                "$ref": "#/components/schemas/UserInput"
                            }
                        }
                    }
                },
                "responses": {
                    "200": {
                        "description": "Success",
                        "content": {
                            "application/json": {
                                "schema": {
                                    "$ref": "#/components/schemas/UserOutput"
                                }
                            }
                        }
                    },
                    "400": {
                        "description": "Bad request"
                    },
                    "401": {
                        "description": "Unauthorized"
                    },
                    "403": {
                        "description": "Forbidden"
                    },
                    "404": {
                        "description": "Not found"
                    },
                    "422": {
                        "description": "Unprocessable Entity"
                    }
                },
                "security": [
                    {
                        "sanctumToken": []
                    }
                ]
            },
            "delete": {
                "tags": [
                    "Users"
                ],
                "summary": "Delete User",
                "description": "Delete User",
                "operationId": "deleteUser",
                "parameters": [
                    {
                        "name": "id",
                        "in": "path",
                        "description": "The ID of the User to delete",
                        "required": true,
                        "schema": {
                            "type": "number",
                            "example": 1
                        }
                    }
                ],
                "responses": {
                    "200": {
                        "description": "Success"
                    },
                    "400": {
                        "description": "Bad request"
                    },
                    "401": {
                        "description": "Unauthorized"
                    },
                    "403": {
                        "description": "Forbidden"
                    },
                    "404": {
                        "description": "Not found"
                    },
                    "422": {
                        "description": "Unprocessable Entity"
                    }
                },
                "security": [
                    {
                        "sanctumToken": []
                    }
                ]
            }
        },
        "/api/v1/auth/admin/users/{id}/lock": {
            "post": {
                "tags": [
                    "Users"
                ],
                "summary": "lock User",
                "description": "lock User",
                "operationId": "lockUser",
                "parameters": [
                    {
                        "name": "id",
                        "in": "path",
                        "description": "The ID of the User to lock",
                        "required": true,
                        "schema": {
                            "type": "number",
                            "example": 1
                        }
                    }
                ],
                "responses": {
                    "200": {
                        "description": "Success",
                        "content": {
                            "application/json": {
                                "schema": {
                                    "$ref": "#/components/schemas/UserOutput"
                                }
                            }
                        }
                    },
                    "400": {
                        "description": "Bad request"
                    },
                    "401": {
                        "description": "Unauthorized"
                    },
                    "403": {
                        "description": "Forbidden"
                    },
                    "404": {
                        "description": "Not found"
                    },
                    "422": {
                        "description": "Unprocessable Entity"
                    }
                },
                "security": [
                    {
                        "sanctumToken": []
                    }
                ]
            }
        },
        "/api/v1/auth/admin/users/{id}/resetPassword": {
            "post": {
                "tags": [
                    "Users"
                ],
                "summary": "resetPassword",
                "description": "resetPassword",
                "operationId": "resetPassword",
                "parameters": [
                    {
                        "name": "id",
                        "in": "path",
                        "description": "The ID of the User to reset password",
                        "required": true,
                        "schema": {
                            "type": "number",
                            "example": 1
                        }
                    }
                ],
                "requestBody": {
                    "content": {
                        "application/json": {
                            "schema": {
                                "properties": {
                                    "": {
                                        "properties": {
                                            "newPassword": {
                                                "type": "string"
                                            },
                                            "oldPassword": {
                                                "type": "string"
                                            },
                                            "confirmPassword": {
                                                "type": "string"
                                            }
                                        },
                                        "type": "object"
                                    }
                                },
                                "type": "object",
                                "example": {
                                    "oldPassword": "123456789",
                                    "newPassword": "123456789012",
                                    "confirmPassword": "123456789012"
                                }
                            }
                        }
                    }
                },
                "responses": {
                    "200": {
                        "description": "Success",
                        "content": {
                            "application/json": {
                                "schema": {
                                    "properties": {
                                        "success": {
                                            "type": "boolean",
                                            "example": "true"
                                        },
                                        "message": {
                                            "type": "string",
                                            "example": "Mot de passe modifié avec succés"
                                        }
                                    },
                                    "type": "object"
                                }
                            }
                        }
                    },
                    "400": {
                        "description": "Bad request"
                    },
                    "401": {
                        "description": "Unauthorized"
                    },
                    "403": {
                        "description": "Forbidden"
                    },
                    "404": {
                        "description": "Not found"
                    },
                    "422": {
                        "description": "Unprocessable Entity"
                    }
                },
                "security": [
                    {
                        "sanctumToken": []
                    }
                ]
            }
        }
    },
    "components": {
        "schemas": {
            "BatchOutput": {
                "title": "BatchOutput",
                "properties": {
                    "id": {
                        "type": "number"
                    },
                    "number": {
                        "type": "number"
                    },
                    "label": {
                        "type": "string"
                    },
                    "begin": {
                        "type": "string",
                        "format": "date"
                    },
                    "end": {
                        "type": "string",
                        "format": "date"
                    },
                    "documents": {
                        "type": "array",
                        "items": {
                            "$ref": "#/components/schemas/DocumentOuput"
                        }
                    },
                    "created_at": {
                        "type": "string",
                        "format": "date"
                    },
                    "updated_at": {
                        "type": "string",
                        "format": "date"
                    }
                },
                "type": "object"
            },
            "BatchInput": {
                "title": "BatchInput",
                "properties": {
                    "label": {
                        "type": "string"
                    },
                    "number": {
                        "type": "number"
                    },
                    "begin": {
                        "type": "string",
                        "format": "date"
                    },
                    "end": {
                        "type": "string",
                        "format": "date"
                    },
                    "documents": {
                        "type": "array",
                        "items": {
                            "type": "number"
                        }
                    }
                },
                "type": "object"
            },
            "DocumentOuput": {
                "title": "DocumentOuput",
                "properties": {
                    "id": {
                        "type": "number"
                    },
                    "number": {
                        "type": "number"
                    },
                    "document_type_id": {
                        "type": "number"
                    },
                    "status": {
                        "type": "string"
                    },
                    "uuid": {
                        "type": "string"
                    },
                    "status_label": {
                        "type": "string"
                    },
                    "stacktrace": {
                        "type": "string"
                    },
                    "batch_id": {
                        "type": "number"
                    },
                    "batch": {
                        "type": "object"
                    },
                    "document_type": {
                        "type": "object"
                    },
                    "files": {
                        "type": "array",
                        "items": {
                            "type": "string"
                        }
                    },
                    "created_at": {
                        "type": "string",
                        "format": "date"
                    },
                    "updated_at": {
                        "type": "string",
                        "format": "date"
                    },
                    "deleted_at": {
                        "type": "string",
                        "format": "date"
                    }
                },
                "type": "object"
            },
            "DocumentInput": {
                "title": "DocumentInput",
                "properties": {
                    "number": {
                        "type": "number"
                    },
                    "document_type_id": {
                        "type": "number"
                    },
                    "status": {
                        "type": "string"
                    },
                    "batch_id": {
                        "type": "number"
                    },
                    "files": {
                        "type": "array",
                        "items": {
                            "type": "string"
                        }
                    }
                },
                "type": "object"
            },
            "DocumentTypeOutput": {
                "title": "DocumentTypeOutput",
                "properties": {
                    "id": {
                        "type": "number"
                    },
                    "name": {
                        "type": "string"
                    },
                    "description": {
                        "type": "string"
                    },
                    "configuration": {
                        "type": "string"
                    },
                    "created_at": {
                        "type": "string",
                        "format": "date"
                    },
                    "updated_at": {
                        "type": "string",
                        "format": "date"
                    }
                },
                "type": "object"
            },
            "DocumentTypeInput": {
                "title": "DocumentTypeInput",
                "properties": {
                    "name": {
                        "type": "string"
                    },
                    "description": {
                        "type": "string"
                    },
                    "configuration": {
                        "type": "string"
                    }
                },
                "type": "object"
            },
            "UserOutput": {
                "title": "UserOutput",
                "properties": {
                    "id": {
                        "type": "number"
                    },
                    "profile": {
                        "type": "string"
                    },
                    "registration": {
                        "type": "string"
                    },
                    "email": {
                        "type": "string"
                    },
                    "name": {
                        "type": "string"
                    },
                    "firstname": {
                        "type": "string"
                    },
                    "profile_label": {
                        "type": "string"
                    },
                    "password": {
                        "type": "string"
                    },
                    "image": {
                        "type": "string"
                    },
                    "email_verified_at": {
                        "type": "string",
                        "format": "date-time"
                    },
                    "is_locked": {
                        "type": "boolean"
                    },
                    "has_password_temp": {
                        "type": "boolean"
                    },
                    "created_at": {
                        "type": "string",
                        "format": "date"
                    },
                    "updated_at": {
                        "type": "string",
                        "format": "date"
                    },
                    "deleted_at": {
                        "type": "string",
                        "format": "date"
                    }
                },
                "type": "object"
            },
            "UserInput": {
                "title": "UserInput",
                "properties": {
                    "profile": {
                        "type": "string"
                    },
                    "registration": {
                        "type": "string"
                    },
                    "email": {
                        "type": "string"
                    },
                    "name": {
                        "type": "string"
                    },
                    "firstname": {
                        "type": "string"
                    },
                    "image": {
                        "type": "file"
                    },
                    "email_verified_at": {
                        "type": "string"
                    },
                    "password": {
                        "type": "string"
                    },
                    "is_locked": {
                        "type": "boolean"
                    },
                    "has_password_temp": {
                        "type": "boolean"
                    }
                },
                "type": "object"
            }
        },
        "securitySchemes": {
            "sanctumToken": {
                "type": "http",
                "name": "Authorization",
                "in": "header",
                "bearerFormat": "JWT",
                "scheme": "Bearer"
            }
        }
    },
    "tags": [
        {
            "name": "Batches",
            "description": "Batches"
        },
        {
            "name": "Documents",
            "description": "Documents"
        },
        {
            "name": "Document Types",
            "description": "Document Types"
        },
        {
            "name": "Authentication",
            "description": "Authentication"
        },
        {
            "name": "Users",
            "description": "Users"
        }
    ]
}