%YAML 1.1
%TAG !u! tag:unity3d.com,2011:
--- !u!114 &11400000
MonoBehaviour:
  m_ObjectHideFlags: 0
  m_CorrespondingSourceObject: {fileID: 0}
  m_PrefabInstance: {fileID: 0}
  m_PrefabAsset: {fileID: 0}
  m_GameObject: {fileID: 0}
  m_Enabled: 1
  m_EditorHideFlags: 0
  m_Script: {fileID: 11500000, guid: 1a190cb8b00b1974fbd9d978f7404172, type: 3}
  m_Name: PowerUp
  m_EditorClassIdentifier: 
  dmg: 0
  type: bufo
  atkSpeed: 0
  range: 20
  spriteTorre: {fileID: 0}
  proyectil: {fileID: 0}
