<svg
   xmlns="http://www.w3.org/2000/svg"
   viewBox="0 0 8 8"
   id="content"
   version="1.1">
   
   <!-- Image being drawn -->
   <path stroke="none" d="m 3 1 4 3 -4 3 z"/>
   <!-- Hit box for click events -->
   <rect width="8" height="8" pointer-events="fill" opacity="0"/>
</svg>
