<?xml version="1.0" encoding="UTF-8" standalone="no"?>
<!-- Generator: Adobe Illustrator 19.2.0, SVG Export Plug-In . SVG Version: 6.00 Build 0)  -->

<svg xmlns:dc="http://purl.org/dc/elements/1.1/" 
  xmlns:cc="http://creativecommons.org/ns#" 
  xmlns:rdf="http://www.w3.org/1999/02/22-rdf-syntax-ns#" 
  xmlns:svg="http://www.w3.org/2000/svg" 
  xmlns="http://www.w3.org/2000/svg" 
  xmlns:sodipodi="http://sodipodi.sourceforge.net/DTD/sodipodi-0.dtd" 
  xmlns:inkscape="http://www.inkscape.org/namespaces/inkscape" version="1.1" id="Calque_1" x="0px" y="0px" viewBox="0 0 115 115" style="enable-background:new 0 0 115 115;" xml:space="preserve" inkscape:version="0.91 r13725" sodipodi:docname="monogramme.svg">
  <metadata id="metadata15">
    <rdf:RDF>
      <cc:Work rdf:about="">
        <dc:format>image/svg+xml</dc:format>
        <dc:type rdf:resource="http://purl.org/dc/dcmitype/StillImage" />
        <dc:title></dc:title>
      </cc:Work>
    </rdf:RDF>
  </metadata>
  <defs id="defs13" />
  <sodipodi:namedview pagecolor="#ffffff" bordercolor="#666666" borderopacity="1" objecttolerance="10" gridtolerance="10" guidetolerance="10" inkscape:pageopacity="0" inkscape:pageshadow="2" inkscape:window-width="1920" inkscape:window-height="1017" id="namedview11" showgrid="false" inkscape:zoom="5.8044244" inkscape:cx="78.275017" inkscape:cy="61.290933" inkscape:window-x="-8" inkscape:window-y="-8" inkscape:window-maximized="1" inkscape:current-layer="Calque_1" />
  <style type="text/css" id="style3">
	.st0{fill:#00B5D8;}
	.st1{fill:#FFFFFF;}
  </style>
  <circle class="st0" cx="57.5" cy="57.5" r="57.5" id="circle5" />
  <path class="st1" d="M79.4,33.8c-12.7-10.7-31.5-10.1-43.5,1.9c0,0,0,0,0,0C24,47.6,23.4,66.5,34.1,79.2c0.6,0.7,1.2,1.4,1.9,2.1  s1.4,1.3,2.1,1.9c12.7,10.7,31.5,10.1,43.5-1.9L77.2,77c0,0,0,0,0,0c-9.5,9.5-24.4,9.8-34.6,1.5l18.1-18.1l18.1-18.1l4.6-4.6  c-0.6-0.7-1.2-1.4-1.9-2.1S80.1,34.4,79.4,33.8z M56.7,56.5L38.6,74.6c-8.3-10.2-8-25.1,1.5-34.6c0,0,0,0,0,0  c9.6-9.5,24.4-9.8,34.6-1.5L56.7,56.5z" id="path7" />
  <path class="st1" d="M85.2,77.5l29.1-29.1c-0.4-2.3-0.9-4.6-1.5-6.9L81,73.3L85.2,77.5z" id="path9" />
</svg>