Title,Price,Location,Date
Уплотнитель холодильника ЛИБХЕР резина гума ущільнювач LIEBHERR,650 грн.,Состояние: Новое,07 мая 2024 г.
Уплотнитель холодильника ЛИБХЕР резина гума ущільнювач LIEBHERR,650 грн.,Состояние: Новое,07 мая 2024 г.
Холодильник Hisense UK LTD,32 000 грн.,Состояние: Новое,06 мая 2024 г.
Холодильник Hisense UK LTD,32 000 грн.,Состояние: Новое,06 мая 2024 г.
Side by side під забудову Холодильник морозильна камера Міле KDN 7724,60 300 грн.,Состояние: Новое,06 мая 2024 г.
Side by side під забудову Холодильник морозильна камера Міле KDN 7724,60 300 грн.,Состояние: Новое,06 мая 2024 г.
Морозильна скриня INTERLUX IL-0200CF,6 400 грн.,Состояние: Новое,Сегодня в 08:05
Морозильна скриня INTERLUX IL-0200CF,6 400 грн.,Состояние: Новое,Сегодня в 08:05
Мини холодильник с морозильной камерой KLARSTEIN 10034554,6 500 грн.,Состояние: Новое,Сегодня в 08:03
Мини холодильник с морозильной камерой KLARSTEIN 10034554,6 500 грн.,Состояние: Новое,Сегодня в 08:03
Датчик до морозильної камери AHT оригінал,1 000 грн.,Состояние: Новое,Сегодня в 07:52
Датчик до морозильної камери AHT оригінал,1 000 грн.,Состояние: Новое,Сегодня в 07:52
Винный холодильник / Мини-бар Klarstein Bellevin 18 Uno/10035863,6 500 грн.,Состояние: Новое,Сегодня в 07:49
Винный холодильник / Мини-бар Klarstein Bellevin 18 Uno/10035863,6 500 грн.,Состояние: Новое,Сегодня в 07:49
Холодильник мини KLARSTEIN Brooklyn 42 (10033822),6 000 грн.,Состояние: Новое,Сегодня в 07:30
Холодильник мини KLARSTEIN Brooklyn 42 (10033822),6 000 грн.,Состояние: Новое,Сегодня в 07:30
Винний холодильник KLARSTEIN Reserva 12 Uno/10035859,3 500 грн.,Состояние: Новое,Сегодня в 06:54
Винний холодильник KLARSTEIN Reserva 12 Uno/10035859,3 500 грн.,Состояние: Новое,Сегодня в 06:54
Морозильная камера,18 000 грн.,Состояние: Новое,Сегодня в 04:52
Морозильная камера,18 000 грн.,Состояние: Новое,Сегодня в 04:52
Холодильна вітринаа нова на запчастини або відновлення,4 800 грн.,Состояние: Новое,Сегодня в 08:03
Холодильна вітринаа нова на запчастини або відновлення,4 800 грн.,Состояние: Новое,Сегодня в 08:03
Холодильник Самунг,12 500 грн.,Состояние: Новое,Сегодня в 03:46
Холодильник Самунг,12 500 грн.,Состояние: Новое,Сегодня в 03:46
"Ущільнювальна резина, уплотнитель, гума для холодильника",80 грн.,Состояние: Новое,Сегодня в 07:01
"Ущільнювальна резина, уплотнитель, гума для холодильника",80 грн.,Состояние: Новое,Сегодня в 07:01
Новий Двокамерний Холодильник Siemens KG36V2WEA HuperFresh NoFrost,32 400 грн.,Состояние: Новое,06 мая 2024 г.
Новий Двокамерний Холодильник Siemens KG36V2WEA HuperFresh NoFrost,32 400 грн.,Состояние: Новое,06 мая 2024 г.
Петля для морозильного ларя,500 грн.,Состояние: Новое,Сегодня в 07:13
Петля для морозильного ларя,500 грн.,Состояние: Новое,Сегодня в 07:13
Нова б/у холодильна вітрина CAPRAIA LUX Фредо широка викладка,11 200 грн.,Состояние: Новое,06 мая 2024 г.
Нова б/у холодильна вітрина CAPRAIA LUX Фредо широка викладка,11 200 грн.,Состояние: Новое,06 мая 2024 г.
"Холодильник BEKO ,стан нового,привезений з Німеччини",14 000 грн.,Состояние: Новое,Сегодня в 06:03
"Холодильник BEKO ,стан нового,привезений з Німеччини",14 000 грн.,Состояние: Новое,Сегодня в 06:03
Вентиль терморегулирующий,220 грн.,Состояние: Новое,Сегодня в 05:21
Вентиль терморегулирующий,220 грн.,Состояние: Новое,Сегодня в 05:21
"Холодильник - VRH-S51M44-W, (білий, однок, 51см) (GRUNHELM)",3 400 грн.,Состояние: Новое,Сегодня в 07:55
"Холодильник - VRH-S51M44-W, (білий, однок, 51см) (GRUNHELM)",3 400 грн.,Состояние: Новое,Сегодня в 07:55
"Новые Холодильник 50 л настоящий

маленький с морозилкой",4 280 грн.,Состояние: Новое,Сегодня в 04:07
"Новые Холодильник 50 л настоящий

маленький с морозилкой",4 280 грн.,Состояние: Новое,Сегодня в 04:07
Нова морозильна скриня  GRUNHELM GCFW-200 морозилка ларь 200л,7 299 грн.,Состояние: Новое,Сегодня в 07:48
Нова морозильна скриня  GRUNHELM GCFW-200 морозилка ларь 200л,7 299 грн.,Состояние: Новое,Сегодня в 07:48
"Ручка двери холодильника атлант 730365800800

ВИДЕО 1

Атлант 73036580",200 грн.,Состояние: Новое,Сегодня в 08:09
"Ручка двери холодильника атлант 730365800800

ВИДЕО 1

Атлант 73036580",200 грн.,Состояние: Новое,Сегодня в 08:09
Холодильник.холодильна вітрина klimasan.,10 000 грн.,Состояние: Новое,Сегодня в 04:06
Холодильник.холодильна вітрина klimasan.,10 000 грн.,Состояние: Новое,Сегодня в 04:06
"Морозильный ларь,скриня GRUNHELM - GCFW-251л Доставка по КИЕВУ",7 550 грн.,Состояние: Новое,Сегодня в 07:54
"Морозильный ларь,скриня GRUNHELM - GCFW-251л Доставка по КИЕВУ",7 550 грн.,Состояние: Новое,Сегодня в 07:54
Холодильник маленький,5 000 грн.,Состояние: Новое,Сегодня в 04:35
Холодильник маленький,5 000 грн.,Состояние: Новое,Сегодня в 04:35
"Холодильник LG GC-B257 / Side by side / з Європи, гарантія, доставка",9 999 грн.,Стан: Нове,20 квітня 2024 р.
"Холодильник LG GC-B257 / Side by side / з Європи, гарантія, доставка",9 999 грн.,Стан: Нове,20 квітня 2024 р.
Морозилка Juka 200 л,10 000 грн.,Стан: Нове,06 травня 2024 р.
Морозилка Juka 200 л,10 000 грн.,Стан: Нове,06 травня 2024 р.
Холодильник AEG новий під вмонтування SCE818E8MF,27 000 грн.,Стан: Нове,07 травня 2024 р.
Холодильник AEG новий під вмонтування SCE818E8MF,27 000 грн.,Стан: Нове,07 травня 2024 р.
Морозильна камера,12 000 грн.,Стан: Нове,07 травня 2024 р.
Морозильна камера,12 000 грн.,Стан: Нове,07 травня 2024 р.
"Датчик NTC 10 кОм заводський, не Китай",100 грн.,Стан: Нове,07 травня 2024 р.
"Датчик NTC 10 кОм заводський, не Китай",100 грн.,Стан: Нове,07 травня 2024 р.
Холодильник двохкамерний  INDESIT INFC8 TI21XO Італія,21 000 грн.,Стан: Нове,07 травня 2024 р.
Холодильник двохкамерний  INDESIT INFC8 TI21XO Італія,21 000 грн.,Стан: Нове,07 травня 2024 р.
Дводверний холодильник Beko GN164021XB сірий side by side,6 000 грн.,Стан: Нове,07 травня 2024 р.
Дводверний холодильник Beko GN164021XB сірий side by side,6 000 грн.,Стан: Нове,07 травня 2024 р.
Морозильна камера Liebherr GP 1356,3 199 грн.,Стан: Нове,07 травня 2024 р.
Морозильна камера Liebherr GP 1356,3 199 грн.,Стан: Нове,07 травня 2024 р.
Холодильник Saturn,2 000 грн.,Стан: Нове,07 травня 2024 р.
Холодильник Saturn,2 000 грн.,Стан: Нове,07 травня 2024 р.
"Барний міні холодильник Exquisit RKB 05-14A, доставка,гарантія",3 499 грн.,Стан: Нове,07 травня 2024 р.
"Барний міні холодильник Exquisit RKB 05-14A, доставка,гарантія",3 499 грн.,Стан: Нове,07 травня 2024 р.
Морозильна камера НОВА,6 500 грн.,Стан: Нове,07 травня 2024 р.
Морозильна камера НОВА,6 500 грн.,Стан: Нове,07 травня 2024 р.
Морозильная камера ELECTROLUX EUF2743AOW 2017 г.в. 280л.186cм.No-Frost,12 500 грн.,Стан: Нове,07 травня 2024 р.
Морозильная камера ELECTROLUX EUF2743AOW 2017 г.в. 280л.186cм.No-Frost,12 500 грн.,Стан: Нове,07 травня 2024 р.
Холодильник для вина TEKA RVU 20046 GBK 113600008,26 000 грн.,Стан: Нове,07 травня 2024 р.
Холодильник для вина TEKA RVU 20046 GBK 113600008,26 000 грн.,Стан: Нове,07 травня 2024 р.
Холодильники,9 889 грн.,Стан: Нове,07 травня 2024 р.
Холодильники,9 889 грн.,Стан: Нове,07 травня 2024 р.
Продам холодильник,5 500 грн.,Стан: Нове,06 травня 2024 р.
Продам холодильник,5 500 грн.,Стан: Нове,06 травня 2024 р.
Есклюзив !!! Чотирьохдверний холодильник Side by Side Hisense Bosch 23,24 500 грн.,Стан: Нове,06 травня 2024 р.
Есклюзив !!! Чотирьохдверний холодильник Side by Side Hisense Bosch 23,24 500 грн.,Стан: Нове,06 травня 2024 р.
"Плата холодильника WhirIpooI 4812 236 78548, нова.",4 000 грн.,Стан: Нове,07 травня 2024 р.
"Плата холодильника WhirIpooI 4812 236 78548, нова.",4 000 грн.,Стан: Нове,07 травня 2024 р.
Продам морозильну камеру,9 000 грн.,Стан: Нове,07 травня 2024 р.
Продам морозильну камеру,9 000 грн.,Стан: Нове,07 травня 2024 р.
Холодильник AEG новий під вмонтування SCE818E8MF,27 000 грн.,Стан: Нове,07 травня 2024 р.
Холодильник AEG новий під вмонтування SCE818E8MF,27 000 грн.,Стан: Нове,07 травня 2024 р.
"Продаж нових холодильників з Європи,",13 000 грн.,Стан: Нове,07 травня 2024 р.
"Продаж нових холодильників з Європи,",13 000 грн.,Стан: Нове,07 травня 2024 р.
Полка в холодильник,260 грн.,Стан: Нове,07 травня 2024 р.
Полка в холодильник,260 грн.,Стан: Нове,07 травня 2024 р.
Вбудований холодильник Whirlpool ART 963/A+/NF крапля/No Frost,14 100 грн.,Стан: Нове,07 травня 2024 р.
Вбудований холодильник Whirlpool ART 963/A+/NF крапля/No Frost,14 100 грн.,Стан: Нове,07 травня 2024 р.
Холодильник Arctic не использовался!,6 900 грн.,Стан: Нове,07 травня 2024 р.
Холодильник Arctic не использовался!,6 900 грн.,Стан: Нове,07 травня 2024 р.
Продам двигатели обдува для холодильника,500 грн.,Стан: Нове,07 травня 2024 р.
Продам двигатели обдува для холодильника,500 грн.,Стан: Нове,07 травня 2024 р.
Крыльчатки от холодильника,150 грн.,Стан: Нове,07 травня 2024 р.
Крыльчатки от холодильника,150 грн.,Стан: Нове,07 травня 2024 р.
