name,url
 «Боржава»,https://zakarpattyachko.com.ua/sanatoriji/borzhava.html
 «Верховина»,https://zakarpattyachko.com.ua/sanatoriji/verhovyna.html
 «Гірська Тиса»,https://zakarpattyachko.com.ua/sanatoriji/hirskatysa.html
 «Карпати»,https://zakarpattyachko.com.ua/sanatoriji/karpaty.html
 «Карпатія»,https://zakarpattyachko.com.ua/sanatoriji/karpatiya.html
 «Квеле Поляна»,https://zakarpattyachko.com.ua/sanatoriji/l-r.html
 «Квітка полонини»,https://zakarpattyachko.com.ua/sanatoriji/kvitkapolonyny.html
 «Кришталеве джерело»,https://zakarpattyachko.com.ua/sanatoriji/krusdzher.html
 «Поляна»,https://zakarpattyachko.com.ua/sanatoriji/polyana.html
 «Синяк»,https://zakarpattyachko.com.ua/sanatoriji/synjak.html
 «Сонячне Закарпаття»,https://zakarpattyachko.com.ua/sanatoriji/sonzkarpat.html
 «Теплиця»,https://zakarpattyachko.com.ua/sanatoriji/teplyca.html
 «Шаян»,https://zakarpattyachko.com.ua/sanatoriji/shajan.html
 «Орлине гніздо»,https://zakarpattyachko.com.ua/sanatoriji/orlyne-gnizdo.html
" МРЦ ""Шаян""",https://zakarpattyachko.com.ua/sanatoriji/mrcz-qshayanq.html
 «Вісак»,https://zakarpattyachko.com.ua/sanatoriji/2013-12-30-21-01-36.html
"+2MarynaЗі мною у санаторії Квітка полонини (""Сузір""я"") стався інцидент: З номера, у якому я проживала, із моєї сумки вкрали УСІ моі гроші, чималу суму. Звичайно, з мого боку було беспечним не тримати кошти у сейфі.Проте байдуже ставлення керівництва до ситуації, звинувачення (!!!),повна відсутність співробітництва та допомоги,а саме з боку заступника Ген. директора, Кождуб Світлани Євгеніївни, хамська поведінка покоївки (4 поверх, Лідія - прізвище її нам ніхто не хотів повідомити, тому не знаю) - це те, що мені довелось пережити. Тому здала свої квитки терміново, покинула санаторій до терміну виїзду. Звичайно, мову про повернення мені коштів ніхто не вів.моя порада усім. будьте дуже уважні. Користуйтеся сейфом, або носіть дорогоцінні речі з собою. Бо таких попереджень у санаторії ви ніколи не знайдете. Як показала практика, у цьому санаторії відсутня навіть елементарна орієнтація на клієнта, яка відповідає простим стандартам обслуговування та сервісу.06 листопада 2013",
"+1Лариса та ДмитроЩойно повернулися із лікування у ""Гірській Тисі"" . Нам по 37 та 39 років. Обрали Гірську Тису за рекомендацією друзів, які були там минуого літа.Відпочинок вийшов не лише оздоровчим та лікувальним, а й цікавим - ми взяли екскурсію на Піп Іван та до Центру Європи.Процедури ефективні, корисні. Кімнати нам також сподобались.Радимо всім!26 лютого 2015",
"+1РавильТретій рік з дружиною оздоровлюємося в Гірській Тисі. Це відмінне місце для того, що б чудово відпочити з користю для здоров'я.Уважний медичний персонал готовий завжди надати допомогу.Здорове харчування з гарною якістю. 10 з 10!18 лютого 2015",
0богданДоброго дня!!!Яхотів дізнатись ваш контактний номер.Дякую!!!23 червня 2012,
"+7ІванТак недавно побував в с.Шаян, дуже цікаво, будиночки виконані в сучасному стилі,бази відпочмнку,багато туристів, красива природа, все це створює відчуття ніби попав десь в Європу.Загалом є все для чудового відпочинку)))01 вересня 2012",
"+2НатальяОгромная благодарность всем сотрудникам санатория «Боржава». Замечательное место с замечательными людьми. Прекрасное тепло и добро, которое походит от людей этой местности. Самое большое удовольствие мы получили с сыном от общения с лошадьми. Большое спасибо Михаилу Николаевичу, который умеет привить любовь к этим замечательным животным. Его уроки дают не только физическое здоровье, а и радость для души. Особо хочется отметить работу массажиста Сивули Татьяны Ивановны, отзывчивость девочки Ярославы с регистратуры, работников бальнеологического отделения: Марьи Ивановны и Марины. Еще раз всем большое спасибо за заботу, красоту и тепло. Процветания и развития21 вересня 2012",
0надя(^o^) (^o^) (^o^) (^o^)О_О О_О О_О О_Окласно09 травня 2013,
"0AndyБулв з 24 червня по 29червня 2014р.з нареченою .Дуже сподобалось. Гарні люди,привітні. Але хочемо ще побувати тут04 грудня 2016",
0ГОХ ЕРНЕСТДОБРОГО ДНЯ ПИШУ ВАМ ИЗ ИЗРАИЛЯ САМ НАРОДИВСЯ В ЗАКАРПАТИ ИРШАВА ХОЧУ З ДРУЖИНОЮ ВИДПОЧИТИ И ПОЛИКУВАТИСЪ У ВАС ПРОШУ ВИДПОВИСТИ ЧИ МОЖНО ПРИИХАТИ ДО ВАС НА 10 ДНИВ У ОКТЯБРЮ БУДУ ВДЯЧНИЙ ЯКЩО ДИСТАНУ НОМЕР ТЕЛЕФОНА ВАШ13 липня 2012,
"+2тамараБула з 21 липня по 02 серпня 2012р.з внучком .Дуже сподобалось. Гарні люди,привітні. Дуже цілюща вода.Всім привіт бажаю ждоров""я.Дякую Ганні Олексіївні.13 серпня 2012",
"+1ГалинаОсобливу теплоту відчувають відпочиваючі в спілкуванні з лікарями – Куля Галиною Михайлівною, Горінецькою Надією Йосипівною, з спеціалістом з маркетингу – Наталією.Окремо можна сказати про директора – Любов Іванівну. Вона зазирне в будь яку щілинку свого клопіткого господарства, побачить найменший недолік і оперативно поправить його. Через те в санаторію чисто, охайно, порядок і культура. Велика заслуга в цьому і головного лікаря.Залишається від щирої душі подякувати керівництву, персоналу і побажати їм міцного здоров’я, подальших успіхів у своїй подальшій праці.Так тримати!27 травня 2015",
0ПОСП Рубастелефон санаторія?01 листопада 2012,
