{
 "directory": {
  "files": [
   {
    "flags": 0,
    "length1": 5386368,
    "length2": 5386368,
    "name": "02 DOPO IL SOGNO ~Yume no Ato Ni~.mp3",
    "offset": 0,
    "type": 2
   },
   {
    "flags": 0,
    "length1": 2940,
    "length2": 2940,
    "name": "Song.ini",
    "offset": 5386368,
    "type": 1
   }
  ],
  "offset": 399
 },
 "headers": {
  "ALBM": "GUNSLINGER GIRL",
  "ANME": 13,
  "ARTS": "Harada Masumi",
  "DIFM": 0,
  "DIFW": 0,
  "ENDH": -1,
  "FLID": "\u0000\u0000\u0000\u0000\u0000\u0000\u0000\u0000\u0000\u0000\u0000\u0000\u0000\u0000\u0000\u0000",
  "GNRE": -1,
  "IDUS": "                ",
  "MUSL": 224,
  "PROV": 0,
  "RGHT": 0,
  "SFTV": 17956934,
  "SORC": "1,I,02 DOPO IL SOGNO ~Yume no Ato Ni~.mp3",
  "TITL": "DOPO IL SOGNO ~Yume no Ato Ni~",
  "TRAK": "2",
  "TYPE": 0,
  "YEAR": "2003"
 }
}
