{
 "directory": {
  "files": [
   {
    "flags": 0,
    "length1": 3937152,
    "length2": 3937152,
    "name": "Seirei_no_Moribito_-_C1_-_Opening_-_(1d6bd478)(RAW).mp3",
    "offset": 0,
    "type": 2
   },
   {
    "flags": 0,
    "length1": 31555048,
    "length2": 31555048,
    "name": "Seirei_no_Moribito_-_C1_-_Opening_-_(1d6bd478)(RAW).avi_001.avi",
    "offset": 3937152,
    "type": 5
   },
   {
    "flags": 0,
    "length1": 2924,
    "length2": 2924,
    "name": "Song.ini",
    "offset": 35492200,
    "type": 1
   }
  ],
  "offset": 455
 },
 "headers": {
  "ANME": 12,
  "ARTS": "Seirei no Moribito",
  "DIFM": 0,
  "DIFW": 0,
  "ENDH": -1,
  "FLID": "\u0000\u0000\u0000\u0000\u0000\u0000\u0000\u0000\u0000\u0000\u0000\u0000\u0000\u0000\u0000\u0000",
  "GNRE": -1,
  "IDUS": "                ",
  "MUSL": 98,
  "PROV": 0,
  "RGHT": 0,
  "SFTV": 17432915,
  "SORC": "1,I,Seirei_no_Moribito_-_C1_-_Opening_-_(1d6bd478)(RAW).mp3",
  "TITL": "Shine",
  "TYPE": 0
 }
}
