{
 "directory": {
  "files": [
   {
    "flags": 0,
    "length1": 13377057,
    "length2": 13377057,
    "name": "04 - Advent One-Winged Angel - ACC Long Version.mp3",
    "offset": 0,
    "type": 2
   },
   {
    "flags": 0,
    "length1": 23745850,
    "length2": 23745850,
    "name": "ff7acc_1.avi",
    "offset": 13377057,
    "type": 5
   },
   {
    "flags": 0,
    "length1": 5394,
    "length2": 5394,
    "name": "Song.ini",
    "offset": 37122907,
    "type": 1
   }
  ],
  "offset": 513
 },
 "headers": {
  "ALBM": "FINAL FANTASY VII ADVENT CHILDREN COMPLETE Mini Disc",
  "ANME": 12,
  "ARTS": "Uematsu Nobuo",
  "DIFM": 0,
  "DIFW": 0,
  "ENDH": -1,
  "FLID": "\u0000\u0000\u0000\u0000\u0000\u0000\u0000\u0000\u0000\u0000\u0000\u0000\u0000\u0000\u0000\u0000",
  "GNRE": -1,
  "IDUS": "                ",
  "MUSL": 416,
  "PROV": 0,
  "RGHT": 0,
  "SFTV": 17432915,
  "SORC": "1,I,04 - Advent One-Winged Angel - ACC Long Version.mp3",
  "TITL": "Advent: One-Winged Angel - ACC Long Version",
  "TRAK": "4",
  "TYPE": 0,
  "YEAR": "2009"
 }
}
