{
 "directory": {
  "files": [
   {
    "flags": 0,
    "length1": 3062627,
    "length2": 3062627,
    "name": "IOSYS_toho9_SansuuKyoushitsu.avi.MP3",
    "offset": 0,
    "type": 2
   },
   {
    "flags": 0,
    "length1": 64130754,
    "length2": 64130754,
    "name": "IOSYS_toho9_SansuuKyoushitsu_001.avi",
    "offset": 3062627,
    "type": 5
   },
   {
    "flags": 0,
    "length1": 6598,
    "length2": 6598,
    "name": "Song.ini",
    "offset": 67193381,
    "type": 1
   }
  ],
  "offset": 412
 },
 "headers": {
  "ANME": 12,
  "ARTS": "TETLA POT x IOSYS",
  "DIFM": 0,
  "DIFW": 0,
  "ENDH": -1,
  "FLID": "\u0000\u0000\u0000\u0000\u0000\u0000\u0000\u0000\u0000\u0000\u0000\u0000\u0000\u0000\u0000\u0000",
  "GNRE": -1,
  "IDUS": "                ",
  "MUSL": 128,
  "PROV": 0,
  "RGHT": 0,
  "SFTV": 17432915,
  "SORC": "1,I,IOSYS_toho9_SansuuKyoushitsu.avi.MP3",
  "TITL": "Chiruno no Sansuu Kyoushitsu",
  "TYPE": 0
 }
}
