{
 "directory": {
  "files": [
   {
    "flags": 0,
    "length1": 949772,
    "length2": 949772,
    "name": "Gin-no-Saji fond invisible.png",
    "offset": 0,
    "type": 3
   },
   {
    "flags": 0,
    "length1": 8753540,
    "length2": 8753540,
    "name": "Goose House - Oto no Naru Hou e.mp3",
    "offset": 949772,
    "type": 2
   },
   {
    "flags": 0,
    "length1": 36304,
    "length2": 36304,
    "name": "Song.ini",
    "offset": 9703312,
    "type": 1
   }
  ],
  "offset": 543
 },
 "headers": {
  "ALBM": "Milk",
  "ANME": 12,
  "ARTS": "Goose house",
  "COMM": "7 voix mdrmdr\rBonne chance pour refaire tout le placement la prochaine fois que karafun les change tout seul",
  "DIFM": 0,
  "DIFW": 0,
  "ENDH": -1,
  "FLID": "\u0000\u0000\u0000\u0000\u0000\u0000\u0000\u0000\u0000\u0000\u0000\u0000\u0000\u0000\u0000\u0000",
  "GNRE": -1,
  "IDUS": "                ",
  "KFNZ": "Dysp",
  "MUSL": 216,
  "PROV": 0,
  "RGHT": 0,
  "SFTV": 17432915,
  "SORC": "1,I,Goose House - Oto no Naru Hou e.mp3",
  "TITL": "Oto no Naru Hou e",
  "TYPE": 0,
  "YEAR": "2015"
 }
}
