{
 "directory": {
  "files": [
   {
    "flags": 0,
    "length1": 2158173,
    "length2": 2158173,
    "name": "Nobunaga the Fool Ending.mp3",
    "offset": 0,
    "type": 2
   },
   {
    "flags": 0,
    "length1": 150815440,
    "length2": 150815440,
    "name": "Nobunaga the Fool Ending.avi",
    "offset": 2158173,
    "type": 5
   },
   {
    "flags": 0,
    "length1": 2818,
    "length2": 2818,
    "name": "Song.ini",
    "offset": 152973613,
    "type": 1
   }
  ],
  "offset": 389
 },
 "headers": {
  "ANME": 12,
  "ARTS": "Stereo Dive Foundation",
  "DIFM": 0,
  "DIFW": 0,
  "ENDH": -1,
  "FLID": "\u0000\u0000\u0000\u0000\u0000\u0000\u0000\u0000\u0000\u0000\u0000\u0000\u0000\u0000\u0000\u0000",
  "GNRE": -1,
  "IDUS": "                ",
  "MUSL": 90,
  "PROV": 0,
  "RGHT": 0,
  "SFTV": 17432915,
  "SORC": "1,I,Nobunaga the Fool Ending.mp3",
  "TITL": "Nobunaga the Fool - Axis",
  "TYPE": 0
 }
}
