{
 "directory": {
  "files": [
   {
    "flags": 0,
    "length1": 1921817,
    "length2": 1921817,
    "name": "Gatchaman Crowds Opening.mp3",
    "offset": 0,
    "type": 2
   },
   {
    "flags": 0,
    "length1": 61799668,
    "length2": 61799668,
    "name": "Gatchaman Crowds Opening.avi",
    "offset": 1921817,
    "type": 5
   },
   {
    "flags": 0,
    "length1": 3043,
    "length2": 3043,
    "name": "Song.ini",
    "offset": 63721485,
    "type": 1
   }
  ],
  "offset": 394
 },
 "headers": {
  "ANME": 12,
  "ARTS": "WHITE ASH",
  "DIFM": 0,
  "DIFW": 0,
  "ENDH": -1,
  "FLID": "\u0000\u0000\u0000\u0000\u0000\u0000\u0000\u0000\u0000\u0000\u0000\u0000\u0000\u0000\u0000\u0000",
  "GNRE": -1,
  "IDUS": "                ",
  "KFNZ": "Antoine Perquin",
  "MUSL": 80,
  "PROV": 0,
  "RGHT": 0,
  "SFTV": 17432915,
  "SORC": "1,I,Gatchaman Crowds Opening.mp3",
  "TITL": "Crows",
  "TYPE": 0,
  "YEAR": "2013"
 }
}
