{
 "directory": {
  "files": [
   {
    "flags": 0,
    "length1": 4194268,
    "length2": 4194268,
    "name": "04._Life_Will_Change_norm.mp3",
    "offset": 0,
    "type": 2
   },
   {
    "flags": 0,
    "length1": 873237,
    "length2": 873237,
    "name": "BG P5.png",
    "offset": 4194268,
    "type": 3
   },
   {
    "flags": 0,
    "length1": 4449,
    "length2": 4449,
    "name": "Song.ini",
    "offset": 5067505,
    "type": 1
   }
  ],
  "offset": 419
 },
 "headers": {
  "ALBM": "Persona 5",
  "ANME": 12,
  "ARTS": "Inaizumi Lyn",
  "DIFM": 0,
  "DIFW": 0,
  "ENDH": -1,
  "FLID": "\u0000\u0000\u0000\u0000\u0000\u0000\u0000\u0000\u0000\u0000\u0000\u0000\u0000\u0000\u0000\u0000",
  "GNRE": -1,
  "IDUS": "                ",
  "KFNZ": "Dysp",
  "LANG": "JA",
  "MUSL": 262,
  "PROV": 0,
  "RGHT": 0,
  "SFTV": 17432915,
  "SORC": "1,I,04._Life_Will_Change_norm.mp3",
  "TITL": "Life will change",
  "TRAK": "4",
  "TYPE": 0,
  "YEAR": "2016"
 }
}
