{
 "directory": {
  "files": [
   {
    "flags": 0,
    "length1": 10861794,
    "length2": 10861794,
    "name": "Kono_Sekai_no_Katasumi_ni_-_NCED.mp3",
    "offset": 0,
    "type": 2
   },
   {
    "flags": 0,
    "length1": 2616177,
    "length2": 2616177,
    "name": "unknown (1).png",
    "offset": 10861794,
    "type": 3
   },
   {
    "flags": 0,
    "length1": 5865,
    "length2": 5865,
    "name": "Song.ini",
    "offset": 13477971,
    "type": 1
   }
  ],
  "offset": 443
 },
 "headers": {
  "ALBM": "Kono Sekai no Katasumi ni",
  "ANME": 12,
  "ARTS": "Kotringo",
  "DIFM": 0,
  "DIFW": 0,
  "ENDH": -1,
  "FLID": "\u0000\u0000\u0000\u0000\u0000\u0000\u0000\u0000\u0000\u0000\u0000\u0000\u0000\u0000\u0000\u0000",
  "GNRE": -1,
  "IDUS": "                ",
  "KFNZ": "Dysp",
  "LANG": "JA",
  "MUSL": 271,
  "PROV": 0,
  "RGHT": 0,
  "SFTV": 17432915,
  "SORC": "1,I,Kono_Sekai_no_Katasumi_ni_-_NCED.mp3",
  "TITL": "Tanpopo",
  "TRAK": "ED",
  "TYPE": 0,
  "YEAR": "2016"
 }
}
