{
 "directory": {
  "files": [
   {
    "flags": 0,
    "length1": 4524958,
    "length2": 4524958,
    "name": "KOBASOLO_-_cover_-_Bouningen_norm.mp3",
    "offset": 0,
    "type": 2
   },
   {
    "flags": 0,
    "length1": 9296,
    "length2": 9296,
    "name": "Song.ini",
    "offset": 4524958,
    "type": 1
   }
  ],
  "offset": 596
 },
 "headers": {
  "ANME": 12,
  "ARTS": "Kobasolo",
  "COMM": "Rip ce kara c'est l'exemple type de pourquoi y vaut mieux repartir de 0 pour les covers au lieu de prendre la sync originale : Des qu'un peu de liberté est prise on perd plus temps a ajuster qu'auter chose\r",
  "COMP": "RADWIMPS",
  "DIFM": 0,
  "DIFW": 0,
  "ENDH": -1,
  "FLID": "\u0000\u0000\u0000\u0000\u0000\u0000\u0000\u0000\u0000\u0000\u0000\u0000\u0000\u0000\u0000\u0000",
  "GNRE": -1,
  "IDUS": "                ",
  "KFNZ": "Dysp",
  "LANG": "JA",
  "MUSL": 283,
  "PROV": 0,
  "RGHT": 0,
  "SFTV": 17432915,
  "SORC": "1,I,KOBASOLO_-_cover_-_Bouningen_norm.mp3",
  "TITL": "Bouningen",
  "TYPE": 0,
  "YEAR": "2017"
 }
}
