{
 "directory": {
  "files": [
   {
    "flags": 0,
    "length1": 9532106,
    "length2": 9532106,
    "name": "01. Beyond the BLADE (IGNITED arrangement)_cover.mp3",
    "offset": 0,
    "type": 2
   },
   {
    "flags": 0,
    "length1": 9532086,
    "length2": 9532086,
    "name": "03. Beyond the BLADE (IGNITED arrangement) (off vocal)_cover.mp3",
    "offset": 9532106,
    "type": 2
   },
   {
    "flags": 0,
    "length1": 199646,
    "length2": 199646,
    "name": "covermagick_cover.jpg",
    "offset": 19064192,
    "type": 3
   },
   {
    "flags": 0,
    "length1": 7308,
    "length2": 7308,
    "name": "Song.ini",
    "offset": 19263838,
    "type": 1
   }
  ],
  "offset": 634
 },
 "headers": {
  "ALBM": "Senki Zesshou Symphogear GX",
  "ANME": 12,
  "ARTS": "Nana Mizuki",
  "COMM": "on/off vocals",
  "COPY": "SATELIGHT",
  "DIFM": 0,
  "DIFW": 0,
  "ENDH": -1,
  "FLID": "\u0000\u0000\u0000\u0000\u0000\u0000\u0000\u0000\u0000\u0000\u0000\u0000\u0000\u0000\u0000\u0000",
  "GNRE": -1,
  "IDUS": "                ",
  "KFNZ": "Dysp",
  "LANG": "JA",
  "MUSL": 233,
  "PROV": 0,
  "RGHT": 0,
  "SFTV": 17432915,
  "SORC": "1,I,01. Beyond the BLADE (IGNITED arrangement)_cover.mp3",
  "TITL": "Beyond the BLADE (IGNITED arrangement)",
  "TYPE": 0,
  "YEAR": "2015"
 }
}
