{
 "directory": {
  "files": [
   {
    "flags": 0,
    "length1": 2156292,
    "length2": 2156292,
    "name": "Working'!! Opening.mp3",
    "offset": 0,
    "type": 2
   },
   {
    "flags": 0,
    "length1": 96087710,
    "length2": 96087710,
    "name": "Working'!! Opening.avi",
    "offset": 2156292,
    "type": 5
   },
   {
    "flags": 0,
    "length1": 3838,
    "length2": 3838,
    "name": "Song.ini",
    "offset": 98244002,
    "type": 1
   }
  ],
  "offset": 341
 },
 "headers": {
  "ANME": 12,
  "DIFM": 0,
  "DIFW": 0,
  "ENDH": -1,
  "FLID": "\u0000\u0000\u0000\u0000\u0000\u0000\u0000\u0000\u0000\u0000\u0000\u0000\u0000\u0000\u0000\u0000",
  "GNRE": -1,
  "IDUS": "                ",
  "MUSL": 90,
  "PROV": 0,
  "RGHT": 0,
  "SFTV": 17432915,
  "SORC": "1,I,Working'!! Opening.mp3",
  "TITL": "Working'!! - Coolish Walk",
  "TYPE": 0
 }
}
