{
 "directory": {
  "files": [
   {
    "flags": 0,
    "length1": 1464975,
    "length2": 1464975,
    "name": "Hakushu Kassai Utaawase (short).mp3",
    "offset": 0,
    "type": 2
   },
   {
    "flags": 0,
    "length1": 45050898,
    "length2": 45050898,
    "name": "Katanagatari 2013 Repeat OP..avi",
    "offset": 1464975,
    "type": 5
   },
   {
    "flags": 0,
    "length1": 2797,
    "length2": 2797,
    "name": "Song.ini",
    "offset": 46515873,
    "type": 1
   }
  ],
  "offset": 400
 },
 "headers": {
  "ANME": 12,
  "ARTS": "Ryo",
  "DIFM": 0,
  "DIFW": 0,
  "ENDH": -1,
  "FLID": "\u0000\u0000\u0000\u0000\u0000\u0000\u0000\u0000\u0000\u0000\u0000\u0000\u0000\u0000\u0000\u0000",
  "GNRE": -1,
  "IDUS": "                ",
  "KFNZ": "Alex",
  "MUSL": 91,
  "PROV": 0,
  "RGHT": 0,
  "SFTV": 17432915,
  "SORC": "1,I,Hakushu Kassai Utaawase (short).mp3",
  "TITL": "Hakushu Kassai Utaawase",
  "TYPE": 0
 }
}
