{
 "directory": {
  "files": [
   {
    "flags": 0,
    "length1": 1433994,
    "length2": 1433994,
    "name": "Kujira ED.mp3",
    "offset": 0,
    "type": 2
   },
   {
    "flags": 0,
    "length1": 67048,
    "length2": 67048,
    "name": "JCPT x256.png",
    "offset": 1433994,
    "type": 3
   },
   {
    "flags": 0,
    "length1": 44786468,
    "length2": 44786468,
    "name": "Kujira ED.avi",
    "offset": 1501042,
    "type": 5
   },
   {
    "flags": 0,
    "length1": 2922,
    "length2": 2922,
    "name": "Song.ini",
    "offset": 46287510,
    "type": 1
   }
  ],
  "offset": 428
 },
 "headers": {
  "ALBM": "Kujira no Kora wa Sajou ni Utau",
  "ANME": 12,
  "ARTS": "rionos",
  "DIFM": 0,
  "DIFW": 0,
  "ENDH": -1,
  "FLID": "\u0000\u0000\u0000\u0000\u0000\u0000\u0000\u0000\u0000\u0000\u0000\u0000\u0000\u0000\u0000\u0000",
  "GNRE": -1,
  "IDUS": "                ",
  "KFNZ": "Dysp",
  "LANG": "JA",
  "MUSL": 89,
  "PROV": 0,
  "RGHT": 0,
  "SFTV": 17432915,
  "SORC": "1,I,Kujira ED.mp3",
  "TITL": "Hashitairo",
  "TYPE": 0,
  "YEAR": "2017"
 }
}
