{
 "directory": {
  "files": [
   {
    "flags": 0,
    "length1": 3600750,
    "length2": 3600750,
    "name": "canaan.mp4.MP3",
    "offset": 0,
    "type": 2
   },
   {
    "flags": 0,
    "length1": 86149120,
    "length2": 86149120,
    "name": "canaan.mp4.MPG",
    "offset": 3600750,
    "type": 5
   },
   {
    "flags": 0,
    "length1": 3728,
    "length2": 3728,
    "name": "Song.ini",
    "offset": 89749870,
    "type": 1
   }
  ],
  "offset": 399
 },
 "headers": {
  "ALBM": "CANAAN",
  "ANME": 12,
  "ARTS": "Faylan",
  "COMP": "Noriyasu Agematsu, Aki Hata",
  "DIFM": 0,
  "DIFW": 0,
  "ENDH": -1,
  "FLID": "\u0000\u0000\u0000\u0000\u0000\u0000\u0000\u0000\u0000\u0000\u0000\u0000\u0000\u0000\u0000\u0000",
  "GNRE": -1,
  "IDUS": "                ",
  "LANG": "JA",
  "MUSL": 90,
  "PROV": 0,
  "RGHT": 0,
  "SFTV": 17432915,
  "SORC": "1,I,canaan.mp4.MP3",
  "TITL": "Mind as Judgement",
  "TYPE": 0,
  "YEAR": "2009"
 }
}
