{
 "directory": {
  "files": [
   {
    "flags": 0,
    "length1": 229129838,
    "length2": 229129838,
    "name": "KinenSatsuei.avi",
    "offset": 0,
    "type": 5
   },
   {
    "flags": 0,
    "length1": 6498120,
    "length2": 6498120,
    "name": "KinenSatsuei_cut.mp3",
    "offset": 229129838,
    "type": 2
   },
   {
    "flags": 0,
    "length1": 8339,
    "length2": 8339,
    "name": "Song.ini",
    "offset": 235627958,
    "type": 1
   }
  ],
  "offset": 411
 },
 "headers": {
  "ALBM": "One Piece x Cup Noodle",
  "ANME": 12,
  "ARTS": "Bump of Chicken",
  "DIFM": 0,
  "DIFW": 0,
  "ENDH": -1,
  "FLID": "\u0000\u0000\u0000\u0000\u0000\u0000\u0000\u0000\u0000\u0000\u0000\u0000\u0000\u0000\u0000\u0000",
  "GNRE": -1,
  "IDUS": "                ",
  "KFNZ": "Dysp",
  "LANG": "JA",
  "MUSL": 294,
  "PROV": 0,
  "RGHT": 0,
  "SFTV": 17432915,
  "SORC": "1,I,KinenSatsuei_cut.mp3",
  "TITL": "Kinen Satsuei",
  "TYPE": 0,
  "YEAR": "2019"
 }
}
