{
 "directory": {
  "files": [
   {
    "flags": 0,
    "length1": 51296,
    "length2": 51296,
    "name": "MATURASC.TTF",
    "offset": 0,
    "type": 4
   },
   {
    "flags": 0,
    "length1": 3588718,
    "length2": 3588718,
    "name": "Gekkan_Shoujo_Nozaki-kun_-_OP_norm.mp3",
    "offset": 51296,
    "type": 2
   },
   {
    "flags": 0,
    "length1": 69090686,
    "length2": 69090686,
    "name": "JPN - Gekkan Shoujo Nozaki-kun - OP - Kimi Janakya Dame Mitai.avi",
    "offset": 3640014,
    "type": 5
   },
   {
    "flags": 0,
    "length1": 5710,
    "length2": 5710,
    "name": "Song.ini",
    "offset": 72730700,
    "type": 1
   }
  ],
  "offset": 522
 },
 "headers": {
  "ALBM": "Gekkan Shoujo Nozaki-kun",
  "ANME": 12,
  "ARTS": "Oishi Masayoshi",
  "DIFM": 0,
  "DIFW": 0,
  "ENDH": -1,
  "FLID": "\u0000\u0000\u0000\u0000\u0000\u0000\u0000\u0000\u0000\u0000\u0000\u0000\u0000\u0000\u0000\u0000",
  "GNRE": -1,
  "IDUS": "                ",
  "KFNZ": "Hoël",
  "MUSL": 90,
  "PROV": 0,
  "RGHT": 0,
  "SFTV": 17432915,
  "SORC": "1,I,Gekkan_Shoujo_Nozaki-kun_-_OP_norm.mp3",
  "TITL": "Kimi ja Nakya Dame Mitai",
  "TYPE": 0
 }
}
