{
 "directory": {
  "files": [
   {
    "flags": 0,
    "length1": 3641518,
    "length2": 3641518,
    "name": "[Ohys-Raws] Dog Days`` - OP (BS11 1280x720 x264 AAC).mp4.MP3",
    "offset": 0,
    "type": 2
   },
   {
    "flags": 0,
    "length1": 65403960,
    "length2": 65403960,
    "name": "[Ohys-Raws] Dog Days`` - OP (BS11 1280x720 x264 AAC).avi",
    "offset": 3641518,
    "type": 5
   },
   {
    "flags": 0,
    "length1": 3146,
    "length2": 3146,
    "name": "Song.ini",
    "offset": 69045478,
    "type": 1
   }
  ],
  "offset": 453
 },
 "headers": {
  "ANME": 12,
  "ARTS": "Dog Days''",
  "DIFM": 0,
  "DIFW": 0,
  "ENDH": -1,
  "FLID": "\u0000\u0000\u0000\u0000\u0000\u0000\u0000\u0000\u0000\u0000\u0000\u0000\u0000\u0000\u0000\u0000",
  "GNRE": -1,
  "IDUS": "                ",
  "MUSL": 91,
  "PROV": 0,
  "RGHT": 0,
  "SFTV": 17432915,
  "SORC": "1,I,[Ohys-Raws] Dog Days`` - OP (BS11 1280x720 x264 AAC).mp4.MP3",
  "TITL": "No Limit",
  "TYPE": 0
 }
}
