{
 "directory": {
  "files": [
   {
    "flags": 0,
    "length1": 39450370,
    "length2": 39450370,
    "name": "ED part1.avi",
    "offset": 0,
    "type": 5
   },
   {
    "flags": 0,
    "length1": 3548192,
    "length2": 3548192,
    "name": "ED part1.mp3",
    "offset": 39450370,
    "type": 2
   },
   {
    "flags": 0,
    "length1": 2592,
    "length2": 2592,
    "name": "Song.ini",
    "offset": 42998562,
    "type": 1
   }
  ],
  "offset": 347
 },
 "headers": {
  "ANME": 12,
  "ARTS": "Yes",
  "DIFM": 0,
  "DIFW": 0,
  "ENDH": -1,
  "FLID": "\u0000\u0000\u0000\u0000\u0000\u0000\u0000\u0000\u0000\u0000\u0000\u0000\u0000\u0000\u0000\u0000",
  "GNRE": -1,
  "IDUS": "                ",
  "KFNZ": "Thibaut (mrkyubu)",
  "MUSL": 89,
  "PROV": 0,
  "RGHT": 0,
  "SFTV": 17432915,
  "SORC": "1,I,ED part1.mp3",
  "TITL": "Roundabout",
  "TYPE": 0,
  "YEAR": "1971"
 }
}
