{
 "directory": {
  "files": [
   {
    "flags": 0,
    "length1": 239315048,
    "length2": 239315048,
    "name": "sakayume.avi",
    "offset": 0,
    "type": 5
   },
   {
    "flags": 0,
    "length1": 12776994,
    "length2": 12776994,
    "name": "sakayume.mp3",
    "offset": 239315048,
    "type": 2
   },
   {
    "flags": 0,
    "length1": 8285,
    "length2": 8285,
    "name": "Song.ini",
    "offset": 252092042,
    "type": 1
   }
  ],
  "offset": 384
 },
 "headers": {
  "ALBM": "Jujutsu Kaisen 0",
  "ANME": 12,
  "ARTS": "King Gnu",
  "DIFM": 0,
  "DIFW": 0,
  "ENDH": -1,
  "FLID": "\u0000\u0000\u0000\u0000\u0000\u0000\u0000\u0000\u0000\u0000\u0000\u0000\u0000\u0000\u0000\u0000",
  "GNRE": -1,
  "IDUS": "                ",
  "KFNZ": "Dysp",
  "LANG": "JA",
  "MUSL": 319,
  "PROV": 0,
  "RGHT": 0,
  "SFTV": 17432915,
  "SORC": "1,I,sakayume.mp3",
  "TITL": "Sakayume",
  "TRAK": "ED",
  "TYPE": 0,
  "YEAR": "2021"
 }
}
