{
 "directory": {
  "files": [
   {
    "flags": 0,
    "length1": 3516416,
    "length2": 3516416,
    "name": "23 - The Sore Feet Song (TV Size).mp3",
    "offset": 0,
    "type": 2
   },
   {
    "flags": 0,
    "length1": 24606720,
    "length2": 24606720,
    "name": "MUSHiSHi - Creditless Opening 2.avi.MPG",
    "offset": 3516416,
    "type": 5
   },
   {
    "flags": 0,
    "length1": 2163,
    "length2": 2163,
    "name": "Song.ini",
    "offset": 28123136,
    "type": 1
   }
  ],
  "offset": 498
 },
 "headers": {
  "ALBM": "Mushishi Soundtrack 1",
  "ANME": 12,
  "ARTS": "Ally Kerr",
  "COMM": "#NIPPONSEI @ IRC.RIZON.NET",
  "DIFM": 0,
  "DIFW": 0,
  "ENDH": -1,
  "FLID": "\u0000\u0000\u0000\u0000\u0000\u0000\u0000\u0000\u0000\u0000\u0000\u0000\u0000\u0000\u0000\u0000",
  "GNRE": -1,
  "IDUS": "                ",
  "MUSL": 88,
  "PROV": 0,
  "RGHT": 0,
  "SFTV": 17432915,
  "SORC": "1,I,23 - The Sore Feet Song (TV Size).mp3",
  "TITL": "The Sore Feet Song (TV Size)",
  "TRAK": "23",
  "TYPE": 0,
  "YEAR": "2006"
 }
}
