{
 "directory": {
  "files": [
   {
    "flags": 0,
    "length1": 126600,
    "length2": 126600,
    "name": "236418_kfn_cover.jpg",
    "offset": 0,
    "type": 3
   },
   {
    "flags": 0,
    "length1": 4126978,
    "length2": 4126978,
    "name": "cqgliostroNORM.mp3",
    "offset": 126600,
    "type": 2
   },
   {
    "flags": 0,
    "length1": 2891,
    "length2": 2891,
    "name": "Song.ini",
    "offset": 4253578,
    "type": 1
   }
  ],
  "offset": 473
 },
 "headers": {
  "ALBM": "Lupin Sansei: Cagliostro no Shiro",
  "ANME": 12,
  "ARTS": "BOBBY",
  "COMM": "https://www.youtube.com/watch?v=ffNMRjgD_S0",
  "DIFM": 0,
  "DIFW": 0,
  "ENDH": -1,
  "FLID": "\u0000\u0000\u0000\u0000\u0000\u0000\u0000\u0000\u0000\u0000\u0000\u0000\u0000\u0000\u0000\u0000",
  "GNRE": -1,
  "IDUS": "                ",
  "KFNZ": "MrKyubu",
  "MUSL": 193,
  "PROV": 0,
  "RGHT": 0,
  "SFTV": 17432915,
  "SORC": "1,I,cqgliostroNORM.mp3",
  "TITL": "Honoo no Takaramono",
  "TRAK": "OP",
  "TYPE": 0,
  "YEAR": "1979"
 }
}
