{
 "directory": {
  "files": [
   {
    "flags": 0,
    "length1": 96938,
    "length2": 96938,
    "name": "lupin_kfn_cover.jpg",
    "offset": 0,
    "type": 3
   },
   {
    "flags": 0,
    "length1": 7880009,
    "length2": 7880009,
    "name": "gift NORM.mp3",
    "offset": 96938,
    "type": 2
   },
   {
    "flags": 0,
    "length1": 4277,
    "length2": 4277,
    "name": "Song.ini",
    "offset": 7976947,
    "type": 1
   }
  ],
  "offset": 440
 },
 "headers": {
  "ALBM": "Lupin III The First",
  "ANME": 12,
  "ARTS": "Lyn Inaizumi",
  "COMM": "https://www.youtube.com/watch?v=lvNdfYDqpAU",
  "DIFM": 0,
  "DIFW": 0,
  "ENDH": -1,
  "FLID": "\u0000\u0000\u0000\u0000\u0000\u0000\u0000\u0000\u0000\u0000\u0000\u0000\u0000\u0000\u0000\u0000",
  "GNRE": -1,
  "IDUS": "                ",
  "KFNZ": "mrkyubu",
  "MUSL": 312,
  "PROV": 0,
  "RGHT": 0,
  "SFTV": 17432915,
  "SORC": "1,I,gift NORM.mp3",
  "TITL": "GIFT",
  "TRAK": "ED",
  "TYPE": 0,
  "YEAR": "2019"
 }
}
