{
 "directory": {
  "files": [
   {
    "flags": 0,
    "length1": 2150650,
    "length2": 2150650,
    "name": "Nisemonogatari Opening 2.mp3",
    "offset": 0,
    "type": 2
   },
   {
    "flags": 0,
    "length1": 137400500,
    "length2": 137400500,
    "name": "Nisemonogatari Opening 2.avi",
    "offset": 2150650,
    "type": 5
   },
   {
    "flags": 0,
    "length1": 4192,
    "length2": 4192,
    "name": "Song.ini",
    "offset": 139551150,
    "type": 1
   }
  ],
  "offset": 391
 },
 "headers": {
  "ANME": 12,
  "ARTS": "Kitamura Eri",
  "DIFM": 0,
  "DIFW": 0,
  "ENDH": -1,
  "FLID": "\u0000\u0000\u0000\u0000\u0000\u0000\u0000\u0000\u0000\u0000\u0000\u0000\u0000\u0000\u0000\u0000",
  "GNRE": -1,
  "IDUS": "                ",
  "MUSL": 90,
  "PROV": 0,
  "RGHT": 0,
  "SFTV": 17432915,
  "SORC": "1,I,Nisemonogatari Opening 2.mp3",
  "TITL": "Nisemonogatari - Marshmallow Justice",
  "TYPE": 0
 }
}
