{
 "directory": {
  "files": [
   {
    "flags": 0,
    "length1": 4791552,
    "length2": 4791552,
    "name": "neko miko reimu.mp4.MP3",
    "offset": 0,
    "type": 2
   },
   {
    "flags": 0,
    "length1": 61165590,
    "length2": 61165590,
    "name": "neko miko reimu.avi",
    "offset": 4791552,
    "type": 5
   },
   {
    "flags": 0,
    "length1": 4009,
    "length2": 4009,
    "name": "Song.ini",
    "offset": 65957142,
    "type": 1
   }
  ],
  "offset": 345
 },
 "headers": {
  "ANME": 12,
  "ARTS": "Touhou",
  "DIFM": 0,
  "DIFW": 0,
  "ENDH": -1,
  "FLID": "\u0000\u0000\u0000\u0000\u0000\u0000\u0000\u0000\u0000\u0000\u0000\u0000\u0000\u0000\u0000\u0000",
  "GNRE": -1,
  "IDUS": "                ",
  "MUSL": 120,
  "PROV": 0,
  "RGHT": 0,
  "SFTV": 17432915,
  "SORC": "1,I,neko miko reimu.mp4.MP3",
  "TITL": "Neko Miko Reimu",
  "TYPE": 0
 }
}
