{
 "directory": {
  "files": [
   {
    "flags": 0,
    "length1": 1067136,
    "length2": 1067136,
    "name": "ending04_tvsize.mp3",
    "offset": 0,
    "type": 2
   },
   {
    "flags": 0,
    "length1": 15937488,
    "length2": 15937488,
    "name": "Bleach - Happy People.avi",
    "offset": 1067136,
    "type": 5
   },
   {
    "flags": 0,
    "length1": 2452,
    "length2": 2452,
    "name": "Song.ini",
    "offset": 17004624,
    "type": 1
   }
  ],
  "offset": 388
 },
 "headers": {
  "ALBM": "Bleach Ending 4",
  "ANME": 12,
  "ARTS": "Skoop on Somebody",
  "DIFM": 0,
  "DIFW": 0,
  "ENDH": -1,
  "FLID": "\u0000\u0000\u0000\u0000\u0000\u0000\u0000\u0000\u0000\u0000\u0000\u0000\u0000\u0000\u0000\u0000",
  "GNRE": -1,
  "IDUS": "                ",
  "MUSL": 67,
  "PROV": 0,
  "RGHT": 0,
  "SFTV": 17432915,
  "SORC": "1,I,ending04_tvsize.mp3",
  "TITL": "Happy People",
  "TYPE": 0,
  "YEAR": "2005"
 }
}
