{
 "directory": {
  "files": [
   {
    "flags": 0,
    "length1": 279614,
    "length2": 279614,
    "name": "Bleach.jpg",
    "offset": 0,
    "type": 3
   },
   {
    "flags": 0,
    "length1": 3433968,
    "length2": 3433968,
    "name": "Stereopony - Hitohira No Hanabira.mp3",
    "offset": 279614,
    "type": 2
   },
   {
    "flags": 0,
    "length1": 5931,
    "length2": 5931,
    "name": "Song.ini",
    "offset": 3713582,
    "type": 1
   }
  ],
  "offset": 386
 },
 "headers": {
  "ANME": 12,
  "ARTS": "Stereopony",
  "DIFM": 0,
  "DIFW": 0,
  "ENDH": -1,
  "FLID": "\u0000\u0000\u0000\u0000\u0000\u0000\u0000\u0000\u0000\u0000\u0000\u0000\u0000\u0000\u0000\u0000",
  "GNRE": -1,
  "IDUS": "                ",
  "KFNZ": "Dysp",
  "MUSL": 215,
  "PROV": 0,
  "RGHT": 0,
  "SFTV": 17432915,
  "SORC": "1,I,Stereopony - Hitohira No Hanabira.mp3",
  "TITL": "Hitohira no Hanabira",
  "TYPE": 0
 }
}
