{
 "directory": {
  "files": [
   {
    "flags": 0,
    "length1": 9730048,
    "length2": 9730048,
    "name": "01_-_romancing_train.mp3",
    "offset": 0,
    "type": 2
   },
   {
    "flags": 0,
    "length1": 1160951,
    "length2": 1160951,
    "name": "Minitokyo.Final.Fantasy.Unlimited.Scans_303493.jpg",
    "offset": 9730048,
    "type": 3
   },
   {
    "flags": 0,
    "length1": 9844,
    "length2": 9844,
    "name": "Song.ini",
    "offset": 10890999,
    "type": 1
   }
  ],
  "offset": 400
 },
 "headers": {
  "ANME": 12,
  "ARTS": "Move",
  "DIFM": 0,
  "DIFW": 0,
  "ENDH": -1,
  "FLID": "\u0000\u0000\u0000\u0000\u0000\u0000\u0000\u0000\u0000\u0000\u0000\u0000\u0000\u0000\u0000\u0000",
  "GNRE": -1,
  "IDUS": "                ",
  "MUSL": 304,
  "PROV": 0,
  "RGHT": 0,
  "SFTV": 17432915,
  "SORC": "1,I,01_-_romancing_train.mp3",
  "TITL": "Romancing Train",
  "TRAK": "01",
  "TYPE": 0,
  "YEAR": "2002"
 }
}
