{
 "directory": {
  "files": [
   {
    "flags": 0,
    "length1": 10139082,
    "length2": 10139082,
    "name": "03. Melodious Moonlight (off vocal).mp3",
    "offset": 0,
    "type": 2
   },
   {
    "flags": 0,
    "length1": 126229,
    "length2": 126229,
    "name": "covermagick_CharacterSong6TsukuyomiShirabe.jpg",
    "offset": 10139082,
    "type": 3
   },
   {
    "flags": 0,
    "length1": 10139070,
    "length2": 10139070,
    "name": "01. Melodious Moonlight.mp3",
    "offset": 10265311,
    "type": 2
   },
   {
    "flags": 0,
    "length1": 5661,
    "length2": 5661,
    "name": "Song.ini",
    "offset": 20404381,
    "type": 1
   }
  ],
  "offset": 569
 },
 "headers": {
  "ALBM": "Senki Zesshou Symphogear AXZ",
  "ANME": 12,
  "ARTS": "Yoshino Nanjou",
  "COMM": "on/off vocals",
  "COPY": "SATELIGHT",
  "DIFM": 0,
  "DIFW": 0,
  "ENDH": -1,
  "FLID": "\u0000\u0000\u0000\u0000\u0000\u0000\u0000\u0000\u0000\u0000\u0000\u0000\u0000\u0000\u0000\u0000",
  "GNRE": -1,
  "IDUS": "                ",
  "KFNZ": "Dysp",
  "LANG": "JA",
  "MUSL": 244,
  "PROV": 0,
  "RGHT": 0,
  "SFTV": 17432915,
  "SORC": "1,I,01. Melodious Moonlight.mp3",
  "TITL": "Melodious Moonlight",
  "TYPE": 0,
  "YEAR": "2017"
 }
}
