{
 "directory": {
  "files": [
   {
    "flags": 0,
    "length1": 3595601,
    "length2": 3595601,
    "name": "BlazBlue Continuum Shift Console Opening (HD) .mp40.MP3",
    "offset": 0,
    "type": 2
   },
   {
    "flags": 0,
    "length1": 44393044,
    "length2": 44393044,
    "name": "BlazBlue Continuum Shift Console Opening (HD) _002_001.avi",
    "offset": 3595601,
    "type": 5
   },
   {
    "flags": 0,
    "length1": 2940,
    "length2": 2940,
    "name": "Song.ini",
    "offset": 47988645,
    "type": 1
   }
  ],
  "offset": 477
 },
 "headers": {
  "ANME": 12,
  "ARTS": "BlazBlue Continuum Shift",
  "DIFM": 0,
  "DIFW": 0,
  "ENDH": -1,
  "FLID": "\u0000\u0000\u0000\u0000\u0000\u0000\u0000\u0000\u0000\u0000\u0000\u0000\u0000\u0000\u0000\u0000",
  "GNRE": -1,
  "IDUS": "                ",
  "MUSL": 90,
  "PROV": 0,
  "RGHT": 0,
  "SFTV": 17432915,
  "SORC": "1,I,BlazBlue Continuum Shift Console Opening (HD) .mp40.MP3",
  "TITL": "Hekira no Sora he Izanaedo",
  "TYPE": 0
 }
}
