{
 "directory": {
  "files": [
   {
    "flags": 0,
    "length1": 3682766,
    "length2": 3682766,
    "name": "Shingeki no Kyojin - OP1 N.mp3",
    "offset": 0,
    "type": 2
   },
   {
    "flags": 0,
    "length1": 90924860,
    "length2": 90924860,
    "name": "[RawFemme] Shingeki no Kyojin - NCOP1 [BD 720p Hi444PP FLAC][E3438BA5]_001.avi",
    "offset": 3682766,
    "type": 5
   },
   {
    "flags": 0,
    "length1": 3355,
    "length2": 3355,
    "name": "Song.ini",
    "offset": 94607626,
    "type": 1
   }
  ],
  "offset": 445
 },
 "headers": {
  "ANME": 12,
  "ARTS": "Shingeki no Kyojin",
  "DIFM": 0,
  "DIFW": 0,
  "ENDH": -1,
  "FLID": "\u0000\u0000\u0000\u0000\u0000\u0000\u0000\u0000\u0000\u0000\u0000\u0000\u0000\u0000\u0000\u0000",
  "GNRE": -1,
  "IDUS": "                ",
  "KFNZ": "Shlaky",
  "MUSL": 92,
  "PROV": 0,
  "RGHT": 0,
  "SFTV": 17432915,
  "SORC": "1,I,Shingeki no Kyojin - OP1 N.mp3",
  "TITL": "Guren no Yumiya",
  "TYPE": 0
 }
}
