{
 "directory": {
  "files": [
   {
    "flags": 0,
    "length1": 11420006,
    "length2": 11420006,
    "name": "01. Parallel Hearts.mp3",
    "offset": 0,
    "type": 2
   },
   {
    "flags": 0,
    "length1": 944679,
    "length2": 944679,
    "name": "pandora.jpg",
    "offset": 11420006,
    "type": 3
   },
   {
    "flags": 0,
    "length1": 5105,
    "length2": 5105,
    "name": "Song.ini",
    "offset": 12364685,
    "type": 1
   }
  ],
  "offset": 380
 },
 "headers": {
  "ALBM": "Parallel Hearts",
  "ANME": 12,
  "ARTS": "FictionJunction",
  "DIFM": 0,
  "DIFW": 0,
  "ENDH": -1,
  "FLID": "\u0000\u0000\u0000\u0000\u0000\u0000\u0000\u0000\u0000\u0000\u0000\u0000\u0000\u0000\u0000\u0000",
  "GNRE": -1,
  "IDUS": "                ",
  "MUSL": 285,
  "PROV": 0,
  "RGHT": 0,
  "SFTV": 17432915,
  "SORC": "1,I,01. Parallel Hearts.mp3",
  "TITL": "Parallel Hearts",
  "TRAK": "1",
  "TYPE": 0
 }
}
