{
 "directory": {
  "files": [
   {
    "flags": 0,
    "length1": 181296,
    "length2": 181296,
    "name": "covermagick_cover.jpg",
    "offset": 0,
    "type": 3
   },
   {
    "flags": 0,
    "length1": 11313952,
    "length2": 11313952,
    "name": "01.Pledge of liberation.mp3",
    "offset": 181296,
    "type": 2
   },
   {
    "flags": 0,
    "length1": 11313974,
    "length2": 11313974,
    "name": "03.Pledge of liberation(Off Vocal).mp3",
    "offset": 11495248,
    "type": 2
   },
   {
    "flags": 0,
    "length1": 7656,
    "length2": 7656,
    "name": "Song.ini",
    "offset": 22809222,
    "type": 1
   }
  ],
  "offset": 517
 },
 "headers": {
  "ALBM": "Azur Lane",
  "ANME": 12,
  "ARTS": "Ishikawa Yui",
  "COMM": "on/off vocals",
  "DIFM": 0,
  "DIFW": 0,
  "ENDH": -1,
  "FLID": "\u0000\u0000\u0000\u0000\u0000\u0000\u0000\u0000\u0000\u0000\u0000\u0000\u0000\u0000\u0000\u0000",
  "GNRE": -1,
  "IDUS": "                ",
  "KFNZ": "Dysp",
  "LANG": "JA",
  "MUSL": 274,
  "PROV": 0,
  "RGHT": 0,
  "SFTV": 17432915,
  "SORC": "1,I,01.Pledge of liberation.mp3",
  "TITL": "Pledge of Liberation",
  "TRAK": "CS1",
  "TYPE": 0,
  "YEAR": "2019"
 }
}
