{
 "directory": {
  "files": [
   {
    "flags": 0,
    "length1": 3629038,
    "length2": 3629038,
    "name": "40 - Roulette Roulette (Ichijou-san ver.) (TV Size).mp3",
    "offset": 0,
    "type": 2
   },
   {
    "flags": 0,
    "length1": 58390528,
    "length2": 58390528,
    "name": "PaniPoni_Dash!_-_C02_-_Creditless_Opening_2_-_[DmzJ](15cdb923)(RAW).mkv.MPG",
    "offset": 3629038,
    "type": 5
   },
   {
    "flags": 0,
    "length1": 3812,
    "length2": 3812,
    "name": "Song.ini",
    "offset": 62019566,
    "type": 1
   }
  ],
  "offset": 655
 },
 "headers": {
  "ALBM": "Pani Poni Dash! Original Soundtrack - Gakuen Sai",
  "ANME": 12,
  "ARTS": "Momotsuki Gakuen Ichinen C Gumi feat. Ichijou-san",
  "COMM": "#NIPPONSEI @ IRC.RIZON.NET",
  "DIFM": 0,
  "DIFW": 0,
  "ENDH": -1,
  "FLID": "\u0000\u0000\u0000\u0000\u0000\u0000\u0000\u0000\u0000\u0000\u0000\u0000\u0000\u0000\u0000\u0000",
  "GNRE": -1,
  "IDUS": "                ",
  "MUSL": 91,
  "PROV": 0,
  "RGHT": 0,
  "SFTV": 17432915,
  "SORC": "1,I,40 - Roulette Roulette (Ichijou-san ver.) (TV Size).mp3",
  "TITL": "Roulette Roulette (Ichijou-san ver.) (TV Size)",
  "TRAK": "40",
  "TYPE": 0,
  "YEAR": "2005"
 }
}
