{
 "directory": {
  "files": [
   {
    "flags": 0,
    "length1": 3795983,
    "length2": 3795983,
    "name": "06._Tough_&_Alone_norm.mp3",
    "offset": 0,
    "type": 2
   },
   {
    "flags": 0,
    "length1": 7189,
    "length2": 7189,
    "name": "Song.ini",
    "offset": 3795983,
    "type": 1
   }
  ],
  "offset": 411
 },
 "headers": {
  "ALBM": "eYe's",
  "ANME": 12,
  "ARTS": "Myth & Roid",
  "COMP": "Myth & Roid",
  "DIFM": 0,
  "DIFW": 0,
  "ENDH": -1,
  "FLID": "\u0000\u0000\u0000\u0000\u0000\u0000\u0000\u0000\u0000\u0000\u0000\u0000\u0000\u0000\u0000\u0000",
  "GNRE": -1,
  "IDUS": "                ",
  "KARV": "1.0.0",
  "KFNZ": "Nicolas",
  "LANG": "EN",
  "MUSL": 237,
  "PROV": 0,
  "RGHT": 0,
  "SFTV": 17432915,
  "SORC": "1,I,06._Tough_&_Alone_norm.mp3",
  "TITL": "Tough and Alone",
  "TRAK": "6",
  "TYPE": 0,
  "YEAR": "2017"
 }
}
