{
 "directory": {
  "files": [
   {
    "flags": 0,
    "length1": 11175943,
    "length2": 11175943,
    "name": "01 - Shirogane no Honoo -keep the faith-.mp3",
    "offset": 0,
    "type": 2
   },
   {
    "flags": 0,
    "length1": 11175956,
    "length2": 11175956,
    "name": "03 - Shirogane no Honoo -keep the faith-  (off vocal).mp3",
    "offset": 11175943,
    "type": 2
   },
   {
    "flags": 0,
    "length1": 141959,
    "length2": 141959,
    "name": "covermagick_CharacterSong05.jpg",
    "offset": 22351899,
    "type": 3
   },
   {
    "flags": 0,
    "length1": 7512,
    "length2": 7512,
    "name": "Song.ini",
    "offset": 22493858,
    "type": 1
   }
  ],
  "offset": 619
 },
 "headers": {
  "ALBM": "Senki Zesshou Symphogear XV",
  "ANME": 12,
  "ARTS": "Hikasa Youko",
  "COMM": "on/off vocals",
  "COPY": "SATELIGHT",
  "DIFM": 0,
  "DIFW": 0,
  "ENDH": -1,
  "FLID": "\u0000\u0000\u0000\u0000\u0000\u0000\u0000\u0000\u0000\u0000\u0000\u0000\u0000\u0000\u0000\u0000",
  "GNRE": -1,
  "IDUS": "                ",
  "KFNZ": "Dysp",
  "LANG": "JA",
  "MUSL": 275,
  "PROV": 0,
  "RGHT": 0,
  "SFTV": 17432915,
  "SORC": "1,I,01 - Shirogane no Honoo -keep the faith-.mp3",
  "TITL": "Shirogane no Honoo -keep the faith-",
  "TYPE": 0,
  "YEAR": "2019"
 }
}
