{
 "directory": {
  "files": [
   {
    "flags": 0,
    "length1": 1577088,
    "length2": 1577088,
    "name": "19_-_give_a_reason_(tv_size).mp3",
    "offset": 0,
    "type": 2
   },
   {
    "flags": 0,
    "length1": 56453120,
    "length2": 56453120,
    "name": "Slayers Next - Creditless Opening.avi.MPG",
    "offset": 1577088,
    "type": 5
   },
   {
    "flags": 0,
    "length1": 3078,
    "length2": 3078,
    "name": "Song.ini",
    "offset": 58030208,
    "type": 1
   }
  ],
  "offset": 405
 },
 "headers": {
  "ANME": 12,
  "ARTS": "Hayashibara Megumi",
  "DIFM": 0,
  "DIFW": 0,
  "ENDH": -1,
  "FLID": "\u0000\u0000\u0000\u0000\u0000\u0000\u0000\u0000\u0000\u0000\u0000\u0000\u0000\u0000\u0000\u0000",
  "GNRE": -1,
  "IDUS": "                ",
  "MUSL": 99,
  "PROV": 0,
  "RGHT": 0,
  "SFTV": 17432915,
  "SORC": "1,I,19_-_give_a_reason_(tv_size).mp3",
  "TITL": "Give A Reason (TV size)",
  "TYPE": 0
 }
}
