{
 "directory": {
  "files": [
   {
    "flags": 0,
    "length1": 8017502,
    "length2": 8017502,
    "name": "Sakura Taisen 4 - Geki! Tei ~Finale~_Track1.mp3",
    "offset": 0,
    "type": 2
   },
   {
    "flags": 0,
    "length1": 99789350,
    "length2": 99789350,
    "name": "Sakura Taisen 4 - Geki! Tei ~Finale~_Track2.avi.avi",
    "offset": 8017502,
    "type": 5
   },
   {
    "flags": 0,
    "length1": 4916,
    "length2": 4916,
    "name": "Song.ini",
    "offset": 107806852,
    "type": 1
   }
  ],
  "offset": 511
 },
 "headers": {
  "ALBM": "Sakura Taisen Complete Song Box - Disc 8",
  "ANME": 12,
  "ARTS": "Sakura Taisen 4",
  "DIFM": 0,
  "DIFW": 0,
  "ENDH": -1,
  "FLID": "\u0000\u0000\u0000\u0000\u0000\u0000\u0000\u0000\u0000\u0000\u0000\u0000\u0000\u0000\u0000\u0000",
  "GNRE": -1,
  "IDUS": "                ",
  "MUSL": 200,
  "PROV": 0,
  "RGHT": 0,
  "SFTV": 17432915,
  "SORC": "1,I,Sakura Taisen 4 - Geki! Tei ~Finale~_Track1.mp3",
  "TITL": "Geki! Tei ~ Final ~",
  "TRAK": "10",
  "TYPE": 0,
  "YEAR": "2002"
 }
}
