{
 "directory": {
  "files": [
   {
    "flags": 0,
    "length1": 125559,
    "length2": 125559,
    "name": "cover_kfn_cover.jpg",
    "offset": 0,
    "type": 3
   },
   {
    "flags": 0,
    "length1": 5946649,
    "length2": 5946649,
    "name": "n_03. Oukyo Shul Shagana (off vocal)NORM.mp3",
    "offset": 125559,
    "type": 2
   },
   {
    "flags": 0,
    "length1": 5797753,
    "length2": 5797753,
    "name": "n_01. Oukyo Shul ShaganaNORM.mp3",
    "offset": 6072208,
    "type": 2
   },
   {
    "flags": 0,
    "length1": 6310,
    "length2": 6310,
    "name": "Song.ini",
    "offset": 11869961,
    "type": 1
   }
  ],
  "offset": 563
 },
 "headers": {
  "ALBM": "Senki Zesshou Symphogear G",
  "ANME": 12,
  "ARTS": "Yoshino Nanjou",
  "COMM": "on/off vocals",
  "COPY": "Elements Garden",
  "DIFM": 0,
  "DIFW": 0,
  "ENDH": -1,
  "FLID": "\u0000\u0000\u0000\u0000\u0000\u0000\u0000\u0000\u0000\u0000\u0000\u0000\u0000\u0000\u0000\u0000",
  "GNRE": -1,
  "IDUS": "                ",
  "KFNZ": "mrkyubu",
  "LANG": "JA",
  "MUSL": 246,
  "PROV": 0,
  "RGHT": 0,
  "SFTV": 17432915,
  "SORC": "1,I,n_01. Oukyo Shul ShaganaNORM.mp3",
  "TITL": "Oukyo Shul Shagana",
  "TYPE": 0,
  "YEAR": "2013"
 }
}
