{
 "directory": {
  "files": [
   {
    "flags": 0,
    "length1": 2800225,
    "length2": 2800225,
    "name": "22- Le Temps des Cerises.mp3",
    "offset": 0,
    "type": 2
   },
   {
    "flags": 0,
    "length1": 132776,
    "length2": 132776,
    "name": "porco1998.jpg",
    "offset": 2800225,
    "type": 3
   },
   {
    "flags": 0,
    "length1": 2666,
    "length2": 2666,
    "name": "Song.ini",
    "offset": 2933001,
    "type": 1
   }
  ],
  "offset": 359
 },
 "headers": {
  "ANME": 12,
  "ARTS": "Porco Rosso",
  "DIFM": 0,
  "DIFW": 0,
  "ENDH": -1,
  "FLID": "\u0000\u0000\u0000\u0000\u0000\u0000\u0000\u0000\u0000\u0000\u0000\u0000\u0000\u0000\u0000\u0000",
  "GNRE": -1,
  "IDUS": "                ",
  "MUSL": 175,
  "PROV": 0,
  "RGHT": 0,
  "SFTV": 17432915,
  "SORC": "1,I,22- Le Temps des Cerises.mp3",
  "TITL": "Le Temps des Cerises",
  "TYPE": 0
 }
}
