{
 "directory": {
  "files": [
   {
    "flags": 0,
    "length1": 167443,
    "length2": 167443,
    "name": "covermagick_CharacterSong03.jpg",
    "offset": 0,
    "type": 3
   },
   {
    "flags": 0,
    "length1": 13486029,
    "length2": 13486029,
    "name": "04 Kimi ga Nakanai Sekai ni off vocal.mp3",
    "offset": 167443,
    "type": 2
   },
   {
    "flags": 0,
    "length1": 13486019,
    "length2": 13486019,
    "name": "02 Kimi ga Nakanai Sekai ni.mp3",
    "offset": 13653472,
    "type": 2
   },
   {
    "flags": 0,
    "length1": 6989,
    "length2": 6989,
    "name": "Song.ini",
    "offset": 27139491,
    "type": 1
   }
  ],
  "offset": 568
 },
 "headers": {
  "ALBM": "Senki Zesshou Symphogear XV",
  "ANME": 12,
  "ARTS": "Yoshino Nanjou",
  "COMM": "on/off vocals",
  "COPY": "SATELIGHT",
  "DIFM": 0,
  "DIFW": 0,
  "ENDH": -1,
  "FLID": "\u0000\u0000\u0000\u0000\u0000\u0000\u0000\u0000\u0000\u0000\u0000\u0000\u0000\u0000\u0000\u0000",
  "GNRE": -1,
  "IDUS": "                ",
  "KFNZ": "Dysp",
  "LANG": "JA",
  "MUSL": 276,
  "PROV": 0,
  "RGHT": 0,
  "SFTV": 17432915,
  "SORC": "1,I,02 Kimi ga Nakanai Sekai ni.mp3",
  "TITL": "Kimi ga Nakanai Sekai ni",
  "TYPE": 0,
  "YEAR": "2019"
 }
}
