{
 "directory": {
  "files": [
   {
    "flags": 0,
    "length1": 22878142,
    "length2": 22878142,
    "name": "Non Non Biyori Repeat OP.avi",
    "offset": 0,
    "type": 5
   },
   {
    "flags": 0,
    "length1": 2889925,
    "length2": 2889925,
    "name": "Non Non Biyori Repeat OP.mp3",
    "offset": 22878142,
    "type": 2
   },
   {
    "flags": 0,
    "length1": 2689,
    "length2": 2689,
    "name": "Song.ini",
    "offset": 25768067,
    "type": 1
   }
  ],
  "offset": 380
 },
 "headers": {
  "ANME": 12,
  "ARTS": "nano.RIPE",
  "DIFM": 0,
  "DIFW": 0,
  "ENDH": -1,
  "FLID": "\u0000\u0000\u0000\u0000\u0000\u0000\u0000\u0000\u0000\u0000\u0000\u0000\u0000\u0000\u0000\u0000",
  "GNRE": -1,
  "IDUS": "                ",
  "KFNZ": "Alex",
  "MUSL": 90,
  "PROV": 0,
  "RGHT": 0,
  "SFTV": 17432915,
  "SORC": "1,I,Non Non Biyori Repeat OP.mp3",
  "TITL": "Kodama Kotodama",
  "TYPE": 0
 }
}
