{
 "directory": {
  "files": [
   {
    "flags": 0,
    "length1": 1446070,
    "length2": 1446070,
    "name": "norm_Mob Psycho 100 - OP - MOB CHOIR - 99.mp3",
    "offset": 0,
    "type": 2
   },
   {
    "flags": 0,
    "length1": 45189572,
    "length2": 45189572,
    "name": "Mob Psycho 100 Opening ''99''.mp4.avi",
    "offset": 1446070,
    "type": 5
   },
   {
    "flags": 0,
    "length1": 4600,
    "length2": 4600,
    "name": "Song.ini",
    "offset": 46635642,
    "type": 1
   }
  ],
  "offset": 457
 },
 "headers": {
  "ALBM": "Mob Psycho 100",
  "ANME": 12,
  "ARTS": "MOB CHOIR",
  "DIFM": 0,
  "DIFW": 0,
  "ENDH": -1,
  "FLID": "\u0000\u0000\u0000\u0000\u0000\u0000\u0000\u0000\u0000\u0000\u0000\u0000\u0000\u0000\u0000\u0000",
  "GNRE": -1,
  "IDUS": "                ",
  "KFNZ": "Dysp",
  "MUSL": 90,
  "PROV": 0,
  "RGHT": 0,
  "SFTV": 17432915,
  "SORC": "1,I,norm_Mob Psycho 100 - OP - MOB CHOIR - 99.mp3",
  "TITL": "99",
  "TRAK": "OP",
  "TYPE": 0,
  "YEAR": "2016"
 }
}
