{
 "directory": {
  "files": [
   {
    "flags": 0,
    "length1": 11866367,
    "length2": 11866367,
    "name": "01. FOR THE FUTURE.mp3",
    "offset": 0,
    "type": 2
   },
   {
    "flags": 0,
    "length1": 11866379,
    "length2": 11866379,
    "name": "03. FOR THE FUTURE (off vocal).mp3",
    "offset": 11866367,
    "type": 2
   },
   {
    "flags": 0,
    "length1": 145245,
    "length2": 145245,
    "name": "covermagick_BonusCD6.jpg",
    "offset": 23732746,
    "type": 3
   },
   {
    "flags": 0,
    "length1": 7524,
    "length2": 7524,
    "name": "Song.ini",
    "offset": 23877991,
    "type": 1
   }
  ],
  "offset": 523
 },
 "headers": {
  "ALBM": "Senki Zesshou Symphogear XV",
  "ANME": 12,
  "ARTS": "Yuka Iguchi",
  "COMM": "on/off vocals",
  "COPY": "SATELIGHT",
  "DIFM": 0,
  "DIFW": 0,
  "ENDH": -1,
  "FLID": "\u0000\u0000\u0000\u0000\u0000\u0000\u0000\u0000\u0000\u0000\u0000\u0000\u0000\u0000\u0000\u0000",
  "GNRE": -1,
  "IDUS": "                ",
  "KFNZ": "Dysp",
  "LANG": "JA",
  "MUSL": 277,
  "PROV": 0,
  "RGHT": 0,
  "SFTV": 17432915,
  "SORC": "1,I,01. FOR THE FUTURE.mp3",
  "TITL": "FOR THE FUTURE",
  "TYPE": 0,
  "YEAR": "2019"
 }
}
