{
 "directory": {
  "files": [
   {
    "flags": 0,
    "length1": 37139138,
    "length2": 37139138,
    "name": "Dance Robot Dance.avi",
    "offset": 0,
    "type": 5
   },
   {
    "flags": 0,
    "length1": 7651925,
    "length2": 7651925,
    "name": "Dance robot dance 96neko.mp3",
    "offset": 37139138,
    "type": 2
   },
   {
    "flags": 0,
    "length1": 6017,
    "length2": 6017,
    "name": "Song.ini",
    "offset": 44791063,
    "type": 1
   }
  ],
  "offset": 382
 },
 "headers": {
  "ANME": 12,
  "ARTS": "Nayutan Seijin",
  "DIFM": 0,
  "DIFW": 0,
  "ENDH": -1,
  "FLID": "\u0000\u0000\u0000\u0000\u0000\u0000\u0000\u0000\u0000\u0000\u0000\u0000\u0000\u0000\u0000\u0000",
  "GNRE": -1,
  "IDUS": "                ",
  "KFNZ": "Kévin",
  "MUSL": 191,
  "PROV": 0,
  "RGHT": 0,
  "SFTV": 17432915,
  "SORC": "1,I,Dance robot dance 96neko.mp3",
  "TITL": "Dance Robot Dance",
  "TYPE": 0
 }
}
