{
 "directory": {
  "files": [
   {
    "flags": 0,
    "length1": 1442517,
    "length2": 1442517,
    "name": "Tonari no Kaibutsu-kun ED.mp3",
    "offset": 0,
    "type": 2
   },
   {
    "flags": 0,
    "length1": 26357596,
    "length2": 26357596,
    "name": "Tonari no Kaibutsu-kun ED.avi",
    "offset": 1442517,
    "type": 5
   },
   {
    "flags": 0,
    "length1": 2972,
    "length2": 2972,
    "name": "Song.ini",
    "offset": 27800113,
    "type": 1
   }
  ],
  "offset": 376
 },
 "headers": {
  "ANME": 12,
  "ARTS": "9nine",
  "DIFM": 0,
  "DIFW": 0,
  "ENDH": -1,
  "FLID": "\u0000\u0000\u0000\u0000\u0000\u0000\u0000\u0000\u0000\u0000\u0000\u0000\u0000\u0000\u0000\u0000",
  "GNRE": -1,
  "IDUS": "                ",
  "KFNZ": "Dysp",
  "MUSL": 90,
  "PROV": 0,
  "RGHT": 0,
  "SFTV": 17432915,
  "SORC": "1,I,Tonari no Kaibutsu-kun ED.mp3",
  "TITL": "White Wishes",
  "TYPE": 0
 }
}
