{
 "directory": {
  "files": [
   {
    "flags": 0,
    "length1": 1351294,
    "length2": 1351294,
    "name": "Hajime no Ippo OP2.mp4.MP3",
    "offset": 0,
    "type": 2
   },
   {
    "flags": 0,
    "length1": 14393344,
    "length2": 14393344,
    "name": "Hajime no Ippo OP2.mp4.MPG",
    "offset": 1351294,
    "type": 5
   },
   {
    "flags": 0,
    "length1": 2309,
    "length2": 2309,
    "name": "Song.ini",
    "offset": 15744638,
    "type": 1
   }
  ],
  "offset": 362
 },
 "headers": {
  "ANME": 12,
  "ARTS": "Shocking Lemon",
  "DIFM": 0,
  "DIFW": 0,
  "ENDH": -1,
  "FLID": "\u0000\u0000\u0000\u0000\u0000\u0000\u0000\u0000\u0000\u0000\u0000\u0000\u0000\u0000\u0000\u0000",
  "GNRE": -1,
  "IDUS": "                ",
  "MUSL": 84,
  "PROV": 0,
  "RGHT": 0,
  "SFTV": 17432915,
  "SORC": "1,I,Hajime no Ippo OP2.mp4.MP3",
  "TITL": "Inner Light",
  "TYPE": 0
 }
}
