{
 "directory": {
  "files": [
   {
    "flags": 0,
    "length1": 140659,
    "length2": 140659,
    "name": "covermagick_BonusCD3.jpg",
    "offset": 0,
    "type": 3
   },
   {
    "flags": 0,
    "length1": 2494191,
    "length2": 2494191,
    "name": "02. Ewigkeit (Shitou -Ewigkeit-).mp3",
    "offset": 140659,
    "type": 2
   },
   {
    "flags": 0,
    "length1": 4496,
    "length2": 4496,
    "name": "Song.ini",
    "offset": 2634850,
    "type": 1
   }
  ],
  "offset": 540
 },
 "headers": {
  "ALBM": "Senki Zesshou Symphogear AXZ",
  "ANME": 12,
  "ARTS": "Minako Kotobuki, Shouta Aoi, Rina Hidaka",
  "COMM": "on/off vocals",
  "COPY": "SATELIGHT",
  "DIFM": 0,
  "DIFW": 0,
  "ENDH": -1,
  "FLID": "\u0000\u0000\u0000\u0000\u0000\u0000\u0000\u0000\u0000\u0000\u0000\u0000\u0000\u0000\u0000\u0000",
  "GNRE": -1,
  "IDUS": "                ",
  "KFNZ": "Luthien",
  "LANG": "DE",
  "MUSL": 48,
  "PROV": 0,
  "RGHT": 0,
  "SFTV": 17432915,
  "SORC": "1,I,02. Ewigkeit (Shitou -Ewigkeit-).mp3",
  "TITL": "Ewigkeit (Shitou -Ewigkeit-)",
  "TYPE": 0,
  "YEAR": "2017"
 }
}
