{
 "directory": {
  "files": [
   {
    "flags": 0,
    "length1": 3632172,
    "length2": 3632172,
    "name": "[BK201-Raws] Fullmetal Alchemist 2 - 03 (D-TBS 1280x720 x264 AC3 5.1).mkv.MP3",
    "offset": 0,
    "type": 2
   },
   {
    "flags": 0,
    "length1": 56973312,
    "length2": 56973312,
    "name": "FMA.mpg.MPG",
    "offset": 3632172,
    "type": 5
   },
   {
    "flags": 0,
    "length1": 4395,
    "length2": 4395,
    "name": "Song.ini",
    "offset": 60605484,
    "type": 1
   }
  ],
  "offset": 445
 },
 "headers": {
  "ANME": 12,
  "ARTS": "YUI",
  "DIFM": 0,
  "DIFW": 0,
  "ENDH": -1,
  "FLID": "\u0000\u0000\u0000\u0000\u0000\u0000\u0000\u0000\u0000\u0000\u0000\u0000\u0000\u0000\u0000\u0000",
  "GNRE": -1,
  "IDUS": "                ",
  "MUSL": 91,
  "PROV": 0,
  "RGHT": 0,
  "SFTV": 17432915,
  "SORC": "1,I,[BK201-Raws] Fullmetal Alchemist 2 - 03 (D-TBS 1280x720 x264 AC3 5.1).mkv.MP3",
  "TITL": "Again",
  "TYPE": 0,
  "YEAR": "2009"
 }
}
