{
 "directory": {
  "files": [
   {
    "flags": 0,
    "length1": 1478431,
    "length2": 1478431,
    "name": "Orphans no namida.mp3",
    "offset": 0,
    "type": 2
   },
   {
    "flags": 0,
    "length1": 45947066,
    "length2": 45947066,
    "name": "Orphans no namida.avi",
    "offset": 1478431,
    "type": 5
   },
   {
    "flags": 0,
    "length1": 2444,
    "length2": 2444,
    "name": "Song.ini",
    "offset": 47425497,
    "type": 1
   }
  ],
  "offset": 392
 },
 "headers": {
  "ALBM": "Gundam Tekketsu",
  "ANME": 12,
  "ARTS": "MISIA",
  "DIFM": 0,
  "DIFW": 0,
  "ENDH": -1,
  "FLID": "\u0000\u0000\u0000\u0000\u0000\u0000\u0000\u0000\u0000\u0000\u0000\u0000\u0000\u0000\u0000\u0000",
  "GNRE": -1,
  "IDUS": "                ",
  "KFNZ": "Dysp",
  "LANG": "JA",
  "MUSL": 92,
  "PROV": 0,
  "RGHT": 0,
  "SFTV": 17432915,
  "SORC": "1,I,Orphans no namida.mp3",
  "TITL": "Orphans no Namida",
  "TYPE": 0
 }
}
