{
 "directory": {
  "files": [
   {
    "flags": 0,
    "length1": 615052,
    "length2": 615052,
    "name": "fate_stay_night_saber-hd.jpg",
    "offset": 0,
    "type": 3
   },
   {
    "flags": 0,
    "length1": 215262,
    "length2": 215262,
    "name": "fatestay.jpg",
    "offset": 615052,
    "type": 3
   },
   {
    "flags": 0,
    "length1": 144802,
    "length2": 144802,
    "name": "fate-stay-night-unlimited-blade-works-episode-1-5.jpg",
    "offset": 830314,
    "type": 3
   },
   {
    "flags": 0,
    "length1": 39623,
    "length2": 39623,
    "name": "horriblesubs-fate-stay-night-unlimited-blade-works-02-720p-mkv_snapshot_07-48_2014-10-19_23-21-23.jpg",
    "offset": 975116,
    "type": 3
   },
   {
    "flags": 0,
    "length1": 12802487,
    "length2": 12802487,
    "name": "09.LAST STARDUST.mp3",
    "offset": 1014739,
    "type": 2
   },
   {
    "flags": 0,
    "length1": 5695,
    "length2": 5695,
    "name": "Song.ini",
    "offset": 13817226,
    "type": 1
   }
  ],
  "offset": 594
 },
 "headers": {
  "ANME": 12,
  "ARTS": "Aimer",
  "DIFM": 0,
  "DIFW": 0,
  "ENDH": -1,
  "FLID": "\u0000\u0000\u0000\u0000\u0000\u0000\u0000\u0000\u0000\u0000\u0000\u0000\u0000\u0000\u0000\u0000",
  "GNRE": -1,
  "IDUS": "                ",
  "KFNZ": "JE",
  "MUSL": 319,
  "PROV": 0,
  "RGHT": 0,
  "SFTV": 17432915,
  "SORC": "1,I,09.LAST STARDUST.mp3",
  "TITL": "Last Stardust",
  "TYPE": 0
 }
}
