{
 "directory": {
  "files": [
   {
    "flags": 0,
    "length1": 3238318,
    "length2": 3238318,
    "name": "Death Note - OP2 - What's up people!_norm.mp3",
    "offset": 0,
    "type": 2
   },
   {
    "flags": 0,
    "length1": 424464,
    "length2": 424464,
    "name": "DAEMONES.TTF",
    "offset": 3238318,
    "type": 4
   },
   {
    "flags": 0,
    "length1": 284784,
    "length2": 284784,
    "name": "28 DAYS LATER.TTF",
    "offset": 3662782,
    "type": 4
   },
   {
    "flags": 0,
    "length1": 61063184,
    "length2": 61063184,
    "name": "JPN - Death Note - OP2 - What's up people question_mark !.avi",
    "offset": 3947566,
    "type": 5
   },
   {
    "flags": 0,
    "length1": 4578,
    "length2": 4578,
    "name": "Song.ini",
    "offset": 65010750,
    "type": 1
   }
  ],
  "offset": 558
 },
 "headers": {
  "ALBM": "Death Note",
  "ANME": 12,
  "ARTS": "MAXIMUM THE HORMONE",
  "DIFM": 0,
  "DIFW": 0,
  "ENDH": -1,
  "FLID": "\u0000\u0000\u0000\u0000\u0000\u0000\u0000\u0000\u0000\u0000\u0000\u0000\u0000\u0000\u0000\u0000",
  "GNRE": -1,
  "IDUS": "                ",
  "KFNZ": "Hoël",
  "MUSL": 81,
  "PROV": 0,
  "RGHT": 0,
  "SFTV": 17432915,
  "SORC": "1,I,Death Note - OP2 - What's up people!_norm.mp3",
  "TITL": "What's up, people?!",
  "TYPE": 0
 }
}
