{
 "directory": {
  "files": [
   {
    "flags": 0,
    "length1": 3668352,
    "length2": 3668352,
    "name": "CODE GEASS OP (STAGE 9 12).mp4.MP3",
    "offset": 0,
    "type": 2
   },
   {
    "flags": 0,
    "length1": 45801052,
    "length2": 45801052,
    "name": "CODE GEASS OP (STAGE 9 12).avi.avi",
    "offset": 3668352,
    "type": 5
   },
   {
    "flags": 0,
    "length1": 2874,
    "length2": 2874,
    "name": "Song.ini",
    "offset": 49469404,
    "type": 1
   }
  ],
  "offset": 402
 },
 "headers": {
  "ALBM": "Code Geass",
  "ANME": 12,
  "ARTS": "Flow",
  "DIFM": 0,
  "DIFW": 0,
  "ENDH": -1,
  "FLID": "\u0000\u0000\u0000\u0000\u0000\u0000\u0000\u0000\u0000\u0000\u0000\u0000\u0000\u0000\u0000\u0000",
  "GNRE": -1,
  "IDUS": "                ",
  "MUSL": 92,
  "PROV": 0,
  "RGHT": 0,
  "SFTV": 17432915,
  "SORC": "1,I,CODE GEASS OP (STAGE 9 12).mp4.MP3",
  "TITL": "Colors",
  "TRAK": "OP1",
  "TYPE": 0
 }
}
