{
 "directory": {
  "files": [
   {
    "flags": 0,
    "length1": 11763019,
    "length2": 11763019,
    "name": "Asu e no Tobira.mp3",
    "offset": 0,
    "type": 2
   },
   {
    "flags": 0,
    "length1": 344566,
    "length2": 344566,
    "name": "__kase_tomoka_and_yamada_yui_asagao_to_kase_san__fde629c377e233ff131c2a82a3cf0e29.jpg",
    "offset": 11763019,
    "type": 3
   },
   {
    "flags": 0,
    "length1": 10330,
    "length2": 10330,
    "name": "Song.ini",
    "offset": 12107585,
    "type": 1
   }
  ],
  "offset": 570
 },
 "headers": {
  "ALBM": "Asagao to Kase-san.",
  "ANME": 12,
  "ARTS": "Yui Yamada (Minami Takahashi) & Tomoka Kase (Ayane Sakura)",
  "COMM": "https://hikarinoakariost.info/",
  "DIFM": 0,
  "DIFW": 0,
  "ENDH": -1,
  "FLID": "\u0000\u0000\u0000\u0000\u0000\u0000\u0000\u0000\u0000\u0000\u0000\u0000\u0000\u0000\u0000\u0000",
  "GNRE": -1,
  "IDUS": "                ",
  "KFNZ": "Dysp",
  "LANG": "JA",
  "MUSL": 287,
  "PROV": 0,
  "RGHT": 0,
  "SFTV": 17432915,
  "SORC": "1,I,Asu e no Tobira.mp3",
  "TITL": "Asu e no Tobira",
  "TRAK": "ED",
  "TYPE": 0,
  "YEAR": "2018"
 }
}
