{
 "directory": {
  "files": [
   {
    "flags": 0,
    "length1": 1351083,
    "length2": 1351083,
    "name": "Charlotte ED_1.mp3",
    "offset": 0,
    "type": 2
   },
   {
    "flags": 0,
    "length1": 42204588,
    "length2": 42204588,
    "name": "Charlotte ED.avi",
    "offset": 1351083,
    "type": 5
   },
   {
    "flags": 0,
    "length1": 4121,
    "length2": 4121,
    "name": "Song.ini",
    "offset": 43555671,
    "type": 1
   }
  ],
  "offset": 372
 },
 "headers": {
  "ALBM": "Charlotte",
  "ANME": 12,
  "ARTS": "Maeda Jun",
  "DIFM": 0,
  "DIFW": 0,
  "ENDH": -1,
  "FLID": "\u0000\u0000\u0000\u0000\u0000\u0000\u0000\u0000\u0000\u0000\u0000\u0000\u0000\u0000\u0000\u0000",
  "GNRE": -1,
  "IDUS": "                ",
  "KFNZ": "Hoël",
  "MUSL": 84,
  "PROV": 0,
  "RGHT": 0,
  "SFTV": 17432915,
  "SORC": "1,I,Charlotte ED_1.mp3",
  "TITL": "Yake Ochinai Tsubasa",
  "TYPE": 0
 }
}
