{
 "directory": {
  "files": [
   {
    "flags": 0,
    "length1": 1445778,
    "length2": 1445778,
    "name": "Grand_Blue_OP_1_norm.mp3",
    "offset": 0,
    "type": 2
   },
   {
    "flags": 0,
    "length1": 67609848,
    "length2": 67609848,
    "name": "JPN - Grand Blue - OP - Grand Blue.avi",
    "offset": 1445778,
    "type": 5
   },
   {
    "flags": 0,
    "length1": 2785,
    "length2": 2785,
    "name": "Song.ini",
    "offset": 69055626,
    "type": 1
   }
  ],
  "offset": 420
 },
 "headers": {
  "ALBM": "Grand Blue",
  "ANME": 12,
  "ARTS": "Magic System",
  "DIFM": 0,
  "DIFW": 0,
  "ENDH": -1,
  "FLID": "\u0000\u0000\u0000\u0000\u0000\u0000\u0000\u0000\u0000\u0000\u0000\u0000\u0000\u0000\u0000\u0000",
  "GNRE": -1,
  "IDUS": "                ",
  "KFNZ": "Dysp",
  "LANG": "JA",
  "MUSL": 90,
  "PROV": 0,
  "RGHT": 0,
  "SFTV": 17432915,
  "SORC": "1,I,Grand_Blue_OP_1_norm.mp3",
  "TITL": "GURANBURU",
  "TRAK": "OP",
  "TYPE": 0
 }
}
