{
 "directory": {
  "files": [
   {
    "flags": 0,
    "length1": 1479151,
    "length2": 1479151,
    "name": "Matryoshka BG.jpg",
    "offset": 0,
    "type": 3
   },
   {
    "flags": 0,
    "length1": 3457722,
    "length2": 3457722,
    "name": "Lon - Matryoshka.mp3",
    "offset": 1479151,
    "type": 2
   },
   {
    "flags": 0,
    "length1": 6948,
    "length2": 6948,
    "name": "Song.ini",
    "offset": 4936873,
    "type": 1
   }
  ],
  "offset": 342
 },
 "headers": {
  "ANME": 12,
  "ARTS": "Lon",
  "DIFM": 0,
  "DIFW": 0,
  "ENDH": -1,
  "FLID": "\u0000\u0000\u0000\u0000\u0000\u0000\u0000\u0000\u0000\u0000\u0000\u0000\u0000\u0000\u0000\u0000",
  "GNRE": -1,
  "IDUS": "                ",
  "KFNZ": "Dysp",
  "MUSL": 216,
  "PROV": 0,
  "RGHT": 0,
  "SFTV": 17432915,
  "SORC": "1,I,Lon - Matryoshka.mp3",
  "TITL": "Matryoshka",
  "TYPE": 0
 }
}
