{
 "directory": {
  "files": [
   {
    "flags": 0,
    "length1": 62998930,
    "length2": 62998930,
    "name": "ShingekiNoKyojinS4-ED1.avi",
    "offset": 0,
    "type": 5
   },
   {
    "flags": 0,
    "length1": 3601211,
    "length2": 3601211,
    "name": "ShingekiNoKyojinS4-ED1.mp3",
    "offset": 62998930,
    "type": 2
   },
   {
    "flags": 0,
    "length1": 3896,
    "length2": 3896,
    "name": "Song.ini",
    "offset": 66600141,
    "type": 1
   }
  ],
  "offset": 473
 },
 "headers": {
  "ALBM": "Shingeki no Kyojin: The Final Season",
  "ANME": 12,
  "ARTS": "Yuuko Andou",
  "COMM": "AnimeThemes.moe",
  "DIFM": 0,
  "DIFW": 0,
  "ENDH": -1,
  "FLID": "\u0000\u0000\u0000\u0000\u0000\u0000\u0000\u0000\u0000\u0000\u0000\u0000\u0000\u0000\u0000\u0000",
  "GNRE": -1,
  "IDUS": "                ",
  "KFNZ": "Dysp",
  "LANG": "JA",
  "MUSL": 90,
  "PROV": 0,
  "RGHT": 0,
  "SFTV": 17432915,
  "SORC": "1,I,ShingekiNoKyojinS4-ED1.mp3",
  "TITL": "Shougeki",
  "TRAK": "ED",
  "TYPE": 0,
  "YEAR": "2020"
 }
}
