{
 "directory": {
  "files": [
   {
    "flags": 0,
    "length1": 1382178,
    "length2": 1382178,
    "name": "IsekaiQuartet2ED.mp3",
    "offset": 0,
    "type": 2
   },
   {
    "flags": 0,
    "length1": 27089568,
    "length2": 27089568,
    "name": "IsekaiQuartet2ED.avi",
    "offset": 1382178,
    "type": 5
   },
   {
    "flags": 0,
    "length1": 5486,
    "length2": 5486,
    "name": "Song.ini",
    "offset": 28471746,
    "type": 1
   }
  ],
  "offset": 407
 },
 "headers": {
  "ALBM": "Isekai Quartet 2",
  "ANME": 12,
  "DIFM": 0,
  "DIFW": 0,
  "ENDH": -1,
  "FLID": "\u0000\u0000\u0000\u0000\u0000\u0000\u0000\u0000\u0000\u0000\u0000\u0000\u0000\u0000\u0000\u0000",
  "GNRE": -1,
  "IDUS": "                ",
  "KFNZ": "Dysp",
  "LANG": "JA",
  "MUSL": 86,
  "PROV": 0,
  "RGHT": 0,
  "SFTV": 17432915,
  "SORC": "1,I,IsekaiQuartet2ED.mp3",
  "TITL": "Ponkotsu! Isekai Theater",
  "TRAK": "ED",
  "TYPE": 0,
  "YEAR": "2020"
 }
}
