{
 "directory": {
  "files": [
   {
    "flags": 0,
    "length1": 94654682,
    "length2": 94654682,
    "name": "windowstabletnouta.avi",
    "offset": 0,
    "type": 5
   },
   {
    "flags": 0,
    "length1": 5395245,
    "length2": 5395245,
    "name": "windowstabletnouta.mp3",
    "offset": 94654682,
    "type": 2
   },
   {
    "flags": 0,
    "length1": 6684,
    "length2": 6684,
    "name": "Song.ini",
    "offset": 100049927,
    "type": 1
   }
  ],
  "offset": 434
 },
 "headers": {
  "ANME": 12,
  "ARTS": "Himeda Manabu",
  "COMM": "https://youtu.be/XeMFaz0sPqA\r",
  "DIFM": 0,
  "DIFW": 0,
  "ENDH": -1,
  "FLID": "\u0000\u0000\u0000\u0000\u0000\u0000\u0000\u0000\u0000\u0000\u0000\u0000\u0000\u0000\u0000\u0000",
  "GNRE": -1,
  "IDUS": "                ",
  "KFNZ": "Dysp",
  "LANG": "JA",
  "MUSL": 135,
  "PROV": 0,
  "RGHT": 0,
  "SFTV": 17432915,
  "SORC": "1,I,windowstabletnouta.mp3",
  "TITL": "Windows Tablet no Uta",
  "TYPE": 0,
  "YEAR": "2014"
 }
}
