{
 "directory": {
  "files": [
   {
    "flags": 0,
    "length1": 196172,
    "length2": 196172,
    "name": "cover_kfn_cover.jpg",
    "offset": 0,
    "type": 3
   },
   {
    "flags": 0,
    "length1": 6317872,
    "length2": 6317872,
    "name": "Senki Zesshou Symphogear GX - Character Song 2 - Tachibana Hibiki - Genkai Toppa G-beat_03. Genkai Toppa G-beat (off vocal).mp3",
    "offset": 196172,
    "type": 2
   },
   {
    "flags": 0,
    "length1": 6261756,
    "length2": 6261756,
    "name": "Senki Zesshou Symphogear GX - Character Song 2 - Tachibana Hibiki - Genkai Toppa G-beat_01. Genkai Toppa G-beat.mp3",
    "offset": 6514044,
    "type": 2
   },
   {
    "flags": 0,
    "length1": 8035,
    "length2": 8035,
    "name": "Song.ini",
    "offset": 12775800,
    "type": 1
   }
  ],
  "offset": 803
 },
 "headers": {
  "ALBM": "Senki Zesshou Symphogear GX",
  "ANME": 12,
  "ARTS": "Aoi Yuuki",
  "COMM": "on/off vocals",
  "COPY": "SATELIGHT",
  "DIFM": 0,
  "DIFW": 0,
  "ENDH": -1,
  "FLID": "\u0000\u0000\u0000\u0000\u0000\u0000\u0000\u0000\u0000\u0000\u0000\u0000\u0000\u0000\u0000\u0000",
  "GNRE": -1,
  "IDUS": "                ",
  "KFNZ": "mrkyubu",
  "LANG": "JA",
  "MUSL": 261,
  "PROV": 0,
  "RGHT": 0,
  "SFTV": 17432915,
  "SORC": "1,I,Senki Zesshou Symphogear GX - Character Song 2 - Tachibana Hibiki - Genkai Toppa G-beat_01. Genkai Toppa G-beat.mp3",
  "TITL": "Genkai Toppa G-beat",
  "TYPE": 0,
  "YEAR": "2015"
 }
}
