{
 "directory": {
  "files": [
   {
    "flags": 0,
    "length1": 13037696,
    "length2": 13037696,
    "name": "01 - synchronicity.mp3",
    "offset": 0,
    "type": 2
   },
   {
    "flags": 0,
    "length1": 1490437,
    "length2": 1490437,
    "name": "tsubasa.jpg",
    "offset": 13037696,
    "type": 3
   },
   {
    "flags": 0,
    "length1": 5108,
    "length2": 5108,
    "name": "Song.ini",
    "offset": 14528133,
    "type": 1
   }
  ],
  "offset": 351
 },
 "headers": {
  "ANME": 12,
  "ARTS": "Tsubasa Tokyo Revelation",
  "DIFM": 0,
  "DIFW": 0,
  "ENDH": -1,
  "FLID": "\u0000\u0000\u0000\u0000\u0000\u0000\u0000\u0000\u0000\u0000\u0000\u0000\u0000\u0000\u0000\u0000",
  "GNRE": -1,
  "IDUS": "                ",
  "MUSL": 326,
  "PROV": 0,
  "RGHT": 0,
  "SFTV": 17432915,
  "SORC": "1,I,01 - synchronicity.mp3",
  "TITL": "Synchronicity",
  "TYPE": 0
 }
}
