{
 "directory": {
  "files": [
   {
    "flags": 0,
    "length1": 798873,
    "length2": 798873,
    "name": "FateZero.jpg",
    "offset": 0,
    "type": 3
   },
   {
    "flags": 0,
    "length1": 4359678,
    "length2": 4359678,
    "name": "Luna Haruna - Sora wa takaku kaze wa utau.mp3",
    "offset": 798873,
    "type": 2
   },
   {
    "flags": 0,
    "length1": 5380,
    "length2": 5380,
    "name": "Song.ini",
    "offset": 5158551,
    "type": 1
   }
  ],
  "offset": 454
 },
 "headers": {
  "ALBM": "Fate/Zero",
  "ANME": 12,
  "ARTS": "Luna Haruna",
  "DIFM": 0,
  "DIFW": 0,
  "ENDH": -1,
  "FLID": "\u0000\u0000\u0000\u0000\u0000\u0000\u0000\u0000\u0000\u0000\u0000\u0000\u0000\u0000\u0000\u0000",
  "GNRE": -1,
  "IDUS": "                ",
  "KFNZ": "Dysp",
  "LANG": "JA",
  "MUSL": 272,
  "PROV": 0,
  "RGHT": 0,
  "SFTV": 17432915,
  "SORC": "1,I,Luna Haruna - Sora wa takaku kaze wa utau.mp3",
  "TITL": "Sora wa takaku, kaze wa utau",
  "TRAK": "ED2",
  "TYPE": 0
 }
}
