{
 "directory": {
  "files": [
   {
    "flags": 0,
    "length1": 2186794,
    "length2": 2186794,
    "name": "Neon Genesis Evangelion - Creditless Opening (Clean).mkv.MP3",
    "offset": 0,
    "type": 2
   },
   {
    "flags": 0,
    "length1": 57600000,
    "length2": 57600000,
    "name": "Neon Genesis Evangelion - Creditless Opening (Clean).mkv.MPG",
    "offset": 2186794,
    "type": 5
   },
   {
    "flags": 0,
    "length1": 3167,
    "length2": 3167,
    "name": "Song.ini",
    "offset": 59786794,
    "type": 1
   }
  ],
  "offset": 492
 },
 "headers": {
  "ANME": 12,
  "ARTS": "Takahashi Yoko",
  "DIFM": 0,
  "DIFW": 0,
  "ENDH": -1,
  "FLID": "\u0000\u0000\u0000\u0000\u0000\u0000\u0000\u0000\u0000\u0000\u0000\u0000\u0000\u0000\u0000\u0000",
  "GNRE": -1,
  "IDUS": "                ",
  "MUSL": 91,
  "PROV": 0,
  "RGHT": 0,
  "SFTV": 17432915,
  "SORC": "1,I,Neon Genesis Evangelion - Creditless Opening (Clean).mkv.MP3",
  "TITL": "Zankoku na Tenshi no Teeze",
  "TYPE": 0,
  "YEAR": "1996"
 }
}
