{
 "directory": {
  "files": [
   {
    "flags": 0,
    "length1": 3777413,
    "length2": 3777413,
    "name": "Idea (TV size).mp3",
    "offset": 0,
    "type": 2
   },
   {
    "flags": 0,
    "length1": 42557440,
    "length2": 42557440,
    "name": "Noein_-_Mou_Hitori_no_Kimi_e_-_C01_-_Textless_Opening_-_[Kyo](0161c70b)(RAW).mkv.MPG",
    "offset": 3777413,
    "type": 5
   },
   {
    "flags": 0,
    "length1": 3238,
    "length2": 3238,
    "name": "Song.ini",
    "offset": 46334853,
    "type": 1
   }
  ],
  "offset": 361
 },
 "headers": {
  "ANME": 12,
  "DIFM": 0,
  "DIFW": 0,
  "ENDH": -1,
  "FLID": "\u0000\u0000\u0000\u0000\u0000\u0000\u0000\u0000\u0000\u0000\u0000\u0000\u0000\u0000\u0000\u0000",
  "GNRE": -1,
  "IDUS": "                ",
  "MUSL": 94,
  "PROV": 0,
  "RGHT": 0,
  "SFTV": 17432915,
  "SORC": "1,I,Idea (TV size).mp3",
  "TYPE": 0
 }
}
