{
 "directory": {
  "files": [
   {
    "flags": 0,
    "length1": 7081305,
    "length2": 7081305,
    "name": "Gurren Lagann - Sora Iro Days.wmv.AVI.MP3",
    "offset": 0,
    "type": 2
   },
   {
    "flags": 0,
    "length1": 142777282,
    "length2": 142777282,
    "name": "Gurren Lagann - Sora Iro Days_001.avi",
    "offset": 7081305,
    "type": 5
   },
   {
    "flags": 0,
    "length1": 6185,
    "length2": 6185,
    "name": "Song.ini",
    "offset": 149858587,
    "type": 1
   }
  ],
  "offset": 418
 },
 "headers": {
  "ANME": 12,
  "ARTS": "Nakagawa Shoko",
  "DIFM": 0,
  "DIFW": 0,
  "ENDH": -1,
  "FLID": "\u0000\u0000\u0000\u0000\u0000\u0000\u0000\u0000\u0000\u0000\u0000\u0000\u0000\u0000\u0000\u0000",
  "GNRE": -1,
  "IDUS": "                ",
  "MUSL": 295,
  "PROV": 0,
  "RGHT": 0,
  "SFTV": 17432915,
  "SORC": "1,I,Gurren Lagann - Sora Iro Days.wmv.AVI.MP3",
  "TITL": "Sora Iro Days",
  "TYPE": 0,
  "YEAR": "2007"
 }
}
