{
 "directory": {
  "files": [
   {
    "flags": 0,
    "length1": 1373687,
    "length2": 1373687,
    "name": "cirno gero.mp3",
    "offset": 0,
    "type": 2
   },
   {
    "flags": 0,
    "length1": 5846,
    "length2": 5846,
    "name": "Song.ini",
    "offset": 1373687,
    "type": 1
   }
  ],
  "offset": 328
 },
 "headers": {
  "ANME": 12,
  "ARTS": "Gero",
  "DIFM": 0,
  "DIFW": 0,
  "ENDH": -1,
  "FLID": "\u0000\u0000\u0000\u0000\u0000\u0000\u0000\u0000\u0000\u0000\u0000\u0000\u0000\u0000\u0000\u0000",
  "GNRE": -1,
  "IDUS": "                ",
  "KFNZ": "Dysp",
  "LANG": "JA",
  "MUSL": 114,
  "PROV": 0,
  "RGHT": 0,
  "SFTV": 17432915,
  "SORC": "1,I,cirno gero.mp3",
  "TITL": "Cirno's perfect math class Metal ver.",
  "TYPE": 0
 }
}
