{
 "directory": {
  "files": [
   {
    "flags": 0,
    "length1": 62210550,
    "length2": 62210550,
    "name": "Kagamine Rin - Soleil.avi",
    "offset": 0,
    "type": 5
   },
   {
    "flags": 0,
    "length1": 6657060,
    "length2": 6657060,
    "name": "Kagamine Rin - Soleil .mp3",
    "offset": 62210550,
    "type": 2
   },
   {
    "flags": 0,
    "length1": 4138,
    "length2": 4138,
    "name": "Song.ini",
    "offset": 68867610,
    "type": 1
   }
  ],
  "offset": 379
 },
 "headers": {
  "ANME": 12,
  "ARTS": "Kagamine Rin",
  "DIFM": 0,
  "DIFW": 0,
  "ENDH": -1,
  "FLID": "\u0000\u0000\u0000\u0000\u0000\u0000\u0000\u0000\u0000\u0000\u0000\u0000\u0000\u0000\u0000\u0000",
  "GNRE": -1,
  "IDUS": "                ",
  "KFNZ": "Dysp",
  "LANG": "JA",
  "MUSL": 230,
  "PROV": 0,
  "RGHT": 0,
  "SFTV": 17432915,
  "SORC": "1,I,Kagamine Rin - Soleil .mp3",
  "TITL": "Soreiyu",
  "TYPE": 0
 }
}
