{
 "directory": {
  "files": [
   {
    "flags": 0,
    "length1": 2887712,
    "length2": 2887712,
    "name": "Lupin Prima Serie_OST_Nice Guy Lupin (128kbit_AAC).mp3",
    "offset": 0,
    "type": 2
   },
   {
    "flags": 0,
    "length1": 142168,
    "length2": 142168,
    "name": "lupin.jpg",
    "offset": 2887712,
    "type": 3
   },
   {
    "flags": 0,
    "length1": 1971,
    "length2": 1971,
    "name": "Song.ini",
    "offset": 3029880,
    "type": 1
   }
  ],
  "offset": 477
 },
 "headers": {
  "ALBM": "Takeo Yamashita",
  "ANME": 12,
  "ARTS": "Lupin III",
  "DIFM": 0,
  "DIFW": 0,
  "ENDH": -1,
  "FLID": "\u0000\u0000\u0000\u0000\u0000\u0000\u0000\u0000\u0000\u0000\u0000\u0000\u0000\u0000\u0000\u0000",
  "GNRE": -1,
  "IDUS": "                ",
  "KFNZ": "mrkyubu",
  "MUSL": 72,
  "PROV": 0,
  "RGHT": 0,
  "SFTV": 17432915,
  "SORC": "1,I,Lupin Prima Serie_OST_Nice Guy Lupin (128kbit_AAC).mp3",
  "TITL": "Nice Guy Lupin T.V. Original",
  "TRAK": "In",
  "TYPE": 0,
  "YEAR": "1999"
 }
}
