{
 "directory": {
  "files": [
   {
    "flags": 0,
    "length1": 13431612,
    "length2": 13431612,
    "name": "Fast_Love_Monogatari_SS_OP_.avi",
    "offset": 0,
    "type": 5
   },
   {
    "flags": 0,
    "length1": 1441903,
    "length2": 1441903,
    "name": "norm_Koimonogatari OP - Kogarashi Sentiment (Subbed).mp3",
    "offset": 13431612,
    "type": 2
   },
   {
    "flags": 0,
    "length1": 4063,
    "length2": 4063,
    "name": "Song.ini",
    "offset": 14873515,
    "type": 1
   }
  ],
  "offset": 488
 },
 "headers": {
  "ANME": 12,
  "ARTS": "Senjougahara & Kaiki",
  "COMM": "Monogatari S2 Hitagi End OP",
  "DIFM": 0,
  "DIFW": 0,
  "ENDH": -1,
  "FLID": "\u0000\u0000\u0000\u0000\u0000\u0000\u0000\u0000\u0000\u0000\u0000\u0000\u0000\u0000\u0000\u0000",
  "GNRE": -1,
  "IDUS": "                ",
  "KFNZ": "JE",
  "MUSL": 90,
  "PROV": 0,
  "RGHT": 0,
  "SFTV": 17432915,
  "SORC": "1,I,norm_Koimonogatari OP - Kogarashi Sentiment (Subbed).mp3",
  "TITL": "Kogarashi Sentiment",
  "TYPE": 0
 }
}
