{
 "directory": {
  "files": [
   {
    "flags": 0,
    "length1": 4405678,
    "length2": 4405678,
    "name": "One_Piece_Opening_3_N.MP3_norm.MP3",
    "offset": 0,
    "type": 2
   },
   {
    "flags": 0,
    "length1": 69758120,
    "length2": 69758120,
    "name": "One Piece Opening 3.avi",
    "offset": 4405678,
    "type": 5
   },
   {
    "flags": 0,
    "length1": 7045,
    "length2": 7045,
    "name": "Song.ini",
    "offset": 74163798,
    "type": 1
   }
  ],
  "offset": 403
 },
 "headers": {
  "ALBM": "One Piece",
  "ANME": 12,
  "ARTS": "The Babystars",
  "DIFM": 0,
  "DIFW": 0,
  "ENDH": -1,
  "FLID": "\u0000\u0000\u0000\u0000\u0000\u0000\u0000\u0000\u0000\u0000\u0000\u0000\u0000\u0000\u0000\u0000",
  "GNRE": -1,
  "IDUS": "                ",
  "KFNZ": "Hoël",
  "MUSL": 110,
  "PROV": 0,
  "RGHT": 0,
  "SFTV": 17432915,
  "SORC": "1,I,One_Piece_Opening_3_N.MP3_norm.MP3",
  "TITL": "Hikari e",
  "TYPE": 0
 }
}
