{
 "directory": {
  "files": [
   {
    "flags": 0,
    "length1": 1446102,
    "length2": 1446102,
    "name": "Juuni Taisen OP_1.mp3",
    "offset": 0,
    "type": 2
   },
   {
    "flags": 0,
    "length1": 44589070,
    "length2": 44589070,
    "name": "Juuni Taisen OP.avi",
    "offset": 1446102,
    "type": 5
   },
   {
    "flags": 0,
    "length1": 2886,
    "length2": 2886,
    "name": "Song.ini",
    "offset": 46035172,
    "type": 1
   }
  ],
  "offset": 384
 },
 "headers": {
  "ANME": 12,
  "ARTS": "Panorama Panama Town",
  "DIFM": 0,
  "DIFW": 0,
  "ENDH": -1,
  "FLID": "\u0000\u0000\u0000\u0000\u0000\u0000\u0000\u0000\u0000\u0000\u0000\u0000\u0000\u0000\u0000\u0000",
  "GNRE": -1,
  "IDUS": "                ",
  "KFNZ": "Dysp",
  "LANG": "JA",
  "MUSL": 90,
  "PROV": 0,
  "RGHT": 0,
  "SFTV": 17432915,
  "SORC": "1,I,Juuni Taisen OP_1.mp3",
  "TITL": "Rapture",
  "TYPE": 0,
  "YEAR": "2017"
 }
}
