{
 "directory": {
  "files": [
   {
    "flags": 0,
    "length1": 3801610,
    "length2": 3801610,
    "name": "01. Brightdown -TV Mix-.mp3",
    "offset": 0,
    "type": 2
   },
   {
    "flags": 0,
    "length1": 39354368,
    "length2": 39354368,
    "name": "D.Gray-man - Creditless Opening 02.mpg",
    "offset": 3801610,
    "type": 5
   },
   {
    "flags": 0,
    "length1": 2842,
    "length2": 2842,
    "name": "Song.ini",
    "offset": 43155978,
    "type": 1
   }
  ],
  "offset": 428
 },
 "headers": {
  "ALBM": "D.Gray-Man OST 2",
  "ANME": 12,
  "ARTS": "Nami Tamaki",
  "DIFM": 0,
  "DIFW": 0,
  "ENDH": -1,
  "FLID": "\u0000\u0000\u0000\u0000\u0000\u0000\u0000\u0000\u0000\u0000\u0000\u0000\u0000\u0000\u0000\u0000",
  "GNRE": -1,
  "IDUS": "                ",
  "MUSL": 95,
  "PROV": 0,
  "RGHT": 0,
  "SFTV": 17432915,
  "SORC": "1,I,01. Brightdown -TV Mix-.mp3",
  "TITL": "Brightdown TV size",
  "TRAK": "1",
  "TYPE": 0,
  "YEAR": "2007"
 }
}
