{
 "directory": {
  "files": [
   {
    "flags": 0,
    "length1": 2926592,
    "length2": 2926592,
    "name": "30 Alumina (Tv size).mp3",
    "offset": 0,
    "type": 2
   },
   {
    "flags": 0,
    "length1": 35308244,
    "length2": 35308244,
    "name": "Death Note (Ending 1).avi",
    "offset": 2926592,
    "type": 5
   },
   {
    "flags": 0,
    "length1": 2529,
    "length2": 2529,
    "name": "Song.ini",
    "offset": 38234836,
    "type": 1
   }
  ],
  "offset": 451
 },
 "headers": {
  "ALBM": "Death note anime Soundtrack",
  "ANME": 12,
  "ARTS": "Nightmare",
  "COMM": "#nipponsei@irc.rizon.net",
  "DIFM": 0,
  "DIFW": 0,
  "ENDH": -1,
  "FLID": "\u0000\u0000\u0000\u0000\u0000\u0000\u0000\u0000\u0000\u0000\u0000\u0000\u0000\u0000\u0000\u0000",
  "GNRE": -1,
  "IDUS": "                ",
  "MUSL": 73,
  "PROV": 0,
  "RGHT": 0,
  "SFTV": 17432915,
  "SORC": "1,I,30 Alumina (Tv size).mp3",
  "TITL": "Alumina (Tv size)",
  "TRAK": "30",
  "TYPE": 0,
  "YEAR": "2006"
 }
}
