{
 "directory": {
  "files": [
   {
    "flags": 0,
    "length1": 3942523,
    "length2": 3942523,
    "name": "No Title.mp3",
    "offset": 0,
    "type": 2
   },
   {
    "flags": 0,
    "length1": 30999388,
    "length2": 30999388,
    "name": "REOL No title.avi",
    "offset": 3942523,
    "type": 5
   },
   {
    "flags": 0,
    "length1": 9834,
    "length2": 9834,
    "name": "Song.ini",
    "offset": 34941911,
    "type": 1
   }
  ],
  "offset": 352
 },
 "headers": {
  "ANME": 12,
  "ARTS": "Reol",
  "DIFM": 0,
  "DIFW": 0,
  "ENDH": -1,
  "FLID": "\u0000\u0000\u0000\u0000\u0000\u0000\u0000\u0000\u0000\u0000\u0000\u0000\u0000\u0000\u0000\u0000",
  "GNRE": -1,
  "IDUS": "                ",
  "KFNZ": "Kévin ~Blame Me !!~",
  "LANG": "JA",
  "MUSL": 246,
  "PROV": 0,
  "RGHT": 0,
  "SFTV": 17432915,
  "SORC": "1,I,No Title.mp3",
  "TITL": "No Title",
  "TYPE": 0
 }
}
