{
 "directory": {
  "files": [
   {
    "flags": 0,
    "length1": 166691,
    "length2": 166691,
    "name": "cover_kfn_cover.jpg",
    "offset": 0,
    "type": 3
   },
   {
    "flags": 0,
    "length1": 3448001,
    "length2": 3448001,
    "name": "n_02. Seiten Galaxy Cross (tv size).mp3",
    "offset": 166691,
    "type": 2
   },
   {
    "flags": 0,
    "length1": 7101,
    "length2": 7101,
    "name": "Song.ini",
    "offset": 3614692,
    "type": 1
   }
  ],
  "offset": 504
 },
 "headers": {
  "ALBM": "Senki Zesshou Symphogear GX",
  "ANME": 12,
  "ARTS": "Nana Mizuki, Youko Hikasa",
  "COPY": "SATELIGHT",
  "DIFM": 0,
  "DIFW": 0,
  "ENDH": -1,
  "FLID": "\u0000\u0000\u0000\u0000\u0000\u0000\u0000\u0000\u0000\u0000\u0000\u0000\u0000\u0000\u0000\u0000",
  "GNRE": -1,
  "IDUS": "                ",
  "KFNZ": "mrkyubu",
  "LANG": "JA",
  "MUSL": 133,
  "PROV": 0,
  "RGHT": 0,
  "SFTV": 17432915,
  "SORC": "1,I,n_02. Seiten Galaxy Cross (tv size).mp3",
  "TITL": "Seiten Galaxy Cross (TV size)",
  "TYPE": 0,
  "YEAR": "2015"
 }
}
