{
 "directory": {
  "files": [
   {
    "flags": 0,
    "length1": 3804686,
    "length2": 3804686,
    "name": "[ChiWorks] Steins;Gate NCOP [1080p@60fps-FI][10bit-x264][FLAC][3c795873]_Track01.mp3",
    "offset": 0,
    "type": 2
   },
   {
    "flags": 0,
    "length1": 93234972,
    "length2": 93234972,
    "name": "[ChiWorks] Steins;Gate NCOP [1080p@60fps-FI][10bit-x264][FLAC][3c795873].avi",
    "offset": 3804686,
    "type": 5
   },
   {
    "flags": 0,
    "length1": 3474,
    "length2": 3474,
    "name": "Song.ini",
    "offset": 97039658,
    "type": 1
   }
  ],
  "offset": 533
 },
 "headers": {
  "ANME": 12,
  "ARTS": "Steins;Gate",
  "DIFM": 0,
  "DIFW": 0,
  "ENDH": -1,
  "FLID": "\u0000\u0000\u0000\u0000\u0000\u0000\u0000\u0000\u0000\u0000\u0000\u0000\u0000\u0000\u0000\u0000",
  "GNRE": -1,
  "IDUS": "                ",
  "MUSL": 95,
  "PROV": 0,
  "RGHT": 0,
  "SFTV": 17432915,
  "SORC": "1,I,[ChiWorks] Steins;Gate NCOP [1080p@60fps-FI][10bit-x264][FLAC][3c795873]_Track01.mp3",
  "TITL": "Hacking to the Gate",
  "TYPE": 0
 }
}
