{
 "directory": {
  "files": [
   {
    "flags": 0,
    "length1": 3603118,
    "length2": 3603118,
    "name": "[Cman] Spice and Wolf OP [Blu-Ray 720p][B8702357].mkv.MP3",
    "offset": 0,
    "type": 2
   },
   {
    "flags": 0,
    "length1": 47671498,
    "length2": 47671498,
    "name": "[Cman] Spice and Wolf OP [Blu-Ray 720p][B8702357].avi",
    "offset": 3603118,
    "type": 5
   },
   {
    "flags": 0,
    "length1": 3029,
    "length2": 3029,
    "name": "Song.ini",
    "offset": 51274616,
    "type": 1
   }
  ],
  "offset": 461
 },
 "headers": {
  "ANME": 12,
  "ARTS": "Ookami to Koushinryou",
  "DIFM": 0,
  "DIFW": 0,
  "ENDH": -1,
  "FLID": "\u0000\u0000\u0000\u0000\u0000\u0000\u0000\u0000\u0000\u0000\u0000\u0000\u0000\u0000\u0000\u0000",
  "GNRE": -1,
  "IDUS": "                ",
  "MUSL": 90,
  "PROV": 0,
  "RGHT": 0,
  "SFTV": 17432915,
  "SORC": "1,I,[Cman] Spice and Wolf OP [Blu-Ray 720p][B8702357].mkv.MP3",
  "TITL": "Tabi no Tochuu",
  "TYPE": 0
 }
}
