{
 "directory": {
  "files": [
   {
    "flags": 0,
    "length1": 5086344,
    "length2": 5086344,
    "name": "LupinIIIPartII-ED2_001.avi",
    "offset": 0,
    "type": 5
   },
   {
    "flags": 0,
    "length1": 1121923,
    "length2": 1121923,
    "name": "LupinIIIPartII-ED2NORM.mp3",
    "offset": 5086344,
    "type": 2
   },
   {
    "flags": 0,
    "length1": 1986,
    "length2": 1986,
    "name": "Song.ini",
    "offset": 6208267,
    "type": 1
   }
  ],
  "offset": 482
 },
 "headers": {
  "ALBM": "Lupin III",
  "ANME": 12,
  "ARTS": "Mizuki Ichirou",
  "COMM": "https://animethemes.moe/video/LupinIIIPartII-ED2.webm",
  "DIFM": 0,
  "DIFW": 0,
  "ENDH": -1,
  "FLID": "\u0000\u0000\u0000\u0000\u0000\u0000\u0000\u0000\u0000\u0000\u0000\u0000\u0000\u0000\u0000\u0000",
  "GNRE": -1,
  "IDUS": "                ",
  "KFNZ": "MrKyubu",
  "MUSL": 71,
  "PROV": 0,
  "RGHT": 0,
  "SFTV": 17432915,
  "SORC": "1,I,LupinIIIPartII-ED2NORM.mp3",
  "TITL": "Love Theme",
  "TRAK": "ED2",
  "TYPE": 0,
  "YEAR": "1978"
 }
}
