{
 "directory": {
  "files": [
   {
    "flags": 0,
    "length1": 2208328,
    "length2": 2208328,
    "name": "OP.mp3",
    "offset": 0,
    "type": 2
   },
   {
    "flags": 0,
    "length1": 41253264,
    "length2": 41253264,
    "name": "AnoHanaOP2.avi",
    "offset": 2208328,
    "type": 5
   },
   {
    "flags": 0,
    "length1": 3758,
    "length2": 3758,
    "name": "Song.ini",
    "offset": 43461592,
    "type": 1
   }
  ],
  "offset": 359
 },
 "headers": {
  "ANME": 12,
  "ARTS": "Galileo Galilei",
  "DIFM": 0,
  "DIFW": 0,
  "ENDH": -1,
  "FLID": "\u0000\u0000\u0000\u0000\u0000\u0000\u0000\u0000\u0000\u0000\u0000\u0000\u0000\u0000\u0000\u0000",
  "GNRE": -1,
  "IDUS": "                ",
  "KFNZ": "Quasi sur Jimmy",
  "LANG": "JA",
  "MUSL": 92,
  "PROV": 0,
  "RGHT": 0,
  "SFTV": 17432915,
  "SORC": "1,I,OP.mp3",
  "TITL": "Circle Game",
  "TYPE": 0,
  "YEAR": "2011"
 }
}
