{
 "directory": {
  "files": [
   {
    "flags": 0,
    "length1": 204901,
    "length2": 204901,
    "name": "54923-1445931259_kfn_cover.jpg",
    "offset": 0,
    "type": 3
   },
   {
    "flags": 0,
    "length1": 4962576,
    "length2": 4962576,
    "name": "24. Zenigata MarchNORM.mp3",
    "offset": 204901,
    "type": 2
   },
   {
    "flags": 0,
    "length1": 4596,
    "length2": 4596,
    "name": "Song.ini",
    "offset": 5167477,
    "type": 1
   }
  ],
  "offset": 468
 },
 "headers": {
  "ALBM": "Lupin vs Fukusei-ningen",
  "ANME": 12,
  "ARTS": "Haruo Minami",
  "COMP": "Yuji Ohno",
  "DIFM": 0,
  "DIFW": 0,
  "ENDH": -1,
  "FLID": "\u0000\u0000\u0000\u0000\u0000\u0000\u0000\u0000\u0000\u0000\u0000\u0000\u0000\u0000\u0000\u0000",
  "GNRE": -1,
  "IDUS": "                ",
  "KFNZ": "MrKyubu",
  "LANG": "JA",
  "MUSL": 210,
  "PROV": 0,
  "RGHT": 0,
  "SFTV": 17432915,
  "SORC": "1,I,24. Zenigata MarchNORM.mp3",
  "TITL": "Lupin Ondo",
  "TRAK": "Insert",
  "TYPE": 0,
  "YEAR": "1978"
 }
}
