{
 "directory": {
  "files": [
   {
    "flags": 0,
    "length1": 5246815,
    "length2": 5246815,
    "name": "03. Itsuka no Niji Hana no Omoide.mp3",
    "offset": 0,
    "type": 2
   },
   {
    "flags": 0,
    "length1": 5174255,
    "length2": 5174255,
    "name": "06. Itsuka no Niji Hana no Omoide (off vocal).mp3",
    "offset": 5246815,
    "type": 2
   },
   {
    "flags": 0,
    "length1": 129960,
    "length2": 129960,
    "name": "cover_kfn_cover.jpg",
    "offset": 10421070,
    "type": 3
   },
   {
    "flags": 0,
    "length1": 10870,
    "length2": 10870,
    "name": "Song.ini",
    "offset": 10551030,
    "type": 1
   }
  ],
  "offset": 593
 },
 "headers": {
  "ALBM": "Senki Zesshou Symphogear GX",
  "ANME": 12,
  "ARTS": "Aoi Yuuki, Yuka Iguchi",
  "COMM": "on/off vocals",
  "COPY": "SATELIGHT",
  "DIFM": 0,
  "DIFW": 0,
  "ENDH": -1,
  "FLID": "\u0000\u0000\u0000\u0000\u0000\u0000\u0000\u0000\u0000\u0000\u0000\u0000\u0000\u0000\u0000\u0000",
  "GNRE": -1,
  "IDUS": "                ",
  "KFNZ": "mrkyubu",
  "LANG": "JA",
  "MUSL": 206,
  "PROV": 0,
  "RGHT": 0,
  "SFTV": 17432915,
  "SORC": "1,I,03. Itsuka no Niji Hana no Omoide.mp3",
  "TITL": "Itsuka no Niji, Hana no Omoide",
  "TYPE": 0,
  "YEAR": "2015"
 }
}
