{
 "directory": {
  "files": [
   {
    "flags": 0,
    "length1": 5040334,
    "length2": 5040334,
    "name": "01 - Brave Heart.mp3",
    "offset": 0,
    "type": 2
   },
   {
    "flags": 0,
    "length1": 232191,
    "length2": 232191,
    "name": "digimon.jpg",
    "offset": 5040334,
    "type": 3
   },
   {
    "flags": 0,
    "length1": 4290,
    "length2": 4290,
    "name": "Song.ini",
    "offset": 5272525,
    "type": 1
   }
  ],
  "offset": 344
 },
 "headers": {
  "ANME": 12,
  "ARTS": "Wada Kouji",
  "DIFM": 0,
  "DIFW": 0,
  "ENDH": -1,
  "FLID": "\u0000\u0000\u0000\u0000\u0000\u0000\u0000\u0000\u0000\u0000\u0000\u0000\u0000\u0000\u0000\u0000",
  "GNRE": -1,
  "IDUS": "                ",
  "KFNZ": "Alex",
  "MUSL": 252,
  "PROV": 0,
  "RGHT": 0,
  "SFTV": 17432915,
  "SORC": "1,I,01 - Brave Heart.mp3",
  "TITL": "Brave Heart",
  "TYPE": 0
 }
}
