{
 "directory": {
  "files": [
   {
    "flags": 0,
    "length1": 3371552,
    "length2": 3371552,
    "name": "short.mp3",
    "offset": 0,
    "type": 2
   },
   {
    "flags": 0,
    "length1": 42276756,
    "length2": 42276756,
    "name": "1.avi",
    "offset": 3371552,
    "type": 5
   },
   {
    "flags": 0,
    "length1": 3605,
    "length2": 3605,
    "name": "Song.ini",
    "offset": 45648308,
    "type": 1
   }
  ],
  "offset": 338
 },
 "headers": {
  "ANME": 12,
  "ARTS": "Coda",
  "DIFM": 0,
  "DIFW": 0,
  "ENDH": -1,
  "FLID": "\u0000\u0000\u0000\u0000\u0000\u0000\u0000\u0000\u0000\u0000\u0000\u0000\u0000\u0000\u0000\u0000",
  "GNRE": -1,
  "IDUS": "                ",
  "KFNZ": "Thibaut (mrkyubu)",
  "MUSL": 84,
  "PROV": 0,
  "RGHT": 0,
  "SFTV": 17432915,
  "SORC": "1,I,short.mp3",
  "TITL": "Fighting Gold",
  "TYPE": 0,
  "YEAR": "2018"
 }
}
