{
 "directory": {
  "files": [
   {
    "flags": 0,
    "length1": 7663867,
    "length2": 7663867,
    "name": "sennotsubasa-metal-cut.mp3",
    "offset": 0,
    "type": 2
   },
   {
    "flags": 0,
    "length1": 6214,
    "length2": 6214,
    "name": "Song.ini",
    "offset": 7663867,
    "type": 1
   }
  ],
  "offset": 369
 },
 "headers": {
  "ANME": 12,
  "ARTS": "FalKKonE, Rena",
  "COMP": "livetune",
  "DIFM": 0,
  "DIFW": 0,
  "ENDH": -1,
  "FLID": "\u0000\u0000\u0000\u0000\u0000\u0000\u0000\u0000\u0000\u0000\u0000\u0000\u0000\u0000\u0000\u0000",
  "GNRE": 9,
  "IDUS": "                ",
  "KFNZ": "Dysp",
  "LANG": "JA",
  "MUSL": 223,
  "PROV": 0,
  "RGHT": 0,
  "SFTV": 17432915,
  "SORC": "1,I,sennotsubasa-metal-cut.mp3",
  "TITL": "Sen no Tsubasa",
  "TYPE": 0,
  "YEAR": "2019"
 }
}
