{
 "directory": {
  "files": [
   {
    "flags": 0,
    "length1": 3601198,
    "length2": 3601198,
    "name": "Tokyo Ghoul - OP - Unravel_norm.mp3",
    "offset": 0,
    "type": 2
   },
   {
    "flags": 0,
    "length1": 424464,
    "length2": 424464,
    "name": "DAEMONES.TTF",
    "offset": 3601198,
    "type": 4
   },
   {
    "flags": 0,
    "length1": 20233686,
    "length2": 20233686,
    "name": "Tokyo_Ghoul_-_OP_-_Unravel_norm.avi",
    "offset": 4025662,
    "type": 5
   },
   {
    "flags": 0,
    "length1": 4753,
    "length2": 4753,
    "name": "Song.ini",
    "offset": 24259348,
    "type": 1
   }
  ],
  "offset": 443
 },
 "headers": {
  "ALBM": "Tokyo Ghoul",
  "ANME": 12,
  "ARTS": "TK",
  "DIFM": 0,
  "DIFW": 0,
  "ENDH": -1,
  "FLID": "\u0000\u0000\u0000\u0000\u0000\u0000\u0000\u0000\u0000\u0000\u0000\u0000\u0000\u0000\u0000\u0000",
  "GNRE": -1,
  "IDUS": "                ",
  "KFNZ": "Hoël",
  "MUSL": 90,
  "PROV": 0,
  "RGHT": 0,
  "SFTV": 17432915,
  "SORC": "1,I,Tokyo Ghoul - OP - Unravel_norm.mp3",
  "TITL": "Unravel",
  "TYPE": 0
 }
}
