{
 "directory": {
  "files": [
   {
    "flags": 0,
    "length1": 144605912,
    "length2": 144605912,
    "name": "Odoryanse.avi",
    "offset": 0,
    "type": 5
   },
   {
    "flags": 0,
    "length1": 8025954,
    "length2": 8025954,
    "name": "Odoryanse.mp3",
    "offset": 144605912,
    "type": 2
   },
   {
    "flags": 0,
    "length1": 8433,
    "length2": 8433,
    "name": "Song.ini",
    "offset": 152631866,
    "type": 1
   }
  ],
  "offset": 374
 },
 "headers": {
  "ANME": 12,
  "ARTS": "Miku x GUMI",
  "COMP": "YurryCanon",
  "DIFM": 0,
  "DIFW": 0,
  "ENDH": -1,
  "FLID": "\u0000\u0000\u0000\u0000\u0000\u0000\u0000\u0000\u0000\u0000\u0000\u0000\u0000\u0000\u0000\u0000",
  "GNRE": -1,
  "IDUS": "                ",
  "KFNZ": "Dysp",
  "LANG": "JA",
  "MUSL": 201,
  "PROV": 0,
  "RGHT": 0,
  "SFTV": 17432915,
  "SORC": "1,I,Odoryanse.mp3",
  "TITL": "Odoryanse",
  "TYPE": 0,
  "YEAR": "2016"
 }
}
