{
 "directory": {
  "files": [
   {
    "flags": 0,
    "length1": 3686445,
    "length2": 3686445,
    "name": "BokuNoHeroAcademiaS3-ED2-NCBD1080.mp3",
    "offset": 0,
    "type": 2
   },
   {
    "flags": 0,
    "length1": 67227738,
    "length2": 67227738,
    "name": "BokuNoHeroAcademiaS3-ED2-NCBD1080.avi",
    "offset": 3686445,
    "type": 5
   },
   {
    "flags": 0,
    "length1": 2955,
    "length2": 2955,
    "name": "Song.ini",
    "offset": 70914183,
    "type": 1
   }
  ],
  "offset": 498
 },
 "headers": {
  "ALBM": "HeroAca S3",
  "ANME": 12,
  "ARTS": "Suda Masaki",
  "COMM": "20200222 Replaced medias",
  "DIFM": 0,
  "DIFW": 0,
  "ENDH": -1,
  "FLID": "\u0000\u0000\u0000\u0000\u0000\u0000\u0000\u0000\u0000\u0000\u0000\u0000\u0000\u0000\u0000\u0000",
  "GNRE": -1,
  "IDUS": "                ",
  "KFNZ": "Dysp",
  "LANG": "JA",
  "MUSL": 92,
  "PROV": 0,
  "RGHT": 0,
  "SFTV": 17432915,
  "SORC": "1,I,BokuNoHeroAcademiaS3-ED2-NCBD1080.mp3",
  "TITL": "Long Hope Philia",
  "TRAK": "ED2",
  "TYPE": 0,
  "YEAR": "2018"
 }
}
