{
 "directory": {
  "files": [
   {
    "flags": 0,
    "length1": 3601314,
    "length2": 3601314,
    "name": "DecaDence-OP1.mp3",
    "offset": 0,
    "type": 2
   },
   {
    "flags": 0,
    "length1": 65568380,
    "length2": 65568380,
    "name": "DecaDence-OP1.avi",
    "offset": 3601314,
    "type": 5
   },
   {
    "flags": 0,
    "length1": 4286,
    "length2": 4286,
    "name": "Song.ini",
    "offset": 69169694,
    "type": 1
   }
  ],
  "offset": 590
 },
 "headers": {
  "ALBM": "Deca-Dence",
  "ANME": 12,
  "ARTS": "Konomi Suzuki",
  "COMM": "https://animethemes.moe/video/DecaDence-OP1.webm\rhttps://www.lyrical-nonsense.com/lyrics/konomi-suzuki/theater-of-life/\rlyrics ok et les chorus peuvent aller niquer leurs morts",
  "DIFM": 0,
  "DIFW": 0,
  "ENDH": -1,
  "FLID": "\u0000\u0000\u0000\u0000\u0000\u0000\u0000\u0000\u0000\u0000\u0000\u0000\u0000\u0000\u0000\u0000",
  "GNRE": -1,
  "IDUS": "                ",
  "KFNZ": "Dysp",
  "LANG": "JA",
  "MUSL": 90,
  "PROV": 0,
  "RGHT": 0,
  "SFTV": 17432915,
  "SORC": "1,I,DecaDence-OP1.mp3",
  "TITL": "Theater of Life",
  "TRAK": "OP",
  "TYPE": 0,
  "YEAR": "2020"
 }
}
