{
 "directory": {
  "files": [
   {
    "flags": 0,
    "length1": 111734,
    "length2": 111734,
    "name": "goemon_kfn_cover.jpg",
    "offset": 0,
    "type": 3
   },
   {
    "flags": 0,
    "length1": 4001528,
    "length2": 4001528,
    "name": "SatoriNORM.mp3",
    "offset": 111734,
    "type": 2
   },
   {
    "flags": 0,
    "length1": 3773,
    "length2": 3773,
    "name": "Song.ini",
    "offset": 4113262,
    "type": 1
   }
  ],
  "offset": 479
 },
 "headers": {
  "ALBM": "Lupin the IIIrd Chikemuri no Ishikawa Goemon",
  "ANME": 12,
  "ARTS": "Rob Laufer",
  "COMM": "https://www.youtube.com/watch?v=mwp-KpeT9lM",
  "DIFM": 0,
  "DIFW": 0,
  "ENDH": -1,
  "FLID": "\u0000\u0000\u0000\u0000\u0000\u0000\u0000\u0000\u0000\u0000\u0000\u0000\u0000\u0000\u0000\u0000",
  "GNRE": -1,
  "IDUS": "                ",
  "KFNZ": "mrkyubu",
  "LANG": "EN",
  "MUSL": 179,
  "PROV": 0,
  "RGHT": 0,
  "SFTV": 17432915,
  "SORC": "1,I,SatoriNORM.mp3",
  "TITL": "Satori",
  "TRAK": "ED",
  "TYPE": 0,
  "YEAR": "2017"
 }
}
