{
 "directory": {
  "files": [
   {
    "flags": 0,
    "length1": 1446197,
    "length2": 1446197,
    "name": "Megalo Box ED.mp3",
    "offset": 0,
    "type": 2
   },
   {
    "flags": 0,
    "length1": 20328000,
    "length2": 20328000,
    "name": "Megalo Box ED_1.avi",
    "offset": 1446197,
    "type": 5
   },
   {
    "flags": 0,
    "length1": 4122,
    "length2": 4122,
    "name": "Song.ini",
    "offset": 21774197,
    "type": 1
   }
  ],
  "offset": 391
 },
 "headers": {
  "ALBM": "Megalo Box",
  "ANME": 12,
  "ARTS": "NakamuraEmi",
  "DIFM": 0,
  "DIFW": 0,
  "ENDH": -1,
  "FLID": "\u0000\u0000\u0000\u0000\u0000\u0000\u0000\u0000\u0000\u0000\u0000\u0000\u0000\u0000\u0000\u0000",
  "GNRE": -1,
  "IDUS": "                ",
  "KFNZ": "Dysp",
  "LANG": "JA",
  "MUSL": 90,
  "PROV": 0,
  "RGHT": 0,
  "SFTV": 17432915,
  "SORC": "1,I,Megalo Box ED.mp3",
  "TITL": "Kakatte Koi yo",
  "TRAK": "ED",
  "TYPE": 0
 }
}
