{
 "directory": {
  "files": [
   {
    "flags": 0,
    "length1": 3605051,
    "length2": 3605051,
    "name": "Takagi3S2-ED3-NCBD1080.mp3",
    "offset": 0,
    "type": 2
   },
   {
    "flags": 0,
    "length1": 48761502,
    "length2": 48761502,
    "name": "Takagi3S2-ED3-NCBD1080.avi",
    "offset": 3605051,
    "type": 5
   },
   {
    "flags": 0,
    "length1": 3858,
    "length2": 3858,
    "name": "Song.ini",
    "offset": 52366553,
    "type": 1
   }
  ],
  "offset": 455
 },
 "headers": {
  "ALBM": "Karakai Jouzu no Takagi-san S2",
  "ANME": 12,
  "ARTS": "Takahashi Rie",
  "COMM": "AnimeThemes.moe",
  "DIFM": 0,
  "DIFW": 0,
  "ENDH": -1,
  "FLID": "\u0000\u0000\u0000\u0000\u0000\u0000\u0000\u0000\u0000\u0000\u0000\u0000\u0000\u0000\u0000\u0000",
  "GNRE": -1,
  "IDUS": "                ",
  "KFNZ": "Dysp",
  "LANG": "JA",
  "MUSL": 90,
  "PROV": 0,
  "RGHT": 0,
  "SFTV": 17432915,
  "SORC": "1,I,Takagi3S2-ED3-NCBD1080.mp3",
  "TITL": "Kiseki",
  "TRAK": "ED3",
  "TYPE": 0
 }
}
