{
 "directory": {
  "files": [
   {
    "flags": 0,
    "length1": 4486272,
    "length2": 4486272,
    "name": "Kidou_Senshi_Gundam_SEED_Destiny_Final_Plus-_The_Chosen_Future_-_C1_-_Opening_-_(69fb5f75)(RAW).wmv.MP3",
    "offset": 0,
    "type": 2
   },
   {
    "flags": 0,
    "length1": 45027510,
    "length2": 45027510,
    "name": "Kidou_Senshi_Gundam_SEED_Destiny_Final_Plus-_The_Chosen_Future_-_C1_-_Opening_-_(69fb5f75)(RAW).wmv.avi",
    "offset": 4486272,
    "type": 5
   },
   {
    "flags": 0,
    "length1": 2737,
    "length2": 2737,
    "name": "Song.ini",
    "offset": 49513782,
    "type": 1
   }
  ],
  "offset": 605
 },
 "headers": {
  "ANME": 12,
  "ARTS": "Gundam SEED Destiny FINAL PLUS",
  "DIFM": 0,
  "DIFW": 0,
  "ENDH": -1,
  "FLID": "\u0000\u0000\u0000\u0000\u0000\u0000\u0000\u0000\u0000\u0000\u0000\u0000\u0000\u0000\u0000\u0000",
  "GNRE": -1,
  "IDUS": "                ",
  "MUSL": 112,
  "PROV": 0,
  "RGHT": 0,
  "SFTV": 17432915,
  "SORC": "1,I,Kidou_Senshi_Gundam_SEED_Destiny_Final_Plus-_The_Chosen_Future_-_C1_-_Opening_-_(69fb5f75)(RAW).wmv.MP3",
  "TITL": "VESTIGE",
  "TYPE": 0
 }
}
