{
 "directory": {
  "files": [
   {
    "flags": 0,
    "length1": 8454350,
    "length2": 8454350,
    "name": "Taiyoukei 96nk.mp3",
    "offset": 0,
    "type": 2
   },
   {
    "flags": 0,
    "length1": 58276148,
    "length2": 58276148,
    "name": "Taiyoukei 96nk.avi",
    "offset": 8454350,
    "type": 5
   },
   {
    "flags": 0,
    "length1": 20002,
    "length2": 20002,
    "name": "Song.ini",
    "offset": 66730498,
    "type": 1
   }
  ],
  "offset": 388
 },
 "headers": {
  "ANME": 12,
  "ARTS": "96neko Hashiyan Amatsuki",
  "COMP": "Nayuta Seijin",
  "DIFM": 0,
  "DIFW": 0,
  "ENDH": -1,
  "FLID": "\u0000\u0000\u0000\u0000\u0000\u0000\u0000\u0000\u0000\u0000\u0000\u0000\u0000\u0000\u0000\u0000",
  "GNRE": -1,
  "IDUS": "                ",
  "KFNZ": "Dysp",
  "MUSL": 259,
  "PROV": 0,
  "RGHT": 0,
  "SFTV": 17432915,
  "SORC": "1,I,Taiyoukei 96nk.mp3",
  "TITL": "Taiyoukei Desuco",
  "TYPE": 0
 }
}
