{
 "directory": {
  "files": [
   {
    "flags": 0,
    "length1": 2170494,
    "length2": 2170494,
    "name": "Ghost in the shell 2nd GIG.avi.MP3",
    "offset": 0,
    "type": 2
   },
   {
    "flags": 0,
    "length1": 29026304,
    "length2": 29026304,
    "name": "Ghost in the shell 2nd GIG.avi.MPG",
    "offset": 2170494,
    "type": 5
   },
   {
    "flags": 0,
    "length1": 2493,
    "length2": 2493,
    "name": "Song.ini",
    "offset": 31196798,
    "type": 1
   }
  ],
  "offset": 383
 },
 "headers": {
  "ANME": 12,
  "ARTS": "Origa",
  "DIFM": 0,
  "DIFW": 0,
  "ENDH": -1,
  "FLID": "\u0000\u0000\u0000\u0000\u0000\u0000\u0000\u0000\u0000\u0000\u0000\u0000\u0000\u0000\u0000\u0000",
  "GNRE": -1,
  "IDUS": "                ",
  "MUSL": 90,
  "PROV": 0,
  "RGHT": 0,
  "SFTV": 17432915,
  "SORC": "1,I,Ghost in the shell 2nd GIG.avi.MP3",
  "TITL": "Rise",
  "TYPE": 0,
  "YEAR": "2004"
 }
}
