{
 "directory": {
  "files": [
   {
    "flags": 0,
    "length1": 1171025,
    "length2": 1171025,
    "name": "kuroshitsuji_51.jpg",
    "offset": 0,
    "type": 3
   },
   {
    "flags": 0,
    "length1": 10168448,
    "length2": 10168448,
    "name": "01 - Lacrimosa.mp3",
    "offset": 1171025,
    "type": 2
   },
   {
    "flags": 0,
    "length1": 3897,
    "length2": 3897,
    "name": "Song.ini",
    "offset": 11339473,
    "type": 1
   }
  ],
  "offset": 296
 },
 "headers": {
  "ANME": 12,
  "DIFM": 0,
  "DIFW": 0,
  "ENDH": -1,
  "FLID": "\u0000\u0000\u0000\u0000\u0000\u0000\u0000\u0000\u0000\u0000\u0000\u0000\u0000\u0000\u0000\u0000",
  "GNRE": -1,
  "IDUS": "                ",
  "MUSL": 254,
  "PROV": 0,
  "RGHT": 0,
  "SFTV": 17432915,
  "SORC": "1,I,01 - Lacrimosa.mp3",
  "TYPE": 0
 }
}
