{
 "directory": {
  "files": [
   {
    "flags": 0,
    "length1": 2885378,
    "length2": 2885378,
    "name": "3-gatsu_no_Lion_-_ED2_norm.mp3",
    "offset": 0,
    "type": 2
   },
   {
    "flags": 0,
    "length1": 45893854,
    "length2": 45893854,
    "name": "3-gatsu no Lion - ED2.avi",
    "offset": 2885378,
    "type": 5
   },
   {
    "flags": 0,
    "length1": 3217,
    "length2": 3217,
    "name": "Song.ini",
    "offset": 48779232,
    "type": 1
   }
  ],
  "offset": 399
 },
 "headers": {
  "ANME": 12,
  "ARTS": "RUANN",
  "DIFM": 0,
  "DIFW": 0,
  "ENDH": -1,
  "FLID": "\u0000\u0000\u0000\u0000\u0000\u0000\u0000\u0000\u0000\u0000\u0000\u0000\u0000\u0000\u0000\u0000",
  "GNRE": -1,
  "IDUS": "                ",
  "KFNZ": "Alex",
  "LANG": "JA",
  "MUSL": 90,
  "PROV": 0,
  "RGHT": 0,
  "SFTV": 17432915,
  "SORC": "1,I,3-gatsu_no_Lion_-_ED2_norm.mp3",
  "TITL": "I Am Standing",
  "TYPE": 0,
  "YEAR": "2018"
 }
}
