{
 "directory": {
  "files": [
   {
    "flags": 0,
    "length1": 3628992,
    "length2": 3628992,
    "name": "disarm dreamer.mp3",
    "offset": 0,
    "type": 2
   },
   {
    "flags": 0,
    "length1": 45139608,
    "length2": 45139608,
    "name": "genshiken fix_001.avi",
    "offset": 3628992,
    "type": 5
   },
   {
    "flags": 0,
    "length1": 2525,
    "length2": 2525,
    "name": "Song.ini",
    "offset": 48768600,
    "type": 1
   }
  ],
  "offset": 340
 },
 "headers": {
  "ANME": 12,
  "ARTS": "Aki Misato",
  "DIFM": 0,
  "DIFW": 0,
  "ENDH": -1,
  "FLID": "\u0000\u0000\u0000\u0000\u0000\u0000\u0000\u0000\u0000\u0000\u0000\u0000\u0000\u0000\u0000\u0000",
  "GNRE": -1,
  "IDUS": "                ",
  "MUSL": 91,
  "PROV": 0,
  "RGHT": 0,
  "SFTV": 17432915,
  "SORC": "1,I,disarm dreamer.mp3",
  "TITL": "Disarm Dreamer",
  "TYPE": 0
 }
}
