{
 "directory": {
  "files": [
   {
    "flags": 0,
    "length1": 56368510,
    "length2": 56368510,
    "name": "AhiruNoSora.avi",
    "offset": 0,
    "type": 5
   },
   {
    "flags": 0,
    "length1": 1430946,
    "length2": 1430946,
    "name": "AhiruNoSora.mp3",
    "offset": 56368510,
    "type": 2
   },
   {
    "flags": 0,
    "length1": 3247,
    "length2": 3247,
    "name": "Song.ini",
    "offset": 57799456,
    "type": 1
   }
  ],
  "offset": 445
 },
 "headers": {
  "ALBM": "Ahiru no Sora",
  "ANME": 12,
  "ARTS": "the pillows",
  "COMM": "Paroles day one y faudra les retaper",
  "DIFM": 0,
  "DIFW": 0,
  "ENDH": -1,
  "FLID": "\u0000\u0000\u0000\u0000\u0000\u0000\u0000\u0000\u0000\u0000\u0000\u0000\u0000\u0000\u0000\u0000",
  "GNRE": -1,
  "IDUS": "                ",
  "KFNZ": "Dysp",
  "LANG": "JA",
  "MUSL": 89,
  "PROV": 0,
  "RGHT": 0,
  "SFTV": 17432915,
  "SORC": "1,I,AhiruNoSora.mp3",
  "TITL": "Happy Go Ducky!",
  "TRAK": "OP",
  "TYPE": 0,
  "YEAR": "2019"
 }
}
