{
 "directory": {
  "files": [
   {
    "flags": 0,
    "length1": 3044920,
    "length2": 3044920,
    "name": "01_Killing_me_norm.mp3",
    "offset": 0,
    "type": 2
   },
   {
    "flags": 0,
    "length1": 712265,
    "length2": 712265,
    "name": "Recollections.png",
    "offset": 3044920,
    "type": 3
   },
   {
    "flags": 0,
    "length1": 4889,
    "length2": 4889,
    "name": "Song.ini",
    "offset": 3757185,
    "type": 1
   }
  ],
  "offset": 456
 },
 "headers": {
  "ALBM": "recollection",
  "ANME": 12,
  "ARTS": "Minstrel",
  "COMM": "EAC V1.0 beta 2, Secure Mode, Test & Copy, AccurateRip, FLAC -8",
  "DIFM": 0,
  "DIFW": 0,
  "ENDH": -1,
  "FLID": "\u0000\u0000\u0000\u0000\u0000\u0000\u0000\u0000\u0000\u0000\u0000\u0000\u0000\u0000\u0000\u0000",
  "GNRE": -1,
  "IDUS": "                ",
  "KFNZ": "Kevin",
  "MUSL": 190,
  "PROV": 0,
  "RGHT": 0,
  "SFTV": 17432915,
  "SORC": "1,I,01_Killing_me_norm.mp3",
  "TITL": "Killing me",
  "TRAK": "01",
  "TYPE": 0
 }
}
