{
 "directory": {
  "files": [
   {
    "flags": 0,
    "length1": 45387312,
    "length2": 45387312,
    "name": "oddloop1.avi",
    "offset": 0,
    "type": 5
   },
   {
    "flags": 0,
    "length1": 6016878,
    "length2": 6016878,
    "name": "oddloop1.mp3",
    "offset": 45387312,
    "type": 2
   },
   {
    "flags": 0,
    "length1": 7546,
    "length2": 7546,
    "name": "Song.ini",
    "offset": 51404190,
    "type": 1
   }
  ],
  "offset": 391
 },
 "headers": {
  "ANME": 12,
  "ARTS": "Frederic",
  "COMM": "https://www.youtube.com/watch?v=PCp2iXA1uLE",
  "DIFM": 0,
  "DIFW": 0,
  "ENDH": -1,
  "FLID": "\u0000\u0000\u0000\u0000\u0000\u0000\u0000\u0000\u0000\u0000\u0000\u0000\u0000\u0000\u0000\u0000",
  "GNRE": -1,
  "IDUS": "                ",
  "KFNZ": "mrkyubu",
  "MUSL": 251,
  "PROV": 0,
  "RGHT": 0,
  "SFTV": 17432915,
  "SORC": "1,I,oddloop1.mp3",
  "TITL": "oddloop",
  "TYPE": 0,
  "YEAR": "2015"
 }
}
