{
 "directory": {
  "files": [
   {
    "flags": 0,
    "length1": 1454002,
    "length2": 1454002,
    "name": "388313-blackangel.jpg",
    "offset": 0,
    "type": 3
   },
   {
    "flags": 0,
    "length1": 1632501,
    "length2": 1632501,
    "name": "MAGI-.The.Labyrinth.of.Magic.full.1340158.jpg",
    "offset": 1454002,
    "type": 3
   },
   {
    "flags": 0,
    "length1": 2016530,
    "length2": 2016530,
    "name": "the_protagonists___magi_by_doubleu42-d71gvmu.jpg",
    "offset": 3086503,
    "type": 3
   },
   {
    "flags": 0,
    "length1": 14797004,
    "length2": 14797004,
    "name": "The Bravery.mp3",
    "offset": 5103033,
    "type": 2
   },
   {
    "flags": 0,
    "length1": 7400,
    "length2": 7400,
    "name": "Song.ini",
    "offset": 19900037,
    "type": 1
   }
  ],
  "offset": 477
 },
 "headers": {
  "ANME": 12,
  "ARTS": "Supercell",
  "DIFM": 0,
  "DIFW": 0,
  "ENDH": -1,
  "FLID": "\u0000\u0000\u0000\u0000\u0000\u0000\u0000\u0000\u0000\u0000\u0000\u0000\u0000\u0000\u0000\u0000",
  "GNRE": -1,
  "IDUS": "                ",
  "MUSL": 367,
  "PROV": 0,
  "RGHT": 0,
  "SFTV": 17432915,
  "SORC": "1,I,The Bravery.mp3",
  "TITL": "Magi - The Bravey",
  "TYPE": 0
 }
}
