{
 "directory": {
  "files": [
   {
    "flags": 0,
    "length1": 4603245,
    "length2": 4603245,
    "name": "FLAIYER.mp3",
    "offset": 0,
    "type": 2
   },
   {
    "flags": 0,
    "length1": 101161,
    "length2": 101161,
    "name": "flyer-crop_kfn_cover.jpg",
    "offset": 4603245,
    "type": 3
   },
   {
    "flags": 0,
    "length1": 7114,
    "length2": 7114,
    "name": "Song.ini",
    "offset": 4704406,
    "type": 1
   }
  ],
  "offset": 404
 },
 "headers": {
  "ANME": 12,
  "ARTS": "Kizuna AI",
  "COMM": "https://www.youtube.com/watch?v=OcvAhLKjEWc",
  "DIFM": 0,
  "DIFW": 0,
  "ENDH": -1,
  "FLID": "\u0000\u0000\u0000\u0000\u0000\u0000\u0000\u0000\u0000\u0000\u0000\u0000\u0000\u0000\u0000\u0000",
  "GNRE": -1,
  "IDUS": "                ",
  "KFNZ": "MrKyubu",
  "MUSL": 230,
  "PROV": 0,
  "RGHT": 0,
  "SFTV": 17432915,
  "SORC": "1,I,FLAIYER.mp3",
  "TITL": "FL-AI-YER",
  "TYPE": 0,
  "YEAR": "2020"
 }
}
