{
 "directory": {
  "files": [
   {
    "flags": 0,
    "length1": 118167,
    "length2": 118167,
    "name": "[Freedom OTAKU] Katte ni Kaizou - 01.mkv_snapshot_06.11_[2014.03.04_20.15.39].jpg",
    "offset": 0,
    "type": 3
   },
   {
    "flags": 0,
    "length1": 1942044,
    "length2": 1942044,
    "name": "4_12.png",
    "offset": 118167,
    "type": 3
   },
   {
    "flags": 0,
    "length1": 113563,
    "length2": 113563,
    "name": "maxresdefault.jpg",
    "offset": 2060211,
    "type": 3
   },
   {
    "flags": 0,
    "length1": 1758686,
    "length2": 1758686,
    "name": "1341393066_c30259d5c9a72c137befaed010a52142.png",
    "offset": 2173774,
    "type": 3
   },
   {
    "flags": 0,
    "length1": 4681855,
    "length2": 4681855,
    "name": "Katte ni Kaizou Shitemo iize.mp3",
    "offset": 3932460,
    "type": 2
   },
   {
    "flags": 0,
    "length1": 7362,
    "length2": 7362,
    "name": "Song.ini",
    "offset": 8614315,
    "type": 1
   }
  ],
  "offset": 600
 },
 "headers": {
  "ANME": 12,
  "ARTS": "Ootsuki Kenji",
  "DIFM": 0,
  "DIFW": 0,
  "ENDH": -1,
  "FLID": "\u0000\u0000\u0000\u0000\u0000\u0000\u0000\u0000\u0000\u0000\u0000\u0000\u0000\u0000\u0000\u0000",
  "GNRE": -1,
  "IDUS": "                ",
  "KFNZ": "JE",
  "MUSL": 282,
  "PROV": 0,
  "RGHT": 0,
  "SFTV": 17432915,
  "SORC": "1,I,Katte ni Kaizou Shitemo iize.mp3",
  "TITL": "Katte ni Kaizou Shitemo iize",
  "TYPE": 0
 }
}
