{
 "directory": {
  "files": [
   {
    "flags": 0,
    "length1": 67089582,
    "length2": 67089582,
    "name": "Symphogear-OP1.avi",
    "offset": 0,
    "type": 5
   },
   {
    "flags": 0,
    "length1": 3691554,
    "length2": 3691554,
    "name": "Symphogear-OP1.mp3",
    "offset": 67089582,
    "type": 2
   },
   {
    "flags": 0,
    "length1": 3525,
    "length2": 3525,
    "name": "Song.ini",
    "offset": 70781136,
    "type": 1
   }
  ],
  "offset": 417
 },
 "headers": {
  "ALBM": "Senki Zesshou Symphogear",
  "ANME": 12,
  "ARTS": "Nana Mizuki",
  "DIFM": 0,
  "DIFW": 0,
  "ENDH": -1,
  "FLID": "\u0000\u0000\u0000\u0000\u0000\u0000\u0000\u0000\u0000\u0000\u0000\u0000\u0000\u0000\u0000\u0000",
  "GNRE": -1,
  "IDUS": "                ",
  "KFNZ": "Dysp",
  "LANG": "JA",
  "MUSL": 92,
  "PROV": 0,
  "RGHT": 0,
  "SFTV": 17432915,
  "SORC": "1,I,Symphogear-OP1.mp3",
  "TITL": "Synchrogazer",
  "TRAK": "OP",
  "TYPE": 0,
  "YEAR": "2012"
 }
}
