{
 "directory": {
  "files": [
   {
    "flags": 0,
    "length1": 1454028,
    "length2": 1454028,
    "name": "Isekai Quartet ED.mp3",
    "offset": 0,
    "type": 2
   },
   {
    "flags": 0,
    "length1": 16382260,
    "length2": 16382260,
    "name": "Isekai Quartet ED.mp4.avi",
    "offset": 1454028,
    "type": 5
   },
   {
    "flags": 0,
    "length1": 1424673,
    "length2": 1424673,
    "name": "Isekai Quartet OP.mp3",
    "offset": 17836288,
    "type": 2
   },
   {
    "flags": 0,
    "length1": 66130250,
    "length2": 66130250,
    "name": "Isekai Quartet OP.avi",
    "offset": 19260961,
    "type": 5
   },
   {
    "flags": 0,
    "length1": 6164,
    "length2": 6164,
    "name": "Song.ini",
    "offset": 85391211,
    "type": 1
   }
  ],
  "offset": 528
 },
 "headers": {
  "ALBM": "Isekai Quartet",
  "ANME": 12,
  "ARTS": "Subaru, Tanya, Kazuma, Ains",
  "DIFM": 0,
  "DIFW": 0,
  "ENDH": -1,
  "FLID": "\u0000\u0000\u0000\u0000\u0000\u0000\u0000\u0000\u0000\u0000\u0000\u0000\u0000\u0000\u0000\u0000",
  "GNRE": -1,
  "IDUS": "                ",
  "KFNZ": "Dysp",
  "LANG": "JA",
  "MUSL": 89,
  "PROV": 0,
  "RGHT": 0,
  "SFTV": 17432915,
  "SORC": "1,I,Isekai Quartet OP.mp3",
  "TITL": "Isekai Quartet",
  "TRAK": "OP",
  "TYPE": 0,
  "YEAR": "2019"
 }
}
