{
 "directory": {
  "files": [
   {
    "flags": 0,
    "length1": 13622489,
    "length2": 13622489,
    "name": "Kisetsu wa Tsugitsugi Shindeiku.mp3",
    "offset": 0,
    "type": 2
   },
   {
    "flags": 0,
    "length1": 99780830,
    "length2": 99780830,
    "name": "Mon film.avi",
    "offset": 13622489,
    "type": 5
   },
   {
    "flags": 0,
    "length1": 7965,
    "length2": 7965,
    "name": "Song.ini",
    "offset": 113403319,
    "type": 1
   }
  ],
  "offset": 442
 },
 "headers": {
  "ANME": 12,
  "ARTS": "Amazarashi",
  "DIFM": 0,
  "DIFW": 0,
  "ENDH": -1,
  "FLID": "\u0000\u0000\u0000\u0000\u0000\u0000\u0000\u0000\u0000\u0000\u0000\u0000\u0000\u0000\u0000\u0000",
  "GNRE": -1,
  "IDUS": "                ",
  "KFNZ": "JE ou Jimmy vu le nom du clip en fait",
  "MUSL": 339,
  "PROV": 0,
  "RGHT": 0,
  "SFTV": 17432915,
  "SORC": "1,I,Kisetsu wa Tsugitsugi Shindeiku.mp3",
  "TITL": "Tokyo Ghoul - Kisetsu wa Tsugitsugi Shindeiku",
  "TYPE": 0
 }
}
