{
 "directory": {
  "files": [
   {
    "flags": 0,
    "length1": 4270988,
    "length2": 4270988,
    "name": "niconico_araki_snow_drive.mp3",
    "offset": 0,
    "type": 2
   },
   {
    "flags": 0,
    "length1": 67003712,
    "length2": 67003712,
    "name": "niconico_araki_snow_drive.avi",
    "offset": 4270988,
    "type": 5
   },
   {
    "flags": 0,
    "length1": 7233,
    "length2": 7233,
    "name": "Song.ini",
    "offset": 71274700,
    "type": 1
   }
  ],
  "offset": 385
 },
 "headers": {
  "ANME": 12,
  "ARTS": "Araki",
  "DIFM": 0,
  "DIFW": 0,
  "ENDH": -1,
  "FLID": "\u0000\u0000\u0000\u0000\u0000\u0000\u0000\u0000\u0000\u0000\u0000\u0000\u0000\u0000\u0000\u0000",
  "GNRE": -1,
  "IDUS": "                ",
  "KFNZ": "Dysp",
  "LANG": "JA",
  "MUSL": 267,
  "PROV": 0,
  "RGHT": 0,
  "SFTV": 17432915,
  "SORC": "1,I,niconico_araki_snow_drive.mp3",
  "TITL": "Snow Drive",
  "TYPE": 0
 }
}
