{
 "directory": {
  "files": [
   {
    "flags": 0,
    "length1": 188490,
    "length2": 188490,
    "name": "37256-1357391808_kfn_cover.jpg",
    "offset": 0,
    "type": 3
   },
   {
    "flags": 0,
    "length1": 7163140,
    "length2": 7163140,
    "name": "endless twilingNORM.mp3",
    "offset": 188490,
    "type": 2
   },
   {
    "flags": 0,
    "length1": 3779,
    "length2": 3779,
    "name": "Song.ini",
    "offset": 7351630,
    "type": 1
   }
  ],
  "offset": 526
 },
 "headers": {
  "ALBM": "Lupin III Bye Bye Liberty - Kiki Ippatsu!",
  "ANME": 12,
  "ARTS": "Akemi Keida",
  "COMM": "https://www.youtube.com/watch?v=dUcFhjd54fI",
  "DIFM": 0,
  "DIFW": 0,
  "ENDH": -1,
  "FLID": "\u0000\u0000\u0000\u0000\u0000\u0000\u0000\u0000\u0000\u0000\u0000\u0000\u0000\u0000\u0000\u0000",
  "GNRE": -1,
  "IDUS": "                ",
  "KFNZ": "mrkyubu",
  "MUSL": 292,
  "PROV": 0,
  "RGHT": 0,
  "SFTV": 17432915,
  "SORC": "1,I,endless twilingNORM.mp3",
  "TITL": "Endoresu Towairaito -Saigo no Shinjuu-",
  "TRAK": "ED",
  "TYPE": 0,
  "YEAR": "1989"
 }
}
