{
 "directory": {
  "files": [
   {
    "flags": 0,
    "length1": 3505152,
    "length2": 3505152,
    "name": "Gakuen_Mokushiroku-_High_School_of_the_Dead_-_C9_-_Ending_8_-_(636d3311)(RAW).mp4.MP3",
    "offset": 0,
    "type": 2
   },
   {
    "flags": 0,
    "length1": 43732386,
    "length2": 43732386,
    "name": "Gakuen_Mokushiroku-_High_School_of_the_Dead_-_C9_-_Ending_8_-_(636d3311)(RAW).avi.avi",
    "offset": 3505152,
    "type": 5
   },
   {
    "flags": 0,
    "length1": 3144,
    "length2": 3144,
    "name": "Song.ini",
    "offset": 47237538,
    "type": 1
   }
  ],
  "offset": 553
 },
 "headers": {
  "ANME": 12,
  "ARTS": "Highschool of the Dead",
  "DIFM": 0,
  "DIFW": 0,
  "ENDH": -1,
  "FLID": "\u0000\u0000\u0000\u0000\u0000\u0000\u0000\u0000\u0000\u0000\u0000\u0000\u0000\u0000\u0000\u0000",
  "GNRE": -1,
  "IDUS": "                ",
  "MUSL": 88,
  "PROV": 0,
  "RGHT": 0,
  "SFTV": 17432915,
  "SORC": "1,I,Gakuen_Mokushiroku-_High_School_of_the_Dead_-_C9_-_Ending_8_-_(636d3311)(RAW).mp4.MP3",
  "TITL": "The Place of Hope",
  "TYPE": 0
 }
}
