{
 "directory": {
  "files": [
   {
    "flags": 0,
    "length1": 29585578,
    "length2": 29585578,
    "name": "Toradora! - OP1 - Pre- parade.avi",
    "offset": 0,
    "type": 5
   },
   {
    "flags": 0,
    "length1": 2154472,
    "length2": 2154472,
    "name": "Toradora!_-_OP1_-_Pre-_parade_norm.mp3",
    "offset": 29585578,
    "type": 2
   },
   {
    "flags": 0,
    "length1": 7258,
    "length2": 7258,
    "name": "Song.ini",
    "offset": 31740050,
    "type": 1
   }
  ],
  "offset": 447
 },
 "headers": {
  "ALBM": "Toradora!",
  "ANME": 12,
  "ARTS": "Kugimiya Rie, Horie Yui, Kitamura Eri",
  "DIFM": 0,
  "DIFW": 0,
  "ENDH": -1,
  "FLID": "\u0000\u0000\u0000\u0000\u0000\u0000\u0000\u0000\u0000\u0000\u0000\u0000\u0000\u0000\u0000\u0000",
  "GNRE": -1,
  "IDUS": "                ",
  "KFNZ": "Hoël",
  "MUSL": 90,
  "PROV": 0,
  "RGHT": 0,
  "SFTV": 17432915,
  "SORC": "1,I,Toradora!_-_OP1_-_Pre-_parade_norm.mp3",
  "TITL": "Pre-Parade",
  "TYPE": 0
 }
}
