{
 "directory": {
  "files": [
   {
    "flags": 0,
    "length1": 3688512,
    "length2": 3688512,
    "name": "Fairy Tail ED1.mp4.MP3",
    "offset": 0,
    "type": 2
   },
   {
    "flags": 0,
    "length1": 46164110,
    "length2": 46164110,
    "name": "Fairy Tail ED1.avi.avi",
    "offset": 3688512,
    "type": 5
   },
   {
    "flags": 0,
    "length1": 4489,
    "length2": 4489,
    "name": "Song.ini",
    "offset": 49852622,
    "type": 1
   }
  ],
  "offset": 351
 },
 "headers": {
  "ANME": 12,
  "ARTS": "Fairy Tail",
  "DIFM": 0,
  "DIFW": 0,
  "ENDH": -1,
  "FLID": "\u0000\u0000\u0000\u0000\u0000\u0000\u0000\u0000\u0000\u0000\u0000\u0000\u0000\u0000\u0000\u0000",
  "GNRE": -1,
  "IDUS": "                ",
  "MUSL": 92,
  "PROV": 0,
  "RGHT": 0,
  "SFTV": 17432915,
  "SORC": "1,I,Fairy Tail ED1.mp4.MP3",
  "TITL": "Kanpegi Gu no Ne",
  "TYPE": 0
 }
}
