{
 "directory": {
  "files": [
   {
    "flags": 0,
    "length1": 1689601,
    "length2": 1689601,
    "name": "Magi.png",
    "offset": 0,
    "type": 3
   },
   {
    "flags": 0,
    "length1": 3537838,
    "length2": 3537838,
    "name": "Magi Kingdom Of Magic - Opening 1.MP3",
    "offset": 1689601,
    "type": 2
   },
   {
    "flags": 0,
    "length1": 2855,
    "length2": 2855,
    "name": "Song.ini",
    "offset": 5227439,
    "type": 1
   }
  ],
  "offset": 405
 },
 "headers": {
  "ALBM": "Magi : The Kingdom of Magic",
  "ANME": 12,
  "ARTS": "SID",
  "DIFM": 0,
  "DIFW": 0,
  "ENDH": -1,
  "FLID": "\u0000\u0000\u0000\u0000\u0000\u0000\u0000\u0000\u0000\u0000\u0000\u0000\u0000\u0000\u0000\u0000",
  "GNRE": -1,
  "IDUS": "                ",
  "KFNZ": "Hoël",
  "MUSL": 88,
  "PROV": 0,
  "RGHT": 0,
  "SFTV": 17432915,
  "SORC": "1,I,Magi Kingdom Of Magic - Opening 1.MP3",
  "TITL": "ANNIVERSARY",
  "TYPE": 0
 }
}
