{
 "directory": {
  "files": [
   {
    "flags": 0,
    "length1": 7870592,
    "length2": 7870592,
    "name": "13 - Gattai Nante Kuso Kurae.mp3",
    "offset": 0,
    "type": 2
   },
   {
    "flags": 0,
    "length1": 65912832,
    "length2": 65912832,
    "name": "Gattai nante kuso kurae!.wmv.MPG",
    "offset": 7870592,
    "type": 5
   },
   {
    "flags": 0,
    "length1": 3806,
    "length2": 3806,
    "name": "Song.ini",
    "offset": 73783424,
    "type": 1
   }
  ],
  "offset": 467
 },
 "headers": {
  "ALBM": "Tengen Toppa Gurren Lagann BEST SOUND - CD2",
  "ANME": 12,
  "ARTS": "Iwasaki Tarou",
  "DIFM": 0,
  "DIFW": 0,
  "ENDH": -1,
  "FLID": "\u0000\u0000\u0000\u0000\u0000\u0000\u0000\u0000\u0000\u0000\u0000\u0000\u0000\u0000\u0000\u0000",
  "GNRE": -1,
  "IDUS": "                ",
  "MUSL": 197,
  "PROV": 0,
  "RGHT": 0,
  "SFTV": 17432915,
  "SORC": "1,I,13 - Gattai Nante Kuso Kurae.mp3",
  "TITL": "Gattai Nante Kuso Kurae",
  "TRAK": "13",
  "TYPE": 0,
  "YEAR": "2007"
 }
}
