{
 "directory": {
  "files": [
   {
    "flags": 0,
    "length1": 5611460,
    "length2": 5611460,
    "name": "01 - Rewrite.mp3",
    "offset": 0,
    "type": 2
   },
   {
    "flags": 0,
    "length1": 381207,
    "length2": 381207,
    "name": "thumb-1920-108065.jpg",
    "offset": 5611460,
    "type": 3
   },
   {
    "flags": 0,
    "length1": 3575,
    "length2": 3575,
    "name": "Song.ini",
    "offset": 5992667,
    "type": 1
   }
  ],
  "offset": 382
 },
 "headers": {
  "ALBM": "Rewrite",
  "ANME": 12,
  "ARTS": "Asian Kung-Fu Generation",
  "DIFM": 0,
  "DIFW": 0,
  "ENDH": -1,
  "FLID": "\u0000\u0000\u0000\u0000\u0000\u0000\u0000\u0000\u0000\u0000\u0000\u0000\u0000\u0000\u0000\u0000",
  "GNRE": -1,
  "IDUS": "                ",
  "MUSL": 233,
  "PROV": 0,
  "RGHT": 0,
  "SFTV": 17432915,
  "SORC": "1,I,01 - Rewrite.mp3",
  "TITL": "Rewrite",
  "TRAK": "1",
  "TYPE": 0,
  "YEAR": "2004"
 }
}
