{
 "directory": {
  "files": [
   {
    "flags": 0,
    "length1": 1439483,
    "length2": 1439483,
    "name": "Shangri-La OP.avi.MP3",
    "offset": 0,
    "type": 2
   },
   {
    "flags": 0,
    "length1": 41752576,
    "length2": 41752576,
    "name": "Shangri-La OP.avi.MPG",
    "offset": 1439483,
    "type": 5
   },
   {
    "flags": 0,
    "length1": 2618,
    "length2": 2618,
    "name": "Song.ini",
    "offset": 43192059,
    "type": 1
   }
  ],
  "offset": 367
 },
 "headers": {
  "ANME": 12,
  "ARTS": "May'n",
  "DIFM": 0,
  "DIFW": 0,
  "ENDH": -1,
  "FLID": "\u0000\u0000\u0000\u0000\u0000\u0000\u0000\u0000\u0000\u0000\u0000\u0000\u0000\u0000\u0000\u0000",
  "GNRE": -1,
  "IDUS": "                ",
  "MUSL": 90,
  "PROV": 0,
  "RGHT": 0,
  "SFTV": 17432915,
  "SORC": "1,I,Shangri-La OP.avi.MP3",
  "TITL": "Kimi shinitamou koto nakare",
  "TYPE": 0,
  "YEAR": "2009"
 }
}
