{
 "directory": {
  "files": [
   {
    "flags": 0,
    "length1": 3690432,
    "length2": 3690432,
    "name": "shana.mp4.MP3",
    "offset": 0,
    "type": 2
   },
   {
    "flags": 0,
    "length1": 65934096,
    "length2": 65934096,
    "name": "shana.avi.avi",
    "offset": 3690432,
    "type": 5
   },
   {
    "flags": 0,
    "length1": 2864,
    "length2": 2864,
    "name": "Song.ini",
    "offset": 69624528,
    "type": 1
   }
  ],
  "offset": 334
 },
 "headers": {
  "ANME": 12,
  "ARTS": "Shakugan no Shana Final",
  "DIFM": 0,
  "DIFW": 0,
  "ENDH": -1,
  "FLID": "\u0000\u0000\u0000\u0000\u0000\u0000\u0000\u0000\u0000\u0000\u0000\u0000\u0000\u0000\u0000\u0000",
  "GNRE": -1,
  "IDUS": "                ",
  "MUSL": 92,
  "PROV": 0,
  "RGHT": 0,
  "SFTV": 17432915,
  "SORC": "1,I,shana.mp4.MP3",
  "TITL": "Light my Fire",
  "TYPE": 0
 }
}
