{
 "directory": {
  "files": [
   {
    "flags": 0,
    "length1": 8290510,
    "length2": 8290510,
    "name": "Minami - Kawaki wo Ameku.mp3",
    "offset": 0,
    "type": 2
   },
   {
    "flags": 0,
    "length1": 142204746,
    "length2": 142204746,
    "name": "JPN - Domestic na Kanojo - MV - Kawaki wo Ameku ~ Full Vers.avi",
    "offset": 8290510,
    "type": 5
   },
   {
    "flags": 0,
    "length1": 7448,
    "length2": 7448,
    "name": "Song.ini",
    "offset": 150495256,
    "type": 1
   }
  ],
  "offset": 474
 },
 "headers": {
  "ALBM": "Domestic na Kanojo",
  "ANME": 12,
  "ARTS": "Minami",
  "DIFM": 0,
  "DIFW": 0,
  "ENDH": -1,
  "FLID": "\u0000\u0000\u0000\u0000\u0000\u0000\u0000\u0000\u0000\u0000\u0000\u0000\u0000\u0000\u0000\u0000",
  "GNRE": -1,
  "IDUS": "                ",
  "KFNZ": "Dysp",
  "LANG": "JA",
  "MUSL": 253,
  "PROV": 0,
  "RGHT": 0,
  "SFTV": 17432915,
  "SORC": "1,I,Minami - Kawaki wo Ameku.mp3",
  "TITL": "Kawaki wo Ameku",
  "TRAK": "OP",
  "TYPE": 0,
  "YEAR": "2019"
 }
}
