{
 "directory": {
  "files": [
   {
    "flags": 0,
    "length1": 536831,
    "length2": 536831,
    "name": "365a885c9c.png",
    "offset": 0,
    "type": 3
   },
   {
    "flags": 0,
    "length1": 15072062,
    "length2": 15072062,
    "name": "Nakajima Miyuki - Gin no Ryuu no Se ni Notte (first release).mp3",
    "offset": 536831,
    "type": 2
   },
   {
    "flags": 0,
    "length1": 6255,
    "length2": 6255,
    "name": "Song.ini",
    "offset": 15608893,
    "type": 1
   }
  ],
  "offset": 519
 },
 "headers": {
  "ALBM": "Koibumi",
  "ANME": 12,
  "ARTS": "Nakajima Miyuki",
  "COMP": "Nakajima Miyuki",
  "DIFM": 0,
  "DIFW": 0,
  "ENDH": -1,
  "FLID": "\u0000\u0000\u0000\u0000\u0000\u0000\u0000\u0000\u0000\u0000\u0000\u0000\u0000\u0000\u0000\u0000",
  "GNRE": -1,
  "IDUS": "                ",
  "KFNZ": "Dysp",
  "LANG": "JA",
  "MUSL": 376,
  "PROV": 0,
  "RGHT": 0,
  "SFTV": 17432915,
  "SORC": "1,I,Nakajima Miyuki - Gin no Ryuu no Se ni Notte (first release).mp3",
  "TITL": "Gin no Ryuu no Se ni Notte",
  "TYPE": 0,
  "YEAR": "2003"
 }
}
