{
 "directory": {
  "files": [
   {
    "flags": 0,
    "length1": 1474619,
    "length2": 1474619,
    "name": "norm_City Hunter 1   ED   Get Wild   VOSTF + Lyrics ( 160kbps ).mp3",
    "offset": 0,
    "type": 2
   },
   {
    "flags": 0,
    "length1": 40117234,
    "length2": 40117234,
    "name": "City_Hunter_-_Get_Wild_480_X_854_.avi",
    "offset": 1474619,
    "type": 5
   },
   {
    "flags": 0,
    "length1": 3452,
    "length2": 3452,
    "name": "Song.ini",
    "offset": 41591853,
    "type": 1
   }
  ],
  "offset": 484
 },
 "headers": {
  "ANME": 12,
  "ARTS": "TM Network",
  "DIFM": 0,
  "DIFW": 0,
  "ENDH": -1,
  "FLID": "\u0000\u0000\u0000\u0000\u0000\u0000\u0000\u0000\u0000\u0000\u0000\u0000\u0000\u0000\u0000\u0000",
  "GNRE": -1,
  "IDUS": "                ",
  "KFNZ": "Antoine Leroux",
  "MUSL": 92,
  "PROV": 0,
  "RGHT": 0,
  "SFTV": 17432915,
  "SORC": "1,I,norm_City Hunter 1   ED   Get Wild   VOSTF + Lyrics ( 160kbps ).mp3",
  "TITL": "Get Wild",
  "TYPE": 0,
  "YEAR": "1987"
 }
}
