{
 "directory": {
  "files": [
   {
    "flags": 0,
    "length1": 2157546,
    "length2": 2157546,
    "name": "To Aru Hikuushi e no Koi Uta Opening.mp3",
    "offset": 0,
    "type": 2
   },
   {
    "flags": 0,
    "length1": 85316426,
    "length2": 85316426,
    "name": "To Aru Hikuushi e no Koi Uta Opening.avi",
    "offset": 2157546,
    "type": 5
   },
   {
    "flags": 0,
    "length1": 2645,
    "length2": 2645,
    "name": "Song.ini",
    "offset": 87473972,
    "type": 1
   }
  ],
  "offset": 428
 },
 "headers": {
  "ANME": 12,
  "ARTS": "Petit Milady",
  "DIFM": 0,
  "DIFW": 0,
  "ENDH": -1,
  "FLID": "\u0000\u0000\u0000\u0000\u0000\u0000\u0000\u0000\u0000\u0000\u0000\u0000\u0000\u0000\u0000\u0000",
  "GNRE": -1,
  "IDUS": "                ",
  "MUSL": 90,
  "PROV": 0,
  "RGHT": 0,
  "SFTV": 17432915,
  "SORC": "1,I,To Aru Hikuushi e no Koi Uta Opening.mp3",
  "TITL": "To Aru Hikuushi e no Koiuta - Azurite",
  "TYPE": 0
 }
}
