{
 "directory": {
  "files": [
   {
    "flags": 0,
    "length1": 3706360,
    "length2": 3706360,
    "name": "42 - Shoujo Q (TV Size).mp3",
    "offset": 0,
    "type": 2
   },
   {
    "flags": 0,
    "length1": 47124480,
    "length2": 47124480,
    "name": "PaniPoni_Dash!_-_C03_-_Creditless_Opening_3_-_[DmzJ](a14ef74a)(RAW).mkv.MPG",
    "offset": 3706360,
    "type": 5
   },
   {
    "flags": 0,
    "length1": 3557,
    "length2": 3557,
    "name": "Song.ini",
    "offset": 50830840,
    "type": 1
   }
  ],
  "offset": 553
 },
 "headers": {
  "ALBM": "Pani Poni Dash! Original Soundtrack - Gakuen Sai",
  "ANME": 12,
  "ARTS": "Momotsuki Gakuen Ichinen C Gumi",
  "COMM": "#NIPPONSEI @ IRC.RIZON.NET",
  "DIFM": 0,
  "DIFW": 0,
  "ENDH": -1,
  "FLID": "\u0000\u0000\u0000\u0000\u0000\u0000\u0000\u0000\u0000\u0000\u0000\u0000\u0000\u0000\u0000\u0000",
  "GNRE": -1,
  "IDUS": "                ",
  "MUSL": 93,
  "PROV": 0,
  "RGHT": 0,
  "SFTV": 17432915,
  "SORC": "1,I,42 - Shoujo Q (TV Size).mp3",
  "TITL": "Shoujo Q (TV Size)",
  "TRAK": "42",
  "TYPE": 0,
  "YEAR": "2005"
 }
}
