{
 "directory": {
  "files": [
   {
    "flags": 0,
    "length1": 8882735,
    "length2": 8882735,
    "name": "RADWIMPS_-_Saihate_Ai_ni_norm.mp3",
    "offset": 0,
    "type": 2
   },
   {
    "flags": 0,
    "length1": 123031,
    "length2": 123031,
    "name": "ApplicationFrameHost_2018-04-26_23-27-46.png",
    "offset": 8882735,
    "type": 3
   },
   {
    "flags": 0,
    "length1": 7669,
    "length2": 7669,
    "name": "Song.ini",
    "offset": 9005766,
    "type": 1
   }
  ],
  "offset": 428
 },
 "headers": {
  "ANME": 12,
  "ARTS": "RADWIMPS",
  "DIFM": 0,
  "DIFW": 0,
  "ENDH": -1,
  "FLID": "\u0000\u0000\u0000\u0000\u0000\u0000\u0000\u0000\u0000\u0000\u0000\u0000\u0000\u0000\u0000\u0000",
  "GNRE": -1,
  "IDUS": "                ",
  "KFNZ": "Dysp",
  "LANG": "JA",
  "MUSL": 222,
  "PROV": 0,
  "RGHT": 0,
  "SFTV": 17432915,
  "SORC": "1,I,RADWIMPS_-_Saihate_Ai_ni_norm.mp3",
  "TITL": "Saihate Ai ni",
  "TYPE": 0,
  "YEAR": "Hey !"
 }
}
