{
 "directory": {
  "files": [
   {
    "flags": 0,
    "length1": 3664512,
    "length2": 3664512,
    "name": "CODE GEASS OP (STAGE 18 23).mp4.MP3",
    "offset": 0,
    "type": 2
   },
   {
    "flags": 0,
    "length1": 45907658,
    "length2": 45907658,
    "name": "CODE GEASS OP (STAGE 18 23).avi.avi",
    "offset": 3664512,
    "type": 5
   },
   {
    "flags": 0,
    "length1": 3467,
    "length2": 3467,
    "name": "Song.ini",
    "offset": 49572170,
    "type": 1
   }
  ],
  "offset": 400
 },
 "headers": {
  "ALBM": "Code Geass",
  "ANME": 12,
  "ARTS": "JINN",
  "DIFM": 0,
  "DIFW": 0,
  "ENDH": -1,
  "FLID": "\u0000\u0000\u0000\u0000\u0000\u0000\u0000\u0000\u0000\u0000\u0000\u0000\u0000\u0000\u0000\u0000",
  "GNRE": -1,
  "IDUS": "                ",
  "MUSL": 92,
  "PROV": 0,
  "RGHT": 0,
  "SFTV": 17432915,
  "SORC": "1,I,CODE GEASS OP (STAGE 18 23).mp4.MP3",
  "TITL": "Kaidoku Funou",
  "TYPE": 0
 }
}
