{
 "directory": {
  "files": [
   {
    "flags": 0,
    "length1": 1483507,
    "length2": 1483507,
    "name": "RG ED.mp3",
    "offset": 0,
    "type": 2
   },
   {
    "flags": 0,
    "length1": 21003152,
    "length2": 21003152,
    "name": "RG ED.avi",
    "offset": 1483507,
    "type": 5
   },
   {
    "flags": 0,
    "length1": 13342085,
    "length2": 13342085,
    "name": "RG ED.mp4",
    "offset": 22486659,
    "type": 0
   },
   {
    "flags": 0,
    "length1": 2213,
    "length2": 2213,
    "name": "Song.ini",
    "offset": 35828744,
    "type": 1
   }
  ],
  "offset": 429
 },
 "headers": {
  "ALBM": "The Rolling Girls",
  "ANME": 12,
  "ARTS": "The Rolling Girls",
  "DIFM": 0,
  "DIFW": 0,
  "ENDH": -1,
  "FLID": "\u0000\u0000\u0000\u0000\u0000\u0000\u0000\u0000\u0000\u0000\u0000\u0000\u0000\u0000\u0000\u0000",
  "GNRE": -1,
  "IDUS": "                ",
  "KFNZ": "Dysp",
  "LANG": "JA",
  "MUSL": 92,
  "PROV": 0,
  "RGHT": 0,
  "SFTV": 17432915,
  "SORC": "1,I,RG ED.mp3",
  "TITL": "Tsuki no Bakugekiki",
  "TRAK": "ED",
  "TYPE": 0,
  "YEAR": "2018"
 }
}
