{
 "directory": {
  "files": [
   {
    "flags": 0,
    "length1": 3649614,
    "length2": 3649614,
    "name": "[ReinForce] Haiyore! Nyaruko-san W - OP (BDRip 1920x1080 x264 FLAC).mp3",
    "offset": 0,
    "type": 2
   },
   {
    "flags": 0,
    "length1": 85071000,
    "length2": 85071000,
    "name": "[ReinForce] Haiyore! Nyaruko-san W - OP (BDRip 1920x1080 x264 FLAC).avi",
    "offset": 3649614,
    "type": 5
   },
   {
    "flags": 0,
    "length1": 6378,
    "length2": 6378,
    "name": "Song.ini",
    "offset": 88720614,
    "type": 1
   }
  ],
  "offset": 538
 },
 "headers": {
  "ANME": 12,
  "ARTS": "Haiyore! Nyaruko-san W",
  "DIFM": 0,
  "DIFW": 0,
  "ENDH": -1,
  "FLID": "\u0000\u0000\u0000\u0000\u0000\u0000\u0000\u0000\u0000\u0000\u0000\u0000\u0000\u0000\u0000\u0000",
  "GNRE": -1,
  "IDUS": "                ",
  "KFNZ": "GroManu",
  "MUSL": 91,
  "PROV": 0,
  "RGHT": 0,
  "SFTV": 17432915,
  "SORC": "1,I,[ReinForce] Haiyore! Nyaruko-san W - OP (BDRip 1920x1080 x264 FLAC).mp3",
  "TITL": "Koi wa Chaos no Shimobe nari",
  "TYPE": 0
 }
}
