{
 "directory": {
  "files": [
   {
    "flags": 0,
    "length1": 53818572,
    "length2": 53818572,
    "name": "FruitsBasket2019-OP1-NCBD1080.avi",
    "offset": 0,
    "type": 5
   },
   {
    "flags": 0,
    "length1": 3646299,
    "length2": 3646299,
    "name": "FruitsBasket2019-OP1-NCBD1080.mp3",
    "offset": 53818572,
    "type": 2
   },
   {
    "flags": 0,
    "length1": 2242,
    "length2": 2242,
    "name": "Song.ini",
    "offset": 57464871,
    "type": 1
   }
  ],
  "offset": 450
 },
 "headers": {
  "ALBM": "Fruits Basket (2019)",
  "ANME": 12,
  "ARTS": "Beverly",
  "DIFM": 0,
  "DIFW": 0,
  "ENDH": -1,
  "FLID": "\u0000\u0000\u0000\u0000\u0000\u0000\u0000\u0000\u0000\u0000\u0000\u0000\u0000\u0000\u0000\u0000",
  "GNRE": -1,
  "IDUS": "                ",
  "KFNZ": "Luthien",
  "LANG": "JA",
  "MUSL": 91,
  "PROV": 0,
  "RGHT": 0,
  "SFTV": 17432915,
  "SORC": "1,I,FruitsBasket2019-OP1-NCBD1080.mp3",
  "TITL": "Again",
  "TRAK": "OP",
  "TYPE": 0,
  "YEAR": "2019"
 }
}
