{
 "directory": {
  "files": [
   {
    "flags": 0,
    "length1": 5543291,
    "length2": 5543291,
    "name": "28 - Traumerei.mp3",
    "offset": 0,
    "type": 2
   },
   {
    "flags": 0,
    "length1": 50188020,
    "length2": 50188020,
    "name": "traumerei fix_001.avi",
    "offset": 5543291,
    "type": 5
   },
   {
    "flags": 0,
    "length1": 2801,
    "length2": 2801,
    "name": "Song.ini",
    "offset": 55731311,
    "type": 1
   }
  ],
  "offset": 451
 },
 "headers": {
  "ALBM": "Zoku Sayonara Zetsubou Sensei Original Soundtrack",
  "ANME": 12,
  "ARTS": "Nonaka Ai",
  "COMM": "#NIPPONSEI @ IRC.RIZON.NET",
  "DIFM": 0,
  "DIFW": 0,
  "ENDH": -1,
  "FLID": "\u0000\u0000\u0000\u0000\u0000\u0000\u0000\u0000\u0000\u0000\u0000\u0000\u0000\u0000\u0000\u0000",
  "GNRE": -1,
  "IDUS": "                ",
  "MUSL": 139,
  "PROV": 0,
  "RGHT": 0,
  "SFTV": 17432915,
  "SORC": "1,I,28 - Traumerei.mp3",
  "TITL": "Traumerei",
  "TRAK": "28",
  "TYPE": 0,
  "YEAR": "2008"
 }
}
