{
 "directory": {
  "files": [
   {
    "flags": 0,
    "length1": 6535459,
    "length2": 6535459,
    "name": "Telecastic Fake Show.mp3",
    "offset": 0,
    "type": 2
   },
   {
    "flags": 0,
    "length1": 34475368,
    "length2": 34475368,
    "name": "Telecastic Fake Show.avi",
    "offset": 6535459,
    "type": 5
   },
   {
    "flags": 0,
    "length1": 7036,
    "length2": 7036,
    "name": "Song.ini",
    "offset": 41010827,
    "type": 1
   }
  ],
  "offset": 383
 },
 "headers": {
  "ANME": 12,
  "ARTS": "Ling Tosite Sigure",
  "DIFM": 0,
  "DIFW": 0,
  "ENDH": -1,
  "FLID": "\u0000\u0000\u0000\u0000\u0000\u0000\u0000\u0000\u0000\u0000\u0000\u0000\u0000\u0000\u0000\u0000",
  "GNRE": -1,
  "IDUS": "                ",
  "KFNZ": "Jimmy",
  "MUSL": 272,
  "PROV": 0,
  "RGHT": 0,
  "SFTV": 17432915,
  "SORC": "1,I,Telecastic Fake Show.mp3",
  "TITL": "Telecastic Fake Show",
  "TYPE": 0
 }
}
