{
 "directory": {
  "files": [
   {
    "flags": 0,
    "length1": 1446161,
    "length2": 1446161,
    "name": "Noragami Aragoto OP_1.mp3",
    "offset": 0,
    "type": 2
   },
   {
    "flags": 0,
    "length1": 45233402,
    "length2": 45233402,
    "name": "Noragami Aragoto OP.avi",
    "offset": 1446161,
    "type": 5
   },
   {
    "flags": 0,
    "length1": 4264,
    "length2": 4264,
    "name": "Song.ini",
    "offset": 46679563,
    "type": 1
   }
  ],
  "offset": 406
 },
 "headers": {
  "ANME": 12,
  "ARTS": "THE ORAL CIGARETTES",
  "DIFM": 0,
  "DIFW": 0,
  "ENDH": -1,
  "FLID": "\u0000\u0000\u0000\u0000\u0000\u0000\u0000\u0000\u0000\u0000\u0000\u0000\u0000\u0000\u0000\u0000",
  "GNRE": -1,
  "IDUS": "                ",
  "KFNZ": "Dysp",
  "LANG": "JA",
  "MUSL": 90,
  "PROV": 0,
  "RGHT": 0,
  "SFTV": 17432915,
  "SORC": "1,I,Noragami Aragoto OP_1.mp3",
  "TITL": "Kyouran Hey Kids!!",
  "TYPE": 0,
  "YEAR": "2015"
 }
}
