{
 "directory": {
  "files": [
   {
    "flags": 0,
    "length1": 4206912,
    "length2": 4206912,
    "name": "Ergo Proxy.2006.NCOP.x264.AC3-CalChi.avi.MP3",
    "offset": 0,
    "type": 2
   },
   {
    "flags": 0,
    "length1": 52894318,
    "length2": 52894318,
    "name": "Ergo Proxy.2006.NCOP.x264.AC3-CalChi.avi.avi",
    "offset": 4206912,
    "type": 5
   },
   {
    "flags": 0,
    "length1": 1936,
    "length2": 1936,
    "name": "Song.ini",
    "offset": 57101230,
    "type": 1
   }
  ],
  "offset": 405
 },
 "headers": {
  "ANME": 12,
  "ARTS": "Ergo Proxy",
  "DIFM": 0,
  "DIFW": 0,
  "ENDH": -1,
  "FLID": "\u0000\u0000\u0000\u0000\u0000\u0000\u0000\u0000\u0000\u0000\u0000\u0000\u0000\u0000\u0000\u0000",
  "GNRE": -1,
  "IDUS": "                ",
  "MUSL": 105,
  "PROV": 0,
  "RGHT": 0,
  "SFTV": 17432915,
  "SORC": "1,I,Ergo Proxy.2006.NCOP.x264.AC3-CalChi.avi.MP3",
  "TITL": "kiri",
  "TYPE": 0
 }
}
