{
 "directory": {
  "files": [
   {
    "flags": 0,
    "length1": 3684672,
    "length2": 3684672,
    "name": "[RAWS-DESU] BACCANO! Creditless ED (704x480 x264 AAC).mp4.MP3",
    "offset": 0,
    "type": 2
   },
   {
    "flags": 0,
    "length1": 11719710,
    "length2": 11719710,
    "name": "[RAWS-DESU] BACCANO! Creditless ED (704x480 x264 AAC).avi_001.avi",
    "offset": 3684672,
    "type": 5
   },
   {
    "flags": 0,
    "length1": 2635,
    "length2": 2635,
    "name": "Song.ini",
    "offset": 15404382,
    "type": 1
   }
  ],
  "offset": 461
 },
 "headers": {
  "ANME": 12,
  "ARTS": "Baccano!",
  "DIFM": 0,
  "DIFW": 0,
  "ENDH": -1,
  "FLID": "\u0000\u0000\u0000\u0000\u0000\u0000\u0000\u0000\u0000\u0000\u0000\u0000\u0000\u0000\u0000\u0000",
  "GNRE": -1,
  "IDUS": "                ",
  "MUSL": 92,
  "PROV": 0,
  "RGHT": 0,
  "SFTV": 17432915,
  "SORC": "1,I,[RAWS-DESU] BACCANO! Creditless ED (704x480 x264 AAC).mp4.MP3",
  "TITL": "Calling",
  "TYPE": 0
 }
}
