{
 "directory": {
  "files": [
   {
    "flags": 0,
    "length1": 1865250,
    "length2": 1865250,
    "name": "01 - Ashita no Kioku ~ TV version.mp3",
    "offset": 0,
    "type": 2
   },
   {
    "flags": 0,
    "length1": 34012804,
    "length2": 34012804,
    "name": "BBBblob001_002.avi",
    "offset": 1865250,
    "type": 5
   },
   {
    "flags": 0,
    "length1": 3355,
    "length2": 3355,
    "name": "Song.ini",
    "offset": 35878054,
    "type": 1
   }
  ],
  "offset": 471
 },
 "headers": {
  "ALBM": "BLACK BLOOD BROTHERS Original Sound Track",
  "ANME": 12,
  "ARTS": "Takahashi Naozumi",
  "COMM": "(null)",
  "DIFM": 0,
  "DIFW": 0,
  "ENDH": -1,
  "FLID": "\u0000\u0000\u0000\u0000\u0000\u0000\u0000\u0000\u0000\u0000\u0000\u0000\u0000\u0000\u0000\u0000",
  "GNRE": -1,
  "IDUS": "                ",
  "MUSL": 93,
  "PROV": 0,
  "RGHT": 0,
  "SFTV": 17432915,
  "SORC": "1,I,01 - Ashita no Kioku ~ TV version.mp3",
  "TITL": "Ashita no Kioku",
  "TRAK": "1",
  "TYPE": 0,
  "YEAR": "2006"
 }
}
