{
 "directory": {
  "files": [
   {
    "flags": 0,
    "length1": 2887925,
    "length2": 2887925,
    "name": "Tales of Zestiria the X S2 - ED.mp3",
    "offset": 0,
    "type": 2
   },
   {
    "flags": 0,
    "length1": 22815076,
    "length2": 22815076,
    "name": "Tales of Zestiria the X S2 - ED.avi",
    "offset": 2887925,
    "type": 5
   },
   {
    "flags": 0,
    "length1": 2689,
    "length2": 2689,
    "name": "Song.ini",
    "offset": 25703001,
    "type": 1
   }
  ],
  "offset": 390
 },
 "headers": {
  "ANME": 12,
  "ARTS": "Flow",
  "DIFM": 0,
  "DIFW": 0,
  "ENDH": -1,
  "FLID": "\u0000\u0000\u0000\u0000\u0000\u0000\u0000\u0000\u0000\u0000\u0000\u0000\u0000\u0000\u0000\u0000",
  "GNRE": -1,
  "IDUS": "                ",
  "KFNZ": "Alex",
  "MUSL": 90,
  "PROV": 0,
  "RGHT": 0,
  "SFTV": 17432915,
  "SORC": "1,I,Tales of Zestiria the X S2 - ED.mp3",
  "TITL": "Innosense",
  "TYPE": 0
 }
}
