{
 "directory": {
  "files": [
   {
    "flags": 0,
    "length1": 151085,
    "length2": 151085,
    "name": "aufwaken_kfn_cover.jpg",
    "offset": 0,
    "type": 3
   },
   {
    "flags": 0,
    "length1": 6709186,
    "length2": 6709186,
    "name": "n_08. Vitalization -Aufwachen Form-.mp3",
    "offset": 151085,
    "type": 2
   },
   {
    "flags": 0,
    "length1": 6733,
    "length2": 6733,
    "name": "Song.ini",
    "offset": 6860271,
    "type": 1
   }
  ],
  "offset": 492
 },
 "headers": {
  "ALBM": "Senki Zesshou Symphogear G",
  "ANME": 12,
  "ARTS": "Nana Mizuki",
  "COPY": "SATELIGHT",
  "DIFM": 0,
  "DIFW": 0,
  "ENDH": -1,
  "FLID": "\u0000\u0000\u0000\u0000\u0000\u0000\u0000\u0000\u0000\u0000\u0000\u0000\u0000\u0000\u0000\u0000",
  "GNRE": -1,
  "IDUS": "                ",
  "KFNZ": "mrkyubu",
  "LANG": "JA",
  "MUSL": 283,
  "PROV": 0,
  "RGHT": 0,
  "SFTV": 17432915,
  "SORC": "1,I,n_08. Vitalization -Aufwachen Form-.mp3",
  "TITL": "Vitalization -Aufwachen Form-",
  "TYPE": 0,
  "YEAR": "2013"
 }
}
