{
  "appId": "com.dymeter.unitapp",
  "appName": "단위수량",
  "bundledWebRuntime": false,
  "npmClient": "npm",
  "webDir": "www",
  "plugins": {
    "SplashScreen": {
      "launchShowDuration": 0
    }
  },
  "cordova": {
    "preferences": {
      "ScrollEnabled": "false",
      "android-minSdkVersion": "19",
      "android-targetSdkVersion": "29",
      "BackupWebStorage": "none",
      "SplashMaintainAspectRatio": "true",
      "FadeSplashScreenDuration": "300",
      "SplashShowOnlyFirstTime": "false",
      "SplashScreen": "value",
      "SplashScreenDelay": "2000",
      "loadUrlTimeoutValue": "700000",
      "cordova.plugins.diagnostic.modules": "Diagnostic_Bluetooth",
      "CordovaWebViewEngine": "CDVWKWebViewEngine",
      "WKWebViewOnly": "true",
      "WKEnableBackground": "true"
    }
  }
}
