%YAML 1.1
%TAG !u! tag:unity3d.com,2011:
--- !u!114 &941264406
MonoBehaviour:
  m_ObjectHideFlags: 0
  m_CorrespondingSourceObject: {fileID: 0}
  m_PrefabInstance: {fileID: 0}
  m_PrefabAsset: {fileID: 0}
  m_GameObject: {fileID: 1948084522200941936}
  m_Enabled: 1
  m_EditorHideFlags: 0
  m_Script: {fileID: 11500000, guid: e7fe1be4d1d99734c81e2b1004b05018, type: 3}
  m_Name: 
  m_EditorClassIdentifier: 
  timeBeforeFall: 1
--- !u!54 &941264407
Rigidbody:
  m_ObjectHideFlags: 0
  m_CorrespondingSourceObject: {fileID: 0}
  m_PrefabInstance: {fileID: 0}
  m_PrefabAsset: {fileID: 0}
  m_GameObject: {fileID: 1948084522200941936}
  serializedVersion: 2
  m_Mass: 1
  m_Drag: 0
  m_AngularDrag: 0.05
  m_UseGravity: 1
  m_IsKinematic: 1
  m_Interpolate: 0
  m_Constraints: 112
  m_CollisionDetection: 0
--- !u!1001 &1949626970097668002
PrefabInstance:
  m_ObjectHideFlags: 0
  serializedVersion: 2
  m_Modification:
    m_TransformParent: {fileID: 0}
    m_Modifications:
    - target: {fileID: 1842693022419666, guid: 8ee62f9f21f8a2b479defcf3f0cb7450, type: 3}
      propertyPath: m_Name
      value: SM_Bld_Ceiling_Pipe_Junction_01 (4)
      objectReference: {fileID: 0}
    - target: {fileID: 1842693022419666, guid: 8ee62f9f21f8a2b479defcf3f0cb7450, type: 3}
      propertyPath: m_TagString
      value: PlatformFalling
      objectReference: {fileID: 0}
    - target: {fileID: 4898241286333772, guid: 8ee62f9f21f8a2b479defcf3f0cb7450, type: 3}
      propertyPath: m_RootOrder
      value: 0
      objectReference: {fileID: 0}
    - target: {fileID: 4898241286333772, guid: 8ee62f9f21f8a2b479defcf3f0cb7450, type: 3}
      propertyPath: m_LocalPosition.x
      value: 11.161
      objectReference: {fileID: 0}
    - target: {fileID: 4898241286333772, guid: 8ee62f9f21f8a2b479defcf3f0cb7450, type: 3}
      propertyPath: m_LocalPosition.y
      value: 26.029
      objectReference: {fileID: 0}
    - target: {fileID: 4898241286333772, guid: 8ee62f9f21f8a2b479defcf3f0cb7450, type: 3}
      propertyPath: m_LocalPosition.z
      value: -13.036
      objectReference: {fileID: 0}
    - target: {fileID: 4898241286333772, guid: 8ee62f9f21f8a2b479defcf3f0cb7450, type: 3}
      propertyPath: m_LocalRotation.w
      value: -0.7071068
      objectReference: {fileID: 0}
    - target: {fileID: 4898241286333772, guid: 8ee62f9f21f8a2b479defcf3f0cb7450, type: 3}
      propertyPath: m_LocalRotation.x
      value: -0
      objectReference: {fileID: 0}
    - target: {fileID: 4898241286333772, guid: 8ee62f9f21f8a2b479defcf3f0cb7450, type: 3}
      propertyPath: m_LocalRotation.y
      value: 0.7071068
      objectReference: {fileID: 0}
    - target: {fileID: 4898241286333772, guid: 8ee62f9f21f8a2b479defcf3f0cb7450, type: 3}
      propertyPath: m_LocalRotation.z
      value: -0
      objectReference: {fileID: 0}
    - target: {fileID: 4898241286333772, guid: 8ee62f9f21f8a2b479defcf3f0cb7450, type: 3}
      propertyPath: m_LocalScale.x
      value: 0.9590837
      objectReference: {fileID: 0}
    - target: {fileID: 4898241286333772, guid: 8ee62f9f21f8a2b479defcf3f0cb7450, type: 3}
      propertyPath: m_LocalScale.y
      value: 0.9590834
      objectReference: {fileID: 0}
    - target: {fileID: 4898241286333772, guid: 8ee62f9f21f8a2b479defcf3f0cb7450, type: 3}
      propertyPath: m_LocalScale.z
      value: 0.9590837
      objectReference: {fileID: 0}
    m_RemovedComponents: []
  m_SourcePrefab: {fileID: 100100000, guid: 8ee62f9f21f8a2b479defcf3f0cb7450, type: 3}
--- !u!1 &1948084522200941936 stripped
GameObject:
  m_CorrespondingSourceObject: {fileID: 1842693022419666, guid: 8ee62f9f21f8a2b479defcf3f0cb7450,
    type: 3}
  m_PrefabInstance: {fileID: 1949626970097668002}
  m_PrefabAsset: {fileID: 0}
