{"_id":{"$numberInt":"1"},"Male":{"Skin":{"$numberInt":"10"},"Colors":{"_t":"UInt32[]","_v":[{"$numberInt":"16765564"},{"$numberInt":"7098157"},{"$numberInt":"15972912"},{"$numberInt":"5468254"},{"$numberInt":"7098157"}]},"Scale":{"$numberInt":"135"},"Heads":[{"_id":{"$numberInt":"1"},"Skin":{"$numberInt":"2012"}},{"_id":{"$numberInt":"2"},"Skin":{"$numberInt":"2013"}},{"_id":{"$numberInt":"3"},"Skin":{"$numberInt":"2014"}},{"_id":{"$numberInt":"4"},"Skin":{"$numberInt":"2015"}},{"_id":{"$numberInt":"5"},"Skin":{"$numberInt":"2016"}},{"_id":{"$numberInt":"6"},"Skin":{"$numberInt":"2017"}},{"_id":{"$numberInt":"7"},"Skin":{"$numberInt":"2018"}},{"_id":{"$numberInt":"8"},"Skin":{"$numberInt":"2019"}}]},"Female":{"Skin":{"$numberInt":"11"},"Colors":{"_t":"UInt32[]","_v":[{"$numberInt":"16103775"},{"$numberInt":"6833184"},{"$numberInt":"13661190"},{"$numberInt":"13661190"},{"$numberInt":"6963462"}]},"Scale":{"$numberInt":"125"},"Heads":[{"_id":{"$numberInt":"9"},"Skin":{"$numberInt":"2020"}},{"_id":{"$numberInt":"10"},"Skin":{"$numberInt":"2021"}},{"_id":{"$numberInt":"11"},"Skin":{"$numberInt":"2022"}},{"_id":{"$numberInt":"12"},"Skin":{"$numberInt":"2023"}},{"_id":{"$numberInt":"13"},"Skin":{"$numberInt":"2024"}},{"_id":{"$numberInt":"14"},"Skin":{"$numberInt":"2025"}},{"_id":{"$numberInt":"15"},"Skin":{"$numberInt":"2026"}},{"_id":{"$numberInt":"16"},"Skin":{"$numberInt":"2027"}}]}}
{"_id":{"$numberInt":"2"},"Male":{"Skin":{"$numberInt":"20"},"Colors":{"_t":"UInt32[]","_v":[{"$numberInt":"15973470"},{"$numberInt":"16777166"},{"$numberInt":"4836573"},{"$numberInt":"2827027"},{"$numberInt":"16761904"}]},"Scale":{"$numberInt":"130"},"Heads":[{"_id":{"$numberInt":"17"},"Skin":{"$numberInt":"2028"}},{"_id":{"$numberInt":"18"},"Skin":{"$numberInt":"2029"}},{"_id":{"$numberInt":"19"},"Skin":{"$numberInt":"2030"}},{"_id":{"$numberInt":"20"},"Skin":{"$numberInt":"2031"}},{"_id":{"$numberInt":"21"},"Skin":{"$numberInt":"2032"}},{"_id":{"$numberInt":"22"},"Skin":{"$numberInt":"2033"}},{"_id":{"$numberInt":"23"},"Skin":{"$numberInt":"2034"}},{"_id":{"$numberInt":"24"},"Skin":{"$numberInt":"2035"}}]},"Female":{"Skin":{"$numberInt":"21"},"Colors":{"_t":"UInt32[]","_v":[{"$numberInt":"16759376"},{"$numberInt":"16777164"},{"$numberInt":"2726594"},{"$numberInt":"2827027"},{"$numberInt":"2726594"}]},"Scale":{"$numberInt":"125"},"Heads":[{"_id":{"$numberInt":"25"},"Skin":{"$numberInt":"2036"}},{"_id":{"$numberInt":"26"},"Skin":{"$numberInt":"2037"}},{"_id":{"$numberInt":"27"},"Skin":{"$numberInt":"2038"}},{"_id":{"$numberInt":"28"},"Skin":{"$numberInt":"2039"}},{"_id":{"$numberInt":"29"},"Skin":{"$numberInt":"2040"}},{"_id":{"$numberInt":"30"},"Skin":{"$numberInt":"2041"}},{"_id":{"$numberInt":"31"},"Skin":{"$numberInt":"2042"}},{"_id":{"$numberInt":"32"},"Skin":{"$numberInt":"2043"}}]}}
{"_id":{"$numberInt":"3"},"Male":{"Skin":{"$numberInt":"30"},"Colors":{"_t":"UInt32[]","_v":[{"$numberInt":"15973470"},{"$numberInt":"16777166"},{"$numberInt":"4404257"},{"$numberInt":"16767286"},{"$numberInt":"10904329"}]},"Scale":{"$numberInt":"120"},"Heads":[{"_id":{"$numberInt":"33"},"Skin":{"$numberInt":"2044"}},{"_id":{"$numberInt":"34"},"Skin":{"$numberInt":"2045"}},{"_id":{"$numberInt":"35"},"Skin":{"$numberInt":"2046"}},{"_id":{"$numberInt":"36"},"Skin":{"$numberInt":"2047"}},{"_id":{"$numberInt":"37"},"Skin":{"$numberInt":"2048"}},{"_id":{"$numberInt":"38"},"Skin":{"$numberInt":"2049"}},{"_id":{"$numberInt":"39"},"Skin":{"$numberInt":"2050"}},{"_id":{"$numberInt":"40"},"Skin":{"$numberInt":"2051"}}]},"Female":{"Skin":{"$numberInt":"31"},"Colors":{"_t":"UInt32[]","_v":[{"$numberInt":"15384674"},{"$numberInt":"15982756"},{"$numberInt":"4404257"},{"$numberInt":"16777164"},{"$numberInt":"11373881"}]},"Scale":{"$numberInt":"95"},"Heads":[{"_id":{"$numberInt":"41"},"Skin":{"$numberInt":"2052"}},{"_id":{"$numberInt":"42"},"Skin":{"$numberInt":"2053"}},{"_id":{"$numberInt":"43"},"Skin":{"$numberInt":"2054"}},{"_id":{"$numberInt":"44"},"Skin":{"$numberInt":"2055"}},{"_id":{"$numberInt":"45"},"Skin":{"$numberInt":"2056"}},{"_id":{"$numberInt":"46"},"Skin":{"$numberInt":"2057"}},{"_id":{"$numberInt":"47"},"Skin":{"$numberInt":"2058"}},{"_id":{"$numberInt":"48"},"Skin":{"$numberInt":"2059"}}]}}
{"_id":{"$numberInt":"4"},"Male":{"Skin":{"$numberInt":"40"},"Colors":{"_t":"UInt32[]","_v":[{"$numberInt":"15919294"},{"$numberInt":"3101814"},{"$numberInt":"3101814"},{"$numberInt":"3101814"},{"$numberInt":"8748628"}]},"Scale":{"$numberInt":"140"},"Heads":[{"_id":{"$numberInt":"49"},"Skin":{"$numberInt":"2060"}},{"_id":{"$numberInt":"50"},"Skin":{"$numberInt":"2061"}},{"_id":{"$numberInt":"51"},"Skin":{"$numberInt":"2062"}},{"_id":{"$numberInt":"52"},"Skin":{"$numberInt":"2063"}},{"_id":{"$numberInt":"53"},"Skin":{"$numberInt":"2064"}},{"_id":{"$numberInt":"54"},"Skin":{"$numberInt":"2065"}},{"_id":{"$numberInt":"55"},"Skin":{"$numberInt":"2066"}},{"_id":{"$numberInt":"56"},"Skin":{"$numberInt":"2067"}}]},"Female":{"Skin":{"$numberInt":"41"},"Colors":{"_t":"UInt32[]","_v":[{"$numberInt":"15384674"},{"$numberInt":"16777198"},{"$numberInt":"4157854"},{"$numberInt":"4157854"},{"$numberInt":"14872505"}]},"Scale":{"$numberInt":"155"},"Heads":[{"_id":{"$numberInt":"57"},"Skin":{"$numberInt":"2068"}},{"_id":{"$numberInt":"58"},"Skin":{"$numberInt":"2069"}},{"_id":{"$numberInt":"59"},"Skin":{"$numberInt":"2070"}},{"_id":{"$numberInt":"60"},"Skin":{"$numberInt":"2071"}},{"_id":{"$numberInt":"61"},"Skin":{"$numberInt":"2072"}},{"_id":{"$numberInt":"62"},"Skin":{"$numberInt":"2073"}},{"_id":{"$numberInt":"63"},"Skin":{"$numberInt":"2074"}},{"_id":{"$numberInt":"64"},"Skin":{"$numberInt":"2075"}}]}}
{"_id":{"$numberInt":"5"},"Male":{"Skin":{"$numberInt":"50"},"Colors":{"_t":"UInt32[]","_v":[{"$numberInt":"7957320"},{"$numberInt":"6178082"},{"$numberInt":"2775654"},{"$numberInt":"14523954"},{"$numberInt":"4336658"}]},"Scale":{"$numberInt":"110"},"Heads":[{"_id":{"$numberInt":"65"},"Skin":{"$numberInt":"2076"}},{"_id":{"$numberInt":"66"},"Skin":{"$numberInt":"2077"}},{"_id":{"$numberInt":"67"},"Skin":{"$numberInt":"2078"}},{"_id":{"$numberInt":"68"},"Skin":{"$numberInt":"2079"}},{"_id":{"$numberInt":"69"},"Skin":{"$numberInt":"2080"}},{"_id":{"$numberInt":"70"},"Skin":{"$numberInt":"2081"}},{"_id":{"$numberInt":"71"},"Skin":{"$numberInt":"2082"}},{"_id":{"$numberInt":"72"},"Skin":{"$numberInt":"2083"}}]},"Female":{"Skin":{"$numberInt":"51"},"Colors":{"_t":"UInt32[]","_v":[{"$numberInt":"7957320"},{"$numberInt":"16777166"},{"$numberInt":"2512998"},{"$numberInt":"13945509"},{"$numberInt":"2512998"}]},"Scale":{"$numberInt":"110"},"Heads":[{"_id":{"$numberInt":"73"},"Skin":{"$numberInt":"2084"}},{"_id":{"$numberInt":"74"},"Skin":{"$numberInt":"2085"}},{"_id":{"$numberInt":"75"},"Skin":{"$numberInt":"2086"}},{"_id":{"$numberInt":"76"},"Skin":{"$numberInt":"2087"}},{"_id":{"$numberInt":"77"},"Skin":{"$numberInt":"2088"}},{"_id":{"$numberInt":"78"},"Skin":{"$numberInt":"2089"}},{"_id":{"$numberInt":"79"},"Skin":{"$numberInt":"2090"}},{"_id":{"$numberInt":"80"},"Skin":{"$numberInt":"2091"}}]}}
{"_id":{"$numberInt":"6"},"Male":{"Skin":{"$numberInt":"60"},"Colors":{"_t":"UInt32[]","_v":[{"$numberInt":"16380634"},{"$numberInt":"13726012"},{"$numberInt":"16735778"},{"$numberInt":"2786186"},{"$numberInt":"16761904"}]},"Scale":{"$numberInt":"150"},"Heads":[{"_id":{"$numberInt":"81"},"Skin":{"$numberInt":"2092"}},{"_id":{"$numberInt":"82"},"Skin":{"$numberInt":"2093"}},{"_id":{"$numberInt":"83"},"Skin":{"$numberInt":"2094"}},{"_id":{"$numberInt":"84"},"Skin":{"$numberInt":"2095"}},{"_id":{"$numberInt":"85"},"Skin":{"$numberInt":"2096"}},{"_id":{"$numberInt":"86"},"Skin":{"$numberInt":"2097"}},{"_id":{"$numberInt":"87"},"Skin":{"$numberInt":"2098"}},{"_id":{"$numberInt":"88"},"Skin":{"$numberInt":"2099"}}]},"Female":{"Skin":{"$numberInt":"61"},"Colors":{"_t":"UInt32[]","_v":[{"$numberInt":"16380634"},{"$numberInt":"14378769"},{"$numberInt":"14568735"},{"$numberInt":"13201181"},{"$numberInt":"2057046"}]},"Scale":{"$numberInt":"150"},"Heads":[{"_id":{"$numberInt":"89"},"Skin":{"$numberInt":"2100"}},{"_id":{"$numberInt":"90"},"Skin":{"$numberInt":"2101"}},{"_id":{"$numberInt":"91"},"Skin":{"$numberInt":"2102"}},{"_id":{"$numberInt":"92"},"Skin":{"$numberInt":"2103"}},{"_id":{"$numberInt":"93"},"Skin":{"$numberInt":"2104"}},{"_id":{"$numberInt":"94"},"Skin":{"$numberInt":"2105"}},{"_id":{"$numberInt":"95"},"Skin":{"$numberInt":"2106"}},{"_id":{"$numberInt":"96"},"Skin":{"$numberInt":"2107"}}]}}
{"_id":{"$numberInt":"7"},"Male":{"Skin":{"$numberInt":"70"},"Colors":{"_t":"UInt32[]","_v":[{"$numberInt":"16765564"},{"$numberInt":"7360545"},{"$numberInt":"14453532"},{"$numberInt":"6048816"},{"$numberInt":"4734007"}]},"Scale":{"$numberInt":"110"},"Heads":[{"_id":{"$numberInt":"97"},"Skin":{"$numberInt":"2108"}},{"_id":{"$numberInt":"98"},"Skin":{"$numberInt":"2109"}},{"_id":{"$numberInt":"99"},"Skin":{"$numberInt":"2110"}},{"_id":{"$numberInt":"100"},"Skin":{"$numberInt":"2111"}},{"_id":{"$numberInt":"101"},"Skin":{"$numberInt":"2112"}},{"_id":{"$numberInt":"102"},"Skin":{"$numberInt":"2113"}},{"_id":{"$numberInt":"103"},"Skin":{"$numberInt":"2114"}},{"_id":{"$numberInt":"104"},"Skin":{"$numberInt":"2115"}}]},"Female":{"Skin":{"$numberInt":"71"},"Colors":{"_t":"UInt32[]","_v":[{"$numberInt":"14785337"},{"$numberInt":"16707772"},{"$numberInt":"16707772"},{"$numberInt":"11941144"},{"$numberInt":"15388778"}]},"Scale":{"$numberInt":"115"},"Heads":[{"_id":{"$numberInt":"105"},"Skin":{"$numberInt":"2116"}},{"_id":{"$numberInt":"106"},"Skin":{"$numberInt":"2117"}},{"_id":{"$numberInt":"107"},"Skin":{"$numberInt":"2118"}},{"_id":{"$numberInt":"108"},"Skin":{"$numberInt":"2119"}},{"_id":{"$numberInt":"109"},"Skin":{"$numberInt":"2120"}},{"_id":{"$numberInt":"110"},"Skin":{"$numberInt":"2121"}},{"_id":{"$numberInt":"111"},"Skin":{"$numberInt":"2122"}},{"_id":{"$numberInt":"112"},"Skin":{"$numberInt":"2123"}}]}}
{"_id":{"$numberInt":"8"},"Male":{"Skin":{"$numberInt":"80"},"Colors":{"_t":"UInt32[]","_v":[{"$numberInt":"16765564"},{"$numberInt":"16355883"},{"$numberInt":"16777185"},{"$numberInt":"2910064"},{"$numberInt":"14561799"}]},"Scale":{"$numberInt":"140"},"Heads":[{"_id":{"$numberInt":"113"},"Skin":{"$numberInt":"2124"}},{"_id":{"$numberInt":"114"},"Skin":{"$numberInt":"2125"}},{"_id":{"$numberInt":"115"},"Skin":{"$numberInt":"2126"}},{"_id":{"$numberInt":"116"},"Skin":{"$numberInt":"2127"}},{"_id":{"$numberInt":"117"},"Skin":{"$numberInt":"2128"}},{"_id":{"$numberInt":"118"},"Skin":{"$numberInt":"2129"}},{"_id":{"$numberInt":"119"},"Skin":{"$numberInt":"2130"}},{"_id":{"$numberInt":"120"},"Skin":{"$numberInt":"2131"}}]},"Female":{"Skin":{"$numberInt":"81"},"Colors":{"_t":"UInt32[]","_v":[{"$numberInt":"16103775"},{"$numberInt":"15430419"},{"$numberInt":"16777185"},{"$numberInt":"14432786"},{"$numberInt":"14432786"}]},"Scale":{"$numberInt":"140"},"Heads":[{"_id":{"$numberInt":"121"},"Skin":{"$numberInt":"2132"}},{"_id":{"$numberInt":"122"},"Skin":{"$numberInt":"2133"}},{"_id":{"$numberInt":"123"},"Skin":{"$numberInt":"2134"}},{"_id":{"$numberInt":"124"},"Skin":{"$numberInt":"2135"}},{"_id":{"$numberInt":"125"},"Skin":{"$numberInt":"2136"}},{"_id":{"$numberInt":"126"},"Skin":{"$numberInt":"2137"}},{"_id":{"$numberInt":"127"},"Skin":{"$numberInt":"2138"}},{"_id":{"$numberInt":"128"},"Skin":{"$numberInt":"2139"}}]}}
{"_id":{"$numberInt":"9"},"Male":{"Skin":{"$numberInt":"90"},"Colors":{"_t":"UInt32[]","_v":[{"$numberInt":"16762983"},{"$numberInt":"14774542"},{"$numberInt":"5792768"},{"$numberInt":"5845776"},{"$numberInt":"16422159"}]},"Scale":{"$numberInt":"140"},"Heads":[{"_id":{"$numberInt":"129"},"Skin":{"$numberInt":"2140"}},{"_id":{"$numberInt":"130"},"Skin":{"$numberInt":"2141"}},{"_id":{"$numberInt":"131"},"Skin":{"$numberInt":"2142"}},{"_id":{"$numberInt":"132"},"Skin":{"$numberInt":"2143"}},{"_id":{"$numberInt":"133"},"Skin":{"$numberInt":"2144"}},{"_id":{"$numberInt":"134"},"Skin":{"$numberInt":"2145"}},{"_id":{"$numberInt":"135"},"Skin":{"$numberInt":"2146"}},{"_id":{"$numberInt":"136"},"Skin":{"$numberInt":"2147"}}]},"Female":{"Skin":{"$numberInt":"91"},"Colors":{"_t":"UInt32[]","_v":[{"$numberInt":"16761703"},{"$numberInt":"14775312"},{"$numberInt":"8091904"},{"$numberInt":"14053895"},{"$numberInt":"6963462"}]},"Scale":{"$numberInt":"135"},"Heads":[{"_id":{"$numberInt":"137"},"Skin":{"$numberInt":"2148"}},{"_id":{"$numberInt":"138"},"Skin":{"$numberInt":"2149"}},{"_id":{"$numberInt":"139"},"Skin":{"$numberInt":"2150"}},{"_id":{"$numberInt":"140"},"Skin":{"$numberInt":"2151"}},{"_id":{"$numberInt":"141"},"Skin":{"$numberInt":"2152"}},{"_id":{"$numberInt":"142"},"Skin":{"$numberInt":"2153"}},{"_id":{"$numberInt":"143"},"Skin":{"$numberInt":"2154"}},{"_id":{"$numberInt":"144"},"Skin":{"$numberInt":"2155"}}]}}
{"_id":{"$numberInt":"10"},"Male":{"Skin":{"$numberInt":"100"},"Colors":{"_t":"UInt32[]","_v":[{"$numberInt":"8537887"},{"$numberInt":"8164099"},{"$numberInt":"14402669"},{"$numberInt":"14402669"},{"$numberInt":"11960892"}]},"Scale":{"$numberInt":"150"},"Heads":[{"_id":{"$numberInt":"145"},"Skin":{"$numberInt":"2156"}},{"_id":{"$numberInt":"146"},"Skin":{"$numberInt":"2157"}},{"_id":{"$numberInt":"147"},"Skin":{"$numberInt":"2158"}},{"_id":{"$numberInt":"148"},"Skin":{"$numberInt":"2159"}},{"_id":{"$numberInt":"149"},"Skin":{"$numberInt":"2160"}},{"_id":{"$numberInt":"150"},"Skin":{"$numberInt":"2161"}},{"_id":{"$numberInt":"151"},"Skin":{"$numberInt":"2162"}},{"_id":{"$numberInt":"152"},"Skin":{"$numberInt":"2163"}}]},"Female":{"Skin":{"$numberInt":"101"},"Colors":{"_t":"UInt32[]","_v":[{"$numberInt":"8537887"},{"$numberInt":"8557826"},{"$numberInt":"16114596"},{"$numberInt":"16114596"},{"$numberInt":"15128478"}]},"Scale":{"$numberInt":"145"},"Heads":[{"_id":{"$numberInt":"153"},"Skin":{"$numberInt":"2164"}},{"_id":{"$numberInt":"154"},"Skin":{"$numberInt":"2165"}},{"_id":{"$numberInt":"155"},"Skin":{"$numberInt":"2166"}},{"_id":{"$numberInt":"156"},"Skin":{"$numberInt":"2167"}},{"_id":{"$numberInt":"157"},"Skin":{"$numberInt":"2168"}},{"_id":{"$numberInt":"158"},"Skin":{"$numberInt":"2169"}},{"_id":{"$numberInt":"159"},"Skin":{"$numberInt":"2170"}},{"_id":{"$numberInt":"160"},"Skin":{"$numberInt":"2171"}}]}}
{"_id":{"$numberInt":"11"},"Male":{"Skin":{"$numberInt":"110"},"Colors":{"_t":"UInt32[]","_v":[{"$numberInt":"16765564"},{"$numberInt":"16753434"},{"$numberInt":"9809704"},{"$numberInt":"5664802"},{"$numberInt":"16771138"}]},"Scale":{"$numberInt":"145"},"Heads":[{"_id":{"$numberInt":"161"},"Skin":{"$numberInt":"2172"}},{"_id":{"$numberInt":"162"},"Skin":{"$numberInt":"2173"}},{"_id":{"$numberInt":"163"},"Skin":{"$numberInt":"2174"}},{"_id":{"$numberInt":"164"},"Skin":{"$numberInt":"2175"}},{"_id":{"$numberInt":"165"},"Skin":{"$numberInt":"2176"}},{"_id":{"$numberInt":"166"},"Skin":{"$numberInt":"2177"}},{"_id":{"$numberInt":"167"},"Skin":{"$numberInt":"2178"}},{"_id":{"$numberInt":"168"},"Skin":{"$numberInt":"2179"}}]},"Female":{"Skin":{"$numberInt":"111"},"Colors":{"_t":"UInt32[]","_v":[{"$numberInt":"16565105"},{"$numberInt":"16753434"},{"$numberInt":"5992482"},{"$numberInt":"6003530"},{"$numberInt":"16769340"}]},"Scale":{"$numberInt":"140"},"Heads":[{"_id":{"$numberInt":"169"},"Skin":{"$numberInt":"2180"}},{"_id":{"$numberInt":"170"},"Skin":{"$numberInt":"2181"}},{"_id":{"$numberInt":"171"},"Skin":{"$numberInt":"2182"}},{"_id":{"$numberInt":"172"},"Skin":{"$numberInt":"2183"}},{"_id":{"$numberInt":"173"},"Skin":{"$numberInt":"2184"}},{"_id":{"$numberInt":"174"},"Skin":{"$numberInt":"2185"}},{"_id":{"$numberInt":"175"},"Skin":{"$numberInt":"2186"}},{"_id":{"$numberInt":"176"},"Skin":{"$numberInt":"2187"}}]}}
{"_id":{"$numberInt":"12"},"Male":{"Skin":{"$numberInt":"120"},"Colors":{"_t":"UInt32[]","_v":[{"$numberInt":"15457984"},{"$numberInt":"5197108"},{"$numberInt":"7673110"},{"$numberInt":"15457984"},{"$numberInt":"4015915"}]},"Scale":{"$numberInt":"160"},"Heads":[{"_id":{"$numberInt":"177"},"Skin":{"$numberInt":"2188"}},{"_id":{"$numberInt":"178"},"Skin":{"$numberInt":"2189"}},{"_id":{"$numberInt":"179"},"Skin":{"$numberInt":"2190"}},{"_id":{"$numberInt":"180"},"Skin":{"$numberInt":"2191"}},{"_id":{"$numberInt":"181"},"Skin":{"$numberInt":"2192"}},{"_id":{"$numberInt":"182"},"Skin":{"$numberInt":"2193"}},{"_id":{"$numberInt":"183"},"Skin":{"$numberInt":"2194"}},{"_id":{"$numberInt":"184"},"Skin":{"$numberInt":"2195"}}]},"Female":{"Skin":{"$numberInt":"121"},"Colors":{"_t":"UInt32[]","_v":[{"$numberInt":"16380634"},{"$numberInt":"4538925"},{"$numberInt":"9711889"},{"$numberInt":"15457984"},{"$numberInt":"9711889"}]},"Scale":{"$numberInt":"145"},"Heads":[{"_id":{"$numberInt":"185"},"Skin":{"$numberInt":"2196"}},{"_id":{"$numberInt":"186"},"Skin":{"$numberInt":"2197"}},{"_id":{"$numberInt":"187"},"Skin":{"$numberInt":"2198"}},{"_id":{"$numberInt":"188"},"Skin":{"$numberInt":"2199"}},{"_id":{"$numberInt":"189"},"Skin":{"$numberInt":"2200"}},{"_id":{"$numberInt":"190"},"Skin":{"$numberInt":"2201"}},{"_id":{"$numberInt":"191"},"Skin":{"$numberInt":"2202"}},{"_id":{"$numberInt":"192"},"Skin":{"$numberInt":"2203"}}]}}
{"_id":{"$numberInt":"13"},"Male":{"Skin":{"$numberInt":"1405"},"Colors":{"_t":"UInt32[]","_v":[{"$numberInt":"14785337"},{"$numberInt":"2567713"},{"$numberInt":"2567713"},{"$numberInt":"3419419"},{"$numberInt":"16777164"}]},"Scale":{"$numberInt":"160"},"Heads":[{"_id":{"$numberInt":"193"},"Skin":{"$numberInt":"2204"}},{"_id":{"$numberInt":"194"},"Skin":{"$numberInt":"2205"}},{"_id":{"$numberInt":"195"},"Skin":{"$numberInt":"2206"}},{"_id":{"$numberInt":"196"},"Skin":{"$numberInt":"2207"}},{"_id":{"$numberInt":"197"},"Skin":{"$numberInt":"2208"}},{"_id":{"$numberInt":"198"},"Skin":{"$numberInt":"2209"}},{"_id":{"$numberInt":"199"},"Skin":{"$numberInt":"2210"}},{"_id":{"$numberInt":"200"},"Skin":{"$numberInt":"2211"}}]},"Female":{"Skin":{"$numberInt":"1407"},"Colors":{"_t":"UInt32[]","_v":[{"$numberInt":"14785337"},{"$numberInt":"677462"},{"$numberInt":"2567713"},{"$numberInt":"3419419"},{"$numberInt":"3419419"}]},"Scale":{"$numberInt":"155"},"Heads":[{"_id":{"$numberInt":"201"},"Skin":{"$numberInt":"2212"}},{"_id":{"$numberInt":"202"},"Skin":{"$numberInt":"2213"}},{"_id":{"$numberInt":"203"},"Skin":{"$numberInt":"2214"}},{"_id":{"$numberInt":"204"},"Skin":{"$numberInt":"2215"}},{"_id":{"$numberInt":"205"},"Skin":{"$numberInt":"2216"}},{"_id":{"$numberInt":"206"},"Skin":{"$numberInt":"2217"}},{"_id":{"$numberInt":"207"},"Skin":{"$numberInt":"2218"}},{"_id":{"$numberInt":"208"},"Skin":{"$numberInt":"2219"}}]}}
{"_id":{"$numberInt":"14"},"Male":{"Skin":{"$numberInt":"1437"},"Colors":{"_t":"UInt32[]","_v":[{"$numberInt":"16761703"},{"$numberInt":"14428465"},{"$numberInt":"4863523"},{"$numberInt":"1855824"},{"$numberInt":"15262931"}]},"Scale":{"$numberInt":"150"},"Heads":[{"_id":{"$numberInt":"209"},"Skin":{"$numberInt":"2220"}},{"_id":{"$numberInt":"210"},"Skin":{"$numberInt":"2221"}},{"_id":{"$numberInt":"211"},"Skin":{"$numberInt":"2222"}},{"_id":{"$numberInt":"212"},"Skin":{"$numberInt":"2223"}},{"_id":{"$numberInt":"213"},"Skin":{"$numberInt":"2224"}},{"_id":{"$numberInt":"214"},"Skin":{"$numberInt":"2225"}},{"_id":{"$numberInt":"215"},"Skin":{"$numberInt":"2226"}},{"_id":{"$numberInt":"216"},"Skin":{"$numberInt":"2227"}}]},"Female":{"Skin":{"$numberInt":"1438"},"Colors":{"_t":"UInt32[]","_v":[{"$numberInt":"16761703"},{"$numberInt":"14428465"},{"$numberInt":"4863523"},{"$numberInt":"1855824"},{"$numberInt":"15262931"}]},"Scale":{"$numberInt":"145"},"Heads":[{"_id":{"$numberInt":"217"},"Skin":{"$numberInt":"2228"}},{"_id":{"$numberInt":"218"},"Skin":{"$numberInt":"2229"}},{"_id":{"$numberInt":"219"},"Skin":{"$numberInt":"2230"}},{"_id":{"$numberInt":"220"},"Skin":{"$numberInt":"2231"}},{"_id":{"$numberInt":"221"},"Skin":{"$numberInt":"2232"}},{"_id":{"$numberInt":"222"},"Skin":{"$numberInt":"2233"}},{"_id":{"$numberInt":"223"},"Skin":{"$numberInt":"2234"}},{"_id":{"$numberInt":"224"},"Skin":{"$numberInt":"2235"}}]}}
{"_id":{"$numberInt":"15"},"Male":{"Skin":{"$numberInt":"1663"},"Colors":{"_t":"UInt32[]","_v":[{"$numberInt":"16699794"},{"$numberInt":"16511423"},{"$numberInt":"3417882"},{"$numberInt":"16377759"},{"$numberInt":"11242064"}]},"Scale":{"$numberInt":"160"},"Heads":[{"_id":{"$numberInt":"225"},"Skin":{"$numberInt":"2236"}},{"_id":{"$numberInt":"226"},"Skin":{"$numberInt":"2237"}},{"_id":{"$numberInt":"227"},"Skin":{"$numberInt":"2238"}},{"_id":{"$numberInt":"228"},"Skin":{"$numberInt":"2239"}},{"_id":{"$numberInt":"229"},"Skin":{"$numberInt":"2240"}},{"_id":{"$numberInt":"230"},"Skin":{"$numberInt":"2241"}},{"_id":{"$numberInt":"231"},"Skin":{"$numberInt":"2242"}},{"_id":{"$numberInt":"232"},"Skin":{"$numberInt":"2243"}}]},"Female":{"Skin":{"$numberInt":"1664"},"Colors":{"_t":"UInt32[]","_v":[{"$numberInt":"16699794"},{"$numberInt":"16511423"},{"$numberInt":"3417882"},{"$numberInt":"16377759"},{"$numberInt":"11242064"}]},"Scale":{"$numberInt":"160"},"Heads":[{"_id":{"$numberInt":"233"},"Skin":{"$numberInt":"2244"}},{"_id":{"$numberInt":"234"},"Skin":{"$numberInt":"2245"}},{"_id":{"$numberInt":"235"},"Skin":{"$numberInt":"2246"}},{"_id":{"$numberInt":"236"},"Skin":{"$numberInt":"2247"}},{"_id":{"$numberInt":"237"},"Skin":{"$numberInt":"2248"}},{"_id":{"$numberInt":"238"},"Skin":{"$numberInt":"2249"}},{"_id":{"$numberInt":"239"},"Skin":{"$numberInt":"2250"}},{"_id":{"$numberInt":"240"},"Skin":{"$numberInt":"2251"}}]}}
{"_id":{"$numberInt":"16"},"Male":{"Skin":{"$numberInt":"3179"},"Colors":{"_t":"UInt32[]","_v":[{"$numberInt":"15066084"},{"$numberInt":"8036512"},{"$numberInt":"10641706"},{"$numberInt":"2722985"},{"$numberInt":"14207124"}]},"Scale":{"$numberInt":"145"},"Heads":[{"_id":{"$numberInt":"241"},"Skin":{"$numberInt":"3183"}},{"_id":{"$numberInt":"242"},"Skin":{"$numberInt":"3184"}},{"_id":{"$numberInt":"243"},"Skin":{"$numberInt":"3185"}},{"_id":{"$numberInt":"244"},"Skin":{"$numberInt":"3186"}},{"_id":{"$numberInt":"245"},"Skin":{"$numberInt":"3187"}},{"_id":{"$numberInt":"246"},"Skin":{"$numberInt":"3188"}},{"_id":{"$numberInt":"247"},"Skin":{"$numberInt":"3189"}},{"_id":{"$numberInt":"248"},"Skin":{"$numberInt":"3190"}}]},"Female":{"Skin":{"$numberInt":"3180"},"Colors":{"_t":"UInt32[]","_v":[{"$numberInt":"15066084"},{"$numberInt":"8036512"},{"$numberInt":"10641706"},{"$numberInt":"2722985"},{"$numberInt":"14207124"}]},"Scale":{"$numberInt":"140"},"Heads":[{"_id":{"$numberInt":"249"},"Skin":{"$numberInt":"3191"}},{"_id":{"$numberInt":"250"},"Skin":{"$numberInt":"3192"}},{"_id":{"$numberInt":"251"},"Skin":{"$numberInt":"3193"}},{"_id":{"$numberInt":"252"},"Skin":{"$numberInt":"3194"}},{"_id":{"$numberInt":"253"},"Skin":{"$numberInt":"3195"}},{"_id":{"$numberInt":"254"},"Skin":{"$numberInt":"3196"}},{"_id":{"$numberInt":"255"},"Skin":{"$numberInt":"3197"}},{"_id":{"$numberInt":"256"},"Skin":{"$numberInt":"3198"}}]}}
{"_id":{"$numberInt":"17"},"Male":{"Skin":{"$numberInt":"3285"},"Colors":{"_t":"UInt32[]","_v":[{"$numberInt":"16378832"},{"$numberInt":"16775898"},{"$numberInt":"2709077"},{"$numberInt":"4492945"},{"$numberInt":"15791081"}]},"Scale":{"$numberInt":"140"},"Heads":[{"_id":{"$numberInt":"257"},"Skin":{"$numberInt":"3289"}},{"_id":{"$numberInt":"258"},"Skin":{"$numberInt":"3290"}},{"_id":{"$numberInt":"259"},"Skin":{"$numberInt":"3291"}},{"_id":{"$numberInt":"260"},"Skin":{"$numberInt":"3292"}},{"_id":{"$numberInt":"261"},"Skin":{"$numberInt":"3293"}},{"_id":{"$numberInt":"262"},"Skin":{"$numberInt":"3294"}},{"_id":{"$numberInt":"263"},"Skin":{"$numberInt":"3295"}},{"_id":{"$numberInt":"264"},"Skin":{"$numberInt":"3296"}}]},"Female":{"Skin":{"$numberInt":"3286"},"Colors":{"_t":"UInt32[]","_v":[{"$numberInt":"16378832"},{"$numberInt":"16775898"},{"$numberInt":"2709077"},{"$numberInt":"4492945"},{"$numberInt":"15791081"}]},"Scale":{"$numberInt":"135"},"Heads":[{"_id":{"$numberInt":"265"},"Skin":{"$numberInt":"3297"}},{"_id":{"$numberInt":"266"},"Skin":{"$numberInt":"3298"}},{"_id":{"$numberInt":"267"},"Skin":{"$numberInt":"3299"}},{"_id":{"$numberInt":"268"},"Skin":{"$numberInt":"3300"}},{"_id":{"$numberInt":"269"},"Skin":{"$numberInt":"3301"}},{"_id":{"$numberInt":"270"},"Skin":{"$numberInt":"3302"}},{"_id":{"$numberInt":"271"},"Skin":{"$numberInt":"3303"}},{"_id":{"$numberInt":"272"},"Skin":{"$numberInt":"3304"}}]}}
{"_id":{"$numberInt":"18"},"Male":{"Skin":{"$numberInt":"3498"},"Colors":{"_t":"UInt32[]","_v":[{"$numberInt":"6247226"},{"$numberInt":"8805673"},{"$numberInt":"11300885"},{"$numberInt":"3551007"},{"$numberInt":"8733459"}]},"Scale":{"$numberInt":"155"},"Heads":[{"_id":{"$numberInt":"273"},"Skin":{"$numberInt":"3502"}},{"_id":{"$numberInt":"285"},"Skin":{"$numberInt":"3503"}},{"_id":{"$numberInt":"286"},"Skin":{"$numberInt":"3504"}},{"_id":{"$numberInt":"287"},"Skin":{"$numberInt":"3505"}},{"_id":{"$numberInt":"288"},"Skin":{"$numberInt":"3506"}},{"_id":{"$numberInt":"289"},"Skin":{"$numberInt":"3507"}},{"_id":{"$numberInt":"290"},"Skin":{"$numberInt":"3508"}},{"_id":{"$numberInt":"291"},"Skin":{"$numberInt":"3509"}}]},"Female":{"Skin":{"$numberInt":"3499"},"Colors":{"_t":"UInt32[]","_v":[{"$numberInt":"9795660"},{"$numberInt":"14196511"},{"$numberInt":"11300885"},{"$numberInt":"3551007"},{"$numberInt":"13395490"}]},"Scale":{"$numberInt":"145"},"Heads":[{"_id":{"$numberInt":"275"},"Skin":{"$numberInt":"3510"}},{"_id":{"$numberInt":"276"},"Skin":{"$numberInt":"3511"}},{"_id":{"$numberInt":"277"},"Skin":{"$numberInt":"3512"}},{"_id":{"$numberInt":"280"},"Skin":{"$numberInt":"3513"}},{"_id":{"$numberInt":"281"},"Skin":{"$numberInt":"3514"}},{"_id":{"$numberInt":"282"},"Skin":{"$numberInt":"3515"}},{"_id":{"$numberInt":"283"},"Skin":{"$numberInt":"3516"}},{"_id":{"$numberInt":"284"},"Skin":{"$numberInt":"3517"}}]}}
