3 0.0200256 0.00835087
7 0.0100688 0.0039228
15 0.00775073 0.00296638
31 0.00514118 0.00178793
63 0.00263243 0.00087103
127 0.00169875 0.000603884
255 0.00202617 0.000292676
511 0.000691056 0.000132272
1023 0.000446125 9.49064e-05
2047 4.28868e-05 4.9532e-05
4095 0.000311202 2.67795e-05
8191 5.89698e-05 1.52543e-05
16383 0.000184565 9.2339e-06
32767 0.00011324 2.54695e-06
