3 0.0196092 0.00835087 0.00104133 0.00104133 0.00104178 2.64683e-06
7 0.0134998 0.0039228 0.000316855 0.000316855 0.000317469 1.4698e-09
15 0.00445705 0.00296638 8.63214e-05 8.63214e-05 8.67033e-05 3.82217e-13
31 0.000661891 0.00178793 2.24717e-05 2.24717e-05 2.26426e-05 1.91369e-15
63 0.00237664 0.00087103 5.72953e-06 5.72953e-06 5.7941e-06 3.65342e-15
