<?xml version="1.0" encoding="UTF-8"?>
<svg width="24px" height="24px" viewBox="0 0 24 24" version="1.1" xmlns="http://www.w3.org/2000/svg" xmlns:xlink="http://www.w3.org/1999/xlink">
    <title>12D7D252-047C-4018-A121-FB5B783745E5@1x</title>
    <g id="Page-1" stroke="none" stroke-width="1" fill="none" fill-rule="evenodd">
        <g id="Login---filled" transform="translate(-465.000000, -456.000000)">
            <g id="ic_hide_password" transform="translate(465.000000, 456.000000)">
                <g id="ic_eye_hide" fill-rule="nonzero">
                    <g id="001-eye" transform="translate(4.000000, 7.000000)">
                        <path d="M15.8805313,3.90609375 C15.7377188,3.74678125 12.3025625,0 8,0 C3.6974375,0 0.2623125,3.74678125 0.11946875,3.90609375 C-0.03984375,4.08415625 -0.03984375,4.35334375 0.11946875,4.53140625 C0.2623125,4.69071875 3.6975,8.4375 8,8.4375 C12.3025,8.4375 15.7376875,4.69071875 15.8805313,4.53140625 C16.0398125,4.35334375 16.0398125,4.08415625 15.8805313,3.90609375 Z M8,7.5 C6.19090625,7.5 4.71875,6.02784375 4.71875,4.21875 C4.71875,2.40965625 6.19090625,0.9375 8,0.9375 C9.80909375,0.9375 11.28125,2.40965625 11.28125,4.21875 C11.28125,6.02784375 9.80909375,7.5 8,7.5 Z" id="Shape" fill="#043B89"></path>
                        <path d="M8.46875,3.28125 C8.46875,2.8096875 8.70284375,2.39484375 9.05896875,2.1396875 C8.73940625,1.97609375 8.38296875,1.875 8,1.875 C6.70771875,1.875 5.65625,2.92646875 5.65625,4.21875 C5.65625,5.51103125 6.70771875,6.5625 8,6.5625 C9.157,6.5625 10.114625,5.7176875 10.3038125,4.6138125 C9.359875,4.91771875 8.46875,4.2038125 8.46875,3.28125 Z" id="Path" fill="#043A86"></path>
                    </g>
                </g>
                <g id="Group" transform="translate(12.000000, 12.000000) rotate(45.000000) translate(-12.000000, -12.000000) translate(11.000000, 3.000000)">
                    <rect id="Rectangle" fill="#043B89" x="0" y="0" width="1" height="18"></rect>
                    <rect id="Rectangle-Copy" fill="#F3F3F3" x="1" y="0" width="1" height="18"></rect>
                </g>
            </g>
        </g>
    </g>
</svg>