EESchema Schematic File Version 4
EELAYER 30 0
EELAYER END
$Descr A4 11693 8268
encoding utf-8
Sheet 1 1
Title "Dual Channel RF Power Meter"
Date "2020-10-26"
Rev "1.0"
Comp "Dyadic Pty Ltd"
Comment1 ""
Comment2 ""
Comment3 ""
Comment4 ""
$EndDescr
$Comp
L RF_Blocks:USBCtl U3
U 1 1 5F973732
P 4775 4300
F 0 "U3" H 4775 5215 50  0000 C CNN
F 1 "USBCtl" H 4775 5124 50  0000 C CNN
F 2 "" H 4775 4300 50  0001 C CNN
F 3 "" H 4775 4300 50  0001 C CNN
	1    4775 4300
	1    0    0    -1  
$EndComp
$Comp
L RF_Blocks:PowerDetect U1
U 1 1 5F9752A4
P 6975 1350
F 0 "U1" H 6975 1715 50  0000 C CNN
F 1 "PowerDetect" H 6975 1624 50  0000 C CNN
F 2 "" H 7100 1350 50  0001 C CNN
F 3 "" H 7100 1350 50  0001 C CNN
	1    6975 1350
	1    0    0    -1  
$EndComp
$Comp
L RF_Blocks:PowerDetect U2
U 1 1 5F975DCA
P 6975 2600
F 0 "U2" H 6975 2965 50  0000 C CNN
F 1 "PowerDetect" H 6975 2874 50  0000 C CNN
F 2 "" H 7100 2600 50  0001 C CNN
F 3 "" H 7100 2600 50  0001 C CNN
	1    6975 2600
	1    0    0    -1  
$EndComp
Wire Wire Line
	5475 3800 5675 3800
Wire Wire Line
	5675 3800 5675 3000
Wire Wire Line
	5675 1750 6425 1750
Wire Wire Line
	6425 3000 5675 3000
Connection ~ 5675 3000
Wire Wire Line
	5675 3000 5675 2800
Wire Wire Line
	5475 3900 5775 3900
Wire Wire Line
	5775 3900 5775 1550
Wire Wire Line
	5775 1550 6425 1550
Wire Wire Line
	5475 4000 5875 4000
Wire Wire Line
	5875 4000 5875 2900
Wire Wire Line
	5875 1650 6425 1650
NoConn ~ 7525 2600
NoConn ~ 7525 1350
Wire Wire Line
	6425 2900 5875 2900
Connection ~ 5875 2900
Wire Wire Line
	5875 2900 5875 1650
Wire Wire Line
	6425 2800 5675 2800
Connection ~ 5675 2800
Wire Wire Line
	5675 2800 5675 1750
Wire Wire Line
	6425 3100 3850 3100
Wire Wire Line
	3850 3100 3850 4500
Wire Wire Line
	6425 1850 3750 1850
Wire Wire Line
	3750 1850 3750 4400
Wire Wire Line
	4075 4750 3750 4750
Wire Wire Line
	3750 4750 3750 5725
Wire Wire Line
	3750 5725 7900 5725
Wire Wire Line
	7900 5725 7900 3000
Wire Wire Line
	7900 3000 7525 3000
Wire Wire Line
	7525 1750 7900 1750
Wire Wire Line
	7900 1750 7900 3000
Connection ~ 7900 3000
Wire Wire Line
	4075 5050 3850 5050
Wire Wire Line
	3850 5050 3850 5625
Wire Wire Line
	3850 5625 7800 5625
Wire Wire Line
	7800 5625 7800 3100
Wire Wire Line
	7800 3100 7525 3100
Wire Wire Line
	7525 1850 7800 1850
Wire Wire Line
	7800 1850 7800 3100
Connection ~ 7800 3100
NoConn ~ 4075 4950
NoConn ~ 4075 4600
NoConn ~ 4075 4300
NoConn ~ 4075 4200
NoConn ~ 4075 4100
NoConn ~ 4075 4000
NoConn ~ 4075 3900
NoConn ~ 4075 3800
NoConn ~ 4075 3700
NoConn ~ 5475 3700
NoConn ~ 5475 4100
NoConn ~ 5475 4200
NoConn ~ 5475 4300
NoConn ~ 5475 4400
NoConn ~ 5475 4500
NoConn ~ 5475 4600
NoConn ~ 5475 4700
NoConn ~ 5475 4800
$Comp
L Connector:Conn_Coaxial J1
U 1 1 5F98682E
P 2150 1350
F 0 "J1" H 2078 1588 50  0000 C CNN
F 1 "Channel 1" H 2078 1497 50  0000 C CNN
F 2 "" H 2150 1350 50  0001 C CNN
F 3 " ~" H 2150 1350 50  0001 C CNN
	1    2150 1350
	-1   0    0    -1  
$EndComp
$Comp
L Connector:Conn_Coaxial J2
U 1 1 5F987DF0
P 2150 2600
F 0 "J2" H 2078 2838 50  0000 C CNN
F 1 "Channel 0" H 2078 2747 50  0000 C CNN
F 2 "" H 2150 2600 50  0001 C CNN
F 3 " ~" H 2150 2600 50  0001 C CNN
	1    2150 2600
	-1   0    0    -1  
$EndComp
$Comp
L power:GND #PWR03
U 1 1 5F988AB8
P 3850 5950
F 0 "#PWR03" H 3850 5700 50  0001 C CNN
F 1 "GND" H 3855 5777 50  0000 C CNN
F 2 "" H 3850 5950 50  0001 C CNN
F 3 "" H 3850 5950 50  0001 C CNN
	1    3850 5950
	1    0    0    -1  
$EndComp
$Comp
L power:GND #PWR01
U 1 1 5F988EB5
P 2150 1550
F 0 "#PWR01" H 2150 1300 50  0001 C CNN
F 1 "GND" H 2155 1377 50  0000 C CNN
F 2 "" H 2150 1550 50  0001 C CNN
F 3 "" H 2150 1550 50  0001 C CNN
	1    2150 1550
	1    0    0    -1  
$EndComp
$Comp
L power:GND #PWR02
U 1 1 5F98950E
P 2150 2800
F 0 "#PWR02" H 2150 2550 50  0001 C CNN
F 1 "GND" H 2155 2627 50  0000 C CNN
F 2 "" H 2150 2800 50  0001 C CNN
F 3 "" H 2150 2800 50  0001 C CNN
	1    2150 2800
	1    0    0    -1  
$EndComp
Wire Wire Line
	2350 1350 6425 1350
Wire Wire Line
	2350 2600 6425 2600
Wire Wire Line
	3850 5950 3850 5625
Connection ~ 3850 5625
Wire Wire Line
	3750 4400 4075 4400
Wire Wire Line
	3850 4500 4075 4500
$EndSCHEMATC
