EESchema Schematic File Version 4
EELAYER 30 0
EELAYER END
$Descr A3 16535 11693
encoding utf-8
Sheet 1 1
Title "Dual Channel RF Power Meter 2"
Date "2021-04-21"
Rev "1.0"
Comp "Dyadic Pty Ltd"
Comment1 ""
Comment2 ""
Comment3 ""
Comment4 ""
$EndDescr
$Comp
L RF_Blocks:USBCtl U3
U 1 1 5F973732
P 8675 7300
F 0 "U3" H 8675 8215 50  0000 C CNN
F 1 "USBCtl" H 8675 8124 50  0000 C CNN
F 2 "" H 8675 7300 50  0001 C CNN
F 3 "" H 8675 7300 50  0001 C CNN
	1    8675 7300
	1    0    0    -1  
$EndComp
$Comp
L RF_Blocks:PowerDetect U1
U 1 1 5F9752A4
P 10975 2725
F 0 "U1" H 10975 3090 50  0000 C CNN
F 1 "PowerDetect" H 10975 2999 50  0000 C CNN
F 2 "" H 11100 2725 50  0001 C CNN
F 3 "" H 11100 2725 50  0001 C CNN
	1    10975 2725
	1    0    0    -1  
$EndComp
$Comp
L RF_Blocks:PowerDetect U2
U 1 1 5F975DCA
P 10975 4875
F 0 "U2" H 10975 5240 50  0000 C CNN
F 1 "PowerDetect" H 10975 5149 50  0000 C CNN
F 2 "" H 11100 4875 50  0001 C CNN
F 3 "" H 11100 4875 50  0001 C CNN
	1    10975 4875
	1    0    0    -1  
$EndComp
Wire Wire Line
	9375 7000 9775 7000
NoConn ~ 7150 5575
NoConn ~ 7975 7600
NoConn ~ 7975 7200
NoConn ~ 7975 7100
NoConn ~ 7975 7000
NoConn ~ 7975 6900
NoConn ~ 7975 6800
NoConn ~ 7975 6700
NoConn ~ 9375 6700
NoConn ~ 9375 7100
NoConn ~ 9375 7200
NoConn ~ 9375 7300
NoConn ~ 9375 7400
NoConn ~ 9375 7500
NoConn ~ 9375 7600
NoConn ~ 9375 7700
NoConn ~ 9375 7800
$Comp
L Connector:Conn_Coaxial J1
U 1 1 5F98682E
P 3625 3925
F 0 "J1" H 3553 4163 50  0000 C CNN
F 1 "Channel 1 In" H 3553 4072 50  0000 C CNN
F 2 "" H 3625 3925 50  0001 C CNN
F 3 " ~" H 3625 3925 50  0001 C CNN
	1    3625 3925
	-1   0    0    -1  
$EndComp
$Comp
L Connector:Conn_Coaxial J2
U 1 1 5F987DF0
P 3625 1825
F 0 "J2" H 3553 2063 50  0000 C CNN
F 1 "Channel 0 In" H 3553 1972 50  0000 C CNN
F 2 "" H 3625 1825 50  0001 C CNN
F 3 " ~" H 3625 1825 50  0001 C CNN
	1    3625 1825
	-1   0    0    -1  
$EndComp
$Comp
L power:GND #PWR03
U 1 1 5F988AB8
P 7775 8225
F 0 "#PWR03" H 7775 7975 50  0001 C CNN
F 1 "GND" H 7780 8052 50  0000 C CNN
F 2 "" H 7775 8225 50  0001 C CNN
F 3 "" H 7775 8225 50  0001 C CNN
	1    7775 8225
	1    0    0    -1  
$EndComp
$Comp
L power:GND #PWR01
U 1 1 5F988EB5
P 3625 4125
F 0 "#PWR01" H 3625 3875 50  0001 C CNN
F 1 "GND" H 3630 3952 50  0000 C CNN
F 2 "" H 3625 4125 50  0001 C CNN
F 3 "" H 3625 4125 50  0001 C CNN
	1    3625 4125
	1    0    0    -1  
$EndComp
$Comp
L power:GND #PWR02
U 1 1 5F98950E
P 3625 2025
F 0 "#PWR02" H 3625 1775 50  0001 C CNN
F 1 "GND" H 3630 1852 50  0000 C CNN
F 2 "" H 3625 2025 50  0001 C CNN
F 3 "" H 3625 2025 50  0001 C CNN
	1    3625 2025
	1    0    0    -1  
$EndComp
Wire Wire Line
	3825 3925 5900 3925
Wire Wire Line
	3825 1825 5900 1825
Wire Wire Line
	7650 7400 7975 7400
$Comp
L RF_Blocks:StepAtten U5
U 1 1 607F8612
P 8025 2725
F 0 "U5" H 8025 3140 50  0000 C CNN
F 1 "StepAtten" H 8025 3049 50  0000 C CNN
F 2 "" H 8045 2665 50  0001 C CNN
F 3 "" H 8045 2665 50  0001 C CNN
	1    8025 2725
	1    0    0    -1  
$EndComp
$Comp
L RF_Blocks:GainBlk U7
U 1 1 607F8E99
P 8100 4875
F 0 "U7" H 7700 5475 50  0000 L CNN
F 1 "GainBlk" H 7625 5375 50  0000 L CNN
F 2 "" H 8100 4875 50  0001 C CNN
F 3 "" H 8100 4875 50  0001 C CNN
	1    8100 4875
	1    0    0    -1  
$EndComp
$Comp
L RF_Blocks:Coupler U6
U 1 1 607F953B
P 6500 3925
F 0 "U6" H 6500 4340 50  0000 C CNN
F 1 "Coupler" H 6500 4249 50  0000 C CNN
F 2 "" H 5700 4425 50  0001 C CNN
F 3 "" H 5700 4425 50  0001 C CNN
	1    6500 3925
	1    0    0    -1  
$EndComp
$Comp
L RF_Blocks:Coupler U4
U 1 1 607F9D35
P 6500 1825
F 0 "U4" H 6500 2240 50  0000 C CNN
F 1 "Coupler" H 6500 2149 50  0000 C CNN
F 2 "" H 5700 2325 50  0001 C CNN
F 3 "" H 5700 2325 50  0001 C CNN
	1    6500 1825
	1    0    0    -1  
$EndComp
Wire Wire Line
	6500 2275 6500 2725
Wire Wire Line
	6500 2725 7525 2725
Wire Wire Line
	6500 4375 6500 4875
Wire Wire Line
	6500 4875 7400 4875
Wire Wire Line
	8525 2725 10425 2725
NoConn ~ 11525 2725
NoConn ~ 11525 4875
Wire Wire Line
	8800 4875 10425 4875
Wire Wire Line
	10425 2925 9875 2925
Wire Wire Line
	9875 2925 9875 3625
Wire Wire Line
	9875 5075 10425 5075
Wire Wire Line
	10425 3025 9775 3025
Wire Wire Line
	9775 3025 9775 5175
Wire Wire Line
	9775 5175 10425 5175
Wire Wire Line
	10425 3125 9675 3125
Wire Wire Line
	9675 3125 9675 3525
Wire Wire Line
	9675 5275 10425 5275
Wire Wire Line
	7525 3075 7250 3075
Wire Wire Line
	7250 3075 7250 3525
Wire Wire Line
	7250 3525 9675 3525
Connection ~ 9675 3525
Wire Wire Line
	9675 3525 9675 5275
Wire Wire Line
	7525 2975 7150 2975
Wire Wire Line
	7150 2975 7150 3625
Wire Wire Line
	7150 3625 9875 3625
Connection ~ 9875 3625
Wire Wire Line
	9875 3625 9875 5075
$Comp
L Connector:Conn_Coaxial J3
U 1 1 60823BAD
P 12550 1825
F 0 "J3" H 12478 2063 50  0000 C CNN
F 1 "Channel 0 Out" H 12478 1972 50  0000 C CNN
F 2 "" H 12550 1825 50  0001 C CNN
F 3 " ~" H 12550 1825 50  0001 C CNN
	1    12550 1825
	1    0    0    -1  
$EndComp
$Comp
L power:GND #PWR04
U 1 1 60823BB7
P 12550 2025
F 0 "#PWR04" H 12550 1775 50  0001 C CNN
F 1 "GND" H 12555 1852 50  0000 C CNN
F 2 "" H 12550 2025 50  0001 C CNN
F 3 "" H 12550 2025 50  0001 C CNN
	1    12550 2025
	-1   0    0    -1  
$EndComp
$Comp
L Connector:Conn_Coaxial J4
U 1 1 6082927C
P 12575 3925
F 0 "J4" H 12503 4163 50  0000 C CNN
F 1 "Channel 1 Out" H 12503 4072 50  0000 C CNN
F 2 "" H 12575 3925 50  0001 C CNN
F 3 " ~" H 12575 3925 50  0001 C CNN
	1    12575 3925
	1    0    0    -1  
$EndComp
$Comp
L power:GND #PWR08
U 1 1 60829286
P 12575 4125
F 0 "#PWR08" H 12575 3875 50  0001 C CNN
F 1 "GND" H 12580 3952 50  0000 C CNN
F 2 "" H 12575 4125 50  0001 C CNN
F 3 "" H 12575 4125 50  0001 C CNN
	1    12575 4125
	-1   0    0    -1  
$EndComp
$Comp
L power:+3.3V #PWR06
U 1 1 6082E704
P 11775 3000
F 0 "#PWR06" H 11775 2850 50  0001 C CNN
F 1 "+3.3V" H 11790 3173 50  0000 C CNN
F 2 "" H 11775 3000 50  0001 C CNN
F 3 "" H 11775 3000 50  0001 C CNN
	1    11775 3000
	1    0    0    -1  
$EndComp
$Comp
L power:+5V #PWR05
U 1 1 6082FA4A
P 8650 2975
F 0 "#PWR05" H 8650 2825 50  0001 C CNN
F 1 "+5V" H 8665 3148 50  0000 C CNN
F 2 "" H 8650 2975 50  0001 C CNN
F 3 "" H 8650 2975 50  0001 C CNN
	1    8650 2975
	1    0    0    -1  
$EndComp
Wire Wire Line
	11525 3125 11775 3125
Wire Wire Line
	11775 5275 11525 5275
Wire Wire Line
	11775 3125 11775 5275
Wire Wire Line
	11775 3000 11775 3125
Connection ~ 11775 3125
$Comp
L power:+5V #PWR09
U 1 1 60838750
P 8100 4325
F 0 "#PWR09" H 8100 4175 50  0001 C CNN
F 1 "+5V" H 8115 4498 50  0000 C CNN
F 2 "" H 8100 4325 50  0001 C CNN
F 3 "" H 8100 4325 50  0001 C CNN
	1    8100 4325
	1    0    0    -1  
$EndComp
Wire Wire Line
	8525 3075 8650 3075
Wire Wire Line
	8650 3075 8650 2975
$Comp
L power:GND #PWR011
U 1 1 6083A5F4
P 8100 5425
F 0 "#PWR011" H 8100 5175 50  0001 C CNN
F 1 "GND" H 8105 5252 50  0000 C CNN
F 2 "" H 8100 5425 50  0001 C CNN
F 3 "" H 8100 5425 50  0001 C CNN
	1    8100 5425
	-1   0    0    -1  
$EndComp
$Comp
L power:GND #PWR07
U 1 1 6083E354
P 8650 3275
F 0 "#PWR07" H 8650 3025 50  0001 C CNN
F 1 "GND" H 8655 3102 50  0000 C CNN
F 2 "" H 8650 3275 50  0001 C CNN
F 3 "" H 8650 3275 50  0001 C CNN
	1    8650 3275
	-1   0    0    -1  
$EndComp
Wire Wire Line
	8525 3175 8650 3175
Wire Wire Line
	8650 3175 8650 3275
Wire Wire Line
	11525 3225 11675 3225
Wire Wire Line
	11675 3225 11675 5375
Wire Wire Line
	11675 5375 11525 5375
$Comp
L power:GND #PWR010
U 1 1 60841586
P 11675 5375
F 0 "#PWR010" H 11675 5125 50  0001 C CNN
F 1 "GND" H 11680 5202 50  0000 C CNN
F 2 "" H 11675 5375 50  0001 C CNN
F 3 "" H 11675 5375 50  0001 C CNN
	1    11675 5375
	-1   0    0    -1  
$EndComp
Connection ~ 11675 5375
Wire Wire Line
	7100 3925 12375 3925
Wire Wire Line
	7100 1825 12350 1825
Wire Wire Line
	7975 8050 7775 8050
Wire Wire Line
	7775 8050 7775 8225
NoConn ~ 7975 7750
Wire Wire Line
	10425 3225 9975 3225
Wire Wire Line
	9975 3225 9975 6125
Wire Wire Line
	10425 5375 10075 5375
Wire Wire Line
	10075 5375 10075 6225
Wire Wire Line
	10075 6225 7650 6225
Wire Wire Line
	7650 6225 7650 7400
Wire Wire Line
	7550 6125 7550 7500
Wire Wire Line
	7550 7500 7975 7500
Wire Wire Line
	7550 6125 9975 6125
Wire Wire Line
	9675 5275 9675 6800
Wire Wire Line
	9375 6800 9675 6800
Connection ~ 9675 5275
Wire Wire Line
	9875 5075 9875 6900
Wire Wire Line
	9375 6900 9875 6900
Connection ~ 9875 5075
Wire Wire Line
	9775 5175 9775 7000
Connection ~ 9775 5175
Wire Wire Line
	7525 3175 7350 3175
Wire Wire Line
	7350 3175 7350 7300
Wire Wire Line
	7350 7300 7975 7300
$EndSCHEMATC
