EESchema Schematic File Version 4
EELAYER 30 0
EELAYER END
$Descr A3 11693 16535 portrait
encoding utf-8
Sheet 1 1
Title "DDSGen"
Date "2020-12-02"
Rev "1.0"
Comp "Dyadic Pty Ltd"
Comment1 ""
Comment2 ""
Comment3 ""
Comment4 ""
$EndDescr
$Comp
L RF_Blocks:ClkGen2 U2
U 1 1 5FC9F35B
P 6750 3900
F 0 "U2" H 6750 3177 50  0000 C CNN
F 1 "ClkMod" H 6750 3086 50  0000 C CNN
F 2 "" H 6750 3900 50  0001 C CNN
F 3 "" H 6750 3900 50  0001 C CNN
	1    6750 3900
	1    0    0    -1  
$EndComp
$Comp
L RF_Blocks:USBCtl U8
U 1 1 5FCA11C5
P 3800 13150
F 0 "U8" H 3800 14065 50  0000 C CNN
F 1 "USBCtl" H 3800 13974 50  0000 C CNN
F 2 "" H 3800 13150 50  0001 C CNN
F 3 "" H 3800 13150 50  0001 C CNN
	1    3800 13150
	1    0    0    -1  
$EndComp
$Comp
L RF_Blocks:DDS2 U4
U 1 1 5FCA53D6
P 8950 8000
F 0 "U4" H 8950 7077 50  0000 C CNN
F 1 "CH2" H 8950 6986 50  0000 C CNN
F 2 "" H 8950 7975 50  0001 C CNN
F 3 "" H 8950 7975 50  0001 C CNN
	1    8950 8000
	1    0    0    -1  
$EndComp
$Comp
L RF_Blocks:DDS2 U3
U 1 1 5FCA6875
P 7900 5750
F 0 "U3" H 7900 4827 50  0000 C CNN
F 1 "CH1" H 7900 4736 50  0000 C CNN
F 2 "" H 7900 5725 50  0001 C CNN
F 3 "" H 7900 5725 50  0001 C CNN
	1    7900 5750
	1    0    0    -1  
$EndComp
$Comp
L RF_Blocks:IFAmp U1
U 1 1 5FCA731E
P 5375 2725
F 0 "U1" H 4900 3125 50  0000 L CNN
F 1 "IFAmp" H 5225 2725 50  0000 L CNN
F 2 "" H 5375 2725 50  0001 C CNN
F 3 "" H 5375 2725 50  0001 C CNN
	1    5375 2725
	1    0    0    -1  
$EndComp
$Comp
L power:+10V #PWR01
U 1 1 5FCBF7A2
P 5375 2175
F 0 "#PWR01" H 5375 2025 50  0001 C CNN
F 1 "+10V" H 5390 2348 50  0000 C CNN
F 2 "" H 5375 2175 50  0001 C CNN
F 3 "" H 5375 2175 50  0001 C CNN
	1    5375 2175
	1    0    0    -1  
$EndComp
$Comp
L power:+5V #PWR04
U 1 1 5FCBFFB9
P 5900 3500
F 0 "#PWR04" H 5900 3350 50  0001 C CNN
F 1 "+5V" H 5915 3673 50  0000 C CNN
F 2 "" H 5900 3500 50  0001 C CNN
F 3 "" H 5900 3500 50  0001 C CNN
	1    5900 3500
	1    0    0    -1  
$EndComp
$Comp
L power:+10V #PWR06
U 1 1 5FCC1930
P 7100 5000
F 0 "#PWR06" H 7100 4850 50  0001 C CNN
F 1 "+10V" H 7115 5173 50  0000 C CNN
F 2 "" H 7100 5000 50  0001 C CNN
F 3 "" H 7100 5000 50  0001 C CNN
	1    7100 5000
	1    0    0    -1  
$EndComp
$Comp
L power:+3V3 #PWR07
U 1 1 5FCC2527
P 6975 5300
F 0 "#PWR07" H 6975 5150 50  0001 C CNN
F 1 "+3V3" H 6825 5375 50  0000 C CNN
F 2 "" H 6975 5300 50  0001 C CNN
F 3 "" H 6975 5300 50  0001 C CNN
	1    6975 5300
	1    0    0    -1  
$EndComp
$Comp
L power:GND #PWR03
U 1 1 5FCC3993
P 5375 3275
F 0 "#PWR03" H 5375 3025 50  0001 C CNN
F 1 "GND" H 5380 3102 50  0000 C CNN
F 2 "" H 5375 3275 50  0001 C CNN
F 3 "" H 5375 3275 50  0001 C CNN
	1    5375 3275
	1    0    0    -1  
$EndComp
$Comp
L power:GND #PWR05
U 1 1 5FCC438B
P 5900 3700
F 0 "#PWR05" H 5900 3450 50  0001 C CNN
F 1 "GND" H 5725 3625 50  0000 C CNN
F 2 "" H 5900 3700 50  0001 C CNN
F 3 "" H 5900 3700 50  0001 C CNN
	1    5900 3700
	1    0    0    -1  
$EndComp
Wire Wire Line
	5900 3500 5900 3550
Wire Wire Line
	5900 3550 6050 3550
Wire Wire Line
	6050 3650 5900 3650
Wire Wire Line
	5900 3650 5900 3700
$Comp
L power:GND #PWR08
U 1 1 5FCCEDEB
P 7100 5500
F 0 "#PWR08" H 7100 5250 50  0001 C CNN
F 1 "GND" H 6950 5425 50  0000 C CNN
F 2 "" H 7100 5500 50  0001 C CNN
F 3 "" H 7100 5500 50  0001 C CNN
	1    7100 5500
	1    0    0    -1  
$EndComp
Wire Wire Line
	7100 5000 7100 5050
Wire Wire Line
	7100 5050 7200 5050
Wire Wire Line
	6975 5300 6975 5350
Wire Wire Line
	6975 5350 7200 5350
Wire Wire Line
	7200 5150 7100 5150
Wire Wire Line
	7100 5150 7100 5450
Wire Wire Line
	7200 5450 7100 5450
Connection ~ 7100 5450
Wire Wire Line
	7100 5450 7100 5500
$Comp
L power:+10V #PWR09
U 1 1 5FCD1275
P 8150 7250
F 0 "#PWR09" H 8150 7100 50  0001 C CNN
F 1 "+10V" H 8165 7423 50  0000 C CNN
F 2 "" H 8150 7250 50  0001 C CNN
F 3 "" H 8150 7250 50  0001 C CNN
	1    8150 7250
	1    0    0    -1  
$EndComp
$Comp
L power:+3V3 #PWR011
U 1 1 5FCD1C29
P 8025 7550
F 0 "#PWR011" H 8025 7400 50  0001 C CNN
F 1 "+3V3" H 7875 7625 50  0000 C CNN
F 2 "" H 8025 7550 50  0001 C CNN
F 3 "" H 8025 7550 50  0001 C CNN
	1    8025 7550
	1    0    0    -1  
$EndComp
$Comp
L power:GND #PWR012
U 1 1 5FCD2656
P 8150 7750
F 0 "#PWR012" H 8150 7500 50  0001 C CNN
F 1 "GND" H 8000 7675 50  0000 C CNN
F 2 "" H 8150 7750 50  0001 C CNN
F 3 "" H 8150 7750 50  0001 C CNN
	1    8150 7750
	1    0    0    -1  
$EndComp
Wire Wire Line
	8150 7250 8150 7300
Wire Wire Line
	8150 7300 8250 7300
Wire Wire Line
	8025 7550 8025 7600
Wire Wire Line
	8025 7600 8250 7600
Wire Wire Line
	8150 7750 8150 7700
Wire Wire Line
	8150 7400 8250 7400
Wire Wire Line
	8250 7700 8150 7700
Connection ~ 8150 7700
Wire Wire Line
	8150 7700 8150 7400
Wire Wire Line
	6075 2725 6750 2725
Wire Wire Line
	6750 2725 6750 3100
Wire Wire Line
	7450 3750 7900 3750
Wire Wire Line
	7900 3750 7900 4700
Wire Wire Line
	7450 3550 8950 3550
Wire Wire Line
	8950 3550 8950 6950
$Comp
L Connector:Conn_Coaxial J1
U 1 1 5FCD5B60
P 4300 2725
F 0 "J1" H 4228 2963 50  0000 C CNN
F 1 "10MHz In" H 4228 2872 50  0000 C CNN
F 2 "" H 4300 2725 50  0001 C CNN
F 3 " ~" H 4300 2725 50  0001 C CNN
	1    4300 2725
	-1   0    0    -1  
$EndComp
$Comp
L power:GND #PWR02
U 1 1 5FCD707E
P 4300 2925
F 0 "#PWR02" H 4300 2675 50  0001 C CNN
F 1 "GND" H 4305 2752 50  0000 C CNN
F 2 "" H 4300 2925 50  0001 C CNN
F 3 "" H 4300 2925 50  0001 C CNN
	1    4300 2925
	1    0    0    -1  
$EndComp
Wire Wire Line
	4500 2725 4675 2725
$Comp
L power:GND #PWR015
U 1 1 5FCD90EE
P 2975 13950
F 0 "#PWR015" H 2975 13700 50  0001 C CNN
F 1 "GND" H 2825 13875 50  0000 C CNN
F 2 "" H 2975 13950 50  0001 C CNN
F 3 "" H 2975 13950 50  0001 C CNN
	1    2975 13950
	1    0    0    -1  
$EndComp
Wire Wire Line
	2975 13950 2975 13900
Wire Wire Line
	2975 13900 3100 13900
Wire Wire Line
	2975 13750 2975 13800
Wire Wire Line
	2975 13800 3100 13800
$Comp
L power:+3V3 #PWR014
U 1 1 5FCDA6B7
P 2975 13750
F 0 "#PWR014" H 2975 13600 50  0001 C CNN
F 1 "+3V3" H 2825 13825 50  0000 C CNN
F 2 "" H 2975 13750 50  0001 C CNN
F 3 "" H 2975 13750 50  0001 C CNN
	1    2975 13750
	1    0    0    -1  
$EndComp
NoConn ~ 3100 13600
NoConn ~ 4500 12550
Wire Wire Line
	6050 4150 5650 4150
Wire Wire Line
	5650 4150 5650 5950
Wire Wire Line
	5650 8200 8250 8200
Wire Wire Line
	7200 5950 5650 5950
Connection ~ 5650 5950
Wire Wire Line
	5650 5950 5650 8200
Wire Wire Line
	6050 4050 5550 4050
Wire Wire Line
	5550 4050 5550 6050
Wire Wire Line
	5550 8300 8250 8300
Wire Wire Line
	7200 6050 5550 6050
Connection ~ 5550 6050
Wire Wire Line
	5550 6050 5550 8300
$Comp
L RF_Blocks:SPI U7
U 1 1 5FCE3ABE
P 7700 12800
F 0 "U7" H 7447 12846 50  0000 R CNN
F 1 "SPI" H 7447 12755 50  0000 R CNN
F 2 "" H 7700 12800 50  0001 C CNN
F 3 "" H 7700 12800 50  0001 C CNN
	1    7700 12800
	-1   0    0    -1  
$EndComp
Wire Wire Line
	4500 12650 5650 12650
Wire Wire Line
	4500 12750 5550 12750
Wire Wire Line
	4500 12850 7600 12850
$Comp
L power:GND #PWR013
U 1 1 5FCE807D
P 7500 13000
F 0 "#PWR013" H 7500 12750 50  0001 C CNN
F 1 "GND" H 7350 12925 50  0000 C CNN
F 2 "" H 7500 13000 50  0001 C CNN
F 3 "" H 7500 13000 50  0001 C CNN
	1    7500 13000
	1    0    0    -1  
$EndComp
Wire Wire Line
	7600 12950 7500 12950
Wire Wire Line
	7500 12950 7500 13000
Wire Wire Line
	7200 6350 5450 6350
Wire Wire Line
	5450 6350 5450 8600
Wire Wire Line
	5450 8600 8250 8600
Wire Wire Line
	7200 6450 7050 6450
Wire Wire Line
	7050 6450 7050 7575
Wire Wire Line
	7050 8700 8250 8700
$Comp
L power:+3V3 #PWR010
U 1 1 5FCEC723
P 6925 7525
F 0 "#PWR010" H 6925 7375 50  0001 C CNN
F 1 "+3V3" H 6775 7600 50  0000 C CNN
F 2 "" H 6925 7525 50  0001 C CNN
F 3 "" H 6925 7525 50  0001 C CNN
	1    6925 7525
	1    0    0    -1  
$EndComp
Wire Wire Line
	6925 7525 6925 7575
Wire Wire Line
	6925 7575 7050 7575
Connection ~ 7050 7575
Wire Wire Line
	7050 7575 7050 8700
Wire Wire Line
	6050 3950 5200 3950
Wire Wire Line
	5200 12950 4500 12950
Wire Wire Line
	6050 3850 5100 3850
Wire Wire Line
	5100 3850 5100 11175
Wire Wire Line
	5100 13050 4500 13050
Wire Wire Line
	6050 4250 5000 4250
Wire Wire Line
	5000 4250 5000 11075
Wire Wire Line
	5000 13350 4500 13350
Wire Wire Line
	7200 6150 5750 6150
Wire Wire Line
	5750 6150 5750 11475
Wire Wire Line
	5750 13450 4500 13450
Wire Wire Line
	8250 8400 5850 8400
Wire Wire Line
	5850 8400 5850 11675
Wire Wire Line
	5850 13550 4500 13550
Wire Wire Line
	7200 6250 5950 6250
Wire Wire Line
	5950 6250 5950 11575
Wire Wire Line
	5950 13150 4500 13150
Wire Wire Line
	4500 13250 6050 13250
Wire Wire Line
	6050 13250 6050 11775
Wire Wire Line
	6050 8500 8250 8500
Wire Wire Line
	7200 5650 2475 5650
Wire Wire Line
	2475 5650 2475 13050
Wire Wire Line
	2475 13050 3100 13050
Wire Wire Line
	7200 5750 2375 5750
Wire Wire Line
	2375 5750 2375 12950
Wire Wire Line
	2375 12950 3100 12950
Wire Wire Line
	7200 5850 2275 5850
Wire Wire Line
	2275 5850 2275 12850
Wire Wire Line
	2275 12850 3100 12850
Wire Wire Line
	8250 7900 1900 7900
Wire Wire Line
	1900 7900 1900 13350
Wire Wire Line
	1900 13350 3100 13350
Wire Wire Line
	8250 8000 1800 8000
Wire Wire Line
	1800 8000 1800 13250
Wire Wire Line
	1800 13250 3100 13250
Wire Wire Line
	8250 8100 1700 8100
Wire Wire Line
	1700 8100 1700 13150
Wire Wire Line
	1700 13150 3100 13150
$Comp
L RF_Blocks:GPIO-Input U6
U 1 1 5FD38F56
P 7700 11825
F 0 "U6" H 7448 12171 50  0000 R CNN
F 1 "GPIO-Input" H 7448 12080 50  0000 R CNN
F 2 "" H 7700 11825 50  0001 C CNN
F 3 "" H 7700 11825 50  0001 C CNN
	1    7700 11825
	-1   0    0    -1  
$EndComp
$Comp
L RF_Blocks:GPIO-Output U5
U 1 1 5FD3A73A
P 7700 10200
F 0 "U5" H 7447 10246 50  0000 R CNN
F 1 "GPIO-Output" H 7447 10155 50  0000 R CNN
F 2 "" H 7800 10200 50  0001 C CNN
F 3 "" H 7800 10200 50  0001 C CNN
	1    7700 10200
	-1   0    0    -1  
$EndComp
$Comp
L Connector:Conn_Coaxial J4
U 1 1 5FD3BAF6
P 10325 5550
F 0 "J4" H 10275 5675 50  0000 L CNN
F 1 "RF1" H 10475 5550 50  0000 L CNN
F 2 "" H 10325 5550 50  0001 C CNN
F 3 " ~" H 10325 5550 50  0001 C CNN
	1    10325 5550
	1    0    0    -1  
$EndComp
$Comp
L Connector:Conn_Coaxial J5
U 1 1 5FD3C93B
P 9825 5950
F 0 "J5" H 9775 6075 50  0000 L CNN
F 1 "CH1" H 9950 5950 50  0000 L CNN
F 2 "" H 9825 5950 50  0001 C CNN
F 3 " ~" H 9825 5950 50  0001 C CNN
	1    9825 5950
	1    0    0    -1  
$EndComp
$Comp
L Connector:Conn_Coaxial J6
U 1 1 5FD3D391
P 10575 7800
F 0 "J6" H 10525 7925 50  0000 L CNN
F 1 "RF2" H 10725 7800 50  0000 L CNN
F 2 "" H 10575 7800 50  0001 C CNN
F 3 " ~" H 10575 7800 50  0001 C CNN
	1    10575 7800
	1    0    0    -1  
$EndComp
$Comp
L Connector:Conn_Coaxial J7
U 1 1 5FD3EBD3
P 10075 8200
F 0 "J7" H 10025 8325 50  0000 L CNN
F 1 "CH2" H 10200 8200 50  0000 L CNN
F 2 "" H 10075 8200 50  0001 C CNN
F 3 " ~" H 10075 8200 50  0001 C CNN
	1    10075 8200
	1    0    0    -1  
$EndComp
$Comp
L Connector:Conn_Coaxial J2
U 1 1 5FD3F798
P 10325 4100
F 0 "J2" H 10425 4075 50  0000 L CNN
F 1 "Clk+" H 10425 3984 50  0000 L CNN
F 2 "" H 10325 4100 50  0001 C CNN
F 3 " ~" H 10325 4100 50  0001 C CNN
	1    10325 4100
	1    0    0    -1  
$EndComp
$Comp
L Connector:Conn_Coaxial J3
U 1 1 5FD401AC
P 9725 4300
F 0 "J3" H 9825 4275 50  0000 L CNN
F 1 "Clk-" H 9825 4184 50  0000 L CNN
F 2 "" H 9725 4300 50  0001 C CNN
F 3 " ~" H 9725 4300 50  0001 C CNN
	1    9725 4300
	1    0    0    -1  
$EndComp
NoConn ~ 8600 5750
NoConn ~ 9650 8000
Wire Wire Line
	7450 4100 10125 4100
Wire Wire Line
	7450 4300 9525 4300
Wire Wire Line
	8600 5550 10125 5550
Wire Wire Line
	8600 5950 9625 5950
Wire Wire Line
	9650 7800 10375 7800
Wire Wire Line
	9650 8200 9875 8200
Wire Wire Line
	5450 8600 5450 11375
Wire Wire Line
	5450 13650 4500 13650
Connection ~ 5450 8600
Wire Wire Line
	3100 12550 3000 12550
Wire Wire Line
	3000 12550 3000 9750
Wire Wire Line
	3000 9750 7600 9750
Wire Wire Line
	3100 12650 2900 12650
Wire Wire Line
	2900 12650 2900 9850
Wire Wire Line
	2900 9850 7600 9850
Wire Wire Line
	3100 12750 2800 12750
Wire Wire Line
	2800 12750 2800 9950
Wire Wire Line
	2800 9950 7600 9950
Wire Wire Line
	3100 13450 2700 13450
Wire Wire Line
	2700 13450 2700 10050
Wire Wire Line
	2700 10050 7600 10050
Wire Wire Line
	7600 11075 5000 11075
Connection ~ 5000 11075
Wire Wire Line
	5000 11075 5000 13350
Wire Wire Line
	5200 3950 5200 11275
Wire Wire Line
	7600 11175 5100 11175
Connection ~ 5100 11175
Wire Wire Line
	5100 11175 5100 13050
Wire Wire Line
	7600 11275 5200 11275
Connection ~ 5200 11275
Wire Wire Line
	5200 11275 5200 12950
Wire Wire Line
	7600 11375 5450 11375
Connection ~ 5450 11375
Wire Wire Line
	5450 11375 5450 13650
Wire Wire Line
	7600 11475 5750 11475
Connection ~ 5750 11475
Wire Wire Line
	5750 11475 5750 13450
Wire Wire Line
	7600 11575 5950 11575
Connection ~ 5950 11575
Wire Wire Line
	5950 11575 5950 13150
Wire Wire Line
	7600 11675 5850 11675
Connection ~ 5850 11675
Wire Wire Line
	5850 11675 5850 13550
Wire Wire Line
	7600 11775 6050 11775
Connection ~ 6050 11775
Wire Wire Line
	6050 11775 6050 8500
NoConn ~ 7600 11975
NoConn ~ 7600 11875
NoConn ~ 7600 10650
NoConn ~ 7600 10550
NoConn ~ 7600 10450
NoConn ~ 7600 10350
NoConn ~ 7600 10250
NoConn ~ 7600 10150
$Comp
L power:PWR_FLAG #FLG0101
U 1 1 5FDD7D08
P 7625 14225
F 0 "#FLG0101" H 7625 14300 50  0001 C CNN
F 1 "PWR_FLAG" H 7625 14398 50  0000 C CNN
F 2 "" H 7625 14225 50  0001 C CNN
F 3 "~" H 7625 14225 50  0001 C CNN
	1    7625 14225
	-1   0    0    1   
$EndComp
$Comp
L power:+3V3 #PWR0101
U 1 1 5FDD80AC
P 7625 14225
F 0 "#PWR0101" H 7625 14075 50  0001 C CNN
F 1 "+3V3" H 7475 14300 50  0000 C CNN
F 2 "" H 7625 14225 50  0001 C CNN
F 3 "" H 7625 14225 50  0001 C CNN
	1    7625 14225
	1    0    0    -1  
$EndComp
$Comp
L power:+5V #PWR0102
U 1 1 5FDD8D8F
P 8100 14225
F 0 "#PWR0102" H 8100 14075 50  0001 C CNN
F 1 "+5V" H 8115 14398 50  0000 C CNN
F 2 "" H 8100 14225 50  0001 C CNN
F 3 "" H 8100 14225 50  0001 C CNN
	1    8100 14225
	1    0    0    -1  
$EndComp
$Comp
L power:+10V #PWR0103
U 1 1 5FDD96BC
P 8575 14225
F 0 "#PWR0103" H 8575 14075 50  0001 C CNN
F 1 "+10V" H 8590 14398 50  0000 C CNN
F 2 "" H 8575 14225 50  0001 C CNN
F 3 "" H 8575 14225 50  0001 C CNN
	1    8575 14225
	1    0    0    -1  
$EndComp
$Comp
L power:PWR_FLAG #FLG0102
U 1 1 5FDDA499
P 8100 14225
F 0 "#FLG0102" H 8100 14300 50  0001 C CNN
F 1 "PWR_FLAG" H 8100 14398 50  0000 C CNN
F 2 "" H 8100 14225 50  0001 C CNN
F 3 "~" H 8100 14225 50  0001 C CNN
	1    8100 14225
	-1   0    0    1   
$EndComp
$Comp
L power:PWR_FLAG #FLG0103
U 1 1 5FDDA874
P 8575 14225
F 0 "#FLG0103" H 8575 14300 50  0001 C CNN
F 1 "PWR_FLAG" H 8575 14398 50  0000 C CNN
F 2 "" H 8575 14225 50  0001 C CNN
F 3 "~" H 8575 14225 50  0001 C CNN
	1    8575 14225
	-1   0    0    1   
$EndComp
$Comp
L power:PWR_FLAG #FLG0104
U 1 1 5FDDAD2C
P 7100 14225
F 0 "#FLG0104" H 7100 14300 50  0001 C CNN
F 1 "PWR_FLAG" H 7100 14398 50  0000 C CNN
F 2 "" H 7100 14225 50  0001 C CNN
F 3 "~" H 7100 14225 50  0001 C CNN
	1    7100 14225
	1    0    0    -1  
$EndComp
$Comp
L power:GND #PWR0104
U 1 1 5FDDB3C8
P 7100 14225
F 0 "#PWR0104" H 7100 13975 50  0001 C CNN
F 1 "GND" H 6950 14150 50  0000 C CNN
F 2 "" H 7100 14225 50  0001 C CNN
F 3 "" H 7100 14225 50  0001 C CNN
	1    7100 14225
	1    0    0    -1  
$EndComp
$Comp
L power:GND #PWR0105
U 1 1 5FDDBABF
P 10325 4300
F 0 "#PWR0105" H 10325 4050 50  0001 C CNN
F 1 "GND" H 10330 4127 50  0000 C CNN
F 2 "" H 10325 4300 50  0001 C CNN
F 3 "" H 10325 4300 50  0001 C CNN
	1    10325 4300
	1    0    0    -1  
$EndComp
$Comp
L power:GND #PWR0106
U 1 1 5FDDC30E
P 9725 4500
F 0 "#PWR0106" H 9725 4250 50  0001 C CNN
F 1 "GND" H 9730 4327 50  0000 C CNN
F 2 "" H 9725 4500 50  0001 C CNN
F 3 "" H 9725 4500 50  0001 C CNN
	1    9725 4500
	1    0    0    -1  
$EndComp
$Comp
L power:GND #PWR0107
U 1 1 5FDDC6F5
P 10325 5750
F 0 "#PWR0107" H 10325 5500 50  0001 C CNN
F 1 "GND" H 10330 5577 50  0000 C CNN
F 2 "" H 10325 5750 50  0001 C CNN
F 3 "" H 10325 5750 50  0001 C CNN
	1    10325 5750
	1    0    0    -1  
$EndComp
$Comp
L power:GND #PWR0108
U 1 1 5FDDCC30
P 9825 6150
F 0 "#PWR0108" H 9825 5900 50  0001 C CNN
F 1 "GND" H 9830 5977 50  0000 C CNN
F 2 "" H 9825 6150 50  0001 C CNN
F 3 "" H 9825 6150 50  0001 C CNN
	1    9825 6150
	1    0    0    -1  
$EndComp
$Comp
L power:GND #PWR0109
U 1 1 5FDDCFE4
P 10075 8400
F 0 "#PWR0109" H 10075 8150 50  0001 C CNN
F 1 "GND" H 10080 8227 50  0000 C CNN
F 2 "" H 10075 8400 50  0001 C CNN
F 3 "" H 10075 8400 50  0001 C CNN
	1    10075 8400
	1    0    0    -1  
$EndComp
$Comp
L power:GND #PWR0110
U 1 1 5FDDD78B
P 10575 8000
F 0 "#PWR0110" H 10575 7750 50  0001 C CNN
F 1 "GND" H 10580 7827 50  0000 C CNN
F 2 "" H 10575 8000 50  0001 C CNN
F 3 "" H 10575 8000 50  0001 C CNN
	1    10575 8000
	1    0    0    -1  
$EndComp
Wire Wire Line
	5650 8200 5650 12650
Connection ~ 5650 8200
Connection ~ 5650 12650
Wire Wire Line
	5650 12650 7600 12650
Wire Wire Line
	5550 8300 5550 12750
Connection ~ 5550 8300
Connection ~ 5550 12750
Wire Wire Line
	5550 12750 7600 12750
Text Notes 8825 11300 0    39   ~ 0
D0
Text Notes 8825 11400 0    39   ~ 0
D1
Text Notes 8825 11500 0    39   ~ 0
D2
Text Notes 8825 11600 0    39   ~ 0
D3
Text Notes 8825 11700 0    39   ~ 0
D4
Text Notes 8825 11800 0    39   ~ 0
D5
Text Notes 8825 11900 0    39   ~ 0
D6
Text Notes 8825 12000 0    39   ~ 0
D7
Text Notes 9075 11300 0    39   ~ 0
Clk ~CS~
Text Notes 8775 11150 0    39   ~ 8
Line
Text Notes 9025 11150 0    39   ~ 8
Function
Wire Notes Line style solid
	8725 11200 9600 11200
Wire Notes Line style solid
	8950 11050 8950 12025
Text Notes 9075 11400 0    39   ~ 0
Clk Ref
Text Notes 9075 11500 0    39   ~ 0
Clk PLL Lock
Text Notes 9075 11600 0    39   ~ 0
DDS Reset
Text Notes 9075 11700 0    39   ~ 0
CH1 ~CS~
Text Notes 9075 11800 0    39   ~ 0
CH1 IO Update
Text Notes 9075 11900 0    39   ~ 0
CH2 ~CS~
Text Notes 9075 12000 0    39   ~ 0
CH2 IO Update
Wire Notes Line style solid
	8725 11050 8725 12025
Wire Notes Line style solid
	8725 12025 9600 12025
Wire Notes Line style solid
	9600 12025 9600 11050
Wire Notes Line style solid
	9600 11050 8725 11050
Wire Notes Line
	4850 10875 9925 10875
Wire Notes Line
	9925 10875 9925 12150
Wire Notes Line
	9925 12150 4850 12150
Wire Notes Line
	4850 12150 4850 10875
Text Notes 6450 12075 0    50   ~ 0
Alternate wiring for\nexternal SPI control.
Wire Notes Line
	1500 8500 3575 8500
Wire Notes Line
	3575 8500 3575 9375
Wire Notes Line
	3575 9375 1500 9375
Wire Notes Line
	1500 9375 1500 8500
Text Notes 2600 9050 0    39   ~ 0
Optional wiring for pin control\nof profile selection and sweep\ncontrol.
$Comp
L power:GND #PWR?
U 1 1 5FEF27C0
P 5900 4425
F 0 "#PWR?" H 5900 4175 50  0001 C CNN
F 1 "GND" H 5725 4350 50  0000 C CNN
F 2 "" H 5900 4425 50  0001 C CNN
F 3 "" H 5900 4425 50  0001 C CNN
	1    5900 4425
	1    0    0    -1  
$EndComp
Wire Wire Line
	6050 4350 5900 4350
Wire Wire Line
	5900 4350 5900 4425
$EndSCHEMATC
