EESchema Schematic File Version 4
EELAYER 30 0
EELAYER END
$Descr A4 8268 11693 portrait
encoding utf-8
Sheet 1 1
Title "ClockGen Reference Design"
Date "2020-07-27"
Rev "1.0"
Comp "Dyadic Pty Ltd"
Comment1 ""
Comment2 ""
Comment3 ""
Comment4 ""
$EndDescr
$Comp
L RF_Blocks:ClkGen2 ClkMod1
U 1 1 5F2686DD
P 5325 2775
F 0 "ClkMod1" H 4925 3425 50  0000 C CNN
F 1 "ClkMod1" H 5325 2775 50  0000 C CNN
F 2 "" H 5325 2775 50  0001 C CNN
F 3 "" H 5325 2775 50  0001 C CNN
	1    5325 2775
	1    0    0    -1  
$EndComp
$Comp
L RF_Blocks:ClkGen2 ClkMod2
U 1 1 5F269D2D
P 5325 5275
F 0 "ClkMod2" H 4925 5925 50  0000 C CNN
F 1 "ClkMod2" H 5325 5275 50  0000 C CNN
F 2 "" H 5325 5275 50  0001 C CNN
F 3 "" H 5325 5275 50  0001 C CNN
	1    5325 5275
	1    0    0    -1  
$EndComp
$Comp
L RF_Blocks:USBCtl U4
U 1 1 5F26BCB7
P 2725 7925
F 0 "U4" H 2325 8725 50  0000 C CNN
F 1 "USBCtl" H 2725 7925 50  0000 C CNN
F 2 "" H 2725 7925 50  0001 C CNN
F 3 "" H 2725 7925 50  0001 C CNN
	1    2725 7925
	1    0    0    -1  
$EndComp
$Comp
L power:GND #PWR03
U 1 1 5F2740F0
P 2375 1975
F 0 "#PWR03" H 2375 1725 50  0001 C CNN
F 1 "GND" H 2380 1802 50  0000 C CNN
F 2 "" H 2375 1975 50  0001 C CNN
F 3 "" H 2375 1975 50  0001 C CNN
	1    2375 1975
	1    0    0    -1  
$EndComp
Wire Wire Line
	6025 3175 6275 3175
Wire Wire Line
	6275 3175 6275 3975
Wire Wire Line
	6275 3975 5325 3975
Wire Wire Line
	5325 3975 5325 4475
Wire Wire Line
	3425 7425 3575 7425
Wire Wire Line
	3575 7425 3575 5525
Wire Wire Line
	3575 3025 4625 3025
Wire Wire Line
	3425 7525 3675 7525
Wire Wire Line
	3675 7525 3675 5425
Wire Wire Line
	3675 2925 4625 2925
Wire Wire Line
	4625 5425 3675 5425
Connection ~ 3675 5425
Wire Wire Line
	3675 5425 3675 2925
Wire Wire Line
	4625 5525 3575 5525
Connection ~ 3575 5525
Wire Wire Line
	3575 5525 3575 3025
Wire Wire Line
	3975 8325 3975 6500
Wire Wire Line
	3975 5325 4625 5325
Wire Wire Line
	3875 8425 3875 6600
Wire Wire Line
	3875 2825 4625 2825
Wire Wire Line
	1325 7825 1325 6200
Wire Wire Line
	1325 5625 4625 5625
Wire Wire Line
	1575 8125 1575 6300
Wire Wire Line
	1575 3125 4625 3125
Wire Wire Line
	1675 8025 1675 6400
Wire Wire Line
	1675 2725 4625 2725
$Comp
L Connector:Conn_Coaxial J2
U 1 1 5F27B20D
P 7425 2425
F 0 "J2" H 7525 2400 50  0000 L CNN
F 1 "Clk1+" H 7525 2475 50  0000 L CNN
F 2 "" H 7425 2425 50  0001 C CNN
F 3 " ~" H 7425 2425 50  0001 C CNN
	1    7425 2425
	1    0    0    -1  
$EndComp
$Comp
L Connector:Conn_Coaxial J3
U 1 1 5F27D2CB
P 6875 2625
F 0 "J3" H 6975 2575 50  0000 L CNN
F 1 "Clk1-" H 6975 2509 50  0000 L CNN
F 2 "" H 6875 2625 50  0001 C CNN
F 3 " ~" H 6875 2625 50  0001 C CNN
	1    6875 2625
	1    0    0    -1  
$EndComp
$Comp
L Connector:Conn_Coaxial J5
U 1 1 5F27DCDF
P 7425 4925
F 0 "J5" H 7525 4900 50  0000 L CNN
F 1 "Clk2+" H 7525 4975 50  0000 L CNN
F 2 "" H 7425 4925 50  0001 C CNN
F 3 " ~" H 7425 4925 50  0001 C CNN
	1    7425 4925
	1    0    0    -1  
$EndComp
$Comp
L Connector:Conn_Coaxial J6
U 1 1 5F27E4B4
P 6875 5125
F 0 "J6" H 6975 5100 50  0000 L CNN
F 1 "Clk2-" H 6975 5009 50  0000 L CNN
F 2 "" H 6875 5125 50  0001 C CNN
F 3 " ~" H 6875 5125 50  0001 C CNN
	1    6875 5125
	1    0    0    -1  
$EndComp
$Comp
L power:GND #PWR07
U 1 1 5F27EE94
P 6875 2825
F 0 "#PWR07" H 6875 2575 50  0001 C CNN
F 1 "GND" H 6725 2775 50  0000 C CNN
F 2 "" H 6875 2825 50  0001 C CNN
F 3 "" H 6875 2825 50  0001 C CNN
	1    6875 2825
	1    0    0    -1  
$EndComp
$Comp
L power:GND #PWR06
U 1 1 5F27F441
P 7425 2625
F 0 "#PWR06" H 7425 2375 50  0001 C CNN
F 1 "GND" H 7575 2575 50  0000 C CNN
F 2 "" H 7425 2625 50  0001 C CNN
F 3 "" H 7425 2625 50  0001 C CNN
	1    7425 2625
	1    0    0    -1  
$EndComp
Wire Wire Line
	6025 2625 6675 2625
Wire Wire Line
	6025 2425 7225 2425
$Comp
L power:GND #PWR011
U 1 1 5F283618
P 7425 5125
F 0 "#PWR011" H 7425 4875 50  0001 C CNN
F 1 "GND" H 7575 5075 50  0000 C CNN
F 2 "" H 7425 5125 50  0001 C CNN
F 3 "" H 7425 5125 50  0001 C CNN
	1    7425 5125
	1    0    0    -1  
$EndComp
$Comp
L power:GND #PWR012
U 1 1 5F283BFD
P 6875 5325
F 0 "#PWR012" H 6875 5075 50  0001 C CNN
F 1 "GND" H 6725 5275 50  0000 C CNN
F 2 "" H 6875 5325 50  0001 C CNN
F 3 "" H 6875 5325 50  0001 C CNN
	1    6875 5325
	1    0    0    -1  
$EndComp
Wire Wire Line
	6025 4925 7225 4925
Wire Wire Line
	6025 5125 6675 5125
$Comp
L Connector:Conn_Coaxial J7
U 1 1 5F285978
P 7425 5475
F 0 "J7" H 7525 5450 50  0000 L CNN
F 1 "Clk3+" H 7525 5525 50  0000 L CNN
F 2 "" H 7425 5475 50  0001 C CNN
F 3 " ~" H 7425 5475 50  0001 C CNN
	1    7425 5475
	1    0    0    -1  
$EndComp
$Comp
L Connector:Conn_Coaxial J8
U 1 1 5F285B83
P 6875 5675
F 0 "J8" H 6975 5650 50  0000 L CNN
F 1 "Clk3-" H 6975 5559 50  0000 L CNN
F 2 "" H 6875 5675 50  0001 C CNN
F 3 " ~" H 6875 5675 50  0001 C CNN
	1    6875 5675
	1    0    0    -1  
$EndComp
$Comp
L power:GND #PWR013
U 1 1 5F285D8E
P 7425 5675
F 0 "#PWR013" H 7425 5425 50  0001 C CNN
F 1 "GND" H 7575 5625 50  0000 C CNN
F 2 "" H 7425 5675 50  0001 C CNN
F 3 "" H 7425 5675 50  0001 C CNN
	1    7425 5675
	1    0    0    -1  
$EndComp
$Comp
L power:GND #PWR014
U 1 1 5F285ED1
P 6875 5875
F 0 "#PWR014" H 6875 5625 50  0001 C CNN
F 1 "GND" H 6725 5825 50  0000 C CNN
F 2 "" H 6875 5875 50  0001 C CNN
F 3 "" H 6875 5875 50  0001 C CNN
	1    6875 5875
	1    0    0    -1  
$EndComp
Wire Wire Line
	6025 5475 7225 5475
Wire Wire Line
	6025 5675 6675 5675
$Comp
L power:GND #PWR010
U 1 1 5F287AB6
P 4250 5075
F 0 "#PWR010" H 4250 4825 50  0001 C CNN
F 1 "GND" H 4100 5025 50  0000 C CNN
F 2 "" H 4250 5075 50  0001 C CNN
F 3 "" H 4250 5075 50  0001 C CNN
	1    4250 5075
	1    0    0    -1  
$EndComp
$Comp
L power:GND #PWR05
U 1 1 5F287E74
P 4475 2575
F 0 "#PWR05" H 4475 2325 50  0001 C CNN
F 1 "GND" H 4325 2525 50  0000 C CNN
F 2 "" H 4475 2575 50  0001 C CNN
F 3 "" H 4475 2575 50  0001 C CNN
	1    4475 2575
	1    0    0    -1  
$EndComp
Wire Wire Line
	4475 2575 4475 2525
Wire Wire Line
	4475 2525 4625 2525
Wire Wire Line
	4250 5075 4250 5025
Wire Wire Line
	4250 5025 4475 5025
$Comp
L power:GND #PWR016
U 1 1 5F28A0CB
P 1575 8725
F 0 "#PWR016" H 1575 8475 50  0001 C CNN
F 1 "GND" H 1425 8675 50  0000 C CNN
F 2 "" H 1575 8725 50  0001 C CNN
F 3 "" H 1575 8725 50  0001 C CNN
	1    1575 8725
	1    0    0    -1  
$EndComp
Wire Wire Line
	2025 8675 1575 8675
Wire Wire Line
	1575 8675 1575 8725
Wire Wire Line
	2025 8575 1575 8575
Wire Wire Line
	1575 8575 1575 8525
$Comp
L power:+5V #PWR09
U 1 1 5F28D95B
P 4475 4875
F 0 "#PWR09" H 4475 4725 50  0001 C CNN
F 1 "+5V" H 4490 5048 50  0000 C CNN
F 2 "" H 4475 4875 50  0001 C CNN
F 3 "" H 4475 4875 50  0001 C CNN
	1    4475 4875
	1    0    0    -1  
$EndComp
$Comp
L power:+5V #PWR04
U 1 1 5F28E6E4
P 4475 2375
F 0 "#PWR04" H 4475 2225 50  0001 C CNN
F 1 "+5V" H 4490 2548 50  0000 C CNN
F 2 "" H 4475 2375 50  0001 C CNN
F 3 "" H 4475 2375 50  0001 C CNN
	1    4475 2375
	1    0    0    -1  
$EndComp
Wire Wire Line
	3075 1425 5325 1425
Wire Wire Line
	5325 1425 5325 1975
Wire Wire Line
	4625 2425 4475 2425
Wire Wire Line
	4475 2425 4475 2375
Wire Wire Line
	4625 4925 4475 4925
Wire Wire Line
	4475 4925 4475 4875
NoConn ~ 3425 7325
NoConn ~ 3425 7725
NoConn ~ 3425 7825
NoConn ~ 2025 8225
$Comp
L Connector:Conn_Coaxial J1
U 1 1 5F2A2F16
P 1225 1425
F 0 "J1" H 1325 1375 50  0000 L CNN
F 1 "Ref. In" H 1325 1309 50  0000 L CNN
F 2 "" H 1225 1425 50  0001 C CNN
F 3 " ~" H 1225 1425 50  0001 C CNN
	1    1225 1425
	-1   0    0    -1  
$EndComp
$Comp
L power:GND #PWR02
U 1 1 5F2A3F2E
P 1225 1625
F 0 "#PWR02" H 1225 1375 50  0001 C CNN
F 1 "GND" H 1375 1525 50  0000 C CNN
F 2 "" H 1225 1625 50  0001 C CNN
F 3 "" H 1225 1625 50  0001 C CNN
	1    1225 1625
	1    0    0    -1  
$EndComp
Wire Wire Line
	1425 1425 1675 1425
$Comp
L RF_Blocks:IFAmp U1
U 1 1 5F2A980D
P 2375 1425
F 0 "U1" H 1925 1825 50  0000 L CNN
F 1 "IFAmp" H 2225 1425 50  0000 L CNN
F 2 "" H 2375 1425 50  0001 C CNN
F 3 "" H 2375 1425 50  0001 C CNN
	1    2375 1425
	1    0    0    -1  
$EndComp
Wire Wire Line
	3875 8425 3425 8425
Wire Wire Line
	3975 8325 3425 8325
Wire Wire Line
	1675 8025 2025 8025
Wire Wire Line
	1575 8125 2025 8125
Wire Wire Line
	1325 7825 2025 7825
$Comp
L power:+3V3 #PWR017
U 1 1 5F966B43
P 1575 8525
F 0 "#PWR017" H 1575 8375 50  0001 C CNN
F 1 "+3V3" H 1590 8698 50  0000 C CNN
F 2 "" H 1575 8525 50  0001 C CNN
F 3 "" H 1575 8525 50  0001 C CNN
	1    1575 8525
	1    0    0    -1  
$EndComp
NoConn ~ 2025 8375
Text Notes 2600 1925 0    50   ~ 0
14 dB
Wire Wire Line
	4625 5225 4475 5225
Wire Wire Line
	4475 5225 4475 5025
Connection ~ 4475 5025
Wire Wire Line
	4475 5025 4625 5025
Wire Wire Line
	2025 7925 1225 7925
Wire Wire Line
	1225 7925 1225 9150
Wire Wire Line
	2025 7725 1125 7725
Wire Wire Line
	1125 7725 1125 9250
Wire Wire Line
	2025 7625 1025 7625
Wire Wire Line
	1025 7625 1025 9350
Wire Wire Line
	2025 7525 925  7525
Wire Wire Line
	925  7525 925  9450
Wire Wire Line
	2025 7425 825  7425
Wire Wire Line
	825  7425 825  9550
Wire Wire Line
	2025 7325 725  7325
Wire Wire Line
	725  7325 725  9650
Wire Wire Line
	1225 9150 5100 9150
Wire Wire Line
	1125 9250 5100 9250
Wire Wire Line
	1025 9350 5100 9350
Wire Wire Line
	925  9450 5100 9450
Wire Wire Line
	825  9550 5100 9550
Wire Wire Line
	725  9650 5100 9650
Wire Wire Line
	3425 8225 4075 8225
Wire Wire Line
	4075 8225 4075 9750
Wire Wire Line
	4075 9750 5100 9750
Wire Wire Line
	3425 8125 4175 8125
Wire Wire Line
	4175 8125 4175 9850
Wire Wire Line
	4175 9850 5100 9850
Wire Wire Line
	3425 8025 4275 8025
Wire Wire Line
	4275 8025 4275 9950
Wire Wire Line
	4275 9950 5100 9950
Wire Wire Line
	3425 7925 4375 7925
Wire Wire Line
	4375 7925 4375 10050
Wire Wire Line
	4375 10050 5100 10050
Wire Wire Line
	3425 7625 4475 7625
Wire Wire Line
	4575 7525 3675 7525
Connection ~ 3675 7525
Wire Wire Line
	4675 7425 3575 7425
Connection ~ 3575 7425
$Comp
L power:GND #PWR015
U 1 1 5FCC3203
P 5025 8250
F 0 "#PWR015" H 5025 8000 50  0001 C CNN
F 1 "GND" H 4875 8200 50  0000 C CNN
F 2 "" H 5025 8250 50  0001 C CNN
F 3 "" H 5025 8250 50  0001 C CNN
	1    5025 8250
	1    0    0    -1  
$EndComp
Wire Wire Line
	5100 8100 5025 8100
Wire Wire Line
	5025 8100 5025 8250
$Comp
L RF_Blocks:GPIO-Output U3
U 1 1 5FCD3157
P 5200 9600
F 0 "U3" H 4947 9554 50  0000 R CNN
F 1 "GPIO-Output" H 4947 9645 50  0000 R CNN
F 2 "" H 5300 9600 50  0001 C CNN
F 3 "" H 5300 9600 50  0001 C CNN
	1    5200 9600
	-1   0    0    1   
$EndComp
$Comp
L RF_Blocks:GPIO-Input U5
U 1 1 5FC46773
P 5200 6950
F 0 "U5" H 4948 7296 50  0000 R CNN
F 1 "GPIO-Input" H 4948 7205 50  0000 R CNN
F 2 "" H 5200 6950 50  0001 C CNN
F 3 "" H 5200 6950 50  0001 C CNN
	1    5200 6950
	-1   0    0    -1  
$EndComp
Wire Wire Line
	4475 7625 4475 8000
Wire Wire Line
	4475 8000 5100 8000
Wire Wire Line
	4575 7525 4575 7900
Wire Wire Line
	4575 7900 5100 7900
Wire Wire Line
	4675 7425 4675 7800
Wire Wire Line
	4675 7800 5100 7800
Wire Wire Line
	5100 6200 1325 6200
Connection ~ 1325 6200
Wire Wire Line
	1325 6200 1325 5625
Wire Wire Line
	5100 6300 1575 6300
Connection ~ 1575 6300
Wire Wire Line
	1575 6300 1575 3125
Wire Wire Line
	5100 6400 1675 6400
Connection ~ 1675 6400
Wire Wire Line
	1675 6400 1675 2725
Wire Wire Line
	5100 6500 3975 6500
Connection ~ 3975 6500
Wire Wire Line
	3975 6500 3975 5325
Wire Wire Line
	5100 6600 3875 6600
Connection ~ 3875 6600
Wire Wire Line
	3875 6600 3875 2825
Wire Notes Line
	925  6025 6325 6025
Wire Notes Line
	6325 6025 6325 7275
Wire Notes Line
	6325 7275 4625 7275
Wire Notes Line
	4625 7275 4625 7000
Wire Notes Line
	4625 7000 925  7000
Wire Notes Line
	925  7000 925  6025
Text Notes 5500 7175 0    50   ~ 0
Alternate wiring for\nexternal SPI control.
$Comp
L power:+10V #PWR0101
U 1 1 5FCBA210
P 2375 875
F 0 "#PWR0101" H 2375 725 50  0001 C CNN
F 1 "+10V" H 2390 1048 50  0000 C CNN
F 2 "" H 2375 875 50  0001 C CNN
F 3 "" H 2375 875 50  0001 C CNN
	1    2375 875 
	1    0    0    -1  
$EndComp
$Comp
L RF_Blocks:SPI U2
U 1 1 5FE45808
P 5200 7950
F 0 "U2" H 4947 7996 50  0000 R CNN
F 1 "SPI" H 4947 7905 50  0000 R CNN
F 2 "" H 5200 7950 50  0001 C CNN
F 3 "" H 5200 7950 50  0001 C CNN
	1    5200 7950
	-1   0    0    -1  
$EndComp
NoConn ~ 5100 7100
NoConn ~ 5100 7000
NoConn ~ 5100 6900
NoConn ~ 5100 6800
NoConn ~ 5100 6700
$Comp
L power:+5V #PWR0102
U 1 1 5FE5F296
P 5575 825
F 0 "#PWR0102" H 5575 675 50  0001 C CNN
F 1 "+5V" H 5590 998 50  0000 C CNN
F 2 "" H 5575 825 50  0001 C CNN
F 3 "" H 5575 825 50  0001 C CNN
	1    5575 825 
	1    0    0    -1  
$EndComp
$Comp
L power:+10V #PWR0103
U 1 1 5FE5F7E8
P 6000 825
F 0 "#PWR0103" H 6000 675 50  0001 C CNN
F 1 "+10V" H 6015 998 50  0000 C CNN
F 2 "" H 6000 825 50  0001 C CNN
F 3 "" H 6000 825 50  0001 C CNN
	1    6000 825 
	1    0    0    -1  
$EndComp
$Comp
L power:PWR_FLAG #FLG0101
U 1 1 5FE600D9
P 5575 825
F 0 "#FLG0101" H 5575 900 50  0001 C CNN
F 1 "PWR_FLAG" H 5575 998 50  0000 C CNN
F 2 "" H 5575 825 50  0001 C CNN
F 3 "~" H 5575 825 50  0001 C CNN
	1    5575 825 
	-1   0    0    1   
$EndComp
$Comp
L power:PWR_FLAG #FLG0102
U 1 1 5FE60912
P 6000 825
F 0 "#FLG0102" H 6000 900 50  0001 C CNN
F 1 "PWR_FLAG" H 6000 998 50  0000 C CNN
F 2 "" H 6000 825 50  0001 C CNN
F 3 "~" H 6000 825 50  0001 C CNN
	1    6000 825 
	-1   0    0    1   
$EndComp
$Comp
L power:PWR_FLAG #FLG0103
U 1 1 5FE60CCB
P 4700 825
F 0 "#FLG0103" H 4700 900 50  0001 C CNN
F 1 "PWR_FLAG" H 4700 998 50  0000 C CNN
F 2 "" H 4700 825 50  0001 C CNN
F 3 "~" H 4700 825 50  0001 C CNN
	1    4700 825 
	1    0    0    -1  
$EndComp
$Comp
L power:GND #PWR0104
U 1 1 5FE61389
P 4700 825
F 0 "#PWR0104" H 4700 575 50  0001 C CNN
F 1 "GND" H 4705 652 50  0000 C CNN
F 2 "" H 4700 825 50  0001 C CNN
F 3 "" H 4700 825 50  0001 C CNN
	1    4700 825 
	1    0    0    -1  
$EndComp
$Comp
L power:+3V3 #PWR0105
U 1 1 5FE61CB5
P 5125 825
F 0 "#PWR0105" H 5125 675 50  0001 C CNN
F 1 "+3V3" H 5140 998 50  0000 C CNN
F 2 "" H 5125 825 50  0001 C CNN
F 3 "" H 5125 825 50  0001 C CNN
	1    5125 825 
	1    0    0    -1  
$EndComp
$Comp
L power:PWR_FLAG #FLG0104
U 1 1 5FE69153
P 5125 825
F 0 "#FLG0104" H 5125 900 50  0001 C CNN
F 1 "PWR_FLAG" H 5125 998 50  0000 C CNN
F 2 "" H 5125 825 50  0001 C CNN
F 3 "~" H 5125 825 50  0001 C CNN
	1    5125 825 
	-1   0    0    1   
$EndComp
Wire Wire Line
	4625 3225 3450 3225
Wire Wire Line
	3450 3225 3450 4350
Wire Wire Line
	3450 5725 4625 5725
Wire Wire Line
	3250 4350 3450 4350
Connection ~ 3450 4350
Wire Wire Line
	3450 4350 3450 5725
NoConn ~ 6025 2975
$Comp
L power:GND #PWR?
U 1 1 5FED5B21
P 3250 4425
F 0 "#PWR?" H 3250 4175 50  0001 C CNN
F 1 "GND" H 3100 4375 50  0000 C CNN
F 2 "" H 3250 4425 50  0001 C CNN
F 3 "" H 3250 4425 50  0001 C CNN
	1    3250 4425
	1    0    0    -1  
$EndComp
Wire Wire Line
	3250 4350 3250 4425
$EndSCHEMATC
