(module DFN-6-1EP_3x3mm_P0.95mm_EP1.2x2.0mm (layer F.Cu) (tedit 5DC9F6C5)
  (descr "DFN6 3*3 MM, 0.95 PITCH; CASE 506AH-01 (see ON Semiconductor 506AH.PDF)")
  (tags "DFN 0.95")
  (attr smd)
  (fp_text reference U1 (at 0 -2.575) (layer F.SilkS)
    (effects (font (size 0.635 0.635) (thickness 0.1016)))
  )
  (fp_text value PE4140 (at 1.016 0 -270) (layer F.Fab)
    (effects (font (size 0.508 0.508) (thickness 0.0762)))
  )
  (fp_text user %R (at -0.1778 -0.0254 -270) (layer F.Fab)
    (effects (font (size 0.7 0.7) (thickness 0.105)))
  )
  (fp_line (start -0.5 -1.5) (end 1.5 -1.5) (layer F.Fab) (width 0.15))
  (fp_line (start 1.5 -1.5) (end 1.5 1.5) (layer F.Fab) (width 0.15))
  (fp_line (start 1.5 1.5) (end -1.5 1.5) (layer F.Fab) (width 0.15))
  (fp_line (start -1.5 1.5) (end -1.5 -0.5) (layer F.Fab) (width 0.15))
  (fp_line (start -1.5 -0.5) (end -0.5 -1.5) (layer F.Fab) (width 0.15))
  (fp_line (start -1.9 -1.85) (end -1.9 1.85) (layer F.CrtYd) (width 0.05))
  (fp_line (start 1.9 -1.85) (end 1.9 1.85) (layer F.CrtYd) (width 0.05))
  (fp_line (start -1.9 -1.85) (end 1.9 -1.85) (layer F.CrtYd) (width 0.05))
  (fp_line (start -1.9 1.85) (end 1.9 1.85) (layer F.CrtYd) (width 0.05))
  (fp_line (start -1.025 1.65) (end 1.025 1.65) (layer F.SilkS) (width 0.15))
  (fp_line (start -1.73 -1.65) (end 1.025 -1.65) (layer F.SilkS) (width 0.15))
  (pad 1 smd rect (at -1.34 -0.95) (size 0.63 0.45) (layers F.Cu F.Paste F.Mask)
    (solder_paste_margin -0.0254))
  (pad 2 smd rect (at -1.34 0) (size 0.63 0.45) (layers F.Cu F.Paste F.Mask)
    (solder_paste_margin -0.0254))
  (pad 3 smd rect (at -1.34 0.95) (size 0.63 0.45) (layers F.Cu F.Paste F.Mask)
    (solder_paste_margin -0.0254))
  (pad 4 smd rect (at 1.34 0.95) (size 0.63 0.45) (layers F.Cu F.Paste F.Mask)
    (solder_paste_margin -0.0254))
  (pad 5 smd rect (at 1.34 0) (size 0.63 0.45) (layers F.Cu F.Paste F.Mask)
    (solder_paste_margin -0.0254))
  (pad 6 smd rect (at 1.34 -0.95) (size 0.63 0.45) (layers F.Cu F.Paste F.Mask)
    (solder_paste_margin -0.0254))
  (pad 7 smd rect (at 0 0) (size 1.2 2) (layers F.Cu F.Mask))
  (pad 7 thru_hole rect (at -0.29972 -0.49784) (size 0.6 1) (drill 0.381) (layers *.Cu F.Paste F.Mask)
    (solder_paste_margin -0.1016))
  (pad 7 thru_hole rect (at 0.29972 -0.49784) (size 0.6 1) (drill 0.381) (layers *.Cu F.Paste F.Mask)
    (solder_paste_margin -0.1016))
  (pad 7 thru_hole rect (at 0.29972 0.50292) (size 0.6 1) (drill 0.381) (layers *.Cu F.Paste F.Mask)
    (solder_paste_margin -0.1016))
  (pad 7 thru_hole rect (at -0.29972 0.50292) (size 0.6 1) (drill 0.381) (layers *.Cu F.Paste F.Mask)
    (solder_paste_margin -0.1016))
  (model ${KISYS3DMOD}/Package_DFN_QFN.3dshapes/DFN-6-1EP_3x3mm_P0.95mm_EP1.7x2.6mm.wrl
    (at (xyz 0 0 0))
    (scale (xyz 1 1 1))
    (rotate (xyz 0 0 0))
  )
)
