(module minickts-DF782 (layer F.Cu) (tedit 550CE581)
  (descr "MINICIRCUITS DF782 PACKAGE")
  (tags "MINICIRCUITS DF782 PACKAGE")
  (attr smd)
  (fp_text reference U3 (at 1.905 -5.969) (layer F.SilkS)
    (effects (font (size 1.778 1.778) (thickness 0.0889)))
  )
  (fp_text value GALI49 (at 2.794 -3.429) (layer F.SilkS)
    (effects (font (size 1.778 1.778) (thickness 0.0889)))
  )
  (fp_line (start -2.286 1.27) (end -2.286 -1.27) (layer F.SilkS) (width 0.127))
  (fp_line (start 2.286 -1.27) (end 2.286 1.27) (layer F.SilkS) (width 0.127))
  (fp_line (start 2.54 -1.524) (end 2.54 1.524) (layer F.SilkS) (width 0.254))
  (fp_line (start 2.54 1.524) (end 2.286 1.524) (layer F.SilkS) (width 0.254))
  (fp_line (start -2.286 1.524) (end -2.54 1.524) (layer F.SilkS) (width 0.254))
  (fp_line (start -2.54 1.524) (end -2.54 -1.524) (layer F.SilkS) (width 0.254))
  (pad 1 smd rect (at -1.4986 1.8542) (size 0.7112 1.4986) (layers F.Cu F.Paste F.Mask))
  (pad 2 smd rect (at 0 1.6002) (size 0.7112 2.0574) (layers F.Cu F.Paste F.Mask))
  (pad 3 smd rect (at 1.4986 1.8542) (size 0.7112 1.4986) (layers F.Cu F.Paste F.Mask))
  (pad 4 smd rect (at 0 -0.9144) (size 1.905 1.4986) (layers F.Cu F.Paste F.Mask))
)
