(module osc (layer F.Cu) (tedit 51122210)
  (fp_text reference osc (at 0 -1.778) (layer F.SilkS)
    (effects (font (size 1.00076 1.00076) (thickness 0.14986)))
  )
  (fp_text value VAL** (at 0 0.127) (layer F.SilkS)
    (effects (font (size 1.00076 1.00076) (thickness 0.14986)))
  )
  (fp_line (start -3.556 -0.508) (end -3.556 0.508) (layer F.SilkS) (width 0.14986))
  (fp_line (start 3.556 -0.508) (end 3.556 0.508) (layer F.SilkS) (width 0.14986))
  (fp_line (start 3.556 0.508) (end 3.556 -0.508) (layer F.SilkS) (width 0.14986))
  (fp_line (start -1.27 2.54) (end 1.016 2.54) (layer F.SilkS) (width 0.14986))
  (fp_line (start -1.27 -2.54) (end 1.143 -2.54) (layer F.SilkS) (width 0.14986))
  (pad 1 smd rect (at -2.54 2.032) (size 1.8034 2.0066) (layers F.Cu F.Paste F.Mask))
  (pad 2 smd rect (at 2.54 2.032) (size 1.8034 2.0066) (layers F.Cu F.Paste F.Mask))
  (pad 3 smd rect (at 2.54 -2.032) (size 1.8034 2.0066) (layers F.Cu F.Paste F.Mask))
  (pad 4 smd rect (at -2.54 -2.032) (size 1.8034 2.0066) (layers F.Cu F.Paste F.Mask))
)
