(module minickts-FG873 (layer F.Cu) (tedit 200000)
  (descr "FG873 PACKAGE")
  (tags "FG873 PACKAGE")
  (attr smd)
  (fp_text reference >NAME (at 4.699 -2.159) (layer B.SilkS)
    (effects (font (size 1.27 1.27) (thickness 0.0889)))
  )
  (fp_text value >VALUE (at 5.334 2.159) (layer B.SilkS)
    (effects (font (size 1.27 1.27) (thickness 0.0889)))
  )
  (fp_line (start 0 -2.2606) (end 2.2606 0) (layer F.SilkS) (width 0.2032))
  (fp_line (start 2.2606 0) (end 0 2.2606) (layer F.SilkS) (width 0.2032))
  (fp_line (start 0 2.2606) (end -2.2606 0) (layer F.SilkS) (width 0.2032))
  (fp_line (start -2.2606 0) (end 0 -2.2606) (layer F.SilkS) (width 0.2032))
  (fp_line (start -1.9558 0) (end 0 -1.9558) (layer F.SilkS) (width 0.2032))
  (fp_line (start 0 -1.9558) (end 1.9558 0) (layer F.SilkS) (width 0.2032))
  (fp_line (start 1.9558 0) (end 0 1.9558) (layer F.SilkS) (width 0.2032))
  (fp_line (start 0 1.9558) (end -1.9558 0) (layer F.SilkS) (width 0.2032))
  (fp_circle (center 0.8128 2.3622) (end 0.9525 2.5019) (layer F.SilkS))
  (fp_circle (center 0 1.27) (end -0.127 1.397) (layer F.SilkS))
  (pad 1 smd rect (at 0 1.8288) (size 2.032 0.6096) (layers F.Cu F.Paste F.Mask))
  (pad 2 smd rect (at 1.8288 0) (size 2.032 0.6096) (layers F.Cu F.Paste F.Mask))
  (pad 3 smd rect (at 0 -1.8542) (size 2.032 0.6096) (layers F.Cu F.Paste F.Mask))
  (pad 4 smd rect (at -1.8288 0) (size 2.032 0.6096) (layers F.Cu F.Paste F.Mask))
)
