(module minicircuits-DZ944 (layer F.Cu) (tedit 200000)
  (descr DZ944)
  (tags DZ944)
  (attr smd)
  (fp_text reference >NAME (at -2.54 -3.81 90) (layer B.SilkS)
    (effects (font (size 1.27 1.27) (thickness 0.0889)))
  )
  (fp_text value >VALUE (at 6.985 -4.445 90) (layer B.SilkS)
    (effects (font (size 1.27 1.27) (thickness 0.0889)))
  )
  (fp_line (start -0.635 -0.635) (end -0.635 -6.985) (layer F.SilkS) (width 0.127))
  (fp_line (start 5.715 -6.985) (end 5.715 -0.635) (layer F.SilkS) (width 0.127))
  (fp_line (start -0.635 -6.985) (end -0.3175 -6.985) (layer F.SilkS) (width 0.127))
  (fp_line (start 0.3175 -6.985) (end 0.9525 -6.985) (layer F.SilkS) (width 0.127))
  (fp_line (start 1.5875 -6.985) (end 2.2225 -6.985) (layer F.SilkS) (width 0.127))
  (fp_line (start 2.8575 -6.985) (end 3.4925 -6.985) (layer F.SilkS) (width 0.127))
  (fp_line (start 4.1275 -6.985) (end 4.7625 -6.985) (layer F.SilkS) (width 0.127))
  (fp_line (start 5.715 -6.985) (end 5.3975 -6.985) (layer F.SilkS) (width 0.127))
  (fp_line (start -0.635 -0.635) (end -0.3175 -0.635) (layer F.SilkS) (width 0.127))
  (fp_line (start 0.3175 -0.635) (end 0.9525 -0.635) (layer F.SilkS) (width 0.127))
  (fp_line (start 1.5875 -0.635) (end 2.2225 -0.635) (layer F.SilkS) (width 0.127))
  (fp_line (start 2.8575 -0.635) (end 3.4925 -0.635) (layer F.SilkS) (width 0.127))
  (fp_line (start 4.7625 -0.635) (end 4.1275 -0.635) (layer F.SilkS) (width 0.127))
  (fp_line (start 5.3975 -0.635) (end 5.715 -0.635) (layer F.SilkS) (width 0.127))
  (fp_circle (center 0 -3.175) (end -0.3175 -3.4925) (layer F.SilkS) (width 0.0635))
  (pad 1 smd rect (at 0 -1.27) (size 2.159 0.762) (layers F.Cu F.Paste F.Mask))
  (pad 2 smd rect (at 1.27 -1.27) (size 2.159 0.762) (layers F.Cu F.Paste F.Mask))
  (pad 3 smd rect (at 2.54 -1.27) (size 2.159 0.762) (layers F.Cu F.Paste F.Mask))
  (pad 4 smd rect (at 3.81 -1.27) (size 2.159 0.762) (layers F.Cu F.Paste F.Mask))
  (pad 5 smd rect (at 5.08 -1.27) (size 2.159 0.762) (layers F.Cu F.Paste F.Mask))
  (pad 6 smd rect (at 5.08 -6.35) (size 2.159 0.762) (layers F.Cu F.Paste F.Mask))
  (pad 7 smd rect (at 3.81 -6.35) (size 2.159 0.762) (layers F.Cu F.Paste F.Mask))
  (pad 8 smd rect (at 2.54 -6.35) (size 2.159 0.762) (layers F.Cu F.Paste F.Mask))
  (pad 9 smd rect (at 1.27 -6.35) (size 2.159 0.762) (layers F.Cu F.Paste F.Mask))
  (pad 10 smd rect (at 0 -6.35) (size 2.159 0.762) (layers F.Cu F.Paste F.Mask))
)
