(module UMCC (layer F.Cu) (tedit 5B5033B8)
  (fp_text reference J6 (at 0.0254 3.17754) (layer F.SilkS)
    (effects (font (size 1 1) (thickness 0.15)))
  )
  (fp_text value ~ (at 0.00254 -3.06324) (layer F.Fab)
    (effects (font (size 1 1) (thickness 0.15)))
  )
  (pad 2 smd rect (at 1.4986 -0.65024) (size 1.05 2.2) (layers F.Cu F.Paste F.Mask))
  (pad 2 smd rect (at -1.49606 -0.65024) (size 1.05 2.2) (layers F.Cu F.Paste F.Mask))
  (pad 1 smd rect (at 0 0.9144) (size 1 1) (layers F.Cu F.Paste F.Mask))
)
