(module minickts-MMM168 (layer F.Cu) (tedit 200000)
  (attr smd)
  (fp_text reference >NAME (at 0.889 -3.683) (layer B.SilkS)
    (effects (font (size 1.27 1.27) (thickness 0.0889)))
  )
  (fp_text value >VALUE (at 1.27 3.429) (layer B.SilkS)
    (effects (font (size 1.27 1.27) (thickness 0.0889)))
  )
  (fp_line (start 1.016 -2.286) (end 1.778 -2.286) (layer F.SilkS) (width 0.127))
  (fp_line (start 1.778 -2.286) (end 1.778 -1.524) (layer F.SilkS) (width 0.127))
  (fp_line (start 1.778 1.524) (end 1.778 2.286) (layer F.SilkS) (width 0.127))
  (fp_line (start 1.778 2.286) (end 1.016 2.286) (layer F.SilkS) (width 0.127))
  (fp_line (start -1.016 2.286) (end -1.778 2.286) (layer F.SilkS) (width 0.127))
  (fp_line (start -1.778 2.286) (end -1.778 1.524) (layer F.SilkS) (width 0.127))
  (fp_line (start -1.016 -2.286) (end -1.778 -2.286) (layer F.SilkS) (width 0.127))
  (fp_line (start -1.778 -2.286) (end -1.778 -1.524) (layer F.SilkS) (width 0.127))
  (fp_text user 1 (at 3.175 -1.905) (layer B.SilkS)
    (effects (font (size 1.27 1.27) (thickness 0.0889)))
  )
  (pad 1 smd rect (at 0.9652 -1.143) (size 0.889 1.29286) (layers F.Cu F.Paste F.Mask))
  (pad 2 smd rect (at 0.9652 1.1684) (size 0.889 1.29286) (layers F.Cu F.Paste F.Mask))
  (pad 3 smd rect (at -0.6858 1.143) (size 1.1938 1.29286) (layers F.Cu F.Paste F.Mask))
  (pad 4 smd rect (at -0.8382 -1.143) (size 0.889 1.29286) (layers F.Cu F.Paste F.Mask))
)
