(module minicircuits-KK81 (layer F.Cu) (tedit 200000)
  (attr smd)
  (fp_text reference >NAME (at 0 -1.5748) (layer B.SilkS)
    (effects (font (size 1.27 1.27) (thickness 0.0889)))
  )
  (fp_text value >VALUE (at 0.635 0.8382) (layer B.SilkS)
    (effects (font (size 1.27 1.27) (thickness 0.0889)))
  )
  (fp_line (start -2.794 -3.429) (end -2.286 -3.429) (layer F.SilkS) (width 0.06604))
  (fp_line (start -2.286 -3.429) (end -2.286 -7.2898) (layer F.SilkS) (width 0.06604))
  (fp_line (start -2.794 -7.2898) (end -2.286 -7.2898) (layer F.SilkS) (width 0.06604))
  (fp_line (start -2.794 -3.429) (end -2.794 -7.2898) (layer F.SilkS) (width 0.06604))
  (fp_line (start -0.254 -3.429) (end 0.254 -3.429) (layer F.SilkS) (width 0.06604))
  (fp_line (start 0.254 -3.429) (end 0.254 -7.2898) (layer F.SilkS) (width 0.06604))
  (fp_line (start -0.254 -7.2898) (end 0.254 -7.2898) (layer F.SilkS) (width 0.06604))
  (fp_line (start -0.254 -3.429) (end -0.254 -7.2898) (layer F.SilkS) (width 0.06604))
  (fp_line (start 2.286 -3.429) (end 2.794 -3.429) (layer F.SilkS) (width 0.06604))
  (fp_line (start 2.794 -3.429) (end 2.794 -7.2898) (layer F.SilkS) (width 0.06604))
  (fp_line (start 2.286 -7.2898) (end 2.794 -7.2898) (layer F.SilkS) (width 0.06604))
  (fp_line (start 2.286 -3.429) (end 2.286 -7.2898) (layer F.SilkS) (width 0.06604))
  (fp_line (start -2.794 7.2898) (end -2.286 7.2898) (layer F.SilkS) (width 0.06604))
  (fp_line (start -2.286 7.2898) (end -2.286 3.429) (layer F.SilkS) (width 0.06604))
  (fp_line (start -2.794 3.429) (end -2.286 3.429) (layer F.SilkS) (width 0.06604))
  (fp_line (start -2.794 7.2898) (end -2.794 3.429) (layer F.SilkS) (width 0.06604))
  (fp_line (start -0.254 7.2898) (end 0.254 7.2898) (layer F.SilkS) (width 0.06604))
  (fp_line (start 0.254 7.2898) (end 0.254 3.429) (layer F.SilkS) (width 0.06604))
  (fp_line (start -0.254 3.429) (end 0.254 3.429) (layer F.SilkS) (width 0.06604))
  (fp_line (start -0.254 7.2898) (end -0.254 3.429) (layer F.SilkS) (width 0.06604))
  (fp_line (start 2.286 7.2898) (end 2.794 7.2898) (layer F.SilkS) (width 0.06604))
  (fp_line (start 2.794 7.2898) (end 2.794 3.429) (layer F.SilkS) (width 0.06604))
  (fp_line (start 2.286 3.429) (end 2.794 3.429) (layer F.SilkS) (width 0.06604))
  (fp_line (start 2.286 7.2898) (end 2.286 3.429) (layer F.SilkS) (width 0.06604))
  (fp_line (start -3.81 3.429) (end 3.81 3.429) (layer F.SilkS) (width 0.127))
  (fp_line (start 3.81 3.429) (end 3.81 -3.429) (layer F.SilkS) (width 0.127))
  (fp_line (start 3.81 -3.429) (end -3.81 -3.429) (layer F.SilkS) (width 0.127))
  (fp_line (start -3.81 -3.429) (end -3.81 3.429) (layer F.SilkS) (width 0.127))
  (fp_circle (center -3.048 2.667) (end -3.302 2.921) (layer F.SilkS) (width 0.0635))
  (pad 1 smd rect (at -2.54 -7.23646) (size 0.6096 1.778) (layers F.Cu F.Paste F.Mask))
  (pad 2 smd rect (at 0 -7.23646) (size 0.6096 1.778) (layers F.Cu F.Paste F.Mask))
  (pad 3 smd rect (at 2.54 -7.23646) (size 0.6096 1.778) (layers F.Cu F.Paste F.Mask))
  (pad 4 smd rect (at 2.54 7.23646) (size 0.6096 1.778) (layers F.Cu F.Paste F.Mask))
  (pad 5 smd rect (at 0 7.23646) (size 0.6096 1.778) (layers F.Cu F.Paste F.Mask))
  (pad 6 smd rect (at -2.54 7.23646) (size 0.6096 1.778) (layers F.Cu F.Paste F.Mask))
)
