(module minickts-AF320 (layer F.Cu) (tedit 200000)
  (descr "AF320 - USED IN MINICIRCUITS PAT SERIES ATTENUATORS")
  (tags "AF320 - USED IN MINICIRCUITS PAT SERIES ATTENUATORS")
  (attr smd)
  (fp_text reference >NAME (at 0 -5.715) (layer B.SilkS)
    (effects (font (size 1.27 1.27) (thickness 0.0889)))
  )
  (fp_text value >VALUE (at 0 -3.81) (layer B.SilkS)
    (effects (font (size 1.27 1.27) (thickness 0.0889)))
  )
  (fp_line (start -0.508 -0.889) (end 0.508 -0.889) (layer F.SilkS) (width 0.06604))
  (fp_line (start 0.508 -0.889) (end 0.508 -2.54) (layer F.SilkS) (width 0.06604))
  (fp_line (start -0.508 -2.54) (end 0.508 -2.54) (layer F.SilkS) (width 0.06604))
  (fp_line (start -0.508 -0.889) (end -0.508 -2.54) (layer F.SilkS) (width 0.06604))
  (fp_line (start -2.54 0.254) (end -0.889 0.254) (layer F.SilkS) (width 0.06604))
  (fp_line (start -0.889 0.254) (end -0.889 -0.254) (layer F.SilkS) (width 0.06604))
  (fp_line (start -2.54 -0.254) (end -0.889 -0.254) (layer F.SilkS) (width 0.06604))
  (fp_line (start -2.54 0.254) (end -2.54 -0.254) (layer F.SilkS) (width 0.06604))
  (fp_line (start 0.889 0.254) (end 2.54 0.254) (layer F.SilkS) (width 0.06604))
  (fp_line (start 2.54 0.254) (end 2.54 -0.254) (layer F.SilkS) (width 0.06604))
  (fp_line (start 0.889 -0.254) (end 2.54 -0.254) (layer F.SilkS) (width 0.06604))
  (fp_line (start 0.889 0.254) (end 0.889 -0.254) (layer F.SilkS) (width 0.06604))
  (fp_line (start -0.508 2.54) (end 0.508 2.54) (layer F.SilkS) (width 0.06604))
  (fp_line (start 0.508 2.54) (end 0.508 0.889) (layer F.SilkS) (width 0.06604))
  (fp_line (start -0.508 0.889) (end 0.508 0.889) (layer F.SilkS) (width 0.06604))
  (fp_line (start -0.508 2.54) (end -0.508 0.889) (layer F.SilkS) (width 0.06604))
  (fp_circle (center 0 0) (end -0.4445 0.4445) (layer F.SilkS) (width 0.0635))
  (pad 1 smd rect (at -2.159 0) (size 1.524 1.524) (layers F.Cu F.Paste F.Mask))
  (pad 2 smd rect (at 0 2.159) (size 1.524 1.524) (layers F.Cu F.Paste F.Mask))
  (pad 3 smd rect (at 2.159 0) (size 1.524 1.524) (layers F.Cu F.Paste F.Mask))
  (pad 4 smd rect (at 0 -2.159) (size 1.524 1.524) (layers F.Cu F.Paste F.Mask))
)
