(module mmcx_th (layer F.Cu) (tedit 5D0C6F0F)
  (fp_text reference J14 (at -0.06604 6.69036) (layer F.SilkS)
    (effects (font (size 0.635 0.635) (thickness 0.1016)))
  )
  (fp_text value "Vtune Out" (at -1.6129 -3.14706) (layer F.Fab)
    (effects (font (size 0.635 0.635) (thickness 0.1016)))
  )
  (fp_line (start -2.286 2.286) (end 2.286 2.286) (layer F.Fab) (width 0.15))
  (fp_line (start 2.286 2.286) (end 2.286 -2.286) (layer F.Fab) (width 0.15))
  (fp_line (start 2.286 -2.286) (end -2.286 -2.286) (layer F.Fab) (width 0.15))
  (fp_line (start -2.286 -2.286) (end -2.286 2.286) (layer F.Fab) (width 0.15))
  (fp_line (start -2.54 2.54) (end 2.54 2.54) (layer F.CrtYd) (width 0.05))
  (fp_line (start 2.54 2.54) (end 2.54 -2.5273) (layer F.CrtYd) (width 0.05))
  (fp_line (start 2.54 -2.5273) (end -2.54 -2.5273) (layer F.CrtYd) (width 0.05))
  (fp_line (start -2.54 -2.5273) (end -2.54 2.54) (layer F.CrtYd) (width 0.05))
  (pad 1 thru_hole circle (at 0 0.00254) (size 1.524 1.524) (drill 0.8636) (layers *.Cu *.Mask))
  (pad 2 thru_hole circle (at 1.26746 -1.27254) (size 1.524 1.524) (drill 0.85) (layers *.Cu *.Mask))
  (pad 2 thru_hole circle (at 1.27 1.27) (size 1.524 1.524) (drill 0.8636) (layers *.Cu *.Mask))
  (pad 2 thru_hole circle (at -1.27254 1.27) (size 1.524 1.524) (drill 0.8636) (layers *.Cu *.Mask))
  (pad 2 thru_hole circle (at -1.27 -1.27) (size 1.524 1.524) (drill 0.8636) (layers *.Cu *.Mask))
)
