EESchema Schematic File Version 4
EELAYER 30 0
EELAYER END
$Descr A4 11693 8268
encoding utf-8
Sheet 1 1
Title "Step Attenuator"
Date "2021-03-08"
Rev "1.2"
Comp "Dyadic Pty. Ltd."
Comment1 "2021"
Comment2 ""
Comment3 ""
Comment4 ""
$EndDescr
$Comp
L connector:Conn_01x02_Male J2
U 1 1 5E0F4065
P 3450 3125
F 0 "J2" H 3556 3303 50  0000 C CNN
F 1 "5V" H 3556 3212 50  0000 C CNN
F 2 "Connector_PinHeader_2.54mm:PinHeader_1x02_P2.54mm_Vertical" H 3450 3125 50  0001 C CNN
F 3 "~" H 3450 3125 50  0001 C CNN
F 4 "Mintron" H 3450 3125 50  0001 C CNN "MFN"
F 5 "MTP125-1102S1" H 3450 3125 50  0001 C CNN "MFP"
F 6 "C358684" H 3450 3125 50  0001 C CNN "S1PN"
F 7 "LCSC" H 3450 3125 50  0001 C CNN "S1PL"
F 8 "Pin Header Male Pin 0.100\"(2.54mm) 2 pin" H 3450 3125 50  0001 C CNN "Description"
F 9 "Through Hole,P=2.54mm" H 3450 3125 50  0001 C CNN "Package ID"
F 10 "1:$0.01; 10:$0.01; 100:$0.01; 500:$0.008" H 3450 3125 50  0001 C CNN "kicost:LCSC:pricing"
F 11 "https://lcsc.com/product-detail/Pin-Header-Female-Header_MINTRON-MTP125-1102S1_C358684.html" H 3450 3125 50  0001 C CNN "kicost:LCSC:link"
	1    3450 3125
	1    0    0    -1  
$EndComp
$Comp
L project:SMA_2 J6
U 1 1 5E0F424F
P 10150 4725
F 0 "J6" H 10100 4875 50  0000 L CNN
F 1 "~" H 10253 4624 50  0000 L CNN
F 2 "SMA_Connectors:SMA_EDGE_4" H 10325 4625 50  0001 C CNN
F 3 "" H 10150 4725 60  0000 C CNN
F 4 "Molex" H 8825 10500 50  0001 C CNN "MFN"
F 5 "0732511150" H 8825 10500 50  0001 C CNN "MFP"
F 6 "S01-SJEDM-11BS05" H 8825 10500 50  0001 C CNN "S1PN"
F 7 "Superbat" H 8825 10500 50  0001 C CNN "S1PL"
F 8 "73251-1150" H 8825 10500 50  0001 C CNN "S2PN"
F 9 "TTI" H 8825 10500 50  0001 C CNN "S2PL"
F 10 "SMA ST PCB-JCK" H 8825 10500 50  0001 C CNN "Description"
F 11 "1:$1.20; 10:$1.08; 100:$0.98" H 10150 4725 50  0001 C CNN "kicost:RF_Supplier:pricing"
	1    10150 4725
	1    0    0    -1  
$EndComp
$Comp
L project:SMA_2 J5
U 1 1 5E0F4302
P 3575 4725
F 0 "J5" H 3575 4875 50  0000 C CNN
F 1 "~" H 3544 4874 50  0000 C CNN
F 2 "SMA_Connectors:SMA_EDGE_4" H 3750 4625 50  0001 C CNN
F 3 "" H 3575 4725 60  0000 C CNN
F 4 "Molex" H 8825 10500 50  0001 C CNN "MFN"
F 5 "0732511150" H 8825 10500 50  0001 C CNN "MFP"
F 6 "S01-SJEDM-11BS05" H 8825 10500 50  0001 C CNN "S1PN"
F 7 "Superbat" H 8825 10500 50  0001 C CNN "S1PL"
F 8 "73251-1150" H 8825 10500 50  0001 C CNN "S2PN"
F 9 "TTI" H 8825 10500 50  0001 C CNN "S2PL"
F 10 "SMA ST PCB-JCK" H 8825 10500 50  0001 C CNN "Description"
F 11 "1:$1.20; 10:$1.08; 100:$0.98" H 3575 4725 50  0001 C CNN "kicost:RF_Supplier:pricing"
	1    3575 4725
	-1   0    0    -1  
$EndComp
$Comp
L project:PE43711 U1
U 1 1 5E0F4949
P 6800 4425
F 0 "U1" H 5900 5325 60  0000 L CNN
F 1 "PE43711" H 6650 4475 60  0000 L CNN
F 2 "psemi:VQFN-24-1EP_4x4mm_P0.5mm_EP2.45x2.45mm_ThermalVias" H 6800 4375 60  0001 C CNN
F 3 "" H 6800 4375 60  0001 C CNN
F 4 "pSemi" H 6800 4425 50  0001 C CNN "MFN"
F 5 "PE43711B" H 6800 4425 50  0001 C CNN "MFP"
F 6 "PE43711" H 6800 4425 50  0001 C CNN "S1PN"
F 7 "RfMW" H 6800 4425 50  0001 C CNN "S1PL"
F 8 "1046-1138-1-ND" H 6800 4425 50  0001 C CNN "S2PN"
F 9 "Digi-Key" H 6800 4425 50  0001 C CNN "S2PL"
F 10 "RF Attenuator 0dB ~ 31.75dB 9kHz ~ 6GHz 50 Ohms" H 6800 4425 50  0001 C CNN "Description"
F 11 "24-VFQFN Exposed Pad" H 6800 4425 50  0001 C CNN "Package ID"
F 12 "1:$7.44; 10:$7.44; 100:$5.20; 1000:$3.47" H 6800 4425 50  0001 C CNN "kicost:RfMW:pricing"
F 13 "1046-1138-1-ND" H 6800 4425 50  0001 C CNN "digikey#"
	1    6800 4425
	1    0    0    -1  
$EndComp
Wire Wire Line
	6300 5425 6300 5525
Wire Wire Line
	6300 5525 6500 5525
Wire Wire Line
	7300 5525 7300 5425
Wire Wire Line
	7100 5425 7100 5525
Connection ~ 7100 5525
Wire Wire Line
	7100 5525 7300 5525
Wire Wire Line
	6900 5425 6900 5525
Connection ~ 6900 5525
Wire Wire Line
	6900 5525 7100 5525
Wire Wire Line
	6700 5425 6700 5525
Connection ~ 6700 5525
Wire Wire Line
	6700 5525 6900 5525
Wire Wire Line
	6500 5425 6500 5525
Connection ~ 6500 5525
Wire Wire Line
	6500 5525 6700 5525
$Comp
L power:GND #PWR014
U 1 1 5E0F517E
P 6900 5625
F 0 "#PWR014" H 6900 5375 50  0001 C CNN
F 1 "GND" H 6905 5452 50  0000 C CNN
F 2 "" H 6900 5625 50  0001 C CNN
F 3 "" H 6900 5625 50  0001 C CNN
	1    6900 5625
	1    0    0    -1  
$EndComp
Wire Wire Line
	6900 5625 6900 5525
Wire Wire Line
	7800 4525 7900 4525
Wire Wire Line
	7900 4525 7900 4925
Wire Wire Line
	7800 4925 7900 4925
Connection ~ 7900 4925
Wire Wire Line
	7900 4925 7900 5625
$Comp
L power:GND #PWR015
U 1 1 5E0F5422
P 7900 5625
F 0 "#PWR015" H 7900 5375 50  0001 C CNN
F 1 "GND" H 7905 5452 50  0000 C CNN
F 2 "" H 7900 5625 50  0001 C CNN
F 3 "" H 7900 5625 50  0001 C CNN
	1    7900 5625
	1    0    0    -1  
$EndComp
Wire Wire Line
	5800 4525 5700 4525
Wire Wire Line
	5700 4525 5700 4925
$Comp
L power:GND #PWR013
U 1 1 5E0F556E
P 5700 5625
F 0 "#PWR013" H 5700 5375 50  0001 C CNN
F 1 "GND" H 5705 5452 50  0000 C CNN
F 2 "" H 5700 5625 50  0001 C CNN
F 3 "" H 5700 5625 50  0001 C CNN
	1    5700 5625
	1    0    0    -1  
$EndComp
Wire Wire Line
	5800 4925 5700 4925
Connection ~ 5700 4925
Wire Wire Line
	5700 4925 5700 5625
Wire Wire Line
	5800 3925 5700 3925
Wire Wire Line
	5700 3925 5700 1400
Wire Wire Line
	5700 1400 5200 1400
Wire Wire Line
	6300 1500 6300 3425
Wire Wire Line
	4100 1500 4950 1500
Wire Wire Line
	6500 3425 6500 1600
Wire Wire Line
	6500 1600 4700 1600
Wire Wire Line
	6700 3425 6700 1700
Wire Wire Line
	6700 1700 4450 1700
Wire Wire Line
	6900 3425 6900 1800
Wire Wire Line
	6900 1800 4200 1800
Wire Wire Line
	7100 2650 7100 2975
Wire Wire Line
	7300 2650 7300 2725
Wire Wire Line
	7300 2725 7900 2725
Wire Wire Line
	7900 2725 7900 2975
Connection ~ 7300 2725
Wire Wire Line
	7300 2725 7300 3425
Wire Wire Line
	7100 2975 7525 2975
Wire Wire Line
	7525 2975 7525 3125
Connection ~ 7100 2975
Wire Wire Line
	7100 2975 7100 3425
$Comp
L power:GND #PWR012
U 1 1 5E145F90
P 10150 4900
F 0 "#PWR012" H 10150 4650 50  0001 C CNN
F 1 "GND" H 10155 4727 50  0000 C CNN
F 2 "" H 10150 4900 50  0001 C CNN
F 3 "" H 10150 4900 50  0001 C CNN
	1    10150 4900
	1    0    0    -1  
$EndComp
$Comp
L power:GND #PWR011
U 1 1 5E145FEE
P 3575 4900
F 0 "#PWR011" H 3575 4650 50  0001 C CNN
F 1 "GND" H 3580 4727 50  0000 C CNN
F 2 "" H 3575 4900 50  0001 C CNN
F 3 "" H 3575 4900 50  0001 C CNN
	1    3575 4900
	1    0    0    -1  
$EndComp
$Comp
L power:GND #PWR07
U 1 1 5E14604C
P 7525 3325
F 0 "#PWR07" H 7525 3075 50  0001 C CNN
F 1 "GND" H 7530 3152 50  0000 C CNN
F 2 "" H 7525 3325 50  0001 C CNN
F 3 "" H 7525 3325 50  0001 C CNN
	1    7525 3325
	1    0    0    -1  
$EndComp
$Comp
L power:GND #PWR06
U 1 1 5E14607B
P 7900 3175
F 0 "#PWR06" H 7900 2925 50  0001 C CNN
F 1 "GND" H 7905 3002 50  0000 C CNN
F 2 "" H 7900 3175 50  0001 C CNN
F 3 "" H 7900 3175 50  0001 C CNN
	1    7900 3175
	1    0    0    -1  
$EndComp
Wire Wire Line
	5200 2375 5200 1400
Connection ~ 5200 1400
Wire Wire Line
	5200 1400 4100 1400
Wire Wire Line
	4950 2375 4950 1500
Connection ~ 4950 1500
Wire Wire Line
	4950 1500 6300 1500
Wire Wire Line
	4700 2375 4700 1600
Connection ~ 4700 1600
Wire Wire Line
	4700 1600 4100 1600
Wire Wire Line
	4450 2375 4450 1700
Connection ~ 4450 1700
Wire Wire Line
	4450 1700 4100 1700
Wire Wire Line
	4200 2375 4200 1800
Connection ~ 4200 1800
Wire Wire Line
	4200 1800 4100 1800
$Comp
L device:R_Small R3
U 1 1 5E169F74
P 4900 3825
F 0 "R3" H 5025 3825 50  0000 C CNN
F 1 "10K" V 4795 3825 50  0000 C CNN
F 2 "Resistor_SMD:R_0402_1005Metric" H 4900 3825 50  0001 C CNN
F 3 "~" H 4900 3825 50  0001 C CNN
F 4 "Yageo" H 4900 3825 50  0001 C CNN "MFN"
F 5 "RC0402FR-0710KL" H 4900 3825 50  0001 C CNN "MFP"
F 6 "603-RC0402FR-0710KL" H 4900 3825 50  0001 C CNN "S1PN"
F 7 "Mouser" H 4900 3825 50  0001 C CNN "S1PL"
F 8 "311-10.0KLRCT-ND" H 4900 3825 50  0001 C CNN "S2PN"
F 9 "Digi-Key" H 4900 3825 50  0001 C CNN "S2PL"
F 10 "RES SMD 10K OHM 1% 1/16W" H 4900 3825 50  0001 C CNN "Description"
F 11 "0402 (1005 Metric)" H 4900 3825 50  0001 C CNN "Package ID"
	1    4900 3825
	-1   0    0    1   
$EndComp
$Comp
L device:R_Small R6
U 1 1 5E16A120
P 4900 4325
F 0 "R6" H 5025 4325 50  0000 C CNN
F 1 "DNF" V 4795 4325 50  0000 C CNN
F 2 "Resistor_SMD:R_0402_1005Metric" H 4900 4325 50  0001 C CNN
F 3 "~" H 4900 4325 50  0001 C CNN
F 4 "Yageo" H 13450 5650 50  0001 C CNN "MFN"
F 5 "RC0402JR-070RL" H 13450 5650 50  0001 C CNN "MFP"
F 6 "603-RC0402JR-070RL" H 13450 5650 50  0001 C CNN "S1PN"
F 7 "Mouser" H 13450 5650 50  0001 C CNN "S1PL"
F 8 "311-0.0JRCT-ND" H 13450 5650 50  0001 C CNN "S2PN"
F 9 "Digi-Key" H 13450 5650 50  0001 C CNN "S2PL"
F 10 "RES SMD 0 OHM JUMPER 1/16W 0402" H 13450 5650 50  0001 C CNN "Description"
F 11 "0402 (1005 Metric)" H 13450 5650 50  0001 C CNN "Package ID"
F 12 "1" H 4900 4325 50  0001 C CNN "DNP"
	1    4900 4325
	-1   0    0    1   
$EndComp
Wire Wire Line
	4900 3925 4900 4075
Wire Wire Line
	4900 4425 4900 4525
Wire Wire Line
	4900 4525 5700 4525
Connection ~ 5700 4525
Wire Wire Line
	5250 4325 5250 4075
Wire Wire Line
	5250 4075 4900 4075
Wire Wire Line
	5250 4325 5800 4325
Connection ~ 4900 4075
Wire Wire Line
	4900 4075 4900 4225
$Comp
L power:GND #PWR01
U 1 1 5E16F13D
P 4200 2575
F 0 "#PWR01" H 4200 2325 50  0001 C CNN
F 1 "GND" H 4205 2402 50  0000 C CNN
F 2 "" H 4200 2575 50  0001 C CNN
F 3 "" H 4200 2575 50  0001 C CNN
	1    4200 2575
	1    0    0    -1  
$EndComp
$Comp
L power:GND #PWR02
U 1 1 5E16F17A
P 4450 2575
F 0 "#PWR02" H 4450 2325 50  0001 C CNN
F 1 "GND" H 4455 2402 50  0000 C CNN
F 2 "" H 4450 2575 50  0001 C CNN
F 3 "" H 4450 2575 50  0001 C CNN
	1    4450 2575
	1    0    0    -1  
$EndComp
$Comp
L power:GND #PWR03
U 1 1 5E16F1B7
P 4700 2575
F 0 "#PWR03" H 4700 2325 50  0001 C CNN
F 1 "GND" H 4705 2402 50  0000 C CNN
F 2 "" H 4700 2575 50  0001 C CNN
F 3 "" H 4700 2575 50  0001 C CNN
	1    4700 2575
	1    0    0    -1  
$EndComp
$Comp
L power:GND #PWR04
U 1 1 5E16F1F4
P 4950 2575
F 0 "#PWR04" H 4950 2325 50  0001 C CNN
F 1 "GND" H 4955 2402 50  0000 C CNN
F 2 "" H 4950 2575 50  0001 C CNN
F 3 "" H 4950 2575 50  0001 C CNN
	1    4950 2575
	1    0    0    -1  
$EndComp
$Comp
L power:GND #PWR05
U 1 1 5E16F231
P 5200 2575
F 0 "#PWR05" H 5200 2325 50  0001 C CNN
F 1 "GND" H 5205 2402 50  0000 C CNN
F 2 "" H 5200 2575 50  0001 C CNN
F 3 "" H 5200 2575 50  0001 C CNN
	1    5200 2575
	1    0    0    -1  
$EndComp
Wire Wire Line
	4675 4725 5800 4725
Wire Wire Line
	5800 4125 5500 4125
Wire Wire Line
	5500 3125 5500 4125
Wire Wire Line
	4900 3725 4900 3125
Connection ~ 4900 3125
$Comp
L power:GND #PWR08
U 1 1 5E17B49C
P 3850 3525
F 0 "#PWR08" H 3850 3275 50  0001 C CNN
F 1 "GND" H 3855 3352 50  0000 C CNN
F 2 "" H 3850 3525 50  0001 C CNN
F 3 "" H 3850 3525 50  0001 C CNN
	1    3850 3525
	1    0    0    -1  
$EndComp
Wire Wire Line
	3850 3225 3650 3225
Wire Wire Line
	3850 3225 3850 3400
Wire Wire Line
	7800 4725 9100 4725
$Comp
L device:R_Small R1
U 1 1 5E194A2B
P 7100 2550
F 0 "R1" V 7150 2675 50  0000 C CNN
F 1 "DNF" V 7150 2400 50  0000 C CNN
F 2 "Resistor_SMD:R_0402_1005Metric" H 7100 2550 50  0001 C CNN
F 3 "~" H 7100 2550 50  0001 C CNN
F 4 "Yageo" H 13450 5650 50  0001 C CNN "MFN"
F 5 "RC0402JR-070RL" H 13450 5650 50  0001 C CNN "MFP"
F 6 "603-RC0402JR-070RL" H 13450 5650 50  0001 C CNN "S1PN"
F 7 "Mouser" H 13450 5650 50  0001 C CNN "S1PL"
F 8 "311-0.0JRCT-ND" H 13450 5650 50  0001 C CNN "S2PN"
F 9 "Digi-Key" H 13450 5650 50  0001 C CNN "S2PL"
F 10 "RES SMD 0 OHM JUMPER 1/16W 0402" H 13450 5650 50  0001 C CNN "Description"
F 11 "0402 (1005 Metric)" H 13450 5650 50  0001 C CNN "Package ID"
F 12 "1" V 7100 2550 50  0001 C CNN "DNP"
	1    7100 2550
	-1   0    0    1   
$EndComp
$Comp
L device:R_Small R2
U 1 1 5E194D1E
P 7300 2550
F 0 "R2" V 7350 2675 50  0000 C CNN
F 1 "DNF" V 7350 2400 50  0000 C CNN
F 2 "Resistor_SMD:R_0402_1005Metric" H 7300 2550 50  0001 C CNN
F 3 "~" H 7300 2550 50  0001 C CNN
F 4 "Yageo" H 13450 5650 50  0001 C CNN "MFN"
F 5 "RC0402JR-070RL" H 13450 5650 50  0001 C CNN "MFP"
F 6 "603-RC0402JR-070RL" H 13450 5650 50  0001 C CNN "S1PN"
F 7 "Mouser" H 13450 5650 50  0001 C CNN "S1PL"
F 8 "311-0.0JRCT-ND" H 13450 5650 50  0001 C CNN "S2PN"
F 9 "Digi-Key" H 13450 5650 50  0001 C CNN "S2PL"
F 10 "RES SMD 0 OHM JUMPER 1/16W 0402" H 13450 5650 50  0001 C CNN "Description"
F 11 "0402 (1005 Metric)" H 13450 5650 50  0001 C CNN "Package ID"
F 12 "1" V 7300 2550 50  0001 C CNN "DNP"
	1    7300 2550
	-1   0    0    1   
$EndComp
$Comp
L power:+5V #PWR0101
U 1 1 5E1A048F
P 4900 3125
F 0 "#PWR0101" H 4900 2975 50  0001 C CNN
F 1 "+5V" H 4915 3298 50  0000 C CNN
F 2 "" H 4900 3125 50  0001 C CNN
F 3 "" H 4900 3125 50  0001 C CNN
	1    4900 3125
	1    0    0    -1  
$EndComp
$Comp
L power:PWR_FLAG #FLG0102
U 1 1 5E1A0848
P 3850 3400
F 0 "#FLG0102" H 3850 3475 50  0001 C CNN
F 1 "PWR_FLAG" V 3850 3528 50  0000 L CNN
F 2 "" H 3850 3400 50  0001 C CNN
F 3 "~" H 3850 3400 50  0001 C CNN
	1    3850 3400
	0    -1   -1   0   
$EndComp
Connection ~ 3850 3400
Wire Wire Line
	3850 3400 3850 3525
Wire Wire Line
	5250 3125 4900 3125
Wire Wire Line
	5500 3125 5250 3125
Connection ~ 5250 3125
$Comp
L power:PWR_FLAG #FLG0101
U 1 1 5E1A06CD
P 5250 3125
F 0 "#FLG0101" H 5250 3200 50  0001 C CNN
F 1 "PWR_FLAG" H 5250 3299 50  0000 C CNN
F 2 "" H 5250 3125 50  0001 C CNN
F 3 "~" H 5250 3125 50  0001 C CNN
	1    5250 3125
	1    0    0    -1  
$EndComp
$Comp
L connector:Conn_01x03_Male J11
U 1 1 5DCCFD9B
P 10175 1175
F 0 "J11" H 10147 1105 50  0000 R CNN
F 1 "Serctl" H 10147 1196 50  0000 R CNN
F 2 "Connector_PinHeader_2.54mm:PinHeader_1x03_P2.54mm_Vertical" H 10175 1175 50  0001 C CNN
F 3 "~" H 10175 1175 50  0001 C CNN
F 4 "Mintron" H 10175 1175 50  0001 C CNN "MFN"
F 5 "MTB125-1103R1" H 10175 1175 50  0001 C CNN "MFP"
F 6 "C376121" H 10175 1175 50  0001 C CNN "S1PN"
F 7 "LCSC" H 10175 1175 50  0001 C CNN "S1PL"
F 8 "Pin Header Male Pin 0.100\"(2.54mm) 3 pin" H 10175 1175 50  0001 C CNN "Description"
F 9 "Through Hole,P=2.54mm" H 10175 1175 50  0001 C CNN "Package ID"
F 10 "1:$0.020765; 50:$0.020765; 500:0.015337" H 10175 1175 50  0001 C CNN "kicost:LCSC:pricing"
F 11 "https://lcsc.com/product-detail/Pin-Header-Female-Header_MINTRON-MTB125-1103R1_C376121.html" H 10175 1175 50  0001 C CNN "kicost:LCSC:link"
	1    10175 1175
	-1   0    0    1   
$EndComp
$Comp
L connector:Conn_01x05_Male J1
U 1 1 5DCCFF0F
P 3900 1600
F 0 "J1" H 4006 1978 50  0000 C CNN
F 1 "Parctl" H 4006 1887 50  0000 C CNN
F 2 "Connector_PinHeader_2.54mm:PinHeader_1x05_P2.54mm_Vertical" H 3900 1600 50  0001 C CNN
F 3 "~" H 3900 1600 50  0001 C CNN
F 4 "Mintron" H 3900 1600 50  0001 C CNN "MFN"
F 5 "MTP125-1105S1" H 3900 1600 50  0001 C CNN "MFP"
F 6 "C358687" H 3900 1600 50  0001 C CNN "S1PN"
F 7 "LCSC" H 3900 1600 50  0001 C CNN "S1PL"
F 8 "Pin Header Male Pin 0.100\"(2.54mm) 5 pin" H 3900 1600 50  0001 C CNN "Description"
F 9 "Through Hole,P=2.54mm" H 3900 1600 50  0001 C CNN "Package ID"
F 10 "1:$0.0266; 20:$0.0266; 200:$0.01985; 600:$0.018603" H 3900 1600 50  0001 C CNN "kicost:LCSC:pricing"
F 11 "https://lcsc.com/product-detail/Pin-Header-Female-Header_MINTRON-MTP125-1105S1_C358687.html" H 3900 1600 50  0001 C CNN "kicost:LCSC:link"
	1    3900 1600
	1    0    0    -1  
$EndComp
Wire Wire Line
	7500 5425 7500 5525
Wire Wire Line
	7500 5525 7300 5525
Connection ~ 7300 5525
Wire Wire Line
	9575 3075 9675 3075
Wire Wire Line
	9675 3075 9675 3175
Wire Wire Line
	9375 3075 9275 3075
Wire Wire Line
	9275 3075 9275 3175
$Comp
L power:GND #PWR020
U 1 1 5DCDC975
P 9275 3375
F 0 "#PWR020" H 9275 3125 50  0001 C CNN
F 1 "GND" H 9280 3202 50  0000 C CNN
F 2 "" H 9275 3375 50  0001 C CNN
F 3 "" H 9275 3375 50  0001 C CNN
	1    9275 3375
	1    0    0    -1  
$EndComp
$Comp
L power:GND #PWR021
U 1 1 5DCDCA0C
P 9675 3375
F 0 "#PWR021" H 9675 3125 50  0001 C CNN
F 1 "GND" H 9680 3202 50  0000 C CNN
F 2 "" H 9675 3375 50  0001 C CNN
F 3 "" H 9675 3375 50  0001 C CNN
	1    9675 3375
	1    0    0    -1  
$EndComp
Wire Wire Line
	9500 1075 9975 1075
$Comp
L device:C_Small C17
U 1 1 5DD0E12D
P 4600 3325
F 0 "C17" H 4425 3250 50  0000 L CNN
F 1 "68p" H 4425 3425 50  0000 L CNN
F 2 "Capacitor_SMD:C_0402_1005Metric" H 4600 3325 50  0001 C CNN
F 3 "" H 12175 8525 60  0001 C CNN
F 4 "Murata" H 12125 5675 50  0001 C CNN "MFN"
F 5 "GRM1555C1H680JA01D" H 12125 5675 50  0001 C CNN "MFP"
F 6 "81-GRM1555C1H680JA1D" H 12125 5675 50  0001 C CNN "S1PN"
F 7 "Mouser" H 12125 5675 50  0001 C CNN "S1PL"
F 8 "490-5876-1-ND" H 12125 5675 50  0001 C CNN "S2PN"
F 9 "Digi-Key" H 12125 5675 50  0001 C CNN "S2PL"
F 10 "68pF 50volts C0G 5%" H 12125 5675 50  0001 C CNN "Description"
F 11 "0402 (1005 Metric)" H 12125 5675 50  0001 C CNN "Package ID"
	1    4600 3325
	-1   0    0    1   
$EndComp
$Comp
L power:GND #PWR023
U 1 1 5DD0E13D
P 4600 3425
F 0 "#PWR023" H 4600 3175 50  0001 C CNN
F 1 "GND" H 4605 3252 50  0000 C CNN
F 2 "" H 4600 3425 50  0001 C CNN
F 3 "" H 4600 3425 50  0001 C CNN
	1    4600 3425
	1    0    0    -1  
$EndComp
$Comp
L device:C_Small C16
U 1 1 5DD0E14B
P 4200 3325
F 0 "C16" H 4225 3250 50  0000 L CNN
F 1 "22p" H 4225 3425 50  0000 L CNN
F 2 "Capacitor_SMD:C_0402_1005Metric" H 4200 3325 50  0001 C CNN
F 3 "" H 11775 8525 60  0001 C CNN
F 4 "Murata" H 11725 5675 50  0001 C CNN "MFN"
F 5 "GCM1555C1H220JA16D" H 11725 5675 50  0001 C CNN "MFP"
F 6 "81-GCM1555C1H220JA6D" H 11725 5675 50  0001 C CNN "S1PN"
F 7 "Mouser" H 11725 5675 50  0001 C CNN "S1PL"
F 8 "490-9648-1-ND" H 11725 5675 50  0001 C CNN "S2PN"
F 9 "Digi-Key" H 11725 5675 50  0001 C CNN "S2PL"
F 10 "22pF 50volts C0G 5% " H 11725 5675 50  0001 C CNN "Description"
F 11 "0402 (1005 Metric)" H 11725 5675 50  0001 C CNN "Package ID"
	1    4200 3325
	-1   0    0    1   
$EndComp
$Comp
L power:GND #PWR022
U 1 1 5DD0E151
P 4200 3425
F 0 "#PWR022" H 4200 3175 50  0001 C CNN
F 1 "GND" H 4205 3252 50  0000 C CNN
F 2 "" H 4200 3425 50  0001 C CNN
F 3 "" H 4200 3425 50  0001 C CNN
	1    4200 3425
	1    0    0    -1  
$EndComp
Wire Wire Line
	4500 3125 4600 3125
Wire Wire Line
	4600 3125 4600 3225
Wire Wire Line
	4300 3125 4200 3125
Wire Wire Line
	4200 3125 4200 3225
Wire Wire Line
	9675 3075 9850 3075
Wire Wire Line
	9850 3075 9850 1275
Wire Wire Line
	9850 1275 9975 1275
Connection ~ 9675 3075
Wire Wire Line
	9100 4325 9100 3075
Wire Wire Line
	9100 3075 9275 3075
Wire Wire Line
	7800 4325 9100 4325
Connection ~ 9275 3075
$Comp
L power:GND #PWR019
U 1 1 5DD65E41
P 9500 2500
F 0 "#PWR019" H 9500 2250 50  0001 C CNN
F 1 "GND" H 9505 2327 50  0000 C CNN
F 2 "" H 9500 2500 50  0001 C CNN
F 3 "" H 9500 2500 50  0001 C CNN
	1    9500 2500
	1    0    0    -1  
$EndComp
$Comp
L power:GND #PWR018
U 1 1 5DD65E55
P 9100 2500
F 0 "#PWR018" H 9100 2250 50  0001 C CNN
F 1 "GND" H 9105 2327 50  0000 C CNN
F 2 "" H 9100 2500 50  0001 C CNN
F 3 "" H 9100 2500 50  0001 C CNN
	1    9100 2500
	1    0    0    -1  
$EndComp
Wire Wire Line
	9400 2200 9500 2200
Wire Wire Line
	9500 2200 9500 2300
Wire Wire Line
	9200 2200 9100 2200
Wire Wire Line
	9100 2200 9100 2300
Wire Wire Line
	9500 2200 9650 2200
Wire Wire Line
	9650 2200 9650 1175
Wire Wire Line
	9650 1175 9975 1175
Connection ~ 9500 2200
Wire Wire Line
	8900 2200 8900 4125
Wire Wire Line
	7800 4125 8900 4125
Wire Wire Line
	8900 2200 9100 2200
Connection ~ 9100 2200
$Comp
L device:L_Small L1
U 1 1 5DD79C5F
P 9150 1350
F 0 "L1" V 9350 1375 50  0000 R CNN
F 1 "91n" V 9250 1400 50  0000 R CNN
F 2 "Inductor_SMD:L_0402_1005Metric" H 9150 1350 50  0001 C CNN
F 3 "~" H 9150 1350 50  0001 C CNN
F 4 "Murata" H 9150 1350 50  0001 C CNN "MFN"
F 5 "LQW15AN91NJ00D " H 9150 1350 50  0001 C CNN "MFP"
F 6 "81-LQW15AN91NJ00D" H 9150 1350 50  0001 C CNN "S1PN"
F 7 "Mouser" H 9150 1350 50  0001 C CNN "S1PL"
F 8 "LQW15AN91NJ00D" H 9150 1350 50  0001 C CNN "S2PN"
F 9 "Arrow" H 9150 1350 50  0001 C CNN "S2PL"
F 10 "0.091uH 5% 100MHz 20Q-Factor Non Magnetic 0.125A 2.38Ohm" H 9150 1350 50  0001 C CNN "Description"
F 11 "0402 (1005 Metric)" H 9150 1350 50  0001 C CNN "Package ID"
	1    9150 1350
	0    -1   -1   0   
$EndComp
$Comp
L power:GND #PWR017
U 1 1 5DD79C65
P 9350 1650
F 0 "#PWR017" H 9350 1400 50  0001 C CNN
F 1 "GND" H 9355 1477 50  0000 C CNN
F 2 "" H 9350 1650 50  0001 C CNN
F 3 "" H 9350 1650 50  0001 C CNN
	1    9350 1650
	1    0    0    -1  
$EndComp
$Comp
L power:GND #PWR016
U 1 1 5DD79C79
P 8950 1650
F 0 "#PWR016" H 8950 1400 50  0001 C CNN
F 1 "GND" H 8955 1477 50  0000 C CNN
F 2 "" H 8950 1650 50  0001 C CNN
F 3 "" H 8950 1650 50  0001 C CNN
	1    8950 1650
	1    0    0    -1  
$EndComp
Wire Wire Line
	9250 1350 9350 1350
Wire Wire Line
	9350 1350 9350 1450
Wire Wire Line
	9050 1350 8950 1350
Wire Wire Line
	8950 1350 8950 1450
Wire Wire Line
	9350 1350 9500 1350
Connection ~ 9350 1350
Connection ~ 8950 1350
Wire Wire Line
	9500 1075 9500 1350
Wire Wire Line
	8700 1350 8700 2025
Wire Wire Line
	7800 3925 8700 3925
Wire Wire Line
	8700 1350 8950 1350
Wire Wire Line
	8900 2200 7300 2200
Wire Wire Line
	7300 2200 7300 2450
Connection ~ 8900 2200
Wire Wire Line
	7100 2450 7100 2025
Wire Wire Line
	7100 2025 8700 2025
Connection ~ 8700 2025
Wire Wire Line
	8700 2025 8700 3925
Wire Wire Line
	3650 3125 4200 3125
Connection ~ 4200 3125
Wire Wire Line
	4600 3125 4900 3125
Connection ~ 4600 3125
$Comp
L device:L_Small L2
U 1 1 5DDC3BDE
P 9300 2200
F 0 "L2" V 9500 2225 50  0000 R CNN
F 1 "91n" V 9400 2250 50  0000 R CNN
F 2 "Inductor_SMD:L_0402_1005Metric" H 9300 2200 50  0001 C CNN
F 3 "~" H 9300 2200 50  0001 C CNN
F 4 "Murata" H 9300 2200 50  0001 C CNN "MFN"
F 5 "LQW15AN91NJ00D " H 9300 2200 50  0001 C CNN "MFP"
F 6 "81-LQW15AN91NJ00D" H 9300 2200 50  0001 C CNN "S1PN"
F 7 "Mouser" H 9300 2200 50  0001 C CNN "S1PL"
F 8 "LQW15AN91NJ00D" H 9300 2200 50  0001 C CNN "S2PN"
F 9 "Arrow" H 9300 2200 50  0001 C CNN "S2PL"
F 10 "0.091uH 5% 100MHz 20Q-Factor Non Magnetic 0.125A 2.38Ohm" H 9300 2200 50  0001 C CNN "Description"
F 11 "0402 (1005 Metric)" H 9300 2200 50  0001 C CNN "Package ID"
	1    9300 2200
	0    -1   -1   0   
$EndComp
$Comp
L device:L_Small L3
U 1 1 5DDC7BA4
P 9475 3075
F 0 "L3" V 9675 3100 50  0000 R CNN
F 1 "91n" V 9575 3125 50  0000 R CNN
F 2 "Inductor_SMD:L_0402_1005Metric" H 9475 3075 50  0001 C CNN
F 3 "~" H 9475 3075 50  0001 C CNN
F 4 "Murata" H 9475 3075 50  0001 C CNN "MFN"
F 5 "LQW15AN91NJ00D " H 9475 3075 50  0001 C CNN "MFP"
F 6 "81-LQW15AN91NJ00D" H 9475 3075 50  0001 C CNN "S1PN"
F 7 "Mouser" H 9475 3075 50  0001 C CNN "S1PL"
F 8 "LQW15AN91NJ00D" H 9475 3075 50  0001 C CNN "S2PN"
F 9 "Arrow" H 9475 3075 50  0001 C CNN "S2PL"
F 10 "0.091uH 5% 100MHz 20Q-Factor Non Magnetic 0.125A 2.38Ohm" H 9475 3075 50  0001 C CNN "Description"
F 11 "0402 (1005 Metric)" H 9475 3075 50  0001 C CNN "Package ID"
	1    9475 3075
	0    -1   -1   0   
$EndComp
$Comp
L device:L_Small L4
U 1 1 5DDCBF3D
P 4400 3125
F 0 "L4" V 4600 3150 50  0000 R CNN
F 1 "91n" V 4500 3175 50  0000 R CNN
F 2 "Inductor_SMD:L_0402_1005Metric" H 4400 3125 50  0001 C CNN
F 3 "~" H 4400 3125 50  0001 C CNN
F 4 "Murata" H 4400 3125 50  0001 C CNN "MFN"
F 5 "LQW15AN91NJ00D " H 4400 3125 50  0001 C CNN "MFP"
F 6 "81-LQW15AN91NJ00D" H 4400 3125 50  0001 C CNN "S1PN"
F 7 "Mouser" H 4400 3125 50  0001 C CNN "S1PL"
F 8 "LQW15AN91NJ00D" H 4400 3125 50  0001 C CNN "S2PN"
F 9 "Arrow" H 4400 3125 50  0001 C CNN "S2PL"
F 10 "0.091uH 5% 100MHz 20Q-Factor Non Magnetic 0.125A 2.38Ohm" H 4400 3125 50  0001 C CNN "Description"
F 11 "0402 (1005 Metric)" H 4400 3125 50  0001 C CNN "Package ID"
	1    4400 3125
	0    -1   -1   0   
$EndComp
$Comp
L device:C_Small C10
U 1 1 5DDD0210
P 8950 1550
F 0 "C10" H 8775 1475 50  0000 L CNN
F 1 "22p" H 8775 1650 50  0000 L CNN
F 2 "Capacitor_SMD:C_0402_1005Metric" H 8950 1550 50  0001 C CNN
F 3 "" H 16525 6750 60  0001 C CNN
F 4 "Murata" H 16475 3900 50  0001 C CNN "MFN"
F 5 "GCM1555C1H220JA16D" H 16475 3900 50  0001 C CNN "MFP"
F 6 "81-GCM1555C1H220JA6D" H 16475 3900 50  0001 C CNN "S1PN"
F 7 "Mouser" H 16475 3900 50  0001 C CNN "S1PL"
F 8 "490-9648-1-ND" H 16475 3900 50  0001 C CNN "S2PN"
F 9 "Digi-Key" H 16475 3900 50  0001 C CNN "S2PL"
F 10 "22pF 50volts C0G 5% " H 16475 3900 50  0001 C CNN "Description"
F 11 "0402 (1005 Metric)" H 16475 3900 50  0001 C CNN "Package ID"
	1    8950 1550
	-1   0    0    1   
$EndComp
$Comp
L device:C_Small C12
U 1 1 5DDD02A7
P 9100 2400
F 0 "C12" H 8925 2325 50  0000 L CNN
F 1 "22p" H 8925 2500 50  0000 L CNN
F 2 "Capacitor_SMD:C_0402_1005Metric" H 9100 2400 50  0001 C CNN
F 3 "" H 16675 7600 60  0001 C CNN
F 4 "Murata" H 16625 4750 50  0001 C CNN "MFN"
F 5 "GCM1555C1H220JA16D" H 16625 4750 50  0001 C CNN "MFP"
F 6 "81-GCM1555C1H220JA6D" H 16625 4750 50  0001 C CNN "S1PN"
F 7 "Mouser" H 16625 4750 50  0001 C CNN "S1PL"
F 8 "490-9648-1-ND" H 16625 4750 50  0001 C CNN "S2PN"
F 9 "Digi-Key" H 16625 4750 50  0001 C CNN "S2PL"
F 10 "22pF 50volts C0G 5% " H 16625 4750 50  0001 C CNN "Description"
F 11 "0402 (1005 Metric)" H 16625 4750 50  0001 C CNN "Package ID"
	1    9100 2400
	-1   0    0    1   
$EndComp
$Comp
L device:C_Small C14
U 1 1 5DDD0329
P 9275 3275
F 0 "C14" H 9100 3200 50  0000 L CNN
F 1 "22p" H 9100 3375 50  0000 L CNN
F 2 "Capacitor_SMD:C_0402_1005Metric" H 9275 3275 50  0001 C CNN
F 3 "" H 16850 8475 60  0001 C CNN
F 4 "Murata" H 16800 5625 50  0001 C CNN "MFN"
F 5 "GCM1555C1H220JA16D" H 16800 5625 50  0001 C CNN "MFP"
F 6 "81-GCM1555C1H220JA6D" H 16800 5625 50  0001 C CNN "S1PN"
F 7 "Mouser" H 16800 5625 50  0001 C CNN "S1PL"
F 8 "490-9648-1-ND" H 16800 5625 50  0001 C CNN "S2PN"
F 9 "Digi-Key" H 16800 5625 50  0001 C CNN "S2PL"
F 10 "22pF 50volts C0G 5% " H 16800 5625 50  0001 C CNN "Description"
F 11 "0402 (1005 Metric)" H 16800 5625 50  0001 C CNN "Package ID"
	1    9275 3275
	-1   0    0    1   
$EndComp
$Comp
L device:C_Small C11
U 1 1 5DDDC7BE
P 9350 1550
F 0 "C11" H 9175 1475 50  0000 L CNN
F 1 "68p" H 9175 1650 50  0000 L CNN
F 2 "Capacitor_SMD:C_0402_1005Metric" H 9350 1550 50  0001 C CNN
F 3 "" H 16925 6750 60  0001 C CNN
F 4 "Murata" H 16875 3900 50  0001 C CNN "MFN"
F 5 "GRM1555C1H680JA01D" H 16875 3900 50  0001 C CNN "MFP"
F 6 "81-GRM1555C1H680JA1D" H 16875 3900 50  0001 C CNN "S1PN"
F 7 "Mouser" H 16875 3900 50  0001 C CNN "S1PL"
F 8 "490-5876-1-ND" H 16875 3900 50  0001 C CNN "S2PN"
F 9 "Digi-Key" H 16875 3900 50  0001 C CNN "S2PL"
F 10 "68pF 50volts C0G 5%" H 16875 3900 50  0001 C CNN "Description"
F 11 "0402 (1005 Metric)" H 16875 3900 50  0001 C CNN "Package ID"
	1    9350 1550
	-1   0    0    1   
$EndComp
$Comp
L device:C_Small C13
U 1 1 5DDDC850
P 9500 2400
F 0 "C13" H 9325 2325 50  0000 L CNN
F 1 "68p" H 9325 2500 50  0000 L CNN
F 2 "Capacitor_SMD:C_0402_1005Metric" H 9500 2400 50  0001 C CNN
F 3 "" H 17075 7600 60  0001 C CNN
F 4 "Murata" H 17025 4750 50  0001 C CNN "MFN"
F 5 "GRM1555C1H680JA01D" H 17025 4750 50  0001 C CNN "MFP"
F 6 "81-GRM1555C1H680JA1D" H 17025 4750 50  0001 C CNN "S1PN"
F 7 "Mouser" H 17025 4750 50  0001 C CNN "S1PL"
F 8 "490-5876-1-ND" H 17025 4750 50  0001 C CNN "S2PN"
F 9 "Digi-Key" H 17025 4750 50  0001 C CNN "S2PL"
F 10 "68pF 50volts C0G 5%" H 17025 4750 50  0001 C CNN "Description"
F 11 "0402 (1005 Metric)" H 17025 4750 50  0001 C CNN "Package ID"
	1    9500 2400
	-1   0    0    1   
$EndComp
$Comp
L device:C_Small C15
U 1 1 5DDDC8CF
P 9675 3275
F 0 "C15" H 9500 3200 50  0000 L CNN
F 1 "68p" H 9500 3375 50  0000 L CNN
F 2 "Capacitor_SMD:C_0402_1005Metric" H 9675 3275 50  0001 C CNN
F 3 "" H 17250 8475 60  0001 C CNN
F 4 "Murata" H 17200 5625 50  0001 C CNN "MFN"
F 5 "GRM1555C1H680JA01D" H 17200 5625 50  0001 C CNN "MFP"
F 6 "81-GRM1555C1H680JA1D" H 17200 5625 50  0001 C CNN "S1PN"
F 7 "Mouser" H 17200 5625 50  0001 C CNN "S1PL"
F 8 "490-5876-1-ND" H 17200 5625 50  0001 C CNN "S2PN"
F 9 "Digi-Key" H 17200 5625 50  0001 C CNN "S2PL"
F 10 "68pF 50volts C0G 5%" H 17200 5625 50  0001 C CNN "Description"
F 11 "0402 (1005 Metric)" H 17200 5625 50  0001 C CNN "Package ID"
	1    9675 3275
	-1   0    0    1   
$EndComp
$Comp
L project:rfi_shield_clip P1
U 1 1 5DDE9BFC
P 7500 1200
F 0 "P1" H 7628 1219 60  0000 L CNN
F 1 "~" H 7628 1166 60  0000 L CNN
F 2 "RF_Shielding:S1721-46R" H 7500 1200 60  0001 C CNN
F 3 "" H 7500 1200 60  0000 C CNN
F 4 "Harwin Inc." H 7500 1200 50  0001 C CNN "MFN"
F 5 "S1721-46R" H 7500 1200 50  0001 C CNN "MFP"
F 6 "952-1476-1-ND" H 7500 1200 50  0001 C CNN "S1PN"
F 7 "Digi-Key" H 7500 1200 50  0001 C CNN "S1PL"
F 8 "855-S1721-46R" H 7500 1200 50  0001 C CNN "S2PN"
F 9 "Mouser" H 7500 1200 50  0001 C CNN "S2PL"
F 10 "RFI SHIELD CLIP MINI TIN SMD" H 7500 1200 50  0001 C CNN "Description"
	1    7500 1200
	1    0    0    -1  
$EndComp
$Comp
L power:GND #PWR024
U 1 1 5DDEA031
P 7500 1300
F 0 "#PWR024" H 7500 1050 50  0001 C CNN
F 1 "GND" H 7505 1127 50  0000 C CNN
F 2 "" H 7500 1300 50  0001 C CNN
F 3 "" H 7500 1300 50  0001 C CNN
	1    7500 1300
	1    0    0    -1  
$EndComp
$Comp
L power:GND #PWR025
U 1 1 5DDEA08A
P 8025 1300
F 0 "#PWR025" H 8025 1050 50  0001 C CNN
F 1 "GND" H 8030 1127 50  0000 C CNN
F 2 "" H 8025 1300 50  0001 C CNN
F 3 "" H 8025 1300 50  0001 C CNN
	1    8025 1300
	1    0    0    -1  
$EndComp
$Comp
L graphics:Logo_Open_Hardware_Small #LOGO1
U 1 1 5DDEA9F2
P 1800 1700
F 0 "#LOGO1" H 1800 1975 50  0001 C CNN
F 1 "Logo_Open_Hardware_Small" H 1800 1475 50  0001 C CNN
F 2 "" H 1800 1700 50  0001 C CNN
F 3 "~" H 1800 1700 50  0001 C CNN
	1    1800 1700
	1    0    0    -1  
$EndComp
Text Notes 1375 2000 0    50   ~ 0
Open Source Hardware
Text Notes 900  3950 0    50   ~ 0
For serial operation populate R3 (10K) and\ndo not populate R6.\nFor parallel operation populate R6 (0 ohm) and\ndo not populate R3.
Text Notes 900  4675 0    50   ~ 0
For serial operation populate C1 to C5\nwith 0 ohm jumpers.\nFor parallel operation populate R10 to R14\nwith 100 pF ceramic capacitors.
Text Notes 900  5450 0    50   ~ 0
For serial operation populate C6, C7 with\n0 ohm jumpers and do not populate R1 or R2.\nFor parallel operation populate R15, R16 with\n100 pF ceramic capacitors and R1 and R2 with\n0 ohm jumpers.
Text Notes 4650 4300 1    50   ~ 10
See NOTE 1
Text Notes 3550 2525 0    50   ~ 10
See NOTE 2
Text Notes 7575 2575 0    50   ~ 10
See NOTE 3
Text Notes 900  3500 0    50   ~ 10
NOTE 1:
Text Notes 900  4250 0    50   ~ 10
NOTE 2:
Text Notes 900  4950 0    50   ~ 10
NOTE 3:
$Comp
L device:R_Small R10
U 1 1 5E79DEE5
P 4200 2475
F 0 "R10" H 4300 2350 50  0000 C CNN
F 1 "0" H 4125 2475 50  0000 C CNN
F 2 "Resistor_SMD:R_0402_1005Metric" H 4200 2475 50  0001 C CNN
F 3 "~" H 4200 2475 50  0001 C CNN
F 4 "Yageo" H 10350 5575 50  0001 C CNN "MFN"
F 5 "RC0402JR-070RL" H 10350 5575 50  0001 C CNN "MFP"
F 6 "603-RC0402JR-070RL" H 10350 5575 50  0001 C CNN "S1PN"
F 7 "Mouser" H 10350 5575 50  0001 C CNN "S1PL"
F 8 "311-0.0JRCT-ND" H 10350 5575 50  0001 C CNN "S2PN"
F 9 "Digi-Key" H 10350 5575 50  0001 C CNN "S2PL"
F 10 "RES SMD 0 OHM JUMPER 1/16W 0402" H 10350 5575 50  0001 C CNN "Description"
F 11 "0402 (1005 Metric)" H 10350 5575 50  0001 C CNN "Package ID"
	1    4200 2475
	-1   0    0    1   
$EndComp
$Comp
L device:R_Small R11
U 1 1 5E7A6451
P 4450 2475
F 0 "R11" H 4550 2350 50  0000 C CNN
F 1 "0" H 4375 2475 50  0000 C CNN
F 2 "Resistor_SMD:R_0402_1005Metric" H 4450 2475 50  0001 C CNN
F 3 "~" H 4450 2475 50  0001 C CNN
F 4 "Yageo" H 10600 5575 50  0001 C CNN "MFN"
F 5 "RC0402JR-070RL" H 10600 5575 50  0001 C CNN "MFP"
F 6 "603-RC0402JR-070RL" H 10600 5575 50  0001 C CNN "S1PN"
F 7 "Mouser" H 10600 5575 50  0001 C CNN "S1PL"
F 8 "311-0.0JRCT-ND" H 10600 5575 50  0001 C CNN "S2PN"
F 9 "Digi-Key" H 10600 5575 50  0001 C CNN "S2PL"
F 10 "RES SMD 0 OHM JUMPER 1/16W 0402" H 10600 5575 50  0001 C CNN "Description"
F 11 "0402 (1005 Metric)" H 10600 5575 50  0001 C CNN "Package ID"
	1    4450 2475
	-1   0    0    1   
$EndComp
$Comp
L device:R_Small R12
U 1 1 5E7AA304
P 4700 2475
F 0 "R12" H 4800 2350 50  0000 C CNN
F 1 "0" H 4625 2475 50  0000 C CNN
F 2 "Resistor_SMD:R_0402_1005Metric" H 4700 2475 50  0001 C CNN
F 3 "~" H 4700 2475 50  0001 C CNN
F 4 "Yageo" H 10850 5575 50  0001 C CNN "MFN"
F 5 "RC0402JR-070RL" H 10850 5575 50  0001 C CNN "MFP"
F 6 "603-RC0402JR-070RL" H 10850 5575 50  0001 C CNN "S1PN"
F 7 "Mouser" H 10850 5575 50  0001 C CNN "S1PL"
F 8 "311-0.0JRCT-ND" H 10850 5575 50  0001 C CNN "S2PN"
F 9 "Digi-Key" H 10850 5575 50  0001 C CNN "S2PL"
F 10 "RES SMD 0 OHM JUMPER 1/16W 0402" H 10850 5575 50  0001 C CNN "Description"
F 11 "0402 (1005 Metric)" H 10850 5575 50  0001 C CNN "Package ID"
	1    4700 2475
	-1   0    0    1   
$EndComp
$Comp
L device:R_Small R13
U 1 1 5E7AE0E9
P 4950 2475
F 0 "R13" H 5050 2350 50  0000 C CNN
F 1 "0" H 4875 2475 50  0000 C CNN
F 2 "Resistor_SMD:R_0402_1005Metric" H 4950 2475 50  0001 C CNN
F 3 "~" H 4950 2475 50  0001 C CNN
F 4 "Yageo" H 11100 5575 50  0001 C CNN "MFN"
F 5 "RC0402JR-070RL" H 11100 5575 50  0001 C CNN "MFP"
F 6 "603-RC0402JR-070RL" H 11100 5575 50  0001 C CNN "S1PN"
F 7 "Mouser" H 11100 5575 50  0001 C CNN "S1PL"
F 8 "311-0.0JRCT-ND" H 11100 5575 50  0001 C CNN "S2PN"
F 9 "Digi-Key" H 11100 5575 50  0001 C CNN "S2PL"
F 10 "RES SMD 0 OHM JUMPER 1/16W 0402" H 11100 5575 50  0001 C CNN "Description"
F 11 "0402 (1005 Metric)" H 11100 5575 50  0001 C CNN "Package ID"
	1    4950 2475
	-1   0    0    1   
$EndComp
$Comp
L device:R_Small R14
U 1 1 5E7B1ECE
P 5200 2475
F 0 "R14" H 5300 2350 50  0000 C CNN
F 1 "0" H 5125 2475 50  0000 C CNN
F 2 "Resistor_SMD:R_0402_1005Metric" H 5200 2475 50  0001 C CNN
F 3 "~" H 5200 2475 50  0001 C CNN
F 4 "Yageo" H 11350 5575 50  0001 C CNN "MFN"
F 5 "RC0402JR-070RL" H 11350 5575 50  0001 C CNN "MFP"
F 6 "603-RC0402JR-070RL" H 11350 5575 50  0001 C CNN "S1PN"
F 7 "Mouser" H 11350 5575 50  0001 C CNN "S1PL"
F 8 "311-0.0JRCT-ND" H 11350 5575 50  0001 C CNN "S2PN"
F 9 "Digi-Key" H 11350 5575 50  0001 C CNN "S2PL"
F 10 "RES SMD 0 OHM JUMPER 1/16W 0402" H 11350 5575 50  0001 C CNN "Description"
F 11 "0402 (1005 Metric)" H 11350 5575 50  0001 C CNN "Package ID"
	1    5200 2475
	-1   0    0    1   
$EndComp
$Comp
L device:R_Small R15
U 1 1 5E7B5EA1
P 7525 3225
F 0 "R15" H 7625 3100 50  0000 C CNN
F 1 "0" H 7450 3225 50  0000 C CNN
F 2 "Resistor_SMD:R_0402_1005Metric" H 7525 3225 50  0001 C CNN
F 3 "~" H 7525 3225 50  0001 C CNN
F 4 "Yageo" H 13675 6325 50  0001 C CNN "MFN"
F 5 "RC0402JR-070RL" H 13675 6325 50  0001 C CNN "MFP"
F 6 "603-RC0402JR-070RL" H 13675 6325 50  0001 C CNN "S1PN"
F 7 "Mouser" H 13675 6325 50  0001 C CNN "S1PL"
F 8 "311-0.0JRCT-ND" H 13675 6325 50  0001 C CNN "S2PN"
F 9 "Digi-Key" H 13675 6325 50  0001 C CNN "S2PL"
F 10 "RES SMD 0 OHM JUMPER 1/16W 0402" H 13675 6325 50  0001 C CNN "Description"
F 11 "0402 (1005 Metric)" H 13675 6325 50  0001 C CNN "Package ID"
	1    7525 3225
	-1   0    0    1   
$EndComp
$Comp
L device:R_Small R16
U 1 1 5E7B9CAE
P 7900 3075
F 0 "R16" H 8000 2950 50  0000 C CNN
F 1 "0" H 7825 3075 50  0000 C CNN
F 2 "Resistor_SMD:R_0402_1005Metric" H 7900 3075 50  0001 C CNN
F 3 "~" H 7900 3075 50  0001 C CNN
F 4 "Yageo" H 14050 6175 50  0001 C CNN "MFN"
F 5 "RC0402JR-070RL" H 14050 6175 50  0001 C CNN "MFP"
F 6 "603-RC0402JR-070RL" H 14050 6175 50  0001 C CNN "S1PN"
F 7 "Mouser" H 14050 6175 50  0001 C CNN "S1PL"
F 8 "311-0.0JRCT-ND" H 14050 6175 50  0001 C CNN "S2PN"
F 9 "Digi-Key" H 14050 6175 50  0001 C CNN "S2PL"
F 10 "RES SMD 0 OHM JUMPER 1/16W 0402" H 14050 6175 50  0001 C CNN "Description"
F 11 "0402 (1005 Metric)" H 14050 6175 50  0001 C CNN "Package ID"
	1    7900 3075
	-1   0    0    1   
$EndComp
$Comp
L project:rfi_shield_clip P2
U 1 1 5E7D3D30
P 8025 1200
F 0 "P2" H 8153 1219 60  0000 L CNN
F 1 "~" H 8153 1166 60  0000 L CNN
F 2 "RF_Shielding:S1721-46R" H 8025 1200 60  0001 C CNN
F 3 "" H 8025 1200 60  0000 C CNN
F 4 "Harwin Inc." H 8025 1200 50  0001 C CNN "MFN"
F 5 "S1721-46R" H 8025 1200 50  0001 C CNN "MFP"
F 6 "952-1476-1-ND" H 8025 1200 50  0001 C CNN "S1PN"
F 7 "Digi-Key" H 8025 1200 50  0001 C CNN "S1PL"
F 8 "855-S1721-46R" H 8025 1200 50  0001 C CNN "S2PN"
F 9 "Mouser" H 8025 1200 50  0001 C CNN "S2PL"
F 10 "RFI SHIELD CLIP MINI TIN SMD" H 8025 1200 50  0001 C CNN "Description"
	1    8025 1200
	1    0    0    -1  
$EndComp
Wire Notes Line
	8850 1100 9550 1100
Wire Notes Line
	9550 1100 9550 1875
Wire Notes Line
	9550 1875 8850 1875
Wire Notes Line
	8850 1875 8850 1100
Wire Notes Line
	9000 1950 9700 1950
Wire Notes Line
	9700 1950 9700 2725
Wire Notes Line
	9700 2725 9000 2725
Wire Notes Line
	9000 2725 9000 1950
Wire Notes Line
	9175 2800 9900 2800
Wire Notes Line
	9900 2800 9900 3625
Wire Notes Line
	9900 3625 9175 3625
Wire Notes Line
	9175 3625 9175 2800
Text Notes 9050 1950 0    50   ~ 10
See NOTE 4
Text Notes 9275 2800 0    50   ~ 10
See NOTE 4
Text Notes 900  5675 0    50   ~ 10
NOTE 4:
Text Notes 900  6125 0    50   ~ 0
Filters on the serial inputs/outputs and\nare optional.  Where not used the 91nH\ninductor should be replaced with a 0 ohm\njumper.
Wire Wire Line
	3700 4725 4475 4725
Wire Wire Line
	9300 4725 10025 4725
$Comp
L device:R_Small C8
U 1 1 6069744A
P 4575 4725
F 0 "C8" V 4675 4725 50  0000 C CNN
F 1 "0" V 4500 4725 50  0000 C CNN
F 2 "Resistor_SMD:R_0402_1005Metric" H 4575 4725 50  0001 C CNN
F 3 "~" H 4575 4725 50  0001 C CNN
F 4 "Yageo" H 10725 7825 50  0001 C CNN "MFN"
F 5 "RC0402JR-070RL" H 10725 7825 50  0001 C CNN "MFP"
F 6 "603-RC0402JR-070RL" H 10725 7825 50  0001 C CNN "S1PN"
F 7 "Mouser" H 10725 7825 50  0001 C CNN "S1PL"
F 8 "311-0.0JRCT-ND" H 10725 7825 50  0001 C CNN "S2PN"
F 9 "Digi-Key" H 10725 7825 50  0001 C CNN "S2PL"
F 10 "RES SMD 0 OHM JUMPER 1/16W 0402" H 10725 7825 50  0001 C CNN "Description"
F 11 "0402 (1005 Metric)" H 10725 7825 50  0001 C CNN "Package ID"
	1    4575 4725
	0    -1   -1   0   
$EndComp
$Comp
L device:R_Small C9
U 1 1 6069F0C9
P 9200 4725
F 0 "C9" V 9300 4725 50  0000 C CNN
F 1 "0" V 9125 4725 50  0000 C CNN
F 2 "Resistor_SMD:R_0402_1005Metric" H 9200 4725 50  0001 C CNN
F 3 "~" H 9200 4725 50  0001 C CNN
F 4 "Yageo" H 15350 7825 50  0001 C CNN "MFN"
F 5 "RC0402JR-070RL" H 15350 7825 50  0001 C CNN "MFP"
F 6 "603-RC0402JR-070RL" H 15350 7825 50  0001 C CNN "S1PN"
F 7 "Mouser" H 15350 7825 50  0001 C CNN "S1PL"
F 8 "311-0.0JRCT-ND" H 15350 7825 50  0001 C CNN "S2PN"
F 9 "Digi-Key" H 15350 7825 50  0001 C CNN "S2PL"
F 10 "RES SMD 0 OHM JUMPER 1/16W 0402" H 15350 7825 50  0001 C CNN "Description"
F 11 "0402 (1005 Metric)" H 15350 7825 50  0001 C CNN "Package ID"
	1    9200 4725
	0    -1   -1   0   
$EndComp
$EndSCHEMATC
