(module SMA_EDGE_5 (layer F.Cu) (tedit 5C031B0A)
  (descr "4-layer SMA")
  (fp_text reference J1 (at 3.3655 -2.3749 -90) (layer F.SilkS) hide
    (effects (font (size 0.8128 0.8128) (thickness 0.1524)))
  )
  (fp_text value ~ (at 3.5052 -4.4831 -90) (layer F.SilkS) hide
    (effects (font (size 1 1) (thickness 0.15)))
  )
  (pad 1 smd rect (at 0 0) (size 2.032 4.25) (layers F.Cu F.Mask)
    (solder_mask_margin 0.254))
  (pad 2 smd rect (at -2.44094 -0.10668) (size 1.27 3.429) (layers B.Cu B.Mask)
    (zone_connect 2))
  (pad 2 smd rect (at 2.4384 -0.11176) (size 1.27 3.429) (layers B.Cu B.Mask)
    (zone_connect 2))
  (pad 2 smd rect (at 2.43586 -0.10922) (size 1.27 3.429) (layers F.Mask)
    (zone_connect 2))
  (pad 2 smd rect (at -2.44094 -0.10668) (size 1.27 3.429) (layers *.Mask)
    (zone_connect 2))
  (model /Users/timm/Documents/Electronics/Designs/Modules/packages3d/sma_EndLaunch.wrl
    (offset (xyz 0 0 8.889999866485596))
    (scale (xyz 0.5 0.5 0.5))
    (rotate (xyz 0 0 0))
  )
)
