(export (version D)
  (design
    (source /Users/timm/Documents/Electronics/Designs/ProdGitRepos/hardwaredesigns/SPI_Buffer/SPI_Buffer.sch)
    (date "Thursday, 06 January 2022 at 04:54:16 pm")
    (tool "Eeschema (5.1.6-0-10_14)")
    (sheet (number 1) (name /) (tstamps /)
      (title_block
        (title "SPI Buffer")
        (company "Dyadic Pty Ltd")
        (rev 1.0)
        (date 2020-08-27)
        (source SPI_Buffer.sch)
        (comment (number 1) (value ""))
        (comment (number 2) (value ""))
        (comment (number 3) (value ""))
        (comment (number 4) (value "")))))
  (components
    (comp (ref U1)
      (value 74LVC4T3144)
      (footprint Package_SO:TSSOP-14_4.4x5mm_P0.65mm)
      (libsource (lib project) (part 74LVC4T3144) (description "4-bit dual supply buffer/line driver; 3-state"))
      (sheetpath (names /) (tstamps /))
      (tstamp 5F530EFD))
    (comp (ref J1)
      (value Input)
      (footprint Connector_IDC:IDC-Header_2x08_P2.54mm_Vertical)
      (datasheet ~)
      (libsource (lib SPI_Buffer-rescue) (part Conn_02x08_Odd_Even-Connector_Generic) (description ""))
      (sheetpath (names /) (tstamps /))
      (tstamp 5F533201))
    (comp (ref J2)
      (value Output)
      (footprint Connector_IDC:IDC-Header_2x08_P2.54mm_Vertical)
      (datasheet ~)
      (libsource (lib SPI_Buffer-rescue) (part Conn_02x08_Odd_Even-Connector_Generic) (description ""))
      (sheetpath (names /) (tstamps /))
      (tstamp 5F537B0B))
    (comp (ref C2)
      (value 0.1u)
      (footprint Capacitor_SMD:C_0603_1608Metric)
      (datasheet ~)
      (libsource (lib SPI_Buffer-rescue) (part C_Small-Device) (description ""))
      (sheetpath (names /) (tstamps /))
      (tstamp 5F53ED43))
    (comp (ref C1)
      (value 0.1u)
      (footprint Capacitor_SMD:C_0603_1608Metric)
      (datasheet ~)
      (libsource (lib SPI_Buffer-rescue) (part C_Small-Device) (description ""))
      (sheetpath (names /) (tstamps /))
      (tstamp 5F53F97B))
    (comp (ref R1)
      (value 10K)
      (footprint Resistor_SMD:R_0603_1608Metric)
      (datasheet ~)
      (libsource (lib SPI_Buffer-rescue) (part R_Small-Device) (description ""))
      (sheetpath (names /) (tstamps /))
      (tstamp 5F752DFD))
    (comp (ref J5)
      (value Pwr/Ctl)
      (footprint Connector_PinHeader_2.54mm:PinHeader_1x04_P2.54mm_Vertical)
      (datasheet ~)
      (libsource (lib SPI_Buffer-rescue) (part Conn_01x04_Male-Connector) (description ""))
      (sheetpath (names /) (tstamps /))
      (tstamp 5F75C8E3))
    (comp (ref J4)
      (value Bridge)
      (footprint Connector_PinHeader_2.54mm:PinHeader_2x10_P2.54mm_Vertical)
      (datasheet ~)
      (libsource (lib SPI_Buffer-rescue) (part Conn_02x10_Odd_Even-Connector_Generic) (description ""))
      (sheetpath (names /) (tstamps /))
      (tstamp 5F9107B5))
    (comp (ref J3)
      (value SPI)
      (footprint Connector_PinHeader_2.54mm:PinHeader_1x04_P2.54mm_Vertical)
      (datasheet ~)
      (libsource (lib SPI_Buffer-rescue) (part Conn_01x04-Connector_Generic) (description ""))
      (sheetpath (names /) (tstamps /))
      (tstamp 5F943C7A))
    (comp (ref C8)
      (value 10p)
      (footprint Capacitor_SMD:C_0402_1005Metric)
      (datasheet ~)
      (libsource (lib Device) (part C_Small) (description "Unpolarized capacitor, small symbol"))
      (sheetpath (names /) (tstamps /))
      (tstamp 61E6F14E))
    (comp (ref C10)
      (value 10p)
      (footprint Capacitor_SMD:C_0402_1005Metric)
      (datasheet ~)
      (libsource (lib Device) (part C_Small) (description "Unpolarized capacitor, small symbol"))
      (sheetpath (names /) (tstamps /))
      (tstamp 61E71E25))
    (comp (ref C12)
      (value 10p)
      (footprint Capacitor_SMD:C_0402_1005Metric)
      (datasheet ~)
      (libsource (lib Device) (part C_Small) (description "Unpolarized capacitor, small symbol"))
      (sheetpath (names /) (tstamps /))
      (tstamp 61E721DA))
    (comp (ref C14)
      (value 10p)
      (footprint Capacitor_SMD:C_0402_1005Metric)
      (datasheet ~)
      (libsource (lib Device) (part C_Small) (description "Unpolarized capacitor, small symbol"))
      (sheetpath (names /) (tstamps /))
      (tstamp 61E72E2F))
    (comp (ref C9)
      (value 10p)
      (footprint Capacitor_SMD:C_0402_1005Metric)
      (datasheet ~)
      (libsource (lib Device) (part C_Small) (description "Unpolarized capacitor, small symbol"))
      (sheetpath (names /) (tstamps /))
      (tstamp 61E735AA))
    (comp (ref C11)
      (value 10p)
      (footprint Capacitor_SMD:C_0402_1005Metric)
      (datasheet ~)
      (libsource (lib Device) (part C_Small) (description "Unpolarized capacitor, small symbol"))
      (sheetpath (names /) (tstamps /))
      (tstamp 61E99164))
    (comp (ref C13)
      (value 10p)
      (footprint Capacitor_SMD:C_0402_1005Metric)
      (datasheet ~)
      (libsource (lib Device) (part C_Small) (description "Unpolarized capacitor, small symbol"))
      (sheetpath (names /) (tstamps /))
      (tstamp 61E99C31))
    (comp (ref C15)
      (value 10p)
      (footprint Capacitor_SMD:C_0402_1005Metric)
      (datasheet ~)
      (libsource (lib Device) (part C_Small) (description "Unpolarized capacitor, small symbol"))
      (sheetpath (names /) (tstamps /))
      (tstamp 61E99E5F))
    (comp (ref C4)
      (value 10p)
      (footprint Capacitor_SMD:C_0402_1005Metric)
      (datasheet ~)
      (libsource (lib Device) (part C_Small) (description "Unpolarized capacitor, small symbol"))
      (sheetpath (names /) (tstamps /))
      (tstamp 61EF2330))
    (comp (ref C5)
      (value 10p)
      (footprint Capacitor_SMD:C_0402_1005Metric)
      (datasheet ~)
      (libsource (lib Device) (part C_Small) (description "Unpolarized capacitor, small symbol"))
      (sheetpath (names /) (tstamps /))
      (tstamp 61EF233A))
    (comp (ref C6)
      (value 10p)
      (footprint Capacitor_SMD:C_0402_1005Metric)
      (datasheet ~)
      (libsource (lib Device) (part C_Small) (description "Unpolarized capacitor, small symbol"))
      (sheetpath (names /) (tstamps /))
      (tstamp 61EF2344))
    (comp (ref C7)
      (value 10p)
      (footprint Capacitor_SMD:C_0402_1005Metric)
      (datasheet ~)
      (libsource (lib Device) (part C_Small) (description "Unpolarized capacitor, small symbol"))
      (sheetpath (names /) (tstamps /))
      (tstamp 61EF234E))
    (comp (ref C3)
      (value 10p)
      (footprint Capacitor_SMD:C_0402_1005Metric)
      (datasheet ~)
      (libsource (lib Device) (part C_Small) (description "Unpolarized capacitor, small symbol"))
      (sheetpath (names /) (tstamps /))
      (tstamp 61F18BE3)))
  (libparts
    (libpart (lib Device) (part C_Small)
      (description "Unpolarized capacitor, small symbol")
      (docs ~)
      (footprints
        (fp C_*))
      (fields
        (field (name Reference) C)
        (field (name Value) C_Small))
      (pins
        (pin (num 1) (name ~) (type passive))
        (pin (num 2) (name ~) (type passive))))
    (libpart (lib SPI_Buffer-rescue) (part C_Small-Device)
      (footprints
        (fp C_*))
      (fields
        (field (name Reference) C)
        (field (name Value) C_Small-Device))
      (pins
        (pin (num 1) (name ~) (type passive))
        (pin (num 2) (name ~) (type passive))))
    (libpart (lib SPI_Buffer-rescue) (part Conn_01x04-Connector_Generic)
      (footprints
        (fp Connector*:*_1x??_*))
      (fields
        (field (name Reference) J)
        (field (name Value) Conn_01x04-Connector_Generic))
      (pins
        (pin (num 1) (name Pin_1) (type passive))
        (pin (num 2) (name Pin_2) (type passive))
        (pin (num 3) (name Pin_3) (type passive))
        (pin (num 4) (name Pin_4) (type passive))))
    (libpart (lib SPI_Buffer-rescue) (part Conn_01x04_Male-Connector)
      (footprints
        (fp Connector*:*_1x??_*))
      (fields
        (field (name Reference) J)
        (field (name Value) Conn_01x04_Male-Connector))
      (pins
        (pin (num 1) (name Pin_1) (type passive))
        (pin (num 2) (name Pin_2) (type passive))
        (pin (num 3) (name Pin_3) (type passive))
        (pin (num 4) (name Pin_4) (type passive))))
    (libpart (lib SPI_Buffer-rescue) (part Conn_02x08_Odd_Even-Connector_Generic)
      (footprints
        (fp Connector*:*_2x??_*))
      (fields
        (field (name Reference) J)
        (field (name Value) Conn_02x08_Odd_Even-Connector_Generic))
      (pins
        (pin (num 1) (name Pin_1) (type passive))
        (pin (num 2) (name Pin_2) (type passive))
        (pin (num 3) (name Pin_3) (type passive))
        (pin (num 4) (name Pin_4) (type passive))
        (pin (num 5) (name Pin_5) (type passive))
        (pin (num 6) (name Pin_6) (type passive))
        (pin (num 7) (name Pin_7) (type passive))
        (pin (num 8) (name Pin_8) (type passive))
        (pin (num 9) (name Pin_9) (type passive))
        (pin (num 10) (name Pin_10) (type passive))
        (pin (num 11) (name Pin_11) (type passive))
        (pin (num 12) (name Pin_12) (type passive))
        (pin (num 13) (name Pin_13) (type passive))
        (pin (num 14) (name Pin_14) (type passive))
        (pin (num 15) (name Pin_15) (type passive))
        (pin (num 16) (name Pin_16) (type passive))))
    (libpart (lib SPI_Buffer-rescue) (part Conn_02x10_Odd_Even-Connector_Generic)
      (footprints
        (fp Connector*:*_2x??_*))
      (fields
        (field (name Reference) J)
        (field (name Value) Conn_02x10_Odd_Even-Connector_Generic))
      (pins
        (pin (num 1) (name Pin_1) (type passive))
        (pin (num 2) (name Pin_2) (type passive))
        (pin (num 3) (name Pin_3) (type passive))
        (pin (num 4) (name Pin_4) (type passive))
        (pin (num 5) (name Pin_5) (type passive))
        (pin (num 6) (name Pin_6) (type passive))
        (pin (num 7) (name Pin_7) (type passive))
        (pin (num 8) (name Pin_8) (type passive))
        (pin (num 9) (name Pin_9) (type passive))
        (pin (num 10) (name Pin_10) (type passive))
        (pin (num 11) (name Pin_11) (type passive))
        (pin (num 12) (name Pin_12) (type passive))
        (pin (num 13) (name Pin_13) (type passive))
        (pin (num 14) (name Pin_14) (type passive))
        (pin (num 15) (name Pin_15) (type passive))
        (pin (num 16) (name Pin_16) (type passive))
        (pin (num 17) (name Pin_17) (type passive))
        (pin (num 18) (name Pin_18) (type passive))
        (pin (num 19) (name Pin_19) (type passive))
        (pin (num 20) (name Pin_20) (type passive))))
    (libpart (lib SPI_Buffer-rescue) (part R_Small-Device)
      (footprints
        (fp R_*))
      (fields
        (field (name Reference) R)
        (field (name Value) R_Small-Device))
      (pins
        (pin (num 1) (name ~) (type passive))
        (pin (num 2) (name ~) (type passive))))
    (libpart (lib project) (part 74LVC4T3144)
      (description "4-bit dual supply buffer/line driver; 3-state")
      (footprints
        (fp SOIC*P1.27mm*)
        (fp DIP*W7.62mm*)
        (fp TSSOP*4.4x5mm*P0.65mm*))
      (fields
        (field (name Reference) U)
        (field (name Value) 74LVC4T3144))
      (pins
        (pin (num 1) (name "VCC(A)") (type power_in))
        (pin (num 2) (name A1) (type input))
        (pin (num 3) (name A2) (type input))
        (pin (num 4) (name A3) (type input))
        (pin (num 5) (name YA4) (type output))
        (pin (num 6) (name GND) (type power_in))
        (pin (num 7) (name GND) (type power_in))
        (pin (num 8) (name B4) (type input))
        (pin (num 9) (name NC) (type passive))
        (pin (num 10) (name YB3) (type output))
        (pin (num 11) (name YB2) (type output))
        (pin (num 12) (name YB1) (type output))
        (pin (num 13) (name "VCC(B)") (type power_in))
        (pin (num 14) (name ~OE~) (type input)))))
  (libraries
    (library (logical Device)
      (uri "/Library/Application Support/kicad/library/Device.lib"))
    (library (logical SPI_Buffer-rescue)
      (uri /Users/timm/Documents/Electronics/Designs/ProdGitRepos/hardwaredesigns/SPI_Buffer/SPI_Buffer-rescue.lib))
    (library (logical project)
      (uri /Users/timm/Documents/Electronics/Designs/ProdGitRepos/hardwaredesigns/SPI_Buffer/SPI_Buffer.lib)))
  (nets
    (net (code 1) (name "Net-(U1-Pad10)")
      (node (ref U1) (pin 10)))
    (net (code 2) (name "Net-(U1-Pad4)")
      (node (ref U1) (pin 4)))
    (net (code 3) (name "Net-(U1-Pad9)")
      (node (ref U1) (pin 9)))
    (net (code 4) (name VCC)
      (node (ref J5) (pin 2))
      (node (ref U1) (pin 13))
      (node (ref C2) (pin 1)))
    (net (code 5) (name GND)
      (node (ref J2) (pin 4))
      (node (ref C4) (pin 2))
      (node (ref C5) (pin 2))
      (node (ref C6) (pin 2))
      (node (ref J2) (pin 16))
      (node (ref C2) (pin 2))
      (node (ref C1) (pin 2))
      (node (ref C7) (pin 2))
      (node (ref J2) (pin 10))
      (node (ref C3) (pin 2))
      (node (ref C15) (pin 2))
      (node (ref C13) (pin 2))
      (node (ref C11) (pin 2))
      (node (ref C9) (pin 2))
      (node (ref C14) (pin 2))
      (node (ref C12) (pin 2))
      (node (ref C10) (pin 2))
      (node (ref C8) (pin 2))
      (node (ref J3) (pin 4))
      (node (ref J1) (pin 4))
      (node (ref J5) (pin 3))
      (node (ref J1) (pin 16))
      (node (ref R1) (pin 2))
      (node (ref J1) (pin 10))
      (node (ref U1) (pin 7))
      (node (ref U1) (pin 6)))
    (net (code 6) (name VAA)
      (node (ref C1) (pin 1))
      (node (ref J5) (pin 1))
      (node (ref U1) (pin 1)))
    (net (code 7) (name /mosi_b)
      (node (ref U1) (pin 11))
      (node (ref J2) (pin 2)))
    (net (code 8) (name /d0_b)
      (node (ref J4) (pin 2))
      (node (ref J2) (pin 5)))
    (net (code 9) (name /d1_b)
      (node (ref J4) (pin 4))
      (node (ref J2) (pin 6)))
    (net (code 10) (name /d2_b)
      (node (ref J4) (pin 6))
      (node (ref J2) (pin 7)))
    (net (code 11) (name /d3_b)
      (node (ref J4) (pin 8))
      (node (ref J2) (pin 8)))
    (net (code 12) (name /d8_b)
      (node (ref J4) (pin 18))
      (node (ref J2) (pin 14)))
    (net (code 13) (name /sck_b)
      (node (ref J2) (pin 1))
      (node (ref U1) (pin 12)))
    (net (code 14) (name /miso_b)
      (node (ref U1) (pin 8))
      (node (ref J2) (pin 3)))
    (net (code 15) (name /d4_b)
      (node (ref J4) (pin 10))
      (node (ref J2) (pin 9)))
    (net (code 16) (name /d5_b)
      (node (ref J4) (pin 12))
      (node (ref J2) (pin 11)))
    (net (code 17) (name /d6_b)
      (node (ref J2) (pin 12))
      (node (ref J4) (pin 14)))
    (net (code 18) (name /d7_b)
      (node (ref J2) (pin 13))
      (node (ref J4) (pin 16)))
    (net (code 19) (name /d9_b)
      (node (ref J4) (pin 20))
      (node (ref J2) (pin 15)))
    (net (code 20) (name /mosi_a)
      (node (ref J1) (pin 2))
      (node (ref J3) (pin 2))
      (node (ref U1) (pin 3))
      (node (ref C3) (pin 1)))
    (net (code 21) (name /d2_a)
      (node (ref C9) (pin 1))
      (node (ref J4) (pin 5))
      (node (ref J1) (pin 7)))
    (net (code 22) (name /d4_a)
      (node (ref J4) (pin 9))
      (node (ref J1) (pin 9))
      (node (ref C14) (pin 1)))
    (net (code 23) (name /d6_a)
      (node (ref C6) (pin 1))
      (node (ref J1) (pin 12))
      (node (ref J4) (pin 13)))
    (net (code 24) (name /d8_a)
      (node (ref J1) (pin 14))
      (node (ref J4) (pin 17))
      (node (ref C7) (pin 1)))
    (net (code 25) (name /d1_a)
      (node (ref J1) (pin 6))
      (node (ref J4) (pin 3))
      (node (ref C4) (pin 1)))
    (net (code 26) (name /d3_a)
      (node (ref J1) (pin 8))
      (node (ref J4) (pin 7))
      (node (ref C5) (pin 1)))
    (net (code 27) (name /d5_a)
      (node (ref J1) (pin 11))
      (node (ref C12) (pin 1))
      (node (ref J4) (pin 11)))
    (net (code 28) (name /d7_a)
      (node (ref J4) (pin 15))
      (node (ref C10) (pin 1))
      (node (ref J1) (pin 13)))
    (net (code 29) (name /d9_a)
      (node (ref J1) (pin 15))
      (node (ref J4) (pin 19))
      (node (ref C8) (pin 1)))
    (net (code 30) (name /sck_a)
      (node (ref J1) (pin 1))
      (node (ref U1) (pin 2))
      (node (ref C15) (pin 1))
      (node (ref J3) (pin 1)))
    (net (code 31) (name /miso_a)
      (node (ref C13) (pin 1))
      (node (ref J1) (pin 3))
      (node (ref U1) (pin 5))
      (node (ref J3) (pin 3)))
    (net (code 32) (name /d0_a)
      (node (ref C11) (pin 1))
      (node (ref J4) (pin 1))
      (node (ref J1) (pin 5)))
    (net (code 33) (name OE)
      (node (ref R1) (pin 1))
      (node (ref J5) (pin 4))
      (node (ref U1) (pin 14)))))