EESchema Schematic File Version 4
EELAYER 30 0
EELAYER END
$Descr A4 11693 8268
encoding utf-8
Sheet 1 1
Title "SAW Filter"
Date "2021-05-25"
Rev "2.4"
Comp "Dyadic Pty Ltd"
Comment1 "2020"
Comment2 ""
Comment3 ""
Comment4 ""
$EndDescr
$Comp
L device:C C4
U 1 1 571F1905
P 4275 2275
F 0 "C4" H 4325 2375 50  0000 L CNN
F 1 "DNF" H 4325 2175 50  0000 L CNN
F 2 "Capacitor_SMD:C_0805_2012Metric" H 4275 2275 60  0001 C CNN
F 3 "" H 4275 2275 60  0001 C CNN
F 4 "Kemet" H 4275 2275 60  0001 C CNN "MFN"
F 5 "C0805C103K5RACTU" H 4275 2275 60  0001 C CNN "MFP"
F 6 "399-1158-1-ND" H 4275 2275 60  0001 C CNN "S1PN"
F 7 "Digi-Key" H 4275 2275 60  0001 C CNN "S1PL"
F 8 "C0805C103K5RACTU" H 4275 2275 60  0001 C CNN "S2PN"
F 9 "Arrow" H 4275 2275 60  0001 C CNN "S2PL"
F 10 "10000pF 50V Ceramic Capacitor X7R 10%" H 4275 2275 60  0001 C CNN "Description"
F 11 "0805 (2012 Metric)" H 4275 2275 60  0001 C CNN "Package ID"
	1    4275 2275
	1    0    0    -1  
$EndComp
$Comp
L device:L L1
U 1 1 571F1906
P 6250 3375
F 0 "L1" H 6150 3300 40  0000 C CNN
F 1 "43n" H 6125 3425 40  0000 C CNN
F 2 "Resistor_SMD:R_0805_2012Metric" H 6250 3375 60  0001 C CNN
F 3 "" H 6250 3375 60  0001 C CNN
F 4 "Coilcraft" H 6250 3375 60  0001 C CNN "MFN"
F 5 "0805CS-430XGLB" H 6250 3375 60  0001 C CNN "MFP"
F 6 "994-0805CS-430XGLB" H 6250 3375 60  0001 C CNN "S1PN"
F 7 "Mouser" H 6250 3375 60  0001 C CNN "S1PL"
F 8 "0805CS-430XGLB" H 6250 3375 60  0001 C CNN "S2PN"
F 9 "Coilcraft direct" H 6250 3375 60  0001 C CNN "S2PL"
F 10 "Fixed Inductors 0805CS 43 nH 2 % 0.5 A" H 6250 3375 60  0001 C CNN "Description"
F 11 "0805 (2012 metric)" H 6250 3375 60  0001 C CNN "Package ID"
	1    6250 3375
	-1   0    0    1   
$EndComp
$Comp
L power:GND #PWR01
U 1 1 571F1907
P 4275 2425
F 0 "#PWR01" H 4275 2425 30  0001 C CNN
F 1 "GND" H 4275 2355 30  0001 C CNN
F 2 "" H 4275 2425 60  0001 C CNN
F 3 "" H 4275 2425 60  0001 C CNN
	1    4275 2425
	1    0    0    -1  
$EndComp
$Comp
L device:Ferrite_Bead_Small FB1
U 1 1 571F1908
P 4875 1975
F 0 "FB1" V 4800 1875 40  0000 C CNN
F 1 "Ferrite Bead" V 4975 1975 40  0000 C CNN
F 2 "Capacitor_SMD:C_0805_2012Metric" H 4875 1975 60  0001 C CNN
F 3 "" H 4875 1975 60  0001 C CNN
F 4 "Murata Electronics North America" H 4875 1975 60  0001 C CNN "MFN"
F 5 "BLM21PG221SN1D" H 4875 1975 60  0001 C CNN "MFP"
F 6 "490-1054-1-ND" H 4875 1975 60  0001 C CNN "S1PN"
F 7 "Digi-Key" H 4875 1975 60  0001 C CNN "S1PL"
F 8 "BLM21PG221SN1D" H 4875 1975 60  0001 C CNN "S2PN"
F 9 "Arrow" H 4875 1975 60  0001 C CNN "S2PL"
F 10 "220 Ohm Impedance Ferrite Bead" H 4875 1975 60  0001 C CNN "Description"
F 11 "0805 (2012 Metric)" H 4875 1975 60  0001 C CNN "Package ID"
	1    4875 1975
	0    -1   -1   0   
$EndComp
$Comp
L power:GND #PWR02
U 1 1 571F190A
P 5475 2425
F 0 "#PWR02" H 5475 2425 30  0001 C CNN
F 1 "GND" H 5475 2355 30  0001 C CNN
F 2 "" H 5475 2425 60  0001 C CNN
F 3 "" H 5475 2425 60  0001 C CNN
	1    5475 2425
	1    0    0    -1  
$EndComp
$Comp
L device:R R9
U 1 1 571F190B
P 6025 1975
F 0 "R9" V 5925 1975 50  0000 C CNN
F 1 "18" V 6125 1975 50  0000 C CNN
F 2 "Resistor_SMD:R_0805_2012Metric" H 6025 1975 60  0001 C CNN
F 3 "" H 6025 1975 60  0001 C CNN
F 4 "Yageo" H 6025 1975 60  0001 C CNN "MFN"
F 5 "RC0805FR-0718RL" H 6025 1975 60  0001 C CNN "MFP"
F 6 "311-180CRCT-ND" H 6025 1975 60  0001 C CNN "S1PN"
F 7 "Digi-Key" H 6025 1975 60  0001 C CNN "S1PL"
F 8 "603-RC0805FR-0718RL" H 6025 1975 60  0001 C CNN "S2PN"
F 9 "Mouser" H 6025 1975 60  0001 C CNN "S2PL"
F 10 "18 Ohms ±1% 0.125W, 1/8W Chip Resistor 0805" H 6025 1975 60  0001 C CNN "Description"
F 11 "0805 (2012 Metric)" H 6025 1975 60  0001 C CNN "Package ID"
	1    6025 1975
	0    -1   -1   0   
$EndComp
$Comp
L power:GND #PWR03
U 1 1 571F190E
P 6575 2425
F 0 "#PWR03" H 6575 2425 30  0001 C CNN
F 1 "GND" H 6575 2355 30  0001 C CNN
F 2 "" H 6575 2425 60  0001 C CNN
F 3 "" H 6575 2425 60  0001 C CNN
	1    6575 2425
	1    0    0    -1  
$EndComp
Wire Wire Line
	4975 1975 5475 1975
Wire Wire Line
	5475 2125 5475 1975
Connection ~ 5475 1975
Wire Wire Line
	4275 2125 4275 1975
Wire Wire Line
	6175 1975 6575 1975
Wire Wire Line
	6575 2125 6575 1975
Connection ~ 6575 1975
Wire Wire Line
	9625 1975 9625 2125
Wire Wire Line
	9225 2125 9225 1975
Connection ~ 9225 1975
Wire Wire Line
	8725 2125 8725 1975
Connection ~ 8725 1975
Wire Wire Line
	7725 2125 7725 1975
Connection ~ 7725 1975
Wire Wire Line
	8275 1975 8275 2900
Connection ~ 8275 1975
$Comp
L power:GND #PWR04
U 1 1 571F1913
P 1525 2475
F 0 "#PWR04" H 1525 2475 30  0001 C CNN
F 1 "GND" H 1525 2405 30  0001 C CNN
F 2 "" H 1525 2475 60  0001 C CNN
F 3 "" H 1525 2475 60  0001 C CNN
	1    1525 2475
	1    0    0    -1  
$EndComp
Wire Wire Line
	1525 2075 1525 2325
$Comp
L power:GND #PWR05
U 1 1 571F1914
P 7725 2425
F 0 "#PWR05" H 7725 2425 30  0001 C CNN
F 1 "GND" H 7725 2355 30  0001 C CNN
F 2 "" H 7725 2425 60  0001 C CNN
F 3 "" H 7725 2425 60  0001 C CNN
	1    7725 2425
	1    0    0    -1  
$EndComp
$Comp
L power:GND #PWR06
U 1 1 571F1915
P 8725 2475
F 0 "#PWR06" H 8725 2475 30  0001 C CNN
F 1 "GND" H 8725 2405 30  0001 C CNN
F 2 "" H 8725 2475 60  0001 C CNN
F 3 "" H 8725 2475 60  0001 C CNN
	1    8725 2475
	1    0    0    -1  
$EndComp
$Comp
L power:GND #PWR07
U 1 1 571F1916
P 9225 2425
F 0 "#PWR07" H 9225 2425 30  0001 C CNN
F 1 "GND" H 9225 2355 30  0001 C CNN
F 2 "" H 9225 2425 60  0001 C CNN
F 3 "" H 9225 2425 60  0001 C CNN
	1    9225 2425
	1    0    0    -1  
$EndComp
$Comp
L power:GND #PWR08
U 1 1 571F1917
P 9625 2425
F 0 "#PWR08" H 9625 2425 30  0001 C CNN
F 1 "GND" H 9625 2355 30  0001 C CNN
F 2 "" H 9625 2425 60  0001 C CNN
F 3 "" H 9625 2425 60  0001 C CNN
	1    9625 2425
	1    0    0    -1  
$EndComp
$Comp
L device:R R2
U 1 1 571F1918
P 2875 4100
F 0 "R2" H 2725 4050 50  0000 C CNN
F 1 "294" H 2725 4150 50  0000 C CNN
F 2 "Resistor_SMD:R_0603_1608Metric" H 2875 4100 60  0001 C CNN
F 3 "" H 2875 4100 60  0001 C CNN
F 4 "Yageo" H 2875 4100 60  0001 C CNN "MFN"
F 5 "RC0603FR-07294RL" H 2875 4100 60  0001 C CNN "MFP"
F 6 "603-RC0603FR-07294RL" H 2875 4100 60  0001 C CNN "S1PN"
F 7 "Mouser" H 2875 4100 60  0001 C CNN "S1PL"
F 8 "311-294HRCT-ND" H 2875 4100 60  0001 C CNN "S2PN"
F 9 "Digi-Key" H 2875 4100 60  0001 C CNN "S2PL"
F 10 "RES SMD 294 OHM 1% 1/10W 0603" H 2875 4100 60  0001 C CNN "Description"
F 11 "0603 (1608 Metric)" H 2875 4100 60  0001 C CNN "Package ID"
	1    2875 4100
	-1   0    0    1   
$EndComp
$Comp
L device:R R4
U 1 1 571F191A
P 3325 3750
F 0 "R4" V 3225 3750 50  0000 C CNN
F 1 "17.8" V 3425 3750 50  0000 C CNN
F 2 "Resistor_SMD:R_0603_1608Metric" H 3325 3750 60  0001 C CNN
F 3 "" H 3325 3750 60  0001 C CNN
F 4 "Yageo" H 3325 3750 60  0001 C CNN "MFN"
F 5 "RC0603FR-0717R8L" H 3325 3750 60  0001 C CNN "MFP"
F 6 "603-RC0603FR-0717R8L" H 3325 3750 60  0001 C CNN "S1PN"
F 7 "Mouser" H 3325 3750 60  0001 C CNN "S1PL"
F 8 "RC0603FR-0717R8L" H 3325 3750 60  0001 C CNN "S2PN"
F 9 "Arrow" H 3325 3750 60  0001 C CNN "S2PL"
F 10 "Thick Film Resistors - SMD 17.8 OHM 1%" H 3325 3750 60  0001 C CNN "Description"
F 11 "0603 (1608 metric)" H 3325 3750 60  0001 C CNN "Package ID"
	1    3325 3750
	0    -1   -1   0   
$EndComp
Wire Wire Line
	3475 3750 3750 3750
Wire Wire Line
	3750 3950 3750 3750
Connection ~ 3750 3750
Wire Wire Line
	6050 3750 6250 3750
$Comp
L power:GND #PWR09
U 1 1 571F1922
P 5650 4050
F 0 "#PWR09" H 5650 4050 30  0001 C CNN
F 1 "GND" H 5650 3980 30  0001 C CNN
F 2 "" H 5650 4050 60  0001 C CNN
F 3 "" H 5650 4050 60  0001 C CNN
	1    5650 4050
	1    0    0    -1  
$EndComp
Connection ~ 6250 3750
$Comp
L power:GND #PWR011
U 1 1 571F1924
P 3750 4250
F 0 "#PWR011" H 3750 4250 30  0001 C CNN
F 1 "GND" H 3750 4180 30  0001 C CNN
F 2 "" H 3750 4250 60  0001 C CNN
F 3 "" H 3750 4250 60  0001 C CNN
	1    3750 4250
	1    0    0    -1  
$EndComp
$Comp
L power:GND #PWR012
U 1 1 571F1925
P 2875 4250
F 0 "#PWR012" H 2875 4250 30  0001 C CNN
F 1 "GND" H 2875 4180 30  0001 C CNN
F 2 "" H 2875 4250 60  0001 C CNN
F 3 "" H 2875 4250 60  0001 C CNN
	1    2875 4250
	1    0    0    -1  
$EndComp
$Comp
L power:PWR_FLAG #FLG013
U 1 1 571F1927
P 1525 2325
F 0 "#FLG013" H 1525 2420 30  0001 C CNN
F 1 "PWR_FLAG" H 1525 2505 30  0000 C CNN
F 2 "" H 1525 2325 60  0001 C CNN
F 3 "" H 1525 2325 60  0001 C CNN
	1    1525 2325
	0    -1   -1   0   
$EndComp
Connection ~ 1525 2325
Text Notes 8950 3600 0    60   ~ 0
A-RF Out
Text Notes 1400 3600 0    60   ~ 0
A-RF In
$Comp
L device:C C3
U 1 1 571F1934
P 3000 2275
F 0 "C3" H 3050 2375 50  0000 L CNN
F 1 "0.01uF" H 3050 2175 50  0000 L CNN
F 2 "Capacitor_SMD:C_0805_2012Metric" H 3000 2275 60  0001 C CNN
F 3 "" H 3000 2275 60  0001 C CNN
F 4 "Kemet" H 3000 2275 60  0001 C CNN "MFN"
F 5 "C0805C104K3RACTU" H 3000 2275 60  0001 C CNN "MFP"
F 6 "399-1168-1-ND" H 3000 2275 60  0001 C CNN "S1PN"
F 7 "Digi-Key" H 3000 2275 60  0001 C CNN "S1PL"
F 8 "C0805C104K3RACTU" H 3000 2275 60  0001 C CNN "S2PN"
F 9 "Arrow" H 3000 2275 60  0001 C CNN "S2PL"
F 10 "0.10µF 25V Ceramic Capacitor X7R" H 3000 2275 60  0001 C CNN "Description"
F 11 "0805 (2012 Metric)" H 3000 2275 60  0001 C CNN "Package ID"
	1    3000 2275
	1    0    0    -1  
$EndComp
Wire Wire Line
	3000 2125 3000 1975
$Comp
L power:GND #PWR017
U 1 1 571F193B
P 3000 2425
F 0 "#PWR017" H 3000 2425 30  0001 C CNN
F 1 "GND" H 3000 2355 30  0001 C CNN
F 2 "" H 3000 2425 60  0001 C CNN
F 3 "" H 3000 2425 60  0001 C CNN
	1    3000 2425
	1    0    0    -1  
$EndComp
Wire Wire Line
	1425 2075 1525 2075
Wire Wire Line
	6250 3225 6250 2900
Wire Wire Line
	6250 2900 8275 2900
$Comp
L project:GALI49 U2
U 1 1 571F193C
P 5650 3750
F 0 "U2" H 5750 3950 50  0000 L BNN
F 1 "SKY65016" H 5750 3550 50  0000 L BNN
F 2 "Package_TO_SOT_SMD:SOT-89-3" H 5650 3900 50  0001 C CNN
F 3 "" H 5650 3750 60  0001 C CNN
F 4 "Skyworks" H 5650 3750 60  0001 C CNN "MFN"
F 5 "SKY65016-70LF" H 5650 3750 60  0001 C CNN "MFP"
F 6 "873-SKY65016-70LF" H 5650 3750 60  0001 C CNN "S1PN"
F 7 "Mouser" H 5650 3750 60  0001 C CNN "S1PL"
F 8 "863-1775-1-ND" H 5650 3750 50  0001 C CNN "S2PN"
F 9 "Digi-Key" H 5650 3750 50  0001 C CNN "S2PL"
F 10 "IC RF AMP DBS 100MHZ-3GHZ SOT89" H 5650 3750 60  0001 C CNN "Description"
F 11 "SOT-89-3" H 5650 3750 60  0001 C CNN "Package ID"
	1    5650 3750
	1    0    0    -1  
$EndComp
Wire Wire Line
	6250 3750 6250 3525
$Comp
L project:TA0477A X2
U 1 1 57BBAAF9
P 4350 3800
F 0 "X2" H 4675 3700 60  0000 C CNN
F 1 "B39162B3520" H 4350 4000 60  0000 C CNN
F 2 "SAW_Filters:Golledge_SAW_QFN6" H 4350 3800 60  0001 C CNN
F 3 "" H 4350 3800 60  0001 C CNN
F 4 "EPCOS" H 4350 3800 60  0001 C CNN "MFN"
F 5 "B39162B3520U410" H 4350 3800 60  0001 C CNN "MFP"
F 6 "2360870" H 4350 3800 60  0001 C CNN "S1PN"
F 7 "Element14" H 4350 3800 60  0001 C CNN "S1PL"
F 8 "SAW Filter 1.575GHz,6-SMD" H 4350 3800 60  0001 C CNN "Description"
	1    4350 3800
	1    0    0    -1  
$EndComp
Wire Wire Line
	5200 3750 5350 3750
Wire Wire Line
	4200 4100 4200 4200
Wire Wire Line
	4200 4200 4300 4200
Wire Wire Line
	4500 4200 4500 4100
Wire Wire Line
	4300 4100 4300 4200
Connection ~ 4300 4200
Wire Wire Line
	4400 4100 4400 4200
Connection ~ 4400 4200
$Comp
L power:GND #PWR018
U 1 1 57BBB175
P 4300 4250
F 0 "#PWR018" H 4300 4250 30  0001 C CNN
F 1 "GND" H 4300 4180 30  0001 C CNN
F 2 "" H 4300 4250 60  0001 C CNN
F 3 "" H 4300 4250 60  0001 C CNN
	1    4300 4250
	1    0    0    -1  
$EndComp
Wire Wire Line
	4275 5100 4500 5100
Wire Wire Line
	4500 5300 4500 5100
Connection ~ 4500 5100
Wire Wire Line
	5100 5100 5375 5100
Wire Wire Line
	5375 5300 5375 5100
Connection ~ 5375 5100
$Comp
L power:GND #PWR019
U 1 1 57BBB375
P 5375 5600
F 0 "#PWR019" H 5375 5600 30  0001 C CNN
F 1 "GND" H 5375 5530 30  0001 C CNN
F 2 "" H 5375 5600 60  0001 C CNN
F 3 "" H 5375 5600 60  0001 C CNN
	1    5375 5600
	1    0    0    -1  
$EndComp
$Comp
L power:GND #PWR020
U 1 1 57BBB37B
P 4500 5600
F 0 "#PWR020" H 4500 5600 30  0001 C CNN
F 1 "GND" H 4500 5530 30  0001 C CNN
F 2 "" H 4500 5600 60  0001 C CNN
F 3 "" H 4500 5600 60  0001 C CNN
	1    4500 5600
	1    0    0    -1  
$EndComp
Wire Wire Line
	5825 5450 5825 5550
Wire Wire Line
	5825 5550 5925 5550
Wire Wire Line
	6125 5550 6125 5450
Wire Wire Line
	5925 5450 5925 5550
Connection ~ 5925 5550
Wire Wire Line
	6025 5450 6025 5550
Connection ~ 6025 5550
$Comp
L power:GND #PWR021
U 1 1 57BBB38E
P 5925 5600
F 0 "#PWR021" H 5925 5600 30  0001 C CNN
F 1 "GND" H 5925 5530 30  0001 C CNN
F 2 "" H 5925 5600 60  0001 C CNN
F 3 "" H 5925 5600 60  0001 C CNN
	1    5925 5600
	1    0    0    -1  
$EndComp
Wire Wire Line
	3675 5450 3675 5550
Wire Wire Line
	3675 5550 3775 5550
Wire Wire Line
	3975 5550 3975 5450
Wire Wire Line
	3775 5450 3775 5550
Connection ~ 3775 5550
Wire Wire Line
	3875 5450 3875 5550
Connection ~ 3875 5550
$Comp
L power:GND #PWR022
U 1 1 57BBB51D
P 3775 5600
F 0 "#PWR022" H 3775 5600 30  0001 C CNN
F 1 "GND" H 3775 5530 30  0001 C CNN
F 2 "" H 3775 5600 60  0001 C CNN
F 3 "" H 3775 5600 60  0001 C CNN
	1    3775 5600
	1    0    0    -1  
$EndComp
Wire Wire Line
	6425 5100 6650 5100
Wire Wire Line
	6650 5300 6650 5100
Connection ~ 6650 5100
Wire Wire Line
	7250 5100 7525 5100
$Comp
L power:GND #PWR023
U 1 1 57BBB8EF
P 7525 5600
F 0 "#PWR023" H 7525 5600 30  0001 C CNN
F 1 "GND" H 7525 5530 30  0001 C CNN
F 2 "" H 7525 5600 60  0001 C CNN
F 3 "" H 7525 5600 60  0001 C CNN
	1    7525 5600
	1    0    0    -1  
$EndComp
$Comp
L power:GND #PWR024
U 1 1 57BBB8F5
P 6650 5600
F 0 "#PWR024" H 6650 5600 30  0001 C CNN
F 1 "GND" H 6650 5530 30  0001 C CNN
F 2 "" H 6650 5600 60  0001 C CNN
F 3 "" H 6650 5600 60  0001 C CNN
	1    6650 5600
	1    0    0    -1  
$EndComp
$Comp
L device:R R3
U 1 1 57BBBA09
P 3075 5100
F 0 "R3" V 2975 5100 50  0000 C CNN
F 1 "0" V 3175 5100 50  0000 C CNN
F 2 "Resistor_SMD:R_0603_1608Metric" H 3075 5100 60  0001 C CNN
F 3 "" H 3075 5100 60  0001 C CNN
F 4 "Yageo" H 3075 5100 60  0001 C CNN "MFN"
F 5 "RC0603JR-070RL" H 3075 5100 60  0001 C CNN "MFP"
F 6 "603-RC0603JR-070RL" H 3075 5100 60  0001 C CNN "S1PN"
F 7 "Mouser" H 3075 5100 60  0001 C CNN "S1PL"
F 8 "311-0.0GRCT-ND" H 3075 5100 60  0001 C CNN "S2PN"
F 9 "Digi-Key" H 3075 5100 60  0001 C CNN "S2PL"
F 10 "Thick Film Resistors ZERO OHM JUMPER" H 3075 5100 60  0001 C CNN "Description"
F 11 "0603 (1608 Metric)" H 3075 5100 60  0001 C CNN "Package ID"
	1    3075 5100
	0    -1   -1   0   
$EndComp
Wire Wire Line
	3225 5100 3375 5100
$Comp
L power:GND #PWR025
U 1 1 57BBCC7B
P 2250 3925
F 0 "#PWR025" H 2250 3925 30  0001 C CNN
F 1 "GND" H 2250 3855 30  0001 C CNN
F 2 "" H 2250 3925 60  0001 C CNN
F 3 "" H 2250 3925 60  0001 C CNN
	1    2250 3925
	1    0    0    -1  
$EndComp
$Comp
L power:GND #PWR026
U 1 1 57BBD951
P 8425 3925
F 0 "#PWR026" H 8425 3925 30  0001 C CNN
F 1 "GND" H 8425 3855 30  0001 C CNN
F 2 "" H 8425 3925 60  0001 C CNN
F 3 "" H 8425 3925 60  0001 C CNN
	1    8425 3925
	1    0    0    -1  
$EndComp
$Comp
L power:GND #PWR027
U 1 1 57BBDE2D
P 2250 5275
F 0 "#PWR027" H 2250 5275 30  0001 C CNN
F 1 "GND" H 2250 5205 30  0001 C CNN
F 2 "" H 2250 5275 60  0001 C CNN
F 3 "" H 2250 5275 60  0001 C CNN
	1    2250 5275
	1    0    0    -1  
$EndComp
$Comp
L power:GND #PWR028
U 1 1 57BBE5AE
P 8425 5275
F 0 "#PWR028" H 8425 5275 30  0001 C CNN
F 1 "GND" H 8425 5205 30  0001 C CNN
F 2 "" H 8425 5275 60  0001 C CNN
F 3 "" H 8425 5275 60  0001 C CNN
	1    8425 5275
	1    0    0    -1  
$EndComp
Wire Wire Line
	4800 3750 4900 3750
Text Notes 1475 4975 0    60   ~ 0
Filt In
Text Notes 8950 4975 0    60   ~ 0
Filt Out
$Comp
L device:CP C10
U 1 1 57BBF7C4
P 8725 2275
F 0 "C10" H 8750 2375 50  0000 L CNN
F 1 "10u/16v" H 8750 2175 50  0000 L CNN
F 2 "Capacitor_SMD:C_1210_3225Metric" H 8763 2125 30  0001 C CNN
F 3 "" H 8725 2275 60  0001 C CNN
F 4 "AVX Corporation" H 8725 2275 60  0001 C CNN "MFN"
F 5 "TPSB106K016R0500" H 8725 2275 60  0001 C CNN "MFP"
F 6 "478-5230-1-ND" H 8725 2275 60  0001 C CNN "S1PN"
F 7 "Digi-Key" H 8725 2275 60  0001 C CNN "S1PL"
F 8 "TPSB106K016R0500" H 8725 2275 60  0001 C CNN "S2PN"
F 9 "Arrow" H 8725 2275 60  0001 C CNN "S2PL"
F 10 "10µF Molded Tantalum Capacitors 16V 500 mOhm ESR" H 8725 2275 60  0001 C CNN "Description"
F 11 "1210 (3528 Metric)" H 8725 2275 60  0001 C CNN "Package ID"
	1    8725 2275
	1    0    0    -1  
$EndComp
Wire Wire Line
	8725 2475 8725 2425
$Comp
L device:C C11
U 1 1 57BC0E37
P 9225 2275
F 0 "C11" H 9275 2375 50  0000 L CNN
F 1 "100pF" H 9275 2175 50  0000 L CNN
F 2 "Capacitor_SMD:C_0805_2012Metric" H 9225 2275 60  0001 C CNN
F 3 "" H 9225 2275 60  0001 C CNN
F 4 "Kemet" H 9225 2275 60  0001 C CNN "MFN"
F 5 "C0805C101J5GACTU" H 9225 2275 60  0001 C CNN "MFP"
F 6 "399-1122-1-ND" H 9225 2275 60  0001 C CNN "S1PN"
F 7 "Digi-Key" H 9225 2275 60  0001 C CNN "S1PL"
F 8 "C0805C101J5GACTU" H 9225 2275 60  0001 C CNN "S2PN"
F 9 "Arrow" H 9225 2275 60  0001 C CNN "S2PL"
F 10 "100pF 50V Ceramic Capacitor C0G, NP0" H 9225 2275 60  0001 C CNN "Description"
F 11 "0805 (2012 Metric) " H 9225 2275 60  0001 C CNN "Package ID"
	1    9225 2275
	1    0    0    -1  
$EndComp
$Comp
L device:C C5
U 1 1 57BC113D
P 5050 3750
F 0 "C5" V 4950 3550 50  0000 L CNN
F 1 "100pF" V 5175 3850 50  0000 L CNN
F 2 "Capacitor_SMD:C_0402_1005Metric" H 5050 3750 60  0001 C CNN
F 3 "" H 5050 3750 60  0001 C CNN
F 4 "Kemet" H 5050 3750 60  0001 C CNN "MFN"
F 5 "CBR04C101J3GAC" H 5050 3750 60  0001 C CNN "MFP"
F 6 "399-17684-1-ND" H 5050 3750 60  0001 C CNN "S1PN"
F 7 "Digi-Key" H 5050 3750 60  0001 C CNN "S1PL"
F 8 "80-CBR04C101J3GAC" H 5050 3750 60  0001 C CNN "S2PN"
F 9 "Mouser" H 5050 3750 60  0001 C CNN "S2PL"
F 10 "HiQ-CBR Series, C0G Dielectric, Low ESR, High SRF" H 5050 3750 60  0001 C CNN "Description"
F 11 "0402 (1005 metric)" H 5050 3750 60  0001 C CNN "Package ID"
	1    5050 3750
	0    1    1    0   
$EndComp
$Comp
L device:C C6
U 1 1 57BC1E97
P 5475 2275
F 0 "C6" H 5525 2375 50  0000 L CNN
F 1 "0.1uF" H 5525 2175 50  0000 L CNN
F 2 "Capacitor_SMD:C_0805_2012Metric" H 5475 2275 60  0001 C CNN
F 3 "" H 5475 2275 60  0001 C CNN
F 4 "Kemet" H 5475 2275 60  0001 C CNN "MFN"
F 5 "C0805C104K3RACTU" H 5475 2275 60  0001 C CNN "MFP"
F 6 "399-1168-1-ND" H 5475 2275 60  0001 C CNN "S1PN"
F 7 "Digi-Key" H 5475 2275 60  0001 C CNN "S1PL"
F 8 "C0805C104K3RACTU" H 5475 2275 60  0001 C CNN "S2PN"
F 9 "Arrow" H 5475 2275 60  0001 C CNN "S2PL"
F 10 "0.10µF 25V Ceramic Capacitor X7R" H 5475 2275 60  0001 C CNN "Description"
F 11 "0805 (2012 Metric)" H 5475 2275 60  0001 C CNN "Package ID"
	1    5475 2275
	1    0    0    -1  
$EndComp
$Comp
L device:C C7
U 1 1 57BC20F1
P 6575 2275
F 0 "C7" H 6625 2375 50  0000 L CNN
F 1 "0.1uF" H 6625 2175 50  0000 L CNN
F 2 "Capacitor_SMD:C_0805_2012Metric" H 6575 2275 60  0001 C CNN
F 3 "" H 6575 2275 60  0001 C CNN
F 4 "Kemet" H 6575 2275 60  0001 C CNN "MFN"
F 5 "C0805C104K3RACTU" H 6575 2275 60  0001 C CNN "MFP"
F 6 "399-1168-1-ND" H 6575 2275 60  0001 C CNN "S1PN"
F 7 "Digi-Key" H 6575 2275 60  0001 C CNN "S1PL"
F 8 "C0805C104K3RACTU" H 6575 2275 60  0001 C CNN "S2PN"
F 9 "Arrow" H 6575 2275 60  0001 C CNN "S2PL"
F 10 "0.10µF 25V Ceramic Capacitor X7R" H 6575 2275 60  0001 C CNN "Description"
F 11 "0805 (2012 Metric)" H 6575 2275 60  0001 C CNN "Package ID"
	1    6575 2275
	1    0    0    -1  
$EndComp
$Comp
L device:C C9
U 1 1 57BC23F8
P 7725 2275
F 0 "C9" H 7775 2375 50  0000 L CNN
F 1 "0.1uF" H 7775 2175 50  0000 L CNN
F 2 "Capacitor_SMD:C_0805_2012Metric" H 7725 2275 60  0001 C CNN
F 3 "" H 7725 2275 60  0001 C CNN
F 4 "Kemet" H 7725 2275 60  0001 C CNN "MFN"
F 5 "C0805C104K3RACTU" H 7725 2275 60  0001 C CNN "MFP"
F 6 "399-1168-1-ND" H 7725 2275 60  0001 C CNN "S1PN"
F 7 "Digi-Key" H 7725 2275 60  0001 C CNN "S1PL"
F 8 "C0805C104K3RACTU" H 7725 2275 60  0001 C CNN "S2PN"
F 9 "Arrow" H 7725 2275 60  0001 C CNN "S2PL"
F 10 "0.10µF 25V Ceramic Capacitor X7R" H 7725 2275 60  0001 C CNN "Description"
F 11 "0805 (2012 Metric)" H 7725 2275 60  0001 C CNN "Package ID"
	1    7725 2275
	1    0    0    -1  
$EndComp
$Comp
L device:C C12
U 1 1 57BC2CA3
P 9625 2275
F 0 "C12" H 9675 2375 50  0000 L CNN
F 1 "0.01uF" H 9675 2175 50  0000 L CNN
F 2 "Capacitor_SMD:C_0805_2012Metric" H 9625 2275 60  0001 C CNN
F 3 "" H 9625 2275 60  0001 C CNN
F 4 "Kemet" H 9625 2275 60  0001 C CNN "MFN"
F 5 "C0805C103K5RACTU" H 9625 2275 60  0001 C CNN "MFP"
F 6 "399-1158-1-ND" H 9625 2275 60  0001 C CNN "S1PN"
F 7 "Digi-Key" H 9625 2275 60  0001 C CNN "S1PL"
F 8 "C0805C103K5RACTU" H 9625 2275 60  0001 C CNN "S2PN"
F 9 "Arrow" H 9625 2275 60  0001 C CNN "S2PL"
F 10 "10000pF 50V Ceramic Capacitor X7R 10%" H 9625 2275 60  0001 C CNN "Description"
F 11 "0805 (2012 Metric)" H 9625 2275 60  0001 C CNN "Package ID"
	1    9625 2275
	1    0    0    -1  
$EndComp
$Comp
L project:SMA_2 J2
U 1 1 57BCF433
P 8425 3750
F 0 "J2" H 8575 3765 50  0000 C CNN
F 1 "~" H 8740 3640 50  0000 C CNN
F 2 "SMA_Connectors:SMA_EDGE_4" H 8425 3750 60  0001 C CNN
F 3 "" H 8425 3750 60  0001 C CNN
F 4 "Molex" H 8425 3750 60  0001 C CNN "MFN"
F 5 "0732511150" H 8425 3750 60  0001 C CNN "MFP"
F 6 "S01-SJPT4-11BS00" H 8425 3750 60  0001 C CNN "S1PN"
F 7 "Superbat" H 8425 3750 60  0001 C CNN "S1PL"
F 8 "73251-1150" H 8425 3750 60  0001 C CNN "S2PN"
F 9 "TTI" H 8425 3750 60  0001 C CNN "S2PL"
F 10 "SMA ST PCB-JCK" H 8425 3750 60  0001 C CNN "Description"
F 11 "1:$1.20; 10:$1.08; 100:$0.96" H 8425 3750 50  0001 C CNN "kicost:RF_Supplier:pricing"
	1    8425 3750
	1    0    0    -1  
$EndComp
Wire Wire Line
	7525 5300 7525 5100
Wire Wire Line
	2875 3950 2875 3750
Wire Wire Line
	5475 1975 5875 1975
Wire Wire Line
	4275 1975 4775 1975
Wire Wire Line
	6575 1975 6975 1975
Wire Wire Line
	9225 1975 9625 1975
Wire Wire Line
	8725 1975 9225 1975
Wire Wire Line
	7725 1975 8275 1975
Wire Wire Line
	8275 1975 8725 1975
Wire Wire Line
	2875 3750 3175 3750
Wire Wire Line
	3750 3750 3900 3750
Wire Wire Line
	6250 3750 6675 3750
Wire Wire Line
	1525 2325 1525 2475
Wire Wire Line
	4300 4200 4400 4200
Wire Wire Line
	4300 4200 4300 4250
Wire Wire Line
	4400 4200 4500 4200
Wire Wire Line
	4500 5100 4800 5100
Wire Wire Line
	5375 5100 5525 5100
Wire Wire Line
	5925 5550 6025 5550
Wire Wire Line
	5925 5550 5925 5600
Wire Wire Line
	6025 5550 6125 5550
Wire Wire Line
	3775 5550 3875 5550
Wire Wire Line
	3775 5550 3775 5600
Wire Wire Line
	3875 5550 3975 5550
Wire Wire Line
	6650 5100 6950 5100
Connection ~ 2875 3750
Connection ~ 7525 5100
$Comp
L project:rfi_shield_clip P2
U 1 1 5CCAF21D
P 4225 1125
F 0 "P2" H 4353 1144 60  0000 L CNN
F 1 "rfi_shield_clip" H 4353 1091 60  0001 L CNN
F 2 "RF_Shielding:S1721-46R" H 4225 1125 60  0001 C CNN
F 3 "" H 4225 1125 60  0000 C CNN
F 4 "Harwin Inc." H 4225 1125 50  0001 C CNN "MFN"
F 5 "S1721-46R" H 4225 1125 50  0001 C CNN "MFP"
F 6 "952-1476-1-ND" H 4225 1125 50  0001 C CNN "S1PN"
F 7 "Digi-Key" H 4225 1125 50  0001 C CNN "S1PL"
F 8 "855-S1721-46R" H 4225 1125 50  0001 C CNN "S2PN"
F 9 "Mouser" H 4225 1125 50  0001 C CNN "S2PL"
F 10 "RFI SHIELD CLIP MINI TIN SMD" H 4225 1125 50  0001 C CNN "Description"
	1    4225 1125
	1    0    0    -1  
$EndComp
$Comp
L power:GND #PWR0101
U 1 1 5CCB578F
P 4225 1225
F 0 "#PWR0101" H 4225 1225 30  0001 C CNN
F 1 "GND" H 4225 1155 30  0001 C CNN
F 2 "" H 4225 1225 60  0001 C CNN
F 3 "" H 4225 1225 60  0001 C CNN
	1    4225 1225
	1    0    0    -1  
$EndComp
$Comp
L power:GND #PWR0102
U 1 1 5CCB5804
P 4700 1225
F 0 "#PWR0102" H 4700 1225 30  0001 C CNN
F 1 "GND" H 4700 1155 30  0001 C CNN
F 2 "" H 4700 1225 60  0001 C CNN
F 3 "" H 4700 1225 60  0001 C CNN
	1    4700 1225
	1    0    0    -1  
$EndComp
$Comp
L power:GND #PWR0103
U 1 1 5CCB5879
P 5175 1225
F 0 "#PWR0103" H 5175 1225 30  0001 C CNN
F 1 "GND" H 5175 1155 30  0001 C CNN
F 2 "" H 5175 1225 60  0001 C CNN
F 3 "" H 5175 1225 60  0001 C CNN
	1    5175 1225
	1    0    0    -1  
$EndComp
$Comp
L power:GND #PWR0104
U 1 1 5CCB58EE
P 5650 1225
F 0 "#PWR0104" H 5650 1225 30  0001 C CNN
F 1 "GND" H 5650 1155 30  0001 C CNN
F 2 "" H 5650 1225 60  0001 C CNN
F 3 "" H 5650 1225 60  0001 C CNN
	1    5650 1225
	1    0    0    -1  
$EndComp
$Comp
L project:SMA_2 J4
U 1 1 5D4CA310
P 8425 5100
F 0 "J4" H 8575 5115 50  0000 C CNN
F 1 "~" H 8740 4990 50  0000 C CNN
F 2 "SMA_Connectors:SMA_EDGE_4" H 8425 5100 60  0001 C CNN
F 3 "" H 8425 5100 60  0001 C CNN
F 4 "Molex" H 8425 5100 60  0001 C CNN "MFN"
F 5 "0732511150" H 8425 5100 60  0001 C CNN "MFP"
F 6 "S01-SJPT4-11BS00" H 8425 5100 60  0001 C CNN "S1PN"
F 7 "Superbat" H 8425 5100 60  0001 C CNN "S1PL"
F 8 "73251-1150" H 8425 5100 60  0001 C CNN "S2PN"
F 9 "TTI" H 8425 5100 60  0001 C CNN "S2PL"
F 10 "SMA ST PCB-JCK" H 8425 5100 60  0001 C CNN "Description"
F 11 "1:$1.20; 10:$1.08; 100:$0.96" H 8425 5100 50  0001 C CNN "kicost:RF_Supplier:pricing"
	1    8425 5100
	1    0    0    -1  
$EndComp
$Comp
L project:SMA_2 J1
U 1 1 5D4CA3C0
P 2250 3750
F 0 "J1" H 2400 3765 50  0000 C CNN
F 1 "~" H 2565 3640 50  0000 C CNN
F 2 "SMA_Connectors:SMA_EDGE_4" H 2250 3750 60  0001 C CNN
F 3 "" H 2250 3750 60  0001 C CNN
F 4 "Molex" H 2250 3750 60  0001 C CNN "MFN"
F 5 "0732511150" H 2250 3750 60  0001 C CNN "MFP"
F 6 "S01-SJPT4-11BS00" H 2250 3750 60  0001 C CNN "S1PN"
F 7 "Superbat" H 2250 3750 60  0001 C CNN "S1PL"
F 8 "73251-1150" H 2250 3750 60  0001 C CNN "S2PN"
F 9 "TTI" H 2250 3750 60  0001 C CNN "S2PL"
F 10 "SMA ST PCB-JCK" H 2250 3750 60  0001 C CNN "Description"
F 11 "1:$1.20; 10:$1.08; 100:$0.96" H 2250 3750 50  0001 C CNN "kicost:RF_Supplier:pricing"
	1    2250 3750
	-1   0    0    -1  
$EndComp
$Comp
L project:SMA_2 J3
U 1 1 5D4D348F
P 2250 5100
F 0 "J3" H 2400 5115 50  0000 C CNN
F 1 "~" H 2565 4990 50  0000 C CNN
F 2 "SMA_Connectors:SMA_EDGE_4" H 2250 5100 60  0001 C CNN
F 3 "" H 2250 5100 60  0001 C CNN
F 4 "Molex" H 2250 5100 60  0001 C CNN "MFN"
F 5 "0732511150" H 2250 5100 60  0001 C CNN "MFP"
F 6 "S01-SJPT4-11BS00" H 2250 5100 60  0001 C CNN "S1PN"
F 7 "Superbat" H 2250 5100 60  0001 C CNN "S1PL"
F 8 "73251-1150" H 2250 5100 60  0001 C CNN "S2PN"
F 9 "TTI" H 2250 5100 60  0001 C CNN "S2PL"
F 10 "SMA ST PCB-JCK" H 2250 5100 60  0001 C CNN "Description"
F 11 "1:$1.20; 10:$1.08; 100:$0.96" H 2250 5100 50  0001 C CNN "kicost:RF_Supplier:pricing"
	1    2250 5100
	-1   0    0    -1  
$EndComp
$Comp
L project:rfi_shield_clip P3
U 1 1 5D4E9FD4
P 4700 1125
F 0 "P3" H 4828 1144 60  0000 L CNN
F 1 "rfi_shield_clip" H 4828 1091 60  0001 L CNN
F 2 "RF_Shielding:S1721-46R" H 4700 1125 60  0001 C CNN
F 3 "" H 4700 1125 60  0000 C CNN
F 4 "Harwin Inc." H 4700 1125 50  0001 C CNN "MFN"
F 5 "S1721-46R" H 4700 1125 50  0001 C CNN "MFP"
F 6 "952-1476-1-ND" H 4700 1125 50  0001 C CNN "S1PN"
F 7 "Digi-Key" H 4700 1125 50  0001 C CNN "S1PL"
F 8 "855-S1721-46R" H 4700 1125 50  0001 C CNN "S2PN"
F 9 "Mouser" H 4700 1125 50  0001 C CNN "S2PL"
F 10 "RFI SHIELD CLIP MINI TIN SMD" H 4700 1125 50  0001 C CNN "Description"
	1    4700 1125
	1    0    0    -1  
$EndComp
$Comp
L project:rfi_shield_clip P4
U 1 1 5D4ED024
P 5175 1125
F 0 "P4" H 5303 1144 60  0000 L CNN
F 1 "rfi_shield_clip" H 5303 1091 60  0001 L CNN
F 2 "RF_Shielding:S1721-46R" H 5175 1125 60  0001 C CNN
F 3 "" H 5175 1125 60  0000 C CNN
F 4 "Harwin Inc." H 5175 1125 50  0001 C CNN "MFN"
F 5 "S1721-46R" H 5175 1125 50  0001 C CNN "MFP"
F 6 "952-1476-1-ND" H 5175 1125 50  0001 C CNN "S1PN"
F 7 "Digi-Key" H 5175 1125 50  0001 C CNN "S1PL"
F 8 "855-S1721-46R" H 5175 1125 50  0001 C CNN "S2PN"
F 9 "Mouser" H 5175 1125 50  0001 C CNN "S2PL"
F 10 "RFI SHIELD CLIP MINI TIN SMD" H 5175 1125 50  0001 C CNN "Description"
	1    5175 1125
	1    0    0    -1  
$EndComp
$Comp
L project:rfi_shield_clip P5
U 1 1 5D4F0131
P 5650 1125
F 0 "P5" H 5778 1144 60  0000 L CNN
F 1 "rfi_shield_clip" H 5778 1091 60  0001 L CNN
F 2 "RF_Shielding:S1721-46R" H 5650 1125 60  0001 C CNN
F 3 "" H 5650 1125 60  0000 C CNN
F 4 "Harwin Inc." H 5650 1125 50  0001 C CNN "MFN"
F 5 "S1721-46R" H 5650 1125 50  0001 C CNN "MFP"
F 6 "952-1476-1-ND" H 5650 1125 50  0001 C CNN "S1PN"
F 7 "Digi-Key" H 5650 1125 50  0001 C CNN "S1PL"
F 8 "855-S1721-46R" H 5650 1125 50  0001 C CNN "S2PN"
F 9 "Mouser" H 5650 1125 50  0001 C CNN "S2PL"
F 10 "RFI SHIELD CLIP MINI TIN SMD" H 5650 1125 50  0001 C CNN "Description"
	1    5650 1125
	1    0    0    -1  
$EndComp
$Comp
L connector:Conn_01x02_Male P1
U 1 1 5D4F6BF4
P 1225 1975
F 0 "P1" H 1331 2153 50  0000 C CNN
F 1 "5V" H 1125 1925 50  0000 C CNN
F 2 "Connector_PinSocket_2.54mm:PinSocket_1x02_P2.54mm_Vertical" H 1225 1975 50  0001 C CNN
F 3 "" H 1225 1975 50  0001 C CNN
F 4 "Mintron" H 1225 1975 50  0001 C CNN "MFN"
F 5 "MTP125-1102S1" H 1225 1975 50  0001 C CNN "MFP"
F 6 "C358684" H 1225 1975 50  0001 C CNN "S1PN"
F 7 "LCSC" H 1225 1975 50  0001 C CNN "S1PL"
F 8 "Pin Header Male Pin 0.100\"(2.54mm) 2 pin" H 1225 1975 50  0001 C CNN "Description"
F 9 "Through Hole,P=2.54mm" H 1225 1975 50  0001 C CNN "Package ID"
F 10 "1:$0.01; 10:$0.01; 100:$0.01; 500:$0.008" H 1225 1975 50  0001 C CNN "kicost:LCSC:pricing"
F 11 "https://lcsc.com/product-detail/Pin-Header-Female-Header_MINTRON-MTP125-1102S1_C358684.html" H 1225 1975 50  0001 C CNN "kicost:LCSC:link"
	1    1225 1975
	1    0    0    -1  
$EndComp
$Comp
L project:TA0477A X1
U 1 1 5EA21EB5
P 3825 5150
F 0 "X1" H 4150 5050 60  0000 C CNN
F 1 "B39162B3520" H 3825 5350 60  0000 C CNN
F 2 "SAW_Filters:Golledge_SAW_QFN6" H 3825 5150 60  0001 C CNN
F 3 "" H 3825 5150 60  0001 C CNN
F 4 "EPCOS" H 3825 5150 60  0001 C CNN "MFN"
F 5 "B39162B3520U410" H 3825 5150 60  0001 C CNN "MFP"
F 6 "2360870" H 3825 5150 60  0001 C CNN "S1PN"
F 7 "Element14" H 3825 5150 60  0001 C CNN "S1PL"
F 8 "SAW Filter 1.575GHz,6-SMD" H 3825 5150 60  0001 C CNN "Description"
	1    3825 5150
	1    0    0    -1  
$EndComp
$Comp
L project:TA0477A X3
U 1 1 5EA24F70
P 5975 5150
F 0 "X3" H 6300 5050 60  0000 C CNN
F 1 "B39162B3520" H 5975 5350 60  0000 C CNN
F 2 "SAW_Filters:Golledge_SAW_QFN6" H 5975 5150 60  0001 C CNN
F 3 "" H 5975 5150 60  0001 C CNN
F 4 "EPCOS" H 5975 5150 60  0001 C CNN "MFN"
F 5 "B39162B3520U410" H 5975 5150 60  0001 C CNN "MFP"
F 6 "2360870" H 5975 5150 60  0001 C CNN "S1PN"
F 7 "Element14" H 5975 5150 60  0001 C CNN "S1PL"
F 8 "SAW Filter 1.575GHz,6-SMD" H 5975 5150 60  0001 C CNN "Description"
	1    5975 5150
	1    0    0    -1  
$EndComp
Wire Wire Line
	1425 1975 3000 1975
$Comp
L device:R R1
U 1 1 5EDA78C7
P 3700 1975
F 0 "R1" V 3600 1975 50  0000 C CNN
F 1 "0" V 3800 1975 50  0000 C CNN
F 2 "Resistor_SMD:R_0603_1608Metric" H 3700 1975 60  0001 C CNN
F 3 "" H 3700 1975 60  0001 C CNN
F 4 "Yageo" H 3700 1975 60  0001 C CNN "MFN"
F 5 "RC0603FR-070RL" H 3700 1975 60  0001 C CNN "MFP"
F 6 "603-RC0603FR-070RL" H 3700 1975 60  0001 C CNN "S1PN"
F 7 "Mouser" H 3700 1975 60  0001 C CNN "S1PL"
F 8 "311-0.0HRTR-ND" H 3700 1975 60  0001 C CNN "S2PN"
F 9 "Digi-Key" H 3700 1975 60  0001 C CNN "S2PL"
F 10 "RES SMD 0 OHM JUMPER 1/10W" H 3700 1975 60  0001 C CNN "Description"
F 11 "0603 (1608 metric)" H 3700 1975 60  0001 C CNN "Package ID"
	1    3700 1975
	0    -1   -1   0   
$EndComp
Wire Wire Line
	3550 1975 3000 1975
Connection ~ 3000 1975
Wire Wire Line
	3850 1975 4275 1975
Connection ~ 4275 1975
$Comp
L device:R R7
U 1 1 5EDAE665
P 4950 5100
F 0 "R7" V 4850 5100 50  0000 C CNN
F 1 "17.8" V 5050 5100 50  0000 C CNN
F 2 "Resistor_SMD:R_0603_1608Metric" H 4950 5100 60  0001 C CNN
F 3 "" H 4950 5100 60  0001 C CNN
F 4 "Yageo" H 4950 5100 60  0001 C CNN "MFN"
F 5 "RC0603FR-0717R8L" H 4950 5100 60  0001 C CNN "MFP"
F 6 "603-RC0603FR-0717R8L" H 4950 5100 60  0001 C CNN "S1PN"
F 7 "Mouser" H 4950 5100 60  0001 C CNN "S1PL"
F 8 "RC0603FR-0717R8L" H 4950 5100 60  0001 C CNN "S2PN"
F 9 "Arrow" H 4950 5100 60  0001 C CNN "S2PL"
F 10 "Thick Film Resistors - SMD 17.8 OHM 1%" H 4950 5100 60  0001 C CNN "Description"
F 11 "0603 (1608 metric)" H 4950 5100 60  0001 C CNN "Package ID"
	1    4950 5100
	0    -1   -1   0   
$EndComp
$Comp
L device:R R5
U 1 1 5EDB1A1B
P 3750 4100
F 0 "R5" H 3600 4050 50  0000 C CNN
F 1 "294" H 3600 4150 50  0000 C CNN
F 2 "Resistor_SMD:R_0603_1608Metric" H 3750 4100 60  0001 C CNN
F 3 "" H 3750 4100 60  0001 C CNN
F 4 "Yageo" H 3750 4100 60  0001 C CNN "MFN"
F 5 "RC0603FR-07294RL" H 3750 4100 60  0001 C CNN "MFP"
F 6 "603-RC0603FR-07294RL" H 3750 4100 60  0001 C CNN "S1PN"
F 7 "Mouser" H 3750 4100 60  0001 C CNN "S1PL"
F 8 "311-294HRCT-ND" H 3750 4100 60  0001 C CNN "S2PN"
F 9 "Digi-Key" H 3750 4100 60  0001 C CNN "S2PL"
F 10 "RES SMD 294 OHM 1% 1/10W 0603" H 3750 4100 60  0001 C CNN "Description"
F 11 "0603 (1608 Metric)" H 3750 4100 60  0001 C CNN "Package ID"
	1    3750 4100
	-1   0    0    1   
$EndComp
$Comp
L device:R R6
U 1 1 5EDB4727
P 4500 5450
F 0 "R6" H 4350 5400 50  0000 C CNN
F 1 "294" H 4350 5500 50  0000 C CNN
F 2 "Resistor_SMD:R_0603_1608Metric" H 4500 5450 60  0001 C CNN
F 3 "" H 4500 5450 60  0001 C CNN
F 4 "Yageo" H 4500 5450 60  0001 C CNN "MFN"
F 5 "RC0603FR-07294RL" H 4500 5450 60  0001 C CNN "MFP"
F 6 "603-RC0603FR-07294RL" H 4500 5450 60  0001 C CNN "S1PN"
F 7 "Mouser" H 4500 5450 60  0001 C CNN "S1PL"
F 8 "311-294HRCT-ND" H 4500 5450 60  0001 C CNN "S2PN"
F 9 "Digi-Key" H 4500 5450 60  0001 C CNN "S2PL"
F 10 "RES SMD 294 OHM 1% 1/10W 0603" H 4500 5450 60  0001 C CNN "Description"
F 11 "0603 (1608 Metric)" H 4500 5450 60  0001 C CNN "Package ID"
	1    4500 5450
	-1   0    0    1   
$EndComp
$Comp
L device:R R8
U 1 1 5EDB744E
P 5375 5450
F 0 "R8" H 5225 5400 50  0000 C CNN
F 1 "294" H 5225 5500 50  0000 C CNN
F 2 "Resistor_SMD:R_0603_1608Metric" H 5375 5450 60  0001 C CNN
F 3 "" H 5375 5450 60  0001 C CNN
F 4 "Yageo" H 5375 5450 60  0001 C CNN "MFN"
F 5 "RC0603FR-07294RL" H 5375 5450 60  0001 C CNN "MFP"
F 6 "603-RC0603FR-07294RL" H 5375 5450 60  0001 C CNN "S1PN"
F 7 "Mouser" H 5375 5450 60  0001 C CNN "S1PL"
F 8 "311-294HRCT-ND" H 5375 5450 60  0001 C CNN "S2PN"
F 9 "Digi-Key" H 5375 5450 60  0001 C CNN "S2PL"
F 10 "RES SMD 294 OHM 1% 1/10W 0603" H 5375 5450 60  0001 C CNN "Description"
F 11 "0603 (1608 Metric)" H 5375 5450 60  0001 C CNN "Package ID"
	1    5375 5450
	-1   0    0    1   
$EndComp
$Comp
L device:R R11
U 1 1 5EDBA5E4
P 7100 5100
F 0 "R11" V 7000 5100 50  0000 C CNN
F 1 "0" V 7200 5100 50  0000 C CNN
F 2 "Resistor_SMD:R_0603_1608Metric" H 7100 5100 60  0001 C CNN
F 3 "" H 7100 5100 60  0001 C CNN
F 4 "Yageo" H 7100 5100 60  0001 C CNN "MFN"
F 5 "RC0603JR-070RL" H 7100 5100 60  0001 C CNN "MFP"
F 6 "603-RC0603JR-070RL" H 7100 5100 60  0001 C CNN "S1PN"
F 7 "Mouser" H 7100 5100 60  0001 C CNN "S1PL"
F 8 "311-0.0GRCT-ND" H 7100 5100 60  0001 C CNN "S2PN"
F 9 "Digi-Key" H 7100 5100 60  0001 C CNN "S2PL"
F 10 "Thick Film Resistors ZERO OHM JUMPER" H 7100 5100 60  0001 C CNN "Description"
F 11 "0603 (1608 Metric)" H 7100 5100 60  0001 C CNN "Package ID"
	1    7100 5100
	0    -1   -1   0   
$EndComp
$Comp
L device:R R10
U 1 1 5EDBD3DF
P 6650 5450
F 0 "R10" H 6500 5400 50  0000 C CNN
F 1 "DNF" H 6500 5500 50  0000 C CNN
F 2 "Resistor_SMD:R_0603_1608Metric" H 6650 5450 60  0001 C CNN
F 3 "" H 6650 5450 60  0001 C CNN
F 4 "Yageo" H 6650 5450 60  0001 C CNN "MFN"
F 5 "RC0603FR-07294RL" H 6650 5450 60  0001 C CNN "MFP"
F 6 "603-RC0603FR-07294RL" H 6650 5450 60  0001 C CNN "S1PN"
F 7 "Mouser" H 6650 5450 60  0001 C CNN "S1PL"
F 8 "311-294HRCT-ND" H 6650 5450 60  0001 C CNN "S2PN"
F 9 "Digi-Key" H 6650 5450 60  0001 C CNN "S2PL"
F 10 "RES SMD 294 OHM 1% 1/10W 0603" H 6650 5450 60  0001 C CNN "Description"
F 11 "0603 (1608 Metric)" H 6650 5450 60  0001 C CNN "Package ID"
	1    6650 5450
	-1   0    0    1   
$EndComp
$Comp
L device:R R13
U 1 1 5EDC01B8
P 7525 5450
F 0 "R13" H 7375 5400 50  0000 C CNN
F 1 "DNF" H 7375 5500 50  0000 C CNN
F 2 "Resistor_SMD:R_0603_1608Metric" H 7525 5450 60  0001 C CNN
F 3 "" H 7525 5450 60  0001 C CNN
F 4 "Yageo" H 7525 5450 60  0001 C CNN "MFN"
F 5 "RC0603FR-07294RL" H 7525 5450 60  0001 C CNN "MFP"
F 6 "603-RC0603FR-07294RL" H 7525 5450 60  0001 C CNN "S1PN"
F 7 "Mouser" H 7525 5450 60  0001 C CNN "S1PL"
F 8 "311-294HRCT-ND" H 7525 5450 60  0001 C CNN "S2PN"
F 9 "Digi-Key" H 7525 5450 60  0001 C CNN "S2PL"
F 10 "RES SMD 294 OHM 1% 1/10W 0603" H 7525 5450 60  0001 C CNN "Description"
F 11 "0603 (1608 Metric)" H 7525 5450 60  0001 C CNN "Package ID"
	1    7525 5450
	-1   0    0    1   
$EndComp
$Comp
L device:C C8
U 1 1 5EDC3CDA
P 6825 3750
F 0 "C8" V 6725 3550 50  0000 L CNN
F 1 "100pF" V 6950 3850 50  0000 L CNN
F 2 "Capacitor_SMD:C_0402_1005Metric" H 6825 3750 60  0001 C CNN
F 3 "" H 6825 3750 60  0001 C CNN
F 4 "Kemet" H 6825 3750 60  0001 C CNN "MFN"
F 5 "CBR04C101J3GAC" H 6825 3750 60  0001 C CNN "MFP"
F 6 "399-17684-1-ND" H 6825 3750 60  0001 C CNN "S1PN"
F 7 "Digi-Key" H 6825 3750 60  0001 C CNN "S1PL"
F 8 "80-CBR04C101J3GAC" H 6825 3750 60  0001 C CNN "S2PN"
F 9 "Mouser" H 6825 3750 60  0001 C CNN "S2PL"
F 10 "HiQ-CBR Series, C0G Dielectric, Low ESR, High SRF" H 6825 3750 60  0001 C CNN "Description"
F 11 "0402 (1005 metric)" H 6825 3750 60  0001 C CNN "Package ID"
	1    6825 3750
	0    1    1    0   
$EndComp
$Comp
L device:R R12
U 1 1 5FDBF4BD
P 7125 1975
F 0 "R12" V 7025 1975 50  0000 C CNN
F 1 "18" V 7225 1975 50  0000 C CNN
F 2 "Resistor_SMD:R_0805_2012Metric" H 7125 1975 60  0001 C CNN
F 3 "" H 7125 1975 60  0001 C CNN
F 4 "Yageo" H 7125 1975 60  0001 C CNN "MFN"
F 5 "RC0805FR-0718RL" H 7125 1975 60  0001 C CNN "MFP"
F 6 "311-180CRCT-ND" H 7125 1975 60  0001 C CNN "S1PN"
F 7 "Digi-Key" H 7125 1975 60  0001 C CNN "S1PL"
F 8 "603-RC0805FR-0718RL" H 7125 1975 60  0001 C CNN "S2PN"
F 9 "Mouser" H 7125 1975 60  0001 C CNN "S2PL"
F 10 "18 Ohms ±1% 0.125W, 1/8W Chip Resistor 0805" H 7125 1975 60  0001 C CNN "Description"
F 11 "0805 (2012 Metric)" H 7125 1975 60  0001 C CNN "Package ID"
	1    7125 1975
	0    -1   -1   0   
$EndComp
Wire Wire Line
	7275 1975 7725 1975
Wire Wire Line
	2375 3750 2875 3750
Wire Wire Line
	2375 5100 2925 5100
Wire Wire Line
	6975 3750 8300 3750
Wire Wire Line
	7525 5100 8300 5100
$EndSCHEMATC
