(module SMA_2 (layer F.Cu) (tedit 58D4B9C2)
  (fp_text reference J5 (at 1.9304 -6.35) (layer F.SilkS)
    (effects (font (size 0.6096 0.6096) (thickness 0.1016)))
  )
  (fp_text value "IF A" (at 5.3848 5.1308) (layer F.SilkS)
    (effects (font (size 1 1) (thickness 0.15)))
  )
  (pad 2 smd rect (at 0 4.318) (size 5 2.4) (layers B.Cu B.Mask))
  (pad 2 smd rect (at 0 4.318) (size 5 2.4) (layers F.Cu F.Mask))
  (pad 2 smd rect (at 0 -4.318) (size 5 2.4) (layers B.Cu B.Mask))
  (pad 1 smd rect (at -0.508 0) (size 4 2) (layers F.Cu F.Paste F.Mask)
    (clearance 0.508))
  (pad 1 smd circle (at 1.5 0) (size 2 2) (layers F.Cu F.Paste F.Mask))
  (pad 2 smd rect (at 0 -4.318) (size 5 2.4) (layers F.Cu F.Mask))
)
