(module RF_castellation (layer F.Cu) (tedit 5BE76514)
  (fp_text reference REF** (at 0 4.53644) (layer F.SilkS)
    (effects (font (size 0.5 0.5) (thickness 0.125)) hide)
  )
  (fp_text value RF_castellation (at 0 -5.78866) (layer F.Fab)
    (effects (font (size 1 1) (thickness 0.15)))
  )
  (pad 1 thru_hole circle (at 0 0) (size 2.032 2.032) (drill 1.524) (layers *.Cu *.Mask))
  (pad 2 thru_hole circle (at 2.54254 -0.00508) (size 2.032 2.032) (drill 1.524) (layers *.Cu F.Mask)
    (zone_connect 2))
  (pad 2 thru_hole circle (at -2.54254 -0.00508) (size 2.032 2.032) (drill 1.524) (layers *.Cu F.Mask)
    (zone_connect 2))
)
