EESchema Schematic File Version 4
EELAYER 30 0
EELAYER END
$Descr A3 16535 11693
encoding utf-8
Sheet 1 1
Title "RF Switches"
Date "2021-04-19"
Rev "1.4"
Comp "Dyadic Pty Ltd"
Comment1 "2020"
Comment2 ""
Comment3 ""
Comment4 ""
$EndDescr
$Comp
L project:PE42420 U1
U 1 1 5F05E3C5
P 4350 5150
F 0 "U1" H 4300 5325 60  0000 L CNN
F 1 "PE42420" H 4175 5100 60  0000 L CNN
F 2 "psemi:QFN-20-1EP_4x4mm_P0.5mm_EP2.25x2.25mm" H 4450 5000 60  0001 C CNN
F 3 "" H 4450 5000 60  0001 C CNN
	1    4350 5150
	1    0    0    -1  
$EndComp
$Comp
L project:Via F3
U 1 1 5F05E534
P 5800 5150
F 0 "F3" H 5877 5108 60  0000 L CNN
F 1 "Via" H 5877 5002 60  0000 L CNN
F 2 "Vias:RF_via" H 5800 5150 60  0001 C CNN
F 3 "" H 5800 5150 60  0001 C CNN
	1    5800 5150
	1    0    0    -1  
$EndComp
$Comp
L project:Via F2
U 1 1 5F05E569
P 2900 5150
F 0 "F2" H 2819 5397 60  0000 C CNN
F 1 "Via" H 2819 5291 60  0000 C CNN
F 2 "Vias:RF_via" H 2900 5150 60  0001 C CNN
F 3 "" H 2900 5150 60  0001 C CNN
	1    2900 5150
	-1   0    0    -1  
$EndComp
$Comp
L project:SMA_2 J3
U 1 1 5F05E6D2
P 7550 5150
F 0 "J3" H 7653 5140 50  0000 L CNN
F 1 "SMA_2" H 7653 5049 50  0000 L CNN
F 2 "SMA_Connectors:SMA_EDGE_4" H 7725 5050 50  0001 C CNN
F 3 "" H 7550 5150 60  0000 C CNN
	1    7550 5150
	1    0    0    -1  
$EndComp
$Comp
L project:SMA_2 J2
U 1 1 5F05E702
P 1375 5150
F 0 "J2" H 1344 5390 50  0000 C CNN
F 1 "SMA_2" H 1344 5299 50  0000 C CNN
F 2 "SMA_Connectors:SMA_EDGE_4" H 1550 5050 50  0001 C CNN
F 3 "" H 1375 5150 60  0000 C CNN
	1    1375 5150
	-1   0    0    -1  
$EndComp
$Comp
L project:SMA_2 J4
U 1 1 5F05E970
P 3675 7825
F 0 "J4" H 3644 8065 50  0000 C CNN
F 1 "SMA_2" H 3644 7974 50  0000 C CNN
F 2 "SMA_Connectors:SMA_EDGE_4" H 3850 7725 50  0001 C CNN
F 3 "" H 3675 7825 60  0000 C CNN
	1    3675 7825
	-1   0    0    -1  
$EndComp
$Comp
L device:Ferrite_Bead_Small FB1
U 1 1 5F05EDB8
P 2800 3125
F 0 "FB1" V 2925 3125 50  0000 C CNN
F 1 "~" V 2654 3125 50  0000 C CNN
F 2 "Inductor_SMD:L_0603_1608Metric" V 2730 3125 50  0001 C CNN
F 3 "~" H 2800 3125 50  0001 C CNN
	1    2800 3125
	0    1    1    0   
$EndComp
$Comp
L device:C_Small C1
U 1 1 5F05F5D0
P 2550 3375
F 0 "C1" H 2300 3425 50  0000 L CNN
F 1 "0.1u" H 2300 3325 50  0000 L CNN
F 2 "Capacitor_SMD:C_0402_1005Metric" H 2550 3375 50  0001 C CNN
F 3 "~" H 2550 3375 50  0001 C CNN
	1    2550 3375
	1    0    0    -1  
$EndComp
$Comp
L device:C_Small C2
U 1 1 5F05F7FE
P 3050 3375
F 0 "C2" H 3142 3421 50  0000 L CNN
F 1 "0.1u" H 3142 3330 50  0000 L CNN
F 2 "Capacitor_SMD:C_0402_1005Metric" H 3050 3375 50  0001 C CNN
F 3 "~" H 3050 3375 50  0001 C CNN
	1    3050 3375
	1    0    0    -1  
$EndComp
Wire Wire Line
	1350 3125 2550 3125
Wire Wire Line
	2550 3275 2550 3125
Connection ~ 2550 3125
Wire Wire Line
	2550 3125 2700 3125
$Comp
L device:R_Small R1
U 1 1 5F05FB29
P 3350 3125
F 0 "R1" V 3450 3125 50  0000 C CNN
F 1 "10" V 3350 3125 50  0000 C CNN
F 2 "Resistor_SMD:R_0402_1005Metric" H 3350 3125 50  0001 C CNN
F 3 "~" H 3350 3125 50  0001 C CNN
	1    3350 3125
	0    1    1    0   
$EndComp
$Comp
L device:C_Small C3
U 1 1 5F05FCED
P 3600 3375
F 0 "C3" H 3692 3421 50  0000 L CNN
F 1 "22p" H 3692 3330 50  0000 L CNN
F 2 "Capacitor_SMD:C_0402_1005Metric" H 3600 3375 50  0001 C CNN
F 3 "~" H 3600 3375 50  0001 C CNN
	1    3600 3375
	1    0    0    -1  
$EndComp
Wire Wire Line
	3950 4250 3950 3850
Wire Wire Line
	3950 3125 3600 3125
Wire Wire Line
	3600 3275 3600 3125
Connection ~ 3600 3125
Wire Wire Line
	3600 3125 3450 3125
Wire Wire Line
	2900 3125 3050 3125
Wire Wire Line
	3050 3275 3050 3125
Connection ~ 3050 3125
Wire Wire Line
	3050 3125 3250 3125
$Comp
L power:GND #PWR01
U 1 1 5F060287
P 2550 3475
F 0 "#PWR01" H 2550 3225 50  0001 C CNN
F 1 "GND" H 2555 3302 50  0000 C CNN
F 2 "" H 2550 3475 50  0001 C CNN
F 3 "" H 2550 3475 50  0001 C CNN
	1    2550 3475
	1    0    0    -1  
$EndComp
$Comp
L power:GND #PWR02
U 1 1 5F060354
P 3050 3475
F 0 "#PWR02" H 3050 3225 50  0001 C CNN
F 1 "GND" H 3055 3302 50  0000 C CNN
F 2 "" H 3050 3475 50  0001 C CNN
F 3 "" H 3050 3475 50  0001 C CNN
	1    3050 3475
	1    0    0    -1  
$EndComp
$Comp
L power:GND #PWR03
U 1 1 5F0604D5
P 3600 3475
F 0 "#PWR03" H 3600 3225 50  0001 C CNN
F 1 "GND" H 3605 3302 50  0000 C CNN
F 2 "" H 3600 3475 50  0001 C CNN
F 3 "" H 3600 3475 50  0001 C CNN
	1    3600 3475
	1    0    0    -1  
$EndComp
Wire Wire Line
	4550 3025 4550 3575
$Comp
L device:R_Small R4
U 1 1 5F061285
P 4550 4050
F 0 "R4" H 4375 4100 50  0000 L CNN
F 1 "0" H 4400 4000 50  0000 L CNN
F 2 "Resistor_SMD:R_0402_1005Metric" H 4550 4050 50  0001 C CNN
F 3 "~" H 4550 4050 50  0001 C CNN
	1    4550 4050
	1    0    0    -1  
$EndComp
Wire Wire Line
	4550 4150 4550 4250
$Comp
L device:R_Small R5
U 1 1 5F0615EC
P 4750 4050
F 0 "R5" H 4809 4096 50  0000 L CNN
F 1 "0" H 4825 4000 50  0000 L CNN
F 2 "Resistor_SMD:R_0402_1005Metric" H 4750 4050 50  0001 C CNN
F 3 "~" H 4750 4050 50  0001 C CNN
	1    4750 4050
	1    0    0    -1  
$EndComp
Wire Wire Line
	4750 4250 4750 4150
Wire Wire Line
	4750 3950 4750 3675
Wire Wire Line
	1350 3225 1675 3225
Wire Wire Line
	1675 3225 1675 3650
$Comp
L power:GND #PWR04
U 1 1 5F061E15
P 1675 3825
F 0 "#PWR04" H 1675 3575 50  0001 C CNN
F 1 "GND" H 1680 3652 50  0000 C CNN
F 2 "" H 1675 3825 50  0001 C CNN
F 3 "" H 1675 3825 50  0001 C CNN
	1    1675 3825
	1    0    0    -1  
$EndComp
$Comp
L power:PWR_FLAG #FLG01
U 1 1 5F061E77
P 1675 3650
F 0 "#FLG01" H 1675 3725 50  0001 C CNN
F 1 "PWR_FLAG" V 1675 3778 50  0000 L CNN
F 2 "" H 1675 3650 50  0001 C CNN
F 3 "~" H 1675 3650 50  0001 C CNN
	1    1675 3650
	0    1    1    0   
$EndComp
Connection ~ 1675 3650
Wire Wire Line
	1675 3650 1675 3825
$Comp
L device:C_Small C4
U 1 1 5F06331A
P 5125 3825
F 0 "C4" H 4925 3875 50  0000 L CNN
F 1 "22p" H 4900 3775 50  0000 L CNN
F 2 "Capacitor_SMD:C_0402_1005Metric" H 5125 3825 50  0001 C CNN
F 3 "~" H 5125 3825 50  0001 C CNN
	1    5125 3825
	1    0    0    -1  
$EndComp
$Comp
L device:C_Small C5
U 1 1 5F06346C
P 5475 3825
F 0 "C5" H 5275 3875 50  0000 L CNN
F 1 "22p" H 5250 3775 50  0000 L CNN
F 2 "Capacitor_SMD:C_0402_1005Metric" H 5475 3825 50  0001 C CNN
F 3 "~" H 5475 3825 50  0001 C CNN
	1    5475 3825
	1    0    0    -1  
$EndComp
$Comp
L power:GND #PWR05
U 1 1 5F063E00
P 5125 3925
F 0 "#PWR05" H 5125 3675 50  0001 C CNN
F 1 "GND" H 5130 3752 50  0000 C CNN
F 2 "" H 5125 3925 50  0001 C CNN
F 3 "" H 5125 3925 50  0001 C CNN
	1    5125 3925
	1    0    0    -1  
$EndComp
$Comp
L power:GND #PWR06
U 1 1 5F063E39
P 5475 3925
F 0 "#PWR06" H 5475 3675 50  0001 C CNN
F 1 "GND" H 5480 3752 50  0000 C CNN
F 2 "" H 5475 3925 50  0001 C CNN
F 3 "" H 5475 3925 50  0001 C CNN
	1    5475 3925
	1    0    0    -1  
$EndComp
Wire Wire Line
	5125 3575 4550 3575
Wire Wire Line
	5125 3575 5125 3725
Connection ~ 4550 3575
Wire Wire Line
	4550 3575 4550 3950
Wire Wire Line
	5475 3675 4750 3675
Wire Wire Line
	5475 3675 5475 3725
Connection ~ 4750 3675
Wire Wire Line
	4750 3675 4750 2925
$Comp
L device:C_Small C6
U 1 1 5F064911
P 3200 5150
F 0 "C6" V 2971 5150 50  0000 C CNN
F 1 "1n" V 3062 5150 50  0000 C CNN
F 2 "Capacitor_SMD:C_0402_1005Metric" H 3200 5150 50  0001 C CNN
F 3 "~" H 3200 5150 50  0001 C CNN
	1    3200 5150
	0    1    1    0   
$EndComp
$Comp
L device:C_Small C7
U 1 1 5F0649BF
P 5500 5150
F 0 "C7" V 5271 5150 50  0000 C CNN
F 1 "1n" V 5362 5150 50  0000 C CNN
F 2 "Capacitor_SMD:C_0402_1005Metric" H 5500 5150 50  0001 C CNN
F 3 "~" H 5500 5150 50  0001 C CNN
	1    5500 5150
	0    1    1    0   
$EndComp
Wire Wire Line
	3300 5150 3450 5150
Wire Wire Line
	5250 5150 5400 5150
Wire Wire Line
	5250 5350 5350 5350
Wire Wire Line
	5250 5550 5350 5550
Wire Wire Line
	5350 5550 5350 5350
Wire Wire Line
	5350 4750 5250 4750
Connection ~ 5350 5350
Wire Wire Line
	5350 5350 5600 5350
Wire Wire Line
	5350 5350 5350 4950
Wire Wire Line
	5250 4950 5350 4950
Connection ~ 5350 4950
Wire Wire Line
	5350 4950 5350 4750
Wire Wire Line
	3100 5350 3350 5350
Wire Wire Line
	3450 5550 3350 5550
Wire Wire Line
	3350 5550 3350 5350
Connection ~ 3350 5350
Wire Wire Line
	3350 5350 3450 5350
Wire Wire Line
	3350 5350 3350 4950
Wire Wire Line
	3350 4950 3450 4950
Wire Wire Line
	3350 4950 3350 4750
Wire Wire Line
	3350 4750 3450 4750
Connection ~ 3350 4950
$Comp
L project:Via F1
U 1 1 5F06B918
P 1900 5150
F 0 "F1" H 1977 5108 60  0000 L CNN
F 1 "Via" H 1977 5002 60  0000 L CNN
F 2 "Vias:RF_via" H 1900 5150 60  0001 C CNN
F 3 "" H 1900 5150 60  0001 C CNN
	1    1900 5150
	1    0    0    -1  
$EndComp
$Comp
L project:Via F4
U 1 1 5F06B9AF
P 6925 5150
F 0 "F4" H 6844 5397 60  0000 C CNN
F 1 "Via" H 6844 5291 60  0000 C CNN
F 2 "Vias:RF_via" H 6925 5150 60  0001 C CNN
F 3 "" H 6925 5150 60  0001 C CNN
	1    6925 5150
	-1   0    0    -1  
$EndComp
Wire Wire Line
	4550 6050 4550 6150
Wire Wire Line
	4750 6050 4750 6150
Wire Wire Line
	4750 6150 4550 6150
Connection ~ 4550 6150
Wire Wire Line
	4550 6150 4150 6150
Wire Wire Line
	4150 6150 4150 6050
Wire Wire Line
	4150 6150 3950 6150
Wire Wire Line
	3950 6150 3950 6050
Connection ~ 4150 6150
Wire Wire Line
	4350 7825 3800 7825
$Comp
L power:GND #PWR010
U 1 1 5F073783
P 7125 5350
F 0 "#PWR010" H 7125 5100 50  0001 C CNN
F 1 "GND" H 7130 5177 50  0000 C CNN
F 2 "" H 7125 5350 50  0001 C CNN
F 3 "" H 7125 5350 50  0001 C CNN
	1    7125 5350
	1    0    0    -1  
$EndComp
$Comp
L power:GND #PWR08
U 1 1 5F0737C6
P 7550 5325
F 0 "#PWR08" H 7550 5075 50  0001 C CNN
F 1 "GND" H 7555 5152 50  0000 C CNN
F 2 "" H 7550 5325 50  0001 C CNN
F 3 "" H 7550 5325 50  0001 C CNN
	1    7550 5325
	1    0    0    -1  
$EndComp
$Comp
L power:GND #PWR09
U 1 1 5F073809
P 1700 5350
F 0 "#PWR09" H 1700 5100 50  0001 C CNN
F 1 "GND" H 1705 5177 50  0000 C CNN
F 2 "" H 1700 5350 50  0001 C CNN
F 3 "" H 1700 5350 50  0001 C CNN
	1    1700 5350
	1    0    0    -1  
$EndComp
$Comp
L power:GND #PWR07
U 1 1 5F07392C
P 1375 5325
F 0 "#PWR07" H 1375 5075 50  0001 C CNN
F 1 "GND" H 1380 5152 50  0000 C CNN
F 2 "" H 1375 5325 50  0001 C CNN
F 3 "" H 1375 5325 50  0001 C CNN
	1    1375 5325
	1    0    0    -1  
$EndComp
$Comp
L power:GND #PWR013
U 1 1 5F07396F
P 3675 8000
F 0 "#PWR013" H 3675 7750 50  0001 C CNN
F 1 "GND" H 3680 7827 50  0000 C CNN
F 2 "" H 3675 8000 50  0001 C CNN
F 3 "" H 3675 8000 50  0001 C CNN
	1    3675 8000
	1    0    0    -1  
$EndComp
Wire Wire Line
	4350 4250 4350 4150
Wire Wire Line
	4350 4150 4150 4150
Wire Wire Line
	3750 4150 3750 4250
Wire Wire Line
	4150 4250 4150 4150
Connection ~ 4150 4150
Wire Wire Line
	4150 4150 3750 4150
Wire Wire Line
	3350 4750 3350 4150
Wire Wire Line
	3350 4150 3750 4150
Connection ~ 3350 4750
Connection ~ 3750 4150
Wire Wire Line
	3350 5550 3350 6150
Wire Wire Line
	3350 6150 3950 6150
Connection ~ 3350 5550
Connection ~ 3950 6150
Wire Wire Line
	5350 5550 5350 6150
Wire Wire Line
	5350 6150 4750 6150
Connection ~ 5350 5550
Connection ~ 4750 6150
$Comp
L power:GND #PWR011
U 1 1 5F07BFB7
P 3350 6150
F 0 "#PWR011" H 3350 5900 50  0001 C CNN
F 1 "GND" H 3355 5977 50  0000 C CNN
F 2 "" H 3350 6150 50  0001 C CNN
F 3 "" H 3350 6150 50  0001 C CNN
	1    3350 6150
	1    0    0    -1  
$EndComp
Connection ~ 3350 6150
$Comp
L power:PWR_FLAG #FLG02
U 1 1 5F07C1C3
P 3950 3850
F 0 "#FLG02" H 3950 3925 50  0001 C CNN
F 1 "PWR_FLAG" V 3950 3978 50  0000 L CNN
F 2 "" H 3950 3850 50  0001 C CNN
F 3 "~" H 3950 3850 50  0001 C CNN
	1    3950 3850
	0    -1   -1   0   
$EndComp
Connection ~ 3950 3850
Wire Wire Line
	3950 3850 3950 3125
Wire Wire Line
	4550 6150 4550 6275
$Comp
L power:GND #PWR012
U 1 1 5F0739B2
P 4550 7625
F 0 "#PWR012" H 4550 7375 50  0001 C CNN
F 1 "GND" H 4555 7452 50  0000 C CNN
F 2 "" H 4550 7625 50  0001 C CNN
F 3 "" H 4550 7625 50  0001 C CNN
	1    4550 7625
	1    0    0    -1  
$EndComp
$Comp
L project:Via F6
U 1 1 5F06CA74
P 4350 7425
F 0 "F6" V 4215 7147 60  0000 R CNN
F 1 "Via" V 4321 7147 60  0000 R CNN
F 2 "Vias:RF_via" H 4350 7425 60  0001 C CNN
F 3 "" H 4350 7425 60  0001 C CNN
	1    4350 7425
	0    -1   -1   0   
$EndComp
$Comp
L project:Via F5
U 1 1 5F05E5D9
P 4350 6475
F 0 "F5" V 4215 6197 60  0000 R CNN
F 1 "Via" V 4321 6197 60  0000 R CNN
F 2 "Vias:RF_via" H 4350 6475 60  0001 C CNN
F 3 "" H 4350 6475 60  0001 C CNN
	1    4350 6475
	0    -1   1    0   
$EndComp
$Comp
L connector:Conn_01x02_Male P2
U 1 1 5F09BE6E
P 6125 3025
F 0 "P2" H 6097 2905 50  0000 R CNN
F 1 "Sig" H 6097 2996 50  0000 R CNN
F 2 "Connector_PinHeader_2.54mm:PinHeader_1x02_P2.54mm_Vertical" H 6125 3025 50  0001 C CNN
F 3 "~" H 6125 3025 50  0001 C CNN
	1    6125 3025
	-1   0    0    1   
$EndComp
$Comp
L connector:Conn_01x02_Male P1
U 1 1 5F09BF27
P 1150 3125
F 0 "P1" H 1256 3303 50  0000 C CNN
F 1 "Pwr" H 1256 3212 50  0000 C CNN
F 2 "Connector_PinHeader_2.54mm:PinHeader_1x02_P2.54mm_Vertical" H 1150 3125 50  0001 C CNN
F 3 "~" H 1150 3125 50  0001 C CNN
	1    1150 3125
	1    0    0    -1  
$EndComp
Wire Wire Line
	4750 2925 5925 2925
Wire Wire Line
	4550 3025 5925 3025
$Comp
L project:PE42553 U2
U 1 1 5F0A6381
P 11400 5225
F 0 "U2" H 11450 5100 60  0000 R CNN
F 1 "PE42553" H 11575 5250 60  0000 R CNN
F 2 "psemi:Psemi-QFN-16_EP1.75x1.75mm" H 11600 4975 60  0001 C CNN
F 3 "" H 11600 4975 60  0001 C CNN
	1    11400 5225
	-1   0    0    1   
$EndComp
$Comp
L device:C_Small C13
U 1 1 5F0B4665
P 12500 5125
F 0 "C13" V 12271 5125 50  0000 C CNN
F 1 "0.1u" V 12362 5125 50  0000 C CNN
F 2 "Capacitor_SMD:C_0402_1005Metric" H 12500 5125 50  0001 C CNN
F 3 "~" H 12500 5125 50  0001 C CNN
	1    12500 5125
	0    1    1    0   
$EndComp
$Comp
L device:C_Small C12
U 1 1 5F0B4B1F
P 10300 5125
F 0 "C12" V 10071 5125 50  0000 C CNN
F 1 "0.1u" V 10162 5125 50  0000 C CNN
F 2 "Capacitor_SMD:C_0402_1005Metric" H 10300 5125 50  0001 C CNN
F 3 "~" H 10300 5125 50  0001 C CNN
	1    10300 5125
	0    1    1    0   
$EndComp
$Comp
L project:Via F9
U 1 1 5F0B5196
P 12800 5125
F 0 "F9" H 12877 5083 60  0000 L CNN
F 1 "Via" H 12877 4977 60  0000 L CNN
F 2 "Vias:RF_via" H 12800 5125 60  0001 C CNN
F 3 "" H 12800 5125 60  0001 C CNN
	1    12800 5125
	1    0    0    -1  
$EndComp
$Comp
L project:Via F8
U 1 1 5F0B5AB4
P 10000 5125
F 0 "F8" H 9919 5372 60  0000 C CNN
F 1 "Via" H 9919 5266 60  0000 C CNN
F 2 "Vias:RF_via" H 10000 5125 60  0001 C CNN
F 3 "" H 10000 5125 60  0001 C CNN
	1    10000 5125
	-1   0    0    -1  
$EndComp
$Comp
L project:Via F11
U 1 1 5F0B6513
P 11500 6425
F 0 "F11" V 11365 6147 60  0000 R CNN
F 1 "Via" V 11471 6147 60  0000 R CNN
F 2 "Vias:RF_via" H 11500 6425 60  0001 C CNN
F 3 "" H 11500 6425 60  0001 C CNN
	1    11500 6425
	0    -1   1    0   
$EndComp
Wire Wire Line
	10600 4925 10500 4925
Wire Wire Line
	10500 4925 10500 5325
Wire Wire Line
	10500 6125 11100 6125
Wire Wire Line
	11100 6125 11100 6025
Wire Wire Line
	10600 5125 10400 5125
Wire Wire Line
	10600 5325 10500 5325
Connection ~ 10500 5325
Wire Wire Line
	10500 5325 10500 5525
Wire Wire Line
	10600 5525 10500 5525
Connection ~ 10500 5525
Wire Wire Line
	10500 5525 10500 6125
Wire Wire Line
	11100 6125 11300 6125
Wire Wire Line
	11900 6125 11900 6025
Connection ~ 11100 6125
Wire Wire Line
	10200 5325 10500 5325
Wire Wire Line
	11700 6225 11700 6125
Connection ~ 11700 6125
Wire Wire Line
	11700 6125 11900 6125
Wire Wire Line
	11700 6025 11700 6125
Wire Wire Line
	11300 6025 11300 6125
Connection ~ 11300 6125
Wire Wire Line
	11300 6125 11700 6125
Wire Wire Line
	12200 5125 12400 5125
Wire Wire Line
	12200 5525 12300 5525
Wire Wire Line
	12300 5525 12300 6125
Wire Wire Line
	12300 6125 11900 6125
Connection ~ 11900 6125
Wire Wire Line
	12200 5325 12300 5325
Wire Wire Line
	12300 5325 12300 5525
Connection ~ 12300 5525
Wire Wire Line
	12300 5325 12300 4925
Wire Wire Line
	12300 4925 12200 4925
Connection ~ 12300 5325
Wire Wire Line
	11300 4425 11300 4325
Wire Wire Line
	11300 4325 11700 4325
Wire Wire Line
	12300 4325 12300 4925
Connection ~ 12300 4925
Wire Wire Line
	11700 4425 11700 4325
Connection ~ 11700 4325
Wire Wire Line
	11700 4325 12300 4325
Wire Wire Line
	12600 5325 12300 5325
$Comp
L power:GND #PWR024
U 1 1 5F0D897F
P 10500 6125
F 0 "#PWR024" H 10500 5875 50  0001 C CNN
F 1 "GND" H 10505 5952 50  0000 C CNN
F 2 "" H 10500 6125 50  0001 C CNN
F 3 "" H 10500 6125 50  0001 C CNN
	1    10500 6125
	1    0    0    -1  
$EndComp
Connection ~ 10500 6125
$Comp
L project:SMA_2 J5
U 1 1 5F0DD980
P 14500 5125
F 0 "J5" H 14603 5115 50  0000 L CNN
F 1 "SMA_2" H 14603 5024 50  0000 L CNN
F 2 "SMA_Connectors:SMA_EDGE_4" H 14675 5025 50  0001 C CNN
F 3 "" H 14500 5125 60  0000 C CNN
	1    14500 5125
	1    0    0    -1  
$EndComp
$Comp
L power:GND #PWR021
U 1 1 5F0DD987
P 14500 5300
F 0 "#PWR021" H 14500 5050 50  0001 C CNN
F 1 "GND" H 14505 5127 50  0000 C CNN
F 2 "" H 14500 5300 50  0001 C CNN
F 3 "" H 14500 5300 50  0001 C CNN
	1    14500 5300
	1    0    0    -1  
$EndComp
$Comp
L project:SMA_2 J1
U 1 1 5F0DFFDB
P 8700 5125
F 0 "J1" H 8669 5365 50  0000 C CNN
F 1 "SMA_2" H 8669 5274 50  0000 C CNN
F 2 "SMA_Connectors:SMA_EDGE_4" H 8875 5025 50  0001 C CNN
F 3 "" H 8700 5125 60  0000 C CNN
	1    8700 5125
	-1   0    0    -1  
$EndComp
$Comp
L power:GND #PWR020
U 1 1 5F0DFFE2
P 8700 5300
F 0 "#PWR020" H 8700 5050 50  0001 C CNN
F 1 "GND" H 8705 5127 50  0000 C CNN
F 2 "" H 8700 5300 50  0001 C CNN
F 3 "" H 8700 5300 50  0001 C CNN
	1    8700 5300
	1    0    0    -1  
$EndComp
$Comp
L project:SMA_2 J6
U 1 1 5F0E282A
P 10825 7800
F 0 "J6" H 10794 8040 50  0000 C CNN
F 1 "SMA_2" H 10794 7949 50  0000 C CNN
F 2 "SMA_Connectors:SMA_EDGE_4" H 11000 7700 50  0001 C CNN
F 3 "" H 10825 7800 60  0000 C CNN
	1    10825 7800
	-1   0    0    -1  
$EndComp
Wire Wire Line
	11500 7800 10950 7800
$Comp
L power:GND #PWR026
U 1 1 5F0E2831
P 10825 7975
F 0 "#PWR026" H 10825 7725 50  0001 C CNN
F 1 "GND" H 10830 7802 50  0000 C CNN
F 2 "" H 10825 7975 50  0001 C CNN
F 3 "" H 10825 7975 50  0001 C CNN
	1    10825 7975
	1    0    0    -1  
$EndComp
$Comp
L power:GND #PWR025
U 1 1 5F0E2837
P 11700 7600
F 0 "#PWR025" H 11700 7350 50  0001 C CNN
F 1 "GND" H 11705 7427 50  0000 C CNN
F 2 "" H 11700 7600 50  0001 C CNN
F 3 "" H 11700 7600 50  0001 C CNN
	1    11700 7600
	1    0    0    -1  
$EndComp
$Comp
L project:Via F12
U 1 1 5F0E283F
P 11500 7400
F 0 "F12" V 11365 7122 60  0000 R CNN
F 1 "Via" V 11471 7122 60  0000 R CNN
F 2 "Vias:RF_via" H 11500 7400 60  0001 C CNN
F 3 "" H 11500 7400 60  0001 C CNN
	1    11500 7400
	0    -1   -1   0   
$EndComp
$Comp
L project:Via F7
U 1 1 5F0F4EA8
P 9200 5125
F 0 "F7" H 9277 5083 60  0000 L CNN
F 1 "Via" H 9277 4977 60  0000 L CNN
F 2 "Vias:RF_via" H 9200 5125 60  0001 C CNN
F 3 "" H 9200 5125 60  0001 C CNN
	1    9200 5125
	1    0    0    -1  
$EndComp
$Comp
L power:GND #PWR022
U 1 1 5F0F7BD0
P 9000 5325
F 0 "#PWR022" H 9000 5075 50  0001 C CNN
F 1 "GND" H 9005 5152 50  0000 C CNN
F 2 "" H 9000 5325 50  0001 C CNN
F 3 "" H 9000 5325 50  0001 C CNN
	1    9000 5325
	1    0    0    -1  
$EndComp
$Comp
L project:Via F10
U 1 1 5F0FD477
P 13950 5125
F 0 "F10" H 13869 5372 60  0000 C CNN
F 1 "Via" H 13869 5266 60  0000 C CNN
F 2 "Vias:RF_via" H 13950 5125 60  0001 C CNN
F 3 "" H 13950 5125 60  0001 C CNN
	1    13950 5125
	-1   0    0    -1  
$EndComp
$Comp
L power:GND #PWR023
U 1 1 5F105CED
P 14150 5325
F 0 "#PWR023" H 14150 5075 50  0001 C CNN
F 1 "GND" H 14155 5152 50  0000 C CNN
F 2 "" H 14150 5325 50  0001 C CNN
F 3 "" H 14150 5325 50  0001 C CNN
	1    14150 5325
	1    0    0    -1  
$EndComp
$Comp
L device:Ferrite_Bead_Small FB2
U 1 1 5F1090D4
P 9950 3300
F 0 "FB2" V 10075 3300 50  0000 C CNN
F 1 "~" V 9804 3300 50  0000 C CNN
F 2 "Inductor_SMD:L_0603_1608Metric" V 9880 3300 50  0001 C CNN
F 3 "~" H 9950 3300 50  0001 C CNN
	1    9950 3300
	0    1    1    0   
$EndComp
$Comp
L device:C_Small C8
U 1 1 5F1090DA
P 9700 3550
F 0 "C8" H 9450 3600 50  0000 L CNN
F 1 "0.1u" H 9450 3500 50  0000 L CNN
F 2 "Capacitor_SMD:C_0402_1005Metric" H 9700 3550 50  0001 C CNN
F 3 "~" H 9700 3550 50  0001 C CNN
	1    9700 3550
	1    0    0    -1  
$EndComp
$Comp
L device:C_Small C9
U 1 1 5F1090E0
P 10200 3550
F 0 "C9" H 10292 3596 50  0000 L CNN
F 1 "0.1u" H 10292 3505 50  0000 L CNN
F 2 "Capacitor_SMD:C_0402_1005Metric" H 10200 3550 50  0001 C CNN
F 3 "~" H 10200 3550 50  0001 C CNN
	1    10200 3550
	1    0    0    -1  
$EndComp
Wire Wire Line
	8500 3300 9700 3300
Wire Wire Line
	9700 3450 9700 3300
Connection ~ 9700 3300
Wire Wire Line
	9700 3300 9850 3300
$Comp
L device:R_Small R2
U 1 1 5F1090EA
P 10500 3300
F 0 "R2" V 10600 3300 50  0000 C CNN
F 1 "10" V 10500 3300 50  0000 C CNN
F 2 "Resistor_SMD:R_0402_1005Metric" H 10500 3300 50  0001 C CNN
F 3 "~" H 10500 3300 50  0001 C CNN
	1    10500 3300
	0    1    1    0   
$EndComp
$Comp
L device:C_Small C10
U 1 1 5F1090F0
P 10750 3550
F 0 "C10" H 10842 3596 50  0000 L CNN
F 1 "22p" H 10842 3505 50  0000 L CNN
F 2 "Capacitor_SMD:C_0402_1005Metric" H 10750 3550 50  0001 C CNN
F 3 "~" H 10750 3550 50  0001 C CNN
	1    10750 3550
	1    0    0    -1  
$EndComp
Wire Wire Line
	11100 4425 11100 4025
Wire Wire Line
	11100 3300 10750 3300
Wire Wire Line
	10750 3450 10750 3300
Connection ~ 10750 3300
Wire Wire Line
	10750 3300 10600 3300
Wire Wire Line
	10050 3300 10200 3300
Wire Wire Line
	10200 3450 10200 3300
Connection ~ 10200 3300
Wire Wire Line
	10200 3300 10400 3300
$Comp
L power:GND #PWR015
U 1 1 5F1090FF
P 9700 3650
F 0 "#PWR015" H 9700 3400 50  0001 C CNN
F 1 "GND" H 9705 3477 50  0000 C CNN
F 2 "" H 9700 3650 50  0001 C CNN
F 3 "" H 9700 3650 50  0001 C CNN
	1    9700 3650
	1    0    0    -1  
$EndComp
$Comp
L power:GND #PWR016
U 1 1 5F109105
P 10200 3650
F 0 "#PWR016" H 10200 3400 50  0001 C CNN
F 1 "GND" H 10205 3477 50  0000 C CNN
F 2 "" H 10200 3650 50  0001 C CNN
F 3 "" H 10200 3650 50  0001 C CNN
	1    10200 3650
	1    0    0    -1  
$EndComp
$Comp
L power:GND #PWR017
U 1 1 5F10910B
P 10750 3650
F 0 "#PWR017" H 10750 3400 50  0001 C CNN
F 1 "GND" H 10755 3477 50  0000 C CNN
F 2 "" H 10750 3650 50  0001 C CNN
F 3 "" H 10750 3650 50  0001 C CNN
	1    10750 3650
	1    0    0    -1  
$EndComp
Wire Wire Line
	8500 3400 8825 3400
$Comp
L power:GND #PWR019
U 1 1 5F109113
P 8825 4000
F 0 "#PWR019" H 8825 3750 50  0001 C CNN
F 1 "GND" H 8830 3827 50  0000 C CNN
F 2 "" H 8825 4000 50  0001 C CNN
F 3 "" H 8825 4000 50  0001 C CNN
	1    8825 4000
	1    0    0    -1  
$EndComp
$Comp
L power:PWR_FLAG #FLG04
U 1 1 5F109121
P 11100 4025
F 0 "#FLG04" H 11100 4100 50  0001 C CNN
F 1 "PWR_FLAG" V 11100 4153 50  0000 L CNN
F 2 "" H 11100 4025 50  0001 C CNN
F 3 "~" H 11100 4025 50  0001 C CNN
	1    11100 4025
	0    -1   -1   0   
$EndComp
Connection ~ 11100 4025
Wire Wire Line
	11100 4025 11100 3300
$Comp
L connector:Conn_01x02_Male P3
U 1 1 5F109129
P 8300 3300
F 0 "P3" H 8406 3478 50  0000 C CNN
F 1 "Pwr" H 8406 3387 50  0000 C CNN
F 2 "Connector_PinHeader_2.54mm:PinHeader_1x02_P2.54mm_Vertical" H 8300 3300 50  0001 C CNN
F 3 "~" H 8300 3300 50  0001 C CNN
	1    8300 3300
	1    0    0    -1  
$EndComp
$Comp
L device:R_Small R3
U 1 1 5F11744C
P 11500 4100
F 0 "R3" H 11559 4146 50  0000 L CNN
F 1 "0" H 11575 4050 50  0000 L CNN
F 2 "Resistor_SMD:R_0402_1005Metric" H 11500 4100 50  0001 C CNN
F 3 "~" H 11500 4100 50  0001 C CNN
	1    11500 4100
	1    0    0    -1  
$EndComp
$Comp
L connector:Conn_01x02_Male P4
U 1 1 5F1179EB
P 13300 3400
F 0 "P4" H 13272 3280 50  0000 R CNN
F 1 "Sig" H 13272 3371 50  0000 R CNN
F 2 "Connector_PinHeader_2.54mm:PinHeader_1x02_P2.54mm_Vertical" H 13300 3400 50  0001 C CNN
F 3 "~" H 13300 3400 50  0001 C CNN
	1    13300 3400
	-1   0    0    1   
$EndComp
Wire Wire Line
	11500 4200 11500 4425
Wire Wire Line
	13100 3300 11500 3300
Wire Wire Line
	11500 3300 11500 3650
$Comp
L device:C_Small C11
U 1 1 5F11FE0D
P 11800 3850
F 0 "C11" H 11892 3896 50  0000 L CNN
F 1 "22p" H 11892 3805 50  0000 L CNN
F 2 "Capacitor_SMD:C_0402_1005Metric" H 11800 3850 50  0001 C CNN
F 3 "~" H 11800 3850 50  0001 C CNN
	1    11800 3850
	1    0    0    -1  
$EndComp
$Comp
L power:GND #PWR018
U 1 1 5F11FE9D
P 11800 3950
F 0 "#PWR018" H 11800 3700 50  0001 C CNN
F 1 "GND" H 11805 3777 50  0000 C CNN
F 2 "" H 11800 3950 50  0001 C CNN
F 3 "" H 11800 3950 50  0001 C CNN
	1    11800 3950
	1    0    0    -1  
$EndComp
Wire Wire Line
	11800 3750 11800 3650
Wire Wire Line
	11800 3650 11500 3650
Connection ~ 11500 3650
Wire Wire Line
	11500 3650 11500 4000
$Comp
L power:GND #PWR014
U 1 1 5F123C40
P 12950 3500
F 0 "#PWR014" H 12950 3250 50  0001 C CNN
F 1 "GND" H 12955 3327 50  0000 C CNN
F 2 "" H 12950 3500 50  0001 C CNN
F 3 "" H 12950 3500 50  0001 C CNN
	1    12950 3500
	1    0    0    -1  
$EndComp
Wire Wire Line
	13100 3400 12950 3400
Wire Wire Line
	12950 3400 12950 3500
Wire Wire Line
	8825 3400 8825 4000
$Comp
L project:rfi_shield_clip P7
U 1 1 5F140658
P 10900 1950
F 0 "P7" H 11028 2022 60  0000 L CNN
F 1 "rfi_shield_clip" H 11028 1916 60  0000 L CNN
F 2 "RF_Shielding:S1721-46R" H 10900 1950 60  0001 C CNN
F 3 "" H 10900 1950 60  0000 C CNN
	1    10900 1950
	1    0    0    -1  
$EndComp
$Comp
L project:rfi_shield_clip P8
U 1 1 5F140715
P 11875 1950
F 0 "P8" H 12003 2022 60  0000 L CNN
F 1 "rfi_shield_clip" H 12003 1916 60  0000 L CNN
F 2 "RF_Shielding:S1721-46R" H 11875 1950 60  0001 C CNN
F 3 "" H 11875 1950 60  0000 C CNN
	1    11875 1950
	1    0    0    -1  
$EndComp
$Comp
L project:rfi_shield_clip P11
U 1 1 5F14099F
P 10900 2525
F 0 "P11" H 11028 2597 60  0000 L CNN
F 1 "rfi_shield_clip" H 11028 2491 60  0000 L CNN
F 2 "RF_Shielding:S1721-46R" H 10900 2525 60  0001 C CNN
F 3 "" H 10900 2525 60  0000 C CNN
	1    10900 2525
	1    0    0    -1  
$EndComp
$Comp
L project:rfi_shield_clip P5
U 1 1 5F140E49
P 3650 1675
F 0 "P5" H 3778 1747 60  0000 L CNN
F 1 "rfi_shield_clip" H 3778 1641 60  0000 L CNN
F 2 "RF_Shielding:S1721-46R" H 3650 1675 60  0001 C CNN
F 3 "" H 3650 1675 60  0000 C CNN
	1    3650 1675
	1    0    0    -1  
$EndComp
$Comp
L project:rfi_shield_clip P9
U 1 1 5F140E55
P 3650 2250
F 0 "P9" H 3778 2322 60  0000 L CNN
F 1 "rfi_shield_clip" H 3778 2216 60  0000 L CNN
F 2 "RF_Shielding:S1721-46R" H 3650 2250 60  0001 C CNN
F 3 "" H 3650 2250 60  0000 C CNN
	1    3650 2250
	1    0    0    -1  
$EndComp
$Comp
L project:rfi_shield_clip P10
U 1 1 5F140E5B
P 4625 2250
F 0 "P10" H 4753 2322 60  0000 L CNN
F 1 "rfi_shield_clip" H 4753 2216 60  0000 L CNN
F 2 "RF_Shielding:S1721-46R" H 4625 2250 60  0001 C CNN
F 3 "" H 4625 2250 60  0000 C CNN
	1    4625 2250
	1    0    0    -1  
$EndComp
$Comp
L power:GND #PWR0101
U 1 1 5F144F3D
P 3650 1775
F 0 "#PWR0101" H 3650 1525 50  0001 C CNN
F 1 "GND" H 3655 1602 50  0000 C CNN
F 2 "" H 3650 1775 50  0001 C CNN
F 3 "" H 3650 1775 50  0001 C CNN
	1    3650 1775
	1    0    0    -1  
$EndComp
$Comp
L power:GND #PWR0103
U 1 1 5F148F9F
P 4625 2350
F 0 "#PWR0103" H 4625 2100 50  0001 C CNN
F 1 "GND" H 4630 2177 50  0000 C CNN
F 2 "" H 4625 2350 50  0001 C CNN
F 3 "" H 4625 2350 50  0001 C CNN
	1    4625 2350
	1    0    0    -1  
$EndComp
$Comp
L power:GND #PWR0104
U 1 1 5F149012
P 3650 2350
F 0 "#PWR0104" H 3650 2100 50  0001 C CNN
F 1 "GND" H 3655 2177 50  0000 C CNN
F 2 "" H 3650 2350 50  0001 C CNN
F 3 "" H 3650 2350 50  0001 C CNN
	1    3650 2350
	1    0    0    -1  
$EndComp
$Comp
L power:GND #PWR0105
U 1 1 5F14D233
P 10900 2050
F 0 "#PWR0105" H 10900 1800 50  0001 C CNN
F 1 "GND" H 10905 1877 50  0000 C CNN
F 2 "" H 10900 2050 50  0001 C CNN
F 3 "" H 10900 2050 50  0001 C CNN
	1    10900 2050
	1    0    0    -1  
$EndComp
$Comp
L power:GND #PWR0106
U 1 1 5F14D2A6
P 11875 2050
F 0 "#PWR0106" H 11875 1800 50  0001 C CNN
F 1 "GND" H 11880 1877 50  0000 C CNN
F 2 "" H 11875 2050 50  0001 C CNN
F 3 "" H 11875 2050 50  0001 C CNN
	1    11875 2050
	1    0    0    -1  
$EndComp
$Comp
L power:GND #PWR0108
U 1 1 5F14D38C
P 10900 2625
F 0 "#PWR0108" H 10900 2375 50  0001 C CNN
F 1 "GND" H 10905 2452 50  0000 C CNN
F 2 "" H 10900 2625 50  0001 C CNN
F 3 "" H 10900 2625 50  0001 C CNN
	1    10900 2625
	1    0    0    -1  
$EndComp
Wire Wire Line
	4350 6050 4350 6275
Wire Wire Line
	4350 6275 4350 7625
Connection ~ 4350 6275
Wire Wire Line
	4350 7825 4350 7625
Connection ~ 4350 7625
Wire Wire Line
	1500 5150 1700 5150
Wire Wire Line
	3100 5150 1700 5150
Connection ~ 3100 5150
Connection ~ 1700 5150
Wire Wire Line
	5600 5150 7125 5150
Connection ~ 5600 5150
Wire Wire Line
	7125 5150 7425 5150
Connection ~ 7125 5150
Wire Wire Line
	10200 5125 9000 5125
Connection ~ 10200 5125
Wire Wire Line
	9000 5125 8825 5125
Connection ~ 9000 5125
Wire Wire Line
	11500 7800 11500 7600
Wire Wire Line
	11500 7600 11500 6225
Connection ~ 11500 7600
Wire Wire Line
	11500 6225 11500 6025
Connection ~ 11500 6225
Wire Wire Line
	12600 5125 14150 5125
Connection ~ 12600 5125
Wire Wire Line
	14150 5125 14375 5125
Connection ~ 14150 5125
$EndSCHEMATC
