(module S1721-46R (layer F.Cu) (tedit 5D14A1D6)
  (fp_text reference P6 (at 0 2.54) (layer F.SilkS) hide
    (effects (font (size 0.635 0.635) (thickness 0.1016)))
  )
  (fp_text value ~ (at 0 -2.286) (layer F.Fab)
    (effects (font (size 0.635 0.635) (thickness 0.1016)))
  )
  (fp_line (start 1.7272 0.6477) (end 3.048 0.6477) (layer F.Fab) (width 0.15))
  (fp_line (start -3.048 -0.6477) (end -1.7272 -0.6477) (layer F.Fab) (width 0.15))
  (fp_text user %R (at 0.06604 -0.0635) (layer F.Fab)
    (effects (font (size 0.635 0.635) (thickness 0.1016)))
  )
  (fp_line (start -3.048 -0.635) (end -3.048 0.635) (layer F.Fab) (width 0.15))
  (fp_line (start 3.048 0.635) (end 3.048 0.635) (layer F.SilkS) (width 0.15))
  (fp_line (start 3.048 -0.635) (end 3.048 0.635) (layer F.Fab) (width 0.15))
  (fp_line (start -3.048 0.635) (end -3.048 0.635) (layer F.SilkS) (width 0.15))
  (fp_line (start -3.048 -0.635) (end -3.048 0.635) (layer F.SilkS) (width 0.15))
  (fp_line (start -3.048 -0.635) (end -3.048 0.635) (layer F.SilkS) (width 0.15))
  (fp_line (start 3.048 -0.635) (end 3.048 0.635) (layer F.SilkS) (width 0.15))
  (fp_line (start -3.048 -0.6477) (end -1.7272 -0.6477) (layer F.SilkS) (width 0.15))
  (fp_line (start 1.7272 0.6477) (end 3.048 0.6477) (layer F.SilkS) (width 0.15))
  (pad 1 smd rect (at 0 0) (size 5.6 1.1) (layers F.Cu F.Paste)
    (solder_paste_margin -0.0508))
  (model ${KIPRJMOD}/../KiCad/Modules/packages3d/HarwinShieldClip_2711.wrl
    (at (xyz 0 -0 -0))
    (scale (xyz 0.25 0.25 0.25))
    (rotate (xyz -90 0 180))
  )
)
