(module via_80mil_60mil (layer F.Cu) (tedit 5B52F805)
  (fp_text reference REF** (at 0.02794 5.37718) (layer F.SilkS)
    (effects (font (size 1 1) (thickness 0.15)) hide)
  )
  (fp_text value via_80mil_60mil (at 0 -7.37362) (layer F.Fab)
    (effects (font (size 1 1) (thickness 0.15)) hide)
  )
  (pad 1 thru_hole circle (at 0 0) (size 2.032 2.032) (drill 1.524) (layers *.Cu *.Mask))
)
