(module Via_25mil_15mil (layer F.Cu) (tedit 59FEA3E6)
  (fp_text reference REF** (at -0.00762 2.38252) (layer F.SilkS)
    (effects (font (size 1 1) (thickness 0.15)) hide)
  )
  (fp_text value Via_25mil_15mil (at 0.02032 -1.88468) (layer F.Fab)
    (effects (font (size 1 1) (thickness 0.15)) hide)
  )
  (pad 1 thru_hole circle (at 0 0) (size 0.635 0.635) (drill 0.381) (layers *.Cu)
    (zone_connect 2))
)
