(kicad_symbol_lib (version 20211014) (generator kicad_symbol_editor)
  (symbol "R_Small-device" (pin_numbers hide) (pin_names (offset 0.254) hide) (in_bom yes) (on_board yes)
    (property "Reference" "R" (id 0) (at 0.762 0.508 0)
      (effects (font (size 1.27 1.27)) (justify left))
    )
    (property "Value" "R_Small-device" (id 1) (at 0.762 -1.016 0)
      (effects (font (size 1.27 1.27)) (justify left))
    )
    (property "Footprint" "" (id 2) (at 0 0 0)
      (effects (font (size 1.27 1.27)) hide)
    )
    (property "Datasheet" "" (id 3) (at 0 0 0)
      (effects (font (size 1.27 1.27)) hide)
    )
    (property "ki_fp_filters" "R_*" (id 4) (at 0 0 0)
      (effects (font (size 1.27 1.27)) hide)
    )
    (symbol "R_Small-device_0_1"
      (rectangle (start -0.762 1.778) (end 0.762 -1.778)
        (stroke (width 0.2032) (type default) (color 0 0 0 0))
        (fill (type none))
      )
    )
    (symbol "R_Small-device_1_1"
      (pin passive line (at 0 2.54 270) (length 0.762)
        (name "~" (effects (font (size 1.27 1.27))))
        (number "1" (effects (font (size 1.27 1.27))))
      )
      (pin passive line (at 0 -2.54 90) (length 0.762)
        (name "~" (effects (font (size 1.27 1.27))))
        (number "2" (effects (font (size 1.27 1.27))))
      )
    )
  )
)
