EESchema Schematic File Version 4
EELAYER 30 0
EELAYER END
$Descr A4 11693 8268
encoding utf-8
Sheet 1 1
Title "Resistive Bridge Coupler"
Date "2021-03-08"
Rev "1.3"
Comp "Dyadic Pty Ltd"
Comment1 "2020"
Comment2 ""
Comment3 ""
Comment4 ""
$EndDescr
$Comp
L project:SMA_2 J2
U 1 1 5F050620
P 5800 3450
F 0 "J2" H 5903 3440 50  0000 L CNN
F 1 "Port 2" H 5903 3349 50  0000 L CNN
F 2 "SMA_Connectors:SMA_EDGE_4" H 5975 3350 50  0001 C CNN
F 3 "" H 5800 3450 60  0000 C CNN
	1    5800 3450
	1    0    0    -1  
$EndComp
$Comp
L project:SMA_2 J1
U 1 1 5F050677
P 5000 2225
F 0 "J1" V 5240 2169 50  0000 C CNN
F 1 "Port 3" V 5149 2169 50  0000 C CNN
F 2 "SMA_Connectors:SMA_EDGE_4" H 5175 2125 50  0001 C CNN
F 3 "" H 5000 2225 60  0000 C CNN
	1    5000 2225
	0    -1   -1   0   
$EndComp
$Comp
L project:SMA_2 J3
U 1 1 5F0506C4
P 5175 5725
F 0 "J3" V 5097 5828 50  0000 L CNN
F 1 "Port 1" V 5188 5828 50  0000 L CNN
F 2 "SMA_Connectors:SMA_EDGE_4" H 5350 5625 50  0001 C CNN
F 3 "" H 5175 5725 60  0000 C CNN
	1    5175 5725
	0    -1   1    0   
$EndComp
$Comp
L device:R_Small R2
U 1 1 5F050994
P 5450 2700
F 0 "R2" H 5509 2746 50  0000 L CNN
F 1 "270" H 5509 2655 50  0000 L CNN
F 2 "Resistor_SMD:R_0402_1005Metric" H 5450 2700 50  0001 C CNN
F 3 "~" H 5450 2700 50  0001 C CNN
	1    5450 2700
	1    0    0    -1  
$EndComp
$Comp
L device:R_Small R1
U 1 1 5F050A14
P 4550 2700
F 0 "R1" H 4609 2746 50  0000 L CNN
F 1 "50" H 4609 2655 50  0000 L CNN
F 2 "Resistor_SMD:R_0402_1005Metric" H 4550 2700 50  0001 C CNN
F 3 "~" H 4550 2700 50  0001 C CNN
	1    4550 2700
	1    0    0    -1  
$EndComp
$Comp
L device:R_Small R3
U 1 1 5F050A5A
P 3500 3400
F 0 "R3" V 3500 3350 50  0000 L CNN
F 1 "42.7" V 3575 3300 50  0000 L CNN
F 2 "Resistor_SMD:R_0402_1005Metric" H 3500 3400 50  0001 C CNN
F 3 "~" H 3500 3400 50  0001 C CNN
	1    3500 3400
	1    0    0    -1  
$EndComp
$Comp
L device:R_Small R4
U 1 1 5F050AAE
P 3725 3400
F 0 "R4" V 3725 3350 50  0000 L CNN
F 1 "42.7" V 3800 3300 50  0000 L CNN
F 2 "Resistor_SMD:R_0402_1005Metric" H 3725 3400 50  0001 C CNN
F 3 "~" H 3725 3400 50  0001 C CNN
	1    3725 3400
	1    0    0    -1  
$EndComp
$Comp
L device:R_Small R5
U 1 1 5F050ADE
P 3950 3400
F 0 "R5" V 3950 3350 50  0000 L CNN
F 1 "40" V 4025 3350 50  0000 L CNN
F 2 "Resistor_SMD:R_0402_1005Metric" H 3950 3400 50  0001 C CNN
F 3 "~" H 3950 3400 50  0001 C CNN
	1    3950 3400
	1    0    0    -1  
$EndComp
$Comp
L device:R_Small R6
U 1 1 5F050B07
P 4150 3400
F 0 "R6" V 4150 3350 50  0000 L CNN
F 1 "40" V 4225 3350 50  0000 L CNN
F 2 "Resistor_SMD:R_0402_1005Metric" H 4150 3400 50  0001 C CNN
F 3 "~" H 4150 3400 50  0001 C CNN
	1    4150 3400
	1    0    0    -1  
$EndComp
Wire Wire Line
	4550 2600 4550 2500
Wire Wire Line
	4550 2500 5000 2500
Wire Wire Line
	5450 2500 5450 2600
Wire Wire Line
	5000 2350 5000 2500
Connection ~ 5000 2500
Wire Wire Line
	5000 2500 5450 2500
Wire Wire Line
	5675 3450 5450 3450
Wire Wire Line
	5450 2800 5450 3450
Wire Wire Line
	3500 3300 3500 3200
Wire Wire Line
	3500 3200 3725 3200
Wire Wire Line
	4550 3200 4550 2800
Wire Wire Line
	4150 3300 4150 3200
Connection ~ 4150 3200
Wire Wire Line
	4150 3200 4550 3200
Wire Wire Line
	3950 3300 3950 3200
Connection ~ 3950 3200
Wire Wire Line
	3950 3200 4150 3200
Wire Wire Line
	3725 3300 3725 3200
Connection ~ 3725 3200
Wire Wire Line
	3725 3200 3950 3200
$Comp
L project:tline T1
U 1 1 5F053B40
P 5175 4500
F 0 "T1" H 5453 4571 50  0000 L CNN
F 1 "tline" H 5453 4480 50  0000 L CNN
F 2 "" H 5175 4500 50  0001 C CNN
F 3 "" H 5175 4500 50  0001 C CNN
	1    5175 4500
	1    0    0    -1  
$EndComp
Wire Wire Line
	4550 3200 4550 3900
Wire Wire Line
	4550 3900 4825 3900
Connection ~ 4550 3200
Wire Wire Line
	5175 3600 5175 3450
Wire Wire Line
	5175 3450 5450 3450
Connection ~ 5450 3450
Wire Wire Line
	5175 5400 5175 5600
Wire Wire Line
	4825 5100 4550 5100
Wire Wire Line
	4550 5100 4550 5300
$Comp
L power:GND #PWR07
U 1 1 5F055B02
P 4550 5300
F 0 "#PWR07" H 4550 5050 50  0001 C CNN
F 1 "GND" H 4555 5127 50  0000 C CNN
F 2 "" H 4550 5300 50  0001 C CNN
F 3 "" H 4550 5300 50  0001 C CNN
	1    4550 5300
	1    0    0    -1  
$EndComp
$Comp
L power:GND #PWR06
U 1 1 5F055B64
P 5800 3625
F 0 "#PWR06" H 5800 3375 50  0001 C CNN
F 1 "GND" H 5805 3452 50  0000 C CNN
F 2 "" H 5800 3625 50  0001 C CNN
F 3 "" H 5800 3625 50  0001 C CNN
	1    5800 3625
	1    0    0    -1  
$EndComp
$Comp
L power:GND #PWR05
U 1 1 5F055B83
P 4150 3500
F 0 "#PWR05" H 4150 3250 50  0001 C CNN
F 1 "GND" H 4155 3327 50  0000 C CNN
F 2 "" H 4150 3500 50  0001 C CNN
F 3 "" H 4150 3500 50  0001 C CNN
	1    4150 3500
	1    0    0    -1  
$EndComp
$Comp
L power:GND #PWR04
U 1 1 5F055BA2
P 3950 3500
F 0 "#PWR04" H 3950 3250 50  0001 C CNN
F 1 "GND" H 3955 3327 50  0000 C CNN
F 2 "" H 3950 3500 50  0001 C CNN
F 3 "" H 3950 3500 50  0001 C CNN
	1    3950 3500
	1    0    0    -1  
$EndComp
$Comp
L power:GND #PWR03
U 1 1 5F055BC1
P 3725 3500
F 0 "#PWR03" H 3725 3250 50  0001 C CNN
F 1 "GND" H 3730 3327 50  0000 C CNN
F 2 "" H 3725 3500 50  0001 C CNN
F 3 "" H 3725 3500 50  0001 C CNN
	1    3725 3500
	1    0    0    -1  
$EndComp
$Comp
L power:GND #PWR02
U 1 1 5F055BE0
P 3500 3500
F 0 "#PWR02" H 3500 3250 50  0001 C CNN
F 1 "GND" H 3505 3327 50  0000 C CNN
F 2 "" H 3500 3500 50  0001 C CNN
F 3 "" H 3500 3500 50  0001 C CNN
	1    3500 3500
	1    0    0    -1  
$EndComp
Wire Wire Line
	5350 5725 5475 5725
Wire Wire Line
	5475 5725 5475 5875
$Comp
L power:GND #PWR08
U 1 1 5F055F37
P 5475 5875
F 0 "#PWR08" H 5475 5625 50  0001 C CNN
F 1 "GND" H 5480 5702 50  0000 C CNN
F 2 "" H 5475 5875 50  0001 C CNN
F 3 "" H 5475 5875 50  0001 C CNN
	1    5475 5875
	1    0    0    -1  
$EndComp
Wire Wire Line
	5175 2225 5300 2225
$Comp
L power:GND #PWR01
U 1 1 5F0560CA
P 5300 2300
F 0 "#PWR01" H 5300 2050 50  0001 C CNN
F 1 "GND" H 5400 2300 50  0000 C CNN
F 2 "" H 5300 2300 50  0001 C CNN
F 3 "" H 5300 2300 50  0001 C CNN
	1    5300 2300
	1    0    0    -1  
$EndComp
Wire Wire Line
	5300 2225 5300 2300
$Comp
L project:rfi_shield_clip P1
U 1 1 5F057D91
P 6850 2550
F 0 "P1" H 6978 2622 60  0000 L CNN
F 1 "rfi_shield_clip" H 6978 2516 60  0000 L CNN
F 2 "RF_Shielding:S1721-46R" H 6850 2550 60  0001 C CNN
F 3 "" H 6850 2550 60  0000 C CNN
	1    6850 2550
	1    0    0    -1  
$EndComp
$Comp
L project:rfi_shield_clip P2
U 1 1 5F057DE0
P 6850 3150
F 0 "P2" H 6978 3222 60  0000 L CNN
F 1 "rfi_shield_clip" H 6978 3116 60  0000 L CNN
F 2 "RF_Shielding:S1721-46R" H 6850 3150 60  0001 C CNN
F 3 "" H 6850 3150 60  0000 C CNN
	1    6850 3150
	1    0    0    -1  
$EndComp
$Comp
L project:rfi_shield_clip P3
U 1 1 5F057E5D
P 6850 3750
F 0 "P3" H 6978 3822 60  0000 L CNN
F 1 "rfi_shield_clip" H 6978 3716 60  0000 L CNN
F 2 "RF_Shielding:S1721-46R" H 6850 3750 60  0001 C CNN
F 3 "" H 6850 3750 60  0000 C CNN
	1    6850 3750
	1    0    0    -1  
$EndComp
$Comp
L project:rfi_shield_clip P4
U 1 1 5F057E9F
P 6850 4375
F 0 "P4" H 6978 4447 60  0000 L CNN
F 1 "rfi_shield_clip" H 6978 4341 60  0000 L CNN
F 2 "RF_Shielding:S1721-46R" H 6850 4375 60  0001 C CNN
F 3 "" H 6850 4375 60  0000 C CNN
	1    6850 4375
	1    0    0    -1  
$EndComp
$Comp
L power:GND #PWR09
U 1 1 5F057EE8
P 6850 2650
F 0 "#PWR09" H 6850 2400 50  0001 C CNN
F 1 "GND" H 6855 2477 50  0000 C CNN
F 2 "" H 6850 2650 50  0001 C CNN
F 3 "" H 6850 2650 50  0001 C CNN
	1    6850 2650
	1    0    0    -1  
$EndComp
$Comp
L power:GND #PWR010
U 1 1 5F057F63
P 6850 3250
F 0 "#PWR010" H 6850 3000 50  0001 C CNN
F 1 "GND" H 6855 3077 50  0000 C CNN
F 2 "" H 6850 3250 50  0001 C CNN
F 3 "" H 6850 3250 50  0001 C CNN
	1    6850 3250
	1    0    0    -1  
$EndComp
$Comp
L power:GND #PWR011
U 1 1 5F058032
P 6850 3850
F 0 "#PWR011" H 6850 3600 50  0001 C CNN
F 1 "GND" H 6855 3677 50  0000 C CNN
F 2 "" H 6850 3850 50  0001 C CNN
F 3 "" H 6850 3850 50  0001 C CNN
	1    6850 3850
	1    0    0    -1  
$EndComp
$Comp
L power:GND #PWR012
U 1 1 5F0581B7
P 6850 4475
F 0 "#PWR012" H 6850 4225 50  0001 C CNN
F 1 "GND" H 6855 4302 50  0000 C CNN
F 2 "" H 6850 4475 50  0001 C CNN
F 3 "" H 6850 4475 50  0001 C CNN
	1    6850 4475
	1    0    0    -1  
$EndComp
$EndSCHEMATC
