EESchema Schematic File Version 4
EELAYER 30 0
EELAYER END
$Descr A4 11693 8268
encoding utf-8
Sheet 1 1
Title "Reference Clock"
Date "2020-08-30"
Rev "1.0"
Comp "Dyadic Pty Ltd"
Comment1 ""
Comment2 ""
Comment3 ""
Comment4 ""
$EndDescr
$Comp
L project:HMC1031 U3
U 1 1 5FCC4FDC
P 5625 3925
F 0 "U3" H 5625 4590 50  0000 C CNN
F 1 "HMC1031" H 5600 4500 50  0000 C CNN
F 2 "Package_SO:MSOP-8_3x3mm_P0.65mm" H 4875 4675 50  0001 C CNN
F 3 "" H 4875 4675 50  0001 C CNN
F 4 "Analog Devices" H 5625 3925 50  0001 C CNN "MFN"
F 5 "HMC1031MS8E" H 5625 3925 50  0001 C CNN "MFP"
F 6 "584-HMC1031MS8E" H 5625 3925 50  0001 C CNN "S1PN"
F 7 "Mouser" H 5625 3925 50  0001 C CNN "S1PL"
F 8 "0.1 MHz to 500 MHz Clock Generator with Integer N PLL" H 5625 3925 50  0001 C CNN "Description"
F 9 "MSOP-8" H 5625 3925 50  0001 C CNN "Package ID"
	1    5625 3925
	1    0    0    -1  
$EndComp
$Comp
L project:PE42553 U2
U 1 1 5FCC6BB0
P 3400 2525
F 0 "U2" H 3400 2425 60  0000 R CNN
F 1 "PE42553" H 3600 2550 60  0000 R CNN
F 2 "Psemi:Psemi-QFN-16_EP1.75x1.75mm" H 3600 2275 60  0001 C CNN
F 3 "" H 3600 2275 60  0001 C CNN
F 4 "pSemi" H 3400 2525 50  0001 C CNN "MFN"
F 5 "PE42553B-Z" H 3400 2525 50  0001 C CNN "MFP"
F 6 "81-PE42553B-Z" H 3400 2525 50  0001 C CNN "S1PN"
F 7 "Mouser" H 3400 2525 50  0001 C CNN "S1PL"
F 8 "RF Switch ICs SPDT, High Iso, High Power, Absorptive" H 3400 2525 50  0001 C CNN "Description"
F 9 "QFN-16" H 3400 2525 50  0001 C CNN "Package ID"
	1    3400 2525
	-1   0    0    1   
$EndComp
$Comp
L project:OSC X1
U 1 1 5FCCB214
P 5575 2525
F 0 "X1" H 5575 2905 70  0000 C CNN
F 1 "ECS-TXO-3225MV" H 5575 2799 50  0000 C CNN
F 2 "Oscillators_SMD:osc-3.2x2.5" H 5575 2525 60  0001 C CNN
F 3 "" H 5575 2525 60  0000 C CNN
F 4 "ECS Inc" H 5575 2525 50  0001 C CNN "MFN"
F 5 "ECS-TXO-3225MV-100-TR " H 5575 2525 50  0001 C CNN "MFP"
F 6 "520-TXO-3225MV-100-T" H 5575 2525 50  0001 C CNN "S1PN"
F 7 "Mouser" H 5575 2525 50  0001 C CNN "S1PL"
F 8 "TCXO Oscillators 10MHz 1.6-3.6V 2.5PPM" H 5575 2525 50  0001 C CNN "Description"
F 9 "3.2 mm x 2.5 mm" H 5575 2525 50  0001 C CNN "Package ID"
	1    5575 2525
	-1   0    0    -1  
$EndComp
$Comp
L Oscillator:ABLNO X2
U 1 1 5FCCCC89
P 8600 5975
F 0 "X2" H 8800 6250 50  0000 L CNN
F 1 "ABLNO-V-100MHz" H 8700 5725 50  0000 L CNN
F 2 "Oscillator:Oscillator_SMD_Abracon_ABLNO" H 8600 5625 50  0001 C CNN
F 3 "" H 8400 6075 50  0001 C CNN
F 4 "Abracon" H 8600 5975 50  0001 C CNN "MFN"
F 5 "ABLNO-V-100.000MHz-T2" H 8600 5975 50  0001 C CNN "MFP"
F 6 "815-ABLNO-V-100-T2" H 8600 5975 50  0001 C CNN "S1PN"
F 7 "Mouser" H 8600 5975 50  0001 C CNN "S1PL"
F 8 "VCXO Oscillators 100.000MHz 3.3Volt +/-28ppm" H 8600 5975 50  0001 C CNN "Description"
F 9 "14 mm x 9 mm" H 8600 5975 50  0001 C CNN "Package ID"
	1    8600 5975
	-1   0    0    -1  
$EndComp
$Comp
L device:C C9
U 1 1 5FD9309C
P 6900 4025
F 0 "C9" H 7015 4071 50  0000 L CNN
F 1 "22n" H 7015 3980 50  0000 L CNN
F 2 "Capacitor_SMD:C_0603_1608Metric" H 6938 3875 50  0001 C CNN
F 3 "~" H 6900 4025 50  0001 C CNN
F 4 "Yageo" H 6900 4025 50  0001 C CNN "MFN"
F 5 "CC0603KRX7R8BB223" H 6900 4025 50  0001 C CNN "MFP"
F 6 "603-CC603KRX7R8BB223" H 6900 4025 50  0001 C CNN "S1PN"
F 7 "Mouser" H 6900 4025 50  0001 C CNN "S1PL"
F 8 "Multilayer Ceramic Capacitors MLCC - SMD/SMT 22nF 25V X7R 10%" H 6900 4025 50  0001 C CNN "Description"
F 9 "0603 (1608 metric)" H 6900 4025 50  0001 C CNN "Package ID"
	1    6900 4025
	1    0    0    -1  
$EndComp
$Comp
L device:R R4
U 1 1 5FD939FA
P 7250 4025
F 0 "R4" H 7320 4071 50  0000 L CNN
F 1 "22k" H 7320 3980 50  0000 L CNN
F 2 "Resistor_SMD:R_0603_1608Metric" V 7180 4025 50  0001 C CNN
F 3 "~" H 7250 4025 50  0001 C CNN
F 4 "Yageo" H 7250 4025 50  0001 C CNN "MFN"
F 5 "RC0603FR-7W22KL" H 7250 4025 50  0001 C CNN "MFP"
F 6 "603-RC0603FR-7W22KL" H 7250 4025 50  0001 C CNN "S1PN"
F 7 "Mouser" H 7250 4025 50  0001 C CNN "S1PL"
F 8 "Thick Film Resistors - SMD 22kOhms 1/10W 0603 1%" H 7250 4025 50  0001 C CNN "Description"
F 9 "0603 (1608 metric)" H 7250 4025 50  0001 C CNN "Package ID"
	1    7250 4025
	1    0    0    -1  
$EndComp
$Comp
L device:C C11
U 1 1 5FD94513
P 7250 4400
F 0 "C11" H 7365 4446 50  0000 L CNN
F 1 "0.27u" H 7365 4355 50  0000 L CNN
F 2 "Capacitor_SMD:C_0603_1608Metric" H 7288 4250 50  0001 C CNN
F 3 "~" H 7250 4400 50  0001 C CNN
F 4 "Kemet" H 7250 4400 50  0001 C CNN "MFN"
F 5 "C0603C274K8PACTU" H 7250 4400 50  0001 C CNN "MFP"
F 6 "80-C0603C274K8P" H 7250 4400 50  0001 C CNN "S1PN"
F 7 "Mouser" H 7250 4400 50  0001 C CNN "S1PL"
F 8 "Multilayer Ceramic Capacitors MLCC - SMD/SMT 10V 0.27uF 0603 X5R 10%" H 7250 4400 50  0001 C CNN "Description"
F 9 "0603 (1608 metric)" H 7250 4400 50  0001 C CNN "Package ID"
	1    7250 4400
	1    0    0    -1  
$EndComp
$Comp
L device:R R2
U 1 1 5FD94AF0
P 7625 3825
F 0 "R2" V 7525 3825 50  0000 C CNN
F 1 "0" V 7725 3825 50  0000 C CNN
F 2 "Resistor_SMD:R_0603_1608Metric" V 7555 3825 50  0001 C CNN
F 3 "~" H 7625 3825 50  0001 C CNN
F 4 "Yageo" V 7625 3825 50  0001 C CNN "MFN"
F 5 "RC0603JR-070RL" V 7625 3825 50  0001 C CNN "MFP"
F 6 "603-RC0603JR-070RL" V 7625 3825 50  0001 C CNN "S1PN"
F 7 "Mouser" V 7625 3825 50  0001 C CNN "S1PL"
F 8 "Thick Film Resistors ZERO OHM JUMPER" V 7625 3825 50  0001 C CNN "Description"
F 9 "0603 (1608 metric)" V 7625 3825 50  0001 C CNN "Package ID"
	1    7625 3825
	0    1    1    0   
$EndComp
$Comp
L device:C C10
U 1 1 5FD954CE
P 7975 4025
F 0 "C10" H 8090 4071 50  0000 L CNN
F 1 "DNF" H 8090 3980 50  0000 L CNN
F 2 "Capacitor_SMD:C_0603_1608Metric" H 8013 3875 50  0001 C CNN
F 3 "~" H 7975 4025 50  0001 C CNN
F 4 "0603 (1608 metric)" H 7975 4025 50  0001 C CNN "Package ID"
	1    7975 4025
	1    0    0    -1  
$EndComp
$Comp
L device:R R5
U 1 1 5FD9669D
P 9225 4025
F 0 "R5" H 9295 4071 50  0000 L CNN
F 1 "0" H 9295 3980 50  0000 L CNN
F 2 "Resistor_SMD:R_0402_1005Metric" V 9155 4025 50  0001 C CNN
F 3 "~" H 9225 4025 50  0001 C CNN
F 4 "Yageo" H 9225 4025 50  0001 C CNN "MFN"
F 5 "RC0402JR-070RL" H 9225 4025 50  0001 C CNN "MFP"
F 6 "603-RC0402JR-070RL" H 9225 4025 50  0001 C CNN "S1PN"
F 7 "Mouser" H 9225 4025 50  0001 C CNN "S1PL"
F 8 "Thick Film Resistors ZERO OHM JUMPER" H 9225 4025 50  0001 C CNN "Description"
F 9 "0402 (1005 metric)" H 9225 4025 50  0001 C CNN "Package ID"
	1    9225 4025
	1    0    0    -1  
$EndComp
$Comp
L device:C C12
U 1 1 5FD97123
P 6675 4675
F 0 "C12" H 6790 4721 50  0000 L CNN
F 1 "3.3n" H 6790 4630 50  0000 L CNN
F 2 "Capacitor_SMD:C_0402_1005Metric" H 6713 4525 50  0001 C CNN
F 3 "~" H 6675 4675 50  0001 C CNN
F 4 "Taiyo Yuden" H 6675 4675 50  0001 C CNN "MFN"
F 5 "UMK105BJ332KVHF" H 6675 4675 50  0001 C CNN "MFP"
F 6 "963-UMK105BJ332KVHF" H 6675 4675 50  0001 C CNN "S1PN"
F 7 "Mouser" H 6675 4675 50  0001 C CNN "S1PL"
F 8 "Multilayer Ceramic Capacitors MLCC - SMD/SMT 0402 50V 3300pF 10% X5R" H 6675 4675 50  0001 C CNN "Description"
F 9 "0402 (1005 metric)" H 6675 4675 50  0001 C CNN "Package ID"
	1    6675 4675
	1    0    0    -1  
$EndComp
$Comp
L device:R R10
U 1 1 5FDA28EB
P 6675 5300
F 0 "R10" H 6745 5346 50  0000 L CNN
F 1 "49.9" H 6745 5255 50  0000 L CNN
F 2 "Resistor_SMD:R_0402_1005Metric" V 6605 5300 50  0001 C CNN
F 3 "~" H 6675 5300 50  0001 C CNN
F 4 "Yageo" H 6675 5300 50  0001 C CNN "MFN"
F 5 "RC0402FR-0749R9L" H 6675 5300 50  0001 C CNN "MFP"
F 6 "603-RC0402FR-0749R9L" H 6675 5300 50  0001 C CNN "S1PN"
F 7 "Mouser" H 6675 5300 50  0001 C CNN "S1PL"
F 8 "Thick Film Resistors 49.9 OHM 1%" H 6675 5300 50  0001 C CNN "Description"
F 9 "0402 (1005 metric)" H 6675 5300 50  0001 C CNN "Package ID"
	1    6675 5300
	1    0    0    -1  
$EndComp
$Comp
L device:R R11
U 1 1 5FDA321E
P 7275 5325
F 0 "R11" H 7345 5371 50  0000 L CNN
F 1 "DNF" H 7345 5280 50  0000 L CNN
F 2 "Resistor_SMD:R_0402_1005Metric" V 7205 5325 50  0001 C CNN
F 3 "~" H 7275 5325 50  0001 C CNN
F 4 "0402 (1005 metric)" H 7275 5325 50  0001 C CNN "Package ID"
	1    7275 5325
	1    0    0    -1  
$EndComp
$Comp
L device:R R6
U 1 1 5FDA3B7E
P 7575 5000
F 0 "R6" V 7475 5000 50  0000 C CNN
F 1 "16.7" V 7675 5000 50  0000 C CNN
F 2 "Resistor_SMD:R_0402_1005Metric" V 7505 5000 50  0001 C CNN
F 3 "~" H 7575 5000 50  0001 C CNN
F 4 "KOA Speer" V 7575 5000 50  0001 C CNN "MFN"
F 5 "RN73H1ETTP16R7F50" V 7575 5000 50  0001 C CNN "MFP"
F 6 "660-RN73H1ETP16R7F50" V 7575 5000 50  0001 C CNN "S1PN"
F 7 "Mouser" V 7575 5000 50  0001 C CNN "S1PL"
F 8 "16.7 Ohms ±1% 0.063W, 1/16W Chip Resistor" V 7575 5000 50  0001 C CNN "Description"
F 9 "0402 (1005 metric)" V 7575 5000 50  0001 C CNN "Package ID"
	1    7575 5000
	0    1    1    0   
$EndComp
$Comp
L power:GND #PWR032
U 1 1 5FDA6D7A
P 8600 6275
F 0 "#PWR032" H 8600 6025 50  0001 C CNN
F 1 "GND" H 8605 6102 50  0000 C CNN
F 2 "" H 8600 6275 50  0001 C CNN
F 3 "" H 8600 6275 50  0001 C CNN
	1    8600 6275
	1    0    0    -1  
$EndComp
Wire Wire Line
	6325 3825 6900 3825
Wire Wire Line
	6900 3875 6900 3825
Connection ~ 6900 3825
Wire Wire Line
	6900 3825 7250 3825
Wire Wire Line
	7250 3875 7250 3825
Connection ~ 7250 3825
Wire Wire Line
	7250 3825 7475 3825
Wire Wire Line
	7250 4175 7250 4250
Wire Wire Line
	7775 3825 7975 3825
Wire Wire Line
	9225 3825 9225 3875
Wire Wire Line
	9225 4175 9225 5975
Wire Wire Line
	9225 5975 9000 5975
Wire Wire Line
	6325 4025 6675 4025
Wire Wire Line
	6675 4025 6675 4525
Wire Wire Line
	6675 4825 6675 5000
$Comp
L power:GND #PWR024
U 1 1 5FDA8BC9
P 6675 5450
F 0 "#PWR024" H 6675 5200 50  0001 C CNN
F 1 "GND" H 6680 5277 50  0000 C CNN
F 2 "" H 6675 5450 50  0001 C CNN
F 3 "" H 6675 5450 50  0001 C CNN
	1    6675 5450
	1    0    0    -1  
$EndComp
$Comp
L power:GND #PWR015
U 1 1 5FDA903D
P 6900 4175
F 0 "#PWR015" H 6900 3925 50  0001 C CNN
F 1 "GND" H 6905 4002 50  0000 C CNN
F 2 "" H 6900 4175 50  0001 C CNN
F 3 "" H 6900 4175 50  0001 C CNN
	1    6900 4175
	1    0    0    -1  
$EndComp
$Comp
L power:GND #PWR018
U 1 1 5FDA95A1
P 7250 4550
F 0 "#PWR018" H 7250 4300 50  0001 C CNN
F 1 "GND" H 7255 4377 50  0000 C CNN
F 2 "" H 7250 4550 50  0001 C CNN
F 3 "" H 7250 4550 50  0001 C CNN
	1    7250 4550
	1    0    0    -1  
$EndComp
Wire Wire Line
	7975 3875 7975 3825
Connection ~ 7975 3825
Wire Wire Line
	7975 3825 9225 3825
$Comp
L power:GND #PWR016
U 1 1 5FDA9BB4
P 7975 4175
F 0 "#PWR016" H 7975 3925 50  0001 C CNN
F 1 "GND" H 7980 4002 50  0000 C CNN
F 2 "" H 7975 4175 50  0001 C CNN
F 3 "" H 7975 4175 50  0001 C CNN
	1    7975 4175
	1    0    0    -1  
$EndComp
Wire Wire Line
	6850 5000 6675 5000
Connection ~ 6675 5000
Wire Wire Line
	6675 5000 6675 5150
Wire Wire Line
	7150 5000 7275 5000
Wire Wire Line
	7725 5000 7875 5000
Wire Wire Line
	7275 5175 7275 5000
Connection ~ 7275 5000
Wire Wire Line
	7275 5000 7425 5000
Wire Wire Line
	7875 5175 7875 5000
Connection ~ 7875 5000
Wire Wire Line
	7875 5000 7975 5000
Wire Wire Line
	7875 5475 7875 5975
Wire Wire Line
	7875 5975 8200 5975
$Comp
L power:GND #PWR025
U 1 1 5FDABD0A
P 7275 5475
F 0 "#PWR025" H 7275 5225 50  0001 C CNN
F 1 "GND" H 7280 5302 50  0000 C CNN
F 2 "" H 7275 5475 50  0001 C CNN
F 3 "" H 7275 5475 50  0001 C CNN
	1    7275 5475
	1    0    0    -1  
$EndComp
Wire Wire Line
	8600 5675 8600 4825
$Comp
L power:GND #PWR023
U 1 1 5FDADF5E
P 8850 5400
F 0 "#PWR023" H 8850 5150 50  0001 C CNN
F 1 "GND" H 8855 5227 50  0000 C CNN
F 2 "" H 8850 5400 50  0001 C CNN
F 3 "" H 8850 5400 50  0001 C CNN
	1    8850 5400
	1    0    0    -1  
$EndComp
$Comp
L device:R R3
U 1 1 5FDB2412
P 9675 3825
F 0 "R3" V 9575 3825 50  0000 C CNN
F 1 "DNF" V 9775 3825 50  0000 C CNN
F 2 "Resistor_SMD:R_0402_1005Metric" V 9605 3825 50  0001 C CNN
F 3 "~" H 9675 3825 50  0001 C CNN
F 4 "0402 (1005 metric)" V 9675 3825 50  0001 C CNN "Package ID"
	1    9675 3825
	0    1    1    0   
$EndComp
Wire Wire Line
	9525 3825 9225 3825
Connection ~ 9225 3825
Wire Wire Line
	9825 3825 10025 3825
Wire Wire Line
	8275 5000 10025 5000
$Comp
L power:GND #PWR022
U 1 1 5FDB3BAC
P 10225 5200
F 0 "#PWR022" H 10225 4950 50  0001 C CNN
F 1 "GND" H 10230 5027 50  0000 C CNN
F 2 "" H 10225 5200 50  0001 C CNN
F 3 "" H 10225 5200 50  0001 C CNN
	1    10225 5200
	1    0    0    -1  
$EndComp
$Comp
L power:GND #PWR014
U 1 1 5FDB43F5
P 10225 4025
F 0 "#PWR014" H 10225 3775 50  0001 C CNN
F 1 "GND" H 10230 3852 50  0000 C CNN
F 2 "" H 10225 4025 50  0001 C CNN
F 3 "" H 10225 4025 50  0001 C CNN
	1    10225 4025
	1    0    0    -1  
$EndComp
NoConn ~ 5975 2625
$Comp
L power:GND #PWR09
U 1 1 5FDB8986
P 5050 2700
F 0 "#PWR09" H 5050 2450 50  0001 C CNN
F 1 "GND" H 5055 2527 50  0000 C CNN
F 2 "" H 5050 2700 50  0001 C CNN
F 3 "" H 5050 2700 50  0001 C CNN
	1    5050 2700
	1    0    0    -1  
$EndComp
Wire Wire Line
	5975 2425 6275 2425
Wire Wire Line
	6275 2425 6275 2500
Wire Wire Line
	5175 2425 5000 2425
Wire Wire Line
	5175 2625 5050 2625
Wire Wire Line
	5050 2625 5050 2700
Wire Wire Line
	4700 2425 4200 2425
$Comp
L connector:Conn_Coaxial J1
U 1 1 5FDBB909
P 1150 2425
F 0 "J1" H 1078 2663 50  0000 C CNN
F 1 "Ref In" H 1078 2572 50  0000 C CNN
F 2 "MMCX_Connectors:mmcx_th" H 1150 2425 50  0001 C CNN
F 3 " ~" H 1150 2425 50  0001 C CNN
F 4 "Amphenol" H 1150 2425 50  0001 C CNN "MFN"
F 5 "262104" H 1150 2425 50  0001 C CNN "MFP"
F 6 "262104" H 1150 2425 50  0001 C CNN "S1PN"
F 7 "TTI" H 1150 2425 50  0001 C CNN "S1PL"
F 8 "MMCX Connector Jack, Female Socket 50Ohm Through Hole Solder" H 1150 2425 50  0001 C CNN "Description"
	1    1150 2425
	-1   0    0    -1  
$EndComp
$Comp
L device:R R1
U 1 1 5FDBD1BA
P 2000 2650
F 0 "R1" H 2070 2696 50  0000 L CNN
F 1 "49.9" H 2070 2605 50  0000 L CNN
F 2 "Resistor_SMD:R_0603_1608Metric" V 1930 2650 50  0001 C CNN
F 3 "~" H 2000 2650 50  0001 C CNN
F 4 "Yageo" H 2000 2650 50  0001 C CNN "MFN"
F 5 "RC0603FR-0749R9L" H 2000 2650 50  0001 C CNN "MFP"
F 6 "603-RC0603FR-0749R9L" H 2000 2650 50  0001 C CNN "S1PN"
F 7 "Mouser" H 2000 2650 50  0001 C CNN "S1PL"
F 8 "Thick Film Resistors - SMD 49.9 OHM 1%" H 2000 2650 50  0001 C CNN "Description"
F 9 "0603 (1608 metric)" H 2000 2650 50  0001 C CNN "Package ID"
	1    2000 2650
	1    0    0    -1  
$EndComp
Wire Wire Line
	3500 3325 3500 3825
Wire Wire Line
	1350 2425 1600 2425
Wire Wire Line
	1900 2425 2000 2425
Wire Wire Line
	2000 2500 2000 2425
Connection ~ 2000 2425
Wire Wire Line
	2000 2425 2600 2425
$Comp
L power:GND #PWR010
U 1 1 5FDC1982
P 2000 2800
F 0 "#PWR010" H 2000 2550 50  0001 C CNN
F 1 "GND" H 2005 2627 50  0000 C CNN
F 2 "" H 2000 2800 50  0001 C CNN
F 3 "" H 2000 2800 50  0001 C CNN
	1    2000 2800
	1    0    0    -1  
$EndComp
$Comp
L project:TPS71733 U4
U 1 1 5FDC28A0
P 2150 6050
F 0 "U4" H 2150 6515 50  0000 C CNN
F 1 "TPS71733" H 2150 6424 50  0000 C CNN
F 2 "Package_TO_SOT_SMD:SOT-353_SC-70-5" H 2150 6050 50  0001 C CNN
F 3 "" H 2150 6050 50  0001 C CNN
F 4 "Texas Instruments" H 2150 6050 50  0001 C CNN "MFN"
F 5 "TPS71733DCKT" H 2150 6050 50  0001 C CNN "MFP"
F 6 "595-TPS71733DCKT" H 2150 6050 50  0001 C CNN "S1PN"
F 7 "Mouser" H 2150 6050 50  0001 C CNN "S1PL"
F 8 "LDO Voltage Regulators Sgl Output LDO 150mA Fixed(3.3V) Hi PSRR" H 2150 6050 50  0001 C CNN "Description"
F 9 "SOT-353" H 2150 6050 50  0001 C CNN "Package ID"
	1    2150 6050
	1    0    0    -1  
$EndComp
$Comp
L power:GND #PWR011
U 1 1 5FDDC8C5
P 6275 2800
F 0 "#PWR011" H 6275 2550 50  0001 C CNN
F 1 "GND" H 6280 2627 50  0000 C CNN
F 2 "" H 6275 2800 50  0001 C CNN
F 3 "" H 6275 2800 50  0001 C CNN
	1    6275 2800
	1    0    0    -1  
$EndComp
$Comp
L power:GND #PWR08
U 1 1 5FDDCDCE
P 1150 2625
F 0 "#PWR08" H 1150 2375 50  0001 C CNN
F 1 "GND" H 1155 2452 50  0000 C CNN
F 2 "" H 1150 2625 50  0001 C CNN
F 3 "" H 1150 2625 50  0001 C CNN
	1    1150 2625
	1    0    0    -1  
$EndComp
$Comp
L power:VDD #PWR01
U 1 1 5FDDD7CB
P 3100 975
F 0 "#PWR01" H 3100 825 50  0001 C CNN
F 1 "VDD" H 3115 1148 50  0000 C CNN
F 2 "" H 3100 975 50  0001 C CNN
F 3 "" H 3100 975 50  0001 C CNN
	1    3100 975 
	1    0    0    -1  
$EndComp
$Comp
L power:VDD #PWR07
U 1 1 5FDDDDDA
P 6275 2175
F 0 "#PWR07" H 6275 2025 50  0001 C CNN
F 1 "VDD" H 6290 2348 50  0000 C CNN
F 2 "" H 6275 2175 50  0001 C CNN
F 3 "" H 6275 2175 50  0001 C CNN
	1    6275 2175
	1    0    0    -1  
$EndComp
$Comp
L power:VDD #PWR027
U 1 1 5FDDE407
P 3050 5700
F 0 "#PWR027" H 3050 5550 50  0001 C CNN
F 1 "VDD" H 3065 5873 50  0000 C CNN
F 2 "" H 3050 5700 50  0001 C CNN
F 3 "" H 3050 5700 50  0001 C CNN
	1    3050 5700
	1    0    0    -1  
$EndComp
$Comp
L project:VCOVCC #PWR019
U 1 1 5FDE2274
P 8600 4650
F 0 "#PWR019" H 8600 4500 50  0001 C CNN
F 1 "VCOVCC" H 8615 4823 50  0000 C CNN
F 2 "" H 8600 4650 50  0001 C CNN
F 3 "" H 8600 4650 50  0001 C CNN
	1    8600 4650
	1    0    0    -1  
$EndComp
$Comp
L project:VCOVCC #PWR026
U 1 1 5FDE2994
P 5800 5675
F 0 "#PWR026" H 5800 5525 50  0001 C CNN
F 1 "VCOVCC" H 5815 5848 50  0000 C CNN
F 2 "" H 5800 5675 50  0001 C CNN
F 3 "" H 5800 5675 50  0001 C CNN
	1    5800 5675
	1    0    0    -1  
$EndComp
$Comp
L power:VCC #PWR02
U 1 1 5FDE385E
P 9600 1100
F 0 "#PWR02" H 9600 950 50  0001 C CNN
F 1 "VCC" H 9615 1273 50  0000 C CNN
F 2 "" H 9600 1100 50  0001 C CNN
F 3 "" H 9600 1100 50  0001 C CNN
	1    9600 1100
	1    0    0    -1  
$EndComp
$Comp
L power:VCC #PWR012
U 1 1 5FDE4340
P 4850 3100
F 0 "#PWR012" H 4850 2950 50  0001 C CNN
F 1 "VCC" H 4865 3273 50  0000 C CNN
F 2 "" H 4850 3100 50  0001 C CNN
F 3 "" H 4850 3100 50  0001 C CNN
	1    4850 3100
	1    0    0    -1  
$EndComp
$Comp
L device:C C8
U 1 1 5FDE4FFF
P 4700 3400
F 0 "C8" H 4550 3500 50  0000 L CNN
F 1 "0.47u" H 4450 3300 50  0000 L CNN
F 2 "Capacitor_SMD:C_0402_1005Metric" H 4738 3250 50  0001 C CNN
F 3 "~" H 4700 3400 50  0001 C CNN
F 4 "Yageo" H 4700 3400 50  0001 C CNN "MFN"
F 5 "CC0402KRX5R6BB474" H 4700 3400 50  0001 C CNN "MFP"
F 6 "603-CC402KRX5R6BB474" H 4700 3400 50  0001 C CNN "S1PN"
F 7 "Mouser" H 4700 3400 50  0001 C CNN "S1PL"
F 8 "Multilayer Ceramic Capacitors MLCC - SMD/SMT 470nF 10V X5R 10%" H 4700 3400 50  0001 C CNN "Description"
F 9 "0402 (1005 metric)" H 4700 3400 50  0001 C CNN "Package ID"
	1    4700 3400
	1    0    0    -1  
$EndComp
Wire Wire Line
	4850 3100 4850 3175
Wire Wire Line
	4850 3625 4925 3625
$Comp
L power:GND #PWR013
U 1 1 5FDEC63A
P 4700 3550
F 0 "#PWR013" H 4700 3300 50  0001 C CNN
F 1 "GND" H 4705 3377 50  0000 C CNN
F 2 "" H 4700 3550 50  0001 C CNN
F 3 "" H 4700 3550 50  0001 C CNN
	1    4700 3550
	1    0    0    -1  
$EndComp
Wire Wire Line
	4700 3250 4700 3175
Wire Wire Line
	4700 3175 4850 3175
Connection ~ 4850 3175
Wire Wire Line
	4850 3175 4850 3625
$Comp
L power:GND #PWR033
U 1 1 5FDEF184
P 2150 6400
F 0 "#PWR033" H 2150 6150 50  0001 C CNN
F 1 "GND" H 2155 6227 50  0000 C CNN
F 2 "" H 2150 6400 50  0001 C CNN
F 3 "" H 2150 6400 50  0001 C CNN
	1    2150 6400
	1    0    0    -1  
$EndComp
$Comp
L power:GND #PWR034
U 1 1 5FDEF598
P 4900 6400
F 0 "#PWR034" H 4900 6150 50  0001 C CNN
F 1 "GND" H 4905 6227 50  0000 C CNN
F 2 "" H 4900 6400 50  0001 C CNN
F 3 "" H 4900 6400 50  0001 C CNN
	1    4900 6400
	1    0    0    -1  
$EndComp
$Comp
L device:C C19
U 1 1 5FDF02C3
P 2700 6300
F 0 "C19" H 2750 6400 50  0000 L CNN
F 1 "0.1u" H 2500 6200 50  0000 L CNN
F 2 "Capacitor_SMD:C_0603_1608Metric" H 2738 6150 50  0001 C CNN
F 3 "~" H 2700 6300 50  0001 C CNN
F 4 "Kemet" H 2700 6300 50  0001 C CNN "MFN"
F 5 "C0603C104K5RACTU" H 2700 6300 50  0001 C CNN "MFP"
F 6 "80-C0603C104K5R" H 2700 6300 50  0001 C CNN "S1PN"
F 7 "Mouser" H 2700 6300 50  0001 C CNN "S1PL"
F 8 "Multilayer Ceramic Capacitors MLCC - SMD/SMT 50volts 0.1uF X7R 10%" H 2700 6300 50  0001 C CNN "Description"
F 9 "0603 (1608 metric)" H 2700 6300 50  0001 C CNN "Package ID"
	1    2700 6300
	1    0    0    -1  
$EndComp
$Comp
L device:C C15
U 1 1 5FDF1962
P 1375 6050
F 0 "C15" H 1175 6150 50  0000 L CNN
F 1 "1.0u" H 1150 5950 50  0000 L CNN
F 2 "Capacitor_SMD:C_0603_1608Metric" H 1413 5900 50  0001 C CNN
F 3 "~" H 1375 6050 50  0001 C CNN
F 4 "Yageo" H 1375 6050 50  0001 C CNN "MFN"
F 5 "CC0603KRX5R8BB105" H 1375 6050 50  0001 C CNN "MFP"
F 6 "603-CC603KRX5R8BB105" H 1375 6050 50  0001 C CNN "S1PN"
F 7 "Mouser" H 1375 6050 50  0001 C CNN "S1PL"
F 8 "Multilayer Ceramic Capacitors MLCC - SMD/SMT 1.0uF 25V X5R 10%" H 1375 6050 50  0001 C CNN "Description"
F 9 "0603 (1608 metric)" H 1375 6050 50  0001 C CNN "Package ID"
	1    1375 6050
	1    0    0    -1  
$EndComp
Wire Wire Line
	1700 5850 1625 5850
Wire Wire Line
	1375 5850 1375 5900
Wire Wire Line
	1700 6050 1625 6050
Wire Wire Line
	1625 6050 1625 5850
Connection ~ 1625 5850
Wire Wire Line
	1625 5850 1375 5850
Wire Wire Line
	2600 6050 2700 6050
Wire Wire Line
	2700 6050 2700 6150
Wire Wire Line
	2600 5850 3050 5850
Wire Wire Line
	3050 5850 3050 5900
$Comp
L power:GND #PWR028
U 1 1 5FDF845B
P 1375 6200
F 0 "#PWR028" H 1375 5950 50  0001 C CNN
F 1 "GND" H 1380 6027 50  0000 C CNN
F 2 "" H 1375 6200 50  0001 C CNN
F 3 "" H 1375 6200 50  0001 C CNN
	1    1375 6200
	1    0    0    -1  
$EndComp
$Comp
L power:GND #PWR035
U 1 1 5FDF87E3
P 2700 6450
F 0 "#PWR035" H 2700 6200 50  0001 C CNN
F 1 "GND" H 2705 6277 50  0000 C CNN
F 2 "" H 2700 6450 50  0001 C CNN
F 3 "" H 2700 6450 50  0001 C CNN
	1    2700 6450
	1    0    0    -1  
$EndComp
$Comp
L power:GND #PWR029
U 1 1 5FDF8DE0
P 3050 6200
F 0 "#PWR029" H 3050 5950 50  0001 C CNN
F 1 "GND" H 3055 6027 50  0000 C CNN
F 2 "" H 3050 6200 50  0001 C CNN
F 3 "" H 3050 6200 50  0001 C CNN
	1    3050 6200
	1    0    0    -1  
$EndComp
Wire Wire Line
	3050 5700 3050 5850
Connection ~ 3050 5850
Wire Wire Line
	4100 5950 4100 5850
Wire Wire Line
	4100 5850 4350 5850
Wire Wire Line
	4450 6050 4350 6050
Wire Wire Line
	4350 6050 4350 5850
Connection ~ 4350 5850
Wire Wire Line
	4350 5850 4450 5850
Wire Wire Line
	5350 6050 5450 6050
Wire Wire Line
	5450 6050 5450 6150
Wire Wire Line
	5350 5850 5800 5850
Wire Wire Line
	5800 5850 5800 5925
Wire Wire Line
	6275 2175 6275 2425
Connection ~ 6275 2425
Wire Wire Line
	5800 5675 5800 5850
Connection ~ 5800 5850
$Comp
L power:GND #PWR031
U 1 1 5FE13154
P 4100 6250
F 0 "#PWR031" H 4100 6000 50  0001 C CNN
F 1 "GND" H 4105 6077 50  0000 C CNN
F 2 "" H 4100 6250 50  0001 C CNN
F 3 "" H 4100 6250 50  0001 C CNN
	1    4100 6250
	1    0    0    -1  
$EndComp
$Comp
L power:GND #PWR036
U 1 1 5FE135B9
P 5450 6450
F 0 "#PWR036" H 5450 6200 50  0001 C CNN
F 1 "GND" H 5455 6277 50  0000 C CNN
F 2 "" H 5450 6450 50  0001 C CNN
F 3 "" H 5450 6450 50  0001 C CNN
	1    5450 6450
	1    0    0    -1  
$EndComp
$Comp
L power:GND #PWR030
U 1 1 5FE13AC8
P 5800 6225
F 0 "#PWR030" H 5800 5975 50  0001 C CNN
F 1 "GND" H 5805 6052 50  0000 C CNN
F 2 "" H 5800 6225 50  0001 C CNN
F 3 "" H 5800 6225 50  0001 C CNN
	1    5800 6225
	1    0    0    -1  
$EndComp
$Comp
L power:GND #PWR05
U 1 1 5FE21BC5
P 8700 1825
F 0 "#PWR05" H 8700 1575 50  0001 C CNN
F 1 "GND" H 8705 1652 50  0000 C CNN
F 2 "" H 8700 1825 50  0001 C CNN
F 3 "" H 8700 1825 50  0001 C CNN
	1    8700 1825
	1    0    0    -1  
$EndComp
Wire Wire Line
	7900 1375 7900 1275
Wire Wire Line
	7900 1275 8150 1275
Wire Wire Line
	8250 1475 8150 1475
Wire Wire Line
	8150 1475 8150 1275
Connection ~ 8150 1275
Wire Wire Line
	8150 1275 8250 1275
Wire Wire Line
	9150 1475 9250 1475
Wire Wire Line
	9250 1475 9250 1575
Wire Wire Line
	9150 1275 9600 1275
Wire Wire Line
	9600 1275 9600 1350
Wire Wire Line
	9600 1100 9600 1275
Connection ~ 9600 1275
$Comp
L power:GND #PWR04
U 1 1 5FE21BF9
P 7900 1675
F 0 "#PWR04" H 7900 1425 50  0001 C CNN
F 1 "GND" H 7905 1502 50  0000 C CNN
F 2 "" H 7900 1675 50  0001 C CNN
F 3 "" H 7900 1675 50  0001 C CNN
	1    7900 1675
	1    0    0    -1  
$EndComp
$Comp
L power:GND #PWR06
U 1 1 5FE21C03
P 9250 1875
F 0 "#PWR06" H 9250 1625 50  0001 C CNN
F 1 "GND" H 9255 1702 50  0000 C CNN
F 2 "" H 9250 1875 50  0001 C CNN
F 3 "" H 9250 1875 50  0001 C CNN
	1    9250 1875
	1    0    0    -1  
$EndComp
$Comp
L power:GND #PWR03
U 1 1 5FE21C0D
P 9600 1650
F 0 "#PWR03" H 9600 1400 50  0001 C CNN
F 1 "GND" H 9605 1477 50  0000 C CNN
F 2 "" H 9600 1650 50  0001 C CNN
F 3 "" H 9600 1650 50  0001 C CNN
	1    9600 1650
	1    0    0    -1  
$EndComp
Wire Wire Line
	8600 4825 8850 4825
Wire Wire Line
	8850 4825 8850 5100
Connection ~ 8600 4825
Wire Wire Line
	8600 4825 8600 4650
Wire Wire Line
	3100 975  3100 1050
Wire Wire Line
	2900 1150 2900 1050
Wire Wire Line
	2900 1050 3100 1050
Connection ~ 3100 1050
Wire Wire Line
	3100 1050 3100 1725
Wire Wire Line
	2600 2825 2475 2825
Wire Wire Line
	2475 2825 2475 3450
Wire Wire Line
	2475 3450 3100 3450
Wire Wire Line
	3100 3450 3100 3325
Wire Wire Line
	3100 3450 3300 3450
Wire Wire Line
	3300 3450 3300 3325
Connection ~ 3100 3450
Wire Wire Line
	3300 3450 3700 3450
Wire Wire Line
	3700 3450 3700 3325
Connection ~ 3300 3450
Wire Wire Line
	3700 3450 3900 3450
Wire Wire Line
	3900 3450 3900 3325
Connection ~ 3700 3450
Wire Wire Line
	2600 2225 2475 2225
Wire Wire Line
	2475 2225 2475 2625
Connection ~ 2475 2825
Wire Wire Line
	2600 2625 2475 2625
Connection ~ 2475 2625
Wire Wire Line
	2475 2625 2475 2825
Wire Wire Line
	4200 2825 4350 2825
Wire Wire Line
	4350 2825 4350 2625
Wire Wire Line
	4350 2225 4200 2225
Wire Wire Line
	4200 2625 4350 2625
Connection ~ 4350 2625
Wire Wire Line
	4350 2625 4350 2225
Wire Wire Line
	3300 1725 3300 1550
Wire Wire Line
	3300 1550 3700 1550
Wire Wire Line
	4350 1550 4350 2225
Connection ~ 4350 2225
Wire Wire Line
	3700 1725 3700 1550
Connection ~ 3700 1550
Wire Wire Line
	3700 1550 4350 1550
$Comp
L Connector_Generic:Conn_02x02_Odd_Even J3
U 1 1 5FE64B38
P 3200 4800
F 0 "J3" H 3250 5017 50  0000 C CNN
F 1 "DivCtl" H 3250 4926 50  0000 C CNN
F 2 "Connector_PinHeader_2.54mm:PinHeader_2x02_P2.54mm_Vertical" H 3200 4800 50  0001 C CNN
F 3 "~" H 3200 4800 50  0001 C CNN
F 4 "Samtec" H 3200 4800 50  0001 C CNN "MFN"
F 5 "HTSW-102-07-G-S" H 3200 4800 50  0001 C CNN "MFP"
F 6 "200-HTSW10207GS" H 3200 4800 50  0001 C CNN "S1PN"
F 7 "Mouser" H 3200 4800 50  0001 C CNN "S1PL"
F 8 "Pin Header Male Pin 0.100\\\"(2.54mm) 2 pin" H 3200 4800 50  0001 C CNN "Description"
F 9 "Through Hole,P=2.54mm" H 3200 4800 50  0001 C CNN "Package ID"
	1    3200 4800
	1    0    0    1   
$EndComp
$Comp
L device:R R8
U 1 1 5FE653F2
P 3750 5025
F 0 "R8" H 3820 5071 50  0000 L CNN
F 1 "100k" H 3820 4980 50  0000 L CNN
F 2 "Resistor_SMD:R_0402_1005Metric" V 3680 5025 50  0001 C CNN
F 3 "~" H 3750 5025 50  0001 C CNN
F 4 "Yageo" H 3750 5025 50  0001 C CNN "MFN"
F 5 "RC0402FR-07100KL" H 3750 5025 50  0001 C CNN "MFP"
F 6 "603-RC0402FR-07100KL" H 3750 5025 50  0001 C CNN "S1PN"
F 7 "Mouser" H 3750 5025 50  0001 C CNN "S1PL"
F 8 "Thick Film Resistors 100K OHM 1%" H 3750 5025 50  0001 C CNN "Description"
F 9 "0402 (1005 metric)" H 3750 5025 50  0001 C CNN "Package ID"
	1    3750 5025
	1    0    0    -1  
$EndComp
Wire Wire Line
	4925 4225 4175 4225
Wire Wire Line
	4175 4225 4175 4700
Wire Wire Line
	4175 4700 3750 4700
Wire Wire Line
	3500 4800 4075 4800
Wire Wire Line
	6475 4800 6475 4225
Wire Wire Line
	6475 4225 6325 4225
Wire Wire Line
	4075 4875 4075 4800
Connection ~ 4075 4800
Wire Wire Line
	4075 4800 6475 4800
Wire Wire Line
	3750 4875 3750 4700
Connection ~ 3750 4700
Wire Wire Line
	3750 4700 3500 4700
$Comp
L power:GND #PWR020
U 1 1 5FE7BEE5
P 3750 5175
F 0 "#PWR020" H 3750 4925 50  0001 C CNN
F 1 "GND" H 3755 5002 50  0000 C CNN
F 2 "" H 3750 5175 50  0001 C CNN
F 3 "" H 3750 5175 50  0001 C CNN
	1    3750 5175
	1    0    0    -1  
$EndComp
$Comp
L power:GND #PWR021
U 1 1 5FE7C26B
P 4075 5175
F 0 "#PWR021" H 4075 4925 50  0001 C CNN
F 1 "GND" H 4080 5002 50  0000 C CNN
F 2 "" H 4075 5175 50  0001 C CNN
F 3 "" H 4075 5175 50  0001 C CNN
	1    4075 5175
	1    0    0    -1  
$EndComp
$Comp
L power:VCC #PWR017
U 1 1 5FE7C89F
P 2875 4450
F 0 "#PWR017" H 2875 4300 50  0001 C CNN
F 1 "VCC" H 2890 4623 50  0000 C CNN
F 2 "" H 2875 4450 50  0001 C CNN
F 3 "" H 2875 4450 50  0001 C CNN
	1    2875 4450
	1    0    0    -1  
$EndComp
Wire Wire Line
	2875 4450 2875 4700
Wire Wire Line
	2875 4800 3000 4800
Wire Wire Line
	3000 4700 2875 4700
Connection ~ 2875 4700
Wire Wire Line
	2875 4700 2875 4800
$Comp
L power:GND #PWR037
U 1 1 5FEA024E
P 6575 3625
F 0 "#PWR037" H 6575 3375 50  0001 C CNN
F 1 "GND" V 6580 3497 50  0000 R CNN
F 2 "" H 6575 3625 50  0001 C CNN
F 3 "" H 6575 3625 50  0001 C CNN
	1    6575 3625
	0    -1   -1   0   
$EndComp
Wire Wire Line
	6325 3625 6575 3625
$Comp
L Connector_Generic:Conn_01x04 J5
U 1 1 5FEA61C3
P 1375 4350
F 0 "J5" H 1293 4667 50  0000 C CNN
F 1 "PwrCtl" H 1293 4576 50  0000 C CNN
F 2 "Connector_PinHeader_2.54mm:PinHeader_1x04_P2.54mm_Vertical" H 1375 4350 50  0001 C CNN
F 3 "~" H 1375 4350 50  0001 C CNN
F 4 "Samtec" H 1825 8000 50  0001 C CNN "MFN"
F 5 "HTSW-104-07-G-S" H 1825 8000 50  0001 C CNN "MFP"
F 6 "200-HTSW10407GS" H 1825 8000 50  0001 C CNN "S1PN"
F 7 "Mouser" H 1825 8000 50  0001 C CNN "S1PL"
F 8 "Pin Header Male Pin 0.100\\\"(2.54mm) 4 pin" H 1825 8000 50  0001 C CNN "Description"
F 9 "Through Hole,P=2.54mm" H 1825 8000 50  0001 C CNN "Package ID"
	1    1375 4350
	-1   0    0    -1  
$EndComp
$Comp
L power:+5V #PWR038
U 1 1 5FEACB48
P 1800 4000
F 0 "#PWR038" H 1800 3850 50  0001 C CNN
F 1 "+5V" H 1815 4173 50  0000 C CNN
F 2 "" H 1800 4000 50  0001 C CNN
F 3 "" H 1800 4000 50  0001 C CNN
	1    1800 4000
	1    0    0    -1  
$EndComp
$Comp
L power:GND #PWR039
U 1 1 5FEAD118
P 1800 4725
F 0 "#PWR039" H 1800 4475 50  0001 C CNN
F 1 "GND" H 1805 4552 50  0000 C CNN
F 2 "" H 1800 4725 50  0001 C CNN
F 3 "" H 1800 4725 50  0001 C CNN
	1    1800 4725
	1    0    0    -1  
$EndComp
Wire Wire Line
	1575 4450 1800 4450
Wire Wire Line
	1800 4450 1800 4050
Wire Wire Line
	1575 4550 1800 4550
Wire Wire Line
	1800 4550 1800 4625
Text GLabel 1975 4350 2    50   Input ~ 0
Locked
Text GLabel 1975 4250 2    50   Input ~ 0
RefSrc
Wire Wire Line
	1575 4250 1975 4250
Wire Wire Line
	1575 4350 1975 4350
Text GLabel 3500 1400 1    50   Input ~ 0
RefSrc
Text GLabel 4575 4025 0    50   Input ~ 0
Locked
Wire Wire Line
	4925 4025 4575 4025
Wire Wire Line
	3500 1725 3500 1400
$Comp
L power:GND #PWR0101
U 1 1 5FECED1C
P 2900 1450
F 0 "#PWR0101" H 2900 1200 50  0001 C CNN
F 1 "GND" H 2905 1277 50  0000 C CNN
F 2 "" H 2900 1450 50  0001 C CNN
F 3 "" H 2900 1450 50  0001 C CNN
	1    2900 1450
	1    0    0    -1  
$EndComp
$Comp
L power:+5V #PWR0102
U 1 1 5FECF2A2
P 1375 5700
F 0 "#PWR0102" H 1375 5550 50  0001 C CNN
F 1 "+5V" H 1390 5873 50  0000 C CNN
F 2 "" H 1375 5700 50  0001 C CNN
F 3 "" H 1375 5700 50  0001 C CNN
	1    1375 5700
	1    0    0    -1  
$EndComp
$Comp
L power:+5V #PWR0103
U 1 1 5FECFB1B
P 4100 5675
F 0 "#PWR0103" H 4100 5525 50  0001 C CNN
F 1 "+5V" H 4115 5848 50  0000 C CNN
F 2 "" H 4100 5675 50  0001 C CNN
F 3 "" H 4100 5675 50  0001 C CNN
	1    4100 5675
	1    0    0    -1  
$EndComp
$Comp
L power:+5V #PWR0104
U 1 1 5FED0CE8
P 7900 1100
F 0 "#PWR0104" H 7900 950 50  0001 C CNN
F 1 "+5V" H 7915 1273 50  0000 C CNN
F 2 "" H 7900 1100 50  0001 C CNN
F 3 "" H 7900 1100 50  0001 C CNN
	1    7900 1100
	1    0    0    -1  
$EndComp
Wire Wire Line
	7900 1100 7900 1275
Connection ~ 7900 1275
Wire Wire Line
	4100 5675 4100 5850
Connection ~ 4100 5850
Wire Wire Line
	1375 5700 1375 5850
Connection ~ 1375 5850
$Comp
L power:GND #PWR0105
U 1 1 5FEE281D
P 4350 2825
F 0 "#PWR0105" H 4350 2575 50  0001 C CNN
F 1 "GND" H 4355 2652 50  0000 C CNN
F 2 "" H 4350 2825 50  0001 C CNN
F 3 "" H 4350 2825 50  0001 C CNN
	1    4350 2825
	1    0    0    -1  
$EndComp
Connection ~ 4350 2825
$Comp
L power:GND #PWR0106
U 1 1 5FEE2C85
P 2475 3450
F 0 "#PWR0106" H 2475 3200 50  0001 C CNN
F 1 "GND" H 2480 3277 50  0000 C CNN
F 2 "" H 2475 3450 50  0001 C CNN
F 3 "" H 2475 3450 50  0001 C CNN
	1    2475 3450
	1    0    0    -1  
$EndComp
Connection ~ 2475 3450
$Comp
L power:PWR_FLAG #FLG0101
U 1 1 5FEE4123
P 1800 4625
F 0 "#FLG0101" H 1800 4700 50  0001 C CNN
F 1 "PWR_FLAG" V 1800 4753 50  0000 L CNN
F 2 "" H 1800 4625 50  0001 C CNN
F 3 "~" H 1800 4625 50  0001 C CNN
	1    1800 4625
	0    1    1    0   
$EndComp
Connection ~ 1800 4625
Wire Wire Line
	1800 4625 1800 4725
$Comp
L power:PWR_FLAG #FLG0102
U 1 1 5FEE4581
P 1800 4050
F 0 "#FLG0102" H 1800 4125 50  0001 C CNN
F 1 "PWR_FLAG" V 1800 4178 50  0000 L CNN
F 2 "" H 1800 4050 50  0001 C CNN
F 3 "~" H 1800 4050 50  0001 C CNN
	1    1800 4050
	0    1    1    0   
$EndComp
Connection ~ 1800 4050
Wire Wire Line
	1800 4050 1800 4000
$Comp
L device:C C13
U 1 1 5FF09040
P 7000 5000
F 0 "C13" V 6925 4800 50  0000 L CNN
F 1 "3.3n" V 6925 5075 50  0000 L CNN
F 2 "Capacitor_SMD:C_0402_1005Metric" H 7038 4850 50  0001 C CNN
F 3 "~" H 7000 5000 50  0001 C CNN
F 4 "Taiyo Yuden" H 7000 5000 50  0001 C CNN "MFN"
F 5 "UMK105BJ332KVHF" H 7000 5000 50  0001 C CNN "MFP"
F 6 "963-UMK105BJ332KVHF" H 7000 5000 50  0001 C CNN "S1PN"
F 7 "Mouser" H 7000 5000 50  0001 C CNN "S1PL"
F 8 "Multilayer Ceramic Capacitors MLCC - SMD/SMT 0402 50V 3300pF 10% X5R" H 7000 5000 50  0001 C CNN "Description"
F 9 "0402 (1005 metric)" V 7000 5000 50  0001 C CNN "Package ID"
	1    7000 5000
	0    1    1    0   
$EndComp
$Comp
L device:C C21
U 1 1 5FF1CC14
P 3925 3825
F 0 "C21" V 3825 3675 50  0000 C CNN
F 1 "0.1u" V 4000 3975 50  0000 C CNN
F 2 "Capacitor_SMD:C_0402_1005Metric" H 3963 3675 50  0001 C CNN
F 3 "~" H 3925 3825 50  0001 C CNN
F 4 "Yageo" V 3925 3825 50  0001 C CNN "MFN"
F 5 "CC0402KPX5R7BB104" V 3925 3825 50  0001 C CNN "MFP"
F 6 "603-CC0402KPX57BB104" V 3925 3825 50  0001 C CNN "S1PN"
F 7 "Mouser" V 3925 3825 50  0001 C CNN "S1PL"
F 8 "Multilayer Ceramic Capacitors MLCC - SMD/SMT 0.1 uF 16V 10% X5R" V 3925 3825 50  0001 C CNN "Description"
F 9 "0402 (1005 metric)" V 3925 3825 50  0001 C CNN "Package ID"
	1    3925 3825
	0    1    1    0   
$EndComp
Wire Wire Line
	3775 3825 3500 3825
Wire Wire Line
	4075 3825 4925 3825
$Comp
L project:TPS71733 U5
U 1 1 5FF2CE05
P 4900 6050
F 0 "U5" H 4900 6515 50  0000 C CNN
F 1 "TPS71733" H 4900 6424 50  0000 C CNN
F 2 "Package_TO_SOT_SMD:SOT-353_SC-70-5" H 4900 6050 50  0001 C CNN
F 3 "" H 4900 6050 50  0001 C CNN
F 4 "Texas Instruments" H 4900 6050 50  0001 C CNN "MFN"
F 5 "TPS71733DCKT" H 4900 6050 50  0001 C CNN "MFP"
F 6 "595-TPS71733DCKT" H 4900 6050 50  0001 C CNN "S1PN"
F 7 "Mouser" H 4900 6050 50  0001 C CNN "S1PL"
F 8 "LDO Voltage Regulators Sgl Output LDO 150mA Fixed(3.3V) Hi PSRR" H 4900 6050 50  0001 C CNN "Description"
F 9 "SOT-353" H 4900 6050 50  0001 C CNN "Package ID"
	1    4900 6050
	1    0    0    -1  
$EndComp
$Comp
L project:TPS71733 U1
U 1 1 5FF33EA8
P 8700 1475
F 0 "U1" H 8700 1940 50  0000 C CNN
F 1 "TPS71733" H 8700 1849 50  0000 C CNN
F 2 "Package_TO_SOT_SMD:SOT-353_SC-70-5" H 8700 1475 50  0001 C CNN
F 3 "" H 8700 1475 50  0001 C CNN
F 4 "Texas Instruments" H 8700 1475 50  0001 C CNN "MFN"
F 5 "TPS71733DCKT" H 8700 1475 50  0001 C CNN "MFP"
F 6 "595-TPS71733DCKT" H 8700 1475 50  0001 C CNN "S1PN"
F 7 "Mouser" H 8700 1475 50  0001 C CNN "S1PL"
F 8 "LDO Voltage Regulators Sgl Output LDO 150mA Fixed(3.3V) Hi PSRR" H 8700 1475 50  0001 C CNN "Description"
F 9 "SOT-353" H 8700 1475 50  0001 C CNN "Package ID"
	1    8700 1475
	1    0    0    -1  
$EndComp
$Comp
L device:C C16
U 1 1 5FF3B8F0
P 3050 6050
F 0 "C16" H 3100 6150 50  0000 L CNN
F 1 "1.0u" H 3100 5950 50  0000 L CNN
F 2 "Capacitor_SMD:C_0603_1608Metric" H 3088 5900 50  0001 C CNN
F 3 "~" H 3050 6050 50  0001 C CNN
F 4 "Yageo" H 3050 6050 50  0001 C CNN "MFN"
F 5 "CC0603KRX5R8BB105" H 3050 6050 50  0001 C CNN "MFP"
F 6 "603-CC603KRX5R8BB105" H 3050 6050 50  0001 C CNN "S1PN"
F 7 "Mouser" H 3050 6050 50  0001 C CNN "S1PL"
F 8 "Multilayer Ceramic Capacitors MLCC - SMD/SMT 1.0uF 25V X5R 10%" H 3050 6050 50  0001 C CNN "Description"
F 9 "0603 (1608 metric)" H 3050 6050 50  0001 C CNN "Package ID"
	1    3050 6050
	1    0    0    -1  
$EndComp
$Comp
L device:C C18
U 1 1 5FF42A79
P 4100 6100
F 0 "C18" H 3900 6200 50  0000 L CNN
F 1 "1.0u" H 3875 6000 50  0000 L CNN
F 2 "Capacitor_SMD:C_0603_1608Metric" H 4138 5950 50  0001 C CNN
F 3 "~" H 4100 6100 50  0001 C CNN
F 4 "Yageo" H 4100 6100 50  0001 C CNN "MFN"
F 5 "CC0603KRX5R8BB105" H 4100 6100 50  0001 C CNN "MFP"
F 6 "603-CC603KRX5R8BB105" H 4100 6100 50  0001 C CNN "S1PN"
F 7 "Mouser" H 4100 6100 50  0001 C CNN "S1PL"
F 8 "Multilayer Ceramic Capacitors MLCC - SMD/SMT 1.0uF 25V X5R 10%" H 4100 6100 50  0001 C CNN "Description"
F 9 "0603 (1608 metric)" H 4100 6100 50  0001 C CNN "Package ID"
	1    4100 6100
	1    0    0    -1  
$EndComp
$Comp
L device:C C17
U 1 1 5FF495D0
P 5800 6075
F 0 "C17" H 5850 6175 50  0000 L CNN
F 1 "1.0u" H 5850 5975 50  0000 L CNN
F 2 "Capacitor_SMD:C_0603_1608Metric" H 5838 5925 50  0001 C CNN
F 3 "~" H 5800 6075 50  0001 C CNN
F 4 "Yageo" H 5800 6075 50  0001 C CNN "MFN"
F 5 "CC0603KRX5R8BB105" H 5800 6075 50  0001 C CNN "MFP"
F 6 "603-CC603KRX5R8BB105" H 5800 6075 50  0001 C CNN "S1PN"
F 7 "Mouser" H 5800 6075 50  0001 C CNN "S1PL"
F 8 "Multilayer Ceramic Capacitors MLCC - SMD/SMT 1.0uF 25V X5R 10%" H 5800 6075 50  0001 C CNN "Description"
F 9 "0603 (1608 metric)" H 5800 6075 50  0001 C CNN "Package ID"
	1    5800 6075
	1    0    0    -1  
$EndComp
$Comp
L device:C C20
U 1 1 5FF502E7
P 5450 6300
F 0 "C20" H 5500 6400 50  0000 L CNN
F 1 "0.1u" H 5250 6200 50  0000 L CNN
F 2 "Capacitor_SMD:C_0603_1608Metric" H 5488 6150 50  0001 C CNN
F 3 "~" H 5450 6300 50  0001 C CNN
F 4 "Kemet" H 5450 6300 50  0001 C CNN "MFN"
F 5 "C0603C104K5RACTU" H 5450 6300 50  0001 C CNN "MFP"
F 6 "80-C0603C104K5R" H 5450 6300 50  0001 C CNN "S1PN"
F 7 "Mouser" H 5450 6300 50  0001 C CNN "S1PL"
F 8 "Multilayer Ceramic Capacitors MLCC - SMD/SMT 50volts 0.1uF X7R 10%" H 5450 6300 50  0001 C CNN "Description"
F 9 "0603 (1608 metric)" H 5450 6300 50  0001 C CNN "Package ID"
	1    5450 6300
	1    0    0    -1  
$EndComp
$Comp
L device:C C3
U 1 1 5FF56E3E
P 7900 1525
F 0 "C3" H 7700 1625 50  0000 L CNN
F 1 "1.0u" H 7675 1425 50  0000 L CNN
F 2 "Capacitor_SMD:C_0603_1608Metric" H 7938 1375 50  0001 C CNN
F 3 "~" H 7900 1525 50  0001 C CNN
F 4 "Yageo" H 7900 1525 50  0001 C CNN "MFN"
F 5 "CC0603KRX5R8BB105" H 7900 1525 50  0001 C CNN "MFP"
F 6 "603-CC603KRX5R8BB105" H 7900 1525 50  0001 C CNN "S1PN"
F 7 "Mouser" H 7900 1525 50  0001 C CNN "S1PL"
F 8 "Multilayer Ceramic Capacitors MLCC - SMD/SMT 1.0uF 25V X5R 10%" H 7900 1525 50  0001 C CNN "Description"
F 9 "0603 (1608 metric)" H 7900 1525 50  0001 C CNN "Package ID"
	1    7900 1525
	1    0    0    -1  
$EndComp
$Comp
L device:C C2
U 1 1 5FF5DB55
P 9600 1500
F 0 "C2" H 9650 1600 50  0000 L CNN
F 1 "1.0u" H 9650 1400 50  0000 L CNN
F 2 "Capacitor_SMD:C_0603_1608Metric" H 9638 1350 50  0001 C CNN
F 3 "~" H 9600 1500 50  0001 C CNN
F 4 "Yageo" H 9600 1500 50  0001 C CNN "MFN"
F 5 "CC0603KRX5R8BB105" H 9600 1500 50  0001 C CNN "MFP"
F 6 "603-CC603KRX5R8BB105" H 9600 1500 50  0001 C CNN "S1PN"
F 7 "Mouser" H 9600 1500 50  0001 C CNN "S1PL"
F 8 "Multilayer Ceramic Capacitors MLCC - SMD/SMT 1.0uF 25V X5R 10%" H 9600 1500 50  0001 C CNN "Description"
F 9 "0603 (1608 metric)" H 9600 1500 50  0001 C CNN "Package ID"
	1    9600 1500
	1    0    0    -1  
$EndComp
$Comp
L device:C C4
U 1 1 5FF650D7
P 9250 1725
F 0 "C4" H 9300 1825 50  0000 L CNN
F 1 "0.1u" H 9050 1625 50  0000 L CNN
F 2 "Capacitor_SMD:C_0603_1608Metric" H 9288 1575 50  0001 C CNN
F 3 "~" H 9250 1725 50  0001 C CNN
F 4 "Kemet" H 9250 1725 50  0001 C CNN "MFN"
F 5 "C0603C104K5RACTU" H 9250 1725 50  0001 C CNN "MFP"
F 6 "80-C0603C104K5R" H 9250 1725 50  0001 C CNN "S1PN"
F 7 "Mouser" H 9250 1725 50  0001 C CNN "S1PL"
F 8 "Multilayer Ceramic Capacitors MLCC - SMD/SMT 50volts 0.1uF X7R 10%" H 9250 1725 50  0001 C CNN "Description"
F 9 "0603 (1608 metric)" H 9250 1725 50  0001 C CNN "Package ID"
	1    9250 1725
	1    0    0    -1  
$EndComp
$Comp
L device:C C7
U 1 1 5FF6C695
P 6275 2650
F 0 "C7" H 6400 2700 50  0000 L CNN
F 1 "0.1u" H 6400 2600 50  0000 L CNN
F 2 "Capacitor_SMD:C_0603_1608Metric" H 6313 2500 50  0001 C CNN
F 3 "~" H 6275 2650 50  0001 C CNN
F 4 "Kemet" H 6275 2650 50  0001 C CNN "MFN"
F 5 "C0603C104K5RACTU" H 6275 2650 50  0001 C CNN "MFP"
F 6 "80-C0603C104K5R" H 6275 2650 50  0001 C CNN "S1PN"
F 7 "Mouser" H 6275 2650 50  0001 C CNN "S1PL"
F 8 "Multilayer Ceramic Capacitors MLCC - SMD/SMT 50volts 0.1uF X7R 10%" H 6275 2650 50  0001 C CNN "Description"
F 9 "0603 (1608 metric)" H 6275 2650 50  0001 C CNN "Package ID"
	1    6275 2650
	1    0    0    -1  
$EndComp
$Comp
L device:C C1
U 1 1 5FF73A37
P 2900 1300
F 0 "C1" H 2950 1400 50  0000 L CNN
F 1 "0.1u" H 2700 1200 50  0000 L CNN
F 2 "Capacitor_SMD:C_0603_1608Metric" H 2938 1150 50  0001 C CNN
F 3 "~" H 2900 1300 50  0001 C CNN
F 4 "Kemet" H 2900 1300 50  0001 C CNN "MFN"
F 5 "C0603C104K5RACTU" H 2900 1300 50  0001 C CNN "MFP"
F 6 "80-C0603C104K5R" H 2900 1300 50  0001 C CNN "S1PN"
F 7 "Mouser" H 2900 1300 50  0001 C CNN "S1PL"
F 8 "Multilayer Ceramic Capacitors MLCC - SMD/SMT 50volts 0.1uF X7R 10%" H 2900 1300 50  0001 C CNN "Description"
F 9 "0603 (1608 metric)" H 2900 1300 50  0001 C CNN "Package ID"
	1    2900 1300
	1    0    0    -1  
$EndComp
$Comp
L device:C C14
U 1 1 5FF7ACFD
P 8850 5250
F 0 "C14" H 8675 5350 50  0000 L CNN
F 1 "0.1u" H 8900 5150 50  0000 L CNN
F 2 "Capacitor_SMD:C_0603_1608Metric" H 8888 5100 50  0001 C CNN
F 3 "~" H 8850 5250 50  0001 C CNN
F 4 "Kemet" H 8850 5250 50  0001 C CNN "MFN"
F 5 "C0603C104K5RACTU" H 8850 5250 50  0001 C CNN "MFP"
F 6 "80-C0603C104K5R" H 8850 5250 50  0001 C CNN "S1PN"
F 7 "Mouser" H 8850 5250 50  0001 C CNN "S1PL"
F 8 "Multilayer Ceramic Capacitors MLCC - SMD/SMT 50volts 0.1uF X7R 10%" H 8850 5250 50  0001 C CNN "Description"
F 9 "0603 (1608 metric)" H 8850 5250 50  0001 C CNN "Package ID"
	1    8850 5250
	1    0    0    -1  
$EndComp
$Comp
L device:R R9
U 1 1 5FF81F7B
P 4075 5025
F 0 "R9" H 4145 5071 50  0000 L CNN
F 1 "100k" H 4145 4980 50  0000 L CNN
F 2 "Resistor_SMD:R_0402_1005Metric" V 4005 5025 50  0001 C CNN
F 3 "~" H 4075 5025 50  0001 C CNN
F 4 "Yageo" H 4075 5025 50  0001 C CNN "MFN"
F 5 "RC0402FR-07100KL" H 4075 5025 50  0001 C CNN "MFP"
F 6 "603-RC0402FR-07100KL" H 4075 5025 50  0001 C CNN "S1PN"
F 7 "Mouser" H 4075 5025 50  0001 C CNN "S1PL"
F 8 "Thick Film Resistors 100K OHM 1%" H 4075 5025 50  0001 C CNN "Description"
F 9 "0402 (1005 metric)" H 4075 5025 50  0001 C CNN "Package ID"
	1    4075 5025
	1    0    0    -1  
$EndComp
$Comp
L device:C C6
U 1 1 5FF88CD5
P 4850 2425
F 0 "C6" V 4750 2275 50  0000 C CNN
F 1 "0.1u" V 4925 2575 50  0000 C CNN
F 2 "Capacitor_SMD:C_0402_1005Metric" H 4888 2275 50  0001 C CNN
F 3 "~" H 4850 2425 50  0001 C CNN
F 4 "Yageo" V 4850 2425 50  0001 C CNN "MFN"
F 5 "CC0402KPX5R7BB104" V 4850 2425 50  0001 C CNN "MFP"
F 6 "603-CC0402KPX57BB104" V 4850 2425 50  0001 C CNN "S1PN"
F 7 "Mouser" V 4850 2425 50  0001 C CNN "S1PL"
F 8 "Multilayer Ceramic Capacitors MLCC - SMD/SMT 0.1 uF 16V 10% X5R" V 4850 2425 50  0001 C CNN "Description"
F 9 "0402 (1005 metric)" V 4850 2425 50  0001 C CNN "Package ID"
	1    4850 2425
	0    1    1    0   
$EndComp
$Comp
L device:C C5
U 1 1 5FF8F904
P 1750 2425
F 0 "C5" V 1650 2275 50  0000 C CNN
F 1 "0.1u" V 1650 2600 50  0000 C CNN
F 2 "Capacitor_SMD:C_0402_1005Metric" H 1788 2275 50  0001 C CNN
F 3 "~" H 1750 2425 50  0001 C CNN
F 4 "Yageo" V 1750 2425 50  0001 C CNN "MFN"
F 5 "CC0402KPX5R7BB104" V 1750 2425 50  0001 C CNN "MFP"
F 6 "603-CC0402KPX57BB104" V 1750 2425 50  0001 C CNN "S1PN"
F 7 "Mouser" V 1750 2425 50  0001 C CNN "S1PL"
F 8 "Multilayer Ceramic Capacitors MLCC - SMD/SMT 0.1 uF 16V 10% X5R" V 1750 2425 50  0001 C CNN "Description"
F 9 "0402 (1005 metric)" V 1750 2425 50  0001 C CNN "Package ID"
	1    1750 2425
	0    1    1    0   
$EndComp
$Comp
L device:R R7
U 1 1 5FF9D32B
P 8125 5000
F 0 "R7" V 8025 5000 50  0000 C CNN
F 1 "16.7" V 8225 5000 50  0000 C CNN
F 2 "Resistor_SMD:R_0402_1005Metric" V 8055 5000 50  0001 C CNN
F 3 "~" H 8125 5000 50  0001 C CNN
F 4 "KOA Speer" V 8125 5000 50  0001 C CNN "MFN"
F 5 "RN73H1ETTP16R7F50" V 8125 5000 50  0001 C CNN "MFP"
F 6 "660-RN73H1ETP16R7F50" V 8125 5000 50  0001 C CNN "S1PN"
F 7 "Mouser" V 8125 5000 50  0001 C CNN "S1PL"
F 8 "16.7 Ohms ±1% 0.063W, 1/16W Chip Resistor" V 8125 5000 50  0001 C CNN "Description"
F 9 "0402 (1005 metric)" V 8125 5000 50  0001 C CNN "Package ID"
	1    8125 5000
	0    1    1    0   
$EndComp
$Comp
L device:R R12
U 1 1 5FFA3F3A
P 7875 5325
F 0 "R12" H 7725 5300 50  0000 C CNN
F 1 "16.7" H 7725 5375 50  0000 C CNN
F 2 "Resistor_SMD:R_0402_1005Metric" V 7805 5325 50  0001 C CNN
F 3 "~" H 7875 5325 50  0001 C CNN
F 4 "KOA Speer" V 7875 5325 50  0001 C CNN "MFN"
F 5 "RN73H1ETTP16R7F50" V 7875 5325 50  0001 C CNN "MFP"
F 6 "660-RN73H1ETP16R7F50" V 7875 5325 50  0001 C CNN "S1PN"
F 7 "Mouser" V 7875 5325 50  0001 C CNN "S1PL"
F 8 "16.7 Ohms ±1% 0.063W, 1/16W Chip Resistor" V 7875 5325 50  0001 C CNN "Description"
F 9 "0402 (1005 metric)" H 7875 5325 50  0001 C CNN "Package ID"
	1    7875 5325
	-1   0    0    1   
$EndComp
$Comp
L connector:Conn_Coaxial J2
U 1 1 5FFABF32
P 10225 3825
F 0 "J2" H 10375 3825 50  0000 C CNN
F 1 "Vtune" H 10450 3725 50  0000 C CNN
F 2 "MMCX_Connectors:mmcx_th" H 10225 3825 50  0001 C CNN
F 3 " ~" H 10225 3825 50  0001 C CNN
F 4 "Amphenol" H 10225 3825 50  0001 C CNN "MFN"
F 5 "262104" H 10225 3825 50  0001 C CNN "MFP"
F 6 "262104" H 10225 3825 50  0001 C CNN "S1PN"
F 7 "TTI" H 10225 3825 50  0001 C CNN "S1PL"
F 8 "MMCX Connector Jack, Female Socket 50Ohm Through Hole Solder" H 10225 3825 50  0001 C CNN "Description"
	1    10225 3825
	1    0    0    -1  
$EndComp
$Comp
L connector:Conn_Coaxial J4
U 1 1 5FFB3D30
P 10225 5000
F 0 "J4" H 10375 5000 50  0000 C CNN
F 1 "Vco Out" H 10450 4900 50  0000 C CNN
F 2 "MMCX_Connectors:mmcx_th" H 10225 5000 50  0001 C CNN
F 3 " ~" H 10225 5000 50  0001 C CNN
F 4 "Amphenol" H 10225 5000 50  0001 C CNN "MFN"
F 5 "262104" H 10225 5000 50  0001 C CNN "MFP"
F 6 "262104" H 10225 5000 50  0001 C CNN "S1PN"
F 7 "TTI" H 10225 5000 50  0001 C CNN "S1PL"
F 8 "MMCX Connector Jack, Female Socket 50Ohm Through Hole Solder" H 10225 5000 50  0001 C CNN "Description"
	1    10225 5000
	1    0    0    -1  
$EndComp
$Comp
L project:rfi_shield_clip P1
U 1 1 60047A76
P 8100 2575
F 0 "P1" H 8228 2645 60  0000 L CNN
F 1 "rfi_shield_clip" H 8228 2539 60  0000 L CNN
F 2 "rf_shields:S1721-46R" H 8100 2575 60  0001 C CNN
F 3 "" H 8100 2575 60  0000 C CNN
F 4 "Harwin Inc." H 8100 2575 50  0001 C CNN "MFN"
F 5 "S1721-46R" H 8100 2575 50  0001 C CNN "MFP"
F 6 "952-1476-1-ND" H 8100 2575 50  0001 C CNN "S1PN"
F 7 "Digi-Key" H 8100 2575 50  0001 C CNN "S1PL"
F 8 "855-S1721-46R" H 8100 2575 50  0001 C CNN "S2PN"
F 9 "Mouser" H 8100 2575 50  0001 C CNN "S2PL"
F 10 "RFI SHIELD CLIP MINI TIN SMD" H 8100 2575 50  0001 C CNN "Description"
	1    8100 2575
	1    0    0    -1  
$EndComp
$Comp
L power:GND #PWR040
U 1 1 60048130
P 8100 2675
F 0 "#PWR040" H 8100 2425 50  0001 C CNN
F 1 "GND" H 8105 2502 50  0000 C CNN
F 2 "" H 8100 2675 50  0001 C CNN
F 3 "" H 8100 2675 50  0001 C CNN
	1    8100 2675
	1    0    0    -1  
$EndComp
$Comp
L project:rfi_shield_clip P2
U 1 1 600487D3
P 9075 2575
F 0 "P2" H 9203 2645 60  0000 L CNN
F 1 "rfi_shield_clip" H 9203 2539 60  0000 L CNN
F 2 "rf_shields:S1721-46R" H 9075 2575 60  0001 C CNN
F 3 "" H 9075 2575 60  0000 C CNN
F 4 "Harwin Inc." H 9075 2575 50  0001 C CNN "MFN"
F 5 "S1721-46R" H 9075 2575 50  0001 C CNN "MFP"
F 6 "952-1476-1-ND" H 9075 2575 50  0001 C CNN "S1PN"
F 7 "Digi-Key" H 9075 2575 50  0001 C CNN "S1PL"
F 8 "855-S1721-46R" H 9075 2575 50  0001 C CNN "S2PN"
F 9 "Mouser" H 9075 2575 50  0001 C CNN "S2PL"
F 10 "RFI SHIELD CLIP MINI TIN SMD" H 9075 2575 50  0001 C CNN "Description"
	1    9075 2575
	1    0    0    -1  
$EndComp
$Comp
L power:GND #PWR041
U 1 1 600487DD
P 9075 2675
F 0 "#PWR041" H 9075 2425 50  0001 C CNN
F 1 "GND" H 9080 2502 50  0000 C CNN
F 2 "" H 9075 2675 50  0001 C CNN
F 3 "" H 9075 2675 50  0001 C CNN
	1    9075 2675
	1    0    0    -1  
$EndComp
$Comp
L project:rfi_shield_clip P3
U 1 1 6004F5AA
P 8100 3175
F 0 "P3" H 8228 3245 60  0000 L CNN
F 1 "rfi_shield_clip" H 8228 3139 60  0000 L CNN
F 2 "rf_shields:S1721-46R" H 8100 3175 60  0001 C CNN
F 3 "" H 8100 3175 60  0000 C CNN
F 4 "Harwin Inc." H 8100 3175 50  0001 C CNN "MFN"
F 5 "S1721-46R" H 8100 3175 50  0001 C CNN "MFP"
F 6 "952-1476-1-ND" H 8100 3175 50  0001 C CNN "S1PN"
F 7 "Digi-Key" H 8100 3175 50  0001 C CNN "S1PL"
F 8 "855-S1721-46R" H 8100 3175 50  0001 C CNN "S2PN"
F 9 "Mouser" H 8100 3175 50  0001 C CNN "S2PL"
F 10 "RFI SHIELD CLIP MINI TIN SMD" H 8100 3175 50  0001 C CNN "Description"
	1    8100 3175
	1    0    0    -1  
$EndComp
$Comp
L power:GND #PWR042
U 1 1 6004F5B4
P 8100 3275
F 0 "#PWR042" H 8100 3025 50  0001 C CNN
F 1 "GND" H 8105 3102 50  0000 C CNN
F 2 "" H 8100 3275 50  0001 C CNN
F 3 "" H 8100 3275 50  0001 C CNN
	1    8100 3275
	1    0    0    -1  
$EndComp
$Comp
L project:rfi_shield_clip P4
U 1 1 6004F5BE
P 9075 3175
F 0 "P4" H 9203 3245 60  0000 L CNN
F 1 "rfi_shield_clip" H 9203 3139 60  0000 L CNN
F 2 "rf_shields:S1721-46R" H 9075 3175 60  0001 C CNN
F 3 "" H 9075 3175 60  0000 C CNN
F 4 "Harwin Inc." H 9075 3175 50  0001 C CNN "MFN"
F 5 "S1721-46R" H 9075 3175 50  0001 C CNN "MFP"
F 6 "952-1476-1-ND" H 9075 3175 50  0001 C CNN "S1PN"
F 7 "Digi-Key" H 9075 3175 50  0001 C CNN "S1PL"
F 8 "855-S1721-46R" H 9075 3175 50  0001 C CNN "S2PN"
F 9 "Mouser" H 9075 3175 50  0001 C CNN "S2PL"
F 10 "RFI SHIELD CLIP MINI TIN SMD" H 9075 3175 50  0001 C CNN "Description"
	1    9075 3175
	1    0    0    -1  
$EndComp
$Comp
L power:GND #PWR043
U 1 1 6004F5C8
P 9075 3275
F 0 "#PWR043" H 9075 3025 50  0001 C CNN
F 1 "GND" H 9080 3102 50  0000 C CNN
F 2 "" H 9075 3275 50  0001 C CNN
F 3 "" H 9075 3275 50  0001 C CNN
	1    9075 3275
	1    0    0    -1  
$EndComp
$EndSCHEMATC
