EESchema Schematic File Version 4
EELAYER 30 0
EELAYER END
$Descr A4 11693 8268
encoding utf-8
Sheet 1 1
Title "RF Power Detector II"
Date "2020-11-15"
Rev "1.0"
Comp "Dyadic Pty Ltd"
Comment1 "2020"
Comment2 ""
Comment3 ""
Comment4 ""
$EndDescr
$Comp
L project:ATTINY25_45_85-SSU IC1
U 1 1 5EF8BD07
P 9675 3350
F 0 "IC1" H 10500 3615 50  0000 C CNN
F 1 "ATTINY45-20XU" H 10500 3524 50  0000 C CNN
F 2 "Package_SO:TSSOP-8_4.4x3mm_P0.65mm" H 11025 3500 50  0001 C CNN
F 3 "" H 9675 3350 60  0000 C CNN
F 4 "Microchip Tech" H 9675 3350 50  0001 C CNN "MFN"
F 5 "ATTINY45-20XU" H 9675 3350 50  0001 C CNN "MFP"
F 6 "ATTINY45-20XU-ND" H 9675 3350 50  0001 C CNN "S1PN"
F 7 "Digi-Key" H 9675 3350 50  0001 C CNN "S1PL"
F 8 "556-ATTINY45-20XU" H 9675 3350 50  0001 C CNN "S2PN"
F 9 "Mouser" H 9675 3350 50  0001 C CNN "S2PL"
F 10 "MCU AVR 4K FLASH 256B EE & SRAM USI ADC" H 9675 3350 50  0001 C CNN "Description"
F 11 "TSSOP-8" H 9675 3350 50  0001 C CNN "Package ID"
	1    9675 3350
	-1   0    0    -1  
$EndComp
$Comp
L power:+3V3 #PWR04
U 1 1 5EF8CE67
P 3050 1800
F 0 "#PWR04" H 3050 1650 50  0001 C CNN
F 1 "+3V3" H 3065 1973 50  0000 C CNN
F 2 "" H 3050 1800 50  0001 C CNN
F 3 "" H 3050 1800 50  0001 C CNN
	1    3050 1800
	1    0    0    -1  
$EndComp
$Comp
L project:TPS71733 U2
U 1 1 5EF8D001
P 2075 2175
F 0 "U2" H 2075 2640 50  0000 C CNN
F 1 "TPS71733" H 2075 2549 50  0000 C CNN
F 2 "Package_TO_SOT_SMD:SOT-353_SC-70-5" H 2075 2175 50  0001 C CNN
F 3 "" H 2075 2175 50  0001 C CNN
F 4 "Texas Instruments" H 2075 2175 50  0001 C CNN "MFN"
F 5 "TPS71733DCKT" H 2075 2175 50  0001 C CNN "MFP"
F 6 "TPS71733DCKT" H 2075 2175 50  0001 C CNN "S1PN"
F 7 "Arrow" H 2075 2175 50  0001 C CNN "S1PL"
F 8 "595-TPS71733DCKT" H 2075 2175 50  0001 C CNN "S2PN"
F 9 "Mouser" H 2075 2175 50  0001 C CNN "S2PL"
F 10 "LDO Voltage Regulators Sgl Output LDO 150mA Fixed(3.3V) Hi PSRR" H 2075 2175 50  0001 C CNN "Description"
F 11 "SC70-5" H 2075 2175 50  0001 C CNN "Package ID"
	1    2075 2175
	1    0    0    -1  
$EndComp
$Comp
L project:SMA_2 J2
U 1 1 5EF8D132
P 1925 4925
F 0 "J2" H 1894 5165 50  0000 C CNN
F 1 "RFin" H 1894 5074 50  0000 C CNN
F 2 "SMA_Connectors:SMA_EDGE_4" H 2100 4825 50  0001 C CNN
F 3 "" H 1925 4925 60  0000 C CNN
	1    1925 4925
	-1   0    0    -1  
$EndComp
$Comp
L power:GND #PWR020
U 1 1 5EF8D1F9
P 1925 5100
F 0 "#PWR020" H 1925 4850 50  0001 C CNN
F 1 "GND" H 1930 4927 50  0000 C CNN
F 2 "" H 1925 5100 50  0001 C CNN
F 3 "" H 1925 5100 50  0001 C CNN
	1    1925 5100
	1    0    0    -1  
$EndComp
$Comp
L device:C C9
U 1 1 5EF8D228
P 4450 4925
F 0 "C9" V 4198 4925 50  0000 C CNN
F 1 "100p" V 4289 4925 50  0000 C CNN
F 2 "Capacitor_SMD:C_0402_1005Metric" H 4488 4775 50  0001 C CNN
F 3 "~" H 4450 4925 50  0001 C CNN
F 4 "Kemet" H 4450 4925 50  0001 C CNN "MFN"
F 5 "C0402C103K3RAC7411" H 4450 4925 50  0001 C CNN "MFP"
F 6 "80-C0402C103K3R7411" H 4450 4925 50  0001 C CNN "S1PN"
F 7 "Mouser" H 4450 4925 50  0001 C CNN "S1PL"
F 8 "Multilayer Ceramic Capacitors MLCC - SMD/SMT 25V 0.01uF X7R" H 4450 4925 50  0001 C CNN "Description"
F 9 "0402 (1005 metric)" H 4450 4925 50  0001 C CNN "Package ID"
	1    4450 4925
	0    1    1    0   
$EndComp
$Comp
L device:R R2
U 1 1 5EF8D287
P 4100 5200
F 0 "R2" H 4170 5246 50  0000 L CNN
F 1 "240" H 4170 5155 50  0000 L CNN
F 2 "Resistor_SMD:R_0402_1005Metric" V 4030 5200 50  0001 C CNN
F 3 "~" H 4100 5200 50  0001 C CNN
F 4 "Yageo" H 4100 5200 50  0001 C CNN "MFN"
F 5 "RC0402FR-07240RL" H 4100 5200 50  0001 C CNN "MFP"
F 6 "603-RC0402FR-07240RL" H 4100 5200 50  0001 C CNN "S1PN"
F 7 "Mouser" H 4100 5200 50  0001 C CNN "S1PL"
F 8 "311-240LRCT-ND" H 4100 5200 50  0001 C CNN "S2PN"
F 9 "Digi-Key" H 4100 5200 50  0001 C CNN "S2PL"
F 10 "240 Ohms ±1% 0.063W, 1/16W Chip Resistor " H 4100 5200 50  0001 C CNN "Description"
F 11 "0402 (1005 Metric)" H 4100 5200 50  0001 C CNN "Package ID"
	1    4100 5200
	1    0    0    -1  
$EndComp
Wire Wire Line
	4100 5050 4100 4925
$Comp
L power:GND #PWR024
U 1 1 5EF8DBB0
P 5675 5475
F 0 "#PWR024" H 5675 5225 50  0001 C CNN
F 1 "GND" H 5680 5302 50  0000 C CNN
F 2 "" H 5675 5475 50  0001 C CNN
F 3 "" H 5675 5475 50  0001 C CNN
	1    5675 5475
	1    0    0    -1  
$EndComp
$Comp
L power:GND #PWR022
U 1 1 5EF8DC23
P 6425 5050
F 0 "#PWR022" H 6425 4800 50  0001 C CNN
F 1 "GND" H 6430 4877 50  0000 C CNN
F 2 "" H 6425 5050 50  0001 C CNN
F 3 "" H 6425 5050 50  0001 C CNN
	1    6425 5050
	1    0    0    -1  
$EndComp
Wire Wire Line
	7675 3750 6975 3750
Wire Wire Line
	6975 3750 6975 4175
$Comp
L device:C C13
U 1 1 5EF8E658
P 5675 5925
F 0 "C13" V 5600 6000 50  0000 L CNN
F 1 "33n" V 5750 5725 50  0000 L CNN
F 2 "Capacitor_SMD:C_0402_1005Metric" H 5713 5775 50  0001 C CNN
F 3 "~" H 5675 5925 50  0001 C CNN
	1    5675 5925
	0    1    1    0   
$EndComp
$Comp
L device:R R4
U 1 1 5EF8E83E
P 6975 5175
F 0 "R4" H 7045 5221 50  0000 L CNN
F 1 "33k" H 7045 5130 50  0000 L CNN
F 2 "Resistor_SMD:R_0402_1005Metric" V 6905 5175 50  0001 C CNN
F 3 "~" H 6975 5175 50  0001 C CNN
F 4 "Yageo" H 6975 5175 50  0001 C CNN "MFN"
F 5 "RC0402FR-070RL" H 6975 5175 50  0001 C CNN "MFP"
F 6 "311-0.0LRCT-ND" H 6975 5175 50  0001 C CNN "S1PN"
F 7 "Digi-Key" H 6975 5175 50  0001 C CNN "S1PL"
F 8 "603-RC0402FR-070RL" H 6975 5175 50  0001 C CNN "S2PN"
F 9 "Mouser" H 6975 5175 50  0001 C CNN "S2PL"
F 10 "0 Ohms Jumper 0.063W, 1/16W Chip Resistor" H 6975 5175 50  0001 C CNN "Description"
F 11 "0402 (1005 Metric)" H 6975 5175 50  0001 C CNN "Package ID"
	1    6975 5175
	1    0    0    -1  
$EndComp
Wire Wire Line
	6975 4775 6975 5025
$Comp
L power:GND #PWR028
U 1 1 5EF8EEBD
P 6975 5325
F 0 "#PWR028" H 6975 5075 50  0001 C CNN
F 1 "GND" H 6980 5152 50  0000 C CNN
F 2 "" H 6975 5325 50  0001 C CNN
F 3 "" H 6975 5325 50  0001 C CNN
	1    6975 5325
	1    0    0    -1  
$EndComp
$Comp
L device:C C4
U 1 1 5EF8F2BA
P 1175 2250
F 0 "C4" H 1290 2296 50  0000 L CNN
F 1 "1.0u" H 1290 2205 50  0000 L CNN
F 2 "Capacitor_SMD:C_0603_1608Metric" H 1213 2100 50  0001 C CNN
F 3 "~" H 1175 2250 50  0001 C CNN
F 4 "Kemet" H 1175 2250 50  0001 C CNN "MFN"
F 5 "CC0603KRX5R8BB105" H 1175 2250 50  0001 C CNN "MFP"
F 6 "311-1445-1-ND" H 1175 2250 50  0001 C CNN "S1PN"
F 7 "Digi-Key" H 1175 2250 50  0001 C CNN "S1PL"
F 8 "603-CC603KRX5R8BB105" H 1175 2250 50  0001 C CNN "S2PN"
F 9 "Mouser" H 1175 2250 50  0001 C CNN "S2PL"
F 10 "1µF ±10% 25V Ceramic Capacitor X5R" H 1175 2250 50  0001 C CNN "Description"
F 11 "0603 (1608 metric)" H 1175 2250 50  0001 C CNN "Package ID"
	1    1175 2250
	1    0    0    -1  
$EndComp
$Comp
L device:C C6
U 1 1 5EF8F339
P 2625 2525
F 0 "C6" H 2740 2571 50  0000 L CNN
F 1 "0.1u" H 2740 2480 50  0000 L CNN
F 2 "Capacitor_SMD:C_0603_1608Metric" H 2663 2375 50  0001 C CNN
F 3 "~" H 2625 2525 50  0001 C CNN
F 4 "Kemet" H 2625 2525 50  0001 C CNN "MFN"
F 5 "C0603C104K5RACTU" H 2625 2525 50  0001 C CNN "MFP"
F 6 "399-5089-1-ND" H 2625 2525 50  0001 C CNN "S1PN"
F 7 "Digi-Key" H 2625 2525 50  0001 C CNN "S1PL"
F 8 "C0603C104K5RACTU" H 2625 2525 50  0001 C CNN "S2PN"
F 9 "Arrow" H 2625 2525 50  0001 C CNN "S2PL"
F 10 "0.10µF 50V Ceramic Capacitor X7R" H 2625 2525 50  0001 C CNN "Description"
F 11 "0603 (1608 Metric)" H 2625 2525 50  0001 C CNN "Package ID"
	1    2625 2525
	1    0    0    -1  
$EndComp
$Comp
L power:+5V #PWR05
U 1 1 5EF8F56E
P 1175 1825
F 0 "#PWR05" H 1175 1675 50  0001 C CNN
F 1 "+5V" H 1190 1998 50  0000 C CNN
F 2 "" H 1175 1825 50  0001 C CNN
F 3 "" H 1175 1825 50  0001 C CNN
	1    1175 1825
	1    0    0    -1  
$EndComp
Wire Wire Line
	1175 1825 1175 1975
Wire Wire Line
	1625 1975 1525 1975
Connection ~ 1175 1975
Wire Wire Line
	1175 1975 1175 2100
Wire Wire Line
	1625 2175 1525 2175
Wire Wire Line
	1525 2175 1525 1975
Connection ~ 1525 1975
Wire Wire Line
	1525 1975 1175 1975
Wire Wire Line
	2525 2175 2625 2175
Wire Wire Line
	2625 2175 2625 2375
Wire Wire Line
	2525 1975 3050 1975
Wire Wire Line
	3050 1975 3050 2075
$Comp
L power:GND #PWR015
U 1 1 5EF90951
P 2625 2675
F 0 "#PWR015" H 2625 2425 50  0001 C CNN
F 1 "GND" H 2630 2502 50  0000 C CNN
F 2 "" H 2625 2675 50  0001 C CNN
F 3 "" H 2625 2675 50  0001 C CNN
	1    2625 2675
	1    0    0    -1  
$EndComp
$Comp
L power:GND #PWR010
U 1 1 5EF90986
P 3050 2375
F 0 "#PWR010" H 3050 2125 50  0001 C CNN
F 1 "GND" H 3055 2202 50  0000 C CNN
F 2 "" H 3050 2375 50  0001 C CNN
F 3 "" H 3050 2375 50  0001 C CNN
	1    3050 2375
	1    0    0    -1  
$EndComp
$Comp
L power:GND #PWR013
U 1 1 5EF91A15
P 2075 2525
F 0 "#PWR013" H 2075 2275 50  0001 C CNN
F 1 "GND" H 2080 2352 50  0000 C CNN
F 2 "" H 2075 2525 50  0001 C CNN
F 3 "" H 2075 2525 50  0001 C CNN
	1    2075 2525
	1    0    0    -1  
$EndComp
$Comp
L power:GND #PWR011
U 1 1 5EF91A4A
P 1175 2400
F 0 "#PWR011" H 1175 2150 50  0001 C CNN
F 1 "GND" H 1180 2227 50  0000 C CNN
F 2 "" H 1175 2400 50  0001 C CNN
F 3 "" H 1175 2400 50  0001 C CNN
	1    1175 2400
	1    0    0    -1  
$EndComp
Wire Wire Line
	3050 1800 3050 1975
Connection ~ 3050 1975
$Comp
L power:+5V #PWR03
U 1 1 5EF92501
P 3950 1775
F 0 "#PWR03" H 3950 1625 50  0001 C CNN
F 1 "+5V" H 3965 1948 50  0000 C CNN
F 2 "" H 3950 1775 50  0001 C CNN
F 3 "" H 3950 1775 50  0001 C CNN
	1    3950 1775
	1    0    0    -1  
$EndComp
Wire Wire Line
	3950 1775 3950 1925
Wire Wire Line
	4400 1925 4300 1925
Connection ~ 3950 1925
Wire Wire Line
	3950 1925 3950 2050
Wire Wire Line
	4400 2125 4300 2125
Wire Wire Line
	4300 2125 4300 1925
Connection ~ 4300 1925
Wire Wire Line
	4300 1925 3950 1925
Wire Wire Line
	5300 2125 5400 2125
Wire Wire Line
	5400 2125 5400 2325
Wire Wire Line
	5300 1925 5825 1925
Wire Wire Line
	5825 1925 5825 2025
$Comp
L power:GND #PWR014
U 1 1 5EF92513
P 5400 2625
F 0 "#PWR014" H 5400 2375 50  0001 C CNN
F 1 "GND" H 5405 2452 50  0000 C CNN
F 2 "" H 5400 2625 50  0001 C CNN
F 3 "" H 5400 2625 50  0001 C CNN
	1    5400 2625
	1    0    0    -1  
$EndComp
$Comp
L power:GND #PWR07
U 1 1 5EF92519
P 5825 2325
F 0 "#PWR07" H 5825 2075 50  0001 C CNN
F 1 "GND" H 5830 2152 50  0000 C CNN
F 2 "" H 5825 2325 50  0001 C CNN
F 3 "" H 5825 2325 50  0001 C CNN
	1    5825 2325
	1    0    0    -1  
$EndComp
$Comp
L power:GND #PWR012
U 1 1 5EF9251F
P 4850 2475
F 0 "#PWR012" H 4850 2225 50  0001 C CNN
F 1 "GND" H 4855 2302 50  0000 C CNN
F 2 "" H 4850 2475 50  0001 C CNN
F 3 "" H 4850 2475 50  0001 C CNN
	1    4850 2475
	1    0    0    -1  
$EndComp
$Comp
L power:GND #PWR08
U 1 1 5EF92525
P 3950 2350
F 0 "#PWR08" H 3950 2100 50  0001 C CNN
F 1 "GND" H 3955 2177 50  0000 C CNN
F 2 "" H 3950 2350 50  0001 C CNN
F 3 "" H 3950 2350 50  0001 C CNN
	1    3950 2350
	1    0    0    -1  
$EndComp
Wire Wire Line
	5825 1750 5825 1925
Connection ~ 5825 1925
$Comp
L power:VDD #PWR02
U 1 1 5EF92FEC
P 5825 1750
F 0 "#PWR02" H 5825 1600 50  0001 C CNN
F 1 "VDD" H 5842 1923 50  0000 C CNN
F 2 "" H 5825 1750 50  0001 C CNN
F 3 "" H 5825 1750 50  0001 C CNN
	1    5825 1750
	1    0    0    -1  
$EndComp
$Comp
L power:+3V3 #PWR019
U 1 1 5EF94CB4
P 3950 3450
F 0 "#PWR019" H 3950 3300 50  0001 C CNN
F 1 "+3V3" H 3965 3623 50  0000 C CNN
F 2 "" H 3950 3450 50  0001 C CNN
F 3 "" H 3950 3450 50  0001 C CNN
	1    3950 3450
	1    0    0    -1  
$EndComp
$Comp
L power:VDD #PWR09
U 1 1 5EF94CEF
P 10175 3250
F 0 "#PWR09" H 10175 3100 50  0001 C CNN
F 1 "VDD" H 10192 3423 50  0000 C CNN
F 2 "" H 10175 3250 50  0001 C CNN
F 3 "" H 10175 3250 50  0001 C CNN
	1    10175 3250
	1    0    0    -1  
$EndComp
$Comp
L power:GND #PWR017
U 1 1 5EF94E78
P 10175 4075
F 0 "#PWR017" H 10175 3825 50  0001 C CNN
F 1 "GND" H 10180 3902 50  0000 C CNN
F 2 "" H 10175 4075 50  0001 C CNN
F 3 "" H 10175 4075 50  0001 C CNN
	1    10175 4075
	1    0    0    -1  
$EndComp
Wire Wire Line
	10025 3450 10175 3450
Wire Wire Line
	10175 3450 10175 3250
Wire Wire Line
	10025 3950 10175 3950
Wire Wire Line
	10175 3950 10175 4075
$Comp
L device:C C3
U 1 1 5EF96CD3
P 3050 2225
F 0 "C3" H 3165 2271 50  0000 L CNN
F 1 "1.0u" H 3165 2180 50  0000 L CNN
F 2 "Capacitor_SMD:C_0603_1608Metric" H 3088 2075 50  0001 C CNN
F 3 "~" H 3050 2225 50  0001 C CNN
F 4 "Kemet" H 3050 2225 50  0001 C CNN "MFN"
F 5 "CC0603KRX5R8BB105" H 3050 2225 50  0001 C CNN "MFP"
F 6 "311-1445-1-ND" H 3050 2225 50  0001 C CNN "S1PN"
F 7 "Digi-Key" H 3050 2225 50  0001 C CNN "S1PL"
F 8 "603-CC603KRX5R8BB105" H 3050 2225 50  0001 C CNN "S2PN"
F 9 "Mouser" H 3050 2225 50  0001 C CNN "S2PL"
F 10 "1µF ±10% 25V Ceramic Capacitor X5R" H 3050 2225 50  0001 C CNN "Description"
F 11 "0603 (1608 metric)" H 3050 2225 50  0001 C CNN "Package ID"
	1    3050 2225
	1    0    0    -1  
$EndComp
$Comp
L device:C C2
U 1 1 5EF9894E
P 3950 2200
F 0 "C2" H 4065 2246 50  0000 L CNN
F 1 "1.0u" H 4065 2155 50  0000 L CNN
F 2 "Capacitor_SMD:C_0603_1608Metric" H 3988 2050 50  0001 C CNN
F 3 "~" H 3950 2200 50  0001 C CNN
F 4 "Kemet" H 3950 2200 50  0001 C CNN "MFN"
F 5 "CC0603KRX5R8BB105" H 3950 2200 50  0001 C CNN "MFP"
F 6 "311-1445-1-ND" H 3950 2200 50  0001 C CNN "S1PN"
F 7 "Digi-Key" H 3950 2200 50  0001 C CNN "S1PL"
F 8 "603-CC603KRX5R8BB105" H 3950 2200 50  0001 C CNN "S2PN"
F 9 "Mouser" H 3950 2200 50  0001 C CNN "S2PL"
F 10 "1µF ±10% 25V Ceramic Capacitor X5R" H 3950 2200 50  0001 C CNN "Description"
F 11 "0603 (1608 metric)" H 3950 2200 50  0001 C CNN "Package ID"
	1    3950 2200
	1    0    0    -1  
$EndComp
$Comp
L device:C C1
U 1 1 5EF989BA
P 5825 2175
F 0 "C1" H 5940 2221 50  0000 L CNN
F 1 "1.0u" H 5940 2130 50  0000 L CNN
F 2 "Capacitor_SMD:C_0603_1608Metric" H 5863 2025 50  0001 C CNN
F 3 "~" H 5825 2175 50  0001 C CNN
F 4 "Kemet" H 5825 2175 50  0001 C CNN "MFN"
F 5 "CC0603KRX5R8BB105" H 5825 2175 50  0001 C CNN "MFP"
F 6 "311-1445-1-ND" H 5825 2175 50  0001 C CNN "S1PN"
F 7 "Digi-Key" H 5825 2175 50  0001 C CNN "S1PL"
F 8 "603-CC603KRX5R8BB105" H 5825 2175 50  0001 C CNN "S2PN"
F 9 "Mouser" H 5825 2175 50  0001 C CNN "S2PL"
F 10 "1µF ±10% 25V Ceramic Capacitor X5R" H 5825 2175 50  0001 C CNN "Description"
F 11 "0603 (1608 metric)" H 5825 2175 50  0001 C CNN "Package ID"
	1    5825 2175
	1    0    0    -1  
$EndComp
$Comp
L device:C C5
U 1 1 5EF99B35
P 5400 2475
F 0 "C5" H 5515 2521 50  0000 L CNN
F 1 "0.1u" H 5515 2430 50  0000 L CNN
F 2 "Capacitor_SMD:C_0603_1608Metric" H 5438 2325 50  0001 C CNN
F 3 "~" H 5400 2475 50  0001 C CNN
F 4 "Kemet" H 5400 2475 50  0001 C CNN "MFN"
F 5 "C0603C104K5RACTU" H 5400 2475 50  0001 C CNN "MFP"
F 6 "399-5089-1-ND" H 5400 2475 50  0001 C CNN "S1PN"
F 7 "Digi-Key" H 5400 2475 50  0001 C CNN "S1PL"
F 8 "C0603C104K5RACTU" H 5400 2475 50  0001 C CNN "S2PN"
F 9 "Arrow" H 5400 2475 50  0001 C CNN "S2PL"
F 10 "0.10µF 50V Ceramic Capacitor X7R" H 5400 2475 50  0001 C CNN "Description"
F 11 "0603 (1608 Metric)" H 5400 2475 50  0001 C CNN "Package ID"
	1    5400 2475
	1    0    0    -1  
$EndComp
$Comp
L project:TPS71733 U1
U 1 1 5EF9CACF
P 4850 2125
F 0 "U1" H 4850 2590 50  0000 C CNN
F 1 "TPS71733" H 4850 2499 50  0000 C CNN
F 2 "Package_TO_SOT_SMD:SOT-353_SC-70-5" H 4850 2125 50  0001 C CNN
F 3 "" H 4850 2125 50  0001 C CNN
F 4 "Texas Instruments" H 4850 2125 50  0001 C CNN "MFN"
F 5 "TPS71733DCKT" H 4850 2125 50  0001 C CNN "MFP"
F 6 "TPS71733DCKT" H 4850 2125 50  0001 C CNN "S1PN"
F 7 "Arrow" H 4850 2125 50  0001 C CNN "S1PL"
F 8 "595-TPS71733DCKT" H 4850 2125 50  0001 C CNN "S2PN"
F 9 "Mouser" H 4850 2125 50  0001 C CNN "S2PL"
F 10 "LDO Voltage Regulators Sgl Output LDO 150mA Fixed(3.3V) Hi PSRR" H 4850 2125 50  0001 C CNN "Description"
F 11 "SC70-5" H 4850 2125 50  0001 C CNN "Package ID"
	1    4850 2125
	1    0    0    -1  
$EndComp
$Comp
L project:SMA_2 J3
U 1 1 5EF9FB2A
P 9750 4775
F 0 "J3" H 9719 5015 50  0000 C CNN
F 1 "Vout" H 9719 4924 50  0000 C CNN
F 2 "MMCX_Connectors:mmcx_th" H 9925 4675 50  0001 C CNN
F 3 "" H 9750 4775 60  0000 C CNN
	1    9750 4775
	1    0    0    -1  
$EndComp
$Comp
L power:GND #PWR023
U 1 1 5EFA099C
P 9750 4950
F 0 "#PWR023" H 9750 4700 50  0001 C CNN
F 1 "GND" H 9755 4777 50  0000 C CNN
F 2 "" H 9750 4950 50  0001 C CNN
F 3 "" H 9750 4950 50  0001 C CNN
	1    9750 4950
	1    0    0    -1  
$EndComp
Wire Wire Line
	9625 4775 9200 4775
$Comp
L connector_generic:Conn_02x04_Counter_Clockwise J1
U 1 1 5EFA60E7
P 8775 2600
F 0 "J1" H 8825 2917 50  0000 C CNN
F 1 "ICSP" H 8825 2826 50  0000 C CNN
F 2 "Connector_PinHeader_2.54mm:PinHeader_2x04_P2.54mm_Vertical" H 8775 2600 50  0001 C CNN
F 3 "~" H 8775 2600 50  0001 C CNN
	1    8775 2600
	1    0    0    -1  
$EndComp
$Comp
L power:VDD #PWR01
U 1 1 5EFA64AB
P 9500 2300
F 0 "#PWR01" H 9500 2150 50  0001 C CNN
F 1 "VDD" H 9517 2473 50  0000 C CNN
F 2 "" H 9500 2300 50  0001 C CNN
F 3 "" H 9500 2300 50  0001 C CNN
	1    9500 2300
	1    0    0    -1  
$EndComp
Wire Wire Line
	9075 2600 9500 2600
Wire Wire Line
	9500 2600 9500 2300
$Comp
L power:GND #PWR06
U 1 1 5EFA73E1
P 9650 2775
F 0 "#PWR06" H 9650 2525 50  0001 C CNN
F 1 "GND" H 9655 2602 50  0000 C CNN
F 2 "" H 9650 2775 50  0001 C CNN
F 3 "" H 9650 2775 50  0001 C CNN
	1    9650 2775
	1    0    0    -1  
$EndComp
Wire Wire Line
	9075 2500 9650 2500
Wire Wire Line
	9650 2500 9650 2775
Wire Wire Line
	7675 3350 7325 3350
Wire Wire Line
	7325 3350 7325 2700
Wire Wire Line
	7675 3450 7200 3450
Wire Wire Line
	7200 3450 7200 2600
Wire Wire Line
	7675 3950 7075 3950
Wire Wire Line
	7075 3950 7075 2500
Wire Wire Line
	7075 2500 8575 2500
Wire Wire Line
	7675 3550 7575 3550
Wire Wire Line
	7575 3550 7575 2900
Wire Wire Line
	9225 2900 9225 2700
Wire Wire Line
	9225 2700 9075 2700
$Comp
L device:C C7
U 1 1 5EFB9132
P 10350 3700
F 0 "C7" H 10465 3746 50  0000 L CNN
F 1 "0.1u" H 10465 3655 50  0000 L CNN
F 2 "Capacitor_SMD:C_0603_1608Metric" H 10388 3550 50  0001 C CNN
F 3 "~" H 10350 3700 50  0001 C CNN
F 4 "Kemet" H 10350 3700 50  0001 C CNN "MFN"
F 5 "C0603C104K5RACTU" H 10350 3700 50  0001 C CNN "MFP"
F 6 "399-5089-1-ND" H 10350 3700 50  0001 C CNN "S1PN"
F 7 "Digi-Key" H 10350 3700 50  0001 C CNN "S1PL"
F 8 "C0603C104K5RACTU" H 10350 3700 50  0001 C CNN "S2PN"
F 9 "Arrow" H 10350 3700 50  0001 C CNN "S2PL"
F 10 "0.10µF 50V Ceramic Capacitor X7R" H 10350 3700 50  0001 C CNN "Description"
F 11 "0603 (1608 Metric)" H 10350 3700 50  0001 C CNN "Package ID"
	1    10350 3700
	1    0    0    -1  
$EndComp
Wire Wire Line
	10350 3550 10350 3450
Wire Wire Line
	10350 3450 10175 3450
Connection ~ 10175 3450
$Comp
L power:GND #PWR016
U 1 1 5EFBA98E
P 10350 3850
F 0 "#PWR016" H 10350 3600 50  0001 C CNN
F 1 "GND" H 10355 3677 50  0000 C CNN
F 2 "" H 10350 3850 50  0001 C CNN
F 3 "" H 10350 3850 50  0001 C CNN
	1    10350 3850
	1    0    0    -1  
$EndComp
$Comp
L device:C C16
U 1 1 5EFC40DD
P 5050 3850
F 0 "C16" H 5165 3896 50  0000 L CNN
F 1 "1n" H 5165 3805 50  0000 L CNN
F 2 "Capacitor_SMD:C_0402_1005Metric" H 5088 3700 50  0001 C CNN
F 3 "~" H 5050 3850 50  0001 C CNN
F 4 "AVX" H 5050 3850 50  0001 C CNN "MFN"
F 5 "04025C102KAT2A" H 5050 3850 50  0001 C CNN "MFP"
F 6 "478-1101-1-ND" H 5050 3850 50  0001 C CNN "S1PN"
F 7 "Digi-Key" H 5050 3850 50  0001 C CNN "S1PL"
F 8 "581-04025C102K" H 5050 3850 50  0001 C CNN "S2PN"
F 9 "Mouser" H 5050 3850 50  0001 C CNN "S2PL"
F 10 "1000pF ±10% 50V Ceramic Capacitor X7R" H 5050 3850 50  0001 C CNN "Description"
F 11 "0402 (1005 Metric)" H 5050 3850 50  0001 C CNN "Package ID"
	1    5050 3850
	1    0    0    -1  
$EndComp
$Comp
L device:C C14
U 1 1 5EFC4151
P 4600 3850
F 0 "C14" H 4715 3896 50  0000 L CNN
F 1 "1.0u" H 4715 3805 50  0000 L CNN
F 2 "Capacitor_SMD:C_0402_1005Metric" H 4638 3700 50  0001 C CNN
F 3 "~" H 4600 3850 50  0001 C CNN
F 4 "Kemet" H 4600 3850 50  0001 C CNN "MFN"
F 5 "C0402C105K4PAC7867" H 4600 3850 50  0001 C CNN "MFP"
F 6 "399-12289-1-ND" H 4600 3850 50  0001 C CNN "S1PN"
F 7 "Digi-Key" H 4600 3850 50  0001 C CNN "S1PL"
F 8 "80-C0402C105K4P" H 4600 3850 50  0001 C CNN "S2PN"
F 9 "Mouser" H 4600 3850 50  0001 C CNN "S2PL"
F 10 "1µF ±10% 16V Ceramic Capacitor X5R" H 4600 3850 50  0001 C CNN "Description"
F 11 "0402 (1005 Metric)" H 4600 3850 50  0001 C CNN "Package ID"
	1    4600 3850
	1    0    0    -1  
$EndComp
$Comp
L device:R R7
U 1 1 5EFC422A
P 4250 3600
F 0 "R7" V 4150 3550 50  0000 L CNN
F 1 "1.5" V 4350 3550 50  0000 L CNN
F 2 "Resistor_SMD:R_0402_1005Metric" V 4180 3600 50  0001 C CNN
F 3 "~" H 4250 3600 50  0001 C CNN
F 4 "Yageo" H 4250 3600 50  0001 C CNN "MFN"
F 5 "RC0402FR-071R5L" H 4250 3600 50  0001 C CNN "MFP"
F 6 "603-RC0402FR-071R5L" H 4250 3600 50  0001 C CNN "S1PN"
F 7 "Mouser" H 4250 3600 50  0001 C CNN "S1PL"
F 8 "311-1.50LRCT-ND" H 4250 3600 50  0001 C CNN "S2PN"
F 9 "Digi-Key" H 4250 3600 50  0001 C CNN "S2PL"
F 10 "1.5 Ohms ±1% 0.063W, 1/16W Chip Resistor" H 4250 3600 50  0001 C CNN "Description"
F 11 "0402 (1005 Metric)" H 4250 3600 50  0001 C CNN "Package ID"
	1    4250 3600
	0    1    1    0   
$EndComp
Wire Wire Line
	4100 3600 3950 3600
Wire Wire Line
	3950 3600 3950 3450
Wire Wire Line
	4600 3700 4600 3600
Wire Wire Line
	4600 3600 4400 3600
Wire Wire Line
	5050 3700 5050 3600
$Comp
L power:GND #PWR031
U 1 1 5EFCCA2A
P 4600 4000
F 0 "#PWR031" H 4600 3750 50  0001 C CNN
F 1 "GND" H 4605 3827 50  0000 C CNN
F 2 "" H 4600 4000 50  0001 C CNN
F 3 "" H 4600 4000 50  0001 C CNN
	1    4600 4000
	1    0    0    -1  
$EndComp
$Comp
L power:GND #PWR033
U 1 1 5EFCCAB8
P 5050 4000
F 0 "#PWR033" H 5050 3750 50  0001 C CNN
F 1 "GND" H 5055 3827 50  0000 C CNN
F 2 "" H 5050 4000 50  0001 C CNN
F 3 "" H 5050 4000 50  0001 C CNN
	1    5050 4000
	1    0    0    -1  
$EndComp
Wire Wire Line
	4600 3600 5050 3600
Connection ~ 4600 3600
Connection ~ 5050 3600
$Comp
L device:R R3
U 1 1 5EFDB756
P 9050 4775
F 0 "R3" V 8950 4725 50  0000 L CNN
F 1 "0" V 9150 4750 50  0000 L CNN
F 2 "Resistor_SMD:R_0402_1005Metric" V 8980 4775 50  0001 C CNN
F 3 "~" H 9050 4775 50  0001 C CNN
F 4 "Yageo" H 9050 4775 50  0001 C CNN "MFN"
F 5 "RC0402FR-070RL" H 9050 4775 50  0001 C CNN "MFP"
F 6 "311-0.0LRCT-ND" H 9050 4775 50  0001 C CNN "S1PN"
F 7 "Digi-Key" H 9050 4775 50  0001 C CNN "S1PL"
F 8 "603-RC0402FR-070RL" H 9050 4775 50  0001 C CNN "S2PN"
F 9 "Mouser" H 9050 4775 50  0001 C CNN "S2PL"
F 10 "0 Ohms Jumper 0.063W, 1/16W Chip Resistor" H 9050 4775 50  0001 C CNN "Description"
F 11 "0402 (1005 Metric)" H 9050 4775 50  0001 C CNN "Package ID"
	1    9050 4775
	0    1    1    0   
$EndComp
$Comp
L device:R R1
U 1 1 5EFDD69A
P 6975 4325
F 0 "R1" H 7045 4371 50  0000 L CNN
F 1 "0" H 7045 4280 50  0000 L CNN
F 2 "Resistor_SMD:R_0402_1005Metric" V 6905 4325 50  0001 C CNN
F 3 "~" H 6975 4325 50  0001 C CNN
F 4 "Yageo" H 6975 4325 50  0001 C CNN "MFN"
F 5 "RC0402FR-070RL" H 6975 4325 50  0001 C CNN "MFP"
F 6 "311-0.0LRCT-ND" H 6975 4325 50  0001 C CNN "S1PN"
F 7 "Digi-Key" H 6975 4325 50  0001 C CNN "S1PL"
F 8 "603-RC0402FR-070RL" H 6975 4325 50  0001 C CNN "S2PN"
F 9 "Mouser" H 6975 4325 50  0001 C CNN "S2PL"
F 10 "0 Ohms Jumper 0.063W, 1/16W Chip Resistor" H 6975 4325 50  0001 C CNN "Description"
F 11 "0402 (1005 Metric)" H 6975 4325 50  0001 C CNN "Package ID"
	1    6975 4325
	1    0    0    -1  
$EndComp
$Comp
L power:+5V #PWR0101
U 1 1 5EFE1481
P 2550 1000
F 0 "#PWR0101" H 2550 850 50  0001 C CNN
F 1 "+5V" H 2565 1173 50  0000 C CNN
F 2 "" H 2550 1000 50  0001 C CNN
F 3 "" H 2550 1000 50  0001 C CNN
	1    2550 1000
	1    0    0    -1  
$EndComp
$Comp
L power:GND #PWR0102
U 1 1 5EFE314E
P 2550 1300
F 0 "#PWR0102" H 2550 1050 50  0001 C CNN
F 1 "GND" H 2555 1127 50  0000 C CNN
F 2 "" H 2550 1300 50  0001 C CNN
F 3 "" H 2550 1300 50  0001 C CNN
	1    2550 1300
	1    0    0    -1  
$EndComp
$Comp
L power:PWR_FLAG #FLG0101
U 1 1 5EFEDB95
P 5350 3600
F 0 "#FLG0101" H 5350 3675 50  0001 C CNN
F 1 "PWR_FLAG" H 5350 3774 50  0000 C CNN
F 2 "" H 5350 3600 50  0001 C CNN
F 3 "~" H 5350 3600 50  0001 C CNN
	1    5350 3600
	1    0    0    -1  
$EndComp
Connection ~ 5350 3600
Wire Wire Line
	5350 3600 5050 3600
$Comp
L power:PWR_FLAG #FLG0102
U 1 1 5EFF0511
P 2200 1200
F 0 "#FLG0102" H 2200 1275 50  0001 C CNN
F 1 "PWR_FLAG" H 2200 1374 50  0000 C CNN
F 2 "" H 2200 1200 50  0001 C CNN
F 3 "~" H 2200 1200 50  0001 C CNN
	1    2200 1200
	-1   0    0    1   
$EndComp
$Comp
L power:PWR_FLAG #FLG0103
U 1 1 5EFF308F
P 2200 1100
F 0 "#FLG0103" H 2200 1175 50  0001 C CNN
F 1 "PWR_FLAG" H 2200 1274 50  0000 C CNN
F 2 "" H 2200 1100 50  0001 C CNN
F 3 "~" H 2200 1100 50  0001 C CNN
	1    2200 1100
	1    0    0    -1  
$EndComp
$Comp
L connector:Conn_01x02_Male J4
U 1 1 5EFFAE8D
P 1825 1100
F 0 "J4" H 1750 1275 50  0000 C CNN
F 1 "Pwr" H 1750 1200 50  0000 C CNN
F 2 "Connector_PinHeader_2.54mm:PinHeader_1x02_P2.54mm_Vertical" H 1825 1100 50  0001 C CNN
F 3 "~" H 1825 1100 50  0001 C CNN
	1    1825 1100
	1    0    0    -1  
$EndComp
Wire Wire Line
	7575 2900 9225 2900
Wire Wire Line
	7200 2600 8575 2600
Wire Wire Line
	7325 2700 8575 2700
Wire Wire Line
	2025 1100 2200 1100
Wire Wire Line
	2550 1100 2550 1000
Connection ~ 2200 1100
Wire Wire Line
	2200 1100 2550 1100
Wire Wire Line
	2025 1200 2200 1200
Wire Wire Line
	2550 1200 2550 1300
Connection ~ 2200 1200
Wire Wire Line
	2200 1200 2550 1200
$Comp
L project:rfi_shield_clip P1
U 1 1 5F03EB7E
P 7800 1250
F 0 "P1" H 7928 1322 60  0000 L CNN
F 1 "rfi_shield_clip" H 7928 1216 60  0000 L CNN
F 2 "RF_Shielding:S1721-46R" H 7800 1250 60  0001 C CNN
F 3 "" H 7800 1250 60  0000 C CNN
	1    7800 1250
	1    0    0    -1  
$EndComp
$Comp
L project:rfi_shield_clip P2
U 1 1 5F03EC3D
P 8850 1250
F 0 "P2" H 8978 1322 60  0000 L CNN
F 1 "rfi_shield_clip" H 8978 1216 60  0000 L CNN
F 2 "RF_Shielding:S1721-46R" H 8850 1250 60  0001 C CNN
F 3 "" H 8850 1250 60  0000 C CNN
	1    8850 1250
	1    0    0    -1  
$EndComp
$Comp
L power:GND #PWR032
U 1 1 5F03ECAB
P 7800 1350
F 0 "#PWR032" H 7800 1100 50  0001 C CNN
F 1 "GND" H 7805 1177 50  0000 C CNN
F 2 "" H 7800 1350 50  0001 C CNN
F 3 "" H 7800 1350 50  0001 C CNN
	1    7800 1350
	1    0    0    -1  
$EndComp
$Comp
L power:GND #PWR034
U 1 1 5F03EDB6
P 8850 1350
F 0 "#PWR034" H 8850 1100 50  0001 C CNN
F 1 "GND" H 8855 1177 50  0000 C CNN
F 2 "" H 8850 1350 50  0001 C CNN
F 3 "" H 8850 1350 50  0001 C CNN
	1    8850 1350
	1    0    0    -1  
$EndComp
Wire Wire Line
	7675 3850 7450 3850
Wire Wire Line
	7450 3850 7450 2800
Wire Wire Line
	7450 2800 8575 2800
NoConn ~ 9075 2800
$Comp
L project:LT5537 U3
U 1 1 5FB7B2E4
P 5675 4975
F 0 "U3" H 5675 5512 60  0000 C CNN
F 1 "LT5537" H 5675 5406 60  0000 C CNN
F 2 "Package_DFN_QFN:DFN-8-1EP_2x3mm_P0.5mm_EP0.61x2.2mm" H 5800 4625 60  0001 C CNN
F 3 "" H 5800 4625 60  0001 C CNN
F 4 "Linear Tech" H 5675 4975 50  0001 C CNN "MFN"
F 5 "LT5537EDDB" H 5675 4975 50  0001 C CNN "MFP"
F 6 "584-LT5537EDDBTRMPBF" H 5675 4975 50  0001 C CNN "S1PN"
F 7 "Mouser" H 5675 4975 50  0001 C CNN "S1PL"
F 8 "RF Detector Wide Dynamic Range RF Log Detector " H 5675 4975 50  0001 C CNN "Description"
F 9 "LT5537EDDB#TRMPBFCT-ND" H 5675 4975 50  0001 C CNN "S2PN"
F 10 "Digi-Key" H 5675 4975 50  0001 C CNN "S2PL"
	1    5675 4975
	1    0    0    -1  
$EndComp
Wire Wire Line
	6075 4775 6975 4775
Wire Wire Line
	6975 4475 6975 4775
Connection ~ 6975 4775
Wire Wire Line
	6975 4775 8900 4775
Wire Wire Line
	6075 5075 6250 5075
Wire Wire Line
	6250 5075 6250 4275
Wire Wire Line
	5350 3600 6250 3600
Wire Wire Line
	6075 4925 6425 4925
Wire Wire Line
	6425 4925 6425 5050
Wire Wire Line
	6075 5225 6250 5225
Wire Wire Line
	6250 5225 6250 5925
Wire Wire Line
	6250 5925 5825 5925
Wire Wire Line
	4100 5350 4100 5475
$Comp
L device:C C8
U 1 1 5FBD61F2
P 4475 5475
F 0 "C8" V 4223 5475 50  0000 C CNN
F 1 "100p" V 4314 5475 50  0000 C CNN
F 2 "Capacitor_SMD:C_0402_1005Metric" H 4513 5325 50  0001 C CNN
F 3 "~" H 4475 5475 50  0001 C CNN
F 4 "Kemet" H 4475 5475 50  0001 C CNN "MFN"
F 5 "C0402C103K3RAC7411" H 4475 5475 50  0001 C CNN "MFP"
F 6 "80-C0402C103K3R7411" H 4475 5475 50  0001 C CNN "S1PN"
F 7 "Mouser" H 4475 5475 50  0001 C CNN "S1PL"
F 8 "Multilayer Ceramic Capacitors MLCC - SMD/SMT 25V 0.01uF X7R" H 4475 5475 50  0001 C CNN "Description"
F 9 "0402 (1005 metric)" H 4475 5475 50  0001 C CNN "Package ID"
	1    4475 5475
	0    1    1    0   
$EndComp
Wire Wire Line
	5275 5225 5075 5225
Wire Wire Line
	5075 5225 5075 5925
Wire Wire Line
	5075 5925 5525 5925
Wire Wire Line
	4100 4925 4300 4925
Wire Wire Line
	4600 4925 5275 4925
Wire Wire Line
	5275 5075 4775 5075
Wire Wire Line
	4775 5075 4775 5475
Wire Wire Line
	4775 5475 4625 5475
Wire Wire Line
	4325 5475 4100 5475
Connection ~ 4100 5475
Wire Wire Line
	6250 4275 5075 4275
Wire Wire Line
	5075 4275 5075 4775
Wire Wire Line
	5075 4775 5275 4775
Connection ~ 6250 4275
Wire Wire Line
	6250 4275 6250 3600
$Comp
L project:TRANSFO4 T1
U 1 1 6048A190
P 3100 5125
F 0 "T1" H 3500 5075 50  0000 C CNN
F 1 "WBC4-1TL" H 3475 5175 50  0000 C CNN
F 2 "RF_Transformers:WBC4" H 3100 5125 60  0001 C CNN
F 3 "" H 3100 5125 60  0001 C CNN
F 4 "Signal Transformers WBC SMT Mini Wdebnd 1:4 0.250-750 MHz " H 3100 5125 50  0001 C CNN "Description"
F 5 "Coilcraft" H 3100 5125 50  0001 C CNN "MFN"
F 6 "WBC4-1TL" H 3100 5125 50  0001 C CNN "MFP"
F 7 "994-WBC4-1TLC" H 3100 5125 50  0001 C CNN "S1PN"
F 8 "Mouser" H 3100 5125 50  0001 C CNN "S1PL"
	1    3100 5125
	-1   0    0    1   
$EndComp
Wire Wire Line
	3500 4925 3600 4925
Connection ~ 4100 4925
Wire Wire Line
	3500 5325 3600 5325
Wire Wire Line
	3825 5325 3825 5475
Wire Wire Line
	3825 5475 4100 5475
$Comp
L device:R R5
U 1 1 6049F176
P 3100 4700
F 0 "R5" V 3000 4650 50  0000 L CNN
F 1 "0" V 3200 4650 50  0000 L CNN
F 2 "Resistor_SMD:R_0603_1608Metric" V 3030 4700 50  0001 C CNN
F 3 "~" H 3100 4700 50  0001 C CNN
F 4 "Yageo" H 3100 4700 50  0001 C CNN "MFN"
F 5 "RC0402FR-070RL" H 3100 4700 50  0001 C CNN "MFP"
F 6 "603-RC0402FR-070RL" H 3100 4700 50  0001 C CNN "S1PN"
F 7 "Mouser" H 3100 4700 50  0001 C CNN "S1PL"
F 8 "311-0.0LRCT-ND" H 3100 4700 50  0001 C CNN "S2PN"
F 9 "Digi-Key" H 3100 4700 50  0001 C CNN "S2PL"
F 10 "0 Ohms Jumper 0.063W, 1/16W Chip Resistor 0402" H 3100 4700 50  0001 C CNN "Description"
F 11 "0402 (1005 Metric)" H 3100 4700 50  0001 C CNN "Package ID"
	1    3100 4700
	0    1    1    0   
$EndComp
$Comp
L device:R R6
U 1 1 604A0E41
P 3100 5500
F 0 "R6" V 3000 5450 50  0000 L CNN
F 1 "0" V 3200 5450 50  0000 L CNN
F 2 "Resistor_SMD:R_0603_1608Metric" V 3030 5500 50  0001 C CNN
F 3 "~" H 3100 5500 50  0001 C CNN
F 4 "Yageo" H 3100 5500 50  0001 C CNN "MFN"
F 5 "RC0402FR-070RL" H 3100 5500 50  0001 C CNN "MFP"
F 6 "603-RC0402FR-070RL" H 3100 5500 50  0001 C CNN "S1PN"
F 7 "Mouser" H 3100 5500 50  0001 C CNN "S1PL"
F 8 "311-0.0LRCT-ND" H 3100 5500 50  0001 C CNN "S2PN"
F 9 "Digi-Key" H 3100 5500 50  0001 C CNN "S2PL"
F 10 "0 Ohms Jumper 0.063W, 1/16W Chip Resistor 0402" H 3100 5500 50  0001 C CNN "Description"
F 11 "0402 (1005 Metric)" H 3100 5500 50  0001 C CNN "Package ID"
	1    3100 5500
	0    1    1    0   
$EndComp
NoConn ~ 3500 5125
Wire Wire Line
	2050 4925 2600 4925
Wire Wire Line
	2700 5325 2600 5325
Wire Wire Line
	2325 5325 2325 5475
$Comp
L power:GND #PWR018
U 1 1 604B0E89
P 2325 5475
F 0 "#PWR018" H 2325 5225 50  0001 C CNN
F 1 "GND" H 2330 5302 50  0000 C CNN
F 2 "" H 2325 5475 50  0001 C CNN
F 3 "" H 2325 5475 50  0001 C CNN
	1    2325 5475
	1    0    0    -1  
$EndComp
Wire Wire Line
	3250 5500 3600 5500
Wire Wire Line
	3600 5500 3600 5325
Connection ~ 3600 5325
Wire Wire Line
	3600 5325 3825 5325
Wire Wire Line
	3250 4700 3600 4700
Wire Wire Line
	3600 4700 3600 4925
Connection ~ 3600 4925
Wire Wire Line
	3600 4925 4100 4925
Wire Wire Line
	2950 4700 2600 4700
Wire Wire Line
	2600 4700 2600 4925
Connection ~ 2600 4925
Wire Wire Line
	2600 4925 2700 4925
Wire Wire Line
	2950 5500 2600 5500
Wire Wire Line
	2600 5500 2600 5325
Connection ~ 2600 5325
Wire Wire Line
	2600 5325 2325 5325
$EndSCHEMATC
