(module SL (layer F.Cu) (tedit 5B52F29E)
  (fp_text reference J3 (at -0.0635 -2.0193) (layer F.SilkS)
    (effects (font (size 1 1) (thickness 0.15)))
  )
  (fp_text value ~ (at 0 -5.65912) (layer F.Fab)
    (effects (font (size 1 1) (thickness 0.15)))
  )
  (pad 1 smd rect (at 0 0) (size 2.032 2.54) (layers F.Cu F.Paste F.Mask))
  (pad 2 smd rect (at 2.54 0) (size 2.032 2.54) (layers F.Cu F.Paste F.Mask)
    (zone_connect 2))
  (pad 2 smd rect (at -2.54 0) (size 2.032 2.54) (layers F.Cu F.Paste F.Mask))
  (pad 2 smd rect (at 2.54 0) (size 2.032 2.54) (layers B.Cu)
    (zone_connect 2))
  (pad 2 smd rect (at -2.54 0) (size 2.032 2.54) (layers B.Cu))
  (pad 1 smd rect (at 0 0) (size 2.032 2.54) (layers B.Cu F.Paste F.Mask))
)
