EESchema Schematic File Version 4
EELAYER 30 0
EELAYER END
$Descr A4 11693 8268
encoding utf-8
Sheet 1 1
Title "RF Power Detector"
Date "2021-03-08"
Rev "1.2"
Comp "Dyadic Pty Ltd"
Comment1 "2021"
Comment2 ""
Comment3 ""
Comment4 ""
$EndDescr
$Comp
L project:ATTINY25_45_85-SSU IC1
U 1 1 5EF8BD07
P 9675 3350
F 0 "IC1" H 10500 3615 50  0000 C CNN
F 1 "ATTINY45-20XU" H 10500 3524 50  0000 C CNN
F 2 "Package_SO:TSSOP-8_4.4x3mm_P0.65mm" H 11025 3500 50  0001 C CNN
F 3 "" H 9675 3350 60  0000 C CNN
F 4 "Microchip Tech" H 9675 3350 50  0001 C CNN "MFN"
F 5 "ATTINY45-20XU" H 9675 3350 50  0001 C CNN "MFP"
F 6 "ATTINY45-20XU-ND" H 9675 3350 50  0001 C CNN "S1PN"
F 7 "Digi-Key" H 9675 3350 50  0001 C CNN "S1PL"
F 8 "556-ATTINY45-20XU" H 9675 3350 50  0001 C CNN "S2PN"
F 9 "Mouser" H 9675 3350 50  0001 C CNN "S2PL"
F 10 "MCU AVR 4K FLASH 256B EE & SRAM USI ADC" H 9675 3350 50  0001 C CNN "Description"
F 11 "TSSOP-8" H 9675 3350 50  0001 C CNN "Package ID"
	1    9675 3350
	-1   0    0    -1  
$EndComp
$Comp
L project:LTC5582 U3
U 1 1 5EF8CAD4
P 5675 5075
F 0 "U3" H 5675 5712 60  0000 C CNN
F 1 "LTC5582" H 5675 5606 60  0000 C CNN
F 2 "Package_DFN_QFN:DFN-10-1EP_3x3mm_P0.5mm_EP1.55x2.48mm" H 5800 4825 60  0001 C CNN
F 3 "" H 5800 4825 60  0000 C CNN
F 4 "Linear Tech" H 5675 5075 50  0001 C CNN "MFN"
F 5 "LTC5582IDD#PBF" H 5675 5075 50  0001 C CNN "MFP"
F 6 "584-LTC5582IDD#PBF" H 5675 5075 50  0001 C CNN "S1PN"
F 7 "Mouser" H 5675 5075 50  0001 C CNN "S1PL"
F 8 "LTC5582IDD#PBF-ND" H 5675 5075 50  0001 C CNN "S2PN"
F 9 "Digi-Key" H 5675 5075 50  0001 C CNN "S2PL"
F 10 "RF Detector IC CDMA, LTE, W-CDMA, WiMAX 40MHz ~ 10GHz -57dBm ~ 2dBm ±0.5dB 10-WFDFN Exposed Pad" H 5675 5075 50  0001 C CNN "Description"
F 11 "10-WFDFN Exposed Pad" H 5675 5075 50  0001 C CNN "Package ID"
	1    5675 5075
	1    0    0    -1  
$EndComp
$Comp
L power:+3V3 #PWR04
U 1 1 5EF8CE67
P 3050 1800
F 0 "#PWR04" H 3050 1650 50  0001 C CNN
F 1 "+3V3" H 3065 1973 50  0000 C CNN
F 2 "" H 3050 1800 50  0001 C CNN
F 3 "" H 3050 1800 50  0001 C CNN
	1    3050 1800
	1    0    0    -1  
$EndComp
$Comp
L project:TPS71733 U2
U 1 1 5EF8D001
P 2075 2175
F 0 "U2" H 2075 2640 50  0000 C CNN
F 1 "TPS71733" H 2075 2549 50  0000 C CNN
F 2 "Package_TO_SOT_SMD:SOT-353_SC-70-5" H 2075 2175 50  0001 C CNN
F 3 "" H 2075 2175 50  0001 C CNN
F 4 "Texas Instruments" H 2075 2175 50  0001 C CNN "MFN"
F 5 "TPS71733DCKT" H 2075 2175 50  0001 C CNN "MFP"
F 6 "TPS71733DCKT" H 2075 2175 50  0001 C CNN "S1PN"
F 7 "Arrow" H 2075 2175 50  0001 C CNN "S1PL"
F 8 "595-TPS71733DCKT" H 2075 2175 50  0001 C CNN "S2PN"
F 9 "Mouser" H 2075 2175 50  0001 C CNN "S2PL"
F 10 "LDO Voltage Regulators Sgl Output LDO 150mA Fixed(3.3V) Hi PSRR" H 2075 2175 50  0001 C CNN "Description"
F 11 "SC70-5" H 2075 2175 50  0001 C CNN "Package ID"
	1    2075 2175
	1    0    0    -1  
$EndComp
$Comp
L project:SMA_2 J2
U 1 1 5EF8D132
P 2950 4925
F 0 "J2" H 2919 5165 50  0000 C CNN
F 1 "RFin" H 2919 5074 50  0000 C CNN
F 2 "SMA_Connectors:SMA_EDGE_4" H 3125 4825 50  0001 C CNN
F 3 "" H 2950 4925 60  0000 C CNN
	1    2950 4925
	-1   0    0    -1  
$EndComp
$Comp
L device:C C10
U 1 1 5EF8D19F
P 3325 5175
F 0 "C10" H 3440 5221 50  0000 L CNN
F 1 "DNF" H 3440 5130 50  0000 L CNN
F 2 "Capacitor_SMD:C_0402_1005Metric" H 3363 5025 50  0001 C CNN
F 3 "~" H 3325 5175 50  0001 C CNN
	1    3325 5175
	1    0    0    -1  
$EndComp
$Comp
L power:GND #PWR020
U 1 1 5EF8D1F9
P 2950 5100
F 0 "#PWR020" H 2950 4850 50  0001 C CNN
F 1 "GND" H 2955 4927 50  0000 C CNN
F 2 "" H 2950 5100 50  0001 C CNN
F 3 "" H 2950 5100 50  0001 C CNN
	1    2950 5100
	1    0    0    -1  
$EndComp
$Comp
L device:C C9
U 1 1 5EF8D228
P 3875 4925
F 0 "C9" V 3623 4925 50  0000 C CNN
F 1 "10n" V 3714 4925 50  0000 C CNN
F 2 "Capacitor_SMD:C_0402_1005Metric" H 3913 4775 50  0001 C CNN
F 3 "~" H 3875 4925 50  0001 C CNN
F 4 "Kemet" H 3875 4925 50  0001 C CNN "MFN"
F 5 "C0402C103K3RAC7411" H 3875 4925 50  0001 C CNN "MFP"
F 6 "80-C0402C103K3R7411" H 3875 4925 50  0001 C CNN "S1PN"
F 7 "Mouser" H 3875 4925 50  0001 C CNN "S1PL"
F 8 "Multilayer Ceramic Capacitors MLCC - SMD/SMT 25V 0.01uF X7R" H 3875 4925 50  0001 C CNN "Description"
F 9 "0402 (1005 metric)" H 3875 4925 50  0001 C CNN "Package ID"
	1    3875 4925
	0    1    1    0   
$EndComp
$Comp
L device:R R2
U 1 1 5EF8D287
P 4325 5200
F 0 "R2" H 4395 5246 50  0000 L CNN
F 1 "91" H 4395 5155 50  0000 L CNN
F 2 "Resistor_SMD:R_0402_1005Metric" V 4255 5200 50  0001 C CNN
F 3 "~" H 4325 5200 50  0001 C CNN
F 4 "Yageo" H 4325 5200 50  0001 C CNN "MFN"
F 5 "RC0402JR-0791RL" H 4325 5200 50  0001 C CNN "MFP"
F 6 "603-RC0402JR-0791RL" H 4325 5200 50  0001 C CNN "S1PN"
F 7 "Mouser" H 4325 5200 50  0001 C CNN "S1PL"
F 8 "311-91JRCT-ND" H 4325 5200 50  0001 C CNN "S2PN"
F 9 "Digi-Key" H 4325 5200 50  0001 C CNN "S2PL"
F 10 "91 Ohms ±5% 0.063W, 1/16W Chip Resistor" H 4325 5200 50  0001 C CNN "Description"
F 11 "0402 (1005 Metric)" H 4325 5200 50  0001 C CNN "Package ID"
	1    4325 5200
	1    0    0    -1  
$EndComp
$Comp
L device:C C11
U 1 1 5EF8D304
P 4325 5625
F 0 "C11" H 4440 5671 50  0000 L CNN
F 1 "6.8p" H 4440 5580 50  0000 L CNN
F 2 "Capacitor_SMD:C_0402_1005Metric" H 4363 5475 50  0001 C CNN
F 3 "~" H 4325 5625 50  0001 C CNN
F 4 "Yageo" H 4325 5625 50  0001 C CNN "MFN"
F 5 "CC0402DRNPO9BN6R8" H 4325 5625 50  0001 C CNN "MFP"
F 6 "603-CC402DRNPO9BN6R8" H 4325 5625 50  0001 C CNN "S1PN"
F 7 "Mouser" H 4325 5625 50  0001 C CNN "S1PL"
F 8 "311-1637-1-ND" H 4325 5625 50  0001 C CNN "S2PN"
F 9 "Digi-Key" H 4325 5625 50  0001 C CNN "S2PL"
F 10 "6.8pF ±0.5pF 50V Ceramic Capacitor C0G, NP0" H 4325 5625 50  0001 C CNN "Description"
F 11 "0402 (1005 Metric)" H 4325 5625 50  0001 C CNN "Package ID"
	1    4325 5625
	1    0    0    -1  
$EndComp
$Comp
L device:C C12
U 1 1 5EF8D360
P 4725 5625
F 0 "C12" H 4840 5671 50  0000 L CNN
F 1 "180p" H 4840 5580 50  0000 L CNN
F 2 "Capacitor_SMD:C_0402_1005Metric" H 4763 5475 50  0001 C CNN
F 3 "~" H 4725 5625 50  0001 C CNN
F 4 "Murata" H 4725 5625 50  0001 C CNN "MFN"
F 5 "GRM1555C1H181JA01D" H 4725 5625 50  0001 C CNN "MFP"
F 6 "490-3231-1-ND" H 4725 5625 50  0001 C CNN "S1PN"
F 7 "Digi-Key" H 4725 5625 50  0001 C CNN "S1PL"
F 8 "81-GRM1555C1H181JA1D" H 4725 5625 50  0001 C CNN "S2PN"
F 9 "Mouser" H 4725 5625 50  0001 C CNN "S2PL"
F 10 "180pF ±5% 50V Ceramic Capacitor C0G, NP0" H 4725 5625 50  0001 C CNN "Description"
F 11 "0402 (1005 Metric)" H 4725 5625 50  0001 C CNN "Package ID"
	1    4725 5625
	1    0    0    -1  
$EndComp
Wire Wire Line
	3075 4925 3325 4925
Wire Wire Line
	4025 4925 4325 4925
Wire Wire Line
	4325 5050 4325 4925
Wire Wire Line
	4325 4925 5275 4925
Wire Wire Line
	3325 5025 3325 4925
Connection ~ 3325 4925
Wire Wire Line
	3325 4925 3725 4925
Wire Wire Line
	4325 5350 4325 5425
Wire Wire Line
	4325 5425 4725 5425
Wire Wire Line
	4725 5425 4725 5475
Connection ~ 4325 5425
Wire Wire Line
	4325 5425 4325 5475
$Comp
L power:GND #PWR024
U 1 1 5EF8DBB0
P 5675 5625
F 0 "#PWR024" H 5675 5375 50  0001 C CNN
F 1 "GND" H 5680 5452 50  0000 C CNN
F 2 "" H 5675 5625 50  0001 C CNN
F 3 "" H 5675 5625 50  0001 C CNN
	1    5675 5625
	1    0    0    -1  
$EndComp
$Comp
L power:GND #PWR022
U 1 1 5EF8DC23
P 5175 5525
F 0 "#PWR022" H 5175 5275 50  0001 C CNN
F 1 "GND" H 5180 5352 50  0000 C CNN
F 2 "" H 5175 5525 50  0001 C CNN
F 3 "" H 5175 5525 50  0001 C CNN
	1    5175 5525
	1    0    0    -1  
$EndComp
$Comp
L power:GND #PWR026
U 1 1 5EF8DC48
P 4725 5775
F 0 "#PWR026" H 4725 5525 50  0001 C CNN
F 1 "GND" H 4730 5602 50  0000 C CNN
F 2 "" H 4725 5775 50  0001 C CNN
F 3 "" H 4725 5775 50  0001 C CNN
	1    4725 5775
	1    0    0    -1  
$EndComp
$Comp
L power:GND #PWR025
U 1 1 5EF8DC6D
P 4325 5775
F 0 "#PWR025" H 4325 5525 50  0001 C CNN
F 1 "GND" H 4330 5602 50  0000 C CNN
F 2 "" H 4325 5775 50  0001 C CNN
F 3 "" H 4325 5775 50  0001 C CNN
	1    4325 5775
	1    0    0    -1  
$EndComp
Connection ~ 4325 4925
Wire Wire Line
	5275 5225 4725 5225
Wire Wire Line
	4725 5225 4725 5425
Connection ~ 4725 5425
Wire Wire Line
	5175 5525 5175 5375
Wire Wire Line
	5175 5375 5275 5375
NoConn ~ 5275 5075
Wire Wire Line
	6075 5375 6225 5375
Wire Wire Line
	6975 5375 6975 4475
Wire Wire Line
	7675 3750 6975 3750
Wire Wire Line
	6975 3750 6975 4175
$Comp
L device:C C13
U 1 1 5EF8E658
P 6225 5625
F 0 "C13" H 6340 5671 50  0000 L CNN
F 1 "Opt" H 6340 5580 50  0000 L CNN
F 2 "Capacitor_SMD:C_0402_1005Metric" H 6263 5475 50  0001 C CNN
F 3 "~" H 6225 5625 50  0001 C CNN
	1    6225 5625
	1    0    0    -1  
$EndComp
$Comp
L device:R R4
U 1 1 5EF8E83E
P 6575 5625
F 0 "R4" H 6645 5671 50  0000 L CNN
F 1 "0" H 6645 5580 50  0000 L CNN
F 2 "Resistor_SMD:R_0402_1005Metric" V 6505 5625 50  0001 C CNN
F 3 "~" H 6575 5625 50  0001 C CNN
F 4 "Yageo" H 6575 5625 50  0001 C CNN "MFN"
F 5 "RC0402FR-070RL" H 6575 5625 50  0001 C CNN "MFP"
F 6 "311-0.0LRCT-ND" H 6575 5625 50  0001 C CNN "S1PN"
F 7 "Digi-Key" H 6575 5625 50  0001 C CNN "S1PL"
F 8 "603-RC0402FR-070RL" H 6575 5625 50  0001 C CNN "S2PN"
F 9 "Mouser" H 6575 5625 50  0001 C CNN "S2PL"
F 10 "0 Ohms Jumper 0.063W, 1/16W Chip Resistor" H 6575 5625 50  0001 C CNN "Description"
F 11 "0402 (1005 Metric)" H 6575 5625 50  0001 C CNN "Package ID"
	1    6575 5625
	1    0    0    -1  
$EndComp
Wire Wire Line
	6225 5475 6225 5375
Connection ~ 6225 5375
Wire Wire Line
	6225 5375 6975 5375
Wire Wire Line
	6075 5225 6575 5225
Wire Wire Line
	6575 5225 6575 5475
Wire Wire Line
	6075 5075 6825 5075
Wire Wire Line
	6825 5075 6825 5725
$Comp
L power:GND #PWR030
U 1 1 5EF8EE90
P 6825 6025
F 0 "#PWR030" H 6825 5775 50  0001 C CNN
F 1 "GND" H 6830 5852 50  0000 C CNN
F 2 "" H 6825 6025 50  0001 C CNN
F 3 "" H 6825 6025 50  0001 C CNN
	1    6825 6025
	1    0    0    -1  
$EndComp
$Comp
L power:GND #PWR028
U 1 1 5EF8EEBD
P 6575 5775
F 0 "#PWR028" H 6575 5525 50  0001 C CNN
F 1 "GND" H 6580 5602 50  0000 C CNN
F 2 "" H 6575 5775 50  0001 C CNN
F 3 "" H 6575 5775 50  0001 C CNN
	1    6575 5775
	1    0    0    -1  
$EndComp
$Comp
L power:GND #PWR027
U 1 1 5EF8EEEA
P 6225 5775
F 0 "#PWR027" H 6225 5525 50  0001 C CNN
F 1 "GND" H 6230 5602 50  0000 C CNN
F 2 "" H 6225 5775 50  0001 C CNN
F 3 "" H 6225 5775 50  0001 C CNN
	1    6225 5775
	1    0    0    -1  
$EndComp
$Comp
L device:C C4
U 1 1 5EF8F2BA
P 1175 2250
F 0 "C4" H 1290 2296 50  0000 L CNN
F 1 "1.0u" H 1290 2205 50  0000 L CNN
F 2 "Capacitor_SMD:C_0603_1608Metric" H 1213 2100 50  0001 C CNN
F 3 "~" H 1175 2250 50  0001 C CNN
F 4 "Kemet" H 1175 2250 50  0001 C CNN "MFN"
F 5 "CC0603KRX5R8BB105" H 1175 2250 50  0001 C CNN "MFP"
F 6 "311-1445-1-ND" H 1175 2250 50  0001 C CNN "S1PN"
F 7 "Digi-Key" H 1175 2250 50  0001 C CNN "S1PL"
F 8 "603-CC603KRX5R8BB105" H 1175 2250 50  0001 C CNN "S2PN"
F 9 "Mouser" H 1175 2250 50  0001 C CNN "S2PL"
F 10 "1µF ±10% 25V Ceramic Capacitor X5R" H 1175 2250 50  0001 C CNN "Description"
F 11 "0603 (1608 metric)" H 1175 2250 50  0001 C CNN "Package ID"
	1    1175 2250
	1    0    0    -1  
$EndComp
$Comp
L device:C C6
U 1 1 5EF8F339
P 2625 2525
F 0 "C6" H 2740 2571 50  0000 L CNN
F 1 "0.1u" H 2740 2480 50  0000 L CNN
F 2 "Capacitor_SMD:C_0603_1608Metric" H 2663 2375 50  0001 C CNN
F 3 "~" H 2625 2525 50  0001 C CNN
F 4 "Kemet" H 2625 2525 50  0001 C CNN "MFN"
F 5 "C0603C104K5RACTU" H 2625 2525 50  0001 C CNN "MFP"
F 6 "399-5089-1-ND" H 2625 2525 50  0001 C CNN "S1PN"
F 7 "Digi-Key" H 2625 2525 50  0001 C CNN "S1PL"
F 8 "C0603C104K5RACTU" H 2625 2525 50  0001 C CNN "S2PN"
F 9 "Arrow" H 2625 2525 50  0001 C CNN "S2PL"
F 10 "0.10µF 50V Ceramic Capacitor X7R" H 2625 2525 50  0001 C CNN "Description"
F 11 "0603 (1608 Metric)" H 2625 2525 50  0001 C CNN "Package ID"
	1    2625 2525
	1    0    0    -1  
$EndComp
$Comp
L power:+5V #PWR05
U 1 1 5EF8F56E
P 1175 1825
F 0 "#PWR05" H 1175 1675 50  0001 C CNN
F 1 "+5V" H 1190 1998 50  0000 C CNN
F 2 "" H 1175 1825 50  0001 C CNN
F 3 "" H 1175 1825 50  0001 C CNN
	1    1175 1825
	1    0    0    -1  
$EndComp
Wire Wire Line
	1175 1825 1175 1975
Wire Wire Line
	1625 1975 1525 1975
Connection ~ 1175 1975
Wire Wire Line
	1175 1975 1175 2100
Wire Wire Line
	1625 2175 1525 2175
Wire Wire Line
	1525 2175 1525 1975
Connection ~ 1525 1975
Wire Wire Line
	1525 1975 1175 1975
Wire Wire Line
	2525 2175 2625 2175
Wire Wire Line
	2625 2175 2625 2375
Wire Wire Line
	2525 1975 3050 1975
Wire Wire Line
	3050 1975 3050 2075
$Comp
L power:GND #PWR015
U 1 1 5EF90951
P 2625 2675
F 0 "#PWR015" H 2625 2425 50  0001 C CNN
F 1 "GND" H 2630 2502 50  0000 C CNN
F 2 "" H 2625 2675 50  0001 C CNN
F 3 "" H 2625 2675 50  0001 C CNN
	1    2625 2675
	1    0    0    -1  
$EndComp
$Comp
L power:GND #PWR010
U 1 1 5EF90986
P 3050 2375
F 0 "#PWR010" H 3050 2125 50  0001 C CNN
F 1 "GND" H 3055 2202 50  0000 C CNN
F 2 "" H 3050 2375 50  0001 C CNN
F 3 "" H 3050 2375 50  0001 C CNN
	1    3050 2375
	1    0    0    -1  
$EndComp
$Comp
L power:GND #PWR013
U 1 1 5EF91A15
P 2075 2525
F 0 "#PWR013" H 2075 2275 50  0001 C CNN
F 1 "GND" H 2080 2352 50  0000 C CNN
F 2 "" H 2075 2525 50  0001 C CNN
F 3 "" H 2075 2525 50  0001 C CNN
	1    2075 2525
	1    0    0    -1  
$EndComp
$Comp
L power:GND #PWR011
U 1 1 5EF91A4A
P 1175 2400
F 0 "#PWR011" H 1175 2150 50  0001 C CNN
F 1 "GND" H 1180 2227 50  0000 C CNN
F 2 "" H 1175 2400 50  0001 C CNN
F 3 "" H 1175 2400 50  0001 C CNN
	1    1175 2400
	1    0    0    -1  
$EndComp
Wire Wire Line
	3050 1800 3050 1975
Connection ~ 3050 1975
$Comp
L power:+5V #PWR03
U 1 1 5EF92501
P 3950 1775
F 0 "#PWR03" H 3950 1625 50  0001 C CNN
F 1 "+5V" H 3965 1948 50  0000 C CNN
F 2 "" H 3950 1775 50  0001 C CNN
F 3 "" H 3950 1775 50  0001 C CNN
	1    3950 1775
	1    0    0    -1  
$EndComp
Wire Wire Line
	3950 1775 3950 1925
Wire Wire Line
	4400 1925 4300 1925
Connection ~ 3950 1925
Wire Wire Line
	3950 1925 3950 2050
Wire Wire Line
	4400 2125 4300 2125
Wire Wire Line
	4300 2125 4300 1925
Connection ~ 4300 1925
Wire Wire Line
	4300 1925 3950 1925
Wire Wire Line
	5300 2125 5400 2125
Wire Wire Line
	5400 2125 5400 2325
Wire Wire Line
	5300 1925 5825 1925
Wire Wire Line
	5825 1925 5825 2025
$Comp
L power:GND #PWR014
U 1 1 5EF92513
P 5400 2625
F 0 "#PWR014" H 5400 2375 50  0001 C CNN
F 1 "GND" H 5405 2452 50  0000 C CNN
F 2 "" H 5400 2625 50  0001 C CNN
F 3 "" H 5400 2625 50  0001 C CNN
	1    5400 2625
	1    0    0    -1  
$EndComp
$Comp
L power:GND #PWR07
U 1 1 5EF92519
P 5825 2325
F 0 "#PWR07" H 5825 2075 50  0001 C CNN
F 1 "GND" H 5830 2152 50  0000 C CNN
F 2 "" H 5825 2325 50  0001 C CNN
F 3 "" H 5825 2325 50  0001 C CNN
	1    5825 2325
	1    0    0    -1  
$EndComp
$Comp
L power:GND #PWR012
U 1 1 5EF9251F
P 4850 2475
F 0 "#PWR012" H 4850 2225 50  0001 C CNN
F 1 "GND" H 4855 2302 50  0000 C CNN
F 2 "" H 4850 2475 50  0001 C CNN
F 3 "" H 4850 2475 50  0001 C CNN
	1    4850 2475
	1    0    0    -1  
$EndComp
$Comp
L power:GND #PWR08
U 1 1 5EF92525
P 3950 2350
F 0 "#PWR08" H 3950 2100 50  0001 C CNN
F 1 "GND" H 3955 2177 50  0000 C CNN
F 2 "" H 3950 2350 50  0001 C CNN
F 3 "" H 3950 2350 50  0001 C CNN
	1    3950 2350
	1    0    0    -1  
$EndComp
Wire Wire Line
	5825 1750 5825 1925
Connection ~ 5825 1925
$Comp
L power:VDD #PWR02
U 1 1 5EF92FEC
P 5825 1750
F 0 "#PWR02" H 5825 1600 50  0001 C CNN
F 1 "VDD" H 5842 1923 50  0000 C CNN
F 2 "" H 5825 1750 50  0001 C CNN
F 3 "" H 5825 1750 50  0001 C CNN
	1    5825 1750
	1    0    0    -1  
$EndComp
$Comp
L power:+3V3 #PWR019
U 1 1 5EF94CB4
P 3450 3550
F 0 "#PWR019" H 3450 3400 50  0001 C CNN
F 1 "+3V3" H 3465 3723 50  0000 C CNN
F 2 "" H 3450 3550 50  0001 C CNN
F 3 "" H 3450 3550 50  0001 C CNN
	1    3450 3550
	1    0    0    -1  
$EndComp
$Comp
L power:VDD #PWR09
U 1 1 5EF94CEF
P 10175 3250
F 0 "#PWR09" H 10175 3100 50  0001 C CNN
F 1 "VDD" H 10192 3423 50  0000 C CNN
F 2 "" H 10175 3250 50  0001 C CNN
F 3 "" H 10175 3250 50  0001 C CNN
	1    10175 3250
	1    0    0    -1  
$EndComp
$Comp
L power:GND #PWR017
U 1 1 5EF94E78
P 10175 4075
F 0 "#PWR017" H 10175 3825 50  0001 C CNN
F 1 "GND" H 10180 3902 50  0000 C CNN
F 2 "" H 10175 4075 50  0001 C CNN
F 3 "" H 10175 4075 50  0001 C CNN
	1    10175 4075
	1    0    0    -1  
$EndComp
Wire Wire Line
	10025 3450 10175 3450
Wire Wire Line
	10175 3450 10175 3250
Wire Wire Line
	10025 3950 10175 3950
Wire Wire Line
	10175 3950 10175 4075
$Comp
L device:C C3
U 1 1 5EF96CD3
P 3050 2225
F 0 "C3" H 3165 2271 50  0000 L CNN
F 1 "1.0u" H 3165 2180 50  0000 L CNN
F 2 "Capacitor_SMD:C_0603_1608Metric" H 3088 2075 50  0001 C CNN
F 3 "~" H 3050 2225 50  0001 C CNN
F 4 "Kemet" H 3050 2225 50  0001 C CNN "MFN"
F 5 "CC0603KRX5R8BB105" H 3050 2225 50  0001 C CNN "MFP"
F 6 "311-1445-1-ND" H 3050 2225 50  0001 C CNN "S1PN"
F 7 "Digi-Key" H 3050 2225 50  0001 C CNN "S1PL"
F 8 "603-CC603KRX5R8BB105" H 3050 2225 50  0001 C CNN "S2PN"
F 9 "Mouser" H 3050 2225 50  0001 C CNN "S2PL"
F 10 "1µF ±10% 25V Ceramic Capacitor X5R" H 3050 2225 50  0001 C CNN "Description"
F 11 "0603 (1608 metric)" H 3050 2225 50  0001 C CNN "Package ID"
	1    3050 2225
	1    0    0    -1  
$EndComp
$Comp
L device:C C2
U 1 1 5EF9894E
P 3950 2200
F 0 "C2" H 4065 2246 50  0000 L CNN
F 1 "1.0u" H 4065 2155 50  0000 L CNN
F 2 "Capacitor_SMD:C_0603_1608Metric" H 3988 2050 50  0001 C CNN
F 3 "~" H 3950 2200 50  0001 C CNN
F 4 "Kemet" H 3950 2200 50  0001 C CNN "MFN"
F 5 "CC0603KRX5R8BB105" H 3950 2200 50  0001 C CNN "MFP"
F 6 "311-1445-1-ND" H 3950 2200 50  0001 C CNN "S1PN"
F 7 "Digi-Key" H 3950 2200 50  0001 C CNN "S1PL"
F 8 "603-CC603KRX5R8BB105" H 3950 2200 50  0001 C CNN "S2PN"
F 9 "Mouser" H 3950 2200 50  0001 C CNN "S2PL"
F 10 "1µF ±10% 25V Ceramic Capacitor X5R" H 3950 2200 50  0001 C CNN "Description"
F 11 "0603 (1608 metric)" H 3950 2200 50  0001 C CNN "Package ID"
	1    3950 2200
	1    0    0    -1  
$EndComp
$Comp
L device:C C1
U 1 1 5EF989BA
P 5825 2175
F 0 "C1" H 5940 2221 50  0000 L CNN
F 1 "1.0u" H 5940 2130 50  0000 L CNN
F 2 "Capacitor_SMD:C_0603_1608Metric" H 5863 2025 50  0001 C CNN
F 3 "~" H 5825 2175 50  0001 C CNN
F 4 "Kemet" H 5825 2175 50  0001 C CNN "MFN"
F 5 "CC0603KRX5R8BB105" H 5825 2175 50  0001 C CNN "MFP"
F 6 "311-1445-1-ND" H 5825 2175 50  0001 C CNN "S1PN"
F 7 "Digi-Key" H 5825 2175 50  0001 C CNN "S1PL"
F 8 "603-CC603KRX5R8BB105" H 5825 2175 50  0001 C CNN "S2PN"
F 9 "Mouser" H 5825 2175 50  0001 C CNN "S2PL"
F 10 "1µF ±10% 25V Ceramic Capacitor X5R" H 5825 2175 50  0001 C CNN "Description"
F 11 "0603 (1608 metric)" H 5825 2175 50  0001 C CNN "Package ID"
	1    5825 2175
	1    0    0    -1  
$EndComp
$Comp
L device:C C5
U 1 1 5EF99B35
P 5400 2475
F 0 "C5" H 5515 2521 50  0000 L CNN
F 1 "0.1u" H 5515 2430 50  0000 L CNN
F 2 "Capacitor_SMD:C_0603_1608Metric" H 5438 2325 50  0001 C CNN
F 3 "~" H 5400 2475 50  0001 C CNN
F 4 "Kemet" H 5400 2475 50  0001 C CNN "MFN"
F 5 "C0603C104K5RACTU" H 5400 2475 50  0001 C CNN "MFP"
F 6 "399-5089-1-ND" H 5400 2475 50  0001 C CNN "S1PN"
F 7 "Digi-Key" H 5400 2475 50  0001 C CNN "S1PL"
F 8 "C0603C104K5RACTU" H 5400 2475 50  0001 C CNN "S2PN"
F 9 "Arrow" H 5400 2475 50  0001 C CNN "S2PL"
F 10 "0.10µF 50V Ceramic Capacitor X7R" H 5400 2475 50  0001 C CNN "Description"
F 11 "0603 (1608 Metric)" H 5400 2475 50  0001 C CNN "Package ID"
	1    5400 2475
	1    0    0    -1  
$EndComp
Wire Wire Line
	5275 4775 5175 4775
$Comp
L power:GND #PWR021
U 1 1 5EF9C2D4
P 3325 5325
F 0 "#PWR021" H 3325 5075 50  0001 C CNN
F 1 "GND" H 3330 5152 50  0000 C CNN
F 2 "" H 3325 5325 50  0001 C CNN
F 3 "" H 3325 5325 50  0001 C CNN
	1    3325 5325
	1    0    0    -1  
$EndComp
$Comp
L project:TPS71733 U1
U 1 1 5EF9CACF
P 4850 2125
F 0 "U1" H 4850 2590 50  0000 C CNN
F 1 "TPS71733" H 4850 2499 50  0000 C CNN
F 2 "Package_TO_SOT_SMD:SOT-353_SC-70-5" H 4850 2125 50  0001 C CNN
F 3 "" H 4850 2125 50  0001 C CNN
F 4 "Texas Instruments" H 4850 2125 50  0001 C CNN "MFN"
F 5 "TPS71733DCKT" H 4850 2125 50  0001 C CNN "MFP"
F 6 "TPS71733DCKT" H 4850 2125 50  0001 C CNN "S1PN"
F 7 "Arrow" H 4850 2125 50  0001 C CNN "S1PL"
F 8 "595-TPS71733DCKT" H 4850 2125 50  0001 C CNN "S2PN"
F 9 "Mouser" H 4850 2125 50  0001 C CNN "S2PL"
F 10 "LDO Voltage Regulators Sgl Output LDO 150mA Fixed(3.3V) Hi PSRR" H 4850 2125 50  0001 C CNN "Description"
F 11 "SC70-5" H 4850 2125 50  0001 C CNN "Package ID"
	1    4850 2125
	1    0    0    -1  
$EndComp
$Comp
L project:SMA_2 J3
U 1 1 5EF9FB2A
P 9750 5375
F 0 "J3" H 9719 5615 50  0000 C CNN
F 1 "Vout" H 9719 5524 50  0000 C CNN
F 2 "MMCX_Connectors:mmcx_th" H 9925 5275 50  0001 C CNN
F 3 "" H 9750 5375 60  0000 C CNN
	1    9750 5375
	1    0    0    -1  
$EndComp
$Comp
L power:GND #PWR023
U 1 1 5EFA099C
P 9750 5550
F 0 "#PWR023" H 9750 5300 50  0001 C CNN
F 1 "GND" H 9755 5377 50  0000 C CNN
F 2 "" H 9750 5550 50  0001 C CNN
F 3 "" H 9750 5550 50  0001 C CNN
	1    9750 5550
	1    0    0    -1  
$EndComp
Wire Wire Line
	9625 5375 9200 5375
Wire Wire Line
	8900 5375 6975 5375
Connection ~ 6975 5375
Wire Wire Line
	6075 4775 6225 4775
Wire Wire Line
	6225 4775 6225 4675
$Comp
L power:+3V3 #PWR018
U 1 1 5EFA496A
P 6225 4375
F 0 "#PWR018" H 6225 4225 50  0001 C CNN
F 1 "+3V3" H 6240 4548 50  0000 C CNN
F 2 "" H 6225 4375 50  0001 C CNN
F 3 "" H 6225 4375 50  0001 C CNN
	1    6225 4375
	1    0    0    -1  
$EndComp
$Comp
L connector_generic:Conn_02x04_Counter_Clockwise J1
U 1 1 5EFA60E7
P 8775 2600
F 0 "J1" H 8825 2917 50  0000 C CNN
F 1 "ICSP" H 8825 2826 50  0000 C CNN
F 2 "Connector_PinHeader_2.54mm:PinHeader_2x04_P2.54mm_Vertical" H 8775 2600 50  0001 C CNN
F 3 "~" H 8775 2600 50  0001 C CNN
	1    8775 2600
	1    0    0    -1  
$EndComp
$Comp
L power:VDD #PWR01
U 1 1 5EFA64AB
P 9500 2300
F 0 "#PWR01" H 9500 2150 50  0001 C CNN
F 1 "VDD" H 9517 2473 50  0000 C CNN
F 2 "" H 9500 2300 50  0001 C CNN
F 3 "" H 9500 2300 50  0001 C CNN
	1    9500 2300
	1    0    0    -1  
$EndComp
Wire Wire Line
	9075 2600 9500 2600
Wire Wire Line
	9500 2600 9500 2300
$Comp
L power:GND #PWR06
U 1 1 5EFA73E1
P 9650 2775
F 0 "#PWR06" H 9650 2525 50  0001 C CNN
F 1 "GND" H 9655 2602 50  0000 C CNN
F 2 "" H 9650 2775 50  0001 C CNN
F 3 "" H 9650 2775 50  0001 C CNN
	1    9650 2775
	1    0    0    -1  
$EndComp
Wire Wire Line
	9075 2500 9650 2500
Wire Wire Line
	9650 2500 9650 2775
Wire Wire Line
	7675 3350 7325 3350
Wire Wire Line
	7325 3350 7325 2700
Wire Wire Line
	7675 3450 7200 3450
Wire Wire Line
	7200 3450 7200 2600
Wire Wire Line
	7675 3950 7075 3950
Wire Wire Line
	7075 3950 7075 2500
Wire Wire Line
	7075 2500 8575 2500
Wire Wire Line
	7675 3550 7575 3550
Wire Wire Line
	7575 3550 7575 2900
Wire Wire Line
	9225 2900 9225 2700
Wire Wire Line
	9225 2700 9075 2700
$Comp
L device:C C7
U 1 1 5EFB9132
P 10350 3700
F 0 "C7" H 10465 3746 50  0000 L CNN
F 1 "0.1u" H 10465 3655 50  0000 L CNN
F 2 "Capacitor_SMD:C_0603_1608Metric" H 10388 3550 50  0001 C CNN
F 3 "~" H 10350 3700 50  0001 C CNN
F 4 "Kemet" H 10350 3700 50  0001 C CNN "MFN"
F 5 "C0603C104K5RACTU" H 10350 3700 50  0001 C CNN "MFP"
F 6 "399-5089-1-ND" H 10350 3700 50  0001 C CNN "S1PN"
F 7 "Digi-Key" H 10350 3700 50  0001 C CNN "S1PL"
F 8 "C0603C104K5RACTU" H 10350 3700 50  0001 C CNN "S2PN"
F 9 "Arrow" H 10350 3700 50  0001 C CNN "S2PL"
F 10 "0.10µF 50V Ceramic Capacitor X7R" H 10350 3700 50  0001 C CNN "Description"
F 11 "0603 (1608 Metric)" H 10350 3700 50  0001 C CNN "Package ID"
	1    10350 3700
	1    0    0    -1  
$EndComp
Wire Wire Line
	10350 3550 10350 3450
Wire Wire Line
	10350 3450 10175 3450
Connection ~ 10175 3450
$Comp
L power:GND #PWR016
U 1 1 5EFBA98E
P 10350 3850
F 0 "#PWR016" H 10350 3600 50  0001 C CNN
F 1 "GND" H 10355 3677 50  0000 C CNN
F 2 "" H 10350 3850 50  0001 C CNN
F 3 "" H 10350 3850 50  0001 C CNN
	1    10350 3850
	1    0    0    -1  
$EndComp
$Comp
L device:C C16
U 1 1 5EFC40DD
P 4550 3950
F 0 "C16" H 4665 3996 50  0000 L CNN
F 1 "1n" H 4665 3905 50  0000 L CNN
F 2 "Capacitor_SMD:C_0402_1005Metric" H 4588 3800 50  0001 C CNN
F 3 "~" H 4550 3950 50  0001 C CNN
F 4 "AVX" H 4550 3950 50  0001 C CNN "MFN"
F 5 "04025C102KAT2A" H 4550 3950 50  0001 C CNN "MFP"
F 6 "478-1101-1-ND" H 4550 3950 50  0001 C CNN "S1PN"
F 7 "Digi-Key" H 4550 3950 50  0001 C CNN "S1PL"
F 8 "581-04025C102K" H 4550 3950 50  0001 C CNN "S2PN"
F 9 "Mouser" H 4550 3950 50  0001 C CNN "S2PL"
F 10 "1000pF ±10% 50V Ceramic Capacitor X7R" H 4550 3950 50  0001 C CNN "Description"
F 11 "0402 (1005 Metric)" H 4550 3950 50  0001 C CNN "Package ID"
	1    4550 3950
	1    0    0    -1  
$EndComp
$Comp
L device:C C14
U 1 1 5EFC4151
P 4100 3950
F 0 "C14" H 4215 3996 50  0000 L CNN
F 1 "1.0u" H 4215 3905 50  0000 L CNN
F 2 "Capacitor_SMD:C_0402_1005Metric" H 4138 3800 50  0001 C CNN
F 3 "~" H 4100 3950 50  0001 C CNN
F 4 "Kemet" H 4100 3950 50  0001 C CNN "MFN"
F 5 "C0402C105K4PAC7867" H 4100 3950 50  0001 C CNN "MFP"
F 6 "399-12289-1-ND" H 4100 3950 50  0001 C CNN "S1PN"
F 7 "Digi-Key" H 4100 3950 50  0001 C CNN "S1PL"
F 8 "80-C0402C105K4P" H 4100 3950 50  0001 C CNN "S2PN"
F 9 "Mouser" H 4100 3950 50  0001 C CNN "S2PL"
F 10 "1µF ±10% 16V Ceramic Capacitor X5R" H 4100 3950 50  0001 C CNN "Description"
F 11 "0402 (1005 Metric)" H 4100 3950 50  0001 C CNN "Package ID"
	1    4100 3950
	1    0    0    -1  
$EndComp
$Comp
L device:R R7
U 1 1 5EFC422A
P 3750 3700
F 0 "R7" V 3650 3650 50  0000 L CNN
F 1 "1.5" V 3850 3650 50  0000 L CNN
F 2 "Resistor_SMD:R_0402_1005Metric" V 3680 3700 50  0001 C CNN
F 3 "~" H 3750 3700 50  0001 C CNN
F 4 "Yageo" H 3750 3700 50  0001 C CNN "MFN"
F 5 "RC0402FR-071R5L" H 3750 3700 50  0001 C CNN "MFP"
F 6 "603-RC0402FR-071R5L" H 3750 3700 50  0001 C CNN "S1PN"
F 7 "Mouser" H 3750 3700 50  0001 C CNN "S1PL"
F 8 "311-1.50LRCT-ND" H 3750 3700 50  0001 C CNN "S2PN"
F 9 "Digi-Key" H 3750 3700 50  0001 C CNN "S2PL"
F 10 "1.5 Ohms ±1% 0.063W, 1/16W Chip Resistor" H 3750 3700 50  0001 C CNN "Description"
F 11 "0402 (1005 Metric)" H 3750 3700 50  0001 C CNN "Package ID"
	1    3750 3700
	0    1    1    0   
$EndComp
Wire Wire Line
	5175 3700 4850 3700
Wire Wire Line
	5175 3700 5175 4775
Wire Wire Line
	3600 3700 3450 3700
Wire Wire Line
	3450 3700 3450 3550
Wire Wire Line
	4100 3800 4100 3700
Wire Wire Line
	4100 3700 3900 3700
Wire Wire Line
	4550 3800 4550 3700
$Comp
L power:GND #PWR031
U 1 1 5EFCCA2A
P 4100 4100
F 0 "#PWR031" H 4100 3850 50  0001 C CNN
F 1 "GND" H 4105 3927 50  0000 C CNN
F 2 "" H 4100 4100 50  0001 C CNN
F 3 "" H 4100 4100 50  0001 C CNN
	1    4100 4100
	1    0    0    -1  
$EndComp
$Comp
L power:GND #PWR033
U 1 1 5EFCCAB8
P 4550 4100
F 0 "#PWR033" H 4550 3850 50  0001 C CNN
F 1 "GND" H 4555 3927 50  0000 C CNN
F 2 "" H 4550 4100 50  0001 C CNN
F 3 "" H 4550 4100 50  0001 C CNN
	1    4550 4100
	1    0    0    -1  
$EndComp
$Comp
L device:C C8
U 1 1 5EFCF50C
P 6225 4525
F 0 "C8" H 6340 4571 50  0000 L CNN
F 1 "0.1u" H 6340 4480 50  0000 L CNN
F 2 "Capacitor_SMD:C_0402_1005Metric" H 6263 4375 50  0001 C CNN
F 3 "~" H 6225 4525 50  0001 C CNN
F 4 "Yageo" H 6225 4525 50  0001 C CNN "MFN"
F 5 "CC0402KRX7R7BB104" H 6225 4525 50  0001 C CNN "MFP"
F 6 "311-1338-1-ND" H 6225 4525 50  0001 C CNN "S1PN"
F 7 "Digi-Key" H 6225 4525 50  0001 C CNN "S1PL"
F 8 "603-CC402KRX7R7BB104" H 6225 4525 50  0001 C CNN "S2PN"
F 9 "Mouser" H 6225 4525 50  0001 C CNN "S2PL"
F 10 "0.1µF ±10% 16V Ceramic Capacitor X7R" H 6225 4525 50  0001 C CNN "Description"
F 11 "0402 (1005 Metric)" H 6225 4525 50  0001 C CNN "Package ID"
	1    6225 4525
	1    0    0    -1  
$EndComp
Wire Wire Line
	4100 3700 4550 3700
Connection ~ 4100 3700
Connection ~ 4550 3700
$Comp
L device:R R6
U 1 1 5EFD9800
P 6825 5875
F 0 "R6" H 6895 5921 50  0000 L CNN
F 1 "0" H 6895 5830 50  0000 L CNN
F 2 "Resistor_SMD:R_0402_1005Metric" V 6755 5875 50  0001 C CNN
F 3 "~" H 6825 5875 50  0001 C CNN
F 4 "Yageo" H 6825 5875 50  0001 C CNN "MFN"
F 5 "RC0402FR-070RL" H 6825 5875 50  0001 C CNN "MFP"
F 6 "311-0.0LRCT-ND" H 6825 5875 50  0001 C CNN "S1PN"
F 7 "Digi-Key" H 6825 5875 50  0001 C CNN "S1PL"
F 8 "603-RC0402FR-070RL" H 6825 5875 50  0001 C CNN "S2PN"
F 9 "Mouser" H 6825 5875 50  0001 C CNN "S2PL"
F 10 "0 Ohms Jumper 0.063W, 1/16W Chip Resistor" H 6825 5875 50  0001 C CNN "Description"
F 11 "0402 (1005 Metric)" H 6825 5875 50  0001 C CNN "Package ID"
	1    6825 5875
	1    0    0    -1  
$EndComp
$Comp
L device:R R3
U 1 1 5EFDB756
P 9050 5375
F 0 "R3" V 8950 5325 50  0000 L CNN
F 1 "0" V 9150 5350 50  0000 L CNN
F 2 "Resistor_SMD:R_0402_1005Metric" V 8980 5375 50  0001 C CNN
F 3 "~" H 9050 5375 50  0001 C CNN
F 4 "Yageo" H 9050 5375 50  0001 C CNN "MFN"
F 5 "RC0402FR-070RL" H 9050 5375 50  0001 C CNN "MFP"
F 6 "311-0.0LRCT-ND" H 9050 5375 50  0001 C CNN "S1PN"
F 7 "Digi-Key" H 9050 5375 50  0001 C CNN "S1PL"
F 8 "603-RC0402FR-070RL" H 9050 5375 50  0001 C CNN "S2PN"
F 9 "Mouser" H 9050 5375 50  0001 C CNN "S2PL"
F 10 "0 Ohms Jumper 0.063W, 1/16W Chip Resistor" H 9050 5375 50  0001 C CNN "Description"
F 11 "0402 (1005 Metric)" H 9050 5375 50  0001 C CNN "Package ID"
	1    9050 5375
	0    1    1    0   
$EndComp
$Comp
L device:R R1
U 1 1 5EFDD69A
P 6975 4325
F 0 "R1" H 7045 4371 50  0000 L CNN
F 1 "0" H 7045 4280 50  0000 L CNN
F 2 "Resistor_SMD:R_0402_1005Metric" V 6905 4325 50  0001 C CNN
F 3 "~" H 6975 4325 50  0001 C CNN
F 4 "Yageo" H 6975 4325 50  0001 C CNN "MFN"
F 5 "RC0402FR-070RL" H 6975 4325 50  0001 C CNN "MFP"
F 6 "311-0.0LRCT-ND" H 6975 4325 50  0001 C CNN "S1PN"
F 7 "Digi-Key" H 6975 4325 50  0001 C CNN "S1PL"
F 8 "603-RC0402FR-070RL" H 6975 4325 50  0001 C CNN "S2PN"
F 9 "Mouser" H 6975 4325 50  0001 C CNN "S2PL"
F 10 "0 Ohms Jumper 0.063W, 1/16W Chip Resistor" H 6975 4325 50  0001 C CNN "Description"
F 11 "0402 (1005 Metric)" H 6975 4325 50  0001 C CNN "Package ID"
	1    6975 4325
	1    0    0    -1  
$EndComp
$Comp
L power:+5V #PWR0101
U 1 1 5EFE1481
P 2550 1000
F 0 "#PWR0101" H 2550 850 50  0001 C CNN
F 1 "+5V" H 2565 1173 50  0000 C CNN
F 2 "" H 2550 1000 50  0001 C CNN
F 3 "" H 2550 1000 50  0001 C CNN
	1    2550 1000
	1    0    0    -1  
$EndComp
$Comp
L power:GND #PWR0102
U 1 1 5EFE314E
P 2550 1300
F 0 "#PWR0102" H 2550 1050 50  0001 C CNN
F 1 "GND" H 2555 1127 50  0000 C CNN
F 2 "" H 2550 1300 50  0001 C CNN
F 3 "" H 2550 1300 50  0001 C CNN
	1    2550 1300
	1    0    0    -1  
$EndComp
$Comp
L power:PWR_FLAG #FLG0101
U 1 1 5EFEDB95
P 4850 3700
F 0 "#FLG0101" H 4850 3775 50  0001 C CNN
F 1 "PWR_FLAG" H 4850 3874 50  0000 C CNN
F 2 "" H 4850 3700 50  0001 C CNN
F 3 "~" H 4850 3700 50  0001 C CNN
	1    4850 3700
	1    0    0    -1  
$EndComp
Connection ~ 4850 3700
Wire Wire Line
	4850 3700 4550 3700
$Comp
L power:PWR_FLAG #FLG0102
U 1 1 5EFF0511
P 2200 1200
F 0 "#FLG0102" H 2200 1275 50  0001 C CNN
F 1 "PWR_FLAG" H 2200 1374 50  0000 C CNN
F 2 "" H 2200 1200 50  0001 C CNN
F 3 "~" H 2200 1200 50  0001 C CNN
	1    2200 1200
	-1   0    0    1   
$EndComp
$Comp
L power:PWR_FLAG #FLG0103
U 1 1 5EFF308F
P 2200 1100
F 0 "#FLG0103" H 2200 1175 50  0001 C CNN
F 1 "PWR_FLAG" H 2200 1274 50  0000 C CNN
F 2 "" H 2200 1100 50  0001 C CNN
F 3 "~" H 2200 1100 50  0001 C CNN
	1    2200 1100
	1    0    0    -1  
$EndComp
$Comp
L connector:Conn_01x02_Male J4
U 1 1 5EFFAE8D
P 1825 1100
F 0 "J4" H 1750 1275 50  0000 C CNN
F 1 "Pwr" H 1750 1200 50  0000 C CNN
F 2 "Connector_PinHeader_2.54mm:PinHeader_1x02_P2.54mm_Vertical" H 1825 1100 50  0001 C CNN
F 3 "~" H 1825 1100 50  0001 C CNN
	1    1825 1100
	1    0    0    -1  
$EndComp
Wire Wire Line
	7575 2900 9225 2900
Wire Wire Line
	7200 2600 8575 2600
Wire Wire Line
	7325 2700 8575 2700
Wire Wire Line
	2025 1100 2200 1100
Wire Wire Line
	2550 1100 2550 1000
Connection ~ 2200 1100
Wire Wire Line
	2200 1100 2550 1100
Wire Wire Line
	2025 1200 2200 1200
Wire Wire Line
	2550 1200 2550 1300
Connection ~ 2200 1200
Wire Wire Line
	2200 1200 2550 1200
$Comp
L project:rfi_shield_clip P1
U 1 1 5F03EB7E
P 7800 1250
F 0 "P1" H 7928 1322 60  0000 L CNN
F 1 "rfi_shield_clip" H 7928 1216 60  0000 L CNN
F 2 "RF_Shielding:S1721-46R" H 7800 1250 60  0001 C CNN
F 3 "" H 7800 1250 60  0000 C CNN
	1    7800 1250
	1    0    0    -1  
$EndComp
$Comp
L project:rfi_shield_clip P2
U 1 1 5F03EC3D
P 8850 1250
F 0 "P2" H 8978 1322 60  0000 L CNN
F 1 "rfi_shield_clip" H 8978 1216 60  0000 L CNN
F 2 "RF_Shielding:S1721-46R" H 8850 1250 60  0001 C CNN
F 3 "" H 8850 1250 60  0000 C CNN
	1    8850 1250
	1    0    0    -1  
$EndComp
$Comp
L power:GND #PWR032
U 1 1 5F03ECAB
P 7800 1350
F 0 "#PWR032" H 7800 1100 50  0001 C CNN
F 1 "GND" H 7805 1177 50  0000 C CNN
F 2 "" H 7800 1350 50  0001 C CNN
F 3 "" H 7800 1350 50  0001 C CNN
	1    7800 1350
	1    0    0    -1  
$EndComp
$Comp
L power:GND #PWR034
U 1 1 5F03EDB6
P 8850 1350
F 0 "#PWR034" H 8850 1100 50  0001 C CNN
F 1 "GND" H 8855 1177 50  0000 C CNN
F 2 "" H 8850 1350 50  0001 C CNN
F 3 "" H 8850 1350 50  0001 C CNN
	1    8850 1350
	1    0    0    -1  
$EndComp
$Comp
L power:+3V3 #PWR0103
U 1 1 5EFEA3AA
P 6600 4375
F 0 "#PWR0103" H 6600 4225 50  0001 C CNN
F 1 "+3V3" H 6615 4548 50  0000 C CNN
F 2 "" H 6600 4375 50  0001 C CNN
F 3 "" H 6600 4375 50  0001 C CNN
	1    6600 4375
	1    0    0    -1  
$EndComp
Wire Wire Line
	6075 4925 6600 4925
Wire Wire Line
	6600 4925 6600 4375
Wire Wire Line
	7675 3850 7450 3850
Wire Wire Line
	7450 3850 7450 2800
Wire Wire Line
	7450 2800 8575 2800
NoConn ~ 9075 2800
$EndSCHEMATC
