(module SMA_EDGE_4 (layer F.Cu) (tedit 6024869E)
  (descr "4-layer SMA")
  (fp_text reference J5 (at 3.3655 -2.3749 -90) (layer F.SilkS) hide
    (effects (font (size 0.635 0.635) (thickness 0.1016)))
  )
  (fp_text value "RF Out" (at 3.5052 -4.4831 -90) (layer F.SilkS) hide
    (effects (font (size 0.635 0.635) (thickness 0.1016)))
  )
  (fp_line (start 5.7531 2.2479) (end 0.0127 2.2479) (layer F.CrtYd) (width 0.05))
  (fp_line (start 5.7531 -3.1496) (end 5.7531 2.2479) (layer F.CrtYd) (width 0.05))
  (fp_line (start -5.8039 -3.1496) (end 5.7531 -3.1496) (layer F.CrtYd) (width 0.05))
  (fp_line (start -5.8039 2.2479) (end -5.8039 -3.1496) (layer F.CrtYd) (width 0.05))
  (fp_line (start 0 2.2479) (end -5.8039 2.2479) (layer F.CrtYd) (width 0.05))
  (fp_line (start 0.381 -2.0193) (end 0.3683 2.2352) (layer F.Fab) (width 0.1))
  (fp_line (start -0.381 -2.0193) (end 0.381 -2.0193) (layer F.Fab) (width 0.1))
  (fp_line (start -0.381 2.2352) (end -0.381 -2.0193) (layer F.Fab) (width 0.1))
  (fp_line (start 3.7338 -2.5019) (end 3.7338 2.2352) (layer F.Fab) (width 0.15))
  (fp_line (start 3.7338 -2.5019) (end 4.7498 -2.5019) (layer F.Fab) (width 0.15))
  (fp_line (start 4.7498 2.2479) (end 4.7498 -2.5019) (layer F.Fab) (width 0.15))
  (fp_line (start -3.7592 -2.5019) (end -3.7592 2.2352) (layer F.Fab) (width 0.15))
  (fp_line (start -4.7752 -2.5019) (end -3.7592 -2.5019) (layer F.Fab) (width 0.15))
  (fp_line (start -4.7752 2.2479) (end -4.7752 -2.5019) (layer F.Fab) (width 0.15))
  (fp_line (start 4.7498 2.2352) (end -4.7752 2.2352) (layer F.Fab) (width 0.15))
  (fp_line (start 4.7498 3.8862) (end 4.7498 2.2352) (layer F.Fab) (width 0.15))
  (fp_line (start -4.7752 3.8862) (end 4.7498 3.8862) (layer F.Fab) (width 0.15))
  (fp_line (start -4.7752 2.2352) (end -4.7752 3.8862) (layer F.Fab) (width 0.15))
  (fp_line (start -2.9972 3.8862) (end -2.9972 12.6365) (layer F.Fab) (width 0.15))
  (fp_line (start -2.9972 12.6365) (end 2.9972 12.6365) (layer F.Fab) (width 0.15))
  (fp_line (start 2.9972 12.6365) (end 2.9845 3.8862) (layer F.Fab) (width 0.15))
  (fp_line (start 4.7498 2.2352) (end -4.7752 2.2352) (layer B.Fab) (width 0.15))
  (fp_line (start 4.7498 2.2479) (end 4.7498 -2.5019) (layer B.Fab) (width 0.15))
  (fp_line (start 3.7338 -2.5019) (end 4.7498 -2.5019) (layer B.Fab) (width 0.15))
  (fp_line (start 3.7338 -2.5019) (end 3.7338 2.2352) (layer B.Fab) (width 0.15))
  (fp_line (start -3.7592 -2.5019) (end -3.7592 2.2352) (layer B.Fab) (width 0.15))
  (fp_line (start -4.7752 -2.5019) (end -3.7592 -2.5019) (layer B.Fab) (width 0.15))
  (fp_line (start -4.7752 2.2479) (end -4.7752 -2.5019) (layer B.Fab) (width 0.15))
  (fp_text user %R (at 5.57276 3.4417 90) (layer F.Fab)
    (effects (font (size 0.635 0.635) (thickness 0.1016)))
  )
  (pad 2 smd rect (at 4.1402 -0.41148) (size 2.413 5.08) (layers F.Cu F.Mask)
    (zone_connect 2))
  (pad 2 smd rect (at 2.25044 0) (size 1.4478 4.24942) (layers F.Cu F.Mask)
    (zone_connect 2))
  (pad 2 smd rect (at -2.25044 0) (size 1.4478 4.24942) (layers F.Cu F.Mask)
    (zone_connect 2))
  (pad 2 smd rect (at -4.1402 -0.41148) (size 2.413 5.08) (layers F.Cu F.Mask)
    (zone_connect 2))
  (pad 2 smd rect (at 4.15036 -0.41148) (size 2.413 5.08) (layers B.Cu B.Mask)
    (zone_connect 2))
  (pad 2 smd rect (at -4.14528 -0.41148) (size 2.413 5.08) (layers B.Cu B.Mask)
    (zone_connect 2))
  (pad 2 smd rect (at 2.286 0.1524) (size 1.5 3.95) (layers B.Cu B.Mask)
    (zone_connect 2))
  (pad 2 smd rect (at -2.286 0.1524) (size 1.5 3.95) (layers B.Cu B.Mask)
    (zone_connect 2))
  (pad 1 smd rect (at 0 0) (size 2.032 4.25) (layers F.Cu F.Mask)
    (solder_mask_margin 0.254))
  (model ${KIPRJMOD}/../KiCad/Modules/packages3d/142-0701-801.wrl
    (offset (xyz 0 -3.25 -3.4))
    (scale (xyz 0.37 0.37 0.37))
    (rotate (xyz -90 0 180))
  )
)
