EESchema Schematic File Version 4
EELAYER 30 0
EELAYER END
$Descr A4 11693 8268
encoding utf-8
Sheet 1 1
Title "Quad FET Mixer"
Date "2021-03-05"
Rev "2.1"
Comp "Dyadic Pty Ltd"
Comment1 "2020"
Comment2 ""
Comment3 ""
Comment4 ""
$EndDescr
$Comp
L project:PE4140 U1
U 1 1 5A1519D9
P 5750 2700
F 0 "U1" H 6125 3200 60  0000 C CNN
F 1 "PE4140" H 6125 3100 60  0000 C CNN
F 2 "PSemi:DFN-6-1EP_3x3mm_P0.95mm_EP1.2x2.0mm" H -750 -550 60  0001 C CNN
F 3 "" H -750 -550 60  0000 C CNN
F 4 "pSemi" H 5750 2700 50  0001 C CNN "MFN"
F 5 "PE4140B-Z" H 5750 2700 50  0001 C CNN "MFP"
F 6 "1046-1021-1-ND" H 5750 2700 50  0001 C CNN "S1PN"
F 7 "Digi-Key" H 5750 2700 50  0001 C CNN "S1PL"
F 8 "PE4140B-Z" H 5750 2700 50  0001 C CNN "S2PN"
F 9 "Verical" H 5750 2700 50  0001 C CNN "S2PL"
F 10 "IC MIXER 0-6GHZ QUAD MSFT" H 5750 2700 50  0001 C CNN "Description"
F 11 "6DFN" H 5750 2700 50  0001 C CNN "Package ID"
	1    5750 2700
	1    0    0    -1  
$EndComp
$Comp
L project:TRANSFO4 T3
U 1 1 5A151A91
P 8675 2700
F 0 "T3" H 9025 2750 50  0000 C CNN
F 1 "ETC1-1-13TR" H 9075 2650 50  0000 C CNN
F 2 "RF_Transformers:SM-22-5" H 2925 350 60  0001 C CNN
F 3 "" H 2925 350 60  0000 C CNN
F 4 "Macom" H 8675 2700 60  0001 C CNN "MFN"
F 5 "ETC1-1-13TR" H 8675 2700 60  0001 C CNN "MFP"
F 6 "937-ETC1-1-13TR" H 8675 2700 60  0001 C CNN "S1PN"
F 7 "Mouser" H 8675 2700 60  0001 C CNN "S1PL"
F 8 "1465-1217-1-ND" H 8675 2700 60  0001 C CNN "S2PN"
F 9 "Digi-Key" H 8675 2700 60  0001 C CNN "S2PL"
F 10 "~" H 8675 2700 60  0001 C CNN "Characteristics"
F 11 "Signal Transformers 4.5-3000MHz IL 2dB Impedance Ratio 1:1" H 8675 2700 60  0001 C CNN "Description"
F 12 "SM-22" H 8675 2700 60  0001 C CNN "Package ID"
F 13 "~" H 8675 2700 60  0001 C CNN "Source"
F 14 "N" H 8675 2700 60  0001 C CNN "Critical"
F 15 "~" H 8675 2700 60  0001 C CNN "Notes"
	1    8675 2700
	1    0    0    1   
$EndComp
$Comp
L project:SMA_2 J3
U 1 1 5A151C9B
P 10400 2900
F 0 "J3" H 10503 2890 50  0000 L CNN
F 1 "IF" H 10503 2799 50  0000 L CNN
F 2 "SMA_Connectors:SMA_EDGE_4" H 8475 -350 50  0001 C CNN
F 3 "" H 8300 -250 60  0000 C CNN
F 4 "Molex" H 4425 7700 50  0001 C CNN "MFN"
F 5 "0732511150" H 4425 7700 50  0001 C CNN "MFP"
F 6 "S01-SJEDM-11BS05" H 4425 7700 50  0001 C CNN "S1PN"
F 7 "Superbat" H 4425 7700 50  0001 C CNN "S1PL"
F 8 "73251-1150" H 4425 7700 50  0001 C CNN "S2PN"
F 9 "TTI" H 4425 7700 50  0001 C CNN "S2PL"
F 10 "SMA ST PCB-JCK" H 4425 7700 50  0001 C CNN "Description"
F 11 "1:$1.20; 10:$1.08; 100:$0.98" H 10400 2900 50  0001 C CNN "kicost:RF_Supplier:pricing"
	1    10400 2900
	1    0    0    -1  
$EndComp
$Comp
L project:SMA_2 J1
U 1 1 5A151D43
P 1125 2500
F 0 "J1" H 1228 2490 50  0000 L CNN
F 1 "RF" H 1228 2399 50  0000 L CNN
F 2 "SMA_Connectors:SMA_EDGE_4" H -800 -750 50  0001 C CNN
F 3 "" H -975 -650 60  0000 C CNN
F 4 "Molex" H 4425 7300 50  0001 C CNN "MFN"
F 5 "0732511150" H 4425 7300 50  0001 C CNN "MFP"
F 6 "S01-SJEDM-11BS05" H 4425 7300 50  0001 C CNN "S1PN"
F 7 "Superbat" H 4425 7300 50  0001 C CNN "S1PL"
F 8 "73251-1150" H 4425 7300 50  0001 C CNN "S2PN"
F 9 "TTI" H 4425 7300 50  0001 C CNN "S2PL"
F 10 "SMA ST PCB-JCK" H 4425 7300 50  0001 C CNN "Description"
F 11 "1:$1.20; 10:$1.08; 100:$0.98" H 1125 2500 50  0001 C CNN "kicost:RF_Supplier:pricing"
	1    1125 2500
	-1   0    0    -1  
$EndComp
$Comp
L project:SMA_2 J2
U 1 1 5A15207E
P 1150 5250
F 0 "J2" H 1253 5240 50  0000 L CNN
F 1 "LO" H 1253 5149 50  0000 L CNN
F 2 "SMA_Connectors:SMA_EDGE_4" H -775 2000 50  0001 C CNN
F 3 "" H -950 2100 60  0000 C CNN
F 4 "Molex" H 4450 7700 50  0001 C CNN "MFN"
F 5 "0732511150" H 4450 7700 50  0001 C CNN "MFP"
F 6 "S01-SJEDM-11BS05" H 4450 7700 50  0001 C CNN "S1PN"
F 7 "Superbat" H 4450 7700 50  0001 C CNN "S1PL"
F 8 "73251-1150" H 4450 7700 50  0001 C CNN "S2PN"
F 9 "TTI" H 4450 7700 50  0001 C CNN "S2PL"
F 10 "SMA ST PCB-JCK" H 4450 7700 50  0001 C CNN "Description"
F 11 "1:$1.20; 10:$1.08; 100:$0.98" H 1150 5250 50  0001 C CNN "kicost:RF_Supplier:pricing"
	1    1150 5250
	-1   0    0    -1  
$EndComp
Wire Wire Line
	5200 2600 5000 2600
Wire Wire Line
	5200 2800 5000 2800
$Comp
L power:GND #PWR01
U 1 1 5A152B22
P 4700 3250
F 0 "#PWR01" H 150 1825 50  0001 C CNN
F 1 "GND" H 4705 3077 50  0000 C CNN
F 2 "" H 150 2075 60  0000 C CNN
F 3 "" H 150 2075 60  0000 C CNN
	1    4700 3250
	1    0    0    -1  
$EndComp
Wire Wire Line
	8025 2700 8025 3375
Wire Wire Line
	6300 2600 6500 2600
Wire Wire Line
	6500 2600 6500 2500
Wire Wire Line
	6300 2800 6500 2800
Wire Wire Line
	6500 2800 6500 2900
$Comp
L power:GND #PWR04
U 1 1 5A152EF4
P 5425 2050
F 0 "#PWR04" H 875 625 50  0001 C CNN
F 1 "GND" H 5430 1877 50  0000 C CNN
F 2 "" H 875 875 60  0000 C CNN
F 3 "" H 875 875 60  0000 C CNN
	1    5425 2050
	-1   0    0    -1  
$EndComp
$Comp
L device:R R22
U 1 1 5A1536A2
P 3925 5575
F 0 "R22" H 3995 5621 50  0000 L CNN
F 1 "DNF" H 3995 5530 50  0000 L CNN
F 2 "Resistor_SMD:R_0402_1005Metric" V -2745 3100 30  0001 C CNN
F 3 "" H -2675 3100 30  0000 C CNN
F 4 "1" H 3925 5575 50  0001 C CNN "DNP"
	1    3925 5575
	1    0    0    -1  
$EndComp
$Comp
L device:R R20
U 1 1 5A1536A8
P 3675 5575
F 0 "R20" H 3450 5625 50  0000 L CNN
F 1 "DNF" H 3450 5525 50  0000 L CNN
F 2 "Resistor_SMD:R_0402_1005Metric" V -2995 3100 30  0001 C CNN
F 3 "" H -2925 3100 30  0000 C CNN
F 4 "1" H 3675 5575 50  0001 C CNN "DNP"
	1    3675 5575
	1    0    0    -1  
$EndComp
$Comp
L power:GND #PWR07
U 1 1 5A1536CA
P 3425 5725
F 0 "#PWR07" H -1125 4300 50  0001 C CNN
F 1 "GND" H 3430 5552 50  0000 C CNN
F 2 "" H -1125 4550 60  0000 C CNN
F 3 "" H -1125 4550 60  0000 C CNN
	1    3425 5725
	1    0    0    -1  
$EndComp
$Comp
L power:GND #PWR08
U 1 1 5A1536D0
P 3675 5725
F 0 "#PWR08" H -875 4300 50  0001 C CNN
F 1 "GND" H 3680 5552 50  0000 C CNN
F 2 "" H -875 4550 60  0000 C CNN
F 3 "" H -875 4550 60  0000 C CNN
	1    3675 5725
	1    0    0    -1  
$EndComp
$Comp
L power:GND #PWR09
U 1 1 5A1536D6
P 3925 5725
F 0 "#PWR09" H -625 4300 50  0001 C CNN
F 1 "GND" H 3930 5552 50  0000 C CNN
F 2 "" H -625 4550 60  0000 C CNN
F 3 "" H -625 4550 60  0000 C CNN
	1    3925 5725
	1    0    0    -1  
$EndComp
Wire Wire Line
	5650 4850 5650 3250
Wire Wire Line
	5850 5250 5850 3250
$Comp
L power:GND #PWR010
U 1 1 5A15683F
P 1925 4925
F 0 "#PWR010" H -2625 3500 50  0001 C CNN
F 1 "GND" H 1930 4752 50  0000 C CNN
F 2 "" H -2625 3750 60  0000 C CNN
F 3 "" H -2625 3750 60  0000 C CNN
	1    1925 4925
	1    0    0    -1  
$EndComp
$Comp
L power:GND #PWR013
U 1 1 5A1569DA
P 1150 5425
F 0 "#PWR013" H -3400 4000 50  0001 C CNN
F 1 "GND" H 1155 5252 50  0000 C CNN
F 2 "" H -3400 4250 60  0000 C CNN
F 3 "" H -3400 4250 60  0000 C CNN
	1    1150 5425
	1    0    0    -1  
$EndComp
Wire Wire Line
	2325 2900 2175 2900
$Comp
L power:GND #PWR014
U 1 1 5A1572BC
P 2175 3000
F 0 "#PWR014" H -2375 1575 50  0001 C CNN
F 1 "GND" H 2180 2827 50  0000 C CNN
F 2 "" H -2375 1825 60  0000 C CNN
F 3 "" H -2375 1825 60  0000 C CNN
	1    2175 3000
	1    0    0    -1  
$EndComp
$Comp
L power:GND #PWR017
U 1 1 5A157457
P 1125 2675
F 0 "#PWR017" H -3425 1250 50  0001 C CNN
F 1 "GND" H 1130 2502 50  0000 C CNN
F 2 "" H -3425 1500 60  0000 C CNN
F 3 "" H -3425 1500 60  0000 C CNN
	1    1125 2675
	1    0    0    -1  
$EndComp
$Comp
L power:GND #PWR021
U 1 1 5A15A16A
P 10400 3075
F 0 "#PWR021" H 5850 1650 50  0001 C CNN
F 1 "GND" H 10405 2902 50  0000 C CNN
F 2 "" H 5850 1900 60  0000 C CNN
F 3 "" H 5850 1900 60  0000 C CNN
	1    10400 3075
	-1   0    0    -1  
$EndComp
$Comp
L power:PWR_FLAG #FLG022
U 1 1 5A16779A
P 10400 5925
F 0 "#FLG022" H 10450 5975 50  0001 C CNN
F 1 "PWR_FLAG" H 10400 6149 50  0000 C CNN
F 2 "" H 2575 1525 60  0000 C CNN
F 3 "" H 2575 1525 60  0000 C CNN
	1    10400 5925
	1    0    0    -1  
$EndComp
$Comp
L power:GND #PWR023
U 1 1 5A167824
P 10400 5925
F 0 "#PWR023" H 5850 4500 50  0001 C CNN
F 1 "GND" H 10405 5752 50  0000 C CNN
F 2 "" H 5850 4750 60  0000 C CNN
F 3 "" H 5850 4750 60  0000 C CNN
	1    10400 5925
	1    0    0    -1  
$EndComp
$Comp
L project:rfi_shield_clip P1
U 1 1 5C896462
P 8450 5600
F 0 "P1" H 8578 5619 60  0000 L CNN
F 1 "~" H 8578 5566 60  0000 L CNN
F 2 "RF_Shielding:S1721-46R" H 8450 5600 60  0001 C CNN
F 3 "" H 8450 5600 60  0000 C CNN
F 4 "Harwin Inc." H 9875 3000 50  0001 C CNN "MFN"
F 5 "S1721-46R" H 9875 3000 50  0001 C CNN "MFP"
F 6 "952-1476-1-ND" H 9875 3000 50  0001 C CNN "S1PN"
F 7 "Digi-Key" H 9875 3000 50  0001 C CNN "S1PL"
F 8 "855-S1721-46R" H 9875 3000 50  0001 C CNN "S2PN"
F 9 "Mouser" H 9875 3000 50  0001 C CNN "S2PL"
F 10 "RFI SHIELD CLIP MINI TIN SMD" H 9875 3000 50  0001 C CNN "Description"
	1    8450 5600
	1    0    0    -1  
$EndComp
$Comp
L power:GND #PWR026
U 1 1 5C896584
P 8450 5700
F 0 "#PWR026" H 3900 4275 50  0001 C CNN
F 1 "GND" H 8455 5527 50  0000 C CNN
F 2 "" H 3900 4525 60  0000 C CNN
F 3 "" H 3900 4525 60  0000 C CNN
	1    8450 5700
	-1   0    0    -1  
$EndComp
$Comp
L project:rfi_shield_clip P3
U 1 1 5C896926
P 9375 5600
F 0 "P3" H 9503 5619 60  0000 L CNN
F 1 "~" H 9503 5566 60  0000 L CNN
F 2 "RF_Shielding:S1721-46R" H 9375 5600 60  0001 C CNN
F 3 "" H 9375 5600 60  0000 C CNN
F 4 "Harwin Inc." H 9875 3000 50  0001 C CNN "MFN"
F 5 "S1721-46R" H 9875 3000 50  0001 C CNN "MFP"
F 6 "952-1476-1-ND" H 9875 3000 50  0001 C CNN "S1PN"
F 7 "Digi-Key" H 9875 3000 50  0001 C CNN "S1PL"
F 8 "855-S1721-46R" H 9875 3000 50  0001 C CNN "S2PN"
F 9 "Mouser" H 9875 3000 50  0001 C CNN "S2PL"
F 10 "RFI SHIELD CLIP MINI TIN SMD" H 9875 3000 50  0001 C CNN "Description"
	1    9375 5600
	1    0    0    -1  
$EndComp
$Comp
L power:GND #PWR028
U 1 1 5C89692C
P 9375 5700
F 0 "#PWR028" H 4825 4275 50  0001 C CNN
F 1 "GND" H 9380 5527 50  0000 C CNN
F 2 "" H 4825 4525 60  0000 C CNN
F 3 "" H 4825 4525 60  0000 C CNN
	1    9375 5700
	-1   0    0    -1  
$EndComp
$Comp
L project:rfi_shield_clip P2
U 1 1 5C89DFE1
P 8925 5600
F 0 "P2" H 9053 5619 60  0000 L CNN
F 1 "~" H 9053 5566 60  0000 L CNN
F 2 "RF_Shielding:S1721-46R" H 8925 5600 60  0001 C CNN
F 3 "" H 8925 5600 60  0000 C CNN
F 4 "Harwin Inc." H 9875 3000 50  0001 C CNN "MFN"
F 5 "S1721-46R" H 9875 3000 50  0001 C CNN "MFP"
F 6 "952-1476-1-ND" H 9875 3000 50  0001 C CNN "S1PN"
F 7 "Digi-Key" H 9875 3000 50  0001 C CNN "S1PL"
F 8 "855-S1721-46R" H 9875 3000 50  0001 C CNN "S2PN"
F 9 "Mouser" H 9875 3000 50  0001 C CNN "S2PL"
F 10 "RFI SHIELD CLIP MINI TIN SMD" H 9875 3000 50  0001 C CNN "Description"
	1    8925 5600
	1    0    0    -1  
$EndComp
$Comp
L power:GND #PWR027
U 1 1 5C89DFE7
P 8925 5700
F 0 "#PWR027" H 4375 4275 50  0001 C CNN
F 1 "GND" H 8930 5527 50  0000 C CNN
F 2 "" H 4375 4525 60  0000 C CNN
F 3 "" H 4375 4525 60  0000 C CNN
	1    8925 5700
	-1   0    0    -1  
$EndComp
$Comp
L project:rfi_shield_clip P4
U 1 1 5C8A1B9C
P 8450 6175
F 0 "P4" H 8578 6194 60  0000 L CNN
F 1 "~" H 8578 6141 60  0000 L CNN
F 2 "RF_Shielding:S1721-46R" H 8450 6175 60  0001 C CNN
F 3 "" H 8450 6175 60  0000 C CNN
F 4 "Harwin Inc." H 9875 3000 50  0001 C CNN "MFN"
F 5 "S1721-46R" H 9875 3000 50  0001 C CNN "MFP"
F 6 "952-1476-1-ND" H 9875 3000 50  0001 C CNN "S1PN"
F 7 "Digi-Key" H 9875 3000 50  0001 C CNN "S1PL"
F 8 "855-S1721-46R" H 9875 3000 50  0001 C CNN "S2PN"
F 9 "Mouser" H 9875 3000 50  0001 C CNN "S2PL"
F 10 "RFI SHIELD CLIP MINI TIN SMD" H 9875 3000 50  0001 C CNN "Description"
	1    8450 6175
	1    0    0    -1  
$EndComp
$Comp
L power:GND #PWR029
U 1 1 5C8A1BA2
P 8450 6275
F 0 "#PWR029" H 3900 4850 50  0001 C CNN
F 1 "GND" H 8455 6102 50  0000 C CNN
F 2 "" H 3900 5100 60  0000 C CNN
F 3 "" H 3900 5100 60  0000 C CNN
	1    8450 6275
	-1   0    0    -1  
$EndComp
$Comp
L project:rfi_shield_clip P6
U 1 1 5C8A1BA8
P 9375 6175
F 0 "P6" H 9503 6194 60  0000 L CNN
F 1 "~" H 9503 6141 60  0000 L CNN
F 2 "RF_Shielding:S1721-46R" H 9375 6175 60  0001 C CNN
F 3 "" H 9375 6175 60  0000 C CNN
F 4 "Harwin Inc." H 9875 3000 50  0001 C CNN "MFN"
F 5 "S1721-46R" H 9875 3000 50  0001 C CNN "MFP"
F 6 "952-1476-1-ND" H 9875 3000 50  0001 C CNN "S1PN"
F 7 "Digi-Key" H 9875 3000 50  0001 C CNN "S1PL"
F 8 "855-S1721-46R" H 9875 3000 50  0001 C CNN "S2PN"
F 9 "Mouser" H 9875 3000 50  0001 C CNN "S2PL"
F 10 "RFI SHIELD CLIP MINI TIN SMD" H 9875 3000 50  0001 C CNN "Description"
	1    9375 6175
	1    0    0    -1  
$EndComp
$Comp
L power:GND #PWR031
U 1 1 5C8A1BAE
P 9375 6275
F 0 "#PWR031" H 4825 4850 50  0001 C CNN
F 1 "GND" H 9380 6102 50  0000 C CNN
F 2 "" H 4825 5100 60  0000 C CNN
F 3 "" H 4825 5100 60  0000 C CNN
	1    9375 6275
	-1   0    0    -1  
$EndComp
$Comp
L graphics:Logo_Open_Hardware_Small #LOGO1
U 1 1 5C770C09
P 1150 1100
F 0 "#LOGO1" H 1150 1375 50  0001 C CNN
F 1 "Open Source Hardware" H 1150 1394 50  0000 C CNN
F 2 "" H 1150 1100 50  0001 C CNN
F 3 "~" H 1150 1100 50  0001 C CNN
	1    1150 1100
	1    0    0    -1  
$EndComp
$Comp
L project:TRANSFO4 T1
U 1 1 5ED692B3
P 2850 5050
F 0 "T1" H 3275 5100 50  0000 C CNN
F 1 "ETC1.6-4-2-3TR" H 3275 5000 50  0000 C CNN
F 2 "RF_Transformers:SM-22-5" H -2900 2700 60  0001 C CNN
F 3 "" H -2900 2700 60  0000 C CNN
F 4 "Macom" H 2850 5050 60  0001 C CNN "MFN"
F 5 "ETC1.6-4-2-3TR" H 2850 5050 60  0001 C CNN "MFP"
F 6 "937-ETC1.6-4-2-3TR" H 2850 5050 60  0001 C CNN "S1PN"
F 7 "Mouser" H 2850 5050 60  0001 C CNN "S1PL"
F 8 "ETC1.6-4-2-3TR" H 2850 5050 60  0001 C CNN "S2PN"
F 9 "Verical" H 2850 5050 60  0001 C CNN "S2PL"
F 10 "~" H 2850 5050 60  0001 C CNN "Characteristics"
F 11 "Signal Transformers 500-3000MHz Imp. Ratio 4:1" H 2850 5050 60  0001 C CNN "Description"
F 12 "SM-22" H 2850 5050 60  0001 C CNN "Package ID"
F 13 "~" H 2850 5050 60  0001 C CNN "Source"
F 14 "N" H 2850 5050 60  0001 C CNN "Critical"
F 15 "~" H 2850 5050 60  0001 C CNN "Notes"
	1    2850 5050
	-1   0    0    1   
$EndComp
Wire Wire Line
	8275 2700 8025 2700
$Comp
L project:TRANSFO4 T2
U 1 1 5EF415B5
P 2725 2700
F 0 "T2" H 3075 2750 50  0000 C CNN
F 1 "ETC1-1-13TR" H 3125 2650 50  0000 C CNN
F 2 "RF_Transformers:SM-22-5" H -3025 350 60  0001 C CNN
F 3 "" H -3025 350 60  0000 C CNN
F 4 "Macom" H 2725 2700 60  0001 C CNN "MFN"
F 5 "ETC1-1-13TR" H 2725 2700 60  0001 C CNN "MFP"
F 6 "937-ETC1-1-13TR" H 2725 2700 60  0001 C CNN "S1PN"
F 7 "Mouser" H 2725 2700 60  0001 C CNN "S1PL"
F 8 "1465-1217-1-ND" H 2725 2700 60  0001 C CNN "S2PN"
F 9 "Digi-Key" H 2725 2700 60  0001 C CNN "S2PL"
F 10 "~" H 2725 2700 60  0001 C CNN "Characteristics"
F 11 "Signal Transformers 4.5-3000MHz IL 2dB Impedance Ratio 1:1" H 2725 2700 60  0001 C CNN "Description"
F 12 "SM-22" H 2725 2700 60  0001 C CNN "Package ID"
F 13 "~" H 2725 2700 60  0001 C CNN "Source"
F 14 "N" H 2725 2700 60  0001 C CNN "Critical"
F 15 "~" H 2725 2700 60  0001 C CNN "Notes"
	1    2725 2700
	-1   0    0    -1  
$EndComp
Wire Wire Line
	6500 2900 8275 2900
Wire Wire Line
	6500 2500 8275 2500
$Comp
L device:R R12
U 1 1 601DFB83
P 4300 4850
F 0 "R12" V 4200 4775 50  0000 L CNN
F 1 "0" V 4400 4825 50  0000 L CNN
F 2 "Resistor_SMD:R_0402_1005Metric" V -2370 2375 30  0001 C CNN
F 3 "" H -2300 2375 30  0000 C CNN
F 4 "1" H 4300 4850 50  0001 C CNN "DNP"
	1    4300 4850
	0    1    1    0   
$EndComp
$Comp
L device:R R13
U 1 1 601E0043
P 4300 5250
F 0 "R13" V 4200 5175 50  0000 L CNN
F 1 "0" V 4400 5225 50  0000 L CNN
F 2 "Resistor_SMD:R_0402_1005Metric" V -2370 2775 30  0001 C CNN
F 3 "" H -2300 2775 30  0000 C CNN
F 4 "1" H 4300 5250 50  0001 C CNN "DNP"
	1    4300 5250
	0    1    1    0   
$EndComp
Wire Wire Line
	3250 5050 3425 5050
Wire Wire Line
	3425 5050 3425 5725
Wire Wire Line
	3675 5425 3675 5250
Wire Wire Line
	3925 5425 3925 4850
$Comp
L device:R R5
U 1 1 60207B73
P 3900 2500
F 0 "R5" H 3970 2546 50  0000 L CNN
F 1 "DNF" H 3970 2455 50  0000 L CNN
F 2 "Resistor_SMD:R_0402_1005Metric" V -2770 25  30  0001 C CNN
F 3 "" H -2700 25  30  0000 C CNN
F 4 "Panasonic Electronic Components" H 7525 5000 60  0001 C CNN "MFN"
F 5 "ERJ-2GE0R00X" H 7525 5000 60  0001 C CNN "MFP"
F 6 "P0.0JCT-ND" H 7525 5000 60  0001 C CNN "S1PN"
F 7 "Digi-Key" H 7525 5000 60  0001 C CNN "S1PL"
F 8 "ERJ-2GE0R00X" H 7525 5000 60  0001 C CNN "S2PN"
F 9 "Arrow" H 7525 5000 60  0001 C CNN "S2PL"
F 10 "~" H 7525 5000 60  0001 C CNN "Characteristics"
F 11 "RES SMD 0.0OHM JUMPER 1/10W" H 7525 5000 60  0001 C CNN "Description"
F 12 "0402 (1005 Metric)" H 7525 5000 60  0001 C CNN "Package ID"
	1    3900 2500
	1    0    0    -1  
$EndComp
$Comp
L device:R R6
U 1 1 60207C29
P 4400 2500
F 0 "R6" H 4470 2546 50  0000 L CNN
F 1 "DNF" H 4470 2455 50  0000 L CNN
F 2 "Resistor_SMD:R_0402_1005Metric" V -2270 25  30  0001 C CNN
F 3 "" H -2200 25  30  0000 C CNN
F 4 "Panasonic Electronic Components" H 8025 5000 60  0001 C CNN "MFN"
F 5 "ERJ-2GE0R00X" H 8025 5000 60  0001 C CNN "MFP"
F 6 "P0.0JCT-ND" H 8025 5000 60  0001 C CNN "S1PN"
F 7 "Digi-Key" H 8025 5000 60  0001 C CNN "S1PL"
F 8 "ERJ-2GE0R00X" H 8025 5000 60  0001 C CNN "S2PN"
F 9 "Arrow" H 8025 5000 60  0001 C CNN "S2PL"
F 10 "~" H 8025 5000 60  0001 C CNN "Characteristics"
F 11 "RES SMD 0.0OHM JUMPER 1/10W" H 8025 5000 60  0001 C CNN "Description"
F 12 "0402 (1005 Metric)" H 8025 5000 60  0001 C CNN "Package ID"
	1    4400 2500
	1    0    0    -1  
$EndComp
$Comp
L device:R R1
U 1 1 60207E18
P 3600 2250
F 0 "R1" V 3500 2200 50  0000 L CNN
F 1 "0" V 3700 2225 50  0000 L CNN
F 2 "Resistor_SMD:R_0402_1005Metric" V -3070 -225 30  0001 C CNN
F 3 "" H -3000 -225 30  0000 C CNN
	1    3600 2250
	0    1    1    0   
$EndComp
$Comp
L device:R R2
U 1 1 60207EAA
P 4150 2250
F 0 "R2" V 4050 2200 50  0000 L CNN
F 1 "0" V 4250 2225 50  0000 L CNN
F 2 "Resistor_SMD:R_0402_1005Metric" V -2520 -225 30  0001 C CNN
F 3 "" H -2450 -225 30  0000 C CNN
	1    4150 2250
	0    1    1    0   
$EndComp
$Comp
L device:R R9
U 1 1 6020803E
P 3900 2900
F 0 "R9" H 3970 2946 50  0000 L CNN
F 1 "DNF" H 3970 2855 50  0000 L CNN
F 2 "Resistor_SMD:R_0402_1005Metric" V -2770 425 30  0001 C CNN
F 3 "" H -2700 425 30  0000 C CNN
F 4 "Panasonic Electronic Components" H 7525 5400 60  0001 C CNN "MFN"
F 5 "ERJ-2GE0R00X" H 7525 5400 60  0001 C CNN "MFP"
F 6 "P0.0JCT-ND" H 7525 5400 60  0001 C CNN "S1PN"
F 7 "Digi-Key" H 7525 5400 60  0001 C CNN "S1PL"
F 8 "ERJ-2GE0R00X" H 7525 5400 60  0001 C CNN "S2PN"
F 9 "Arrow" H 7525 5400 60  0001 C CNN "S2PL"
F 10 "~" H 7525 5400 60  0001 C CNN "Characteristics"
F 11 "RES SMD 0.0OHM JUMPER 1/10W" H 7525 5400 60  0001 C CNN "Description"
F 12 "0402 (1005 Metric)" H 7525 5400 60  0001 C CNN "Package ID"
	1    3900 2900
	1    0    0    -1  
$EndComp
$Comp
L device:R R10
U 1 1 602080BF
P 4400 2900
F 0 "R10" H 4470 2946 50  0000 L CNN
F 1 "DNF" H 4470 2855 50  0000 L CNN
F 2 "Resistor_SMD:R_0402_1005Metric" V -2270 425 30  0001 C CNN
F 3 "" H -2200 425 30  0000 C CNN
F 4 "Panasonic Electronic Components" H 8025 5400 60  0001 C CNN "MFN"
F 5 "ERJ-2GE0R00X" H 8025 5400 60  0001 C CNN "MFP"
F 6 "P0.0JCT-ND" H 8025 5400 60  0001 C CNN "S1PN"
F 7 "Digi-Key" H 8025 5400 60  0001 C CNN "S1PL"
F 8 "ERJ-2GE0R00X" H 8025 5400 60  0001 C CNN "S2PN"
F 9 "Arrow" H 8025 5400 60  0001 C CNN "S2PL"
F 10 "~" H 8025 5400 60  0001 C CNN "Characteristics"
F 11 "RES SMD 0.0OHM JUMPER 1/10W" H 8025 5400 60  0001 C CNN "Description"
F 12 "0402 (1005 Metric)" H 8025 5400 60  0001 C CNN "Package ID"
	1    4400 2900
	1    0    0    -1  
$EndComp
$Comp
L device:R R11
U 1 1 60208135
P 3600 3150
F 0 "R11" V 3500 3100 50  0000 L CNN
F 1 "0" V 3700 3125 50  0000 L CNN
F 2 "Resistor_SMD:R_0402_1005Metric" V -3070 675 30  0001 C CNN
F 3 "" H -3000 675 30  0000 C CNN
	1    3600 3150
	0    1    1    0   
$EndComp
Wire Wire Line
	4300 2250 4400 2250
Wire Wire Line
	5000 2250 5000 2600
Wire Wire Line
	3750 3150 3900 3150
Wire Wire Line
	5000 2800 5000 3150
Wire Wire Line
	3125 2700 3900 2700
Wire Wire Line
	4400 2700 4400 2750
Wire Wire Line
	4400 2650 4400 2700
Connection ~ 4400 2700
Wire Wire Line
	3900 2750 3900 2700
Connection ~ 3900 2700
Wire Wire Line
	3900 2700 4400 2700
Wire Wire Line
	3900 2650 3900 2700
Wire Wire Line
	3750 2250 3900 2250
Wire Wire Line
	3900 2350 3900 2250
Connection ~ 3900 2250
Wire Wire Line
	3900 2250 4000 2250
Wire Wire Line
	3900 3050 3900 3150
Connection ~ 3900 3150
Wire Wire Line
	3900 3150 4400 3150
Wire Wire Line
	4400 3050 4400 3150
Connection ~ 4400 3150
Wire Wire Line
	4400 3150 5000 3150
Wire Wire Line
	3450 2250 3300 2250
Wire Wire Line
	3300 2250 3300 2500
Wire Wire Line
	3300 2500 3125 2500
Wire Wire Line
	3125 2900 3300 2900
Wire Wire Line
	3300 2900 3300 3150
Wire Wire Line
	3300 3150 3450 3150
Wire Wire Line
	4400 2700 4700 2700
Wire Wire Line
	4700 2700 4700 3250
Wire Wire Line
	4400 2350 4400 2250
Connection ~ 4400 2250
Wire Wire Line
	4400 2250 5000 2250
Wire Wire Line
	3250 5250 3675 5250
Wire Wire Line
	3250 4850 3925 4850
Wire Wire Line
	4150 4850 3925 4850
Connection ~ 3925 4850
Wire Wire Line
	4150 5250 3675 5250
Connection ~ 3675 5250
Wire Wire Line
	4450 4850 5650 4850
Wire Wire Line
	4450 5250 5850 5250
Wire Wire Line
	1250 2500 2325 2500
Wire Wire Line
	9075 2900 10275 2900
Wire Wire Line
	1275 5250 2450 5250
$Comp
L power:GND #PWR0101
U 1 1 602D05FA
P 9500 2575
F 0 "#PWR0101" H 4950 1150 50  0001 C CNN
F 1 "GND" H 9505 2402 50  0000 C CNN
F 2 "" H 4950 1400 60  0000 C CNN
F 3 "" H 4950 1400 60  0000 C CNN
	1    9500 2575
	-1   0    0    -1  
$EndComp
Wire Wire Line
	9500 2500 9500 2575
Wire Wire Line
	9075 2500 9500 2500
Wire Wire Line
	2175 2900 2175 3000
Wire Wire Line
	1925 4850 1925 4925
Wire Wire Line
	1925 4850 2450 4850
Wire Wire Line
	5425 2050 5425 1925
Wire Wire Line
	5425 1925 5750 1925
Wire Wire Line
	5750 1925 5750 2150
$Comp
L power:GND #PWR0102
U 1 1 603C8E4C
P 8025 3375
F 0 "#PWR0102" H 3475 1950 50  0001 C CNN
F 1 "GND" H 8030 3202 50  0000 C CNN
F 2 "" H 3475 2200 60  0000 C CNN
F 3 "" H 3475 2200 60  0000 C CNN
	1    8025 3375
	-1   0    0    -1  
$EndComp
$EndSCHEMATC
