(module VQFN-24-1EP_4x4mm_P0.5mm_EP2.45x2.45mm_ThermalVias (layer F.Cu) (tedit 5DCD5946)
  (descr "VQFN, 24 Pin (http://www.ti.com/lit/ds/symlink/msp430f1101a.pdf), generated with kicad-footprint-generator ipc_dfn_qfn_generator.py")
  (tags "VQFN DFN_QFN")
  (attr smd)
  (fp_text reference U1 (at -3.0607 -3.1242) (layer F.SilkS)
    (effects (font (size 0.635 0.635) (thickness 0.1016)))
  )
  (fp_text value PE43711 (at 0 3.32) (layer F.Fab)
    (effects (font (size 0.635 0.635) (thickness 0.1016)))
  )
  (fp_text user %R (at 0 0) (layer F.Fab)
    (effects (font (size 1 1) (thickness 0.15)))
  )
  (fp_line (start 2.62 -2.62) (end -2.62 -2.62) (layer F.CrtYd) (width 0.05))
  (fp_line (start 2.62 2.62) (end 2.62 -2.62) (layer F.CrtYd) (width 0.05))
  (fp_line (start -2.62 2.62) (end 2.62 2.62) (layer F.CrtYd) (width 0.05))
  (fp_line (start -2.62 -2.62) (end -2.62 2.62) (layer F.CrtYd) (width 0.05))
  (fp_line (start -2 -1) (end -1 -2) (layer F.Fab) (width 0.1))
  (fp_line (start -2 2) (end -2 -1) (layer F.Fab) (width 0.1))
  (fp_line (start 2 2) (end -2 2) (layer F.Fab) (width 0.1))
  (fp_line (start 2 -2) (end 2 2) (layer F.Fab) (width 0.1))
  (fp_line (start -1 -2) (end 2 -2) (layer F.Fab) (width 0.1))
  (fp_line (start -1.635 -2.11) (end -2.11 -2.11) (layer F.SilkS) (width 0.12))
  (fp_line (start 2.11 2.11) (end 2.11 1.635) (layer F.SilkS) (width 0.12))
  (fp_line (start 1.635 2.11) (end 2.11 2.11) (layer F.SilkS) (width 0.12))
  (fp_line (start -2.11 2.11) (end -2.11 1.635) (layer F.SilkS) (width 0.12))
  (fp_line (start -1.635 2.11) (end -2.11 2.11) (layer F.SilkS) (width 0.12))
  (fp_line (start 2.11 -2.11) (end 2.11 -1.635) (layer F.SilkS) (width 0.12))
  (fp_line (start 1.635 -2.11) (end 2.11 -2.11) (layer F.SilkS) (width 0.12))
  (pad 24 smd roundrect (at -1.25 -1.9875) (size 0.3 0.775) (layers F.Cu F.Paste F.Mask) (roundrect_rratio 0.25))
  (pad 23 smd roundrect (at -0.75 -1.9875) (size 0.3 0.775) (layers F.Cu F.Paste F.Mask) (roundrect_rratio 0.25))
  (pad 22 smd roundrect (at -0.25 -1.9875) (size 0.3 0.775) (layers F.Cu F.Paste F.Mask) (roundrect_rratio 0.25))
  (pad 21 smd roundrect (at 0.25 -1.9875) (size 0.3 0.775) (layers F.Cu F.Paste F.Mask) (roundrect_rratio 0.25))
  (pad 20 smd roundrect (at 0.75 -1.9875) (size 0.3 0.775) (layers F.Cu F.Paste F.Mask) (roundrect_rratio 0.25))
  (pad 19 smd roundrect (at 1.25 -1.9875) (size 0.3 0.775) (layers F.Cu F.Paste F.Mask) (roundrect_rratio 0.25))
  (pad 18 smd roundrect (at 1.9875 -1.25) (size 0.775 0.3) (layers F.Cu F.Paste F.Mask) (roundrect_rratio 0.25))
  (pad 17 smd roundrect (at 1.9875 -0.75) (size 0.775 0.3) (layers F.Cu F.Paste F.Mask) (roundrect_rratio 0.25))
  (pad 16 smd roundrect (at 1.9875 -0.25) (size 0.775 0.3) (layers F.Cu F.Paste F.Mask) (roundrect_rratio 0.25))
  (pad 15 smd roundrect (at 1.9875 0.25) (size 0.775 0.3) (layers F.Cu F.Paste F.Mask) (roundrect_rratio 0.25))
  (pad 14 smd roundrect (at 1.9875 0.75) (size 0.775 0.3) (layers F.Cu F.Paste F.Mask) (roundrect_rratio 0.25))
  (pad 13 smd roundrect (at 1.9875 1.25) (size 0.775 0.3) (layers F.Cu F.Paste F.Mask) (roundrect_rratio 0.25))
  (pad 12 smd roundrect (at 1.25 1.9875) (size 0.3 0.775) (layers F.Cu F.Paste F.Mask) (roundrect_rratio 0.25))
  (pad 11 smd roundrect (at 0.75 1.9875) (size 0.3 0.775) (layers F.Cu F.Paste F.Mask) (roundrect_rratio 0.25))
  (pad 10 smd roundrect (at 0.25 1.9875) (size 0.3 0.775) (layers F.Cu F.Paste F.Mask) (roundrect_rratio 0.25))
  (pad 9 smd roundrect (at -0.25 1.9875) (size 0.3 0.775) (layers F.Cu F.Paste F.Mask) (roundrect_rratio 0.25))
  (pad 8 smd roundrect (at -0.75 1.9875) (size 0.3 0.775) (layers F.Cu F.Paste F.Mask) (roundrect_rratio 0.25))
  (pad 7 smd roundrect (at -1.25 1.9875) (size 0.3 0.775) (layers F.Cu F.Paste F.Mask) (roundrect_rratio 0.25))
  (pad 6 smd roundrect (at -1.9875 1.25) (size 0.775 0.3) (layers F.Cu F.Paste F.Mask) (roundrect_rratio 0.25))
  (pad 5 smd roundrect (at -1.9875 0.75) (size 0.775 0.3) (layers F.Cu F.Paste F.Mask) (roundrect_rratio 0.25))
  (pad 4 smd roundrect (at -1.9875 0.25) (size 0.775 0.3) (layers F.Cu F.Paste F.Mask) (roundrect_rratio 0.25))
  (pad 3 smd roundrect (at -1.9875 -0.25) (size 0.775 0.3) (layers F.Cu F.Paste F.Mask) (roundrect_rratio 0.25))
  (pad 2 smd roundrect (at -1.9875 -0.75) (size 0.775 0.3) (layers F.Cu F.Paste F.Mask) (roundrect_rratio 0.25))
  (pad 1 smd roundrect (at -1.9875 -1.25) (size 0.775 0.3) (layers F.Cu F.Paste F.Mask) (roundrect_rratio 0.25))
  (pad "" smd custom (at 0.49 0.49) (size 0.759054 0.759054) (layers F.Paste)
    (options (clearance outline) (anchor circle))
    (primitives
      (gr_poly (pts
         (xy -0.454242 -0.242915) (xy -0.242915 -0.454242) (xy 0.242915 -0.454242) (xy 0.454242 -0.242915) (xy 0.454242 0.242915)
         (xy 0.242915 0.454242) (xy -0.242915 0.454242) (xy -0.454242 0.242915)) (width 0))
    ))
  (pad "" smd custom (at 0.49 -0.49) (size 0.759054 0.759054) (layers F.Paste)
    (options (clearance outline) (anchor circle))
    (primitives
      (gr_poly (pts
         (xy -0.454242 -0.242915) (xy -0.242915 -0.454242) (xy 0.242915 -0.454242) (xy 0.454242 -0.242915) (xy 0.454242 0.242915)
         (xy 0.242915 0.454242) (xy -0.242915 0.454242) (xy -0.454242 0.242915)) (width 0))
    ))
  (pad "" smd custom (at -0.49 0.49) (size 0.759054 0.759054) (layers F.Paste)
    (options (clearance outline) (anchor circle))
    (primitives
      (gr_poly (pts
         (xy -0.454242 -0.242915) (xy -0.242915 -0.454242) (xy 0.242915 -0.454242) (xy 0.454242 -0.242915) (xy 0.454242 0.242915)
         (xy 0.242915 0.454242) (xy -0.242915 0.454242) (xy -0.454242 0.242915)) (width 0))
    ))
  (pad "" smd custom (at -0.49 -0.49) (size 0.759054 0.759054) (layers F.Paste)
    (options (clearance outline) (anchor circle))
    (primitives
      (gr_poly (pts
         (xy -0.454242 -0.242915) (xy -0.242915 -0.454242) (xy 0.242915 -0.454242) (xy 0.454242 -0.242915) (xy 0.454242 0.242915)
         (xy 0.242915 0.454242) (xy -0.242915 0.454242) (xy -0.454242 0.242915)) (width 0))
    ))
  (pad 25 smd roundrect (at 0 0) (size 2.75 2.75) (layers B.Cu) (roundrect_rratio 0.102)
    (zone_connect 2))
  (pad 25 thru_hole circle (at 0.98 0.98) (size 0.5 0.5) (drill 0.2) (layers *.Cu)
    (zone_connect 2))
  (pad 25 thru_hole circle (at 0 0.98) (size 0.5 0.5) (drill 0.2) (layers *.Cu)
    (zone_connect 2))
  (pad 25 thru_hole circle (at -0.98 0.98) (size 0.5 0.5) (drill 0.2) (layers *.Cu)
    (zone_connect 2))
  (pad 25 thru_hole circle (at 0.98 0) (size 0.5 0.5) (drill 0.2) (layers *.Cu)
    (zone_connect 2))
  (pad 25 thru_hole circle (at 0 0) (size 0.5 0.5) (drill 0.2) (layers *.Cu)
    (zone_connect 2))
  (pad 25 thru_hole circle (at -0.98 0) (size 0.5 0.5) (drill 0.2) (layers *.Cu)
    (zone_connect 2))
  (pad 25 thru_hole circle (at 0.98 -0.98) (size 0.5 0.5) (drill 0.2) (layers *.Cu)
    (zone_connect 2))
  (pad 25 thru_hole circle (at 0 -0.98) (size 0.5 0.5) (drill 0.2) (layers *.Cu)
    (zone_connect 2))
  (pad 25 thru_hole circle (at -0.98 -0.98) (size 0.5 0.5) (drill 0.2) (layers *.Cu)
    (zone_connect 2))
  (pad 25 smd roundrect (at 0 0) (size 2.75 2.75) (layers F.Cu F.Mask) (roundrect_rratio 0.102)
    (zone_connect 2))
  (model ${KIPRJMOD}/../KiCad/Modules/packages3d/VQFN-24.wrl
    (offset (xyz 18.99919971466064 9.778999853134156 -0))
    (scale (xyz 0.385 0.385 0.385))
    (rotate (xyz 90 0 180))
  )
)
