(kicad_pcb (version 20171130) (host pcbnew "(5.1.6-0-10_14)")

  (general
    (thickness 1.6)
    (drawings 8)
    (tracks 182)
    (zones 0)
    (modules 38)
    (nets 21)
  )

  (page A4)
  (title_block
    (title "IF Amplifier")
    (date 2021-04-18)
    (rev 2.5)
    (company "Dyadic Pty Ltd")
    (comment 1 2020)
  )

  (layers
    (0 F.Cu signal)
    (1 In1.Cu signal)
    (2 In2.Cu signal)
    (31 B.Cu signal)
    (32 B.Adhes user)
    (33 F.Adhes user)
    (34 B.Paste user)
    (35 F.Paste user)
    (36 B.SilkS user)
    (37 F.SilkS user)
    (38 B.Mask user)
    (39 F.Mask user)
    (40 Dwgs.User user)
    (41 Cmts.User user)
    (42 Eco1.User user)
    (43 Eco2.User user)
    (44 Edge.Cuts user)
    (45 Margin user)
    (46 B.CrtYd user)
    (47 F.CrtYd user)
    (48 B.Fab user)
    (49 F.Fab user)
  )

  (setup
    (last_trace_width 0.254)
    (user_trace_width 0.1524)
    (user_trace_width 0.254)
    (user_trace_width 0.3429)
    (user_trace_width 0.381)
    (user_trace_width 0.508)
    (user_trace_width 0.635)
    (user_trace_width 0.762)
    (user_trace_width 0.889)
    (trace_clearance 0.1524)
    (zone_clearance 0.254)
    (zone_45_only yes)
    (trace_min 0.1524)
    (via_size 0.508)
    (via_drill 0.4)
    (via_min_size 0.508)
    (via_min_drill 0.381)
    (user_via 0.508 0.381)
    (user_via 0.635 0.381)
    (user_via 0.762 0.508)
    (user_via 0.889 0.508)
    (user_via 1.016 0.635)
    (user_via 1.143 0.635)
    (user_via 1.27 0.762)
    (uvia_size 0.3)
    (uvia_drill 0.1)
    (uvias_allowed no)
    (uvia_min_size 0.2)
    (uvia_min_drill 0.1)
    (edge_width 0.15)
    (segment_width 0.2)
    (pcb_text_width 0.3)
    (pcb_text_size 1.5 1.5)
    (mod_edge_width 0.15)
    (mod_text_size 0.635 0.635)
    (mod_text_width 0.1016)
    (pad_size 1.524 1.524)
    (pad_drill 0.85)
    (pad_to_mask_clearance 0.0381)
    (solder_mask_min_width 0.1016)
    (pad_to_paste_clearance -0.0762)
    (aux_axis_origin 0 0)
    (visible_elements FFFFFF7F)
    (pcbplotparams
      (layerselection 0x31008_7ffffff8)
      (usegerberextensions false)
      (usegerberattributes false)
      (usegerberadvancedattributes false)
      (creategerberjobfile false)
      (excludeedgelayer false)
      (linewidth 0.101600)
      (plotframeref false)
      (viasonmask false)
      (mode 1)
      (useauxorigin false)
      (hpglpennumber 1)
      (hpglpenspeed 20)
      (hpglpendiameter 15.000000)
      (psnegative false)
      (psa4output false)
      (plotreference true)
      (plotvalue true)
      (plotinvisibletext false)
      (padsonsilk false)
      (subtractmaskfromsilk false)
      (outputformat 1)
      (mirror false)
      (drillshape 0)
      (scaleselection 1)
      (outputdirectory "plot/"))
  )

  (net 0 "")
  (net 1 "Net-(C1-Pad1)")
  (net 2 GND)
  (net 3 "Net-(C2-Pad1)")
  (net 4 "Net-(C5-Pad1)")
  (net 5 "Net-(C7-Pad1)")
  (net 6 "Net-(C7-Pad2)")
  (net 7 "Net-(C8-Pad1)")
  (net 8 "Net-(C9-Pad1)")
  (net 9 "Net-(C10-Pad1)")
  (net 10 "Net-(C10-Pad2)")
  (net 11 "Net-(J1-Pad1)")
  (net 12 "Net-(J2-Pad1)")
  (net 13 "Net-(R5-Pad1)")
  (net 14 "Net-(R6-Pad1)")
  (net 15 "Net-(X1-Pad2)")
  (net 16 "Net-(X3-Pad1)")
  (net 17 "Net-(J12-Pad1)")
  (net 18 "Net-(J21-Pad1)")
  (net 19 "Net-(R10-Pad1)")
  (net 20 "Net-(D1-Pad1)")

  (net_class Default "This is the default net class."
    (clearance 0.1524)
    (trace_width 0.254)
    (via_dia 0.508)
    (via_drill 0.4)
    (uvia_dia 0.3)
    (uvia_drill 0.1)
    (add_net GND)
    (add_net "Net-(C1-Pad1)")
    (add_net "Net-(C10-Pad1)")
    (add_net "Net-(C10-Pad2)")
    (add_net "Net-(C2-Pad1)")
    (add_net "Net-(C5-Pad1)")
    (add_net "Net-(C7-Pad1)")
    (add_net "Net-(C7-Pad2)")
    (add_net "Net-(C8-Pad1)")
    (add_net "Net-(C9-Pad1)")
    (add_net "Net-(D1-Pad1)")
    (add_net "Net-(J1-Pad1)")
    (add_net "Net-(J12-Pad1)")
    (add_net "Net-(J2-Pad1)")
    (add_net "Net-(J21-Pad1)")
    (add_net "Net-(R10-Pad1)")
    (add_net "Net-(R5-Pad1)")
    (add_net "Net-(R6-Pad1)")
    (add_net "Net-(X1-Pad2)")
    (add_net "Net-(X3-Pad1)")
  )

  (module RF_SMA_Connectors:SMA_EDGE_4 (layer F.Cu) (tedit 6024869E) (tstamp 5CCA9F84)
    (at 171.958 93.8784 90)
    (descr "4-layer SMA")
    (path /5D4AE14F)
    (fp_text reference J2 (at 3.3655 -2.3749) (layer F.SilkS) hide
      (effects (font (size 0.635 0.635) (thickness 0.1016)))
    )
    (fp_text value "RF Out" (at 1.6764 -4.86664 180) (layer B.SilkS)
      (effects (font (size 0.635 0.635) (thickness 0.1016)) (justify mirror))
    )
    (fp_text user %R (at 5.57276 3.4417 180) (layer F.Fab)
      (effects (font (size 0.635 0.635) (thickness 0.1016)))
    )
    (fp_line (start 5.7531 2.2479) (end 0.0127 2.2479) (layer F.CrtYd) (width 0.05))
    (fp_line (start 5.7531 -3.1496) (end 5.7531 2.2479) (layer F.CrtYd) (width 0.05))
    (fp_line (start -5.8039 -3.1496) (end 5.7531 -3.1496) (layer F.CrtYd) (width 0.05))
    (fp_line (start -5.8039 2.2479) (end -5.8039 -3.1496) (layer F.CrtYd) (width 0.05))
    (fp_line (start 0 2.2479) (end -5.8039 2.2479) (layer F.CrtYd) (width 0.05))
    (fp_line (start 0.381 -2.0193) (end 0.3683 2.2352) (layer F.Fab) (width 0.1))
    (fp_line (start -0.381 -2.0193) (end 0.381 -2.0193) (layer F.Fab) (width 0.1))
    (fp_line (start -0.381 2.2352) (end -0.381 -2.0193) (layer F.Fab) (width 0.1))
    (fp_line (start 3.7338 -2.5019) (end 3.7338 2.2352) (layer F.Fab) (width 0.15))
    (fp_line (start 3.7338 -2.5019) (end 4.7498 -2.5019) (layer F.Fab) (width 0.15))
    (fp_line (start 4.7498 2.2479) (end 4.7498 -2.5019) (layer F.Fab) (width 0.15))
    (fp_line (start -3.7592 -2.5019) (end -3.7592 2.2352) (layer F.Fab) (width 0.15))
    (fp_line (start -4.7752 -2.5019) (end -3.7592 -2.5019) (layer F.Fab) (width 0.15))
    (fp_line (start -4.7752 2.2479) (end -4.7752 -2.5019) (layer F.Fab) (width 0.15))
    (fp_line (start 4.7498 2.2352) (end -4.7752 2.2352) (layer F.Fab) (width 0.15))
    (fp_line (start 4.7498 3.8862) (end 4.7498 2.2352) (layer F.Fab) (width 0.15))
    (fp_line (start -4.7752 3.8862) (end 4.7498 3.8862) (layer F.Fab) (width 0.15))
    (fp_line (start -4.7752 2.2352) (end -4.7752 3.8862) (layer F.Fab) (width 0.15))
    (fp_line (start -2.9972 3.8862) (end -2.9972 12.6365) (layer F.Fab) (width 0.15))
    (fp_line (start -2.9972 12.6365) (end 2.9972 12.6365) (layer F.Fab) (width 0.15))
    (fp_line (start 2.9972 12.6365) (end 2.9845 3.8862) (layer F.Fab) (width 0.15))
    (fp_line (start 4.7498 2.2352) (end -4.7752 2.2352) (layer B.Fab) (width 0.15))
    (fp_line (start 4.7498 2.2479) (end 4.7498 -2.5019) (layer B.Fab) (width 0.15))
    (fp_line (start 3.7338 -2.5019) (end 4.7498 -2.5019) (layer B.Fab) (width 0.15))
    (fp_line (start 3.7338 -2.5019) (end 3.7338 2.2352) (layer B.Fab) (width 0.15))
    (fp_line (start -3.7592 -2.5019) (end -3.7592 2.2352) (layer B.Fab) (width 0.15))
    (fp_line (start -4.7752 -2.5019) (end -3.7592 -2.5019) (layer B.Fab) (width 0.15))
    (fp_line (start -4.7752 2.2479) (end -4.7752 -2.5019) (layer B.Fab) (width 0.15))
    (pad 1 smd rect (at 0 0 90) (size 2.032 4.25) (layers F.Cu F.Mask)
      (net 12 "Net-(J2-Pad1)") (solder_mask_margin 0.254))
    (pad 2 smd rect (at -2.286 0.1524 90) (size 1.5 3.95) (layers B.Cu B.Mask)
      (net 2 GND) (zone_connect 2))
    (pad 2 smd rect (at 2.286 0.1524 90) (size 1.5 3.95) (layers B.Cu B.Mask)
      (net 2 GND) (zone_connect 2))
    (pad 2 smd rect (at -4.14528 -0.41148 90) (size 2.413 5.08) (layers B.Cu B.Mask)
      (net 2 GND) (zone_connect 2))
    (pad 2 smd rect (at 4.15036 -0.41148 90) (size 2.413 5.08) (layers B.Cu B.Mask)
      (net 2 GND) (zone_connect 2))
    (pad 2 smd rect (at -4.1402 -0.41148 90) (size 2.413 5.08) (layers F.Cu F.Mask)
      (net 2 GND) (zone_connect 2))
    (pad 2 smd rect (at -2.25044 0 90) (size 1.4478 4.24942) (layers F.Cu F.Mask)
      (net 2 GND) (zone_connect 2))
    (pad 2 smd rect (at 2.25044 0 90) (size 1.4478 4.24942) (layers F.Cu F.Mask)
      (net 2 GND) (zone_connect 2))
    (pad 2 smd rect (at 4.1402 -0.41148 90) (size 2.413 5.08) (layers F.Cu F.Mask)
      (net 2 GND) (zone_connect 2))
    (model ${KIPRJMOD}/../KiCad/Modules/packages3d/142-0701-801.wrl
      (offset (xyz 0 -3.25 -3.4))
      (scale (xyz 0.37 0.37 0.37))
      (rotate (xyz -90 0 180))
    )
  )

  (module RF_SMA_Connectors:SMA_EDGE_4 (layer F.Cu) (tedit 6024869E) (tstamp 5CCA9F77)
    (at 136.3726 97.6884 270)
    (descr "4-layer SMA")
    (path /59FAFD47)
    (fp_text reference J1 (at 3.3655 -2.3749 180) (layer F.SilkS) hide
      (effects (font (size 0.635 0.635) (thickness 0.1016)))
    )
    (fp_text value "RF In" (at -0.34036 -4.4704) (layer B.SilkS)
      (effects (font (size 0.635 0.635) (thickness 0.1016)) (justify mirror))
    )
    (fp_text user %R (at 5.57276 3.4417) (layer F.Fab)
      (effects (font (size 0.635 0.635) (thickness 0.1016)))
    )
    (fp_line (start 5.7531 2.2479) (end 0.0127 2.2479) (layer F.CrtYd) (width 0.05))
    (fp_line (start 5.7531 -3.1496) (end 5.7531 2.2479) (layer F.CrtYd) (width 0.05))
    (fp_line (start -5.8039 -3.1496) (end 5.7531 -3.1496) (layer F.CrtYd) (width 0.05))
    (fp_line (start -5.8039 2.2479) (end -5.8039 -3.1496) (layer F.CrtYd) (width 0.05))
    (fp_line (start 0 2.2479) (end -5.8039 2.2479) (layer F.CrtYd) (width 0.05))
    (fp_line (start 0.381 -2.0193) (end 0.3683 2.2352) (layer F.Fab) (width 0.1))
    (fp_line (start -0.381 -2.0193) (end 0.381 -2.0193) (layer F.Fab) (width 0.1))
    (fp_line (start -0.381 2.2352) (end -0.381 -2.0193) (layer F.Fab) (width 0.1))
    (fp_line (start 3.7338 -2.5019) (end 3.7338 2.2352) (layer F.Fab) (width 0.15))
    (fp_line (start 3.7338 -2.5019) (end 4.7498 -2.5019) (layer F.Fab) (width 0.15))
    (fp_line (start 4.7498 2.2479) (end 4.7498 -2.5019) (layer F.Fab) (width 0.15))
    (fp_line (start -3.7592 -2.5019) (end -3.7592 2.2352) (layer F.Fab) (width 0.15))
    (fp_line (start -4.7752 -2.5019) (end -3.7592 -2.5019) (layer F.Fab) (width 0.15))
    (fp_line (start -4.7752 2.2479) (end -4.7752 -2.5019) (layer F.Fab) (width 0.15))
    (fp_line (start 4.7498 2.2352) (end -4.7752 2.2352) (layer F.Fab) (width 0.15))
    (fp_line (start 4.7498 3.8862) (end 4.7498 2.2352) (layer F.Fab) (width 0.15))
    (fp_line (start -4.7752 3.8862) (end 4.7498 3.8862) (layer F.Fab) (width 0.15))
    (fp_line (start -4.7752 2.2352) (end -4.7752 3.8862) (layer F.Fab) (width 0.15))
    (fp_line (start -2.9972 3.8862) (end -2.9972 12.6365) (layer F.Fab) (width 0.15))
    (fp_line (start -2.9972 12.6365) (end 2.9972 12.6365) (layer F.Fab) (width 0.15))
    (fp_line (start 2.9972 12.6365) (end 2.9845 3.8862) (layer F.Fab) (width 0.15))
    (fp_line (start 4.7498 2.2352) (end -4.7752 2.2352) (layer B.Fab) (width 0.15))
    (fp_line (start 4.7498 2.2479) (end 4.7498 -2.5019) (layer B.Fab) (width 0.15))
    (fp_line (start 3.7338 -2.5019) (end 4.7498 -2.5019) (layer B.Fab) (width 0.15))
    (fp_line (start 3.7338 -2.5019) (end 3.7338 2.2352) (layer B.Fab) (width 0.15))
    (fp_line (start -3.7592 -2.5019) (end -3.7592 2.2352) (layer B.Fab) (width 0.15))
    (fp_line (start -4.7752 -2.5019) (end -3.7592 -2.5019) (layer B.Fab) (width 0.15))
    (fp_line (start -4.7752 2.2479) (end -4.7752 -2.5019) (layer B.Fab) (width 0.15))
    (pad 1 smd rect (at 0 0 270) (size 2.032 4.25) (layers F.Cu F.Mask)
      (net 11 "Net-(J1-Pad1)") (solder_mask_margin 0.254))
    (pad 2 smd rect (at -2.286 0.1524 270) (size 1.5 3.95) (layers B.Cu B.Mask)
      (net 2 GND) (zone_connect 2))
    (pad 2 smd rect (at 2.286 0.1524 270) (size 1.5 3.95) (layers B.Cu B.Mask)
      (net 2 GND) (zone_connect 2))
    (pad 2 smd rect (at -4.14528 -0.41148 270) (size 2.413 5.08) (layers B.Cu B.Mask)
      (net 2 GND) (zone_connect 2))
    (pad 2 smd rect (at 4.15036 -0.41148 270) (size 2.413 5.08) (layers B.Cu B.Mask)
      (net 2 GND) (zone_connect 2))
    (pad 2 smd rect (at -4.1402 -0.41148 270) (size 2.413 5.08) (layers F.Cu F.Mask)
      (net 2 GND) (zone_connect 2))
    (pad 2 smd rect (at -2.25044 0 270) (size 1.4478 4.24942) (layers F.Cu F.Mask)
      (net 2 GND) (zone_connect 2))
    (pad 2 smd rect (at 2.25044 0 270) (size 1.4478 4.24942) (layers F.Cu F.Mask)
      (net 2 GND) (zone_connect 2))
    (pad 2 smd rect (at 4.1402 -0.41148 270) (size 2.413 5.08) (layers F.Cu F.Mask)
      (net 2 GND) (zone_connect 2))
    (model ${KIPRJMOD}/../KiCad/Modules/packages3d/142-0701-801.wrl
      (offset (xyz 0 -3.25 -3.4))
      (scale (xyz 0.37 0.37 0.37))
      (rotate (xyz -90 0 180))
    )
  )

  (module RF_Shielding:S1721-46R (layer F.Cu) (tedit 5D14A1D6) (tstamp 5CCAD7EA)
    (at 155.6766 103.9622)
    (path /5C813E6C)
    (attr smd)
    (fp_text reference P2 (at 0 2.54) (layer F.SilkS) hide
      (effects (font (size 0.635 0.635) (thickness 0.1016)))
    )
    (fp_text value ~ (at 0 -2.286) (layer F.Fab)
      (effects (font (size 0.635 0.635) (thickness 0.1016)))
    )
    (fp_line (start 1.7272 0.6477) (end 3.048 0.6477) (layer F.SilkS) (width 0.15))
    (fp_line (start -3.048 -0.6477) (end -1.7272 -0.6477) (layer F.SilkS) (width 0.15))
    (fp_line (start 3.048 -0.635) (end 3.048 0.635) (layer F.SilkS) (width 0.15))
    (fp_line (start -3.048 -0.635) (end -3.048 0.635) (layer F.SilkS) (width 0.15))
    (fp_line (start -3.048 -0.635) (end -3.048 0.635) (layer F.SilkS) (width 0.15))
    (fp_line (start -3.048 0.635) (end -3.048 0.635) (layer F.SilkS) (width 0.15))
    (fp_line (start 3.048 -0.635) (end 3.048 0.635) (layer F.Fab) (width 0.15))
    (fp_line (start 3.048 0.635) (end 3.048 0.635) (layer F.SilkS) (width 0.15))
    (fp_line (start -3.048 -0.635) (end -3.048 0.635) (layer F.Fab) (width 0.15))
    (fp_line (start -3.048 -0.6477) (end -1.7272 -0.6477) (layer F.Fab) (width 0.15))
    (fp_line (start 1.7272 0.6477) (end 3.048 0.6477) (layer F.Fab) (width 0.15))
    (fp_text user %R (at 0.06604 -0.0635) (layer F.Fab)
      (effects (font (size 0.635 0.635) (thickness 0.1016)))
    )
    (pad 1 smd rect (at 0 0) (size 5.6 1.1) (layers F.Cu F.Paste)
      (net 2 GND) (solder_paste_margin -0.0508))
    (model ${KIPRJMOD}/packages3d/HarwinShieldClip_2711.wrl
      (at (xyz 0 -0 -0))
      (scale (xyz 0.25 0.25 0.25))
      (rotate (xyz -90 0 180))
    )
  )

  (module RF_Shielding:S1721-46R (layer F.Cu) (tedit 5D14A1D6) (tstamp 5CCAD847)
    (at 154.4066 83.82)
    (path /5D06BA9B)
    (attr smd)
    (fp_text reference P3 (at 0 2.54) (layer F.SilkS) hide
      (effects (font (size 0.635 0.635) (thickness 0.1016)))
    )
    (fp_text value ~ (at 0 -2.286) (layer F.Fab)
      (effects (font (size 0.635 0.635) (thickness 0.1016)))
    )
    (fp_line (start 1.7272 0.6477) (end 3.048 0.6477) (layer F.SilkS) (width 0.15))
    (fp_line (start -3.048 -0.6477) (end -1.7272 -0.6477) (layer F.SilkS) (width 0.15))
    (fp_line (start 3.048 -0.635) (end 3.048 0.635) (layer F.SilkS) (width 0.15))
    (fp_line (start -3.048 -0.635) (end -3.048 0.635) (layer F.SilkS) (width 0.15))
    (fp_line (start -3.048 -0.635) (end -3.048 0.635) (layer F.SilkS) (width 0.15))
    (fp_line (start -3.048 0.635) (end -3.048 0.635) (layer F.SilkS) (width 0.15))
    (fp_line (start 3.048 -0.635) (end 3.048 0.635) (layer F.Fab) (width 0.15))
    (fp_line (start 3.048 0.635) (end 3.048 0.635) (layer F.SilkS) (width 0.15))
    (fp_line (start -3.048 -0.635) (end -3.048 0.635) (layer F.Fab) (width 0.15))
    (fp_line (start -3.048 -0.6477) (end -1.7272 -0.6477) (layer F.Fab) (width 0.15))
    (fp_line (start 1.7272 0.6477) (end 3.048 0.6477) (layer F.Fab) (width 0.15))
    (fp_text user %R (at 0.06604 -0.0635) (layer F.Fab)
      (effects (font (size 0.635 0.635) (thickness 0.1016)))
    )
    (pad 1 smd rect (at 0 0) (size 5.6 1.1) (layers F.Cu F.Paste)
      (net 2 GND) (solder_paste_margin -0.0508))
    (model ${KIPRJMOD}/packages3d/HarwinShieldClip_2711.wrl
      (at (xyz 0 -0 -0))
      (scale (xyz 0.25 0.25 0.25))
      (rotate (xyz -90 0 180))
    )
  )

  (module MountingHole:MountingHole_2.2mm_M2_Pad (layer F.Cu) (tedit 5E4E7001) (tstamp 5CCAA4C7)
    (at 164.3888 101.2952)
    (descr "Mounting Hole 2.2mm, M2")
    (tags "mounting hole 2.2mm m2")
    (attr virtual)
    (fp_text reference REF** (at 0 -3.2) (layer F.SilkS) hide
      (effects (font (size 0.635 0.635) (thickness 0.1016)))
    )
    (fp_text value MountingHole_2.2mm_M2_Pad (at 2.31648 1.18872) (layer F.Fab)
      (effects (font (size 0.635 0.635) (thickness 0.1016)))
    )
    (fp_circle (center 0 0) (end 2.2 0) (layer Cmts.User) (width 0.15))
    (fp_circle (center 0 0) (end 2.45 0) (layer F.CrtYd) (width 0.05))
    (fp_text user %R (at 0.3 0) (layer F.Fab)
      (effects (font (size 1 1) (thickness 0.15)))
    )
    (pad 1 thru_hole circle (at 0 0) (size 4.4 4.4) (drill 2.2) (layers *.Cu *.Mask)
      (net 2 GND))
  )

  (module Capacitor_SMD:C_0603_1608Metric (layer F.Cu) (tedit 5C731210) (tstamp 5CCA9EC0)
    (at 140.64996 86.7156 90)
    (descr "Capacitor SMD 0603 (1608 Metric), square (rectangular) end terminal, IPC_7351 nominal, (Body size source: http://www.tortai-tech.com/upload/download/2011102023233369053.pdf), generated with kicad-footprint-generator")
    (tags capacitor)
    (path /59FD7A8F)
    (attr smd)
    (fp_text reference C1 (at 2.2606 0.0254 270) (layer F.SilkS)
      (effects (font (size 0.635 0.635) (thickness 0.1016)))
    )
    (fp_text value 0.01u (at 2.37236 0.06604 270) (layer F.Fab)
      (effects (font (size 0.635 0.635) (thickness 0.1016)))
    )
    (fp_line (start 1.48 0.73) (end -1.48 0.73) (layer F.CrtYd) (width 0.05))
    (fp_line (start 1.48 -0.73) (end 1.48 0.73) (layer F.CrtYd) (width 0.05))
    (fp_line (start -1.48 -0.73) (end 1.48 -0.73) (layer F.CrtYd) (width 0.05))
    (fp_line (start -1.48 0.73) (end -1.48 -0.73) (layer F.CrtYd) (width 0.05))
    (fp_line (start -0.162779 0.51) (end 0.162779 0.51) (layer F.SilkS) (width 0.12))
    (fp_line (start -0.162779 -0.51) (end 0.162779 -0.51) (layer F.SilkS) (width 0.12))
    (fp_line (start 0.8 0.4) (end -0.8 0.4) (layer F.Fab) (width 0.1))
    (fp_line (start 0.8 -0.4) (end 0.8 0.4) (layer F.Fab) (width 0.1))
    (fp_line (start -0.8 -0.4) (end 0.8 -0.4) (layer F.Fab) (width 0.1))
    (fp_line (start -0.8 0.4) (end -0.8 -0.4) (layer F.Fab) (width 0.1))
    (fp_text user %R (at 0 0 90) (layer F.Fab)
      (effects (font (size 0.4 0.4) (thickness 0.06)))
    )
    (pad 2 smd roundrect (at 0.7875 0 90) (size 0.875 0.95) (layers F.Cu F.Paste F.Mask) (roundrect_rratio 0.25)
      (net 2 GND))
    (pad 1 smd roundrect (at -0.7875 0 90) (size 0.875 0.95) (layers F.Cu F.Paste F.Mask) (roundrect_rratio 0.25)
      (net 1 "Net-(C1-Pad1)"))
    (model ${KISYS3DMOD}/Capacitor_SMD.3dshapes/C_0603_1608Metric.wrl
      (at (xyz 0 0 0))
      (scale (xyz 1 1 1))
      (rotate (xyz 0 0 0))
    )
  )

  (module Capacitor_SMD:C_0603_1608Metric (layer F.Cu) (tedit 5C731281) (tstamp 5CCA9ED1)
    (at 148.25472 87.31504 90)
    (descr "Capacitor SMD 0603 (1608 Metric), square (rectangular) end terminal, IPC_7351 nominal, (Body size source: http://www.tortai-tech.com/upload/download/2011102023233369053.pdf), generated with kicad-footprint-generator")
    (tags capacitor)
    (path /59FD7B0C)
    (attr smd)
    (fp_text reference C2 (at 0.14732 1.23952 90) (layer F.SilkS)
      (effects (font (size 0.635 0.635) (thickness 0.1016)))
    )
    (fp_text value 0.1u (at 0.01524 0.9144 90) (layer F.Fab)
      (effects (font (size 0.635 0.635) (thickness 0.1016)))
    )
    (fp_line (start -0.8 0.4) (end -0.8 -0.4) (layer F.Fab) (width 0.1))
    (fp_line (start -0.8 -0.4) (end 0.8 -0.4) (layer F.Fab) (width 0.1))
    (fp_line (start 0.8 -0.4) (end 0.8 0.4) (layer F.Fab) (width 0.1))
    (fp_line (start 0.8 0.4) (end -0.8 0.4) (layer F.Fab) (width 0.1))
    (fp_line (start -0.162779 -0.51) (end 0.162779 -0.51) (layer F.SilkS) (width 0.12))
    (fp_line (start -0.162779 0.51) (end 0.162779 0.51) (layer F.SilkS) (width 0.12))
    (fp_line (start -1.48 0.73) (end -1.48 -0.73) (layer F.CrtYd) (width 0.05))
    (fp_line (start -1.48 -0.73) (end 1.48 -0.73) (layer F.CrtYd) (width 0.05))
    (fp_line (start 1.48 -0.73) (end 1.48 0.73) (layer F.CrtYd) (width 0.05))
    (fp_line (start 1.48 0.73) (end -1.48 0.73) (layer F.CrtYd) (width 0.05))
    (fp_text user %R (at 0 0 90) (layer F.Fab)
      (effects (font (size 0.4 0.4) (thickness 0.06)))
    )
    (pad 1 smd roundrect (at -0.7875 0 90) (size 0.875 0.95) (layers F.Cu F.Paste F.Mask) (roundrect_rratio 0.25)
      (net 3 "Net-(C2-Pad1)"))
    (pad 2 smd roundrect (at 0.7875 0 90) (size 0.875 0.95) (layers F.Cu F.Paste F.Mask) (roundrect_rratio 0.25)
      (net 2 GND))
    (model ${KISYS3DMOD}/Capacitor_SMD.3dshapes/C_0603_1608Metric.wrl
      (at (xyz 0 0 0))
      (scale (xyz 1 1 1))
      (rotate (xyz 0 0 0))
    )
  )

  (module Capacitor_SMD:C_0805_2012Metric (layer F.Cu) (tedit 5C7464CC) (tstamp 5CCA9EE2)
    (at 152.8826 100.18268 270)
    (descr "Capacitor SMD 0805 (2012 Metric), square (rectangular) end terminal, IPC_7351 nominal, (Body size source: https://docs.google.com/spreadsheets/d/1BsfQQcO9C6DZCsRaXUlFlo91Tg2WpOkGARC1WS5S8t0/edit?usp=sharing), generated with kicad-footprint-generator")
    (tags capacitor)
    (path /59FD8525)
    (attr smd)
    (fp_text reference C3 (at 0.762 1.5494 270) (layer F.SilkS)
      (effects (font (size 0.635 0.635) (thickness 0.1016)))
    )
    (fp_text value 10u (at -0.05588 1.21412 270) (layer F.Fab)
      (effects (font (size 0.635 0.635) (thickness 0.1016)))
    )
    (fp_line (start -1 0.6) (end -1 -0.6) (layer F.Fab) (width 0.1))
    (fp_line (start -1 -0.6) (end 1 -0.6) (layer F.Fab) (width 0.1))
    (fp_line (start 1 -0.6) (end 1 0.6) (layer F.Fab) (width 0.1))
    (fp_line (start 1 0.6) (end -1 0.6) (layer F.Fab) (width 0.1))
    (fp_line (start -0.258578 -0.71) (end 0.258578 -0.71) (layer F.SilkS) (width 0.12))
    (fp_line (start -0.258578 0.71) (end 0.258578 0.71) (layer F.SilkS) (width 0.12))
    (fp_line (start -1.68 0.95) (end -1.68 -0.95) (layer F.CrtYd) (width 0.05))
    (fp_line (start -1.68 -0.95) (end 1.68 -0.95) (layer F.CrtYd) (width 0.05))
    (fp_line (start 1.68 -0.95) (end 1.68 0.95) (layer F.CrtYd) (width 0.05))
    (fp_line (start 1.68 0.95) (end -1.68 0.95) (layer F.CrtYd) (width 0.05))
    (fp_text user %R (at 0 0 270) (layer F.Fab)
      (effects (font (size 0.5 0.5) (thickness 0.08)))
    )
    (pad 1 smd roundrect (at -0.9375 0 270) (size 0.975 1.4) (layers F.Cu F.Paste F.Mask) (roundrect_rratio 0.25)
      (net 3 "Net-(C2-Pad1)"))
    (pad 2 smd roundrect (at 0.9375 0 270) (size 0.975 1.4) (layers F.Cu F.Paste F.Mask) (roundrect_rratio 0.25)
      (net 2 GND) (zone_connect 1))
    (model ${KISYS3DMOD}/Capacitor_SMD.3dshapes/C_0805_2012Metric.wrl
      (at (xyz 0 0 0))
      (scale (xyz 1 1 1))
      (rotate (xyz 0 0 0))
    )
  )

  (module Capacitor_SMD:C_0603_1608Metric (layer F.Cu) (tedit 5C7399E8) (tstamp 5CCA9F04)
    (at 147.3962 96.266 180)
    (descr "Capacitor SMD 0603 (1608 Metric), square (rectangular) end terminal, IPC_7351 nominal, (Body size source: http://www.tortai-tech.com/upload/download/2011102023233369053.pdf), generated with kicad-footprint-generator")
    (tags capacitor)
    (path /5CF68437)
    (attr smd)
    (fp_text reference C5 (at 0.5334 -1.397 180) (layer F.SilkS)
      (effects (font (size 0.635 0.635) (thickness 0.1016)))
    )
    (fp_text value 0.1u (at 0.03048 -0.94996 180) (layer F.Fab)
      (effects (font (size 0.635 0.635) (thickness 0.1016)))
    )
    (fp_line (start -0.8 0.4) (end -0.8 -0.4) (layer F.Fab) (width 0.1))
    (fp_line (start -0.8 -0.4) (end 0.8 -0.4) (layer F.Fab) (width 0.1))
    (fp_line (start 0.8 -0.4) (end 0.8 0.4) (layer F.Fab) (width 0.1))
    (fp_line (start 0.8 0.4) (end -0.8 0.4) (layer F.Fab) (width 0.1))
    (fp_line (start -0.162779 -0.51) (end 0.162779 -0.51) (layer F.SilkS) (width 0.12))
    (fp_line (start -0.162779 0.51) (end 0.162779 0.51) (layer F.SilkS) (width 0.12))
    (fp_line (start -1.48 0.73) (end -1.48 -0.73) (layer F.CrtYd) (width 0.05))
    (fp_line (start -1.48 -0.73) (end 1.48 -0.73) (layer F.CrtYd) (width 0.05))
    (fp_line (start 1.48 -0.73) (end 1.48 0.73) (layer F.CrtYd) (width 0.05))
    (fp_line (start 1.48 0.73) (end -1.48 0.73) (layer F.CrtYd) (width 0.05))
    (fp_text user %R (at 0 0 180) (layer F.Fab)
      (effects (font (size 0.4 0.4) (thickness 0.06)))
    )
    (pad 1 smd roundrect (at -0.7875 0 180) (size 0.875 0.95) (layers F.Cu F.Paste F.Mask) (roundrect_rratio 0.25)
      (net 4 "Net-(C5-Pad1)"))
    (pad 2 smd roundrect (at 0.7875 0 180) (size 0.875 0.95) (layers F.Cu F.Paste F.Mask) (roundrect_rratio 0.25)
      (net 2 GND))
    (model ${KISYS3DMOD}/Capacitor_SMD.3dshapes/C_0603_1608Metric.wrl
      (at (xyz 0 0 0))
      (scale (xyz 1 1 1))
      (rotate (xyz 0 0 0))
    )
  )

  (module Capacitor_SMD:C_0603_1608Metric (layer F.Cu) (tedit 5C7398D5) (tstamp 5CCA9F26)
    (at 145.7452 93.091 180)
    (descr "Capacitor SMD 0603 (1608 Metric), square (rectangular) end terminal, IPC_7351 nominal, (Body size source: http://www.tortai-tech.com/upload/download/2011102023233369053.pdf), generated with kicad-footprint-generator")
    (tags capacitor)
    (path /5CF69D46)
    (attr smd)
    (fp_text reference C7 (at 0.0254 1.2446 180) (layer F.SilkS)
      (effects (font (size 0.635 0.635) (thickness 0.1016)))
    )
    (fp_text value 0.1u (at -0.14224 0.9144 180) (layer F.Fab)
      (effects (font (size 0.635 0.635) (thickness 0.1016)))
    )
    (fp_line (start 1.48 0.73) (end -1.48 0.73) (layer F.CrtYd) (width 0.05))
    (fp_line (start 1.48 -0.73) (end 1.48 0.73) (layer F.CrtYd) (width 0.05))
    (fp_line (start -1.48 -0.73) (end 1.48 -0.73) (layer F.CrtYd) (width 0.05))
    (fp_line (start -1.48 0.73) (end -1.48 -0.73) (layer F.CrtYd) (width 0.05))
    (fp_line (start -0.162779 0.51) (end 0.162779 0.51) (layer F.SilkS) (width 0.12))
    (fp_line (start -0.162779 -0.51) (end 0.162779 -0.51) (layer F.SilkS) (width 0.12))
    (fp_line (start 0.8 0.4) (end -0.8 0.4) (layer F.Fab) (width 0.1))
    (fp_line (start 0.8 -0.4) (end 0.8 0.4) (layer F.Fab) (width 0.1))
    (fp_line (start -0.8 -0.4) (end 0.8 -0.4) (layer F.Fab) (width 0.1))
    (fp_line (start -0.8 0.4) (end -0.8 -0.4) (layer F.Fab) (width 0.1))
    (fp_text user %R (at 0 0 180) (layer F.Fab)
      (effects (font (size 0.4 0.4) (thickness 0.06)))
    )
    (pad 2 smd roundrect (at 0.7875 0 180) (size 0.875 0.95) (layers F.Cu F.Paste F.Mask) (roundrect_rratio 0.25)
      (net 6 "Net-(C7-Pad2)"))
    (pad 1 smd roundrect (at -0.7875 0 180) (size 0.875 0.95) (layers F.Cu F.Paste F.Mask) (roundrect_rratio 0.25)
      (net 5 "Net-(C7-Pad1)"))
    (model ${KISYS3DMOD}/Capacitor_SMD.3dshapes/C_0603_1608Metric.wrl
      (at (xyz 0 0 0))
      (scale (xyz 1 1 1))
      (rotate (xyz 0 0 0))
    )
  )

  (module Capacitor_SMD:C_0603_1608Metric (layer F.Cu) (tedit 5C739BE6) (tstamp 5CCA9F37)
    (at 161.6202 97.4852 270)
    (descr "Capacitor SMD 0603 (1608 Metric), square (rectangular) end terminal, IPC_7351 nominal, (Body size source: http://www.tortai-tech.com/upload/download/2011102023233369053.pdf), generated with kicad-footprint-generator")
    (tags capacitor)
    (path /5CF6CD08)
    (attr smd)
    (fp_text reference C8 (at -0.6604 -1.3716 270) (layer F.SilkS)
      (effects (font (size 0.635 0.635) (thickness 0.1016)))
    )
    (fp_text value 0.1u (at -0.0381 -1.1938 270) (layer F.Fab)
      (effects (font (size 0.635 0.635) (thickness 0.1016)))
    )
    (fp_line (start -0.8 0.4) (end -0.8 -0.4) (layer F.Fab) (width 0.1))
    (fp_line (start -0.8 -0.4) (end 0.8 -0.4) (layer F.Fab) (width 0.1))
    (fp_line (start 0.8 -0.4) (end 0.8 0.4) (layer F.Fab) (width 0.1))
    (fp_line (start 0.8 0.4) (end -0.8 0.4) (layer F.Fab) (width 0.1))
    (fp_line (start -0.162779 -0.51) (end 0.162779 -0.51) (layer F.SilkS) (width 0.12))
    (fp_line (start -0.162779 0.51) (end 0.162779 0.51) (layer F.SilkS) (width 0.12))
    (fp_line (start -1.48 0.73) (end -1.48 -0.73) (layer F.CrtYd) (width 0.05))
    (fp_line (start -1.48 -0.73) (end 1.48 -0.73) (layer F.CrtYd) (width 0.05))
    (fp_line (start 1.48 -0.73) (end 1.48 0.73) (layer F.CrtYd) (width 0.05))
    (fp_line (start 1.48 0.73) (end -1.48 0.73) (layer F.CrtYd) (width 0.05))
    (fp_text user %R (at 0 0 270) (layer F.Fab)
      (effects (font (size 0.4 0.4) (thickness 0.06)))
    )
    (pad 1 smd roundrect (at -0.7875 0 270) (size 0.875 0.95) (layers F.Cu F.Paste F.Mask) (roundrect_rratio 0.25)
      (net 7 "Net-(C8-Pad1)"))
    (pad 2 smd roundrect (at 0.7875 0 270) (size 0.875 0.95) (layers F.Cu F.Paste F.Mask) (roundrect_rratio 0.25)
      (net 2 GND))
    (model ${KISYS3DMOD}/Capacitor_SMD.3dshapes/C_0603_1608Metric.wrl
      (at (xyz 0 0 0))
      (scale (xyz 1 1 1))
      (rotate (xyz 0 0 0))
    )
  )

  (module Capacitor_SMD:C_0603_1608Metric (layer F.Cu) (tedit 5C739C3B) (tstamp 5CCA9F48)
    (at 155.8036 97.1804 180)
    (descr "Capacitor SMD 0603 (1608 Metric), square (rectangular) end terminal, IPC_7351 nominal, (Body size source: http://www.tortai-tech.com/upload/download/2011102023233369053.pdf), generated with kicad-footprint-generator")
    (tags capacitor)
    (path /5CF66E7B)
    (attr smd)
    (fp_text reference C9 (at 2.2352 0.0254 270) (layer F.SilkS)
      (effects (font (size 0.635 0.635) (thickness 0.1016)))
    )
    (fp_text value 0.1u (at -0.1143 -1.0795 180) (layer F.Fab)
      (effects (font (size 0.635 0.635) (thickness 0.1016)))
    )
    (fp_line (start 1.48 0.73) (end -1.48 0.73) (layer F.CrtYd) (width 0.05))
    (fp_line (start 1.48 -0.73) (end 1.48 0.73) (layer F.CrtYd) (width 0.05))
    (fp_line (start -1.48 -0.73) (end 1.48 -0.73) (layer F.CrtYd) (width 0.05))
    (fp_line (start -1.48 0.73) (end -1.48 -0.73) (layer F.CrtYd) (width 0.05))
    (fp_line (start -0.162779 0.51) (end 0.162779 0.51) (layer F.SilkS) (width 0.12))
    (fp_line (start -0.162779 -0.51) (end 0.162779 -0.51) (layer F.SilkS) (width 0.12))
    (fp_line (start 0.8 0.4) (end -0.8 0.4) (layer F.Fab) (width 0.1))
    (fp_line (start 0.8 -0.4) (end 0.8 0.4) (layer F.Fab) (width 0.1))
    (fp_line (start -0.8 -0.4) (end 0.8 -0.4) (layer F.Fab) (width 0.1))
    (fp_line (start -0.8 0.4) (end -0.8 -0.4) (layer F.Fab) (width 0.1))
    (fp_text user %R (at 0 0 180) (layer F.Fab)
      (effects (font (size 0.4 0.4) (thickness 0.06)))
    )
    (pad 2 smd roundrect (at 0.7875 0 180) (size 0.875 0.95) (layers F.Cu F.Paste F.Mask) (roundrect_rratio 0.25)
      (net 2 GND))
    (pad 1 smd roundrect (at -0.7875 0 180) (size 0.875 0.95) (layers F.Cu F.Paste F.Mask) (roundrect_rratio 0.25)
      (net 8 "Net-(C9-Pad1)"))
    (model ${KISYS3DMOD}/Capacitor_SMD.3dshapes/C_0603_1608Metric.wrl
      (at (xyz 0 0 0))
      (scale (xyz 1 1 1))
      (rotate (xyz 0 0 0))
    )
  )

  (module Capacitor_SMD:C_0603_1608Metric (layer F.Cu) (tedit 5C739AE2) (tstamp 5CCA9F59)
    (at 159.1818 91.5416 180)
    (descr "Capacitor SMD 0603 (1608 Metric), square (rectangular) end terminal, IPC_7351 nominal, (Body size source: http://www.tortai-tech.com/upload/download/2011102023233369053.pdf), generated with kicad-footprint-generator")
    (tags capacitor)
    (path /5CF6B4AC)
    (attr smd)
    (fp_text reference C10 (at -0.1016 1.27 180) (layer F.SilkS)
      (effects (font (size 0.635 0.635) (thickness 0.1016)))
    )
    (fp_text value 0.1u (at -0.13208 0.889 180) (layer F.Fab)
      (effects (font (size 0.635 0.635) (thickness 0.1016)))
    )
    (fp_line (start 1.48 0.73) (end -1.48 0.73) (layer F.CrtYd) (width 0.05))
    (fp_line (start 1.48 -0.73) (end 1.48 0.73) (layer F.CrtYd) (width 0.05))
    (fp_line (start -1.48 -0.73) (end 1.48 -0.73) (layer F.CrtYd) (width 0.05))
    (fp_line (start -1.48 0.73) (end -1.48 -0.73) (layer F.CrtYd) (width 0.05))
    (fp_line (start -0.162779 0.51) (end 0.162779 0.51) (layer F.SilkS) (width 0.12))
    (fp_line (start -0.162779 -0.51) (end 0.162779 -0.51) (layer F.SilkS) (width 0.12))
    (fp_line (start 0.8 0.4) (end -0.8 0.4) (layer F.Fab) (width 0.1))
    (fp_line (start 0.8 -0.4) (end 0.8 0.4) (layer F.Fab) (width 0.1))
    (fp_line (start -0.8 -0.4) (end 0.8 -0.4) (layer F.Fab) (width 0.1))
    (fp_line (start -0.8 0.4) (end -0.8 -0.4) (layer F.Fab) (width 0.1))
    (fp_text user %R (at 0 0 180) (layer F.Fab)
      (effects (font (size 0.4 0.4) (thickness 0.06)))
    )
    (pad 2 smd roundrect (at 0.7875 0 180) (size 0.875 0.95) (layers F.Cu F.Paste F.Mask) (roundrect_rratio 0.25)
      (net 10 "Net-(C10-Pad2)"))
    (pad 1 smd roundrect (at -0.7875 0 180) (size 0.875 0.95) (layers F.Cu F.Paste F.Mask) (roundrect_rratio 0.25)
      (net 9 "Net-(C10-Pad1)"))
    (model ${KISYS3DMOD}/Capacitor_SMD.3dshapes/C_0603_1608Metric.wrl
      (at (xyz 0 0 0))
      (scale (xyz 1 1 1))
      (rotate (xyz 0 0 0))
    )
  )

  (module Inductor_SMD:L_0805_2012Metric (layer F.Cu) (tedit 5C739A6D) (tstamp 5CCA9F6A)
    (at 155.66644 99.2378)
    (descr "Inductor SMD 0805 (2012 Metric), square (rectangular) end terminal, IPC_7351 nominal, (Body size source: https://docs.google.com/spreadsheets/d/1BsfQQcO9C6DZCsRaXUlFlo91Tg2WpOkGARC1WS5S8t0/edit?usp=sharing), generated with kicad-footprint-generator")
    (tags inductor)
    (path /59FDA9D3)
    (attr smd)
    (fp_text reference FB1 (at 0.06604 1.47828 180) (layer F.SilkS)
      (effects (font (size 0.635 0.635) (thickness 0.1016)))
    )
    (fp_text value "220 ohm" (at 0.02032 0.97536) (layer F.Fab)
      (effects (font (size 0.635 0.635) (thickness 0.1016)))
    )
    (fp_line (start -1 0.6) (end -1 -0.6) (layer F.Fab) (width 0.1))
    (fp_line (start -1 -0.6) (end 1 -0.6) (layer F.Fab) (width 0.1))
    (fp_line (start 1 -0.6) (end 1 0.6) (layer F.Fab) (width 0.1))
    (fp_line (start 1 0.6) (end -1 0.6) (layer F.Fab) (width 0.1))
    (fp_line (start -0.258578 -0.71) (end 0.258578 -0.71) (layer F.SilkS) (width 0.12))
    (fp_line (start -0.258578 0.71) (end 0.258578 0.71) (layer F.SilkS) (width 0.12))
    (fp_line (start -1.68 0.95) (end -1.68 -0.95) (layer F.CrtYd) (width 0.05))
    (fp_line (start -1.68 -0.95) (end 1.68 -0.95) (layer F.CrtYd) (width 0.05))
    (fp_line (start 1.68 -0.95) (end 1.68 0.95) (layer F.CrtYd) (width 0.05))
    (fp_line (start 1.68 0.95) (end -1.68 0.95) (layer F.CrtYd) (width 0.05))
    (fp_text user %R (at 0 0) (layer F.Fab)
      (effects (font (size 0.5 0.5) (thickness 0.08)))
    )
    (pad 1 smd roundrect (at -0.9375 0) (size 0.975 1.4) (layers F.Cu F.Paste F.Mask) (roundrect_rratio 0.25)
      (net 3 "Net-(C2-Pad1)"))
    (pad 2 smd roundrect (at 0.9375 0) (size 0.975 1.4) (layers F.Cu F.Paste F.Mask) (roundrect_rratio 0.25)
      (net 8 "Net-(C9-Pad1)"))
    (model ${KISYS3DMOD}/Inductor_SMD.3dshapes/L_0805_2012Metric.wrl
      (at (xyz 0 0 0))
      (scale (xyz 1 1 1))
      (rotate (xyz 0 0 0))
    )
  )

  (module Resistor_SMD:R_0603_1608Metric (layer F.Cu) (tedit 5C731245) (tstamp 5CCA9FA1)
    (at 141.4272 88.9762 180)
    (descr "Resistor SMD 0603 (1608 Metric), square (rectangular) end terminal, IPC_7351 nominal, (Body size source: http://www.tortai-tech.com/upload/download/2011102023233369053.pdf), generated with kicad-footprint-generator")
    (tags resistor)
    (path /59FD80DB)
    (attr smd)
    (fp_text reference R1 (at -2.23012 -0.34036 180) (layer F.SilkS)
      (effects (font (size 0.635 0.635) (thickness 0.1016)))
    )
    (fp_text value 10 (at -0.0889 -1.2827 180) (layer F.Fab)
      (effects (font (size 0.635 0.635) (thickness 0.1016)))
    )
    (fp_line (start 1.48 0.73) (end -1.48 0.73) (layer F.CrtYd) (width 0.05))
    (fp_line (start 1.48 -0.73) (end 1.48 0.73) (layer F.CrtYd) (width 0.05))
    (fp_line (start -1.48 -0.73) (end 1.48 -0.73) (layer F.CrtYd) (width 0.05))
    (fp_line (start -1.48 0.73) (end -1.48 -0.73) (layer F.CrtYd) (width 0.05))
    (fp_line (start -0.162779 0.51) (end 0.162779 0.51) (layer F.SilkS) (width 0.12))
    (fp_line (start -0.162779 -0.51) (end 0.162779 -0.51) (layer F.SilkS) (width 0.12))
    (fp_line (start 0.8 0.4) (end -0.8 0.4) (layer F.Fab) (width 0.1))
    (fp_line (start 0.8 -0.4) (end 0.8 0.4) (layer F.Fab) (width 0.1))
    (fp_line (start -0.8 -0.4) (end 0.8 -0.4) (layer F.Fab) (width 0.1))
    (fp_line (start -0.8 0.4) (end -0.8 -0.4) (layer F.Fab) (width 0.1))
    (fp_text user %R (at 0 0 180) (layer F.Fab)
      (effects (font (size 0.4 0.4) (thickness 0.06)))
    )
    (pad 2 smd roundrect (at 0.7875 0 180) (size 0.875 0.95) (layers F.Cu F.Paste F.Mask) (roundrect_rratio 0.25)
      (net 1 "Net-(C1-Pad1)"))
    (pad 1 smd roundrect (at -0.7875 0 180) (size 0.875 0.95) (layers F.Cu F.Paste F.Mask) (roundrect_rratio 0.25)
      (net 3 "Net-(C2-Pad1)"))
    (model ${KISYS3DMOD}/Resistor_SMD.3dshapes/R_0603_1608Metric.wrl
      (at (xyz 0 0 0))
      (scale (xyz 1 1 1))
      (rotate (xyz 0 0 0))
    )
  )

  (module Resistor_SMD:R_0603_1608Metric (layer F.Cu) (tedit 5C73998D) (tstamp 5CCA9FB2)
    (at 150.6474 94.6658 180)
    (descr "Resistor SMD 0603 (1608 Metric), square (rectangular) end terminal, IPC_7351 nominal, (Body size source: http://www.tortai-tech.com/upload/download/2011102023233369053.pdf), generated with kicad-footprint-generator")
    (tags resistor)
    (path /59FADE2A)
    (attr smd)
    (fp_text reference R2 (at -2.2606 0 180) (layer F.SilkS)
      (effects (font (size 0.635 0.635) (thickness 0.1016)))
    )
    (fp_text value 2.2k (at -1.94564 0.01524) (layer F.Fab)
      (effects (font (size 0.635 0.635) (thickness 0.1016)))
    )
    (fp_line (start -0.8 0.4) (end -0.8 -0.4) (layer F.Fab) (width 0.1))
    (fp_line (start -0.8 -0.4) (end 0.8 -0.4) (layer F.Fab) (width 0.1))
    (fp_line (start 0.8 -0.4) (end 0.8 0.4) (layer F.Fab) (width 0.1))
    (fp_line (start 0.8 0.4) (end -0.8 0.4) (layer F.Fab) (width 0.1))
    (fp_line (start -0.162779 -0.51) (end 0.162779 -0.51) (layer F.SilkS) (width 0.12))
    (fp_line (start -0.162779 0.51) (end 0.162779 0.51) (layer F.SilkS) (width 0.12))
    (fp_line (start -1.48 0.73) (end -1.48 -0.73) (layer F.CrtYd) (width 0.05))
    (fp_line (start -1.48 -0.73) (end 1.48 -0.73) (layer F.CrtYd) (width 0.05))
    (fp_line (start 1.48 -0.73) (end 1.48 0.73) (layer F.CrtYd) (width 0.05))
    (fp_line (start 1.48 0.73) (end -1.48 0.73) (layer F.CrtYd) (width 0.05))
    (fp_text user %R (at 0 0 180) (layer F.Fab)
      (effects (font (size 0.4 0.4) (thickness 0.06)))
    )
    (pad 1 smd roundrect (at -0.7875 0 180) (size 0.875 0.95) (layers F.Cu F.Paste F.Mask) (roundrect_rratio 0.25)
      (net 3 "Net-(C2-Pad1)"))
    (pad 2 smd roundrect (at 0.7875 0 180) (size 0.875 0.95) (layers F.Cu F.Paste F.Mask) (roundrect_rratio 0.25)
      (net 4 "Net-(C5-Pad1)"))
    (model ${KISYS3DMOD}/Resistor_SMD.3dshapes/R_0603_1608Metric.wrl
      (at (xyz 0 0 0))
      (scale (xyz 1 1 1))
      (rotate (xyz 0 0 0))
    )
  )

  (module Resistor_SMD:R_0603_1608Metric (layer F.Cu) (tedit 5C7399BA) (tstamp 5CCA9FC3)
    (at 150.6474 96.266)
    (descr "Resistor SMD 0603 (1608 Metric), square (rectangular) end terminal, IPC_7351 nominal, (Body size source: http://www.tortai-tech.com/upload/download/2011102023233369053.pdf), generated with kicad-footprint-generator")
    (tags resistor)
    (path /5CF709C6)
    (attr smd)
    (fp_text reference R3 (at -0.8636 1.397) (layer F.SilkS)
      (effects (font (size 0.635 0.635) (thickness 0.1016)))
    )
    (fp_text value 2.2k (at 2.01168 0.03048) (layer F.Fab)
      (effects (font (size 0.635 0.635) (thickness 0.1016)))
    )
    (fp_line (start -0.8 0.4) (end -0.8 -0.4) (layer F.Fab) (width 0.1))
    (fp_line (start -0.8 -0.4) (end 0.8 -0.4) (layer F.Fab) (width 0.1))
    (fp_line (start 0.8 -0.4) (end 0.8 0.4) (layer F.Fab) (width 0.1))
    (fp_line (start 0.8 0.4) (end -0.8 0.4) (layer F.Fab) (width 0.1))
    (fp_line (start -0.162779 -0.51) (end 0.162779 -0.51) (layer F.SilkS) (width 0.12))
    (fp_line (start -0.162779 0.51) (end 0.162779 0.51) (layer F.SilkS) (width 0.12))
    (fp_line (start -1.48 0.73) (end -1.48 -0.73) (layer F.CrtYd) (width 0.05))
    (fp_line (start -1.48 -0.73) (end 1.48 -0.73) (layer F.CrtYd) (width 0.05))
