EESchema Schematic File Version 4
EELAYER 30 0
EELAYER END
$Descr A4 11693 8268
encoding utf-8
Sheet 1 1
Title "Reference Buffer"
Date "2020-07-21"
Rev "2.4"
Comp "Dyadic Pty Ltd"
Comment1 "2020"
Comment2 ""
Comment3 ""
Comment4 ""
$EndDescr
$Comp
L device:R R14
U 1 1 5DA26CAF
P 5650 3100
F 0 "R14" H 5720 3146 50  0000 L CNN
F 1 "2.2k" H 5720 3055 50  0000 L CNN
F 2 "Resistor_SMD:R_0603_1608Metric" V -2020 100 30  0001 C CNN
F 3 "" H -1950 100 30  0000 C CNN
F 4 "Yageo" H 5650 3100 60  0001 C CNN "MFN"
F 5 "RC0603FR-072K2L" H 5650 3100 60  0001 C CNN "MFP"
F 6 "603-RC0603FR-072K2L" H 5650 3100 60  0001 C CNN "S1PN"
F 7 "Mouser" H 5650 3100 60  0001 C CNN "S1PL"
F 8 "311-2.20KHRCT-ND" H 5650 3100 60  0001 C CNN "S2PN"
F 9 "Digi-Key" H 5650 3100 60  0001 C CNN "S2PL"
F 10 "~" H 5650 3100 60  0001 C CNN "Characteristics"
F 11 "RES SMD 2.2K OHM 1% 1/10W 0603 " H 5650 3100 60  0001 C CNN "Description"
F 12 "0603 (1608 Metric)" H 5650 3100 60  0001 C CNN "Package ID"
F 13 "~" H 5650 3100 60  0001 C CNN "Source"
F 14 "N" H 5650 3100 60  0001 C CNN "Critical"
F 15 "~" H 5650 3100 60  0001 C CNN "Notes"
F 16 "soip" H 5650 3100 50  0001 C CNN "variant"
	1    5650 3100
	1    0    0    -1  
$EndComp
$Comp
L device:R R23
U 1 1 5DA26CD3
P 6250 4450
F 0 "R23" V 6043 4450 50  0000 C CNN
F 1 "15" V 6134 4450 50  0000 C CNN
F 2 "Resistor_SMD:R_0603_1608Metric" V -1420 1450 30  0001 C CNN
F 3 "" H -1350 1450 30  0000 C CNN
F 4 "Yageo" H 6250 4450 60  0001 C CNN "MFN"
F 5 "RC0603FR-0715RL" H 6250 4450 60  0001 C CNN "MFP"
F 6 "603-RC0603FR-0715RL" H 6250 4450 60  0001 C CNN "S1PN"
F 7 "Mouser" H 6250 4450 60  0001 C CNN "S1PL"
F 8 "311-15.0HRCT-ND" H 6250 4450 60  0001 C CNN "S2PN"
F 9 "Digi-Key" H 6250 4450 60  0001 C CNN "S2PL"
F 10 "~" H 6250 4450 60  0001 C CNN "Characteristics"
F 11 "RES SMD 15 OHM 1% 1/10W 0603 " H 6250 4450 60  0001 C CNN "Description"
F 12 "0603 (1608 Metric)" H 6250 4450 60  0001 C CNN "Package ID"
F 13 "~" H 6250 4450 60  0001 C CNN "Source"
F 14 "N" H 6250 4450 60  0001 C CNN "Critical"
F 15 "~" H 6250 4450 60  0001 C CNN "Notes"
F 16 "soip" V 6250 4450 50  0001 C CNN "variant"
	1    6250 4450
	0    1    1    0   
$EndComp
$Comp
L device:R X7
U 1 1 5DA26CE5
P 5200 4450
F 0 "X7" V 5075 4450 50  0000 C CNN
F 1 "0" V 5200 4450 50  0000 C CNN
F 2 "Capacitor_SMD:C_0603_1608Metric" V -2470 1450 30  0001 C CNN
F 3 "" H -2400 1450 30  0000 C CNN
F 4 "~" H 5200 4450 60  0001 C CNN "MFN"
F 5 "~" H 5200 4450 60  0001 C CNN "MFP"
F 6 "~" H 5200 4450 60  0001 C CNN "S1PN"
F 7 "~" H 5200 4450 60  0001 C CNN "S1PL"
F 8 "~" H 5200 4450 60  0001 C CNN "S2PN"
F 9 "~" H 5200 4450 60  0001 C CNN "S2PL"
F 10 "~" H 5200 4450 60  0001 C CNN "Characteristics"
F 11 "~" H 5200 4450 60  0001 C CNN "Description"
F 12 "~" H 5200 4450 60  0001 C CNN "Package ID"
F 13 "~" H 5200 4450 60  0001 C CNN "Source"
F 14 "N" H 5200 4450 60  0001 C CNN "Critical"
F 15 "~" H 5200 4450 60  0001 C CNN "Notes"
F 16 "soip" V 5200 4450 50  0001 C CNN "variant"
	1    5200 4450
	0    1    1    0   
$EndComp
$Comp
L device:R R19
U 1 1 5DA26CF7
P 6000 4050
F 0 "R19" H 6070 4096 50  0000 L CNN
F 1 "49.9" H 6070 4005 50  0000 L CNN
F 2 "Resistor_SMD:R_0603_1608Metric" V -1670 1050 30  0001 C CNN
F 3 "" H -1600 1050 30  0000 C CNN
F 4 "Yageo" H 6000 4050 60  0001 C CNN "MFN"
F 5 "RC0603FR-0749R9L" H 6000 4050 60  0001 C CNN "MFP"
F 6 "603-RC0603FR-0749R9L" H 6000 4050 60  0001 C CNN "S1PN"
F 7 "Mouser" H 6000 4050 60  0001 C CNN "S1PL"
F 8 "311-49.9HRCT-ND" H 6000 4050 60  0001 C CNN "S2PN"
F 9 "Digi-Key" H 6000 4050 60  0001 C CNN "S2PL"
F 10 "~" H 6000 4050 60  0001 C CNN "Characteristics"
F 11 "RES SMD 49.9 OHM 1% 1/10W 0603" H 6000 4050 60  0001 C CNN "Description"
F 12 "0603 (1608 Metric)" H 6000 4050 60  0001 C CNN "Package ID"
F 13 "~" H 6000 4050 60  0001 C CNN "Source"
F 14 "N" H 6000 4050 60  0001 C CNN "Critical"
F 15 "~" H 6000 4050 60  0001 C CNN "Notes"
F 16 "soip" H 6000 4050 50  0001 C CNN "variant"
	1    6000 4050
	1    0    0    -1  
$EndComp
$Comp
L device:R R16
U 1 1 5DA26D09
P 6950 3700
F 0 "R16" V 6743 3700 50  0000 C CNN
F 1 "360" V 6834 3700 50  0000 C CNN
F 2 "Resistor_SMD:R_0603_1608Metric" V -720 700 30  0001 C CNN
F 3 "" H -650 700 30  0000 C CNN
F 4 "Yageo" H 6950 3700 60  0001 C CNN "MFN"
F 5 "RC0603FR-071K8L" H 6950 3700 60  0001 C CNN "MFP"
F 6 "603-RC0603FR-071K8L" H 6950 3700 60  0001 C CNN "S1PN"
F 7 "Mouser" H 6950 3700 60  0001 C CNN "S1PL"
F 8 "311-1.80KHRCT-ND" H 6950 3700 60  0001 C CNN "S2PN"
F 9 "Digi-Key" H 6950 3700 60  0001 C CNN "S2PL"
F 10 "~" H 6950 3700 60  0001 C CNN "Characteristics"
F 11 "RES SMD 1.8K OHM 1% 1/10W 0603 " H 6950 3700 60  0001 C CNN "Description"
F 12 "0603 (1608 Metric) " H 6950 3700 60  0001 C CNN "Package ID"
F 13 "~" H 6950 3700 60  0001 C CNN "Source"
F 14 "N" H 6950 3700 60  0001 C CNN "Critical"
F 15 "~" H 6950 3700 60  0001 C CNN "Notes"
F 16 "soip" V 6950 3700 50  0001 C CNN "variant"
	1    6950 3700
	0    1    1    0   
$EndComp
$Comp
L device:R R24
U 1 1 5DA26D1B
P 6650 4700
F 0 "R24" H 6720 4746 50  0000 L CNN
F 1 "39" H 6720 4655 50  0000 L CNN
F 2 "Resistor_SMD:R_0603_1608Metric" V -1020 1700 30  0001 C CNN
F 3 "" H -950 1700 30  0000 C CNN
F 4 "Yageo" H 6650 4700 60  0001 C CNN "MFN"
F 5 "RC0603FR-0739RL" H 6650 4700 60  0001 C CNN "MFP"
F 6 "603-RC0603FR-0739RL" H 6650 4700 60  0001 C CNN "S1PN"
F 7 "Mouser" H 6650 4700 60  0001 C CNN "S1PL"
F 8 "311-39.0HRCT-ND" H 6650 4700 60  0001 C CNN "S2PN"
F 9 "Digi-Key" H 6650 4700 60  0001 C CNN "S2PL"
F 10 "~" H 6650 4700 60  0001 C CNN "Characteristics"
F 11 "RES SMD 39 OHM 1% 1/10W 0603 " H 6650 4700 60  0001 C CNN "Description"
F 12 "0603 (1608 Metric) " H 6650 4700 60  0001 C CNN "Package ID"
F 13 "~" H 6650 4700 60  0001 C CNN "Source"
F 14 "N" H 6650 4700 60  0001 C CNN "Critical"
F 15 "~" H 6650 4700 60  0001 C CNN "Notes"
F 16 "soip" H 6650 4700 50  0001 C CNN "variant"
	1    6650 4700
	1    0    0    -1  
$EndComp
$Comp
L device:R X6
U 1 1 5DA26D2D
P 4600 4450
F 0 "X6" V 4475 4450 50  0000 C CNN
F 1 "0" V 4600 4450 50  0000 C CNN
F 2 "Capacitor_SMD:C_0603_1608Metric" V -3070 1450 30  0001 C CNN
F 3 "" H -3000 1450 30  0000 C CNN
F 4 "~" H 4600 4450 60  0001 C CNN "MFN"
F 5 "~" H 4600 4450 60  0001 C CNN "MFP"
F 6 "~" H 4600 4450 60  0001 C CNN "S1PN"
F 7 "~" H 4600 4450 60  0001 C CNN "S1PL"
F 8 "~" H 4600 4450 60  0001 C CNN "S2PN"
F 9 "~" H 4600 4450 60  0001 C CNN "S2PL"
F 10 "~" H 4600 4450 60  0001 C CNN "Characteristics"
F 11 "~" H 4600 4450 60  0001 C CNN "Description"
F 12 "~" H 4600 4450 60  0001 C CNN "Package ID"
F 13 "~" H 4600 4450 60  0001 C CNN "Source"
F 14 "N" H 4600 4450 60  0001 C CNN "Critical"
F 15 "~" H 4600 4450 60  0001 C CNN "Notes"
F 16 "soip" V 4600 4450 50  0001 C CNN "variant"
	1    4600 4450
	0    1    1    0   
$EndComp
$Comp
L device:R X9
U 1 1 5DA26D3F
P 4900 4700
F 0 "X9" H 4970 4746 50  0000 L CNN
F 1 "DNF" H 4970 4655 50  0000 L CNN
F 2 "Capacitor_SMD:C_0603_1608Metric" V -2770 1700 30  0001 C CNN
F 3 "" H -2700 1700 30  0000 C CNN
F 4 "~" H 4900 4700 60  0001 C CNN "MFN"
F 5 "~" H 4900 4700 60  0001 C CNN "MFP"
F 6 "~" H 4900 4700 60  0001 C CNN "S1PN"
F 7 "~" H 4900 4700 60  0001 C CNN "S1PL"
F 8 "~" H 4900 4700 60  0001 C CNN "S2PN"
F 9 "~" H 4900 4700 60  0001 C CNN "S2PL"
F 10 "~" H 4900 4700 60  0001 C CNN "Characteristics"
F 11 "~" H 4900 4700 60  0001 C CNN "Description"
F 12 "~" H 4900 4700 60  0001 C CNN "Package ID"
F 13 "~" H 4900 4700 60  0001 C CNN "Source"
F 14 "N" H 4900 4700 60  0001 C CNN "Critical"
F 15 "~" H 4900 4700 60  0001 C CNN "Notes"
F 16 "soip" H 4900 4700 50  0001 C CNN "variant"
	1    4900 4700
	1    0    0    -1  
$EndComp
$Comp
L device:R X8
U 1 1 5DA26D51
P 4300 4700
F 0 "X8" H 4370 4746 50  0000 L CNN
F 1 "DNF" H 4370 4655 50  0000 L CNN
F 2 "Capacitor_SMD:C_0603_1608Metric" V -3370 1700 30  0001 C CNN
F 3 "" H -3300 1700 30  0000 C CNN
F 4 "~" H 4300 4700 60  0001 C CNN "MFN"
F 5 "~" H 4300 4700 60  0001 C CNN "MFP"
F 6 "~" H 4300 4700 60  0001 C CNN "S1PN"
F 7 "~" H 4300 4700 60  0001 C CNN "S1PL"
F 8 "~" H 4300 4700 60  0001 C CNN "S2PN"
F 9 "~" H 4300 4700 60  0001 C CNN "S2PL"
F 10 "~" H 4300 4700 60  0001 C CNN "Characteristics"
F 11 "~" H 4300 4700 60  0001 C CNN "Description"
F 12 "~" H 4300 4700 60  0001 C CNN "Package ID"
F 13 "~" H 4300 4700 60  0001 C CNN "Source"
F 14 "N" H 4300 4700 60  0001 C CNN "Critical"
F 15 "~" H 4300 4700 60  0001 C CNN "Notes"
F 16 "soip" H 4300 4700 50  0001 C CNN "variant"
	1    4300 4700
	1    0    0    -1  
$EndComp
$Comp
L device:R X10
U 1 1 5DA26D63
P 4300 5100
F 0 "X10" H 4370 5146 50  0000 L CNN
F 1 "DNF" H 4370 5055 50  0000 L CNN
F 2 "Capacitor_SMD:C_0603_1608Metric" V -3370 2100 30  0001 C CNN
F 3 "" H -3300 2100 30  0000 C CNN
F 4 "~" H 4300 5100 60  0001 C CNN "MFN"
F 5 "~" H 4300 5100 60  0001 C CNN "MFP"
F 6 "~" H 4300 5100 60  0001 C CNN "S1PN"
F 7 "~" H 4300 5100 60  0001 C CNN "S1PL"
F 8 "~" H 4300 5100 60  0001 C CNN "S2PN"
F 9 "~" H 4300 5100 60  0001 C CNN "S2PL"
F 10 "~" H 4300 5100 60  0001 C CNN "Characteristics"
F 11 "~" H 4300 5100 60  0001 C CNN "Description"
F 12 "~" H 4300 5100 60  0001 C CNN "Package ID"
F 13 "~" H 4300 5100 60  0001 C CNN "Source"
F 14 "N" H 4300 5100 60  0001 C CNN "Critical"
F 15 "~" H 4300 5100 60  0001 C CNN "Notes"
F 16 "soip" H 4300 5100 50  0001 C CNN "variant"
	1    4300 5100
	1    0    0    -1  
$EndComp
$Comp
L power:GND #PWR037
U 1 1 5DA26D75
P 7400 4700
F 0 "#PWR037" H 7450 4750 50  0001 C CNN
F 1 "GND" H 7405 4527 50  0000 C CNN
F 2 "" H -150 25  60  0000 C CNN
F 3 "" H -150 25  60  0000 C CNN
	1    7400 4700
	1    0    0    -1  
$EndComp
$Comp
L power:GND #PWR040
U 1 1 5DA26D7B
P 6650 5250
F 0 "#PWR040" H 6700 5300 50  0001 C CNN
F 1 "GND" H 6655 5077 50  0000 C CNN
F 2 "" H -900 575 60  0000 C CNN
F 3 "" H -900 575 60  0000 C CNN
	1    6650 5250
	1    0    0    -1  
$EndComp
$Comp
L power:GND #PWR030
U 1 1 5DA26D81
P 7650 3350
F 0 "#PWR030" H 7700 3400 50  0001 C CNN
F 1 "GND" H 7655 3177 50  0000 C CNN
F 2 "" H 100 -1325 60  0000 C CNN
F 3 "" H 100 -1325 60  0000 C CNN
	1    7650 3350
	1    0    0    -1  
$EndComp
$Comp
L power:GND #PWR032
U 1 1 5DA26D87
P 5650 3750
F 0 "#PWR032" H 5700 3800 50  0001 C CNN
F 1 "GND" H 5655 3577 50  0000 C CNN
F 2 "" H -1900 -925 60  0000 C CNN
F 3 "" H -1900 -925 60  0000 C CNN
	1    5650 3750
	1    0    0    -1  
$EndComp
$Comp
L power:GND #PWR031
U 1 1 5DA26D8D
P 5300 3750
F 0 "#PWR031" H 5350 3800 50  0001 C CNN
F 1 "GND" H 5305 3577 50  0000 C CNN
F 2 "" H -2250 -925 60  0000 C CNN
F 3 "" H -2250 -925 60  0000 C CNN
	1    5300 3750
	1    0    0    -1  
$EndComp
$Comp
L power:GND #PWR038
U 1 1 5DA26D93
P 4900 4850
F 0 "#PWR038" H 4950 4900 50  0001 C CNN
F 1 "GND" H 4905 4677 50  0000 C CNN
F 2 "" H -2650 175 60  0000 C CNN
F 3 "" H -2650 175 60  0000 C CNN
	1    4900 4850
	1    0    0    -1  
$EndComp
$Comp
L power:GND #PWR039
U 1 1 5DA26D99
P 4300 5250
F 0 "#PWR039" H 4350 5300 50  0001 C CNN
F 1 "GND" H 4305 5077 50  0000 C CNN
F 2 "" H -3250 575 60  0000 C CNN
F 3 "" H -3250 575 60  0000 C CNN
	1    4300 5250
	1    0    0    -1  
$EndComp
$Comp
L power:GND #PWR036
U 1 1 5DA26D9F
P 3775 4625
F 0 "#PWR036" H 3825 4675 50  0001 C CNN
F 1 "GND" H 3780 4452 50  0000 C CNN
F 2 "" H -3775 -50 60  0000 C CNN
F 3 "" H -3775 -50 60  0000 C CNN
	1    3775 4625
	1    0    0    -1  
$EndComp
$Comp
L power:GND #PWR035
U 1 1 5DA26DA5
P 9825 4525
F 0 "#PWR035" H 9875 4575 50  0001 C CNN
F 1 "GND" H 9830 4352 50  0000 C CNN
F 2 "" H 2275 -150 60  0000 C CNN
F 3 "" H 2275 -150 60  0000 C CNN
	1    9825 4525
	1    0    0    -1  
$EndComp
$Comp
L device:C C11
U 1 1 5DA26DB7
P 2900 1900
F 0 "C11" H 3015 1946 50  0000 L CNN
F 1 "0.01u" H 3015 1855 50  0000 L CNN
F 2 "Capacitor_SMD:C_0603_1608Metric" H -4237 -775 30  0001 C CNN
F 3 "" H -4275 -625 60  0000 C CNN
F 4 "Kemet" H 2900 1900 60  0001 C CNN "MFN"
F 5 "C0603C103K5RACTU" H 2900 1900 60  0001 C CNN "MFP"
F 6 "399-1091-1-ND" H 2900 1900 60  0001 C CNN "S1PN"
F 7 "Digi-Key" H 2900 1900 60  0001 C CNN "S1PL"
F 8 "80-C0603C103K5R" H 2900 1900 60  0001 C CNN "S2PN"
F 9 "Mouser" H 2900 1900 60  0001 C CNN "S2PL"
F 10 "~" H 2900 1900 60  0001 C CNN "Characteristics"
F 11 "Multilayer Ceramic Capacitors MLCC - SMD/SMT 50V 0.01uF 0603 X7R 10%" H 2900 1900 60  0001 C CNN "Description"
F 12 "0603 (1608 metric)" H 2900 1900 60  0001 C CNN "Package ID"
F 13 "~" H 2900 1900 60  0001 C CNN "Source"
F 14 "N" H 2900 1900 60  0001 C CNN "Critical"
F 15 "~" H 2900 1900 60  0001 C CNN "Notes"
F 16 "soip" H 2900 1900 50  0001 C CNN "variant"
	1    2900 1900
	1    0    0    -1  
$EndComp
$Comp
L device:C C12
U 1 1 5DA26DC9
P 3500 1900
F 0 "C12" H 3615 1946 50  0000 L CNN
F 1 "0.1u" H 3615 1855 50  0000 L CNN
F 2 "Capacitor_SMD:C_0603_1608Metric" H -3637 -775 30  0001 C CNN
F 3 "" H -3675 -625 60  0000 C CNN
F 4 "Kemet" H 3500 1900 60  0001 C CNN "MFN"
F 5 "C0603C104J4RACTU" H 3500 1900 60  0001 C CNN "MFP"
F 6 "399-1097-1-ND" H 3500 1900 60  0001 C CNN "S1PN"
F 7 "Digi-Key" H 3500 1900 60  0001 C CNN "S1PL"
F 8 "80-C0603C104J4R" H 3500 1900 60  0001 C CNN "S2PN"
F 9 "Mouser" H 3500 1900 60  0001 C CNN "S2PL"
F 10 "~" H 3500 1900 60  0001 C CNN "Characteristics"
F 11 "CAP CER 0.1UF 16V X7R 0603" H 3500 1900 60  0001 C CNN "Description"
F 12 "0603 (1608 Metric)" H 3500 1900 60  0001 C CNN "Package ID"
F 13 "~" H 3500 1900 60  0001 C CNN "Source"
F 14 "N" H 3500 1900 60  0001 C CNN "Critical"
F 15 "~" H 3500 1900 60  0001 C CNN "Notes"
F 16 "soip" H 3500 1900 50  0001 C CNN "variant"
	1    3500 1900
	1    0    0    -1  
$EndComp
$Comp
L device:R R13
U 1 1 5DA26DE1
P 3200 1650
F 0 "R13" V 2993 1650 50  0000 C CNN
F 1 "10" V 3084 1650 50  0000 C CNN
F 2 "Resistor_SMD:R_0603_1608Metric" V -4470 -1350 30  0001 C CNN
F 3 "" H -4400 -1350 30  0000 C CNN
F 4 "Yageo" H 3200 1650 60  0001 C CNN "MFN"
F 5 "RC0603FR-0710RL" H 3200 1650 60  0001 C CNN "MFP"
F 6 "603-RC0603FR-0710RL" H 3200 1650 60  0001 C CNN "S1PN"
F 7 "Mouser" H 3200 1650 60  0001 C CNN "S1PL"
F 8 "311-10.0HRCT-ND" H 3200 1650 60  0001 C CNN "S2PN"
F 9 "Digi-Key" H 3200 1650 60  0001 C CNN "S2PL"
F 10 "~" H 3200 1650 60  0001 C CNN "Characteristics"
F 11 "RES SMD 10 OHM 1% 1/10W 0603" H 3200 1650 60  0001 C CNN "Description"
F 12 "0603 (1608 Metric)" H 3200 1650 60  0001 C CNN "Package ID"
F 13 "~" H 3200 1650 60  0001 C CNN "Source"
F 14 "N" H 3200 1650 60  0001 C CNN "Critical"
F 15 "~" H 3200 1650 60  0001 C CNN "Notes"
F 16 "soip" V 3200 1650 50  0001 C CNN "variant"
	1    3200 1650
	0    1    1    0   
$EndComp
$Comp
L device:C C13
U 1 1 5DA26DF3
P 3900 1900
F 0 "C13" H 4015 1946 50  0000 L CNN
F 1 "10u" H 4015 1855 50  0000 L CNN
F 2 "Capacitor_SMD:C_0805_2012Metric" H -3237 -775 30  0001 C CNN
F 3 "" H -3275 -625 60  0000 C CNN
F 4 "Murata" H 3900 1900 60  0001 C CNN "MFN"
F 5 "GRM21BR61C106KE15L" H 3900 1900 60  0001 C CNN "MFP"
F 6 "81-GRM21BR61C106KE15" H 3900 1900 60  0001 C CNN "S1PN"
F 7 "Mouser" H 3900 1900 60  0001 C CNN "S1PL"
F 8 "490-3886-1-ND" H 3900 1900 60  0001 C CNN "S2PN"
F 9 "Digi-Key" H 3900 1900 60  0001 C CNN "S2PL"
F 10 "~" H 3900 1900 60  0001 C CNN "Characteristics"
F 11 "CAP CER 10UF 16V X5R 0805 " H 3900 1900 60  0001 C CNN "Description"
F 12 "0805 (2012 Metric) " H 3900 1900 60  0001 C CNN "Package ID"
F 13 "~" H 3900 1900 60  0001 C CNN "Source"
F 14 "N" H 3900 1900 60  0001 C CNN "Critical"
F 15 "~" H 3900 1900 60  0001 C CNN "Notes"
F 16 "soip" H 3900 1900 50  0001 C CNN "variant"
	1    3900 1900
	1    0    0    -1  
$EndComp
Wire Wire Line
	6650 3700 6650 4250
Wire Wire Line
	6650 3700 6800 3700
Wire Wire Line
	7100 4250 6650 4250
Connection ~ 6650 4250
Wire Wire Line
	7900 4350 8050 4350
Wire Wire Line
	7100 3700 8050 3700
Wire Wire Line
	8050 3700 8050 4350
Connection ~ 8050 4350
Wire Wire Line
	6650 4850 6650 4950
Wire Wire Line
	7100 4450 6400 4450
Wire Wire Line
	5900 4450 6000 4450
Wire Wire Line
	7400 2950 7650 2950
Wire Wire Line
	7650 2950 7650 3050
Connection ~ 7400 2950
Wire Wire Line
	6000 4200 6000 4450
Connection ~ 6000 4450
Wire Wire Line
	5650 3250 5650 3350
Wire Wire Line
	6000 3350 6000 3900
Wire Wire Line
	5300 3350 5650 3350
Connection ~ 5650 3350
Wire Wire Line
	5300 3450 5300 3350
Wire Wire Line
	5650 2950 5650 2550
Wire Wire Line
	5650 2550 6550 2550
Wire Wire Line
	5600 4450 5350 4450
Wire Wire Line
	4750 4450 4900 4450
Wire Wire Line
	4900 4550 4900 4450
Connection ~ 4900 4450
Wire Wire Line
	4300 4950 4300 4850
Wire Wire Line
	4300 4550 4300 4450
Wire Wire Line
	8550 4350 8750 4350
Wire Wire Line
	7500 4000 7500 3900
Wire Wire Line
	7500 3900 7400 3900
Connection ~ 7400 3900
Wire Wire Line
	2400 1650 2900 1650
Wire Wire Line
	3350 1650 3500 1650
Wire Wire Line
	4600 1650 5000 1650
Wire Wire Line
	5400 1650 5400 1750
Wire Wire Line
	5000 1750 5000 1650
Connection ~ 5000 1650
Wire Wire Line
	3900 1750 3900 1650
Connection ~ 3900 1650
Wire Wire Line
	3500 1750 3500 1650
Connection ~ 3500 1650
Wire Wire Line
	2900 1750 2900 1650
Connection ~ 2900 1650
$Comp
L power:GND #PWR023
U 1 1 5DA26E26
P 2500 2050
F 0 "#PWR023" H 2550 2100 50  0001 C CNN
F 1 "GND" H 2505 1877 50  0000 C CNN
F 2 "" H -5050 -2625 60  0000 C CNN
F 3 "" H -5050 -2625 60  0000 C CNN
	1    2500 2050
	1    0    0    -1  
$EndComp
$Comp
L power:GND #PWR024
U 1 1 5DA26E2C
P 2900 2050
F 0 "#PWR024" H 2950 2100 50  0001 C CNN
F 1 "GND" H 2905 1877 50  0000 C CNN
F 2 "" H -4650 -2625 60  0000 C CNN
F 3 "" H -4650 -2625 60  0000 C CNN
	1    2900 2050
	1    0    0    -1  
$EndComp
$Comp
L power:GND #PWR025
U 1 1 5DA26E32
P 3500 2050
F 0 "#PWR025" H 3550 2100 50  0001 C CNN
F 1 "GND" H 3505 1877 50  0000 C CNN
F 2 "" H -4050 -2625 60  0000 C CNN
F 3 "" H -4050 -2625 60  0000 C CNN
	1    3500 2050
	1    0    0    -1  
$EndComp
$Comp
L power:GND #PWR026
U 1 1 5DA26E38
P 3900 2050
F 0 "#PWR026" H 3950 2100 50  0001 C CNN
F 1 "GND" H 3905 1877 50  0000 C CNN
F 2 "" H -3650 -2625 60  0000 C CNN
F 3 "" H -3650 -2625 60  0000 C CNN
	1    3900 2050
	1    0    0    -1  
$EndComp
Wire Wire Line
	2400 1750 2500 1750
$Comp
L power:GND #PWR028
U 1 1 5DA26E47
P 5000 2050
F 0 "#PWR028" H 5050 2100 50  0001 C CNN
F 1 "GND" H 5005 1877 50  0000 C CNN
F 2 "" H -2550 -2625 60  0000 C CNN
F 3 "" H -2550 -2625 60  0000 C CNN
	1    5000 2050
	1    0    0    -1  
$EndComp
$Comp
L power:GND #PWR029
U 1 1 5DA26E4D
P 5400 2050
F 0 "#PWR029" H 5450 2100 50  0001 C CNN
F 1 "GND" H 5405 1877 50  0000 C CNN
F 2 "" H -2150 -2625 60  0000 C CNN
F 3 "" H -2150 -2625 60  0000 C CNN
	1    5400 2050
	1    0    0    -1  
$EndComp
Wire Wire Line
	6550 1650 6550 2550
Connection ~ 5400 1650
Connection ~ 6550 2550
Wire Wire Line
	7400 2550 7400 2650
Wire Wire Line
	7400 2850 7400 2950
Wire Wire Line
	6650 4250 6650 4550
Wire Wire Line
	8050 4350 8250 4350
Wire Wire Line
	7400 2950 7400 3900
Wire Wire Line
	6000 4450 6100 4450
Wire Wire Line
	5650 3350 5650 3450
Wire Wire Line
	5650 3350 6000 3350
Wire Wire Line
	4900 4450 5050 4450
Wire Wire Line
	4300 4450 4450 4450
Wire Wire Line
	7400 3900 7400 4000
Wire Wire Line
	5000 1650 5400 1650
Wire Wire Line
	3900 1650 4300 1650
Wire Wire Line
	3500 1650 3900 1650
Wire Wire Line
	2900 1650 3050 1650
Wire Wire Line
	5400 1650 6550 1650
Wire Wire Line
	6550 2550 7400 2550
$Comp
L power:GND #PWR034
U 1 1 5DA26E8D
P 3775 4125
F 0 "#PWR034" H 3825 4175 50  0001 C CNN
F 1 "GND" H 3780 3952 50  0000 C CNN
F 2 "" H -3775 -550 60  0000 C CNN
F 3 "" H -3775 -550 60  0000 C CNN
	1    3775 4125
	1    0    0    -1  
$EndComp
$Comp
L device:R_Small R18
U 1 1 5DA26E9B
P 4075 3950
F 0 "R18" V 3975 3950 50  0000 C CNN
F 1 "DNF" V 4175 3950 50  0000 C CNN
F 2 "Resistor_SMD:R_0402_1005Metric" H 4075 3950 50  0001 C CNN
F 3 "~" H 4075 3950 50  0001 C CNN
F 4 "Yageo" H 4075 3950 50  0001 C CNN "MFN"
F 5 "RC0402JR-070RL" H 4075 3950 50  0001 C CNN "MFP"
F 6 "603-RC0402JR-070RL" H 4075 3950 50  0001 C CNN "S1PN"
F 7 "Mouser" H 4075 3950 50  0001 C CNN "S1PL"
F 8 "311-0.0JRCT-ND" H 4075 3950 50  0001 C CNN "S2PN"
F 9 "Digi-Key" H 4075 3950 50  0001 C CNN "S2PL"
F 10 "RES SMD 0 OHM JUMPER 1/16W 0402" H 4075 3950 50  0001 C CNN "Description"
F 11 "0402 (1005 Metric)" H 4075 3950 50  0001 C CNN "Package ID"
F 12 "soip" V 4075 3950 50  0001 C CNN "variant"
F 13 "1" V 4075 3950 50  0001 C CNN "DNP"
	1    4075 3950
	0    1    1    0   
$EndComp
Wire Wire Line
	3900 4450 3975 4450
Wire Wire Line
	4175 4450 4300 4450
Connection ~ 4300 4450
Wire Wire Line
	4300 4450 4300 3950
Wire Wire Line
	4300 3950 4175 3950
Wire Wire Line
	3975 3950 3900 3950
$Comp
L power:GND #PWR033
U 1 1 5DA26EA7
P 9825 4000
F 0 "#PWR033" H 9875 4050 50  0001 C CNN
F 1 "GND" H 9830 3827 50  0000 C CNN
F 2 "" H 2275 -675 60  0000 C CNN
F 3 "" H 2275 -675 60  0000 C CNN
	1    9825 4000
	1    0    0    -1  
$EndComp
Wire Wire Line
	9050 4350 9150 4350
Wire Wire Line
	9325 4350 9325 3825
Wire Wire Line
	9325 3825 9400 3825
Connection ~ 9325 4350
Wire Wire Line
	9325 4350 9400 4350
Wire Wire Line
	9600 3825 9700 3825
Wire Wire Line
	9600 4350 9700 4350
$Comp
L project:rfi_shield_clip P5
U 1 1 5DA26EBB
P 8175 1725
F 0 "P5" H 8303 1744 60  0000 L CNN
F 1 "~" H 8303 1691 60  0000 L CNN
F 2 "RF_Shielding:S1721-46R" H 8175 1725 60  0001 C CNN
F 3 "" H 8175 1725 60  0000 C CNN
F 4 "Harwin Inc." H 8175 1725 50  0001 C CNN "MFN"
F 5 "S1721-46R" H 8175 1725 50  0001 C CNN "MFP"
F 6 "952-1476-1-ND" H 8175 1725 50  0001 C CNN "S1PN"
F 7 "Digi-Key" H 8175 1725 50  0001 C CNN "S1PL"
F 8 "855-S1721-46R" H 8175 1725 50  0001 C CNN "S2PN"
F 9 "Mouser" H 8175 1725 50  0001 C CNN "S2PL"
F 10 "RFI SHIELD CLIP MINI TIN SMD" H 8175 1725 50  0001 C CNN "Description"
F 11 "soip" H 8175 1725 50  0001 C CNN "variant"
	1    8175 1725
	1    0    0    -1  
$EndComp
$Comp
L power:GND #PWR021
U 1 1 5DA26EC1
P 8175 1825
F 0 "#PWR021" H 8225 1875 50  0001 C CNN
F 1 "GND" H 8180 1652 50  0000 C CNN
F 2 "" H 625 -2850 60  0000 C CNN
F 3 "" H 625 -2850 60  0000 C CNN
	1    8175 1825
	1    0    0    -1  
$EndComp
$Comp
L power:GND #PWR022
U 1 1 5DA26EC7
P 8650 1825
F 0 "#PWR022" H 8700 1875 50  0001 C CNN
F 1 "GND" H 8655 1652 50  0000 C CNN
F 2 "" H 1100 -2850 60  0000 C CNN
F 3 "" H 1100 -2850 60  0000 C CNN
	1    8650 1825
	1    0    0    -1  
$EndComp
$Comp
L device:R_Small R22
U 1 1 5DA26ED5
P 4075 4450
F 0 "R22" V 3975 4450 50  0000 C CNN
F 1 "0" V 4175 4450 50  0000 C CNN
F 2 "Resistor_SMD:R_0402_1005Metric" H 4075 4450 50  0001 C CNN
F 3 "~" H 4075 4450 50  0001 C CNN
F 4 "Yageo" H 4075 4450 50  0001 C CNN "MFN"
F 5 "RC0402JR-070RL" H 4075 4450 50  0001 C CNN "MFP"
F 6 "603-RC0402JR-070RL" H 4075 4450 50  0001 C CNN "S1PN"
F 7 "Mouser" H 4075 4450 50  0001 C CNN "S1PL"
F 8 "311-0.0JRCT-ND" H 4075 4450 50  0001 C CNN "S2PN"
F 9 "Digi-Key" H 4075 4450 50  0001 C CNN "S2PL"
F 10 "RES SMD 0 OHM JUMPER 1/16W 0402" H 4075 4450 50  0001 C CNN "Description"
F 11 "0402 (1005 Metric)" H 4075 4450 50  0001 C CNN "Package ID"
F 12 "soip" V 4075 4450 50  0001 C CNN "variant"
	1    4075 4450
	0    1    1    0   
$EndComp
$Comp
L device:R_Small R17
U 1 1 5DA26EE3
P 9500 3825
F 0 "R17" V 9400 3825 50  0000 C CNN
F 1 "DNF" V 9600 3825 50  0000 C CNN
F 2 "Resistor_SMD:R_0402_1005Metric" H 9500 3825 50  0001 C CNN
F 3 "~" H 9500 3825 50  0001 C CNN
F 4 "Yageo" H 9500 3825 50  0001 C CNN "MFN"
F 5 "RC0402JR-070RL" H 9500 3825 50  0001 C CNN "MFP"
F 6 "603-RC0402JR-070RL" H 9500 3825 50  0001 C CNN "S1PN"
F 7 "Mouser" H 9500 3825 50  0001 C CNN "S1PL"
F 8 "311-0.0JRCT-ND" H 9500 3825 50  0001 C CNN "S2PN"
F 9 "Digi-Key" H 9500 3825 50  0001 C CNN "S2PL"
F 10 "RES SMD 0 OHM JUMPER 1/16W 0402" H 9500 3825 50  0001 C CNN "Description"
F 11 "0402 (1005 Metric)" H 9500 3825 50  0001 C CNN "Package ID"
F 12 "soip" V 9500 3825 50  0001 C CNN "variant"
F 13 "1" V 9500 3825 50  0001 C CNN "DNP"
	1    9500 3825
	0    1    1    0   
$EndComp
$Comp
L device:R_Small R21
U 1 1 5DA26EF1
P 9500 4350
F 0 "R21" V 9400 4350 50  0000 C CNN
F 1 "0" V 9600 4350 50  0000 C CNN
F 2 "Resistor_SMD:R_0402_1005Metric" H 9500 4350 50  0001 C CNN
F 3 "~" H 9500 4350 50  0001 C CNN
F 4 "Yageo" H 9500 4350 50  0001 C CNN "MFN"
F 5 "RC0402JR-070RL" H 9500 4350 50  0001 C CNN "MFP"
F 6 "603-RC0402JR-070RL" H 9500 4350 50  0001 C CNN "S1PN"
F 7 "Mouser" H 9500 4350 50  0001 C CNN "S1PL"
F 8 "311-0.0JRCT-ND" H 9500 4350 50  0001 C CNN "S2PN"
F 9 "Digi-Key" H 9500 4350 50  0001 C CNN "S2PL"
F 10 "RES SMD 0 OHM JUMPER 1/16W 0402" H 9500 4350 50  0001 C CNN "Description"
F 11 "0402 (1005 Metric)" H 9500 4350 50  0001 C CNN "Package ID"
F 12 "soip" V 9500 4350 50  0001 C CNN "variant"
	1    9500 4350
	0    1    1    0   
$EndComp
$Comp
L device:C C14
U 1 1 5DA26F03
P 5000 1900
F 0 "C14" H 5115 1946 50  0000 L CNN
F 1 "0.1u" H 5115 1855 50  0000 L CNN
F 2 "Capacitor_SMD:C_0603_1608Metric" H -2137 -775 30  0001 C CNN
F 3 "" H -2175 -625 60  0000 C CNN
F 4 "Kemet" H 5000 1900 60  0001 C CNN "MFN"
F 5 "C0603C104J4RACTU " H 5000 1900 60  0001 C CNN "MFP"
F 6 "399-1097-1-ND" H 5000 1900 60  0001 C CNN "S1PN"
F 7 "Digi-Key" H 5000 1900 60  0001 C CNN "S1PL"
F 8 "80-C0603C104J4R" H 5000 1900 60  0001 C CNN "S2PN"
F 9 "Mouser" H 5000 1900 60  0001 C CNN "S2PL"
F 10 "~" H 5000 1900 60  0001 C CNN "Characteristics"
F 11 "CAP CER 0.1UF 16V X7R 0603" H 5000 1900 60  0001 C CNN "Description"
F 12 "0603 (1608 Metric)" H 5000 1900 60  0001 C CNN "Package ID"
F 13 "~" H 5000 1900 60  0001 C CNN "Source"
F 14 "N" H 5000 1900 60  0001 C CNN "Critical"
F 15 "~" H 5000 1900 60  0001 C CNN "Notes"
F 16 "soip" H 5000 1900 50  0001 C CNN "variant"
	1    5000 1900
	1    0    0    -1  
$EndComp
$Comp
L device:C C16
U 1 1 5DA26F15
P 7650 3200
F 0 "C16" H 7765 3246 50  0000 L CNN
F 1 "0.1u" H 7765 3155 50  0000 L CNN
F 2 "Capacitor_SMD:C_0603_1608Metric" H 513 525 30  0001 C CNN
F 3 "" H 475 675 60  0000 C CNN
F 4 "Kemet" H 7650 3200 60  0001 C CNN "MFN"
F 5 "C0603C104J4RACTU " H 7650 3200 60  0001 C CNN "MFP"
F 6 "399-1097-1-ND" H 7650 3200 60  0001 C CNN "S1PN"
F 7 "Digi-Key" H 7650 3200 60  0001 C CNN "S1PL"
F 8 "80-C0603C104J4R" H 7650 3200 60  0001 C CNN "S2PN"
F 9 "Mouser" H 7650 3200 60  0001 C CNN "S2PL"
F 10 "~" H 7650 3200 60  0001 C CNN "Characteristics"
F 11 "CAP CER 0.1UF 16V X7R 0603" H 7650 3200 60  0001 C CNN "Description"
F 12 "0603 (1608 Metric)" H 7650 3200 60  0001 C CNN "Package ID"
F 13 "~" H 7650 3200 60  0001 C CNN "Source"
F 14 "N" H 7650 3200 60  0001 C CNN "Critical"
F 15 "~" H 7650 3200 60  0001 C CNN "Notes"
F 16 "soip" H 7650 3200 50  0001 C CNN "variant"
	1    7650 3200
	1    0    0    -1  
$EndComp
$Comp
L device:C C17
U 1 1 5DA26F27
P 5300 3600
F 0 "C17" H 5415 3646 50  0000 L CNN
F 1 "0.1u" H 5415 3555 50  0000 L CNN
F 2 "Capacitor_SMD:C_0603_1608Metric" H -1837 925 30  0001 C CNN
F 3 "" H -1875 1075 60  0000 C CNN
F 4 "Kemet" H 5300 3600 60  0001 C CNN "MFN"
F 5 "C0603C104J4RACTU " H 5300 3600 60  0001 C CNN "MFP"
F 6 "399-1097-1-ND" H 5300 3600 60  0001 C CNN "S1PN"
F 7 "Digi-Key" H 5300 3600 60  0001 C CNN "S1PL"
F 8 "80-C0603C104J4R" H 5300 3600 60  0001 C CNN "S2PN"
F 9 "Mouser" H 5300 3600 60  0001 C CNN "S2PL"
F 10 "~" H 5300 3600 60  0001 C CNN "Characteristics"
F 11 "CAP CER 0.1UF 16V X7R 0603" H 5300 3600 60  0001 C CNN "Description"
F 12 "0603 (1608 Metric)" H 5300 3600 60  0001 C CNN "Package ID"
F 13 "~" H 5300 3600 60  0001 C CNN "Source"
F 14 "N" H 5300 3600 60  0001 C CNN "Critical"
F 15 "~" H 5300 3600 60  0001 C CNN "Notes"
F 16 "soip" H 5300 3600 50  0001 C CNN "variant"
	1    5300 3600
	1    0    0    -1  
$EndComp
$Comp
L device:C C19
U 1 1 5DA26F39
P 5750 4450
F 0 "C19" V 5500 4400 50  0000 L CNN
F 1 "0.1u" V 5600 4375 50  0000 L CNN
F 2 "Capacitor_SMD:C_0603_1608Metric" H -1387 1775 30  0001 C CNN
F 3 "" H -1425 1925 60  0000 C CNN
F 4 "Kemet" H 5750 4450 60  0001 C CNN "MFN"
F 5 "C0603C104J4RACTU " H 5750 4450 60  0001 C CNN "MFP"
F 6 "399-1097-1-ND" H 5750 4450 60  0001 C CNN "S1PN"
F 7 "Digi-Key" H 5750 4450 60  0001 C CNN "S1PL"
F 8 "80-C0603C104J4R" H 5750 4450 60  0001 C CNN "S2PN"
F 9 "Mouser" H 5750 4450 60  0001 C CNN "S2PL"
F 10 "~" H 5750 4450 60  0001 C CNN "Characteristics"
F 11 "CAP CER 0.1UF 16V X7R 0603" H 5750 4450 60  0001 C CNN "Description"
F 12 "0603 (1608 Metric)" H 5750 4450 60  0001 C CNN "Package ID"
F 13 "~" H 5750 4450 60  0001 C CNN "Source"
F 14 "N" H 5750 4450 60  0001 C CNN "Critical"
F 15 "~" H 5750 4450 60  0001 C CNN "Notes"
F 16 "soip" V 5750 4450 50  0001 C CNN "variant"
	1    5750 4450
	0    1    1    0   
$EndComp
$Comp
L device:C C18
U 1 1 5DA26F4B
P 8400 4350
F 0 "C18" V 8150 4275 50  0000 L CNN
F 1 "0.1u" V 8250 4275 50  0000 L CNN
F 2 "Capacitor_SMD:C_0603_1608Metric" H 1263 1675 30  0001 C CNN
F 3 "" H 1225 1825 60  0000 C CNN
F 4 "Kemet" H 8400 4350 60  0001 C CNN "MFN"
F 5 "C0603C104J4RACTU " H 8400 4350 60  0001 C CNN "MFP"
F 6 "399-1097-1-ND" H 8400 4350 60  0001 C CNN "S1PN"
F 7 "Digi-Key" H 8400 4350 60  0001 C CNN "S1PL"
F 8 "80-C0603C104J4R" H 8400 4350 60  0001 C CNN "S2PN"
F 9 "Mouser" H 8400 4350 60  0001 C CNN "S2PL"
F 10 "~" H 8400 4350 60  0001 C CNN "Characteristics"
F 11 "CAP CER 0.1UF 16V X7R 0603" H 8400 4350 60  0001 C CNN "Description"
F 12 "0603 (1608 Metric)" H 8400 4350 60  0001 C CNN "Package ID"
F 13 "~" H 8400 4350 60  0001 C CNN "Source"
F 14 "N" H 8400 4350 60  0001 C CNN "Critical"
F 15 "~" H 8400 4350 60  0001 C CNN "Notes"
F 16 "soip" V 8400 4350 50  0001 C CNN "variant"
	1    8400 4350
	0    1    1    0   
$EndComp
$Comp
L device:C C20
U 1 1 5DA26F5D
P 6650 5100
F 0 "C20" H 6765 5146 50  0000 L CNN
F 1 "0.1u" H 6765 5055 50  0000 L CNN
F 2 "Capacitor_SMD:C_0603_1608Metric" H -487 2425 30  0001 C CNN
F 3 "" H -525 2575 60  0000 C CNN
F 4 "Kemet" H 6650 5100 60  0001 C CNN "MFN"
F 5 "C0603C104J4RACTU " H 6650 5100 60  0001 C CNN "MFP"
F 6 "399-1097-1-ND" H 6650 5100 60  0001 C CNN "S1PN"
F 7 "Digi-Key" H 6650 5100 60  0001 C CNN "S1PL"
F 8 "80-C0603C104J4R" H 6650 5100 60  0001 C CNN "S2PN"
F 9 "Mouser" H 6650 5100 60  0001 C CNN "S2PL"
F 10 "~" H 6650 5100 60  0001 C CNN "Characteristics"
F 11 "CAP CER 0.1UF 16V X7R 0603" H 6650 5100 60  0001 C CNN "Description"
F 12 "0603 (1608 Metric)" H 6650 5100 60  0001 C CNN "Package ID"
F 13 "~" H 6650 5100 60  0001 C CNN "Source"
F 14 "N" H 6650 5100 60  0001 C CNN "Critical"
F 15 "~" H 6650 5100 60  0001 C CNN "Notes"
F 16 "soip" H 6650 5100 50  0001 C CNN "variant"
	1    6650 5100
	1    0    0    -1  
$EndComp
$Comp
L device:C C15
U 1 1 5DA26F6F
P 5400 1900
F 0 "C15" H 5515 1946 50  0000 L CNN
F 1 "10u" H 5515 1855 50  0000 L CNN
F 2 "Capacitor_SMD:C_0805_2012Metric" H -1737 -775 30  0001 C CNN
F 3 "" H -1775 -625 60  0000 C CNN
F 4 "Murata" H 5400 1900 60  0001 C CNN "MFN"
F 5 "GRM21BR61C106KE15L" H 5400 1900 60  0001 C CNN "MFP"
F 6 "81-GRM21BR61C106KE15" H 5400 1900 60  0001 C CNN "S1PN"
F 7 "Mouser" H 5400 1900 60  0001 C CNN "S1PL"
F 8 "490-3886-1-ND" H 5400 1900 60  0001 C CNN "S2PN"
F 9 "Digi-Key" H 5400 1900 60  0001 C CNN "S2PL"
F 10 "~" H 5400 1900 60  0001 C CNN "Characteristics"
F 11 "CAP CER 10UF 16V X5R 0805 " H 5400 1900 60  0001 C CNN "Description"
F 12 "0805 (2012 Metric) " H 5400 1900 60  0001 C CNN "Package ID"
F 13 "~" H 5400 1900 60  0001 C CNN "Source"
F 14 "N" H 5400 1900 60  0001 C CNN "Critical"
F 15 "~" H 5400 1900 60  0001 C CNN "Notes"
F 16 "soip" H 5400 1900 50  0001 C CNN "variant"
	1    5400 1900
	1    0    0    -1  
$EndComp
$Comp
L device:R R15
U 1 1 5DA26F81
P 5650 3600
F 0 "R15" H 5720 3646 50  0000 L CNN
F 1 "2.2k" H 5720 3555 50  0000 L CNN
F 2 "Resistor_SMD:R_0603_1608Metric" V -2020 600 30  0001 C CNN
F 3 "" H -1950 600 30  0000 C CNN
F 4 "Yageo" H 5650 3600 60  0001 C CNN "MFN"
F 5 "RC0603FR-072K2L" H 5650 3600 60  0001 C CNN "MFP"
F 6 "603-RC0603FR-072K2L" H 5650 3600 60  0001 C CNN "S1PN"
F 7 "Mouser" H 5650 3600 60  0001 C CNN "S1PL"
F 8 "311-2.20KHRCT-ND" H 5650 3600 60  0001 C CNN "S2PN"
F 9 "Digi-Key" H 5650 3600 60  0001 C CNN "S2PL"
F 10 "~" H 5650 3600 60  0001 C CNN "Characteristics"
F 11 "RES SMD 2.2K OHM 1% 1/10W 0603 " H 5650 3600 60  0001 C CNN "Description"
F 12 "0603 (1608 Metric)" H 5650 3600 60  0001 C CNN "Package ID"
F 13 "~" H 5650 3600 60  0001 C CNN "Source"
F 14 "N" H 5650 3600 60  0001 C CNN "Critical"
F 15 "~" H 5650 3600 60  0001 C CNN "Notes"
F 16 "soip" H 5650 3600 50  0001 C CNN "variant"
	1    5650 3600
	1    0    0    -1  
$EndComp
$Comp
L device:R R20
U 1 1 5DA26F93
P 8900 4350
F 0 "R20" V 8700 4300 50  0000 L CNN
F 1 "49.9" V 8800 4250 50  0000 L CNN
F 2 "Resistor_SMD:R_0603_1608Metric" V 1230 1350 30  0001 C CNN
F 3 "" H 1300 1350 30  0000 C CNN
F 4 "Yageo" H 8900 4350 60  0001 C CNN "MFN"
F 5 "RC0603FR-0749R9L" H 8900 4350 60  0001 C CNN "MFP"
F 6 "603-RC0603FR-0749R9L" H 8900 4350 60  0001 C CNN "S1PN"
F 7 "Mouser" H 8900 4350 60  0001 C CNN "S1PL"
F 8 "311-49.9HRCT-ND" H 8900 4350 60  0001 C CNN "S2PN"
F 9 "Digi-Key" H 8900 4350 60  0001 C CNN "S2PL"
F 10 "~" H 8900 4350 60  0001 C CNN "Characteristics"
F 11 "RES SMD 49.9 OHM 1% 1/10W 0603" H 8900 4350 60  0001 C CNN "Description"
F 12 "0603 (1608 Metric)" H 8900 4350 60  0001 C CNN "Package ID"
F 13 "~" H 8900 4350 60  0001 C CNN "Source"
F 14 "N" H 8900 4350 60  0001 C CNN "Critical"
F 15 "~" H 8900 4350 60  0001 C CNN "Notes"
F 16 "soip" V 8900 4350 50  0001 C CNN "variant"
	1    8900 4350
	0    1    1    0   
$EndComp
$Comp
L project:rfi_shield_clip P6
U 1 1 5DA26FA0
P 8650 1725
F 0 "P6" H 8778 1744 60  0000 L CNN
F 1 "~" H 8778 1691 60  0000 L CNN
F 2 "RF_Shielding:S1721-46R" H 8650 1725 60  0001 C CNN
F 3 "" H 8650 1725 60  0000 C CNN
F 4 "Harwin Inc." H 8650 1725 50  0001 C CNN "MFN"
F 5 "S1721-46R" H 8650 1725 50  0001 C CNN "MFP"
F 6 "952-1476-1-ND" H 8650 1725 50  0001 C CNN "S1PN"
F 7 "Digi-Key" H 8650 1725 50  0001 C CNN "S1PL"
F 8 "855-S1721-46R" H 8650 1725 50  0001 C CNN "S2PN"
F 9 "Mouser" H 8650 1725 50  0001 C CNN "S2PL"
F 10 "RFI SHIELD CLIP MINI TIN SMD" H 8650 1725 50  0001 C CNN "Description"
F 11 "soip" H 8650 1725 50  0001 C CNN "variant"
	1    8650 1725
	1    0    0    -1  
$EndComp
$Comp
L project:OPA847 U4
U 1 1 5DA3CCE3
P 7500 4350
F 0 "U4" H 7650 4500 60  0000 L CNN
F 1 "OPA847-SOT" H 7600 4150 60  0000 L CNN
F 2 "Package_TO_SOT_SMD:TSOT-23-6" H 7500 4350 60  0001 C CNN
F 3 "AmpliOp.sch" H 7675 4050 60  0001 L CNN
F 4 "Texas Instruments" H 7500 4350 50  0001 C CNN "MFN"
F 5 "OPA847ID" H 7500 4350 50  0001 C CNN "MFP"
F 6 "OPA847ID" H 7500 4350 50  0001 C CNN "S1PN"
F 7 "Arrow" H 7500 4350 50  0001 C CNN "S1PL"
F 8 "296-15171-5-ND" H 7500 4350 50  0001 C CNN "S2PN"
F 9 "Digi-Key" H 7500 4350 50  0001 C CNN "S2PL"
F 10 "Op Amp Single High Speed Amplifier ±6V/12V" H 7500 4350 50  0001 C CNN "Description"
F 11 "8-SOIC (0.154\", 3.90mm Width)" H 7500 4350 50  0001 C CNN "Package ID"
F 12 "1:$5.25; 10:$4.73; 100:$3.96" H 7500 4350 50  0001 C CNN "kicost:Texas_Instruments:pricing"
F 13 "soip" H 7500 4350 50  0001 C CNN "variant"
	1    7500 4350
	1    0    0    -1  
$EndComp
Wire Wire Line
	2500 1750 2500 2050
$Comp
L power:PWR_FLAG #FLG0101
U 1 1 5DA43F97
P 7400 2950
F 0 "#FLG0101" H 7400 3025 50  0001 C CNN
F 1 "PWR_FLAG" V 7400 3078 50  0000 L CNN
F 2 "" H 7400 2950 50  0001 C CNN
F 3 "~" H 7400 2950 50  0001 C CNN
	1    7400 2950
	0    -1   -1   0   
$EndComp
$Comp
L project:SMA_2 J5
U 1 1 5D4B3F48
P 9825 4350
F 0 "J5" H 9928 4340 50  0000 L CNN
F 1 "RF Out" H 10075 4550 50  0000 L CNN
F 2 "RF_SMA_Connectors:SMA_EDGE_4" H 6600 200 50  0001 C CNN
F 3 "" H 6425 300 60  0000 C CNN
F 4 "Molex" H 9825 4350 50  0001 C CNN "MFN"
F 5 "0732511150" H 9825 4350 50  0001 C CNN "MFP"
F 6 "S01-SJEDM-11BS05" H 9825 4350 50  0001 C CNN "S1PN"
F 7 "Superbat" H 9825 4350 50  0001 C CNN "S1PL"
F 8 "73251-1150" H 9825 4350 50  0001 C CNN "S2PN"
F 9 "TTI" H 9825 4350 50  0001 C CNN "S2PL"
F 10 "SMA ST PCB-JCK" H 9825 4350 50  0001 C CNN "Description"
F 11 "1:$1.20; 10:$1.08; 100:$0.98" H 9825 4350 50  0001 C CNN "kicost:RF_Supplier:pricing"
F 12 "soip" H 9825 4350 50  0001 C CNN "variant"
	1    9825 4350
	1    0    0    -1  
$EndComp
$Comp
L project:SMA_2 J6
U 1 1 5D4B9B28
P 3775 4450
F 0 "J6" H 3878 4440 50  0000 L CNN
F 1 "RF In" H 4025 4650 50  0000 L CNN
F 2 "RF_SMA_Connectors:SMA_EDGE_4" H 550 300 50  0001 C CNN
F 3 "" H 375 400 60  0000 C CNN
F 4 "Molex" H 3775 4450 50  0001 C CNN "MFN"
F 5 "0732511150" H 3775 4450 50  0001 C CNN "MFP"
F 6 "S01-SJEDM-11BS05" H 3775 4450 50  0001 C CNN "S1PN"
F 7 "Superbat" H 3775 4450 50  0001 C CNN "S1PL"
F 8 "73251-1150" H 3775 4450 50  0001 C CNN "S2PN"
F 9 "TTI" H 3775 4450 50  0001 C CNN "S2PL"
F 10 "SMA ST PCB-JCK" H 3775 4450 50  0001 C CNN "Description"
F 11 "1:$1.20; 10:$1.08; 100:$0.98" H 3775 4450 50  0001 C CNN "kicost:RF_Supplier:pricing"
F 12 "soip" H 3775 4450 50  0001 C CNN "variant"
	1    3775 4450
	-1   0    0    -1  
$EndComp
$Comp
L project:SMA_2 J3
U 1 1 5D4CA9AA
P 9825 3825
F 0 "J3" H 9928 3815 50  0000 L CNN
F 1 "DNF" H 9928 3724 50  0000 L CNN
F 2 "MMCX_Connectors:mmcx_th" H 6600 -325 50  0001 C CNN
F 3 "" H 6425 -225 60  0000 C CNN
F 4 "Amphenol" H 9825 3825 50  0001 C CNN "MFN"
F 5 "901-143-6RFX" H 9825 3825 50  0001 C CNN "MFP"
F 6 "S01-RJPT4-11BS00" H 9825 3825 50  0001 C CNN "S1PN"
F 7 "Superbat" H 9825 3825 50  0001 C CNN "S1PL"
F 8 "901-143-6RFX" H 9825 3825 50  0001 C CNN "S2PN"
F 9 "TTI" H 9825 3825 50  0001 C CNN "S2PL"
F 10 "SMA Coaxial Connector R/A PCB RECEPTACLE" H 9825 3825 50  0001 C CNN "Description"
F 11 "soip" H 9825 3825 50  0001 C CNN "variant"
F 12 "1" H 9825 3825 50  0001 C CNN "DNP"
	1    9825 3825
	1    0    0    -1  
$EndComp
$Comp
L project:SMA_2 J4
U 1 1 5D4D0447
P 3775 3950
F 0 "J4" H 3878 3940 50  0000 L CNN
F 1 "DNF" H 3878 3849 50  0000 L CNN
F 2 "MMCX_Connectors:mmcx_th" H 550 -200 50  0001 C CNN
F 3 "" H 375 -100 60  0000 C CNN
F 4 "Amphenol" H 3775 3950 50  0001 C CNN "MFN"
F 5 "901-143-6RFX" H 3775 3950 50  0001 C CNN "MFP"
F 6 "S01-RJPT4-11BS00" H 3775 3950 50  0001 C CNN "S1PN"
F 7 "Superbat" H 3775 3950 50  0001 C CNN "S1PL"
F 8 "901-143-6RFX" H 3775 3950 50  0001 C CNN "S2PN"
F 9 "TTI" H 3775 3950 50  0001 C CNN "S2PL"
F 10 "SMA Coaxial Connector R/A PCB RECEPTACLE" H 3775 3950 50  0001 C CNN "Description"
F 11 "soip" H 3775 3950 50  0001 C CNN "variant"
F 12 "1" H 3775 3950 50  0001 C CNN "DNP"
	1    3775 3950
	-1   0    0    -1  
$EndComp
$Comp
L device:L_Small FB2
U 1 1 5D4D6413
P 7400 2750
F 0 "FB2" H 7450 2775 50  0000 L CNN
F 1 "220 ohm" H 7447 2705 50  0000 L CNN
F 2 "Inductor_SMD:L_0805_2012Metric" H -400 -25 60  0001 C CNN
F 3 "" H -400 -25 60  0000 C CNN
F 4 "Murata" H 7400 2750 60  0001 C CNN "MFN"
F 5 "BLM21PG221SN1D " H 7400 2750 60  0001 C CNN "MFP"
F 6 "490-1054-1-ND" H 7400 2750 60  0001 C CNN "S1PN"
F 7 "Digi-Key" H 7400 2750 60  0001 C CNN "S1PL"
F 8 "81-BLM21P221SG" H 7400 2750 60  0001 C CNN "S2PN"
F 9 "Mouser" H 7400 2750 60  0001 C CNN "S2PL"
F 10 "~" H 7400 2750 60  0001 C CNN "Characteristics"
F 11 "FERRITE BEAD 220 OHM" H 7400 2750 60  0001 C CNN "Description"
F 12 "0805" H 7400 2750 60  0001 C CNN "Package ID"
F 13 "~" H 7400 2750 60  0001 C CNN "Source"
F 14 "N" H 7400 2750 60  0001 C CNN "Critical"
F 15 "~" H 7400 2750 60  0001 C CNN "Notes"
F 16 "soip" H 7400 2750 50  0001 C CNN "variant"
	1    7400 2750
	1    0    0    -1  
$EndComp
$Comp
L graphics:Logo_Open_Hardware_Small #LOGO1
U 1 1 5D7BB9F0
P 1900 6100
F 0 "#LOGO1" H 1900 6375 50  0001 C CNN
F 1 "Logo_Open_Hardware_Small" H 1900 5875 50  0001 C CNN
F 2 "" H 1900 6100 50  0001 C CNN
F 3 "~" H 1900 6100 50  0001 C CNN
	1    1900 6100
	1    0    0    -1  
$EndComp
Text Notes 1550 5800 0    50   ~ 0
Open Source Hardware
$Comp
L device:R R25
U 1 1 5D89CE9F
P 4450 1650
F 0 "R25" V 4243 1650 50  0000 C CNN
F 1 "0 (opt)" V 4334 1650 50  0000 C CNN
F 2 "Resistor_SMD:R_1206_3216Metric" V -3220 -1350 30  0001 C CNN
F 3 "" H -3150 -1350 30  0000 C CNN
F 4 "Yageo" H 4450 1650 60  0001 C CNN "MFN"
F 5 "RC1206JR-070RL" H 4450 1650 60  0001 C CNN "MFP"
F 6 "603-RC1206JR-070RL" H 4450 1650 60  0001 C CNN "S1PN"
F 7 "Mouser" H 4450 1650 60  0001 C CNN "S1PL"
F 8 "311-0.0ERCT-ND" H 4450 1650 60  0001 C CNN "S2PN"
F 9 "Digi-Key" H 4450 1650 60  0001 C CNN "S2PL"
F 10 "~" H 4450 1650 60  0001 C CNN "Characteristics"
F 11 "RES SMD 0 OHM JUMPER 1/4W 1206" H 4450 1650 60  0001 C CNN "Description"
F 12 "1206 (3216 Metric)" H 4450 1650 60  0001 C CNN "Package ID"
F 13 "~" H 4450 1650 60  0001 C CNN "Source"
F 14 "N" H 4450 1650 60  0001 C CNN "Critical"
F 15 "~" H 4450 1650 60  0001 C CNN "Notes"
F 16 "soip, extreg" V 4450 1650 50  0001 C CNN "variant"
	1    4450 1650
	0    1    1    0   
$EndComp
$Comp
L connector:Conn_01x02_Male P4
U 1 1 5E9B58B1
P 2200 1750
F 0 "P4" H 2119 1475 50  0000 C CNN
F 1 "+5V" H 2119 1566 50  0000 C CNN
F 2 "Connector_PinHeader_2.54mm:PinHeader_1x02_P2.54mm_Vertical" H -6250 -100 60  0001 C CNN
F 3 "" H -6250 -100 60  0000 C CNN
F 4 "Nextron" H 2200 1750 50  0001 C CNN "MFN"
F 5 "Z-211-0211-0021-001" H 2200 1750 50  0001 C CNN "MFP"
F 6 "C152154" H 2200 1750 50  0001 C CNN "S1PN"
F 7 "LCSC" H 2200 1750 50  0001 C CNN "S1PL"
F 8 "Pin Header Male Pin 0.100\"(2.54mm) 2 pin" H 2200 1750 50  0001 C CNN "Description"
F 9 "Through Hole,P=2.54mm" H 2200 1750 50  0001 C CNN "Package ID"
F 10 "soip" H 2200 1750 50  0001 C CNN "variant"
F 11 "1:$0.025034; 20:$0.025034; 200:$0.01825" H 2200 1750 50  0001 C CNN "kicost:LCSC:pricing"
F 12 "https://lcsc.com/product-detail/Pin-Header-Female-Header_nextron-Nextronics-Engineering-Z-211-0211-0021-001_C152154.html" H 2200 1750 50  0001 C CNN "kicost:LCSC:link"
	1    2200 1750
	1    0    0    1   
$EndComp
$Comp
L device:D_Zener D?
U 1 1 5F1748C1
P 9150 4600
F 0 "D?" V 9104 4680 50  0000 L CNN
F 1 "D_Zener" V 9195 4680 50  0000 L CNN
F 2 "" H 9150 4600 50  0001 C CNN
F 3 "~" H 9150 4600 50  0001 C CNN
	1    9150 4600
	0    1    1    0   
$EndComp
$Comp
L power:GND #PWR?
U 1 1 5F1755CB
P 9150 4750
F 0 "#PWR?" H 9200 4800 50  0001 C CNN
F 1 "GND" H 9155 4577 50  0000 C CNN
F 2 "" H 1600 75  60  0000 C CNN
F 3 "" H 1600 75  60  0000 C CNN
	1    9150 4750
	1    0    0    -1  
$EndComp
Wire Wire Line
	9150 4450 9150 4350
Connection ~ 9150 4350
Wire Wire Line
	9150 4350 9325 4350
$EndSCHEMATC
