(module SL2 (layer F.Cu) (tedit 5BFB140F)
  (attr smd)
  (fp_text reference J17 (at -0.0635 -2.0193) (layer F.SilkS) hide
    (effects (font (size 1 1) (thickness 0.15)))
  )
  (fp_text value ~ (at 0 -5.65912) (layer F.Fab)
    (effects (font (size 1 1) (thickness 0.15)))
  )
  (pad 1 smd rect (at 0 0) (size 2.032 2.54) (layers F.Cu F.Paste F.Mask))
  (pad 2 smd rect (at 2.54 0) (size 2.032 2.54) (layers F.Cu F.Paste F.Mask)
    (zone_connect 2))
  (pad 2 smd rect (at -2.54 0) (size 2.032 2.54) (layers F.Cu F.Paste F.Mask))
)
