EESchema Schematic File Version 4
EELAYER 30 0
EELAYER END
$Descr A3 16535 11693
encoding utf-8
Sheet 1 1
Title "IF Amplifier"
Date "2021-04-18"
Rev "2.5"
Comp "Dyadic Pty Ltd"
Comment1 "2020"
Comment2 ""
Comment3 ""
Comment4 ""
$EndDescr
$Comp
L device:R R2
U 1 1 59FADE2A
P 7425 7450
F 0 "R2" H 7495 7496 50  0000 L CNN
F 1 "2.2k" H 7495 7405 50  0000 L CNN
F 2 "Resistor_SMD:R_0603_1608Metric" V -245 4450 30  0001 C CNN
F 3 "" H -175 4450 30  0000 C CNN
F 4 "Yageo" H 7425 7450 60  0001 C CNN "MFN"
F 5 "RC0603FR-072K2L" H 7425 7450 60  0001 C CNN "MFP"
F 6 "603-RC0603FR-072K2L" H 7425 7450 60  0001 C CNN "S1PN"
F 7 "Mouser" H 7425 7450 60  0001 C CNN "S1PL"
F 8 "311-2.20KHRCT-ND" H 7425 7450 60  0001 C CNN "S2PN"
F 9 "Digi-Key" H 7425 7450 60  0001 C CNN "S2PL"
F 10 "~" H 7425 7450 60  0001 C CNN "Characteristics"
F 11 "RES SMD 2.2K OHM 1% 1/10W 0603 " H 7425 7450 60  0001 C CNN "Description"
F 12 "0603 (1608 Metric)" H 7425 7450 60  0001 C CNN "Package ID"
F 13 "~" H 7425 7450 60  0001 C CNN "Source"
F 14 "N" H 7425 7450 60  0001 C CNN "Critical"
F 15 "~" H 7425 7450 60  0001 C CNN "Notes"
F 16 "sot" H 7425 7450 50  0001 C CNN "variant"
	1    7425 7450
	1    0    0    -1  
$EndComp
$Comp
L device:R R5
U 1 1 59FAE9AE
P 8025 8800
F 0 "R5" V 7818 8800 50  0000 C CNN
F 1 "15" V 7909 8800 50  0000 C CNN
F 2 "Resistor_SMD:R_0603_1608Metric" V 355 5800 30  0001 C CNN
F 3 "" H 425 5800 30  0000 C CNN
F 4 "Yageo" H 8025 8800 60  0001 C CNN "MFN"
F 5 "RC0603FR-0715RL" H 8025 8800 60  0001 C CNN "MFP"
F 6 "603-RC0603FR-0715RL" H 8025 8800 60  0001 C CNN "S1PN"
F 7 "Mouser" H 8025 8800 60  0001 C CNN "S1PL"
F 8 "311-15.0HRCT-ND" H 8025 8800 60  0001 C CNN "S2PN"
F 9 "Digi-Key" H 8025 8800 60  0001 C CNN "S2PL"
F 10 "~" H 8025 8800 60  0001 C CNN "Characteristics"
F 11 "RES SMD 15 OHM 1% 1/10W 0603 " H 8025 8800 60  0001 C CNN "Description"
F 12 "0603 (1608 Metric)" H 8025 8800 60  0001 C CNN "Package ID"
F 13 "~" H 8025 8800 60  0001 C CNN "Source"
F 14 "N" H 8025 8800 60  0001 C CNN "Critical"
F 15 "~" H 8025 8800 60  0001 C CNN "Notes"
F 16 "sot" V 8025 8800 50  0001 C CNN "variant"
	1    8025 8800
	0    1    1    0   
$EndComp
$Comp
L device:R R4
U 1 1 59FAEACD
P 7775 8400
F 0 "R4" H 7845 8446 50  0000 L CNN
F 1 "49.9" H 7845 8355 50  0000 L CNN
F 2 "Resistor_SMD:R_0603_1608Metric" V 105 5400 30  0001 C CNN
F 3 "" H 175 5400 30  0000 C CNN
F 4 "Yageo" H 7775 8400 60  0001 C CNN "MFN"
F 5 "RC0603FR-0749R9L" H 7775 8400 60  0001 C CNN "MFP"
F 6 "603-RC0603FR-0749R9L" H 7775 8400 60  0001 C CNN "S1PN"
F 7 "Mouser" H 7775 8400 60  0001 C CNN "S1PL"
F 8 "311-49.9HRCT-ND" H 7775 8400 60  0001 C CNN "S2PN"
F 9 "Digi-Key" H 7775 8400 60  0001 C CNN "S2PL"
F 10 "~" H 7775 8400 60  0001 C CNN "Characteristics"
F 11 "RES SMD 49.9 OHM 1% 1/10W 0603" H 7775 8400 60  0001 C CNN "Description"
F 12 "0603 (1608 Metric)" H 7775 8400 60  0001 C CNN "Package ID"
F 13 "~" H 7775 8400 60  0001 C CNN "Source"
F 14 "N" H 7775 8400 60  0001 C CNN "Critical"
F 15 "~" H 7775 8400 60  0001 C CNN "Notes"
F 16 "sot" H 7775 8400 50  0001 C CNN "variant"
	1    7775 8400
	1    0    0    -1  
$EndComp
$Comp
L device:R R7
U 1 1 59FAEB32
P 8725 8050
F 0 "R7" V 8518 8050 50  0000 C CNN
F 1 "1.8k" V 8609 8050 50  0000 C CNN
F 2 "Resistor_SMD:R_0603_1608Metric" V 1055 5050 30  0001 C CNN
F 3 "" H 1125 5050 30  0000 C CNN
F 4 "Yageo" H 8725 8050 60  0001 C CNN "MFN"
F 5 "RC0603FR-071K8L" H 8725 8050 60  0001 C CNN "MFP"
F 6 "603-RC0603FR-071K8L" H 8725 8050 60  0001 C CNN "S1PN"
F 7 "Mouser" H 8725 8050 60  0001 C CNN "S1PL"
F 8 "311-1.80KHRCT-ND" H 8725 8050 60  0001 C CNN "S2PN"
F 9 "Digi-Key" H 8725 8050 60  0001 C CNN "S2PL"
F 10 "~" H 8725 8050 60  0001 C CNN "Characteristics"
F 11 "RES SMD 1.8K OHM 1% 1/10W 0603 " H 8725 8050 60  0001 C CNN "Description"
F 12 "0603 (1608 Metric) " H 8725 8050 60  0001 C CNN "Package ID"
F 13 "~" H 8725 8050 60  0001 C CNN "Source"
F 14 "N" H 8725 8050 60  0001 C CNN "Critical"
F 15 "~" H 8725 8050 60  0001 C CNN "Notes"
F 16 "sot" V 8725 8050 50  0001 C CNN "variant"
	1    8725 8050
	0    1    1    0   
$EndComp
$Comp
L device:R R6
U 1 1 59FAEB8E
P 8425 9050
F 0 "R6" H 8495 9096 50  0000 L CNN
F 1 "39" H 8495 9005 50  0000 L CNN
F 2 "Resistor_SMD:R_0603_1608Metric" V 755 6050 30  0001 C CNN
F 3 "" H 825 6050 30  0000 C CNN
F 4 "Yageo" H 8425 9050 60  0001 C CNN "MFN"
F 5 "RC0603FR-0739RL" H 8425 9050 60  0001 C CNN "MFP"
F 6 "603-RC0603FR-0739RL" H 8425 9050 60  0001 C CNN "S1PN"
F 7 "Mouser" H 8425 9050 60  0001 C CNN "S1PL"
F 8 "311-39.0HRCT-ND" H 8425 9050 60  0001 C CNN "S2PN"
F 9 "Digi-Key" H 8425 9050 60  0001 C CNN "S2PL"
F 10 "~" H 8425 9050 60  0001 C CNN "Characteristics"
F 11 "RES SMD 39 OHM 1% 1/10W 0603 " H 8425 9050 60  0001 C CNN "Description"
F 12 "0603 (1608 Metric) " H 8425 9050 60  0001 C CNN "Package ID"
F 13 "~" H 8425 9050 60  0001 C CNN "Source"
F 14 "N" H 8425 9050 60  0001 C CNN "Critical"
F 15 "~" H 8425 9050 60  0001 C CNN "Notes"
F 16 "sot" H 8425 9050 50  0001 C CNN "variant"
	1    8425 9050
	1    0    0    -1  
$EndComp
$Comp
L device:R X3
U 1 1 59FAF7AB
P 6375 8800
F 0 "X3" V 6250 8800 50  0000 C CNN
F 1 "0" V 6375 8800 50  0000 C CNN
F 2 "Capacitor_SMD:C_0603_1608Metric" V -1295 5800 30  0001 C CNN
F 3 "" H -1225 5800 30  0000 C CNN
F 4 "Yageo" H 11075 8700 50  0001 C CNN "MFN"
F 5 "RC0603JR-070RL" H 11075 8700 50  0001 C CNN "MFP"
F 6 "603-RC0603JR-070RL" H 11075 8700 50  0001 C CNN "S1PN"
F 7 "Mouser" H 11075 8700 50  0001 C CNN "S1PL"
F 8 "311-0.0GRCT-ND" H 11075 8700 50  0001 C CNN "S2PN"
F 9 "Digi-Key" H 11075 8700 50  0001 C CNN "S2PL"
F 10 "0 Ohms Jumper 0.1W, 1/10W, 0603" H 11075 8700 50  0001 C CNN "Description"
F 11 "0603 (1608 Metric)" H 11075 8700 50  0001 C CNN "Package ID"
F 12 "~" H 6375 8800 60  0001 C CNN "Source"
F 13 "N" H 6375 8800 60  0001 C CNN "Critical"
F 14 "~" H 6375 8800 60  0001 C CNN "Notes"
F 15 "sot" V 6375 8800 50  0001 C CNN "variant"
	1    6375 8800
	0    1    1    0   
$EndComp
$Comp
L device:R X4
U 1 1 59FAF807
P 6675 9050
F 0 "X4" H 6745 9096 50  0000 L CNN
F 1 "DNF" H 6745 9005 50  0000 L CNN
F 2 "Capacitor_SMD:C_0603_1608Metric" V -995 6050 30  0001 C CNN
F 3 "" H -925 6050 30  0000 C CNN
F 4 "~" H 6675 9050 60  0001 C CNN "MFN"
F 5 "~" H 6675 9050 60  0001 C CNN "MFP"
F 6 "~" H 6675 9050 60  0001 C CNN "S1PN"
F 7 "~" H 6675 9050 60  0001 C CNN "S1PL"
F 8 "~" H 6675 9050 60  0001 C CNN "S2PN"
F 9 "~" H 6675 9050 60  0001 C CNN "S2PL"
F 10 "~" H 6675 9050 60  0001 C CNN "Characteristics"
F 11 "~" H 6675 9050 60  0001 C CNN "Description"
F 12 "~" H 6675 9050 60  0001 C CNN "Package ID"
F 13 "~" H 6675 9050 60  0001 C CNN "Source"
F 14 "N" H 6675 9050 60  0001 C CNN "Critical"
F 15 "~" H 6675 9050 60  0001 C CNN "Notes"
F 16 "1" H 6675 9050 50  0001 C CNN "DNP"
F 17 "sot" H 6675 9050 50  0001 C CNN "variant"
	1    6675 9050
	1    0    0    -1  
$EndComp
$Comp
L device:R X1
U 1 1 59FAF880
P 6075 9050
F 0 "X1" H 6145 9096 50  0000 L CNN
F 1 "DNF" H 6145 9005 50  0000 L CNN
F 2 "Capacitor_SMD:C_0603_1608Metric" V -1595 6050 30  0001 C CNN
F 3 "" H -1525 6050 30  0000 C CNN
F 4 "~" H 6075 9050 60  0001 C CNN "MFN"
F 5 "~" H 6075 9050 60  0001 C CNN "MFP"
F 6 "~" H 6075 9050 60  0001 C CNN "S1PN"
F 7 "~" H 6075 9050 60  0001 C CNN "S1PL"
F 8 "~" H 6075 9050 60  0001 C CNN "S2PN"
F 9 "~" H 6075 9050 60  0001 C CNN "S2PL"
F 10 "~" H 6075 9050 60  0001 C CNN "Characteristics"
F 11 "~" H 6075 9050 60  0001 C CNN "Description"
F 12 "~" H 6075 9050 60  0001 C CNN "Package ID"
F 13 "~" H 6075 9050 60  0001 C CNN "Source"
F 14 "N" H 6075 9050 60  0001 C CNN "Critical"
F 15 "~" H 6075 9050 60  0001 C CNN "Notes"
F 16 "sot" H 6075 9050 50  0001 C CNN "variant"
F 17 "1" H 6075 9050 50  0001 C CNN "DNP"
	1    6075 9050
	1    0    0    -1  
$EndComp
$Comp
L device:R X2
U 1 1 59FAF8DE
P 6075 9450
F 0 "X2" H 6145 9496 50  0000 L CNN
F 1 "DNF" H 6145 9405 50  0000 L CNN
F 2 "Capacitor_SMD:C_0603_1608Metric" V -1595 6450 30  0001 C CNN
F 3 "" H -1525 6450 30  0000 C CNN
F 4 "~" H 6075 9450 60  0001 C CNN "MFN"
F 5 "~" H 6075 9450 60  0001 C CNN "MFP"
F 6 "~" H 6075 9450 60  0001 C CNN "S1PN"
F 7 "~" H 6075 9450 60  0001 C CNN "S1PL"
F 8 "~" H 6075 9450 60  0001 C CNN "S2PN"
F 9 "~" H 6075 9450 60  0001 C CNN "S2PL"
F 10 "~" H 6075 9450 60  0001 C CNN "Characteristics"
F 11 "~" H 6075 9450 60  0001 C CNN "Description"
F 12 "~" H 6075 9450 60  0001 C CNN "Package ID"
F 13 "~" H 6075 9450 60  0001 C CNN "Source"
F 14 "N" H 6075 9450 60  0001 C CNN "Critical"
F 15 "~" H 6075 9450 60  0001 C CNN "Notes"
F 16 "sot" H 6075 9450 50  0001 C CNN "variant"
F 17 "1" H 6075 9450 50  0001 C CNN "DNP"
	1    6075 9450
	1    0    0    -1  
$EndComp
$Comp
L project:SMA_2 J1
U 1 1 59FAFD47
P 5550 8800
F 0 "J1" H 5653 8790 50  0000 L CNN
F 1 "RF In" H 5800 9000 50  0000 L CNN
F 2 "RF_SMA_Connectors:SMA_EDGE_4" H 2325 4650 50  0001 C CNN
F 3 "" H 2150 4750 60  0000 C CNN
F 4 "Molex" H 5550 8800 50  0001 C CNN "MFN"
F 5 "0732511150" H 5550 8800 50  0001 C CNN "MFP"
F 6 "S01-SJEDM-11BS05" H 5550 8800 50  0001 C CNN "S1PN"
F 7 "Superbat" H 5550 8800 50  0001 C CNN "S1PL"
F 8 "73251-1150" H 5550 8800 50  0001 C CNN "S2PN"
F 9 "TTI" H 5550 8800 50  0001 C CNN "S2PL"
F 10 "SMA ST PCB-JCK" H 5550 8800 50  0001 C CNN "Description"
F 11 "1:$1.20; 10:$1.08; 100:$0.98" H 5550 8800 50  0001 C CNN "kicost:RF_Supplier:pricing"
	1    5550 8800
	-1   0    0    -1  
$EndComp
$Comp
L power:GND #PWR01
U 1 1 59FB05A2
P 9175 9050
F 0 "#PWR01" H 9225 9100 50  0001 C CNN
F 1 "GND" H 9180 8877 50  0000 C CNN
F 2 "" H 1625 4375 60  0000 C CNN
F 3 "" H 1625 4375 60  0000 C CNN
	1    9175 9050
	1    0    0    -1  
$EndComp
$Comp
L power:GND #PWR02
U 1 1 59FB0602
P 8425 9600
F 0 "#PWR02" H 8475 9650 50  0001 C CNN
F 1 "GND" H 8430 9427 50  0000 C CNN
F 2 "" H 875 4925 60  0000 C CNN
F 3 "" H 875 4925 60  0000 C CNN
	1    8425 9600
	1    0    0    -1  
$EndComp
$Comp
L power:GND #PWR03
U 1 1 59FB0F99
P 9425 7700
F 0 "#PWR03" H 9475 7750 50  0001 C CNN
F 1 "GND" H 9430 7527 50  0000 C CNN
F 2 "" H 1875 3025 60  0000 C CNN
F 3 "" H 1875 3025 60  0000 C CNN
	1    9425 7700
	1    0    0    -1  
$EndComp
$Comp
L power:GND #PWR04
U 1 1 59FB16E7
P 7425 8100
F 0 "#PWR04" H 7475 8150 50  0001 C CNN
F 1 "GND" H 7430 7927 50  0000 C CNN
F 2 "" H -125 3425 60  0000 C CNN
F 3 "" H -125 3425 60  0000 C CNN
	1    7425 8100
	1    0    0    -1  
$EndComp
$Comp
L power:GND #PWR05
U 1 1 59FB1740
P 7075 8100
F 0 "#PWR05" H 7125 8150 50  0001 C CNN
F 1 "GND" H 7080 7927 50  0000 C CNN
F 2 "" H -475 3425 60  0000 C CNN
F 3 "" H -475 3425 60  0000 C CNN
	1    7075 8100
	1    0    0    -1  
$EndComp
$Comp
L power:GND #PWR06
U 1 1 59FB2017
P 6675 9200
F 0 "#PWR06" H 6725 9250 50  0001 C CNN
F 1 "GND" H 6680 9027 50  0000 C CNN
F 2 "" H -875 4525 60  0000 C CNN
F 3 "" H -875 4525 60  0000 C CNN
	1    6675 9200
	1    0    0    -1  
$EndComp
$Comp
L power:GND #PWR07
U 1 1 59FB2070
P 6075 9600
F 0 "#PWR07" H 6125 9650 50  0001 C CNN
F 1 "GND" H 6080 9427 50  0000 C CNN
F 2 "" H -1475 4925 60  0000 C CNN
F 3 "" H -1475 4925 60  0000 C CNN
	1    6075 9600
	1    0    0    -1  
$EndComp
$Comp
L power:GND #PWR08
U 1 1 59FB2260
P 5550 8975
F 0 "#PWR08" H 5600 9025 50  0001 C CNN
F 1 "GND" H 5555 8802 50  0000 C CNN
F 2 "" H -2000 4300 60  0000 C CNN
F 3 "" H -2000 4300 60  0000 C CNN
	1    5550 8975
	1    0    0    -1  
$EndComp
$Comp
L power:GND #PWR09
U 1 1 59FB30D1
P 11400 8875
F 0 "#PWR09" H 11450 8925 50  0001 C CNN
F 1 "GND" H 11405 8702 50  0000 C CNN
F 2 "" H 3850 4200 60  0000 C CNN
F 3 "" H 3850 4200 60  0000 C CNN
	1    11400 8875
	1    0    0    -1  
$EndComp
$Comp
L device:C C1
U 1 1 59FD7A8F
P 6025 6250
F 0 "C1" H 6140 6296 50  0000 L CNN
F 1 "0.01u" H 6140 6205 50  0000 L CNN
F 2 "Capacitor_SMD:C_0603_1608Metric" H -1112 3575 30  0001 C CNN
F 3 "" H -1150 3725 60  0000 C CNN
F 4 "Kemet" H 6025 6250 60  0001 C CNN "MFN"
F 5 "C0603C103K5RACTU" H 6025 6250 60  0001 C CNN "MFP"
F 6 "399-1091-1-ND" H 6025 6250 60  0001 C CNN "S1PN"
F 7 "Digi-Key" H 6025 6250 60  0001 C CNN "S1PL"
F 8 "80-C0603C103K5R" H 6025 6250 60  0001 C CNN "S2PN"
F 9 "Mouser" H 6025 6250 60  0001 C CNN "S2PL"
F 10 "~" H 6025 6250 60  0001 C CNN "Characteristics"
F 11 "Multilayer Ceramic Capacitors MLCC - SMD/SMT 50V 0.01uF 0603 X7R 10%" H 6025 6250 60  0001 C CNN "Description"
F 12 "0603 (1608 metric)" H 6025 6250 60  0001 C CNN "Package ID"
F 13 "~" H 6025 6250 60  0001 C CNN "Source"
F 14 "N" H 6025 6250 60  0001 C CNN "Critical"
F 15 "~" H 6025 6250 60  0001 C CNN "Notes"
F 16 "sot" H 6025 6250 50  0001 C CNN "variant"
	1    6025 6250
	1    0    0    -1  
$EndComp
$Comp
L device:C C2
U 1 1 59FD7B0C
P 6625 6250
F 0 "C2" H 6740 6296 50  0000 L CNN
F 1 "0.1u" H 6740 6205 50  0000 L CNN
F 2 "Capacitor_SMD:C_0603_1608Metric" H -512 3575 30  0001 C CNN
F 3 "" H -550 3725 60  0000 C CNN
F 4 "Kemet" H 6625 6250 60  0001 C CNN "MFN"
F 5 "C0603C104J4RACTU" H 6625 6250 60  0001 C CNN "MFP"
F 6 "399-1097-1-ND" H 6625 6250 60  0001 C CNN "S1PN"
F 7 "Digi-Key" H 6625 6250 60  0001 C CNN "S1PL"
F 8 "80-C0603C104J4R" H 6625 6250 60  0001 C CNN "S2PN"
F 9 "Mouser" H 6625 6250 60  0001 C CNN "S2PL"
F 10 "~" H 6625 6250 60  0001 C CNN "Characteristics"
F 11 "CAP CER 0.1UF 16V X7R 0603" H 6625 6250 60  0001 C CNN "Description"
F 12 "0603 (1608 Metric)" H 6625 6250 60  0001 C CNN "Package ID"
F 13 "~" H 6625 6250 60  0001 C CNN "Source"
F 14 "N" H 6625 6250 60  0001 C CNN "Critical"
F 15 "~" H 6625 6250 60  0001 C CNN "Notes"
F 16 "sot" H 6625 6250 50  0001 C CNN "variant"
	1    6625 6250
	1    0    0    -1  
$EndComp
$Comp
L connector:Conn_01x02_Male P1
U 1 1 59FD7C03
P 5325 6100
F 0 "P1" H 5244 5825 50  0000 C CNN
F 1 "+10V" H 5244 5916 50  0000 C CNN
F 2 "Connector_PinHeader_2.54mm:PinHeader_1x02_P2.54mm_Vertical" H -3125 4250 60  0001 C CNN
F 3 "" H -3125 4250 60  0000 C CNN
F 4 "Nextron" H 5325 6100 50  0001 C CNN "MFN"
F 5 "Z-211-0211-0021-001" H 5325 6100 50  0001 C CNN "MFP"
F 6 "C152154" H 5325 6100 50  0001 C CNN "S1PN"
F 7 "LCSC" H 5325 6100 50  0001 C CNN "S1PL"
F 8 "Pin Header Male Pin 0.100\"(2.54mm) 2 pin" H 5325 6100 50  0001 C CNN "Description"
F 9 "Through Hole,P=2.54mm" H 5325 6100 50  0001 C CNN "Package ID"
F 10 "sot" H 5325 6100 50  0001 C CNN "variant"
F 11 "1:$0.025034; 20:$0.025034; 200:$0.01825" H 5325 6100 50  0001 C CNN "kicost:LCSC:pricing"
F 12 "https://lcsc.com/product-detail/Pin-Header-Female-Header_nextron-Nextronics-Engineering-Z-211-0211-0021-001_C152154.html" H 5325 6100 50  0001 C CNN "kicost:LCSC:link"
	1    5325 6100
	1    0    0    1   
$EndComp
$Comp
L device:R R1
U 1 1 59FD80DB
P 6325 6000
F 0 "R1" V 6118 6000 50  0000 C CNN
F 1 "10" V 6209 6000 50  0000 C CNN
F 2 "Resistor_SMD:R_0603_1608Metric" V -1345 3000 30  0001 C CNN
F 3 "" H -1275 3000 30  0000 C CNN
F 4 "Yageo" H 6325 6000 60  0001 C CNN "MFN"
F 5 "RC0603FR-0710RL" H 6325 6000 60  0001 C CNN "MFP"
F 6 "603-RC0603FR-0710RL" H 6325 6000 60  0001 C CNN "S1PN"
F 7 "Mouser" H 6325 6000 60  0001 C CNN "S1PL"
F 8 "311-10.0HRCT-ND" H 6325 6000 60  0001 C CNN "S2PN"
F 9 "Digi-Key" H 6325 6000 60  0001 C CNN "S2PL"
F 10 "~" H 6325 6000 60  0001 C CNN "Characteristics"
F 11 "RES SMD 10 OHM 1% 1/10W 0603" H 6325 6000 60  0001 C CNN "Description"
F 12 "0603 (1608 Metric)" H 6325 6000 60  0001 C CNN "Package ID"
F 13 "~" H 6325 6000 60  0001 C CNN "Source"
F 14 "N" H 6325 6000 60  0001 C CNN "Critical"
F 15 "~" H 6325 6000 60  0001 C CNN "Notes"
F 16 "sot" V 6325 6000 50  0001 C CNN "variant"
	1    6325 6000
	0    1    1    0   
$EndComp
$Comp
L device:C C3
U 1 1 59FD8525
P 7025 6250
F 0 "C3" H 7140 6296 50  0000 L CNN
F 1 "10u" H 7140 6205 50  0000 L CNN
F 2 "Capacitor_SMD:C_0805_2012Metric" H -112 3575 30  0001 C CNN
F 3 "" H -150 3725 60  0000 C CNN
F 4 "Murata" H 7025 6250 60  0001 C CNN "MFN"
F 5 "GRM21BR61C106KE15L" H 7025 6250 60  0001 C CNN "MFP"
F 6 "81-GRM21BR61C106KE15" H 7025 6250 60  0001 C CNN "S1PN"
F 7 "Mouser" H 7025 6250 60  0001 C CNN "S1PL"
F 8 "490-3886-1-ND" H 7025 6250 60  0001 C CNN "S2PN"
F 9 "Digi-Key" H 7025 6250 60  0001 C CNN "S2PL"
F 10 "~" H 7025 6250 60  0001 C CNN "Characteristics"
F 11 "CAP CER 10UF 16V X5R 0805 " H 7025 6250 60  0001 C CNN "Description"
F 12 "0805 (2012 Metric) " H 7025 6250 60  0001 C CNN "Package ID"
F 13 "~" H 7025 6250 60  0001 C CNN "Source"
F 14 "N" H 7025 6250 60  0001 C CNN "Critical"
F 15 "~" H 7025 6250 60  0001 C CNN "Notes"
F 16 "sot" H 7025 6250 50  0001 C CNN "variant"
	1    7025 6250
	1    0    0    -1  
$EndComp
Wire Wire Line
	8425 8050 8425 8600
Wire Wire Line
	8425 8050 8575 8050
Wire Wire Line
	8875 8600 8425 8600
Connection ~ 8425 8600
Wire Wire Line
	9675 8700 9825 8700
Wire Wire Line
	8875 8050 9825 8050
Wire Wire Line
	9825 8050 9825 8700
Connection ~ 9825 8700
Wire Wire Line
	8425 9200 8425 9300
Wire Wire Line
	8875 8800 8175 8800
Wire Wire Line
	7675 8800 7775 8800
Wire Wire Line
	9175 7300 9425 7300
Wire Wire Line
	9425 7300 9425 7400
Connection ~ 9175 7300
Wire Wire Line
	7775 8550 7775 8800
Connection ~ 7775 8800
Wire Wire Line
	7425 7600 7425 7700
Wire Wire Line
	7775 7700 7775 8250
Wire Wire Line
	7075 7700 7425 7700
Connection ~ 7425 7700
Wire Wire Line
	7075 7800 7075 7700
Wire Wire Line
	7425 7300 7425 6900
Wire Wire Line
	7425 6900 8325 6900
Wire Wire Line
	7375 8800 7125 8800
Wire Wire Line
	6525 8800 6675 8800
Wire Wire Line
	6675 8900 6675 8800
Connection ~ 6675 8800
Wire Wire Line
	6075 9300 6075 9200
Wire Wire Line
	6075 8900 6075 8800
Wire Wire Line
	10325 8700 10525 8700
Wire Wire Line
	9275 8350 9275 8250
Wire Wire Line
	9275 8250 9175 8250
Connection ~ 9175 8250
Wire Wire Line
	5525 6000 6025 6000
Wire Wire Line
	6475 6000 6625 6000
Wire Wire Line
	7025 6100 7025 6000
Connection ~ 7025 6000
Wire Wire Line
	6625 6100 6625 6000
Connection ~ 6625 6000
Wire Wire Line
	6025 6100 6025 6000
Connection ~ 6025 6000
$Comp
L power:GND #PWR010
U 1 1 59FD9165
P 5625 6400
F 0 "#PWR010" H 5675 6450 50  0001 C CNN
F 1 "GND" H 5630 6227 50  0000 C CNN
F 2 "" H -1925 1725 60  0000 C CNN
F 3 "" H -1925 1725 60  0000 C CNN
	1    5625 6400
	1    0    0    -1  
$EndComp
$Comp
L power:GND #PWR011
U 1 1 59FD92DB
P 6025 6400
F 0 "#PWR011" H 6075 6450 50  0001 C CNN
F 1 "GND" H 6030 6227 50  0000 C CNN
F 2 "" H -1525 1725 60  0000 C CNN
F 3 "" H -1525 1725 60  0000 C CNN
	1    6025 6400
	1    0    0    -1  
$EndComp
$Comp
L power:GND #PWR012
U 1 1 59FD9349
P 6625 6400
F 0 "#PWR012" H 6675 6450 50  0001 C CNN
F 1 "GND" H 6630 6227 50  0000 C CNN
F 2 "" H -925 1725 60  0000 C CNN
F 3 "" H -925 1725 60  0000 C CNN
	1    6625 6400
	1    0    0    -1  
$EndComp
$Comp
L power:GND #PWR013
U 1 1 59FD93B7
P 7025 6400
F 0 "#PWR013" H 7075 6450 50  0001 C CNN
F 1 "GND" H 7030 6227 50  0000 C CNN
F 2 "" H -525 1725 60  0000 C CNN
F 3 "" H -525 1725 60  0000 C CNN
	1    7025 6400
	1    0    0    -1  
$EndComp
Wire Wire Line
	5525 6100 5625 6100
Wire Wire Line
	5625 6100 5625 6300
Wire Wire Line
	8325 6000 8325 6900
Connection ~ 8325 6900
$Comp
L power:PWR_FLAG #FLG017
U 1 1 59FDA40F
P 5625 6300
F 0 "#FLG017" H 3625 3220 50  0001 C CNN
F 1 "PWR_FLAG" V 5625 6478 50  0000 L CNN
F 2 "" H 3625 3125 60  0000 C CNN
F 3 "" H 3625 3125 60  0000 C CNN
	1    5625 6300
	0    -1   -1   0   
$EndComp
Connection ~ 5625 6300
$Comp
L device:L_Small FB1
U 1 1 59FDA9D3
P 9175 7100
F 0 "FB1" H 9225 7125 50  0000 L CNN
F 1 "220 ohm" H 9222 7055 50  0000 L CNN
F 2 "Inductor_SMD:L_0805_2012Metric" H 1375 4325 60  0001 C CNN
F 3 "" H 1375 4325 60  0000 C CNN
F 4 "Murata" H 9175 7100 60  0001 C CNN "MFN"
F 5 "BLM21PG221SN1D " H 9175 7100 60  0001 C CNN "MFP"
F 6 "490-1054-1-ND" H 9175 7100 60  0001 C CNN "S1PN"
F 7 "Digi-Key" H 9175 7100 60  0001 C CNN "S1PL"
F 8 "81-BLM21P221SG" H 9175 7100 60  0001 C CNN "S2PN"
F 9 "Mouser" H 9175 7100 60  0001 C CNN "S2PL"
F 10 "~" H 9175 7100 60  0001 C CNN "Characteristics"
F 11 "FERRITE BEAD 220 OHM" H 9175 7100 60  0001 C CNN "Description"
F 12 "0805" H 9175 7100 60  0001 C CNN "Package ID"
F 13 "~" H 9175 7100 60  0001 C CNN "Source"
F 14 "N" H 9175 7100 60  0001 C CNN "Critical"
F 15 "~" H 9175 7100 60  0001 C CNN "Notes"
F 16 "sot" H 9175 7100 50  0001 C CNN "variant"
	1    9175 7100
	1    0    0    -1  
$EndComp
Wire Wire Line
	9175 6900 9175 7000
Wire Wire Line
	9175 7200 9175 7300
Wire Wire Line
	8425 8600 8425 8900
Wire Wire Line
	9825 8700 10025 8700
Wire Wire Line
	9175 7300 9175 8250
Wire Wire Line
	7775 8800 7875 8800
Wire Wire Line
	7425 7700 7425 7800
Wire Wire Line
	7425 7700 7775 7700
Wire Wire Line
	6675 8800 6825 8800
Wire Wire Line
	6075 8800 6225 8800
Wire Wire Line
	9175 8250 9175 8350
Wire Wire Line
	6625 6000 7025 6000
Wire Wire Line
	6025 6000 6175 6000
Wire Wire Line
	8325 6900 9175 6900
Wire Wire Line
	5625 6300 5625 6400
$Comp
L project:SMA_2 J12
U 1 1 5C7FD351
P 5550 8300
F 0 "J12" H 5653 8290 50  0000 L CNN
F 1 "DNF" H 5653 8199 50  0000 L CNN
F 2 "MMCX_Connectors:mmcx_th" H 2325 4150 50  0001 C CNN
F 3 "" H 2150 4250 60  0000 C CNN
F 4 "Amphenol" H 5550 8300 50  0001 C CNN "MFN"
F 5 "901-143-6RFX" H 5550 8300 50  0001 C CNN "MFP"
F 6 "S01-RJPT4-11BS00" H 5550 8300 50  0001 C CNN "S1PN"
F 7 "Superbat" H 5550 8300 50  0001 C CNN "S1PL"
F 8 "901-143-6RFX" H 5550 8300 50  0001 C CNN "S2PN"
F 9 "TTI" H 5550 8300 50  0001 C CNN "S2PL"
F 10 "SMA Coaxial Connector R/A PCB RECEPTACLE" H 5550 8300 50  0001 C CNN "Description"
F 11 "sot" H 5550 8300 50  0001 C CNN "variant"
F 12 "1" H 5550 8300 50  0001 C CNN "DNP"
	1    5550 8300
	-1   0    0    -1  
$EndComp
$Comp
L power:GND #PWR018
U 1 1 5C7FD64F
P 5550 8475
F 0 "#PWR018" H 5600 8525 50  0001 C CNN
F 1 "GND" H 5555 8302 50  0000 C CNN
F 2 "" H -2000 3800 60  0000 C CNN
F 3 "" H -2000 3800 60  0000 C CNN
	1    5550 8475
	1    0    0    -1  
$EndComp
$Comp
L device:R_Small R10
U 1 1 5C7FF6B0
P 5850 8300
F 0 "R10" V 5750 8300 50  0000 C CNN
F 1 "DNF" V 5950 8300 50  0000 C CNN
F 2 "Resistor_SMD:R_0402_1005Metric" H 5850 8300 50  0001 C CNN
F 3 "~" H 5850 8300 50  0001 C CNN
F 4 "Yageo" H 5850 8300 50  0001 C CNN "MFN"
F 5 "RC0402JR-070RL" H 5850 8300 50  0001 C CNN "MFP"
F 6 "603-RC0402JR-070RL" H 5850 8300 50  0001 C CNN "S1PN"
F 7 "Mouser" H 5850 8300 50  0001 C CNN "S1PL"
F 8 "311-0.0JRCT-ND" H 5850 8300 50  0001 C CNN "S2PN"
F 9 "Digi-Key" H 5850 8300 50  0001 C CNN "S2PL"
F 10 "RES SMD 0 OHM JUMPER 1/16W 0402" H 5850 8300 50  0001 C CNN "Description"
F 11 "0402 (1005 Metric)" H 5850 8300 50  0001 C CNN "Package ID"
F 12 "sot" V 5850 8300 50  0001 C CNN "variant"
F 13 "1" V 5850 8300 50  0001 C CNN "DNP"
	1    5850 8300
	0    1    1    0   
$EndComp
Wire Wire Line
	5675 8800 5750 8800
Wire Wire Line
	5950 8800 6075 8800
Connection ~ 6075 8800
Wire Wire Line
	6075 8800 6075 8300
Wire Wire Line
	6075 8300 5950 8300
Wire Wire Line
	5750 8300 5675 8300
$Comp
L power:GND #PWR017
U 1 1 5C805350
P 11400 8350
F 0 "#PWR017" H 11450 8400 50  0001 C CNN
F 1 "GND" H 11405 8177 50  0000 C CNN
F 2 "" H 3850 3675 60  0000 C CNN
F 3 "" H 3850 3675 60  0000 C CNN
	1    11400 8350
	1    0    0    -1  
$EndComp
Wire Wire Line
	10825 8700 10900 8700
Wire Wire Line
	10900 8700 10900 8175
Wire Wire Line
	10900 8175 10975 8175
Connection ~ 10900 8700
Wire Wire Line
	10900 8700 10975 8700
Wire Wire Line
	11175 8175 11275 8175
Wire Wire Line
	11175 8700 11275 8700
$Comp
L project:rfi_shield_clip P2
U 1 1 5C813E6C
P 9950 6075
F 0 "P2" H 10078 6094 60  0000 L CNN
F 1 "~" H 10078 6041 60  0000 L CNN
F 2 "RF_Shielding:S1721-46R" H 9950 6075 60  0001 C CNN
F 3 "" H 9950 6075 60  0000 C CNN
F 4 "Harwin Inc." H 9950 6075 50  0001 C CNN "MFN"
F 5 "S1721-46R" H 9950 6075 50  0001 C CNN "MFP"
F 6 "952-1476-1-ND" H 9950 6075 50  0001 C CNN "S1PN"
F 7 "Digi-Key" H 9950 6075 50  0001 C CNN "S1PL"
F 8 "855-S1721-46R" H 9950 6075 50  0001 C CNN "S2PN"
F 9 "Mouser" H 9950 6075 50  0001 C CNN "S2PL"
F 10 "RFI SHIELD CLIP MINI TIN SMD" H 9950 6075 50  0001 C CNN "Description"
	1    9950 6075
	1    0    0    -1  
$EndComp
$Comp
L power:GND #PWR019
U 1 1 5C813F67
P 9950 6175
F 0 "#PWR019" H 10000 6225 50  0001 C CNN
F 1 "GND" H 9955 6002 50  0000 C CNN
F 2 "" H 2400 1500 60  0000 C CNN
F 3 "" H 2400 1500 60  0000 C CNN
	1    9950 6175
	1    0    0    -1  
$EndComp
$Comp
L power:GND #PWR020
U 1 1 5C81448A
P 10425 6175
F 0 "#PWR020" H 10475 6225 50  0001 C CNN
F 1 "GND" H 10430 6002 50  0000 C CNN
F 2 "" H 2875 1500 60  0000 C CNN
F 3 "" H 2875 1500 60  0000 C CNN
	1    10425 6175
	1    0    0    -1  
$EndComp
$Comp
L device:R_Small R12
U 1 1 5CF60B24
P 5850 8800
F 0 "R12" V 5750 8800 50  0000 C CNN
F 1 "0" V 5950 8800 50  0000 C CNN
F 2 "Resistor_SMD:R_0402_1005Metric" H 5850 8800 50  0001 C CNN
F 3 "~" H 5850 8800 50  0001 C CNN
F 4 "Yageo" H 5850 8800 50  0001 C CNN "MFN"
F 5 "RC0402JR-070RL" H 5850 8800 50  0001 C CNN "MFP"
F 6 "603-RC0402JR-070RL" H 5850 8800 50  0001 C CNN "S1PN"
F 7 "Mouser" H 5850 8800 50  0001 C CNN "S1PL"
F 8 "311-0.0JRCT-ND" H 5850 8800 50  0001 C CNN "S2PN"
F 9 "Digi-Key" H 5850 8800 50  0001 C CNN "S2PL"
F 10 "RES SMD 0 OHM JUMPER 1/16W 0402" H 5850 8800 50  0001 C CNN "Description"
F 11 "0402 (1005 Metric)" H 5850 8800 50  0001 C CNN "Package ID"
F 12 "sot" V 5850 8800 50  0001 C CNN "variant"
	1    5850 8800
	0    1    1    0   
$EndComp
$Comp
L device:R_Small R9
U 1 1 5CF62415
P 11075 8175
F 0 "R9" V 10975 8175 50  0000 C CNN
F 1 "DNF" V 11175 8175 50  0000 C CNN
F 2 "Resistor_SMD:R_0402_1005Metric" H 11075 8175 50  0001 C CNN
F 3 "~" H 11075 8175 50  0001 C CNN
F 4 "Yageo" H 11075 8175 50  0001 C CNN "MFN"
F 5 "RC0402JR-070RL" H 11075 8175 50  0001 C CNN "MFP"
F 6 "603-RC0402JR-070RL" H 11075 8175 50  0001 C CNN "S1PN"
F 7 "Mouser" H 11075 8175 50  0001 C CNN "S1PL"
F 8 "311-0.0JRCT-ND" H 11075 8175 50  0001 C CNN "S2PN"
F 9 "Digi-Key" H 11075 8175 50  0001 C CNN "S2PL"
F 10 "RES SMD 0 OHM JUMPER 1/16W 0402" H 11075 8175 50  0001 C CNN "Description"
F 11 "0402 (1005 Metric)" H 11075 8175 50  0001 C CNN "Package ID"
F 12 "1" V 11075 8175 50  0001 C CNN "DNP"
F 13 "sot" V 11075 8175 50  0001 C CNN "variant"
	1    11075 8175
	0    1    1    0   
$EndComp
$Comp
L device:R_Small R11
U 1 1 5CF639D1
P 11075 8700
F 0 "R11" V 10975 8700 50  0000 C CNN
F 1 "0" V 11175 8700 50  0000 C CNN
F 2 "Resistor_SMD:R_0402_1005Metric" H 11075 8700 50  0001 C CNN
F 3 "~" H 11075 8700 50  0001 C CNN
F 4 "Yageo" H 11075 8700 50  0001 C CNN "MFN"
F 5 "RC0402JR-070RL" H 11075 8700 50  0001 C CNN "MFP"
F 6 "603-RC0402JR-070RL" H 11075 8700 50  0001 C CNN "S1PN"
F 7 "Mouser" H 11075 8700 50  0001 C CNN "S1PL"
F 8 "311-0.0JRCT-ND" H 11075 8700 50  0001 C CNN "S2PN"
F 9 "Digi-Key" H 11075 8700 50  0001 C CNN "S2PL"
F 10 "RES SMD 0 OHM JUMPER 1/16W 0402" H 11075 8700 50  0001 C CNN "Description"
F 11 "0402 (1005 Metric)" H 11075 8700 50  0001 C CNN "Package ID"
F 12 "sot" V 11075 8700 50  0001 C CNN "variant"
	1    11075 8700
	0    1    1    0   
$EndComp
$Comp
L device:C C9
U 1 1 5CF66E7B
P 9425 7550
F 0 "C9" H 9540 7596 50  0000 L CNN
F 1 "0.1u" H 9540 7505 50  0000 L CNN
F 2 "Capacitor_SMD:C_0603_1608Metric" H 2288 4875 30  0001 C CNN
F 3 "" H 2250 5025 60  0000 C CNN
F 4 "Kemet" H 9425 7550 60  0001 C CNN "MFN"
F 5 "C0603C104J4RACTU " H 9425 7550 60  0001 C CNN "MFP"
F 6 "399-1097-1-ND" H 9425 7550 60  0001 C CNN "S1PN"
F 7 "Digi-Key" H 9425 7550 60  0001 C CNN "S1PL"
F 8 "80-C0603C104J4R" H 9425 7550 60  0001 C CNN "S2PN"
F 9 "Mouser" H 9425 7550 60  0001 C CNN "S2PL"
F 10 "~" H 9425 7550 60  0001 C CNN "Characteristics"
F 11 "CAP CER 0.1UF 16V X7R 0603" H 9425 7550 60  0001 C CNN "Description"
F 12 "0603 (1608 Metric)" H 9425 7550 60  0001 C CNN "Package ID"
F 13 "~" H 9425 7550 60  0001 C CNN "Source"
F 14 "N" H 9425 7550 60  0001 C CNN "Critical"
F 15 "~" H 9425 7550 60  0001 C CNN "Notes"
F 16 "sot" H 9425 7550 50  0001 C CNN "variant"
	1    9425 7550
	1    0    0    -1  
$EndComp
$Comp
L device:C C5
U 1 1 5CF68437
P 7075 7950
F 0 "C5" H 7190 7996 50  0000 L CNN
F 1 "0.1u" H 7190 7905 50  0000 L CNN
F 2 "Capacitor_SMD:C_0603_1608Metric" H -62 5275 30  0001 C CNN
F 3 "" H -100 5425 60  0000 C CNN
F 4 "Kemet" H 7075 7950 60  0001 C CNN "MFN"
F 5 "C0603C104J4RACTU " H 7075 7950 60  0001 C CNN "MFP"
F 6 "399-1097-1-ND" H 7075 7950 60  0001 C CNN "S1PN"
F 7 "Digi-Key" H 7075 7950 60  0001 C CNN "S1PL"
F 8 "80-C0603C104J4R" H 7075 7950 60  0001 C CNN "S2PN"
F 9 "Mouser" H 7075 7950 60  0001 C CNN "S2PL"
F 10 "~" H 7075 7950 60  0001 C CNN "Characteristics"
F 11 "CAP CER 0.1UF 16V X7R 0603" H 7075 7950 60  0001 C CNN "Description"
F 12 "0603 (1608 Metric)" H 7075 7950 60  0001 C CNN "Package ID"
F 13 "~" H 7075 7950 60  0001 C CNN "Source"
F 14 "N" H 7075 7950 60  0001 C CNN "Critical"
F 15 "~" H 7075 7950 60  0001 C CNN "Notes"
F 16 "sot" H 7075 7950 50  0001 C CNN "variant"
	1    7075 7950
	1    0    0    -1  
$EndComp
$Comp
L device:C C7
U 1 1 5CF69D46
P 7525 8800
F 0 "C7" V 7275 8750 50  0000 L CNN
F 1 "0.1u" V 7375 8725 50  0000 L CNN
F 2 "Capacitor_SMD:C_0603_1608Metric" H 388 6125 30  0001 C CNN
F 3 "" H 350 6275 60  0000 C CNN
F 4 "Kemet" H 7525 8800 60  0001 C CNN "MFN"
F 5 "C0603C104J4RACTU " H 7525 8800 60  0001 C CNN "MFP"
F 6 "399-1097-1-ND" H 7525 8800 60  0001 C CNN "S1PN"
F 7 "Digi-Key" H 7525 8800 60  0001 C CNN "S1PL"
F 8 "80-C0603C104J4R" H 7525 8800 60  0001 C CNN "S2PN"
F 9 "Mouser" H 7525 8800 60  0001 C CNN "S2PL"
F 10 "~" H 7525 8800 60  0001 C CNN "Characteristics"
F 11 "CAP CER 0.1UF 16V X7R 0603" H 7525 8800 60  0001 C CNN "Description"
F 12 "0603 (1608 Metric)" H 7525 8800 60  0001 C CNN "Package ID"
F 13 "~" H 7525 8800 60  0001 C CNN "Source"
F 14 "N" H 7525 8800 60  0001 C CNN "Critical"
F 15 "~" H 7525 8800 60  0001 C CNN "Notes"
F 16 "sot" V 7525 8800 50  0001 C CNN "variant"
	1    7525 8800
	0    1    1    0   
$EndComp
$Comp
L device:C C10
U 1 1 5CF6B4AC
P 10175 8700
F 0 "C10" V 9925 8625 50  0000 L CNN
F 1 "0.1u" V 10025 8625 50  0000 L CNN
F 2 "Capacitor_SMD:C_0603_1608Metric" H 3038 6025 30  0001 C CNN
F 3 "" H 3000 6175 60  0000 C CNN
F 4 "Kemet" H 10175 8700 60  0001 C CNN "MFN"
F 5 "C0603C104J4RACTU " H 10175 8700 60  0001 C CNN "MFP"
F 6 "399-1097-1-ND" H 10175 8700 60  0001 C CNN "S1PN"
F 7 "Digi-Key" H 10175 8700 60  0001 C CNN "S1PL"
F 8 "80-C0603C104J4R" H 10175 8700 60  0001 C CNN "S2PN"
F 9 "Mouser" H 10175 8700 60  0001 C CNN "S2PL"
F 10 "~" H 10175 8700 60  0001 C CNN "Characteristics"
F 11 "CAP CER 0.1UF 16V X7R 0603" H 10175 8700 60  0001 C CNN "Description"
F 12 "0603 (1608 Metric)" H 10175 8700 60  0001 C CNN "Package ID"
F 13 "~" H 10175 8700 60  0001 C CNN "Source"
F 14 "N" H 10175 8700 60  0001 C CNN "Critical"
F 15 "~" H 10175 8700 60  0001 C CNN "Notes"
F 16 "sot" V 10175 8700 50  0001 C CNN "variant"
	1    10175 8700
	0    1    1    0   
$EndComp
$Comp
L device:C C8
U 1 1 5CF6CD08
P 8425 9450
F 0 "C8" H 8540 9496 50  0000 L CNN
F 1 "0.1u" H 8540 9405 50  0000 L CNN
F 2 "Capacitor_SMD:C_0603_1608Metric" H 1288 6775 30  0001 C CNN
F 3 "" H 1250 6925 60  0000 C CNN
F 4 "Kemet" H 8425 9450 60  0001 C CNN "MFN"
F 5 "C0603C104J4RACTU " H 8425 9450 60  0001 C CNN "MFP"
F 6 "399-1097-1-ND" H 8425 9450 60  0001 C CNN "S1PN"
F 7 "Digi-Key" H 8425 9450 60  0001 C CNN "S1PL"
F 8 "80-C0603C104J4R" H 8425 9450 60  0001 C CNN "S2PN"
F 9 "Mouser" H 8425 9450 60  0001 C CNN "S2PL"
F 10 "~" H 8425 9450 60  0001 C CNN "Characteristics"
F 11 "CAP CER 0.1UF 16V X7R 0603" H 8425 9450 60  0001 C CNN "Description"
F 12 "0603 (1608 Metric)" H 8425 9450 60  0001 C CNN "Package ID"
F 13 "~" H 8425 9450 60  0001 C CNN "Source"
F 14 "N" H 8425 9450 60  0001 C CNN "Critical"
F 15 "~" H 8425 9450 60  0001 C CNN "Notes"
F 16 "sot" H 8425 9450 50  0001 C CNN "variant"
	1    8425 9450
	1    0    0    -1  
$EndComp
$Comp
L device:R R3
U 1 1 5CF709C6
P 7425 7950
F 0 "R3" H 7495 7996 50  0000 L CNN
F 1 "2.2k" H 7495 7905 50  0000 L CNN
F 2 "Resistor_SMD:R_0603_1608Metric" V -245 4950 30  0001 C CNN
F 3 "" H -175 4950 30  0000 C CNN
F 4 "Yageo" H 7425 7950 60  0001 C CNN "MFN"
F 5 "RC0603FR-072K2L" H 7425 7950 60  0001 C CNN "MFP"
F 6 "603-RC0603FR-072K2L" H 7425 7950 60  0001 C CNN "S1PN"
F 7 "Mouser" H 7425 7950 60  0001 C CNN "S1PL"
F 8 "311-2.20KHRCT-ND" H 7425 7950 60  0001 C CNN "S2PN"
F 9 "Digi-Key" H 7425 7950 60  0001 C CNN "S2PL"
F 10 "~" H 7425 7950 60  0001 C CNN "Characteristics"
F 11 "RES SMD 2.2K OHM 1% 1/10W 0603 " H 7425 7950 60  0001 C CNN "Description"
F 12 "0603 (1608 Metric)" H 7425 7950 60  0001 C CNN "Package ID"
F 13 "~" H 7425 7950 60  0001 C CNN "Source"
F 14 "N" H 7425 7950 60  0001 C CNN "Critical"
F 15 "~" H 7425 7950 60  0001 C CNN "Notes"
F 16 "sot" H 7425 7950 50  0001 C CNN "variant"
	1    7425 7950
	1    0    0    -1  
$EndComp
$Comp
L device:R R8
U 1 1 5CF725CC
P 10675 8700
F 0 "R8" V 10475 8650 50  0000 L CNN
F 1 "49.9" V 10575 8600 50  0000 L CNN
F 2 "Resistor_SMD:R_0603_1608Metric" V 3005 5700 30  0001 C CNN
F 3 "" H 3075 5700 30  0000 C CNN
F 4 "Yageo" H 10675 8700 60  0001 C CNN "MFN"
F 5 "RC0603FR-0749R9L" H 10675 8700 60  0001 C CNN "MFP"
F 6 "603-RC0603FR-0749R9L" H 10675 8700 60  0001 C CNN "S1PN"
F 7 "Mouser" H 10675 8700 60  0001 C CNN "S1PL"
F 8 "311-49.9HRCT-ND" H 10675 8700 60  0001 C CNN "S2PN"
F 9 "Digi-Key" H 10675 8700 60  0001 C CNN "S2PL"
F 10 "~" H 10675 8700 60  0001 C CNN "Characteristics"
F 11 "RES SMD 49.9 OHM 1% 1/10W 0603" H 10675 8700 60  0001 C CNN "Description"
F 12 "0603 (1608 Metric)" H 10675 8700 60  0001 C CNN "Package ID"
F 13 "~" H 10675 8700 60  0001 C CNN "Source"
F 14 "N" H 10675 8700 60  0001 C CNN "Critical"
F 15 "~" H 10675 8700 60  0001 C CNN "Notes"
F 16 "sot" V 10675 8700 50  0001 C CNN "variant"
	1    10675 8700
	0    1    1    0   
$EndComp
$Comp
L project:rfi_shield_clip P3
U 1 1 5D06BA9B
P 10425 6075
F 0 "P3" H 10553 6094 60  0000 L CNN
F 1 "~" H 10553 6041 60  0000 L CNN
F 2 "RF_Shielding:S1721-46R" H 10425 6075 60  0001 C CNN
F 3 "" H 10425 6075 60  0000 C CNN
F 4 "Harwin Inc." H 10425 6075 50  0001 C CNN "MFN"
F 5 "S1721-46R" H 10425 6075 50  0001 C CNN "MFP"
F 6 "952-1476-1-ND" H 10425 6075 50  0001 C CNN "S1PN"
F 7 "Digi-Key" H 10425 6075 50  0001 C CNN "S1PL"
F 8 "855-S1721-46R" H 10425 6075 50  0001 C CNN "S2PN"
F 9 "Mouser" H 10425 6075 50  0001 C CNN "S2PL"
F 10 "RFI SHIELD CLIP MINI TIN SMD" H 10425 6075 50  0001 C CNN "Description"
	1    10425 6075
	1    0    0    -1  
$EndComp
$Comp
L device:R R14
U 1 1 5DA26CAF
P 7300 2700
F 0 "R14" H 7370 2746 50  0000 L CNN
F 1 "2.2k" H 7370 2655 50  0000 L CNN
F 2 "Resistor_SMD:R_0603_1608Metric" V -370 -300 30  0001 C CNN
F 3 "" H -300 -300 30  0000 C CNN
F 4 "Yageo" H 7300 2700 60  0001 C CNN "MFN"
F 5 "RC0603FR-072K2L" H 7300 2700 60  0001 C CNN "MFP"
F 6 "603-RC0603FR-072K2L" H 7300 2700 60  0001 C CNN "S1PN"
F 7 "Mouser" H 7300 2700 60  0001 C CNN "S1PL"
F 8 "311-2.20KHRCT-ND" H 7300 2700 60  0001 C CNN "S2PN"
F 9 "Digi-Key" H 7300 2700 60  0001 C CNN "S2PL"
F 10 "~" H 7300 2700 60  0001 C CNN "Characteristics"
F 11 "RES SMD 2.2K OHM 1% 1/10W 0603 " H 7300 2700 60  0001 C CNN "Description"
F 12 "0603 (1608 Metric)" H 7300 2700 60  0001 C CNN "Package ID"
F 13 "~" H 7300 2700 60  0001 C CNN "Source"
F 14 "N" H 7300 2700 60  0001 C CNN "Critical"
F 15 "~" H 7300 2700 60  0001 C CNN "Notes"
F 16 "soip" H 7300 2700 50  0001 C CNN "variant"
	1    7300 2700
	1    0    0    -1  
$EndComp
$Comp
L project:L78L10 U3
U 1 1 5DA26CC1
P 6100 1300
F 0 "U3" H 6100 1637 60  0000 C CNN
F 1 "L78L08" H 6100 1531 60  0000 C CNN
F 2 "Package_TO_SOT_SMD:SOT-89-3" H 1075 -900 60  0001 C CNN
F 3 "" H 1075 -900 60  0000 C CNN
F 4 "STMicroelectronics" H 6100 1300 60  0001 C CNN "MFN"
F 5 "L78L08ACUTR" H 6100 1300 60  0001 C CNN "MFP"
F 6 "497-7271-1-ND" H 6100 1300 60  0001 C CNN "S1PN"
F 7 "Digi-Key" H 6100 1300 60  0001 C CNN "S1PL"
F 8 "L78L08ACUTR" H 6100 1300 60  0001 C CNN "S2PN"
F 9 "Arrow" H 6100 1300 60  0001 C CNN "S2PL"
F 10 "~" H 6100 1300 60  0001 C CNN "Characteristics"
F 11 "IC REG LINEAR 8V 100MA" H 6100 1300 60  0001 C CNN "Description"
F 12 "SOT-89-3" H 6100 1300 60  0001 C CNN "Package ID"
F 13 "~" H 6100 1300 60  0001 C CNN "Source"
F 14 "N" H 6100 1300 60  0001 C CNN "Critical"
F 15 "~" H 6100 1300 60  0001 C CNN "Notes"
F 16 "soip" H 6100 1300 50  0001 C CNN "variant"
	1    6100 1300
	1    0    0    -1  
$EndComp
$Comp
L device:R R23
U 1 1 5DA26CD3
P 7900 4050
F 0 "R23" V 7693 4050 50  0000 C CNN
F 1 "15" V 7784 4050 50  0000 C CNN
F 2 "Resistor_SMD:R_0603_1608Metric" V 230 1050 30  0001 C CNN
F 3 "" H 300 1050 30  0000 C CNN
F 4 "Yageo" H 7900 4050 60  0001 C CNN "MFN"
F 5 "RC0603FR-0715RL" H 7900 4050 60  0001 C CNN "MFP"
F 6 "603-RC0603FR-0715RL" H 7900 4050 60  0001 C CNN "S1PN"
F 7 "Mouser" H 7900 4050 60  0001 C CNN "S1PL"
F 8 "311-15.0HRCT-ND" H 7900 4050 60  0001 C CNN "S2PN"
F 9 "Digi-Key" H 7900 4050 60  0001 C CNN "S2PL"
F 10 "~" H 7900 4050 60  0001 C CNN "Characteristics"
F 11 "RES SMD 15 OHM 1% 1/10W 0603 " H 7900 4050 60  0001 C CNN "Description"
F 12 "0603 (1608 Metric)" H 7900 4050 60  0001 C CNN "Package ID"
F 13 "~" H 7900 4050 60  0001 C CNN "Source"
F 14 "N" H 7900 4050 60  0001 C CNN "Critical"
F 15 "~" H 7900 4050 60  0001 C CNN "Notes"
F 16 "soip" V 7900 4050 50  0001 C CNN "variant"
	1    7900 4050
	0    1    1    0   
$EndComp
$Comp
L device:R X7
U 1 1 5DA26CE5
P 6850 4050
F 0 "X7" V 6725 4050 50  0000 C CNN
F 1 "0" V 6850 4050 50  0000 C CNN
F 2 "Capacitor_SMD:C_0603_1608Metric" V -820 1050 30  0001 C CNN
F 3 "" H -750 1050 30  0000 C CNN
F 4 "~" H 6850 4050 60  0001 C CNN "MFN"
F 5 "~" H 6850 4050 60  0001 C CNN "MFP"
F 6 "~" H 6850 4050 60  0001 C CNN "S1PN"
F 7 "~" H 6850 4050 60  0001 C CNN "S1PL"
F 8 "~" H 6850 4050 60  0001 C CNN "S2PN"
F 9 "~" H 6850 4050 60  0001 C CNN "S2PL"
F 10 "~" H 6850 4050 60  0001 C CNN "Characteristics"
F 11 "~" H 6850 4050 60  0001 C CNN "Description"
F 12 "~" H 6850 4050 60  0001 C CNN "Package ID"
F 13 "~" H 6850 4050 60  0001 C CNN "Source"
F 14 "N" H 6850 4050 60  0001 C CNN "Critical"
F 15 "~" H 6850 4050 60  0001 C CNN "Notes"
F 16 "soip" V 6850 4050 50  0001 C CNN "variant"
	1    6850 4050
	0    1    1    0   
$EndComp
$Comp
L device:R R19
U 1 1 5DA26CF7
P 7650 3650
F 0 "R19" H 7720 3696 50  0000 L CNN
F 1 "49.9" H 7720 3605 50  0000 L CNN
F 2 "Resistor_SMD:R_0603_1608Metric" V -20 650 30  0001 C CNN
F 3 "" H 50  650 30  0000 C CNN
F 4 "Yageo" H 7650 3650 60  0001 C CNN "MFN"
F 5 "RC0603FR-0749R9L" H 7650 3650 60  0001 C CNN "MFP"
F 6 "603-RC0603FR-0749R9L" H 7650 3650 60  0001 C CNN "S1PN"
F 7 "Mouser" H 7650 3650 60  0001 C CNN "S1PL"
F 8 "311-49.9HRCT-ND" H 7650 3650 60  0001 C CNN "S2PN"
F 9 "Digi-Key" H 7650 3650 60  0001 C CNN "S2PL"
F 10 "~" H 7650 3650 60  0001 C CNN "Characteristics"
F 11 "RES SMD 49.9 OHM 1% 1/10W 0603" H 7650 3650 60  0001 C CNN "Description"
F 12 "0603 (1608 Metric)" H 7650 3650 60  0001 C CNN "Package ID"
F 13 "~" H 7650 3650 60  0001 C CNN "Source"
F 14 "N" H 7650 3650 60  0001 C CNN "Critical"
F 15 "~" H 7650 3650 60  0001 C CNN "Notes"
F 16 "soip" H 7650 3650 50  0001 C CNN "variant"
	1    7650 3650
	1    0    0    -1  
$EndComp
$Comp
L device:R R16
U 1 1 5DA26D09
P 8600 3300
F 0 "R16" V 8393 3300 50  0000 C CNN
F 1 "1.8k" V 8484 3300 50  0000 C CNN
F 2 "Resistor_SMD:R_0603_1608Metric" V 930 300 30  0001 C CNN
F 3 "" H 1000 300 30  0000 C CNN
F 4 "Yageo" H 8600 3300 60  0001 C CNN "MFN"
F 5 "RC0603FR-071K8L" H 8600 3300 60  0001 C CNN "MFP"
F 6 "603-RC0603FR-071K8L" H 8600 3300 60  0001 C CNN "S1PN"
F 7 "Mouser" H 8600 3300 60  0001 C CNN "S1PL"
F 8 "311-1.80KHRCT-ND" H 8600 3300 60  0001 C CNN "S2PN"
F 9 "Digi-Key" H 8600 3300 60  0001 C CNN "S2PL"
F 10 "~" H 8600 3300 60  0001 C CNN "Characteristics"
F 11 "RES SMD 1.8K OHM 1% 1/10W 0603 " H 8600 3300 60  0001 C CNN "Description"
F 12 "0603 (1608 Metric) " H 8600 3300 60  0001 C CNN "Package ID"
F 13 "~" H 8600 3300 60  0001 C CNN "Source"
F 14 "N" H 8600 3300 60  0001 C CNN "Critical"
F 15 "~" H 8600 3300 60  0001 C CNN "Notes"
F 16 "soip" V 8600 3300 50  0001 C CNN "variant"
	1    8600 3300
	0    1    1    0   
$EndComp
$Comp
L device:R R24
U 1 1 5DA26D1B
P 8300 4300
F 0 "R24" H 8370 4346 50  0000 L CNN
F 1 "39" H 8370 4255 50  0000 L CNN
F 2 "Resistor_SMD:R_0603_1608Metric" V 630 1300 30  0001 C CNN
F 3 "" H 700 1300 30  0000 C CNN
F 4 "Yageo" H 8300 4300 60  0001 C CNN "MFN"
F 5 "RC0603FR-0739RL" H 8300 4300 60  0001 C CNN "MFP"
F 6 "603-RC0603FR-0739RL" H 8300 4300 60  0001 C CNN "S1PN"
F 7 "Mouser" H 8300 4300 60  0001 C CNN "S1PL"
F 8 "311-39.0HRCT-ND" H 8300 4300 60  0001 C CNN "S2PN"
F 9 "Digi-Key" H 8300 4300 60  0001 C CNN "S2PL"
F 10 "~" H 8300 4300 60  0001 C CNN "Characteristics"
F 11 "RES SMD 39 OHM 1% 1/10W 0603 " H 8300 4300 60  0001 C CNN "Description"
F 12 "0603 (1608 Metric) " H 8300 4300 60  0001 C CNN "Package ID"
F 13 "~" H 8300 4300 60  0001 C CNN "Source"
F 14 "N" H 8300 4300 60  0001 C CNN "Critical"
F 15 "~" H 8300 4300 60  0001 C CNN "Notes"
F 16 "soip" H 8300 4300 50  0001 C CNN "variant"
	1    8300 4300
	1    0    0    -1  
$EndComp
$Comp
L device:R X6
U 1 1 5DA26D2D
P 6250 4050
F 0 "X6" V 6125 4050 50  0000 C CNN
F 1 "0" V 6250 4050 50  0000 C CNN
F 2 "Capacitor_SMD:C_0603_1608Metric" V -1420 1050 30  0001 C CNN
F 3 "" H -1350 1050 30  0000 C CNN
F 4 "~" H 6250 4050 60  0001 C CNN "MFN"
F 5 "~" H 6250 4050 60  0001 C CNN "MFP"
F 6 "~" H 6250 4050 60  0001 C CNN "S1PN"
F 7 "~" H 6250 4050 60  0001 C CNN "S1PL"
F 8 "~" H 6250 4050 60  0001 C CNN "S2PN"
F 9 "~" H 6250 4050 60  0001 C CNN "S2PL"
F 10 "~" H 6250 4050 60  0001 C CNN "Characteristics"
F 11 "~" H 6250 4050 60  0001 C CNN "Description"
F 12 "~" H 6250 4050 60  0001 C CNN "Package ID"
F 13 "~" H 6250 4050 60  0001 C CNN "Source"
F 14 "N" H 6250 4050 60  0001 C CNN "Critical"
F 15 "~" H 6250 4050 60  0001 C CNN "Notes"
F 16 "soip" V 6250 4050 50  0001 C CNN "variant"
	1    6250 4050
	0    1    1    0   
$EndComp
$Comp
L device:R X9
U 1 1 5DA26D3F
P 6550 4300
F 0 "X9" H 6620 4346 50  0000 L CNN
F 1 "DNF" H 6620 4255 50  0000 L CNN
F 2 "Capacitor_SMD:C_0603_1608Metric" V -1120 1300 30  0001 C CNN
F 3 "" H -1050 1300 30  0000 C CNN
F 4 "~" H 6550 4300 60  0001 C CNN "MFN"
F 5 "~" H 6550 4300 60  0001 C CNN "MFP"
F 6 "~" H 6550 4300 60  0001 C CNN "S1PN"
F 7 "~" H 6550 4300 60  0001 C CNN "S1PL"
F 8 "~" H 6550 4300 60  0001 C CNN "S2PN"
F 9 "~" H 6550 4300 60  0001 C CNN "S2PL"
F 10 "~" H 6550 4300 60  0001 C CNN "Characteristics"
F 11 "~" H 6550 4300 60  0001 C CNN "Description"
F 12 "~" H 6550 4300 60  0001 C CNN "Package ID"
F 13 "~" H 6550 4300 60  0001 C CNN "Source"
F 14 "N" H 6550 4300 60  0001 C CNN "Critical"
F 15 "~" H 6550 4300 60  0001 C CNN "Notes"
F 16 "soip" H 6550 4300 50  0001 C CNN "variant"
	1    6550 4300
	1    0    0    -1  
$EndComp
$Comp
L device:R X8
U 1 1 5DA26D51
P 5950 4300
F 0 "X8" H 6020 4346 50  0000 L CNN
F 1 "DNF" H 6020 4255 50  0000 L CNN
F 2 "Capacitor_SMD:C_0603_1608Metric" V -1720 1300 30  0001 C CNN
F 3 "" H -1650 1300 30  0000 C CNN
F 4 "~" H 5950 4300 60  0001 C CNN "MFN"
F 5 "~" H 5950 4300 60  0001 C CNN "MFP"
F 6 "~" H 5950 4300 60  0001 C CNN "S1PN"
F 7 "~" H 5950 4300 60  0001 C CNN "S1PL"
F 8 "~" H 5950 4300 60  0001 C CNN "S2PN"
F 9 "~" H 5950 4300 60  0001 C CNN "S2PL"
F 10 "~" H 5950 4300 60  0001 C CNN "Characteristics"
F 11 "~" H 5950 4300 60  0001 C CNN "Description"
F 12 "~" H 5950 4300 60  0001 C CNN "Package ID"
F 13 "~" H 5950 4300 60  0001 C CNN "Source"
F 14 "N" H 5950 4300 60  0001 C CNN "Critical"
F 15 "~" H 5950 4300 60  0001 C CNN "Notes"
F 16 "soip" H 5950 4300 50  0001 C CNN "variant"
	1    5950 4300
	1    0    0    -1  
$EndComp
$Comp
L device:R X10
U 1 1 5DA26D63
P 5950 4700
F 0 "X10" H 6020 4746 50  0000 L CNN
F 1 "DNF" H 6020 4655 50  0000 L CNN
F 2 "Capacitor_SMD:C_0603_1608Metric" V -1720 1700 30  0001 C CNN
F 3 "" H -1650 1700 30  0000 C CNN
F 4 "~" H 5950 4700 60  0001 C CNN "MFN"
F 5 "~" H 5950 4700 60  0001 C CNN "MFP"
F 6 "~" H 5950 4700 60  0001 C CNN "S1PN"
F 7 "~" H 5950 4700 60  0001 C CNN "S1PL"
F 8 "~" H 5950 4700 60  0001 C CNN "S2PN"
F 9 "~" H 5950 4700 60  0001 C CNN "S2PL"
F 10 "~" H 5950 4700 60  0001 C CNN "Characteristics"
F 11 "~" H 5950 4700 60  0001 C CNN "Description"
F 12 "~" H 5950 4700 60  0001 C CNN "Package ID"
F 13 "~" H 5950 4700 60  0001 C CNN "Source"
F 14 "N" H 5950 4700 60  0001 C CNN "Critical"
F 15 "~" H 5950 4700 60  0001 C CNN "Notes"
F 16 "soip" H 5950 4700 50  0001 C CNN "variant"
	1    5950 4700
	1    0    0    -1  
$EndComp
$Comp
L power:GND #PWR037
U 1 1 5DA26D75
P 9050 4300
F 0 "#PWR037" H 9100 4350 50  0001 C CNN
F 1 "GND" H 9055 4127 50  0000 C CNN
F 2 "" H 1500 -375 60  0000 C CNN
F 3 "" H 1500 -375 60  0000 C CNN
	1    9050 4300
	1    0    0    -1  
$EndComp
$Comp
L power:GND #PWR040
U 1 1 5DA26D7B
P 8300 4850
F 0 "#PWR040" H 8350 4900 50  0001 C CNN
F 1 "GND" H 8305 4677 50  0000 C CNN
F 2 "" H 750 175 60  0000 C CNN
F 3 "" H 750 175 60  0000 C CNN
	1    8300 4850
	1    0    0    -1  
$EndComp
$Comp
L power:GND #PWR030
U 1 1 5DA26D81
P 9300 2950
F 0 "#PWR030" H 9350 3000 50  0001 C CNN
F 1 "GND" H 9305 2777 50  0000 C CNN
F 2 "" H 1750 -1725 60  0000 C CNN
F 3 "" H 1750 -1725 60  0000 C CNN
	1    9300 2950
	1    0    0    -1  
$EndComp
$Comp
L power:GND #PWR032
U 1 1 5DA26D87
P 7300 3350
F 0 "#PWR032" H 7350 3400 50  0001 C CNN
F 1 "GND" H 7305 3177 50  0000 C CNN
F 2 "" H -250 -1325 60  0000 C CNN
F 3 "" H -250 -1325 60  0000 C CNN
	1    7300 3350
	1    0    0    -1  
$EndComp
$Comp
L power:GND #PWR031
U 1 1 5DA26D8D
P 6950 3350
F 0 "#PWR031" H 7000 3400 50  0001 C CNN
F 1 "GND" H 6955 3177 50  0000 C CNN
F 2 "" H -600 -1325 60  0000 C CNN
F 3 "" H -600 -1325 60  0000 C CNN
	1    6950 3350
	1    0    0    -1  
$EndComp
$Comp
L power:GND #PWR038
U 1 1 5DA26D93
P 6550 4450
F 0 "#PWR038" H 6600 4500 50  0001 C CNN
F 1 "GND" H 6555 4277 50  0000 C CNN
F 2 "" H -1000 -225 60  0000 C CNN
F 3 "" H -1000 -225 60  0000 C CNN
	1    6550 4450
	1    0    0    -1  
$EndComp
$Comp
L power:GND #PWR039
U 1 1 5DA26D99
P 5950 4850
F 0 "#PWR039" H 6000 4900 50  0001 C CNN
F 1 "GND" H 5955 4677 50  0000 C CNN
F 2 "" H -1600 175 60  0000 C CNN
F 3 "" H -1600 175 60  0000 C CNN
	1    5950 4850
	1    0    0    -1  
$EndComp
$Comp
L power:GND #PWR036
U 1 1 5DA26D9F
P 5425 4225
F 0 "#PWR036" H 5475 4275 50  0001 C CNN
F 1 "GND" H 5430 4052 50  0000 C CNN
F 2 "" H -2125 -450 60  0000 C CNN
F 3 "" H -2125 -450 60  0000 C CNN
	1    5425 4225
	1    0    0    -1  
$EndComp
$Comp
L power:GND #PWR035
U 1 1 5DA26DA5
P 11275 4125
F 0 "#PWR035" H 11325 4175 50  0001 C CNN
F 1 "GND" H 11280 3952 50  0000 C CNN
F 2 "" H 3725 -550 60  0000 C CNN
F 3 "" H 3725 -550 60  0000 C CNN
	1    11275 4125
	1    0    0    -1  
$EndComp
$Comp
L device:C C11
U 1 1 5DA26DB7
P 4550 1500
F 0 "C11" H 4665 1546 50  0000 L CNN
F 1 "0.01u" H 4665 1455 50  0000 L CNN
F 2 "Capacitor_SMD:C_0603_1608Metric" H -2587 -1175 30  0001 C CNN
F 3 "" H -2625 -1025 60  0000 C CNN
F 4 "Kemet" H 4550 1500 60  0001 C CNN "MFN"
F 5 "C0603C103K5RACTU" H 4550 1500 60  0001 C CNN "MFP"
F 6 "399-1091-1-ND" H 4550 1500 60  0001 C CNN "S1PN"
F 7 "Digi-Key" H 4550 1500 60  0001 C CNN "S1PL"
F 8 "80-C0603C103K5R" H 4550 1500 60  0001 C CNN "S2PN"
F 9 "Mouser" H 4550 1500 60  0001 C CNN "S2PL"
F 10 "~" H 4550 1500 60  0001 C CNN "Characteristics"
F 11 "Multilayer Ceramic Capacitors MLCC - SMD/SMT 50V 0.01uF 0603 X7R 10%" H 4550 1500 60  0001 C CNN "Description"
F 12 "0603 (1608 metric)" H 4550 1500 60  0001 C CNN "Package ID"
F 13 "~" H 4550 1500 60  0001 C CNN "Source"
F 14 "N" H 4550 1500 60  0001 C CNN "Critical"
F 15 "~" H 4550 1500 60  0001 C CNN "Notes"
F 16 "soip" H 4550 1500 50  0001 C CNN "variant"
	1    4550 1500
	1    0    0    -1  
$EndComp
$Comp
L device:C C12
U 1 1 5DA26DC9
P 5150 1500
F 0 "C12" H 5265 1546 50  0000 L CNN
F 1 "0.1u" H 5265 1455 50  0000 L CNN
F 2 "Capacitor_SMD:C_0603_1608Metric" H -1987 -1175 30  0001 C CNN
F 3 "" H -2025 -1025 60  0000 C CNN
F 4 "Kemet" H 5150 1500 60  0001 C CNN "MFN"
F 5 "C0603C104J4RACTU" H 5150 1500 60  0001 C CNN "MFP"
F 6 "399-1097-1-ND" H 5150 1500 60  0001 C CNN "S1PN"
F 7 "Digi-Key" H 5150 1500 60  0001 C CNN "S1PL"
F 8 "80-C0603C104J4R" H 5150 1500 60  0001 C CNN "S2PN"
F 9 "Mouser" H 5150 1500 60  0001 C CNN "S2PL"
F 10 "~" H 5150 1500 60  0001 C CNN "Characteristics"
F 11 "CAP CER 0.1UF 16V X7R 0603" H 5150 1500 60  0001 C CNN "Description"
F 12 "0603 (1608 Metric)" H 5150 1500 60  0001 C CNN "Package ID"
F 13 "~" H 5150 1500 60  0001 C CNN "Source"
F 14 "N" H 5150 1500 60  0001 C CNN "Critical"
F 15 "~" H 5150 1500 60  0001 C CNN "Notes"
F 16 "soip" H 5150 1500 50  0001 C CNN "variant"
	1    5150 1500
	1    0    0    -1  
$EndComp
$Comp
L device:R R13
U 1 1 5DA26DE1
P 4850 1250
F 0 "R13" V 4643 1250 50  0000 C CNN
F 1 "10" V 4734 1250 50  0000 C CNN
F 2 "Resistor_SMD:R_0603_1608Metric" V -2820 -1750 30  0001 C CNN
F 3 "" H -2750 -1750 30  0000 C CNN
F 4 "Yageo" H 4850 1250 60  0001 C CNN "MFN"
F 5 "RC0603FR-0710RL" H 4850 1250 60  0001 C CNN "MFP"
F 6 "603-RC0603FR-0710RL" H 4850 1250 60  0001 C CNN "S1PN"
F 7 "Mouser" H 4850 1250 60  0001 C CNN "S1PL"
F 8 "311-10.0HRCT-ND" H 4850 1250 60  0001 C CNN "S2PN"
F 9 "Digi-Key" H 4850 1250 60  0001 C CNN "S2PL"
F 10 "~" H 4850 1250 60  0001 C CNN "Characteristics"
F 11 "RES SMD 10 OHM 1% 1/10W 0603" H 4850 1250 60  0001 C CNN "Description"
F 12 "0603 (1608 Metric)" H 4850 1250 60  0001 C CNN "Package ID"
F 13 "~" H 4850 1250 60  0001 C CNN "Source"
F 14 "N" H 4850 1250 60  0001 C CNN "Critical"
F 15 "~" H 4850 1250 60  0001 C CNN "Notes"
F 16 "soip" V 4850 1250 50  0001 C CNN "variant"
	1    4850 1250
	0    1    1    0   
$EndComp
$Comp
L device:C C13
U 1 1 5DA26DF3
P 5550 1500
F 0 "C13" H 5665 1546 50  0000 L CNN
F 1 "10u" H 5665 1455 50  0000 L CNN
F 2 "Capacitor_SMD:C_0805_2012Metric" H -1587 -1175 30  0001 C CNN
F 3 "" H -1625 -1025 60  0000 C CNN
F 4 "Murata" H 5550 1500 60  0001 C CNN "MFN"
F 5 "GRM21BR61C106KE15L" H 5550 1500 60  0001 C CNN "MFP"
F 6 "81-GRM21BR61C106KE15" H 5550 1500 60  0001 C CNN "S1PN"
F 7 "Mouser" H 5550 1500 60  0001 C CNN "S1PL"
F 8 "490-3886-1-ND" H 5550 1500 60  0001 C CNN "S2PN"
F 9 "Digi-Key" H 5550 1500 60  0001 C CNN "S2PL"
F 10 "~" H 5550 1500 60  0001 C CNN "Characteristics"
F 11 "CAP CER 10UF 16V X5R 0805 " H 5550 1500 60  0001 C CNN "Description"
F 12 "0805 (2012 Metric) " H 5550 1500 60  0001 C CNN "Package ID"
F 13 "~" H 5550 1500 60  0001 C CNN "Source"
F 14 "N" H 5550 1500 60  0001 C CNN "Critical"
F 15 "~" H 5550 1500 60  0001 C CNN "Notes"
F 16 "soip" H 5550 1500 50  0001 C CNN "variant"
	1    5550 1500
	1    0    0    -1  
$EndComp
Wire Wire Line
	8300 3300 8300 3850
Wire Wire Line
	8300 3300 8450 3300
Wire Wire Line
	8750 3850 8300 3850
Connection ~ 8300 3850
Wire Wire Line
	9550 3950 9700 3950
Wire Wire Line
	8750 3300 9700 3300
Wire Wire Line
	9700 3300 9700 3950
Connection ~ 9700 3950
Wire Wire Line
	8300 4450 8300 4550
Wire Wire Line
	8750 4050 8050 4050
Wire Wire Line
	7550 4050 7650 4050
Wire Wire Line
	9050 2550 9300 2550
Wire Wire Line
	9300 2550 9300 2650
Connection ~ 9050 2550
Wire Wire Line
	7650 3800 7650 4050
Connection ~ 7650 4050
Wire Wire Line
	7300 2850 7300 2950
Wire Wire Line
	7650 2950 7650 3500
Wire Wire Line
	6950 2950 7300 2950
Connection ~ 7300 2950
Wire Wire Line
	6950 3050 6950 2950
Wire Wire Line
	7300 2550 7300 2150
Wire Wire Line
	7300 2150 8200 2150
Wire Wire Line
	7250 4050 7000 4050
Wire Wire Line
	6400 4050 6550 4050
Wire Wire Line
	6550 4150 6550 4050
Connection ~ 6550 4050
Wire Wire Line
	5950 4550 5950 4450
Wire Wire Line
	5950 4150 5950 4050
Wire Wire Line
	10200 3950 10400 3950
Wire Wire Line
	9150 3600 9150 3500
Wire Wire Line
	9150 3500 9050 3500
Connection ~ 9050 3500
Wire Wire Line
	4050 1250 4550 1250
Wire Wire Line
	5000 1250 5150 1250
Wire Wire Line
	6500 1250 6650 1250
Wire Wire Line
	7050 1250 7050 1350
Wire Wire Line
	6650 1350 6650 1250
Connection ~ 6650 1250
Wire Wire Line
	5550 1350 5550 1250
Connection ~ 5550 1250
Wire Wire Line
	5150 1350 5150 1250
Connection ~ 5150 1250
Wire Wire Line
	4550 1350 4550 1250
Connection ~ 4550 1250
$Comp
L power:GND #PWR023
U 1 1 5DA26E26
P 4150 1650
F 0 "#PWR023" H 4200 1700 50  0001 C CNN
F 1 "GND" H 4155 1477 50  0000 C CNN
F 2 "" H -3400 -3025 60  0000 C CNN
F 3 "" H -3400 -3025 60  0000 C CNN
	1    4150 1650
	1    0    0    -1  
$EndComp
$Comp
L power:GND #PWR024
U 1 1 5DA26E2C
P 4550 1650
F 0 "#PWR024" H 4600 1700 50  0001 C CNN
F 1 "GND" H 4555 1477 50  0000 C CNN
F 2 "" H -3000 -3025 60  0000 C CNN
F 3 "" H -3000 -3025 60  0000 C CNN
	1    4550 1650
	1    0    0    -1  
$EndComp
$Comp
L power:GND #PWR025
U 1 1 5DA26E32
P 5150 1650
F 0 "#PWR025" H 5200 1700 50  0001 C CNN
F 1 "GND" H 5155 1477 50  0000 C CNN
F 2 "" H -2400 -3025 60  0000 C CNN
F 3 "" H -2400 -3025 60  0000 C CNN
	1    5150 1650
	1    0    0    -1  
$EndComp
$Comp
L power:GND #PWR026
U 1 1 5DA26E38
P 5550 1650
F 0 "#PWR026" H 5600 1700 50  0001 C CNN
F 1 "GND" H 5555 1477 50  0000 C CNN
F 2 "" H -2000 -3025 60  0000 C CNN
F 3 "" H -2000 -3025 60  0000 C CNN
	1    5550 1650
	1    0    0    -1  
$EndComp
$Comp
L power:GND #PWR027
U 1 1 5DA26E3E
P 6100 1650
F 0 "#PWR027" H 6150 1700 50  0001 C CNN
F 1 "GND" H 6105 1477 50  0000 C CNN
F 2 "" H -1450 -3025 60  0000 C CNN
F 3 "" H -1450 -3025 60  0000 C CNN
	1    6100 1650
	1    0    0    -1  
$EndComp
Wire Wire Line
	6100 1550 6100 1650
Wire Wire Line
	4050 1350 4150 1350
$Comp
L power:GND #PWR028
U 1 1 5DA26E47
P 6650 1650
F 0 "#PWR028" H 6700 1700 50  0001 C CNN
F 1 "GND" H 6655 1477 50  0000 C CNN
F 2 "" H -900 -3025 60  0000 C CNN
F 3 "" H -900 -3025 60  0000 C CNN
	1    6650 1650
	1    0    0    -1  
$EndComp
$Comp
L power:GND #PWR029
U 1 1 5DA26E4D
P 7050 1650
F 0 "#PWR029" H 7100 1700 50  0001 C CNN
F 1 "GND" H 7055 1477 50  0000 C CNN
F 2 "" H -500 -3025 60  0000 C CNN
F 3 "" H -500 -3025 60  0000 C CNN
	1    7050 1650
	1    0    0    -1  
$EndComp
Wire Wire Line
	8200 1250 8200 2150
Connection ~ 7050 1250
Connection ~ 8200 2150
Wire Wire Line
	9050 2150 9050 2250
Wire Wire Line
	9050 2450 9050 2550
Wire Wire Line
	8300 3850 8300 4150
Wire Wire Line
	9700 3950 9900 3950
Wire Wire Line
	9050 2550 9050 3500
Wire Wire Line
	7650 4050 7750 4050
Wire Wire Line
	7300 2950 7300 3050
Wire Wire Line
	7300 2950 7650 2950
Wire Wire Line
	6550 4050 6700 4050
Wire Wire Line
	5950 4050 6100 4050
Wire Wire Line
	9050 3500 9050 3600
Wire Wire Line
	6650 1250 7050 1250
Wire Wire Line
	5550 1250 5700 1250
Wire Wire Line
	5150 1250 5550 1250
Wire Wire Line
	4550 1250 4700 1250
Wire Wire Line
	7050 1250 8200 1250
Wire Wire Line
	8200 2150 9050 2150
$Comp
L power:GND #PWR034
U 1 1 5DA26E8D
P 5425 3725
F 0 "#PWR034" H 5475 3775 50  0001 C CNN
F 1 "GND" H 5430 3552 50  0000 C CNN
F 2 "" H -2125 -950 60  0000 C CNN
F 3 "" H -2125 -950 60  0000 C CNN
	1    5425 3725
	1    0    0    -1  
$EndComp
$Comp
L device:R_Small R18
U 1 1 5DA26E9B
P 5725 3550
F 0 "R18" V 5625 3550 50  0000 C CNN
F 1 "DNF" V 5825 3550 50  0000 C CNN
F 2 "Resistor_SMD:R_0402_1005Metric" H 5725 3550 50  0001 C CNN
F 3 "~" H 5725 3550 50  0001 C CNN
F 4 "Yageo" H 5725 3550 50  0001 C CNN "MFN"
F 5 "RC0402JR-070RL" H 5725 3550 50  0001 C CNN "MFP"
F 6 "603-RC0402JR-070RL" H 5725 3550 50  0001 C CNN "S1PN"
F 7 "Mouser" H 5725 3550 50  0001 C CNN "S1PL"
F 8 "311-0.0JRCT-ND" H 5725 3550 50  0001 C CNN "S2PN"
F 9 "Digi-Key" H 5725 3550 50  0001 C CNN "S2PL"
F 10 "RES SMD 0 OHM JUMPER 1/16W 0402" H 5725 3550 50  0001 C CNN "Description"
F 11 "0402 (1005 Metric)" H 5725 3550 50  0001 C CNN "Package ID"
F 12 "soip" V 5725 3550 50  0001 C CNN "variant"
F 13 "1" V 5725 3550 50  0001 C CNN "DNP"
	1    5725 3550
	0    1    1    0   
$EndComp
Wire Wire Line
	5550 4050 5625 4050
Wire Wire Line
	5825 4050 5950 4050
Connection ~ 5950 4050
Wire Wire Line
	5950 4050 5950 3550
Wire Wire Line
	5950 3550 5825 3550
Wire Wire Line
	5625 3550 5550 3550
$Comp
L power:GND #PWR033
U 1 1 5DA26EA7
P 11275 3600
F 0 "#PWR033" H 11325 3650 50  0001 C CNN
F 1 "GND" H 11280 3427 50  0000 C CNN
F 2 "" H 3725 -1075 60  0000 C CNN
F 3 "" H 3725 -1075 60  0000 C CNN
	1    11275 3600
	1    0    0    -1  
$EndComp
Wire Wire Line
	10700 3950 10775 3950
Wire Wire Line
	10775 3950 10775 3425
Wire Wire Line
	10775 3425 10850 3425
Connection ~ 10775 3950
Wire Wire Line
	10775 3950 10850 3950
Wire Wire Line
	11050 3425 11150 3425
Wire Wire Line
	11050 3950 11150 3950
$Comp
L project:rfi_shield_clip P5
U 1 1 5DA26EBB
P 9825 1325
F 0 "P5" H 9953 1344 60  0000 L CNN
F 1 "~" H 9953 1291 60  0000 L CNN
F 2 "RF_Shielding:S1721-46R" H 9825 1325 60  0001 C CNN
F 3 "" H 9825 1325 60  0000 C CNN
F 4 "Harwin Inc." H 9825 1325 50  0001 C CNN "MFN"
F 5 "S1721-46R" H 9825 1325 50  0001 C CNN "MFP"
F 6 "952-1476-1-ND" H 9825 1325 50  0001 C CNN "S1PN"
F 7 "Digi-Key" H 9825 1325 50  0001 C CNN "S1PL"
F 8 "855-S1721-46R" H 9825 1325 50  0001 C CNN "S2PN"
F 9 "Mouser" H 9825 1325 50  0001 C CNN "S2PL"
F 10 "RFI SHIELD CLIP MINI TIN SMD" H 9825 1325 50  0001 C CNN "Description"
F 11 "soip" H 9825 1325 50  0001 C CNN "variant"
	1    9825 1325
	1    0    0    -1  
$EndComp
$Comp
L power:GND #PWR021
U 1 1 5DA26EC1
P 9825 1425
F 0 "#PWR021" H 9875 1475 50  0001 C CNN
F 1 "GND" H 9830 1252 50  0000 C CNN
F 2 "" H 2275 -3250 60  0000 C CNN
F 3 "" H 2275 -3250 60  0000 C CNN
	1    9825 1425
	1    0    0    -1  
$EndComp
$Comp
L power:GND #PWR022
U 1 1 5DA26EC7
P 10300 1425
F 0 "#PWR022" H 10350 1475 50  0001 C CNN
F 1 "GND" H 10305 1252 50  0000 C CNN
F 2 "" H 2750 -3250 60  0000 C CNN
F 3 "" H 2750 -3250 60  0000 C CNN
	1    10300 1425
	1    0    0    -1  
$EndComp
$Comp
L device:R_Small R22
U 1 1 5DA26ED5
P 5725 4050
F 0 "R22" V 5625 4050 50  0000 C CNN
F 1 "0" V 5825 4050 50  0000 C CNN
F 2 "Resistor_SMD:R_0402_1005Metric" H 5725 4050 50  0001 C CNN
F 3 "~" H 5725 4050 50  0001 C CNN
F 4 "Yageo" H 5725 4050 50  0001 C CNN "MFN"
F 5 "RC0402JR-070RL" H 5725 4050 50  0001 C CNN "MFP"
F 6 "603-RC0402JR-070RL" H 5725 4050 50  0001 C CNN "S1PN"
F 7 "Mouser" H 5725 4050 50  0001 C CNN "S1PL"
F 8 "311-0.0JRCT-ND" H 5725 4050 50  0001 C CNN "S2PN"
F 9 "Digi-Key" H 5725 4050 50  0001 C CNN "S2PL"
F 10 "RES SMD 0 OHM JUMPER 1/16W 0402" H 5725 4050 50  0001 C CNN "Description"
F 11 "0402 (1005 Metric)" H 5725 4050 50  0001 C CNN "Package ID"
F 12 "soip" V 5725 4050 50  0001 C CNN "variant"
	1    5725 4050
	0    1    1    0   
$EndComp
$Comp
L device:R_Small R17
U 1 1 5DA26EE3
P 10950 3425
F 0 "R17" V 10850 3425 50  0000 C CNN
F 1 "DNF" V 11050 3425 50  0000 C CNN
F 2 "Resistor_SMD:R_0402_1005Metric" H 10950 3425 50  0001 C CNN
F 3 "~" H 10950 3425 50  0001 C CNN
F 4 "Yageo" H 10950 3425 50  0001 C CNN "MFN"
F 5 "RC0402JR-070RL" H 10950 3425 50  0001 C CNN "MFP"
F 6 "603-RC0402JR-070RL" H 10950 3425 50  0001 C CNN "S1PN"
F 7 "Mouser" H 10950 3425 50  0001 C CNN "S1PL"
F 8 "311-0.0JRCT-ND" H 10950 3425 50  0001 C CNN "S2PN"
F 9 "Digi-Key" H 10950 3425 50  0001 C CNN "S2PL"
F 10 "RES SMD 0 OHM JUMPER 1/16W 0402" H 10950 3425 50  0001 C CNN "Description"
F 11 "0402 (1005 Metric)" H 10950 3425 50  0001 C CNN "Package ID"
F 12 "soip" V 10950 3425 50  0001 C CNN "variant"
F 13 "1" V 10950 3425 50  0001 C CNN "DNP"
	1    10950 3425
	0    1    1    0   
$EndComp
$Comp
L device:R_Small R21
U 1 1 5DA26EF1
P 10950 3950
F 0 "R21" V 10850 3950 50  0000 C CNN
F 1 "0" V 11050 3950 50  0000 C CNN
F 2 "Resistor_SMD:R_0402_1005Metric" H 10950 3950 50  0001 C CNN
F 3 "~" H 10950 3950 50  0001 C CNN
F 4 "Yageo" H 10950 3950 50  0001 C CNN "MFN"
F 5 "RC0402JR-070RL" H 10950 3950 50  0001 C CNN "MFP"
F 6 "603-RC0402JR-070RL" H 10950 3950 50  0001 C CNN "S1PN"
F 7 "Mouser" H 10950 3950 50  0001 C CNN "S1PL"
F 8 "311-0.0JRCT-ND" H 10950 3950 50  0001 C CNN "S2PN"
F 9 "Digi-Key" H 10950 3950 50  0001 C CNN "S2PL"
F 10 "RES SMD 0 OHM JUMPER 1/16W 0402" H 10950 3950 50  0001 C CNN "Description"
F 11 "0402 (1005 Metric)" H 10950 3950 50  0001 C CNN "Package ID"
F 12 "soip" V 10950 3950 50  0001 C CNN "variant"
	1    10950 3950
	0    1    1    0   
$EndComp
$Comp
L device:C C14
U 1 1 5DA26F03
P 6650 1500
F 0 "C14" H 6765 1546 50  0000 L CNN
F 1 "0.1u" H 6765 1455 50  0000 L CNN
F 2 "Capacitor_SMD:C_0603_1608Metric" H -487 -1175 30  0001 C CNN
F 3 "" H -525 -1025 60  0000 C CNN
F 4 "Kemet" H 6650 1500 60  0001 C CNN "MFN"
F 5 "C0603C104J4RACTU " H 6650 1500 60  0001 C CNN "MFP"
F 6 "399-1097-1-ND" H 6650 1500 60  0001 C CNN "S1PN"
F 7 "Digi-Key" H 6650 1500 60  0001 C CNN "S1PL"
F 8 "80-C0603C104J4R" H 6650 1500 60  0001 C CNN "S2PN"
F 9 "Mouser" H 6650 1500 60  0001 C CNN "S2PL"
F 10 "~" H 6650 1500 60  0001 C CNN "Characteristics"
F 11 "CAP CER 0.1UF 16V X7R 0603" H 6650 1500 60  0001 C CNN "Description"
F 12 "0603 (1608 Metric)" H 6650 1500 60  0001 C CNN "Package ID"
F 13 "~" H 6650 1500 60  0001 C CNN "Source"
F 14 "N" H 6650 1500 60  0001 C CNN "Critical"
F 15 "~" H 6650 1500 60  0001 C CNN "Notes"
F 16 "soip" H 6650 1500 50  0001 C CNN "variant"
	1    6650 1500
	1    0    0    -1  
$EndComp
$Comp
L device:C C16
U 1 1 5DA26F15
P 9300 2800
F 0 "C16" H 9415 2846 50  0000 L CNN
F 1 "0.1u" H 9415 2755 50  0000 L CNN
F 2 "Capacitor_SMD:C_0603_1608Metric" H 2163 125 30  0001 C CNN
F 3 "" H 2125 275 60  0000 C CNN
F 4 "Kemet" H 9300 2800 60  0001 C CNN "MFN"
F 5 "C0603C104J4RACTU " H 9300 2800 60  0001 C CNN "MFP"
F 6 "399-1097-1-ND" H 9300 2800 60  0001 C CNN "S1PN"
F 7 "Digi-Key" H 9300 2800 60  0001 C CNN "S1PL"
F 8 "80-C0603C104J4R" H 9300 2800 60  0001 C CNN "S2PN"
F 9 "Mouser" H 9300 2800 60  0001 C CNN "S2PL"
F 10 "~" H 9300 2800 60  0001 C CNN "Characteristics"
F 11 "CAP CER 0.1UF 16V X7R 0603" H 9300 2800 60  0001 C CNN "Description"
F 12 "0603 (1608 Metric)" H 9300 2800 60  0001 C CNN "Package ID"
F 13 "~" H 9300 2800 60  0001 C CNN "Source"
F 14 "N" H 9300 2800 60  0001 C CNN "Critical"
F 15 "~" H 9300 2800 60  0001 C CNN "Notes"
F 16 "soip" H 9300 2800 50  0001 C CNN "variant"
	1    9300 2800
	1    0    0    -1  
$EndComp
$Comp
L device:C C17
U 1 1 5DA26F27
P 6950 3200
F 0 "C17" H 7065 3246 50  0000 L CNN
F 1 "0.1u" H 7065 3155 50  0000 L CNN
F 2 "Capacitor_SMD:C_0603_1608Metric" H -187 525 30  0001 C CNN
F 3 "" H -225 675 60  0000 C CNN
F 4 "Kemet" H 6950 3200 60  0001 C CNN "MFN"
F 5 "C0603C104J4RACTU " H 6950 3200 60  0001 C CNN "MFP"
F 6 "399-1097-1-ND" H 6950 3200 60  0001 C CNN "S1PN"
F 7 "Digi-Key" H 6950 3200 60  0001 C CNN "S1PL"
F 8 "80-C0603C104J4R" H 6950 3200 60  0001 C CNN "S2PN"
F 9 "Mouser" H 6950 3200 60  0001 C CNN "S2PL"
F 10 "~" H 6950 3200 60  0001 C CNN "Characteristics"
F 11 "CAP CER 0.1UF 16V X7R 0603" H 6950 3200 60  0001 C CNN "Description"
F 12 "0603 (1608 Metric)" H 6950 3200 60  0001 C CNN "Package ID"
F 13 "~" H 6950 3200 60  0001 C CNN "Source"
F 14 "N" H 6950 3200 60  0001 C CNN "Critical"
F 15 "~" H 6950 3200 60  0001 C CNN "Notes"
F 16 "soip" H 6950 3200 50  0001 C CNN "variant"
	1    6950 3200
	1    0    0    -1  
$EndComp
$Comp
L device:C C19
U 1 1 5DA26F39
P 7400 4050
F 0 "C19" V 7150 4000 50  0000 L CNN
F 1 "0.1u" V 7250 3975 50  0000 L CNN
F 2 "Capacitor_SMD:C_0603_1608Metric" H 263 1375 30  0001 C CNN
F 3 "" H 225 1525 60  0000 C CNN
F 4 "Kemet" H 7400 4050 60  0001 C CNN "MFN"
F 5 "C0603C104J4RACTU " H 7400 4050 60  0001 C CNN "MFP"
F 6 "399-1097-1-ND" H 7400 4050 60  0001 C CNN "S1PN"
F 7 "Digi-Key" H 7400 4050 60  0001 C CNN "S1PL"
F 8 "80-C0603C104J4R" H 7400 4050 60  0001 C CNN "S2PN"
F 9 "Mouser" H 7400 4050 60  0001 C CNN "S2PL"
F 10 "~" H 7400 4050 60  0001 C CNN "Characteristics"
F 11 "CAP CER 0.1UF 16V X7R 0603" H 7400 4050 60  0001 C CNN "Description"
F 12 "0603 (1608 Metric)" H 7400 4050 60  0001 C CNN "Package ID"
F 13 "~" H 7400 4050 60  0001 C CNN "Source"
F 14 "N" H 7400 4050 60  0001 C CNN "Critical"
F 15 "~" H 7400 4050 60  0001 C CNN "Notes"
F 16 "soip" V 7400 4050 50  0001 C CNN "variant"
	1    7400 4050
	0    1    1    0   
$EndComp
$Comp
L device:C C18
U 1 1 5DA26F4B
P 10050 3950
F 0 "C18" V 9800 3875 50  0000 L CNN
F 1 "0.1u" V 9900 3875 50  0000 L CNN
F 2 "Capacitor_SMD:C_0603_1608Metric" H 2913 1275 30  0001 C CNN
F 3 "" H 2875 1425 60  0000 C CNN
F 4 "Kemet" H 10050 3950 60  0001 C CNN "MFN"
F 5 "C0603C104J4RACTU " H 10050 3950 60  0001 C CNN "MFP"
F 6 "399-1097-1-ND" H 10050 3950 60  0001 C CNN "S1PN"
F 7 "Digi-Key" H 10050 3950 60  0001 C CNN "S1PL"
F 8 "80-C0603C104J4R" H 10050 3950 60  0001 C CNN "S2PN"
F 9 "Mouser" H 10050 3950 60  0001 C CNN "S2PL"
F 10 "~" H 10050 3950 60  0001 C CNN "Characteristics"
F 11 "CAP CER 0.1UF 16V X7R 0603" H 10050 3950 60  0001 C CNN "Description"
F 12 "0603 (1608 Metric)" H 10050 3950 60  0001 C CNN "Package ID"
F 13 "~" H 10050 3950 60  0001 C CNN "Source"
F 14 "N" H 10050 3950 60  0001 C CNN "Critical"
F 15 "~" H 10050 3950 60  0001 C CNN "Notes"
F 16 "soip" V 10050 3950 50  0001 C CNN "variant"
	1    10050 3950
	0    1    1    0   
$EndComp
$Comp
L device:C C20
U 1 1 5DA26F5D
P 8300 4700
F 0 "C20" H 8415 4746 50  0000 L CNN
F 1 "0.1u" H 8415 4655 50  0000 L CNN
F 2 "Capacitor_SMD:C_0603_1608Metric" H 1163 2025 30  0001 C CNN
F 3 "" H 1125 2175 60  0000 C CNN
F 4 "Kemet" H 8300 4700 60  0001 C CNN "MFN"
F 5 "C0603C104J4RACTU " H 8300 4700 60  0001 C CNN "MFP"
F 6 "399-1097-1-ND" H 8300 4700 60  0001 C CNN "S1PN"
F 7 "Digi-Key" H 8300 4700 60  0001 C CNN "S1PL"
F 8 "80-C0603C104J4R" H 8300 4700 60  0001 C CNN "S2PN"
F 9 "Mouser" H 8300 4700 60  0001 C CNN "S2PL"
F 10 "~" H 8300 4700 60  0001 C CNN "Characteristics"
F 11 "CAP CER 0.1UF 16V X7R 0603" H 8300 4700 60  0001 C CNN "Description"
F 12 "0603 (1608 Metric)" H 8300 4700 60  0001 C CNN "Package ID"
F 13 "~" H 8300 4700 60  0001 C CNN "Source"
F 14 "N" H 8300 4700 60  0001 C CNN "Critical"
F 15 "~" H 8300 4700 60  0001 C CNN "Notes"
F 16 "soip" H 8300 4700 50  0001 C CNN "variant"
	1    8300 4700
	1    0    0    -1  
$EndComp
$Comp
L device:C C15
U 1 1 5DA26F6F
P 7050 1500
F 0 "C15" H 7165 1546 50  0000 L CNN
F 1 "10u" H 7165 1455 50  0000 L CNN
F 2 "Capacitor_SMD:C_0805_2012Metric" H -87 -1175 30  0001 C CNN
F 3 "" H -125 -1025 60  0000 C CNN
F 4 "Murata" H 7050 1500 60  0001 C CNN "MFN"
F 5 "GRM21BR61C106KE15L" H 7050 1500 60  0001 C CNN "MFP"
F 6 "81-GRM21BR61C106KE15" H 7050 1500 60  0001 C CNN "S1PN"
F 7 "Mouser" H 7050 1500 60  0001 C CNN "S1PL"
F 8 "490-3886-1-ND" H 7050 1500 60  0001 C CNN "S2PN"
F 9 "Digi-Key" H 7050 1500 60  0001 C CNN "S2PL"
F 10 "~" H 7050 1500 60  0001 C CNN "Characteristics"
F 11 "CAP CER 10UF 16V X5R 0805 " H 7050 1500 60  0001 C CNN "Description"
F 12 "0805 (2012 Metric) " H 7050 1500 60  0001 C CNN "Package ID"
F 13 "~" H 7050 1500 60  0001 C CNN "Source"
F 14 "N" H 7050 1500 60  0001 C CNN "Critical"
F 15 "~" H 7050 1500 60  0001 C CNN "Notes"
F 16 "soip" H 7050 1500 50  0001 C CNN "variant"
	1    7050 1500
	1    0    0    -1  
$EndComp
$Comp
L device:R R15
U 1 1 5DA26F81
P 7300 3200
F 0 "R15" H 7370 3246 50  0000 L CNN
F 1 "2.2k" H 7370 3155 50  0000 L CNN
F 2 "Resistor_SMD:R_0603_1608Metric" V -370 200 30  0001 C CNN
F 3 "" H -300 200 30  0000 C CNN
F 4 "Yageo" H 7300 3200 60  0001 C CNN "MFN"
F 5 "RC0603FR-072K2L" H 7300 3200 60  0001 C CNN "MFP"
F 6 "603-RC0603FR-072K2L" H 7300 3200 60  0001 C CNN "S1PN"
F 7 "Mouser" H 7300 3200 60  0001 C CNN "S1PL"
F 8 "311-2.20KHRCT-ND" H 7300 3200 60  0001 C CNN "S2PN"
F 9 "Digi-Key" H 7300 3200 60  0001 C CNN "S2PL"
F 10 "~" H 7300 3200 60  0001 C CNN "Characteristics"
F 11 "RES SMD 2.2K OHM 1% 1/10W 0603 " H 7300 3200 60  0001 C CNN "Description"
F 12 "0603 (1608 Metric)" H 7300 3200 60  0001 C CNN "Package ID"
F 13 "~" H 7300 3200 60  0001 C CNN "Source"
F 14 "N" H 7300 3200 60  0001 C CNN "Critical"
F 15 "~" H 7300 3200 60  0001 C CNN "Notes"
F 16 "soip" H 7300 3200 50  0001 C CNN "variant"
	1    7300 3200
	1    0    0    -1  
$EndComp
$Comp
L device:R R20
U 1 1 5DA26F93
P 10550 3950
F 0 "R20" V 10350 3900 50  0000 L CNN
F 1 "49.9" V 10450 3850 50  0000 L CNN
F 2 "Resistor_SMD:R_0603_1608Metric" V 2880 950 30  0001 C CNN
F 3 "" H 2950 950 30  0000 C CNN
F 4 "Yageo" H 10550 3950 60  0001 C CNN "MFN"
F 5 "RC0603FR-0749R9L" H 10550 3950 60  0001 C CNN "MFP"
F 6 "603-RC0603FR-0749R9L" H 10550 3950 60  0001 C CNN "S1PN"
F 7 "Mouser" H 10550 3950 60  0001 C CNN "S1PL"
F 8 "311-49.9HRCT-ND" H 10550 3950 60  0001 C CNN "S2PN"
F 9 "Digi-Key" H 10550 3950 60  0001 C CNN "S2PL"
F 10 "~" H 10550 3950 60  0001 C CNN "Characteristics"
F 11 "RES SMD 49.9 OHM 1% 1/10W 0603" H 10550 3950 60  0001 C CNN "Description"
F 12 "0603 (1608 Metric)" H 10550 3950 60  0001 C CNN "Package ID"
F 13 "~" H 10550 3950 60  0001 C CNN "Source"
F 14 "N" H 10550 3950 60  0001 C CNN "Critical"
F 15 "~" H 10550 3950 60  0001 C CNN "Notes"
F 16 "soip" V 10550 3950 50  0001 C CNN "variant"
	1    10550 3950
	0    1    1    0   
$EndComp
$Comp
L project:rfi_shield_clip P6
U 1 1 5DA26FA0
P 10300 1325
F 0 "P6" H 10428 1344 60  0000 L CNN
F 1 "~" H 10428 1291 60  0000 L CNN
F 2 "RF_Shielding:S1721-46R" H 10300 1325 60  0001 C CNN
F 3 "" H 10300 1325 60  0000 C CNN
F 4 "Harwin Inc." H 10300 1325 50  0001 C CNN "MFN"
F 5 "S1721-46R" H 10300 1325 50  0001 C CNN "MFP"
F 6 "952-1476-1-ND" H 10300 1325 50  0001 C CNN "S1PN"
F 7 "Digi-Key" H 10300 1325 50  0001 C CNN "S1PL"
F 8 "855-S1721-46R" H 10300 1325 50  0001 C CNN "S2PN"
F 9 "Mouser" H 10300 1325 50  0001 C CNN "S2PL"
F 10 "RFI SHIELD CLIP MINI TIN SMD" H 10300 1325 50  0001 C CNN "Description"
F 11 "soip" H 10300 1325 50  0001 C CNN "variant"
	1    10300 1325
	1    0    0    -1  
$EndComp
$Comp
L project:OPA847 U2
U 1 1 5DA31DD6
P 9275 8700
F 0 "U2" H 9400 8900 60  0000 L CNN
F 1 "OPA847-SOT" H 9350 8500 60  0000 L CNN
F 2 "Package_TO_SOT_SMD:SOT-23-6" H 9275 8700 60  0001 C CNN
F 3 "AmpliOp.sch" H 9400 8400 60  0001 L CNN
F 4 "Texas Instruments" H 9275 8700 50  0001 C CNN "MFN"
F 5 "OPA847IDBVT" H 9275 8700 50  0001 C CNN "MFP"
F 6 "OPA847IDBVT" H 9275 8700 50  0001 C CNN "S1PN"
F 7 "Arrow" H 9275 8700 50  0001 C CNN "S1PL"
F 8 "296-46172-1-ND" H 9275 8700 50  0001 C CNN "S2PN"
F 9 "Digi-Key" H 9275 8700 50  0001 C CNN "S2PL"
F 10 "Op Amp Single High Speed Amplifier ±6V/12V" H 9275 8700 50  0001 C CNN "Description"
F 11 "SOT-23-6" H 9275 8700 50  0001 C CNN "Package ID"
F 12 "1:$5.03; 10:$4.53; 100:$3.79" H 9275 8700 50  0001 C CNN "kicost:Texas_Instruments:pricing"
F 13 "sot" H 9275 8700 50  0001 C CNN "variant"
	1    9275 8700
	1    0    0    -1  
$EndComp
Wire Wire Line
	4150 1350 4150 1650
$Comp
L power:PWR_FLAG #FLG0101
U 1 1 5DA43F97
P 9050 2550
F 0 "#FLG0101" H 9050 2625 50  0001 C CNN
F 1 "PWR_FLAG" V 9050 2678 50  0000 L CNN
F 2 "" H 9050 2550 50  0001 C CNN
F 3 "~" H 9050 2550 50  0001 C CNN
	1    9050 2550
	0    -1   -1   0   
$EndComp
$Comp
L power:PWR_FLAG #FLG0102
U 1 1 5DA44321
P 9175 7300
F 0 "#FLG0102" H 9175 7375 50  0001 C CNN
F 1 "PWR_FLAG" V 9175 7428 50  0000 L CNN
F 2 "" H 9175 7300 50  0001 C CNN
F 3 "~" H 9175 7300 50  0001 C CNN
	1    9175 7300
	0    -1   -1   0   
$EndComp
$Comp
L project:SMA_2 J2
U 1 1 5D4AE14F
P 11400 8700
F 0 "J2" H 11503 8690 50  0000 L CNN
F 1 "RF Out" H 11650 8900 50  0000 L CNN
F 2 "RF_SMA_Connectors:SMA_EDGE_4" H 8175 4550 50  0001 C CNN
F 3 "" H 8000 4650 60  0000 C CNN
F 4 "Molex" H 11400 8700 50  0001 C CNN "MFN"
F 5 "0732511150" H 11400 8700 50  0001 C CNN "MFP"
F 6 "S01-SJEDM-11BS05" H 11400 8700 50  0001 C CNN "S1PN"
F 7 "Superbat" H 11400 8700 50  0001 C CNN "S1PL"
F 8 "73251-1150" H 11400 8700 50  0001 C CNN "S2PN"
F 9 "TTI" H 11400 8700 50  0001 C CNN "S2PL"
F 10 "SMA ST PCB-JCK" H 11400 8700 50  0001 C CNN "Description"
F 11 "1:$1.20; 10:$1.08; 100:$0.98" H 11400 8700 50  0001 C CNN "kicost:RF_Supplier:pricing"
F 12 "sot" H 11400 8700 50  0001 C CNN "variant"
	1    11400 8700
	1    0    0    -1  
$EndComp
$Comp
L project:SMA_2 J5
U 1 1 5D4B3F48
P 11275 3950
F 0 "J5" H 11378 3940 50  0000 L CNN
F 1 "RF Out" H 11525 4150 50  0000 L CNN
F 2 "RF_SMA_Connectors:SMA_EDGE_4" H 8050 -200 50  0001 C CNN
F 3 "" H 7875 -100 60  0000 C CNN
F 4 "Molex" H 11275 3950 50  0001 C CNN "MFN"
F 5 "0732511150" H 11275 3950 50  0001 C CNN "MFP"
F 6 "S01-SJEDM-11BS05" H 11275 3950 50  0001 C CNN "S1PN"
F 7 "Superbat" H 11275 3950 50  0001 C CNN "S1PL"
F 8 "73251-1150" H 11275 3950 50  0001 C CNN "S2PN"
F 9 "TTI" H 11275 3950 50  0001 C CNN "S2PL"
F 10 "SMA ST PCB-JCK" H 11275 3950 50  0001 C CNN "Description"
F 11 "1:$1.20; 10:$1.08; 100:$0.98" H 11275 3950 50  0001 C CNN "kicost:RF_Supplier:pricing"
F 12 "soip" H 11275 3950 50  0001 C CNN "variant"
	1    11275 3950
	1    0    0    -1  
$EndComp
$Comp
L project:SMA_2 J6
U 1 1 5D4B9B28
P 5425 4050
F 0 "J6" H 5528 4040 50  0000 L CNN
F 1 "RF In" H 5675 4250 50  0000 L CNN
F 2 "RF_SMA_Connectors:SMA_EDGE_4" H 2200 -100 50  0001 C CNN
F 3 "" H 2025 0   60  0000 C CNN
F 4 "Molex" H 5425 4050 50  0001 C CNN "MFN"
F 5 "0732511150" H 5425 4050 50  0001 C CNN "MFP"
F 6 "S01-SJEDM-11BS05" H 5425 4050 50  0001 C CNN "S1PN"
F 7 "Superbat" H 5425 4050 50  0001 C CNN "S1PL"
F 8 "73251-1150" H 5425 4050 50  0001 C CNN "S2PN"
F 9 "TTI" H 5425 4050 50  0001 C CNN "S2PL"
F 10 "SMA ST PCB-JCK" H 5425 4050 50  0001 C CNN "Description"
F 11 "1:$1.20; 10:$1.08; 100:$0.98" H 5425 4050 50  0001 C CNN "kicost:RF_Supplier:pricing"
F 12 "soip" H 5425 4050 50  0001 C CNN "variant"
	1    5425 4050
	-1   0    0    -1  
$EndComp
$Comp
L project:SMA_2 J21
U 1 1 5D4C56AE
P 11400 8175
F 0 "J21" H 11503 8165 50  0000 L CNN
F 1 "DNF" H 11503 8074 50  0000 L CNN
F 2 "MMCX_Connectors:mmcx_th" H 8175 4025 50  0001 C CNN
F 3 "" H 8000 4125 60  0000 C CNN
F 4 "Amphenol" H 11400 8175 50  0001 C CNN "MFN"
F 5 "901-143-6RFX" H 11400 8175 50  0001 C CNN "MFP"
F 6 "S01-RJPT4-11BS00" H 11400 8175 50  0001 C CNN "S1PN"
F 7 "Superbat" H 11400 8175 50  0001 C CNN "S1PL"
F 8 "901-143-6RFX" H 11400 8175 50  0001 C CNN "S2PN"
F 9 "TTI" H 11400 8175 50  0001 C CNN "S2PL"
F 10 "SMA Coaxial Connector R/A PCB RECEPTACLE" H 11400 8175 50  0001 C CNN "Description"
F 11 "1" H 11400 8175 50  0001 C CNN "DNP"
F 12 "sot" H 11400 8175 50  0001 C CNN "variant"
	1    11400 8175
	1    0    0    -1  
$EndComp
$Comp
L project:SMA_2 J3
U 1 1 5D4CA9AA
P 11275 3425
F 0 "J3" H 11378 3415 50  0000 L CNN
F 1 "DNF" H 11378 3324 50  0000 L CNN
F 2 "MMCX_Connectors:mmcx_th" H 8050 -725 50  0001 C CNN
F 3 "" H 7875 -625 60  0000 C CNN
F 4 "Amphenol" H 11275 3425 50  0001 C CNN "MFN"
F 5 "901-143-6RFX" H 11275 3425 50  0001 C CNN "MFP"
F 6 "S01-RJPT4-11BS00" H 11275 3425 50  0001 C CNN "S1PN"
F 7 "Superbat" H 11275 3425 50  0001 C CNN "S1PL"
F 8 "901-143-6RFX" H 11275 3425 50  0001 C CNN "S2PN"
F 9 "TTI" H 11275 3425 50  0001 C CNN "S2PL"
F 10 "SMA Coaxial Connector R/A PCB RECEPTACLE" H 11275 3425 50  0001 C CNN "Description"
F 11 "soip" H 11275 3425 50  0001 C CNN "variant"
F 12 "1" H 11275 3425 50  0001 C CNN "DNP"
	1    11275 3425
	1    0    0    -1  
$EndComp
$Comp
L project:SMA_2 J4
U 1 1 5D4D0447
P 5425 3550
F 0 "J4" H 5528 3540 50  0000 L CNN
F 1 "DNF" H 5528 3449 50  0000 L CNN
F 2 "MMCX_Connectors:mmcx_th" H 2200 -600 50  0001 C CNN
F 3 "" H 2025 -500 60  0000 C CNN
F 4 "Amphenol" H 5425 3550 50  0001 C CNN "MFN"
F 5 "901-143-6RFX" H 5425 3550 50  0001 C CNN "MFP"
F 6 "S01-RJPT4-11BS00" H 5425 3550 50  0001 C CNN "S1PN"
F 7 "Superbat" H 5425 3550 50  0001 C CNN "S1PL"
F 8 "901-143-6RFX" H 5425 3550 50  0001 C CNN "S2PN"
F 9 "TTI" H 5425 3550 50  0001 C CNN "S2PL"
F 10 "SMA Coaxial Connector R/A PCB RECEPTACLE" H 5425 3550 50  0001 C CNN "Description"
F 11 "soip" H 5425 3550 50  0001 C CNN "variant"
F 12 "1" H 5425 3550 50  0001 C CNN "DNP"
	1    5425 3550
	-1   0    0    -1  
$EndComp
$Comp
L device:L_Small FB2
U 1 1 5D4D6413
P 9050 2350
F 0 "FB2" H 9100 2375 50  0000 L CNN
F 1 "220 ohm" H 9097 2305 50  0000 L CNN
F 2 "Inductor_SMD:L_0805_2012Metric" H 1250 -425 60  0001 C CNN
F 3 "" H 1250 -425 60  0000 C CNN
F 4 "Murata" H 9050 2350 60  0001 C CNN "MFN"
F 5 "BLM21PG221SN1D " H 9050 2350 60  0001 C CNN "MFP"
F 6 "490-1054-1-ND" H 9050 2350 60  0001 C CNN "S1PN"
F 7 "Digi-Key" H 9050 2350 60  0001 C CNN "S1PL"
F 8 "81-BLM21P221SG" H 9050 2350 60  0001 C CNN "S2PN"
F 9 "Mouser" H 9050 2350 60  0001 C CNN "S2PL"
F 10 "~" H 9050 2350 60  0001 C CNN "Characteristics"
F 11 "FERRITE BEAD 220 OHM" H 9050 2350 60  0001 C CNN "Description"
F 12 "0805" H 9050 2350 60  0001 C CNN "Package ID"
F 13 "~" H 9050 2350 60  0001 C CNN "Source"
F 14 "N" H 9050 2350 60  0001 C CNN "Critical"
F 15 "~" H 9050 2350 60  0001 C CNN "Notes"
F 16 "soip" H 9050 2350 50  0001 C CNN "variant"
	1    9050 2350
	1    0    0    -1  
$EndComp
$Comp
L graphics:Logo_Open_Hardware_Small #LOGO1
U 1 1 5D7BB9F0
P 3975 9050
F 0 "#LOGO1" H 3975 9325 50  0001 C CNN
F 1 "Logo_Open_Hardware_Small" H 3975 8825 50  0001 C CNN
F 2 "" H 3975 9050 50  0001 C CNN
F 3 "~" H 3975 9050 50  0001 C CNN
	1    3975 9050
	1    0    0    -1  
$EndComp
Text Notes 3525 8750 0    50   ~ 0
Open Source Hardware
Wire Wire Line
	5950 800  5550 800 
Wire Wire Line
	5550 800  5550 1250
Wire Wire Line
	6250 800  6650 800 
Wire Wire Line
	6650 800  6650 1250
Text Notes 6725 925  0    80   ~ 0
For off board power regulation\nreplace U3 with R25.
$Comp
L device:R R25
U 1 1 5D89CE9F
P 6100 800
F 0 "R25" V 5893 800 50  0000 C CNN
F 1 "0 (opt)" V 5984 800 50  0000 C CNN
F 2 "Resistor_SMD:R_1206_3216Metric" V -1570 -2200 30  0001 C CNN
F 3 "" H -1500 -2200 30  0000 C CNN
F 4 "Yageo" H 6100 800 60  0001 C CNN "MFN"
F 5 "RC1206JR-070RL" H 6100 800 60  0001 C CNN "MFP"
F 6 "603-RC1206JR-070RL" H 6100 800 60  0001 C CNN "S1PN"
F 7 "Mouser" H 6100 800 60  0001 C CNN "S1PL"
F 8 "311-0.0ERCT-ND" H 6100 800 60  0001 C CNN "S2PN"
F 9 "Digi-Key" H 6100 800 60  0001 C CNN "S2PL"
F 10 "~" H 6100 800 60  0001 C CNN "Characteristics"
F 11 "RES SMD 0 OHM JUMPER 1/4W 1206" H 6100 800 60  0001 C CNN "Description"
F 12 "1206 (3216 Metric)" H 6100 800 60  0001 C CNN "Package ID"
F 13 "~" H 6100 800 60  0001 C CNN "Source"
F 14 "N" H 6100 800 60  0001 C CNN "Critical"
F 15 "~" H 6100 800 60  0001 C CNN "Notes"
F 16 "soip, extreg" V 6100 800 50  0001 C CNN "variant"
	1    6100 800 
	0    1    1    0   
$EndComp
$Comp
L connector:Conn_01x02_Male P4
U 1 1 5E9B58B1
P 3850 1350
F 0 "P4" H 3769 1075 50  0000 C CNN
F 1 "+10V" H 3769 1166 50  0000 C CNN
F 2 "Connector_PinHeader_2.54mm:PinHeader_1x02_P2.54mm_Vertical" H -4600 -500 60  0001 C CNN
F 3 "" H -4600 -500 60  0000 C CNN
F 4 "Nextron" H 3850 1350 50  0001 C CNN "MFN"
F 5 "Z-211-0211-0021-001" H 3850 1350 50  0001 C CNN "MFP"
F 6 "C152154" H 3850 1350 50  0001 C CNN "S1PN"
F 7 "LCSC" H 3850 1350 50  0001 C CNN "S1PL"
F 8 "Pin Header Male Pin 0.100\"(2.54mm) 2 pin" H 3850 1350 50  0001 C CNN "Description"
F 9 "Through Hole,P=2.54mm" H 3850 1350 50  0001 C CNN "Package ID"
F 10 "soip" H 3850 1350 50  0001 C CNN "variant"
F 11 "1:$0.025034; 20:$0.025034; 200:$0.01825" H 3850 1350 50  0001 C CNN "kicost:LCSC:pricing"
F 12 "https://lcsc.com/product-detail/Pin-Header-Female-Header_nextron-Nextronics-Engineering-Z-211-0211-0021-001_C152154.html" H 3850 1350 50  0001 C CNN "kicost:LCSC:link"
	1    3850 1350
	1    0    0    1   
$EndComp
Wire Wire Line
	7025 6000 8325 6000
$Comp
L device:R X5
U 1 1 5E818CF0
P 6975 8800
F 0 "X5" V 6850 8800 50  0000 C CNN
F 1 "0" V 6975 8800 50  0000 C CNN
F 2 "Capacitor_SMD:C_0603_1608Metric" V -695 5800 30  0001 C CNN
F 3 "" H -625 5800 30  0000 C CNN
F 4 "Yageo" H 11675 8700 50  0001 C CNN "MFN"
F 5 "RC0603JR-070RL" H 11675 8700 50  0001 C CNN "MFP"
F 6 "603-RC0603JR-070RL" H 11675 8700 50  0001 C CNN "S1PN"
F 7 "Mouser" H 11675 8700 50  0001 C CNN "S1PL"
F 8 "311-0.0GRCT-ND" H 11675 8700 50  0001 C CNN "S2PN"
F 9 "Digi-Key" H 11675 8700 50  0001 C CNN "S2PL"
F 10 "0 Ohms Jumper 0.1W, 1/10W, 0603" H 11675 8700 50  0001 C CNN "Description"
F 11 "0603 (1608 Metric)" H 11675 8700 50  0001 C CNN "Package ID"
F 12 "~" H 6975 8800 60  0001 C CNN "Source"
F 13 "N" H 6975 8800 60  0001 C CNN "Critical"
F 14 "~" H 6975 8800 60  0001 C CNN "Notes"
F 15 "sot" V 6975 8800 50  0001 C CNN "variant"
	1    6975 8800
	0    1    1    0   
$EndComp
$Comp
L power:GND #PWR014
U 1 1 5F17EDBB
P 10900 9100
F 0 "#PWR014" H 10950 9150 50  0001 C CNN
F 1 "GND" H 10905 8927 50  0000 C CNN
F 2 "" H 3350 4425 60  0000 C CNN
F 3 "" H 3350 4425 60  0000 C CNN
	1    10900 9100
	1    0    0    -1  
$EndComp
Wire Wire Line
	10900 8800 10900 8700
$Comp
L device:D_Zener D1
U 1 1 5F17E28C
P 10900 8950
F 0 "D1" V 10854 9030 50  0000 L CNN
F 1 "DNF" V 10945 9030 50  0000 L CNN
F 2 "Resistor_SMD:R_0805_2012Metric" H 10900 8950 50  0001 C CNN
F 3 "~" H 10900 8950 50  0001 C CNN
	1    10900 8950
	0    1    1    0   
$EndComp
NoConn ~ 9150 4300
$Comp
L project:OPA847_SOIC U4
U 1 1 5F19DFFA
P 9150 3950
F 0 "U4" H 9250 4150 60  0000 L CNN
F 1 "OPA847_SOIC" H 9250 3700 60  0000 L CNN
F 2 "Package_SO:SO-8_3.9x4.9mm_P1.27mm" H 9150 3950 60  0001 C CNN
F 3 "" H 9150 3950 60  0000 C CNN
	1    9150 3950
	1    0    0    -1  
$EndComp
Text Notes 11200 6725 0    50   ~ 0
Gain (dB)
Text Notes 11750 6725 0    50   ~ 0
R7
Wire Notes Line style solid
	11050 6750 12000 6750
Text Notes 11325 6875 0    50   ~ 0
14
Text Notes 11325 6975 0    50   ~ 0
20
Text Notes 11325 7075 0    50   ~ 0
27
Text Notes 11725 6875 0    50   ~ 0
360
Text Notes 11725 6975 0    50   ~ 0
820
Text Notes 11725 7075 0    50   ~ 0
1.8k
Wire Notes Line style solid
	11625 6625 11625 7125
$EndSCHEMATC
