(module SMA_EDGE_3 (layer F.Cu) (tedit 5B8E4E2F)
  (fp_text reference J3 (at 3.3655 -2.3749 -90) (layer F.SilkS)
    (effects (font (size 0.8128 0.8128) (thickness 0.1524)) hide)
  )
  (fp_text value SMA_2 (at 3.5052 -4.4831 -90) (layer F.SilkS)
    (effects (font (size 1 1) (thickness 0.15)) hide)
  )
  (pad 2 smd rect (at 4.40436 -0.41148) (size 2.413 5.08) (layers F.Cu F.Mask)
    (zone_connect 2))
  (pad 2 smd rect (at 2.54 0.1524) (size 1.5 3.95) (layers F.Cu F.Mask)
    (zone_connect 2))
  (pad 2 smd rect (at -2.54 0.1524) (size 1.5 3.95) (layers F.Cu F.Mask)
    (zone_connect 2))
  (pad 2 smd rect (at -4.39928 -0.41148) (size 2.413 5.08) (layers F.Cu F.Mask)
    (zone_connect 2))
  (pad 2 smd rect (at 4.40436 -0.41148) (size 2.413 5.08) (layers B.Cu B.Mask)
    (zone_connect 2))
  (pad 2 smd rect (at -4.39928 -0.41148) (size 2.413 5.08) (layers B.Cu B.Mask)
    (zone_connect 2))
  (pad 2 smd rect (at 2.54 0.1524) (size 1.5 3.95) (layers B.Cu B.Mask)
    (zone_connect 2))
  (pad 2 smd rect (at -2.54 0.1524) (size 1.5 3.95) (layers B.Cu B.Mask)
    (zone_connect 2))
  (pad 1 smd rect (at 0 0) (size 2.032 4.25) (layers F.Cu F.Mask)
    (solder_mask_margin 0.254))
  (model /Users/timm/Documents/Electronics/Designs/Modules/packages3d/sma_EndLaunch.wrl
    (at (xyz 0 0 0.35))
    (scale (xyz 0.5 0.5 0.5))
    (rotate (xyz 0 0 0))
  )
)
