EESchema Schematic File Version 4
EELAYER 30 0
EELAYER END
$Descr A4 11693 8268
encoding utf-8
Sheet 1 1
Title "INA-10386 Amplifier"
Date "2020-12-16"
Rev "2.5"
Comp "Dyadic Pty Ltd"
Comment1 "2020"
Comment2 ""
Comment3 ""
Comment4 ""
$EndDescr
$Comp
L INA-10386-rescue:C-device C1
U 1 1 51C102FD
P 3475 3200
F 0 "C1" H 3525 3300 50  0000 L CNN
F 1 "0.01uF" H 3525 3100 50  0000 L CNN
F 2 "Capacitor_SMD:C_0603_1608Metric" H 3475 3200 60  0001 C CNN
F 3 "" H 3475 3200 60  0001 C CNN
F 4 "Kemet" H 3475 3200 50  0001 C CNN "MFN"
F 5 "C0603C103K5RACTU" H 3475 3200 50  0001 C CNN "MFP"
F 6 "399-1091-1-ND" H 3475 3200 50  0001 C CNN "S1PN"
F 7 "Digi-Key" H 3475 3200 50  0001 C CNN "S1PL"
F 8 "80-C0603C103K5R" H 3475 3200 50  0001 C CNN "S2PN"
F 9 "Mouser" H 3475 3200 50  0001 C CNN "S2PL"
F 10 "Multilayer Ceramic Capacitors MLCC - SMD/SMT 50V 0.01uF 0603 X7R 10%" H 3475 3200 50  0001 C CNN "Description"
F 11 "0603 (1608 metric)" H 3475 3200 50  0001 C CNN "Package ID"
F 12 "sot86" H 3475 3200 50  0001 C CNN "variant"
	1    3475 3200
	1    0    0    -1  
$EndComp
$Comp
L power:GND #PWR01
U 1 1 51C10301
P 3475 3350
F 0 "#PWR01" H 3475 3350 30  0001 C CNN
F 1 "GND" H 3475 3280 30  0001 C CNN
F 2 "" H 3475 3350 60  0001 C CNN
F 3 "" H 3475 3350 60  0001 C CNN
	1    3475 3350
	1    0    0    -1  
$EndComp
$Comp
L INA-10386-rescue:C-device C2
U 1 1 51C10303
P 4275 3200
F 0 "C2" H 4325 3300 50  0000 L CNN
F 1 "0.1uF" H 4325 3100 50  0000 L CNN
F 2 "Capacitor_SMD:C_0603_1608Metric" H 4275 3200 60  0001 C CNN
F 3 "" H 4275 3200 60  0001 C CNN
F 4 "Kemet" H 4275 3200 50  0001 C CNN "MFN"
F 5 "C0603C104J4RACTU" H 4275 3200 50  0001 C CNN "MFP"
F 6 "399-1097-1-ND" H 4275 3200 50  0001 C CNN "S1PN"
F 7 "Digi-Key" H 4275 3200 50  0001 C CNN "S1PL"
F 8 "80-C0603C104J4R" H 4275 3200 50  0001 C CNN "S2PN"
F 9 "Mouser" H 4275 3200 50  0001 C CNN "S2PL"
F 10 "CAP CER 0.1UF 16V X7R 0603" H 4275 3200 50  0001 C CNN "Description"
F 11 "0603 (1608 Metric)" H 4275 3200 50  0001 C CNN "Package ID"
F 12 "sot86" H 4275 3200 50  0001 C CNN "variant"
	1    4275 3200
	1    0    0    -1  
$EndComp
$Comp
L power:GND #PWR02
U 1 1 51C10304
P 4275 3350
F 0 "#PWR02" H 4275 3350 30  0001 C CNN
F 1 "GND" H 4275 3280 30  0001 C CNN
F 2 "" H 4275 3350 60  0001 C CNN
F 3 "" H 4275 3350 60  0001 C CNN
	1    4275 3350
	1    0    0    -1  
$EndComp
$Comp
L power:GND #PWR03
U 1 1 51C10308
P 5375 3350
F 0 "#PWR03" H 5375 3350 30  0001 C CNN
F 1 "GND" H 5375 3280 30  0001 C CNN
F 2 "" H 5375 3350 60  0001 C CNN
F 3 "" H 5375 3350 60  0001 C CNN
	1    5375 3350
	1    0    0    -1  
$EndComp
Wire Wire Line
	3975 2900 4275 2900
Wire Wire Line
	4275 3050 4275 2900
Connection ~ 4275 2900
Wire Wire Line
	3475 3050 3475 2900
Wire Wire Line
	5375 3050 5375 2900
Connection ~ 5375 2900
$Comp
L INA-10386-rescue:C-device C6
U 1 1 51C1030A
P 8025 3200
F 0 "C6" H 8075 3300 50  0000 L CNN
F 1 "100pF" H 8075 3100 50  0000 L CNN
F 2 "Capacitor_SMD:C_0603_1608Metric" H 8025 3200 60  0001 C CNN
F 3 "" H 8025 3200 60  0001 C CNN
F 4 "Yageo" H 8025 3200 50  0001 C CNN "MFN"
F 5 "CC0603JRNPO9BN101" H 8025 3200 50  0001 C CNN "MFP"
F 6 "311-1069-1-ND" H 8025 3200 50  0001 C CNN "S1PN"
F 7 "Digi-Key" H 8025 3200 50  0001 C CNN "S1PL"
F 8 "603-CC603JRNPO9BN101" H 8025 3200 50  0001 C CNN "S2PN"
F 9 "Mouser" H 8025 3200 50  0001 C CNN "S2PL"
F 10 "100pF ±5% 50V Ceramic Capacitor C0G, NP0" H 8025 3200 50  0001 C CNN "Description"
F 11 "0603 (1608 Metric)" H 8025 3200 50  0001 C CNN "Package ID"
F 12 "sot86" H 8025 3200 50  0001 C CNN "variant"
	1    8025 3200
	1    0    0    -1  
$EndComp
Wire Wire Line
	8425 2900 8425 3050
Wire Wire Line
	8025 3050 8025 2900
Connection ~ 8025 2900
Wire Wire Line
	7525 3050 7525 2900
Connection ~ 7525 2900
Wire Wire Line
	6525 3050 6525 2900
Connection ~ 6525 2900
$Comp
L power:GND #PWR08
U 1 1 51C10319
P 3050 3400
F 0 "#PWR08" H 3050 3400 30  0001 C CNN
F 1 "GND" H 3050 3330 30  0001 C CNN
F 2 "" H 3050 3400 60  0001 C CNN
F 3 "" H 3050 3400 60  0001 C CNN
	1    3050 3400
	1    0    0    -1  
$EndComp
Wire Wire Line
	3050 3000 3050 3250
$Comp
L power:GND #PWR04
U 1 1 51C1031A
P 6525 3350
F 0 "#PWR04" H 6525 3350 30  0001 C CNN
F 1 "GND" H 6525 3280 30  0001 C CNN
F 2 "" H 6525 3350 60  0001 C CNN
F 3 "" H 6525 3350 60  0001 C CNN
	1    6525 3350
	1    0    0    -1  
$EndComp
$Comp
L power:GND #PWR05
U 1 1 51C1031B
P 7525 3350
F 0 "#PWR05" H 7525 3350 30  0001 C CNN
F 1 "GND" H 7525 3280 30  0001 C CNN
F 2 "" H 7525 3350 60  0001 C CNN
F 3 "" H 7525 3350 60  0001 C CNN
	1    7525 3350
	1    0    0    -1  
$EndComp
$Comp
L power:GND #PWR06
U 1 1 51C1031C
P 8025 3350
F 0 "#PWR06" H 8025 3350 30  0001 C CNN
F 1 "GND" H 8025 3280 30  0001 C CNN
F 2 "" H 8025 3350 60  0001 C CNN
F 3 "" H 8025 3350 60  0001 C CNN
	1    8025 3350
	1    0    0    -1  
$EndComp
$Comp
L power:GND #PWR07
U 1 1 51C1031D
P 8425 3350
F 0 "#PWR07" H 8425 3350 30  0001 C CNN
F 1 "GND" H 8425 3280 30  0001 C CNN
F 2 "" H 8425 3350 60  0001 C CNN
F 3 "" H 8425 3350 60  0001 C CNN
	1    8425 3350
	1    0    0    -1  
$EndComp
$Comp
L INA-10386-rescue:R-device X5
U 1 1 51C10322
P 4450 4500
F 0 "X5" H 4300 4450 50  0000 C CNN
F 1 "DNF" H 4300 4550 50  0000 C CNN
F 2 "Capacitor_SMD:C_0603_1608Metric" H 4450 4500 60  0001 C CNN
F 3 "" H 4450 4500 60  0001 C CNN
F 4 "sot86" H 4450 4500 50  0001 C CNN "variant"
F 5 "1" H 4450 4500 50  0001 C CNN "DNP"
	1    4450 4500
	-1   0    0    1   
$EndComp
$Comp
L INA-10386-rescue:R-device X6
U 1 1 51C10325
P 4225 4750
F 0 "X6" V 4400 4750 50  0000 C CNN
F 1 "DNF" V 4325 4750 50  0000 C CNN
F 2 "Capacitor_SMD:C_0603_1608Metric" H 4225 4750 60  0001 C CNN
F 3 "" H 4225 4750 60  0001 C CNN
F 4 "sot86" H 4225 4750 50  0001 C CNN "variant"
F 5 "1" H 4225 4750 50  0001 C CNN "DNP"
	1    4225 4750
	0    -1   -1   0   
$EndComp
$Comp
L INA-10386-rescue:R-device X9
U 1 1 51C10328
P 8850 4500
F 0 "X9" H 8700 4550 50  0000 C CNN
F 1 "DNF" H 8700 4450 50  0000 C CNN
F 2 "Capacitor_SMD:C_0603_1608Metric" H 8850 4500 60  0001 C CNN
F 3 "" H 8850 4500 60  0001 C CNN
F 4 "sot86" H 8850 4500 50  0001 C CNN "variant"
F 5 "1" H 8850 4500 50  0001 C CNN "DNP"
	1    8850 4500
	1    0    0    -1  
$EndComp
$Comp
L INA-10386-rescue:R-device X8
U 1 1 51C1032A
P 8200 4500
F 0 "X8" H 8050 4450 50  0000 C CNN
F 1 "DNF" H 8050 4550 50  0000 C CNN
F 2 "Capacitor_SMD:C_0603_1608Metric" H 8200 4500 60  0001 C CNN
F 3 "" H 8200 4500 60  0001 C CNN
F 4 "sot86" H 8200 4500 50  0001 C CNN "variant"
F 5 "1" H 8200 4500 50  0001 C CNN "DNP"
	1    8200 4500
	-1   0    0    1   
$EndComp
Wire Wire Line
	3175 4150 3325 4150
Wire Wire Line
	4325 4150 4450 4150
Wire Wire Line
	5600 4150 5750 4150
Wire Wire Line
	6875 4150 7075 4150
Wire Wire Line
	7500 4150 7775 4150
$Comp
L power:GND #PWR017
U 1 1 51C1032B
P 8850 4650
F 0 "#PWR017" H 8850 4650 30  0001 C CNN
F 1 "GND" H 8850 4580 30  0001 C CNN
F 2 "" H 8850 4650 60  0001 C CNN
F 3 "" H 8850 4650 60  0001 C CNN
	1    8850 4650
	1    0    0    -1  
$EndComp
$Comp
L power:GND #PWR010
U 1 1 51C1032C
P 6475 4450
F 0 "#PWR010" H 6475 4450 30  0001 C CNN
F 1 "GND" H 6475 4380 30  0001 C CNN
F 2 "" H 6475 4450 60  0001 C CNN
F 3 "" H 6475 4450 60  0001 C CNN
	1    6475 4450
	1    0    0    -1  
$EndComp
$Comp
L power:GND #PWR09
U 1 1 51C1032D
P 6475 3850
F 0 "#PWR09" H 6475 3850 30  0001 C CNN
F 1 "GND" H 6475 3780 30  0001 C CNN
F 2 "" H 6475 3850 60  0001 C CNN
F 3 "" H 6475 3850 60  0001 C CNN
	1    6475 3850
	-1   0    0    1   
$EndComp
Connection ~ 7075 4150
$Comp
L power:GND #PWR013
U 1 1 51C1032E
P 4000 4850
F 0 "#PWR013" H 4000 4850 30  0001 C CNN
F 1 "GND" H 4000 4780 30  0001 C CNN
F 2 "" H 4000 4850 60  0001 C CNN
F 3 "" H 4000 4850 60  0001 C CNN
	1    4000 4850
	1    0    0    -1  
$EndComp
$Comp
L power:GND #PWR016
U 1 1 51C10330
P 8200 4650
F 0 "#PWR016" H 8200 4650 30  0001 C CNN
F 1 "GND" H 8200 4580 30  0001 C CNN
F 2 "" H 8200 4650 60  0001 C CNN
F 3 "" H 8200 4650 60  0001 C CNN
	1    8200 4650
	1    0    0    -1  
$EndComp
Wire Wire Line
	8650 4150 8850 4150
Wire Wire Line
	8850 4350 8850 4150
Connection ~ 8850 4150
Wire Wire Line
	8200 4350 8200 4150
Connection ~ 8200 4150
$Comp
L power:PWR_FLAG #FLG01
U 1 1 51C10341
P 3050 3250
F 0 "#FLG01" H 3050 3345 30  0001 C CNN
F 1 "PWR_FLAG" H 3050 3430 30  0000 C CNN
F 2 "" H 3050 3250 60  0001 C CNN
F 3 "" H 3050 3250 60  0001 C CNN
	1    3050 3250
	0    -1   -1   0   
$EndComp
Connection ~ 3050 3250
Text Notes 9950 4000 0    60   ~ 0
A-RF Out
Text Notes 2175 3975 0    60   ~ 0
A-RF In
$Comp
L INA-10386-rescue:R-device X4
U 1 1 51C10464
P 3325 4500
F 0 "X4" H 3175 4450 50  0000 C CNN
F 1 "DNF" H 3175 4550 50  0000 C CNN
F 2 "Capacitor_SMD:C_0603_1608Metric" H 3325 4500 60  0001 C CNN
F 3 "" H 3325 4500 60  0001 C CNN
F 4 "sot86" H 3325 4500 50  0001 C CNN "variant"
F 5 "1" H 3325 4500 50  0001 C CNN "DNP"
	1    3325 4500
	-1   0    0    1   
$EndComp
$Comp
L INA-10386-rescue:R-device X10
U 1 1 51C104E5
P 9300 4500
F 0 "X10" H 9150 4550 50  0000 C CNN
F 1 "DNF" H 9150 4450 50  0000 C CNN
F 2 "Capacitor_SMD:C_0603_1608Metric" H 9300 4500 60  0001 C CNN
F 3 "" H 9300 4500 60  0001 C CNN
F 4 "sot86" H 9300 4500 50  0001 C CNN "variant"
F 5 "1" H 9300 4500 50  0001 C CNN "DNP"
	1    9300 4500
	1    0    0    -1  
$EndComp
Wire Wire Line
	3325 4350 3325 4150
Connection ~ 3325 4150
$Comp
L power:GND #PWR011
U 1 1 51C10E56
P 3325 4650
F 0 "#PWR011" H 3325 4650 30  0001 C CNN
F 1 "GND" H 3325 4580 30  0001 C CNN
F 2 "" H 3325 4650 60  0001 C CNN
F 3 "" H 3325 4650 60  0001 C CNN
	1    3325 4650
	1    0    0    -1  
$EndComp
$Comp
L INA-10386-rescue:R-device X7
U 1 1 51C10F84
P 5750 4500
F 0 "X7" H 5900 4450 50  0000 C CNN
F 1 "DNF" H 5900 4550 50  0000 C CNN
F 2 "Capacitor_SMD:C_0603_1608Metric" H 5750 4500 60  0001 C CNN
F 3 "" H 5750 4500 60  0001 C CNN
F 4 "sot86" H 5750 4500 50  0001 C CNN "variant"
F 5 "1" H 5750 4500 50  0001 C CNN "DNP"
	1    5750 4500
	-1   0    0    1   
$EndComp
$Comp
L power:GND #PWR014
U 1 1 51C10F8A
P 5750 4650
F 0 "#PWR014" H 5750 4650 30  0001 C CNN
F 1 "GND" H 5750 4580 30  0001 C CNN
F 2 "" H 5750 4650 60  0001 C CNN
F 3 "" H 5750 4650 60  0001 C CNN
	1    5750 4650
	1    0    0    -1  
$EndComp
Wire Wire Line
	5750 4350 5750 4150
Connection ~ 5750 4150
$Comp
L INA-10386-rescue:C-device C10
U 1 1 51C12F57
P 7775 4500
F 0 "C10" H 7825 4600 50  0000 L CNN
F 1 "DNF" H 7825 4400 50  0000 L CNN
F 2 "Capacitor_SMD:C_0603_1608Metric" H 7775 4500 60  0001 C CNN
F 3 "" H 7775 4500 60  0001 C CNN
F 4 "sot86" H 7775 4500 50  0001 C CNN "variant"
F 5 "1" H 7775 4500 50  0001 C CNN "DNP"
	1    7775 4500
	1    0    0    -1  
$EndComp
$Comp
L power:GND #PWR015
U 1 1 51C12F63
P 7775 4650
F 0 "#PWR015" H 7775 4650 30  0001 C CNN
F 1 "GND" H 7775 4580 30  0001 C CNN
F 2 "" H 7775 4650 60  0001 C CNN
F 3 "" H 7775 4650 60  0001 C CNN
	1    7775 4650
	1    0    0    -1  
$EndComp
$Comp
L power:GND #PWR018
U 1 1 51C1306D
P 9300 4650
F 0 "#PWR018" H 9300 4650 30  0001 C CNN
F 1 "GND" H 9300 4580 30  0001 C CNN
F 2 "" H 9300 4650 60  0001 C CNN
F 3 "" H 9300 4650 60  0001 C CNN
	1    9300 4650
	1    0    0    -1  
$EndComp
Wire Wire Line
	9300 4350 9300 4150
Wire Wire Line
	2950 3000 3050 3000
Wire Wire Line
	7775 4350 7775 4150
Connection ~ 7775 4150
$Comp
L INA-10386-rescue:GALI49-project U1
U 1 1 550CED70
P 6475 4150
F 0 "U1" H 6575 4350 50  0000 L BNN
F 1 "QPA4586" H 6575 3950 50  0000 L BNN
F 2 "Minicircuits_2:WW107" H 6475 4300 50  0001 C CNN
F 3 "" H 6475 4150 60  0000 C CNN
F 4 "Qorvo" H 6475 4150 50  0001 C CNN "MFN"
F 5 "qpa4586atr13" H 6475 4150 50  0001 C CNN "MFP"
F 6 "772-QPA4586ATR13" H 6475 4150 50  0001 C CNN "S1PN"
F 7 "Mouser" H 6475 4150 50  0001 C CNN "S1PL"
F 8 "RF Amplifier DC-4GHz Gain 19.9dB" H 6475 4150 50  0001 C CNN "Description"
F 9 "SOT-86-4" H 6475 4150 50  0001 C CNN "Package ID"
F 10 "sot86" H 6475 4150 50  0001 C CNN "variant"
	1    6475 4150
	1    0    0    -1  
$EndComp
Wire Wire Line
	2950 2900 3475 2900
Wire Wire Line
	3475 2900 3775 2900
Wire Wire Line
	8025 2900 8425 2900
Wire Wire Line
	7525 2900 8025 2900
Wire Wire Line
	7075 4150 7200 4150
Wire Wire Line
	8850 4150 9300 4150
Wire Wire Line
	8200 4150 8350 4150
Wire Wire Line
	3050 3250 3050 3400
Wire Wire Line
	5750 4150 6175 4150
Wire Wire Line
	7775 4150 8200 4150
$Comp
L INA-10386-rescue:Ferrite_Bead_Small-device FB1
U 1 1 5C6B82B2
P 3875 2900
F 0 "FB1" V 3730 2900 50  0000 C CNN
F 1 "~" V 3729 2900 50  0000 C CNN
F 2 "Inductor_SMD:L_0805_2012Metric" V 3805 2900 50  0001 C CNN
F 3 "~" H 3875 2900 50  0001 C CNN
F 4 "Murata Electronics" H 5225 4625 50  0001 C CNN "MFN"
F 5 "BLM21PG221SN1D" H 5225 4625 50  0001 C CNN "MFP"
F 6 "81-BLM21P221SG" H 5225 4625 50  0001 C CNN "S1PN"
F 7 "Mouser" H 5225 4625 50  0001 C CNN "S1PL"
F 8 "490-1054-1-ND" H 5225 4625 50  0001 C CNN "S2PN"
F 9 "Digi-Key" H 5225 4625 50  0001 C CNN "S2PL"
F 10 "FERRITE BEAD 220 OHM 0805 1LN" H 5225 4625 50  0001 C CNN "Description"
F 11 "0805 (2012 Metric)" H 5225 4625 50  0001 C CNN "Package ID"
F 12 "sot86" V 3875 2900 50  0001 C CNN "variant"
	1    3875 2900
	0    1    1    0   
$EndComp
$Comp
L INA-10386-rescue:CP-device C5
U 1 1 5C6C045C
P 7525 3200
F 0 "C5" H 7600 3300 50  0000 L CNN
F 1 "10u/16V" H 7575 3100 50  0000 L CNN
F 2 "Capacitor_Tantalum_SMD:CP_EIA-3216-12_Kemet-S" H 7563 3050 50  0001 C CNN
F 3 "~" H 7525 3200 50  0001 C CNN
F 4 "Kemet" H 7525 3200 50  0001 C CNN "MFN"
F 5 "T491A106K016AT" H 7525 3200 50  0001 C CNN "MFP"
F 6 "80-T491A106K016" H 7525 3200 50  0001 C CNN "S1PN"
F 7 "Mouser" H 7525 3200 50  0001 C CNN "S1PL"
F 8 "399-8269-1-ND" H 7525 3200 50  0001 C CNN "S2PN"
F 9 "Digi-Key" H 7525 3200 50  0001 C CNN "S2PL"
F 10 "10µF Molded Tantalum Capacitors 16V 3 Ohm ESR" H 7525 3200 50  0001 C CNN "Description"
F 11 "1206 (3216 Metric) " H 7525 3200 50  0001 C CNN "Package ID"
F 12 "sot86" H 7525 3200 50  0001 C CNN "variant"
	1    7525 3200
	1    0    0    -1  
$EndComp
Wire Wire Line
	6525 2900 7075 2900
Connection ~ 7075 2900
Wire Wire Line
	7075 2900 7525 2900
Connection ~ 3475 2900
$Comp
L INA-10386-rescue:Logo_Open_Hardware_Small-graphics #LOGO1
U 1 1 5C70D97E
P 1450 1275
F 0 "#LOGO1" H 1450 1550 50  0001 C CNN
F 1 "Open Source Hardware" H 1450 1050 50  0000 C CNN
F 2 "" H 1450 1275 50  0001 C CNN
F 3 "~" H 1450 1275 50  0001 C CNN
	1    1450 1275
	1    0    0    -1  
$EndComp
$Comp
L INA-10386-rescue:SMA_2-project J2
U 1 1 5C78947A
P 9850 4150
F 0 "J2" H 10000 4150 50  0000 L CNN
F 1 "~" H 9953 4049 50  0000 L CNN
F 2 "RF_SMA_Connectors:SMA_EDGE_4" H 10025 4050 50  0001 C CNN
F 3 "" H 9850 4150 60  0000 C CNN
F 4 "Molex" H 4850 8875 50  0001 C CNN "MFN"
F 5 "0732511150" H 4850 8875 50  0001 C CNN "MFP"
F 6 "S01-SJEDM-11BS05" H 4850 8875 50  0001 C CNN "S1PN"
F 7 "Superbat" H 4850 8875 50  0001 C CNN "S1PL"
F 8 "73251-1150" H 4850 8875 50  0001 C CNN "S2PN"
F 9 "TTI" H 4850 8875 50  0001 C CNN "S2PL"
F 10 "SMA ST PCB-JCK" H 4850 8875 50  0001 C CNN "Description"
F 11 "sot86" H 9850 4150 50  0001 C CNN "variant"
F 12 "1:$1.20; 10:$1.08; 100:$0.98" H 9850 4150 50  0001 C CNN "kicost:RF_Supplier:pricing"
	1    9850 4150
	1    0    0    -1  
$EndComp
$Comp
L INA-10386-rescue:SMA_2-project J1
U 1 1 5C789601
P 2700 4150
F 0 "J1" H 2850 4150 50  0000 C CNN
F 1 "~" H 2669 4299 50  0000 C CNN
F 2 "RF_SMA_Connectors:SMA_EDGE_4" H 2875 4050 50  0001 C CNN
F 3 "" H 2700 4150 60  0000 C CNN
F 4 "Molex" H 4850 8875 50  0001 C CNN "MFN"
F 5 "0732511150" H 4850 8875 50  0001 C CNN "MFP"
F 6 "S01-SJEDM-11BS05" H 4850 8875 50  0001 C CNN "S1PN"
F 7 "Superbat" H 4850 8875 50  0001 C CNN "S1PL"
F 8 "07325-11150" H 4850 8875 50  0001 C CNN "S2PN"
F 9 "TTI" H 4850 8875 50  0001 C CNN "S2PL"
F 10 "SMA ST PCB-JCK" H 4850 8875 50  0001 C CNN "Description"
F 11 "sot86" H 2700 4150 50  0001 C CNN "variant"
F 12 "1:$1.20; 10:$1.08; 100:$0.98" H 2700 4150 50  0001 C CNN "kicost:RF_Supplier:pricing"
	1    2700 4150
	-1   0    0    -1  
$EndComp
$Comp
L power:GND #PWR0102
U 1 1 5C78E8EC
P 2700 4325
F 0 "#PWR0102" H 2700 4325 30  0001 C CNN
F 1 "GND" H 2700 4255 30  0001 C CNN
F 2 "" H 2700 4325 60  0001 C CNN
F 3 "" H 2700 4325 60  0001 C CNN
	1    2700 4325
	1    0    0    -1  
$EndComp
$Comp
L power:GND #PWR0103
U 1 1 5C791375
P 9850 4325
F 0 "#PWR0103" H 9850 4325 30  0001 C CNN
F 1 "GND" H 9850 4255 30  0001 C CNN
F 2 "" H 9850 4325 60  0001 C CNN
F 3 "" H 9850 4325 60  0001 C CNN
	1    9850 4325
	1    0    0    -1  
$EndComp
$Comp
L INA-10386-rescue:rfi_shield_clip-project P3
U 1 1 5C796E6C
P 9525 1625
F 0 "P3" H 9653 1644 60  0000 L CNN
F 1 "~" H 9653 1591 60  0000 L CNN
F 2 "RF_Shielding:S1721-46R" H 9525 1625 60  0001 C CNN
F 3 "" H 9525 1625 60  0000 C CNN
F 4 "Harwin Inc." H 9525 1625 50  0001 C CNN "MFN"
F 5 "S1721-46R" H 9525 1625 50  0001 C CNN "MFP"
F 6 "952-1476-1-ND" H 9525 1625 50  0001 C CNN "S1PN"
F 7 "Digi-Key" H 9525 1625 50  0001 C CNN "S1PL"
F 8 "855-S1721-46R" H 9525 1625 50  0001 C CNN "S2PN"
F 9 "Arrow" H 9525 1625 50  0001 C CNN "S2PL"
F 10 "RFI SHIELD CLIP MINI TIN SMD" H 9525 1625 50  0001 C CNN "Description"
F 11 "sot86" H 9525 1625 50  0001 C CNN "variant"
	1    9525 1625
	1    0    0    -1  
$EndComp
$Comp
L power:GND #PWR037
U 1 1 5C797178
P 9525 1725
F 0 "#PWR037" H 9525 1725 30  0001 C CNN
F 1 "GND" H 9525 1655 30  0001 C CNN
F 2 "" H 9525 1725 60  0001 C CNN
F 3 "" H 9525 1725 60  0001 C CNN
	1    9525 1725
	1    0    0    -1  
$EndComp
$Comp
L power:GND #PWR038
U 1 1 5C79736B
P 9975 1725
F 0 "#PWR038" H 9975 1725 30  0001 C CNN
F 1 "GND" H 9975 1655 30  0001 C CNN
F 2 "" H 9975 1725 60  0001 C CNN
F 3 "" H 9975 1725 60  0001 C CNN
	1    9975 1725
	1    0    0    -1  
$EndComp
$Comp
L INA-10386-rescue:R_Small-device R6
U 1 1 5C7A1E58
P 3075 3725
F 0 "R6" V 3000 3725 50  0000 C CNN
F 1 "DNF" V 3150 3725 50  0000 C CNN
F 2 "Resistor_SMD:R_0402_1005Metric" H 3075 3725 50  0001 C CNN
F 3 "~" H 3075 3725 50  0001 C CNN
F 4 "Yageo" H 3075 3725 50  0001 C CNN "MFN"
F 5 "RC0402JR-070RL" H 3075 3725 50  0001 C CNN "MFP"
F 6 "603-RC0402JR-070RL" H 3075 3725 50  0001 C CNN "S1PN"
F 7 "Mouser" H 3075 3725 50  0001 C CNN "S1PL"
F 8 "311-0.0JRCT-ND" H 3075 3725 50  0001 C CNN "S2PN"
F 9 "Digi-Key" H 3075 3725 50  0001 C CNN "S2PL"
F 10 "RES SMD 0 OHM JUMPER 1/16W 0402" H 3075 3725 50  0001 C CNN "Description"
F 11 "0402 (1005 Metric)" H 3075 3725 50  0001 C CNN "Package ID"
F 12 "sot86" V 3075 3725 50  0001 C CNN "variant"
F 13 "1" V 3075 3725 50  0001 C CNN "DNP"
	1    3075 3725
	0    1    1    0   
$EndComp
$Comp
L INA-10386-rescue:SMA_2-project J11
U 1 1 5C7A2106
P 2700 3725
F 0 "J11" H 2850 3725 50  0000 C CNN
F 1 "DNF" H 2669 3874 50  0000 C CNN
F 2 "RF_SMA_Connectors:SMA-VERT" H 2875 3625 50  0001 C CNN
F 3 "" H 2700 3725 60  0000 C CNN
F 4 "Amphenol" H 4850 8450 50  0001 C CNN "MFN"
F 5 "901-143-6RFX" H 4850 8450 50  0001 C CNN "MFP"
F 6 "S01-RJPT4-11BS00" H 4850 8450 50  0001 C CNN "S1PN"
F 7 "Superbat" H 4850 8450 50  0001 C CNN "S1PL"
F 8 "901-143-6RFX" H 4850 8450 50  0001 C CNN "S2PN"
F 9 "TTI" H 4850 8450 50  0001 C CNN "S2PL"
F 10 "SMA Coaxial Connector R/A PCB RECEPTACLE" H 4850 8450 50  0001 C CNN "Description"
F 11 "1" H 2700 3725 50  0001 C CNN "DNP"
F 12 "sot86" H 2700 3725 50  0001 C CNN "variant"
	1    2700 3725
	-1   0    0    -1  
$EndComp
$Comp
L power:GND #PWR042
U 1 1 5C7A210C
P 2700 3900
F 0 "#PWR042" H 2700 3900 30  0001 C CNN
F 1 "GND" H 2700 3830 30  0001 C CNN
F 2 "" H 2700 3900 60  0001 C CNN
F 3 "" H 2700 3900 60  0001 C CNN
	1    2700 3900
	1    0    0    -1  
$EndComp
Wire Wire Line
	2825 4150 2975 4150
Wire Wire Line
	2825 3725 2975 3725
Wire Wire Line
	3325 4150 3325 3725
Wire Wire Line
	3325 3725 3175 3725
$Comp
L INA-10386-rescue:SMA_2-project J21
U 1 1 5C7CA573
P 9850 3700
F 0 "J21" H 9800 3850 50  0000 L CNN
F 1 "DNF" H 9975 3700 50  0000 L CNN
F 2 "RF_SMA_Connectors:SMA-VERT" H 10025 3600 50  0001 C CNN
F 3 "" H 9850 3700 60  0000 C CNN
F 4 "Amphenol" H 4850 8450 50  0001 C CNN "MFN"
F 5 "901-143-6RFX" H 4850 8450 50  0001 C CNN "MFP"
F 6 "S01-RJPT4-11BS00" H 4850 8450 50  0001 C CNN "S1PN"
F 7 "Superbat" H 4850 8450 50  0001 C CNN "S1PL"
F 8 "901-143-6RFX" H 4850 8450 50  0001 C CNN "S2PN"
F 9 "TTI" H 4850 8450 50  0001 C CNN "S2PL"
F 10 "SMA Coaxial Connector R/A PCB RECEPTACLE" H 4850 8450 50  0001 C CNN "Description"
F 11 "sot86" H 9850 3700 50  0001 C CNN "variant"
F 12 "1" H 9850 3700 50  0001 C CNN "DNP"
	1    9850 3700
	1    0    0    -1  
$EndComp
$Comp
L power:GND #PWR041
U 1 1 5C7CA579
P 9850 3875
F 0 "#PWR041" H 9850 3875 30  0001 C CNN
F 1 "GND" H 9850 3805 30  0001 C CNN
F 2 "" H 9850 3875 60  0001 C CNN
F 3 "" H 9850 3875 60  0001 C CNN
	1    9850 3875
	1    0    0    -1  
$EndComp
Wire Wire Line
	9425 4150 9300 4150
Connection ~ 9300 4150
Wire Wire Line
	9300 4150 9300 3700
Wire Wire Line
	9300 3700 9425 3700
Wire Wire Line
	9625 3700 9725 3700
Wire Wire Line
	9625 4150 9725 4150
Wire Wire Line
	7075 2900 7075 3400
Wire Wire Line
	7075 3700 7075 4150
$Comp
L INA-10386-rescue:C-device C7
U 1 1 5D071601
P 8425 3200
F 0 "C7" H 8475 3300 50  0000 L CNN
F 1 "0.01uF" H 8475 3100 50  0000 L CNN
F 2 "Capacitor_SMD:C_0603_1608Metric" H 8425 3200 60  0001 C CNN
F 3 "" H 8425 3200 60  0001 C CNN
F 4 "Kemet" H 8425 3200 50  0001 C CNN "MFN"
F 5 "C0603C103K5RACTU" H 8425 3200 50  0001 C CNN "MFP"
F 6 "399-1091-1-ND" H 8425 3200 50  0001 C CNN "S1PN"
F 7 "Digi-Key" H 8425 3200 50  0001 C CNN "S1PL"
F 8 "80-C0603C103K5R" H 8425 3200 50  0001 C CNN "S2PN"
F 9 "Mouser" H 8425 3200 50  0001 C CNN "S2PL"
F 10 "Multilayer Ceramic Capacitors MLCC - SMD/SMT 50V 0.01uF 0603 X7R 10%" H 8425 3200 50  0001 C CNN "Description"
F 11 "0603 (1608 metric)" H 8425 3200 50  0001 C CNN "Package ID"
F 12 "sot86" H 8425 3200 50  0001 C CNN "variant"
	1    8425 3200
	1    0    0    -1  
$EndComp
$Comp
L INA-10386-rescue:C-device C3
U 1 1 5D07CFAC
P 5375 3200
F 0 "C3" H 5425 3300 50  0000 L CNN
F 1 "0.1uF" H 5425 3100 50  0000 L CNN
F 2 "Capacitor_SMD:C_0603_1608Metric" H 5375 3200 60  0001 C CNN
F 3 "" H 5375 3200 60  0001 C CNN
F 4 "Kemet" H 5375 3200 50  0001 C CNN "MFN"
F 5 "C0603C104J4RACTU" H 5375 3200 50  0001 C CNN "MFP"
F 6 "399-1097-1-ND" H 5375 3200 50  0001 C CNN "S1PN"
F 7 "Digi-Key" H 5375 3200 50  0001 C CNN "S1PL"
F 8 "80-C0603C104J4R" H 5375 3200 50  0001 C CNN "S2PN"
F 9 "Mouser" H 5375 3200 50  0001 C CNN "S2PL"
F 10 "CAP CER 0.1UF 16V X7R 0603" H 5375 3200 50  0001 C CNN "Description"
F 11 "0603 (1608 Metric)" H 5375 3200 50  0001 C CNN "Package ID"
	1    5375 3200
	1    0    0    -1  
$EndComp
$Comp
L INA-10386-rescue:C-device C4
U 1 1 5D080612
P 6525 3200
F 0 "C4" H 6575 3300 50  0000 L CNN
F 1 "0.1uF" H 6575 3100 50  0000 L CNN
F 2 "Capacitor_SMD:C_0603_1608Metric" H 6525 3200 60  0001 C CNN
F 3 "" H 6525 3200 60  0001 C CNN
F 4 "Kemet" H 6525 3200 50  0001 C CNN "MFN"
F 5 "C0603C104J4RACTU" H 6525 3200 50  0001 C CNN "MFP"
F 6 "399-1097-1-ND" H 6525 3200 50  0001 C CNN "S1PN"
F 7 "Digi-Key" H 6525 3200 50  0001 C CNN "S1PL"
F 8 "80-C0603C104J4R" H 6525 3200 50  0001 C CNN "S2PN"
F 9 "Mouser" H 6525 3200 50  0001 C CNN "S2PL"
F 10 "CAP CER 0.1UF 16V X7R 0603" H 6525 3200 50  0001 C CNN "Description"
F 11 "0603 (1608 Metric)" H 6525 3200 50  0001 C CNN "Package ID"
F 12 "sot86" H 6525 3200 50  0001 C CNN "variant"
	1    6525 3200
	1    0    0    -1  
$EndComp
$Comp
L INA-10386-rescue:R_Small-device R7
U 1 1 5D08F3C3
P 3075 4150
F 0 "R7" V 3000 4150 50  0000 C CNN
F 1 "0" V 3150 4150 50  0000 C CNN
F 2 "Resistor_SMD:R_0402_1005Metric" H 3075 4150 50  0001 C CNN
F 3 "~" H 3075 4150 50  0001 C CNN
F 4 "Yageo" H 3075 4150 50  0001 C CNN "MFN"
F 5 "RC0402JR-070RL" H 3075 4150 50  0001 C CNN "MFP"
F 6 "603-RC0402JR-070RL" H 3075 4150 50  0001 C CNN "S1PN"
F 7 "Mouser" H 3075 4150 50  0001 C CNN "S1PL"
F 8 "311-0.0JRCT-ND" H 3075 4150 50  0001 C CNN "S2PN"
F 9 "Digi-Key" H 3075 4150 50  0001 C CNN "S2PL"
F 10 "RES SMD 0 OHM JUMPER 1/16W 0402" H 3075 4150 50  0001 C CNN "Description"
F 11 "0402 (1005 Metric)" H 3075 4150 50  0001 C CNN "Package ID"
F 12 "sot86" V 3075 4150 50  0001 C CNN "variant"
	1    3075 4150
	0    1    1    0   
$EndComp
$Comp
L INA-10386-rescue:R_Small-device R5
U 1 1 5D092B53
P 9525 3700
F 0 "R5" V 9450 3700 50  0000 C CNN
F 1 "DNF" V 9600 3700 50  0000 C CNN
F 2 "Resistor_SMD:R_0402_1005Metric" H 9525 3700 50  0001 C CNN
F 3 "~" H 9525 3700 50  0001 C CNN
F 4 "Yageo" H 9525 3700 50  0001 C CNN "MFN"
F 5 "RC0402JR-070RL" H 9525 3700 50  0001 C CNN "MFP"
F 6 "603-RC0402JR-070RL" H 9525 3700 50  0001 C CNN "S1PN"
F 7 "Mouser" H 9525 3700 50  0001 C CNN "S1PL"
F 8 "311-0.0JRCT-ND" H 9525 3700 50  0001 C CNN "S2PN"
F 9 "Digi-Key" H 9525 3700 50  0001 C CNN "S2PL"
F 10 "RES SMD 0 OHM JUMPER 1/16W 0402" H 9525 3700 50  0001 C CNN "Description"
F 11 "0402 (1005 Metric)" H 9525 3700 50  0001 C CNN "Package ID"
F 12 "sot86" V 9525 3700 50  0001 C CNN "variant"
F 13 "1" V 9525 3700 50  0001 C CNN "DNP"
	1    9525 3700
	0    1    1    0   
$EndComp
$Comp
L INA-10386-rescue:R_Small-device R8
U 1 1 5D096879
P 9525 4150
F 0 "R8" V 9450 4150 50  0000 C CNN
F 1 "0" V 9600 4150 50  0000 C CNN
F 2 "Resistor_SMD:R_0402_1005Metric" H 9525 4150 50  0001 C CNN
F 3 "~" H 9525 4150 50  0001 C CNN
F 4 "Yageo" H 9525 4150 50  0001 C CNN "MFN"
F 5 "RC0402JR-070RL" H 9525 4150 50  0001 C CNN "MFP"
F 6 "603-RC0402JR-070RL" H 9525 4150 50  0001 C CNN "S1PN"
F 7 "Mouser" H 9525 4150 50  0001 C CNN "S1PL"
F 8 "311-0.0JRCT-ND" H 9525 4150 50  0001 C CNN "S2PN"
F 9 "Digi-Key" H 9525 4150 50  0001 C CNN "S2PL"
F 10 "RES SMD 0 OHM JUMPER 1/16W 0402" H 9525 4150 50  0001 C CNN "Description"
F 11 "0402 (1005 Metric)" H 9525 4150 50  0001 C CNN "Package ID"
F 12 "sot86" V 9525 4150 50  0001 C CNN "variant"
	1    9525 4150
	0    1    1    0   
$EndComp
$Comp
L INA-10386-rescue:rfi_shield_clip-project P4
U 1 1 5D0A8B4D
P 9975 1625
F 0 "P4" H 10103 1644 60  0000 L CNN
F 1 "~" H 10103 1591 60  0000 L CNN
F 2 "RF_Shielding:S1721-46R" H 9975 1625 60  0001 C CNN
F 3 "" H 9975 1625 60  0000 C CNN
F 4 "Harwin Inc." H 9975 1625 50  0001 C CNN "MFN"
F 5 "S1721-46R" H 9975 1625 50  0001 C CNN "MFP"
F 6 "952-1476-1-ND" H 9975 1625 50  0001 C CNN "S1PN"
F 7 "Digi-Key" H 9975 1625 50  0001 C CNN "S1PL"
F 8 "855-S1721-46R" H 9975 1625 50  0001 C CNN "S2PN"
F 9 "Mouser" H 9975 1625 50  0001 C CNN "S2PL"
F 10 "RFI SHIELD CLIP MINI TIN SMD" H 9975 1625 50  0001 C CNN "Description"
F 11 "sot86" H 9975 1625 50  0001 C CNN "variant"
	1    9975 1625
	1    0    0    -1  
$EndComp
$Comp
L INA-10386-rescue:L-device L1
U 1 1 5D697045
P 7075 3550
F 0 "L1" H 7128 3596 50  0000 L CNN
F 1 "51nH" H 7128 3505 50  0000 L CNN
F 2 "Inductor_SMD:L_0603_1608Metric" H 7075 3550 50  0001 C CNN
F 3 "~" H 7075 3550 50  0001 C CNN
F 4 "Coilcraft" H 7075 3550 50  0001 C CNN "MFN"
F 5 "0603HP-51NXJLU" H 7075 3550 50  0001 C CNN "MFP"
F 6 "994-0603HP-51NXJLU" H 7075 3550 50  0001 C CNN "S1PN"
F 7 "Mouser" H 7075 3550 50  0001 C CNN "S1PL"
F 8 "Fixed Inductors 0603HP Hi Perfrmnce 33 nH 5 %" H 7075 3550 50  0001 C CNN "Description"
F 9 "0603 (1608 metric)" H 7075 3550 50  0001 C CNN "Package ID"
F 10 "sot86" H 7075 3550 50  0001 C CNN "variant"
	1    7075 3550
	1    0    0    -1  
$EndComp
$Comp
L INA-10386-rescue:R-device R1
U 1 1 5E69B64F
P 4825 2900
F 0 "R1" V 4725 2900 50  0000 C CNN
F 1 "75 1/4W" V 4925 2900 50  0000 C CNN
F 2 "Resistor_SMD:R_1206_3216Metric" H 4825 2900 60  0001 C CNN
F 3 "" H 4825 2900 60  0001 C CNN
F 4 "Yageo" H 4825 2900 50  0001 C CNN "MFN"
F 5 "RC1206JR-0775RL" H 4825 2900 50  0001 C CNN "MFP"
F 6 "311-75ERCT-ND" H 4825 2900 50  0001 C CNN "S1PN"
F 7 "Digi-Key" H 4825 2900 50  0001 C CNN "S1PL"
F 8 "603-RC1206JR-0775RL" H 4825 2900 50  0001 C CNN "S2PN"
F 9 "Mouser" H 4825 2900 50  0001 C CNN "S2PL"
F 10 "75 Ohms ±5% 0.25W, 1/4W Chip Resistor" H 4825 2900 50  0001 C CNN "Description"
F 11 "1206 (3216 Metric)" H 4825 2900 50  0001 C CNN "Package ID"
F 12 "sot86" V 4825 2900 50  0001 C CNN "variant"
	1    4825 2900
	0    -1   -1   0   
$EndComp
$Comp
L INA-10386-rescue:R-device R2
U 1 1 5E6A7E46
P 5925 2900
F 0 "R2" V 5825 2900 50  0000 C CNN
F 1 "39 1/4W" V 6025 2900 50  0000 C CNN
F 2 "Resistor_SMD:R_1206_3216Metric" H 5925 2900 60  0001 C CNN
F 3 "" H 5925 2900 60  0001 C CNN
F 4 "Yageo" H 5925 2900 50  0001 C CNN "MFN"
F 5 "RC1206JR-0739RL" H 5925 2900 50  0001 C CNN "MFP"
F 6 "311-39ERCT-ND" H 5925 2900 50  0001 C CNN "S1PN"
F 7 "Digi-Key" H 5925 2900 50  0001 C CNN "S1PL"
F 8 "603-RC1206JR-0739RL" H 5925 2900 50  0001 C CNN "S2PN"
F 9 "Mouser" H 5925 2900 50  0001 C CNN "S2PL"
F 10 "39 Ohms ±1% 0.25W, 1/4W Chip Resistor" H 5925 2900 50  0001 C CNN "Description"
F 11 "1206 (3216 Metric)" H 5925 2900 50  0001 C CNN "Package ID"
F 12 "sot86" V 5925 2900 50  0001 C CNN "variant"
	1    5925 2900
	0    -1   -1   0   
$EndComp
$Comp
L INA-10386-rescue:C-device C9
U 1 1 5E520C0F
P 7350 4150
F 0 "C9" V 7450 4200 50  0000 L CNN
F 1 "100p" V 7450 3900 50  0000 L CNN
F 2 "Capacitor_SMD:C_0402_1005Metric" H 7350 4150 60  0001 C CNN
F 3 "" H 7350 4150 60  0001 C CNN
F 4 "Kemet" H 3225 350 50  0001 C CNN "MFN"
F 5 "CBR04C101J3GAC" H 3225 350 50  0001 C CNN "MFP"
F 6 "80-CBR04C101J3GAC" H 3225 350 50  0001 C CNN "S1PN"
F 7 "Mouser" H 3225 350 50  0001 C CNN "S1PL"
F 8 "399-17684-1-ND" H 3225 350 50  0001 C CNN "S2PN"
F 9 "Digi-Key" H 3225 350 50  0001 C CNN "S2PL"
F 10 "HiQ-CBR Series, C0G Dielectric, Low ESR, High SRF" H 3225 350 50  0001 C CNN "Description"
F 11 "0402 (1005 metric)" H 3225 350 50  0001 C CNN "Package ID"
F 12 "sot86" V 10325 4150 50  0001 C CNN "variant"
	1    7350 4150
	0    -1   -1   0   
$EndComp
$Comp
L INA-10386-rescue:C-device C8
U 1 1 5E52D9C9
P 5450 4150
F 0 "C8" V 5550 4200 50  0000 L CNN
F 1 "100p" V 5550 3900 50  0000 L CNN
F 2 "Capacitor_SMD:C_0402_1005Metric" H 5450 4150 60  0001 C CNN
F 3 "" H 5450 4150 60  0001 C CNN
F 4 "Kemet" H 1325 350 50  0001 C CNN "MFN"
F 5 "CBR04C101J3GAC" H 1325 350 50  0001 C CNN "MFP"
F 6 "80-CBR04C101J3GAC" H 1325 350 50  0001 C CNN "S1PN"
F 7 "Mouser" H 1325 350 50  0001 C CNN "S1PL"
F 8 "399-17684-1-ND" H 1325 350 50  0001 C CNN "S2PN"
F 9 "Digi-Key" H 1325 350 50  0001 C CNN "S2PL"
F 10 "HiQ-CBR Series, C0G Dielectric, Low ESR, High SRF" H 1325 350 50  0001 C CNN "Description"
F 11 "0402 (1005 metric)" H 1325 350 50  0001 C CNN "Package ID"
F 12 "sot86" V 8425 4150 50  0001 C CNN "variant"
	1    5450 4150
	0    -1   -1   0   
$EndComp
$Comp
L INA-10386-rescue:R-device X1
U 1 1 5E57EF95
P 4175 4150
F 0 "X1" V 4275 4150 50  0000 C CNN
F 1 "0" V 4175 4150 50  0000 C CNN
F 2 "Capacitor_SMD:C_0603_1608Metric" H 4175 4150 60  0001 C CNN
F 3 "" H 4175 4150 60  0001 C CNN
F 4 "Yageo" H 4175 4150 50  0001 C CNN "MFN"
F 5 "RC0603JR-070RL" H 4175 4150 50  0001 C CNN "MFP"
F 6 "311-0.0GRCT-ND" H 4175 4150 50  0001 C CNN "S1PN"
F 7 "Digi-Key" H 4175 4150 50  0001 C CNN "S1PL"
F 8 "603-RC0603JR-070RL" H 4175 4150 50  0001 C CNN "S2PN"
F 9 "Mouser" H 4175 4150 50  0001 C CNN "S2PL"
F 10 "0 Ohms Jumper 0.1W, 1/10W Chip Resistor" H 4175 4150 50  0001 C CNN "Description"
F 11 "0603 (1608 Metric)" H 4175 4150 50  0001 C CNN "Package ID"
F 12 "sot86" V 4175 4150 50  0001 C CNN "variant"
	1    4175 4150
	0    1    1    0   
$EndComp
$Comp
L INA-10386-rescue:R-device X2
U 1 1 5E58BAC8
P 4725 4150
F 0 "X2" V 4825 4150 50  0000 C CNN
F 1 "0" V 4725 4150 50  0000 C CNN
F 2 "Capacitor_SMD:C_0603_1608Metric" H 4725 4150 60  0001 C CNN
F 3 "" H 4725 4150 60  0001 C CNN
F 4 "Yageo" H 4725 4150 50  0001 C CNN "MFN"
F 5 "RC0603JR-070RL" H 4725 4150 50  0001 C CNN "MFP"
F 6 "311-0.0GRCT-ND" H 4725 4150 50  0001 C CNN "S1PN"
F 7 "Digi-Key" H 4725 4150 50  0001 C CNN "S1PL"
F 8 "603-RC0603JR-070RL" H 4725 4150 50  0001 C CNN "S2PN"
F 9 "Mouser" H 4725 4150 50  0001 C CNN "S2PL"
F 10 "0 Ohms Jumper 0.1W, 1/10W Chip Resistor" H 4725 4150 50  0001 C CNN "Description"
F 11 "0603 (1608 Metric)" H 4725 4150 50  0001 C CNN "Package ID"
F 12 "sot86" V 4725 4150 50  0001 C CNN "variant"
	1    4725 4150
	0    1    1    0   
$EndComp
$Comp
L INA-10386-rescue:R-device X3
U 1 1 5E5986DA
P 8500 4150
F 0 "X3" V 8600 4150 50  0000 C CNN
F 1 "0" V 8500 4150 50  0000 C CNN
F 2 "Capacitor_SMD:C_0603_1608Metric" H 8500 4150 60  0001 C CNN
F 3 "" H 8500 4150 60  0001 C CNN
F 4 "Yageo" H 8500 4150 50  0001 C CNN "MFN"
F 5 "RC0603JR-070RL" H 8500 4150 50  0001 C CNN "MFP"
F 6 "311-0.0GRCT-ND" H 8500 4150 50  0001 C CNN "S1PN"
F 7 "Digi-Key" H 8500 4150 50  0001 C CNN "S1PL"
F 8 "603-RC0603JR-070RL" H 8500 4150 50  0001 C CNN "S2PN"
F 9 "Mouser" H 8500 4150 50  0001 C CNN "S2PL"
F 10 "0 Ohms Jumper 0.1W, 1/10W Chip Resistor" H 8500 4150 50  0001 C CNN "Description"
F 11 "0603 (1608 Metric)" H 8500 4150 50  0001 C CNN "Package ID"
F 12 "sot86" V 8500 4150 50  0001 C CNN "variant"
	1    8500 4150
	0    1    1    0   
$EndComp
Wire Wire Line
	4275 2900 4675 2900
Wire Wire Line
	4975 2900 5375 2900
Wire Wire Line
	5375 2900 5775 2900
Wire Wire Line
	6075 2900 6525 2900
$Comp
L INA-10386-rescue:Conn_01x02_Female-connector P1
U 1 1 5E7EB21B
P 2750 3000
F 0 "P1" H 2644 2675 50  0000 C CNN
F 1 "+10V" H 2644 2766 50  0000 C CNN
F 2 "Connector_PinHeader_2.54mm:PinHeader_1x02_P2.54mm_Vertical" H 2750 3000 50  0001 C CNN
F 3 "~" H 2750 3000 50  0001 C CNN
F 4 "Mintron" H 2750 3000 50  0001 C CNN "MFN"
F 5 "MTP125-1102S1" H 2750 3000 50  0001 C CNN "MFP"
F 6 "C358684" H 2750 3000 50  0001 C CNN "S1PN"
F 7 "LCSC" H 2750 3000 50  0001 C CNN "S1PL"
F 8 "Pin Header Male Pin 0.100\\\"(2.54mm) 2 pin" H 2750 3000 50  0001 C CNN "Description"
F 9 "Through Hole,P=2.54mm" H 2750 3000 50  0001 C CNN "Package ID"
F 10 "sot86" H 2750 3000 50  0001 C CNN "variant"
F 11 "1:$0.01; 10:$0.01; 100:$0.01; 500:$0.008" H 2750 3000 50  0001 C CNN "kicost:LCSC:pricing"
F 12 "https://lcsc.com/product-detail/Pin-Header-Female-Header_MINTRON-MTP125-1102S1_C358684.html" H 2750 3000 50  0001 C CNN "kicost:LCSC:link"
	1    2750 3000
	-1   0    0    1   
$EndComp
Wire Wire Line
	3325 4150 4025 4150
Wire Wire Line
	4875 4150 5300 4150
Wire Wire Line
	4450 4650 4450 4750
Wire Wire Line
	4450 4750 4375 4750
Wire Wire Line
	4450 4350 4450 4150
Connection ~ 4450 4150
Wire Wire Line
	4450 4150 4575 4150
Wire Wire Line
	4075 4750 4000 4750
Wire Wire Line
	4000 4750 4000 4850
$EndSCHEMATC
