(module SMA-VERT (layer F.Cu) (tedit 5D0B2E0E)
  (tags "SMA Connector")
  (fp_text reference J21 (at 0 5.08) (layer F.SilkS) hide
    (effects (font (size 0.635 0.635) (thickness 0.1016)))
  )
  (fp_text value ~ (at 1.27 7.62) (layer F.SilkS) hide
    (effects (font (size 0.635 0.635) (thickness 0.1016)))
  )
  (fp_circle (center 0 0) (end 1.205497 0) (layer F.CrtYd) (width 0.05))
  (fp_line (start 3.937 -3.937) (end 3.937 3.937) (layer F.Fab) (width 0.1))
  (fp_line (start 3.937 3.937) (end -3.937 3.937) (layer F.Fab) (width 0.1))
  (fp_line (start -3.937 3.937) (end -3.937 -3.937) (layer F.Fab) (width 0.1))
  (fp_line (start -3.937 -3.937) (end 3.937 -3.937) (layer F.Fab) (width 0.1))
  (pad 2 smd rect (at 0 0) (size 9 9) (layers F.Mask))
  (pad 1 thru_hole circle (at 0 0) (size 1.99898 1.99898) (drill 1.35) (layers *.Cu *.Mask F.SilkS))
  (model ${KIPRJMOD}/../KiCad/Modules/packages3d/sma_pcb_ra_jack.wrl
    (offset (xyz 10.5 0 5.7))
    (scale (xyz 0.35 0.35 0.35))
    (rotate (xyz -90 0 -90))
  )
)
