EESchema Schematic File Version 4
EELAYER 30 0
EELAYER END
$Descr A3 16535 11693
encoding utf-8
Sheet 1 1
Title "MMIC Amplifier"
Date "2021-03-05"
Rev "2.9"
Comp "Dyadic Pty Ltd"
Comment1 "2020"
Comment2 ""
Comment3 ""
Comment4 ""
$EndDescr
$Comp
L device:C C1
U 1 1 51C102FD
P 5750 1750
F 0 "C1" H 5800 1850 50  0000 L CNN
F 1 "0.01uF" H 5800 1650 50  0000 L CNN
F 2 "Capacitor_SMD:C_0603_1608Metric" H 5750 1750 60  0001 C CNN
F 3 "" H 5750 1750 60  0001 C CNN
F 4 "Kemet" H 5750 1750 50  0001 C CNN "MFN"
F 5 "C0603C103K5RACTU" H 5750 1750 50  0001 C CNN "MFP"
F 6 "399-1091-1-ND" H 5750 1750 50  0001 C CNN "S1PN"
F 7 "Digi-Key" H 5750 1750 50  0001 C CNN "S1PL"
F 8 "80-C0603C103K5R" H 5750 1750 50  0001 C CNN "S2PN"
F 9 "Mouser" H 5750 1750 50  0001 C CNN "S2PL"
F 10 "Multilayer Ceramic Capacitors MLCC - SMD/SMT 50V 0.01uF 0603 X7R 10%" H 5750 1750 50  0001 C CNN "Description"
F 11 "0603 (1608 metric)" H 5750 1750 50  0001 C CNN "Package ID"
F 12 "sot86" H 5750 1750 50  0001 C CNN "variant"
	1    5750 1750
	1    0    0    -1  
$EndComp
$Comp
L power:GND #PWR01
U 1 1 51C10301
P 5750 1900
F 0 "#PWR01" H 5750 1900 30  0001 C CNN
F 1 "GND" H 5750 1830 30  0001 C CNN
F 2 "" H 5750 1900 60  0001 C CNN
F 3 "" H 5750 1900 60  0001 C CNN
	1    5750 1900
	1    0    0    -1  
$EndComp
$Comp
L device:C C2
U 1 1 51C10303
P 6550 1750
F 0 "C2" H 6600 1850 50  0000 L CNN
F 1 "0.1uF" H 6600 1650 50  0000 L CNN
F 2 "Capacitor_SMD:C_0603_1608Metric" H 6550 1750 60  0001 C CNN
F 3 "" H 6550 1750 60  0001 C CNN
F 4 "Kemet" H 6550 1750 50  0001 C CNN "MFN"
F 5 "C0603C104J4RACTU" H 6550 1750 50  0001 C CNN "MFP"
F 6 "399-1097-1-ND" H 6550 1750 50  0001 C CNN "S1PN"
F 7 "Digi-Key" H 6550 1750 50  0001 C CNN "S1PL"
F 8 "80-C0603C104J4R" H 6550 1750 50  0001 C CNN "S2PN"
F 9 "Mouser" H 6550 1750 50  0001 C CNN "S2PL"
F 10 "CAP CER 0.1UF 16V X7R 0603" H 6550 1750 50  0001 C CNN "Description"
F 11 "0603 (1608 Metric)" H 6550 1750 50  0001 C CNN "Package ID"
F 12 "sot86" H 6550 1750 50  0001 C CNN "variant"
	1    6550 1750
	1    0    0    -1  
$EndComp
$Comp
L power:GND #PWR02
U 1 1 51C10304
P 6550 1900
F 0 "#PWR02" H 6550 1900 30  0001 C CNN
F 1 "GND" H 6550 1830 30  0001 C CNN
F 2 "" H 6550 1900 60  0001 C CNN
F 3 "" H 6550 1900 60  0001 C CNN
	1    6550 1900
	1    0    0    -1  
$EndComp
$Comp
L power:GND #PWR03
U 1 1 51C10308
P 7650 1900
F 0 "#PWR03" H 7650 1900 30  0001 C CNN
F 1 "GND" H 7650 1830 30  0001 C CNN
F 2 "" H 7650 1900 60  0001 C CNN
F 3 "" H 7650 1900 60  0001 C CNN
	1    7650 1900
	1    0    0    -1  
$EndComp
Wire Wire Line
	6250 1450 6550 1450
Wire Wire Line
	6550 1600 6550 1450
Connection ~ 6550 1450
Wire Wire Line
	5750 1600 5750 1450
Wire Wire Line
	7650 1600 7650 1450
Connection ~ 7650 1450
$Comp
L device:C C6
U 1 1 51C1030A
P 10300 1750
F 0 "C6" H 10350 1850 50  0000 L CNN
F 1 "100pF" H 10350 1650 50  0000 L CNN
F 2 "Capacitor_SMD:C_0603_1608Metric" H 10300 1750 60  0001 C CNN
F 3 "" H 10300 1750 60  0001 C CNN
F 4 "Yageo" H 10300 1750 50  0001 C CNN "MFN"
F 5 "CC0603JRNPO9BN101" H 10300 1750 50  0001 C CNN "MFP"
F 6 "311-1069-1-ND" H 10300 1750 50  0001 C CNN "S1PN"
F 7 "Digi-Key" H 10300 1750 50  0001 C CNN "S1PL"
F 8 "603-CC603JRNPO9BN101" H 10300 1750 50  0001 C CNN "S2PN"
F 9 "Mouser" H 10300 1750 50  0001 C CNN "S2PL"
F 10 "100pF ±5% 50V Ceramic Capacitor C0G, NP0" H 10300 1750 50  0001 C CNN "Description"
F 11 "0603 (1608 Metric)" H 10300 1750 50  0001 C CNN "Package ID"
F 12 "sot86" H 10300 1750 50  0001 C CNN "variant"
	1    10300 1750
	1    0    0    -1  
$EndComp
Wire Wire Line
	10700 1450 10700 1600
Wire Wire Line
	10300 1600 10300 1450
Connection ~ 10300 1450
Wire Wire Line
	9800 1600 9800 1450
Connection ~ 9800 1450
Wire Wire Line
	8800 1600 8800 1450
Connection ~ 8800 1450
$Comp
L power:GND #PWR08
U 1 1 51C10319
P 5325 1950
F 0 "#PWR08" H 5325 1950 30  0001 C CNN
F 1 "GND" H 5325 1880 30  0001 C CNN
F 2 "" H 5325 1950 60  0001 C CNN
F 3 "" H 5325 1950 60  0001 C CNN
	1    5325 1950
	1    0    0    -1  
$EndComp
Wire Wire Line
	5325 1550 5325 1800
$Comp
L power:GND #PWR04
U 1 1 51C1031A
P 8800 1900
F 0 "#PWR04" H 8800 1900 30  0001 C CNN
F 1 "GND" H 8800 1830 30  0001 C CNN
F 2 "" H 8800 1900 60  0001 C CNN
F 3 "" H 8800 1900 60  0001 C CNN
	1    8800 1900
	1    0    0    -1  
$EndComp
$Comp
L power:GND #PWR05
U 1 1 51C1031B
P 9800 1900
F 0 "#PWR05" H 9800 1900 30  0001 C CNN
F 1 "GND" H 9800 1830 30  0001 C CNN
F 2 "" H 9800 1900 60  0001 C CNN
F 3 "" H 9800 1900 60  0001 C CNN
	1    9800 1900
	1    0    0    -1  
$EndComp
$Comp
L power:GND #PWR06
U 1 1 51C1031C
P 10300 1900
F 0 "#PWR06" H 10300 1900 30  0001 C CNN
F 1 "GND" H 10300 1830 30  0001 C CNN
F 2 "" H 10300 1900 60  0001 C CNN
F 3 "" H 10300 1900 60  0001 C CNN
	1    10300 1900
	1    0    0    -1  
$EndComp
$Comp
L power:GND #PWR07
U 1 1 51C1031D
P 10700 1900
F 0 "#PWR07" H 10700 1900 30  0001 C CNN
F 1 "GND" H 10700 1830 30  0001 C CNN
F 2 "" H 10700 1900 60  0001 C CNN
F 3 "" H 10700 1900 60  0001 C CNN
	1    10700 1900
	1    0    0    -1  
$EndComp
$Comp
L device:R X5
U 1 1 51C10322
P 7425 3050
F 0 "X5" H 7275 3000 50  0000 C CNN
F 1 "DNF" H 7275 3100 50  0000 C CNN
F 2 "Capacitor_SMD:C_0402_1005Metric" H 7425 3050 60  0001 C CNN
F 3 "" H 7425 3050 60  0001 C CNN
F 4 "sot86" H 7425 3050 50  0001 C CNN "variant"
F 5 "1" H 7425 3050 50  0001 C CNN "DNP"
	1    7425 3050
	-1   0    0    1   
$EndComp
$Comp
L device:R X8
U 1 1 51C1032A
P 10050 3050
F 0 "X8" H 9900 3000 50  0000 C CNN
F 1 "DNF" H 9900 3100 50  0000 C CNN
F 2 "Capacitor_SMD:C_0402_1005Metric" H 10050 3050 60  0001 C CNN
F 3 "" H 10050 3050 60  0001 C CNN
F 4 "sot86" H 10050 3050 50  0001 C CNN "variant"
F 5 "1" H 10050 3050 50  0001 C CNN "DNP"
	1    10050 3050
	-1   0    0    1   
$EndComp
Wire Wire Line
	7875 2700 8025 2700
Wire Wire Line
	9150 2700 9350 2700
Wire Wire Line
	9775 2700 10050 2700
$Comp
L power:GND #PWR010
U 1 1 51C1032C
P 8750 3000
F 0 "#PWR010" H 8750 3000 30  0001 C CNN
F 1 "GND" H 8750 2930 30  0001 C CNN
F 2 "" H 8750 3000 60  0001 C CNN
F 3 "" H 8750 3000 60  0001 C CNN
	1    8750 3000
	1    0    0    -1  
$EndComp
$Comp
L power:GND #PWR09
U 1 1 51C1032D
P 8750 2400
F 0 "#PWR09" H 8750 2400 30  0001 C CNN
F 1 "GND" H 8750 2330 30  0001 C CNN
F 2 "" H 8750 2400 60  0001 C CNN
F 3 "" H 8750 2400 60  0001 C CNN
	1    8750 2400
	-1   0    0    1   
$EndComp
Connection ~ 9350 2700
$Comp
L power:GND #PWR016
U 1 1 51C10330
P 9350 3200
F 0 "#PWR016" H 9350 3200 30  0001 C CNN
F 1 "GND" H 9350 3130 30  0001 C CNN
F 2 "" H 9350 3200 60  0001 C CNN
F 3 "" H 9350 3200 60  0001 C CNN
	1    9350 3200
	1    0    0    -1  
$EndComp
$Comp
L power:PWR_FLAG #FLG01
U 1 1 51C10341
P 5325 1800
F 0 "#FLG01" H 5325 1895 30  0001 C CNN
F 1 "PWR_FLAG" H 5325 1980 30  0000 C CNN
F 2 "" H 5325 1800 60  0001 C CNN
F 3 "" H 5325 1800 60  0001 C CNN
	1    5325 1800
	0    -1   -1   0   
$EndComp
Connection ~ 5325 1800
Text Notes 12225 2550 0    60   ~ 0
A-RF Out
$Comp
L device:R X7
U 1 1 51C10F84
P 8025 3050
F 0 "X7" H 8175 3000 50  0000 C CNN
F 1 "DNF" H 8175 3100 50  0000 C CNN
F 2 "Capacitor_SMD:C_0402_1005Metric" H 8025 3050 60  0001 C CNN
F 3 "" H 8025 3050 60  0001 C CNN
F 4 "sot86" H 8025 3050 50  0001 C CNN "variant"
F 5 "1" H 8025 3050 50  0001 C CNN "DNP"
	1    8025 3050
	-1   0    0    1   
$EndComp
$Comp
L power:GND #PWR014
U 1 1 51C10F8A
P 8025 3200
F 0 "#PWR014" H 8025 3200 30  0001 C CNN
F 1 "GND" H 8025 3130 30  0001 C CNN
F 2 "" H 8025 3200 60  0001 C CNN
F 3 "" H 8025 3200 60  0001 C CNN
	1    8025 3200
	1    0    0    -1  
$EndComp
Wire Wire Line
	8025 2900 8025 2700
Connection ~ 8025 2700
$Comp
L device:C C10
U 1 1 51C12F57
P 9350 3050
F 0 "C10" H 9400 3150 50  0000 L CNN
F 1 "DNF" H 9400 2950 50  0000 L CNN
F 2 "Capacitor_SMD:C_0402_1005Metric" H 9350 3050 60  0001 C CNN
F 3 "" H 9350 3050 60  0001 C CNN
F 4 "sot86" H 9350 3050 50  0001 C CNN "variant"
F 5 "1" H 9350 3050 50  0001 C CNN "DNP"
	1    9350 3050
	1    0    0    -1  
$EndComp
$Comp
L power:GND #PWR015
U 1 1 51C12F63
P 10050 3200
F 0 "#PWR015" H 10050 3200 30  0001 C CNN
F 1 "GND" H 10050 3130 30  0001 C CNN
F 2 "" H 10050 3200 60  0001 C CNN
F 3 "" H 10050 3200 60  0001 C CNN
	1    10050 3200
	1    0    0    -1  
$EndComp
Wire Wire Line
	5225 1550 5325 1550
Wire Wire Line
	10050 2900 10050 2700
$Comp
L project:GALI49 U1
U 1 1 550CED70
P 8750 2700
F 0 "U1" H 8850 2900 50  0000 L BNN
F 1 "QPA4586" H 8850 2500 50  0000 L BNN
F 2 "Minicircuits_2:WW107" H 8750 2850 50  0001 C CNN
F 3 "" H 8750 2700 60  0000 C CNN
F 4 "Qorvo" H 8750 2700 50  0001 C CNN "MFN"
F 5 "qpa4586atr13" H 8750 2700 50  0001 C CNN "MFP"
F 6 "772-QPA4586ATR13" H 8750 2700 50  0001 C CNN "S1PN"
F 7 "Mouser" H 8750 2700 50  0001 C CNN "S1PL"
F 8 "RF Amplifier DC-4GHz Gain 19.9dB" H 8750 2700 50  0001 C CNN "Description"
F 9 "SOT-86-4" H 8750 2700 50  0001 C CNN "Package ID"
F 10 "sot86" H 8750 2700 50  0001 C CNN "variant"
	1    8750 2700
	1    0    0    -1  
$EndComp
Wire Wire Line
	5225 1450 5750 1450
Wire Wire Line
	5750 1450 6050 1450
Wire Wire Line
	10300 1450 10700 1450
Wire Wire Line
	9800 1450 10300 1450
Wire Wire Line
	9350 2700 9475 2700
Wire Wire Line
	5325 1800 5325 1950
Wire Wire Line
	8025 2700 8450 2700
$Comp
L device:Ferrite_Bead_Small FB1
U 1 1 5C6B82B2
P 6150 1450
F 0 "FB1" V 6005 1450 50  0000 C CNN
F 1 "~" V 6004 1450 50  0000 C CNN
F 2 "Inductor_SMD:L_0805_2012Metric" V 6080 1450 50  0001 C CNN
F 3 "~" H 6150 1450 50  0001 C CNN
F 4 "Murata Electronics" H 7500 3175 50  0001 C CNN "MFN"
F 5 "BLM21PG221SN1D" H 7500 3175 50  0001 C CNN "MFP"
F 6 "81-BLM21P221SG" H 7500 3175 50  0001 C CNN "S1PN"
F 7 "Mouser" H 7500 3175 50  0001 C CNN "S1PL"
F 8 "490-1054-1-ND" H 7500 3175 50  0001 C CNN "S2PN"
F 9 "Digi-Key" H 7500 3175 50  0001 C CNN "S2PL"
F 10 "FERRITE BEAD 220 OHM 0805 1LN" H 7500 3175 50  0001 C CNN "Description"
F 11 "0805 (2012 Metric)" H 7500 3175 50  0001 C CNN "Package ID"
F 12 "sot86" V 6150 1450 50  0001 C CNN "variant"
	1    6150 1450
	0    1    1    0   
$EndComp
$Comp
L device:CP C5
U 1 1 5C6C045C
P 9800 1750
F 0 "C5" H 9875 1850 50  0000 L CNN
F 1 "10u/16V" H 9850 1650 50  0000 L CNN
F 2 "Capacitor_Tantalum_SMD:CP_EIA-3216-12_Kemet-S" H 9838 1600 50  0001 C CNN
F 3 "~" H 9800 1750 50  0001 C CNN
F 4 "Kemet" H 9800 1750 50  0001 C CNN "MFN"
F 5 "T491A106K016AT" H 9800 1750 50  0001 C CNN "MFP"
F 6 "80-T491A106K016" H 9800 1750 50  0001 C CNN "S1PN"
F 7 "Mouser" H 9800 1750 50  0001 C CNN "S1PL"
F 8 "399-8269-1-ND" H 9800 1750 50  0001 C CNN "S2PN"
F 9 "Digi-Key" H 9800 1750 50  0001 C CNN "S2PL"
F 10 "10µF Molded Tantalum Capacitors 16V 3 Ohm ESR" H 9800 1750 50  0001 C CNN "Description"
F 11 "1206 (3216 Metric) " H 9800 1750 50  0001 C CNN "Package ID"
F 12 "sot86" H 9800 1750 50  0001 C CNN "variant"
	1    9800 1750
	1    0    0    -1  
$EndComp
$Comp
L power:GND #PWR019
U 1 1 5C6E3064
P 5825 4825
F 0 "#PWR019" H 5825 4825 30  0001 C CNN
F 1 "GND" H 5825 4755 30  0001 C CNN
F 2 "" H 5825 4825 60  0001 C CNN
F 3 "" H 5825 4825 60  0001 C CNN
	1    5825 4825
	1    0    0    -1  
$EndComp
$Comp
L power:GND #PWR020
U 1 1 5C6E3070
P 6625 4825
F 0 "#PWR020" H 6625 4825 30  0001 C CNN
F 1 "GND" H 6625 4755 30  0001 C CNN
F 2 "" H 6625 4825 60  0001 C CNN
F 3 "" H 6625 4825 60  0001 C CNN
	1    6625 4825
	1    0    0    -1  
$EndComp
$Comp
L power:GND #PWR021
U 1 1 5C6E3088
P 7725 4825
F 0 "#PWR021" H 7725 4825 30  0001 C CNN
F 1 "GND" H 7725 4755 30  0001 C CNN
F 2 "" H 7725 4825 60  0001 C CNN
F 3 "" H 7725 4825 60  0001 C CNN
	1    7725 4825
	1    0    0    -1  
$EndComp
Wire Wire Line
	6325 4375 6625 4375
Wire Wire Line
	6625 4525 6625 4375
Connection ~ 6625 4375
Wire Wire Line
	5825 4525 5825 4375
Wire Wire Line
	7725 4525 7725 4375
Connection ~ 7725 4375
$Comp
L device:C C16
U 1 1 5C6E309C
P 10375 4675
F 0 "C16" H 10425 4775 50  0000 L CNN
F 1 "100pF" H 10425 4575 50  0000 L CNN
F 2 "Capacitor_SMD:C_0603_1608Metric" H 10375 4675 60  0001 C CNN
F 3 "" H 10375 4675 60  0001 C CNN
F 4 "Yageo" H 10325 1825 50  0001 C CNN "MFN"
F 5 "CC0603JRNPO9BN101" H 10325 1825 50  0001 C CNN "MFP"
F 6 "311-1069-1-ND" H 10325 1825 50  0001 C CNN "S1PN"
F 7 "Digi-Key" H 10325 1825 50  0001 C CNN "S1PL"
F 8 "603-CC603JRNPO9BN101" H 10325 1825 50  0001 C CNN "S2PN"
F 9 "Mouser" H 10325 1825 50  0001 C CNN "S2PL"
F 10 "100pF ±5% 50V Ceramic Capacitor C0G, NP0" H 10325 1825 50  0001 C CNN "Description"
F 11 "0603 (1608 Metric)" H 10325 1825 50  0001 C CNN "Package ID"
F 12 "sot89" H 10375 4675 50  0001 C CNN "variant"
	1    10375 4675
	1    0    0    -1  
$EndComp
Wire Wire Line
	10775 4375 10775 4525
Wire Wire Line
	10375 4525 10375 4375
Connection ~ 10375 4375
Wire Wire Line
	9875 4525 9875 4375
Connection ~ 9875 4375
Wire Wire Line
	8875 4525 8875 4375
Connection ~ 8875 4375
$Comp
L power:GND #PWR026
U 1 1 5C6E30B0
P 5400 4875
F 0 "#PWR026" H 5400 4875 30  0001 C CNN
F 1 "GND" H 5400 4805 30  0001 C CNN
F 2 "" H 5400 4875 60  0001 C CNN
F 3 "" H 5400 4875 60  0001 C CNN
	1    5400 4875
	1    0    0    -1  
$EndComp
$Comp
L power:GND #PWR022
U 1 1 5C6E30B7
P 8875 4825
F 0 "#PWR022" H 8875 4825 30  0001 C CNN
F 1 "GND" H 8875 4755 30  0001 C CNN
F 2 "" H 8875 4825 60  0001 C CNN
F 3 "" H 8875 4825 60  0001 C CNN
	1    8875 4825
	1    0    0    -1  
$EndComp
$Comp
L power:GND #PWR023
U 1 1 5C6E30BD
P 9875 4825
F 0 "#PWR023" H 9875 4825 30  0001 C CNN
F 1 "GND" H 9875 4755 30  0001 C CNN
F 2 "" H 9875 4825 60  0001 C CNN
F 3 "" H 9875 4825 60  0001 C CNN
	1    9875 4825
	1    0    0    -1  
$EndComp
$Comp
L power:GND #PWR024
U 1 1 5C6E30C3
P 10375 4825
F 0 "#PWR024" H 10375 4825 30  0001 C CNN
F 1 "GND" H 10375 4755 30  0001 C CNN
F 2 "" H 10375 4825 60  0001 C CNN
F 3 "" H 10375 4825 60  0001 C CNN
	1    10375 4825
	1    0    0    -1  
$EndComp
$Comp
L power:GND #PWR025
U 1 1 5C6E30C9
P 10775 4825
F 0 "#PWR025" H 10775 4825 30  0001 C CNN
F 1 "GND" H 10775 4755 30  0001 C CNN
F 2 "" H 10775 4825 60  0001 C CNN
F 3 "" H 10775 4825 60  0001 C CNN
	1    10775 4825
	1    0    0    -1  
$EndComp
$Comp
L device:R X15
U 1 1 5C6E30CF
P 6975 5975
F 0 "X15" H 6825 5925 50  0000 C CNN
F 1 "DNF" H 6825 6025 50  0000 C CNN
F 2 "Capacitor_SMD:C_0402_1005Metric" H 6975 5975 60  0001 C CNN
F 3 "" H 6975 5975 60  0001 C CNN
F 4 "sot89" H 6975 5975 50  0001 C CNN "variant"
F 5 "1" H 6975 5975 50  0001 C CNN "DNP"
	1    6975 5975
	-1   0    0    1   
$EndComp
Wire Wire Line
	7425 5625 7575 5625
Wire Wire Line
	9225 5625 9275 5625
$Comp
L power:GND #PWR028
U 1 1 5C6E3115
P 8825 5925
F 0 "#PWR028" H 8825 5925 30  0001 C CNN
F 1 "GND" H 8825 5855 30  0001 C CNN
F 2 "" H 8825 5925 60  0001 C CNN
F 3 "" H 8825 5925 60  0001 C CNN
	1    8825 5925
	1    0    0    -1  
$EndComp
Connection ~ 9425 5625
$Comp
L power:GND #PWR034
U 1 1 5C6E312E
P 10050 6125
F 0 "#PWR034" H 10050 6125 30  0001 C CNN
F 1 "GND" H 10050 6055 30  0001 C CNN
F 2 "" H 10050 6125 60  0001 C CNN
F 3 "" H 10050 6125 60  0001 C CNN
	1    10050 6125
	1    0    0    -1  
$EndComp
Text Notes 12975 5500 0    60   ~ 0
A-RF Out
$Comp
L device:R X17
U 1 1 5C6E3162
P 7575 5975
F 0 "X17" H 7725 5925 50  0000 C CNN
F 1 "DNF" H 7725 6025 50  0000 C CNN
F 2 "Capacitor_SMD:C_0402_1005Metric" H 7575 5975 60  0001 C CNN
F 3 "" H 7575 5975 60  0001 C CNN
F 4 "sot89" H 7575 5975 50  0001 C CNN "variant"
F 5 "1" H 7575 5975 50  0001 C CNN "DNP"
	1    7575 5975
	-1   0    0    1   
$EndComp
$Comp
L power:GND #PWR032
U 1 1 5C6E3168
P 7575 6125
F 0 "#PWR032" H 7575 6125 30  0001 C CNN
F 1 "GND" H 7575 6055 30  0001 C CNN
F 2 "" H 7575 6125 60  0001 C CNN
F 3 "" H 7575 6125 60  0001 C CNN
	1    7575 6125
	1    0    0    -1  
$EndComp
Wire Wire Line
	7575 5825 7575 5625
Connection ~ 7575 5625
$Comp
L device:C C20
U 1 1 5C6E3170
P 9425 5975
F 0 "C20" H 9475 6075 50  0000 L CNN
F 1 "DNF" H 9475 5875 50  0000 L CNN
F 2 "Capacitor_SMD:C_0402_1005Metric" H 9425 5975 60  0001 C CNN
F 3 "" H 9425 5975 60  0001 C CNN
F 4 "sot89" H 9425 5975 50  0001 C CNN "variant"
F 5 "1" H 9425 5975 50  0001 C CNN "DNP"
	1    9425 5975
	1    0    0    -1  
$EndComp
$Comp
L power:GND #PWR033
U 1 1 5C6E3176
P 9425 6125
F 0 "#PWR033" H 9425 6125 30  0001 C CNN
F 1 "GND" H 9425 6055 30  0001 C CNN
F 2 "" H 9425 6125 60  0001 C CNN
F 3 "" H 9425 6125 60  0001 C CNN
	1    9425 6125
	1    0    0    -1  
$EndComp
Wire Wire Line
	5300 4475 5400 4475
Wire Wire Line
	9425 5825 9425 5625
$Comp
L project:SKY65014 U2
U 1 1 5C6E318E
P 8825 5625
F 0 "U2" H 8800 5875 50  0000 L BNN
F 1 "SKY65014" H 8925 5425 50  0000 L BNN
F 2 "Package_TO_SOT_SMD:SOT-89-3" H 8825 5775 50  0001 C CNN
F 3 "" H 8825 5625 60  0000 C CNN
F 4 "Skyworks" H 8825 5625 50  0001 C CNN "MFN"
F 5 "SKY65014-70LF" H 8825 5625 50  0001 C CNN "MFP"
F 6 "SKY65014-70LF" H 8825 5625 50  0001 C CNN "S1PN"
F 7 "RFMW" H 8825 5625 50  0001 C CNN "S1PL"
F 8 "873-SKY65014-70LF" H 8825 5625 50  0001 C CNN "S2PN"
F 9 "Mouser" H 8825 5625 50  0001 C CNN "S2PL"
F 10 "sot89" H 8825 5625 50  0001 C CNN "variant"
F 11 "1:$1.46; 10:$1.19; 100:$1.19" H 8825 5625 50  0001 C CNN "kicost:RFMW:pricing"
	1    8825 5625
	1    0    0    -1  
$EndComp
Wire Wire Line
	5300 4375 5825 4375
Wire Wire Line
	5825 4375 6125 4375
Wire Wire Line
	10375 4375 10775 4375
Wire Wire Line
	9875 4375 10375 4375
Wire Wire Line
	9425 5625 9600 5625
$Comp
L device:Ferrite_Bead_Small FB2
U 1 1 5C6E31A5
P 6225 4375
F 0 "FB2" V 6080 4375 50  0000 C CNN
F 1 "~" V 6079 4375 50  0000 C CNN
F 2 "Inductor_SMD:L_0805_2012Metric" V 6155 4375 50  0001 C CNN
F 3 "~" H 6225 4375 50  0001 C CNN
F 4 "Murata Electronics" H 7525 3250 50  0001 C CNN "MFN"
F 5 "BLM21PG221SN1D" H 7525 3250 50  0001 C CNN "MFP"
F 6 "81-BLM21P221SG" H 7525 3250 50  0001 C CNN "S1PN"
F 7 "Mouser" H 7525 3250 50  0001 C CNN "S1PL"
F 8 "490-1054-1-ND" H 7525 3250 50  0001 C CNN "S2PN"
F 9 "Digi-Key" H 7525 3250 50  0001 C CNN "S2PL"
F 10 "FERRITE BEAD 220 OHM 0805 1LN" H 7525 3250 50  0001 C CNN "Description"
F 11 "0805 (2012 Metric)" H 7525 3250 50  0001 C CNN "Package ID"
F 12 "sot89" V 6225 4375 50  0001 C CNN "variant"
	1    6225 4375
	0    1    1    0   
$EndComp
$Comp
L device:CP C15
U 1 1 5C6E31AB
P 9875 4675
F 0 "C15" H 9950 4775 50  0000 L CNN
F 1 "10u/16V" H 9925 4575 50  0000 L CNN
F 2 "Capacitor_Tantalum_SMD:CP_EIA-3216-12_Kemet-S" H 9913 4525 50  0001 C CNN
F 3 "~" H 9875 4675 50  0001 C CNN
F 4 "Kemet" H 9825 1825 50  0001 C CNN "MFN"
F 5 "T491A106K016AT" H 9825 1825 50  0001 C CNN "MFP"
F 6 "80-T491A106K016" H 9825 1825 50  0001 C CNN "S1PN"
F 7 "Mouser" H 9825 1825 50  0001 C CNN "S1PL"
F 8 "399-8269-1-ND" H 9825 1825 50  0001 C CNN "S2PN"
F 9 "Digi-Key" H 9825 1825 50  0001 C CNN "S2PL"
F 10 "10µF Molded Tantalum Capacitors 16V 3 Ohm ESR" H 9825 1825 50  0001 C CNN "Description"
F 11 "1206 (3216 Metric) " H 9825 1825 50  0001 C CNN "Package ID"
F 12 "sot89" H 9875 4675 50  0001 C CNN "variant"
	1    9875 4675
	1    0    0    -1  
$EndComp
Connection ~ 5750 1450
Connection ~ 5825 4375
$Comp
L graphics:Logo_Open_Hardware_Small #LOGO1
U 1 1 5C70D97E
P 1450 1275
F 0 "#LOGO1" H 1450 1550 50  0001 C CNN
F 1 "Open Source Hardware" H 1450 1050 50  0000 C CNN
F 2 "" H 1450 1275 50  0001 C CNN
F 3 "~" H 1450 1275 50  0001 C CNN
	1    1450 1275
	1    0    0    -1  
$EndComp
Wire Wire Line
	5400 4475 5400 4875
$Comp
L project:SMA_2 J2
U 1 1 5C78947A
P 12125 2700
F 0 "J2" H 12275 2700 50  0000 L CNN
F 1 "~" H 12228 2599 50  0000 L CNN
F 2 "RF_SMA_Connectors:SMA_EDGE_4" H 12300 2600 50  0001 C CNN
F 3 "" H 12125 2700 60  0000 C CNN
F 4 "Molex" H 7125 7425 50  0001 C CNN "MFN"
F 5 "0732511150" H 7125 7425 50  0001 C CNN "MFP"
F 6 "S01-SJEDM-11BS05" H 7125 7425 50  0001 C CNN "S1PN"
F 7 "Superbat" H 7125 7425 50  0001 C CNN "S1PL"
F 8 "73251-1150" H 7125 7425 50  0001 C CNN "S2PN"
F 9 "TTI" H 7125 7425 50  0001 C CNN "S2PL"
F 10 "SMA ST PCB-JCK" H 7125 7425 50  0001 C CNN "Description"
F 11 "sot86" H 12125 2700 50  0001 C CNN "variant"
F 12 "1:$1.20; 10:$1.08; 100:$0.98" H 12125 2700 50  0001 C CNN "kicost:RF_Supplier:pricing"
	1    12125 2700
	1    0    0    -1  
$EndComp
$Comp
L project:SMA_2 J4
U 1 1 5C789547
P 12725 5625
F 0 "J4" H 12850 5625 50  0000 L CNN
F 1 "~" H 12828 5524 50  0000 L CNN
F 2 "RF_SMA_Connectors:SMA_EDGE_4" H 12900 5525 50  0001 C CNN
F 3 "" H 12725 5625 60  0000 C CNN
F 4 "Molex" H 7700 7500 50  0001 C CNN "MFN"
F 5 "0732511150" H 7700 7500 50  0001 C CNN "MFP"
F 6 "S01-SJEDM-11BS05" H 7700 7500 50  0001 C CNN "S1PN"
F 7 "Superbat" H 7700 7500 50  0001 C CNN "S1PL"
F 8 "73251-1150" H 7700 7500 50  0001 C CNN "S2PN"
F 9 "TTI" H 7700 7500 50  0001 C CNN "S2PL"
F 10 "SMA ST PCB-JCK" H 7700 7500 50  0001 C CNN "Description"
F 11 "sot89" H 12725 5625 50  0001 C CNN "variant"
F 12 "1:$1.20; 10:$1.08; 100:$0.98" H 12725 5625 50  0001 C CNN "kicost:RF_Supplier:pricing"
	1    12725 5625
	1    0    0    -1  
$EndComp
$Comp
L project:SMA_2 J1
U 1 1 5C789601
P 4975 2700
F 0 "J1" H 5125 2700 50  0000 C CNN
F 1 "~" H 4944 2849 50  0000 C CNN
F 2 "RF_SMA_Connectors:SMA_EDGE_4" H 5150 2600 50  0001 C CNN
F 3 "" H 4975 2700 60  0000 C CNN
F 4 "Molex" H 7125 7425 50  0001 C CNN "MFN"
F 5 "0732511150" H 7125 7425 50  0001 C CNN "MFP"
F 6 "S01-SJEDM-11BS05" H 7125 7425 50  0001 C CNN "S1PN"
F 7 "Superbat" H 7125 7425 50  0001 C CNN "S1PL"
F 8 "07325-11150" H 7125 7425 50  0001 C CNN "S2PN"
F 9 "TTI" H 7125 7425 50  0001 C CNN "S2PL"
F 10 "SMA ST PCB-JCK" H 7125 7425 50  0001 C CNN "Description"
F 11 "sot86" H 4975 2700 50  0001 C CNN "variant"
F 12 "1:$1.20; 10:$1.08; 100:$0.98" H 4975 2700 50  0001 C CNN "kicost:RF_Supplier:pricing"
	1    4975 2700
	-1   0    0    -1  
$EndComp
$Comp
L project:SMA_2 J3
U 1 1 5C789719
P 4525 5625
F 0 "J3" H 4675 5625 50  0000 C CNN
F 1 "~" H 4494 5774 50  0000 C CNN
F 2 "RF_SMA_Connectors:SMA_EDGE_4" H 4700 5525 50  0001 C CNN
F 3 "" H 4525 5625 60  0000 C CNN
F 4 "Molex" H 6625 7500 50  0001 C CNN "MFN"
F 5 "0732511150" H 6625 7500 50  0001 C CNN "MFP"
F 6 "S01-SJEDM-11BS05" H 6625 7500 50  0001 C CNN "S1PN"
F 7 "Superbat" H 6625 7500 50  0001 C CNN "S1PL"
F 8 "73251-1150" H 6625 7500 50  0001 C CNN "S2PN"
F 9 "TTI" H 6625 7500 50  0001 C CNN "S2PL"
F 10 "SMA ST PCB-JCK" H 6625 7500 50  0001 C CNN "Description"
F 11 "sot89" H 4525 5625 50  0001 C CNN "variant"
F 12 "1:$1.20; 10:$1.08; 100:$0.98" H 4525 5625 50  0001 C CNN "kicost:RF_Supplier:pricing"
	1    4525 5625
	-1   0    0    -1  
$EndComp
$Comp
L power:GND #PWR0101
U 1 1 5C78C1E2
P 4525 5800
F 0 "#PWR0101" H 4525 5800 30  0001 C CNN
F 1 "GND" H 4525 5730 30  0001 C CNN
F 2 "" H 4525 5800 60  0001 C CNN
F 3 "" H 4525 5800 60  0001 C CNN
	1    4525 5800
	1    0    0    -1  
$EndComp
$Comp
L power:GND #PWR0102
U 1 1 5C78E8EC
P 4975 2875
F 0 "#PWR0102" H 4975 2875 30  0001 C CNN
F 1 "GND" H 4975 2805 30  0001 C CNN
F 2 "" H 4975 2875 60  0001 C CNN
F 3 "" H 4975 2875 60  0001 C CNN
	1    4975 2875
	1    0    0    -1  
$EndComp
$Comp
L power:GND #PWR0103
U 1 1 5C791375
P 12125 2875
F 0 "#PWR0103" H 12125 2875 30  0001 C CNN
F 1 "GND" H 12125 2805 30  0001 C CNN
F 2 "" H 12125 2875 60  0001 C CNN
F 3 "" H 12125 2875 60  0001 C CNN
	1    12125 2875
	1    0    0    -1  
$EndComp
$Comp
L power:GND #PWR0104
U 1 1 5C79399E
P 12725 5800
F 0 "#PWR0104" H 12725 5800 30  0001 C CNN
F 1 "GND" H 12725 5730 30  0001 C CNN
F 2 "" H 12725 5800 60  0001 C CNN
F 3 "" H 12725 5800 60  0001 C CNN
	1    12725 5800
	1    0    0    -1  
$EndComp
$Comp
L project:rfi_shield_clip P3
U 1 1 5C796E6C
P 1650 2950
F 0 "P3" H 1778 2969 60  0000 L CNN
F 1 "~" H 1778 2916 60  0000 L CNN
F 2 "RF_Shielding:S1721-46R" H 1650 2950 60  0001 C CNN
F 3 "" H 1650 2950 60  0000 C CNN
F 4 "Harwin Inc." H 1650 2950 50  0001 C CNN "MFN"
F 5 "S1721-46R" H 1650 2950 50  0001 C CNN "MFP"
F 6 "952-1476-1-ND" H 1650 2950 50  0001 C CNN "S1PN"
F 7 "Digi-Key" H 1650 2950 50  0001 C CNN "S1PL"
F 8 "855-S1721-46R" H 1650 2950 50  0001 C CNN "S2PN"
F 9 "Arrow" H 1650 2950 50  0001 C CNN "S2PL"
F 10 "RFI SHIELD CLIP MINI TIN SMD" H 1650 2950 50  0001 C CNN "Description"
F 11 "sot86" H 1650 2950 50  0001 C CNN "variant"
	1    1650 2950
	1    0    0    -1  
$EndComp
$Comp
L power:GND #PWR037
U 1 1 5C797178
P 1650 3050
F 0 "#PWR037" H 1650 3050 30  0001 C CNN
F 1 "GND" H 1650 2980 30  0001 C CNN
F 2 "" H 1650 3050 60  0001 C CNN
F 3 "" H 1650 3050 60  0001 C CNN
	1    1650 3050
	1    0    0    -1  
$EndComp
$Comp
L power:GND #PWR038
U 1 1 5C79736B
P 2100 3050
F 0 "#PWR038" H 2100 3050 30  0001 C CNN
F 1 "GND" H 2100 2980 30  0001 C CNN
F 2 "" H 2100 3050 60  0001 C CNN
F 3 "" H 2100 3050 60  0001 C CNN
	1    2100 3050
	1    0    0    -1  
$EndComp
$Comp
L power:GND #PWR039
U 1 1 5C7998B4
P 1650 3575
F 0 "#PWR039" H 1650 3575 30  0001 C CNN
F 1 "GND" H 1650 3505 30  0001 C CNN
F 2 "" H 1650 3575 60  0001 C CNN
F 3 "" H 1650 3575 60  0001 C CNN
	1    1650 3575
	1    0    0    -1  
$EndComp
$Comp
L power:GND #PWR040
U 1 1 5C7998C0
P 2100 3575
F 0 "#PWR040" H 2100 3575 30  0001 C CNN
F 1 "GND" H 2100 3505 30  0001 C CNN
F 2 "" H 2100 3575 60  0001 C CNN
F 3 "" H 2100 3575 60  0001 C CNN
	1    2100 3575
	1    0    0    -1  
$EndComp
Wire Wire Line
	9350 2500 9350 2700
Wire Wire Line
	9425 5425 9425 5625
$Comp
L device:C C7
U 1 1 5D071601
P 10700 1750
F 0 "C7" H 10750 1850 50  0000 L CNN
F 1 "0.01uF" H 10750 1650 50  0000 L CNN
F 2 "Capacitor_SMD:C_0603_1608Metric" H 10700 1750 60  0001 C CNN
F 3 "" H 10700 1750 60  0001 C CNN
F 4 "Kemet" H 10700 1750 50  0001 C CNN "MFN"
F 5 "C0603C103K5RACTU" H 10700 1750 50  0001 C CNN "MFP"
F 6 "399-1091-1-ND" H 10700 1750 50  0001 C CNN "S1PN"
F 7 "Digi-Key" H 10700 1750 50  0001 C CNN "S1PL"
F 8 "80-C0603C103K5R" H 10700 1750 50  0001 C CNN "S2PN"
F 9 "Mouser" H 10700 1750 50  0001 C CNN "S2PL"
F 10 "Multilayer Ceramic Capacitors MLCC - SMD/SMT 50V 0.01uF 0603 X7R 10%" H 10700 1750 50  0001 C CNN "Description"
F 11 "0603 (1608 metric)" H 10700 1750 50  0001 C CNN "Package ID"
F 12 "sot86" H 10700 1750 50  0001 C CNN "variant"
	1    10700 1750
	1    0    0    -1  
$EndComp
$Comp
L device:C C11
U 1 1 5D0750D3
P 5825 4675
F 0 "C11" H 5875 4775 50  0000 L CNN
F 1 "0.01uF" H 5875 4575 50  0000 L CNN
F 2 "Capacitor_SMD:C_0603_1608Metric" H 5825 4675 60  0001 C CNN
F 3 "" H 5825 4675 60  0001 C CNN
F 4 "Kemet" H 5825 4675 50  0001 C CNN "MFN"
F 5 "C0603C103K5RACTU" H 5825 4675 50  0001 C CNN "MFP"
F 6 "399-1091-1-ND" H 5825 4675 50  0001 C CNN "S1PN"
F 7 "Digi-Key" H 5825 4675 50  0001 C CNN "S1PL"
F 8 "80-C0603C103K5R" H 5825 4675 50  0001 C CNN "S2PN"
F 9 "Mouser" H 5825 4675 50  0001 C CNN "S2PL"
F 10 "Multilayer Ceramic Capacitors MLCC - SMD/SMT 50V 0.01uF 0603 X7R 10%" H 5825 4675 50  0001 C CNN "Description"
F 11 "0603 (1608 metric)" H 5825 4675 50  0001 C CNN "Package ID"
F 12 "sot89" H 5825 4675 50  0001 C CNN "variant"
	1    5825 4675
	1    0    0    -1  
$EndComp
$Comp
L device:C C17
U 1 1 5D078BA2
P 10775 4675
F 0 "C17" H 10825 4775 50  0000 L CNN
F 1 "0.01uF" H 10825 4575 50  0000 L CNN
F 2 "Capacitor_SMD:C_0603_1608Metric" H 10775 4675 60  0001 C CNN
F 3 "" H 10775 4675 60  0001 C CNN
F 4 "Kemet" H 10775 4675 50  0001 C CNN "MFN"
F 5 "C0603C103K5RACTU" H 10775 4675 50  0001 C CNN "MFP"
F 6 "399-1091-1-ND" H 10775 4675 50  0001 C CNN "S1PN"
F 7 "Digi-Key" H 10775 4675 50  0001 C CNN "S1PL"
F 8 "80-C0603C103K5R" H 10775 4675 50  0001 C CNN "S2PN"
F 9 "Mouser" H 10775 4675 50  0001 C CNN "S2PL"
F 10 "Multilayer Ceramic Capacitors MLCC - SMD/SMT 50V 0.01uF 0603 X7R 10%" H 10775 4675 50  0001 C CNN "Description"
F 11 "0603 (1608 metric)" H 10775 4675 50  0001 C CNN "Package ID"
F 12 "sot89" H 10775 4675 50  0001 C CNN "variant"
	1    10775 4675
	1    0    0    -1  
$EndComp
$Comp
L device:C C3
U 1 1 5D07CFAC
P 7650 1750
F 0 "C3" H 7700 1850 50  0000 L CNN
F 1 "0.1uF" H 7700 1650 50  0000 L CNN
F 2 "Capacitor_SMD:C_0603_1608Metric" H 7650 1750 60  0001 C CNN
F 3 "" H 7650 1750 60  0001 C CNN
F 4 "Kemet" H 7650 1750 50  0001 C CNN "MFN"
F 5 "C0603C104J4RACTU" H 7650 1750 50  0001 C CNN "MFP"
F 6 "399-1097-1-ND" H 7650 1750 50  0001 C CNN "S1PN"
F 7 "Digi-Key" H 7650 1750 50  0001 C CNN "S1PL"
F 8 "80-C0603C104J4R" H 7650 1750 50  0001 C CNN "S2PN"
F 9 "Mouser" H 7650 1750 50  0001 C CNN "S2PL"
F 10 "CAP CER 0.1UF 16V X7R 0603" H 7650 1750 50  0001 C CNN "Description"
F 11 "0603 (1608 Metric)" H 7650 1750 50  0001 C CNN "Package ID"
	1    7650 1750
	1    0    0    -1  
$EndComp
$Comp
L device:C C4
U 1 1 5D080612
P 8800 1750
F 0 "C4" H 8850 1850 50  0000 L CNN
F 1 "0.1uF" H 8850 1650 50  0000 L CNN
F 2 "Capacitor_SMD:C_0603_1608Metric" H 8800 1750 60  0001 C CNN
F 3 "" H 8800 1750 60  0001 C CNN
F 4 "Kemet" H 8800 1750 50  0001 C CNN "MFN"
F 5 "C0603C104J4RACTU" H 8800 1750 50  0001 C CNN "MFP"
F 6 "399-1097-1-ND" H 8800 1750 50  0001 C CNN "S1PN"
F 7 "Digi-Key" H 8800 1750 50  0001 C CNN "S1PL"
F 8 "80-C0603C104J4R" H 8800 1750 50  0001 C CNN "S2PN"
F 9 "Mouser" H 8800 1750 50  0001 C CNN "S2PL"
F 10 "CAP CER 0.1UF 16V X7R 0603" H 8800 1750 50  0001 C CNN "Description"
F 11 "0603 (1608 Metric)" H 8800 1750 50  0001 C CNN "Package ID"
F 12 "sot86" H 8800 1750 50  0001 C CNN "variant"
	1    8800 1750
	1    0    0    -1  
$EndComp
$Comp
L device:C C12
U 1 1 5D083F64
P 6625 4675
F 0 "C12" H 6675 4775 50  0000 L CNN
F 1 "0.1uF" H 6675 4575 50  0000 L CNN
F 2 "Capacitor_SMD:C_0603_1608Metric" H 6625 4675 60  0001 C CNN
F 3 "" H 6625 4675 60  0001 C CNN
F 4 "Kemet" H 6625 4675 50  0001 C CNN "MFN"
F 5 "C0603C104J4RACTU" H 6625 4675 50  0001 C CNN "MFP"
F 6 "399-1097-1-ND" H 6625 4675 50  0001 C CNN "S1PN"
F 7 "Digi-Key" H 6625 4675 50  0001 C CNN "S1PL"
F 8 "80-C0603C104J4R" H 6625 4675 50  0001 C CNN "S2PN"
F 9 "Mouser" H 6625 4675 50  0001 C CNN "S2PL"
F 10 "CAP CER 0.1UF 16V X7R 0603" H 6625 4675 50  0001 C CNN "Description"
F 11 "0603 (1608 Metric)" H 6625 4675 50  0001 C CNN "Package ID"
F 12 "sot89" H 6625 4675 50  0001 C CNN "variant"
	1    6625 4675
	1    0    0    -1  
$EndComp
$Comp
L device:C C13
U 1 1 5D087624
P 7725 4675
F 0 "C13" H 7775 4775 50  0000 L CNN
F 1 "0.1uF" H 7775 4575 50  0000 L CNN
F 2 "Capacitor_SMD:C_0603_1608Metric" H 7725 4675 60  0001 C CNN
F 3 "" H 7725 4675 60  0001 C CNN
F 4 "Kemet" H 7725 4675 50  0001 C CNN "MFN"
F 5 "C0603C104J4RACTU" H 7725 4675 50  0001 C CNN "MFP"
F 6 "399-1097-1-ND" H 7725 4675 50  0001 C CNN "S1PN"
F 7 "Digi-Key" H 7725 4675 50  0001 C CNN "S1PL"
F 8 "80-C0603C104J4R" H 7725 4675 50  0001 C CNN "S2PN"
F 9 "Mouser" H 7725 4675 50  0001 C CNN "S2PL"
F 10 "CAP CER 0.1UF 16V X7R 0603" H 7725 4675 50  0001 C CNN "Description"
F 11 "0603 (1608 Metric)" H 7725 4675 50  0001 C CNN "Package ID"
F 12 "sot89" H 7725 4675 50  0001 C CNN "variant"
	1    7725 4675
	1    0    0    -1  
$EndComp
$Comp
L device:C C14
U 1 1 5D08AC9E
P 8875 4675
F 0 "C14" H 8925 4775 50  0000 L CNN
F 1 "0.1uF" H 8925 4575 50  0000 L CNN
F 2 "Capacitor_SMD:C_0603_1608Metric" H 8875 4675 60  0001 C CNN
F 3 "" H 8875 4675 60  0001 C CNN
F 4 "Kemet" H 8875 4675 50  0001 C CNN "MFN"
F 5 "C0603C104J4RACTU" H 8875 4675 50  0001 C CNN "MFP"
F 6 "399-1097-1-ND" H 8875 4675 50  0001 C CNN "S1PN"
F 7 "Digi-Key" H 8875 4675 50  0001 C CNN "S1PL"
F 8 "80-C0603C104J4R" H 8875 4675 50  0001 C CNN "S2PN"
F 9 "Mouser" H 8875 4675 50  0001 C CNN "S2PL"
F 10 "CAP CER 0.1UF 16V X7R 0603" H 8875 4675 50  0001 C CNN "Description"
F 11 "0603 (1608 Metric)" H 8875 4675 50  0001 C CNN "Package ID"
F 12 "sot89" H 8875 4675 50  0001 C CNN "variant"
	1    8875 4675
	1    0    0    -1  
$EndComp
$Comp
L project:rfi_shield_clip P4
U 1 1 5D0A8B4D
P 2100 2950
F 0 "P4" H 2228 2969 60  0000 L CNN
F 1 "~" H 2228 2916 60  0000 L CNN
F 2 "RF_Shielding:S1721-46R" H 2100 2950 60  0001 C CNN
F 3 "" H 2100 2950 60  0000 C CNN
F 4 "Harwin Inc." H 2100 2950 50  0001 C CNN "MFN"
F 5 "S1721-46R" H 2100 2950 50  0001 C CNN "MFP"
F 6 "952-1476-1-ND" H 2100 2950 50  0001 C CNN "S1PN"
F 7 "Digi-Key" H 2100 2950 50  0001 C CNN "S1PL"
F 8 "855-S1721-46R" H 2100 2950 50  0001 C CNN "S2PN"
F 9 "Mouser" H 2100 2950 50  0001 C CNN "S2PL"
F 10 "RFI SHIELD CLIP MINI TIN SMD" H 2100 2950 50  0001 C CNN "Description"
F 11 "sot86" H 2100 2950 50  0001 C CNN "variant"
	1    2100 2950
	1    0    0    -1  
$EndComp
$Comp
L project:rfi_shield_clip P6
U 1 1 5D0AC1A8
P 2100 3475
F 0 "P6" H 2228 3494 60  0000 L CNN
F 1 "~" H 2228 3441 60  0000 L CNN
F 2 "RF_Shielding:S1721-46R" H 2100 3475 60  0001 C CNN
F 3 "" H 2100 3475 60  0000 C CNN
F 4 "Harwin Inc." H 2100 3475 50  0001 C CNN "MFN"
F 5 "S1721-46R" H 2100 3475 50  0001 C CNN "MFP"
F 6 "952-1476-1-ND" H 2100 3475 50  0001 C CNN "S1PN"
F 7 "Digi-Key" H 2100 3475 50  0001 C CNN "S1PL"
F 8 "855-S1721-46R" H 2100 3475 50  0001 C CNN "S2PN"
F 9 "Mouser" H 2100 3475 50  0001 C CNN "S2PL"
F 10 "RFI SHIELD CLIP MINI TIN SMD" H 2100 3475 50  0001 C CNN "Description"
F 11 "sot89" H 2100 3475 50  0001 C CNN "variant"
	1    2100 3475
	1    0    0    -1  
$EndComp
$Comp
L project:rfi_shield_clip P5
U 1 1 5D0AF815
P 1650 3475
F 0 "P5" H 1778 3494 60  0000 L CNN
F 1 "~" H 1778 3441 60  0000 L CNN
F 2 "RF_Shielding:S1721-46R" H 1650 3475 60  0001 C CNN
F 3 "" H 1650 3475 60  0000 C CNN
F 4 "Harwin Inc." H 1650 3475 50  0001 C CNN "MFN"
F 5 "S1721-46R" H 1650 3475 50  0001 C CNN "MFP"
F 6 "952-1476-1-ND" H 1650 3475 50  0001 C CNN "S1PN"
F 7 "Digi-Key" H 1650 3475 50  0001 C CNN "S1PL"
F 8 "855-S1721-46R" H 1650 3475 50  0001 C CNN "S2PN"
F 9 "Mouser" H 1650 3475 50  0001 C CNN "S2PL"
F 10 "RFI SHIELD CLIP MINI TIN SMD" H 1650 3475 50  0001 C CNN "Description"
F 11 "sot89" H 1650 3475 50  0001 C CNN "variant"
	1    1650 3475
	1    0    0    -1  
$EndComp
$Comp
L device:L L1
U 1 1 5D697045
P 9350 2350
F 0 "L1" H 9225 2400 50  0000 L CNN
F 1 "33nH" H 9125 2300 50  0000 L CNN
F 2 "Project:coilcraft_0603hp" H 9350 2350 50  0001 C CNN
F 3 "~" H 9350 2350 50  0001 C CNN
F 4 "Coilcraft" H 9350 2350 50  0001 C CNN "MFN"
F 5 "0603HP-33NXJLU" H 9350 2350 50  0001 C CNN "MFP"
F 6 "994-0603HP-33NXJLU" H 9350 2350 50  0001 C CNN "S1PN"
F 7 "Mouser" H 9350 2350 50  0001 C CNN "S1PL"
F 8 "Fixed Inductors 0603HP Hi Perfrmnce 33 nH 5 %" H 9350 2350 50  0001 C CNN "Description"
F 9 "0603 (1608 metric)" H 9350 2350 50  0001 C CNN "Package ID"
F 10 "sot86" H 9350 2350 50  0001 C CNN "variant"
	1    9350 2350
	1    0    0    -1  
$EndComp
$Comp
L device:L L2
U 1 1 5D6AA04D
P 9425 5275
F 0 "L2" H 9478 5321 50  0000 L CNN
F 1 "12nH" H 9478 5230 50  0000 L CNN
F 2 "Project:coilcraft_0603hp" H 9425 5275 50  0001 C CNN
F 3 "~" H 9425 5275 50  0001 C CNN
F 4 "Coilcraft" H 9425 5275 50  0001 C CNN "MFN"
F 5 "0603HP-12NXJLU" H 9425 5275 50  0001 C CNN "MFP"
F 6 "994-0603HP-12NXJLU" H 9425 5275 50  0001 C CNN "S1PN"
F 7 "Mouser" H 9425 5275 50  0001 C CNN "S1PL"
F 8 "Fixed Inductors 0603HP Hi Perfrmnce 12 nH 5 %" H 9425 5275 50  0001 C CNN "Description"
F 9 "0603 (1608 metric)" H 9425 5275 50  0001 C CNN "Package ID"
F 10 "sot89" H 9425 5275 50  0001 C CNN "variant"
	1    9425 5275
	1    0    0    -1  
$EndComp
$Comp
L power:GND #PWR045
U 1 1 5DC86445
P 5900 7800
F 0 "#PWR045" H 5900 7800 30  0001 C CNN
F 1 "GND" H 5900 7730 30  0001 C CNN
F 2 "" H 5900 7800 60  0001 C CNN
F 3 "" H 5900 7800 60  0001 C CNN
	1    5900 7800
	1    0    0    -1  
$EndComp
$Comp
L power:GND #PWR046
U 1 1 5DC8644B
P 6700 7800
F 0 "#PWR046" H 6700 7800 30  0001 C CNN
F 1 "GND" H 6700 7730 30  0001 C CNN
F 2 "" H 6700 7800 60  0001 C CNN
F 3 "" H 6700 7800 60  0001 C CNN
	1    6700 7800
	1    0    0    -1  
$EndComp
$Comp
L device:R R15
U 1 1 5DC86451
P 7250 7350
F 0 "R15" V 7150 7350 50  0000 C CNN
F 1 "75 1/4W" V 7350 7350 50  0000 C CNN
F 2 "Resistor_SMD:R_1206_3216Metric" H 7250 7350 60  0001 C CNN
F 3 "" H 7250 7350 60  0001 C CNN
F 4 "Yageo" H 7250 7350 50  0001 C CNN "MFN"
F 5 "RC1206JR-0775RL" H 7250 7350 50  0001 C CNN "MFP"
F 6 "311-75ERCT-ND" H 7250 7350 50  0001 C CNN "S1PN"
F 7 "Digi-Key" H 7250 7350 50  0001 C CNN "S1PL"
F 8 "603-RC1206JR-0775RL" H 7250 7350 50  0001 C CNN "S2PN"
F 9 "Mouser" H 7250 7350 50  0001 C CNN "S2PL"
F 10 "75 Ohms ±5% 0.25W, 1/4W Chip Resistor" H 7250 7350 50  0001 C CNN "Description"
F 11 "1206 (3216 Metric)" H 7250 7350 50  0001 C CNN "Package ID"
F 12 "dfn" V 7250 7350 50  0001 C CNN "variant"
	1    7250 7350
	0    -1   -1   0   
$EndComp
$Comp
L power:GND #PWR047
U 1 1 5DC8645D
P 7800 7800
F 0 "#PWR047" H 7800 7800 30  0001 C CNN
F 1 "GND" H 7800 7730 30  0001 C CNN
F 2 "" H 7800 7800 60  0001 C CNN
F 3 "" H 7800 7800 60  0001 C CNN
	1    7800 7800
	1    0    0    -1  
$EndComp
Wire Wire Line
	6400 7350 6700 7350
Wire Wire Line
	6700 7500 6700 7350
Connection ~ 6700 7350
Wire Wire Line
	5900 7500 5900 7350
Wire Wire Line
	7800 7500 7800 7350
Connection ~ 7800 7350
$Comp
L device:C C26
U 1 1 5DC86472
P 10725 7650
F 0 "C26" H 10775 7750 50  0000 L CNN
F 1 "100pF" H 10775 7550 50  0000 L CNN
F 2 "Capacitor_SMD:C_0603_1608Metric" H 10725 7650 60  0001 C CNN
F 3 "" H 10725 7650 60  0001 C CNN
F 4 "Yageo" H 10675 4800 50  0001 C CNN "MFN"
F 5 "CC0603JRNPO9BN101" H 10675 4800 50  0001 C CNN "MFP"
F 6 "311-1069-1-ND" H 10675 4800 50  0001 C CNN "S1PN"
F 7 "Digi-Key" H 10675 4800 50  0001 C CNN "S1PL"
F 8 "603-CC603JRNPO9BN101" H 10675 4800 50  0001 C CNN "S2PN"
F 9 "Mouser" H 10675 4800 50  0001 C CNN "S2PL"
F 10 "100pF ±5% 50V Ceramic Capacitor C0G, NP0" H 10675 4800 50  0001 C CNN "Description"
F 11 "0603 (1608 Metric)" H 10675 4800 50  0001 C CNN "Package ID"
F 12 "dfn" H 10725 7650 50  0001 C CNN "variant"
	1    10725 7650
	1    0    0    -1  
$EndComp
Wire Wire Line
	11125 7350 11125 7500
Wire Wire Line
	10725 7500 10725 7350
Connection ~ 10725 7350
Wire Wire Line
	10225 7500 10225 7350
Connection ~ 10225 7350
$Comp
L power:GND #PWR052
U 1 1 5DC86480
P 5475 7850
F 0 "#PWR052" H 5475 7850 30  0001 C CNN
F 1 "GND" H 5475 7780 30  0001 C CNN
F 2 "" H 5475 7850 60  0001 C CNN
F 3 "" H 5475 7850 60  0001 C CNN
	1    5475 7850
	1    0    0    -1  
$EndComp
$Comp
L power:GND #PWR048
U 1 1 5DC86486
P 9400 7800
F 0 "#PWR048" H 9400 7800 30  0001 C CNN
F 1 "GND" H 9400 7730 30  0001 C CNN
F 2 "" H 9400 7800 60  0001 C CNN
F 3 "" H 9400 7800 60  0001 C CNN
	1    9400 7800
	1    0    0    -1  
$EndComp
$Comp
L power:GND #PWR049
U 1 1 5DC8648C
P 10225 7800
F 0 "#PWR049" H 10225 7800 30  0001 C CNN
F 1 "GND" H 10225 7730 30  0001 C CNN
F 2 "" H 10225 7800 60  0001 C CNN
F 3 "" H 10225 7800 60  0001 C CNN
	1    10225 7800
	1    0    0    -1  
$EndComp
$Comp
L power:GND #PWR050
U 1 1 5DC86492
P 10725 7800
F 0 "#PWR050" H 10725 7800 30  0001 C CNN
F 1 "GND" H 10725 7730 30  0001 C CNN
F 2 "" H 10725 7800 60  0001 C CNN
F 3 "" H 10725 7800 60  0001 C CNN
	1    10725 7800
	1    0    0    -1  
$EndComp
$Comp
L power:GND #PWR051
U 1 1 5DC86498
P 11125 7800
F 0 "#PWR051" H 11125 7800 30  0001 C CNN
F 1 "GND" H 11125 7730 30  0001 C CNN
F 2 "" H 11125 7800 60  0001 C CNN
F 3 "" H 11125 7800 60  0001 C CNN
	1    11125 7800
	1    0    0    -1  
$EndComp
$Comp
L device:C C28
U 1 1 5DC864B6
P 7350 8600
F 0 "C28" V 7450 8650 50  0000 L CNN
F 1 "100p" V 7450 8350 50  0000 L CNN
F 2 "Capacitor_SMD:C_0402_1005Metric" H 7350 8600 60  0001 C CNN
F 3 "" H 7350 8600 60  0001 C CNN
F 4 "Kemet" H 3225 4800 50  0001 C CNN "MFN"
F 5 "CBR04C101J3GAC" H 3225 4800 50  0001 C CNN "MFP"
F 6 "80-CBR04C101J3GAC" H 3225 4800 50  0001 C CNN "S1PN"
F 7 "Mouser" H 3225 4800 50  0001 C CNN "S1PL"
F 8 "399-17684-1-ND" H 3225 4800 50  0001 C CNN "S2PN"
F 9 "Digi-Key" H 3225 4800 50  0001 C CNN "S2PL"
F 10 "HiQ-CBR Series, C0G Dielectric, Low ESR, High SRF" H 3225 4800 50  0001 C CNN "Description"
F 11 "0402 (1005 metric)" H 3225 4800 50  0001 C CNN "Package ID"
F 12 "dfn" V 10325 8600 50  0001 C CNN "variant"
	1    7350 8600
	0    -1   -1   0   
$EndComp
$Comp
L device:C C29
U 1 1 5DC864BC
P 10050 8600
F 0 "C29" V 10150 8675 50  0000 L CNN
F 1 "100p" V 10150 8325 50  0000 L CNN
F 2 "Capacitor_SMD:C_0402_1005Metric" H 10050 8600 60  0001 C CNN
F 3 "" H 10050 8600 60  0001 C CNN
F 4 "Kemet" H 2950 4800 50  0001 C CNN "MFN"
F 5 "CBR04C101J3GAC" H 2950 4800 50  0001 C CNN "MFP"
F 6 "80-CBR04C101J3GAC" H 2950 4800 50  0001 C CNN "S1PN"
F 7 "Mouser" H 2950 4800 50  0001 C CNN "S1PL"
F 8 "399-17684-1-ND" H 2950 4800 50  0001 C CNN "S2PN"
F 9 "Digi-Key" H 2950 4800 50  0001 C CNN "S2PL"
F 10 "HiQ-CBR Series, C0G Dielectric, Low ESR, High SRF" H 2950 4800 50  0001 C CNN "Description"
F 11 "0402 (1005 metric)" H 2950 4800 50  0001 C CNN "Package ID"
F 12 "dfn" V 10050 8600 50  0001 C CNN "variant"
	1    10050 8600
	0    -1   -1   0   
$EndComp
Wire Wire Line
	7500 8600 7650 8600
Text Notes 13050 8475 0    60   ~ 0
A-RF Out
Text Notes 4000 8475 0    60   ~ 0
A-RF In
$Comp
L device:R X27
U 1 1 5DC8651E
P 7650 8950
F 0 "X27" H 7800 8950 50  0000 C CNN
F 1 "DNF" H 7500 8950 50  0000 C CNN
F 2 "Capacitor_SMD:C_0402_1005Metric" H 7650 8950 60  0001 C CNN
F 3 "" H 7650 8950 60  0001 C CNN
F 4 "dfn" H 7650 8950 50  0001 C CNN "variant"
F 5 "1" H 7650 8950 50  0001 C CNN "DNP"
	1    7650 8950
	-1   0    0    1   
$EndComp
$Comp
L power:GND #PWR061
U 1 1 5DC86524
P 7650 9100
F 0 "#PWR061" H 7650 9100 30  0001 C CNN
F 1 "GND" H 7650 9030 30  0001 C CNN
F 2 "" H 7650 9100 60  0001 C CNN
F 3 "" H 7650 9100 60  0001 C CNN
	1    7650 9100
	1    0    0    -1  
$EndComp
Wire Wire Line
	7650 8800 7650 8600
Connection ~ 7650 8600
$Comp
L device:C C30
U 1 1 5DC8652C
P 9750 8950
F 0 "C30" H 9800 9050 50  0000 L CNN
F 1 "DNF" H 9800 8850 50  0000 L CNN
F 2 "Capacitor_SMD:C_0402_1005Metric" H 9750 8950 60  0001 C CNN
F 3 "" H 9750 8950 60  0001 C CNN
F 4 "dfn" H 9750 8950 50  0001 C CNN "variant"
F 5 "1" H 9750 8950 50  0001 C CNN "DNP"
	1    9750 8950
	1    0    0    -1  
$EndComp
$Comp
L power:GND #PWR062
U 1 1 5DC86532
P 9750 9100
F 0 "#PWR062" H 9750 9100 30  0001 C CNN
F 1 "GND" H 9750 9030 30  0001 C CNN
F 2 "" H 9750 9100 60  0001 C CNN
F 3 "" H 9750 9100 60  0001 C CNN
	1    9750 9100
	1    0    0    -1  
$EndComp
Wire Wire Line
	5375 7450 5475 7450
Wire Wire Line
	9750 8800 9750 8600
Wire Wire Line
	5375 7350 5900 7350
Wire Wire Line
	5900 7350 6200 7350
Wire Wire Line
	10725 7350 11125 7350
Wire Wire Line
	10225 7350 10725 7350
Wire Wire Line
	7650 8600 8625 8600
$Comp
L device:Ferrite_Bead_Small FB3
U 1 1 5DC8655E
P 6300 7350
F 0 "FB3" V 6155 7350 50  0000 C CNN
F 1 "~" V 6154 7350 50  0000 C CNN
F 2 "Inductor_SMD:L_0805_2012Metric" V 6230 7350 50  0001 C CNN
F 3 "~" H 6300 7350 50  0001 C CNN
F 4 "Murata Electronics" H 7600 6225 50  0001 C CNN "MFN"
F 5 "BLM21PG221SN1D" H 7600 6225 50  0001 C CNN "MFP"
F 6 "81-BLM21P221SG" H 7600 6225 50  0001 C CNN "S1PN"
F 7 "Mouser" H 7600 6225 50  0001 C CNN "S1PL"
F 8 "490-1054-1-ND" H 7600 6225 50  0001 C CNN "S2PN"
F 9 "Digi-Key" H 7600 6225 50  0001 C CNN "S2PL"
F 10 "FERRITE BEAD 220 OHM 0805 1LN" H 7600 6225 50  0001 C CNN "Description"
F 11 "0805 (2012 Metric)" H 7600 6225 50  0001 C CNN "Package ID"
F 12 "dfn" V 6300 7350 50  0001 C CNN "variant"
	1    6300 7350
	0    1    1    0   
$EndComp
$Comp
L device:CP C25
U 1 1 5DC8656C
P 10225 7650
F 0 "C25" H 10300 7750 50  0000 L CNN
F 1 "10u/16V" H 10275 7550 50  0000 L CNN
F 2 "Capacitor_Tantalum_SMD:CP_EIA-3216-12_Kemet-S" H 10263 7500 50  0001 C CNN
F 3 "~" H 10225 7650 50  0001 C CNN
F 4 "Kemet" H 10175 4800 50  0001 C CNN "MFN"
F 5 "T491A106K016AT" H 10175 4800 50  0001 C CNN "MFP"
F 6 "80-T491A106K016" H 10175 4800 50  0001 C CNN "S1PN"
F 7 "Mouser" H 10175 4800 50  0001 C CNN "S1PL"
F 8 "399-8269-1-ND" H 10175 4800 50  0001 C CNN "S2PN"
F 9 "Digi-Key" H 10175 4800 50  0001 C CNN "S2PL"
F 10 "10µF Molded Tantalum Capacitors 16V 3 Ohm ESR" H 10175 4800 50  0001 C CNN "Description"
F 11 "1206 (3216 Metric) " H 10175 4800 50  0001 C CNN "Package ID"
F 12 "dfn" H 10225 7650 50  0001 C CNN "variant"
	1    10225 7650
	1    0    0    -1  
$EndComp
Connection ~ 5900 7350
Wire Wire Line
	5475 7450 5475 7850
$Comp
L project:SMA_2 J8
U 1 1 5DC8657E
P 12800 8600
F 0 "J8" H 12925 8600 50  0000 L CNN
F 1 "~" H 12903 8499 50  0000 L CNN
F 2 "RF_SMA_Connectors:SMA_EDGE_4" H 12975 8500 50  0001 C CNN
F 3 "" H 12800 8600 60  0000 C CNN
F 4 "Molex" H 7775 10475 50  0001 C CNN "MFN"
F 5 "0732511150" H 7775 10475 50  0001 C CNN "MFP"
F 6 "S01-SJEDM-11BS05" H 7775 10475 50  0001 C CNN "S1PN"
F 7 "Superbat" H 7775 10475 50  0001 C CNN "S1PL"
F 8 "73251-1150" H 7775 10475 50  0001 C CNN "S2PN"
F 9 "TTI" H 7775 10475 50  0001 C CNN "S2PL"
F 10 "SMA ST PCB-JCK" H 7775 10475 50  0001 C CNN "Description"
F 11 "dfn" H 12800 8600 50  0001 C CNN "variant"
F 12 "1:$1.20; 10:$1.08; 100:$0.98" H 12800 8600 50  0001 C CNN "kicost:RF_Supplier:pricing"
	1    12800 8600
	1    0    0    -1  
$EndComp
$Comp
L project:SMA_2 J7
U 1 1 5DC8658B
P 4600 8600
F 0 "J7" H 4750 8600 50  0000 C CNN
F 1 "~" H 4569 8749 50  0000 C CNN
F 2 "RF_SMA_Connectors:SMA_EDGE_4" H 4775 8500 50  0001 C CNN
F 3 "" H 4600 8600 60  0000 C CNN
F 4 "Molex" H 6700 10475 50  0001 C CNN "MFN"
F 5 "0732511150" H 6700 10475 50  0001 C CNN "MFP"
F 6 "S01-SJEDM-11BS05" H 6700 10475 50  0001 C CNN "S1PN"
F 7 "Superbat" H 6700 10475 50  0001 C CNN "S1PL"
F 8 "73251-1150" H 6700 10475 50  0001 C CNN "S2PN"
F 9 "TTI" H 6700 10475 50  0001 C CNN "S2PL"
F 10 "SMA ST PCB-JCK" H 6700 10475 50  0001 C CNN "Description"
F 11 "dfn" H 4600 8600 50  0001 C CNN "variant"
F 12 "1:$1.20; 10:$1.08; 100:$0.98" H 4600 8600 50  0001 C CNN "kicost:RF_Supplier:pricing"
	1    4600 8600
	-1   0    0    -1  
$EndComp
$Comp
L power:GND #PWR055
U 1 1 5DC86591
P 4600 8775
F 0 "#PWR055" H 4600 8775 30  0001 C CNN
F 1 "GND" H 4600 8705 30  0001 C CNN
F 2 "" H 4600 8775 60  0001 C CNN
F 3 "" H 4600 8775 60  0001 C CNN
	1    4600 8775
	1    0    0    -1  
$EndComp
$Comp
L power:GND #PWR056
U 1 1 5DC86597
P 12800 8775
F 0 "#PWR056" H 12800 8775 30  0001 C CNN
F 1 "GND" H 12800 8705 30  0001 C CNN
F 2 "" H 12800 8775 60  0001 C CNN
F 3 "" H 12800 8775 60  0001 C CNN
	1    12800 8775
	1    0    0    -1  
$EndComp
$Comp
L device:C C21
U 1 1 5DC865D7
P 5900 7650
F 0 "C21" H 5950 7750 50  0000 L CNN
F 1 "0.01uF" H 5950 7550 50  0000 L CNN
F 2 "Capacitor_SMD:C_0603_1608Metric" H 5900 7650 60  0001 C CNN
F 3 "" H 5900 7650 60  0001 C CNN
F 4 "Kemet" H 5900 7650 50  0001 C CNN "MFN"
F 5 "C0603C103K5RACTU" H 5900 7650 50  0001 C CNN "MFP"
F 6 "399-1091-1-ND" H 5900 7650 50  0001 C CNN "S1PN"
F 7 "Digi-Key" H 5900 7650 50  0001 C CNN "S1PL"
F 8 "80-C0603C103K5R" H 5900 7650 50  0001 C CNN "S2PN"
F 9 "Mouser" H 5900 7650 50  0001 C CNN "S2PL"
F 10 "Multilayer Ceramic Capacitors MLCC - SMD/SMT 50V 0.01uF 0603 X7R 10%" H 5900 7650 50  0001 C CNN "Description"
F 11 "0603 (1608 metric)" H 5900 7650 50  0001 C CNN "Package ID"
F 12 "dfn" H 5900 7650 50  0001 C CNN "variant"
	1    5900 7650
	1    0    0    -1  
$EndComp
$Comp
L device:C C27
U 1 1 5DC865E5
P 11125 7650
F 0 "C27" H 11175 7750 50  0000 L CNN
F 1 "0.01uF" H 11175 7550 50  0000 L CNN
F 2 "Capacitor_SMD:C_0603_1608Metric" H 11125 7650 60  0001 C CNN
F 3 "" H 11125 7650 60  0001 C CNN
F 4 "Kemet" H 11125 7650 50  0001 C CNN "MFN"
F 5 "C0603C103K5RACTU" H 11125 7650 50  0001 C CNN "MFP"
F 6 "399-1091-1-ND" H 11125 7650 50  0001 C CNN "S1PN"
F 7 "Digi-Key" H 11125 7650 50  0001 C CNN "S1PL"
F 8 "80-C0603C103K5R" H 11125 7650 50  0001 C CNN "S2PN"
F 9 "Mouser" H 11125 7650 50  0001 C CNN "S2PL"
F 10 "Multilayer Ceramic Capacitors MLCC - SMD/SMT 50V 0.01uF 0603 X7R 10%" H 11125 7650 50  0001 C CNN "Description"
F 11 "0603 (1608 metric)" H 11125 7650 50  0001 C CNN "Package ID"
F 12 "dfn" H 11125 7650 50  0001 C CNN "variant"
	1    11125 7650
	1    0    0    -1  
$EndComp
$Comp
L device:C C22
U 1 1 5DC865F3
P 6700 7650
F 0 "C22" H 6750 7750 50  0000 L CNN
F 1 "0.1uF" H 6750 7550 50  0000 L CNN
F 2 "Capacitor_SMD:C_0603_1608Metric" H 6700 7650 60  0001 C CNN
F 3 "" H 6700 7650 60  0001 C CNN
F 4 "Kemet" H 6700 7650 50  0001 C CNN "MFN"
F 5 "C0603C104J4RACTU" H 6700 7650 50  0001 C CNN "MFP"
F 6 "399-1097-1-ND" H 6700 7650 50  0001 C CNN "S1PN"
F 7 "Digi-Key" H 6700 7650 50  0001 C CNN "S1PL"
F 8 "80-C0603C104J4R" H 6700 7650 50  0001 C CNN "S2PN"
F 9 "Mouser" H 6700 7650 50  0001 C CNN "S2PL"
F 10 "CAP CER 0.1UF 16V X7R 0603" H 6700 7650 50  0001 C CNN "Description"
F 11 "0603 (1608 Metric)" H 6700 7650 50  0001 C CNN "Package ID"
F 12 "dfn" H 6700 7650 50  0001 C CNN "variant"
	1    6700 7650
	1    0    0    -1  
$EndComp
$Comp
L device:C C23
U 1 1 5DC86601
P 7800 7650
F 0 "C23" H 7850 7750 50  0000 L CNN
F 1 "0.1uF" H 7850 7550 50  0000 L CNN
F 2 "Capacitor_SMD:C_0603_1608Metric" H 7800 7650 60  0001 C CNN
F 3 "" H 7800 7650 60  0001 C CNN
F 4 "Kemet" H 7800 7650 50  0001 C CNN "MFN"
F 5 "C0603C104J4RACTU" H 7800 7650 50  0001 C CNN "MFP"
F 6 "399-1097-1-ND" H 7800 7650 50  0001 C CNN "S1PN"
F 7 "Digi-Key" H 7800 7650 50  0001 C CNN "S1PL"
F 8 "80-C0603C104J4R" H 7800 7650 50  0001 C CNN "S2PN"
F 9 "Mouser" H 7800 7650 50  0001 C CNN "S2PL"
F 10 "CAP CER 0.1UF 16V X7R 0603" H 7800 7650 50  0001 C CNN "Description"
F 11 "0603 (1608 Metric)" H 7800 7650 50  0001 C CNN "Package ID"
F 12 "dfn" H 7800 7650 50  0001 C CNN "variant"
	1    7800 7650
	1    0    0    -1  
$EndComp
$Comp
L device:C C24
U 1 1 5DC8660F
P 9400 7650
F 0 "C24" H 9200 7750 50  0000 L CNN
F 1 "0.1uF" H 9150 7525 50  0000 L CNN
F 2 "Capacitor_SMD:C_0603_1608Metric" H 9400 7650 60  0001 C CNN
F 3 "" H 9400 7650 60  0001 C CNN
F 4 "Kemet" H 9400 7650 50  0001 C CNN "MFN"
F 5 "C0603C104J4RACTU" H 9400 7650 50  0001 C CNN "MFP"
F 6 "399-1097-1-ND" H 9400 7650 50  0001 C CNN "S1PN"
F 7 "Digi-Key" H 9400 7650 50  0001 C CNN "S1PL"
F 8 "80-C0603C104J4R" H 9400 7650 50  0001 C CNN "S2PN"
F 9 "Mouser" H 9400 7650 50  0001 C CNN "S2PL"
F 10 "CAP CER 0.1UF 16V X7R 0603" H 9400 7650 50  0001 C CNN "Description"
F 11 "0603 (1608 Metric)" H 9400 7650 50  0001 C CNN "Package ID"
F 12 "dfn" H 9400 7650 50  0001 C CNN "variant"
	1    9400 7650
	1    0    0    -1  
$EndComp
$Comp
L project:GRF2003DS U3
U 1 1 5DC8664D
P 8925 8600
F 0 "U3" H 9150 8775 50  0000 L CNN
F 1 "GRF2014" H 9150 8475 50  0000 L CNN
F 2 "GRF_DFN:DFN-6-1EP_1.5x1.5mm_P0.5mm_EP0.6x1.1mm" H 8925 8600 60  0001 C CNN
F 3 "" H 8925 8600 60  0000 C CNN
F 4 "Guerrilla RF" H 8925 8600 50  0001 C CNN "MFN"
F 5 "GRF2003" H 8925 8600 50  0001 C CNN "MFP"
F 6 "GRF2003" H 8925 8600 50  0001 C CNN "S1PN"
F 7 "RichardsonRFPD" H 8925 8600 50  0001 C CNN "S1PL"
F 8 "RF Amplifier .05-10GHz NF 3.8dB Gain 12dB" H 8925 8600 50  0001 C CNN "Description"
F 9 "DFN-6" H 8925 8600 50  0001 C CNN "Package ID"
F 10 "dfn" H 8925 8600 50  0001 C CNN "variant"
F 11 "1:$2.05; 10:$2.05; 100:$1.94" H 8925 8600 50  0001 C CNN "kicost:RichardsonRFPD:pricing"
	1    8925 8600
	1    0    0    -1  
$EndComp
$Comp
L device:R R17
U 1 1 5DC86653
P 8925 7650
F 0 "R17" H 8775 7700 50  0000 C CNN
F 1 "1K" H 8775 7600 50  0000 C CNN
F 2 "Resistor_SMD:R_0402_1005Metric" H 8925 7650 60  0001 C CNN
F 3 "" H 8925 7650 60  0001 C CNN
F 4 "dfn" H 8925 7650 50  0001 C CNN "variant"
	1    8925 7650
	1    0    0    -1  
$EndComp
Wire Wire Line
	8925 8300 8925 8050
Wire Wire Line
	8925 8900 8925 8950
Wire Wire Line
	8925 8950 9025 8950
Wire Wire Line
	9125 8950 9125 8900
Wire Wire Line
	9025 8900 9025 8950
Connection ~ 9025 8950
Wire Wire Line
	9025 8950 9125 8950
$Comp
L power:GND #PWR057
U 1 1 5DC8666B
P 9025 8950
F 0 "#PWR057" H 9025 8950 30  0001 C CNN
F 1 "GND" H 9025 8880 30  0001 C CNN
F 2 "" H 9025 8950 60  0001 C CNN
F 3 "" H 9025 8950 60  0001 C CNN
	1    9025 8950
	1    0    0    -1  
$EndComp
$Comp
L connector:Conn_01x02_Female P7
U 1 1 5DC86693
P 5175 7450
F 0 "P7" H 5069 7125 50  0000 C CNN
F 1 "+V" H 5069 7216 50  0000 C CNN
F 2 "Connector_PinHeader_2.54mm:PinHeader_1x02_P2.54mm_Vertical" H 5175 7450 50  0001 C CNN
F 3 "~" H 5175 7450 50  0001 C CNN
F 4 "Mintron" H 5175 7450 50  0001 C CNN "MFN"
F 5 "MTP125-1102S1" H 5175 7450 50  0001 C CNN "MFP"
F 6 "C358684" H 5175 7450 50  0001 C CNN "S1PN"
F 7 "LCSC" H 5175 7450 50  0001 C CNN "S1PL"
F 8 "Pin Header Male Pin 0.100\\\"(2.54mm) 2 pin" H 5175 7450 50  0001 C CNN "Description"
F 9 "Through Hole,P=2.54mm" H 5175 7450 50  0001 C CNN "Package ID"
F 10 "dfn" H 5175 7450 50  0001 C CNN "variant"
F 11 "1:$0.01; 10:$0.01; 100:$0.01; 500:$0.008" H 5175 7450 50  0001 C CNN "kicost:LCSC:pricing"
F 12 "https://lcsc.com/product-detail/Pin-Header-Female-Header_MINTRON-MTP125-1102S1_C358684.html" H 5175 7450 50  0001 C CNN "kicost:LCSC:link"
	1    5175 7450
	-1   0    0    1   
$EndComp
Wire Wire Line
	7575 5625 8525 5625
$Comp
L power:GND #PWR066
U 1 1 5DD9E2F9
P 1650 4050
F 0 "#PWR066" H 1650 4050 30  0001 C CNN
F 1 "GND" H 1650 3980 30  0001 C CNN
F 2 "" H 1650 4050 60  0001 C CNN
F 3 "" H 1650 4050 60  0001 C CNN
	1    1650 4050
	1    0    0    -1  
$EndComp
$Comp
L power:GND #PWR067
U 1 1 5DD9E2FF
P 2100 4050
F 0 "#PWR067" H 2100 4050 30  0001 C CNN
F 1 "GND" H 2100 3980 30  0001 C CNN
F 2 "" H 2100 4050 60  0001 C CNN
F 3 "" H 2100 4050 60  0001 C CNN
	1    2100 4050
	1    0    0    -1  
$EndComp
$Comp
L project:rfi_shield_clip P9
U 1 1 5DD9E30C
P 2100 3950
F 0 "P9" H 2228 3969 60  0000 L CNN
F 1 "~" H 2228 3916 60  0000 L CNN
F 2 "RF_Shielding:S1721-46R" H 2100 3950 60  0001 C CNN
F 3 "" H 2100 3950 60  0000 C CNN
F 4 "Harwin Inc." H 2100 3950 50  0001 C CNN "MFN"
F 5 "S1721-46R" H 2100 3950 50  0001 C CNN "MFP"
F 6 "952-1476-1-ND" H 2100 3950 50  0001 C CNN "S1PN"
F 7 "Digi-Key" H 2100 3950 50  0001 C CNN "S1PL"
F 8 "855-S1721-46R" H 2100 3950 50  0001 C CNN "S2PN"
F 9 "Mouser" H 2100 3950 50  0001 C CNN "S2PL"
F 10 "RFI SHIELD CLIP MINI TIN SMD" H 2100 3950 50  0001 C CNN "Description"
F 11 "dfn" H 2100 3950 50  0001 C CNN "variant"
	1    2100 3950
	1    0    0    -1  
$EndComp
$Comp
L project:rfi_shield_clip P8
U 1 1 5DD9E319
P 1650 3950
F 0 "P8" H 1778 3969 60  0000 L CNN
F 1 "~" H 1778 3916 60  0000 L CNN
F 2 "RF_Shielding:S1721-46R" H 1650 3950 60  0001 C CNN
F 3 "" H 1650 3950 60  0000 C CNN
F 4 "Harwin Inc." H 1650 3950 50  0001 C CNN "MFN"
F 5 "S1721-46R" H 1650 3950 50  0001 C CNN "MFP"
F 6 "952-1476-1-ND" H 1650 3950 50  0001 C CNN "S1PN"
F 7 "Digi-Key" H 1650 3950 50  0001 C CNN "S1PL"
F 8 "855-S1721-46R" H 1650 3950 50  0001 C CNN "S2PN"
F 9 "Mouser" H 1650 3950 50  0001 C CNN "S2PL"
F 10 "RFI SHIELD CLIP MINI TIN SMD" H 1650 3950 50  0001 C CNN "Description"
F 11 "dfn" H 1650 3950 50  0001 C CNN "variant"
	1    1650 3950
	1    0    0    -1  
$EndComp
Wire Wire Line
	9750 8475 9750 8600
Wire Wire Line
	9325 8600 9575 8600
Connection ~ 9750 8600
Wire Wire Line
	9750 8600 9900 8600
Wire Wire Line
	9225 8900 9225 8950
Wire Wire Line
	9225 8950 9125 8950
Connection ~ 9125 8950
Wire Wire Line
	9400 7500 9400 7350
Connection ~ 9400 7350
Wire Wire Line
	8925 7500 8925 7350
Connection ~ 8925 7350
Wire Wire Line
	8925 7350 9400 7350
Text Notes 9025 8275 1    50   ~ 0
Ien = 6mA
Text Notes 8800 7275 0    50   ~ 0
160mA
$Comp
L device:R R16
U 1 1 5E67466E
P 8350 7350
F 0 "R16" V 8250 7350 50  0000 C CNN
F 1 "75 1/4W" V 8450 7350 50  0000 C CNN
F 2 "Resistor_SMD:R_1206_3216Metric" H 8350 7350 60  0001 C CNN
F 3 "" H 8350 7350 60  0001 C CNN
F 4 "Yageo" H 8350 7350 50  0001 C CNN "MFN"
F 5 "RC1206JR-0775RL" H 8350 7350 50  0001 C CNN "MFP"
F 6 "311-75ERCT-ND" H 8350 7350 50  0001 C CNN "S1PN"
F 7 "Digi-Key" H 8350 7350 50  0001 C CNN "S1PL"
F 8 "603-RC1206JR-0775RL" H 8350 7350 50  0001 C CNN "S2PN"
F 9 "Mouser" H 8350 7350 50  0001 C CNN "S2PL"
F 10 "75 Ohms ±5% 0.25W, 1/4W Chip Resistor" H 8350 7350 50  0001 C CNN "Description"
F 11 "1206 (3216 Metric)" H 8350 7350 50  0001 C CNN "Package ID"
F 12 "dfn" V 8350 7350 50  0001 C CNN "variant"
	1    8350 7350
	0    -1   -1   0   
$EndComp
$Comp
L device:R R3
U 1 1 5E681858
P 7175 4375
F 0 "R3" V 7075 4375 50  0000 C CNN
F 1 "33 1/4W" V 7275 4375 50  0000 C CNN
F 2 "Resistor_SMD:R_1206_3216Metric" H 7175 4375 60  0001 C CNN
F 3 "" H 7175 4375 60  0001 C CNN
F 4 "Yageo" H 7175 4375 50  0001 C CNN "MFN"
F 5 "RC1206FR-0733RL" H 7175 4375 50  0001 C CNN "MFP"
F 6 "311-33.0FRCT-ND" H 7175 4375 50  0001 C CNN "S1PN"
F 7 "Digi-Key" H 7175 4375 50  0001 C CNN "S1PL"
F 8 "603-RC1206FR-0733RL" H 7175 4375 50  0001 C CNN "S2PN"
F 9 "Mouser" H 7175 4375 50  0001 C CNN "S2PL"
F 10 "33 Ohms ±1% 0.25W, 1/4W, 1206" H 7175 4375 50  0001 C CNN "Description"
F 11 "1206 (3216 Metric)" H 7175 4375 50  0001 C CNN "Package ID"
F 12 "sot89" V 7175 4375 50  0001 C CNN "variant"
	1    7175 4375
	0    -1   -1   0   
$EndComp
$Comp
L device:R R1
U 1 1 5E69B64F
P 7100 1450
F 0 "R1" V 7000 1450 50  0000 C CNN
F 1 "75 1/4W" V 7200 1450 50  0000 C CNN
F 2 "Resistor_SMD:R_1206_3216Metric" H 7100 1450 60  0001 C CNN
F 3 "" H 7100 1450 60  0001 C CNN
F 4 "Yageo" H 7100 1450 50  0001 C CNN "MFN"
F 5 "RC1206JR-0775RL" H 7100 1450 50  0001 C CNN "MFP"
F 6 "311-75ERCT-ND" H 7100 1450 50  0001 C CNN "S1PN"
F 7 "Digi-Key" H 7100 1450 50  0001 C CNN "S1PL"
F 8 "603-RC1206JR-0775RL" H 7100 1450 50  0001 C CNN "S2PN"
F 9 "Mouser" H 7100 1450 50  0001 C CNN "S2PL"
F 10 "75 Ohms ±5% 0.25W, 1/4W Chip Resistor" H 7100 1450 50  0001 C CNN "Description"
F 11 "1206 (3216 Metric)" H 7100 1450 50  0001 C CNN "Package ID"
F 12 "sot86" V 7100 1450 50  0001 C CNN "variant"
	1    7100 1450
	0    -1   -1   0   
$EndComp
$Comp
L device:R R2
U 1 1 5E6A7E46
P 8200 1450
F 0 "R2" V 8100 1450 50  0000 C CNN
F 1 "75 1/4W" V 8300 1450 50  0000 C CNN
F 2 "Resistor_SMD:R_1206_3216Metric" H 8200 1450 60  0001 C CNN
F 3 "" H 8200 1450 60  0001 C CNN
F 4 "Yageo" H 8200 1450 50  0001 C CNN "MFN"
F 5 "RC1206JR-0775RL" H 8200 1450 50  0001 C CNN "MFP"
F 6 "311-75ERCT-ND" H 8200 1450 50  0001 C CNN "S1PN"
F 7 "Digi-Key" H 8200 1450 50  0001 C CNN "S1PL"
F 8 "603-RC1206JR-0775RL" H 8200 1450 50  0001 C CNN "S2PN"
F 9 "Mouser" H 8200 1450 50  0001 C CNN "S2PL"
F 10 "75 Ohms ±5% 0.25W, 1/4W Chip Resistor" H 8200 1450 50  0001 C CNN "Description"
F 11 "1206 (3216 Metric)" H 8200 1450 50  0001 C CNN "Package ID"
F 12 "sot86" V 8200 1450 50  0001 C CNN "variant"
	1    8200 1450
	0    -1   -1   0   
$EndComp
$Comp
L device:C C18
U 1 1 5E5071AC
P 7275 5625
F 0 "C18" V 7375 5675 50  0000 L CNN
F 1 "100p" V 7375 5375 50  0000 L CNN
F 2 "Capacitor_SMD:C_0402_1005Metric" H 7275 5625 60  0001 C CNN
F 3 "" H 7275 5625 60  0001 C CNN
F 4 "Kemet" H 3150 1825 50  0001 C CNN "MFN"
F 5 "CBR04C101J3GAC" H 3150 1825 50  0001 C CNN "MFP"
F 6 "80-CBR04C101J3GAC" H 3150 1825 50  0001 C CNN "S1PN"
F 7 "Mouser" H 3150 1825 50  0001 C CNN "S1PL"
F 8 "399-17684-1-ND" H 3150 1825 50  0001 C CNN "S2PN"
F 9 "Digi-Key" H 3150 1825 50  0001 C CNN "S2PL"
F 10 "HiQ-CBR Series, C0G Dielectric, Low ESR, High SRF" H 3150 1825 50  0001 C CNN "Description"
F 11 "0402 (1005 metric)" H 3150 1825 50  0001 C CNN "Package ID"
F 12 "sot89" V 10250 5625 50  0001 C CNN "variant"
	1    7275 5625
	0    -1   -1   0   
$EndComp
$Comp
L device:C C19
U 1 1 5E513E28
P 9750 5625
F 0 "C19" V 9850 5675 50  0000 L CNN
F 1 "100p" V 9850 5375 50  0000 L CNN
F 2 "Capacitor_SMD:C_0402_1005Metric" H 9750 5625 60  0001 C CNN
F 3 "" H 9750 5625 60  0001 C CNN
F 4 "Kemet" H 5625 1825 50  0001 C CNN "MFN"
F 5 "CBR04C101J3GAC" H 5625 1825 50  0001 C CNN "MFP"
F 6 "80-CBR04C101J3GAC" H 5625 1825 50  0001 C CNN "S1PN"
F 7 "Mouser" H 5625 1825 50  0001 C CNN "S1PL"
F 8 "399-17684-1-ND" H 5625 1825 50  0001 C CNN "S2PN"
F 9 "Digi-Key" H 5625 1825 50  0001 C CNN "S2PL"
F 10 "HiQ-CBR Series, C0G Dielectric, Low ESR, High SRF" H 5625 1825 50  0001 C CNN "Description"
F 11 "0402 (1005 metric)" H 5625 1825 50  0001 C CNN "Package ID"
F 12 "sot89" V 12725 5625 50  0001 C CNN "variant"
	1    9750 5625
	0    -1   -1   0   
$EndComp
$Comp
L device:C C9
U 1 1 5E520C0F
P 9625 2700
F 0 "C9" V 9725 2750 50  0000 L CNN
F 1 "100p" V 9725 2450 50  0000 L CNN
F 2 "Capacitor_SMD:C_0402_1005Metric" H 9625 2700 60  0001 C CNN
F 3 "" H 9625 2700 60  0001 C CNN
F 4 "Kemet" H 5500 -1100 50  0001 C CNN "MFN"
F 5 "CBR04C101J3GAC" H 5500 -1100 50  0001 C CNN "MFP"
F 6 "80-CBR04C101J3GAC" H 5500 -1100 50  0001 C CNN "S1PN"
F 7 "Mouser" H 5500 -1100 50  0001 C CNN "S1PL"
F 8 "399-17684-1-ND" H 5500 -1100 50  0001 C CNN "S2PN"
F 9 "Digi-Key" H 5500 -1100 50  0001 C CNN "S2PL"
F 10 "HiQ-CBR Series, C0G Dielectric, Low ESR, High SRF" H 5500 -1100 50  0001 C CNN "Description"
F 11 "0402 (1005 metric)" H 5500 -1100 50  0001 C CNN "Package ID"
F 12 "sot86" V 12600 2700 50  0001 C CNN "variant"
	1    9625 2700
	0    -1   -1   0   
$EndComp
$Comp
L device:C C8
U 1 1 5E52D9C9
P 7725 2700
F 0 "C8" V 7825 2750 50  0000 L CNN
F 1 "100p" V 7825 2450 50  0000 L CNN
F 2 "Capacitor_SMD:C_0402_1005Metric" H 7725 2700 60  0001 C CNN
F 3 "" H 7725 2700 60  0001 C CNN
F 4 "Kemet" H 3600 -1100 50  0001 C CNN "MFN"
F 5 "CBR04C101J3GAC" H 3600 -1100 50  0001 C CNN "MFP"
F 6 "80-CBR04C101J3GAC" H 3600 -1100 50  0001 C CNN "S1PN"
F 7 "Mouser" H 3600 -1100 50  0001 C CNN "S1PL"
F 8 "399-17684-1-ND" H 3600 -1100 50  0001 C CNN "S2PN"
F 9 "Digi-Key" H 3600 -1100 50  0001 C CNN "S2PL"
F 10 "HiQ-CBR Series, C0G Dielectric, Low ESR, High SRF" H 3600 -1100 50  0001 C CNN "Description"
F 11 "0402 (1005 metric)" H 3600 -1100 50  0001 C CNN "Package ID"
F 12 "sot86" V 10700 2700 50  0001 C CNN "variant"
	1    7725 2700
	0    -1   -1   0   
$EndComp
$Comp
L device:L L3
U 1 1 5E5AB130
P 9750 8325
F 0 "L3" H 9803 8371 50  0000 L CNN
F 1 "12nH" H 9803 8280 50  0000 L CNN
F 2 "Project:coilcraft_0603hp" H 9750 8325 50  0001 C CNN
F 3 "~" H 9750 8325 50  0001 C CNN
F 4 "Coilcraft" H 9750 8325 50  0001 C CNN "MFN"
F 5 "0603HP-12NXJLU" H 9750 8325 50  0001 C CNN "MFP"
F 6 "994-0603HP-12NXJLU" H 9750 8325 50  0001 C CNN "S1PN"
F 7 "Mouser" H 9750 8325 50  0001 C CNN "S1PL"
F 8 "Fixed Inductors 0603HP Hi Perfrmnce 12 nH 5 %" H 9750 8325 50  0001 C CNN "Description"
F 9 "0603 (1608 metric)" H 9750 8325 50  0001 C CNN "Package ID"
F 10 "dfn" H 9750 8325 50  0001 C CNN "variant"
	1    9750 8325
	1    0    0    -1  
$EndComp
Wire Wire Line
	6700 7350 7100 7350
Wire Wire Line
	7400 7350 7800 7350
Wire Wire Line
	7800 7350 8200 7350
Wire Wire Line
	8500 7350 8925 7350
Wire Wire Line
	6625 4375 7025 4375
Wire Wire Line
	7325 4375 7725 4375
Wire Wire Line
	7725 4375 8125 4375
Wire Wire Line
	8425 4375 8875 4375
Wire Wire Line
	6550 1450 6950 1450
Wire Wire Line
	7250 1450 7650 1450
Wire Wire Line
	7650 1450 8050 1450
Wire Wire Line
	8350 1450 8800 1450
$Comp
L connector:Conn_01x02_Female P2
U 1 1 5E7E2491
P 5100 4475
F 0 "P2" H 4994 4150 50  0000 C CNN
F 1 "+V" H 4994 4241 50  0000 C CNN
F 2 "Connector_PinHeader_2.54mm:PinHeader_1x02_P2.54mm_Vertical" H 5100 4475 50  0001 C CNN
F 3 "~" H 5100 4475 50  0001 C CNN
F 4 "Mintron" H 5100 4475 50  0001 C CNN "MFN"
F 5 "MTP125-1102S1" H 5100 4475 50  0001 C CNN "MFP"
F 6 "C358684" H 5100 4475 50  0001 C CNN "S1PN"
F 7 "LCSC" H 5100 4475 50  0001 C CNN "S1PL"
F 8 "Pin Header Male Pin 0.100\\\"(2.54mm) 2 pin" H 5100 4475 50  0001 C CNN "Description"
F 9 "Through Hole,P=2.54mm" H 5100 4475 50  0001 C CNN "Package ID"
F 10 "sot89" H 5100 4475 50  0001 C CNN "variant"
F 11 "1:$0.01; 10:$0.01; 100:$0.01; 500:$0.008" H 5100 4475 50  0001 C CNN "kicost:LCSC:pricing"
F 12 "https://lcsc.com/product-detail/Pin-Header-Female-Header_MINTRON-MTP125-1102S1_C358684.html" H 5100 4475 50  0001 C CNN "kicost:LCSC:link"
	1    5100 4475
	-1   0    0    1   
$EndComp
$Comp
L connector:Conn_01x02_Female P1
U 1 1 5E7EB21B
P 5025 1550
F 0 "P1" H 4919 1225 50  0000 C CNN
F 1 "+V" H 4919 1316 50  0000 C CNN
F 2 "Connector_PinHeader_2.54mm:PinHeader_1x02_P2.54mm_Vertical" H 5025 1550 50  0001 C CNN
F 3 "~" H 5025 1550 50  0001 C CNN
F 4 "Mintron" H 5025 1550 50  0001 C CNN "MFN"
F 5 "MTP125-1102S1" H 5025 1550 50  0001 C CNN "MFP"
F 6 "C358684" H 5025 1550 50  0001 C CNN "S1PN"
F 7 "LCSC" H 5025 1550 50  0001 C CNN "S1PL"
F 8 "Pin Header Male Pin 0.100\\\"(2.54mm) 2 pin" H 5025 1550 50  0001 C CNN "Description"
F 9 "Through Hole,P=2.54mm" H 5025 1550 50  0001 C CNN "Package ID"
F 10 "sot86" H 5025 1550 50  0001 C CNN "variant"
F 11 "1:$0.01; 10:$0.01; 100:$0.01; 500:$0.008" H 5025 1550 50  0001 C CNN "kicost:LCSC:pricing"
F 12 "https://lcsc.com/product-detail/Pin-Header-Female-Header_MINTRON-MTP125-1102S1_C358684.html" H 5025 1550 50  0001 C CNN "kicost:LCSC:link"
	1    5025 1550
	-1   0    0    1   
$EndComp
$Comp
L device:R R4
U 1 1 5E806982
P 8275 4375
F 0 "R4" V 8175 4375 50  0000 C CNN
F 1 "33 1/4W" V 8375 4375 50  0000 C CNN
F 2 "Resistor_SMD:R_1206_3216Metric" H 8275 4375 60  0001 C CNN
F 3 "" H 8275 4375 60  0001 C CNN
F 4 "Yageo" H 8275 4375 50  0001 C CNN "MFN"
F 5 "RC1206FR-0733RL" H 8275 4375 50  0001 C CNN "MFP"
F 6 "311-33.0FRCT-ND" H 8275 4375 50  0001 C CNN "S1PN"
F 7 "Digi-Key" H 8275 4375 50  0001 C CNN "S1PL"
F 8 "603-RC1206FR-0733RL" H 8275 4375 50  0001 C CNN "S2PN"
F 9 "Mouser" H 8275 4375 50  0001 C CNN "S2PL"
F 10 "33 Ohms ±1% 0.25W, 1/4W, 1206" H 8275 4375 50  0001 C CNN "Description"
F 11 "1206 (3216 Metric)" H 8275 4375 50  0001 C CNN "Package ID"
F 12 "sot89" V 8275 4375 50  0001 C CNN "variant"
	1    8275 4375
	0    -1   -1   0   
$EndComp
$Comp
L device:C C35
U 1 1 60672453
P 8650 8050
F 0 "C35" V 8750 8125 50  0000 L CNN
F 1 "Opt" V 8750 7850 50  0000 L CNN
F 2 "Capacitor_SMD:C_0402_1005Metric" H 8650 8050 60  0001 C CNN
F 3 "" H 8650 8050 60  0001 C CNN
F 4 "Kemet" H 4525 4250 50  0001 C CNN "MFN"
F 5 "CBR04C101J3GAC" H 4525 4250 50  0001 C CNN "MFP"
F 6 "80-CBR04C101J3GAC" H 4525 4250 50  0001 C CNN "S1PN"
F 7 "Mouser" H 4525 4250 50  0001 C CNN "S1PL"
F 8 "399-17684-1-ND" H 4525 4250 50  0001 C CNN "S2PN"
F 9 "Digi-Key" H 4525 4250 50  0001 C CNN "S2PL"
F 10 "HiQ-CBR Series, C0G Dielectric, Low ESR, High SRF" H 4525 4250 50  0001 C CNN "Description"
F 11 "0402 (1005 metric)" H 4525 4250 50  0001 C CNN "Package ID"
F 12 "dfn" V 11625 8050 50  0001 C CNN "variant"
	1    8650 8050
	0    -1   -1   0   
$EndComp
$Comp
L power:GND #PWR030
U 1 1 60673159
P 8400 8150
F 0 "#PWR030" H 8400 8150 30  0001 C CNN
F 1 "GND" H 8400 8080 30  0001 C CNN
F 2 "" H 8400 8150 60  0001 C CNN
F 3 "" H 8400 8150 60  0001 C CNN
	1    8400 8150
	1    0    0    -1  
$EndComp
Wire Wire Line
	8800 8050 8925 8050
Connection ~ 8925 8050
Wire Wire Line
	8925 8050 8925 7800
Wire Wire Line
	8500 8050 8400 8050
Wire Wire Line
	8400 8050 8400 8150
$Comp
L device:R X13
U 1 1 603128E5
P 10050 5975
F 0 "X13" H 9900 5925 50  0000 C CNN
F 1 "DNF" H 9900 6025 50  0000 C CNN
F 2 "Capacitor_SMD:C_0402_1005Metric" H 10050 5975 60  0001 C CNN
F 3 "" H 10050 5975 60  0001 C CNN
F 4 "dfn" H 10050 5975 50  0001 C CNN "variant"
F 5 "1" H 10050 5975 50  0001 C CNN "DNP"
	1    10050 5975
	-1   0    0    1   
$EndComp
$Comp
L device:R X23
U 1 1 60307FEF
P 10350 8950
F 0 "X23" H 10200 8900 50  0000 C CNN
F 1 "DNF" H 10200 9000 50  0000 C CNN
F 2 "Capacitor_SMD:C_0402_1005Metric" H 10350 8950 60  0001 C CNN
F 3 "" H 10350 8950 60  0001 C CNN
F 4 "dfn" H 10350 8950 50  0001 C CNN "variant"
F 5 "1" H 10350 8950 50  0001 C CNN "DNP"
	1    10350 8950
	-1   0    0    1   
$EndComp
$Comp
L power:GND #PWR012
U 1 1 5EAC73DE
P 10350 9100
F 0 "#PWR012" H 10350 9100 30  0001 C CNN
F 1 "GND" H 10350 9030 30  0001 C CNN
F 2 "" H 10350 9100 60  0001 C CNN
F 3 "" H 10350 9100 60  0001 C CNN
	1    10350 9100
	1    0    0    -1  
$EndComp
$Comp
L device:R X25
U 1 1 5DC8649E
P 7050 8950
F 0 "X25" H 6900 8900 50  0000 C CNN
F 1 "DNF" H 6900 9000 50  0000 C CNN
F 2 "Capacitor_SMD:C_0402_1005Metric" H 7050 8950 60  0001 C CNN
F 3 "" H 7050 8950 60  0001 C CNN
F 4 "dfn" H 7050 8950 50  0001 C CNN "variant"
F 5 "1" H 7050 8950 50  0001 C CNN "DNP"
	1    7050 8950
	-1   0    0    1   
$EndComp
$Comp
L power:GND #PWR0105
U 1 1 6038FBA6
P 7050 9100
F 0 "#PWR0105" H 7050 9100 30  0001 C CNN
F 1 "GND" H 7050 9030 30  0001 C CNN
F 2 "" H 7050 9100 60  0001 C CNN
F 3 "" H 7050 9100 60  0001 C CNN
	1    7050 9100
	1    0    0    -1  
$EndComp
Wire Wire Line
	7050 8800 7050 8600
Connection ~ 7050 8600
Wire Wire Line
	7050 8600 7200 8600
Wire Wire Line
	10200 8600 10350 8600
Wire Wire Line
	10350 8800 10350 8600
Connection ~ 10350 8600
Wire Wire Line
	6975 5825 6975 5625
Wire Wire Line
	6975 5625 7125 5625
$Comp
L power:GND #PWR0106
U 1 1 6040F793
P 6975 6125
F 0 "#PWR0106" H 6975 6125 30  0001 C CNN
F 1 "GND" H 6975 6055 30  0001 C CNN
F 2 "" H 6975 6125 60  0001 C CNN
F 3 "" H 6975 6125 60  0001 C CNN
	1    6975 6125
	1    0    0    -1  
$EndComp
Connection ~ 6975 5625
Wire Wire Line
	9900 5625 10050 5625
Wire Wire Line
	10050 5825 10050 5625
Connection ~ 10050 5625
$Comp
L power:GND #PWR0107
U 1 1 6044B136
P 7425 3200
F 0 "#PWR0107" H 7425 3200 30  0001 C CNN
F 1 "GND" H 7425 3130 30  0001 C CNN
F 2 "" H 7425 3200 60  0001 C CNN
F 3 "" H 7425 3200 60  0001 C CNN
	1    7425 3200
	1    0    0    -1  
$EndComp
Wire Wire Line
	7425 2900 7425 2700
Wire Wire Line
	7425 2700 7575 2700
Connection ~ 7425 2700
Wire Wire Line
	9350 2900 9350 2700
Connection ~ 10050 2700
Wire Wire Line
	4650 5625 6650 5625
Wire Wire Line
	10050 5625 12600 5625
Wire Wire Line
	10350 8600 12675 8600
Wire Wire Line
	4725 8600 6725 8600
Wire Wire Line
	5100 2700 7100 2700
Wire Wire Line
	10050 2700 12000 2700
$Comp
L device:R X26
U 1 1 6026F935
P 6725 8950
F 0 "X26" H 6575 8900 50  0000 C CNN
F 1 "DNF" H 6575 9000 50  0000 C CNN
F 2 "Capacitor_SMD:C_0402_1005Metric" H 6725 8950 60  0001 C CNN
F 3 "" H 6725 8950 60  0001 C CNN
F 4 "dfn" H 6725 8950 50  0001 C CNN "variant"
F 5 "1" H 6725 8950 50  0001 C CNN "DNP"
	1    6725 8950
	-1   0    0    1   
$EndComp
$Comp
L power:GND #PWR0108
U 1 1 6026F93F
P 6725 9400
F 0 "#PWR0108" H 6725 9400 30  0001 C CNN
F 1 "GND" H 6725 9330 30  0001 C CNN
F 2 "" H 6725 9400 60  0001 C CNN
F 3 "" H 6725 9400 60  0001 C CNN
	1    6725 9400
	1    0    0    -1  
$EndComp
Wire Wire Line
	6725 8800 6725 8600
Connection ~ 6725 8600
Wire Wire Line
	6725 8600 7050 8600
$Comp
L device:R X16
U 1 1 60275ACB
P 6650 5975
F 0 "X16" H 6500 5925 50  0000 C CNN
F 1 "DNF" H 6500 6025 50  0000 C CNN
F 2 "Capacitor_SMD:C_0402_1005Metric" H 6650 5975 60  0001 C CNN
F 3 "" H 6650 5975 60  0001 C CNN
F 4 "dfn" H 6650 5975 50  0001 C CNN "variant"
F 5 "1" H 6650 5975 50  0001 C CNN "DNP"
	1    6650 5975
	-1   0    0    1   
$EndComp
$Comp
L power:GND #PWR0109
U 1 1 60275AD5
P 6650 6425
F 0 "#PWR0109" H 6650 6425 30  0001 C CNN
F 1 "GND" H 6650 6355 30  0001 C CNN
F 2 "" H 6650 6425 60  0001 C CNN
F 3 "" H 6650 6425 60  0001 C CNN
	1    6650 6425
	1    0    0    -1  
$EndComp
Wire Wire Line
	6650 5825 6650 5625
Connection ~ 6650 5625
Wire Wire Line
	6650 5625 6975 5625
$Comp
L device:R X6
U 1 1 6027C396
P 7100 3050
F 0 "X6" H 6950 3000 50  0000 C CNN
F 1 "DNF" H 6950 3100 50  0000 C CNN
F 2 "Capacitor_SMD:C_0402_1005Metric" H 7100 3050 60  0001 C CNN
F 3 "" H 7100 3050 60  0001 C CNN
F 4 "dfn" H 7100 3050 50  0001 C CNN "variant"
F 5 "1" H 7100 3050 50  0001 C CNN "DNP"
	1    7100 3050
	-1   0    0    1   
$EndComp
$Comp
L power:GND #PWR0110
U 1 1 6027C3A0
P 7100 3500
F 0 "#PWR0110" H 7100 3500 30  0001 C CNN
F 1 "GND" H 7100 3430 30  0001 C CNN
F 2 "" H 7100 3500 60  0001 C CNN
F 3 "" H 7100 3500 60  0001 C CNN
	1    7100 3500
	1    0    0    -1  
$EndComp
Wire Wire Line
	7100 2900 7100 2700
Connection ~ 7100 2700
Wire Wire Line
	7100 2700 7425 2700
Wire Wire Line
	8800 1450 9350 1450
$Comp
L device:L L11
U 1 1 611343D1
P 9350 1925
F 0 "L11" H 9403 1971 50  0000 L CNN
F 1 "110nH" H 9403 1880 50  0000 L CNN
F 2 "Project:coilcraft_0603hp" H 9350 1925 50  0001 C CNN
F 3 "~" H 9350 1925 50  0001 C CNN
F 4 "Coilcraft" H 9350 1925 50  0001 C CNN "MFN"
F 5 "0603HP-33NXJLU" H 9350 1925 50  0001 C CNN "MFP"
F 6 "994-0603HP-33NXJLU" H 9350 1925 50  0001 C CNN "S1PN"
F 7 "Mouser" H 9350 1925 50  0001 C CNN "S1PL"
F 8 "Fixed Inductors 0603HP Hi Perfrmnce 33 nH 5 %" H 9350 1925 50  0001 C CNN "Description"
F 9 "0603 (1608 metric)" H 9350 1925 50  0001 C CNN "Package ID"
F 10 "sot86" H 9350 1925 50  0001 C CNN "variant"
	1    9350 1925
	1    0    0    -1  
$EndComp
Wire Wire Line
	9350 2075 9350 2125
Wire Wire Line
	9350 1775 9350 1450
Connection ~ 9350 1450
Wire Wire Line
	9350 1450 9800 1450
Wire Wire Line
	8875 4375 9425 4375
$Comp
L device:L L22
U 1 1 61148D70
P 9425 4825
F 0 "L22" H 9478 4871 50  0000 L CNN
F 1 "110nH" H 9478 4780 50  0000 L CNN
F 2 "Project:coilcraft_0603hp" H 9425 4825 50  0001 C CNN
F 3 "~" H 9425 4825 50  0001 C CNN
F 4 "Coilcraft" H 9425 4825 50  0001 C CNN "MFN"
F 5 "0603HP-12NXJLU" H 9425 4825 50  0001 C CNN "MFP"
F 6 "994-0603HP-12NXJLU" H 9425 4825 50  0001 C CNN "S1PN"
F 7 "Mouser" H 9425 4825 50  0001 C CNN "S1PL"
F 8 "Fixed Inductors 0603HP Hi Perfrmnce 12 nH 5 %" H 9425 4825 50  0001 C CNN "Description"
F 9 "0603 (1608 metric)" H 9425 4825 50  0001 C CNN "Package ID"
F 10 "sot89" H 9425 4825 50  0001 C CNN "variant"
	1    9425 4825
	1    0    0    -1  
$EndComp
Wire Wire Line
	9425 5125 9425 5075
Wire Wire Line
	9425 4675 9425 4375
Connection ~ 9425 4375
Wire Wire Line
	9425 4375 9875 4375
Wire Wire Line
	9400 7350 9750 7350
$Comp
L device:L L33
U 1 1 611577C7
P 9750 7875
F 0 "L33" H 9803 7921 50  0000 L CNN
F 1 "110nH" H 9803 7830 50  0000 L CNN
F 2 "Project:coilcraft_0603hp" H 9750 7875 50  0001 C CNN
F 3 "~" H 9750 7875 50  0001 C CNN
F 4 "Coilcraft" H 9750 7875 50  0001 C CNN "MFN"
F 5 "0603HP-12NXJLU" H 9750 7875 50  0001 C CNN "MFP"
F 6 "994-0603HP-12NXJLU" H 9750 7875 50  0001 C CNN "S1PN"
F 7 "Mouser" H 9750 7875 50  0001 C CNN "S1PL"
F 8 "Fixed Inductors 0603HP Hi Perfrmnce 12 nH 5 %" H 9750 7875 50  0001 C CNN "Description"
F 9 "0603 (1608 metric)" H 9750 7875 50  0001 C CNN "Package ID"
F 10 "dfn" H 9750 7875 50  0001 C CNN "variant"
	1    9750 7875
	1    0    0    -1  
$EndComp
Wire Wire Line
	9750 8175 9750 8100
Wire Wire Line
	9750 7725 9750 7350
Connection ~ 9750 7350
Wire Wire Line
	9750 7350 10225 7350
$Comp
L device:R R6
U 1 1 60D73D39
P 9575 8325
F 0 "R6" H 9425 8375 50  0000 C CNN
F 1 "DNF" H 9425 8275 50  0000 C CNN
F 2 "Project:coilcraft_0603hp" H 9575 8325 60  0001 C CNN
F 3 "" H 9575 8325 60  0001 C CNN
F 4 "dfn" H 9575 8325 50  0001 C CNN "variant"
	1    9575 8325
	1    0    0    -1  
$EndComp
Wire Wire Line
	9575 8475 9575 8600
Connection ~ 9575 8600
Wire Wire Line
	9575 8600 9750 8600
Wire Wire Line
	9575 8175 9575 8100
Wire Wire Line
	9575 8100 9750 8100
Connection ~ 9750 8100
Wire Wire Line
	9750 8100 9750 8025
$Comp
L device:C C33
U 1 1 60D7E01D
P 10075 8100
F 0 "C33" V 10150 7850 50  0000 L CNN
F 1 "DNF" V 10000 7850 50  0000 L CNN
F 2 "Capacitor_SMD:C_0402_1005Metric" H 10075 8100 60  0001 C CNN
F 3 "" H 10075 8100 60  0001 C CNN
F 4 "Kemet" H 2975 4300 50  0001 C CNN "MFN"
F 5 "CBR04C101J3GAC" H 2975 4300 50  0001 C CNN "MFP"
F 6 "80-CBR04C101J3GAC" H 2975 4300 50  0001 C CNN "S1PN"
F 7 "Mouser" H 2975 4300 50  0001 C CNN "S1PL"
F 8 "399-17684-1-ND" H 2975 4300 50  0001 C CNN "S2PN"
F 9 "Digi-Key" H 2975 4300 50  0001 C CNN "S2PL"
F 10 "HiQ-CBR Series, C0G Dielectric, Low ESR, High SRF" H 2975 4300 50  0001 C CNN "Description"
F 11 "0402 (1005 metric)" H 2975 4300 50  0001 C CNN "Package ID"
F 12 "dfn" V 10075 8100 50  0001 C CNN "variant"
	1    10075 8100
	0    -1   -1   0   
$EndComp
Wire Wire Line
	9750 8100 9925 8100
$Comp
L power:GND #PWR017
U 1 1 60D83C3A
P 10450 8225
F 0 "#PWR017" H 10450 8225 30  0001 C CNN
F 1 "GND" H 10450 8155 30  0001 C CNN
F 2 "" H 10450 8225 60  0001 C CNN
F 3 "" H 10450 8225 60  0001 C CNN
	1    10450 8225
	1    0    0    -1  
$EndComp
Wire Wire Line
	10225 8100 10450 8100
Wire Wire Line
	10450 8100 10450 8225
$Comp
L device:C C32
U 1 1 60D89964
P 9750 5075
F 0 "C32" V 9800 4850 50  0000 L CNN
F 1 "DNF" V 9675 4850 50  0000 L CNN
F 2 "Capacitor_SMD:C_0402_1005Metric" H 9750 5075 60  0001 C CNN
F 3 "" H 9750 5075 60  0001 C CNN
F 4 "Kemet" H 2650 1275 50  0001 C CNN "MFN"
F 5 "CBR04C101J3GAC" H 2650 1275 50  0001 C CNN "MFP"
F 6 "80-CBR04C101J3GAC" H 2650 1275 50  0001 C CNN "S1PN"
F 7 "Mouser" H 2650 1275 50  0001 C CNN "S1PL"
F 8 "399-17684-1-ND" H 2650 1275 50  0001 C CNN "S2PN"
F 9 "Digi-Key" H 2650 1275 50  0001 C CNN "S2PL"
F 10 "HiQ-CBR Series, C0G Dielectric, Low ESR, High SRF" H 2650 1275 50  0001 C CNN "Description"
F 11 "0402 (1005 metric)" H 2650 1275 50  0001 C CNN "Package ID"
F 12 "dfn" V 9750 5075 50  0001 C CNN "variant"
	1    9750 5075
	0    -1   -1   0   
$EndComp
Wire Wire Line
	9425 5075 9600 5075
$Comp
L power:GND #PWR013
U 1 1 60D8996F
P 10125 5200
F 0 "#PWR013" H 10125 5200 30  0001 C CNN
F 1 "GND" H 10125 5130 30  0001 C CNN
F 2 "" H 10125 5200 60  0001 C CNN
F 3 "" H 10125 5200 60  0001 C CNN
	1    10125 5200
	1    0    0    -1  
$EndComp
Wire Wire Line
	9900 5075 10125 5075
Wire Wire Line
	10125 5075 10125 5200
Connection ~ 9425 5075
Wire Wire Line
	9425 5075 9425 4975
$Comp
L device:R R5
U 1 1 60D92DBF
P 9275 5300
F 0 "R5" H 9125 5350 50  0000 C CNN
F 1 "DNF" H 9125 5250 50  0000 C CNN
F 2 "Project:coilcraft_0603hp" H 9275 5300 60  0001 C CNN
F 3 "" H 9275 5300 60  0001 C CNN
F 4 "dfn" H 9275 5300 50  0001 C CNN "variant"
	1    9275 5300
	1    0    0    -1  
$EndComp
Wire Wire Line
	9275 5150 9275 5075
Wire Wire Line
	9275 5075 9425 5075
Wire Wire Line
	9275 5450 9275 5625
Connection ~ 9275 5625
Wire Wire Line
	9275 5625 9425 5625
$Comp
L device:C C31
U 1 1 60DA079C
P 9675 2125
F 0 "C31" V 9600 2225 50  0000 L CNN
F 1 "DNF" V 9600 1850 50  0000 L CNN
F 2 "Capacitor_SMD:C_0402_1005Metric" H 9675 2125 60  0001 C CNN
F 3 "" H 9675 2125 60  0001 C CNN
F 4 "Kemet" H 2575 -1675 50  0001 C CNN "MFN"
F 5 "CBR04C101J3GAC" H 2575 -1675 50  0001 C CNN "MFP"
F 6 "80-CBR04C101J3GAC" H 2575 -1675 50  0001 C CNN "S1PN"
F 7 "Mouser" H 2575 -1675 50  0001 C CNN "S1PL"
F 8 "399-17684-1-ND" H 2575 -1675 50  0001 C CNN "S2PN"
F 9 "Digi-Key" H 2575 -1675 50  0001 C CNN "S2PL"
F 10 "HiQ-CBR Series, C0G Dielectric, Low ESR, High SRF" H 2575 -1675 50  0001 C CNN "Description"
F 11 "0402 (1005 metric)" H 2575 -1675 50  0001 C CNN "Package ID"
F 12 "dfn" V 9675 2125 50  0001 C CNN "variant"
	1    9675 2125
	0    -1   -1   0   
$EndComp
Wire Wire Line
	9350 2125 9525 2125
$Comp
L power:GND #PWR011
U 1 1 60DA07A7
P 10050 2250
F 0 "#PWR011" H 10050 2250 30  0001 C CNN
F 1 "GND" H 10050 2180 30  0001 C CNN
F 2 "" H 10050 2250 60  0001 C CNN
F 3 "" H 10050 2250 60  0001 C CNN
	1    10050 2250
	1    0    0    -1  
$EndComp
Wire Wire Line
	9825 2125 10050 2125
Wire Wire Line
	10050 2125 10050 2250
Connection ~ 9350 2125
Wire Wire Line
	9350 2125 9350 2200
$Comp
L device:R X3
U 1 1 60E45517
P 6725 9250
F 0 "X3" H 6575 9200 50  0000 C CNN
F 1 "DNF" H 6575 9300 50  0000 C CNN
F 2 "Capacitor_SMD:C_0402_1005Metric" H 6725 9250 60  0001 C CNN
F 3 "" H 6725 9250 60  0001 C CNN
F 4 "dfn" H 6725 9250 50  0001 C CNN "variant"
F 5 "1" H 6725 9250 50  0001 C CNN "DNP"
	1    6725 9250
	-1   0    0    1   
$EndComp
$Comp
L device:R X2
U 1 1 60E4C285
P 6650 6275
F 0 "X2" H 6500 6225 50  0000 C CNN
F 1 "DNF" H 6500 6325 50  0000 C CNN
F 2 "Capacitor_SMD:C_0402_1005Metric" H 6650 6275 60  0001 C CNN
F 3 "" H 6650 6275 60  0001 C CNN
F 4 "dfn" H 6650 6275 50  0001 C CNN "variant"
F 5 "1" H 6650 6275 50  0001 C CNN "DNP"
	1    6650 6275
	-1   0    0    1   
$EndComp
$Comp
L device:R X1
U 1 1 60E52B58
P 7100 3350
F 0 "X1" H 6950 3300 50  0000 C CNN
F 1 "DNF" H 6950 3400 50  0000 C CNN
F 2 "Capacitor_SMD:C_0402_1005Metric" H 7100 3350 60  0001 C CNN
F 3 "" H 7100 3350 60  0001 C CNN
F 4 "dfn" H 7100 3350 50  0001 C CNN "variant"
F 5 "1" H 7100 3350 50  0001 C CNN "DNP"
	1    7100 3350
	-1   0    0    1   
$EndComp
$EndSCHEMATC
