(kicad_sch (version 20211123) (generator eeschema)

  (uuid 6b4812b5-79ec-49a8-8eef-738c47d1df01)

  (paper "A4")

  (title_block
    (title "GRF2014")
    (date "2021-04-06")
    (rev "2.8")
    (company "Dyadic Pty Ltd")
    (comment 1 "2020")
  )

  (lib_symbols
    (symbol "GRF2014-rescue:C-device" (pin_numbers hide) (pin_names (offset 0.254)) (in_bom yes) (on_board yes)
      (property "Reference" "C" (id 0) (at 0.635 2.54 0)
        (effects (font (size 1.27 1.27)) (justify left))
      )
      (property "Value" "C-device" (id 1) (at 0.635 -2.54 0)
        (effects (font (size 1.27 1.27)) (justify left))
      )
      (property "Footprint" "" (id 2) (at 0.9652 -3.81 0)
        (effects (font (size 1.27 1.27)) hide)
      )
      (property "Datasheet" "" (id 3) (at 0 0 0)
        (effects (font (size 1.27 1.27)) hide)
      )
      (property "ki_fp_filters" "C_*" (id 4) (at 0 0 0)
        (effects (font (size 1.27 1.27)) hide)
      )
      (symbol "C-device_0_1"
        (polyline
          (pts
            (xy -2.032 -0.762)
            (xy 2.032 -0.762)
          )
          (stroke (width 0.508) (type default) (color 0 0 0 0))
          (fill (type none))
        )
        (polyline
          (pts
            (xy -2.032 0.762)
            (xy 2.032 0.762)
          )
          (stroke (width 0.508) (type default) (color 0 0 0 0))
          (fill (type none))
        )
      )
      (symbol "C-device_1_1"
        (pin passive line (at 0 3.81 270) (length 2.794)
          (name "~" (effects (font (size 1.27 1.27))))
          (number "1" (effects (font (size 1.27 1.27))))
        )
        (pin passive line (at 0 -3.81 90) (length 2.794)
          (name "~" (effects (font (size 1.27 1.27))))
          (number "2" (effects (font (size 1.27 1.27))))
        )
      )
    )
    (symbol "GRF2014-rescue:CP-device" (pin_numbers hide) (pin_names (offset 0.254)) (in_bom yes) (on_board yes)
      (property "Reference" "C" (id 0) (at 0.635 2.54 0)
        (effects (font (size 1.27 1.27)) (justify left))
      )
      (property "Value" "CP-device" (id 1) (at 0.635 -2.54 0)
        (effects (font (size 1.27 1.27)) (justify left))
      )
      (property "Footprint" "" (id 2) (at 0.9652 -3.81 0)
        (effects (font (size 1.27 1.27)) hide)
      )
      (property "Datasheet" "" (id 3) (at 0 0 0)
        (effects (font (size 1.27 1.27)) hide)
      )
      (property "ki_fp_filters" "CP_*" (id 4) (at 0 0 0)
        (effects (font (size 1.27 1.27)) hide)
      )
      (symbol "CP-device_0_1"
        (rectangle (start -2.286 0.508) (end -2.286 1.016)
          (stroke (width 0) (type default) (color 0 0 0 0))
          (fill (type none))
        )
        (rectangle (start -2.286 0.508) (end 2.286 0.508)
          (stroke (width 0) (type default) (color 0 0 0 0))
          (fill (type none))
        )
        (polyline
          (pts
            (xy -1.778 2.286)
            (xy -0.762 2.286)
          )
          (stroke (width 0) (type default) (color 0 0 0 0))
          (fill (type none))
        )
        (polyline
          (pts
            (xy -1.27 2.794)
            (xy -1.27 1.778)
          )
          (stroke (width 0) (type default) (color 0 0 0 0))
          (fill (type none))
        )
        (rectangle (start 2.286 -0.508) (end -2.286 -1.016)
          (stroke (width 0) (type default) (color 0 0 0 0))
          (fill (type outline))
        )
        (rectangle (start 2.286 1.016) (end -2.286 1.016)
          (stroke (width 0) (type default) (color 0 0 0 0))
          (fill (type none))
        )
        (rectangle (start 2.286 1.016) (end 2.286 0.508)
          (stroke (width 0) (type default) (color 0 0 0 0))
          (fill (type none))
        )
      )
      (symbol "CP-device_1_1"
        (pin passive line (at 0 3.81 270) (length 2.794)
          (name "~" (effects (font (size 1.27 1.27))))
          (number "1" (effects (font (size 1.27 1.27))))
        )
        (pin passive line (at 0 -3.81 90) (length 2.794)
          (name "~" (effects (font (size 1.27 1.27))))
          (number "2" (effects (font (size 1.27 1.27))))
        )
      )
    )
    (symbol "GRF2014-rescue:Conn_01x02_Female-connector" (pin_names (offset 1.016) hide) (in_bom yes) (on_board yes)
      (property "Reference" "J" (id 0) (at 0 2.54 0)
        (effects (font (size 1.27 1.27)))
      )
      (property "Value" "Conn_01x02_Female-connector" (id 1) (at 0 -5.08 0)
        (effects (font (size 1.27 1.27)))
      )
      (property "Footprint" "" (id 2) (at 0 0 0)
        (effects (font (size 1.27 1.27)) hide)
      )
      (property "Datasheet" "" (id 3) (at 0 0 0)
        (effects (font (size 1.27 1.27)) hide)
      )
      (property "ki_fp_filters" "Connector*:*_1x??_*" (id 4) (at 0 0 0)
        (effects (font (size 1.27 1.27)) hide)
      )
      (symbol "Conn_01x02_Female-connector_1_1"
        (arc (start 0 -2.032) (mid -0.508 -2.54) (end 0 -3.048)
          (stroke (width 0.1524) (type default) (color 0 0 0 0))
          (fill (type none))
        )
        (polyline
          (pts
            (xy -1.27 -2.54)
            (xy -0.508 -2.54)
          )
          (stroke (width 0.1524) (type default) (color 0 0 0 0))
          (fill (type none))
        )
        (polyline
          (pts
            (xy -1.27 0)
            (xy -0.508 0)
          )
          (stroke (width 0.1524) (type default) (color 0 0 0 0))
          (fill (type none))
        )
        (arc (start 0 0.508) (mid -0.508 0) (end 0 -0.508)
          (stroke (width 0.1524) (type default) (color 0 0 0 0))
          (fill (type none))
        )
        (pin passive line (at -5.08 0 0) (length 3.81)
          (name "Pin_1" (effects (font (size 1.27 1.27))))
          (number "1" (effects (font (size 1.27 1.27))))
        )
        (pin passive line (at -5.08 -2.54 0) (length 3.81)
          (name "Pin_2" (effects (font (size 1.27 1.27))))
          (number "2" (effects (font (size 1.27 1.27))))
        )
      )
    )
    (symbol "GRF2014-rescue:Ferrite_Bead_Small-device" (pin_numbers hide) (pin_names (offset 0)) (in_bom yes) (on_board yes)
      (property "Reference" "FB" (id 0) (at 1.905 1.27 0)
        (effects (font (size 1.27 1.27)) (justify left))
      )
      (property "Value" "Ferrite_Bead_Small-device" (id 1) (at 1.905 -1.27 0)
        (effects (font (size 1.27 1.27)) (justify left))
      )
      (property "Footprint" "" (id 2) (at -1.778 0 90)
        (effects (font (size 1.27 1.27)) hide)
      )
      (property "Datasheet" "" (id 3) (at 0 0 0)
        (effects (font (size 1.27 1.27)) hide)
      )
      (property "ki_fp_filters" "Inductor_* L_* *Ferrite*" (id 4) (at 0 0 0)
        (effects (font (size 1.27 1.27)) hide)
      )
      (symbol "Ferrite_Bead_Small-device_0_1"
        (polyline
          (pts
            (xy 0 -1.27)
            (xy 0 -0.7874)
          )
          (stroke (width 0) (type default) (color 0 0 0 0))
          (fill (type none))
        )
        (polyline
          (pts
            (xy 0 0.889)
            (xy 0 1.2954)
          )
          (stroke (width 0) (type default) (color 0 0 0 0))
          (fill (type none))
        )
        (polyline
          (pts
            (xy -1.8288 0.2794)
            (xy -1.1176 1.4986)
            (xy 1.8288 -0.2032)
            (xy 1.1176 -1.4224)
            (xy -1.8288 0.2794)
          )
          (stroke (width 0) (type default) (color 0 0 0 0))
          (fill (type none))
        )
      )
      (symbol "Ferrite_Bead_Small-device_1_1"
        (pin passive line (at 0 2.54 270) (length 1.27)
          (name "~" (effects (font (size 1.27 1.27))))
          (number "1" (effects (font (size 1.27 1.27))))
        )
        (pin passive line (at 0 -2.54 90) (length 1.27)
          (name "~" (effects (font (size 1.27 1.27))))
          (number "2" (effects (font (size 1.27 1.27))))
        )
      )
    )
    (symbol "GRF2014-rescue:L-device" (pin_numbers hide) (pin_names (offset 1.016) hide) (in_bom yes) (on_board yes)
      (property "Reference" "L" (id 0) (at -1.27 0 90)
        (effects (font (size 1.27 1.27)))
      )
      (property "Value" "L-device" (id 1) (at 1.905 0 90)
        (effects (font (size 1.27 1.27)))
      )
      (property "Footprint" "" (id 2) (at 0 0 0)
        (effects (font (size 1.27 1.27)) hide)
      )
      (property "Datasheet" "" (id 3) (at 0 0 0)
        (effects (font (size 1.27 1.27)) hide)
      )
      (property "ki_fp_filters" "Choke_* *Coil* Inductor_* L_*" (id 4) (at 0 0 0)
        (effects (font (size 1.27 1.27)) hide)
      )
      (symbol "L-device_0_1"
        (arc (start 0 -2.54) (mid 0.635 -1.905) (end 0 -1.27)
          (stroke (width 0) (type default) (color 0 0 0 0))
          (fill (type none))
        )
        (arc (start 0 -1.27) (mid 0.635 -0.635) (end 0 0)
          (stroke (width 0) (type default) (color 0 0 0 0))
          (fill (type none))
        )
        (arc (start 0 0) (mid 0.635 0.635) (end 0 1.27)
          (stroke (width 0) (type default) (color 0 0 0 0))
          (fill (type none))
        )
        (arc (start 0 1.27) (mid 0.635 1.905) (end 0 2.54)
          (stroke (width 0) (type default) (color 0 0 0 0))
          (fill (type none))
        )
      )
      (symbol "L-device_1_1"
        (pin passive line (at 0 3.81 270) (length 1.27)
          (name "1" (effects (font (size 1.27 1.27))))
          (number "1" (effects (font (size 1.27 1.27))))
        )
        (pin passive line (at 0 -3.81 90) (length 1.27)
          (name "2" (effects (font (size 1.27 1.27))))
          (number "2" (effects (font (size 1.27 1.27))))
        )
      )
    )
    (symbol "GRF2014-rescue:Logo_Open_Hardware_Small-graphics" (pin_names (offset 1.016)) (in_bom yes) (on_board yes)
      (property "Reference" "#LOGO" (id 0) (at 0 6.985 0)
        (effects (font (size 1.27 1.27)) hide)
      )
      (property "Value" "Logo_Open_Hardware_Small-graphics" (id 1) (at 0 -5.715 0)
        (effects (font (size 1.27 1.27)) hide)
      )
      (property "Footprint" "" (id 2) (at 0 0 0)
        (effects (font (size 1.27 1.27)) hide)
      )
      (property "Datasheet" "" (id 3) (at 0 0 0)
        (effects (font (size 1.27 1.27)) hide)
      )
      (symbol "Logo_Open_Hardware_Small-graphics_0_1"
        (polyline
          (pts
            (xy 3.3528 -4.3434)
            (xy 3.302 -4.318)
            (xy 3.175 -4.2418)
            (xy 2.9972 -4.1148)
            (xy 2.7686 -3.9624)
            (xy 2.54 -3.81)
            (xy 2.3622 -3.7084)
            (xy 2.2352 -3.6068)
            (xy 2.1844 -3.5814)
            (xy 2.159 -3.6068)
            (xy 2.0574 -3.6576)
            (xy 1.905 -3.7338)
            (xy 1.8034 -3.7846)
            (xy 1.6764 -3.8354)
            (xy 1.6002 -3.8354)
            (xy 1.6002 -3.8354)
            (xy 1.5494 -3.7338)
            (xy 1.4732 -3.5306)
            (xy 1.3462 -3.302)
            (xy 1.2446 -3.0226)
            (xy 1.1176 -2.7178)
            (xy 0.9652 -2.413)
            (xy 0.8636 -2.1082)
            (xy 0.7366 -1.8288)
            (xy 0.6604 -1.6256)
            (xy 0.6096 -1.4732)
            (xy 0.5842 -1.397)
            (xy 0.5842 -1.397)
            (xy 0.6604 -1.3208)
            (xy 0.7874 -1.2446)
            (xy 1.0414 -1.016)
            (xy 1.2954 -0.6858)
            (xy 1.4478 -0.3302)
            (xy 1.524 0.0762)
            (xy 1.4732 0.4572)
            (xy 1.3208 0.8128)
            (xy 1.0668 1.143)
            (xy 0.762 1.3716)
            (xy 0.4064 1.524)
            (xy 0 1.5748)
            (xy -0.381 1.5494)
            (xy -0.7366 1.397)
            (xy -1.0668 1.143)
            (xy -1.2192 0.9906)
            (xy -1.397 0.6604)
            (xy -1.524 0.3048)
            (xy -1.524 0.2286)
            (xy -1.4986 -0.1778)
            (xy -1.397 -0.5334)
            (xy -1.1938 -0.8636)
            (xy -0.9144 -1.143)
            (xy -0.8636 -1.1684)
            (xy -0.7366 -1.27)
            (xy -0.635 -1.3462)
            (xy -0.5842 -1.397)
            (xy -1.0668 -2.5908)
            (xy -1.143 -2.794)
            (xy -1.2954 -3.1242)
            (xy -1.397 -3.4036)
            (xy -1.4986 -3.6322)
            (xy -1.5748 -3.7846)
            (xy -1.6002 -3.8354)
            (xy -1.6002 -3.8354)
            (xy -1.651 -3.8354)
            (xy -1.7272 -3.81)
            (xy -1.905 -3.7338)
            (xy -2.0066 -3.683)
            (xy -2.1336 -3.6068)
            (xy -2.2098 -3.5814)
            (xy -2.2606 -3.6068)
            (xy -2.3622 -3.683)
            (xy -2.54 -3.81)
            (xy -2.7686 -3.9624)
            (xy -2.9718 -4.0894)
            (xy -3.1496 -4.2164)
            (xy -3.302 -4.318)
            (xy -3.3528 -4.3434)
            (xy -3.3782 -4.3434)
            (xy -3.429 -4.318)
            (xy -3.5306 -4.2164)
            (xy -3.7084 -4.064)
            (xy -3.937 -3.8354)
            (xy -3.9624 -3.81)
            (xy -4.1656 -3.6068)
            (xy -4.318 -3.4544)
            (xy -4.4196 -3.3274)
            (xy -4.445 -3.2766)
            (xy -4.445 -3.2766)
            (xy -4.4196 -3.2258)
            (xy -4.318 -3.0734)
            (xy -4.2164 -2.8956)
            (xy -4.064 -2.667)
            (xy -3.6576 -2.0828)
            (xy -3.8862 -1.5494)
            (xy -3.937 -1.3716)
            (xy -4.0386 -1.1684)
            (xy -4.0894 -1.0414)
            (xy -4.1148 -0.9652)
            (xy -4.191 -0.9398)
            (xy -4.318 -0.9144)
            (xy -4.5466 -0.8636)
            (xy -4.8006 -0.8128)
            (xy -5.0546 -0.7874)
            (xy -5.2578 -0.7366)
            (xy -5.4356 -0.7112)
            (xy -5.5118 -0.6858)
            (xy -5.5118 -0.6858)
            (xy -5.5372 -0.635)
            (xy -5.5372 -0.5588)
            (xy -5.5372 -0.4318)
            (xy -5.5626 -0.2286)
            (xy -5.5626 0.0762)
            (xy -5.5626 0.127)
            (xy -5.5372 0.4064)
            (xy -5.5372 0.635)
            (xy -5.5372 0.762)
            (xy -5.5372 0.8382)
            (xy -5.5372 0.8382)
            (xy -5.461 0.8382)
            (xy -5.3086 0.889)
            (xy -5.08 0.9144)
            (xy -4.826 0.9652)
            (xy -4.8006 0.9906)
            (xy -4.5466 1.0414)
            (xy -4.318 1.0668)
            (xy -4.1656 1.1176)
            (xy -4.0894 1.143)
            (xy -4.0894 1.143)
            (xy -4.0386 1.2446)
            (xy -3.9624 1.4224)
            (xy -3.8608 1.6256)
            (xy -3.7846 1.8288)
            (xy -3.7084 2.0066)
            (xy -3.6576 2.159)
            (xy -3.6322 2.2098)
            (xy -3.6322 2.2098)
            (xy -3.683 2.286)
            (xy -3.7592 2.413)
            (xy -3.8862 2.5908)
            (xy -4.064 2.8194)
            (xy -4.064 2.8448)
            (xy -4.2164 3.0734)
            (xy -4.3434 3.2512)
            (xy -4.4196 3.3782)
            (xy -4.445 3.4544)
            (xy -4.445 3.4544)
            (xy -4.3942 3.5052)
            (xy -4.2926 3.6322)
            (xy -4.1148 3.81)
            (xy -3.937 4.0132)
            (xy -3.8608 4.064)
            (xy -3.6576 4.2926)
            (xy -3.5052 4.4196)
            (xy -3.4036 4.4958)
            (xy -3.3528 4.5212)
            (xy -3.3528 4.5212)
            (xy -3.302 4.4704)
            (xy -3.1496 4.3688)
            (xy -2.9718 4.2418)
            (xy -2.7432 4.0894)
            (xy -2.7178 4.0894)
            (xy -2.4892 3.937)
            (xy -2.3114 3.81)
            (xy -2.1844 3.7084)
            (xy -2.1336 3.683)
            (xy -2.1082 3.683)
            (xy -2.032 3.7084)
            (xy -1.8542 3.7592)
            (xy -1.6764 3.8354)
            (xy -1.4732 3.937)
            (xy -1.27 4.0132)
            (xy -1.143 4.064)
            (xy -1.0668 4.1148)
            (xy -1.0668 4.1148)
            (xy -1.0414 4.191)
            (xy -1.016 4.3434)
            (xy -0.9652 4.572)
            (xy -0.9144 4.8514)
            (xy -0.889 4.9022)
            (xy -0.8382 5.1562)
            (xy -0.8128 5.3848)
            (xy -0.7874 5.5372)
            (xy -0.762 5.588)
            (xy -0.7112 5.6134)
            (xy -0.5842 5.6134)
            (xy -0.4064 5.6134)
            (xy -0.1524 5.6134)
            (xy 0.0762 5.6134)
            (xy 0.3302 5.6134)
            (xy 0.5334 5.6134)
            (xy 0.6858 5.588)
            (xy 0.7366 5.588)
            (xy 0.7366 5.588)
            (xy 0.762 5.5118)
            (xy 0.8128 5.334)
            (xy 0.8382 5.1054)
            (xy 0.9144 4.826)
            (xy 0.9144 4.7752)
            (xy 0.9652 4.5212)
            (xy 1.016 4.2926)
            (xy 1.0414 4.1402)
            (xy 1.0668 4.0894)
            (xy 1.0668 4.0894)
            (xy 1.1938 4.0386)
            (xy 1.3716 3.9624)
            (xy 1.5748 3.8608)
            (xy 2.0828 3.6576)
            (xy 2.7178 4.0894)
            (xy 2.7686 4.1402)
            (xy 2.9972 4.2926)
            (xy 3.175 4.4196)
            (xy 3.302 4.4958)
            (xy 3.3782 4.5212)
            (xy 3.3782 4.5212)
            (xy 3.429 4.4704)
            (xy 3.556 4.3434)
            (xy 3.7338 4.191)
            (xy 3.9116 3.9878)
            (xy 4.064 3.8354)
            (xy 4.2418 3.6576)
            (xy 4.3434 3.556)
            (xy 4.4196 3.4798)
            (xy 4.4196 3.429)
            (xy 4.4196 3.4036)
            (xy 4.3942 3.3274)
            (xy 4.2926 3.2004)
            (xy 4.1656 2.9972)
            (xy 4.0132 2.794)
            (xy 3.8862 2.5908)
            (xy 3.7592 2.3876)
            (xy 3.6576 2.2352)
            (xy 3.6322 2.159)
            (xy 3.6322 2.1336)
            (xy 3.683 2.0066)
            (xy 3.7592 1.8288)
            (xy 3.8608 1.6002)
            (xy 4.064 1.1176)
            (xy 4.3942 1.0414)
            (xy 4.5974 1.016)
            (xy 4.8768 0.9652)
            (xy 5.1308 0.9144)
            (xy 5.5372 0.8382)
            (xy 5.5626 -0.6604)
            (xy 5.4864 -0.6858)
            (xy 5.4356 -0.6858)
            (xy 5.2832 -0.7366)
            (xy 5.0546 -0.762)
            (xy 4.8006 -0.8128)
            (xy 4.5974 -0.8636)
            (xy 4.3688 -0.9144)
            (xy 4.2164 -0.9398)
            (xy 4.1402 -0.9398)
            (xy 4.1148 -0.9652)
            (xy 4.064 -1.0668)
            (xy 3.9878 -1.2446)
            (xy 3.9116 -1.4478)
            (xy 3.81 -1.651)
            (xy 3.7338 -1.8542)
            (xy 3.683 -2.0066)
            (xy 3.6576 -2.0828)
            (xy 3.683 -2.1336)
            (xy 3.7846 -2.2606)
            (xy 3.8862 -2.4638)
            (xy 4.0386 -2.667)
            (xy 4.191 -2.8956)
            (xy 4.318 -3.0734)
            (xy 4.3942 -3.2004)
            (xy 4.445 -3.2766)
            (xy 4.4196 -3.3274)
            (xy 4.3434 -3.429)
            (xy 4.1656 -3.5814)
            (xy 3.937 -3.8354)
            (xy 3.8862 -3.8608)
            (xy 3.683 -4.064)
            (xy 3.5306 -4.2164)
            (xy 3.4036 -4.318)
            (xy 3.3528 -4.3434)
          )
          (stroke (width 0) (type default) (color 0 0 0 0))
          (fill (type outline))
        )
      )
    )
    (symbol "GRF2014-rescue:R-device" (pin_numbers hide) (pin_names (offset 0)) (in_bom yes) (on_board yes)
      (property "Reference" "R" (id 0) (at 2.032 0 90)
        (effects (font (size 1.27 1.27)))
      )
      (property "Value" "R-device" (id 1) (at 0 0 90)
        (effects (font (size 1.27 1.27)))
      )
      (property "Footprint" "" (id 2) (at -1.778 0 90)
        (effects (font (size 1.27 1.27)) hide)
      )
      (property "Datasheet" "" (id 3) (at 0 0 0)
        (effects (font (size 1.27 1.27)) hide)
      )
      (property "ki_fp_filters" "R_*" (id 4) (at 0 0 0)
        (effects (font (size 1.27 1.27)) hide)
      )
      (symbol "R-device_0_1"
        (rectangle (start -1.016 -2.54) (end 1.016 2.54)
          (stroke (width 0.254) (type default) (color 0 0 0 0))
          (fill (type none))
        )
      )
      (symbol "R-device_1_1"
        (pin passive line (at 0 3.81 270) (length 1.27)
          (name "~" (effects (font (size 1.27 1.27))))
          (number "1" (effects (font (size 1.27 1.27))))
        )
        (pin passive line (at 0 -3.81 90) (length 1.27)
          (name "~" (effects (font (size 1.27 1.27))))
          (number "2" (effects (font (size 1.27 1.27))))
        )
      )
    )
    (symbol "power:GND" (power) (pin_names (offset 0)) (in_bom yes) (on_board yes)
      (property "Reference" "#PWR" (id 0) (at 0 -6.35 0)
        (effects (font (size 1.27 1.27)) hide)
      )
      (property "Value" "GND" (id 1) (at 0 -3.81 0)
        (effects (font (size 1.27 1.27)))
      )
      (property "Footprint" "" (id 2) (at 0 0 0)
        (effects (font (size 1.27 1.27)) hide)
      )
      (property "Datasheet" "" (id 3) (at 0 0 0)
        (effects (font (size 1.27 1.27)) hide)
      )
      (property "ki_keywords" "power-flag" (id 4) (at 0 0 0)
        (effects (font (size 1.27 1.27)) hide)
      )
      (property "ki_description" "Power symbol creates a global label with name \"GND\" , ground" (id 5) (at 0 0 0)
        (effects (font (size 1.27 1.27)) hide)
      )
      (symbol "GND_0_1"
        (polyline
          (pts
            (xy 0 0)
            (xy 0 -1.27)
            (xy 1.27 -1.27)
            (xy 0 -2.54)
            (xy -1.27 -1.27)
            (xy 0 -1.27)
          )
          (stroke (width 0) (type default) (color 0 0 0 0))
          (fill (type none))
        )
      )
      (symbol "GND_1_1"
        (pin power_in line (at 0 0 270) (length 0) hide
          (name "GND" (effects (font (size 1.27 1.27))))
          (number "1" (effects (font (size 1.27 1.27))))
        )
      )
    )
    (symbol "project:GRF2003DS" (pin_names (offset 1.016)) (in_bom yes) (on_board yes)
      (property "Reference" "U" (id 0) (at 2.54 5.08 0)
        (effects (font (size 1.27 1.27)) (justify left bottom))
      )
      (property "Value" "GRF2003DS" (id 1) (at 5.08 -3.81 0)
        (effects (font (size 1.27 1.27)) (justify left bottom))
      )
      (property "Footprint" "" (id 2) (at 0 0 0)
        (effects (font (size 1.524 1.524)))
      )
      (property "Datasheet" "" (id 3) (at 0 0 0)
        (effects (font (size 1.524 1.524)))
      )
      (property "ki_locked" "" (id 4) (at 0 0 0)
        (effects (font (size 1.27 1.27)))
      )
      (symbol "GRF2003DS_0_1"
        (polyline
          (pts
            (xy 5.08 -5.08)
            (xy 7.62 -5.08)
          )
          (stroke (width 0) (type default) (color 0 0 0 0))
          (fill (type none))
        )
      )
      (symbol "GRF2003DS_1_0"
        (polyline
          (pts
            (xy -5.08 0)
            (xy -3.81 0)
          )
          (stroke (width 0) (type default) (color 0 0 0 0))
          (fill (type none))
        )
        (polyline
          (pts
            (xy -3.81 -6.35)
            (xy -3.81 0)
          )
          (stroke (width 0) (type default) (color 0 0 0 0))
          (fill (type none))
        )
        (polyline
          (pts
            (xy -3.81 0)
            (xy -3.81 6.35)
          )
          (stroke (width 0) (type default) (color 0 0 0 0))
          (fill (type none))
        )
        (polyline
          (pts
            (xy 0 -5.08)
            (xy 0 -4.318)
          )
          (stroke (width 0) (type default) (color 0 0 0 0))
          (fill (type none))
        )
        (polyline
          (pts
            (xy 0 5.08)
            (xy 0 4.318)
          )
          (stroke (width 0) (type default) (color 0 0 0 0))
          (fill (type none))
        )
        (polyline
          (pts
            (xy 7.62 0)
            (xy -3.81 -6.35)
          )
          (stroke (width 0) (type default) (color 0 0 0 0))
          (fill (type none))
        )
        (polyline
          (pts
            (xy 7.62 0)
            (xy -3.81 6.35)
          )
          (stroke (width 0) (type default) (color 0 0 0 0))
          (fill (type none))
        )
      )
      (symbol "GRF2003DS_1_1"
        (rectangle (start 0 -5.08) (end 2.54 -5.08)
          (stroke (width 0) (type default) (color 0 0 0 0))
          (fill (type none))
        )
        (rectangle (start 2.54 -5.08) (end 5.08 -5.08)
          (stroke (width 0) (type default) (color 0 0 0 0))
          (fill (type none))
        )
        (pin input line (at 0 7.62 270) (length 2.54)
          (name "Ven" (effects (font (size 1.016 1.016))))
          (number "1" (effects (font (size 1.016 1.016))))
        )
        (pin passive line (at 0 -7.62 90) (length 2.54)
          (name "GND" (effects (font (size 1.016 1.016))))
          (number "2" (effects (font (size 1.016 1.016))))
        )
        (pin bidirectional line (at -7.62 0 0) (length 2.54)
          (name "IN" (effects (font (size 1.016 1.016))))
          (number "3" (effects (font (size 1.016 1.016))))
        )
        (pin bidirectional line (at 10.16 0 180) (length 2.54)
          (name "OUT" (effects (font (size 1.016 1.016))))
          (number "4" (effects (font (size 1.016 1.016))))
        )
        (pin passive line (at 2.54 -7.62 90) (length 2.54)
          (name "~" (effects (font (size 1.016 1.016))))
          (number "5" (effects (font (size 1.016 1.016))))
        )
        (pin passive line (at 5.08 -7.62 90) (length 2.54)
          (name "~" (effects (font (size 1.016 1.016))))
          (number "6" (effects (font (size 1.016 1.016))))
        )
        (pin passive line (at 7.62 -7.62 90) (length 2.54)
          (name "~" (effects (font (size 1.016 1.016))))
          (number "7" (effects (font (size 1.016 1.016))))
        )
      )
    )
    (symbol "project:SMA_2" (pin_numbers hide) (pin_names (offset 1.016) hide) (in_bom yes) (on_board yes)
      (property "Reference" "J" (id 0) (at 3.81 1.905 0)
        (effects (font (size 1.27 1.27)))
      )
      (property "Value" "SMA_2" (id 1) (at 4.445 -0.635 0)
        (effects (font (size 1.27 1.27)))
      )
      (property "Footprint" "" (id 2) (at 4.445 -2.54 0)
        (effects (font (size 1.27 1.27)))
      )
      (property "Datasheet" "" (id 3) (at 0 0 0)
        (effects (font (size 1.524 1.524)))
      )
      (symbol "SMA_2_0_1"
        (arc (start -1.905 -0.508) (mid -1.1909 -1.5311) (end 0 -1.905)
          (stroke (width 0) (type default) (color 0 0 0 0))
          (fill (type none))
        )
        (arc (start 0 -1.905) (mid 1.905 0) (end 0 1.905)
          (stroke (width 0) (type default) (color 0 0 0 0))
          (fill (type none))
        )
        (circle (center 0 0) (radius 0.635)
          (stroke (width 0) (type default) (color 0 0 0 0))
          (fill (type outline))
        )
        (arc (start 0 1.905) (mid -1.2136 1.47) (end -1.905 0.381)
          (stroke (width 0) (type default) (color 0 0 0 0))
          (fill (type none))
        )
      )
      (symbol "SMA_2_1_1"
        (pin bidirectional line (at -3.175 0 0) (length 2.54)
          (name "RF" (effects (font (size 0 0))))
          (number "1" (effects (font (size 0 0))))
        )
        (pin passive line (at 0 -4.445 90) (length 2.54)
          (name "~" (effects (font (size 1.016 1.016))))
          (number "2" (effects (font (size 1.016 1.016))))
        )
      )
    )
    (symbol "project:rfi_shield_clip" (pin_names (offset 1.016)) (in_bom yes) (on_board yes)
      (property "Reference" "P" (id 0) (at 0 5.08 0)
        (effects (font (size 1.524 1.524)))
      )
      (property "Value" "rfi_shield_clip" (id 1) (at 0 7.62 0)
        (effects (font (size 1.524 1.524)))
      )
      (property "Footprint" "" (id 2) (at 0 0 0)
        (effects (font (size 1.524 1.524)))
      )
      (property "Datasheet" "" (id 3) (at 0 0 0)
        (effects (font (size 1.524 1.524)))
      )
      (symbol "rfi_shield_clip_0_1"
        (rectangle (start -2.54 3.81) (end 2.54 -1.27)
          (stroke (width 0) (type default) (color 0 0 0 0))
          (fill (type none))
        )
      )
      (symbol "rfi_shield_clip_1_1"
        (pin power_in line (at 0 -2.54 90) (length 1.27)
          (name "Gnd" (effects (font (size 1.016 1.016))))
          (number "1" (effects (font (size 1.016 1.016))))
        )
      )
    )
  )

  (junction (at 95.25 109.22) (diameter 0) (color 0 0 0 0)
    (uuid 08afdcdc-6629-447b-bb1f-d75a8f5f5daa)
  )
  (junction (at 104.14 109.22) (diameter 0) (color 0 0 0 0)
    (uuid 0913c606-3274-478a-a6fe-38137b5f2470)
  )
  (junction (at 172.72 77.47) (diameter 0) (color 0 0 0 0)
    (uuid 27176014-ec2b-4b7b-82ba-ee4bf7e3f850)
  )
  (junction (at 197.485 77.47) (diameter 0) (color 0 0 0 0)
    (uuid 271f42c6-1325-4574-8cd6-be70a8d2edb0)
  )
  (junction (at 156.845 118.11) (diameter 0) (color 0 0 0 0)
    (uuid 2b7cca22-012e-45d5-a2d0-ac2147a0d313)
  )
  (junction (at 95.25 77.47) (diameter 0) (color 0 0 0 0)
    (uuid 2d372620-3622-43a2-8213-a1f03afb4fd1)
  )
  (junction (at 123.19 77.47) (diameter 0) (color 0 0 0 0)
    (uuid 67b55b68-4413-4f0f-a326-4ff2b40cf66b)
  )
  (junction (at 74.93 77.47) (diameter 0) (color 0 0 0 0)
    (uuid 7f6ddb8b-e54b-4b6c-bda1-8d44cf87f8fa)
  )
  (junction (at 163.83 77.47) (diameter 0) (color 0 0 0 0)
    (uuid 7f7a2436-4f85-4709-b714-74571a5a8bac)
  )
  (junction (at 184.785 77.47) (diameter 0) (color 0 0 0 0)
    (uuid 83a7bde7-b781-4cda-8fae-6dc9af07ca8b)
  )
  (junction (at 172.72 109.22) (diameter 0) (color 0 0 0 0)
    (uuid 8421be4e-9d83-45e8-8edf-5def0695c6c0)
  )
  (junction (at 154.305 118.11) (diameter 0) (color 0 0 0 0)
    (uuid d7157e8c-f4e6-47b9-8201-8de353fa2e7e)
  )
  (junction (at 189.865 109.22) (diameter 0) (color 0 0 0 0)
    (uuid d7e89aab-af83-41cb-8512-a1be3a6afbab)
  )
  (junction (at 119.38 109.22) (diameter 0) (color 0 0 0 0)
    (uuid e9ebe0df-3ccf-4ced-9295-1abdb4221bc6)
  )
  (junction (at 151.765 77.47) (diameter 0) (color 0 0 0 0)
    (uuid ffd9ad86-663c-4e94-8fdb-111763487f51)
  )

  (wire (pts (xy 61.595 77.47) (xy 74.93 77.47))
    (stroke (width 0) (type default) (color 0 0 0 0))
    (uuid 1209b06b-cbe8-4875-afe7-dbc7b962933f)
  )
  (wire (pts (xy 172.72 90.17) (xy 172.72 109.22))
    (stroke (width 0) (type default) (color 0 0 0 0))
    (uuid 15f31c41-bd19-44b7-9e09-1b9f4a1a49d8)
  )
  (wire (pts (xy 189.865 109.22) (xy 215.265 109.22))
    (stroke (width 0) (type default) (color 0 0 0 0))
    (uuid 15f96cb3-c519-44a2-91c7-e037b0bad1cb)
  )
  (wire (pts (xy 104.14 109.22) (xy 107.95 109.22))
    (stroke (width 0) (type default) (color 0 0 0 0))
    (uuid 1e025d53-8139-4783-b5a7-36dc62988baa)
  )
  (wire (pts (xy 154.305 116.84) (xy 154.305 118.11))
    (stroke (width 0) (type default) (color 0 0 0 0))
    (uuid 1f2ebc34-74a4-4def-9fbc-7492c7f02699)
  )
  (wire (pts (xy 172.72 109.22) (xy 176.53 109.22))
    (stroke (width 0) (type default) (color 0 0 0 0))
    (uuid 3027d1a1-d203-43e2-8328-9f0c11e5af68)
  )
  (wire (pts (xy 197.485 77.47) (xy 207.645 77.47))
    (stroke (width 0) (type default) (color 0 0 0 0))
    (uuid 3ae1a1d5-a4f2-4e21-8cfc-d1969f0a65a1)
  )
  (wire (pts (xy 140.97 77.47) (xy 151.765 77.47))
    (stroke (width 0) (type default) (color 0 0 0 0))
    (uuid 3cf81f0e-bc60-4318-a833-9e79ab399e34)
  )
  (wire (pts (xy 87.63 77.47) (xy 95.25 77.47))
    (stroke (width 0) (type default) (color 0 0 0 0))
    (uuid 3e2a3b20-63e1-494d-8d4c-6072a3984838)
  )
  (wire (pts (xy 189.865 114.3) (xy 189.865 109.22))
    (stroke (width 0) (type default) (color 0 0 0 0))
    (uuid 4588d6ca-ce1f-446a-b431-0377f49c86cf)
  )
  (wire (pts (xy 151.765 77.47) (xy 163.83 77.47))
    (stroke (width 0) (type default) (color 0 0 0 0))
    (uuid 48a862ea-9a93-418f-a093-8acf7c9fe46f)
  )
  (wire (pts (xy 184.785 81.28) (xy 184.785 77.47))
    (stroke (width 0) (type default) (color 0 0 0 0))
    (uuid 505d11d6-8afe-42b7-b585-3e4edea74a2b)
  )
  (wire (pts (xy 113.03 77.47) (xy 123.19 77.47))
    (stroke (width 0) (type default) (color 0 0 0 0))
    (uuid 52ff6e4f-8e5b-4cdb-935a-a4e0c4532eea)
  )
  (wire (pts (xy 172.72 77.47) (xy 172.72 82.55))
    (stroke (width 0) (type default) (color 0 0 0 0))
    (uuid 5c8398b1-d879-46ce-a19f-76b6517d432a)
  )
  (wire (pts (xy 115.57 109.22) (xy 119.38 109.22))
    (stroke (width 0) (type default) (color 0 0 0 0))
    (uuid 6059a3be-49e1-4577-8bdb-76ea69798ac1)
  )
  (wire (pts (xy 207.645 77.47) (xy 207.645 81.28))
    (stroke (width 0) (type default) (color 0 0 0 0))
    (uuid 6c48bb68-6250-4cdf-a975-af902f16d46d)
  )
  (wire (pts (xy 104.14 114.3) (xy 104.14 109.22))
    (stroke (width 0) (type default) (color 0 0 0 0))
    (uuid 702fc7a7-54a2-465f-948f-5cbd04b2883a)
  )
  (wire (pts (xy 151.765 118.11) (xy 154.305 118.11))
    (stroke (width 0) (type default) (color 0 0 0 0))
    (uuid 70625d72-d102-41ce-a733-b20caaf04908)
  )
  (wire (pts (xy 70.485 109.22) (xy 95.25 109.22))
    (stroke (width 0) (type default) (color 0 0 0 0))
    (uuid 71bb45e4-f974-4a0b-a7f3-a1a3558cb939)
  )
  (wire (pts (xy 61.595 80.01) (xy 64.135 80.01))
    (stroke (width 0) (type default) (color 0 0 0 0))
    (uuid 73dc5652-37b1-4bae-967c-f4f827fb1cbe)
  )
  (wire (pts (xy 197.485 81.28) (xy 197.485 77.47))
    (stroke (width 0) (type default) (color 0 0 0 0))
    (uuid 73e3a595-a4a7-4860-b92b-db553a486279)
  )
  (wire (pts (xy 74.93 77.47) (xy 82.55 77.47))
    (stroke (width 0) (type default) (color 0 0 0 0))
    (uuid 74e1ddc9-736b-4e38-a4bd-93b1ece91060)
  )
  (wire (pts (xy 172.72 114.3) (xy 172.72 109.22))
    (stroke (width 0) (type default) (color 0 0 0 0))
    (uuid 77b4106f-8f93-45b7-bf6b-ba15000c5b2c)
  )
  (wire (pts (xy 123.19 81.28) (xy 123.19 77.47))
    (stroke (width 0) (type default) (color 0 0 0 0))
    (uuid 7be9d28b-3333-49c5-a650-d42e7b87e3be)
  )
  (wire (pts (xy 159.385 116.84) (xy 159.385 118.11))
    (stroke (width 0) (type default) (color 0 0 0 0))
    (uuid 829c8f12-1436-4825-80f1-06633b2c6787)
  )
  (wire (pts (xy 64.135 80.01) (xy 64.135 90.17))
    (stroke (width 0) (type default) (color 0 0 0 0))
    (uuid 82c397e1-bad9-4d00-af7a-e91058a9119f)
  )
  (wire (pts (xy 95.25 77.47) (xy 105.41 77.47))
    (stroke (width 0) (type default) (color 0 0 0 0))
    (uuid 83a42a07-630e-4c4b-bd08-6cca9b77a0ae)
  )
  (wire (pts (xy 74.93 81.28) (xy 74.93 77.47))
    (stroke (width 0) (type default) (color 0 0 0 0))
    (uuid 8514148c-c58e-439e-a5bf-e8f98414ec46)
  )
  (wire (pts (xy 154.305 118.11) (xy 156.845 118.11))
    (stroke (width 0) (type default) (color 0 0 0 0))
    (uuid 8fc07cb2-17fe-4c4e-8c94-3764aaf75087)
  )
  (wire (pts (xy 151.765 101.6) (xy 151.765 88.9))
    (stroke (width 0) (type default) (color 0 0 0 0))
    (uuid 92201c1a-6dea-4dca-8497-a1eb2ab9e1ac)
  )
  (wire (pts (xy 163.83 77.47) (xy 172.72 77.47))
    (stroke (width 0) (type default) (color 0 0 0 0))
    (uuid 9393b334-a478-4e74-b11c-c8f3f9adeecb)
  )
  (wire (pts (xy 119.38 109.22) (xy 144.145 109.22))
    (stroke (width 0) (type default) (color 0 0 0 0))
    (uuid 94d474fe-f547-4b63-a637-5aa431d1ea75)
  )
  (wire (pts (xy 163.83 81.28) (xy 163.83 77.47))
    (stroke (width 0) (type default) (color 0 0 0 0))
    (uuid a25c2754-3958-4f28-9eb4-22ca144a7b6c)
  )
  (wire (pts (xy 123.19 77.47) (xy 133.35 77.47))
    (stroke (width 0) (type default) (color 0 0 0 0))
    (uuid aa380bda-4f0a-4cf8-a51f-008db6ac627d)
  )
  (wire (pts (xy 151.765 116.84) (xy 151.765 118.11))
    (stroke (width 0) (type default) (color 0 0 0 0))
    (uuid add9c17e-01f6-40f3-a6b6-1a4c1f9d5305)
  )
  (wire (pts (xy 95.25 109.22) (xy 104.14 109.22))
    (stroke (width 0) (type default) (color 0 0 0 0))
    (uuid b69bf520-650d-49b3-a93c-d10312ce5bde)
  )
  (wire (pts (xy 151.765 81.28) (xy 151.765 77.47))
    (stroke (width 0) (type default) (color 0 0 0 0))
    (uuid b8103934-d96f-4a9d-b123-022d00e5d946)
  )
  (wire (pts (xy 95.25 81.28) (xy 95.25 77.47))
    (stroke (width 0) (type default) (color 0 0 0 0))
    (uuid c1d31495-c8cf-4668-ab43-b5c23cabb2a3)
  )
  (wire (pts (xy 172.72 77.47) (xy 184.785 77.47))
    (stroke (width 0) (type default) (color 0 0 0 0))
    (uuid c74030ae-bdb5-41a2-840d-a493b8845676)
  )
  (wire (pts (xy 161.925 109.22) (xy 172.72 109.22))
    (stroke (width 0) (type default) (color 0 0 0 0))
    (uuid cc59a041-1e26-431e-bdcd-7772081d3bcc)
  )
  (wire (pts (xy 159.385 118.11) (xy 156.845 118.11))
    (stroke (width 0) (type default) (color 0 0 0 0))
    (uuid d406ee61-7b6b-4a6c-a973-4df882e99f4a)
  )
  (wire (pts (xy 184.785 77.47) (xy 197.485 77.47))
    (stroke (width 0) (type default) (color 0 0 0 0))
    (uuid df5d762b-631c-4d8a-8d8f-d227f8eef366)
  )
  (wire (pts (xy 119.38 114.3) (xy 119.38 109.22))
    (stroke (width 0) (type default) (color 0 0 0 0))
    (uuid e819620f-16e8-4b65-93b5-4aadf6102dfc)
  )
  (wire (pts (xy 184.15 109.22) (xy 189.865 109.22))
    (stroke (width 0) (type default) (color 0 0 0 0))
    (uuid e9b859a3-cfeb-4311-bd84-2d4657b3b3da)
  )
  (wire (pts (xy 156.845 118.11) (xy 156.845 116.84))
    (stroke (width 0) (type default) (color 0 0 0 0))
    (uuid ecc008fc-a148-4230-a5cd-d14cebb4fb49)
  )
  (wire (pts (xy 95.25 114.3) (xy 95.25 109.22))
    (stroke (width 0) (type default) (color 0 0 0 0))
    (uuid f1d78493-82b2-4db0-9229-8d1effd36ac8)
  )

  (text "A-RF Out" (at 224.79 106.045 0)
    (effects (font (size 1.524 1.524)) (justify left bottom))
    (uuid 065b5e19-8ac0-4c38-aaf2-6b9446dd7ce5)
  )
  (text "A-RF In" (at 52.07 106.045 0)
    (effects (font (size 1.524 1.524)) (justify left bottom))
    (uuid 23e95e4b-01e8-4028-a308-fd44e49bce74)
  )
  (text "160mA" (at 148.59 75.565 0)
    (effects (font (size 1.27 1.27)) (justify left bottom))
    (uuid 356ec25b-fdb8-4b64-a29b-c18ad7cd0bd8)
  )

  (symbol (lib_id "GRF2014-rescue:Logo_Open_Hardware_Small-graphics") (at 36.83 32.385 0) (unit 1)
    (in_bom yes) (on_board yes)
    (uuid 00000000-0000-0000-0000-00005c70d97e)
    (property "Reference" "#LOGO1" (id 0) (at 36.83 25.4 0)
      (effects (font (size 1.27 1.27)) hide)
    )
    (property "Value" "Open Source Hardware" (id 1) (at 36.83 38.1 0))
    (property "Footprint" "" (id 2) (at 36.83 32.385 0)
      (effects (font (size 1.27 1.27)) hide)
    )
    (property "Datasheet" "~" (id 3) (at 36.83 32.385 0)
      (effects (font (size 1.27 1.27)) hide)
    )
  )

  (symbol (lib_id "project:rfi_shield_clip") (at 233.045 38.735 0) (unit 1)
    (in_bom yes) (on_board yes)
    (uuid 00000000-0000-0000-0000-00005c796e6c)
    (property "Reference" "P1" (id 0) (at 236.2962 38.2524 0)
      (effects (font (size 1.524 1.524)) (justify left))
    )
    (property "Value" "~" (id 1) (at 236.2962 39.5986 0)
      (effects (font (size 1.524 1.524)) (justify left))
    )
    (property "Footprint" "RF_Shielding:S1721-46R" (id 2) (at 233.045 38.735 0)
      (effects (font (size 1.524 1.524)) hide)
    )
    (property "Datasheet" "" (id 3) (at 233.045 38.735 0)
      (effects (font (size 1.524 1.524)))
    )
    (property "MFN" "Harwin Inc." (id 4) (at 233.045 38.735 0)
      (effects (font (size 1.27 1.27)) hide)
    )
    (property "MFP" "S1721-46R" (id 5) (at 233.045 38.735 0)
      (effects (font (size 1.27 1.27)) hide)
    )
    (property "S1PN" "952-1476-1-ND" (id 6) (at 233.045 38.735 0)
      (effects (font (size 1.27 1.27)) hide)
    )
    (property "S1PL" "Digi-Key" (id 7) (at 233.045 38.735 0)
      (effects (font (size 1.27 1.27)) hide)
    )
    (property "S2PN" "855-S1721-46R" (id 8) (at 233.045 38.735 0)
      (effects (font (size 1.27 1.27)) hide)
    )
    (property "S2PL" "Arrow" (id 9) (at 233.045 38.735 0)
      (effects (font (size 1.27 1.27)) hide)
    )
    (property "Description" "RFI SHIELD CLIP MINI TIN SMD" (id 10) (at 233.045 38.735 0)
      (effects (font (size 1.27 1.27)) hide)
    )
    (property "variant" "sot86" (id 11) (at 233.045 38.735 0)
      (effects (font (size 1.27 1.27)) hide)
    )
    (pin "1" (uuid 1d851825-c85f-449a-90fe-387fffab5394))
  )

  (symbol (lib_id "power:GND") (at 233.045 41.275 0) (unit 1)
    (in_bom yes) (on_board yes)
    (uuid 00000000-0000-0000-0000-00005c797178)
    (property "Reference" "#PWR01" (id 0) (at 233.045 41.275 0)
      (effects (font (size 0.762 0.762)) hide)
    )
    (property "Value" "GND" (id 1) (at 233.045 43.053 0)
      (effects (font (size 0.762 0.762)) hide)
    )
    (property "Footprint" "" (id 2) (at 233.045 41.275 0)
      (effects (font (size 1.524 1.524)) hide)
    )
    (property "Datasheet" "" (id 3) (at 233.045 41.275 0)
      (effects (font (size 1.524 1.524)) hide)
    )
    (pin "1" (uuid 368a4c24-d7a6-454e-9a6b-3e45a72371c1))
  )

  (symbol (lib_id "power:GND") (at 244.475 41.275 0) (unit 1)
    (in_bom yes) (on_board yes)
    (uuid 00000000-0000-0000-0000-00005c79736b)
    (property "Reference" "#PWR02" (id 0) (at 244.475 41.275 0)
      (effects (font (size 0.762 0.762)) hide)
    )
    (property "Value" "GND" (id 1) (at 244.475 43.053 0)
      (effects (font (size 0.762 0.762)) hide)
    )
    (property "Footprint" "" (id 2) (at 244.475 41.275 0)
      (effects (font (size 1.524 1.524)) hide)
    )
    (property "Datasheet" "" (id 3) (at 244.475 41.275 0)
      (effects (font (size 1.524 1.524)) hide)
    )
    (pin "1" (uuid 02a453ce-85f9-497a-93eb-d3de99f0a335))
  )

  (symbol (lib_id "project:rfi_shield_clip") (at 244.475 38.735 0) (unit 1)
    (in_bom yes) (on_board yes)
    (uuid 00000000-0000-0000-0000-00005d0a8b4d)
    (property "Reference" "P2" (id 0) (at 247.7262 38.2524 0)
      (effects (font (size 1.524 1.524)) (justify left))
    )
    (property "Value" "~" (id 1) (at 247.7262 39.5986 0)
      (effects (font (size 1.524 1.524)) (justify left))
    )
    (property "Footprint" "RF_Shielding:S1721-46R" (id 2) (at 244.475 38.735 0)
      (effects (font (size 1.524 1.524)) hide)
    )
    (property "Datasheet" "" (id 3) (at 244.475 38.735 0)
      (effects (font (size 1.524 1.524)))
    )
    (property "MFN" "Harwin Inc." (id 4) (at 244.475 38.735 0)
      (effects (font (size 1.27 1.27)) hide)
    )
    (property "MFP" "S1721-46R" (id 5) (at 244.475 38.735 0)
      (effects (font (size 1.27 1.27)) hide)
    )
    (property "S1PN" "952-1476-1-ND" (id 6) (at 244.475 38.735 0)
      (effects (font (size 1.27 1.27)) hide)
    )
    (property "S1PL" "Digi-Key" (id 7) (at 244.475 38.735 0)
      (effects (font (size 1.27 1.27)) hide)
    )
    (property "S2PN" "855-S1721-46R" (id 8) (at 244.475 38.735 0)
      (effects (font (size 1.27 1.27)) hide)
    )
    (property "S2PL" "Mouser" (id 9) (at 244.475 38.735 0)
      (effects (font (size 1.27 1.27)) hide)
    )
    (property "Description" "RFI SHIELD CLIP MINI TIN SMD" (id 10) (at 244.475 38.735 0)
      (effects (font (size 1.27 1.27)) hide)
    )
    (property "variant" "sot86" (id 11) (at 244.475 38.735 0)
      (effects (font (size 1.27 1.27)) hide)
    )
    (pin "1" (uuid f30c54c6-2f52-47b8-92a3-ff075fbafa91))
  )

  (symbol (lib_id "power:GND") (at 74.93 88.9 0) (unit 1)
    (in_bom yes) (on_board yes)
    (uuid 00000000-0000-0000-0000-00005dc86445)
    (property "Reference" "#PWR03" (id 0) (at 74.93 88.9 0)
      (effects (font (size 0.762 0.762)) hide)
    )
    (property "Value" "GND" (id 1) (at 74.93 90.678 0)
      (effects (font (size 0.762 0.762)) hide)
    )
    (property "Footprint" "" (id 2) (at 74.93 88.9 0)
      (effects (font (size 1.524 1.524)) hide)
    )
    (property "Datasheet" "" (id 3) (at 74.93 88.9 0)
      (effects (font (size 1.524 1.524)) hide)
    )
    (pin "1" (uuid 2004c435-a4d9-44e6-8068-06085ffd7fff))
  )

  (symbol (lib_id "power:GND") (at 95.25 88.9 0) (unit 1)
    (in_bom yes) (on_board yes)
    (uuid 00000000-0000-0000-0000-00005dc8644b)
    (property "Reference" "#PWR04" (id 0) (at 95.25 88.9 0)
      (effects (font (size 0.762 0.762)) hide)
    )
    (property "Value" "GND" (id 1) (at 95.25 90.678 0)
      (effects (font (size 0.762 0.762)) hide)
    )
    (property "Footprint" "" (id 2) (at 95.25 88.9 0)
      (effects (font (size 1.524 1.524)) hide)
    )
    (property "Datasheet" "" (id 3) (at 95.25 88.9 0)
      (effects (font (size 1.524 1.524)) hide)
    )
    (pin "1" (uuid 7ea4b3b2-0b5c-40c1-bbdc-a1fdaa9ce16f))
  )

  (symbol (lib_id "GRF2014-rescue:R-device") (at 109.22 77.47 90) (unit 1)
    (in_bom yes) (on_board yes)
    (uuid 00000000-0000-0000-0000-00005dc86451)
    (property "Reference" "R15" (id 0) (at 109.22 80.01 90))
    (property "Value" "0" (id 1) (at 109.22 74.93 90))
    (property "Footprint" "Resistor_SMD:R_1206_3216Metric" (id 2) (at 109.22 77.47 0)
      (effects (font (size 1.524 1.524)) hide)
    )
    (property "Datasheet" "" (id 3) (at 109.22 77.47 0)
      (effects (font (size 1.524 1.524)) hide)
    )
    (property "MFN" "Yageo" (id 4) (at 109.22 77.47 0)
      (effects (font (size 1.27 1.27)) hide)
    )
    (property "MFP" "RC1206JR-0775RL" (id 5) (at 109.22 77.47 0)
      (effects (font (size 1.27 1.27)) hide)
    )
    (property "S1PN" "311-75ERCT-ND" (id 6) (at 109.22 77.47 0)
      (effects (font (size 1.27 1.27)) hide)
    )
    (property "S1PL" "Digi-Key" (id 7) (at 109.22 77.47 0)
      (effects (font (size 1.27 1.27)) hide)
    )
    (property "S2PN" "603-RC1206JR-0775RL" (id 8) (at 109.22 77.47 0)
      (effects (font (size 1.27 1.27)) hide)
    )
    (property "S2PL" "Mouser" (id 9) (at 109.22 77.47 0)
      (effects (font (size 1.27 1.27)) hide)
    )
    (property "Description" "75 Ohms ±5% 0.25W, 1/4W Chip Resistor" (id 10) (at 109.22 77.47 0)
      (effects (font (size 1.27 1.27)) hide)
    )
    (property "Package ID" "1206 (3216 Metric)" (id 11) (at 109.22 77.47 0)
      (effects (font (size 1.27 1.27)) hide)
    )
    (property "variant" "dfn" (id 12) (at 109.22 77.47 90)
      (effects (font (size 1.27 1.27)) hide)
    )
    (pin "1" (uuid 5f5271bc-232b-4fce-a638-dcd23bb5ffd8))
    (pin "2" (uuid 798dc1c7-c480-4e39-9d49-b48217959d95))
  )

  (symbol (lib_id "power:GND") (at 123.19 88.9 0) (unit 1)
    (in_bom yes) (on_board yes)
    (uuid 00000000-0000-0000-0000-00005dc8645d)
    (property "Reference" "#PWR05" (id 0) (at 123.19 88.9 0)
      (effects (font (size 0.762 0.762)) hide)
    )
    (property "Value" "GND" (id 1) (at 123.19 90.678 0)
      (effects (font (size 0.762 0.762)) hide)
    )
    (property "Footprint" "" (id 2) (at 123.19 88.9 0)
      (effects (font (size 1.524 1.524)) hide)
    )
    (property "Datasheet" "" (id 3) (at 123.19 88.9 0)
      (effects (font (size 1.524 1.524)) hide)
    )
    (pin "1" (uuid 2193c68f-ff92-4efa-a7f0-24f1fedd8090))
  )

  (symbol (lib_id "GRF2014-rescue:C-device") (at 197.485 85.09 0) (unit 1)
    (in_bom yes) (on_board yes)
    (uuid 00000000-0000-0000-0000-00005dc86472)
    (property "Reference" "C26" (id 0) (at 198.755 82.55 0)
      (effects (font (size 1.27 1.27)) (justify left))
    )
    (property "Value" "100pF" (id 1) (at 198.755 87.63 0)
      (effects (font (size 1.27 1.27)) (justify left))
    )
    (property "Footprint" "Capacitor_SMD:C_0603_1608Metric" (id 2) (at 197.485 85.09 0)
      (effects (font (size 1.524 1.524)) hide)
    )
    (property "Datasheet" "" (id 3) (at 197.485 85.09 0)
      (effects (font (size 1.524 1.524)) hide)
    )
    (property "MFN" "Yageo" (id 4) (at 196.215 157.48 0)
      (effects (font (size 1.27 1.27)) hide)
    )
    (property "MFP" "CC0603JRNPO9BN101" (id 5) (at 196.215 157.48 0)
      (effects (font (size 1.27 1.27)) hide)
    )
    (property "S1PN" "311-1069-1-ND" (id 6) (at 196.215 157.48 0)
      (effects (font (size 1.27 1.27)) hide)
    )
    (property "S1PL" "Digi-Key" (id 7) (at 196.215 157.48 0)
      (effects (font (size 1.27 1.27)) hide)
    )
    (property "S2PN" "603-CC603JRNPO9BN101" (id 8) (at 196.215 157.48 0)
      (effects (font (size 1.27 1.27)) hide)
    )
    (property "S2PL" "Mouser" (id 9) (at 196.215 157.48 0)
      (effects (font (size 1.27 1.27)) hide)
    )
    (property "Description" "100pF ±5% 50V Ceramic Capacitor C0G, NP0" (id 10) (at 196.215 157.48 0)
      (effects (font (size 1.27 1.27)) hide)
    )
    (property "Package ID" "0603 (1608 Metric)" (id 11) (at 196.215 157.48 0)
      (effects (font (size 1.27 1.27)) hide)
    )
    (property "variant" "dfn" (id 12) (at 197.485 85.09 0)
      (effects (font (size 1.27 1.27)) hide)
    )
    (pin "1" (uuid c64dc9e2-ad6e-49a8-99d4-369f0911674e))
    (pin "2" (uuid ec0a3146-761f-4d08-85b7-8cf76905e618))
  )

  (symbol (lib_id "power:GND") (at 64.135 90.17 0) (unit 1)
    (in_bom yes) (on_board yes)
    (uuid 00000000-0000-0000-0000-00005dc86480)
    (property "Reference" "#PWR010" (id 0) (at 64.135 90.17 0)
      (effects (font (size 0.762 0.762)) hide)
    )
    (property "Value" "GND" (id 1) (at 64.135 91.948 0)
      (effects (font (size 0.762 0.762)) hide)
    )
    (property "Footprint" "" (id 2) (at 64.135 90.17 0)
      (effects (font (size 1.524 1.524)) hide)
    )
    (property "Datasheet" "" (id 3) (at 64.135 90.17 0)
      (effects (font (size 1.524 1.524)) hide)
    )
    (pin "1" (uuid 19f7b09a-13cc-4dd4-a5fc-2802d3fa1452))
  )

  (symbol (lib_id "power:GND") (at 163.83 88.9 0) (unit 1)
    (in_bom yes) (on_board yes)
    (uuid 00000000-0000-0000-0000-00005dc86486)
    (property "Reference" "#PWR06" (id 0) (at 163.83 88.9 0)
      (effects (font (size 0.762 0.762)) hide)
    )
    (property "Value" "GND" (id 1) (at 163.83 90.678 0)
      (effects (font (size 0.762 0.762)) hide)
    )
    (property "Footprint" "" (id 2) (at 163.83 88.9 0)
      (effects (font (size 1.524 1.524)) hide)
    )
    (property "Datasheet" "" (id 3) (at 163.83 88.9 0)
      (effects (font (size 1.524 1.524)) hide)
    )
    (pin "1" (uuid a5218bdb-e5d0-4d01-99f8-5cce66369746))
  )

  (symbol (lib_id "power:GND") (at 184.785 88.9 0) (unit 1)
    (in_bom yes) (on_board yes)
    (uuid 00000000-0000-0000-0000-00005dc8648c)
    (property "Reference" "#PWR07" (id 0) (at 184.785 88.9 0)
      (effects (font (size 0.762 0.762)) hide)
    )
    (property "Value" "GND" (id 1) (at 184.785 90.678 0)
      (effects (font (size 0.762 0.762)) hide)
    )
    (property "Footprint" "" (id 2) (at 184.785 88.9 0)
      (effects (font (size 1.524 1.524)) hide)
    )
    (property "Datasheet" "" (id 3) (at 184.785 88.9 0)
      (effects (font (size 1.524 1.524)) hide)
    )
    (pin "1" (uuid c9e947fd-07ed-4557-97f3-c0c5a984e2f0))
  )

  (symbol (lib_id "power:GND") (at 197.485 88.9 0) (unit 1)
    (in_bom yes) (on_board yes)
    (uuid 00000000-0000-0000-0000-00005dc86492)
    (property "Reference" "#PWR08" (id 0) (at 197.485 88.9 0)
      (effects (font (size 0.762 0.762)) hide)
    )
    (property "Value" "GND" (id 1) (at 197.485 90.678 0)
      (effects (font (size 0.762 0.762)) hide)
    )
    (property "Footprint" "" (id 2) (at 197.485 88.9 0)
      (effects (font (size 1.524 1.524)) hide)
    )
    (property "Datasheet" "" (id 3) (at 197.485 88.9 0)
      (effects (font (size 1.524 1.524)) hide)
    )
    (pin "1" (uuid 11aa3b2e-a516-46b0-83a4-c75d3493f30d))
  )

  (symbol (lib_id "power:GND") (at 207.645 88.9 0) (unit 1)
    (in_bom yes) (on_board yes)
    (uuid 00000000-0000-0000-0000-00005dc86498)
    (property "Reference" "#PWR09" (id 0) (at 207.645 88.9 0)
      (effects (font (size 0.762 0.762)) hide)
    )
    (property "Value" "GND" (id 1) (at 207.645 90.678 0)
      (effects (font (size 0.762 0.762)) hide)
    )
    (property "Footprint" "" (id 2) (at 207.645 88.9 0)
      (effects (font (size 1.524 1.524)) hide)
    )
    (property "Datasheet" "" (id 3) (at 207.645 88.9 0)
      (effects (font (size 1.524 1.524)) hide)
    )
    (pin "1" (uuid b8bcd867-f5e6-4e98-9882-614d01d32b6a))
  )

  (symbol (lib_id "GRF2014-rescue:R-device") (at 104.14 118.11 180) (unit 1)
    (in_bom yes) (on_board yes)
    (uuid 00000000-0000-0000-0000-00005dc8649e)
    (property "Reference" "X25" (id 0) (at 107.95 116.84 0))
    (property "Value" "DNF" (id 1) (at 107.95 119.38 0))
    (property "Footprint" "Capacitor_SMD:C_0402_1005Metric" (id 2) (at 104.14 118.11 0)
      (effects (font (size 1.524 1.524)) hide)
    )
    (property "Datasheet" "" (id 3) (at 104.14 118.11 0)
      (effects (font (size 1.524 1.524)) hide)
    )
    (property "variant" "dfn" (id 4) (at 104.14 118.11 0)
      (effects (font (size 1.27 1.27)) hide)
    )
    (property "DNP" "1" (id 5) (at 104.14 118.11 0)
      (effects (font (size 1.27 1.27)) hide)
    )
    (pin "1" (uuid 03ebd40e-e2ea-458d-a285-49aa5051e17e))
    (pin "2" (uuid 33fb8913-128e-4411-a08f-ba7e5ba26a3b))
  )

  (symbol (lib_id "GRF2014-rescue:C-device") (at 111.76 109.22 90) (unit 1)
    (in_bom yes) (on_board yes)
    (uuid 00000000-0000-0000-0000-00005dc864b6)
    (property "Reference" "C28" (id 0) (at 110.49 106.68 90)
      (effects (font (size 1.27 1.27)) (justify left))
    )
    (property "Value" "1000p" (id 1) (at 119.38 106.68 90)
      (effects (font (size 1.27 1.27)) (justify left))
    )
    (property "Footprint" "Capacitor_SMD:C_0402_1005Metric" (id 2) (at 111.76 109.22 0)
      (effects (font (size 1.524 1.524)) hide)
    )
    (property "Datasheet" "" (id 3) (at 111.76 109.22 0)
      (effects (font (size 1.524 1.524)) hide)
    )
    (property "MFN" "Kemet" (id 4) (at 208.28 213.995 0)
      (effects (font (size 1.27 1.27)) hide)
    )
    (property "MFP" "CBR04C101J3GAC" (id 5) (at 208.28 213.995 0)
      (effects (font (size 1.27 1.27)) hide)
    )
    (property "S1PN" "80-CBR04C101J3GAC" (id 6) (at 208.28 213.995 0)
      (effects (font (size 1.27 1.27)) hide)
    )
    (property "S1PL" "Mouser" (id 7) (at 208.28 213.995 0)
      (effects (font (size 1.27 1.27)) hide)
    )
    (property "S2PN" "399-17684-1-ND" (id 8) (at 208.28 213.995 0)
      (effects (font (size 1.27 1.27)) hide)
    )
    (property "S2PL" "Digi-Key" (id 9) (at 208.28 213.995 0)
      (effects (font (size 1.27 1.27)) hide)
    )
    (property "Description" "HiQ-CBR Series, C0G Dielectric, Low ESR, High SRF" (id 10) (at 208.28 213.995 0)
      (effects (font (size 1.27 1.27)) hide)
    )
    (property "Package ID" "0402 (1005 metric)" (id 11) (at 208.28 213.995 0)
      (effects (font (size 1.27 1.27)) hide)
    )
    (property "variant" "dfn" (id 12) (at 111.76 33.655 90)
      (effects (font (size 1.27 1.27)) hide)
    )
    (pin "1" (uuid 2f9da833-bd5a-40dd-998e-e39058927cb7))
    (pin "2" (uuid d759feb4-5ed3-477a-965d-d152ef36decb))
  )

  (symbol (lib_id "GRF2014-rescue:R-device") (at 119.38 118.11 180) (unit 1)
    (in_bom yes) (on_board yes)
    (uuid 00000000-0000-0000-0000-00005dc8651e)
    (property "Reference" "X27" (id 0) (at 115.57 118.11 0))
    (property "Value" "DNF" (id 1) (at 123.19 118.11 0))
    (property "Footprint" "Capacitor_SMD:C_0402_1005Metric" (id 2) (at 119.38 118.11 0)
      (effects (font (size 1.524 1.524)) hide)
    )
    (property "Datasheet" "" (id 3) (at 119.38 118.11 0)
      (effects (font (size 1.524 1.524)) hide)
    )
    (property "variant" "dfn" (id 4) (at 119.38 118.11 0)
      (effects (font (size 1.27 1.27)) hide)
    )
    (property "DNP" "1" (id 5) (at 119.38 118.11 0)
      (effects (font (size 1.27 1.27)) hide)
    )
    (pin "1" (uuid 55ab2681-8fbd-49ef-8a64-9e1648b60935))
    (pin "2" (uuid dee8b43e-4c2c-4c61-a681-a9b3c99c7bd0))
  )

  (symbol (lib_id "power:GND") (at 119.38 121.92 0) (unit 1)
    (in_bom yes) (on_board yes)
    (uuid 00000000-0000-0000-0000-00005dc86524)
    (property "Reference" "#PWR019" (id 0) (at 119.38 121.92 0)
      (effects (font (size 0.762 0.762)) hide)
    )
    (property "Value" "GND" (id 1) (at 119.38 123.698 0)
      (effects (font (size 0.762 0.762)) hide)
    )
    (property "Footprint" "" (id 2) (at 119.38 121.92 0)
      (effects (font (size 1.524 1.524)) hide)
    )
    (property "Datasheet" "" (id 3) (at 119.38 121.92 0)
      (effects (font (size 1.524 1.524)) hide)
    )
    (pin "1" (uuid c7b94d04-7618-4fc3-b890-0a4aee2bd053))
  )

  (symbol (lib_id "GRF2014-rescue:C-device") (at 172.72 118.11 0) (unit 1)
    (in_bom yes) (on_board yes)
    (uuid 00000000-0000-0000-0000-00005dc8652c)
    (property "Reference" "C30" (id 0) (at 173.99 115.57 0)
      (effects (font (size 1.27 1.27)) (justify left))
    )
    (property "Value" "DNF" (id 1) (at 173.99 120.65 0)
      (effects (font (size 1.27 1.27)) (justify left))
    )
    (property "Footprint" "Capacitor_SMD:C_0402_1005Metric" (id 2) (at 172.72 118.11 0)
      (effects (font (size 1.524 1.524)) hide)
    )
    (property "Datasheet" "" (id 3) (at 172.72 118.11 0)
      (effects (font (size 1.524 1.524)) hide)
    )
    (property "variant" "dfn" (id 4) (at 172.72 118.11 0)
      (effects (font (size 1.27 1.27)) hide)
    )
    (property "DNP" "1" (id 5) (at 172.72 118.11 0)
      (effects (font (size 1.27 1.27)) hide)
    )
    (pin "1" (uuid 0798be36-b57b-4e14-8e9b-b518eb348b57))
    (pin "2" (uuid 33079d69-6280-4636-89d6-c90e0e1a9a6d))
  )

  (symbol (lib_id "power:GND") (at 172.72 121.92 0) (unit 1)
    (in_bom yes) (on_board yes)
    (uuid 00000000-0000-0000-0000-00005dc86532)
    (property "Reference" "#PWR020" (id 0) (at 172.72 121.92 0)
      (effects (font (size 0.762 0.762)) hide)
    )
    (property "Value" "GND" (id 1) (at 172.72 123.698 0)
      (effects (font (size 0.762 0.762)) hide)
    )
    (property "Footprint" "" (id 2) (at 172.72 121.92 0)
      (effects (font (size 1.524 1.524)) hide)
    )
    (property "Datasheet" "" (id 3) (at 172.72 121.92 0)
      (effects (font (size 1.524 1.524)) hide)
    )
    (pin "1" (uuid 9c15712a-d36c-400a-b674-c6ec08dc94a4))
  )

  (symbol (lib_id "GRF2014-rescue:Ferrite_Bead_Small-device") (at 85.09 77.47 270) (unit 1)
    (in_bom yes) (on_board yes)
    (uuid 00000000-0000-0000-0000-00005dc8655e)
    (property "Reference" "FB3" (id 0) (at 85.09 73.787 90))
    (property "Value" "~" (id 1) (at 85.09 73.7616 90))
    (property "Footprint" "Inductor_SMD:L_0805_2012Metric" (id 2) (at 85.09 75.692 90)
      (effects (font (size 1.27 1.27)) hide)
    )
    (property "Datasheet" "~" (id 3) (at 85.09 77.47 0)
      (effects (font (size 1.27 1.27)) hide)
    )
    (property "MFN" "Murata Electronics" (id 4) (at 56.515 110.49 0)
      (effects (font (size 1.27 1.27)) hide)
    )
    (property "MFP" "BLM21PG221SN1D" (id 5) (at 56.515 110.49 0)
      (effects (font (size 1.27 1.27)) hide)
    )
    (property "S1PN" "81-BLM21P221SG" (id 6) (at 56.515 110.49 0)
      (effects (font (size 1.27 1.27)) hide)
    )
    (property "S1PL" "Mouser" (id 7) (at 56.515 110.49 0)
      (effects (font (size 1.27 1.27)) hide)
    )
    (property "S2PN" "490-1054-1-ND" (id 8) (at 56.515 110.49 0)
      (effects (font (size 1.27 1.27)) hide)
    )
    (property "S2PL" "Digi-Key" (id 9) (at 56.515 110.49 0)
      (effects (font (size 1.27 1.27)) hide)
    )
    (property "Description" "FERRITE BEAD 220 OHM 0805 1LN" (id 10) (at 56.515 110.49 0)
      (effects (font (size 1.27 1.27)) hide)
    )
    (property "Package ID" "0805 (2012 Metric)" (id 11) (at 56.515 110.49 0)
      (effects (font (size 1.27 1.27)) hide)
    )
    (property "variant" "dfn" (id 12) (at 85.09 77.47 90)
      (effects (font (size 1.27 1.27)) hide)
    )
    (pin "1" (uuid 0a9b0e53-e1e6-4eab-b3a9-1556ec515a58))
    (pin "2" (uuid ba56f246-2b01-445c-8188-38699efb6abc))
  )

  (symbol (lib_id "GRF2014-rescue:CP-device") (at 184.785 85.09 0) (unit 1)
    (in_bom yes) (on_board yes)
    (uuid 00000000-0000-0000-0000-00005dc8656c)
    (property "Reference" "C25" (id 0) (at 186.69 82.55 0)
      (effects (font (size 1.27 1.27)) (justify left))
    )
    (property "Value" "10u/16V" (id 1) (at 186.055 87.63 0)
      (effects (font (size 1.27 1.27)) (justify left))
    )
    (property "Footprint" "Capacitor_Tantalum_SMD:CP_EIA-3216-12_Kemet-S" (id 2) (at 185.7502 88.9 0)
      (effects (font (size 1.27 1.27)) hide)
    )
    (property "Datasheet" "~" (id 3) (at 184.785 85.09 0)
      (effects (font (size 1.27 1.27)) hide)
    )
    (property "MFN" "Kemet" (id 4) (at 183.515 157.48 0)
      (effects (font (size 1.27 1.27)) hide)
    )
    (property "MFP" "T491A106K016AT" (id 5) (at 183.515 157.48 0)
      (effects (font (size 1.27 1.27)) hide)
    )
    (property "S1PN" "80-T491A106K016" (id 6) (at 183.515 157.48 0)
      (effects (font (size 1.27 1.27)) hide)
    )
    (property "S1PL" "Mouser" (id 7) (at 183.515 157.48 0)
      (effects (font (size 1.27 1.27)) hide)
    )
    (property "S2PN" "399-8269-1-ND" (id 8) (at 183.515 157.48 0)
      (effects (font (size 1.27 1.27)) hide)
    )
    (property "S2PL" "Digi-Key" (id 9) (at 183.515 157.48 0)
      (effects (font (size 1.27 1.27)) hide)
    )
    (property "Description" "10µF Molded Tantalum Capacitors 16V 3 Ohm ESR" (id 10) (at 183.515 157.48 0)
      (effects (font (size 1.27 1.27)) hide)
    )
    (property "Package ID" "1206 (3216 Metric) " (id 11) (at 183.515 157.48 0)
      (effects (font (size 1.27 1.27)) hide)
    )
    (property "variant" "dfn" (id 12) (at 184.785 85.09 0)
      (effects (font (size 1.27 1.27)) hide)
    )
    (pin "1" (uuid 38f2c834-2a53-4262-894a-1512293eb332))
    (pin "2" (uuid 010e4359-ccb9-4f83-877c-be3dbe463c55))
  )

  (symbol (lib_id "power:GND") (at 67.31 113.665 0) (unit 1)
    (in_bom yes) (on_board yes)
    (uuid 00000000-0000-0000-0000-00005dc86591)
    (property "Reference" "#PWR013" (id 0) (at 67.31 113.665 0)
      (effects (font (size 0.762 0.762)) hide)
    )
    (property "Value" "GND" (id 1) (at 67.31 115.443 0)
      (effects (font (size 0.762 0.762)) hide)
    )
    (property "Footprint" "" (id 2) (at 67.31 113.665 0)
      (effects (font (size 1.524 1.524)) hide)
    )
    (property "Datasheet" "" (id 3) (at 67.31 113.665 0)
      (effects (font (size 1.524 1.524)) hide)
    )
    (pin "1" (uuid c7d09788-3aef-4388-a2b0-6ed9e0b5ef37))
  )

  (symbol (lib_id "power:GND") (at 218.44 113.665 0) (unit 1)
    (in_bom yes) (on_board yes)
    (uuid 00000000-0000-0000-0000-00005dc86597)
    (property "Reference" "#PWR014" (id 0) (at 218.44 113.665 0)
      (effects (font (size 0.762 0.762)) hide)
    )
    (property "Value" "GND" (id 1) (at 218.44 115.443 0)
      (effects (font (size 0.762 0.762)) hide)
    )
    (property "Footprint" "" (id 2) (at 218.44 113.665 0)
      (effects (font (size 1.524 1.524)) hide)
    )
    (property "Datasheet" "" (id 3) (at 218.44 113.665 0)
      (effects (font (size 1.524 1.524)) hide)
    )
    (pin "1" (uuid 0b8fd480-e24d-4909-82d9-5ca41032d8b3))
  )

  (symbol (lib_id "GRF2014-rescue:C-device") (at 74.93 85.09 0) (unit 1)
    (in_bom yes) (on_board yes)
    (uuid 00000000-0000-0000-0000-00005dc865d7)
    (property "Reference" "C21" (id 0) (at 76.2 82.55 0)
      (effects (font (size 1.27 1.27)) (justify left))
    )
    (property "Value" "0.01uF" (id 1) (at 76.2 87.63 0)
      (effects (font (size 1.27 1.27)) (justify left))
    )
    (property "Footprint" "Capacitor_SMD:C_0603_1608Metric" (id 2) (at 74.93 85.09 0)
      (effects (font (size 1.524 1.524)) hide)
    )
    (property "Datasheet" "" (id 3) (at 74.93 85.09 0)
      (effects (font (size 1.524 1.524)) hide)
    )
    (property "MFN" "Kemet" (id 4) (at 74.93 85.09 0)
      (effects (font (size 1.27 1.27)) hide)
    )
    (property "MFP" "C0603C103K5RACTU" (id 5) (at 74.93 85.09 0)
      (effects (font (size 1.27 1.27)) hide)
    )
    (property "S1PN" "399-1091-1-ND" (id 6) (at 74.93 85.09 0)
      (effects (font (size 1.27 1.27)) hide)
    )
    (property "S1PL" "Digi-Key" (id 7) (at 74.93 85.09 0)
      (effects (font (size 1.27 1.27)) hide)
    )
    (property "S2PN" "80-C0603C103K5R" (id 8) (at 74.93 85.09 0)
      (effects (font (size 1.27 1.27)) hide)
    )
    (property "S2PL" "Mouser" (id 9) (at 74.93 85.09 0)
      (effects (font (size 1.27 1.27)) hide)
    )
    (property "Description" "Multilayer Ceramic Capacitors MLCC - SMD/SMT 50V 0.01uF 0603 X7R 10%" (id 10) (at 74.93 85.09 0)
      (effects (font (size 1.27 1.27)) hide)
    )
    (property "Package ID" "0603 (1608 metric)" (id 11) (at 74.93 85.09 0)
      (effects (font (size 1.27 1.27)) hide)
    )
    (property "variant" "dfn" (id 12) (at 74.93 85.09 0)
      (effects (font (size 1.27 1.27)) hide)
    )
    (pin "1" (uuid ada68415-6303-439d-8b79-cb3e4c9f5218))
    (pin "2" (uuid 3d738318-011f-4318-a3ea-406281049ddf))
  )

  (symbol (lib_id "GRF2014-rescue:C-device") (at 207.645 85.09 0) (unit 1)
    (in_bom yes) (on_board yes)
    (uuid 00000000-0000-0000-0000-00005dc865e5)
    (property "Reference" "C27" (id 0) (at 208.915 82.55 0)
      (effects (font (size 1.27 1.27)) (justify left))
    )
    (property "Value" "0.01uF" (id 1) (at 208.915 87.63 0)
      (effects (font (size 1.27 1.27)) (justify left))
    )
    (property "Footprint" "Capacitor_SMD:C_0603_1608Metric" (id 2) (at 207.645 85.09 0)
      (effects (font (size 1.524 1.524)) hide)
    )
    (property "Datasheet" "" (id 3) (at 207.645 85.09 0)
      (effects (font (size 1.524 1.524)) hide)
    )
    (property "MFN" "Kemet" (id 4) (at 207.645 85.09 0)
      (effects (font (size 1.27 1.27)) hide)
    )
    (property "MFP" "C0603C103K5RACTU" (id 5) (at 207.645 85.09 0)
      (effects (font (size 1.27 1.27)) hide)
    )
    (property "S1PN" "399-1091-1-ND" (id 6) (at 207.645 85.09 0)
      (effects (font (size 1.27 1.27)) hide)
    )
    (property "S1PL" "Digi-Key" (id 7) (at 207.645 85.09 0)
      (effects (font (size 1.27 1.27)) hide)
    )
    (property "S2PN" "80-C0603C103K5R" (id 8) (at 207.645 85.09 0)
      (effects (font (size 1.27 1.27)) hide)
    )
    (property "S2PL" "Mouser" (id 9) (at 207.645 85.09 0)
      (effects (font (size 1.27 1.27)) hide)
    )
    (property "Description" "Multilayer Ceramic Capacitors MLCC - SMD/SMT 50V 0.01uF 0603 X7R 10%" (id 10) (at 207.645 85.09 0)
      (effects (font (size 1.27 1.27)) hide)
    )
    (property "Package ID" "0603 (1608 metric)" (id 11) (at 207.645 85.09 0)
      (effects (font (size 1.27 1.27)) hide)
    )
    (property "variant" "dfn" (id 12) (at 207.645 85.09 0)
      (effects (font (size 1.27 1.27)) hide)
    )
    (pin "1" (uuid 07184819-4893-4aea-8169-ce40efe8dc47))
    (pin "2" (uuid 350d17b7-4687-4843-8298-5271b70a77a5))
  )

  (symbol (lib_id "GRF2014-rescue:C-device") (at 95.25 85.09 0) (unit 1)
    (in_bom yes) (on_board yes)
    (uuid 00000000-0000-0000-0000-00005dc865f3)
    (property "Reference" "C22" (id 0) (at 96.52 82.55 0)
      (effects (font (size 1.27 1.27)) (justify left))
    )
    (property "Value" "0.1uF" (id 1) (at 96.52 87.63 0)
      (effects (font (size 1.27 1.27)) (justify left))
    )
    (property "Footprint" "Capacitor_SMD:C_0603_1608Metric" (id 2) (at 95.25 85.09 0)
      (effects (font (size 1.524 1.524)) hide)
    )
    (property "Datasheet" "" (id 3) (at 95.25 85.09 0)
      (effects (font (size 1.524 1.524)) hide)
    )
    (property "MFN" "Kemet" (id 4) (at 95.25 85.09 0)
      (effects (font (size 1.27 1.27)) hide)
    )
    (property "MFP" "C0603C104J4RACTU" (id 5) (at 95.25 85.09 0)
      (effects (font (size 1.27 1.27)) hide)
    )
    (property "S1PN" "399-1097-1-ND" (id 6) (at 95.25 85.09 0)
      (effects (font (size 1.27 1.27)) hide)
    )
    (property "S1PL" "Digi-Key" (id 7) (at 95.25 85.09 0)
      (effects (font (size 1.27 1.27)) hide)
    )
    (property "S2PN" "80-C0603C104J4R" (id 8) (at 95.25 85.09 0)
      (effects (font (size 1.27 1.27)) hide)
    )
    (property "S2PL" "Mouser" (id 9) (at 95.25 85.09 0)
      (effects (font (size 1.27 1.27)) hide)
    )
    (property "Description" "CAP CER 0.1UF 16V X7R 0603" (id 10) (at 95.25 85.09 0)
      (effects (font (size 1.27 1.27)) hide)
    )
    (property "Package ID" "0603 (1608 Metric)" (id 11) (at 95.25 85.09 0)
      (effects (font (size 1.27 1.27)) hide)
    )
    (property "variant" "dfn" (id 12) (at 95.25 85.09 0)
      (effects (font (size 1.27 1.27)) hide)
    )
    (pin "1" (uuid 7f59db2f-b342-4337-a896-856d173efb08))
    (pin "2" (uuid 5e8eba82-ab82-4e23-8588-f9e3c7625ca1))
  )

  (symbol (lib_id "GRF2014-rescue:C-device") (at 123.19 85.09 0) (unit 1)
    (in_bom yes) (on_board yes)
    (uuid 00000000-0000-0000-0000-00005dc86601)
    (property "Reference" "C23" (id 0) (at 124.46 82.55 0)
      (effects (font (size 1.27 1.27)) (justify left))
    )
    (property "Value" "DNF" (id 1) (at 124.46 87.63 0)
      (effects (font (size 1.27 1.27)) (justify left))
    )
    (property "Footprint" "Capacitor_SMD:C_0603_1608Metric" (id 2) (at 123.19 85.09 0)
      (effects (font (size 1.524 1.524)) hide)
    )
    (property "Datasheet" "" (id 3) (at 123.19 85.09 0)
      (effects (font (size 1.524 1.524)) hide)
    )
    (property "MFN" "Kemet" (id 4) (at 123.19 85.09 0)
      (effects (font (size 1.27 1.27)) hide)
    )
    (property "MFP" "C0603C104J4RACTU" (id 5) (at 123.19 85.09 0)
      (effects (font (size 1.27 1.27)) hide)
    )
    (property "S1PN" "399-1097-1-ND" (id 6) (at 123.19 85.09 0)
      (effects (font (size 1.27 1.27)) hide)
    )
    (property "S1PL" "Digi-Key" (id 7) (at 123.19 85.09 0)
      (effects (font (size 1.27 1.27)) hide)
    )
    (property "S2PN" "80-C0603C104J4R" (id 8) (at 123.19 85.09 0)
      (effects (font (size 1.27 1.27)) hide)
    )
    (property "S2PL" "Mouser" (id 9) (at 123.19 85.09 0)
      (effects (font (size 1.27 1.27)) hide)
    )
    (property "Description" "CAP CER 0.1UF 16V X7R 0603" (id 10) (at 123.19 85.09 0)
      (effects (font (size 1.27 1.27)) hide)
    )
    (property "Package ID" "0603 (1608 Metric)" (id 11) (at 123.19 85.09 0)
      (effects (font (size 1.27 1.27)) hide)
    )
    (property "variant" "dfn" (id 12) (at 123.19 85.09 0)
      (effects (font (size 1.27 1.27)) hide)
    )
    (pin "1" (uuid 827fea33-7c40-47da-ac95-408aa559aa86))
    (pin "2" (uuid 4f77b9ae-134a-4c99-89c8-d274a181750e))
  )

  (symbol (lib_id "GRF2014-rescue:C-device") (at 163.83 85.09 0) (unit 1)
    (in_bom yes) (on_board yes)
    (uuid 00000000-0000-0000-0000-00005dc8660f)
    (property "Reference" "C24" (id 0) (at 158.75 82.55 0)
      (effects (font (size 1.27 1.27)) (justify left))
    )
    (property "Value" "0.1uF" (id 1) (at 157.48 88.265 0)
      (effects (font (size 1.27 1.27)) (justify left))
    )
    (property "Footprint" "Capacitor_SMD:C_0603_1608Metric" (id 2) (at 163.83 85.09 0)
      (effects (font (size 1.524 1.524)) hide)
    )
    (property "Datasheet" "" (id 3) (at 163.83 85.09 0)
      (effects (font (size 1.524 1.524)) hide)
    )
    (property "MFN" "Kemet" (id 4) (at 163.83 85.09 0)
      (effects (font (size 1.27 1.27)) hide)
    )
    (property "MFP" "C0603C104J4RACTU" (id 5) (at 163.83 85.09 0)
      (effects (font (size 1.27 1.27)) hide)
    )
    (property "S1PN" "399-1097-1-ND" (id 6) (at 163.83 85.09 0)
      (effects (font (size 1.27 1.27)) hide)
    )
    (property "S1PL" "Digi-Key" (id 7) (at 163.83 85.09 0)
      (effects (font (size 1.27 1.27)) hide)
    )
    (property "S2PN" "80-C0603C104J4R" (id 8) (at 163.83 85.09 0)
      (effects (font (size 1.27 1.27)) hide)
    )
    (property "S2PL" "Mouser" (id 9) (at 163.83 85.09 0)
      (effects (font (size 1.27 1.27)) hide)
    )
    (property "Description" "CAP CER 0.1UF 16V X7R 0603" (id 10) (at 163.83 85.09 0)
      (effects (font (size 1.27 1.27)) hide)
    )
    (property "Package ID" "0603 (1608 Metric)" (id 11) (at 163.83 85.09 0)
      (effects (font (size 1.27 1.27)) hide)
    )
    (property "variant" "dfn" (id 12) (at 163.83 85.09 0)
      (effects (font (size 1.27 1.27)) hide)
    )
    (pin "1" (uuid ed78fea1-d9ec-4223-81b9-cda069c3900d))
    (pin "2" (uuid 6dd2c912-8202-4625-a36b-7665b1444285))
  )

  (symbol (lib_id "project:GRF2003DS") (at 151.765 109.22 0) (unit 1)
    (in_bom yes) (on_board yes)
    (uuid 00000000-0000-0000-0000-00005dc8664d)
    (property "Reference" "U3" (id 0) (at 157.48 104.775 0)
      (effects (font (size 1.27 1.27)) (justify left))
    )
    (property "Value" "GRF2014" (id 1) (at 157.48 112.395 0)
      (effects (font (size 1.27 1.27)) (justify left))
    )
    (property "Footprint" "GRF_DFN:DFN-6-1EP_1.5x1.5mm_P0.5mm_EP0.6x1.1mm" (id 2) (at 151.765 109.22 0)
      (effects (font (size 1.524 1.524)) hide)
    )
    (property "Datasheet" "" (id 3) (at 151.765 109.22 0)
      (effects (font (size 1.524 1.524)))
    )
    (property "MFN" "Guerrilla RF" (id 4) (at 151.765 109.22 0)
      (effects (font (size 1.27 1.27)) hide)
    )
    (property "MFP" "GRF2014" (id 5) (at 151.765 109.22 0)
      (effects (font (size 1.27 1.27)) hide)
    )
    (property "S1PN" "GRF2014" (id 6) (at 151.765 109.22 0)
      (effects (font (size 1.27 1.27)) hide)
    )
    (property "S1PL" "RichardsonRFPD" (id 7) (at 151.765 109.22 0)
      (effects (font (size 1.27 1.27)) hide)
    )
    (property "Description" "RF Amplifier .05-10GHz NF 3.8dB Gain 12dB" (id 8) (at 151.765 109.22 0)
      (effects (font (size 1.27 1.27)) hide)
    )
    (property "Package ID" "DFN-6" (id 9) (at 151.765 109.22 0)
      (effects (font (size 1.27 1.27)) hide)
    )
    (property "variant" "dfn" (id 10) (at 151.765 109.22 0)
      (effects (font (size 1.27 1.27)) hide)
    )
    (property "kicost:RichardsonRFPD:pricing" "1:$2.05; 10:$2.05; 100:$1.94" (id 11) (at 151.765 109.22 0)
      (effects (font (size 1.27 1.27)) hide)
    )
    (pin "1" (uuid 1782abbe-b76e-4735-bb31-d6f74f34c262))
    (pin "2" (uuid 4f80ef83-3d6f-4357-9a50-f395946aea3a))
    (pin "3" (uuid e745b2e4-0131-4a7e-8b04-d4d4462b9d0e))
    (pin "4" (uuid f3ba1014-884d-4405-85f0-83150777507d))
    (pin "5" (uuid 598bce6e-b3d9-4d64-acf5-733a588ee68f))
    (pin "6" (uuid 6b7c51f1-0c13-4f44-b1da-f53774cee0ae))
    (pin "7" (uuid b81d78de-bc07-4795-ac3c-1a6f6b602ac9))
  )

  (symbol (lib_id "GRF2014-rescue:R-device") (at 151.765 85.09 0) (unit 1)
    (in_bom yes) (on_board yes)
    (uuid 00000000-0000-0000-0000-00005dc86653)
    (property "Reference" "R17" (id 0) (at 147.955 83.82 0))
    (property "Value" "330" (id 1) (at 147.955 86.36 0))
    (property "Footprint" "Resistor_SMD:R_0402_1005Metric" (id 2) (at 151.765 85.09 0)
      (effects (font (size 1.524 1.524)) hide)
    )
    (property "Datasheet" "" (id 3) (at 151.765 85.09 0)
      (effects (font (size 1.524 1.524)) hide)
    )
    (property "variant" "dfn" (id 4) (at 151.765 85.09 0)
      (effects (font (size 1.27 1.27)) hide)
    )
    (pin "1" (uuid a59a2d0c-b7c0-488c-8122-e37562a0072b))
    (pin "2" (uuid b4ab7a36-0e94-4455-9efc-eb6721976b1e))
  )

  (symbol (lib_id "power:GND") (at 154.305 118.11 0) (unit 1)
    (in_bom yes) (on_board yes)
    (uuid 00000000-0000-0000-0000-00005dc8666b)
    (property "Reference" "#PWR015" (id 0) (at 154.305 118.11 0)
      (effects (font (size 0.762 0.762)) hide)
    )
    (property "Value" "GND" (id 1) (at 154.305 119.888 0)
      (effects (font (size 0.762 0.762)) hide)
    )
    (property "Footprint" "" (id 2) (at 154.305 118.11 0)
      (effects (font (size 1.524 1.524)) hide)
    )
    (property "Datasheet" "" (id 3) (at 154.305 118.11 0)
      (effects (font (size 1.524 1.524)) hide)
    )
    (pin "1" (uuid 70c29980-0f89-4b29-bcd0-7232cfd572cd))
  )

  (symbol (lib_id "GRF2014-rescue:Conn_01x02_Female-connector") (at 56.515 80.01 180) (unit 1)
    (in_bom yes) (on_board yes)
    (uuid 00000000-0000-0000-0000-00005dc86693)
    (property "Reference" "P3" (id 0) (at 59.2074 71.755 0))
    (property "Value" "+5V" (id 1) (at 59.2074 74.0664 0))
    (property "Footprint" "Connector_PinHeader_2.54mm:PinHeader_1x02_P2.54mm_Vertical" (id 2) (at 56.515 80.01 0)
      (effects (font (size 1.27 1.27)) hide)
    )
    (property "Datasheet" "~" (id 3) (at 56.515 80.01 0)
      (effects (font (size 1.27 1.27)) hide)
    )
    (property "MFN" "Mintron" (id 4) (at 56.515 80.01 0)
      (effects (font (size 1.27 1.27)) hide)
    )
    (property "MFP" "MTP125-1102S1" (id 5) (at 56.515 80.01 0)
      (effects (font (size 1.27 1.27)) hide)
    )
    (property "S1PN" "C358684" (id 6) (at 56.515 80.01 0)
      (effects (font (size 1.27 1.27)) hide)
    )
    (property "S1PL" "LCSC" (id 7) (at 56.515 80.01 0)
      (effects (font (size 1.27 1.27)) hide)
    )
    (property "Description" "Pin Header Male Pin 0.100\\\"(2.54mm) 2 pin" (id 8) (at 56.515 80.01 0)
      (effects (font (size 1.27 1.27)) hide)
    )
    (property "Package ID" "Through Hole,P=2.54mm" (id 9) (at 56.515 80.01 0)
      (effects (font (size 1.27 1.27)) hide)
    )
    (property "variant" "dfn" (id 10) (at 56.515 80.01 0)
      (effects (font (size 1.27 1.27)) hide)
    )
    (property "kicost:LCSC:pricing" "1:$0.01; 10:$0.01; 100:$0.01; 500:$0.008" (id 11) (at 56.515 80.01 0)
      (effects (font (size 1.27 1.27)) hide)
    )
    (property "kicost:LCSC:link" "https://lcsc.com/product-detail/Pin-Header-Female-Header_MINTRON-MTP125-1102S1_C358684.html" (id 12) (at 56.515 80.01 0)
      (effects (font (size 1.27 1.27)) hide)
    )
    (pin "1" (uuid a1f49deb-f4dd-4c6c-9fe3-2665b60b393d))
    (pin "2" (uuid 117b04ab-e7be-46fc-be52-5c2a0bb8de02))
  )

  (symbol (lib_id "GRF2014-rescue:L-device") (at 172.72 86.36 0) (unit 1)
    (in_bom yes) (on_board yes)
    (uuid 00000000-0000-0000-0000-00005e5ab130)
    (property "Reference" "L3" (id 0) (at 174.0662 85.1916 0)
      (effects (font (size 1.27 1.27)) (justify left))
    )
    (property "Value" "33nH" (id 1) (at 174.0662 87.503 0)
      (effects (font (size 1.27 1.27)) (justify left))
    )
    (property "Footprint" "Inductor_SMD:L_0603_1608Metric" (id 2) (at 172.72 86.36 0)
      (effects (font (size 1.27 1.27)) hide)
    )
    (property "Datasheet" "~" (id 3) (at 172.72 86.36 0)
      (effects (font (size 1.27 1.27)) hide)
    )
    (property "MFN" "Coilcraft" (id 4) (at 172.72 86.36 0)
      (effects (font (size 1.27 1.27)) hide)
    )
    (property "MFP" "0603HP-12NXJLU" (id 5) (at 172.72 86.36 0)
      (effects (font (size 1.27 1.27)) hide)
    )
    (property "S1PN" "994-0603HP-12NXJLU" (id 6) (at 172.72 86.36 0)
      (effects (font (size 1.27 1.27)) hide)
    )
    (property "S1PL" "Mouser" (id 7) (at 172.72 86.36 0)
      (effects (font (size 1.27 1.27)) hide)
    )
    (property "Description" "Fixed Inductors 0603HP Hi Perfrmnce 12 nH 5 %" (id 8) (at 172.72 86.36 0)
      (effects (font (size 1.27 1.27)) hide)
    )
    (property "Package ID" "0603 (1608 metric)" (id 9) (at 172.72 86.36 0)
      (effects (font (size 1.27 1.27)) hide)
    )
    (property "variant" "dfn" (id 10) (at 172.72 86.36 0)
      (effects (font (size 1.27 1.27)) hide)
    )
    (pin "1" (uuid fb5712f9-3e6b-4b24-8455-5874aea7db7a))
    (pin "2" (uuid 61096fdf-a796-4dfb-993d-c4e257b60649))
  )

  (symbol (lib_id "GRF2014-rescue:R-device") (at 137.16 77.47 90) (unit 1)
    (in_bom yes) (on_board yes)
    (uuid 00000000-0000-0000-0000-00005e67466e)
    (property "Reference" "R16" (id 0) (at 137.16 80.01 90))
    (property "Value" "0" (id 1) (at 137.16 74.93 90))
    (property "Footprint" "Resistor_SMD:R_1206_3216Metric" (id 2) (at 137.16 77.47 0)
      (effects (font (size 1.524 1.524)) hide)
    )
    (property "Datasheet" "" (id 3) (at 137.16 77.47 0)
      (effects (font (size 1.524 1.524)) hide)
    )
    (property "MFN" "Yageo" (id 4) (at 137.16 77.47 0)
      (effects (font (size 1.27 1.27)) hide)
    )
    (property "MFP" "RC1206JR-0775RL" (id 5) (at 137.16 77.47 0)
      (effects (font (size 1.27 1.27)) hide)
    )
    (property "S1PN" "311-75ERCT-ND" (id 6) (at 137.16 77.47 0)
      (effects (font (size 1.27 1.27)) hide)
    )
    (property "S1PL" "Digi-Key" (id 7) (at 137.16 77.47 0)
      (effects (font (size 1.27 1.27)) hide)
    )
    (property "S2PN" "603-RC1206JR-0775RL" (id 8) (at 137.16 77.47 0)
      (effects (font (size 1.27 1.27)) hide)
    )
    (property "S2PL" "Mouser" (id 9) (at 137.16 77.47 0)
      (effects (font (size 1.27 1.27)) hide)
    )
    (property "Description" "75 Ohms ±5% 0.25W, 1/4W Chip Resistor" (id 10) (at 137.16 77.47 0)
      (effects (font (size 1.27 1.27)) hide)
    )
    (property "Package ID" "1206 (3216 Metric)" (id 11) (at 137.16 77.47 0)
      (effects (font (size 1.27 1.27)) hide)
    )
    (property "variant" "dfn" (id 12) (at 137.16 77.47 90)
      (effects (font (size 1.27 1.27)) hide)
    )
    (pin "1" (uuid 8c92d238-4d28-42e7-b068-2f4ab0319438))
    (pin "2" (uuid 97475344-5523-4354-801a-dcf750b0a811))
  )

  (symbol (lib_id "power:GND") (at 189.865 121.92 0) (unit 1)
    (in_bom yes) (on_board yes)
    (uuid 00000000-0000-0000-0000-00005eac73de)
    (property "Reference" "#PWR021" (id 0) (at 189.865 121.92 0)
      (effects (font (size 0.762 0.762)) hide)
    )
    (property "Value" "GND" (id 1) (at 189.865 123.698 0)
      (effects (font (size 0.762 0.762)) hide)
    )
    (property "Footprint" "" (id 2) (at 189.865 121.92 0)
      (effects (font (size 1.524 1.524)) hide)
    )
    (property "Datasheet" "" (id 3) (at 189.865 121.92 0)
      (effects (font (size 1.524 1.524)) hide)
    )
    (pin "1" (uuid 6811ab4d-a4a7-4fa6-90bf-9b11e8a20a64))
  )

  (symbol (lib_id "GRF2014-rescue:R-device") (at 189.865 118.11 180) (unit 1)
    (in_bom yes) (on_board yes)
    (uuid 00000000-0000-0000-0000-00005eac73ed)
    (property "Reference" "X23" (id 0) (at 186.055 116.84 0))
    (property "Value" "DNF" (id 1) (at 186.055 118.745 0))
    (property "Footprint" "Capacitor_SMD:C_0402_1005Metric" (id 2) (at 189.865 118.11 0)
      (effects (font (size 1.524 1.524)) hide)
    )
    (property "Datasheet" "" (id 3) (at 189.865 118.11 0)
      (effects (font (size 1.524 1.524)) hide)
    )
    (property "MFN" "Yageo" (id 4) (at 189.865 118.11 0)
      (effects (font (size 1.27 1.27)) hide)
    )
    (property "MFP" "RC0603JR-070RL" (id 5) (at 189.865 118.11 0)
      (effects (font (size 1.27 1.27)) hide)
    )
    (property "S1PN" "311-0.0GRCT-ND" (id 6) (at 189.865 118.11 0)
      (effects (font (size 1.27 1.27)) hide)
    )
    (property "S1PL" "Digi-Key" (id 7) (at 189.865 118.11 0)
      (effects (font (size 1.27 1.27)) hide)
    )
    (property "S2PN" "603-RC0603JR-070RL" (id 8) (at 189.865 118.11 0)
      (effects (font (size 1.27 1.27)) hide)
    )
    (property "S2PL" "Mouser" (id 9) (at 189.865 118.11 0)
      (effects (font (size 1.27 1.27)) hide)
    )
    (property "Description" "0 Ohms Jumper 0.1W, 1/10W Chip Resistor" (id 10) (at 189.865 118.11 0)
      (effects (font (size 1.27 1.27)) hide)
    )
    (property "Package ID" "0603 (1608 Metric)" (id 11) (at 189.865 118.11 0)
      (effects (font (size 1.27 1.27)) hide)
    )
    (property "variant" "sot89" (id 12) (at 189.865 118.11 90)
      (effects (font (size 1.27 1.27)) hide)
    )
    (pin "1" (uuid 5dc4f089-eb55-4dfc-9dd2-b8d7736a89ef))
    (pin "2" (uuid 1fdde973-4a71-4427-a6ff-004ca6bc396e))
  )

  (symbol (lib_id "project:SMA_2") (at 218.44 109.22 0) (unit 1)
    (in_bom yes) (on_board yes)
    (uuid 00000000-0000-0000-0000-00005ec8db31)
    (property "Reference" "J4" (id 0) (at 221.0562 109.474 0)
      (effects (font (size 1.27 1.27)) (justify left))
    )
    (property "Value" "SMA_2" (id 1) (at 221.0562 111.7854 0)
      (effects (font (size 1.27 1.27)) (justify left))
    )
    (property "Footprint" "" (id 2) (at 222.885 111.76 0))
    (property "Datasheet" "" (id 3) (at 218.44 109.22 0)
      (effects (font (size 1.524 1.524)))
    )
    (pin "1" (uuid 36b0bc84-24f3-4730-bf53-d1962e92c7cb))
    (pin "2" (uuid 9f349496-fb2a-40ca-992e-b906aabd0cc9))
  )

  (symbol (lib_id "project:SMA_2") (at 67.31 109.22 0) (mirror y) (unit 1)
    (in_bom yes) (on_board yes)
    (uuid 00000000-0000-0000-0000-00005ec90ba7)
    (property "Reference" "J3" (id 0) (at 61.595 109.22 0))
    (property "Value" "SMA_2" (id 1) (at 61.595 112.395 0))
    (property "Footprint" "" (id 2) (at 62.865 111.76 0))
    (property "Datasheet" "" (id 3) (at 67.31 109.22 0)
      (effects (font (size 1.524 1.524)))
    )
    (pin "1" (uuid 7fc075a8-84a2-46af-81d9-e8ce7bee7ede))
    (pin "2" (uuid 88e8232e-f0ab-4f03-9ff1-0922444d7ada))
  )

  (symbol (lib_id "power:GND") (at 104.14 121.92 0) (unit 1)
    (in_bom yes) (on_board yes)
    (uuid 00000000-0000-0000-0000-00005ec95c69)
    (property "Reference" "#PWR018" (id 0) (at 104.14 121.92 0)
      (effects (font (size 0.762 0.762)) hide)
    )
    (property "Value" "GND" (id 1) (at 104.14 123.698 0)
      (effects (font (size 0.762 0.762)) hide)
    )
    (property "Footprint" "" (id 2) (at 104.14 121.92 0)
      (effects (font (size 1.524 1.524)) hide)
    )
    (property "Datasheet" "" (id 3) (at 104.14 121.92 0)
      (effects (font (size 1.524 1.524)) hide)
    )
    (pin "1" (uuid ebff9833-1e4e-45cd-83d2-412c1065fbed))
  )

  (symbol (lib_id "GRF2014-rescue:C-device") (at 180.34 109.22 90) (unit 1)
    (in_bom yes) (on_board yes)
    (uuid 00000000-0000-0000-0000-00006023da4b)
    (property "Reference" "C29" (id 0) (at 179.07 106.68 90)
      (effects (font (size 1.27 1.27)) (justify left))
    )
    (property "Value" "1000p" (id 1) (at 187.96 106.68 90)
      (effects (font (size 1.27 1.27)) (justify left))
    )
    (property "Footprint" "Capacitor_SMD:C_0402_1005Metric" (id 2) (at 180.34 109.22 0)
      (effects (font (size 1.524 1.524)) hide)
    )
    (property "Datasheet" "" (id 3) (at 180.34 109.22 0)
      (effects (font (size 1.524 1.524)) hide)
    )
    (property "MFN" "Kemet" (id 4) (at 276.86 213.995 0)
      (effects (font (size 1.27 1.27)) hide)
    )
    (property "MFP" "CBR04C101J3GAC" (id 5) (at 276.86 213.995 0)
      (effects (font (size 1.27 1.27)) hide)
    )
    (property "S1PN" "80-CBR04C101J3GAC" (id 6) (at 276.86 213.995 0)
      (effects (font (size 1.27 1.27)) hide)
    )
    (property "S1PL" "Mouser" (id 7) (at 276.86 213.995 0)
      (effects (font (size 1.27 1.27)) hide)
    )
    (property "S2PN" "399-17684-1-ND" (id 8) (at 276.86 213.995 0)
      (effects (font (size 1.27 1.27)) hide)
    )
    (property "S2PL" "Digi-Key" (id 9) (at 276.86 213.995 0)
      (effects (font (size 1.27 1.27)) hide)
    )
    (property "Description" "HiQ-CBR Series, C0G Dielectric, Low ESR, High SRF" (id 10) (at 276.86 213.995 0)
      (effects (font (size 1.27 1.27)) hide)
    )
    (property "Package ID" "0402 (1005 metric)" (id 11) (at 276.86 213.995 0)
      (effects (font (size 1.27 1.27)) hide)
    )
    (property "variant" "dfn" (id 12) (at 180.34 33.655 90)
      (effects (font (size 1.27 1.27)) hide)
    )
    (pin "1" (uuid e0655ac5-9821-42f8-88ab-f62775e57c0a))
    (pin "2" (uuid a61f0f6e-213e-4f65-bc17-9e25ff799249))
  )

  (symbol (lib_id "GRF2014-rescue:R-device") (at 95.25 118.11 180) (unit 1)
    (in_bom yes) (on_board yes)
    (uuid 00000000-0000-0000-0000-0000606ca518)
    (property "Reference" "X26" (id 0) (at 99.06 116.84 0))
    (property "Value" "DNF" (id 1) (at 99.06 119.38 0))
    (property "Footprint" "Capacitor_SMD:C_0402_1005Metric" (id 2) (at 95.25 118.11 0)
      (effects (font (size 1.524 1.524)) hide)
    )
    (property "Datasheet" "" (id 3) (at 95.25 118.11 0)
      (effects (font (size 1.524 1.524)) hide)
    )
    (property "variant" "dfn" (id 4) (at 95.25 118.11 0)
      (effects (font (size 1.27 1.27)) hide)
    )
    (property "DNP" "1" (id 5) (at 95.25 118.11 0)
      (effects (font (size 1.27 1.27)) hide)
    )
    (pin "1" (uuid 92cad489-7907-44a7-ad1b-1c5f3615a6b0))
    (pin "2" (uuid 008f9a1b-03dd-4d11-b1d4-859e30d294ae))
  )

  (symbol (lib_id "power:GND") (at 95.25 121.92 0) (unit 1)
    (in_bom yes) (on_board yes)
    (uuid 00000000-0000-0000-0000-0000606ca522)
    (property "Reference" "#PWR?" (id 0) (at 95.25 121.92 0)
      (effects (font (size 0.762 0.762)) hide)
    )
    (property "Value" "GND" (id 1) (at 95.25 123.698 0)
      (effects (font (size 0.762 0.762)) hide)
    )
    (property "Footprint" "" (id 2) (at 95.25 121.92 0)
      (effects (font (size 1.524 1.524)) hide)
    )
    (property "Datasheet" "" (id 3) (at 95.25 121.92 0)
      (effects (font (size 1.524 1.524)) hide)
    )
    (pin "1" (uuid dd00f075-1766-4d52-bf50-5f838f6b707c))
  )

  (sheet_instances
    (path "/" (page "1"))
  )

  (symbol_instances
    (path "/00000000-0000-0000-0000-00005c70d97e"
      (reference "#LOGO1") (unit 1) (value "Open Source Hardware") (footprint "")
    )
    (path "/00000000-0000-0000-0000-00005c797178"
      (reference "#PWR01") (unit 1) (value "GND") (footprint "")
    )
    (path "/00000000-0000-0000-0000-00005c79736b"
      (reference "#PWR02") (unit 1) (value "GND") (footprint "")
    )
    (path "/00000000-0000-0000-0000-00005dc86445"
      (reference "#PWR03") (unit 1) (value "GND") (footprint "")
    )
    (path "/00000000-0000-0000-0000-00005dc8644b"
      (reference "#PWR04") (unit 1) (value "GND") (footprint "")
    )
    (path "/00000000-0000-0000-0000-00005dc8645d"
      (reference "#PWR05") (unit 1) (value "GND") (footprint "")
    )
    (path "/00000000-0000-0000-0000-00005dc86486"
      (reference "#PWR06") (unit 1) (value "GND") (footprint "")
    )
    (path "/00000000-0000-0000-0000-00005dc8648c"
      (reference "#PWR07") (unit 1) (value "GND") (footprint "")
    )
    (path "/00000000-0000-0000-0000-00005dc86492"
      (reference "#PWR08") (unit 1) (value "GND") (footprint "")
    )
    (path "/00000000-0000-0000-0000-00005dc86498"
      (reference "#PWR09") (unit 1) (value "GND") (footprint "")
    )
    (path "/00000000-0000-0000-0000-00005dc86480"
      (reference "#PWR010") (unit 1) (value "GND") (footprint "")
    )
    (path "/00000000-0000-0000-0000-00005dc86591"
      (reference "#PWR013") (unit 1) (value "GND") (footprint "")
    )
    (path "/00000000-0000-0000-0000-00005dc86597"
      (reference "#PWR014") (unit 1) (value "GND") (footprint "")
    )
    (path "/00000000-0000-0000-0000-00005dc8666b"
      (reference "#PWR015") (unit 1) (value "GND") (footprint "")
    )
    (path "/00000000-0000-0000-0000-00005ec95c69"
      (reference "#PWR018") (unit 1) (value "GND") (footprint "")
    )
    (path "/00000000-0000-0000-0000-00005dc86524"
      (reference "#PWR019") (unit 1) (value "GND") (footprint "")
    )
    (path "/00000000-0000-0000-0000-00005dc86532"
      (reference "#PWR020") (unit 1) (value "GND") (footprint "")
    )
    (path "/00000000-0000-0000-0000-00005eac73de"
      (reference "#PWR021") (unit 1) (value "GND") (footprint "")
    )
    (path "/00000000-0000-0000-0000-0000606ca522"
      (reference "#PWR?") (unit 1) (value "GND") (footprint "")
    )
    (path "/00000000-0000-0000-0000-00005dc865d7"
      (reference "C21") (unit 1) (value "0.01uF") (footprint "Capacitor_SMD:C_0603_1608Metric")
    )
    (path "/00000000-0000-0000-0000-00005dc865f3"
      (reference "C22") (unit 1) (value "0.1uF") (footprint "Capacitor_SMD:C_0603_1608Metric")
    )
    (path "/00000000-0000-0000-0000-00005dc86601"
      (reference "C23") (unit 1) (value "DNF") (footprint "Capacitor_SMD:C_0603_1608Metric")
    )
    (path "/00000000-0000-0000-0000-00005dc8660f"
      (reference "C24") (unit 1) (value "0.1uF") (footprint "Capacitor_SMD:C_0603_1608Metric")
    )
    (path "/00000000-0000-0000-0000-00005dc8656c"
      (reference "C25") (unit 1) (value "10u/16V") (footprint "Capacitor_Tantalum_SMD:CP_EIA-3216-12_Kemet-S")
    )
    (path "/00000000-0000-0000-0000-00005dc86472"
      (reference "C26") (unit 1) (value "100pF") (footprint "Capacitor_SMD:C_0603_1608Metric")
    )
    (path "/00000000-0000-0000-0000-00005dc865e5"
      (reference "C27") (unit 1) (value "0.01uF") (footprint "Capacitor_SMD:C_0603_1608Metric")
    )
    (path "/00000000-0000-0000-0000-00005dc864b6"
      (reference "C28") (unit 1) (value "1000p") (footprint "Capacitor_SMD:C_0402_1005Metric")
    )
    (path "/00000000-0000-0000-0000-00006023da4b"
      (reference "C29") (unit 1) (value "1000p") (footprint "Capacitor_SMD:C_0402_1005Metric")
    )
    (path "/00000000-0000-0000-0000-00005dc8652c"
      (reference "C30") (unit 1) (value "DNF") (footprint "Capacitor_SMD:C_0402_1005Metric")
    )
    (path "/00000000-0000-0000-0000-00005dc8655e"
      (reference "FB3") (unit 1) (value "~") (footprint "Inductor_SMD:L_0805_2012Metric")
    )
    (path "/00000000-0000-0000-0000-00005ec90ba7"
      (reference "J3") (unit 1) (value "SMA_2") (footprint "")
    )
    (path "/00000000-0000-0000-0000-00005ec8db31"
      (reference "J4") (unit 1) (value "SMA_2") (footprint "")
    )
    (path "/00000000-0000-0000-0000-00005e5ab130"
      (reference "L3") (unit 1) (value "33nH") (footprint "Inductor_SMD:L_0603_1608Metric")
    )
    (path "/00000000-0000-0000-0000-00005c796e6c"
      (reference "P1") (unit 1) (value "~") (footprint "RF_Shielding:S1721-46R")
    )
    (path "/00000000-0000-0000-0000-00005d0a8b4d"
      (reference "P2") (unit 1) (value "~") (footprint "RF_Shielding:S1721-46R")
    )
    (path "/00000000-0000-0000-0000-00005dc86693"
      (reference "P3") (unit 1) (value "+5V") (footprint "Connector_PinHeader_2.54mm:PinHeader_1x02_P2.54mm_Vertical")
    )
    (path "/00000000-0000-0000-0000-00005dc86451"
      (reference "R15") (unit 1) (value "0") (footprint "Resistor_SMD:R_1206_3216Metric")
    )
    (path "/00000000-0000-0000-0000-00005e67466e"
      (reference "R16") (unit 1) (value "0") (footprint "Resistor_SMD:R_1206_3216Metric")
    )
    (path "/00000000-0000-0000-0000-00005dc86653"
      (reference "R17") (unit 1) (value "330") (footprint "Resistor_SMD:R_0402_1005Metric")
    )
    (path "/00000000-0000-0000-0000-00005dc8664d"
      (reference "U3") (unit 1) (value "GRF2014") (footprint "GRF_DFN:DFN-6-1EP_1.5x1.5mm_P0.5mm_EP0.6x1.1mm")
    )
    (path "/00000000-0000-0000-0000-00005eac73ed"
      (reference "X23") (unit 1) (value "DNF") (footprint "Capacitor_SMD:C_0402_1005Metric")
    )
    (path "/00000000-0000-0000-0000-00005dc8649e"
      (reference "X25") (unit 1) (value "DNF") (footprint "Capacitor_SMD:C_0402_1005Metric")
    )
    (path "/00000000-0000-0000-0000-0000606ca518"
      (reference "X26") (unit 1) (value "DNF") (footprint "Capacitor_SMD:C_0402_1005Metric")
    )
    (path "/00000000-0000-0000-0000-00005dc8651e"
      (reference "X27") (unit 1) (value "DNF") (footprint "Capacitor_SMD:C_0402_1005Metric")
    )
  )
)
