(module SMA_EDGE (layer F.Cu) (tedit 59FE4AD7)
  (fp_text reference J1 (at -3.6322 -3.1242 90) (layer F.SilkS)
    (effects (font (size 0.8128 0.8128) (thickness 0.2032)))
  )
  (fp_text value SMA_2 (at 5.4102 -1.1176 90) (layer F.SilkS)
    (effects (font (size 1 1) (thickness 0.15)))
  )
  (pad 1 smd rect (at 0 0) (size 1.5 4.25) (layers F.Cu F.Paste F.Mask))
  (pad 2 smd rect (at -2.77 0.1524) (size 1.5 3.95) (layers B.Cu B.Mask)
    (zone_connect 2))
  (pad 2 smd rect (at 2.77 0.1524) (size 1.5 3.95) (layers B.Cu B.Mask)
    (zone_connect 2))
  (model /Users/timm/Documents/Electronics/Designs/Modules/packages3d/sma_EndLaunch.wrl
    (at (xyz 0 0 0.35))
    (scale (xyz 0.5 0.5 0.5))
    (rotate (xyz 0 0 0))
  )
)
