(kicad_symbol_lib (version 20211014) (generator kicad_symbol_editor)
  (symbol "C-device" (pin_numbers hide) (pin_names (offset 0.254)) (in_bom yes) (on_board yes)
    (property "Reference" "C" (id 0) (at 0.635 2.54 0)
      (effects (font (size 1.27 1.27)) (justify left))
    )
    (property "Value" "C-device" (id 1) (at 0.635 -2.54 0)
      (effects (font (size 1.27 1.27)) (justify left))
    )
    (property "Footprint" "" (id 2) (at 0.9652 -3.81 0)
      (effects (font (size 1.27 1.27)) hide)
    )
    (property "Datasheet" "" (id 3) (at 0 0 0)
      (effects (font (size 1.27 1.27)) hide)
    )
    (property "ki_fp_filters" "C_*" (id 4) (at 0 0 0)
      (effects (font (size 1.27 1.27)) hide)
    )
    (symbol "C-device_0_1"
      (polyline
        (pts
          (xy -2.032 -0.762)
          (xy 2.032 -0.762)
        )
        (stroke (width 0.508) (type default) (color 0 0 0 0))
        (fill (type none))
      )
      (polyline
        (pts
          (xy -2.032 0.762)
          (xy 2.032 0.762)
        )
        (stroke (width 0.508) (type default) (color 0 0 0 0))
        (fill (type none))
      )
    )
    (symbol "C-device_1_1"
      (pin passive line (at 0 3.81 270) (length 2.794)
        (name "~" (effects (font (size 1.27 1.27))))
        (number "1" (effects (font (size 1.27 1.27))))
      )
      (pin passive line (at 0 -3.81 90) (length 2.794)
        (name "~" (effects (font (size 1.27 1.27))))
        (number "2" (effects (font (size 1.27 1.27))))
      )
    )
  )
  (symbol "CP-device" (pin_numbers hide) (pin_names (offset 0.254)) (in_bom yes) (on_board yes)
    (property "Reference" "C" (id 0) (at 0.635 2.54 0)
      (effects (font (size 1.27 1.27)) (justify left))
    )
    (property "Value" "CP-device" (id 1) (at 0.635 -2.54 0)
      (effects (font (size 1.27 1.27)) (justify left))
    )
    (property "Footprint" "" (id 2) (at 0.9652 -3.81 0)
      (effects (font (size 1.27 1.27)) hide)
    )
    (property "Datasheet" "" (id 3) (at 0 0 0)
      (effects (font (size 1.27 1.27)) hide)
    )
    (property "ki_fp_filters" "CP_*" (id 4) (at 0 0 0)
      (effects (font (size 1.27 1.27)) hide)
    )
    (symbol "CP-device_0_1"
      (rectangle (start -2.286 0.508) (end -2.286 1.016)
        (stroke (width 0) (type default) (color 0 0 0 0))
        (fill (type none))
      )
      (rectangle (start -2.286 0.508) (end 2.286 0.508)
        (stroke (width 0) (type default) (color 0 0 0 0))
        (fill (type none))
      )
      (polyline
        (pts
          (xy -1.778 2.286)
          (xy -0.762 2.286)
        )
        (stroke (width 0) (type default) (color 0 0 0 0))
        (fill (type none))
      )
      (polyline
        (pts
          (xy -1.27 2.794)
          (xy -1.27 1.778)
        )
        (stroke (width 0) (type default) (color 0 0 0 0))
        (fill (type none))
      )
      (rectangle (start 2.286 -0.508) (end -2.286 -1.016)
        (stroke (width 0) (type default) (color 0 0 0 0))
        (fill (type outline))
      )
      (rectangle (start 2.286 1.016) (end -2.286 1.016)
        (stroke (width 0) (type default) (color 0 0 0 0))
        (fill (type none))
      )
      (rectangle (start 2.286 1.016) (end 2.286 0.508)
        (stroke (width 0) (type default) (color 0 0 0 0))
        (fill (type none))
      )
    )
    (symbol "CP-device_1_1"
      (pin passive line (at 0 3.81 270) (length 2.794)
        (name "~" (effects (font (size 1.27 1.27))))
        (number "1" (effects (font (size 1.27 1.27))))
      )
      (pin passive line (at 0 -3.81 90) (length 2.794)
        (name "~" (effects (font (size 1.27 1.27))))
        (number "2" (effects (font (size 1.27 1.27))))
      )
    )
  )
  (symbol "Conn_01x02_Female-connector" (pin_names (offset 1.016) hide) (in_bom yes) (on_board yes)
    (property "Reference" "J" (id 0) (at 0 2.54 0)
      (effects (font (size 1.27 1.27)))
    )
    (property "Value" "Conn_01x02_Female-connector" (id 1) (at 0 -5.08 0)
      (effects (font (size 1.27 1.27)))
    )
    (property "Footprint" "" (id 2) (at 0 0 0)
      (effects (font (size 1.27 1.27)) hide)
    )
    (property "Datasheet" "" (id 3) (at 0 0 0)
      (effects (font (size 1.27 1.27)) hide)
    )
    (property "ki_fp_filters" "Connector*:*_1x??_*" (id 4) (at 0 0 0)
      (effects (font (size 1.27 1.27)) hide)
    )
    (symbol "Conn_01x02_Female-connector_1_1"
      (arc (start 0 -2.032) (mid -0.508 -2.54) (end 0 -3.048)
        (stroke (width 0.1524) (type default) (color 0 0 0 0))
        (fill (type none))
      )
      (polyline
        (pts
          (xy -1.27 -2.54)
          (xy -0.508 -2.54)
        )
        (stroke (width 0.1524) (type default) (color 0 0 0 0))
        (fill (type none))
      )
      (polyline
        (pts
          (xy -1.27 0)
          (xy -0.508 0)
        )
        (stroke (width 0.1524) (type default) (color 0 0 0 0))
        (fill (type none))
      )
      (arc (start 0 0.508) (mid -0.508 0) (end 0 -0.508)
        (stroke (width 0.1524) (type default) (color 0 0 0 0))
        (fill (type none))
      )
      (pin passive line (at -5.08 0 0) (length 3.81)
        (name "Pin_1" (effects (font (size 1.27 1.27))))
        (number "1" (effects (font (size 1.27 1.27))))
      )
      (pin passive line (at -5.08 -2.54 0) (length 3.81)
        (name "Pin_2" (effects (font (size 1.27 1.27))))
        (number "2" (effects (font (size 1.27 1.27))))
      )
    )
  )
  (symbol "Ferrite_Bead_Small-device" (pin_numbers hide) (pin_names (offset 0)) (in_bom yes) (on_board yes)
    (property "Reference" "FB" (id 0) (at 1.905 1.27 0)
      (effects (font (size 1.27 1.27)) (justify left))
    )
    (property "Value" "Ferrite_Bead_Small-device" (id 1) (at 1.905 -1.27 0)
      (effects (font (size 1.27 1.27)) (justify left))
    )
    (property "Footprint" "" (id 2) (at -1.778 0 90)
      (effects (font (size 1.27 1.27)) hide)
    )
    (property "Datasheet" "" (id 3) (at 0 0 0)
      (effects (font (size 1.27 1.27)) hide)
    )
    (property "ki_fp_filters" "Inductor_* L_* *Ferrite*" (id 4) (at 0 0 0)
      (effects (font (size 1.27 1.27)) hide)
    )
    (symbol "Ferrite_Bead_Small-device_0_1"
      (polyline
        (pts
          (xy 0 -1.27)
          (xy 0 -0.7874)
        )
        (stroke (width 0) (type default) (color 0 0 0 0))
        (fill (type none))
      )
      (polyline
        (pts
          (xy 0 0.889)
          (xy 0 1.2954)
        )
        (stroke (width 0) (type default) (color 0 0 0 0))
        (fill (type none))
      )
      (polyline
        (pts
          (xy -1.8288 0.2794)
          (xy -1.1176 1.4986)
          (xy 1.8288 -0.2032)
          (xy 1.1176 -1.4224)
          (xy -1.8288 0.2794)
        )
        (stroke (width 0) (type default) (color 0 0 0 0))
        (fill (type none))
      )
    )
    (symbol "Ferrite_Bead_Small-device_1_1"
      (pin passive line (at 0 2.54 270) (length 1.27)
        (name "~" (effects (font (size 1.27 1.27))))
        (number "1" (effects (font (size 1.27 1.27))))
      )
      (pin passive line (at 0 -2.54 90) (length 1.27)
        (name "~" (effects (font (size 1.27 1.27))))
        (number "2" (effects (font (size 1.27 1.27))))
      )
    )
  )
  (symbol "L-device" (pin_numbers hide) (pin_names (offset 1.016) hide) (in_bom yes) (on_board yes)
    (property "Reference" "L" (id 0) (at -1.27 0 90)
      (effects (font (size 1.27 1.27)))
    )
    (property "Value" "L-device" (id 1) (at 1.905 0 90)
      (effects (font (size 1.27 1.27)))
    )
    (property "Footprint" "" (id 2) (at 0 0 0)
      (effects (font (size 1.27 1.27)) hide)
    )
    (property "Datasheet" "" (id 3) (at 0 0 0)
      (effects (font (size 1.27 1.27)) hide)
    )
    (property "ki_fp_filters" "Choke_* *Coil* Inductor_* L_*" (id 4) (at 0 0 0)
      (effects (font (size 1.27 1.27)) hide)
    )
    (symbol "L-device_0_1"
      (arc (start 0 -2.54) (mid 0.635 -1.905) (end 0 -1.27)
        (stroke (width 0) (type default) (color 0 0 0 0))
        (fill (type none))
      )
      (arc (start 0 -1.27) (mid 0.635 -0.635) (end 0 0)
        (stroke (width 0) (type default) (color 0 0 0 0))
        (fill (type none))
      )
      (arc (start 0 0) (mid 0.635 0.635) (end 0 1.27)
        (stroke (width 0) (type default) (color 0 0 0 0))
        (fill (type none))
      )
      (arc (start 0 1.27) (mid 0.635 1.905) (end 0 2.54)
        (stroke (width 0) (type default) (color 0 0 0 0))
        (fill (type none))
      )
    )
    (symbol "L-device_1_1"
      (pin passive line (at 0 3.81 270) (length 1.27)
        (name "1" (effects (font (size 1.27 1.27))))
        (number "1" (effects (font (size 1.27 1.27))))
      )
      (pin passive line (at 0 -3.81 90) (length 1.27)
        (name "2" (effects (font (size 1.27 1.27))))
        (number "2" (effects (font (size 1.27 1.27))))
      )
    )
  )
  (symbol "Logo_Open_Hardware_Small-graphics" (pin_names (offset 1.016)) (in_bom yes) (on_board yes)
    (property "Reference" "#LOGO" (id 0) (at 0 6.985 0)
      (effects (font (size 1.27 1.27)) hide)
    )
    (property "Value" "Logo_Open_Hardware_Small-graphics" (id 1) (at 0 -5.715 0)
      (effects (font (size 1.27 1.27)) hide)
    )
    (property "Footprint" "" (id 2) (at 0 0 0)
      (effects (font (size 1.27 1.27)) hide)
    )
    (property "Datasheet" "" (id 3) (at 0 0 0)
      (effects (font (size 1.27 1.27)) hide)
    )
    (symbol "Logo_Open_Hardware_Small-graphics_0_1"
      (polyline
        (pts
          (xy 3.3528 -4.3434)
          (xy 3.302 -4.318)
          (xy 3.175 -4.2418)
          (xy 2.9972 -4.1148)
          (xy 2.7686 -3.9624)
          (xy 2.54 -3.81)
          (xy 2.3622 -3.7084)
          (xy 2.2352 -3.6068)
          (xy 2.1844 -3.5814)
          (xy 2.159 -3.6068)
          (xy 2.0574 -3.6576)
          (xy 1.905 -3.7338)
          (xy 1.8034 -3.7846)
          (xy 1.6764 -3.8354)
          (xy 1.6002 -3.8354)
          (xy 1.6002 -3.8354)
          (xy 1.5494 -3.7338)
          (xy 1.4732 -3.5306)
          (xy 1.3462 -3.302)
          (xy 1.2446 -3.0226)
          (xy 1.1176 -2.7178)
          (xy 0.9652 -2.413)
          (xy 0.8636 -2.1082)
          (xy 0.7366 -1.8288)
          (xy 0.6604 -1.6256)
          (xy 0.6096 -1.4732)
          (xy 0.5842 -1.397)
          (xy 0.5842 -1.397)
          (xy 0.6604 -1.3208)
          (xy 0.7874 -1.2446)
          (xy 1.0414 -1.016)
          (xy 1.2954 -0.6858)
          (xy 1.4478 -0.3302)
          (xy 1.524 0.0762)
          (xy 1.4732 0.4572)
          (xy 1.3208 0.8128)
          (xy 1.0668 1.143)
          (xy 0.762 1.3716)
          (xy 0.4064 1.524)
          (xy 0 1.5748)
          (xy -0.381 1.5494)
          (xy -0.7366 1.397)
          (xy -1.0668 1.143)
          (xy -1.2192 0.9906)
          (xy -1.397 0.6604)
          (xy -1.524 0.3048)
          (xy -1.524 0.2286)
          (xy -1.4986 -0.1778)
          (xy -1.397 -0.5334)
          (xy -1.1938 -0.8636)
          (xy -0.9144 -1.143)
          (xy -0.8636 -1.1684)
          (xy -0.7366 -1.27)
          (xy -0.635 -1.3462)
          (xy -0.5842 -1.397)
          (xy -1.0668 -2.5908)
          (xy -1.143 -2.794)
          (xy -1.2954 -3.1242)
          (xy -1.397 -3.4036)
          (xy -1.4986 -3.6322)
          (xy -1.5748 -3.7846)
          (xy -1.6002 -3.8354)
          (xy -1.6002 -3.8354)
          (xy -1.651 -3.8354)
          (xy -1.7272 -3.81)
          (xy -1.905 -3.7338)
          (xy -2.0066 -3.683)
          (xy -2.1336 -3.6068)
          (xy -2.2098 -3.5814)
          (xy -2.2606 -3.6068)
          (xy -2.3622 -3.683)
          (xy -2.54 -3.81)
          (xy -2.7686 -3.9624)
          (xy -2.9718 -4.0894)
          (xy -3.1496 -4.2164)
          (xy -3.302 -4.318)
          (xy -3.3528 -4.3434)
          (xy -3.3782 -4.3434)
          (xy -3.429 -4.318)
          (xy -3.5306 -4.2164)
          (xy -3.7084 -4.064)
          (xy -3.937 -3.8354)
          (xy -3.9624 -3.81)
          (xy -4.1656 -3.6068)
          (xy -4.318 -3.4544)
          (xy -4.4196 -3.3274)
          (xy -4.445 -3.2766)
          (xy -4.445 -3.2766)
          (xy -4.4196 -3.2258)
          (xy -4.318 -3.0734)
          (xy -4.2164 -2.8956)
          (xy -4.064 -2.667)
          (xy -3.6576 -2.0828)
          (xy -3.8862 -1.5494)
          (xy -3.937 -1.3716)
          (xy -4.0386 -1.1684)
          (xy -4.0894 -1.0414)
          (xy -4.1148 -0.9652)
          (xy -4.191 -0.9398)
          (xy -4.318 -0.9144)
          (xy -4.5466 -0.8636)
          (xy -4.8006 -0.8128)
          (xy -5.0546 -0.7874)
          (xy -5.2578 -0.7366)
          (xy -5.4356 -0.7112)
          (xy -5.5118 -0.6858)
          (xy -5.5118 -0.6858)
          (xy -5.5372 -0.635)
          (xy -5.5372 -0.5588)
          (xy -5.5372 -0.4318)
          (xy -5.5626 -0.2286)
          (xy -5.5626 0.0762)
          (xy -5.5626 0.127)
          (xy -5.5372 0.4064)
          (xy -5.5372 0.635)
          (xy -5.5372 0.762)
          (xy -5.5372 0.8382)
          (xy -5.5372 0.8382)
          (xy -5.461 0.8382)
          (xy -5.3086 0.889)
          (xy -5.08 0.9144)
          (xy -4.826 0.9652)
          (xy -4.8006 0.9906)
          (xy -4.5466 1.0414)
          (xy -4.318 1.0668)
          (xy -4.1656 1.1176)
          (xy -4.0894 1.143)
          (xy -4.0894 1.143)
          (xy -4.0386 1.2446)
          (xy -3.9624 1.4224)
          (xy -3.8608 1.6256)
          (xy -3.7846 1.8288)
          (xy -3.7084 2.0066)
          (xy -3.6576 2.159)
          (xy -3.6322 2.2098)
          (xy -3.6322 2.2098)
          (xy -3.683 2.286)
          (xy -3.7592 2.413)
          (xy -3.8862 2.5908)
          (xy -4.064 2.8194)
          (xy -4.064 2.8448)
          (xy -4.2164 3.0734)
          (xy -4.3434 3.2512)
          (xy -4.4196 3.3782)
          (xy -4.445 3.4544)
          (xy -4.445 3.4544)
          (xy -4.3942 3.5052)
          (xy -4.2926 3.6322)
          (xy -4.1148 3.81)
          (xy -3.937 4.0132)
          (xy -3.8608 4.064)
          (xy -3.6576 4.2926)
          (xy -3.5052 4.4196)
          (xy -3.4036 4.4958)
          (xy -3.3528 4.5212)
          (xy -3.3528 4.5212)
          (xy -3.302 4.4704)
          (xy -3.1496 4.3688)
          (xy -2.9718 4.2418)
          (xy -2.7432 4.0894)
          (xy -2.7178 4.0894)
          (xy -2.4892 3.937)
          (xy -2.3114 3.81)
          (xy -2.1844 3.7084)
          (xy -2.1336 3.683)
          (xy -2.1082 3.683)
          (xy -2.032 3.7084)
          (xy -1.8542 3.7592)
          (xy -1.6764 3.8354)
          (xy -1.4732 3.937)
          (xy -1.27 4.0132)
          (xy -1.143 4.064)
          (xy -1.0668 4.1148)
          (xy -1.0668 4.1148)
          (xy -1.0414 4.191)
          (xy -1.016 4.3434)
          (xy -0.9652 4.572)
          (xy -0.9144 4.8514)
          (xy -0.889 4.9022)
          (xy -0.8382 5.1562)
          (xy -0.8128 5.3848)
          (xy -0.7874 5.5372)
          (xy -0.762 5.588)
          (xy -0.7112 5.6134)
          (xy -0.5842 5.6134)
          (xy -0.4064 5.6134)
          (xy -0.1524 5.6134)
          (xy 0.0762 5.6134)
          (xy 0.3302 5.6134)
          (xy 0.5334 5.6134)
          (xy 0.6858 5.588)
          (xy 0.7366 5.588)
          (xy 0.7366 5.588)
          (xy 0.762 5.5118)
          (xy 0.8128 5.334)
          (xy 0.8382 5.1054)
          (xy 0.9144 4.826)
          (xy 0.9144 4.7752)
          (xy 0.9652 4.5212)
          (xy 1.016 4.2926)
          (xy 1.0414 4.1402)
          (xy 1.0668 4.0894)
          (xy 1.0668 4.0894)
          (xy 1.1938 4.0386)
          (xy 1.3716 3.9624)
          (xy 1.5748 3.8608)
          (xy 2.0828 3.6576)
          (xy 2.7178 4.0894)
          (xy 2.7686 4.1402)
          (xy 2.9972 4.2926)
          (xy 3.175 4.4196)
          (xy 3.302 4.4958)
          (xy 3.3782 4.5212)
          (xy 3.3782 4.5212)
          (xy 3.429 4.4704)
          (xy 3.556 4.3434)
          (xy 3.7338 4.191)
          (xy 3.9116 3.9878)
          (xy 4.064 3.8354)
          (xy 4.2418 3.6576)
          (xy 4.3434 3.556)
          (xy 4.4196 3.4798)
          (xy 4.4196 3.429)
          (xy 4.4196 3.4036)
          (xy 4.3942 3.3274)
          (xy 4.2926 3.2004)
          (xy 4.1656 2.9972)
          (xy 4.0132 2.794)
          (xy 3.8862 2.5908)
          (xy 3.7592 2.3876)
          (xy 3.6576 2.2352)
          (xy 3.6322 2.159)
          (xy 3.6322 2.1336)
          (xy 3.683 2.0066)
          (xy 3.7592 1.8288)
          (xy 3.8608 1.6002)
          (xy 4.064 1.1176)
          (xy 4.3942 1.0414)
          (xy 4.5974 1.016)
          (xy 4.8768 0.9652)
          (xy 5.1308 0.9144)
          (xy 5.5372 0.8382)
          (xy 5.5626 -0.6604)
          (xy 5.4864 -0.6858)
          (xy 5.4356 -0.6858)
          (xy 5.2832 -0.7366)
          (xy 5.0546 -0.762)
          (xy 4.8006 -0.8128)
          (xy 4.5974 -0.8636)
          (xy 4.3688 -0.9144)
          (xy 4.2164 -0.9398)
          (xy 4.1402 -0.9398)
          (xy 4.1148 -0.9652)
          (xy 4.064 -1.0668)
          (xy 3.9878 -1.2446)
          (xy 3.9116 -1.4478)
          (xy 3.81 -1.651)
          (xy 3.7338 -1.8542)
          (xy 3.683 -2.0066)
          (xy 3.6576 -2.0828)
          (xy 3.683 -2.1336)
          (xy 3.7846 -2.2606)
          (xy 3.8862 -2.4638)
          (xy 4.0386 -2.667)
          (xy 4.191 -2.8956)
          (xy 4.318 -3.0734)
          (xy 4.3942 -3.2004)
          (xy 4.445 -3.2766)
          (xy 4.4196 -3.3274)
          (xy 4.3434 -3.429)
          (xy 4.1656 -3.5814)
          (xy 3.937 -3.8354)
          (xy 3.8862 -3.8608)
          (xy 3.683 -4.064)
          (xy 3.5306 -4.2164)
          (xy 3.4036 -4.318)
          (xy 3.3528 -4.3434)
        )
        (stroke (width 0) (type default) (color 0 0 0 0))
        (fill (type outline))
      )
    )
  )
  (symbol "R-device" (pin_numbers hide) (pin_names (offset 0)) (in_bom yes) (on_board yes)
    (property "Reference" "R" (id 0) (at 2.032 0 90)
      (effects (font (size 1.27 1.27)))
    )
    (property "Value" "R-device" (id 1) (at 0 0 90)
      (effects (font (size 1.27 1.27)))
    )
    (property "Footprint" "" (id 2) (at -1.778 0 90)
      (effects (font (size 1.27 1.27)) hide)
    )
    (property "Datasheet" "" (id 3) (at 0 0 0)
      (effects (font (size 1.27 1.27)) hide)
    )
    (property "ki_fp_filters" "R_*" (id 4) (at 0 0 0)
      (effects (font (size 1.27 1.27)) hide)
    )
    (symbol "R-device_0_1"
      (rectangle (start -1.016 -2.54) (end 1.016 2.54)
        (stroke (width 0.254) (type default) (color 0 0 0 0))
        (fill (type none))
      )
    )
    (symbol "R-device_1_1"
      (pin passive line (at 0 3.81 270) (length 1.27)
        (name "~" (effects (font (size 1.27 1.27))))
        (number "1" (effects (font (size 1.27 1.27))))
      )
      (pin passive line (at 0 -3.81 90) (length 1.27)
        (name "~" (effects (font (size 1.27 1.27))))
        (number "2" (effects (font (size 1.27 1.27))))
      )
    )
  )
  (symbol "R_Small-device" (pin_numbers hide) (pin_names (offset 0.254) hide) (in_bom yes) (on_board yes)
    (property "Reference" "R" (id 0) (at 0.762 0.508 0)
      (effects (font (size 1.27 1.27)) (justify left))
    )
    (property "Value" "R_Small-device" (id 1) (at 0.762 -1.016 0)
      (effects (font (size 1.27 1.27)) (justify left))
    )
    (property "Footprint" "" (id 2) (at 0 0 0)
      (effects (font (size 1.27 1.27)) hide)
    )
    (property "Datasheet" "" (id 3) (at 0 0 0)
      (effects (font (size 1.27 1.27)) hide)
    )
    (property "ki_fp_filters" "R_*" (id 4) (at 0 0 0)
      (effects (font (size 1.27 1.27)) hide)
    )
    (symbol "R_Small-device_0_1"
      (rectangle (start -0.762 1.778) (end 0.762 -1.778)
        (stroke (width 0.2032) (type default) (color 0 0 0 0))
        (fill (type none))
      )
    )
    (symbol "R_Small-device_1_1"
      (pin passive line (at 0 2.54 270) (length 0.762)
        (name "~" (effects (font (size 1.27 1.27))))
        (number "1" (effects (font (size 1.27 1.27))))
      )
      (pin passive line (at 0 -2.54 90) (length 0.762)
        (name "~" (effects (font (size 1.27 1.27))))
        (number "2" (effects (font (size 1.27 1.27))))
      )
    )
  )
)
