EESchema Schematic File Version 4
LIBS:MGA30889-cache
EELAYER 26 0
EELAYER END
$Descr A4 11693 8268
encoding utf-8
Sheet 1 1
Title "MGA-30889"
Date "2020-04-10"
Rev "1.0"
Comp "Dyadic Pty Ltd"
Comment1 "2020"
Comment2 ""
Comment3 ""
Comment4 ""
$EndDescr
$Comp
L power:GND #PWR03
U 1 1 5C6E3064
P 3000 3875
F 0 "#PWR03" H 3000 3875 30  0001 C CNN
F 1 "GND" H 3000 3805 30  0001 C CNN
F 2 "" H 3000 3875 60  0001 C CNN
F 3 "" H 3000 3875 60  0001 C CNN
	1    3000 3875
	1    0    0    -1  
$EndComp
$Comp
L power:GND #PWR04
U 1 1 5C6E3070
P 3800 3875
F 0 "#PWR04" H 3800 3875 30  0001 C CNN
F 1 "GND" H 3800 3805 30  0001 C CNN
F 2 "" H 3800 3875 60  0001 C CNN
F 3 "" H 3800 3875 60  0001 C CNN
	1    3800 3875
	1    0    0    -1  
$EndComp
$Comp
L device:R R1
U 1 1 5C6E3076
P 4350 3425
F 0 "R1" V 4250 3425 50  0000 C CNN
F 1 "0" V 4450 3425 50  0000 C CNN
F 2 "Resistor_SMD:R_0805_2012Metric" H 4350 3425 60  0001 C CNN
F 3 "" H 4350 3425 60  0001 C CNN
F 4 "Panasonic Electronic Components" H 4350 3425 50  0001 C CNN "MFN"
F 5 "ERJ-6GEY0R00V" H 4350 3425 50  0001 C CNN "MFP"
F 6 "P0.0ACT-ND" H 4350 3425 50  0001 C CNN "S1PN"
F 7 "Digi-Key" H 4350 3425 50  0001 C CNN "S1PL"
F 8 "ERJ-6GEY0R00V" H 4350 3425 50  0001 C CNN "S2PN"
F 9 "Arrow" H 4350 3425 50  0001 C CNN "S2PL"
F 10 "RES SMD 0.0 OHM JUMPER 1/8W" H 4350 3425 50  0001 C CNN "Description"
F 11 "0805 (2012 Metric)" H 4350 3425 50  0001 C CNN "Package ID"
	1    4350 3425
	0    -1   -1   0   
$EndComp
$Comp
L device:R R2
U 1 1 5C6E3082
P 5450 3425
F 0 "R2" V 5350 3425 50  0000 C CNN
F 1 "0" V 5550 3425 50  0000 C CNN
F 2 "Resistor_SMD:R_0805_2012Metric" H 5450 3425 60  0001 C CNN
F 3 "" H 5450 3425 60  0001 C CNN
F 4 "Panasonic Electronic Components" H 4350 3425 50  0001 C CNN "MFN"
F 5 "ERJ-6GEY0R00V" H 4350 3425 50  0001 C CNN "MFP"
F 6 "P0.0ACT-ND" H 4350 3425 50  0001 C CNN "S1PN"
F 7 "Digi-Key" H 4350 3425 50  0001 C CNN "S1PL"
F 8 "ERJ-6GEY0R00V" H 4350 3425 50  0001 C CNN "S2PN"
F 9 "Arrow" H 4350 3425 50  0001 C CNN "S2PL"
F 10 "RES SMD 0.0 OHM JUMPER 1/8W" H 4350 3425 50  0001 C CNN "Description"
F 11 "0805 (2012 Metric)" H 4350 3425 50  0001 C CNN "Package ID"
	1    5450 3425
	0    -1   -1   0   
$EndComp
$Comp
L power:GND #PWR05
U 1 1 5C6E3088
P 4900 3875
F 0 "#PWR05" H 4900 3875 30  0001 C CNN
F 1 "GND" H 4900 3805 30  0001 C CNN
F 2 "" H 4900 3875 60  0001 C CNN
F 3 "" H 4900 3875 60  0001 C CNN
	1    4900 3875
	1    0    0    -1  
$EndComp
Wire Wire Line
	3500 3425 3800 3425
Wire Wire Line
	3800 3575 3800 3425
Connection ~ 3800 3425
Wire Wire Line
	3000 3575 3000 3425
Wire Wire Line
	4900 3575 4900 3425
Connection ~ 4900 3425
$Comp
L device:C C6
U 1 1 5C6E309C
P 7550 3725
F 0 "C6" H 7600 3825 50  0000 L CNN
F 1 "100pF" H 7600 3625 50  0000 L CNN
F 2 "Capacitor_SMD:C_0603_1608Metric" H 7550 3725 60  0001 C CNN
F 3 "" H 7550 3725 60  0001 C CNN
F 4 "Yageo" H 7500 875 50  0001 C CNN "MFN"
F 5 "CC0603JRNPO9BN101" H 7500 875 50  0001 C CNN "MFP"
F 6 "311-1069-1-ND" H 7500 875 50  0001 C CNN "S1PN"
F 7 "Digi-Key" H 7500 875 50  0001 C CNN "S1PL"
F 8 "603-CC603JRNPO9BN101" H 7500 875 50  0001 C CNN "S2PN"
F 9 "Mouser" H 7500 875 50  0001 C CNN "S2PL"
F 10 "100pF ±5% 50V Ceramic Capacitor C0G, NP0" H 7500 875 50  0001 C CNN "Description"
F 11 "0603 (1608 Metric)" H 7500 875 50  0001 C CNN "Package ID"
	1    7550 3725
	1    0    0    -1  
$EndComp
Wire Wire Line
	7950 3425 7950 3575
Wire Wire Line
	7550 3575 7550 3425
Connection ~ 7550 3425
Wire Wire Line
	7050 3575 7050 3425
Connection ~ 7050 3425
Wire Wire Line
	6050 3575 6050 3425
Connection ~ 6050 3425
$Comp
L power:GND #PWR010
U 1 1 5C6E30B0
P 2575 3925
F 0 "#PWR010" H 2575 3925 30  0001 C CNN
F 1 "GND" H 2575 3855 30  0001 C CNN
F 2 "" H 2575 3925 60  0001 C CNN
F 3 "" H 2575 3925 60  0001 C CNN
	1    2575 3925
	1    0    0    -1  
$EndComp
$Comp
L power:GND #PWR06
U 1 1 5C6E30B7
P 6050 3875
F 0 "#PWR06" H 6050 3875 30  0001 C CNN
F 1 "GND" H 6050 3805 30  0001 C CNN
F 2 "" H 6050 3875 60  0001 C CNN
F 3 "" H 6050 3875 60  0001 C CNN
	1    6050 3875
	1    0    0    -1  
$EndComp
$Comp
L power:GND #PWR07
U 1 1 5C6E30BD
P 7050 3875
F 0 "#PWR07" H 7050 3875 30  0001 C CNN
F 1 "GND" H 7050 3805 30  0001 C CNN
F 2 "" H 7050 3875 60  0001 C CNN
F 3 "" H 7050 3875 60  0001 C CNN
	1    7050 3875
	1    0    0    -1  
$EndComp
$Comp
L power:GND #PWR08
U 1 1 5C6E30C3
P 7550 3875
F 0 "#PWR08" H 7550 3875 30  0001 C CNN
F 1 "GND" H 7550 3805 30  0001 C CNN
F 2 "" H 7550 3875 60  0001 C CNN
F 3 "" H 7550 3875 60  0001 C CNN
	1    7550 3875
	1    0    0    -1  
$EndComp
$Comp
L power:GND #PWR09
U 1 1 5C6E30C9
P 7950 3875
F 0 "#PWR09" H 7950 3875 30  0001 C CNN
F 1 "GND" H 7950 3805 30  0001 C CNN
F 2 "" H 7950 3875 60  0001 C CNN
F 3 "" H 7950 3875 60  0001 C CNN
	1    7950 3875
	1    0    0    -1  
$EndComp
$Comp
L device:R X5
U 1 1 5C6E30CF
P 2725 5025
F 0 "X5" H 2575 4975 50  0000 C CNN
F 1 "100" H 2575 5075 50  0000 C CNN
F 2 "Capacitor_SMD:C_0603_1608Metric" H 2725 5025 60  0001 C CNN
F 3 "" H 2725 5025 60  0001 C CNN
	1    2725 5025
	-1   0    0    1   
$EndComp
$Comp
L device:R X1
U 1 1 5C6E30D5
P 3175 4675
F 0 "X1" V 3275 4675 50  0000 C CNN
F 1 "75" V 3075 4675 50  0000 C CNN
F 2 "Capacitor_SMD:C_0603_1608Metric" H 3175 4675 60  0001 C CNN
F 3 "" H 3175 4675 60  0001 C CNN
F 4 "Panasonic Electronic Components" H 3175 4675 50  0001 C CNN "MFN"
F 5 "ERJ-3GEY0R00V" H 3175 4675 50  0001 C CNN "MFP"
F 6 "P0.0GCT-ND" H 3175 4675 50  0001 C CNN "S1PN"
F 7 "Digi-Key" H 3175 4675 50  0001 C CNN "S1PL"
F 8 "ERJ3GEY0R00V" H 3175 4675 50  0001 C CNN "S2PN"
F 9 "Arrow" H 3175 4675 50  0001 C CNN "S2PL"
F 10 "RES SMD 0.0OHM JUMPER 1/10W" H 3175 4675 50  0001 C CNN "Description"
F 11 "0603 (1608 Metric)" H 3175 4675 50  0001 C CNN "Package ID"
	1    3175 4675
	0    1    1    0   
$EndComp
$Comp
L device:R X2
U 1 1 5C6E30DB
P 3725 4675
F 0 "X2" V 3625 4675 50  0000 C CNN
F 1 "0" V 3825 4675 50  0000 C CNN
F 2 "Capacitor_SMD:C_0603_1608Metric" H 3725 4675 60  0001 C CNN
F 3 "" H 3725 4675 60  0001 C CNN
F 4 "Panasonic Electronic Components" H 3175 4675 50  0001 C CNN "MFN"
F 5 "ERJ-3GEY0R00V" H 3175 4675 50  0001 C CNN "MFP"
F 6 "P0.0GCT-ND" H 3175 4675 50  0001 C CNN "S1PN"
F 7 "Digi-Key" H 3175 4675 50  0001 C CNN "S1PL"
F 8 "ERJ3GEY0R00V" H 3175 4675 50  0001 C CNN "S2PN"
F 9 "Arrow" H 3175 4675 50  0001 C CNN "S2PL"
F 10 "RES SMD 0.0OHM JUMPER 1/10W" H 3175 4675 50  0001 C CNN "Description"
F 11 "0603 (1608 Metric)" H 3175 4675 50  0001 C CNN "Package ID"
	1    3725 4675
	0    -1   -1   0   
$EndComp
$Comp
L device:R X6
U 1 1 5C6E30E1
P 4150 5025
F 0 "X6" H 4300 5025 50  0000 C CNN
F 1 "100" H 4300 5125 50  0000 C CNN
F 2 "Capacitor_SMD:C_0603_1608Metric" H 4150 5025 60  0001 C CNN
F 3 "" H 4150 5025 60  0001 C CNN
	1    4150 5025
	-1   0    0    1   
$EndComp
$Comp
L device:C C8
U 1 1 5C6E30E7
P 4450 4675
F 0 "C8" V 4600 4600 50  0000 L CNN
F 1 "0.1u" V 4300 4600 50  0000 L CNN
F 2 "Capacitor_SMD:C_0603_1608Metric" H 4450 4675 60  0001 C CNN
F 3 "" H 4450 4675 60  0001 C CNN
F 4 "Kemet" H 7425 4675 50  0001 C CNN "MFN"
F 5 "C0603C104K5RACTU" H 7425 4675 50  0001 C CNN "MFP"
F 6 "399-5089-1-ND" H 7425 4675 50  0001 C CNN "S1PN"
F 7 "Digi-Key" H 7425 4675 50  0001 C CNN "S1PL"
F 8 "C0603C104K5RACTU" H 7425 4675 50  0001 C CNN "S2PN"
F 9 "Arrow" H 7425 4675 50  0001 C CNN "S2PL"
F 10 "0.10µF 50V Ceramic Capacitor X7R" H 7425 4675 50  0001 C CNN "Description"
F 11 "0603 (1608 Metric)" H 7425 4675 50  0001 C CNN "Package ID"
	1    4450 4675
	0    -1   -1   0   
$EndComp
$Comp
L device:C C9
U 1 1 5C6E30ED
P 7425 4675
F 0 "C9" V 7575 4600 50  0000 L CNN
F 1 "0.1u" V 7275 4575 50  0000 L CNN
F 2 "Capacitor_SMD:C_0603_1608Metric" H 7425 4675 60  0001 C CNN
F 3 "" H 7425 4675 60  0001 C CNN
F 4 "Kemet" H 7425 4675 50  0001 C CNN "MFN"
F 5 "C0603C104K5RACTU" H 7425 4675 50  0001 C CNN "MFP"
F 6 "399-5089-1-ND" H 7425 4675 50  0001 C CNN "S1PN"
F 7 "Digi-Key" H 7425 4675 50  0001 C CNN "S1PL"
F 8 "C0603C104K5RACTU" H 7425 4675 50  0001 C CNN "S2PN"
F 9 "Arrow" H 7425 4675 50  0001 C CNN "S2PL"
F 10 "0.10µF 50V Ceramic Capacitor X7R" H 7425 4675 50  0001 C CNN "Description"
F 11 "0603 (1608 Metric)" H 7425 4675 50  0001 C CNN "Package ID"
	1    7425 4675
	0    -1   -1   0   
$EndComp
$Comp
L device:R X9
U 1 1 5C6E30F3
P 8925 5025
F 0 "X9" H 8775 5025 50  0000 C CNN
F 1 "294" H 8775 4925 50  0000 C CNN
F 2 "Capacitor_SMD:C_0603_1608Metric" H 8925 5025 60  0001 C CNN
F 3 "" H 8925 5025 60  0001 C CNN
	1    8925 5025
	1    0    0    -1  
$EndComp
$Comp
L device:R X3
U 1 1 5C6E30F9
P 8575 4675
F 0 "X3" V 8475 4675 50  0000 C CNN
F 1 "17.8" V 8675 4675 50  0000 C CNN
F 2 "Capacitor_SMD:C_0603_1608Metric" H 8575 4675 60  0001 C CNN
F 3 "" H 8575 4675 60  0001 C CNN
F 4 "Panasonic Electronic Components" H 3175 4675 50  0001 C CNN "MFN"
F 5 "ERJ-3GEY0R00V" H 3175 4675 50  0001 C CNN "MFP"
F 6 "P0.0GCT-ND" H 3175 4675 50  0001 C CNN "S1PN"
F 7 "Digi-Key" H 3175 4675 50  0001 C CNN "S1PL"
F 8 "ERJ3GEY0R00V" H 3175 4675 50  0001 C CNN "S2PN"
F 9 "Arrow" H 3175 4675 50  0001 C CNN "S2PL"
F 10 "RES SMD 0.0OHM JUMPER 1/10W" H 3175 4675 50  0001 C CNN "Description"
F 11 "0603 (1608 Metric)" H 3175 4675 50  0001 C CNN "Package ID"
	1    8575 4675
	0    -1   -1   0   
$EndComp
$Comp
L device:R X8
U 1 1 5C6E30FF
P 8275 5025
F 0 "X8" H 8425 5025 50  0000 C CNN
F 1 "294" H 8425 5125 50  0000 C CNN
F 2 "Capacitor_SMD:C_0603_1608Metric" H 8275 5025 60  0001 C CNN
F 3 "" H 8275 5025 60  0001 C CNN
	1    8275 5025
	-1   0    0    1   
$EndComp
Wire Wire Line
	2175 4675 2325 4675
Wire Wire Line
	2725 4875 2725 4675
Connection ~ 2725 4675
Wire Wire Line
	3325 4675 3575 4675
Wire Wire Line
	3875 4675 4150 4675
Wire Wire Line
	4150 4875 4150 4675
Connection ~ 4150 4675
Wire Wire Line
	4600 4675 4750 4675
Wire Wire Line
	6400 4675 6600 4675
Wire Wire Line
	7575 4675 7850 4675
$Comp
L power:GND #PWR022
U 1 1 5C6E310F
P 8925 5175
F 0 "#PWR022" H 8925 5175 30  0001 C CNN
F 1 "GND" H 8925 5105 30  0001 C CNN
F 2 "" H 8925 5175 60  0001 C CNN
F 3 "" H 8925 5175 60  0001 C CNN
	1    8925 5175
	1    0    0    -1  
$EndComp
$Comp
L power:GND #PWR015
U 1 1 5C6E3115
P 6000 4975
F 0 "#PWR015" H 6000 4975 30  0001 C CNN
F 1 "GND" H 6000 4905 30  0001 C CNN
F 2 "" H 6000 4975 60  0001 C CNN
F 3 "" H 6000 4975 60  0001 C CNN
	1    6000 4975
	1    0    0    -1  
$EndComp
Connection ~ 6600 4675
$Comp
L power:GND #PWR018
U 1 1 5C6E3122
P 4150 5175
F 0 "#PWR018" H 4150 5175 30  0001 C CNN
F 1 "GND" H 4150 5105 30  0001 C CNN
F 2 "" H 4150 5175 60  0001 C CNN
F 3 "" H 4150 5175 60  0001 C CNN
	1    4150 5175
	1    0    0    -1  
$EndComp
$Comp
L power:GND #PWR017
U 1 1 5C6E3128
P 2725 5175
F 0 "#PWR017" H 2725 5175 30  0001 C CNN
F 1 "GND" H 2725 5105 30  0001 C CNN
F 2 "" H 2725 5175 60  0001 C CNN
F 3 "" H 2725 5175 60  0001 C CNN
	1    2725 5175
	1    0    0    -1  
$EndComp
$Comp
L power:GND #PWR021
U 1 1 5C6E312E
P 8275 5175
F 0 "#PWR021" H 8275 5175 30  0001 C CNN
F 1 "GND" H 8275 5105 30  0001 C CNN
F 2 "" H 8275 5175 60  0001 C CNN
F 3 "" H 8275 5175 60  0001 C CNN
	1    8275 5175
	1    0    0    -1  
$EndComp
Wire Wire Line
	8725 4675 8925 4675
Wire Wire Line
	8925 4875 8925 4675
Connection ~ 8925 4675
Wire Wire Line
	8275 4875 8275 4675
Connection ~ 8275 4675
Text Notes 10150 4550 0    60   ~ 0
A-RF Out
Text Notes 1100 4550 0    60   ~ 0
A-RF In
$Comp
L device:R X4
U 1 1 5C6E314E
P 2325 5025
F 0 "X4" H 2175 4975 50  0000 C CNN
F 1 "DNI" H 2175 5075 50  0000 C CNN
F 2 "Capacitor_SMD:C_0603_1608Metric" H 2325 5025 60  0001 C CNN
F 3 "" H 2325 5025 60  0001 C CNN
	1    2325 5025
	-1   0    0    1   
$EndComp
$Comp
L device:R X10
U 1 1 5C6E3154
P 9375 5025
F 0 "X10" H 9225 5025 50  0000 C CNN
F 1 "DNI" H 9225 4925 50  0000 C CNN
F 2 "Capacitor_SMD:C_0603_1608Metric" H 9375 5025 60  0001 C CNN
F 3 "" H 9375 5025 60  0001 C CNN
	1    9375 5025
	1    0    0    -1  
$EndComp
Wire Wire Line
	2325 4875 2325 4675
Connection ~ 2325 4675
$Comp
L power:GND #PWR016
U 1 1 5C6E315C
P 2325 5175
F 0 "#PWR016" H 2325 5175 30  0001 C CNN
F 1 "GND" H 2325 5105 30  0001 C CNN
F 2 "" H 2325 5175 60  0001 C CNN
F 3 "" H 2325 5175 60  0001 C CNN
	1    2325 5175
	1    0    0    -1  
$EndComp
$Comp
L device:R X7
U 1 1 5C6E3162
P 4750 5025
F 0 "X7" H 4900 5025 50  0000 C CNN
F 1 "DNI" H 4900 5125 50  0000 C CNN
F 2 "Capacitor_SMD:C_0603_1608Metric" H 4750 5025 60  0001 C CNN
F 3 "" H 4750 5025 60  0001 C CNN
	1    4750 5025
	-1   0    0    1   
$EndComp
$Comp
L power:GND #PWR019
U 1 1 5C6E3168
P 4750 5175
F 0 "#PWR019" H 4750 5175 30  0001 C CNN
F 1 "GND" H 4750 5105 30  0001 C CNN
F 2 "" H 4750 5175 60  0001 C CNN
F 3 "" H 4750 5175 60  0001 C CNN
	1    4750 5175
	1    0    0    -1  
$EndComp
Wire Wire Line
	4750 4875 4750 4675
Connection ~ 4750 4675
$Comp
L device:C C10
U 1 1 5C6E3170
P 7850 5025
F 0 "C10" H 7550 5075 50  0000 L CNN
F 1 "DNI" H 7575 4975 50  0000 L CNN
F 2 "Capacitor_SMD:C_0603_1608Metric" H 7850 5025 60  0001 C CNN
F 3 "" H 7850 5025 60  0001 C CNN
	1    7850 5025
	1    0    0    -1  
$EndComp
$Comp
L power:GND #PWR020
U 1 1 5C6E3176
P 7850 5175
F 0 "#PWR020" H 7850 5175 30  0001 C CNN
F 1 "GND" H 7850 5105 30  0001 C CNN
F 2 "" H 7850 5175 60  0001 C CNN
F 3 "" H 7850 5175 60  0001 C CNN
	1    7850 5175
	1    0    0    -1  
$EndComp
$Comp
L power:GND #PWR023
U 1 1 5C6E317C
P 9375 5175
F 0 "#PWR023" H 9375 5175 30  0001 C CNN
F 1 "GND" H 9375 5105 30  0001 C CNN
F 2 "" H 9375 5175 60  0001 C CNN
F 3 "" H 9375 5175 60  0001 C CNN
	1    9375 5175
	1    0    0    -1  
$EndComp
Wire Wire Line
	9375 4875 9375 4675
Wire Wire Line
	2475 3525 2575 3525
Wire Wire Line
	7850 4875 7850 4675
Connection ~ 7850 4675
Wire Wire Line
	2475 3425 3000 3425
Wire Wire Line
	3000 3425 3300 3425
Wire Wire Line
	7550 3425 7950 3425
Wire Wire Line
	7050 3425 7550 3425
Wire Wire Line
	2725 4675 3025 4675
Wire Wire Line
	4150 4675 4300 4675
Wire Wire Line
	6600 4675 7275 4675
Wire Wire Line
	8925 4675 9375 4675
Wire Wire Line
	8275 4675 8425 4675
Wire Wire Line
	2325 4675 2725 4675
Wire Wire Line
	7850 4675 8275 4675
$Comp
L device:Ferrite_Bead_Small FB1
U 1 1 5C6E31A5
P 3400 3425
F 0 "FB1" V 3255 3425 50  0000 C CNN
F 1 "~" V 3254 3425 50  0000 C CNN
F 2 "Inductor_SMD:L_0805_2012Metric" V 3330 3425 50  0001 C CNN
F 3 "~" H 3400 3425 50  0001 C CNN
F 4 "Murata Electronics" H 4700 2300 50  0001 C CNN "MFN"
F 5 "BLM21PG221SN1D" H 4700 2300 50  0001 C CNN "MFP"
F 6 "81-BLM21P221SG" H 4700 2300 50  0001 C CNN "S1PN"
F 7 "Mouser" H 4700 2300 50  0001 C CNN "S1PL"
F 8 "490-1054-1-ND" H 4700 2300 50  0001 C CNN "S2PN"
F 9 "Digi-Key" H 4700 2300 50  0001 C CNN "S2PL"
F 10 "FERRITE BEAD 220 OHM 0805 1LN" H 4700 2300 50  0001 C CNN "Description"
F 11 "0805 (2012 Metric)" H 4700 2300 50  0001 C CNN "Package ID"
	1    3400 3425
	0    1    1    0   
$EndComp
$Comp
L device:CP C5
U 1 1 5C6E31AB
P 7050 3725
F 0 "C5" H 7125 3825 50  0000 L CNN
F 1 "10u/16V" H 7100 3625 50  0000 L CNN
F 2 "Capacitor_Tantalum_SMD:CP_EIA-3216-12_Kemet-S" H 7088 3575 50  0001 C CNN
F 3 "~" H 7050 3725 50  0001 C CNN
F 4 "Kemet" H 7000 875 50  0001 C CNN "MFN"
F 5 "T491A106K016AT" H 7000 875 50  0001 C CNN "MFP"
F 6 "80-T491A106K016" H 7000 875 50  0001 C CNN "S1PN"
F 7 "Mouser" H 7000 875 50  0001 C CNN "S1PL"
F 8 "399-8269-1-ND" H 7000 875 50  0001 C CNN "S2PN"
F 9 "Digi-Key" H 7000 875 50  0001 C CNN "S2PL"
F 10 "10µF Molded Tantalum Capacitors 16V 3 Ohm ESR" H 7000 875 50  0001 C CNN "Description"
F 11 "1206 (3216 Metric) " H 7000 875 50  0001 C CNN "Package ID"
	1    7050 3725
	1    0    0    -1  
$EndComp
Wire Wire Line
	6050 3425 6600 3425
Connection ~ 6600 3425
Connection ~ 3000 3425
$Comp
L graphics:Logo_Open_Hardware_Small #LOGO1
U 1 1 5C70D97E
P 2125 2325
F 0 "#LOGO1" H 2125 2600 50  0001 C CNN
F 1 "Open Source Hardware" H 2125 2100 50  0000 C CNN
F 2 "" H 2125 2325 50  0001 C CNN
F 3 "~" H 2125 2325 50  0001 C CNN
	1    2125 2325
	1    0    0    -1  
$EndComp
Wire Wire Line
	2575 3525 2575 3800
$Comp
L project:SMA_2 J4
U 1 1 5C789547
P 9900 4675
F 0 "J4" H 10025 4675 50  0000 L CNN
F 1 "~" H 10003 4574 50  0000 L CNN
F 2 "RF_SMA_Connectors:SMA_EDGE_4" H 10075 4575 50  0001 C CNN
F 3 "" H 9900 4675 60  0000 C CNN
F 4 "Molex" H 4875 6550 50  0001 C CNN "MFN"
F 5 "0732511150" H 4875 6550 50  0001 C CNN "MFP"
F 6 "S01-SJEDM-11BS05" H 4875 6550 50  0001 C CNN "S1PN"
F 7 "Superbat" H 4875 6550 50  0001 C CNN "S1PL"
F 8 "73251-1150" H 4875 6550 50  0001 C CNN "S2PN"
F 9 "TTI" H 4875 6550 50  0001 C CNN "S2PL"
F 10 "SMA ST PCB-JCK" H 4875 6550 50  0001 C CNN "Description"
	1    9900 4675
	1    0    0    -1  
$EndComp
$Comp
L project:SMA_2 J3
U 1 1 5C789719
P 1700 4675
F 0 "J3" H 1850 4675 50  0000 C CNN
F 1 "~" H 1669 4824 50  0000 C CNN
F 2 "RF_SMA_Connectors:SMA_EDGE_4" H 1875 4575 50  0001 C CNN
F 3 "" H 1700 4675 60  0000 C CNN
F 4 "Molex" H 3800 6550 50  0001 C CNN "MFN"
F 5 "0732511150" H 3800 6550 50  0001 C CNN "MFP"
F 6 "S01-SJEDM-11BS05" H 3800 6550 50  0001 C CNN "S1PN"
F 7 "Superbat" H 3800 6550 50  0001 C CNN "S1PL"
F 8 "73251-1150" H 3800 6550 50  0001 C CNN "S2PN"
F 9 "TTI" H 3800 6550 50  0001 C CNN "S2PL"
F 10 "SMA ST PCB-JCK" H 3800 6550 50  0001 C CNN "Description"
	1    1700 4675
	-1   0    0    -1  
$EndComp
$Comp
L power:GND #PWR013
U 1 1 5C78C1E2
P 1700 4850
F 0 "#PWR013" H 1700 4850 30  0001 C CNN
F 1 "GND" H 1700 4780 30  0001 C CNN
F 2 "" H 1700 4850 60  0001 C CNN
F 3 "" H 1700 4850 60  0001 C CNN
	1    1700 4850
	1    0    0    -1  
$EndComp
$Comp
L power:GND #PWR014
U 1 1 5C79399E
P 9900 4850
F 0 "#PWR014" H 9900 4850 30  0001 C CNN
F 1 "GND" H 9900 4780 30  0001 C CNN
F 2 "" H 9900 4850 60  0001 C CNN
F 3 "" H 9900 4850 60  0001 C CNN
	1    9900 4850
	1    0    0    -1  
$EndComp
$Comp
L power:GND #PWR01
U 1 1 5C7998B4
P 9675 1350
F 0 "#PWR01" H 9675 1350 30  0001 C CNN
F 1 "GND" H 9675 1280 30  0001 C CNN
F 2 "" H 9675 1350 60  0001 C CNN
F 3 "" H 9675 1350 60  0001 C CNN
	1    9675 1350
	1    0    0    -1  
$EndComp
$Comp
L power:GND #PWR02
U 1 1 5C7998C0
P 10125 1350
F 0 "#PWR02" H 10125 1350 30  0001 C CNN
F 1 "GND" H 10125 1280 30  0001 C CNN
F 2 "" H 10125 1350 60  0001 C CNN
F 3 "" H 10125 1350 60  0001 C CNN
	1    10125 1350
	1    0    0    -1  
$EndComp
$Comp
L project:SMA_2 J2
U 1 1 5C7AC1B0
P 1700 4250
F 0 "J2" H 1850 4250 50  0000 C CNN
F 1 "~" H 1669 4399 50  0000 C CNN
F 2 "RF_SMA_Connectors:SMA-VERT" H 1875 4150 50  0001 C CNN
F 3 "" H 1700 4250 60  0000 C CNN
F 4 "Amphenol" H 3800 6125 50  0001 C CNN "MFN"
F 5 "901-143-6RFX" H 3800 6125 50  0001 C CNN "MFP"
F 6 "S01-RJPT4-11BS00" H 3800 6125 50  0001 C CNN "S1PN"
F 7 "Superbat" H 3800 6125 50  0001 C CNN "S1PL"
F 8 "901-143-6RFX" H 3800 6125 50  0001 C CNN "S2PN"
F 9 "TTI" H 3800 6125 50  0001 C CNN "S2PL"
F 10 "SMA Coaxial Connector R/A PCB RECEPTACLE" H 3800 6125 50  0001 C CNN "Description"
	1    1700 4250
	-1   0    0    -1  
$EndComp
$Comp
L power:GND #PWR012
U 1 1 5C7AC1B6
P 1700 4425
F 0 "#PWR012" H 1700 4425 30  0001 C CNN
F 1 "GND" H 1700 4355 30  0001 C CNN
F 2 "" H 1700 4425 60  0001 C CNN
F 3 "" H 1700 4425 60  0001 C CNN
	1    1700 4425
	1    0    0    -1  
$EndComp
Wire Wire Line
	1825 4675 1975 4675
Wire Wire Line
	1825 4250 1975 4250
Wire Wire Line
	2325 4675 2325 4250
Wire Wire Line
	2325 4250 2175 4250
$Comp
L project:SMA_2 J1
U 1 1 5C7E9B34
P 9900 4225
F 0 "J1" H 10025 4225 50  0000 L CNN
F 1 "~" H 10003 4124 50  0000 L CNN
F 2 "RF_SMA_Connectors:SMA-VERT" H 10075 4125 50  0001 C CNN
F 3 "" H 9900 4225 60  0000 C CNN
F 4 "Amphenol" H 4875 6125 50  0001 C CNN "MFN"
F 5 "901-143-6RFX" H 4875 6125 50  0001 C CNN "MFP"
F 6 "S01-RJPT4-11BS00" H 4875 6125 50  0001 C CNN "S1PN"
F 7 "Superbat" H 4875 6125 50  0001 C CNN "S1PL"
F 8 "901-143-6RFX" H 4875 6125 50  0001 C CNN "S2PN"
F 9 "TTI" H 4875 6125 50  0001 C CNN "S2PL"
F 10 "SMA Coaxial Connector R/A PCB RECEPTACLE" H 4875 6125 50  0001 C CNN "Description"
	1    9900 4225
	1    0    0    -1  
$EndComp
$Comp
L power:GND #PWR011
U 1 1 5C7E9B3A
P 9900 4400
F 0 "#PWR011" H 9900 4400 30  0001 C CNN
F 1 "GND" H 9900 4330 30  0001 C CNN
F 2 "" H 9900 4400 60  0001 C CNN
F 3 "" H 9900 4400 60  0001 C CNN
	1    9900 4400
	1    0    0    -1  
$EndComp
Wire Wire Line
	9475 4675 9375 4675
Connection ~ 9375 4675
Wire Wire Line
	9675 4675 9775 4675
Wire Wire Line
	9775 4225 9675 4225
Wire Wire Line
	9375 4675 9375 4225
Wire Wire Line
	9375 4225 9475 4225
Wire Wire Line
	6600 3425 6600 3925
Wire Wire Line
	6600 4225 6600 4675
$Comp
L device:C C1
U 1 1 5D0750D3
P 3000 3725
F 0 "C1" H 3050 3825 50  0000 L CNN
F 1 "0.01uF" H 3050 3625 50  0000 L CNN
F 2 "Capacitor_SMD:C_0603_1608Metric" H 3000 3725 60  0001 C CNN
F 3 "" H 3000 3725 60  0001 C CNN
F 4 "Kemet" H 3000 3725 50  0001 C CNN "MFN"
F 5 "C0603C103K5RACTU" H 3000 3725 50  0001 C CNN "MFP"
F 6 "399-1091-1-ND" H 3000 3725 50  0001 C CNN "S1PN"
F 7 "Digi-Key" H 3000 3725 50  0001 C CNN "S1PL"
F 8 "80-C0603C103K5R" H 3000 3725 50  0001 C CNN "S2PN"
F 9 "Mouser" H 3000 3725 50  0001 C CNN "S2PL"
F 10 "Multilayer Ceramic Capacitors MLCC - SMD/SMT 50V 0.01uF 0603 X7R 10%" H 3000 3725 50  0001 C CNN "Description"
F 11 "0603 (1608 metric)" H 3000 3725 50  0001 C CNN "Package ID"
	1    3000 3725
	1    0    0    -1  
$EndComp
$Comp
L device:C C7
U 1 1 5D078BA2
P 7950 3725
F 0 "C7" H 8000 3825 50  0000 L CNN
F 1 "0.01uF" H 8000 3625 50  0000 L CNN
F 2 "Capacitor_SMD:C_0603_1608Metric" H 7950 3725 60  0001 C CNN
F 3 "" H 7950 3725 60  0001 C CNN
F 4 "Kemet" H 7950 3725 50  0001 C CNN "MFN"
F 5 "C0603C103K5RACTU" H 7950 3725 50  0001 C CNN "MFP"
F 6 "399-1091-1-ND" H 7950 3725 50  0001 C CNN "S1PN"
F 7 "Digi-Key" H 7950 3725 50  0001 C CNN "S1PL"
F 8 "80-C0603C103K5R" H 7950 3725 50  0001 C CNN "S2PN"
F 9 "Mouser" H 7950 3725 50  0001 C CNN "S2PL"
F 10 "Multilayer Ceramic Capacitors MLCC - SMD/SMT 50V 0.01uF 0603 X7R 10%" H 7950 3725 50  0001 C CNN "Description"
F 11 "0603 (1608 metric)" H 7950 3725 50  0001 C CNN "Package ID"
	1    7950 3725
	1    0    0    -1  
$EndComp
$Comp
L device:C C2
U 1 1 5D083F64
P 3800 3725
F 0 "C2" H 3850 3825 50  0000 L CNN
F 1 "0.1uF" H 3850 3625 50  0000 L CNN
F 2 "Capacitor_SMD:C_0603_1608Metric" H 3800 3725 60  0001 C CNN
F 3 "" H 3800 3725 60  0001 C CNN
F 4 "Kemet" H 3800 3725 50  0001 C CNN "MFN"
F 5 "C0603C104J4RACTU" H 3800 3725 50  0001 C CNN "MFP"
F 6 "399-1097-1-ND" H 3800 3725 50  0001 C CNN "S1PN"
F 7 "Digi-Key" H 3800 3725 50  0001 C CNN "S1PL"
F 8 "80-C0603C104J4R" H 3800 3725 50  0001 C CNN "S2PN"
F 9 "Mouser" H 3800 3725 50  0001 C CNN "S2PL"
F 10 "CAP CER 0.1UF 16V X7R 0603" H 3800 3725 50  0001 C CNN "Description"
F 11 "0603 (1608 Metric)" H 3800 3725 50  0001 C CNN "Package ID"
	1    3800 3725
	1    0    0    -1  
$EndComp
$Comp
L device:C C3
U 1 1 5D087624
P 4900 3725
F 0 "C3" H 4950 3825 50  0000 L CNN
F 1 "DNI" H 4950 3625 50  0000 L CNN
F 2 "Capacitor_SMD:C_0603_1608Metric" H 4900 3725 60  0001 C CNN
F 3 "" H 4900 3725 60  0001 C CNN
F 4 "Kemet" H 4900 3725 50  0001 C CNN "MFN"
F 5 "C0603C104J4RACTU" H 4900 3725 50  0001 C CNN "MFP"
F 6 "399-1097-1-ND" H 4900 3725 50  0001 C CNN "S1PN"
F 7 "Digi-Key" H 4900 3725 50  0001 C CNN "S1PL"
F 8 "80-C0603C104J4R" H 4900 3725 50  0001 C CNN "S2PN"
F 9 "Mouser" H 4900 3725 50  0001 C CNN "S2PL"
F 10 "CAP CER 0.1UF 16V X7R 0603" H 4900 3725 50  0001 C CNN "Description"
F 11 "0603 (1608 Metric)" H 4900 3725 50  0001 C CNN "Package ID"
	1    4900 3725
	1    0    0    -1  
$EndComp
$Comp
L device:C C4
U 1 1 5D08AC9E
P 6050 3725
F 0 "C4" H 6100 3825 50  0000 L CNN
F 1 "DNI" H 6100 3625 50  0000 L CNN
F 2 "Capacitor_SMD:C_0603_1608Metric" H 6050 3725 60  0001 C CNN
F 3 "" H 6050 3725 60  0001 C CNN
F 4 "Kemet" H 6050 3725 50  0001 C CNN "MFN"
F 5 "C0603C104J4RACTU" H 6050 3725 50  0001 C CNN "MFP"
F 6 "399-1097-1-ND" H 6050 3725 50  0001 C CNN "S1PN"
F 7 "Digi-Key" H 6050 3725 50  0001 C CNN "S1PL"
F 8 "80-C0603C104J4R" H 6050 3725 50  0001 C CNN "S2PN"
F 9 "Mouser" H 6050 3725 50  0001 C CNN "S2PL"
F 10 "CAP CER 0.1UF 16V X7R 0603" H 6050 3725 50  0001 C CNN "Description"
F 11 "0603 (1608 Metric)" H 6050 3725 50  0001 C CNN "Package ID"
	1    6050 3725
	1    0    0    -1  
$EndComp
$Comp
L device:R_Small R4
U 1 1 5D09A324
P 2075 4250
F 0 "R4" V 2000 4250 50  0000 C CNN
F 1 "0" V 2150 4250 50  0000 C CNN
F 2 "Resistor_SMD:R_0402_1005Metric" H 2075 4250 50  0001 C CNN
F 3 "~" H 2075 4250 50  0001 C CNN
F 4 "Yageo" H 2075 4250 50  0001 C CNN "MFN"
F 5 "RC0402JR-070RL" H 2075 4250 50  0001 C CNN "MFP"
F 6 "603-RC0402JR-070RL" H 2075 4250 50  0001 C CNN "S1PN"
F 7 "Mouser" H 2075 4250 50  0001 C CNN "S1PL"
F 8 "311-0.0JRCT-ND" H 2075 4250 50  0001 C CNN "S2PN"
F 9 "Digi-Key" H 2075 4250 50  0001 C CNN "S2PL"
F 10 "RES SMD 0 OHM JUMPER 1/16W 0402" H 2075 4250 50  0001 C CNN "Description"
F 11 "0402 (1005 Metric)" H 2075 4250 50  0001 C CNN "Package ID"
	1    2075 4250
	0    1    1    0   
$EndComp
$Comp
L device:R_Small R5
U 1 1 5D09DAA1
P 2075 4675
F 0 "R5" V 2000 4675 50  0000 C CNN
F 1 "0" V 2150 4675 50  0000 C CNN
F 2 "Resistor_SMD:R_0402_1005Metric" H 2075 4675 50  0001 C CNN
F 3 "~" H 2075 4675 50  0001 C CNN
F 4 "Yageo" H 2075 4675 50  0001 C CNN "MFN"
F 5 "RC0402JR-070RL" H 2075 4675 50  0001 C CNN "MFP"
F 6 "603-RC0402JR-070RL" H 2075 4675 50  0001 C CNN "S1PN"
F 7 "Mouser" H 2075 4675 50  0001 C CNN "S1PL"
F 8 "311-0.0JRCT-ND" H 2075 4675 50  0001 C CNN "S2PN"
F 9 "Digi-Key" H 2075 4675 50  0001 C CNN "S2PL"
F 10 "RES SMD 0 OHM JUMPER 1/16W 0402" H 2075 4675 50  0001 C CNN "Description"
F 11 "0402 (1005 Metric)" H 2075 4675 50  0001 C CNN "Package ID"
	1    2075 4675
	0    1    1    0   
$EndComp
$Comp
L device:R_Small R3
U 1 1 5D0A1104
P 9575 4225
F 0 "R3" V 9500 4225 50  0000 C CNN
F 1 "0" V 9650 4225 50  0000 C CNN
F 2 "Resistor_SMD:R_0402_1005Metric" H 9575 4225 50  0001 C CNN
F 3 "~" H 9575 4225 50  0001 C CNN
F 4 "Yageo" H 9575 4225 50  0001 C CNN "MFN"
F 5 "RC0402JR-070RL" H 9575 4225 50  0001 C CNN "MFP"
F 6 "603-RC0402JR-070RL" H 9575 4225 50  0001 C CNN "S1PN"
F 7 "Mouser" H 9575 4225 50  0001 C CNN "S1PL"
F 8 "311-0.0JRCT-ND" H 9575 4225 50  0001 C CNN "S2PN"
F 9 "Digi-Key" H 9575 4225 50  0001 C CNN "S2PL"
F 10 "RES SMD 0 OHM JUMPER 1/16W 0402" H 9575 4225 50  0001 C CNN "Description"
F 11 "0402 (1005 Metric)" H 9575 4225 50  0001 C CNN "Package ID"
	1    9575 4225
	0    1    1    0   
$EndComp
$Comp
L device:R_Small R6
U 1 1 5D0A4B15
P 9575 4675
F 0 "R6" V 9500 4675 50  0000 C CNN
F 1 "0" V 9650 4675 50  0000 C CNN
F 2 "Resistor_SMD:R_0402_1005Metric" H 9575 4675 50  0001 C CNN
F 3 "~" H 9575 4675 50  0001 C CNN
F 4 "Yageo" H 9575 4675 50  0001 C CNN "MFN"
F 5 "RC0402JR-070RL" H 9575 4675 50  0001 C CNN "MFP"
F 6 "603-RC0402JR-070RL" H 9575 4675 50  0001 C CNN "S1PN"
F 7 "Mouser" H 9575 4675 50  0001 C CNN "S1PL"
F 8 "311-0.0JRCT-ND" H 9575 4675 50  0001 C CNN "S2PN"
F 9 "Digi-Key" H 9575 4675 50  0001 C CNN "S2PL"
F 10 "RES SMD 0 OHM JUMPER 1/16W 0402" H 9575 4675 50  0001 C CNN "Description"
F 11 "0402 (1005 Metric)" H 9575 4675 50  0001 C CNN "Package ID"
	1    9575 4675
	0    1    1    0   
$EndComp
$Comp
L project:rfi_shield_clip P2
U 1 1 5D0AC1A8
P 10125 1250
F 0 "P2" H 10253 1269 60  0000 L CNN
F 1 "~" H 10253 1216 60  0000 L CNN
F 2 "RF_Shielding:S1721-46R" H 10125 1250 60  0001 C CNN
F 3 "" H 10125 1250 60  0000 C CNN
F 4 "Harwin Inc." H 10125 1250 50  0001 C CNN "MFN"
F 5 "S1721-46R" H 10125 1250 50  0001 C CNN "MFP"
F 6 "952-1476-1-ND" H 10125 1250 50  0001 C CNN "S1PN"
F 7 "Digi-Key" H 10125 1250 50  0001 C CNN "S1PL"
F 8 "855-S1721-46R" H 10125 1250 50  0001 C CNN "S2PN"
F 9 "Mouser" H 10125 1250 50  0001 C CNN "S2PL"
F 10 "RFI SHIELD CLIP MINI TIN SMD" H 10125 1250 50  0001 C CNN "Description"
	1    10125 1250
	1    0    0    -1  
$EndComp
$Comp
L project:rfi_shield_clip P1
U 1 1 5D0AF815
P 9675 1250
F 0 "P1" H 9803 1269 60  0000 L CNN
F 1 "~" H 9803 1216 60  0000 L CNN
F 2 "RF_Shielding:S1721-46R" H 9675 1250 60  0001 C CNN
F 3 "" H 9675 1250 60  0000 C CNN
F 4 "Harwin Inc." H 9675 1250 50  0001 C CNN "MFN"
F 5 "S1721-46R" H 9675 1250 50  0001 C CNN "MFP"
F 6 "952-1476-1-ND" H 9675 1250 50  0001 C CNN "S1PN"
F 7 "Digi-Key" H 9675 1250 50  0001 C CNN "S1PL"
F 8 "855-S1721-46R" H 9675 1250 50  0001 C CNN "S2PN"
F 9 "Mouser" H 9675 1250 50  0001 C CNN "S2PL"
F 10 "RFI SHIELD CLIP MINI TIN SMD" H 9675 1250 50  0001 C CNN "Description"
	1    9675 1250
	1    0    0    -1  
$EndComp
$Comp
L device:L L1
U 1 1 5D612261
P 6600 4075
F 0 "L1" H 6653 4121 50  0000 L CNN
F 1 "390nH" H 6653 4030 50  0000 L CNN
F 2 "Inductor_SMD:L_0603_1608Metric" H 6600 4075 50  0001 C CNN
F 3 "~" H 6600 4075 50  0001 C CNN
F 4 "Coilcraft" H 6600 4075 50  0001 C CNN "MFN"
F 5 "0603HP-R39XJE" H 6600 4075 50  0001 C CNN "MFP"
F 6 "0603HP-R39XJE" H 6600 4075 50  0001 C CNN "S1PN"
F 7 "Coilcraft Direct" H 6600 4075 50  0001 C CNN "S1PL"
F 8 "RF inductor, ceramic core, 5%" H 6600 4075 50  0001 C CNN "Description"
F 9 "0603 (1608 metric)" H 6600 4075 50  0001 C CNN "Package ID"
	1    6600 4075
	1    0    0    -1  
$EndComp
$Comp
L connector:Conn_01x02_Female P3
U 1 1 5D688B4F
P 2275 3525
F 0 "P3" H 2169 3200 50  0000 C CNN
F 1 "+5V " H 2169 3291 50  0000 C CNN
F 2 "Connector_PinHeader_2.54mm:PinHeader_1x02_P2.54mm_Vertical" H 2275 3525 50  0001 C CNN
F 3 "~" H 2275 3525 50  0001 C CNN
	1    2275 3525
	-1   0    0    1   
$EndComp
Wire Wire Line
	4750 4675 5700 4675
Wire Wire Line
	6600 3425 7050 3425
$Comp
L power:PWR_FLAG #FLG01
U 1 1 5D6E1BFC
P 2575 3800
F 0 "#FLG01" H 2575 3875 50  0001 C CNN
F 1 "PWR_FLAG" V 2575 3928 50  0000 L CNN
F 2 "" H 2575 3800 50  0001 C CNN
F 3 "~" H 2575 3800 50  0001 C CNN
	1    2575 3800
	0    -1   -1   0   
$EndComp
Connection ~ 2575 3800
Wire Wire Line
	2575 3800 2575 3925
$Comp
L project:SKY65014 U1
U 1 1 5D6E43A3
P 6000 4675
F 0 "U1" H 6100 4975 50  0000 C CNN
F 1 "MGA-30889" H 6250 4875 50  0000 C CNN
F 2 "Package_TO_SOT_SMD:SOT-89-3" H 6000 4675 60  0001 C CNN
F 3 "" H 6000 4675 60  0000 C CNN
F 4 "Avago" H 6000 4675 50  0001 C CNN "MFN"
F 5 "MGA-30889" H 6000 4675 50  0001 C CNN "MFP"
F 6 "1865178" H 6000 4675 50  0001 C CNN "S1PN"
F 7 "Element14" H 6000 4675 50  0001 C CNN "S1PL"
F 8 "53R0133" H 6000 4675 50  0001 C CNN "S2PN"
F 9 "Newark" H 6000 4675 50  0001 C CNN "S2PL"
F 10 "RF Amp Chip Single GP 2.6GHz 5.5V" H 6000 4675 50  0001 C CNN "Description"
F 11 "SOT-89" H 6000 4675 50  0001 C CNN "Package ID"
	1    6000 4675
	1    0    0    -1  
$EndComp
Wire Wire Line
	3800 3425 4200 3425
Wire Wire Line
	4500 3425 4900 3425
Wire Wire Line
	4900 3425 5300 3425
Wire Wire Line
	5600 3425 6050 3425
$EndSCHEMATC
