(module SMA_EDGE_2 (layer F.Cu) (tedit 5B4E728A)
  (fp_text reference J2 (at -2.032 -1.4732 -270) (layer F.SilkS)
    (effects (font (size 0.8128 0.8128) (thickness 0.2032)))
  )
  (fp_text value Out (at -6.7945 -2.032 -270) (layer F.SilkS)
    (effects (font (size 1 1) (thickness 0.15)))
  )
  (pad 1 smd rect (at 0 0) (size 1.5 4.25) (layers F.Cu F.Mask)
    (solder_mask_margin 0.254))
  (pad 2 smd rect (at -2.54 0.1524) (size 1.5 3.95) (layers B.Cu B.Paste B.Mask)
    (zone_connect 2))
  (pad 2 smd rect (at 2.54 0.1524) (size 1.5 3.95) (layers B.Cu B.Paste B.Mask)
    (zone_connect 2))
  (model /Users/timm/Documents/Electronics/Designs/Modules/packages3d/sma_EndLaunch.wrl
    (at (xyz 0 0 0.35))
    (scale (xyz 0.5 0.5 0.5))
    (rotate (xyz 0 0 0))
  )
)
