EESchema Schematic File Version 4
EELAYER 30 0
EELAYER END
$Descr A4 11693 8268
encoding utf-8
Sheet 1 1
Title "GRF2014"
Date "2021-04-06"
Rev "2.8"
Comp "Dyadic Pty Ltd"
Comment1 "2020"
Comment2 ""
Comment3 ""
Comment4 ""
$EndDescr
$Comp
L graphics:Logo_Open_Hardware_Small #LOGO1
U 1 1 5C70D97E
P 1450 1275
F 0 "#LOGO1" H 1450 1550 50  0001 C CNN
F 1 "Open Source Hardware" H 1450 1050 50  0000 C CNN
F 2 "" H 1450 1275 50  0001 C CNN
F 3 "~" H 1450 1275 50  0001 C CNN
	1    1450 1275
	1    0    0    -1  
$EndComp
$Comp
L project:rfi_shield_clip P1
U 1 1 5C796E6C
P 9175 1525
F 0 "P1" H 9303 1544 60  0000 L CNN
F 1 "~" H 9303 1491 60  0000 L CNN
F 2 "RF_Shielding:S1721-46R" H 9175 1525 60  0001 C CNN
F 3 "" H 9175 1525 60  0000 C CNN
F 4 "Harwin Inc." H 9175 1525 50  0001 C CNN "MFN"
F 5 "S1721-46R" H 9175 1525 50  0001 C CNN "MFP"
F 6 "952-1476-1-ND" H 9175 1525 50  0001 C CNN "S1PN"
F 7 "Digi-Key" H 9175 1525 50  0001 C CNN "S1PL"
F 8 "855-S1721-46R" H 9175 1525 50  0001 C CNN "S2PN"
F 9 "Arrow" H 9175 1525 50  0001 C CNN "S2PL"
F 10 "RFI SHIELD CLIP MINI TIN SMD" H 9175 1525 50  0001 C CNN "Description"
F 11 "sot86" H 9175 1525 50  0001 C CNN "variant"
	1    9175 1525
	1    0    0    -1  
$EndComp
$Comp
L power:GND #PWR01
U 1 1 5C797178
P 9175 1625
F 0 "#PWR01" H 9175 1625 30  0001 C CNN
F 1 "GND" H 9175 1555 30  0001 C CNN
F 2 "" H 9175 1625 60  0001 C CNN
F 3 "" H 9175 1625 60  0001 C CNN
	1    9175 1625
	1    0    0    -1  
$EndComp
$Comp
L power:GND #PWR02
U 1 1 5C79736B
P 9625 1625
F 0 "#PWR02" H 9625 1625 30  0001 C CNN
F 1 "GND" H 9625 1555 30  0001 C CNN
F 2 "" H 9625 1625 60  0001 C CNN
F 3 "" H 9625 1625 60  0001 C CNN
	1    9625 1625
	1    0    0    -1  
$EndComp
$Comp
L project:rfi_shield_clip P2
U 1 1 5D0A8B4D
P 9625 1525
F 0 "P2" H 9753 1544 60  0000 L CNN
F 1 "~" H 9753 1491 60  0000 L CNN
F 2 "RF_Shielding:S1721-46R" H 9625 1525 60  0001 C CNN
F 3 "" H 9625 1525 60  0000 C CNN
F 4 "Harwin Inc." H 9625 1525 50  0001 C CNN "MFN"
F 5 "S1721-46R" H 9625 1525 50  0001 C CNN "MFP"
F 6 "952-1476-1-ND" H 9625 1525 50  0001 C CNN "S1PN"
F 7 "Digi-Key" H 9625 1525 50  0001 C CNN "S1PL"
F 8 "855-S1721-46R" H 9625 1525 50  0001 C CNN "S2PN"
F 9 "Mouser" H 9625 1525 50  0001 C CNN "S2PL"
F 10 "RFI SHIELD CLIP MINI TIN SMD" H 9625 1525 50  0001 C CNN "Description"
F 11 "sot86" H 9625 1525 50  0001 C CNN "variant"
	1    9625 1525
	1    0    0    -1  
$EndComp
$Comp
L power:GND #PWR03
U 1 1 5DC86445
P 2950 3500
F 0 "#PWR03" H 2950 3500 30  0001 C CNN
F 1 "GND" H 2950 3430 30  0001 C CNN
F 2 "" H 2950 3500 60  0001 C CNN
F 3 "" H 2950 3500 60  0001 C CNN
	1    2950 3500
	1    0    0    -1  
$EndComp
$Comp
L power:GND #PWR04
U 1 1 5DC8644B
P 3750 3500
F 0 "#PWR04" H 3750 3500 30  0001 C CNN
F 1 "GND" H 3750 3430 30  0001 C CNN
F 2 "" H 3750 3500 60  0001 C CNN
F 3 "" H 3750 3500 60  0001 C CNN
	1    3750 3500
	1    0    0    -1  
$EndComp
$Comp
L device:R R15
U 1 1 5DC86451
P 4300 3050
F 0 "R15" V 4200 3050 50  0000 C CNN
F 1 "0" V 4400 3050 50  0000 C CNN
F 2 "Resistor_SMD:R_1206_3216Metric" H 4300 3050 60  0001 C CNN
F 3 "" H 4300 3050 60  0001 C CNN
F 4 "Yageo" H 4300 3050 50  0001 C CNN "MFN"
F 5 "RC1206JR-0775RL" H 4300 3050 50  0001 C CNN "MFP"
F 6 "311-75ERCT-ND" H 4300 3050 50  0001 C CNN "S1PN"
F 7 "Digi-Key" H 4300 3050 50  0001 C CNN "S1PL"
F 8 "603-RC1206JR-0775RL" H 4300 3050 50  0001 C CNN "S2PN"
F 9 "Mouser" H 4300 3050 50  0001 C CNN "S2PL"
F 10 "75 Ohms ±5% 0.25W, 1/4W Chip Resistor" H 4300 3050 50  0001 C CNN "Description"
F 11 "1206 (3216 Metric)" H 4300 3050 50  0001 C CNN "Package ID"
F 12 "dfn" V 4300 3050 50  0001 C CNN "variant"
	1    4300 3050
	0    -1   -1   0   
$EndComp
$Comp
L power:GND #PWR05
U 1 1 5DC8645D
P 4850 3500
F 0 "#PWR05" H 4850 3500 30  0001 C CNN
F 1 "GND" H 4850 3430 30  0001 C CNN
F 2 "" H 4850 3500 60  0001 C CNN
F 3 "" H 4850 3500 60  0001 C CNN
	1    4850 3500
	1    0    0    -1  
$EndComp
Wire Wire Line
	3450 3050 3750 3050
Wire Wire Line
	3750 3200 3750 3050
Connection ~ 3750 3050
Wire Wire Line
	2950 3200 2950 3050
Wire Wire Line
	4850 3200 4850 3050
Connection ~ 4850 3050
$Comp
L device:C C26
U 1 1 5DC86472
P 7775 3350
F 0 "C26" H 7825 3450 50  0000 L CNN
F 1 "100pF" H 7825 3250 50  0000 L CNN
F 2 "Capacitor_SMD:C_0603_1608Metric" H 7775 3350 60  0001 C CNN
F 3 "" H 7775 3350 60  0001 C CNN
F 4 "Yageo" H 7725 500 50  0001 C CNN "MFN"
F 5 "CC0603JRNPO9BN101" H 7725 500 50  0001 C CNN "MFP"
F 6 "311-1069-1-ND" H 7725 500 50  0001 C CNN "S1PN"
F 7 "Digi-Key" H 7725 500 50  0001 C CNN "S1PL"
F 8 "603-CC603JRNPO9BN101" H 7725 500 50  0001 C CNN "S2PN"
F 9 "Mouser" H 7725 500 50  0001 C CNN "S2PL"
F 10 "100pF ±5% 50V Ceramic Capacitor C0G, NP0" H 7725 500 50  0001 C CNN "Description"
F 11 "0603 (1608 Metric)" H 7725 500 50  0001 C CNN "Package ID"
F 12 "dfn" H 7775 3350 50  0001 C CNN "variant"
	1    7775 3350
	1    0    0    -1  
$EndComp
Wire Wire Line
	8175 3050 8175 3200
Wire Wire Line
	7775 3200 7775 3050
Connection ~ 7775 3050
Wire Wire Line
	7275 3200 7275 3050
Connection ~ 7275 3050
$Comp
L power:GND #PWR010
U 1 1 5DC86480
P 2525 3550
F 0 "#PWR010" H 2525 3550 30  0001 C CNN
F 1 "GND" H 2525 3480 30  0001 C CNN
F 2 "" H 2525 3550 60  0001 C CNN
F 3 "" H 2525 3550 60  0001 C CNN
	1    2525 3550
	1    0    0    -1  
$EndComp
$Comp
L power:GND #PWR06
U 1 1 5DC86486
P 6450 3500
F 0 "#PWR06" H 6450 3500 30  0001 C CNN
F 1 "GND" H 6450 3430 30  0001 C CNN
F 2 "" H 6450 3500 60  0001 C CNN
F 3 "" H 6450 3500 60  0001 C CNN
	1    6450 3500
	1    0    0    -1  
$EndComp
$Comp
L power:GND #PWR07
U 1 1 5DC8648C
P 7275 3500
F 0 "#PWR07" H 7275 3500 30  0001 C CNN
F 1 "GND" H 7275 3430 30  0001 C CNN
F 2 "" H 7275 3500 60  0001 C CNN
F 3 "" H 7275 3500 60  0001 C CNN
	1    7275 3500
	1    0    0    -1  
$EndComp
$Comp
L power:GND #PWR08
U 1 1 5DC86492
P 7775 3500
F 0 "#PWR08" H 7775 3500 30  0001 C CNN
F 1 "GND" H 7775 3430 30  0001 C CNN
F 2 "" H 7775 3500 60  0001 C CNN
F 3 "" H 7775 3500 60  0001 C CNN
	1    7775 3500
	1    0    0    -1  
$EndComp
$Comp
L power:GND #PWR09
U 1 1 5DC86498
P 8175 3500
F 0 "#PWR09" H 8175 3500 30  0001 C CNN
F 1 "GND" H 8175 3430 30  0001 C CNN
F 2 "" H 8175 3500 60  0001 C CNN
F 3 "" H 8175 3500 60  0001 C CNN
	1    8175 3500
	1    0    0    -1  
$EndComp
$Comp
L device:R X25
U 1 1 5DC8649E
P 4100 4650
F 0 "X25" H 3950 4600 50  0000 C CNN
F 1 "120" H 3950 4700 50  0000 C CNN
F 2 "Capacitor_SMD:C_0402_1005Metric" H 4100 4650 60  0001 C CNN
F 3 "" H 4100 4650 60  0001 C CNN
F 4 "dfn" H 4100 4650 50  0001 C CNN "variant"
F 5 "1" H 4100 4650 50  0001 C CNN "DNP"
	1    4100 4650
	-1   0    0    1   
$EndComp
$Comp
L device:C C28
U 1 1 5DC864B6
P 4400 4300
F 0 "C28" V 4500 4350 50  0000 L CNN
F 1 "470p" V 4500 4000 50  0000 L CNN
F 2 "Capacitor_SMD:C_0402_1005Metric" H 4400 4300 60  0001 C CNN
F 3 "" H 4400 4300 60  0001 C CNN
F 4 "Kemet" H 275 500 50  0001 C CNN "MFN"
F 5 "CBR04C101J3GAC" H 275 500 50  0001 C CNN "MFP"
F 6 "80-CBR04C101J3GAC" H 275 500 50  0001 C CNN "S1PN"
F 7 "Mouser" H 275 500 50  0001 C CNN "S1PL"
F 8 "399-17684-1-ND" H 275 500 50  0001 C CNN "S2PN"
F 9 "Digi-Key" H 275 500 50  0001 C CNN "S2PL"
F 10 "HiQ-CBR Series, C0G Dielectric, Low ESR, High SRF" H 275 500 50  0001 C CNN "Description"
F 11 "0402 (1005 metric)" H 275 500 50  0001 C CNN "Package ID"
F 12 "dfn" V 7375 4300 50  0001 C CNN "variant"
	1    4400 4300
	0    -1   -1   0   
$EndComp
Wire Wire Line
	4550 4300 4700 4300
Text Notes 8850 4175 0    60   ~ 0
A-RF Out
Text Notes 2050 4175 0    60   ~ 0
A-RF In
$Comp
L device:R X27
U 1 1 5DC8651E
P 4700 4650
F 0 "X27" H 4850 4650 50  0000 C CNN
F 1 "DNF" H 4550 4650 50  0000 C CNN
F 2 "Capacitor_SMD:C_0402_1005Metric" H 4700 4650 60  0001 C CNN
F 3 "" H 4700 4650 60  0001 C CNN
F 4 "dfn" H 4700 4650 50  0001 C CNN "variant"
F 5 "1" H 4700 4650 50  0001 C CNN "DNP"
	1    4700 4650
	-1   0    0    1   
$EndComp
$Comp
L power:GND #PWR019
U 1 1 5DC86524
P 4700 4800
F 0 "#PWR019" H 4700 4800 30  0001 C CNN
F 1 "GND" H 4700 4730 30  0001 C CNN
F 2 "" H 4700 4800 60  0001 C CNN
F 3 "" H 4700 4800 60  0001 C CNN
	1    4700 4800
	1    0    0    -1  
$EndComp
Wire Wire Line
	4700 4500 4700 4300
Connection ~ 4700 4300
$Comp
L device:C C30
U 1 1 5DC8652C
P 6800 4650
F 0 "C30" H 6850 4750 50  0000 L CNN
F 1 "DNF" H 6850 4550 50  0000 L CNN
F 2 "Capacitor_SMD:C_0402_1005Metric" H 6800 4650 60  0001 C CNN
F 3 "" H 6800 4650 60  0001 C CNN
F 4 "dfn" H 6800 4650 50  0001 C CNN "variant"
F 5 "1" H 6800 4650 50  0001 C CNN "DNP"
	1    6800 4650
	1    0    0    -1  
$EndComp
$Comp
L power:GND #PWR020
U 1 1 5DC86532
P 6800 4800
F 0 "#PWR020" H 6800 4800 30  0001 C CNN
F 1 "GND" H 6800 4730 30  0001 C CNN
F 2 "" H 6800 4800 60  0001 C CNN
F 3 "" H 6800 4800 60  0001 C CNN
	1    6800 4800
	1    0    0    -1  
$EndComp
Wire Wire Line
	2425 3150 2525 3150
Wire Wire Line
	2425 3050 2950 3050
Wire Wire Line
	2950 3050 3250 3050
Wire Wire Line
	7775 3050 8175 3050
Wire Wire Line
	7275 3050 7775 3050
Wire Wire Line
	4700 4300 5675 4300
$Comp
L device:Ferrite_Bead_Small FB3
U 1 1 5DC8655E
P 3350 3050
F 0 "FB3" V 3205 3050 50  0000 C CNN
F 1 "~" V 3204 3050 50  0000 C CNN
F 2 "Inductor_SMD:L_0805_2012Metric" V 3280 3050 50  0001 C CNN
F 3 "~" H 3350 3050 50  0001 C CNN
F 4 "Murata Electronics" H 4650 1925 50  0001 C CNN "MFN"
F 5 "BLM21PG221SN1D" H 4650 1925 50  0001 C CNN "MFP"
F 6 "81-BLM21P221SG" H 4650 1925 50  0001 C CNN "S1PN"
F 7 "Mouser" H 4650 1925 50  0001 C CNN "S1PL"
F 8 "490-1054-1-ND" H 4650 1925 50  0001 C CNN "S2PN"
F 9 "Digi-Key" H 4650 1925 50  0001 C CNN "S2PL"
F 10 "FERRITE BEAD 220 OHM 0805 1LN" H 4650 1925 50  0001 C CNN "Description"
F 11 "0805 (2012 Metric)" H 4650 1925 50  0001 C CNN "Package ID"
F 12 "dfn" V 3350 3050 50  0001 C CNN "variant"
	1    3350 3050
	0    1    1    0   
$EndComp
$Comp
L device:CP C25
U 1 1 5DC8656C
P 7275 3350
F 0 "C25" H 7350 3450 50  0000 L CNN
F 1 "10u/16V" H 7325 3250 50  0000 L CNN
F 2 "Capacitor_Tantalum_SMD:CP_EIA-3216-12_Kemet-S" H 7313 3200 50  0001 C CNN
F 3 "~" H 7275 3350 50  0001 C CNN
F 4 "Kemet" H 7225 500 50  0001 C CNN "MFN"
F 5 "T491A106K016AT" H 7225 500 50  0001 C CNN "MFP"
F 6 "80-T491A106K016" H 7225 500 50  0001 C CNN "S1PN"
F 7 "Mouser" H 7225 500 50  0001 C CNN "S1PL"
F 8 "399-8269-1-ND" H 7225 500 50  0001 C CNN "S2PN"
F 9 "Digi-Key" H 7225 500 50  0001 C CNN "S2PL"
F 10 "10µF Molded Tantalum Capacitors 16V 3 Ohm ESR" H 7225 500 50  0001 C CNN "Description"
F 11 "1206 (3216 Metric) " H 7225 500 50  0001 C CNN "Package ID"
F 12 "dfn" H 7275 3350 50  0001 C CNN "variant"
	1    7275 3350
	1    0    0    -1  
$EndComp
Connection ~ 2950 3050
Wire Wire Line
	2525 3150 2525 3550
$Comp
L power:GND #PWR013
U 1 1 5DC86591
P 2650 4475
F 0 "#PWR013" H 2650 4475 30  0001 C CNN
F 1 "GND" H 2650 4405 30  0001 C CNN
F 2 "" H 2650 4475 60  0001 C CNN
F 3 "" H 2650 4475 60  0001 C CNN
	1    2650 4475
	1    0    0    -1  
$EndComp
$Comp
L power:GND #PWR014
U 1 1 5DC86597
P 8600 4475
F 0 "#PWR014" H 8600 4475 30  0001 C CNN
F 1 "GND" H 8600 4405 30  0001 C CNN
F 2 "" H 8600 4475 60  0001 C CNN
F 3 "" H 8600 4475 60  0001 C CNN
	1    8600 4475
	1    0    0    -1  
$EndComp
Wire Wire Line
	7475 4300 8475 4300
$Comp
L device:C C21
U 1 1 5DC865D7
P 2950 3350
F 0 "C21" H 3000 3450 50  0000 L CNN
F 1 "0.01uF" H 3000 3250 50  0000 L CNN
F 2 "Capacitor_SMD:C_0603_1608Metric" H 2950 3350 60  0001 C CNN
F 3 "" H 2950 3350 60  0001 C CNN
F 4 "Kemet" H 2950 3350 50  0001 C CNN "MFN"
F 5 "C0603C103K5RACTU" H 2950 3350 50  0001 C CNN "MFP"
F 6 "399-1091-1-ND" H 2950 3350 50  0001 C CNN "S1PN"
F 7 "Digi-Key" H 2950 3350 50  0001 C CNN "S1PL"
F 8 "80-C0603C103K5R" H 2950 3350 50  0001 C CNN "S2PN"
F 9 "Mouser" H 2950 3350 50  0001 C CNN "S2PL"
F 10 "Multilayer Ceramic Capacitors MLCC - SMD/SMT 50V 0.01uF 0603 X7R 10%" H 2950 3350 50  0001 C CNN "Description"
F 11 "0603 (1608 metric)" H 2950 3350 50  0001 C CNN "Package ID"
F 12 "dfn" H 2950 3350 50  0001 C CNN "variant"
	1    2950 3350
	1    0    0    -1  
$EndComp
$Comp
L device:C C27
U 1 1 5DC865E5
P 8175 3350
F 0 "C27" H 8225 3450 50  0000 L CNN
F 1 "0.01uF" H 8225 3250 50  0000 L CNN
F 2 "Capacitor_SMD:C_0603_1608Metric" H 8175 3350 60  0001 C CNN
F 3 "" H 8175 3350 60  0001 C CNN
F 4 "Kemet" H 8175 3350 50  0001 C CNN "MFN"
F 5 "C0603C103K5RACTU" H 8175 3350 50  0001 C CNN "MFP"
F 6 "399-1091-1-ND" H 8175 3350 50  0001 C CNN "S1PN"
F 7 "Digi-Key" H 8175 3350 50  0001 C CNN "S1PL"
F 8 "80-C0603C103K5R" H 8175 3350 50  0001 C CNN "S2PN"
F 9 "Mouser" H 8175 3350 50  0001 C CNN "S2PL"
F 10 "Multilayer Ceramic Capacitors MLCC - SMD/SMT 50V 0.01uF 0603 X7R 10%" H 8175 3350 50  0001 C CNN "Description"
F 11 "0603 (1608 metric)" H 8175 3350 50  0001 C CNN "Package ID"
F 12 "dfn" H 8175 3350 50  0001 C CNN "variant"
	1    8175 3350
	1    0    0    -1  
$EndComp
$Comp
L device:C C22
U 1 1 5DC865F3
P 3750 3350
F 0 "C22" H 3800 3450 50  0000 L CNN
F 1 "0.1uF" H 3800 3250 50  0000 L CNN
F 2 "Capacitor_SMD:C_0603_1608Metric" H 3750 3350 60  0001 C CNN
F 3 "" H 3750 3350 60  0001 C CNN
F 4 "Kemet" H 3750 3350 50  0001 C CNN "MFN"
F 5 "C0603C104J4RACTU" H 3750 3350 50  0001 C CNN "MFP"
F 6 "399-1097-1-ND" H 3750 3350 50  0001 C CNN "S1PN"
F 7 "Digi-Key" H 3750 3350 50  0001 C CNN "S1PL"
F 8 "80-C0603C104J4R" H 3750 3350 50  0001 C CNN "S2PN"
F 9 "Mouser" H 3750 3350 50  0001 C CNN "S2PL"
F 10 "CAP CER 0.1UF 16V X7R 0603" H 3750 3350 50  0001 C CNN "Description"
F 11 "0603 (1608 Metric)" H 3750 3350 50  0001 C CNN "Package ID"
F 12 "dfn" H 3750 3350 50  0001 C CNN "variant"
	1    3750 3350
	1    0    0    -1  
$EndComp
$Comp
L device:C C23
U 1 1 5DC86601
P 4850 3350
F 0 "C23" H 4900 3450 50  0000 L CNN
F 1 "DNF" H 4900 3250 50  0000 L CNN
F 2 "Capacitor_SMD:C_0603_1608Metric" H 4850 3350 60  0001 C CNN
F 3 "" H 4850 3350 60  0001 C CNN
F 4 "Kemet" H 4850 3350 50  0001 C CNN "MFN"
F 5 "C0603C104J4RACTU" H 4850 3350 50  0001 C CNN "MFP"
F 6 "399-1097-1-ND" H 4850 3350 50  0001 C CNN "S1PN"
F 7 "Digi-Key" H 4850 3350 50  0001 C CNN "S1PL"
F 8 "80-C0603C104J4R" H 4850 3350 50  0001 C CNN "S2PN"
F 9 "Mouser" H 4850 3350 50  0001 C CNN "S2PL"
F 10 "CAP CER 0.1UF 16V X7R 0603" H 4850 3350 50  0001 C CNN "Description"
F 11 "0603 (1608 Metric)" H 4850 3350 50  0001 C CNN "Package ID"
F 12 "dfn" H 4850 3350 50  0001 C CNN "variant"
	1    4850 3350
	1    0    0    -1  
$EndComp
$Comp
L device:C C24
U 1 1 5DC8660F
P 6450 3350
F 0 "C24" H 6250 3450 50  0000 L CNN
F 1 "0.1uF" H 6200 3225 50  0000 L CNN
F 2 "Capacitor_SMD:C_0603_1608Metric" H 6450 3350 60  0001 C CNN
F 3 "" H 6450 3350 60  0001 C CNN
F 4 "Kemet" H 6450 3350 50  0001 C CNN "MFN"
F 5 "C0603C104J4RACTU" H 6450 3350 50  0001 C CNN "MFP"
F 6 "399-1097-1-ND" H 6450 3350 50  0001 C CNN "S1PN"
F 7 "Digi-Key" H 6450 3350 50  0001 C CNN "S1PL"
F 8 "80-C0603C104J4R" H 6450 3350 50  0001 C CNN "S2PN"
F 9 "Mouser" H 6450 3350 50  0001 C CNN "S2PL"
F 10 "CAP CER 0.1UF 16V X7R 0603" H 6450 3350 50  0001 C CNN "Description"
F 11 "0603 (1608 Metric)" H 6450 3350 50  0001 C CNN "Package ID"
F 12 "dfn" H 6450 3350 50  0001 C CNN "variant"
	1    6450 3350
	1    0    0    -1  
$EndComp
$Comp
L project:GRF2003DS U3
U 1 1 5DC8664D
P 5975 4300
F 0 "U3" H 6200 4475 50  0000 L CNN
F 1 "GRF4014" H 6200 4175 50  0000 L CNN
F 2 "GRF_DFN:DFN-6-1EP_1.5x1.5mm_P0.5mm_EP0.6x1.1mm" H 5975 4300 60  0001 C CNN
F 3 "" H 5975 4300 60  0000 C CNN
F 4 "Guerrilla RF" H 5975 4300 50  0001 C CNN "MFN"
F 5 "GRF4014" H 5975 4300 50  0001 C CNN "MFP"
F 6 "GRF4014" H 5975 4300 50  0001 C CNN "S1PN"
F 7 "RichardsonRFPD" H 5975 4300 50  0001 C CNN "S1PL"
F 8 "RF Amplifier .1-6GHz NF 0.8 dB Gain 16dB" H 5975 4300 50  0001 C CNN "Description"
F 9 "DFN-6" H 5975 4300 50  0001 C CNN "Package ID"
F 10 "dfn" H 5975 4300 50  0001 C CNN "variant"
F 11 "1:$2.05; 10:$2.05; 100:$1.94" H 5975 4300 50  0001 C CNN "kicost:RichardsonRFPD:pricing"
	1    5975 4300
	1    0    0    -1  
$EndComp
$Comp
L device:R R17
U 1 1 5DC86653
P 5975 3350
F 0 "R17" H 5825 3400 50  0000 C CNN
F 1 "2000" H 5825 3300 50  0000 C CNN
F 2 "Resistor_SMD:R_0402_1005Metric" H 5975 3350 60  0001 C CNN
F 3 "" H 5975 3350 60  0001 C CNN
F 4 "dfn" H 5975 3350 50  0001 C CNN "variant"
	1    5975 3350
	1    0    0    -1  
$EndComp
Wire Wire Line
	5975 4000 5975 3725
Wire Wire Line
	5975 4600 5975 4650
Wire Wire Line
	5975 4650 6075 4650
Wire Wire Line
	6175 4650 6175 4600
Wire Wire Line
	6075 4600 6075 4650
Connection ~ 6075 4650
Wire Wire Line
	6075 4650 6175 4650
$Comp
L power:GND #PWR015
U 1 1 5DC8666B
P 6075 4650
F 0 "#PWR015" H 6075 4650 30  0001 C CNN
F 1 "GND" H 6075 4580 30  0001 C CNN
F 2 "" H 6075 4650 60  0001 C CNN
F 3 "" H 6075 4650 60  0001 C CNN
	1    6075 4650
	1    0    0    -1  
$EndComp
$Comp
L connector:Conn_01x02_Female P3
U 1 1 5DC86693
P 2225 3150
F 0 "P3" H 2119 2825 50  0000 C CNN
F 1 "+5V" H 2119 2916 50  0000 C CNN
F 2 "Connector_PinHeader_2.54mm:PinHeader_1x02_P2.54mm_Vertical" H 2225 3150 50  0001 C CNN
F 3 "~" H 2225 3150 50  0001 C CNN
F 4 "Mintron" H 2225 3150 50  0001 C CNN "MFN"
F 5 "MTP125-1102S1" H 2225 3150 50  0001 C CNN "MFP"
F 6 "C358684" H 2225 3150 50  0001 C CNN "S1PN"
F 7 "LCSC" H 2225 3150 50  0001 C CNN "S1PL"
F 8 "Pin Header Male Pin 0.100\\\"(2.54mm) 2 pin" H 2225 3150 50  0001 C CNN "Description"
F 9 "Through Hole,P=2.54mm" H 2225 3150 50  0001 C CNN "Package ID"
F 10 "dfn" H 2225 3150 50  0001 C CNN "variant"
F 11 "1:$0.01; 10:$0.01; 100:$0.01; 500:$0.008" H 2225 3150 50  0001 C CNN "kicost:LCSC:pricing"
F 12 "https://lcsc.com/product-detail/Pin-Header-Female-Header_MINTRON-MTP125-1102S1_C358684.html" H 2225 3150 50  0001 C CNN "kicost:LCSC:link"
	1    2225 3150
	-1   0    0    1   
$EndComp
Wire Wire Line
	6800 4150 6800 4300
Wire Wire Line
	6375 4300 6800 4300
Connection ~ 6800 4300
Wire Wire Line
	6800 4300 6950 4300
Wire Wire Line
	6275 4600 6275 4650
Wire Wire Line
	6275 4650 6175 4650
Connection ~ 6175 4650
Wire Wire Line
	6450 3200 6450 3050
Connection ~ 6450 3050
Wire Wire Line
	5975 3200 5975 3050
Connection ~ 5975 3050
Wire Wire Line
	5975 3050 6450 3050
Text Notes 5850 2975 0    50   ~ 0
60mA
$Comp
L device:R R16
U 1 1 5E67466E
P 5400 3050
F 0 "R16" V 5300 3050 50  0000 C CNN
F 1 "0" V 5500 3050 50  0000 C CNN
F 2 "Resistor_SMD:R_1206_3216Metric" H 5400 3050 60  0001 C CNN
F 3 "" H 5400 3050 60  0001 C CNN
F 4 "Yageo" H 5400 3050 50  0001 C CNN "MFN"
F 5 "RC1206JR-0775RL" H 5400 3050 50  0001 C CNN "MFP"
F 6 "311-75ERCT-ND" H 5400 3050 50  0001 C CNN "S1PN"
F 7 "Digi-Key" H 5400 3050 50  0001 C CNN "S1PL"
F 8 "603-RC1206JR-0775RL" H 5400 3050 50  0001 C CNN "S2PN"
F 9 "Mouser" H 5400 3050 50  0001 C CNN "S2PL"
F 10 "75 Ohms ±5% 0.25W, 1/4W Chip Resistor" H 5400 3050 50  0001 C CNN "Description"
F 11 "1206 (3216 Metric)" H 5400 3050 50  0001 C CNN "Package ID"
F 12 "dfn" V 5400 3050 50  0001 C CNN "variant"
	1    5400 3050
	0    -1   -1   0   
$EndComp
$Comp
L device:L L3
U 1 1 5E5AB130
P 6800 4000
F 0 "L3" H 6853 4046 50  0000 L CNN
F 1 "5.6uH" H 6853 3955 50  0000 L CNN
F 2 "Inductor_SMD:L_0603_1608Metric" H 6800 4000 50  0001 C CNN
F 3 "~" H 6800 4000 50  0001 C CNN
F 4 "Coilcraft" H 6800 4000 50  0001 C CNN "MFN"
F 5 "0603HP-12NXJLU" H 6800 4000 50  0001 C CNN "MFP"
F 6 "994-0603HP-12NXJLU" H 6800 4000 50  0001 C CNN "S1PN"
F 7 "Mouser" H 6800 4000 50  0001 C CNN "S1PL"
F 8 "Fixed Inductors 0603HP Hi Perfrmnce 12 nH 5 %" H 6800 4000 50  0001 C CNN "Description"
F 9 "0603 (1608 metric)" H 6800 4000 50  0001 C CNN "Package ID"
F 10 "dfn" H 6800 4000 50  0001 C CNN "variant"
	1    6800 4000
	1    0    0    -1  
$EndComp
Wire Wire Line
	3750 3050 4150 3050
Wire Wire Line
	4450 3050 4850 3050
Wire Wire Line
	4850 3050 5250 3050
Wire Wire Line
	5550 3050 5975 3050
$Comp
L power:GND #PWR021
U 1 1 5EAC73DE
P 7475 4800
F 0 "#PWR021" H 7475 4800 30  0001 C CNN
F 1 "GND" H 7475 4730 30  0001 C CNN
F 2 "" H 7475 4800 60  0001 C CNN
F 3 "" H 7475 4800 60  0001 C CNN
	1    7475 4800
	1    0    0    -1  
$EndComp
$Comp
L device:R X23
U 1 1 5EAC73ED
P 7475 4650
F 0 "X23" H 7625 4600 50  0000 C CNN
F 1 "DNF" H 7625 4675 50  0000 C CNN
F 2 "Capacitor_SMD:C_0402_1005Metric" H 7475 4650 60  0001 C CNN
F 3 "" H 7475 4650 60  0001 C CNN
F 4 "Yageo" H 7475 4650 50  0001 C CNN "MFN"
F 5 "RC0603JR-070RL" H 7475 4650 50  0001 C CNN "MFP"
F 6 "311-0.0GRCT-ND" H 7475 4650 50  0001 C CNN "S1PN"
F 7 "Digi-Key" H 7475 4650 50  0001 C CNN "S1PL"
F 8 "603-RC0603JR-070RL" H 7475 4650 50  0001 C CNN "S2PN"
F 9 "Mouser" H 7475 4650 50  0001 C CNN "S2PL"
F 10 "0 Ohms Jumper 0.1W, 1/10W Chip Resistor" H 7475 4650 50  0001 C CNN "Description"
F 11 "0603 (1608 Metric)" H 7475 4650 50  0001 C CNN "Package ID"
F 12 "sot89" V 7475 4650 50  0001 C CNN "variant"
	1    7475 4650
	-1   0    0    1   
$EndComp
Wire Wire Line
	7475 4500 7475 4300
$Comp
L project:SMA_2 J4
U 1 1 5EC8DB31
P 8600 4300
F 0 "J4" H 8703 4290 50  0000 L CNN
F 1 "SMA_2" H 8703 4199 50  0000 L CNN
F 2 "" H 8775 4200 50  0000 C CNN
F 3 "" H 8600 4300 60  0000 C CNN
	1    8600 4300
	1    0    0    -1  
$EndComp
$Comp
L project:SMA_2 J3
U 1 1 5EC90BA7
P 2650 4300
F 0 "J3" H 2875 4300 50  0000 C CNN
F 1 "SMA_2" H 2875 4175 50  0000 C CNN
F 2 "" H 2825 4200 50  0000 C CNN
F 3 "" H 2650 4300 60  0000 C CNN
	1    2650 4300
	-1   0    0    -1  
$EndComp
$Comp
L power:GND #PWR018
U 1 1 5EC95C69
P 4100 4800
F 0 "#PWR018" H 4100 4800 30  0001 C CNN
F 1 "GND" H 4100 4730 30  0001 C CNN
F 2 "" H 4100 4800 60  0001 C CNN
F 3 "" H 4100 4800 60  0001 C CNN
	1    4100 4800
	1    0    0    -1  
$EndComp
Wire Wire Line
	4100 4500 4100 4300
Wire Wire Line
	4100 4300 4250 4300
Wire Wire Line
	6800 4500 6800 4300
$Comp
L device:C C29
U 1 1 6023DA4B
P 7100 4300
F 0 "C29" V 7200 4350 50  0000 L CNN
F 1 "2200p" V 7200 4000 50  0000 L CNN
F 2 "Capacitor_SMD:C_0402_1005Metric" H 7100 4300 60  0001 C CNN
F 3 "" H 7100 4300 60  0001 C CNN
F 4 "Kemet" H 2975 500 50  0001 C CNN "MFN"
F 5 "CBR04C101J3GAC" H 2975 500 50  0001 C CNN "MFP"
F 6 "80-CBR04C101J3GAC" H 2975 500 50  0001 C CNN "S1PN"
F 7 "Mouser" H 2975 500 50  0001 C CNN "S1PL"
F 8 "399-17684-1-ND" H 2975 500 50  0001 C CNN "S2PN"
F 9 "Digi-Key" H 2975 500 50  0001 C CNN "S2PL"
F 10 "HiQ-CBR Series, C0G Dielectric, Low ESR, High SRF" H 2975 500 50  0001 C CNN "Description"
F 11 "0402 (1005 metric)" H 2975 500 50  0001 C CNN "Package ID"
F 12 "dfn" V 10075 4300 50  0001 C CNN "variant"
	1    7100 4300
	0    -1   -1   0   
$EndComp
$Comp
L device:R X26
U 1 1 606CA518
P 3750 4650
F 0 "X26" H 3600 4600 50  0000 C CNN
F 1 "DNF" H 3600 4700 50  0000 C CNN
F 2 "Capacitor_SMD:C_0402_1005Metric" H 3750 4650 60  0001 C CNN
F 3 "" H 3750 4650 60  0001 C CNN
F 4 "dfn" H 3750 4650 50  0001 C CNN "variant"
F 5 "1" H 3750 4650 50  0001 C CNN "DNP"
	1    3750 4650
	-1   0    0    1   
$EndComp
$Comp
L power:GND #PWR016
U 1 1 606CA522
P 3750 4800
F 0 "#PWR016" H 3750 4800 30  0001 C CNN
F 1 "GND" H 3750 4730 30  0001 C CNN
F 2 "" H 3750 4800 60  0001 C CNN
F 3 "" H 3750 4800 60  0001 C CNN
	1    3750 4800
	1    0    0    -1  
$EndComp
Wire Wire Line
	3750 4500 3750 4300
Wire Wire Line
	2775 4300 3750 4300
Connection ~ 4100 4300
Connection ~ 3750 4300
Wire Wire Line
	3750 4300 4100 4300
Wire Wire Line
	7250 4300 7475 4300
Connection ~ 7475 4300
$Comp
L device:C C1
U 1 1 6200F4DD
P 5550 3725
F 0 "C1" V 5650 3775 50  0000 L CNN
F 1 "1000p" V 5650 3425 50  0000 L CNN
F 2 "Capacitor_SMD:C_0402_1005Metric" H 5550 3725 60  0001 C CNN
F 3 "" H 5550 3725 60  0001 C CNN
F 4 "Kemet" H 1425 -75 50  0001 C CNN "MFN"
F 5 "CBR04C101J3GAC" H 1425 -75 50  0001 C CNN "MFP"
F 6 "80-CBR04C101J3GAC" H 1425 -75 50  0001 C CNN "S1PN"
F 7 "Mouser" H 1425 -75 50  0001 C CNN "S1PL"
F 8 "399-17684-1-ND" H 1425 -75 50  0001 C CNN "S2PN"
F 9 "Digi-Key" H 1425 -75 50  0001 C CNN "S2PL"
F 10 "HiQ-CBR Series, C0G Dielectric, Low ESR, High SRF" H 1425 -75 50  0001 C CNN "Description"
F 11 "0402 (1005 metric)" H 1425 -75 50  0001 C CNN "Package ID"
F 12 "dfn" V 8525 3725 50  0001 C CNN "variant"
	1    5550 3725
	0    -1   -1   0   
$EndComp
$Comp
L power:GND #PWR011
U 1 1 6200FD39
P 5275 3875
F 0 "#PWR011" H 5275 3875 30  0001 C CNN
F 1 "GND" H 5275 3805 30  0001 C CNN
F 2 "" H 5275 3875 60  0001 C CNN
F 3 "" H 5275 3875 60  0001 C CNN
	1    5275 3875
	1    0    0    -1  
$EndComp
Wire Wire Line
	5700 3725 5975 3725
Connection ~ 5975 3725
Wire Wire Line
	5975 3725 5975 3500
Wire Wire Line
	5400 3725 5275 3725
Wire Wire Line
	5275 3725 5275 3875
Wire Wire Line
	6450 3050 6800 3050
$Comp
L device:L L1
U 1 1 6201473C
P 6800 3500
F 0 "L1" H 6853 3546 50  0000 L CNN
F 1 "1.5uH" H 6853 3455 50  0000 L CNN
F 2 "Inductor_SMD:L_0603_1608Metric" H 6800 3500 50  0001 C CNN
F 3 "~" H 6800 3500 50  0001 C CNN
F 4 "Coilcraft" H 6800 3500 50  0001 C CNN "MFN"
F 5 "0603HP-12NXJLU" H 6800 3500 50  0001 C CNN "MFP"
F 6 "994-0603HP-12NXJLU" H 6800 3500 50  0001 C CNN "S1PN"
F 7 "Mouser" H 6800 3500 50  0001 C CNN "S1PL"
F 8 "Fixed Inductors 0603HP Hi Perfrmnce 12 nH 5 %" H 6800 3500 50  0001 C CNN "Description"
F 9 "0603 (1608 metric)" H 6800 3500 50  0001 C CNN "Package ID"
F 10 "dfn" H 6800 3500 50  0001 C CNN "variant"
	1    6800 3500
	1    0    0    -1  
$EndComp
$Comp
L device:C C2
U 1 1 620150DB
P 7075 3750
F 0 "C2" V 7150 3825 50  0000 L CNN
F 1 "0.1u" V 7000 3500 50  0000 L CNN
F 2 "Capacitor_SMD:C_0402_1005Metric" H 7075 3750 60  0001 C CNN
F 3 "" H 7075 3750 60  0001 C CNN
F 4 "Kemet" H 2950 -50 50  0001 C CNN "MFN"
F 5 "CBR04C101J3GAC" H 2950 -50 50  0001 C CNN "MFP"
F 6 "80-CBR04C101J3GAC" H 2950 -50 50  0001 C CNN "S1PN"
F 7 "Mouser" H 2950 -50 50  0001 C CNN "S1PL"
F 8 "399-17684-1-ND" H 2950 -50 50  0001 C CNN "S2PN"
F 9 "Digi-Key" H 2950 -50 50  0001 C CNN "S2PL"
F 10 "HiQ-CBR Series, C0G Dielectric, Low ESR, High SRF" H 2950 -50 50  0001 C CNN "Description"
F 11 "0402 (1005 metric)" H 2950 -50 50  0001 C CNN "Package ID"
F 12 "dfn" V 10050 3750 50  0001 C CNN "variant"
	1    7075 3750
	0    -1   -1   0   
$EndComp
Wire Wire Line
	6800 3350 6800 3050
Connection ~ 6800 3050
Wire Wire Line
	6800 3050 7275 3050
Wire Wire Line
	6800 3650 6800 3750
Wire Wire Line
	6925 3750 6800 3750
Connection ~ 6800 3750
Wire Wire Line
	6800 3750 6800 3850
$Comp
L power:GND #PWR012
U 1 1 620188A3
P 7350 3875
F 0 "#PWR012" H 7350 3875 30  0001 C CNN
F 1 "GND" H 7350 3805 30  0001 C CNN
F 2 "" H 7350 3875 60  0001 C CNN
F 3 "" H 7350 3875 60  0001 C CNN
	1    7350 3875
	1    0    0    -1  
$EndComp
Wire Wire Line
	7225 3750 7350 3750
Wire Wire Line
	7350 3750 7350 3875
$EndSCHEMATC
